##TITLE=Analysis number 320322
Compound Code cc 56114
Book Reference 483/32
Project Code adrs
Chemist Name mattw
##JCAMPDX= 6.0         $$ Bruker NMR JCAMP-DX V2.0
##DATA TYPE= NMR SPECTRUM
##DATA CLASS= NTUPLES
##ORIGIN= Bruker BioSpin GmbH
##OWNER= nmr
$$ XWIN-NMR		Version 3.5
$$ Wed Jun 21 15:24:03 2006 GMT Daylight Time (UT+1h)  MAYBRIDGE\nmr@NMR_250MHZ
##.OBSERVE FREQUENCY= 250.131544655141
##.OBSERVE NUCLEUS= ^1H
##.ACQUISITION MODE= SIMULTANEOUS (DQD)
##.ACQUISITION SCHEME= undefined
##.AVERAGES= 16
##.DIGITISER RES= 18
##SPECTROMETER/DATA SYSTEM= dpx250
##.PULSE SEQUENCE= zg30
##.SOLVENT NAME= CDCl3
##.SHIFT REFERENCE= (INTERNAL, CDCl3, 0, 16.522)
##AUDIT TRAIL= $$ (NUMBER, WHEN, WHO, WHERE, WHAT)
$$ ##TITLE= Audit trail, XWIN-NMR		Version 3.5
$$ ##JCAMPDX= 5.01
$$ ##ORIGIN= Bruker BioSpin GmbH
$$ ##OWNER= nmr
$$ C:\u/data/dgb/nmr/ADRS/1200/pdata/1/auditp.txt
$$ ##AUDIT TRAIL=  $$ (NUMBER, WHEN, WHO, WHERE, WHAT)
(   1,<2006-06-21 15:23:37.53 +100>,<MAYBRIDGE\nmr>,<NMR_250MHZ>,
      <created by zg, POWCHK disabled, PULCHK disabled
       configuration hash MD5:
       E2 DF 36 D8 04 B2 41 60 5A D7 A3 38 5A 4B D0 FE
       data hash MD5: 64K
       F4 1F CD B1 BD C4 4D 94 33 FC 9F 66 67 75 B2 5C>)
(   2,<2006-06-21 15:23:52.31 +100>,<MAYBRIDGE\nmr>,<NMR_250MHZ>,
      <Start of raw data processing
       ef LB = 0.3 FT_mod = 6 PKNL = 1 SI = 32K 
       data hash MD5: 32K
       D1 1F 3B 9C 10 74 EC 29 F5 50 D8 17 DD EC FC F5>)
(   3,<2006-06-21 15:23:54.29 +100>,<MAYBRIDGE\nmr>,<NMR_250MHZ>,
      <apk 
       data hash MD5: 32K
       03 CA F8 39 79 D4 7B 48 8E 6A 43 51 CA 69 AE F8>)
(   4,<2006-06-21 15:23:55.59 +100>,<MAYBRIDGE\nmr>,<NMR_250MHZ>,
      <abs ABSG = 5 
       data hash MD5: 32K
       07 D1 8C 11 BC F0 50 80 4A DE FA 38 5D 55 01 8A>)
$$ ##END=
$$ 
$$ hash MD5
$$ F6 FD 00 B2 4C 3E C3 A0 A5 E7 86 86 25 86 BC FB
##$RELAX= 
##$RELAX= 
##$RELAX= 
##$RELAX= 
##$RELAX= 
##$RELAX= 
##$RELAX= 
$$ Bruker specific parameters
$$ --------------------------
##$DU= <C:\u>
##$EXPNO= 1200
##$NAME= <ADRS>
##$PROCNO= 1
##$TYPE= <nmr>
##$USER= <dgb>
##$AMP= (0..31)
100 100 100 100 100 100 100 100 100 100 100 100 100 100 100 100 100 100 
100 100 100 100 100 100 100 100 100 100 100 100 100 100 
##$AQSEQ= 0
##$AQ_mod= 3
##$AUNM= <au_zg>
##$AUTOPOS= <52 >
##$BF1= 250.13
##$BF2= 250.13
##$BF3= 250.13
##$BF4= 250.13
##$BF5= 500.13
##$BF6= 500.13
##$BF7= 500.13
##$BF8= 500.13
##$BYTORDA= 1
##$CFDGTYP= 0
##$CFRGTYP= 5
##$CHEMSTR= <none>
##$CNST= (0..31)
1 1 145 1 1 1 1 1 1 1 1 1 1 1 1 1 1 1 1 1 1 1 1 1 1 1 1 1 1 1 1 1 
##$CPDPRG= <>
##$CPDPRG1= <>
##$CPDPRG2= <>
##$CPDPRG3= <>
##$CPDPRG4= <mlev>
##$CPDPRG5= <mlev>
##$CPDPRG6= <mlev>
##$CPDPRG7= <mlev>
##$CPDPRG8= <mlev>
##$CPDPRGB= <>
##$CPDPRGT= <>
##$D= (0..31)
0 1 0 0 0 0 0 0 0 0.06 0 0 0 0 0 0 0.0002 0 0 0 0 0 0 0 0 0 0 0 0 0 0 
0 
##$DATE= 1150899815
##$DBL= (0..7)
120 120 120 120 120 120 120 120 
##$DBP= (0..7)
150 150 150 150 150 150 150 150 
##$DBP07= 0
##$DBPNAM0= <>
##$DBPNAM1= <>
$$ [...]
##$SUBNAM7= <"">
##$SUBNAM8= <"">
##$SUBNAM9= <"">
##$SW= 20.6930455092707
##$SWIBOX= (0..15)
0 0 3 0 0 0 0 0 0 0 0 0 0 0 0 0 
##$SW_h= 5175.983436853
##$TD= 65536
##$TD0= 1
##$TE= 294.16
##$TE2= 300
##$TE3= 300
##$TEG= 300
##$TL= (0..7)
0 120 120 120 120 120 120 120 
##$TP= (0..7)
150 150 150 150 150 150 150 150 
##$TP07= 0
##$TPNAME0= <>
##$TPNAME1= <>
##$TPNAME2= <>
##$TPNAME3= <>
##$TPNAME4= <>
##$TPNAME5= <>
##$TPNAME6= <>
##$TPNAME7= <>
##$TPOAL= (0..7)
0.5 0.5 0.5 0.5 0.5 0.5 0.5 0.5 
##$TPOFFS= (0..7)
0 0 0 0 0 0 0 0 
##$TUNHIN= 0
##$TUNHOUT= 0
##$TUNXOUT= 0
##$USERA1= <user>
##$USERA2= <user>
##$USERA3= <user>
##$USERA4= <user>
##$USERA5= <user>
##$V9= 5
##$VALIST= <valist>
##$VCLIST= <CCCCCCCCCCCCCCC>
##$VD= 0
##$VDLIST= <DDDDDDDDDDDDDDD>
##$VPLIST= <PPPPPPPPPPPPPPP>
##$VTLIST= <TTTTTTTTTTTTTTT>
##$WBST= 1024
##$WBSW= 4
##$XGAIN= (0..3)
0 0 0 0 
##$XL= 0
##$YL= 0
##$YMAX_a= 263173
##$YMIN_a= -630754
##$ZGOPTNS= <>
##$ZL1= 120
##$ZL2= 120
##$ZL3= 120
##$ZL4= 120
##$ABSF1= 16.522
##$ABSF2= -4.171173
##$ABSG= 5
##$ABSL= 3
##$ALPHA= 0
##$AQORDER= 0
##$ASSFAC= 0
##$ASSFACI= 0
##$ASSFACX= 0
##$ASSWID= 0
##$AUNMP= <proc_1d>
##$AZFE= 0.1
##$AZFW= 0.1
##$BCFW= 0
##$BC_mod= 0
##$BYTORDP= 0
##$COROFFS= 0
##$CY= 12.5
##$DATMOD= 1
##$DC= 0
##$DFILT= <>
##$DTYPP= 0
##$F1P= 14.0000005364418
##$F2P= -0.99999901652339
##$FCOR= 0.5
##$FTSIZE= 32768
##$FT_mod= 6
##$GAMMA= 0
##$GB= 0
##$INTBC= 1
##$INTSCL= 1
##$ISEN= 128
##$LB= 0.3
##$LEV0= 0
##$LPBIN= 0
##$MAXI= 10000
##$MC2= 0
##$MEAN= 0
##$ME_mod= 0
##$MI= 0
##$NCOEF= 0
##$NC_proc= -4
##$NLEV= 6
##$NOISF1= 0
##$NOISF2= 0
##$NSP= 0
##$NTH_PI= 0
##$NZP= 0
##$OFFSET= 16.522
##$PC= 1
##$PHC0= 180.7981
##$PHC1= -11.57843
##$PH_mod= 1
##$PKNL= yes
##$PPARMOD= 0
##$PSCAL= 4
##$PSIGN= 0
##$REVERSE= no
##$SF= 250.13
##$SI= 32768
##$SIGF1= 0
##$SIGF2= 0
##$SINO= 400
##$SIOLD= 32768
##$SREGLST= <1H.CDCl3>
##$SSB= 0
##$STSI= 32768
##$STSR= 0
##$SW_p= 5175.98343685301
##$SYMM= 0
##$S_DEV= 0
##$TDeff= 65536
##$TDoff= 0
##$TI= <Analysis number 999999
Compound Code 99
Book Reference 9
Project Code 9>
##$TILT= no
##$TM1= 0
##$TM2= 0
##$TOPLEV= 0
##$USERP1= <user>
##$USERP2= <user>
##$USERP3= <user>
##$USERP4= <user>
##$USERP5= <user>
##$WDW= 1
##$XDIM= 32768
##$YMAX_p= 396451893
##$YMIN_p= -314008
$$ End of Bruker specific parameters
$$ ---------------------------------
##NTUPLES= NMR SPECTRUM
##VAR_NAME=  FREQUENCY,     SPECTRUM/REAL,   SPECTRUM/IMAG
##SYMBOL=    X,             R,               I
##VAR_TYPE=  INDEPENDENT,   DEPENDENT,       DEPENDENT
##VAR_FORM=  AFFN,          ASDF,            ASDF
##VAR_DIM=   32768,         32768,           32768
##UNITS=     HZ,            ARBITRARY UNITS, ARBITRARY UNITS
##FACTOR=    0.157963299565203, 1,           1
##FIRST=     4132.6476996994, 0,             0
##LAST=      -1043.33573715361, 0,           0
##MIN=       -1043.33573715361, -314008,     0
##MAX=       4132.6476996994, 396451893,     0
$$ Real data points
##PAGE= N=1
##DATA TABLE= (X++(R..R)), XYDATA
$$ [...]
20083e1374L0477J8879J0229n3827k4768K1469P2325N2362m8970l1147k9201j1725
20071d5271M011k426N038L4173K9425m7063l4174L996J2593J3776M9735K3029
20059D6842m6764j4179J644Q070Q2463K1259n0231n7590j3037l451J589l7226
20047f0611N1007m538L7966m693p2068M0301K5297J2799l7404J3163j453k3048
20035b3282j4319M2042m336k5602j7614m5750j5722P0427P2403j0964k8995p5209
20023g6921k3624L4155O5430M6011K272o1971l4778J2389P3823j9029r8201Q750
20011g1694J5938M0881l4680J18868N1468N8o9177l8273j0092l2985j4537J1026
19999c3199L9790N351J11057K4211q3990l0736L4011o7872k7925K3762M3434k4717
$$ y = [-51374, -20897, -2018, 8211, -45616, -70384, -48915, 23410, 75772, 26802, -4345, -33546, -45271, -41260, -43686, -38648, -4475, 24950, -22113, -56287, -52291, -39698, -25922, 23813, 46842, 78, -14101, -12457, -4387, 78076, 99335, 49104, -8486, -21523, -24974, -23385, -60611, -9604, -14142, 23824, 19131, -52937, -12636, 12661, 25460, -11944, 1219, -234, -23282, -37601, 4441, 105, -25497, -43111, -88861, -104583, -34156, 38247, 27283, -1712, -76921, -100545, -66390, -960, 45051, 47323, -14648, -49426, -37037, 36786, 17757, -80444, -71694, -55756, -14875, -49555, 69313, 120781, 120839, 51662, 13389, 3297, -29688, -44225, -33199, 6591, 11942, 122999, 147210, 63220, 32484, 66495, -1377, -29302, -5540, 37894, 13177]
19987A3177l8112j7129p799k7551j3103R022J454K8804L2145J5041k3505k4992
19975e2548J1577P2498L7845k4693o4095l8770M4876n1758l5913J9107L4973P949
19963c8952K4472l2958j4811O995L1556n753n122N05j3638m8204K6433J5666n697
19950e9508J4889P5150j5335m0812O7561k7350p6242r033M0463k8655m0244K2809
19938g6307K9088J22n7343m366N4728J6179L1416K5275l2896j7105O7227L7514
19926G3532m4600l3160n478k2270j836j2409j6191l3707L4374Q589r204k9517
19914i1877O3211P7923o191m1458p520l0079m7934l9091L0256P659L8955M9366
19902C220J8329m8909l9033j0697L4339O8088J0277m5670j4771M933l6525j4981
$$ y = [13177, -24935, -42064, -49863, -77414, -90517, -81495, -80041, -51237, -19092, -4051, -27556, -52548, -40971, 31527, 69372, 44679, -19416, -58186, -13310, -65068, -100981, -81874, -46901, -38952, -14480, -47438, -62249, -55254, -23698, -29451, -34573, -34068, -47706, -95910, -69477, -53811, -59508, -44619, 30531, 15196, -25616, 41945, 14595, -61647, -70680, -30217, -58872, -99116, -76307, -47219, -47097, -104440, -108806, -54078, -37899, -6483, 18792, -14104, -31209, 36018, 73532, 28932, -4228, -9706, -31976, -33812, -46221, -62412, -96119, -61745, -53156, -62360, -91877, -28666, 49257, 43066, 1608, -5912, -35991, -83925, -123016, -92760, -85101, -46146, 3220, 21549, -27360, -66393, -77090, -42751, 25337, 35614, -10056, -24827, -19894, -56419, -71400]
19890g1400J0670J9842J474K8861l4431K6917J7123m016L9980k9866q8375L3587
19878d9634j0860k352P7101M2742q404k8077J9688L6747k9296O641J4368K1213
19866H9877K6430j0170n2795j1867j1946j1063L6516K0174j7791j0467J3417k6167
19854C4148K0613l5945l4506q0326O933M2897l0748L7781R900J3648L9711M2669
19842F6775l6523p6104j8157j09J3443j5892L3073L7683k9013j4295N8526J1100
19830C0507P5423J5646p724j2789k3161l503l7432N461o7524j7655K6143N497
19818a1111J3212K6844r857k1531k1931K5623K6997k3600q2939r247P3467l0882
19806d4955M1006L3627r2609l2653j369K720N0664L4448N1558o901J5524K6121
$$ y = [-71400, -60730, -40888, -39414, -10553, -44984, -18067, -944, -4960, 35020, 5154, -83221, -49634, -60494, -62846, 14255, 56997, 48593, 20516, 40204, 76951, 47655, 54296, 68664, 89877, 116307, 106137, 53342, 41475, 29529, 18466, 54982, 75156, 57365, 46898, 60315, 34148, 54761, 18816, -15690, -96016, -89083, -46186, -76934, -39153, -29253, -15605, 24106, 66775, 30252, -45852, -64009, -64118, -50675, -66567, -33494, 4189, -24824, -39119, 19407, 30507, 105930, 121576, 113852, 101063, 77902, 74399, 36967, 42428, -25096, -42751, -16608, -11111, 2101, 28945, 19088, -2443, -24374, 1249, 28246, 4646, -78293, -87540, -14073, -44955, -3949, 29678, -62931, -95584, -96953, -94233, -43569, -9121, 42437, 35536, 51060, 77181]
19794G7181O2074q521p7779K4868r648n2681l6705O4712J05472R729R317M1293
19782B09312j9513j6986L4246L8937j6940K0443K1286n669r4124n7336m2149J3050
19770H4557l9844m556l4083O0027N1889J068j6783p9539r965j7708j0074M406
19758a0605j1188p584J822j829K7961J7044j046l3983l3884R037K1120L9209j9863
19745c789K8296L6524l9878o4408J6651j1235j6170N9891Q8485M114r5470n7784
19733e4773n759j3069k3975M6078J2655J0470m362J1312l4986n0859K4005N6943
19721b6320K2787m734k1662l391j1098K4010l8680J9434J5274m0070K750J839
19709e9861j5999K6961L8041q500L3965R13M7076k6942m1101L3015L1772K6979
$$ y = [77181, 139255, 130734, 52955, 77823, 68175, 15494, -21211, 43501, 148973, 158702, 168019, 209312, 189799, 172813, 207059, 245996, 229056, 249499, 270785, 265116, 170992, 113656, 71507, 84557, 44713, 40157, 6074, 66101, 117990, 119058, 102275, 22736, 12771, -4937, -15011, -10605, -21793, -29377, -27555, -29384, -1423, 15621, 14575, -19408, -53292, -44255, -23135, 16074, -3789, 24507, 61031, 21153, -43255, -26604, -37839, -54009, 5882, 94367, 98481, 3011, -54773, -60532, -73601, -97576, -51498, -38843, -28373, -32735, -21423, -56409, -107268, -83263, -26320, -3533, -8267, -29929, -33320, -44418, -20408, -59088, -39654, -24380, -64450, -61700, -59861, -75860, -48899, -10858, -19358, 14607, 15520, 62596, 35654, -5447, 27568, 59340, 86319]
19697H6319L605k1509M0335k0772m0860j2483O740K6302k934O837m2066k5766
19685C748J3010L5019N915l6082k5356j3541K90L3167l3632K901J0876M958m2899
19672d1626L0522N4189p8426p991O4707j4936R662k7804J7936O2600r971j9783
19660C9079m1347N7788j8905k6055l6532O0592O8936m897j0157j1548q006l1769
19648C7179k9897O2004N7086n1477m2423O4573J5628l0433J3439P926j5909k1437
19636F6259k4017n4950J4907J1540O0931J4382m8897l492n532k9821O23L1480
19624C3413P7286M7814L2281L4302o2946m5932j9205o0125j1523J8424j4048j387
19612B8354l6773k2039L5965J8246J2419K705j3451O4773n721l6163L261J5804
$$ y = [86319, 89924, 68415, 108750, 87978, 47118, 34635, 41375, 67677, 64743, 71580, 29514, 3748, 16758, 51777, 57692, 21610, -3746, -17287, -16997, 16170, -17462, -14561, -3685, 1273, -41626, -11104, 43085, -35341, -43332, 21375, 6439, 16101, -11703, 6233, 68833, 58862, 39079, -2268, 55520, 36615, 10560, -25972, 34620, 103556, 98659, 88502, 76954, 68948, 37179, 7282, 69286, 126372, 74895, 32472, 97045, 112673, 82240, 95679, 103605, 87696, 66259, 42242, -12708, 2199, 13739, 74670, 89052, 40155, 36663, 31131, 1310, 1933, 33413, 110699, 158513, 190794, 225096, 162150, 116218, 97013, 36888, 25365, 43789, 29741, 28354, -8419, -30458, 5507, 23753, 36172, 38877, 25426, 90199, 84478, 48315, 51576, 67380]
19600F7380L9949L764j06J6909J5079J1974l8770o414r119j8635l1559j8414l340
19587B8698K0697P008o2045j4653p491J4083K5264N2384j5390j1867L7343J1496
19575H5527K6149J1504m2292j7920q720L066R892J335M145k0762q3245l0064k4429
19562h5814k9973K6491J3573l7760j502Q4185N6231K9326j0284l6726m1414K899
19550c0768N4438N9681n611o9073k9877l650j2232j9347j0813M1793O6957j2822
19538B8676J3584L4571l8566j6864j7959M6090l3176q050M7100K7315L6339L853
19526A22913j6533j9337L66O216m6342l0870N6191L6498L7579P90n4695l5176
19514E7600q949l9555l8553K0629M2056L1753k7054K0769M7942J1795K3o230M9849
$$ y = [67380, 107329, 111093, 110987, 127896, 142975, 154949, 116179, 109765, 100646, 82011, 50452, 32038, 28698, 49395, 56403, -5642, -20295, -27786, -13703, 11561, 63945, 48555, 36688, 74031, 85527, 111676, 123180, 80888, 62968, 54248, 57314, 67206, 68541, 72686, 51924, -31321, -61385, -85814, -115787, -89296, -75723, -113483, -114985, -30800, 25431, 54757, 44473, 7747, -33667, -30768, 23670, 83351, 77740, 8667, -21210, -24860, -37092, -56439, -67252, -25459, 41498, 28676, 42260, 76831, 38265, 21401, 3442, 49532, 16356, 8306, 55406, 82721, 119060, 122913, 106380, 87043, 87409, 93625, 47283, 16413, 72604, 109102, 146681, 147471, 92776, 57600, 48651, 9096, -29457, -8828, 33228, 64981, 37927, 58696, 106638, 118433, 118456, 112226, 162075]
19501A62075k5044o1679J592k5425r79K1324p1845j2616O3778R5055n1708o4659
19489B9869l0928K3374j5001J1141K1377k2533m3758M7905J2118l7675q808j5244
19477b8163k0199K5592M5688L9408l7421R34L5840j1202n4557j9521O0219J2723
19465D9341J0264K7965J8504m8826Q89n0009k2218N10J6075K3440J14434M5070
19453A85439j7524m3182p1568o523J8013L9318K5946k935K8019L4434j6399l0078
19441A42960K6205L0369k8616m2876m5744q1538k5586P0473L0474P9647J6387
19430A72155N180j6015j12498j8409L7052K5439N3800l4202m3973M8087m77n189
19418A10950N820J4029k4660m7983l8304o820Q70L6239K8695J5823j5434o5109
$$ y = [162075, 137031, 75352, 76944, 51519, 50540, 71864, 19, -12597, 51181, 146236, 94528, 29869, -1059, 22315, 7314, 18455, 39832, 17299, -26459, 21446, 33564, -4111, -12919, -28163, -48362, -22770, 22918, 62326, 24905, 25839, 61679, 50477, -4080, -23601, 36618, 49341, 59605, 87570, 106074, 57248, 58137, 8128, -14090, -13580, 2495, 25935, 140369, 185439, 167915, 124733, 53165, 46642, 64655, 103973, 129919, 126984, 155003, 189437, 173038, 142960, 169165, 199534, 170918, 128042, 82298, 760, -24826, 45647, 76121, 155768, 172155, 177335, 161320, 48822, 30413, 67465, 92904, 146704, 112502, 68529, 116616, 116139, 110950, 116770, 130799, 106139, 58156, 19852, 13032, 13902, 50141, 78836, 94659, 79225, 14116]
19406A4116K5244K5372n907K7422K1096N537n7061l4027L591J8943K871L716m6607
19393D306m6316N3341L3187j9249J375o584Q216R832J7228O1531J9049M2208J1180
19380A89304n701m1123m4995m1963r846l1337p285M34M2806M884K6L7357k4837
19367F7724k9033O9089L9578k5145o4843k6733l0815J2458K5291K6156k823L3776
19355I4680k1264o7808l5394O5742Q5770K4321k2751J8948j3877j1813o1947J9181
19343G3788P5097j9612l0830j7190L1722L4056J6755L5376l2351o0088K4217K2705
19331A53645j3562m5586j966o7067K0219N5715j920k4923j3483k152q522P3912
19319A24310L213j5272J289j6532l1014M6445j5957P453O0406l9985k5888K607
$$ y = [14116, 39360, 64732, 58825, 86247, 107343, 112880, 55819, 21792, 25383, 44326, 47197, 50913, 4306, -42010, 11331, 44518, 25269, 26644, 20060, 28276, 38108, 55336, 116867, 135916, 178124, 189304, 183603, 142480, 97485, 55522, 45676, 14339, 7054, 7488, 50294, 55178, 55204, 92561, 67724, 38691, 107780, 147358, 122213, 57370, 30637, -178, 12280, 37571, 63727, 60904, 94680, 73416, 5608, -29786, 35956, 121726, 146047, 123296, 142244, 128367, 116554, 54607, 73788, 148885, 129273, 98443, 81253, 112975, 147031, 163786, 199162, 166811, 106723, 130940, 153645, 140083, 94497, 92531, 25464, 45683, 101398, 99478, 74555, 61072, 58920, 50398, 124310, 127523, 112251, 113540, 97008, 65994, 112439, 96482, 103935, 164341, 124356, 98468, 101075]
19307A01075j9061K5134K9541o176j8299n308k4801j627K1447j3306k5285M3409
19295A06743O2969m4812J3973J9783j6187o0130m9161l6055j7159L9416K7662
19284D7042J4847k2366k4337J1427J9303l4877k1374m865K4474J1457K9562L5365
19272H5658J9695m0827m0680K8660J8030K3887k9777N69m9524N497L406J9519
19260D4113l8322J3148P1916O2896o3511m8668m4188k4725M5209l5714K4798P7096
19248H4048K0843m6977o7536L7828M9000J1983o248J486l1321K6654M7861O6907
19236A94528j6443n1476K8270J1692l5152r456j8J6258Q19O461p955k53r570M9980
19222A77685M2038p5796o799k529l8642j2932J1298M446k5989k0764K006M3140
$$ y = [101075, 82014, 107148, 136689, 130513, 112214, 106906, 82105, 80478, 101925, 88619, 63334, 106743, 169712, 124900, 138873, 158656, 142469, 82339, 33178, -2877, -20036, 19380, 47042, 61889, 39523, 15186, 26613, 45916, 11039, -10335, -15200, 9274, 20731, 50293, 85658, 105353, 64526, 23846, 52506, 70536, 94423, 64646, 65215, 15691, 21188, 24594, 44113, 5791, 18939, 90855, 153751, 90240, 41572, -2616, -27341, 17868, -17846, 6952, 84048, 104891, 57914, -9622, 28206, 77206, 89189, 82941, 84427, 53106, 79760, 127621, 194528, 178085, 126609, 154879, 166571, 131419, 121963, 121945, 138203, 139022, 145483, 137528, 137275, 127705, 177685, 219723, 143927, 137128, 134599, 95957, 83025, 94323, 98769, 72780, 52016, 54022, 97162]
19210I7162J7385j2558k9734l1821K4202l5051N878r606J123j677j4782J4608
19198B5129N1795J7832k6307k2444K7427J1510J1347l6019K5544j317n312P912
19186H7097J0809J0411j7643j2045O939k2613j9257M1324J3861N1749o221k8987
19174A15424L759K1918J6429K9262k1211l2289K047J7307j3833j5620l4710k9126
19162E9357M7208N2643Q065M322J8659K644l4055J0759J478P780M0635O1203M9248
19149C29946P279N377K0256J09647M3067M7813N0071j3163o448J4091L3014k2611
19137F18339k0365J2938J8655M003N8205m3746m94J6542j1848o3255q4462r7042
19125D07470l7205j4424l196n0575k1648M4229N1516o9953l5462K2280m4146m6376
$$ y = [97162, 114547, 101989, 72255, 40434, 64636, 29585, 35463, 25857, 26980, 25303, 10521, 25129, 76924, 94756, 68449, 46005, 73432, 84942, 96289, 60270, 85814, 84497, 79185, 87097, 97906, 108317, 90674, 78629, 85568, 62955, 43698, 85022, 98883, 150632, 144411, 115424, 119183, 141101, 157530, 186792, 165581, 133292, 135339, 152646, 138813, 123193, 88483, 59357, 106565, 159208, 167273, 171595, 190254, 192898, 158843, 169602, 171080, 178860, 219495, 280698, 329946, 337225, 342602, 362858, 472505, 515572, 563385, 613456, 600293, 593845, 607936, 640950, 618339, 597974, 610912, 629567, 633570, 691775, 648029, 647535, 664077, 652229, 588974, 504512, 407470, 370265, 355841, 352645, 302070, 280422, 324651, 376167, 306214, 270752, 293032, 248886, 202510]
19113B02510K3992l0980M656j5564j1073l405m7257L3410J1514n3849p1496l30
19101D2128L1038o650J1994K5038J4581P690J2213K7674o078K6164O0262N1180
19089B97234n7415q0714j0438N5868J2005l9044j0946Q207P620J1553P187j4791
19077A86326o273K8096N60N114M365j6401n6963m6135k095P8237N6555O4835N543
19064C01764k9782m3898l8292J151K4836N4850L8024R180j519o595o650J792n8965
19051B45896k9196j100Q255N2582K538j7958j0917j2167R5104J6704o4108o1658
19039B23975k5117K1888N360n973j4859q1296L22O616J0367k214J4865J0451k1404
19026A42981k1487j9033N4598o119l0851J5450K3541L4923K8703K2969k898j0562
$$ y = [202510, 226502, 195522, 200178, 184614, 173541, 170136, 122879, 156289, 167803, 113954, 42458, 42128, 73166, 66516, 78510, 103548, 118129, 125819, 138032, 165706, 159628, 185792, 246054, 297234, 239819, 159105, 148667, 204535, 216540, 177496, 166550, 174757, 182377, 193930, 201117, 186326, 180053, 208149, 208709, 213823, 218188, 201787, 144824, 98689, 96594, 174831, 231386, 296221, 301764, 271982, 228084, 189792, 190943, 215779, 270629, 308653, 317833, 316314, 309719, 303069, 304861, 245896, 216700, 215600, 223855, 276437, 278975, 261017, 250100, 237933, 333037, 349741, 285633, 223975, 198858, 220746, 226106, 220133, 205274, 123978, 124300, 130916, 141283, 139069, 153934, 164385, 142981, 121494, 102461, 157059, 150940, 120089, 135539, 159080, 194003, 222706, 245675, 242777, 232215]
19014B32215K8676K5460K2398J6398N1246K5390J9907n90n195M6360p0230m5000
19002C47035k8037m6888J3217K5919O8331L4782O335q6308j9478k476j4332J1040
18990C09140m2833m745k9251m5550p2770O5683l539n0988m6080J1736Q4095L7831
18978B12729m5592l935l1286o352K2819n0086q804O606N5888M1071l8535n1029
18966A03494m6502l868L4531N2881K5850j3180L806J6881j3560K416K5140n8300
18954A29589k8423m8691J3934L0985n560J798J6013M983J2956K0833k7236q47
18942A20334J7301l6356l707l0756M1775J0522J773j5621l8385L2306k2536M7939
18930A24589N3504P8090J5264k2180n719k8424Q108N629M6467O0832P5197K0405
$$ y = [232215, 260891, 286351, 308749, 325147, 376393, 401783, 421690, 421100, 415905, 462265, 392035, 347035, 318998, 272110, 285327, 311246, 379577, 414359, 420694, 334386, 314908, 312432, 298100, 309140, 266307, 261562, 232311, 186761, 113991, 179674, 176135, 125147, 79067, 90803, 174898, 212729, 167137, 163202, 131916, 125564, 148383, 98297, 89493, 96099, 151987, 193058, 154523, 103494, 56992, 53124, 87655, 140536, 166386, 153206, 157012, 173893, 160333, 162749, 187889, 129589, 101166, 52475, 66409, 97394, 91834, 93632, 109645, 114628, 127584, 148417, 121181, 120334, 137635, 101279, 97572, 66816, 108591, 119113, 120886, 105265, 66880, 99186, 76650, 124589, 178093, 256183, 271447, 249267, 243548, 215124, 223232, 228861, 275328, 336160, 411357, 431762]
18918D31762l4929M7378m489J4742Q304J4056L2253o997j2631K5261K4012M6449
18906E85171J8788J8062l4288j3103J9621p463j05999m4497J5745O326J7460L5546
18894E11369Q7767P5266L0003J14153P5125J536J3358L5985O087m1741m8549o9523
18882G90836o6898m1674o1927j9031P2871L5588P2207Q5135O7223j0223l6478
18871H87629k0663k593o4649j01504q7681j21303l2321j1521n0318m9764P548
18860C52860o0544l3119J2575K4925N7245L481m7698j7666O9775N5375K4012k4721
18848D16500l9825p0204m9820k045K0490J2593m9150j8359L1626J4193l9J5397
18836B81357k5976L9726K8785r35j537m1533r46p296n5687j3616N3491N8415M155
$$ y = [431762, 396833, 444211, 439722, 454464, 462768, 476824, 509077, 502080, 489449, 514710, 538722, 585171, 603959, 622021, 587733, 574630, 594251, 586788, 480789, 436292, 452037, 458363, 475823, 511369, 599136, 674402, 704405, 818558, 893683, 895219, 908577, 944562, 950649, 908908, 860359, 790836, 723938, 682264, 620337, 601306, 674177, 709765, 781972, 867107, 934330, 924107, 887629, 866966, 864373, 799724, 698220, 610539, 489236, 456915, 445394, 395076, 345312, 352860, 292316, 259197, 271772, 296697, 353942, 357423, 309725, 292059, 361834, 417209, 441221, 416500, 376675, 306471, 256651, 254606, 275096, 287689, 238539, 220180, 251806, 265999, 265960, 281357, 255381, 295107, 323892, 322957, 321420, 279887, 278941, 271645, 215958, 202342, 255833, 314248, 318403]
18823C18403j8080l9568j8051l7199m747O4040O3202k5270j3043j7582j379j150
18811B69576N0642q399J6307M237j1716j4695m8130J2908J0858L4401J91J07080
18799D23260J7680k2728l7959l7795n7200J167M2556n831l9427L9312K5510k4427
18787C24118k0451j8555q794K8839j2700k7746k0595M747j1213p333K0723J55
18775B51195K3972L0018k5482J2594O0016R7662N4873k1500k5110M9533K0191
18764E27962j19071m5309p1783k803M9112J5055q188o5378l420j647J8606L1956
18752C25092J092m3978j5963L1473r90n9380k8480P06j0767M9471k053j9508j3538
18739B13177J2455L4258P430k0165M9180L7597L8069k1315J3545K2856k8193m7452
$$ y = [318403, 300323, 260755, 242704, 205505, 200758, 264798, 328000, 302730, 289687, 272105, 270726, 269576, 320218, 311819, 328126, 332363, 320647, 305952, 257822, 270730, 281588, 315989, 316180, 423260, 440940, 418212, 380253, 342458, 285258, 286425, 328981, 323150, 283723, 323035, 348545, 324118, 303667, 285112, 276318, 305157, 292457, 264711, 244116, 248863, 237650, 230317, 251040, 251195, 275167, 305185, 279703, 292297, 352313, 449975, 504848, 483348, 458238, 507771, 527962, 408891, 363582, 291799, 288996, 338108, 353163, 344975, 279597, 276177, 274530, 293136, 325092, 326184, 282206, 266243, 297716, 296726, 237346, 208866, 209572, 198805, 248276, 246223, 226715, 213177, 225632, 259890, 267320, 247155, 296335, 333932, 372001, 350686, 364231, 387087, 358894, 311442]
18727C11442J328K0651K3192l3225m3054j5243l2510L757J2994N9579j509r070
18715B98332J3341j7756M5407K3883L4779k7816L1761l8032K5965P2711J5294
18704D77869l7789j8424J2240P0436k5200l5162K9707J4053j898j9402P1348K1425
18692E59203J6632M2886n2671K9157J0284J6049P2532N3680M6682m5492J3050
18681G61992R077n6362l3558j3825M1874K0237K9550k74K6013J1299N26L7250
18669H33799J1870m1939M884R1274O5439L4300O3632Q9361R2440L8425R1872J36671
18657A512028K31639L08872L02570L36054M39169M25486K48986K24090J49488
18648D178382k9088j51759l23491l12534j74174j2607J44476K04446K97412L39576
$$ y = [311442, 312770, 333421, 356613, 323388, 280334, 265091, 232581, 236338, 249332, 308911, 307402, 298332, 311673, 293917, 339324, 363207, 397986, 370170, 401931, 363899, 389864, 462575, 477869, 440080, 421656, 433896, 504332, 479132, 443970, 473677, 487730, 485832, 466430, 537778, 559203, 575835, 618721, 566050, 595207, 605491, 621540, 694072, 747752, 794434, 748942, 761992, 771069, 714707, 681149, 667324, 709198, 729435, 758985, 758711, 784724, 796023, 796549, 833799, 845669, 803730, 808614, 899888, 965327, 999627, 1063259, 1152620, 1245060, 1283485, 1375357, 1512028, 1743667, 2052539, 2355109, 2691163, 3130332, 3555818, 3804804, 4028894, 4178382, 4149294, 3997535, 3674044, 3361510, 3187336, 3174729, 3319205, 3523651, 3821063, 4160639]
18638D160639L11360J62034N8243m6284k32320l09786l49479l76576k77003j90086
18628B910742j31461k0159p5233j17577n5582m6986l9693m8613j5130J8431r26
18617B377813L7121K4525M1520J0389k6679m8042j0638j956J9366J6185j8336
18606B421268M9932R0912P3958J16429P3584M8123P5779Q8877J07752R4144J21925
18595C362683J88971J56575J36217J59927P3960K21224K25565K07401J96860K42410
18585E171793K57402L45819L40960M06714M36869N20764N97509Q00506R58658
18576I836994J037840J150331J417125J854334K387173L282328M364632N851626
18568C1182383P815606R613550J0591192J0637092J0463872R888792Q044221M148602
$$ y = [4160639, 4471999, 4634033, 4692276, 4645992, 4413672, 4103886, 3754407, 3377831, 3100828, 2910742, 2779281, 2759122, 2683889, 2566312, 2510730, 2463744, 2424051, 2375438, 2360308, 2378739, 2377813, 2414934, 2439459, 2480979, 2491368, 2464689, 2416647, 2406009, 2404053, 2423419, 2439604, 2421268, 2471200, 2562112, 2636070, 2752499, 2826083, 2874206, 2949985, 3038862, 3146614, 3240758, 3362683, 3551654, 3708229, 3844446, 4004373, 4078333, 4299557, 4525122, 4732523, 4929383, 5171793, 5429195, 5775014, 6115974, 6522688, 6959557, 7480321, 8077830, 8878336, 9836994, 10874834, 12025165, 13442290, 15296624, 17683797, 20966125, 25330757, 31182383, 38997989, 48611539, 59202731, 69839823, 80303695, 90192487, 98236708, 102385310]
18560A02385310J46141j577673j770041k007747k358947j175674J215655L124582
18552I7981606M409928M943226L502130l35336m503378o564467p489736r067594
18544H2876379j1064624j1260171r417508p232860n446275m173516l215612k606639
18536B8459174k078926j704170j573291j295594j136488r39448q52841q43431
18528A8034985p53494o61883o84387o49284o00090n28827m52312m67017m62464
18519A2775227m15623m72105m49993l40679l53553l89299l38720m03242l60101
18510I251912l54314l34619l04588l35325l56375k48683k43757k38377k49921
18501F585953k17313k05381k48648k11178j42777r5758j55268j77777j13314j33208
$$ y = [102385310, 102531451, 100953778, 99183737, 97175990, 94817043, 93641369, 94857024, 97981606, 102391534, 107334760, 110836890, 110501554, 105998176, 99433709, 91943973, 82876379, 71811755, 60551584, 51134076, 43901216, 38454941, 34281425, 31065813, 28459174, 26380248, 24676078, 23102787, 21807193, 20670705, 19731257, 18878416, 18034985, 17281491, 16619608, 15935221, 15285937, 14685847, 14157020, 13704708, 13237691, 12775227, 12359604, 11887499, 11437506, 11096827, 10743274, 10353975, 10015255, 9612013, 9251912, 8897598, 8562979, 8258391, 7923066, 7566691, 7318008, 7074251, 6835874, 6585953, 6368640, 6163259, 5914611, 5703433, 5560656, 5464898, 5309630, 5131853, 5018539, 4885331]
18491D885331j66181j46876j42046j30209o5718j05936j16275r6848j20161r3813
18481C701268j10000j08567p5438j37448j25265o190M0967n6262j26987o8508
18471B927570K0448l952k3372l5500K833n6945n7851r1871j29846m4849q1369
18460B425296q6032j54013j16938l1592n999r855K5043m9246p1967n1104n7377
18449A816216N164K5457k3195q191o1253m4414o2538J6594l0875k3756P514J1362
18437A628085K0417r346j5690l6484j2231M791J1691p278l5306P4391J04258Q5621
18425A812919J06553J02530L2284J18044N8287J4742l4896m5392p6372o9072p2797
18414A946830j01197n8627l7736m3118n1294R562R7904K9340j4706j3468l415
$$ y = [4885331, 4719150, 4572274, 4430228, 4300019, 4234301, 4128365, 4012090, 3915242, 3795081, 3701268, 3591268, 3482701, 3407263, 3269815, 3144550, 3138360, 3179327, 3123065, 2996078, 2927570, 2948018, 2944066, 2920694, 2885194, 2888027, 2831082, 2773231, 2681360, 2551514, 2506665, 2425296, 2339264, 2185251, 2068313, 2036721, 2030722, 2020867, 2045910, 1996664, 1924697, 1873593, 1816216, 1821380, 1846837, 1823642, 1815451, 1754198, 1709784, 1647246, 1663840, 1632965, 1609209, 1616723, 1628085, 1648502, 1639156, 1623466, 1586982, 1574751, 1579542, 1591233, 1583955, 1548649, 1623040, 1727298, 1812919, 1919472, 2022002, 2054286, 2172330, 2230617, 2245359, 2210463, 2165071, 2088699, 2019627, 1946830, 1845633, 1787006, 1749270, 1706152, 1654858, 1664420, 1762324, 1791664, 1776958, 1763490, 1760075]
18403A760075r1251j04860n2340K057k6205m9422L8016j2643k9163p8075p3691
18392A282498M7345K7487l4173K5919l5465o458k2668m3245R590N1435K126n9404
18380A244987K1850O7172O8114J71984J66164Q8787N4547R0107J1826J0677n2317
18369A943898j01587j04347k1634j9811k4511O474k9400j5943l952N7853J6547
18358A703587p2185r490M4484N0744M9238P6471L4111J800P9660R6988K0449O23
18346B076480K7461K7565k3567j2869k6202K5494L2730Q3693J08234J81397K08272
18335B708688J85937K50856L01242L09243K62196K56120J49598Q9790P9504O8744
18325D661918J16377Q0493J16129K17991L75877M66411O48442P36102Q80288R83507
$$ y = [1760075, 1668824, 1563964, 1511624, 1513681, 1487476, 1438054, 1476070, 1463427, 1434264, 1356189, 1282498, 1329843, 1357330, 1323157, 1349076, 1313611, 1307153, 1284485, 1241240, 1250830, 1302265, 1304391, 1244987, 1266837, 1334009, 1402123, 1574107, 1740271, 1829058, 1883605, 1973712, 1985538, 1996215, 1943898, 1842311, 1737964, 1716330, 1696519, 1672008, 1678482, 1649082, 1633139, 1629187, 1687040, 1703587, 1631402, 1621912, 1666396, 1717140, 1766378, 1842849, 1876960, 1878760, 1958420, 2055408, 2075857, 2076480, 2103941, 2131506, 2107939, 2095070, 2068868, 2094362, 2127092, 2210785, 2319019, 2500416, 2708688, 2894625, 3145481, 3446723, 3755966, 4018162, 4274282, 4423880, 4513670, 4593174, 4661918, 4778295, 4858788, 4974917, 5192908, 5568785, 6035196, 6683638, 7419740, 8300028, 9283535]
18315I283535J268005J714902K347839L499768N362175Q097327J1054660J3220089
18307E5848300J3712626J3631395J3372765J1166470O173619j231084n385487
18300A07288604p117658p976453r628222j0055239o188668K117O070053R637419
18292H2031953J0785456J1298648J0594272P318060Q95946n808885q665595j0167520
18284I8282335j1613433j4471529j4596270j2029539q354602n292721l550051
18277B8374190k480037j890658j572297j393430j255606j104499r48768q97391
18269A6831504q22575p29223n54990m92731m31458l74937l41339l68019m57624
18260A2258608m49764m58741m78540m85731m69767n15704m57898m01125l46742
$$ y = [9283535, 10551540, 12266442, 14614281, 18114049, 23476224, 31573551, 42628211, 55848300, 69560926, 83192321, 96565086, 107731556, 113905175, 112674091, 107288604, 100170946, 92194493, 82566271, 72511032, 66322364, 66324481, 72394534, 82031953, 92817409, 104116057, 114710329, 122028389, 122924335, 117115450, 108449855, 98282335, 86668902, 72197373, 57601103, 45571564, 37216962, 31924241, 28374190, 25894153, 24003495, 22431198, 21037768, 19782162, 18677663, 17728895, 16831504, 16008929, 15279706, 14724716, 14231985, 13800527, 13425590, 13084251, 12716232, 12258608, 11808844, 11350103, 10871563, 10385832, 9916065, 9400361, 8942463, 8541338, 8194596]
18251H194596l69009k68320k42454k47883k55826k22187k43628k46510k55294
18242E843485k00768j51933j40185j57495j94862j81468j19888j25625j44657
18233D426604j55688o0912j03369j20169j00473j18771j41683j52608j16984m9727
18223C306220k9315m6702o2810o8027p6173q1243n7462q8837l2699J0142L3046
18212B806140q9481o4660K452m0195r4942k5525k5189L5941k9760j27786p3951
18201B273044o5035q3867o3484o2955l7434j2556J2055J1325R078o5788o9055
18190A845328j5145k6514n1531r7562j07088k1140M1914l7984M86j4404k2466
18179A493894k4528J2366k5475o3604k0470K4044l2307n1214j1963J4544Q001
$$ y = [8194596, 7825587, 7557267, 7314813, 7066930, 6811104, 6588917, 6345289, 6098779, 5843485, 5642717, 5490784, 5350599, 5193104, 4998242, 4816774, 4696886, 4571261, 4426604, 4270916, 4210004, 4106635, 3986466, 3885993, 3767222, 3625539, 3472931, 3355947, 3306220, 3276905, 3230203, 3167393, 3099366, 3023193, 2941950, 2884488, 2795651, 2762952, 2773094, 2806140, 2716659, 2651999, 2654451, 2614256, 2519314, 2493789, 2468600, 2504541, 2474781, 2346995, 2273044, 2208009, 2124142, 2060658, 1997703, 1960269, 1947713, 1959768, 1971093, 1980171, 1914383, 1845328, 1830183, 1803669, 1752138, 1654576, 1547488, 1526348, 1568262, 1530278, 1530764, 1516360, 1493894, 1469366, 1481732, 1456257, 1392653, 1372183, 1396227, 1363920, 1312706, 1300743, 1315287, 1323288]
18168A323288n4805j3885k7820m7648K8139P3239M4442o3789p9137L522l4772
18157A150774K072j6262k319L925j7242p056L8884j3860m7249k6923K6680j4796
18145A076628n3966r2188k2928L8339P0178M2560M1631J5568K6309L8112K4632
18134A204875k5530K4070Q9015P3099R5529Q6978Q5926M9959J30302J27968J30404
18123B072595K40328K00374K50991M15391M91287O83227J068288J570863K485520
18114I478864M348298Q140477J2632831J0904326N519519L942319L105417J490340
18106E9562391j3285620j8052957r664531m733169k661211j697281j190227q84766
18098G392629o79112n36215m09644l65078l33588l08049k36579j60406j33688
$$ y = [1323288, 1268483, 1254598, 1226778, 1179130, 1207269, 1280508, 1324950, 1261161, 1182024, 1185546, 1150774, 1152846, 1136584, 1134265, 1138190, 1120948, 1113892, 1152776, 1138916, 1091667, 1064744, 1091424, 1076628, 1022662, 930474, 907546, 945885, 1016063, 1058623, 1100254, 1115822, 1142131, 1180243, 1204875, 1179345, 1203415, 1292430, 1365529, 1461058, 1548036, 1633962, 1683921, 1814223, 1942191, 2072595, 2312923, 2513297, 2764288, 3179679, 3670966, 4354193, 5422481, 6993344, 9478864, 13827162, 21967639, 34600470, 45504796, 51024315, 54966634, 58072051, 59562391, 46276771, 28223814, 18559283, 13826114, 11164903, 9467622, 8277395, 7392629, 6713517, 6177302, 5767658, 5402580, 5068992, 4760943, 4524364, 4363958, 4230270]
18089D230270q9701r8983j19266j37167j35945j29618j25606j14371r1818j57350
18079C030445j26790l4068j01441q3285q6070o6680n6756n2656n9608q7814p5591
18068B199686q8155j00895k1916p2097m5160n6865q0960o2570J6994r922n3326
18057A624814l9233l9717J6067m8335n6376J7792J5315J7859m886k4184r390l4859
18045A434867m9630o9996j8229k9636l8731K3177l9100J6972O772P7908l123r104
18033A302147L2983k1417m0597m8266m7653o8315l3448k9693J8740J8186J8777
18022A101444n2909l1896n611q939k2638p6880j3185J3106P1564l0179m3059M6083
18010I46901M8342m47n1597K21l4148L922K7465J08152K5922j1454l9596l4978
$$ y = [4230270, 4140569, 4041586, 3922320, 3785153, 3649208, 3519590, 3393984, 3279613, 3187795, 3030445, 2903655, 2869587, 2768146, 2684861, 2598791, 2532111, 2475355, 2422699, 2363091, 2275277, 2199686, 2111531, 2010636, 1988720, 1916623, 1871463, 1814598, 1733638, 1671068, 1688062, 1678140, 1624814, 1585581, 1545864, 1561931, 1513596, 1457220, 1475012, 1490327, 1508186, 1503300, 1479116, 1469726, 1434867, 1385237, 1315241, 1297012, 1267376, 1228645, 1251822, 1212722, 1229694, 1236466, 1314374, 1311251, 1302147, 1335130, 1313713, 1273116, 1224850, 1177197, 1108882, 1075434, 1045741, 1064481, 1082667, 1101444, 1048535, 1016639, 1011028, 1002089, 979451, 902571, 889386, 902492, 974056, 943877, 900818, 946901, 995243, 994796, 943199, 943420, 909272, 913194, 940659, 1048811, 1074733, 1063279, 1023683, 988705]
17998I88705K3959K8435m9163p2284o966L784P2674O1538K1981L5742Q967M8303
17986A165675Q5477j2986o9916m1807q90M6488K2178k8313L3496P4983K387N4687
17974A331459P2773P0480M2606N7792K7482m0416K9883R7316R4983N8407O9670
17963A912435J01534J15046J03287J8414l7988l432l455L2026n099M9813M1612
17952B324193K3103p693k7085m2692l4402L576J9814N1669j6891J10104K02631
17941B606327J75048K26287M07981L31309K88937M61177O62869J057387J572165
17932G789487K421496L757445N431813O913282P765480P862308P400364N266331
17924E4608006J953188k080235n177105o866554q069147p714207o226553m189881
$$ y = [988705, 1012664, 1041099, 991936, 919652, 912686, 916470, 989144, 1050682, 1072663, 1108405, 1117372, 1165675, 1251152, 1238166, 1168250, 1126443, 1125553, 1172041, 1194219, 1165906, 1199402, 1274385, 1276772, 1331459, 1404232, 1474712, 1517318, 1575110, 1602592, 1562176, 1592059, 1689375, 1784358, 1842765, 1912435, 2013969, 2129015, 2232302, 2250716, 2212728, 2209296, 2205841, 2237867, 2232768, 2282581, 2324193, 2347296, 2339603, 2312518, 2269826, 2235424, 2239000, 2258814, 2310483, 2293592, 2403696, 2606327, 2781375, 3007662, 3415643, 3746952, 4035889, 4497066, 5159935, 6217322, 7789487, 10210983, 13968428, 19400241, 26313523, 34079003, 41941311, 49341675, 54608006, 56561194, 54480959, 49303854, 42437300, 34368153, 26653946, 20427393, 16237512]
17916A6237512k648957j709832j188827q57233o42110n50356m37156l84608l01835
17907G516598j38816m4584j1687j3133P956K3593m6636j23281j51134j08210j9709
17896F890957N6924N0614J23958J86983L40110O11135P92686R75375J064591J235204
17886A2328537J563220K178807K976511M286343P025979J0709445J4257088J6495094
17878G1821024J6826438J5805594J1881303N318708l122246j0397284j4574158
17871I3559379j6961641j6722396j3727970r744539o391034m268394l127263k370478
17863B0245664j825495j476561j221818r63951p39683o43007n85909m56328l52057
17854A1980855k54154k26200k02019k02582k51404k00580k03265j94994k06579
$$ y = [16237512, 13588555, 11878723, 10689896, 9832663, 9190553, 8640197, 8203041, 7818433, 7516598, 7377782, 7333198, 7321511, 7308378, 7316334, 7339927, 7293291, 7170010, 7018876, 6910666, 6890957, 6947881, 6998495, 7122453, 7309436, 7649546, 8260681, 9053367, 10028742, 11093333, 12328537, 13891757, 16070564, 19047075, 23333418, 30359397, 41068842, 55325930, 71821024, 88647462, 104453056, 116334359, 121653067, 118530821, 108133537, 93559379, 76597738, 59875342, 46147372, 36402833, 30011799, 25743405, 22616142, 20245664, 18420169, 16943608, 15721790, 14757839, 14018156, 13375149, 12789240, 12332912, 11980855, 11726701, 11500501, 11298482, 11095900, 10844496, 10643916, 10440651, 10245657, 10039078]
17845A0039078k18447k39225k48583j75803p0114Q1612K17926M01030O56889J054348
17835A1498711J641340K636457M156026O176298Q161924R548723R750140R355185
17827F2924804P361178L395937j476800o090911q530522j0173163j0458705q710716
17819B8241102o326040m014590k633593j854130j371317r99063p81814p06548
17811I554007n87371n06004l72710l08992k65070k19559k29794j69098j13678
17802F781731j47292j51471j56636j31283j23037k09415k43145k48496l12106
17793E058850k38611k07030j73518j46736k27224j92294r9490j40556j24475j29024
17783C379892r6183m7104n0479j22768j51940q7448k8080r1188j44519j23712
$$ y = [10039078, 9820631, 9581406, 9332823, 9157020, 9086906, 9168518, 9386444, 9787474, 10444363, 11498711, 13140051, 15776508, 19932534, 26108832, 34270756, 43819479, 53569619, 62924804, 70285982, 73681919, 72205119, 66114208, 57583686, 47410523, 36951818, 28241102, 21915062, 17900472, 15266879, 13412749, 12041432, 11042369, 10260555, 9554007, 8966636, 8460632, 8087922, 7778930, 7513860, 7294301, 7064507, 6895409, 6781731, 6634439, 6482968, 6326332, 6195049, 6072012, 5862597, 5619452, 5370956, 5058850, 4820239, 4613209, 4439691, 4292955, 4065731, 3873437, 3773947, 3633391, 3508916, 3379892, 3283709, 3236605, 3186126, 3063358, 2911418, 2823970, 2795890, 2704702, 2560183, 2436471]
17773B436471k8206J850o4206p4345j8608n2596o5940j01050r5861o7548J6656
17762A886617J9072r1816l399j3487q3114l8887J6505l4940o9485j7492n648o3423
17750A500503O754k664o8474q7915m0719j245j4759J391o4194n4666j7179J3770
17738A170603j5005r425k6464j2491j4534m348k5627m3649m3303L6917K4317n6790
17726I80201m3148l0138J128l0356J0218p293m5692p0517N3869J37030J56709
17715A112011J24926L6881N8571M352L3919l2555l4270p1034o8646n5189k8160
17704A080806M932p320N662O4786Q8534Q4663N2927o6096j16196n5145o1421n7886
17692A018246p6974m2759o8144q6519j2482j2345m1692l0087l3769n4743p826
$$ y = [2436471, 2408265, 2410115, 2345909, 2271564, 2252956, 2200360, 2134420, 2033370, 1937509, 1869961, 1886617, 1905689, 1813873, 1810474, 1796987, 1713873, 1674986, 1691491, 1656551, 1587066, 1569574, 1563926, 1500503, 1507257, 1504593, 1436119, 1348204, 1307485, 1306240, 1291481, 1292872, 1228678, 1174012, 1156833, 1170603, 1155598, 1146173, 1119709, 1107218, 1092684, 1088336, 1062709, 1019060, 975757, 1012674, 1036991, 980201, 937053, 906915, 908043, 877687, 887905, 880612, 834920, 764403, 818272, 955302, 1112011, 1236937, 1273818, 1332389, 1336741, 1370660, 1338105, 1303835, 1232801, 1164155, 1108966, 1080806, 1085738, 1078418, 1084080, 1148866, 1237400, 1322063, 1374990, 1308894, 1192698, 1137553, 1076132, 1018246, 941272, 898513, 830369, 743850, 731368, 719023, 677331, 647244, 613475, 558732, 550906]
17681E50906L9836L5676k1986L465M653N171j2380J6115j6518k3913p6734k9153
17669D75138M4251m98p44O5164O00j03047l9202M9189K514n903j668j7091J0963
17656D79666J3213j0532m316j8046J8679j0746J5825j3037r92j1168K7570J9846
17644E05962j3791J2888o6428r4153k9753M8825Q7762M7766J6536J0723J8018
17633E44355L1127m0920Q670N792l6841l2486j0350J2710J0064M3852k851j6780
17621E16342J9422j649k7843M566k6935J1693j1866k2693M5410J6828p267K2616
17609E38624j802J4832P3722N1819l5955l505O059L9533P3046O6644M0826L2376
17597H96219N4539O769p324j5323r464l2688m895K4302P5376M1700m0888o9586
$$ y = [550906, 590742, 626418, 604432, 607897, 612550, 617721, 605341, 621456, 604938, 581025, 504291, 475138, 519389, 518891, 518147, 583311, 583911, 480864, 441662, 490851, 493365, 487462, 485794, 468703, 479666, 492879, 482347, 478031, 459985, 478664, 467918, 483743, 470706, 469714, 458546, 486116, 505962, 492171, 505059, 438631, 344478, 314725, 363550, 451312, 499078, 515614, 526337, 544355, 575482, 534562, 543232, 549024, 512183, 479697, 469347, 482057, 492121, 535973, 533122, 516342, 535764, 534115, 506272, 510838, 483903, 495596, 483730, 461037, 506447, 523275, 516008, 538624, 536822, 551654, 625376, 677195, 641240, 637735, 643794, 683327, 756373, 823017, 863843, 896219, 950758, 957527, 950203, 934880, 925416, 892728, 887833, 912135, 987511, 1029211, 988323, 918737]
17585I18737l9645m211k0617m4585l227j0534j08390k0337J6759L4581m5657M8263
17573G21137K7742j7910l012K3473j5883l8165n4173m875M6639j9474n9485o6159
17561E39855j2571L6584L9422L2340N799M350l6474m9063Q499M3679L2103l5151
17549F09372k0133N6702M3448J7934j9448l6802L7441M3965L2413n2216L6658
17538G49334j148k5333K2298N2018o6671q7492k5824K7878l4853K5609O4373N306
17526G05495o0427j1900K3691l4876l8165K0529K0543m7827j5410L62p507o4983
17514D89525l0586l1759k8600M3899O1600k6329o0833n7017l0145L3626N2447
17503D15828L2501R572l4917l8100m0525L0924L8269k5503o1331l6963K8621j3597
$$ y = [918737, 879092, 874881, 854264, 809679, 806452, 795918, 687528, 667191, 683950, 718531, 672874, 721137, 748879, 730969, 727957, 751430, 735547, 697382, 643209, 638334, 684973, 665499, 606014, 539855, 527284, 563868, 603290, 635630, 641429, 645779, 609305, 560242, 568741, 612420, 644523, 609372, 589239, 645941, 689389, 707323, 687875, 651073, 688514, 732479, 764892, 712676, 749334, 748186, 722853, 745151, 797169, 730498, 643006, 617182, 645060, 610207, 635816, 700189, 705495, 645068, 633168, 656859, 621983, 583818, 604347, 624890, 577063, 561653, 562015, 554508, 489525, 458939, 427180, 398580, 442479, 504079, 477750, 416917, 359900, 329755, 363381, 415828, 448329, 457901, 422984, 384884, 344359, 375283, 413552, 388049, 326718, 289755, 318376, 304779]
17491C04779k6047J8692K7556Q606K253r779M794J3703q073M34K2710k7628l8423
17478B93577l67k2072L5735p889k5594R60K3884N3418J6844M1122O319m1462m3261
17465C31214K0560M9450M6769m1111k2984J9964k7138o753M4177J6932L674k8787
17453D05967j5319K0135K6420r321K7085K1710L1562O2707Q3301O6401K5523J1604
17441G57775m0332q760q9979n4858q609N5164J0234k9285n0874n7238J5959J6702
17429E15899O512M4478N6867k1871L8972q427n1281L4454J819j8852J4495J5212
17417F28277k2197m8083J6100K5745l6981q3323k5056O64K511L7299m438o9891
17405D20627j2309j3646M7854J5799M0619J2195N887m0230j5913M094p85M1665
$$ y = [304779, 278732, 297424, 324980, 333586, 335839, 326060, 330854, 344557, 336484, 336918, 359628, 332000, 293577, 293210, 271138, 306873, 298984, 273390, 274350, 298234, 351652, 368496, 409618, 415937, 374475, 331214, 351774, 401224, 447993, 406882, 383898, 403862, 376724, 369971, 414148, 431080, 434754, 405967, 390648, 410783, 437203, 427882, 454967, 476677, 508239, 570946, 654247, 720648, 746171, 757775, 717443, 708683, 618704, 563846, 555237, 610401, 620635, 591350, 540476, 483238, 499197, 515899, 522411, 566889, 623756, 601885, 640857, 632430, 581149, 615603, 617422, 598570, 613065, 628277, 606080, 557997, 574097, 599842, 562861, 479538, 454482, 455146, 457657, 494956, 490518, 420627, 408318, 394672, 442526, 458325, 498944, 511139, 517026, 476796, 460883, 464977, 464192, 505857]
17393E05857O637j510M8468O3813M8492k3415j8271Q601P0096O1966N5340M7760
17381H73834M9875M2408L5269N4571L5445Q2226N6364R0100J24490L8001l3151
17370A449432L17j4875o1135k6009n2970j09275o3187k9192L988j4869m26N320
17358A087119l1739k8907L7949m6282j13112p1812l3677k9013l6649j402L171
17347G35646k8940m3278L7845M216k4216p5373K2867L2456Q586O368k0754n4750
17335F00673k8557L6976M2494O5960K2372J783k5274J8206Q2052R2646P8681P7123
17323A065135m9863l0924L4536j6159j03706p5708l7445K9L3519K5629Q617O3858
17311I17518M5687Q542j7251O5619J03732l47J2623L3577k7973K8324l5380j3233
$$ y = [505857, 512494, 510984, 559452, 623265, 671757, 648342, 630071, 638672, 708768, 770734, 826074, 873834, 923709, 966117, 1001386, 1055957, 1091402, 1173628, 1229992, 1320092, 1444582, 1482583, 1449432, 1449749, 1434874, 1373739, 1347730, 1294760, 1185485, 1122298, 1093106, 1097094, 1082225, 1081799, 1087119, 1055380, 1026473, 1064422, 1018140, 905028, 833216, 799539, 770526, 733877, 732475, 735646, 706706, 663428, 701273, 705489, 681273, 605900, 628767, 661223, 669809, 676177, 655423, 600673, 572116, 609092, 651586, 717546, 739918, 741701, 716427, 734633, 816685, 909331, 988012, 1065135, 1015272, 984348, 1018884, 1002725, 899019, 823311, 785866, 785895, 819414, 845043, 853660, 917518, 963205, 971747, 954496, 1020115, 1123847, 1123500, 1136123, 1169700, 1141727, 1170051, 1134671, 1121438]
17299A121438O5630l2755l7149l1456k0078m6979o4699k1245K8876m6048o0400
17288H55135p3926o0132P1880O2191K4240L7570m4839o2291k360K3594p315j0130
17276H13617K1521q043J8440P301k7634j993K7563l4013q232N702K1498M9717
17264H85444m174K9706J11886O8288K2210n4551M7834Q9503N4868q139k3540Q441
17252A227776l796l7127J584m971l2089q049J0483J0084J9991L4353K2249m132
17240A236356Q484M5678n326J4976Q9314P1060K663j8166J4369Q0942P9433P4907
17228A694690k7696k5295K1458O1018K7181J7572l7854l4072J9604m7512n4321
17217A614773l23K4088k3777o699j8557n0403m7697l4003j3967j3297p113j3857
$$ y = [1121438, 1187068, 1154313, 1117164, 1085708, 1065630, 1018651, 953952, 932707, 961583, 915535, 855135, 781209, 721077, 792957, 855148, 879388, 916958, 872119, 809828, 807468, 831062, 823747, 813617, 835138, 827095, 845535, 852836, 825202, 823209, 850772, 816759, 808527, 814229, 835727, 885444, 881270, 910976, 1022862, 1091150, 1113360, 1058809, 1106643, 1196146, 1251014, 1242875, 1219335, 1227776, 1223980, 1186853, 1188437, 1183466, 1151377, 1143328, 1153811, 1163895, 1183886, 1218239, 1240488, 1236356, 1244840, 1290518, 1285192, 1300168, 1389482, 1460542, 1463205, 1445039, 1459408, 1540350, 1619783, 1694690, 1666994, 1641699, 1663157, 1724175, 1751356, 1768928, 1731074, 1697002, 1716606, 1669094, 1614773, 1614450, 1638538, 1614761, 1608062, 1589505, 1539102, 1491405, 1457402, 1443435, 1430138, 1423025, 1409168]
17205A409168n1059o2178p397n908N699m1333j2376J0090L7823q796l5551j6930
17193A221252N3752K4356k8276J7566J335M0803P2536P015O837M7727k932k3440
17181A438531m556Q626O7378O3769N3212k0454L8832M3787k1814L6181O504m70
17169A709526M0243J7686m081M2770O9220M5703L0079K0752m974L6620P551j2980
17157A998115L8381K5908M6914l803P1829P9186j2179L2840K0668j0500N9675
17146B347034J10782O6123n7305l9717K4342R9517J10097K8465M8954J07536P0217
17135B916045R7171M2224l0990K4788M8165J16174K09189J12601J28597J43275
17125C807239J18250K59600K57236L08639L34488L57409L32207M20531M74367
$$ y = [1409168, 1358109, 1295931, 1288534, 1282626, 1288325, 1246992, 1234616, 1244706, 1282529, 1273733, 1238182, 1221252, 1275004, 1299360, 1271084, 1288650, 1289985, 1330788, 1403324, 1410339, 1417176, 1464903, 1461971, 1438531, 1433975, 1442601, 1509979, 1573748, 1626960, 1606506, 1645338, 1689125, 1667311, 1703492, 1709996, 1709526, 1749769, 1767455, 1763374, 1806144, 1875364, 1921067, 1951146, 1971898, 1966924, 2003544, 2011095, 1998115, 2036496, 2062404, 2109318, 2105515, 2177344, 2256530, 2244351, 2277191, 2297859, 2287359, 2347034, 2457816, 2523939, 2466634, 2426917, 2451259, 2550776, 2660873, 2689338, 2738292, 2845828, 2916045, 3013216, 3055440, 3024450, 3049238, 3097403, 3213577, 3422766, 3535367, 3663964, 3807239, 3925489, 4185089, 4442325, 4750964, 5085452, 5442861, 5775068, 6195599, 6669966]
17116F669966N68038O75410Q39225J071457J364521J622768J896118K505704L285571
17107B0498778M222100N397236O724004Q260769J0856089J3473623J3906118J2318792
17099I5657509J1408616J0922938Q071594K64761l129935l581800o313160n899300
17091A07401223l809577l046133k482650M679K644105K768079l56805j126294
17083A01996627j37539j420685m937168n878712q232520r172156p351021p332895
17075E7533931p020030n288918m314404m242384l383023k647063k237777j581095
17067B6819237r30906m41649O048N66696J053846J326155J563585K356326L275346
17058C5594684L600197L709004M413517N552110P096873Q160330Q759302Q124551
$$ y = [6669966, 7238004, 7913414, 8752639, 9824096, 11188617, 12811385, 14707503, 17213207, 20498778, 24720878, 30118114, 36842118, 45102887, 55958976, 69432599, 83338717, 95657509, 107066125, 117989063, 126060657, 126325418, 123195483, 119613683, 113300523, 107401223, 103591646, 100545513, 98062863, 98067542, 100711647, 103479726, 103122921, 101996627, 101859088, 100438403, 95501235, 89622523, 81390003, 72217847, 64866826, 57533931, 50513901, 45224983, 40910579, 36668195, 33285172, 30638109, 28400332, 26819237, 25888331, 25446682, 25452730, 26019426, 27073272, 28399427, 29963012, 32319338, 35594684, 39194881, 42903885, 47317402, 52869512, 59966385, 68126715, 76886017, 85010568]
17050H5010568Q381645Q754621P612147K005966j279363p23035k344140l797596
17042A03620813l920628m279477m163459k050513n70691j610146l279317j218604
17034H2527978M29180j1950k241564k743640l020828n636313n366103m736255
17026E9200505n451968n134931m192372m666336m908950l912552l521204k975017
17018B4437175k095652j537087j230499j004706q48456p60426o99115o92331o42187
17009A4926716o09657n27562m70616m61202m30808m20914l70374m07114m15246
17000A0813223l78850l61889l35392k84785k81465l15085l26367k85775k68405
16991G975210k50755k33260k12399j47556k21054k57325k07460j98424j35885
$$ y = [85010568, 93392213, 102146834, 109758981, 111764947, 110485584, 109762549, 107418409, 103620813, 99700185, 95420708, 91257249, 89206736, 88636045, 87025899, 83746582, 82527978, 82957158, 82945208, 80703644, 77960004, 74939176, 69302863, 63936760, 59200505, 53748537, 48613606, 44421234, 39754898, 34845948, 30933396, 27412192, 24437175, 22341523, 20804436, 19573937, 18569231, 17720775, 16960349, 16261234, 15568903, 14926716, 14317059, 13789497, 13318881, 12857679, 12426871, 12005957, 11635583, 11228469, 10813223, 10434373, 10072484, 9737092, 9452307, 9170842, 8855757, 8529390, 8243615, 7975210, 7724455, 7491195, 7278796, 7131240, 6910186, 6652861, 6445401, 6246977, 6111092]
16982F111092j01898j20038j21659j38348j55903j48977r7470n0004q9600j69021
16972D918174j61300j37183j07286p5002n6397k6909n3686p6941j19364j11728
16962C992378o9015p729k435k3215k1206o0034k6487n4062J5926p5044q7236m5101
16950C536740p4374l8880l7291q3722n7122o4895o2172l5656l5937n4674j5823
16939B976194k1100k3430o226n3364M8631n629n1716j8009j033j140l9549K0231
16927B823860J8928K3058o752K6359Q6141N6404Q8168R9912L5423Q3758J50650
16916C485909J47899J58217K56130K87242K62854K76112L55309M23585L98203
16907F051460N35477O99407R35881J398065J975255K926543L953368M711925N919458
$$ y = [6111092, 6009194, 5889156, 5767497, 5629149, 5473246, 5324269, 5226799, 5176795, 5087195, 4918174, 4756874, 4619691, 4512405, 4437403, 4381006, 4354097, 4300411, 4223470, 4104106, 3992378, 3923363, 3915634, 3913199, 3889984, 3868778, 3808744, 3782257, 3728195, 3744121, 3669077, 3581841, 3536740, 3462366, 3423486, 3386195, 3302473, 3245351, 3180456, 3118284, 3082628, 3046691, 2992017, 2976194, 2955094, 2931664, 2925438, 2872074, 2920705, 2915076, 2863360, 2845351, 2844318, 2843178, 2803629, 2823860, 2842788, 2865846, 2859094, 2885453, 2971594, 3027998, 3116166, 3216078, 3251501, 3335259, 3485909, 3633808, 3792025, 4048155, 4335397, 4598251, 4874363, 5229672, 5653257, 6051460, 6586937, 7286344, 8222225, 9620290, 11595545, 14522088, 18475456, 23187381, 29106839]
16898B9106839P421493Q000553P032110O112102O425852N282415K030141k44394
16890G1167111J020735J173099l91809J328172M345130M942483M988807O600272
16882I5174000N863520K745436L42402O47367k490004p000518p104045m409160
16874H3768998m560707n833036l238728p89099q72409r53271k17329j310843l947848
16865F2045728m689948m061895n569830o847638n760180m345895m014684l589751
16857B3165907k526889j779912j310227j098282r87078p35039o58199o15576o16336
16848A2838369n26189m89759n23473n50962m71961m66825m32073l57916l73080
16839H646131l26647l40020k42652k06449l00792k29836l00537k37516j79726
$$ y = [29106839, 36528332, 44528885, 51560995, 57673097, 64098949, 69381364, 71411505, 71167111, 72187846, 73360945, 72969136, 74297308, 78642438, 83584921, 88573728, 95174000, 101037520, 103782956, 104125358, 104772725, 102282721, 95282203, 88178158, 83768998, 79208291, 73375255, 70136527, 69347428, 68475019, 67521748, 67304419, 65993576, 62045728, 57355780, 53293885, 47724055, 40876417, 35116237, 30770342, 26755658, 23165907, 20639018, 18859106, 17548879, 16450597, 15463519, 14728480, 14070281, 13454705, 12838369, 12312180, 11822421, 11298948, 10747986, 10276025, 9809200, 9377127, 9019211, 8646131, 8319484, 7979464, 7736812, 7530363, 7229571, 6999735, 6699198, 6461682, 6281956]
16830F281956j89374j77697j89362k72634k12099j59947j43311j89978j45538
16821D602016j59631k04151j16113p4368j12989j08932r2504j19499r3274j13674
16811C406881r8755q3846r7955j93129j17930r3831m7510m2396n1488j03582n4929
16800B421530k9836m8412n3314j0109p1464m6020o0841m3377l2120m3985m1650
16789A940402q3468o1629n4769j624k0930l4795j1413r2012K640J826k0943m0445
16777A522840p21l6013K7358K6292n6577r5008k3348L0687r913m8807m1037j8055
16765A277698K652L8234l286n5619k5360k466q5181j26687k3699O957k606j3673
16753I86964j6080J1479k0950m632k5707l5140r609r7885o9711P505j9584l209
$$ y = [6281956, 6092582, 5914885, 5725523, 5452889, 5240790, 5080843, 4937532, 4747554, 4602016, 4442385, 4238234, 4122121, 4047753, 3934764, 3825832, 3733328, 3613829, 3520555, 3406881, 3308126, 3224280, 3126325, 2933196, 2815266, 2721435, 2673925, 2631529, 2580041, 2476459, 2421530, 2391694, 2343282, 2289968, 2279859, 2208395, 2162375, 2101534, 2058157, 2026037, 1982052, 1940402, 1856934, 1795305, 1740536, 1738912, 1717982, 1683187, 1671774, 1579762, 1582402, 1584228, 1563285, 1522840, 1522119, 1486106, 1513464, 1539756, 1483179, 1388171, 1364823, 1395510, 1385597, 1336790, 1295753, 1277698, 1280350, 1318584, 1315298, 1259679, 1234319, 1231853, 1146672, 1019985, 996286, 1003243, 1000637, 986964, 970884, 982363, 961413, 956781, 931074, 895934, 886325, 788440, 718729, 726234, 706650, 703441]
16741G03441k1739o4945j5043J0383j2620j3526j7758o124J2114J468m878J8257
16729E89030m3685l6235m6982K7258k6526J849j8605K1659L9807m7J4348j7802
16717E04069o3464r703M5176O989J9455l6559p6311j5542J3720K1734P151L91
16705D17106R925L3972P6641o893m4206k3725J4940L1088L7728R912N061l31k2802
16692E38416j4519K6600N9588M4841M7545M4142K7501O1977N2528P8011J00540
16681A067170J54234J27094J07789P3189Q2094J14356j1866j90242j13832k3964
16671A386022K7197J06591J73696K54521K90528K95443J44781P4434k4171j86212
16661B542830k33575k35628k20345r0268k0928K0222N1112P8870Q3626J6071K9635
$$ y = [703441, 681702, 616757, 601714, 612097, 599477, 585951, 568193, 562069, 574183, 575651, 570773, 589030, 545345, 509110, 462128, 489386, 462860, 464709, 446104, 467763, 507570, 507523, 521871, 504069, 440605, 430902, 476078, 483067, 502522, 465963, 389652, 374110, 387830, 409564, 416715, 417106, 427031, 461003, 537644, 530751, 486545, 462820, 477760, 508848, 546576, 556488, 561549, 561218, 538416, 523897, 550497, 610085, 654926, 702471, 746613, 774114, 836091, 888619, 966630, 1067170, 1221404, 1348498, 1456287, 1529476, 1611570, 1725926, 1714060, 1523818, 1409986, 1386022, 1413219, 1519810, 1693506, 1948027, 2238555, 2533998, 2678779, 2753213, 2729042, 2542830, 2309255, 2073627, 1853282, 1763014, 1742086, 1762308, 1813420, 1892290, 1975916, 1991987, 2021622]
16650B021622K9596m7706j70121j94974j38686n1198J2056l574p3471l4969n5941
16639A292634l2886M2380N3275J866j5257K7415m1208L8120N3651k4311L3183
16628A428862K3282l442n0002M7984O6644K3510k0336k8359J4924M703R433K5036
16616A542239N4108J6854R1535N4337m5978N568p332n6025n4044j0016N4889L3953
16604A680088O6000R3565R0722Q0571P710P2239J49735Q9320k3250Q284J4242
16593B329226l4446N7571J15139O5156P7813R8171Q7344J68774J58325P3668P2467
16582C269208R8212M2169R8028J09611P7640J55982K52851L54429L27949L63113
16572E149192L44495M10220M37867M17693L90383N79795Q64231J238123J748474
$$ y = [2021622, 2051218, 2003512, 1833391, 1638417, 1499731, 1448533, 1460589, 1457015, 1383544, 1348575, 1292634, 1259748, 1302128, 1355403, 1357269, 1342012, 1369427, 1328219, 1366339, 1419990, 1395679, 1428862, 1452144, 1448702, 1398700, 1446684, 1513328, 1536838, 1516502, 1488143, 1503067, 1507770, 1517203, 1542239, 1596347, 1613201, 1704736, 1759073, 1713095, 1718663, 1711331, 1655306, 1601262, 1591246, 1646135, 1680088, 1746088, 1839653, 1930375, 2010946, 2018656, 2090895, 2240630, 2329950, 2306700, 2314984, 2329226, 2294780, 2352351, 2467490, 2532646, 2610459, 2708630, 2795974, 2964748, 3123073, 3196741, 3269208, 3367420, 3409589, 3507617, 3617228, 3694868, 3850850, 4103701, 4458130, 4786079, 5149192, 5493687, 5903907, 6341774, 6759467, 7149850, 7729645, 8593876, 9831999, 11580473]
16563A1580473K507439L697785N639300Q557222J1617846J2156287R206561O164740
16555G1127653M181362J185037n892550j1990056r720304l600624K161710P665650
16547E5117878J2966131J6080718J6549672J5900540J2626383O006015l725752
16540A31521585j2034170j4996728j8162582j7576750j1314774m834908M99422
16533E3101095N293864Q338062P552311M701156K494777L91738m458562j2372566
16525F5041875j4869555j0919316o892244m524399l245228k396654j861960j515401
16517A8817118j169499r74360q86420o96328n12191m51642n05427n74159n74983
16508A2472109n71332o92191o17260n00594m65022m35629l36490k78646k99442
$$ y = [11580473, 14087912, 17785697, 23424997, 31982219, 43600065, 55756352, 64962913, 71127653, 75309015, 76494052, 70601502, 58611446, 48891142, 45290518, 47452228, 55117878, 68084009, 84164727, 100714399, 116614939, 129241322, 135247337, 131521585, 119487415, 104490687, 86328105, 68751355, 57436581, 52601673, 53101095, 58394959, 66733021, 74285332, 78986488, 81481265, 81873003, 77414441, 65041875, 50172320, 39253004, 32360760, 27836361, 24591133, 22194479, 20332519, 18817118, 17647619, 16673259, 15786839, 15090511, 14578320, 14126678, 13621251, 13047092, 12472109, 11900777, 11208586, 10591326, 10090732, 9625710, 9190081, 8853591, 8574945, 8275503]
16499H275503l03211k36964k52230l55233l48555l24937k92144k11230k02314
16490E748685k25573k02547j87758j85114j85712j47500j00849p4718j12044j73976
16480D152894j97748k03333j00001q6802j02723o0622j72013o1706l8482p0551
16470C058913j16071j68654p8010k6322j38159j45272r8078M726q0292o8957k0937
16459B122887o13j5794p9866j23974r6160o7696l2078j24580o6322o9687n8539
16448A387578m4633Q333o371o6943r6648k9500p6912l1300j8657j7260q884m0585
16436I58218j5385m436K924o6537k537K636j3496l7350p7572k4107k5587K4038
16424G20809J6455P985j2867k0398p358m1041o9602n7458J001k6670k244p4533
$$ y = [8275503, 7972292, 7735328, 7483098, 7127865, 6779310, 6454373, 6162229, 5950999, 5748685, 5523112, 5320565, 5132807, 4947693, 4761981, 4614481, 4513632, 4438914, 4326870, 4152894, 3955146, 3751813, 3651812, 3565010, 3462287, 3401665, 3229652, 3167946, 3129464, 3058913, 2942842, 2774188, 2696178, 2669856, 2531697, 2386425, 2288347, 2293073, 2212781, 2143824, 2122887, 2122274, 2106480, 2026614, 1902640, 1806480, 1738784, 1706706, 1582126, 1515804, 1446117, 1387578, 1342945, 1351278, 1344907, 1277964, 1181316, 1151816, 1074904, 1043604, 1024947, 1007687, 998803, 958218, 942833, 938397, 941321, 874784, 872247, 874883, 861387, 824037, 746465, 722358, 696771, 720809, 737264, 745249, 732382, 711984, 704626, 663585, 593983, 536525, 537526, 510856, 508612, 434079]
16412D34079m2469M4127O0118k7567L0P777J9620O2474k1185p4029m1859N817
16400D26933P2335M6739m0991k0686L684L4436J9122K6527k4749j4079N9839L0391
16388F19501J2701N065o0167n8123m7176j7787o0246J1743J5840K5671J398j5664
16376D32756m3201r7822j5187L597L6116l8619n4719m8669m6171n9970L224N6396
16364A27731j4523N889j798m8177P171M4813L3328l6053K189p1063p6419l2825
16352e9737M5368L5239L4318M0088j5149k3223j5673j0225k5257N0977P317o5757
16340a714J7029N7398j518J6346m1721j3706j4714n121O0674L3356k4792r3J4604
16327I6028k0618q802J4723j5567n4279o3351L3872J6373L323n55J0702K0659
$$ y = [434079, 391610, 435737, 495855, 468288, 468318, 476095, 495715, 558189, 537004, 462975, 421116, 426933, 499268, 546007, 505016, 484330, 488014, 522450, 541572, 568099, 543350, 529271, 589110, 619501, 632202, 637267, 577100, 518977, 471801, 454014, 393768, 405511, 421351, 447022, 448420, 432756, 389555, 291733, 276546, 280143, 316259, 277640, 222921, 174252, 128081, 68111, 71335, 127731, 113208, 119097, 117299, 69122, 76293, 121106, 154434, 118381, 120570, 49507, -26912, -59737, -14369, 20870, 55188, 95276, 80127, 56904, 41231, 31006, 5749, 56726, 64043, -1714, 15315, 72713, 71195, 87541, 45820, 32114, 17400, 12279, 72953, 106309, 81517, 81424, 96028, 75410, 66608, 81331, 65764, 11485, -51866, -17994, -1621, 1702, 1147, 11849, 32508]
16315C2508j08k9259k9977l0282l363j3737J6193M2674L4461J5106q3788j884
16303e1456K1954P2409l123m7835J3241M6265m0983o2392l5075J9277M1036M4525
16291A7843k9418j04004k5167M9074O9508Q020k7154J6716p788K5602n4318k0775
16279h1861l9354j0534O3104M0245k6449o7524q241N882j5493K2941K776J2649
16267a01859N0274J1955n17j3699k5526O499j6431n4826n1307k4115N3610R0344
16255g5598O4798l0421n2923r365J578k143N105m6275M8697P1392r740k2866m7961
16242a05722k8535k7992n2655j264M2605N724J6960L8146O5584J5391m0285o2066
16230a34109k7618J8385L3660n863o6105K2495O8780q942m2146m650k5832P5568
$$ y = [32508, 32400, 3141, -26836, -57118, -60481, -74218, -58025, -15351, 19110, 34216, -49572, -51456, -29502, 42907, 39784, -8051, 5190, 51455, 10472, -51920, -86995, -67718, -26682, 17843, -11575, -115579, -140746, -91672, -22164, -14144, -41298, -24582, -32370, -6768, -61086, -81861, -121215, -131749, -68645, -28400, -54849, -122373, -130614, -124732, -140225, -117284, -114508, -101859, -51585, -39630, -40147, -53846, -79372, -72873, -89304, -144130, -195437, -219552, -165942, -75598, -10800, -41221, -94144, -103509, -101931, -104074, -98969, -145244, -96547, -25155, -34895, -57761, -105722, -134257, -162249, -214904, -216168, -173563, -167839, -150879, -112733, -47149, -31758, -72043, -134109, -161727, -143342, -109682, -115545, -181650, -159155, -90375, -99317, -141463, -146113, -171945, -96377]
16218i6377P086k5510L7646R002j0909l1510L9136K056N8850O9446n5646q3332
16206h0062j3715L9193n857K29n5462K5142j1271r309J1175k7367J1563p3150
16194a88891J6258L2891k6924J7169Q8783N8713m985n743n3305l8128j6633J4530
16182a06265n4649M786L6818P280M8826k9492l3088n8639m2987M7594N3469L047
16170a23300k0973l811O5033m158K0401n3775r2012k5333K9871J2395L9859J4060
16158a41743j2460J9869R662K405m5825m665R51K9588N6872K6900k1853M8384
16146c1915q251j5096J7112N6307k8259j09667q703N3767j0278m1743L7535P9527
16134i664j5900k7294n901j2428o2138Q560L3966J5953j4504k662r583J7083J1552
$$ y = [-96377, -89291, -114801, -77155, -68153, -79062, -110572, -71436, -69380, -10530, 58916, 3270, -80062, -93777, -54584, -60441, -60212, -115674, -90532, -101803, -111112, -99937, -127304, -115741, -188891, -172633, -139742, -166666, -149497, -60714, -2001, -6986, -12729, -66034, -104162, -120795, -106265, -160914, -156128, -119310, -112030, -63204, -92696, -125784, -184423, -227410, -179816, -126347, -123300, -144273, -148084, -83051, -87209, -66808, -120583, -212595, -237928, -208057, -195662, -155803, -141743, -154203, -134334, -124672, -122267, -168092, -172757, -171806, -142218, -85346, -58446, -80299, -31915, -40166, -55262, -38150, 18157, -10102, -119769, -128472, -74705, -84983, -126726, -89191, -9664, -25564, -52858, -58759, -71187, -133325, -124765, -90799, -74846, -89350, -92012, -101595, -84512, -72960]
16121g2960j9040J6803k910P701j1224j314n898k0092L9757n8387m8323N7720
16109a18167L1963J8343l0688j6031J7466n168K9770J1100n101l4400m4997N328
16097a40582N4714R556o938j5498k739K9230k5256k4050J4306M698j8419L2770
16085h8208M8053J8252l1228K5052p97K7467J3895Q010m1424k5901K1424K6324
16073I19J9918j5903q1825m3764L5590O932k373k2100l943L7727O3877Q261q0137
16060g6821r0476L6792R2238j9410j7994J7893N12j0063r032K9128m5960j8696
16048a11889j7061m808N1750qm2813n0876n338J05757N9892m6988k1603j4007
16036i7992M2104m7791n8862l262M5690P1206J0287L866j2244J3197k2512n3687
$$ y = [-72960, -92000, -75197, -78107, -70406, -81630, -82944, -88842, -108934, -69177, -127564, -175887, -118167, -86204, -67861, -98549, -114580, -97114, -102282, -72512, -61412, -66513, -100913, -145910, -140582, -85868, -76312, -83250, -98748, -101487, -72257, -97513, -121563, -107257, -102559, -120978, -88208, -40155, -21903, -53131, -28079, -28876, -1409, 12486, 20496, -20928, -46829, -25405, 919, 20837, 4934, -76891, -120655, -85065, -78133, -80506, -102606, -106549, -68822, -4945, 3316, -76821, -167297, -130505, -38267, -57677, -75671, -57778, -57266, -67329, -76361, -47233, -93193, -111889, -128950, -133758, -82008, -82016, -124829, -175705, -181043, -75286, -15394, -62382, -83985, -97992, -55888, -103679, -162541, -165803, -120113, -48907, -38620, -34754, -46998, -33801, -56313, -110000]
16024a10000m9139j1792m929J9318L3120R0533J0486l9765l2554L3140J4831k0950
16012f7701m5378O8104L5769k6088K519M0975K6306L0292J5177m2381q826K935
16000C1703J7441j190K8006P4903K8885k32K107J1063O1544J1514J6023k4396
15988B57371m9585k0151L0681N8567P8462J51141R2904N0711M7979L143k5222
15977F76001p1920p6405j14519j13610j2571m8574M2571J28026J2492k8011j4035
15966C79445L2886Q246o5836o7302j3612r8736q3687J9350k3387q715k0842q148
15954D9662j1795j9091p273j9202O6961K7409o9830l1061n6797l0867K680K8774
15942g0430K8497J2284Q3995l8702m0254j9121K5708j8270l1743j4077J516L4125
$$ y = [-110000, -159139, -170931, -175860, -156542, -123422, -32889, -22403, -62168, -94722, -61582, -46751, -67701, -113079, -44975, -9206, -35294, -32775, 8200, 34506, 64798, 79975, 37594, 28768, 31703, 49144, 47954, 75960, 150863, 179748, 179516, 181623, 192686, 254230, 265744, 281767, 257371, 207786, 187635, 218316, 276883, 355345, 506486, 599390, 650101, 698080, 701223, 676001, 604081, 527676, 413157, 299547, 286976, 238402, 280973, 408999, 421491, 393480, 379445, 412331, 420577, 354741, 287439, 273827, 175091, 91404, 110754, 87367, 78652, 57810, 49662, 37867, 18776, 11503, -7699, 59262, 86671, 16841, -14220, -71017, -101884, -99204, -70430, -41933, -29649, 54346, 15644, -24610, -43731, -18023, -36293, -68036, -82113, -80597, -46472]
15930d6472j3843J4015J4372j2468k7578J1159L375R005m9385j2213N5311j6528
15918g1250q7294J5966L1925J13707K2679o1774m1377l2385J7760k3826K4432
15907i1437L6410L7349l4817l5945K8273R697j0571N4537L282o697K0934P306
15895A8321P475n0885p5129Q777O736j0579K3714P960M8155j0577L0567L9875
15883D4410k1900j9254q942K0152J054q1071m4434M6499M8142N4876l1354k0124
15871a1946J4333o3381m0636p913K7802Q0610L368k1373k3578M779J1823k478
15859b8590k1911n1819n330J5933L6248L5551K29K7590L809p5295l0823M4422
15847d9986o238o159L045p304L2042K9913L880o1896k9657l9381N8828L5599m8982
$$ y = [-46472, -60315, -46300, -31928, -44396, -71974, -60815, -57440, -48435, -97820, -110033, -54722, -71250, -158544, -142578, -110653, 3054, 25733, -36041, -77418, -109803, -92043, -115869, -91437, -55027, -17678, -52495, -88440, -60167, -50470, -61041, -6504, -3222, -9919, 11015, 18321, 25796, -25089, -100218, -91441, -84705, -95284, -71570, -63610, -15455, -26032, 4535, 44410, 22510, 3256, -5686, 14466, 15520, -65551, -109985, -63486, -15344, 39532, 8178, -11946, 2387, -60994, -101630, -109543, -81741, -1131, 2237, -19136, -42714, -37935, -26112, -28590, -50501, -102320, -107650, -91717, -55469, -19918, -19689, 7901, 11710, -63585, -94408, -49986, -56224, -62383, -59338, -66642, -34600, -4687, -807, -62703, -92360, -131741, -72913, -37314, -86296]
15834h6296q185N8958J0707j3124m3304l2563M631M6382N694K7204O9792L8980
15822G8876l5299m8372l372k733l5901l8108K6919J8695j8822j2343J4510J0092
15810d5858l9590l6195j6072J1689O9766P5155N303n916j4908j4487n5211k7027
15798i3351K5225M8493K1415J6492j2570l4975l6319N2750K3029n825l6184l9828
15786g1648j2410o225j5259L4891l533k3002J8859J555L5650M6946P215k7134
15774a4095j8206m807K723j7174K9408L6483j8860m506N0466R702k1742L4806
15762F4198J5730j422l8798n8509J665L404J6249l1908N0432j5880m562o0321
15750e9722Q3k5774p3293N835N8407l007j2243J01367M0996L6389k5801j8111
$$ y = [-86296, -94481, -35523, -24816, -37940, -81244, -113807, -109176, -62794, -57100, -29896, 39896, 78876, 43577, -4795, -8167, -10900, -46801, -84909, -57990, -39295, -58117, -70460, -55950, -45858, -85448, -121643, -137715, -126026, -56260, 18895, 24198, 18282, 3374, -11113, -66324, -93351, -68126, -19633, 1782, 18274, 5704, -29271, -65590, -12840, 10189, 4364, -31820, -71648, -84058, -90283, -105542, -70651, -74184, -97186, -78327, -76772, -41122, 5824, 13039, -14095, -32301, -37108, -34385, -51559, -22151, 14332, -4528, -9034, 41432, 51134, 29392, 64198, 79928, 78506, 39708, -18801, -17136, -13732, 2517, -29391, 21041, 5161, 599, -59722, -59639, -85413, -158706, -152871, -94464, -97471, -109714, -8347, 32649, 69038, 43237, 25126]
15738B5126N284l7892j7029j760J4769J4545o3156M755k2920K7635O7388J9395
15726C6140K8062k4856m2758J1305N7673Q555L8915q963K5007K1996m7340r8431
15714E305q596O489L2766l5782q780N3945K1789r2133o4744L1244O364J8412N046
15701b8675J1317K2761k946M1065k9174m5495O026j2370n3737K3216L4025O864
15689b7123J0609L7888j8360j6141J2363r994K398Q403O4242o962P509Q3247k4772
15676A23307q2430j3760K2270m0497j8444r072j9810L6340k247L269J2788l3450
15664b1736J5308N6364K2126Q541M657l0814l5064j2748J4246Q502O1385Q981
15652I9748j8503p8029m0613k0247j7256O9267L4642L613k4591j5623J3751o714
$$ y = [25126, 30410, -7482, -24511, -26271, -11502, 3043, -60113, -55358, -78278, -50643, 16745, 36140, 64202, 39346, -3412, 7893, 65566, 74121, 113036, 104073, 129080, 151076, 103736, 5305, -3291, 3198, 35964, 182, -8598, 45347, 67136, -24997, -89741, -58497, -52133, -33721, -28675, -17358, 5403, 2457, 43522, 14348, -31147, -25121, -37491, -91228, -68012, -33987, -27123, -16514, 21374, 3014, -13127, -764, -10758, -8360, 43, 64285, 57323, 64832, 148079, 123307, 40877, 27117, 49387, 8890, -9554, -18626, -38436, -2096, -4343, -1074, 11714, -21736, -6428, 49936, 72062, 80603, 85260, 54446, 19382, 6634, 20880, 29382, 90767, 99748, 81245, 3216, -37397, -57644, -74900, -5633, 29009, 32622, 8031, -7592, 6159, -555]
15640e55j837M9576J9218j1523l693n670j9705m6000P545q342k6637N3818L4287
15627D0482r636L9741K3189K155q967n0747m3561L5237j6137m8087p437Q220L328
15614c2220o23J9429k8309O134N3580M9433j8311L8887j4213k1353N46p79M4346
15601I6547L3089K0813n9644k4730J0075K2048K8030j0249k4101r4506K1060j2986
15589E446l2128l699Q792K7066K8807k7637l4932j8588j5003j8828k462O0281
15577b2885M6753k7197m9952o692L7383O1397k2278J2291J5242l750K1398L46
15565F2056J2943o699j0155K7103l318n984k9536j8004Q649L45M5062n760M59
15552G7161j6211K7436J4997k1669m0284n4479o410J3213m2348l544Q751n188
$$ y = [-555, -2392, 47184, 66402, 54879, 51186, 45516, 25811, -20189, -12644, -20986, -47623, 6195, 40482, 30846, 70587, 93776, 95931, 86964, 36217, -7344, 27893, 11756, -36331, -43768, -35548, -32220, -32843, -13414, -41723, -35589, 17991, 67424, 49113, 88000, 73787, 52434, 52980, 52201, 96547, 129636, 150449, 90805, 66075, 76150, 98198, 126228, 115979, 91878, -2628, 18432, 5446, -26682, -30381, -21589, 5477, 34284, 6647, -28285, -46873, -61876, -80704, -83166, -22885, 23868, -3329, -53281, -59973, -22590, 38807, 16529, 28820, 44062, 40312, 61710, 62056, 74999, 68300, 58145, 85248, 81930, 75946, 46410, 28406, 37055, 37400, 82462, 76702, 77161, 60950, 88386, 103383, 81714, 41430, -13049, -19459, -6246, -48594, -52138, -43387, -48575]
15540d8575Q448N7996M5802K1206M6870k7241m8470j2519N7855K8040j2285n2403
15528F4724l7888m0614L406L2553l3750Q397o827L6407J259l481M9920M5653O230
15515A25989n1444P808L1021j1301K2801J0167m9367L5236K1841J406K3353L0964
15503A98474j3662q1023j09237J9199O1959P884j7301J374k8379P6095N3654n66
15491A68471l9747l0358M252m6526k2438J4374m046Q1094J1669q7703L001n654
15479D6389M2272L1844l0471M302K4743L3318N668m9840Q286k5093j4529m4458
15467C2431k4035K6128N8339k1151r232O6680J191M071l6637n5344k6773Q6978
15455A02646Q8081m1530l5893J5161k4704Q609j565L3251j7963J7167p888m0846
$$ y = [-48575, -40127, 17869, 63671, 84877, 131747, 104506, 56036, 43517, 101372, 129412, 117127, 64724, 26836, -13778, -10372, 22181, -11569, -3172, -9999, 26408, 27667, 24186, 74106, 119759, 125989, 74545, 82353, 113374, 102073, 124874, 135041, 85674, 120910, 142751, 144157, 167510, 198474, 184812, 103789, -5448, 13751, 75710, 83594, 66293, 67667, 39288, 115383, 169037, 168471, 128724, 98366, 102618, 56092, 33654, 48028, 43982, 125076, 136745, 49042, 52043, 46389, 88661, 120505, 90034, 94336, 119079, 152397, 158065, 108225, 116511, 91418, 76889, 32431, 8396, 34524, 92863, 71712, 62480, 129160, 130351, 134422, 97785, 42441, 15668, 102646, 190727, 149197, 113304, 128465, 103761, 112370, 110805, 144056, 126093, 143260, 135372, 94526]
15443I4526L821K7073k6636q966J6819K1470l7671n8777j8107N945K0205L5398
15431G5100J7612J3041n222k2942L8310r392k552J6142M0553o055p1027R832O0993
15418A54393l6384m7686L776K1557J3341Q926K0125o674j2006j9294m5555L0114
15406H4633k1051M2331L0466J9406n498r422K4905R993J5540j5292p143K5834
15394A94702L965l5039J144L022l6981J9769N2486L0306J2230m206n0905j1210
15382A79283K0295l622M5072J6165k4331j6664l6693n3714j1259L5885k8067R828
15370A32178K0535r542k4641q351n0302j4471K3822J4118L2551L0379l848j5635
15358A26793L446j0621m070O4214R915q2318k6270K8718P3853l1911j9098J601
$$ y = [94526, 98347, 125420, 98784, 89818, 106637, 128107, 90436, 31659, 13552, 19497, 39702, 75100, 92712, 105753, 100531, 77589, 115899, 106507, 103955, 120097, 160650, 154595, 83568, 93400, 154393, 118009, 70323, 74099, 95656, 108997, 117923, 138048, 131374, 119368, 100074, 54519, 84633, 63582, 105913, 136379, 155785, 150287, 140865, 165770, 175763, 191303, 176011, 168868, 194702, 198667, 163628, 164772, 167794, 130813, 150582, 203068, 233374, 245604, 241398, 190493, 179283, 199578, 195956, 241028, 257193, 232862, 216198, 179505, 125791, 114532, 150417, 122350, 132178, 152713, 143171, 118530, 110179, 59877, 45406, 69228, 83346, 115897, 146276, 142428, 126793, 130239, 119618, 115548, 179762, 189677, 107359, 81089, 109807, 183660, 151749, 132651, 134252]
15346A34252K1192O3275K7174O729j5325k2260K4075O6830J540J0508K733M3781
15334C64504J4196O7029O1332L9450P6366J46549J83348K45391J84651J53631
15324A536447K13306K61058J84297R0156J0906p6833j46376j62843j28241k38952
15314A542925k48349k19679j45805r7411q9414j22648p7775o705n4578r374M5439
15303E16626N57j00663p0394q112N8139l1350l8252n1985o377K5877k5518l4143
15291B34405N8972M8291n4983l0226N5855k7069k7861J2739m666Q601P4561L3760
15279C82379r3953m0536K6892L9553k8784n9629K2275N4683k9421k2036J9296
15268B70719M9055J0416o5836O90l315o939K6584l0246K8749K2133M4026J0684
$$ y = [134252, 155444, 218719, 245893, 252622, 237297, 215037, 239112, 305942, 307482, 317990, 320723, 364504, 378700, 445729, 507061, 546511, 622877, 769426, 952774, 1198165, 1382816, 1536447, 1749753, 2010811, 2195108, 2285264, 2296170, 2219337, 2072961, 1910118, 1781877, 1542925, 1294576, 1074897, 929092, 831681, 742267, 619619, 541844, 535139, 480561, 471187, 516626, 517183, 416520, 346126, 338014, 396153, 364803, 326551, 274566, 268189, 294066, 268548, 234405, 293377, 341668, 286685, 256459, 312314, 285245, 257384, 270123, 265457, 274058, 348619, 382379, 288426, 247890, 274782, 314335, 285551, 225922, 248197, 302880, 273459, 251423, 270719, 319774, 330190, 264354, 265044, 261729, 254790, 281374, 251128, 279877, 302010, 346036, 356720]
15256C56720o5257n713K6996k777l2466k2820J171N6829J9786p8319l8249L9072
15244B54973J597J3530m4963K1117J3287k0941M582M482p224J3818K9232M5547
15232C29037k3766M1867K9376p562l2823k6070N9030J6396K3893L9756J2315k9770
15220D31679k3906j1613m063N6255J1817J9285n528K8841K7705P9720K2159L0130
15208F62481L6716M8660N9366J69697K05644J71405J08894R7114Q3781M3376R500
15197A696634K1984l4942o9758j41336j02803r7619j42840j54117j32027q8994
15187G54182p5750q3128j2873j315j0739o304m2008m7911m1127L435J4397n9097
15175C91762k5910M3467M4591K1421P13j7648l0457j6971Q085l354k9625J7340
$$ y = [356720, 291463, 285750, 312746, 309969, 277503, 254683, 255854, 312683, 332469, 254150, 215901, 254973, 256570, 270100, 225137, 246254, 259541, 238600, 243182, 247664, 240440, 254258, 283490, 329037, 305271, 347138, 376514, 368952, 336129, 310059, 369089, 385485, 409378, 449134, 461449, 431679, 407773, 396160, 392097, 448352, 460169, 479454, 473926, 502767, 530472, 610192, 632351, 662481, 699197, 747857, 807223, 976920, 1182564, 1353969, 1462863, 1559977, 1643758, 1687134, 1696634, 1718618, 1683676, 1613918, 1472582, 1369779, 1272160, 1129320, 975203, 843176, 754182, 678432, 595304, 582431, 581116, 570377, 564073, 522065, 474154, 433027, 436462, 450859, 391762, 365852, 409319, 453910, 475331, 476044, 458396, 427939, 410968, 419053, 415699, 386074, 403414]
15163D03414M0973K3836J5398J523l0225m2264O2556P0491L6902J220J9705q589
15151E94940O513P8080K1397k0723K110j4064N1604J0804R684k6211j0787J8202
15139G21549j2018L197n2829M8745J7489m7889M607K6388k3012m644k8818k9986
15127F22779j6162o3595k5368K8997M0165L3191l1341k9535k3066r110l7717j1891
15115D77347j4099K9356m203l2423N6081J3215k3395n395J0540J2556j1845J8865
15103E26600P399k4602J904L3166j1903J7808L5797Q8903J8185K3118O4505Q4942
15091H65822O3597l0020J3344L2042k457m1483q7304n7933k4642m9565l2057o205
15079F43139J4428j4213l3717J0418J7654j6442J2758J620j3010J0565N5969l7733
$$ y = [403414, 444387, 468223, 483621, 485144, 454919, 412655, 475211, 545702, 582604, 583824, 603529, 594940, 601453, 679533, 700930, 680207, 682317, 668253, 719857, 730661, 740345, 714134, 703347, 721549, 709531, 712728, 659899, 708644, 726133, 678244, 682851, 709239, 686227, 681583, 652765, 622779, 606617, 543022, 517654, 546651, 586816, 620007, 588666, 559131, 536065, 526955, 489238, 477347, 463248, 492604, 488401, 455978, 512059, 525274, 501879, 496484, 507024, 519580, 507735, 526600, 533999, 509397, 511301, 544467, 532564, 550372, 586169, 675072, 693257, 716375, 780880, 865822, 929419, 899399, 912743, 944785, 942328, 900845, 813541, 755608, 730966, 681401, 649344, 643139, 657567, 643354, 609637, 620055, 637709, 621267, 634025, 635645, 622635, 633200, 689169, 651436]
15067F51436L1813K1907K2047P294Q774k35N6684K5919j9527k371l4040Q826l5409
15054G43118l3857M4066N580K2532O6988K8346L5223N449L4124p6037m7017nL1242
15041H59752j3913K6025O1419j5946J016J9772J1334M4906J2354p503n801J2944
15029A006359K2072M015k8106j2575L1977J8506K9293L0940R7583M2846M6652
15018A289562M1171L5773L6055P9911J01410O1103P4452k1310j3927j3586L9335
15007A709949N1718M925j3009J4340m1479m8411n1071j8499J03116R7481M8381
14996A857441j4698K3513N9209N7691L4191l727m0703K850P4362M4300J7946O0816
14984B173191K0931k4931Q81M3610L614j0275N7167L2609L9885L5467J3972k4099
$$ y = [651436, 683249, 705156, 727203, 734497, 743271, 743036, 799720, 825639, 806112, 803741, 769701, 778527, 743118, 709261, 753327, 758907, 781439, 848427, 876773, 911996, 917445, 951569, 875532, 828515, 828510, 859752, 845839, 871864, 933283, 917337, 918353, 938125, 949459, 994365, 1006719, 999216, 993415, 1006359, 1028431, 1032446, 1004340, 991765, 1023742, 1042248, 1071541, 1102481, 1200064, 1242910, 1289562, 1330733, 1366506, 1402561, 1482472, 1583882, 1644985, 1719437, 1698127, 1684200, 1670614, 1709949, 1761667, 1766592, 1753583, 1767923, 1726444, 1678033, 1626962, 1608463, 1711579, 1809060, 1857441, 1842743, 1866256, 1925465, 1983156, 2017347, 2013620, 1972917, 1975767, 2050129, 2094429, 2112375, 2173191, 2194122, 2169191, 2170072, 2213682, 2217296, 2207021, 2264188, 2296797, 2336682, 2372149, 2386121, 2362022]
14972B362022J0176K4083j4319l1983n9587k5083p45l3160K5382l7045j9993M6448
14960B246196J0032L7576Q4520P7747P7927L4748N0561K234L1321N7958K5128
14949B735948L4840L0548J3173J8580k0367o876N0653R5915O7966Q9681M0693
14938C150754P8637Q8381M0861R1652J10802P8177J04267J76904J56001J64917
14928D241353J45785O7190J82097K05468J15388J23061R8837R1342J51160J61130
14918E582811J23816J31043J51608K42836J88636K31641K71773L84431N13554
14909G822149N16285O58455P72484J003588J266716J504486J711100J993863K306810
14900A9555936K598485K963364L362099L973032M818188O212759Q505930J2200452
$$ y = [2362022, 2372198, 2396281, 2381962, 2349979, 2290392, 2265309, 2264564, 2231404, 2256786, 2219741, 2199748, 2246196, 2256228, 2293804, 2378324, 2456071, 2533998, 2568746, 2619307, 2621541, 2652862, 2710820, 2735948, 2770788, 2801336, 2814509, 2833089, 2812722, 2805846, 2856499, 2952414, 3020380, 3110061, 3150754, 3229391, 3317772, 3358633, 3450285, 3561087, 3639264, 3743531, 3920435, 4076436, 4241353, 4387138, 4454328, 4636425, 4841893, 4957281, 5080342, 5179179, 5270521, 5421681, 5582811, 5706627, 5837670, 5989278, 6232114, 6420750, 6652391, 6924164, 7308595, 7822149, 8338434, 8996889, 9769373, 10772961, 12039677, 13544163, 15255263, 17249126, 19555936, 22154421, 25117785, 28479884, 32452916, 37271104, 43483863, 51989793, 64190245]
14892F4190245J7020505K2730264K9249150L5988185M1863258M4823985M3995040
14885B99860632L9482767L1772848K0028974N306672r628327k2571567l2875593
14878C31376406m0455447m3828992m2351937l7285015l1339446k5115867j9035247
14871I1964455j3439406r138524o602647n222228m340885l745283l349869k952899
14863D3172714k764276k482680k238881k010833j854632j655244j429773j326132
14855B7410263j200734j144102j043589j012712r20782p93564q26478r00894q07141
14846A8760267p71383p95861p44161o78227o97517o27118o34188n71874m37093
14837A2802845m49417m80467m26371l66879k63440k69246k46868k43055k78980
$$ y = [64190245, 81210750, 103941014, 133190164, 169178349, 211041607, 255865592, 299860632, 339343399, 371116247, 391145221, 396451893, 386823566, 364251999, 331376406, 290920959, 247091967, 204740030, 167455015, 136115569, 110999702, 91964455, 78525049, 69386525, 62783878, 57561650, 53220765, 49475482, 46125613, 43172714, 40408438, 37925758, 35686877, 33676044, 31821412, 30166168, 28736395, 27410263, 26209529, 25065427, 24021838, 23009126, 22088344, 21294780, 20468302, 19567408, 18760267, 17988884, 17193023, 16448862, 15770635, 15073118, 14446000, 13811812, 13239938, 12802845, 12353428, 11872961, 11446590, 11079711, 10816271, 10547025, 10300157, 10057102, 9778122]
14828I778122k37511k55526l18797l33125l11853l16756l49010l28294l12560
14819G014690k63753k22086k29605k40709j81388k13714k23663j90959j77789
14810E071024j66127j78040j78837j11106j21899j38940j35833j00675j19840
14801C819727j76285r7795q5939j19491r5578j42709r9552j46715j08654q5356
14791B661653j62241j17570l2550m7383p1111n8956o9440j26761j50694m1466
14781A783481l3320k6459l5128J9183r6344q6218n1268l8510o8664k8068k8161
14770A310524m304L1678O7944J4332L0374p760l0567j0062j5513m7087J928n5789
14758A285698p2539o8301m6172j4806q1518j14897j33053l3869r895o5328q9777
$$ y = [9778122, 9540611, 9285085, 8966288, 8633163, 8321310, 8004554, 7655544, 7327250, 7014690, 6750937, 6528851, 6299246, 6058537, 5877149, 5663435, 5439772, 5248813, 5071024, 4904897, 4726857, 4548020, 4436914, 4315015, 4176075, 4040242, 3939567, 3819727, 3643442, 3545647, 3459708, 3340217, 3244639, 3101930, 3002378, 2855663, 2747009, 2661653, 2499412, 2381842, 2349292, 2301909, 2230798, 2171842, 2102402, 1975641, 1824947, 1783481, 1750161, 1723702, 1688574, 1707757, 1611413, 1525195, 1473927, 1435417, 1366753, 1338685, 1310524, 1306220, 1337898, 1405842, 1420174, 1450548, 1442788, 1412221, 1402159, 1386646, 1339559, 1341487, 1285698, 1213159, 1144858, 1098686, 1083880, 1002362, 887465, 754412, 720543, 710648, 645320, 555543]
14747E55543m5704p8674o3305p7003r831l5568n6374p5099m3395j1486q110k8732
14735B2262j9272L1897K1941j5214o3490N125R4424J8610k880m1148m7716L9834
14723D4373M8557K7648J2917l6014J0709l4810o7263J7286M1508k3529n8191l0028
14711d6837k9590L442J7176O3414L2880L8798L016n0946m0022J6418j5977n8951
14699f7179q049j866l7304J244L6635j8917r829K1388K3399M6266L5314k5812
14687d710N880j3718l6738j598k3337q462j962k907j6880k834o581J6423K4930
14674g2494L2319j0520l1634P019l3865K4084N3401L8974l4593n6502n7458J4228
14662a27041L9630o015o7819O3561k6803o014q431O0926M4932J3253K1395o5453
$$ y = [555543, 509839, 431165, 367860, 290857, 281026, 245458, 189084, 113985, 70590, 59104, 50994, 22262, 2990, 34887, 56828, 41614, -21876, -16751, 77673, 96283, 93403, 52255, 4539, 44373, 92930, 120578, 133495, 97481, 108190, 73380, 6117, 23403, 64911, 41382, -16809, -46837, -76427, -72985, -55809, 7605, 40485, 79283, 82299, 31353, -8669, 7749, -8228, -67179, -75228, -77094, -114398, -113154, -76519, -95436, -105265, -83877, -60478, -14212, 21102, -4710, 1170, -12548, -49286, -50884, -74221, -82683, -84645, -87552, -104432, -107266, -113847, -97424, -72494, -40175, -50695, -82329, -75310, -109175, -85091, -31690, 7284, -27309, -83811, -141269, -127041, -87411, -93426, -161245, -97684, -124487, -130501, -138932, -78006, -33074, -19821, 1574, -63879]
14650f3879j8192k330M3407l3436o4936Q743j8593K3329k3494n6453o1059L6036
14638b30857O5576J2702n421M6113L8917K6269M694m745l8127j5487k3727N5294
14626f8799l0368K9629q72o3789K2822j7039M3471L5386K0937j7481k8961k3438
14614i8502j9265p8975j5364j2352K6585O5372n5594n7290K5765P397J8299J7180
14602a76744n824m4397k8096M0157K9055m1355n1856L0715j5973j3169k7693Q297
14590b96883P373K3029M1243K9770k5198l4433j886J458j9577J8688P126K850
14578b46440n4921L0113N6856O4794J2932j4956J902m0547n1867o13j3934J21892
14566a34789M4066k7563m4586j5628M654m1764j5641J3591K6036J1318m0064l9729
$$ y = [-63879, -82071, -84401, -40994, -74430, -139366, -130623, -149216, -125887, -149381, -205834, -266893, -230857, -165281, -152579, -158000, -111887, -72970, -46701, -42007, -46752, -84879, -100366, -124093, -68799, -99167, -69538, -70410, -134199, -111377, -128416, -84945, -49559, -28622, -46103, -75064, -98502, -117767, -196742, -212106, -224458, -197873, -132501, -188095, -245385, -219620, -212223, -193924, -176744, -182568, -226965, -255061, -214904, -185849, -227204, -279060, -248345, -264318, -277487, -305180, -296883, -289510, -266481, -225238, -195468, -220666, -255099, -256985, -255527, -275104, -256416, -249290, -246440, -301361, -271248, -214392, -149598, -136666, -151622, -149720, -190267, -242134, -242747, -256681, -134789, -90723, -118286, -162872, -178500, -173846, -215610, -231251, -217660, -191624, -180306, -220370, -260099]
14554b60099j8233N55L6174L593n5702j9518p78L6535M3638J8386k8805m5221
14542b89475J1612q294N567J7025m738K4926j408P851M2962J9072K2890J4507
14530a37503J5664q766n5819Q055l6756j7723N8199K6702o5482n4126J3517L712
14518b50326J60K3668R581J2194M3506L9309L1652m6493m1218m41K4556o653J952
14505a58553K797l5047R374l9985j7313P37K7632P422j6339K4564k258N575j2701
14492b04095M4323n7265m4339m3308K1574N0192J5182j6974L4397K3837J5302
14481a61174K0683p0613o2567L5804K4531j9072m467M4973K7675L506M4060k2272
14469a38933l695N0990M457m8239k253K5788J0675k9295J7750L5023L6282m0441
$$ y = [-260099, -278332, -277777, -241603, -238010, -293712, -313230, -314008, -277473, -233835, -215449, -244254, -289475, -277863, -286157, -280590, -263565, -268303, -243377, -244785, -236934, -193972, -174900, -152010, -137503, -121839, -130605, -186424, -178369, -215125, -232848, -174649, -147947, -213429, -267555, -254038, -250326, -250166, -226498, -216917, -204723, -161217, -121908, -90256, -136749, -177967, -178408, -153852, -160505, -158553, -155756, -190803, -181429, -221414, -238727, -237990, -210358, -202936, -219275, -194711, -196969, -191394, -204095, -159772, -217037, -261376, -304684, -283110, -232918, -217736, -234710, -200313, -176476, -161174, -140491, -211104, -273671, -237867, -213336, -232408, -236875, -191902, -164227, -160721, -116661, -138933, -142628, -91638, -87181, -135420, -137673, -111885, -101210, -130505, -112755, -77732, -41450, -81891]
14457h1891n6120q302r849M0043N3601R0702N2929J2789k3765N5462J06388J91486
14445D23473K03926J71553J96446K30600J54975K46032K40021P3909o8086j10925
14435A761924k17271j72301k00651k84543k13406j64041q1139r9318n9634k9782
14425B39838m6814L182J3962m2627l2301O2294n858l7807j8138q845n1149q9622
14413a3885j4922l0544m576l223L4936O6842j0098j9162p154j5855j784l17m4027
14400f3769o3226K7008K3335n735L0619k1380J8700l3133j2350J7416R059J3957
14388e9499j1789n0365l1259J9711J4858k1276j9060P5342J14573j1289n8145
14377c8198k6990O65j9929k297K3602n459m3495k4289K7616j4333j5271k7502
$$ y = [-81891, -138011, -146313, -156162, -116119, -62518, 28184, 81113, 93902, 70137, 125599, 231987, 423473, 627399, 798952, 995398, 1225998, 1380973, 1627005, 1867026, 1940935, 1872849, 1761924, 1544653, 1372352, 1171701, 887158, 673752, 509711, 428572, 329254, 269620, 239838, 193024, 196206, 210168, 167541, 135240, 197534, 191676, 153869, 135731, 126886, 75737, -13885, -28807, -59351, -63927, -67150, -32214, 34628, 24530, 5368, -1786, -17641, -19425, -19742, -63769, -126995, -99987, -76652, -82387, -51768, -73148, -54448, -87581, -99931, -82515, -73456, -59499, -71288, -121653, -152912, -133201, -118343, -139619, -158679, -83337, 31236, 19947, -38198, -65188, -64523, -84452, -86749, -63147, -68606, -112101, -136390, -108774, -123107, -138378, -165880]
14365a65880M1497n6815K6008N9235J5605j7620j8728J583n2522m2436J9332M4702
14353a46039J3261p683J601M9332O4639Q239n7198k035j8820n1483L9888m637
14341a10935L1740m2335n6014K0335M0360J9837N234M7914P411M894o360o821
14329d4740K7225p434k4342l3760J8587K1390p434k2660k3525l0289M966J6573
14317a05443J392m8185K0232J3384K8608l6691j9394j2541m051J2909m2089J2151
14305a79718L0249o270R478o526J7903l321l715j38L2752j8215P434N3087j3486
14292h0486l9285k479J0600M0239k4720M817j679m3790l9149n024M8406k7479
14280a60029J5845O6967N4280l0326k9122K3628R351m1763k3455n5914k0936j1610
$$ y = [-165880, -124383, -181198, -155190, -95955, -80350, -97970, -116698, -115115, -167637, -210073, -190741, -146039, -132778, -140461, -138860, -89528, -24889, -16650, -73848, -75883, -94703, -146186, -106298, -110935, -79195, -121530, -177544, -157209, -116849, -97012, -91778, -43864, -36453, -31559, -37919, -44740, -17515, -24949, -49291, -83051, -64464, -43074, -50508, -73168, -96693, -126982, -122016, -105443, -104051, -152236, -132004, -118620, -90012, -126703, -146097, -158638, -162689, -149780, -191869, -179718, -149469, -155739, -146261, -152787, -134884, -138205, -141920, -142058, -109306, -127521, -120087, -67000, -80486, -119771, -122250, -111650, -71411, -96131, -91314, -92993, -136783, -175932, -180956, -132550, -160029, -144184, -77217, -22937, -53263, -82385, -58757, -49406, -91169, -114624, -170538, -191474, -203084]
14268b03084k8790J4406N3525L1036j3233k6254N6168M186L1777K0183K1680K4810
14256a3590l5730o6000P066N0565l4434q336M531L4745L5270k1979M0406q9204
14244i6690o7315L3570N2600J2044j8637l3865r105l960j4980M1383L826O940
14232i4189k1948q8250o32P2982k7660o28K672j3249N6774M5618j6457L799L8514
14219d2654q078r576J11158L668l3346K403J8359k0779m9868j0886r144J3260
14207c5483r324k1748l2410j3598J5383n6305o0146P685K4957L9590r042J9214
14195a31227J2748j7189j1054q412jj1589p32O5450N9925l165K6459j1131n6769
14182h6687J5510K6603r53J0339O224j5787n3027K8056K4945K433o4710l1294
$$ y = [-203084, -231874, -217468, -163943, -132907, -146140, -172394, -116226, -112040, -80263, -60080, -38400, -13590, -49320, -115320, -108254, -57689, -92123, -100459, -95928, -61183, -25913, -47892, -7486, -96690, -164005, -130435, -77835, -65791, -84428, -118293, -127398, -131358, -146338, -104955, -101129, -94189, -116137, -204387, -205019, -132037, -159697, -160325, -157653, -170902, -114128, -68510, -84967, -81168, -42654, -50732, -60308, 50850, 54518, 21172, 23575, 41934, 21155, -28713, -39599, -48743, -35483, -44807, -66555, -98965, -112563, -97180, -153485, -213631, -205946, -180989, -141399, -150441, -131227, -118479, -135668, -146722, -155134, -155135, -166724, -167456, -102006, -42081, -45246, -18787, -29918, -86687, -71177, -44574, -45527, -35188, -28964, -44751, -97778, -69722, -44777, -42344, -107054, -138348]
14170a38348L5924L7361L009n1686k9404L498j2797J2652L7432K6477K1878l446
14158e7450q269n0987K3829K075M7826j6793K4495K0583j4765l9870m3972N2273
14146f1025M4546K5056M0819l8204j3390J9899n0948m3525m172Q724k2543l3732
14134a28495M604j0350M176R935L2518P964O826N2994J0522m5590o073j3527j5761
14121i0257K5215R742J9646l1859l0298K409J2442M8626K8192L5584M3641L2990
14109A06073m4429j38964l3257M5099P878l4646O2165r339P58N896j3256k1112
14097f7134k9715K0077K9689k1398J6224o335K5089J4207q14m6465K1165K506
14085d2904n7560j4683N0823k3189L1181O2512m9564L651J1884O345O299l5778
$$ y = [-138348, -102424, -65063, -62054, -113740, -143144, -139646, -152443, -139791, -102359, -75882, -54004, -57450, -65719, -116706, -92877, -90802, -42976, -59769, -35274, -14691, -29456, -69326, -113298, -61025, -16479, 8577, 49396, 11192, -2198, 17701, -33247, -76772, -80944, -72220, -94763, -128495, -123891, -134241, -130065, -120130, -87612, -79648, -72822, -19828, -9306, -54896, -60969, -74496, -90257, -65042, -55300, -35654, -67513, -97811, -95402, -82960, -34334, -6142, 29442, 73083, 106073, 61644, -77320, -110577, -65478, -57600, -92246, -30081, -39420, -38662, -32766, -46022, -67134, -96849, -76772, -47083, -68481, -52257, -58592, -33503, -19296, -20110, -66575, -45410, -42904, -100464, -115147, -64324, -87513, -56332, 6180, -43384, -39733, -27849, -21504, -15205, -50983]
14073e0983R2482J1470m90J27J7107R755l0195j2294L775J2509r1606l6897R435
14060f5805k5224J7269j528j168k2483K4990M9885K458q58N0505K313j0633m0623
14047b0902N885p941O8427k1696j0731J6485l0611JK4088M781k1312j3103K4907
14034A8278N278k7784n8460L2945P2542K6192m040k2345k1125m1349k445m8482
14022g0795O7282k799n1409j0599N3191k0471o1411L4860J07397K0828j7462p2227
14010b3615J6442N1781J1570j4989p6624k549K071r165k1486K7880k610K7723
13998a3571J9415k7552J1137O516N0704K9750j4839K5810l1995o2044j3229j6744
13986c6642J7695k551J3615J2651M50q9291k7273m265m593O3593N0963O6727M6883
$$ y = [-50983, 41499, 52969, 52479, 52606, 69713, 79468, 49273, 36979, 40754, 53263, -38343, -75240, -65805, -91029, -73760, -75288, -76456, -98939, -73949, -24064, -21606, -22464, 28041, 30354, 19721, -20902, -15017, -22958, 45469, 23773, 13042, 29527, -1084, -1083, 23005, 27786, 6474, -6629, 18278, 23556, -4228, -62688, -29743, 42799, 68991, 64951, 42606, 21481, -19868, -22313, -70795, -3513, -6312, -57721, -68320, -15129, -35600, -97011, -62151, 45246, 66074, 48612, -23615, -7173, 44608, 56178, 41189, -35435, -37984, -35913, -45078, -66564, -38684, -41294, -13571, 5844, -21708, -10571, -4055, 46649, 76399, 61560, 87370, 55375, -6669, -19898, -36642, -18947, -21498, -7883, 4768, 5218, -84073, -111346, -115611, -120204, -56611, -5648, 61079, 107962]
13973A07962J5701l9581l6398k2004m3867j3682M9792k2888l9307K7949K7301
13962A0978K8988n6246q227l2629k4438L7358M180M618L8244r5l1095M678l2043
13949e5729J1934J3580L7307J0897K4485R0013K5283k5659J5104o031J2742o5939
13937H7987j4431k4507M831J4904K3731j9636j0629l3043j5719j2777J6124J1558
13925B8393k933K1790L288M9474Q4685k0661p7165k0970N5607n3792l2596K7249
13913F2369M2963J7509L096M2480J02493N4184Q1509j0608N3600Q6230O0600J01685
13901F98110J77667K48800K93194M10896L75274L10470K28658K20040J10265R6
13891C073470j24205k56483l15411k89824l47558l11279k37891j93162j86989
$$ y = [107962, 123663, 84082, 47684, 25680, -18187, -31869, 17923, -4965, -44272, -16323, 10978, 39966, -16280, -24507, -57136, -81574, -44216, -40036, -35418, 2826, 2731, -28364, -23686, -55729, -43795, -30215, 7092, 17989, 42474, 132487, 157770, 132111, 147215, 141184, 153926, 87987, 73556, 49049, 53880, 68784, 92515, 72879, 62250, 29207, 13488, 711, 16835, 28393, 25460, 47250, 50538, 100012, 184697, 164036, 86871, 65901, 121508, 67716, 35120, 62369, 105332, 122841, 125937, 168417, 270910, 325094, 406603, 395995, 449595, 535825, 596425, 698110, 875777, 1124577, 1417771, 1828667, 2203941, 2514411, 2743069, 2963109, 3073374, 3073470, 2949265, 2692782, 2377371, 2087547, 1739989, 1428710, 1190819, 997657, 810668]
13882H10668j46144r3039j02847j19806r3516j8675q500m120k374J2570j4751
13871B19466o441j798j2225l2570L9296M5290k2928n9306L1278M6189o5587m0744
13859A39920K5474M3590N401P604j0334J528Q180n8429j2751k174J3915K0988
13847A82912L1729J8323j220q1096n9701J5770N3895M420q274O359k1038n9809
13835H2270L5260P2206n8077l5815L1317k0498k3657l4950J0792k1153M3632K9718
13823A11045L1514J1284J1680K4864j7653m3311o3749l1559n7216o898P086J04548
13811H1635O4152p1636o8196K0361K6786N321j8235m9005q886M8018O8469q704
13799I0080j2786j3293K9219J0596m819L120j893N168k6948j246m029k7442k0632
$$ y = [810668, 664524, 571485, 468638, 348832, 255316, 236641, 228141, 224021, 221647, 234217, 219466, 213025, 211227, 199002, 166432, 205728, 251018, 228090, 168784, 200062, 246251, 180664, 139920, 165394, 208984, 214385, 221989, 211655, 213183, 221363, 162934, 150183, 148009, 161924, 182912, 214641, 232964, 231744, 150648, 90947, 106717, 160612, 165032, 156758, 163117, 142079, 82270, 117530, 189736, 131659, 95844, 127161, 106663, 83006, 48056, 58848, 37695, 81327, 111045, 142559, 153843, 165523, 190387, 172734, 129423, 65674, 34115, -23101, -29999, -22913, 81635, 145787, 74151, 5955, 26316, 53102, 58423, 40188, -8817, -17703, 30315, 98784, 90080, 77294, 64001, 93220, 103816, 98997, 102117, 100224, 105392, 78444, 77198, 73169, 45727, 25095]
13786B5095j8008l031P0964J596m4708o6804J9050J2443n022K9534K5438l13J7563
13773F3797p660P40L4839n1601o1434N9195L5116j1752k1388k4673j5884k2408
13761b3113K1410k879K8642P3242L267j3021j9717J7454K4538M177K460r895J1738
13748A18303j7034k4981j9111k7591r670N1318L985j0773J1796k9962K243M5900
13736I4423j027k7889r5492J8976P7900L989J4707L7972K6753P490q2572J281
13724G6511L7756N623j2964r158j3823j9252Q761J04866N6757j0521n0217m2857
13712A31482q03M0015J2305L2510L1828J2784K3846l8965j6793P077j1324k6152
13700A97810j6261L000K7938K6687M5391K5898K1420J6343L3136m8380M808J5329
$$ y = [25095, 7087, 4056, 75020, 76616, 31908, -34896, -15846, -3403, -8425, 21109, 46547, 46234, 63797, 56137, 56877, 91716, 40115, -21319, 37876, 72992, 61240, 39852, 15179, -705, -23113, -1703, -4582, 24060, 97302, 100569, 87548, 67831, 85285, 109823, 114000, 116460, 106565, 118303, 101269, 76288, 57177, 29586, 19916, 71234, 75219, 64446, 76242, 46280, 48523, 94423, 93396, 65507, -29985, -11009, 66891, 70880, 85587, 123559, 150312, 157802, 75230, 76511, 114267, 119890, 106926, 97768, 83945, 64693, 73454, 178320, 235077, 224556, 174339, 131482, 130679, 170694, 182999, 215509, 247337, 260121, 283967, 245002, 228209, 235286, 223962, 197810, 181549, 184549, 212487, 239174, 284565, 310463, 331883, 348226, 381362, 332982, 337790, 353119]
13688C53119r937O468q392j8903l8494J75K1443l6794J7116l0155j8792l4601
13676B02253M329j9753m567L7274K8324J3481L4423n666k8193l6855j4938j7623
13664A92489R075k6694k5750Q706J5235N0744L1646R542r900n8180J9799p454
13652B09258l2485K3161j6584J3929J9641k5585K1211N6692L1264n0420l8823
13641B11259l7581l1727P5094n306o8632J4794J1601j9381J0838J6213J6416J3349
13629B06937j0771l4553r1677m1441L8982N1503N8780K666l2915M872j7194k1973
13617A13216j9832K0049l3360L5179O7230L5142l9429m2459M0573M188J0480j1999
13605A78978n4266j1177q367K3692L7199j6193P3938k895n3200m9116m6406l6905
$$ y = [353119, 343182, 349650, 341258, 322355, 283861, 284036, 305479, 268685, 285801, 255646, 236854, 202253, 206582, 186829, 182262, 219536, 247860, 261341, 295764, 290098, 261905, 225050, 210112, 192489, 201564, 174870, 149120, 157826, 173061, 223805, 255451, 264993, 255093, 196913, 216712, 209258, 176773, 199934, 183350, 197279, 216920, 191335, 212546, 269238, 300502, 250082, 211259, 173678, 141951, 217045, 211739, 143107, 157901, 169502, 150121, 160959, 177172, 193588, 206937, 196166, 161613, 69936, 28495, 67477, 118980, 177760, 180426, 147511, 152383, 135189, 113216, 93384, 113433, 80073, 115252, 182482, 217624, 178195, 135736, 176309, 180497, 190977, 178978, 124712, 113535, 105168, 128860, 166059, 149866, 223804, 220909, 167709, 118593, 72187, 35282]
13593C5282J3570L5839M0361m0367j0765N3088M4425n0374K2147L7433K9329J7899
13581B27867n9641J4895L6633J2713r508K302m4590l6856L3094k4992j5259L3870
13569A70528J6635l9674R352K3356k2000j6998j3184Q943q721q289K4328q045
13557A36231J961R879L0647n477q537M2877p794l9666K7433K3226k9242L5405
13545B16943j8714m1607M125l0953M6965P5987m0372j2005m4270q493l0956K9365
13533A46015m6285N751L7962J020J9287M4373J1859n4118J3838K1767J0586m6076
13521A65979L8688k8649l8371P0549L5405n1357k2626J4391J0698j0197q0313
13510A04197L070L6823K1878n379N0070O2279k3097k9287o914K1043L4397P217
$$ y = [35282, 48852, 84691, 125052, 84685, 73920, 127008, 171433, 121059, 143206, 180639, 209968, 227867, 168226, 183121, 219754, 232467, 222959, 225261, 180671, 143815, 176909, 151917, 136658, 170528, 187163, 147489, 156841, 180197, 158197, 141199, 128015, 136958, 128237, 119948, 144276, 136231, 138192, 148071, 178718, 173241, 164704, 207581, 199787, 160121, 187554, 210780, 181538, 216943, 198229, 156622, 160747, 129794, 176759, 252746, 212374, 200369, 156099, 147606, 116650, 146015, 99730, 105481, 143443, 144463, 163750, 208123, 219982, 165864, 179702, 201469, 212055, 165979, 204667, 176018, 137647, 208196, 243601, 192244, 169618, 184009, 194707, 184510, 104197, 107267, 144090, 165968, 160589, 210659, 272938, 249841, 220554, 213640, 234683, 269080, 276297]
13498B76297M031l0245n2063l7856N3572J5440M751n198L0292l3155r756J3088
13486B29198k5944K3869J3252k0070p542J8695l484M1209P82k2149L6039p159
13474B76696k9440j6094L6536m1128L1797R1124k2272l3913L3918p7274l3301
13463B16649j2682K5563R125J3660K0307N049k3257m1113O30L8265J9367J800
13451B73363K7943Q698l2802k2167J6358K785p534j4405q760m1699l865L5760
13439B33675K5932j5155j7604j7459K8666O6896M8477n967p8429K5010P848K1845
13427C23735m0388l676L2562N539m3656J9129j8906K6770n1989j6768K4238J4528
13415B71118l546L3599K5972Q929J5514q595J3965L9517j8997N90k2949r897K0867
$$ y = [276297, 280328, 250083, 198020, 160164, 213736, 229176, 233927, 228729, 259021, 225866, 216110, 229198, 203254, 227123, 240375, 220305, 212763, 231458, 227974, 269183, 269965, 247816, 283855, 276696, 247256, 231162, 267698, 226570, 258367, 349491, 327219, 293306, 327224, 249950, 216649, 203967, 229530, 238655, 252315, 272622, 277671, 254414, 213301, 213931, 252196, 271563, 273363, 301306, 310004, 277202, 255035, 271393, 274178, 266644, 252239, 243479, 201780, 197915, 233675, 259607, 244452, 226848, 209389, 238055, 304951, 353428, 347461, 269032, 294042, 301890, 323735, 283347, 279671, 312233, 317772, 274116, 293245, 274339, 301109, 249120, 232352, 256590, 271118, 267572, 301171, 327143, 336072, 351586, 342991, 356956, 396473, 377476, 378066, 355117, 345220, 366087]
13402C66087M6409l2738o5131N0666K8873N6835q41j9882k4699J055m4598n8507
13390C03529R267L9192k2961M6J8283n980K2490M3836K9793o2617m2836K1696
13378C53738N6674Q080m5575j548J1892o5083j1857J9635j0663N8574N1257l1951
13366C93173k0967R238j0404k6794k1377m9197J5702k2546J1446K2388k3302K5972
13354C03332j2410J7453J9452P086j8744K25K8130q259N1624O1413q732P531o6575
13341C81526n0799n8238K718N1199N3116L7865L309o6177o4306K081j7445L4197
13329C09046O2065K1524J9201K8102l8351j7611N4139O8191O8553j9144n0181
13318E05534n4703N454o138l6053j4350l0940l1696Q3735n8697k5274O9644J3774
$$ y = [366087, 412496, 379758, 314627, 365293, 394166, 451001, 450160, 430278, 405579, 406634, 362036, 303529, 312796, 351988, 329027, 329073, 347356, 341376, 363866, 407702, 437495, 374878, 332042, 353738, 410412, 418492, 372917, 371369, 383261, 318178, 306321, 325956, 315293, 373867, 425124, 393173, 372206, 381444, 371040, 344246, 322869, 273672, 289374, 266828, 278274, 300662, 277360, 303332, 290922, 308375, 327827, 334913, 316169, 316394, 344524, 336265, 387889, 449302, 440570, 448101, 381526, 330727, 272489, 275207, 326406, 379522, 417387, 420696, 354519, 290213, 292294, 274849, 309046, 371111, 392635, 411836, 439938, 401587, 383976, 438115, 506306, 574859, 555715, 505534, 450831, 456285, 450147, 414094, 399744, 368804, 337108, 420843, 362146, 336872, 406516, 420290]
13306D20290j2083M4921K248K5516m3653l0288p247j1604q031L9618k9164N9619
13294D50142r881k3727M1628l2159l1219K505M1708L0794J6934N61J1842J3919
13282E13047M494j9691m2987J6804L935K0254m3540K8361J1074M305m955m291
13270D86810m6397L7469Q8967j5122J2956N4329l8462M664K188J9335m6286k9082
13258E31369p4104l1314k2098n5180l6019K857O6528N7201K7812j6084J2476n729
13246D57715M9686K6187L7264L9818O095L136K6543n9076l4105L1266N1623P417
13234F43569J020O9373P3827l9102p9692L5475m496k3453l6450m5106J1650L3974
13222F40589N8474j8446n2966k9080o2630J847k8088R801L7249o4929k0093K1310
$$ y = [420290, 408207, 453128, 455376, 480892, 437239, 406951, 399704, 388100, 380069, 419687, 390523, 450142, 440261, 416534, 458162, 426003, 394784, 397289, 438997, 469791, 486725, 487286, 499128, 513047, 517541, 497850, 454863, 471667, 475602, 495856, 452316, 480677, 491751, 496056, 491101, 486810, 440413, 477882, 566849, 551727, 564683, 619012, 580550, 585214, 587402, 606737, 560451, 531369, 457265, 425951, 403853, 348673, 312654, 315511, 382039, 439240, 467052, 450968, 463444, 457715, 507401, 533588, 570852, 610670, 616765, 619901, 646444, 587368, 553263, 584529, 636152, 643569, 644589, 713962, 787789, 748687, 668995, 704470, 699974, 676521, 640071, 594965, 606615, 640589, 699063, 680617, 627651, 598571, 535941, 537788, 509700, 519501, 556750, 491821, 471728, 493038]
13210D93038O0058J0488L5558J1521n4837l6631j9036k1915J7447J4532l0270
13199D79953n962J4849J097N658J558N4985q90j34n0398l2281l0711Q524K3638
13186D69886M3248L364m0054j6216k6653L2896j1184J9143K7241K9701q927m31
13174E22014m226J1056P8386K7098l077n5998P264L9133l4218j4679J9252L8632
13162F30637K1622p621l017l9892J3774O5333L0770k596l0710o4160k2930L665
13150E94875K5423p0054m2145J4847L4083O4224Q8890K1036k4339m1646l5470
13139F29724J3711M9970j1962o493J4338k0519o94L9183J4372P303Q450l1764
13127G05619k2307m0708K9474M178J3586k0305Q329Q942L7223K3336k6877J524
$$ y = [493038, 553096, 563584, 599142, 610663, 555826, 519195, 500159, 478244, 495691, 510223, 479953, 473991, 488840, 489937, 495595, 497153, 552138, 551248, 551114, 500716, 468435, 437724, 446248, 469886, 513134, 516498, 476444, 460228, 433575, 466471, 455287, 474430, 501671, 531372, 522445, 522014, 517788, 528844, 607230, 634328, 631251, 575253, 582517, 621650, 587432, 572753, 592005, 630637, 652259, 644638, 641621, 601729, 615503, 680836, 711606, 709010, 678300, 614140, 591210, 594875, 620298, 550244, 508099, 522946, 557029, 621253, 710143, 731179, 706840, 665194, 629724, 643435, 693405, 681443, 674950, 689288, 668769, 668075, 707258, 721630, 728933, 737383, 705619, 683312, 642604, 672078, 676256, 689842, 669537, 677866, 686808, 724031, 747367, 720490, 722014]
13115G22014k1411J0696K6084k4254o1126j0287L3095N3217J7412r641M3006N6254
13103H35059k7244o4363p4321q1113k7984K839M9825O0045L8987R823l137l9802
13091F78614K101K4501j8801k940k5471j8140J9425j1046m8698K6426P571J9977
13079F53519J1013K4480j0939n2349k990P4300L9399J5194L4741J79j589L351
13067G88309M849M1367n4878o4681K2667L8834J0713j167K0214M238o3973j246
13055G45246K4132l090n0421j7172O5904R054k483J9745O236K6719o130k65L268
13042H20743K6387r503o9446k9189j3855L504Q5714M1429k956m9233n878O933
13030H04650k0947Q197k6007j1321K3395L5467J4596m3908j5273O6602L6949j652
$$ y = [722014, 700603, 711299, 737383, 713129, 652003, 641716, 674811, 728028, 745440, 735799, 778805, 835059, 807815, 743452, 669131, 588018, 560034, 562873, 612698, 672743, 711730, 721553, 718416, 678614, 680715, 705216, 686415, 683475, 658004, 639864, 659289, 648243, 599545, 625971, 633542, 653519, 664532, 689012, 678073, 625724, 622734, 697034, 736433, 751627, 786368, 786547, 784958, 788309, 793158, 834525, 779647, 714966, 737633, 776467, 787180, 786013, 806227, 810465, 746492, 745246, 769378, 766288, 715867, 698695, 764599, 773653, 771170, 790915, 797151, 823870, 817740, 817475, 820743, 847130, 837627, 768181, 738992, 725137, 728641, 814355, 855784, 852828, 803595, 797717, 804650, 783703, 791900, 765893, 754572, 777967, 813434, 828030, 784122, 768849, 835451, 872400, 870748]
13018H70748K0579j3909k3308J0411m3849k7474k1837L9612K3967N6887M2828
13007I34655o4216l8767p899o508K6783L9121J9871M3923K806K257k9593m636
12995I17797r8J8787j281n7223m6496K0406k7991o577l199n783O7167L8009L8160
12982I51678j8234j305J0162m712m583J328j3315K2960r91k7482N4252j8596o1150
12969H90012M1003N0585r92L866K8362J9516n2482n170P2587L9323o3509j0448
12957A012653O402n662J3173l424J7826L6085J1587n985q195j2253J9767O366
12945A088340n3083l0198k4698K3123j3329L4276Q4144M2363j9372k679J3802
12934A142689P6993J4367o9616m1243J4351K2011J0350M201j766j415J3353P881
$$ y = [870748, 891327, 877418, 854110, 864521, 820672, 793198, 771361, 810973, 834940, 891827, 934655, 870439, 831672, 823773, 817265, 844048, 883169, 903040, 946963, 949769, 952026, 922433, 917797, 917699, 936486, 935205, 877982, 831486, 851892, 823901, 817324, 814125, 808342, 875509, 913518, 951678, 933444, 932139, 942301, 937589, 933006, 934334, 921019, 943979, 942988, 915506, 969758, 951162, 890012, 931015, 981600, 980608, 984474, 1012836, 1032352, 979870, 974700, 1047287, 1086610, 1023101, 1012653, 1019055, 1013393, 1026566, 1023142, 1040968, 1077053, 1088640, 1082655, 1074460, 1062207, 1081974, 1088340, 1035257, 1005059, 980361, 1003484, 990155, 1024431, 1108575, 1150938, 1131566, 1128887, 1142689, 1219682, 1234049, 1164433, 1123190, 1137541, 1159552, 1169902, 1174103, 1172337, 1170922, 1184275, 1192156]
12922A192156L2576J2563n9990l4592N1766N898Q590J499K7052j099j4994N9303
12910A280728k7349l2873q268l4031L3963K1484P203M4598P670J5109K614O439
12898A317287j1773n569R027O2247L1086k2646K1213P5371j3621P895k7185p8356
12886A364976m721M4343O4169L0945j7534k6533L5031M536J2505m0261l7058n4664
12874A375734l2596K3806j4816M7236L3939n292j6040M1791Q394M2259j548k2477
12862A480390j7249n9952j1358K6725L5883Q7593P1391O779N961L2084Q4950j303
12850A741894j1336j9914j069J2558o0498l1640j9180l538k9761M9926O4979r497
12838A682924k7795J0767Q836J8434O8847N5208L4844m3435N57k2912J2964K5870
$$ y = [1192156, 1224732, 1237295, 1177305, 1142713, 1194479, 1200377, 1208967, 1210466, 1237518, 1236419, 1221425, 1280728, 1253379, 1220506, 1212238, 1178207, 1212170, 1233654, 1240857, 1285455, 1293125, 1308234, 1310848, 1317287, 1305514, 1299945, 1308972, 1371219, 1402305, 1379659, 1400872, 1476243, 1462622, 1470517, 1443332, 1364976, 1360255, 1404598, 1468767, 1499712, 1482178, 1455645, 1490676, 1495212, 1507717, 1467456, 1430398, 1375734, 1343138, 1366944, 1352128, 1399364, 1433303, 1428011, 1411971, 1453762, 1462156, 1504415, 1502867, 1480390, 1463141, 1403189, 1391831, 1418556, 1454439, 1542032, 1613423, 1620202, 1626163, 1658247, 1743197, 1741894, 1730558, 1710644, 1709575, 1722133, 1661635, 1629995, 1610815, 1607277, 1577516, 1627442, 1692421, 1682924, 1655129, 1665896, 1674732, 1693166, 1762013, 1817221, 1852065, 1808630, 1809187, 1786275, 1799239, 1825109]
12826A825109L2315o391n1125l4695K7010L2316j0930K2569M6083J6879M627k2363
12814A881404l3109N4425k377L3607L8965o259J1816j0434O0798M8418l6365m223
12802B036666n1849l8732O3365J1024M0724Q8378M7675o3966l4049N4283O3774
12791B217293k9639j7507J8249L1182k5628k2974m4762M461L0535L9430N2006
12780B252646M2195J8434P969L31N277m350J6866m3120k4858K2694K3991K7849
12768B345924N8143J7377Q298J9380K0087J6397m3034l6122K8859P1368L8991
12757B545668j9444n035K4599M4053p433j7853J260M949j7017K1995n234k6240
12745B544268j7087N3065N7145K3744O2246P3361J2080N167r270M2196M5424j4233
$$ y = [1825109, 1857424, 1851033, 1799908, 1765213, 1792223, 1824539, 1813609, 1836178, 1882261, 1899140, 1903767, 1881404, 1848295, 1902720, 1900343, 1933950, 1972915, 1966656, 1978472, 1968038, 2028836, 2077254, 2040889, 2036666, 1984817, 1946085, 2009450, 2020474, 2061198, 2149576, 2197251, 2133285, 2099236, 2153519, 2217293, 2187654, 2170147, 2188396, 2219578, 2193950, 2170976, 2126214, 2130675, 2161210, 2200640, 2252646, 2294841, 2313275, 2321244, 2321575, 2326852, 2322502, 2339368, 2296248, 2271390, 2294084, 2318075, 2345924, 2404067, 2421444, 2429742, 2449122, 2469209, 2485606, 2442572, 2406450, 2435309, 2506677, 2545668, 2526224, 2521189, 2545788, 2589841, 2582408, 2564555, 2565815, 2570764, 2553747, 2575742, 2570508, 2544268, 2527181, 2580246, 2637391, 2661135, 2723381, 2796742, 2808822, 2813989, 2804719, 2846915, 2892339, 2878106]
12733B878106r223j1031N8918M3110K8612L8360k4886k5424L7167N2277M1808
12722C107794N201m0810q1971J5686P0062M9067J5995j3464l745Q926N6121P0253
12710C259115r217k9333M0592N3550l2031k2512M3467J02315N0285K1558r083
12699C468706M4337K9585l512k9962N9026M2293J8916l2391J5100P1871M733N2996
12687C741698M7656O2593k0074o5099l927J15365P5853n0929p597M9117L0835
12676C975491L5591M2684Q0208M6484j4120N348j5803L1155L5832M3090K9040
12665D295000N0382P0486q780n5173K1581J17868J1599m8572J2859J3358j7504
12654D463104M9269O5084l825Q3373R5003K4955N3493M8218L4906k2831N2112
$$ y = [2878106, 2868883, 2857852, 2916770, 2959880, 2988492, 3026852, 3001966, 2976542, 3013709, 3065986, 3107794, 3112995, 3072185, 2990214, 3005900, 3075962, 3125029, 3141024, 3127560, 3123815, 3132741, 3188862, 3259115, 3249898, 3220565, 3261157, 3314707, 3282676, 3260164, 3303631, 3405946, 3456231, 3477789, 3468706, 3513043, 3542628, 3539116, 3509154, 3568180, 3610473, 3629389, 3596998, 3612098, 3683969, 3688702, 3741698, 3789354, 3851947, 3831873, 3766774, 3762847, 3878212, 3954065, 3903136, 3895539, 3944656, 3975491, 4011082, 4053766, 4133974, 4180458, 4166338, 4171686, 4155883, 4187038, 4222870, 4265960, 4295000, 4345382, 4415868, 4407088, 4351915, 4373496, 4491364, 4502963, 4454391, 4467250, 4480608, 4463104, 4512373, 4577457, 4573632, 4657005, 4752008, 4776963, 4830456, 4878674, 4913580, 4890749, 4942861]
12643D942861P3820P9557K6709m3808J4917Q5143L4183N6850O422k7837P01O4944
12631E314462Q0765K1962j254N9782J05502P744J4995O5383Q5372R9950R241K472
12619E866376l0146Q7325M2970K6681R8801P6736K0701L8359P3496O5859N0754
12608F417912N6528K9905K9743L6279R0505N4168L8541M6758N6112K4517O169
12597F887137j8205L3914M4909O3409J6349K5218N5459J23590Q7407N8991J20070
12586G498248N2417L173P1209R4368J20429R2094N9J7337J8721N1235L1726P8136
12574H129152J13323Q7029O5536Q9206J19274O4358P0459Q3000L7620P1748K7796
12563H958501N7747P7209J20583J21735M1829M6696L9404R2340J69008J22490
$$ y = [4942861, 5016681, 5096238, 5122947, 5079139, 5094056, 5179199, 5213382, 5270232, 5276654, 5248817, 5249518, 5314462, 5395227, 5417189, 5415935, 5475717, 5581219, 5588963, 5603958, 5669341, 5754713, 5854663, 5863904, 5866376, 5836230, 5923555, 5966525, 5993206, 6092007, 6168743, 6189444, 6227803, 6301299, 6367158, 6417912, 6474440, 6504345, 6534088, 6570367, 6660872, 6715040, 6753581, 6800339, 6856451, 6880968, 6887137, 6868932, 6902846, 6947755, 7011164, 7027513, 7052731, 7108190, 7231780, 7319187, 7378178, 7498248, 7550665, 7553838, 7625047, 7719415, 7839844, 7931938, 7931997, 7949334, 7968055, 8019290, 8051016, 8129152, 8242475, 8329504, 8395040, 8484246, 8603520, 8667878, 8738337, 8821337, 8858957, 8930705, 8958501, 9016248, 9093457, 9214040, 9335775, 9377604, 9424300, 9463704, 9556044, 9725052, 9847542]
12553I847542P0469N5656P2863Q3252J27353J23430N5861N8867J38118J5184L268
12542A0651863P3414J37169N1459Q9657J29006J34678N9065K3156M1739J28568
12532A1519774J88436J35382L6969K3183P7726J40095J15347Q1475J36086N1574
12522A2506047Q6708J92412J60855O4716M0924R6832R9078J03567Q6457J03613
12512A3541209J25069J05654J38424J52329J22660N7068J02507J30020P2434R6805
12502A4644179J50887J54478J21606J23086J37307J31500L5721J10470J85218
12493A5794452J24779J19655J34942J30432J17486R0741R7147J11526J26664J10122
12483A6957946R3793J44656J52898J14727R4811Q7437J5387L3129J43126J83475
$$ y = [9847542, 9918011, 9973667, 10046530, 10129782, 10257135, 10380565, 10436426, 10495293, 10633411, 10648595, 10651863, 10725277, 10862446, 10913905, 11003562, 11132568, 11267246, 11326311, 11349467, 11391206, 11519774, 11708210, 11843592, 11880561, 11903744, 11981470, 12121565, 12236912, 12318387, 12454473, 12506047, 12592755, 12785167, 12946022, 13010738, 13051662, 13148494, 13247572, 13351139, 13437596, 13541209, 13666278, 13771932, 13910356, 14062685, 14185345, 14242413, 14344920, 14474940, 14547374, 14644179, 14795066, 14949544, 15071150, 15194236, 15331543, 15463043, 15498764, 15609234, 15794452, 15919231, 16038886, 16173828, 16304260, 16421746, 16512487, 16609634, 16721160, 16847824, 16957946, 17051739, 17196395, 17349293, 17464020, 17558831, 17646268, 17661655, 17694784, 17837910, 18021385]
12473A8021385J70332R6609J22959Q0664J03100J30021O8402J26922J06439K7705
12463A9054538N8845Q4765J47891J06732J38843J05463O5156M0348P3812J21959
12453A9998352J28372M6308L0976O0787J05095J07586J48654P1588j022J6455
12443B0713151N2432O3525O8137O6042l0M1007J3941K5543P1880J7841j8988M0746
12431B1155227O7120O6056K4864R456M3560N2071M8922p8322J4814O8456L618
12420B1475842O380m2752m3991n9602P1575N0565p4300q6131m9320L2291j6496
12409B1264061l7271l7227m7594r5210o2172n4180o9851j1788l3492l7438J2400
12398B0790238m0838q1042r6181n6689j03083r3533n6718o7502m5521r6054o1757
$$ y = [18021385, 18191717, 18288326, 18411285, 18491949, 18595049, 18725070, 18793472, 18920394, 19026833, 19054538, 19113383, 19198148, 19346039, 19452771, 19591614, 19697077, 19762233, 19802581, 19876393, 19998352, 20126724, 20173032, 20204008, 20264795, 20369890, 20477476, 20626130, 20697718, 20696696, 20713151, 20765583, 20829108, 20897245, 20963287, 20963257, 21004264, 21018205, 21043748, 21115628, 21133469, 21114481, 21155227, 21222347, 21288403, 21313267, 21322723, 21366283, 21418354, 21467276, 21388954, 21403768, 21472224, 21475842, 21482222, 21439470, 21395479, 21335877, 21407452, 21458017, 21383717, 21297586, 21248266, 21280557, 21264061, 21226790, 21189563, 21141969, 21046759, 20984587, 20930407, 20860556, 20848768, 20815276, 20777838, 20790238, 20749400, 20668358, 20572177, 20515488, 20412405, 20318872, 20262154, 20194652, 20149131, 20053077, 19991320]
12387A9991320l5674j77327q8655j00826r8464p0097r0559j12008r6946j24158
12377A8996606j10595m5206r2136j05226q3346r8813j26715j41792j14029j10726
12367A7968022j12965j09978o1535p8941j29842j29849j37163j50647j05491j35581
12357A6816030j27130j15285m2193q7478q3737j26325j39253j71130j86087p2211
12347A5665201r7052j26828j42710j00128j3247r7511j80243j88035p1247j26152
12337A4522048r8646q8016j06116j61652j09203o0257j20831r5026j42104j26589
12327A3413608o1433j24828q6081l5143j50767j38053j26842j40614o6636q2959
12317A2400252r3176p8579o5111r5754j40271j26745r0137j23252q2667p7952
$$ y = [19991320, 19955646, 19778319, 19689664, 19588838, 19490374, 19420277, 19329718, 19217710, 19120764, 18996606, 18886011, 18840805, 18748669, 18643443, 18560097, 18461284, 18334569, 18192777, 18078748, 17968022, 17855057, 17745079, 17683544, 17604603, 17474761, 17344912, 17207749, 17057102, 16951611, 16816030, 16688900, 16573615, 16531422, 16443944, 16360207, 16233882, 16094629, 15923499, 15737412, 15665201, 15568149, 15441321, 15298611, 15198483, 15185236, 15087725, 14907482, 14719447, 14648200, 14522048, 14423402, 14335386, 14229270, 14067618, 13958415, 13898158, 13777327, 13682301, 13540197, 13413608, 13352175, 13227347, 13141266, 13106123, 12955356, 12817303, 12690461, 12549847, 12483211, 12400252, 12307076, 12228497, 12163386, 12067632, 11927361, 11800616, 11710479, 11587227, 11504560, 11426608]
12307A1426608l7967p7677k17710j48975p2920p7746n6435m9414n3687q4753j46564
12296A0402760j94120j18042q1613l4242k3784j12307q6200n1589j05066q3042
12286I512755n4167m8799R459q0010q3817m7586o9310o8113p6973j25879j88422
12275H679138j06475j5649n6198o0437p9357p7892m7078k6857p0103j24071q1039
12264G933982l3415r3355j20379j21401n857J5384p3584r6366r9066k3615o2894
12253G219434o1554m521l1500p4792m6023J072n3928j60928j04843k6922p725
12242F647770m9694q8494o6030k2604k1210m7031p0472m5267o7348n8462m3211
12231F067947o6875k7998o2516m1477q2380n6075k0946n6363j08187m8557o5771
$$ y = [11426608, 11388641, 11310964, 11093254, 10944279, 10871359, 10793613, 10737178, 10687764, 10634077, 10549324, 10402760, 10208640, 10090598, 10008985, 9974743, 9950959, 9838652, 9752452, 9700863, 9595797, 9512755, 9458588, 9409789, 9419248, 9339238, 9255421, 9207835, 9138525, 9070412, 8993439, 8867560, 8679138, 8572663, 8557014, 8500816, 8440379, 8361022, 8283130, 8236052, 8209195, 8139092, 8015021, 7933982, 7900567, 7807212, 7686833, 7565432, 7559575, 7574959, 7501375, 7405009, 7305943, 7282328, 7219434, 7157880, 7153359, 7121859, 7047067, 7001044, 7002116, 6948188, 6787260, 6682417, 6655495, 6647770, 6598076, 6509582, 6443552, 6420948, 6399738, 6352707, 6282235, 6236968, 6169620, 6111158, 6067947, 6001072, 5973074, 5910558, 5869081, 5786701, 5730626, 5709680, 5653317, 5545130, 5496573, 5430802]
12220E430802R508P224l8431p3543m5852l8985m3337l2230m2440m5079p285p5613
12208E004739k4637l6888l1737l2022l0586l738l2504j2716l6120q2101p123J8945
12196D693512l8832j17594o2725J487k4218k9951n4578k1957L743M5491n7899
12185D336479p5982n5728p1100M1768J5049n2809n4202p0477l7764k9494n5822
12174C889918k5493m4349K114l5851K081n6393n8076j6221p161n6612N033K909
12162C601899l4611m3192J7808M939k3374n0668O750m8812k8847l6751p50n9211
12150C305180M094j8841j1785l2512o4644l2894J9278m5421n7100m4959P837k5060
12138C003173n2946R397l8237j1725k6913J6834l1951r208K297J046m5099o6491
$$ y = [5430802, 5440310, 5447534, 5409103, 5335560, 5289708, 5250723, 5207386, 5175156, 5132716, 5087637, 5080352, 5004739, 4980102, 4943214, 4911477, 4879455, 4848869, 4845131, 4812627, 4799911, 4763791, 4681690, 4674567, 4693512, 4654680, 4537086, 4474361, 4475848, 4451630, 4421679, 4367101, 4345144, 4348887, 4394378, 4336479, 4260497, 4204769, 4133669, 4175437, 4190486, 4137677, 4083475, 4012998, 3975234, 3945740, 3889918, 3864425, 3820076, 3822190, 3786339, 3788420, 3732027, 3673951, 3657730, 3650569, 3593957, 3598990, 3601899, 3567288, 3524096, 3541904, 3546843, 3523469, 3472801, 3479551, 3430739, 3401892, 3365141, 3364391, 3305180, 3309274, 3290433, 3278648, 3246136, 3181492, 3148598, 3167876, 3122455, 3065355, 3020396, 3028233, 3003173, 2950227, 2959624, 2921387, 2909662, 2882749, 2899583, 2867632, 2858424, 2860721, 2861767, 2816668, 2750177]
12126B750177m7379n9792L889O76L5020M6954l1681p1280p2083j2434J0568J7137
12114B569772k4588q3845m3726K612K9536l9170l1964J1806L6646K9505L8929
12103B495513m9513n1953k560J5060k7406n9305M803j5801k9064P0455L194k4358
12091B329065o4451p4110o5080L8191L8505o5803n7515L6949M2122j454j8801
12080B137618k7291l2890p260m177l5111n4954J1821j0547N6564M0911J6794m9044
12068B042434p3294o4892J5501k2912j6444N5451L3699m25j5287p5007n1883J3304
12056A840245M6843l5585q2683j7516P2751J3463o2268k6000k7869J9968j8321
12045A723028R887J7826j95J0755l6032q6698k5293k0450L1571n606j0699j969
$$ y = [2750177, 2702798, 2643006, 2646895, 2647571, 2682591, 2729545, 2697864, 2626584, 2554501, 2542067, 2552635, 2569772, 2545184, 2461339, 2417613, 2420225, 2449761, 2410591, 2378627, 2390433, 2427079, 2456584, 2495513, 2446000, 2394047, 2391487, 2406547, 2379141, 2319836, 2324639, 2308838, 2279774, 2350229, 2353423, 2329065, 2264614, 2190504, 2125424, 2163615, 2202120, 2136317, 2078802, 2115751, 2157873, 2156419, 2137618, 2110327, 2077437, 2070177, 2066000, 2030889, 1975935, 1987756, 1977209, 2033773, 2074684, 2091478, 2042434, 1969140, 1904248, 1919749, 1896837, 1880393, 1935844, 1969543, 1969118, 1953831, 1878824, 1826941, 1840245, 1887088, 1851503, 1768820, 1751304, 1824055, 1837518, 1775250, 1749250, 1721381, 1741349, 1723028, 1732915, 1750741, 1750546, 1761301, 1725269, 1638571, 1613278, 1592828, 1624399, 1618793, 1608094, 1606125]
12033A606125m5552L269L2456m351k3873l0974l338J3042J1399R3n629L157L3487
12020A589311n0693l6249j374L2385L3559l878L547J4717N370m4347m698N80l3679
12007A504551O762k5784k6757k7173j9394N4197P6699k7362p8652k1019m4192
11996A371876o4612P261L9421K1288K1574j6763M1391L3121o8699k9199j8456
11985A338203o677K267l4578P073J7573n6649m547J4877k8424k8043M5791M3021
11973A309887J4777K6574m4755l6696K266k6140l8857J0338K5420O058j0608J7044
11961A255308j8678l1519r827j298l0202K4425l6551m3303p945L6388n0016o453
11949A080329K4613K4929k6880l7911J3837Q9163M8152l1217m7990p9204m7159
$$ y = [1606125, 1560573, 1563842, 1596298, 1591947, 1568074, 1537100, 1533762, 1546804, 1558203, 1558296, 1552667, 1555824, 1589311, 1538618, 1502369, 1500995, 1533380, 1566939, 1563061, 1566608, 1581325, 1586695, 1542348, 1537650, 1538230, 1504551, 1511313, 1485529, 1458772, 1431599, 1412205, 1466402, 1543101, 1515739, 1437087, 1416068, 1371876, 1307264, 1314525, 1353946, 1375234, 1396808, 1380045, 1421436, 1454557, 1385858, 1356659, 1338203, 1331526, 1333793, 1299215, 1306288, 1323861, 1267212, 1262665, 1277542, 1249118, 1221075, 1266866, 1309887, 1324664, 1351238, 1306483, 1269787, 1272053, 1245913, 1207056, 1217394, 1242814, 1248872, 1238264, 1255308, 1236630, 1205111, 1195284, 1193986, 1163784, 1188209, 1151658, 1108355, 1100410, 1136798, 1086782, 1080329, 1104942, 1129871, 1102991, 1065080, 1078917, 1168080, 1216232, 1185015, 1137025, 1057821, 1010662]
11938A010662K8901O3979J0216n5107l1446q930p2581J3092K6144n3619L3752
11927I65063n5301l5848o382N4603K5694O0058L1801j5196l7442Q253N1394l2917
11915A013780l8003N5521m2831m9306k5456P479J2594k1992l185M7704L045l2626
11903I26724R561P086j6533N843R27r2124q149K5225K4509j085r26M8538L6262
11890I65858k6029n0231k7445l3427p43M983k2807j7995O97J4812O570j3796q0569
11877G19878l4607Q515M04K5425l325M2869L2372J4326j7785L7963J396k6099
11865H01332K4317L1726n460J029l5809n764k2414j2537l13m9657m741n1237J0218
11852F80690P449K9059m844p1900m1591M8679M8899n3606n4899o461M3570M4946
$$ y = [1010662, 1039563, 1103542, 1113758, 1058651, 1027205, 1018275, 945694, 958786, 984930, 931311, 965063, 909762, 873914, 867532, 922135, 947829, 1007887, 1039688, 1024492, 987050, 995303, 1046697, 1013780, 975777, 1031298, 988467, 939161, 913705, 921184, 933778, 911786, 908601, 956305, 959350, 926724, 936285, 943371, 926838, 932681, 933608, 841484, 833335, 858560, 883069, 881984, 881058, 929596, 965858, 939829, 889598, 862153, 828726, 827983, 832966, 810159, 792164, 792861, 807673, 814243, 800447, 719878, 685271, 693786, 694190, 719615, 716290, 759159, 791531, 805857, 788072, 826035, 827431, 801332, 825649, 857375, 851915, 852944, 817135, 811371, 788957, 776420, 776107, 726450, 721709, 670472, 680690, 688139, 717198, 712354, 640454, 598863, 647542, 696441, 642835, 587936, 581475, 625045, 669991]
11840F69991K8716o896m202M4313m8464m4870j1913L4928l4003m3893m5431n36
11828E37740r320L1742K4565j0349N9789M8695M3748o3729p6804R239M8823j5123
11816F29016l4732l902K7817K4962k264o9576k6289N5464J4942J0900m6012l4121
11804E46205j3002o202L1227j6018m8150K7101N0013N9178j445l291m8083k4459
11792E53074J1452k0661r086P258n8039l6836m3910p681P7070O5308j1468m9058
11780D77423N8621O4996J2623j9851m1043k5167o4873M4890L9589o1383j9724
11769D66101n228N3014j7785m8795m7914J903K5967J4364j0989l4910K5912p804
11757D13836J6767Q0233L215k8134m6601J2988J4794J3421j7149L3919j6143k8561
$$ y = [669991, 698707, 691811, 687609, 731922, 683458, 638588, 626675, 661603, 627600, 583707, 538276, 537740, 528420, 560162, 584727, 574378, 634167, 682862, 726610, 662881, 586077, 595316, 644139, 629016, 594284, 590382, 618199, 643161, 640897, 571321, 545032, 600496, 615438, 626338, 580326, 546205, 533203, 527001, 558228, 542210, 494060, 521161, 571174, 630352, 628907, 625616, 577533, 553074, 564526, 543865, 534779, 542037, 483998, 447162, 403252, 395571, 472641, 537949, 526481, 477423, 536044, 601040, 613663, 593812, 552769, 527602, 462729, 507619, 547208, 485825, 466101, 460873, 513887, 496102, 447307, 399393, 401296, 427263, 441627, 430638, 395728, 421640, 413836, 430603, 510836, 514051, 485917, 439316, 452304, 467098, 480519, 463370, 497289, 481146, 452585]
11745D52585l1870j7464M2449j1211m548o508k8272J4861O3332J5194M4888k6634
11733E06802r4926m4116o332J9760K4765k0515J1388O1780L0461j5873p2692k7239
11721C73263O7517J1881m82J2511k0958k7690j8547q95K3085R0266k4685l7626
11709D47640k2852j2998l9679J3874j4279O362R564J7874m8012l8819q976j165
11697C08534L9977P9753L1663m5827j1038o0503m1761j6754K6441N4035L6965
11686D01485p335m9860m2057Q9744O7971M386m3934l9033k1318k5704l3048k8012
11674B73285L2711L9137P0838M6934J647m4806m5836n3605j9557L5880M7126l421
11662C80333n9601K9956M3070J8301r220J5737m544J0432k517j7244k3828p3076
$$ y = [452585, 420715, 403251, 445700, 434489, 429941, 423433, 395161, 410022, 473354, 488548, 533436, 506802, 411876, 367760, 361428, 381188, 405953, 385438, 396826, 458606, 489067, 473194, 400502, 373263, 440780, 452661, 452179, 464690, 443732, 416042, 397495, 396600, 419685, 509951, 485266, 447640, 424788, 411790, 372111, 385985, 371706, 378068, 387632, 405506, 357494, 318675, 309699, 308534, 348511, 428264, 459927, 414100, 403062, 342559, 300798, 284044, 310485, 364520, 401485, 394150, 344290, 302233, 391977, 459948, 464334, 420400, 381367, 360049, 334345, 301297, 273285, 305996, 345133, 415971, 462905, 464552, 419746, 373910, 320305, 300748, 336628, 383754, 380333, 320732, 350688, 393758, 412059, 402839, 418576, 414032, 424464, 421947, 404703, 380875, 307799]
11650C07799k2730N4553P0589J3834j0160o3346j7789O950J7915j0408k255P5911
11638D20863k4569q2389Q333N1117n929l3545l1479k8188m804J997N7607P538
11626C36552L953l939k5149R39P42K635J6540J5781p943J5687k7765p2671O37
11613B55999N1837k7227J0351L0869J4443P075n2534J5651M4555j816l0988M4579
11601C62794n436l4893K3421o920L111j7968O079j8405o303J6247K2886k5379
11589C19234p396K9352N7522L690r256j8268M903n2993j7084O714N9383n1007
11577C24794j5021l900M2582o608q3921o3089J5191K0495O048j6969O014K425
11565B28041l0831J4067k7643Q079k7795k6959l3251M6791Q5371L280j1690k902
$$ y = [307799, 285069, 339622, 410211, 424045, 413885, 350539, 332750, 339700, 357615, 347207, 344952, 420863, 396294, 313905, 322238, 373355, 367426, 333881, 302402, 274214, 269410, 271407, 329014, 336552, 340505, 336566, 311417, 312356, 313098, 315733, 332273, 348054, 340111, 355798, 328033, 255362, 255999, 307836, 280609, 290960, 321829, 336272, 343347, 290813, 306464, 351019, 349203, 318215, 362794, 357358, 322465, 345886, 338966, 342077, 324109, 330188, 311783, 305480, 321727, 344613, 319234, 311838, 341190, 398712, 402402, 393146, 374878, 379781, 326788, 309704, 316418, 375801, 324794, 309773, 305873, 348455, 341847, 257926, 194837, 210028, 230523, 236571, 219602, 225616, 228041, 197210, 211277, 183634, 191713, 163918, 136959, 103708, 150499, 235870, 239150, 227460, 224558]
11553B24558r178J2164m1733N8894L1665k6698p1929l3693j2554Q589J9833L412
11541A63330R115L305m6079p746k025P0272L6226J0288q785K945J9222J523k1738
11528B29853l3135n0658l3665L2606M924m3448J6684K0991N540k9389O37J2159
11516A33099K5416M4737j1493m8372k8063Q376N5811J6582L2371R645k9308n3958
11504A54843M1683K273l7260J8135K7520K4819k4195k1538L5457J92K365K7253
11492B51547k8056m2126o7390M144R752k8565J8906O276O3907O3701m4155k5055
11480A82886M293L8257k3384J3642k747l353n0934Q817L6394j7013J1793j254
11468A97397M12j0295j9149K2148Q1828j3753o3265j6920M5066K5552j0074J3919
$$ y = [224558, 215380, 227544, 185811, 244705, 276370, 249672, 177743, 144050, 131496, 140085, 159918, 163330, 172445, 175750, 129671, 121925, 119900, 190172, 226398, 236686, 227901, 230846, 250068, 251591, 229853, 196718, 146060, 112395, 145001, 149925, 106477, 123161, 144152, 149692, 120303, 120940, 133099, 158515, 203252, 191759, 143387, 115324, 123700, 179511, 196093, 228464, 238109, 208801, 154843, 196526, 198799, 161539, 179674, 207194, 232013, 207818, 186280, 221737, 221929, 224294, 251547, 223491, 181365, 113975, 118119, 127871, 99306, 118212, 124488, 188395, 252096, 207941, 182886, 187179, 225436, 202052, 215694, 212947, 209594, 158660, 167477, 203871, 186858, 198651, 197397, 197809, 187514, 168365, 190513, 272341, 258588, 195323, 178403, 223469, 249021, 238947, 252866]
11456B52866l0004k3810l2164o160J3379j0766m915O4077l3082k9061k14J8302
11444A78448P708n4099l0328J9596o522J2845L0728j6812J7410o643J5455K226
11432A70012J1346O378J2289J4128j5370P137m6267o8150J618K8n044K0791j7085
11419I1811M3214L3282m0093o6712k9437M4875N7439k785n9452o4607L0837R1557
11407A29929L5141j2251n5210J5884O4276l7680n2681j971P1307k5250K1141M5176
11395A97811J6936n565p8080j4236K4024K1234l0296J172r15r050j2959K8611
11383A38687O6915J9945r0490j8841L7453m6888l4270m5652k6321K4500L6536
11372F1574K6220q122o843m065M7907J839m348r157m3346l386N3215M2516M1950
$$ y = [252866, 222862, 199052, 166888, 160728, 174107, 163341, 158426, 222503, 189421, 160360, 160146, 178448, 186156, 132057, 101729, 121325, 114803, 127648, 158376, 141564, 158974, 152331, 167786, 170012, 181358, 187736, 200025, 214153, 198783, 205920, 159653, 91503, 93121, 93149, 88105, 108896, 91811, 135025, 168307, 128214, 61502, 32065, 76940, 134379, 131594, 72142, 7535, 38372, 129929, 165070, 152819, 97609, 113493, 177769, 140089, 87408, 85437, 156744, 131494, 152635, 197811, 214747, 209182, 131102, 116866, 140890, 162124, 131828, 133000, 132085, 123035, 110076, 138687, 205602, 225547, 135057, 116216, 153669, 106781, 72511, 26859, 538, 25038, 61574, 87794, 79672, 72829, 68764, 116671, 118510, 114162, 105005, 61659, 58273, 111488, 154004, 195954]
11359A95954K4423n290k5826o0247p0345K220k4116l2467O2383j3257R443P1744
11347A34619P316k2469L3621J4053q1749J0924O0576M0588j6178l8993p0484l3678
11335C8146J633J2528P6753O0010L2368l3438k2222j6565o3809L4792J9370J918
11323A41484J8695n704n6939J3610n122N323K3893J3852J947J09J5656K2159k7963
11310A61000n2502p5532L8462L0174K2960j9150K816k9811k436O450k3689J2543
11298G1285K3577K0763O9198J7784p250q554m3316l5415k028R777l657n3600l9141
11285A9423L7332L9497J22760K5704j8787j3137n0611q4177J0974P905k1914n5894
11273A9075o259J7362L2726L0931J8239N6798o48n1324l8589J4493k0808k0156
$$ y = [195954, 220377, 215087, 189261, 129014, 58669, 60889, 36773, 4306, 66689, 53432, 62875, 134619, 141935, 119466, 153087, 167140, 85391, 96315, 156891, 197479, 181301, 142308, 71824, 38146, 39779, 52307, 129060, 189070, 221438, 188000, 165778, 149213, 85404, 120196, 139566, 141484, 160179, 154475, 97536, 111146, 106024, 111347, 135240, 149092, 151039, 151148, 166804, 188963, 161000, 108498, 32966, 71428, 101602, 124562, 105412, 108228, 78417, 75981, 82431, 58742, 71285, 94862, 115625, 184823, 202607, 195357, 186803, 143487, 108072, 106044, 115821, 112164, 58564, 19423, 56755, 96252, 219012, 244716, 225929, 212792, 162181, 78004, 88978, 96883, 74969, 19075, 12816, 30178, 62904, 93835, 112074, 168872, 168224, 116900, 78311, 92804, 71996, 51840]
11261E1840M0990N5538n5595k1932j3945j5543k9491l51J0381p166L4957L5149
11249H4832L613L8645n528l5671m2165j3202K6775N8017K4848k4499l2385k29
11237H3051J1087j0658k1897o710L0600r956l0864p3240L1224L6515j780p82j1550
11224B5040l02J5262j8241N0893K5150n0472l6682K945N4777J2713k3861J5409
11212G2631J1639N2258k1919j4223n2187j2909P3406K2100j0431k1341K3769K7525
11200A50318j2000j9734p0399k6695j0663J8800K4302J2327K570K9487l7308j9061
11188D1944L882l1543m2975K079k327L3924O0184M3263K0400l1407m8852K1885
11176G0457K9930J6470K4062l9643K5873J5787K770k9192j9397k1499R153M0650
$$ y = [51840, 92830, 148368, 92773, 70841, 56896, 41353, 11862, 11511, 21892, 14726, 49683, 84832, 88445, 127090, 121562, 85891, 43726, 30524, 57299, 115316, 140164, 115665, 83280, 83051, 94138, 83480, 61583, 54873, 85473, 75517, 44653, -28587, 2637, 39152, 37372, 36590, 25040, 24738, 40000, 21759, 72652, 97802, 47330, 10648, 13593, 68370, 81083, 57222, 72631, 84270, 136528, 114609, 100386, 48199, 35290, 108696, 130796, 120365, 99024, 122793, 150318, 138318, 118584, 48185, 21490, 10827, 29627, 53929, 66256, 68826, 98313, 61005, 41944, 45826, 14283, -28692, -26613, -28940, 4984, 65168, 108431, 128831, 97424, 48572, 70457, 100387, 116857, 140919, 101276, 127149, 142936, 145706, 116514, 97117, 75618, 84771, 125421]
11164A25421J0362n51m6271k6188m323j6818N304k3097q813L3202K8619k3667
11152E3180k927n605j7179m952Q3o6463k0179r1M6212L0285M9939L8299N976j8305
11138H8273O955l2417j0689M4426O7185p515r5480m103L1984k4341K5007Q4142
11126A73427L1228K1802n3015p5090m418k822j5373l4956j1046J3963M7628J1502
11114A02830j6957k3553m1558N7210J0113r848m6731m5594j1212Q567J9317M6133
11102D8717l3539o6109j325P5716M9705j5635j8524j0918L6622j6116K6096K8176
11090A02866m2096o9J4863J9368R852n7255K272L9938p615o167K5483L8136N936
11077A45512K4845k1298m7849j8666j0425L9613K7029m0213n7256j3498k4592
$$ y = [125421, 135783, 135232, 88961, 62773, 58450, 41632, 46936, 23839, 15026, 48228, 76847, 53180, 50253, 44648, 27469, 22517, 22600, -43863, -64042, -64133, -17921, 12364, 62303, 100602, 106578, 88273, 95228, 62811, 52122, 96548, 163733, 156218, 60738, 56635, 88619, 64278, 89285, 173427, 204655, 226457, 173442, 98352, 93934, 91112, 75739, 40783, 29737, 43700, 91328, 102830, 85873, 62320, 20762, 77972, 88085, 78237, 31506, -14088, -25300, -16733, 2584, 48717, 15178, -50931, -52256, 23460, 73165, 57530, 39006, 28088, 64710, 48594, 74690, 102866, 60770, 60701, 75564, 94932, 104784, 47529, 49801, 89739, 82124, 75957, 101440, 139576, 145512, 170357, 149059, 101210, 82544, 72119, 111732, 138761, 98548, 41292, 27794, 3202]
11066C202K5880J2547l6974M4609K6354O196j987j5983K3042L3002o848r965K2483
11053A25558k0940n4688P1626q923m2200p401j3490j5642j7393Q584m938J2491
11041C2644j9466m3032q081j0971K1668l3817j6164M0894L8443M1500q871k0601
11029A4146j6444O9611m2801K0548K3716l1425l3317j4303k3304j053K6153M511
11017c962Q459N2813L5995p2214m4606Q461p924M6313l4228M0179l8092k6515
11005c5321K3292j2615J7640K7175k8566q539L5569K1945L8726J8425Q4132K417
10993A84280n6133p9304q655k2470k5151J0123L0905n8113k9976n064j3364M0696
10981c2226K7907p738k4538k2228K0882n244j7607L6796j0630K2047L2783P403
$$ y = [3202, 29082, 41629, 4655, 49264, 75618, 81814, 79827, 63844, 86886, 119888, 113040, 103075, 125558, 104618, 49930, 121556, 112633, 70433, 63032, 49542, 33900, 16507, 25091, 20153, 32644, 13178, -29854, -37935, -48906, -27238, -61055, -77219, -36325, 2118, 43618, 34747, 14146, -2298, 67313, 24512, 45060, 68776, 37351, 4034, -10269, -33573, -34626, -8473, -3962, 4497, 57310, 93305, 21091, -23515, -15054, -22978, 23335, -10893, 29286, -8806, -35321, -12029, -24644, -7004, 20171, -8395, -16934, 18635, 40580, 79306, 97731, 181863, 184280, 128147, 48843, 40188, 17718, -7433, 2690, 33595, -24518, -54494, -59558, -72922, -32226, -4319, -12057, -36595, -58823, -37941, -43185, -60792, -23996, -34626, -12579, 20204, 27607]
10969B7607m7698j426L2179L5802L3727j1743k5730n0487K6923J9509k3704k1903
10957f944N422l43N1994O807k9318L5183M5981p7186m370P161O6690K9957N1072
10944A82106J5042n9719q452K7513J4200q7796k9425K4487j1610k3036l066j1998
10932B8246J4739Q655K35J4623l4249l6501J9374J8080P103O88k6431l5337J4845
10919e930J9229j6189j7544N9898K8592o7569k2027N5459L5498M0463k8957n362
10907G5561J14k4603r720m7826K3832j2343k9025k9631M9665M0401N620J8990
10895F1035J1687J8025J5956j3672m5260j2501k6152L9807R067l399j4114J2751
10883E3230J462j5538m8466L206J2553j699J6066l900O002K0874N5579K492m4773
$$ y = [27607, -20091, -21517, 10662, 46464, 80191, 68448, 42718, -7769, 19154, 38663, 14959, -6944, -1522, -1865, 50129, 56936, 27618, 62801, 108782, 31596, 27226, 34387, 101077, 131034, 182106, 197148, 137429, 128977, 156490, 170690, 82894, 53469, 77956, 66346, 43310, 40244, 28246, 42985, 51640, 51875, 66498, 32249, -4252, 15122, 33202, 40305, 40993, 14562, -20775, -5930, 13299, -2890, -20434, 39464, 68056, 487, -21540, 33919, 69417, 109880, 80923, 75561, 75675, 51072, 41352, -6474, 17358, 5015, -24010, -53641, -3976, 36425, 42045, 61035, 72722, 90747, 106703, 93031, 47771, 35270, 9118, 48925, 57992, 54593, 40479, 53230, 54692, 39154, -9312, -6106, 6447, 4748, 20814, 16914, 22916, 43790, 99369, 101861, 57088]
10870E7088j2021l1925o739M9700N1845J3246M8255L1426o1583l5009m3435l8356
10858B2492K9002k6023L8118k5027m7312l2827j8983J4733N1888L221M98r900
10846a20n1794n8686L2118L9191N1486K2239M514J0218J9534n0897k9301q378
10834a9876N3406P9036O0271k4298k7575o684q702J807j7264q5997k0852K4233
10822G505j9197R0007M191O663K1638q9947p8080J9683J9210m0629L0658N2677
10810B4379l8994k8885O6217O2847m4864p560l853k031j1666q488L8692J3913
10798E9707L2322P4384j8258q1229r004J9836q399J7478k3731o951o9624n8562
10786g2031j2212L4729O2759j183n7618M6220M5232J0830J8503k0307j9662Mr4328
$$ y = [57088, 45067, 13142, 6403, 56103, 107948, 121194, 169449, 200875, 139292, 104283, 60848, 22492, 51494, 25471, 63589, 38562, -8750, -41577, -60560, -45827, 6061, 9282, 9780, -120, -51914, -110600, -78482, -39291, 12195, 34434, 38948, 49166, 68700, 17803, -11498, -19876, 33530, 112566, 172837, 148539, 120964, 114280, 105578, 107385, 90121, 4124, -16728, 7505, -11692, 78315, 82506, 89169, 110807, 20860, -57220, -37537, -18327, -58956, -28298, 24379, -14615, -43500, 22717, 85564, 40700, 33140, 29287, 27256, 15590, 7102, 45794, 59707, 92029, 166413, 148155, 66926, 57922, 77758, 69359, 86837, 63106, 56155, -13469, -72031, -84243, -49514, 13245, 12062, -45556, 664, 45896, 56726, 75229, 54922, 35260, 35264, -59064]
10773e9064K529L3788K2645K2769k2034L1246L3594n6182k0889O1973Q7508j1275
10761A26608o2529j0344O095L2846J33k8303m2430m4030j8783K7769J0329J0300
10749G661j3897O408n2040K1062L4762M210k8781J3946k8335m3175p857N9352
10737b6684Q8624K7424k0127j5141L7739k3865l0500j2615p3714n764K4926L7444
10725G747m743n4914m1445K5558Q2956j0390p949m0281n6697m689l844L1826J7126
10712e9739K9758j1008o3204K7401L3081P885J468j0327l8432O12N7322M6160
10700B0977q2309l9525N4791P606K2346R697N1853M3859k4436l5657J8350r391
10688C8161j2250j9005k3456M9117J5040k0369m0562l7770k8930K7740O0833l562
$$ y = [-59064, -56535, -22747, -102, 22667, 633, 31879, 65473, 9291, -11598, 50375, 137883, 126608, 64079, 53735, 59830, 92676, 92809, 64506, 22076, -21954, -40737, -12968, -2639, 7661, -6236, 172, -51868, -30806, 3956, 8166, -20615, -6669, -35004, -78179, -86036, -26684, 61940, 89364, 69237, 54096, 91835, 67970, 37470, 24855, -48859, -54623, -29697, 7747, 3004, -51910, -93355, -67797, 15159, 4769, -3180, -43461, -100158, -104847, -108691, -76865, -59739, -29981, -40989, -104193, -76792, -43711, -35826, -34358, -44685, -83117, -82505, -25183, 20977, -61332, -100857, -46066, -38460, -16114, -6417, 45436, 89295, 64859, 29202, 47552, 38161, 25911, 6906, -16550, 32567, 47607, 27238, -13324, -51094, -80024, -52284, 8549, 4987]
10676D987j5443L263J00322M3818l3234k8830m1564j6016k8247N585P8361L5225
10664A08227o1145m7000N0588O0509p9710o3262o2689k700J7986J6487N9722J2005
10652I018M2655j6738J1054M2906l6027k6185N5307L671q505j7311j6378m5785
10640b318k1182M8551L7216j9954j3282J887j8368K376N8546j081n2671k5042
10628e322k6693j1526L7076L112P199P6463R637q8029o3159O9587k2412n78n5325
10615f9970J0335P1810K9174j5851k3379L351M3843O3580O8959r805l8034k6660
10603A07353j2271m4332n957J5437m801k0593k831M4512m009j3165j9742l3377
10591F224j086N57j2033n298q600j190m4455P11K1421n077j3612N023L7198q33
$$ y = [4987, -10456, -7193, 93129, 136947, 103713, 74883, 33319, 17303, -10944, -5359, 73002, 108227, 47082, 82, 50670, 111179, 31469, -31793, -94482, -97182, -79196, -62709, -2987, 9018, 51673, 34935, 45989, 88895, 52868, 26683, 81990, 85661, 77156, 59845, 43467, -2318, -23500, 25051, 62267, 42313, 29031, 30918, 12550, 14926, 73472, 72391, 19720, -5322, -32015, -43541, -6465, -3353, 3846, 80309, 89946, 1917, -61242, 8345, -14067, -14645, -69970, -59635, 12175, 41349, 25498, 2119, 5470, 49313, 112893, 181852, 172047, 134013, 107353, 95082, 50750, 44793, 60230, 55429, 34836, 32005, 76517, 72508, 59343, 39601, 6224, 5138, 5695, -6338, -11636, -20236, -21426, -65881, -65170, -43749, -48826, -62438, -57415, -20217, -21050]
10577b1050J0083Q0419n391l7191J4743K6595j1257m27l729J217k0753k0160l0717
10564a7618l5285L3357K1435l5276o256N7418J628j1859L260L1633p50k3051J8688
10551C7324L7253Q079k3612n1698l323N8636j3876o2949j7214J4417q953K7656
10539A740j9138l8296j6541K5796Q1084L0895L205k5008k2492R242m4274j2527
10527b6314P3903L3869j4158l000J5204l3694o406j8770o8070l1806O2590L8694
10515B2042l2157m2252l8250O346O7464l3636K0916N1379r014J0461P0059L9240
10503A32598l4679j8277L2269j3211K1334Q557l6529l2178j6790J4274k1191K3357
10491E9534N4137k0814n2016j9135j0250k1706J5044P459l8987k4500O5508l1888
$$ y = [-21050, -10967, 69452, 64061, 26870, 41613, 68208, 56951, 56524, 52795, 54012, 33259, 13099, -17618, -52903, -19546, 1889, -33387, -39643, 17775, 19403, 7544, 10804, 42437, 41687, 18636, 37324, 74577, 82656, 59044, 7346, 4023, 62659, 48783, -14166, -31380, -16963, -25916, 1740, -17398, -55694, -72235, -46439, 34645, 65540, 68745, 43737, 21245, 30487, -13787, -26314, 47589, 81458, 67300, 64300, 79504, 45810, 39404, 20634, -47436, -79242, -16652, 22042, -10115, -52367, -90617, -84271, -16807, -50443, -29527, 21852, 12838, 23299, 93358, 132598, 97919, 79642, 111911, 98700, 120034, 128591, 92062, 59884, 43094, 57368, 36177, 59534, 113671, 92857, 40841, 21706, 11456, -10250, 4794, 12253, -26734, -51234, 14274, -17614]
10479a7614o9140M2081L1425K5106K6382P837j3574j7566K4391L5548J805n214
10467G1467k6409j8066k4614K251j2928j0524J2162N8351K4307n094P190P4944
10455A53037J7720j04950j4494P911K7793r756j7749k6051K9699J8947K30k5656
10443E6681O996j9831j6451K5628O5063K4671l6777l6462r208K6576L9028m349
10431A21565j3500L339O6545l406m6657l7846o1644j673R17J7643R952K7340j8094
10418F4481L1402j8831r3913N626N4845j1116l5524K8742L606n2708o4522l7663
10406a25575L0707K3975K8584L9253K2214K6670j0019o2121Q122M6537J1745k4818
10394A5274l3719k9673L3550M6208L4528k7506N316k5032J115l6099p1L9081J686
$$ y = [-17614, -86754, -44673, -13248, 11858, 38240, 46077, 32503, 14937, 39328, 74876, 76681, 71467, 45058, 26992, 2378, 4629, -8299, -18823, -6661, 51690, 75997, 70903, 78093, 153037, 170757, 65807, 51313, 59224, 87017, 77261, 59512, 33461, 63160, 82107, 82337, 56681, 63677, 43846, 27395, 53023, 118086, 142757, 105980, 69518, 60310, 86886, 125914, 121565, 108065, 111404, 177949, 174543, 127886, 90040, 28396, 26723, 27640, 45283, 55235, 82575, 64481, 95883, 77052, -16861, -11235, 43610, 32494, -3030, 25712, 29318, -23390, -87912, -125575, -94868, -70893, -42309, -3056, 19158, 45828, 35809, -26312, -18190, 28347, 40092, 15274, -18445, -48118, -14568, 31640, 66168, 38662, 43978, 18946, 20061, -16038, -16109, 22972, 24658]
10381B4658N287n2338j0362P310J0380J5134j2900n2110K2375J3193j2148N060
10369c6461j3612J5595N3372N7969K6833l7878l8106L1916P9410M7115q254n7638
10357A20261m8005l599J5457p1479k3289P626j2156N238O8736K9931q2676j7533
10345a1488L4520l833K0155O9514M2198l2803k6849K2372K2502l2159m916j9119
10333H0094k4802R376L910p4000n7850N1180L5310k9096K0124M5011j3091p5906
10321b9740L437J3616O808J7357L484Q879M6169j4088l4317J4189J7028k689m870
10308D5263L1886M3385l9585k383M0762m1112o0297k0841K7635M4978L1910L1693
10296A33294n580l3471J6281l3722J5966m358L25p08M0393K5308o9540j5972Q1910
$$ y = [24658, 29945, -22393, -32755, -25445, -15065, 69, -12831, -64941, -42566, -29373, -41521, -36461, -50073, -34478, 18894, 76863, 103696, 65818, 27712, 59628, 139038, 186153, 177899, 120261, 72256, 68657, 84114, 12635, -10654, -3028, -15184, -9946, 58790, 88721, 6045, -11488, 23032, 19199, 39354, 108868, 151066, 118263, 91414, 113786, 136288, 104129, 99213, 80094, 55292, 64668, 68578, -5422, -63272, -12092, 23218, -5878, 14246, 59257, 46166, -29740, -26303, -12687, -5879, 11478, 14962, 23841, 70010, 55922, 21605, 35794, 52822, 50133, 45263, 77149, 120534, 80949, 78566, 119328, 78216, 17919, -2922, 24713, 69691, 101601, 133294, 127714, 94243, 110524, 76802, 92768, 88410, 88735, 88027, 128420, 153728, 84188, 68216, 150126]
10283A50126K3407k1440m0109n8180o054R276Q7183o856n3555O087L1834l1294
10271I0425m6661l7733o7326M4751J9408L635p322L8746J3155p176k0990K1523
10259D4435J6472K8741k2436p1795J6405N1193J0090l3111M9583O0984K6230L0412
10247B07203M885J6643J4313o6153o9225o9318k9423M0342J9024l2204J3703l4824
10235A4966m2323l7332M4899N7543j755j5430m4458k6964J4785N0477p170j5870
10223h632j938M314M4181P463R411K6146m2616q7896J12M7802K8701K4924K2132
10210G4104p069o0571L2993J3147p1028k3586L6543O9797k8165n0437L9853K2618
10198D8199L5876l7534o6021r595k8383l0930M9116M2121M1108j8718o9646j7543
$$ y = [150126, 173533, 152093, 111984, 53804, 47750, 57026, 144209, 137353, 83798, 89885, 121719, 90425, 43764, 6031, -61295, -16544, 2864, 6499, -823, 37923, 51078, 43902, 22912, 44435, 60907, 89648, 67212, -4583, 11822, 63015, 73105, 39994, 89577, 150561, 176791, 207203, 212088, 228731, 243044, 176891, 107666, 38348, 8925, 49267, 68291, 36087, 49790, 14966, -27357, -64689, -19790, 37753, 35998, 20568, -23890, -50854, -36069, 14408, 7238, -8632, -10570, -6256, 37925, 45388, 54799, 80945, 38329, -49567, -49455, -1653, 27048, 51972, 74104, 67035, 6464, 39457, 52604, -18424, -42010, -5467, 64330, 36165, -14272, 25581, 48199, 84075, 46541, -19480, -29075, -57458, -88388, -39272, 2849, 43957, 25239, -44407, -61950]
10186f1950M5568J0819Q59Q5618N7273R664j8766k9865k154l6155k3250L2138
10174F9799K3045N9323P773j3465m5123l7449n0930n1251q335K8470K7937j9925
10162a0131K4655M4464P724L9365K999n2005l4295k0505l6701j0206j209M0108
10150e737M8861o874M9045M2712o3905n8468L1667j9002j5789J8947L6691k2154
10138C5994J6459M4634j9556l2342j5373n254J1751m5868K1764M8252P1791O116
10126A38368j631o974k7016n7931m3542J3038J6691m8152J2019N9587J3455j050
10114F6862m3796l2554j045J0944L5393N0181M031l5406l1068k100M0538J8660
10102H0640P833K4836L0471m589n1386j3049p9577l4471K7885M0218J3100j0485
$$ y = [-61950, -16382, -5563, -4704, 80914, 138187, 147851, 129085, 99220, 97066, 60911, 37661, 69799, 92844, 152167, 159940, 146475, 101352, 63903, 12973, -38278, -46613, -18143, 9794, -10131, 14524, 58988, 66712, 106077, 109076, 57071, 22776, 2271, -34430, -44636, -45845, -5737, 43124, 36250, 85295, 128007, 64102, 5634, 37301, 18299, 2510, 21457, 58148, 35994, 52453, 97087, 77531, 45189, 29816, 24562, 36313, -9555, 12209, 60461, 132252, 138368, 136737, 129763, 102747, 44816, 1274, 14312, 31003, -17149, -5130, 54457, 67912, 66862, 23066, -9488, -10533, 411, 35804, 85985, 90016, 54610, 23542, 21442, 61980, 80640, 88473, 113309, 143780, 139191, 87805, 74756, -4821, -39292, -11407, 28811, 41911, 31426]
10090C1426m5832r150O7168O6419k0462l7885J407j0492l5344l6915N0705j5101
10078E944m8243j335j1896R092J1891N4544j9808l1100L7321M3956r060j3416
10066B7890K2033m624R470K947K3395j6726k5052k0217K145L3272K0314q177O3597
10053A30267P9735J25750J71730R4063P3637N8631K3447l8498j34695k44037j61019
10042A79011p2021J3846n6090j3629P530J4702K8186R7371K8649J9867P9300N8750
10030C85472l730R302J8260k6986r6214j17954r0516K0909J8873J4060K8309m456
10018A55329j2635k0525k5542k8028l770k8458K1411N4883J7224M5629m8853o1556
10006F5109k8353K8889n517k3641r187K1835j9186J7553O2632L4243j0127j0427
$$ y = [31426, -14406, -23556, 43612, 110031, 89569, 51684, 53091, 42599, 7255, -29660, 21045, 5944, -42299, -43634, -55530, -46438, -34547, 19997, 189, -30911, 6410, 50366, 41306, 27890, 49923, 45299, 54769, 57716, 81111, 64385, 39333, 19116, 21261, 54533, 74847, 66670, 130267, 210002, 335752, 507482, 601545, 675182, 733813, 757260, 718762, 584067, 340030, 179011, 106990, 120836, 64746, 51117, 58647, 73349, 101535, 198906, 227555, 247422, 326722, 385472, 381742, 391044, 409304, 382318, 286104, 168150, 77634, 98543, 117416, 131476, 159785, 155329, 142694, 122169, 96627, 68599, 64829, 36371, 57782, 112665, 129889, 175518, 126665, 65109, 36756, 65645, 60128, 36487, 27300, 49135, 29949, 47502, 110134, 144377, 134250, 123823]
9994A23823o476L0336N5855O3252J5979l1950m9573K1267k3683k9575k2934m365
9982A41956J7701n1112m3133K4548M7087J9975l8009P208J9997k2209m7607j4788
9970F1614k4688K6561K1656J4230M8315M2820M3869L4518l8426r0891l0330j616
9958A07632r51Q672J933l5920j517o922l2269l6349K4496M64J3803J9846P2564
9945A35482O948P5395j7435j9839K7337J7650L0822k4300n6961l857j9967p8854
9933G2421o243L0895j7459p350K2437l9048K9093o133l9950M6091P5141M9687
9921B09582l1578n280M0443p701P948j0721k4624j9727j2547n8532L5132K9340
9909A51735L361O455K2802n4957l6863J2741J3936J515O084K1999M6424L5443
$$ y = [123823, 117347, 147683, 203538, 266790, 282769, 250819, 201246, 222513, 198830, 169255, 146321, 141956, 159657, 108545, 65412, 89960, 137047, 157022, 119013, 126221, 146218, 124009, 76402, 61614, 36926, 63487, 85143, 99373, 147688, 190508, 234377, 268895, 230469, 139578, 109248, 107632, 106681, 115353, 117286, 81366, 79849, 72927, 40658, 4309, 28805, 29269, 43072, 62918, 135482, 142430, 217825, 200390, 180551, 207888, 225538, 256360, 232060, 175099, 171242, 151275, 72421, 66178, 97073, 79614, 72264, 94701, 55653, 84746, 78613, 38663, 84754, 159895, 209582, 178004, 172724, 213167, 205466, 213414, 202693, 178069, 158342, 145795, 87263, 122395, 151735, 155096, 161551, 184353, 129396, 92533, 105274, 119210, 120725, 126809, 148808, 195232, 230675]
9897B30675M4343L1072K138K9288j0798l1378L303P734L0606L2366N3623Q5361
9885E08333J18344K12309L55214N05857L90866K45782J34698M1914n1279n18951
9875A943087o28630m41352k22010l9486j7591p251o0566k4440l4409o8688k0263
9864C78401j3031L8158J1310K3790l1790n3493K6946O0960Q2558J12808Q7346
9853G23963J12401L7962j5932m0797q4630k15694j54554j20667o0586K867m3177
9842A41156j4436n5997m3437L1969j1302r243L0545l8560M4963L0041o091L320
9830A02928j0990k0999m6854j8751J286J5241n57K3263J1780k3325J1647J6266
9818F0935J7197J2194k2073m9691K7241L5954l5217m8699L6036K5695j4206P236
$$ y = [230675, 275018, 306090, 308228, 337516, 326718, 295340, 298643, 306377, 336983, 369349, 422972, 508333, 626677, 838986, 1194200, 1700057, 2090923, 2336705, 2471403, 2513317, 2462038, 1943087, 1314457, 873105, 651095, 611609, 594018, 586767, 526201, 501761, 467352, 398664, 378401, 365370, 403528, 414838, 438628, 406838, 353345, 380291, 441251, 523809, 636617, 723963, 836364, 874326, 858394, 817597, 732967, 517273, 362719, 242052, 181466, 184333, 141156, 126720, 70723, 27286, 59255, 47953, 38710, 69255, 30695, 75658, 105699, 99608, 102928, 91938, 70939, 24085, 5334, 6620, 21861, 21304, 44567, 56347, 33022, 44669, 60935, 78132, 90326, 68253, 18562, 45803, 81757, 46540, -2159, 33877, 59572, 45366, 52602]
9806E2602j1095M2948j3313l84L837M3996j1236L0800P7046J470J9894o832r996
9793B19737n2218q1841j9898l7451n757M788N3278J9133j3544J6239J7705L425
9781A23596n8766n1869l9347j0196J3401L841k4754K5838M6951j3206M3893j8636
9769D0746m1618M3379Q052l3280k9930O568m1302N3099P5233m014q0912o8793
9757g2772M6360K3328L0n582K5524r092j4505L6835j0720q838k2451k0346K1023
9744a1206J1061m172K676J2537k7065j0679j109k745r7028k9135M8858M0578O7540
9731A11J2679n533p385l4428j6337m2037j9664N4777J00039K2620p0381o3776
9719f9315l3976k294n4083Q697L9578O8435M3717K3495K8623k2484m2983k5419
$$ y = [52602, 41507, 84455, 71142, 70758, 74595, 118591, 107355, 138155, 215201, 216671, 236565, 229733, 219737, 167519, 85678, 65780, 28329, 22572, 27360, 80638, 99771, 86227, 102466, 120171, 123596, 64830, 12961, -26386, -36582, -23181, -19340, -44094, -18256, 28695, 15489, 59382, 40746, -872, 42507, 50559, 17279, -12651, -6083, -47385, 5714, 80947, 76933, -3979, -72772, -26412, -3084, -3054, -8636, 16888, 7796, -6709, 30126, 19406, 10568, -11883, -32229, -11206, -145, -4317, -1641, 10896, -16169, -26848, -27957, -30702, -127730, -156865, -108007, -67429, 111, 12790, 7257, -128, -34556, -50893, -92930, -112594, -57817, 42222, 64842, -5539, -69315, -103291, -105585, -159668, -150971, -111393, -42958, 759, 24254, 52877, 30393, -12590, -38009]
9707c8009L5310l178j0k5058M2289K1431q557L5652R182m0411l3657J1923K3415
9694C0322N795J0931q864M080J588p4283n5389J8593K4573Q3305Q6874J2238k5808
9681A13955o2881m7520l1913p4205O2672K4080m3913j0693m3397k6995L1186M7976
9669f1648K527J8228K8609N3101L950j0290l2454k9016n0123K2193L7904N184
9657a1835M1085N508k5729k7887j1205K0904O8230j760k0343j8434Q34l791m9856
9644c4279m2981m2181N9371N8720j6568o102N0221k0032n1310k359N0956L5787
9632C9243j7557k2955j2995j554l745L1883m3605j0968m9635J7745J3667k406
9620f2882P845K6707M047m0750m767O5244J5106j7559o8841l2778l336O1842N7449
$$ y = [-38009, -2699, -5877, -5887, -30945, 11344, 32775, 24218, 59870, 69052, 28641, -5016, 6907, 30322, 36117, 47048, 38184, 42264, 43852, -30431, -85820, -67227, -42654, 40651, 127525, 139763, 113955, 51074, 3554, -28359, -102564, -39892, -15812, -59725, -70418, -113815, -140810, -109624, -61648, -59121, -40893, -12284, 40817, 44767, 34477, 2023, -26993, -77116, -54923, -17019, -11835, 29250, 34758, 9029, -18858, -30063, -9159, 59071, 57311, 36968, 18534, 19368, 15577, -34279, -77260, -119441, -60070, -1350, -17918, -24020, 26201, 6169, -45141, -47500, 3456, 39243, 21686, -1269, -14264, -15818, -19563, 12320, -31285, -42253, -91888, -74143, -60476, -62882, -55037, -28330, -24283, -65033, -69800, -4556, 10550, -7009, -75850, -108628, -111964, -50122, 7327]
9607G327L5460O2686J4769o9257o8238J2422L8593j7436J2963J1293k9554K1533
9595C2561P6292l013m0725o6339K566J6579J6009o981J9265k4278k7564L642J3215
9582A1229P460n2936n029O4569K9988n6771P556J1224J5722R671k4073k2229P2125
9569F8506J0903n6948k8341k0778k8879L4060j1206J5917j4031k0090j655L1316
9557b1226Q58m0813J3804L6832l8160M6144J3128p177j2367m7518j162N1629j2020
9544a8048j162m5470J4922P6954N7576j6164j6072K576r537k3345q1933P951J1608
9531d0144J1014O3733J8493k0391n4943m917K4285L8476k2596q269N2254J6299
9519G3294o3830o3115j9780P7534L8876M5171k2392l3778j7818N553N5921k6766
$$ y = [7327, 42787, 105473, 120242, 50985, -17253, -4831, 33762, 16326, 29289, 40582, 11028, 32561, 108853, 105840, 65115, -1224, 1342, 17921, 33930, 26949, 46214, 21936, -5628, -1986, 11229, 18689, -34247, -39276, 25293, 55281, -1490, 6066, 17290, 33012, 42683, 18610, -3619, 68506, 79409, 22461, -5880, -26658, -55537, -21477, -32683, -16766, -30797, -50887, -52542, -21226, -20368, -61181, -47377, -10545, -48705, -2561, 10567, 3390, -8977, -56495, -57657, -6028, -18048, -19210, -64680, -49758, 27196, 84772, 68608, 52536, 55112, 45575, 22230, -59703, -51752, -40144, -29130, 34603, 53096, 32705, -22238, -27155, -2870, 35606, 13010, 4741, 56995, 73294, 9464, -53651, -73431, 4103, 42979, 88150, 65758, 31980, 14162, 19715, 75636, 48870]
9507D8870k3100k8657J6901j585K0057L3446J4197l7849m7869K2846J6923K9026
9495F3206q085j1920k2055m0232J5035O447M698j926o3419N8194P5532j4298l0245
9482C0932n842l9057J827L0965m5718l6332o519r093L1246M5055L145N0918m3743
9469G784o048M4121P8448k156M401m2310P42j5270m2459n2904K2301P3328K9187
9456I9165M046m1394j6420q754k3242N636l0328j1852R51J8275K8529J1587q5508
9443d9309N3635K1807m8338n4J3800J8124L7996k4127L5839L8807K5564j1368
9431A12376m9829N0674M4955m6140l7699k5288m1937m6451J5530L6066L1747j6125
9419B7879M6367P8565J3207K1985Q0582K2460Q110j1379K4053M7339q46m0937
$$ y = [48870, 25770, -2887, 14014, 12429, 32486, 65932, 80129, 42280, -5589, 17257, 34180, 63206, 55121, 43201, 21146, -19086, -4051, 2396, 7094, 5168, -58251, -57, 75475, 61177, 30932, 25090, -13967, -12140, 18825, -26893, -63225, -69744, -78837, -47591, -2536, 609, 51527, 7784, 1736, 45857, 124305, 122149, 126550, 84240, 84982, 69712, 27253, -25651, -3350, 69978, 99165, 103211, 61817, 45397, 36643, 13401, 19037, -11291, -23143, -22192, -3917, 24612, 36199, -49309, 4326, 26133, -22205, -22259, -8459, 9665, 47661, 23534, 59373, 98180, 123744, 112376, 62547, 113221, 158176, 112036, 74337, 49049, 7112, -39339, -23809, 12257, 44004, 27879, 74246, 152811, 166018, 188003, 268585, 291045, 299155, 287776, 311829, 359168, 358322, 317385]
9407C17385o3649m8589m6468Q056j7380l3081k9118n9277j114Q3288R4947J2323
9395B17323q8855o2061m5301L0492O3206L5666m857n5646J3118o077j7032Q579
9383H8555j5431P3164K9863j2824k5173L750n614m899M5737N1142m1968o8970
9371A17332O400L2331K1922N1254L9584p8496j03873L88O6624M6131N058l5527
9359A69128M5085j1287k2013J6270k311m2124j2745p8246K956N0988L3193l5557
9347A13337p1094p4517o053P267K8484j1963O5930M6248o1756J1777L1560k5094
$$ y = [317385, 253736, 205147, 158679, 166735, 149355, 116274, 87156, 27879, 26765, 110053, 205000, 217323, 128468, 66407, 21106, 51598, 114804, 150470, 145613, 89967, 103085, 97008, 79976, 88555, 73124, 146288, 176151, 163327, 138154, 141904, 136290, 131391, 177128, 228270, 186302, 117332, 123732, 156063, 177985, 229239, 268823, 190327, 86454, 86842, 153466, 199597, 204655, 169128, 214213, 202926, 180913, 197183, 194872, 152748, 140003, 61757, 64713, 115701, 148894, 113337, 42243, -32274, -38327, -31060, -2576, -14539, 51391, 97639, 35883, 47660, 79220, 54126]
$$ [...]
##END NTUPLES=NMR SPECTRUM
##END=
