##TITLE=Analysis number 320213
Compound Code cc 56146
Book Reference 458/144
Project Code adrs
Chemist Name stevem
##JCAMPDX= 6.0         $$ Bruker NMR JCAMP-DX V2.0
##DATA TYPE= NMR SPECTRUM
##DATA CLASS= NTUPLES
##ORIGIN= Bruker BioSpin GmbH
##OWNER= nmr
$$ XWIN-NMR		Version 3.5
$$ Mon Jun 19 08:26:10 2006 GMT Daylight Time (UT+1h)  MAYBRIDGE\nmr@NMR_250MHZ
##.OBSERVE FREQUENCY= 250.131544655141
##.OBSERVE NUCLEUS= ^1H
##.ACQUISITION MODE= SIMULTANEOUS (DQD)
##.ACQUISITION SCHEME= undefined
##.AVERAGES= 16
##.DIGITISER RES= 18
##SPECTROMETER/DATA SYSTEM= dpx250
##.PULSE SEQUENCE= zg30
##.SOLVENT NAME= CDCl3
##.SHIFT REFERENCE= (INTERNAL, CDCl3, 0, 16.522)
##AUDIT TRAIL= $$ (NUMBER, WHEN, WHO, WHERE, WHAT)
$$ ##TITLE= Audit trail, XWIN-NMR		Version 3.5
$$ ##JCAMPDX= 5.01
$$ ##ORIGIN= Bruker BioSpin GmbH
$$ ##OWNER= nmr
$$ C:\u/data/dgb/nmr/ADRS/930/pdata/1/auditp.txt
$$ ##AUDIT TRAIL=  $$ (NUMBER, WHEN, WHO, WHERE, WHAT)
(   1,<2006-06-19 08:25:39.50 +100>,<MAYBRIDGE\nmr>,<NMR_250MHZ>,
      <created by zg, POWCHK disabled, PULCHK disabled
       configuration hash MD5:
       E2 DF 36 D8 04 B2 41 60 5A D7 A3 38 5A 4B D0 FE
       data hash MD5: 64K
       0D D7 3D BC 69 16 6D 51 59 0E 53 BD 88 AF 05 01>)
(   2,<2006-06-19 08:25:58.70 +100>,<MAYBRIDGE\nmr>,<NMR_250MHZ>,
      <Start of raw data processing
       ef LB = 0.3 FT_mod = 6 PKNL = 1 SI = 32K 
       data hash MD5: 32K
       C1 A5 D0 BC 5A 0F A6 70 6C 6D 89 50 3A 67 0B 6B>)
(   3,<2006-06-19 08:26:00.78 +100>,<MAYBRIDGE\nmr>,<NMR_250MHZ>,
      <apk 
       data hash MD5: 32K
       A1 92 A4 B9 13 6D 64 3A FC 8A B1 86 04 F1 16 D6>)
(   4,<2006-06-19 08:26:01.56 +100>,<MAYBRIDGE\nmr>,<NMR_250MHZ>,
      <abs ABSG = 5 
       data hash MD5: 32K
       4A A5 A9 C7 D1 56 CB CA 59 92 CD 5B 27 D1 4A 04>)
$$ ##END=
$$ 
$$ hash MD5
$$ 60 79 80 36 7A D5 5F FB 4A 79 E9 7C FD C7 1B AF
##$RELAX= 
##$RELAX= 
##$RELAX= 
##$RELAX= 
##$RELAX= 
##$RELAX= 
##$RELAX= 
$$ Bruker specific parameters
$$ --------------------------
##$DU= <C:\u>
##$EXPNO= 930
##$NAME= <ADRS>
##$PROCNO= 1
##$TYPE= <nmr>
##$USER= <dgb>
##$AMP= (0..31)
100 100 100 100 100 100 100 100 100 100 100 100 100 100 100 100 100 100 
100 100 100 100 100 100 100 100 100 100 100 100 100 100 
##$AQSEQ= 0
##$AQ_mod= 3
##$AUNM= <au_zg>
##$AUTOPOS= <4 >
##$BF1= 250.13
##$BF2= 250.13
##$BF3= 250.13
##$BF4= 250.13
##$BF5= 500.13
##$BF6= 500.13
##$BF7= 500.13
##$BF8= 500.13
##$BYTORDA= 1
##$CFDGTYP= 0
##$CFRGTYP= 5
##$CHEMSTR= <none>
##$CNST= (0..31)
1 1 145 1 1 1 1 1 1 1 1 1 1 1 1 1 1 1 1 1 1 1 1 1 1 1 1 1 1 1 1 1 
##$CPDPRG= <>
##$CPDPRG1= <>
##$CPDPRG2= <>
##$CPDPRG3= <>
##$CPDPRG4= <mlev>
##$CPDPRG5= <mlev>
##$CPDPRG6= <mlev>
##$CPDPRG7= <mlev>
##$CPDPRG8= <mlev>
##$CPDPRGB= <>
##$CPDPRGT= <>
##$D= (0..31)
0 1 0 0 0 0 0 0 0 0.06 0 0 0 0 0 0 0.0002 0 0 0 0 0 0 0 0 0 0 0 0 0 0 
0 
##$DATE= 1150701938
##$DBL= (0..7)
120 120 120 120 120 120 120 120 
##$DBP= (0..7)
150 150 150 150 150 150 150 150 
##$DBP07= 0
##$DBPNAM0= <>
##$DBPNAM1= <>
$$ [...]
##$SUBNAM7= <"">
##$SUBNAM8= <"">
##$SUBNAM9= <"">
##$SW= 20.6930455092707
##$SWIBOX= (0..15)
0 0 3 0 0 0 0 0 0 0 0 0 0 0 0 0 
##$SW_h= 5175.983436853
##$TD= 65536
##$TD0= 1
##$TE= 295.16
##$TE2= 300
##$TE3= 300
##$TEG= 300
##$TL= (0..7)
0 120 120 120 120 120 120 120 
##$TP= (0..7)
150 150 150 150 150 150 150 150 
##$TP07= 0
##$TPNAME0= <>
##$TPNAME1= <>
##$TPNAME2= <>
##$TPNAME3= <>
##$TPNAME4= <>
##$TPNAME5= <>
##$TPNAME6= <>
##$TPNAME7= <>
##$TPOAL= (0..7)
0.5 0.5 0.5 0.5 0.5 0.5 0.5 0.5 
##$TPOFFS= (0..7)
0 0 0 0 0 0 0 0 
##$TUNHIN= 0
##$TUNHOUT= 0
##$TUNXOUT= 0
##$USERA1= <user>
##$USERA2= <user>
##$USERA3= <user>
##$USERA4= <user>
##$USERA5= <user>
##$V9= 5
##$VALIST= <valist>
##$VCLIST= <CCCCCCCCCCCCCCC>
##$VD= 0
##$VDLIST= <DDDDDDDDDDDDDDD>
##$VPLIST= <PPPPPPPPPPPPPPP>
##$VTLIST= <TTTTTTTTTTTTTTT>
##$WBST= 1024
##$WBSW= 4
##$XGAIN= (0..3)
0 0 0 0 
##$XL= 0
##$YL= 0
##$YMAX_a= 359352
##$YMIN_a= -674365
##$ZGOPTNS= <>
##$ZL1= 120
##$ZL2= 120
##$ZL3= 120
##$ZL4= 120
##$ABSF1= 16.522
##$ABSF2= -4.171173
##$ABSG= 5
##$ABSL= 3
##$ALPHA= 0
##$AQORDER= 0
##$ASSFAC= 0
##$ASSFACI= 0
##$ASSFACX= 0
##$ASSWID= 0
##$AUNMP= <proc_1d>
##$AZFE= 0.1
##$AZFW= 0.1
##$BCFW= 0
##$BC_mod= 0
##$BYTORDP= 0
##$COROFFS= 0
##$CY= 12.5
##$DATMOD= 1
##$DC= 0
##$DFILT= <>
##$DTYPP= 0
##$F1P= 14.0000005364418
##$F2P= -0.99999901652339
##$FCOR= 0.5
##$FTSIZE= 32768
##$FT_mod= 6
##$GAMMA= 0
##$GB= 0
##$INTBC= 1
##$INTSCL= 1
##$ISEN= 128
##$LB= 0.3
##$LEV0= 0
##$LPBIN= 0
##$MAXI= 10000
##$MC2= 0
##$MEAN= 0
##$ME_mod= 0
##$MI= 0
##$NCOEF= 0
##$NC_proc= -4
##$NLEV= 6
##$NOISF1= 0
##$NOISF2= 0
##$NSP= 0
##$NTH_PI= 0
##$NZP= 0
##$OFFSET= 16.522
##$PC= 1
##$PHC0= 166.9476
##$PHC1= 12.64821
##$PH_mod= 1
##$PKNL= yes
##$PPARMOD= 0
##$PSCAL= 4
##$PSIGN= 0
##$REVERSE= no
##$SF= 250.13
##$SI= 32768
##$SIGF1= 0
##$SIGF2= 0
##$SINO= 400
##$SIOLD= 32768
##$SREGLST= <1H.CDCl3>
##$SSB= 0
##$STSI= 32768
##$STSR= 0
##$SW_p= 5175.98343685301
##$SYMM= 0
##$S_DEV= 0
##$TDeff= 65536
##$TDoff= 0
##$TI= <Analysis number 999999
Compound Code 99
Book Reference 9
Project Code 9>
##$TILT= no
##$TM1= 0
##$TM2= 0
##$TOPLEV= 0
##$USERP1= <user>
##$USERP2= <user>
##$USERP3= <user>
##$USERP4= <user>
##$USERP5= <user>
##$WDW= 1
##$XDIM= 32768
##$YMAX_p= 344509575
##$YMIN_p= -110358
$$ End of Bruker specific parameters
$$ ---------------------------------
##NTUPLES= NMR SPECTRUM
##VAR_NAME=  FREQUENCY,     SPECTRUM/REAL,   SPECTRUM/IMAG
##SYMBOL=    X,             R,               I
##VAR_TYPE=  INDEPENDENT,   DEPENDENT,       DEPENDENT
##VAR_FORM=  AFFN,          ASDF,            ASDF
##VAR_DIM=   32768,         32768,           32768
##UNITS=     HZ,            ARBITRARY UNITS, ARBITRARY UNITS
##FACTOR=    0.157963299565203, 1,           1
##FIRST=     4132.6476996994, 0,             0
##LAST=      -1043.33573715361, 0,           0
##MIN=       -1043.33573715361, -110358,     0
##MAX=       4132.6476996994, 344509575,     0
$$ Real data points
##PAGE= N=1
##DATA TABLE= (X++(R..R)), XYDATA
$$ [...]
16094a4423K015J903J1086J1806j5722k7091K9423K6047j2552k8109k1091k1681
$$ -14423 -12408 -10505 581 12387 -3335 -30426 -1003 25044 12492 -15617 -36708 -58389
16082e8389p293L7077K41J2508K1373O018j2333p383j4529j4837K571L7547J0958
$$ -58389 -65682 -28605 -28364 -15856 5517 11535 -798 -8181 -22710 -37547 -34976 2571 13529
16069A3529j2797j6343N974J653m335J972L489j214n537j5219m242n632r019k439
$$ 13529 732 -15611 -9637 -7984 -12319 -10347 -6858 -8072 -13609 -28828 -33070 -38702 -47721 -50160
16055e0160j0867K2053L0203J5971j1687n817K9481K1861j4519R066j1583l0987
$$ -50160 -61027 -38974 -8771 7200 -4487 -10304 19177 41038 26519 35585 24002 -6985
16043f985k3573J2919j3484J5414L8347j005J1292Q494K149M163k2363k1761q084
$$ -6985 -30558 -17639 -31123 -15709 22638 21633 32925 41419 43568 47731 25368 3607 -4477
16030d477K917J472k534m778j2344P327J5020r054P364J1508l2398l3099K302
$$ -4477 -1560 -88 -2622 -7400 -19744 -12417 2603 -6451 913 12421 -19977 -53076 -50774
16017e0774K5940L2569q39j3164j8663j3947L1796K5645k3961L194J8670l735
$$ -50774 -24834 7735 6896 -6268 -24931 -38878 -7082 18563 -5398 -2204 16466 12731
16005A2731K604J6272Q085p280o626R840j192Q541l2237m6678Q831M7185M8127
$$ 12731 15335 31607 39692 32412 25786 35626 34434 42975 10738 -35940 -27109 20076 68203
15992F8203P02j3245j698L657K5253K1274M0455L7797k036L2420Q035k6835N325
$$ 68203 68905 55660 53962 57619 82872 104146 144601 182398 180362 212782 220817 193982 199307
15979A99307j948J4245K1916l739j4498K708M0110M7016N9338J3860J8108R626
$$ 199307 197359 211604 233520 229781 215283 217991 258101 305117 364455 378315 396423 406049
15967D06049j9674k6294l25j4569l7950l6678p194k821o622M471k951R546K8654
$$ 406049 386375 360081 359756 345187 307237 270559 263365 260544 253922 258393 255442 264988 293642
15954B93642J2392m6086l0740k9614m2895j5281k7458l3839j7696n843K020M591
$$ 293642 306034 259948 229208 199594 156699 141418 113960 80121 62425 56582 58602 63193
15942F3193k4569j3018K7343P520J0420j0834k9736k8931j2224j736J8099l407
$$ 63193 38624 25606 52949 60469 70889 60055 30319 1388 -10836 -12572 5527 2120
15930B120J0343Q463J2561J2027j5944q449j7439K259j0869P18J322N904r095
$$ 2120 12463 20926 33487 45514 29570 21121 3682 5941 -4928 -4210 -2888 3016 -6079
15917f079j989K742q385j0521M6271M30j1267k461j1465P466K4030J8156j7777
$$ -6079 -8068 -5326 -13711 -24232 22039 22469 11202 8741 -2724 4742 28772 46928 29151
15904B9151k4241J3015J7156J6857P252k5378m4753k6393J0210j0149n7698J3752
$$ 29151 4910 17925 35081 51938 59190 33812 -10941 -37334 -27124 -37273 -94971 -81219
15892h1219L5405J6254Q164O53N028J320j3593Q097J3523P659M289r772j4235
$$ -81219 -45814 -29560 -21396 -20743 -15715 -14395 -27988 -19891 -6368 1291 5580 -4192 -18427
15879a8427k4461k513K7500K0696L7601O006k0657l7601m688O712l795P930K19
$$ -18427 -42888 -45401 -17901 2795 40396 46402 25745 -11856 -16544 -9832 -13627 -5697 -5478
15866e478q519M732M951J1984n953j0952J6581m789l059J4874N015j0460J3503
$$ -5478 -13997 -9265 -4314 7670 1717 -9235 7346 2557 -502 14372 19387 8927 22430
15853B2430Q068l069J9360j4943j7158k6094k6708j4749K1970L1635K6680j759
$$ 22430 30498 27429 46789 31846 14688 -11406 -38114 -52863 -30893 742 27422 25663
15841B5663j1692j5475j7855j0665k0894K6501K3845J0984j6662R560j4199j4930
$$ 25663 13971 -1504 -19359 -30024 -50918 -24417 -572 10412 -6250 3310 -10889 -25819
15829b5819O070j2605j0150K3617N769J6110j44j6097k1596K247L6189N981J7759
$$ -25819 -19749 -32354 -42504 -18887 -13118 2992 2848 -13249 -34845 -32598 3591 9572 27331
15816B7331k1110j3547K6768j9726k0143j0801J1345J9351l9115j0262j0022K3839
$$ 27331 6221 -7326 19442 -284 -20427 -31228 -19883 -532 -39647 -49909 -59931 -36092
15804c6092L2870J8334K7385J54M590l5551j6613J3733r955l6409J697J5748M24
$$ -36092 -3222 15112 42497 42651 47241 11690 -4923 8810 -1145 -37554 -35857 -20109 -19685
15791a9685J30J9629l0724k1151J3680K3192K2288P262k2451j7895M475J6150
$$ -19685 -19555 74 -30650 -51801 -38121 -14929 7359 14621 -7830 -25725 -21250 -5100
15779e100k2799j2365L031j0152Q693K1443r657l2232M498N942j2138n262j634
$$ -5100 -27899 -40264 -37233 -47385 -38692 -17249 -26906 -59138 -54640 -48698 -60836 -66098 -67732
15766f7732L8390M5055J5157j3319l502j8816k5970J9483R040k752N759l352q91
$$ -67732 -29342 15713 30870 17551 14049 -4767 -30737 -11254 -2214 -4966 793 -2559 -3450
15753c450J2492j1172Q12j754J7520K5342J8412J5830l7447m8172j4063k117O661
$$ -3450 9042 -2130 -1318 -3072 14448 39790 58202 74032 36585 -11587 -25650 -27767 -21106
15740b1106q026j0533M039p579k990L0425K0237P782k5097j0193K9063r115m472
$$ -21106 -29132 -39665 -35626 -43205 -46195 -15770 4467 12249 -12848 -23041 6022 -3093 -7565
15727g565P815J7763r843j1754n499J1465l603k4552J105M035R162j5158k31K944
$$ -7565 250 18013 8170 -3584 -9083 2382 -1221 -25773 -24668 -20633 -11471 -26629 -26860 -23916
15713b3916R248j5400j5556Q358j3248n542q405K4173K3995K0612M818k5072k0593
$$ -23916 -14668 -30068 -45624 -37266 -50514 -56056 -64461 -40288 -16293 4319 9137 -15935 -36528
15700c6528K326J3833K0584n135j0397n492J511K528P386l013m254l607J3658
$$ -36528 -34202 -20369 215 -4920 -15317 -20809 -19298 -16770 -9384 -12397 -16651 -20258 -6600
15687f600p449j8906P40k627M2528M187q604j6394j6917j6676K159R971L0826
$$ -6600 -14049 -32955 -32215 -34842 7686 11873 3269 -13125 -30042 -46718 -44559 -34588 -3762
15674c762p350j2464K283J4319J53K1997k3811j7411j2505J421O796K3871j463
$$ -3762 -11112 -23576 -21293 -6974 -6821 15176 -8635 -26046 -38551 -37130 -30334 -6463 -7926
15661g926j4019J2116L8143j6065l0773o251q213K2787L2664K8892R771k8749
$$ -7926 -21945 -9829 28314 12249 -18524 -24775 -32988 -10201 22463 51355 61126 32377
15649C2377k8523j4467l3957J2630J7300m832J7247J2067J5454r315l3453j1525
$$ 32377 3854 -10613 -44570 -31940 -14640 -19472 -2225 9842 25296 15981 -17472 -28997
15637b8997k4192P994J6966K950J9585j9384o112K646K2933J170p204P670J7717
$$ -28997 -53189 -45195 -28229 -25279 -5694 -25078 -31190 -28544 -5611 -4441 -11645 -3975 13742
15624A3742L6593k6293j8162J9586k437j3672j8885k970q600j9878q285K5346
$$ 13742 50335 24042 5880 25466 23029 9357 -9528 -12498 -21098 -40976 -49261 -23915
15612b3915K3255q62R825j9908k55l0114M83m270N110J9344K999p163j6780M522
$$ -23915 -660 -1522 8303 -11605 -11860 -41974 -41491 -45761 -40651 -21307 -18308 -25471 -42251 -37729
15598c7729K0491P460J1615o37r372J9273J9904M734J955K835Q189K0034O683
$$ -37729 -17238 -9778 1837 1200 -8172 11101 31005 35739 37694 40529 48718 68752 75435
15585G5435j7815j3379j9578j3398J0488j351j5733M698L8166j5065j9460j232
$$ 75435 57620 44241 24663 11265 21753 20402 4669 9367 47533 32468 13008 11776
15573A1776K1101j5646j3468J3839j6698k3768L025J2495L6130K8445o579m7239
$$ 11776 32877 17231 3763 17602 904 -22864 -19839 -7344 28786 57231 50652 3413
15561C413J404J0648J8901k6692l327n937k7509Q650J7392l786L416l0702j0229
$$ 3413 4817 15465 34366 7674 4347 -1590 -29099 -20449 -3057 -6843 -3427 -34129 -44358
15548d4358K9079j8964k1483J6241K8306L111N499k224n171J3433J8354R280J4862
$$ -44358 -15279 -34243 -55726 -39485 -11179 -8068 -2569 -4793 -9964 3469 21823 31103 45965
15535D5965p082J6497O668k2647p752L3488Q906l0530k4162j3552K6970k5473
$$ 45965 38883 55380 62048 39401 31649 65137 74043 43513 19351 5799 32769 7296
15523G296j7787o135J5226K8129n853P02K6772O233l6314N446K6987j8156k2703
$$ 7296 -10491 -16626 -1400 26729 20876 21578 48350 54583 18269 23715 50702 32546 9843
15510I843L771j4012O472J2236Q457J1456O206l7288k0430l8645p083K0888M4713
$$ 9843 13614 -398 6074 18310 26767 38223 44429 7141 -13289 -51934 -59017 -38129 6584
15497F584J3945m3804l0286K2946J0866R934K7132L164K569j4841l3738P42L331
$$ 6584 20529 -23275 -53561 -30615 -19749 -9815 17317 20481 23050 8209 -25529 -24787 -21456
15484b1456j5081j5360l481J9575J8146L0560K0718n203j742m314j8544L2970
$$ -21456 -36537 -51897 -55378 -35803 -17657 12903 33621 28418 26676 22362 3818 36788
15472C6788J3328j3608P623J436j6269K3306J8046K1829j6578l122L4258M4325
$$ 36788 50116 36508 44131 45567 29298 52604 70650 92479 75901 72779 107037 151362
15460A51362K4926J7751L0688L3224O2864O2970Q1040Q1344M5251J7396P2541
$$ 151362 176288 194039 224727 257951 320815 383785 464825 546169 591420 608816 681357
15449F81357J12076Q6108P1753M2242N1330L0268J8644p80o126m7293n4283p6979
$$ 681357 793433 879541 951294 993536 1044866 1075134 1093778 1092998 1086872 1039579 985296 908317
15437I08317r9573m9533m5225o8518m5849m1020m9566o1403k5324l0031l1069
$$ 908317 808744 759211 713986 645468 599619 558599 509033 447630 422306 392275 361206
15426C61206p0111k7313o872j3774r538r614l33N319k8086j5791k1654k4161l1593
$$ 361206 291095 263782 256910 243136 233598 223984 223651 228970 200884 185093 163439 139278 107685
15413A07685M680k043r583j8866J990K7666J0628k2084j8868j6728m721J2243
$$ 107685 112365 110322 100739 81873 83863 111529 122157 100073 81205 64477 59756 71999
15401G1999L974j7991k648j4585R301L836J472N959j3835j1651J1439J9680n982
$$ 71999 75973 57982 55334 40749 50050 53886 55358 61317 47482 35831 47270 66950 60968
15388F0968J81k9497k5513J8465K890n751m009r22j0914O808j1082K5229K091
$$ 60968 61149 31652 6139 24604 27494 21743 17734 16812 5898 12706 1624 26853 28944
15375B8944p01J650l7907J304J9782Q163J2154o904l3841o914K7925J7637j4857
$$ 28944 28243 29893 -8014 -6710 13072 21235 33389 26485 -7356 -14270 13655 31292 16435
15362A6435j1028J0026R231l863l777M058K0808M465p354p497j4626k1028K079
$$ 16435 5407 15433 24664 20801 17024 21082 41890 46355 39001 31504 16878 -4150 -2071
15349b071k7744j7000J8532K4273J4141M883q513K3412K4868j5518l6484k7910
$$ -2071 -29815 -46815 -28283 -4010 10131 15014 6501 29913 54781 39263 2779 -25131
15337b5131L486q05P445K9327J2497Q150o077k786n779M712K258J8150m219l8656
$$ -25131 -21645 -22450 -15005 14322 26819 34969 28892 26106 20327 25039 27297 45447 41228 2572
15323B572J4862K905j2575L1515N625j4107j5060k2512O763J4094r860R057J2657
$$ 2572 17434 20339 7764 39279 44904 30797 15737 -6775 -12 14082 4222 13279 25936
15310B5936M014l591m458J6691J663j4921l5287J6362J4418k2517j2566J6902
$$ 25936 29950 26359 21901 38592 40255 25334 -9953 6409 20827 -1690 -14256 2646
15298B646K303m417M183K9316K693J3786J5907j1278k6516p056L2414m293Q004
$$ 2646 4949 532 4715 34031 36724 50510 66417 55139 28623 21567 53981 49688 57692
15285E7692J0752K0425q314l3308J8282J6456j026j4153J7973Q453J1931K0788
$$ 57692 68444 88869 80555 47247 65529 81985 80959 66806 84779 93232 105163 125951
15273A25951l428K0672J3402N155J0408L0079J6927L851K7272J0680K2012M6403
$$ 125951 122523 143195 156597 161752 172160 202239 219166 223017 250289 260969 282981 329384
15261C29384L7458L5956M2561N2605M8518J00Q874K7999J1954J7358L443k3645
$$ 329384 366842 402798 445359 497964 546482 546582 555456 583455 595409 612767 616210 592565
15249E92565l1674k7609l1026m6773k6864m4930n7800l5154k7874k8573l3062
$$ 592565 560891 533282 502256 455483 428619 383689 325889 290735 262861 234288 201226
15238B01226j0695J5667j0784j3649q179M595q698k6342r608M33J3463k404p847
$$ 201226 190531 206198 195414 181765 173586 178181 169483 143141 133533 133966 147429 145025 137178
15225A37178j7306m129L665J0774O315k5325n3016j0225j3404K1238L640L056
$$ 137178 119872 115743 119408 130182 136497 111172 58156 47931 34527 55765 59405 62461
15213F2461J0258k0717J0665l817O464J219J661L0943j4245N235N69L459k0383
$$ 62461 72719 52002 62667 58850 65314 66533 68194 99137 84892 90127 90696 94155 73772
15200G3772m1468K6137K6198J2505Q075J091j0118j7303m493K4089M275l2276
$$ 73772 32304 58441 84639 97144 105219 106310 96192 78889 74396 98485 102760 70484
15188G0484j2049k3680n923J9274j5803L0421M6180J5230R241k0556J793J3147
$$ 70484 58435 34755 28832 48106 32303 62724 108904 124134 133375 112819 114612 127759
15176A27759l908M0901J1290j3511L841J0573K87o943o132j792K8494j6080j2763
$$ 127759 123851 164752 176042 162531 166372 176945 177232 170289 164157 162365 190859 174779 162016
15163A62016K2238r235j7223n508Q294K678R126P981L1376L3682K6985n62k3444
$$ 162016 184254 175019 157796 152288 160582 163260 172386 180367 211743 245425 272410 271848 248404
15150B48404L4812n4K2697j7993j8369M2044K7223K7118J2962K879M7013M4012
$$ 248404 283216 283162 305859 287866 269497 311541 338764 365882 378844 381723 428736 472748
15138D72748M4819O5356J359J3222N4756J8988K1915K0713Q707O505J4839k032
$$ 472748 517567 582923 584282 597504 652260 671248 693163 713876 722583 729088 743927 741895
15126G41895q622P235L6011N110k2908K371j0738J1020L4813l3201m2746k3222
$$ 741895 733273 740508 776519 781629 758721 761092 750354 761374 796187 762986 720240 697018
15114F97018m431J3237Q108K6195K9507K2718j412N465R474K2461K3717p513l38
$$ 697018 692587 705824 713932 740127 769634 792352 790940 796405 805879 828340 852057 844544 844206
15101H44206j1691L649J3599R055k2486J6201J3872L7073L5333J1423K7403K7550
$$ 844206 832515 836164 849763 858818 836332 852533 866405 903478 938811 950234 977637 1005187
15089A005187L2789M3048L4280J8112K4545j8727j1184N668M7716L1646K5111
$$ 1005187 1037976 1081024 1115304 1133416 1157961 1139234 1128050 1133718 1181434 1213080 1238191
15078A238191N2296O9354K8848K6987K9572M7346P6223N1276M0676N6214O0059
$$ 1238191 1290487 1359841 1388689 1415676 1445248 1492594 1568817 1620093 1660769 1716983 1777042
15067A777042Q1671N1844M8263N9649L4611P0534R3976R4010J02015O7894J00166
$$ 1777042 1858713 1910557 1958820 2018469 2053080 2123614 2217590 2311600 2413615 2481509 2581675
15056B581675R6027J16620J18846Q7423J24422J46462J67330J93254J87149J87725
$$ 2581675 2677702 2794322 2913168 3000591 3125013 3271475 3438805 3632059 3819208 4006933
15046D006933J83946K53035K78851K89227K82320L29234L39926M03591M56733
$$ 4006933 4190879 4443914 4722765 5011992 5294312 5623546 5963472 6367063 6823796
15037F823796N10629N62863O00655O74625P52536Q75001R92862J133301J289957
$$ 6823796 7334425 7897288 8497943 9172568 9925104 10800105 11792967 12926268 14216225
15028A4216225J522872J727572K060355K438007K820860L301584L928751M628679
$$ 14216225 15739097 17466669 19527024 21965031 24785891 28087475 32016226 36644905
15020C6644905N394466O354217P397324Q578219R924692J1357789J2888966J4309253
$$ 36644905 42039371 48393588 55790912 64369131 74293823 85651612 98540578 112849831
15012A12849831J5420679J6140904J6253510J5630505J4117769J1689898Q490122
$$ 112849831 128270510 144411414 160664924 176295429 190413198 202103096 210593218
15005B10593218M730946P81592l112137o751135r761181j1991591j3379306j3943160
$$ 210593218 215324164 216105756 212993619 206242484 196481303 184489712 171110406 157167246
14997A57167246j3755107j3095552j2091014j0894946r722223q615017p690520
$$ 157167246 143412139 130316587 118225573 107330627 97608404 88993387 81302867
14990H1302867o914215o225935n653456n139215m640345m174816l776358l347833
$$ 81302867 74388652 68162717 62509261 57370046 52729701 48554885 44778527 41430694
14982D1430694k956209k648774k297587k095488j881424j692210j510108j406732
$$ 41430694 38474485 35825711 33528124 31432636 29551212 27859002 26348894 24942162
14974B4942162j285140j178606j120586r94055q94186q72248q25205p63238p42758
$$ 24942162 23657022 22478416 21357830 20363775 19469589 18597341 17772136 17008898 16266140
14965A6266140o70397o42604o17410n86155n53108m70085m65202m23584m14664
$$ 16266140 15595743 14953139 14335729 13749574 13196466 12726381 12261179 11837595 11422931
14956A1422931l89047l79503l45979l39497l22651l20280k84601l09838k95884
$$ 11422931 11033884 10654381 10308402 9968905 9646254 9325974 9041373 8731535 8435651
14947H435651k78362k33303k32996k33475k28223k57358k02605j64252j83916
$$ 8435651 8157289 7923986 7690990 7457515 7229292 6971934 6769329 6605077 6421161
14938F421161j61990j46290j46917j41874j46576j69890j69490j56433j44956
$$ 6421161 6259171 6112881 5965964 5824090 5677514 5507624 5338134 5181701 5036745
14929E036745j41240j36651j30667j46861j47101j62560j62949j31316j60160
$$ 5036745 4895505 4758854 4628187 4481326 4334225 4171665 4008716 3877400 3717240
14920C717240j47881j20609j15752j61972j63763j12123j01378j29253j10512
$$ 3717240 3569359 3448750 3332998 3171026 3007263 2895140 2793762 2664509 2553997
14911B553997r1391q5423j18586j16739q1689m7972k3710n6863p0444q3911q5017
$$ 2553997 2462606 2377183 2258597 2141858 2060169 2012197 1988487 1931624 1861180 1777269 1692252
14900A692252p4372o4442l9889m3301m2755l4052k0120r055k6310p666J2414K638
$$ 1692252 1617880 1553438 1513549 1470248 1427493 1393441 1373321 1364266 1337956 1330290 1342704 1345342
14888A345342j1581j7043l4045l2097j4011o188l5589N724O872n935j4837n625
$$ 1345342 1333761 1316718 1282673 1250576 1236565 1230377 1194788 1200512 1207384 1201449 1186612 1180987
14876A180987r032j7587j6380n179o16J8384Q273j5829k8116k6105k1905m4041
$$ 1180987 1171955 1154368 1137988 1132809 1132193 1150577 1158850 1143021 1114905 1088800 1066895 1022854
14864A022854m0673o873J233j1572K450j2185l301p443l9989l1028j9941k5175
$$ 1022854 982181 975308 976541 964969 967419 955234 951933 944490 904501 873473 853532 828357
14852H28357l5882j1111J618R447K1329j541j7843m489l106Q318K0912m7465l428
$$ 828357 792475 781364 782982 792429 813758 812217 794374 789885 786779 795097 816009 768544 765116
14839G65116J1064J4909J3952k6133q848K4919P918J7845K5465J0047k5934k397
$$ 765116 776180 791089 805041 778908 770060 794979 802897 820742 846207 856254 830320 827923
14827H27923j7381j7392Q90n850j7447q814j9154j3349q182J5313l4359P15m992
$$ 827923 810542 793150 794040 788190 770743 761929 742775 729426 721244 736557 702198 702913 697921
14814F97921J4197J2946m0657l4332N729J2022R975O318L565J467j0506k9413
$$ 697921 712118 725064 684407 650075 655804 667826 677801 684119 687684 689151 678645 649232
14802F49232r737L2722L1057Q880j5092j1549Q397K8984M217J3801r672j5171
$$ 649232 639495 672217 703274 712154 697062 685513 693910 722894 727111 740912 731240 716069
14790G16069L0046l4224k2510m267j2599k1738M800j2000n2714j9858o3176m5604
$$ 716069 746115 711891 689381 685114 672515 650777 655577 643577 590863 571005 507829 462225
14778D62225l354M017N72J2739j8317j242J0536p851J4512K907o574k4140l0399
$$ 462225 458871 462888 463460 476199 457882 456640 467176 459325 473837 476744 470170 446030 415631
14765D15631k2248M764J5168R057L80m359P340k2008j6931j2323j8674Q986p286
$$ 415631 393383 398147 413315 422372 422752 418393 425733 403725 386794 374471 355797 364783 357497
14752C57497j5786r443k6142n959j6000j7756r294K5531j4524j1160J6847j2199
$$ 357497 341711 332268 306126 300167 284167 266411 257117 282648 268124 256964 273811 261612
14740B61612j7730q079K478L731j1079M03O809L1098N975K146p702k4242p056
$$ 261612 243882 235803 238281 242012 230933 231336 238145 269243 275218 277364 269662 245420 238364
14727B38364q949j8762j2530J9266K1654j8498l3833k1198j994K0967P659k603
$$ 238364 229415 210653 198123 217389 239043 220545 186712 165514 163520 184487 192146 189543
14715A89543K0517L104o7J0260K5148p75n1274j5400m21j7155K370K5215j9558
$$ 189543 210060 213164 213097 223357 248505 247730 196456 181056 180635 163480 165850 191065 171507
14702A71507q87l37j4097j309j1825K4939L1322J3971k3310J9281M936k2724k934
$$ 171507 170620 170283 156186 154877 143052 167991 199313 213284 189974 209255 214191 191467 188533
14689A88533m6517r803j5479m432K3802J6182J344J5938n975j9337k8696j5447
$$ 188533 142016 132213 116734 112302 136104 152286 153630 169568 163593 144256 115560 100113
14677A00113J9930L2517L030l5282m670J1773m465m083k4983M938K2587Q996J399
$$ 100113 120043 152560 155590 120308 115638 127411 122946 118863 93880 98818 121405 130401 131800
14664A31800K352P473k1510m5633j8908K3169R254j6885L8375m987j6772J8445
$$ 131800 134152 141625 120115 74482 55574 78743 87997 71112 109487 104500 87728 106173
14652A06173K4244j5579l1266K4400L0241r301L6403J4319j0618q144R215l1647
$$ 106173 130417 114838 83572 107972 138213 128912 165315 179634 169016 160872 170087 138440
14640A38440r572J983r578j3714L515J7201J704K49j0149K1879j9013k2033p86
$$ 138440 128868 130851 121273 107559 111074 128275 129979 130228 120079 141958 122945 100912 100126
14627A00126L3061l129l6511o696l470j5420J090K2656l240J0104k133L078J2421
$$ 100126 133187 130058 93547 86851 83381 67961 69051 91707 88467 98571 96438 99516 111937
14614A11937J0727O70k1350j2752J4501j0813J202J5630J9822o875l5287k4570
$$ 111937 122664 123334 101984 89232 103733 92920 94122 109752 129574 122699 87412 62842
14602F2842J5329M1222P01j7772k201q453p807r486R724L526O907J6714J947N414
$$ 62842 78171 119393 120094 102322 100121 91668 83861 74375 84099 87625 94532 111246 113193 118607
14588A18607J1875L2281R824p173o312k1469r98J8744J8700J8192o952J9058N1520
$$ 118607 130482 162763 172587 165414 159102 137633 136635 155379 174079 192271 185319 204377 255897
14575B55897L2631M6431P2267M0871O2992N5298P8992R3872O6720O6211Q2503
$$ 255897 288528 334959 407226 448097 511089 566387 645379 739251 805971 872182 954685
14564I54685P2933O0941M4124K8781p571J0940r707o1793m8823p1310n5658m6531
$$ 954685 1027618 1088559 1132683 1161464 1153893 1164833 1155126 1093333 1044510 973200 917542 871011
14552H71011q2340o0543m9499o5291p9934k4368j5730l1328m1504m5815l9454
$$ 871011 788671 728128 678629 613338 533404 509036 493306 461978 420474 374659 335205
14541C35205k2536k8001r089l2510j9010l154j6941k8754O422K707L8047j3571
$$ 335205 312669 284668 275579 243069 224059 220905 203964 175210 181632 184339 222386 208815
14529B08815l9538K0637l473k1457p391k049J8288l4588j3924m542j0835P456
$$ 208815 169277 189914 186441 164984 157593 155544 173832 139244 125320 120778 109943 117399
14517A17399J6356J4697n005j0291j2431r068j446k0140J8960J9279k6493n16
$$ 117399 133755 148452 143447 133156 120725 111657 110211 90071 109031 128310 101817 101301
14505A01301K875l4152l3248L598J6205L4745p220m189n989l550M377L480M315
$$ 101301 104176 70024 36776 40374 56579 91324 84104 79915 73926 70376 74753 78233 82548
14492H2548k1436k9527j1874R565J0760k701l059O383J4285K943n492K117k2656
$$ 82548 61112 31585 19711 29276 40036 37335 34276 40659 54944 57887 52395 54512 31856
14479C1856n865k4844K992j1613k411J1779M4347j4147n185J8519k4138k4670
$$ 31856 25991 1147 4139 -7474 -9885 1894 46241 32094 26909 45428 21290 -3380
14467c380N786K0149j1725K101K2483N201J0543q062o125J5553m73n0929k8073
$$ -3380 2406 22555 10830 12931 35414 40615 51158 43096 36971 52524 52051 1122 -26951
14454b6951K0579K9034K9621K4079n223p261l5412j282L25O436l472m67j4177
$$ -26951 -6372 22662 52283 76362 71139 63878 28466 27184 27509 33945 30473 30006 15829
14441A5829k0981m73L416K7858N031k0492n497J7024J1516Q327R487j506j8486
$$ 15829 -5152 -5625 -2209 25649 30680 10188 4691 21715 33231 41558 51045 49539 31053
14428C1053K401J4950L1270N423j689k4347j9297k4296N647J7771P708q818j6004
$$ 31053 33454 48404 79674 85097 83408 59061 39764 15468 21115 38886 46594 37776 21772
14415B1772j8842j896j8841j1801L0342j8871j5754J2126K6189k551j8195R757
$$ 21772 2930 1034 -17807 -29608 734 -18137 -33891 -21765 4424 1873 -16322 -6565
14403f565J8464J056l9030j6214N031J985K5945N913K880J4797o031j3588J6088
$$ -6565 11899 12955 -26075 -42289 -37258 -35273 -9328 -3415 -535 14262 8231 -5357 10731
14390A0731Q235j1550q274q35r473q750L9537K7842M465k9398j5725P082j5132
$$ 10731 18966 7416 -858 -1693 -11166 -19916 19621 47463 51928 22530 6805 13887 -1245
14377a245P406Q384J9924K0080J8537K0963j5078k5159j481l4101l506Q029L0617
$$ -1245 6161 14545 34469 54549 73086 94049 78971 53812 52331 18230 14724 22753 53370
14364E3370J4653J3039N497j5369k6632N212K0527j1977k0370k876Q74K0635M376
$$ 53370 68023 81062 86559 71190 44558 49770 70297 58320 37950 35074 35948 56583 60959
14351F0959Q158J303k8068k5544J888M8044L979m0871l1842N894K6421j934P88
$$ 60959 69117 70420 42352 16808 18696 66740 70719 29848 -1994 3900 30321 28387 29175
14338B9175M198j4301L0409m683j9888K9090j004l4577j962J2227P398J0892k502
$$ 29175 33373 19072 49481 44798 24910 54000 52996 18419 16457 28684 36082 46974 44472
14325D4472j3646J0868m536k8495j914j885k5971J5941j415m150r588m119R617
$$ 44472 30826 41694 37158 8663 6749 4864 -21107 -5166 -6581 -10731 -20319 -24438 -14821
14312a4821L9155K8543q789r14j6532q094n162K1834l628O662L226l1917Q39K3140
$$ -14821 24334 52877 44088 43174 26642 18548 13386 35220 31592 38254 41480 9563 10402 33542
14298C3542K7322p200O322r954J946o396m679j7281J3504J6158R817j3513O35
$$ 33542 60864 53664 59986 50032 51978 45582 40903 23622 37126 53284 63101 49588 50223
14285E0223k3929j8418M413J702O814P519k3953O0M8509l823p950j0182K289k3120
$$ 50223 26294 7876 12289 13991 20805 28324 4371 4431 52940 49117 41167 30985 33274 10154
14271A0154J350J6179J2776J5258J230k2258k8164r526J9458j2052n983P309o864
$$ 10154 11504 27683 40459 55717 56947 34689 6525 -3001 16457 4405 -1578 5731 -1133
14258a133k8794N460J5782k6911K4687L3211j3089J1542j9740Q994l410k2822
$$ -1133 -29927 -24467 -8685 -35596 -10909 22302 9213 20755 1015 10009 6599 -16223
14246a6223o730l1673q567K6188L4344L789O844l302N347K3503r651k7268k6542
$$ -16223 -22953 -54626 -63193 -37005 -2661 1128 7972 4670 10017 33520 23869 -3399 -29941
14233b9941j5766K4369q699K9344K2009J8386K5497o1704m0776k0283K6071P974
$$ -29941 -45707 -21338 -30037 -693 21316 39702 65199 3495 -37281 -57564 -31493 -23519
14221b3519R271o298L2844K4014J5104L12k6746j2153J0359p299q471o928l0905
$$ -23519 -14248 -20546 12298 36312 51416 51728 24982 12829 23188 15889 7418 490 -30415
14208c0415j1377K0107J0867n878K2515J4760J8643j4294j1973q329K6350J8885
$$ -30415 -41792 -21685 -10818 -16696 5819 20579 39222 24928 12955 4626 30976 49861
14196D9861J8135k4270k5165j302k7770k2139J4531Q556K3652L861M207J2731
$$ 49861 67996 43726 18561 17259 -10511 -32650 -18119 -9563 14089 17950 22157 34888
14184C4888L979n445l0053L261l015l805J2166k360l570j2019K4153J0251n786
$$ 34888 38867 33422 3369 6630 3615 -190 11976 9616 6046 -5973 18180 28431 22645
14171B2645J2377L0727K999j2311p128M6K5526j0114k1183n661j442j1202J6704
$$ 22645 35022 65749 68748 56437 49309 49355 74881 64767 43584 37923 36481 25279 41983
14158D1983l1366r673K4105p881j4436k2171K4083L1762j6048l8406J6038J4024
$$ 41983 10617 944 25049 17168 2732 -19439 4644 36406 20358 -18048 -2010 12014
14146A2014l5477L27L1949J3193j4510J0051K4523M656k1852J4935j3675j4578
$$ 12014 -23463 -23136 8813 22006 7496 17547 42070 46726 24874 39809 26134 11556
14134A1556j0886n845J2059J8436m359j321j1158p236l713J7162K3454K9197m931
$$ 11556 670 -5175 6884 25320 20961 19640 8482 1246 -2467 14695 38149 67346 62415
14121F2415l7508k2738j1851n661L8186L5881m1794m5266j1786L650J1346M568
$$ 62415 24907 2169 -9682 -15343 22843 58724 16930 -28336 -40122 -36472 -25126 -20558
14109b0558Q571K329o271o070J409k6941j8261J1148J9885K4939R9p29J8558K4113
$$ -20558 -11987 -9658 -15929 -21999 -20590 -47531 -65792 -54644 -34759 -9820 -9721 -10450 8108 32221
14095C2221j8219k0172N933O605R981J0116k5592n248m943l769J72L339K1473
$$ 32221 14002 -6170 -237 6368 16349 26465 873 -4375 -9318 -13087 -12915 -9576 11897
14082A1897K5228N411k3319n426j5388o687K7934J0192m907n562k0040j8503J9549
$$ 11897 37125 42536 19217 13791 -1597 -8284 19650 29842 24935 19373 -667 -19170 379
14069C79K8925K2420K435l95j1189l8681J1072p164j9708o046J2040j9127j8691
$$ 379 29304 51724 54159 53764 42575 3894 14966 7802 -11906 -17952 -5912 -25039 -43730
14056d3730n10K8373K3239J479k539j4287p328P892L3212J5023l9038j5811j7037
$$ -43730 -44240 -15867 7372 8851 6312 -7975 -15303 -7411 25801 40824 1786 -14025 -31062
14043c1062r630K0658j6054r239j0686L4999K8465J4669J9256J6257l411J1954
$$ -31062 -40692 -20034 -36088 -45327 -56013 -21014 7451 22120 41376 57633 54222 66176
14031F6176J5615M261j1183k3933j8613k1854j5980m482j3359K7916L3788J3352
$$ 66176 81791 86052 74869 50936 32323 10469 -5511 -9993 -23352 4564 38352 51704
14019E1704J5322J831K0053O36k1939j1991l2235k1538K8028J0341J479K8217
$$ 51704 67026 68857 88910 89546 67607 55616 23381 1843 29871 40212 41691 69908
14007F9908J3883q590l459K3126J5499k7287k4453L467L0300j0422Q437J5643
$$ 69908 83791 75201 71742 94868 110367 83080 58627 62094 92394 81972 90409 106052
13995A06052M162m685k7516j0496P992j5547K2097J9224p819j158j1279P218K0610
$$ 106052 110214 105529 78013 67517 75509 59962 82059 101283 93464 92306 81027 88245 108855
13982A08855J61n385R678L6930K3680P158l3680r821L5544M929p990J0178J587
$$ 108855 109016 103631 113309 150239 173919 181077 147397 137576 173120 178049 170059 180237 181824
13969A81824l7523j5044M3361R790l494k5015j1686K5082M0183J7105l786J6606
$$ 181824 144301 129257 172618 182408 178914 153899 142213 167295 207478 224583 220797 237403
13957B37403J9194J7998L0392N630J7850K3116K1522K0746K3627M0022L0914P2426
$$ 237403 256597 274595 304987 310617 328467 351583 373105 393851 417478 457500 488414 560840
13945E60840Q3981O1600L8875P6175R7501P8210J14629J49080J70091J76335K34767
$$ 560840 644821 706421 745296 821471 918972 997182 1111811 1260891 1430982 1607317 1842084
13934A842084K66768L05384L49829M40645N68879O86670Q18726R49538J044687
$$ 1842084 2108852 2414236 2764065 3204710 3773589 4460259 5278985 6228523 7273210
13925G273210J096654J132826J068538R94266Q20916N79271K78854r850l21344
$$ 7273210 8369864 9502690 10571228 11565494 12386410 12965681 13244535 13234685 12913341
13916A2913341n89841p50187q98037r56813j015567r83670r01263p70329o77293
$$ 12913341 12323500 11573313 10675276 9718463 8702896 7719226 6817963 6047634 5370341
13907E370341o06713n02489m31992l67627k63632k26625k28022k25320k00303
$$ 5370341 4763628 4261139 3829147 3461520 3197888 2971263 2743241 2517921 2317618
13898B317618j36820r5441j28559j07315j11723q3233n7262p0508o2977p4036
$$ 2317618 2180798 2085357 1956798 1849483 1737760 1654527 1597265 1526757 1463780 1389744
13888A389744n9254k4262n4511k1706P082L196k8099j7728J9351R898o278l8833
$$ 1389744 1330490 1306228 1251717 1230011 1237093 1240289 1212190 1194462 1213813 1223711 1217433 1178600
13876A178600l7700j6193m7365m4591q2956n0107p7626p6323m1878m4270k5630
$$ 1178600 1140900 1124707 1077342 1032751 949795 899688 822062 745739 703861 659591 633961
13865F33961j708o736m1622k7275j0976k1696k3151m661j5604p093n755n2804
$$ 633961 632253 625517 583895 556620 545644 523948 500797 496136 480532 473439 467684 414880
13853D14880l8939j0151R565J353M880j0478j4771k7781j2293k0341j0045m597
$$ 414880 375941 365790 375355 376708 381588 371110 356339 328558 316265 295924 285879 281282
13841B81282J144N839p854p839k880p472m0867j2700k5261J6214M373l468J7201
$$ 281282 282426 288265 280411 272572 269692 262220 221353 208653 183392 199606 203979 200511 217712
13828B17712q590l0072j5515j122k2348j1802l003P018K905j9630k1391L586N175
$$ 217712 209122 179050 163535 162413 140065 128263 125260 132278 135183 115553 94162 97748 102923
13815A02923k7863k1655L3068M725L037J4722P604j38k6531m894j9900Q9K135
$$ 102923 75060 53405 86473 91198 94235 108957 116561 116423 89892 84998 65098 65187 67322
13802F7322q700L730J9937o13j3973k9451j0541q068j1728j1267j3417M9278m163
$$ 67322 58622 62352 82289 81676 67703 38252 27711 19643 7915 -3352 -16769 32509 28346
13789B8346m779o859J773J408M2524J0491n4310j2071n552N444p45n428N984K3210
$$ 28346 23567 16708 18481 19889 62413 72904 18594 6523 971 6415 5670 242 6226 29436
13775B9436M517j949j9109K7169J5116q825k5461k5532L472J765j8582J7058L040
$$ 29436 33953 32004 12895 40064 55180 46355 20894 -4638 -1166 599 -17983 -925 2115
13762B115K263P439K7202j6662k2001J8755J9395p175k1176k2831n879K5319K7536
$$ 2115 4378 11817 39019 22357 356 19111 38506 31331 10155 -12676 -18555 6764 34300
13749C4300K5174k212j5970M473J4766m634P591K5496j3137n1047m2409J5799
$$ 34300 59474 57262 41292 45765 60531 55897 63488 88984 75847 24800 -17609 -1810
13737a810J3427k1498r297L7320k729J09J8133j2373J664q245l940m94j4293J8526
$$ -1810 11617 -9881 -19178 18142 15413 15522 33655 21282 22946 14701 10761 10267 -4026 14500
13723A4500J3427r102m551J2100J4285J682J6879J1802k0212p965k684m0268j1474
$$ 14500 27927 18825 14274 26374 40659 42341 59220 71022 50810 42845 40161 -107 -11581
13710a1581K6634J3118J592L3391O132k954j0273K0182N669k6247q510J1831n173
$$ -11581 15053 28171 29763 63154 69286 66332 56059 76241 81910 55663 47153 58984 53811
13697E3811j9836J5892J8942j8005j0871j4774q664N38L3262J2157j0953q135
$$ 53811 33975 49867 68809 50804 39933 25159 16495 17033 50295 62452 51499 43364
13685D3364j2020k344k4903O037k1004j1960j949J9767J3760L0829j3964n0007
$$ 43364 31344 29000 4097 10134 -10870 -22830 -24779 -5012 8748 39577 25613 -24394
13673b4394l8311K0462J9786L0966L08l232k6697j1542J3066J4834J2699K9255
$$ -24394 -62705 -42243 -22457 8509 8817 5585 -21112 -32654 -19588 -4754 7945 37200
13661C7200j701k2860N011Q960j4856l912K2044K1795l951k2986l4484j6784J5839
$$ 37200 35499 12639 17650 26610 11754 7842 29886 51681 47730 24744 -9740 -26524 -10685
13648a0685K0093P799j4913j2480J0727J5049L616j6274j8418K257P08k2603K0165
$$ -10685 9408 17207 2294 -10186 541 15590 19206 2932 -15486 -13229 -12521 -35124 -14959
13635a4959K3573K4022j1924J1378J1182j0821o884O292j7369l6718J567N037
$$ -14959 8614 32636 20712 32090 43272 32451 25567 31859 14490 -22228 -20661 -15624
13623a5624J796o630J4282L4057K5503j7538l5421J2483K4483J1491J185k9172
$$ -15624 -13828 -20458 -6176 27881 53384 35846 425 12908 37391 48882 50067 20895
13611B0895M307j9292J0065q024j3638J504M114J5760j0659p41M1587m265j4256
$$ 20895 25202 5910 15975 7951 -5687 -4183 -69 15691 5032 4291 45878 41613 27357
13598B7357O568L34O581m7316K280K4027K6749m512k3887O478J4587k1970o939
$$ 27357 33925 34259 40840 -6476 -4196 19831 46580 42068 18181 24659 39246 17276 10337
13585A0337L1040p913r159m9895l2851K3999K5721K3063K9383J884l2081k0146
$$ 10337 41377 33464 24305 -25590 -58441 -34442 -8721 14342 43725 45609 13528 -6618
13573f618k161k7402J9326N875J8748k2108m0879N283L2696K3188J7347P930k574
$$ -6618 -8779 -36181 -16855 -10980 7768 -14340 -55219 -49936 -17240 5948 23295 31225 28651
13560B8651r040o467P983K1030r642o246j1094J7617k0696k4451k5839n394q521
$$ 28651 19611 13144 21127 42157 32515 26269 15175 32792 12096 -12355 -38194 -43588 -52109
13547e2109m966M1618P747j5735K8167J8319k0005n908R208K221J1729P300o172
$$ -52109 -57075 -15457 -7710 -23445 4722 23041 3036 -2872 6336 8557 20286 27586 21414
13534B1414p024J2585Q245J9092J2987k1763n914J2025L172j7039p039k900j0437
$$ 21414 14390 26975 35220 54312 67299 45536 39622 51647 54819 37780 30741 27841 17404
13521A7404j3854p93r867J3317J3917J128J3034J8929q680P757J9258j7890j1914
$$ 17404 3550 2757 -7110 6207 20124 21252 34286 53215 44535 52292 71550 53660 41746
13508D1746j931q384J5901P835m314q228K7160N384j3753k4053r126K3314M795
$$ 41746 39815 31431 47332 55167 50853 42625 69785 75169 61416 37363 28237 51551 56346
13495E6346O656j6036j4011j0655j331O6888j473n5890r89J7104J9643L5536J4872
$$ 56346 63002 46966 32955 22300 20969 87857 86384 30494 29505 46609 66252 101788 116660
13482A16660Q145n402l7488j934M6303J8788l1735j6467M101N120L3903K4262
$$ 116660 124805 119403 81915 79981 126284 145072 113337 96870 100971 106091 139994 164256
13470A64256j083q97K3199N852K8869K4894L170J7850k1348m3100j6196K3843
$$ 164256 163173 162276 185475 191327 220196 245090 248260 266110 244762 201662 185466 209309
13458B09309k29n546K5777R878m601N922J1709l2700l5108l2207l048L5807J8052
$$ 209309 209080 203534 229311 239189 234588 240510 252219 219519 184411 152204 149156 184963 203015
13445B03015K832n683m5431q151L3671K3391j3529l152L515j2917q120p285j8276
$$ 203015 205847 200164 154733 146582 180253 203644 190115 186963 190478 177561 169441 162156 143880
13432A43880R00L1903N855K4876J1580J281L4378K3185O649j1825j487l7324p298
$$ 143880 144780 176683 182538 207414 218994 220275 254653 277838 284487 272662 271175 233851 226553
13419B26553j0895k599L6159K0427J7712J1981j844j3767k5948M3038J8554m232
$$ 226553 215658 213059 249218 269645 287357 299338 297494 283727 257779 300817 319371 315139
13407C15139M6530J2619m2972k1359m283q22r406P364L0801p009J3698M3003J7129
$$ 315139 361669 374288 331316 309957 305674 304852 295446 302810 333611 326602 340300 383303 400432
13394D00432J4164k5047k9980j101K8055M8946K1828J4489J9737J1950q023j5768
$$ 400432 414596 389549 359569 358468 386523 435469 457297 471786 491523 503473 495450 479682
13382D79682K4327M0100k2091Q656j3689j9404N15L9028J376r850l1159J5326
$$ 479682 504009 544109 522018 530674 516985 497581 498096 537124 538500 528650 497491 512817
13370E12817O0672K6205p34j3750O689J1759N929j9856M913J9921L387J1094J6825
$$ 512817 573489 599694 598960 585210 591899 603658 609587 589731 594644 614565 617952 629046 645871
13357F45871L6949j7102o311l065J7490J9010K3854J6905J2602L0852L0845J2136
$$ 645871 682820 665718 659407 656342 673832 692842 716696 733601 746203 777055 807900 820036
13345H20036l3308j677K3496J5069p587j5314N522L308r192k3261l4800R722J2414
$$ 820036 786728 785051 808547 823616 816029 800715 806237 809545 800353 777092 742292 752014 764428
13332G64428K777K4495K4954m600K6714K9389l5410J9487j2489q89L7340K6801
$$ 764428 767205 791700 816654 812054 838768 868157 832747 852234 839745 838856 876196 902997
13320I02997l6625k1726K21J1147j0604j6998J9109L9760R223j8768j7633J4768
$$ 902997 866372 844646 844867 856014 845410 828412 847521 887281 896504 877736 860103 874871
13308H74871R056K4258q546N791K1989m390k736m028j6174k2134J671N0192L5493
$$ 874871 883927 908185 899639 905430 927419 923029 920293 916265 900091 877957 879628 929820 965313
13295I65313J2319J948j0064K3565M1186J1704J1580J9617J4298M3675P5168R2166
$$ 965313 977632 979580 969516 993081 1034267 1045971 1057551 1077168 1091466 1135141 1210309 1302475
13283A302475J16815J59899J52989J23122J13851J40963J68262J94995J44159
$$ 1302475 1419290 1579189 1732178 1855300 1969151 2110114 2278376 2473371 2617530
13274B617530J12345J03625J7141k6290n975k3926k9659j7752k6451m1484l8976
$$ 2617530 2729875 2833500 2850641 2824351 2818376 2794450 2764791 2747039 2720588 2679104 2640128
13263B640128k2557J4378L1328K9118L2835K5931J3455k191n9292q4477q7050
$$ 2640128 2617571 2631949 2663277 2692395 2725230 2751161 2764616 2762425 2703133 2618656 2531606
13252B531606j36767j41928j40582j46428j52671j45462j15448j33830j28967
$$ 2531606 2394839 2252911 2112329 1965901 1813230 1667768 1552320 1418490 1289523
13243A289523j16841o2374p2255o2375n5185j1037r002k3955n1632j2445q973
$$ 1289523 1172682 1110308 1038053 975678 920493 909456 900454 876499 824867 812422 803449
13232H03449k6378k6260k0753j3496k6110k7219j8718k2531J5901o069m2436O583
$$ 803449 777071 750811 730058 716562 690452 663233 644515 621984 637885 631816 589380 595963
13220E95963j8279j7799k941Q865J5024J8383j1139k9031j0401Q105L297n64q667
$$ 595963 577684 559885 556944 565809 580833 599216 588077 559046 548645 556750 560047 559483 550816
13207E50816R676R058N363J7026L1233L7843K0718M8073P6953O7080O1280J36703
$$ 550816 560492 569550 574913 591939 623172 661015 681733 729806 806759 873839 935119 1071822
13195A071822J92865J72768J90860J99695K20430J75490J28924J33384J05790
$$ 1071822 1264687 1437455 1628315 1828010 2048440 2223930 2352854 2486238 2592028
13186B592028N7949Q026p2031j08176j12149j14877j12913j14613j00067o0778
$$ 2592028 2649977 2658003 2585972 2477796 2365647 2250770 2137857 2023244 1923177 1862399
13176A862399l0114J4604J6294P4934O9245Q8421J08344L2417K5835K1054k8164
$$ 1862399 1832285 1846889 1863183 1938117 2007362 2095783 2204127 2236544 2262379 2283433 2255269
13165B255269p6478r0023j34512j42261j67975j52795j46626j69076j20656j10274
$$ 2255269 2178791 2088768 1954256 1811995 1644020 1491225 1344599 1175523 1054867 944593
13155I44593p5125n9792p6052l9219o2161l0459k7957m9132j1814k714k234l4617
$$ 944593 869468 809676 733624 694405 632244 601785 573828 524696 512882 510168 507934 473317
13143D73317k5769j8906l1960j7166k0028m3034j4777p570J319m881j8073l1402
$$ 473317 447548 428642 396682 379516 359488 316454 301677 294107 295426 290545 272472 241070
13131B41070j2039J093j8517M567Q30m351rL965J0343m8959j2660K2298j1840
$$ 241070 229031 230124 211607 216174 217004 212653 212644 216609 226952 177993 165333 187631 175791
13118A75791k9829j0796m3592J1863K0758N0652L3869p706j0098R899J2721P996
$$ 175791 145962 135166 91574 103437 124195 174847 208716 201010 190912 200811 213532 221528
13106B21528k1465o863k8290l4110R322J3487k2303k1237j8470k2514r965M421
$$ 221528 200063 193200 164910 130800 140122 153609 131306 110069 91599 69085 59120 63541
13094F3541J1342M0645J758K015L2676n888m3269J9007J4740l4757m4019k2641
$$ 63541 74883 115528 117286 119301 151977 146089 102820 121827 136567 101810 57791 35150
13082C5150J30k0617r71K5164J5332K7428K0751q971K8641l250k6741m9160j4475
$$ 35150 35280 14663 13692 38856 54188 81616 102367 93396 122037 118787 92046 42886 28411
13069B8411o995m84q326M785K4262j2247l0083j0920K3662r920j7777J9586K1859
$$ 28411 21416 20932 12606 17391 41653 29406 -677 -11597 12065 2145 -15632 3954 25813
13056B5813Q811l5830k2090K0560L5948j6337p336J6387J9631j1664J1638k1101
$$ 25813 34624 -1206 -23296 -2736 33212 16875 9539 25926 45557 33893 45531 24430
13044B4430r260k6149m465j0791O024M0344J9011k2021j299j731K4571K562j3354
$$ 24430 15170 -10979 -15444 -26235 -20211 20133 39144 17123 15824 14093 38664 41226 27872
13031B7872Q767k611j2098k8920k6341J3399K2245J40k0j9426L0594K5920J3516
$$ 27872 36639 34028 21930 -6990 -33331 -19932 2313 2453 2433 -16993 13601 39521 53037
13018E3037j1625j5429J8431l1784k6810J6479r998k1164Q367J4936M687P393
$$ 53037 41412 25983 44414 12630 -14180 2299 -7699 -28863 -20496 -5560 -873 6520
13006F520J0386j8919J0932K0699J2269m383O78J5119J3709l1833j5383K4537
$$ 6520 16906 -2013 8919 29618 41887 37504 38182 53301 67010 35177 19794 44331
12994D4331p866m378k3869k1111K0270r749l5858N863K283o324L1007J5170J0707
$$ 44331 36465 32087 8218 -12893 7377 -2372 -38230 -32367 -30084 -36408 -5401 9769 20476
12981B0476J2648j2981m5202k4493N294J2255p241K1448J301o357M4389J6794
$$ 20476 33124 20143 -25059 -49552 -44258 -32003 -39244 -17796 -16495 -22852 21537 38331
12969C8331J1750j0121n745r325M933K220l263K0654k8077k841O080J0709j2241
$$ 38331 50081 39960 34215 24890 29823 32043 28780 49434 21357 18516 24596 35305 23064
12956B3064N21q192k0467K5973j021J3880J212o611J2350J0301j653q525K6866
$$ 23064 23585 15393 -5074 20899 19878 33758 34970 28359 40709 51010 49357 40832 67698
12943F7698K6505K618q557j3366k0128l1184J597N6359J6004r745p641K6619L387
$$ 67698 94203 96821 88264 74898 54770 23586 25183 81542 97546 87801 80160 106779 110166
12930A10166j7327R945L362j6449N2049K9381R50K9648N183K1582N2492O0684
$$ 110166 92839 102784 106146 89697 141746 171127 172077 201725 206908 228490 280982 341666
12918C41666J9145K2927O4810O6514P7581P1879R8705L9667K5823L7488L9008
$$ 341666 360811 383738 448548 515062 592643 664522 763227 802894 828717 866205 905213
12907I05213J3123k0684j593o591m8675k1197n1869o5037q3906o6772m8977k6621
$$ 905213 918336 897652 896059 889468 840793 819596 767727 702690 618784 552012 503035 476414
12895D76414p094j3339j8812n6221m9549k7842k7495j1730j317P438l2287l1235
$$ 476414 469320 455981 437169 380948 331399 303557 276062 264332 263015 270453 238166 206931
12883B06931k2271k46k917p249k7037L293J5573L579n905p158k6638n262Q206
$$ 206931 184660 184414 181497 174248 147211 150504 166077 169656 163751 156593 129955 124693 132899
12870A32899R947p643l4728l6088L64J7076K7694j3966j3597j6485o786J337j0394
$$ 132899 142846 135203 100475 64387 64751 81827 109521 95555 81958 65473 58687 60024 49630
12857D9630j4788L714K6954P694k8501L113j8039j2097q703j7463J7509J0440
$$ 49630 34842 38556 65510 73204 44703 47816 29777 17680 8977 -8486 9023 19463
12845A9463p254R932j2611k4181l0985l430M9091K0112l6741Q109K3990o326j8074
$$ 19463 12209 22141 9530 -14651 -45636 -49066 25 20137 -16604 -8495 15495 9169 -8905
12832h905J9008K100Q941J5553j3776j0474p587N305K4035P890k2041m047j586
$$ -8905 10103 12203 21144 36697 22921 12447 4860 10165 34200 42090 20049 16002 14416
12819A4416o269j1535n924K4777L1992r452j2814J7743j5535m7303q33K4039K512
$$ 14416 8147 -3388 -9312 15465 47457 38005 25191 42934 27399 -19904 -20737 3302 5814
12806E814j9212K634L1326K5870j7200j8193j9264Q379J7551J0930k1833j869
$$ 5814 -13398 -10764 20562 46432 29232 11039 -8225 154 17705 28635 6802 4933
12794D933l0650o232K1898j5106J9974M888k377J477O02O57R714k210J8300j67
$$ 4933 -25717 -31949 -10051 -25157 -5183 -295 -2672 -1195 -593 64 9778 7568 25868 25701
12780B5701j128k5832j5786J9219M6001J1294k2132l5998k5299j080L178J9666
$$ 25701 24573 -1259 -17045 2174 48175 59469 37337 1339 -23960 -25040 -21862 -2196
12768b196O306k1493j4875J1130N5016L1433j722j6134k921O42k1433m630o996
$$ -2196 4110 -17383 -32258 -21128 33888 65321 63599 47465 44544 45186 23753 19123 12127
12755A2127k5945N803K6520K3785J4073K5173K2683l62R522M363N082j6659K9354
$$ 12127 -13818 -8015 18505 42290 56363 81536 104219 103857 113379 117742 122824 106165 135519
12742A35519J2137J1261J5569P439j0732q529k6652l2601m251L293K2083J282
$$ 135519 147656 158917 174486 181925 171193 162664 136012 103411 99160 102453 124536 125818
12730A25818j0805j836j5931K984l224j0733l44J0382k8285j8779o261L1013L1693
$$ 125818 115013 113177 97246 100230 97006 86273 85929 96311 68026 49247 42986 73999 105692
12717A05692j7328O314j4468r318J6401K51m6645m249j465r868o785k4024j4509
$$ 105692 88364 94678 80210 70892 87293 87544 40899 36650 35185 25317 18532 -5492 -20001
12704b0001R201R499N960J9501r212j2829J7511J6999k9053j2063L3806j1228
$$ -20001 -10800 -1301 4659 24160 14948 2119 19630 36629 7576 -4487 29319 18091
12692A8091j9901j482L0870J8245k661O767j9540J1101L452o920P312L0918K4475
$$ 18091 -1810 -3292 27578 45823 43162 49929 30389 41490 44942 38022 45334 76252 100727
12679A00727K5518J9722q055j7824j0024L85l006j4015k838o317j7649k491K957
$$ 100727 126245 145967 137912 120088 110064 110449 107443 93428 90590 84273 66624 64133 67090
12666F7090N155K0714J0998K198O174K2337K1845J0180j1223r046J0435j5759
$$ 67090 72245 92959 103957 106155 112329 134666 156511 166691 155468 146422 156857 141098
12654A41098j1659K0370K6345K268K1281p231r296L725P64O401K4545M0477k0588
$$ 141098 129439 149809 176154 178422 199703 192472 183176 186901 187665 194066 218611 259088 238500
12641B38500n055P883k866O482L6868J6357N989J0464k6663N397N682J683O201
$$ 238500 233445 241328 238462 244944 281812 298169 304158 314622 287959 293356 299038 300721 306922
12628C06922J5397K2891K528L5834Q917L5448M6982M4849L1313Q401O335K6514
$$ 306922 322319 345210 347738 383572 392489 427937 474919 519768 551081 559482 565817 592331
12616E92331K5156L3122J1263K0793m752R131J3864l1820l478J8488J346P776
$$ 592331 617487 650609 661872 682665 677913 687044 700908 669088 665610 684098 685444 693220
12604F93220O979K2355J6863j3772K7483j055J0992K8828j1758Q632p544o864
$$ 693220 700199 722554 739417 725645 753128 752073 763065 791893 780135 788767 781223 774359
12592G74359K2707L2668P555j6052J6470J6850J3423p780K4184M0556n977J985
$$ 774359 797066 829734 837289 821237 837707 854557 867980 860200 884384 924940 918963 920948
12580I20948N0958L5493n105R301M5448K3726N6008L7437L2260N9123M8734M5146
$$ 920948 971906 1007399 1002294 1011595 1057043 1080769 1136777 1174214 1206474 1265597 1314331 1359477
12568A359477O5436O3196O9330P3332N5024N3896P4690P4719Q0652P3323O1965
$$ 1359477 1424913 1488109 1557439 1630771 1685795 1739691 1814381 1889100 1969752 2043075 2105040
12557B105040Q0066N0500R869K6778O0213O5692P3809L6151R195M1044O5682O5923
$$ 2105040 2185106 2235606 2245475 2272253 2332466 2398158 2471967 2508118 2517313 2558357 2624039 2689962
12545B689962N7170Q5450P2348M9739J06262J46751J27522J76897J74199J43021
$$ 2689962 2747132 2832582 2904930 2954669 3060931 3207682 3335204 3512101 3686300 3829321
12535C829321J40752J76254J87621J68621J77523K03141K44264K20904K54443
$$ 3829321 3970073 4146327 4333948 4502569 4680092 4883233 5127497 5348401 5602844
12526E602844K84409L00118L33158L43139M05762M27937M43405M92977N65761
$$ 5602844 5887253 6187371 6520529 6863668 7269430 7697367 8140772 8633749 9199510
12517I199510N98871O52374P64411Q55593R27581J058696J201904J367986J542089
$$ 9199510 9798381 10450755 11215166 12070759 12998340 14057036 15258940 16626926 18169015
12508A8169015J794262K059960K296570K625993L009912L476115M021478M655262
$$ 18169015 19963277 22023237 24319807 26945800 29955712 33431827 37453305 42108567
12500D2108567N432516O332930P444579Q723872J0059779J1350568J2491694J3291016
$$ 42108567 47541083 53874013 61318592 70042464 80102243 91452811 103944505 117235521
12492A17235521J3600382J3278983J2220015J0401264P944017M949909J640631
$$ 117235521 130835903 144114886 156334901 166736165 174680182 179630091 181270722
12485A81270722j734837m840256p530833r655185j1063491j1812405j1918600
$$ 181270722 179535885 174695629 167164796 157509611 146446120 134633715 122715115
12478A22715115j1450052j0602068r602132q500564p467345o488150n667785m958662
$$ 122715115 111265063 100662995 91060863 82560299 75092954 68604804 62937019 57978357
12470E7978357m347094l883243l501455l163062k894572k594837k356644k142839
$$ 57978357 53631263 49748020 46246565 43083503 40188931 37594094 35237450 33094611
12462C3094611j939957j778459j647495j493199j326815j221787j126981j067704
$$ 33094611 31154654 29376195 27728700 26235501 24908686 23686899 22559918 21492214
12454B1492214j004814r39043q54042q18204p57651p04400o52018o15312n85256
$$ 21492214 20487400 19548357 18694315 17876111 17118460 16414060 15762042 15146730 14561474
12445A4561474n65192n63024m99138m83344m55810m13332m07833m16086l70785
$$ 14561474 13996282 13433258 12934120 12450776 11994966 11581634 11173801 10757715 10386930
12436A0386930l41060l29232k95691k69265k59953k61354k66529k41276k53574
$$ 10386930 10045870 9716638 9420947 9151682 8891729 8630375 8363846 8122570 7868996
12427G868996k21692k42455j99492j87147k15458k09098j96679j72616j60475
$$ 7868996 7647304 7404849 7205357 7018210 6802752 6593654 6396975 6224359 6063884
12418F063884j38890j41530j53137j57548j81740j51218j29613r7953j36488j28807
$$ 6063884 5924994 5783464 5630327 5472779 5291039 5139821 5010208 4912255 4775767 4646960
12408D646960j24055j54311j33371j24763j42127j53064j40414j32266j07519
$$ 4646960 4522905 4368594 4235223 4110460 3968333 3815269 3674855 3542589 3435070
12399C435070j25695j47373r5966p5245j19297j11132r3539j02237n5027o4282
$$ 3435070 3309375 3162002 3066036 2990791 2871494 2760362 2666823 2564586 2509559 2445277
12389B445277q9864q8080q2900o9176n3484p7316p7247o7822p4147n4321m3286
$$ 2445277 2355413 2267333 2184433 2115257 2061773 1984457 1907210 1839388 1765241 1710920 1667634
12378A667634j4168k3825l5687n1316l8831l7945m8243j9874r123n517l1202R26
$$ 1667634 1653466 1629641 1593954 1542638 1503807 1465862 1417619 1397745 1388622 1383105 1351903 1352829
12366A352829j4008l6323m1325k9669k5326o399j0355j7671j932p874K302l231
$$ 1352829 1338821 1302498 1261173 1231504 1206178 1199779 1189424 1171753 1169821 1161947 1164249 1161018
12354A161018k8295j2217m179P174k3429l51L279k0719l6699O410j2830k4207
$$ 1161018 1132723 1120506 1116327 1123501 1100072 1099721 1103000 1082281 1045582 1051992 1039162 1014955
12342A014955J6114J255l2174j8604M765P583n912R21j7243m4964l0660k8989
$$ 1014955 1031069 1032324 1000150 981546 986311 993894 987982 988903 971660 926696 896036 867047
12330H67047j7892m397L1666J1712k1171l405K1875J6252o762l7110P787L0486
$$ 867047 849155 844758 876424 888136 866965 863560 885435 901687 894925 857815 865602 896088
12318H96088o953o933P185j219L388L8117J5464k4953K2225J3580j9145j3240
$$ 896088 889135 882202 889387 888168 891556 929673 945137 920184 942409 955989 936844 923604
12306I23604r186j648j7886K8442J1025j2338m386m352Q681k8649j6389l9659
$$ 923604 914418 912770 894884 923326 934351 922013 917627 913275 921956 893307 876918 837259
12294H37259l4890p738k661K258j3535l8997j8790K0090K669n796j1813j2322
$$ 837259 802369 794631 791970 794228 780693 741696 722906 742996 745665 739869 728056 715734
12282G15734J4716K631m934l0410l6795m6993J45K4950J109K515M189J8514J637
$$ 715734 730450 733081 728147 697737 660942 613949 614094 639044 640153 642668 646857 665371 667008
12269F67008P27k9642j4003l4964j2876K262k2947l1799j2605j1334j2315k2358
$$ 667008 667735 638093 624090 589126 576250 578512 555565 523766 511161 499827 487512 465154
12257D65154m603O382M331m086j3528k3299J0333J6674p063j9131K5333J7332
$$ 465154 460551 466933 471264 467178 453650 430351 440684 457358 450295 431164 456497 473829
12245D73829j804J760j598K9779k820p588j9508j5464k9726m4475Q018K4883r064
$$ 473829 472025 473785 472187 501966 499146 491558 472050 456586 426860 382385 390403 415286 406222
12232D06222k2939j1946l644J4683q726M66M845j0297m079j9134k5853Q598O444
$$ 406222 383283 371337 367693 382376 373650 374116 378961 368664 364585 345451 319598 328196 334640
12219C34640l1812q36K011q852j8343j3363j5190m60j495K1346P103j6161j5380
$$ 334640 302828 301992 304003 295151 276808 263445 248255 247795 246300 267646 274749 258588 243208
12206B43208k1671K7050M1251J1412P407j6195k0464L455J5775J6354p04j4379
$$ 243208 221537 248587 289838 301250 308657 292462 271998 275453 291228 307582 306878 292499
12194B92499R552n907j003J4975j391k2403J6203K9882J7270Q462k2809k2040
$$ 292499 302051 296144 295141 310116 308725 286322 302525 332407 349677 358139 335330 313290
12182C13290P269L751J3067m401j643J0206R377L6283L5059J39P413L82J6491
$$ 313290 320559 324310 337377 332976 331333 341539 350916 387199 422258 422397 429810 430192 446683
12169D46683O6221P9583P4799M7608M2879N9460Q8644J05514J15950J57867K15279
$$ 446683 512904 592487 667286 714894 757773 817233 905877 1011391 1127341 1285208 1500487
12158A500487J93084J48046J53083J17080N9082M4413n724q4232j35524j28035
$$ 1500487 1693571 1841617 1994700 2111780 2170862 2215275 2209551 2125319 1989795 1861760
12148A861760j62742j50479j33902r7255j00173j27153o8612n1765n6200p0590
$$ 1861760 1699018 1548539 1414637 1317382 1217209 1090056 1021444 969679 913479 842889
12138H42889n9314p2944j8711k1346k9646j1777j8852l1363k4269k8509k9906
$$ 842889 783575 710631 691920 670574 640928 629151 610299 578936 554667 526158 496252
12127D96252k2061N868J3991K0574j3667j2618j4871q016p694M159K3748R932
$$ 496252 474191 480059 494050 514624 500957 488339 473468 465452 457758 461917 485665 495597
12115D95597K7153l685k3117j4194J3575J4732M7060K1122K3875J5769L9022L6056
$$ 495597 522750 519065 495948 481754 495329 510061 557121 578243 602118 617887 656909 692965
12103F92965Q1808R9494Q9200R9024J50190J95113K22993K36745K31777J97025
$$ 692965 774773 874267 963467 1062491 1212681 1407794 1630787 1867532 2099309 2296334
12093B296334J82151J48666P1283k5644p9436j19739j53850j34171j14827p9105
$$ 2296334 2478485 2627151 2698434 2672790 2593354 2473615 2319765 2185594 2070767 1991662
12083A991662q1388m6527j2930k5837R006K7295J8704J6343O9922J02434J24069
$$ 1991662 1910274 1863747 1850817 1824980 1833986 1861281 1879985 1896328 1966250 2068684 2192753
12072B192753J45843K04821K31211J87935J76151J09690N7457j5476j05924j46827
$$ 2192753 2338596 2543417 2774628 2962563 3138714 3248404 3305861 3290385 3184461 3037634
12062C037634j59546j68465j68664j89439j93853j67599j46613j34728j32630
$$ 3037634 2878088 2709623 2540959 2351520 2157667 1990068 1843455 1708727 1576097
12053A576097j02842r9354r4007p6621r1007m4473l4740n8902q1346l9844l4427
$$ 1576097 1473255 1373901 1279894 1203273 1112266 1067793 1033053 974151 892805 852961 818534
12042H18534m1618k7209k0782k1184k0506m1421l5144n705j6510p477j2261k7105
$$ 818534 776916 749707 728925 707741 687235 645814 610670 604965 588455 580978 568717 541612
12030E41612k5784j8393N733J4717m736l763n078m703L6913K9027L7843J3175
$$ 541612 515828 497435 503168 517885 513149 509386 504308 499605 536518 565545 603388 616563
12018F16563J3063M7394K9237O2528O7158Q8611P3444R9548J31955J78155J89579
$$ 616563 629626 677020 706257 768785 835943 924554 997998 1097546 1229501 1407656 1597235
12007A597235J38708J06573L8134Q999l3823o0704q7367j31687j38670j61773
$$ 1597235 1735943 1842516 1880650 1889649 1855826 1795122 1707755 1576068 1437398 1275625
11997A275625j52949j05110p7792n2098n0405o5188m2507j9493k4185J6788j5637
$$ 1275625 1122676 1017566 939774 887676 837271 772083 729576 710083 685898 702686 687049
11986F87049l7520j0399J1546K2700L8412M6133N1231R0621J25448J89450K27455
$$ 687049 649529 639130 650676 673376 711788 757921 809152 899773 1025221 1214671 1442126
11975A442126K34626K42148K48162J89682J38735N4503k2794r8623j42252k12711
$$ 1442126 1676752 1918900 2167062 2356744 2495479 2549982 2527188 2428565 2286313 2073602
11965B073602k45485k08553k03252j86517j69020j53741q5309o4330q2441n1017
$$ 2073602 1828117 1619564 1416312 1229795 1060775 907034 821725 757395 674954 623937
11955F23937n8049n1134l2115o2360j5036j8692Q018p816l9427n5114k0384o979
$$ 623937 565888 514754 482639 420279 405243 386551 394569 386753 347326 292212 271828 264849
11943B64849K2574k377j1142l1215j8242j0495L80J7171P570j7824j6517K0591
$$ 264849 287423 285046 273904 242689 224447 213952 214332 231503 239073 221249 204732 225323
11931B25323j9778k7136k0504k9408J351K0381M878l1324j3612K6986L5939K4641
$$ 225323 205545 178409 157905 128497 129848 150229 155107 123783 110171 137157 173096 197737
11919A97737l2872j5634p045J6303j747k7134n14O78q286Q157M16j6428k2814
$$ 197737 164865 149231 142186 158489 156742 129608 129094 129772 121486 129643 130059 113631 90817
11906I0817j7499j1008R039K5658M215j9367r319j7365L8073K148k0091J9576
$$ 90817 73318 62310 71349 97007 101222 81855 72536 55171 93244 95392 75301 94877
11894I4877j0010j2715k047J3049J5161J6576k528q30M232r014k5179k3793K330
$$ 94877 84867 72152 70105 83154 98315 114891 112363 111533 115765 106751 81572 57779 60109
11881F0109j8177Q43J7565k3595J8955K4682M404J2377j1425M641J4455J947N865
$$ 60109 41932 42775 60340 36745 55700 80382 84786 97163 85738 90379 104834 106781 112646
11868A12646j1634k3269j3833K8523j1456l1192K4024j437p540j3456K0033J575
$$ 112646 101012 77743 63910 92433 80977 49785 73809 72372 64832 51376 71409 72984
11856G2984k6311j2475J3489O645R108j0019n87m47J5018j0430L4461K1475k9138
$$ 72984 46673 34198 47687 54332 63440 53421 52834 52387 67405 56975 91436 112911 83773
11843H3773j9769O054K644j3701n37k5233o478j9744l526Q467M1107Q757k5575
$$ 83773 64004 70058 72702 59001 58464 33231 26753 7009 3483 11950 53057 61814 36239
11830C6239m1299M0538p45q140l536J4651j9248j709k2475j284j8039M0668L529
$$ 36239 -5060 35478 34733 26593 23057 37708 18460 16751 -5724 -7008 -25047 15621 19150
11817A9150J298J6843N019J1779k2707p873K9797j3779M669r98j6930l918K270
$$ 19150 20448 37291 42310 54089 31382 23509 53306 39527 44196 43198 26268 22350 24620
11804B4620K186P692L447j5315k2907J726j043J5019O765L3062o38J2153l1086
$$ 24620 26806 34498 37945 22630 -277 1449 406 15425 22190 55252 54614 66767 35681
11791C5681j6998J7548K0901j1944j8908l0844L1178N49J2100K2387l661j6365
$$ 35681 18683 36231 57132 45188 26280 -4564 26614 27163 39263 61650 57989 41624
11779D1624o444J2971k2940k5094J3758L7072K8770j6005N087L22q976o577j6250
$$ 41624 35180 48151 25211 117 13875 50947 79717 63712 68799 69121 60145 53568 37318
11766C7318j1773k1017k8537q206K5106K2914k616j582K2559J7535l0889r781
$$ 37318 25545 4528 -24009 -32215 -7109 15805 13189 11607 34166 51701 20812 11031
11754A1031j7627J0808J3726R726J8485M3Q738j5629j5677k760j6327J3263K9425
$$ 11031 -6596 4212 17938 27664 46149 46192 54930 39301 23624 20864 4537 17800 47225
11741D7225j7j0879n837o485j9381M5874L4645k0381l9977q738k3044J0226J2226
$$ 47225 47208 36329 30492 24007 4626 50500 85145 64764 24787 16049 -6995 3231 15457
11728A5457J4479L848j225j0127j4678k425J3674J8058J3062P695j233M408k0701
$$ 15457 29936 33784 32559 22432 7754 5329 19003 37061 50123 57818 56585 60993 40292
11715D0292n301L18J5602O366J4128j0245l0233J351K990J0938K0415k8694j6522
$$ 40292 34991 35309 50911 57277 71405 61160 30927 32278 35268 46206 66621 37927 21405
11702B1405k5816q643L5177J3173j3911l426J9865N792P49p988k6437K717p381
$$ 21405 -4411 -13054 22123 35296 21385 17959 37824 43616 44365 36377 9940 12657 5276
11689E276j1628J1449J0135N773q918M364r679l744P640J4302j0356R14k518k0170
$$ 5276 -6352 5097 15232 21005 12087 16451 6772 3028 10668 24970 14614 15528 13010 -7160
11675g160j6595L5074J8880j4307j6153n939j4343j3914J2548j331P687q344R674
$$ -7160 -23755 11319 30199 15892 -261 -6200 -20543 -34457 -21909 -23240 -15553 -23897 -14223
11662a4223M5662L760j2293j4037K3858j2095k4196j3433K0790R689O090M2989
$$ -14223 31439 35199 22906 8869 32727 20632 -3564 -16997 3793 13482 19572 62561
11650F2561j520j5610k0493m677R934K347L7367J5422l7443k0634K3295J3988
$$ 62561 61041 45431 24938 20261 30195 32542 69909 85331 47888 27254 50549 64537
11638F4537j6804L109j8942l9074j1428K2420M1311j4760k7706k535P167Q246
$$ 64537 47733 50842 31900 -7174 -18602 3818 45129 30369 2663 128 7295 15541
11626A5541j2052n142o346r839r082K9285P51j9489J4693O1851j8037j8438j4256
$$ 15541 3489 -1653 -7999 -17838 -26920 2365 3116 -16373 -1680 60171 42134 23696 9440
11613I440j7955k148P375j0843j8987L926J2333n231r457K9091j1791j4615J1395
$$ 9440 -8515 -10663 -3288 -14131 -33118 -29192 -16859 -22090 -31547 -2456 -14247 -28862 -17467
11600a7467k8181q511L900j3594P118m60J934M744J4457K9140r418m3071j4833
$$ -17467 -45648 -54159 -50259 -63853 -56735 -57195 -55261 -50517 -36060 -6920 -16338 -59409 -74242
11587g4242K7113J5284p37Q908Q933j4600j0568j2158l5664o594K6898N959K7098
$$ -74242 -47129 -31845 -32582 -23674 -14741 -29341 -39909 -52067 -87731 -94325 -67427 -61468 -34370
11574c4370L5670q932j3537J3383J85j0841j1160K2296J2648k848N46o555k3142
$$ -34370 1300 -7632 -21169 -7786 -7601 -18442 -29602 -7306 5342 2494 3040 -3515 -26657
11561b6657k1774m96L6826L6587K1397P054O291j4590j3690j7333k6322K1093
$$ -26657 -48431 -48927 -12101 24486 45883 52937 59228 44638 30948 13615 -12707 8386
11549H386K5564j4693j2985q66j0733o385m797O286j5929m619J7913r398j5442
$$ 8386 33950 19257 6272 5406 -5327 -11712 -16509 -10223 -26152 -30771 -12858 -22256 -37698
11536c7698RK1921M879M936J4999m791L569M853n171o611j8916J281j3539j2450
$$ -37698 -37689 -15768 -10889 -5953 9046 4255 7824 12677 7506 895 -18021 -16740 -30279 -42729
11522d2729J9409l0708m896K4244o62m485j2489K5309R894J442l648O280J0510
$$ -42729 -23320 -54028 -58924 -34680 -35342 -39827 -52316 -27007 -17113 -15671 -19319 -13039 -2529
11509b529J0j107p652J887o714n426j5745N28n405M997K4408N093r483j1037k5195
$$ -2529 -2519 -3626 -11278 -9391 -16105 -21531 -37276 -36748 -42153 -37156 -12748 -7655 -17138 -28175 -53370
11494e3370p40R745L7082M259k9804L064K93J0876k4664N777P580j1583j0335
$$ -53370 -54110 -44365 -7283 -3024 -32828 -29764 -29471 -18595 -43259 -37482 -29902 -41485 -51820
11481e1820K659q373L047k3021K0133L3497J8705J8270j1257j4739J2194m418
$$ -51820 -49161 -57534 -54487 -77508 -57375 -23878 -5173 13097 1840 -12899 -705 -5123
11469e123q905J0504J0481k2475j3176P511p619J9374J0300k4521j4945O916J7851
$$ -5123 -14028 -3524 6957 -15518 -28694 -21183 -28802 -9428 872 -23649 -38594 -31678 -13827
11456a3827n351k4435K4555M0991P466r672L302n213j3793L8508K2180j8334O995
$$ -13827 -19178 -43613 -19058 21933 29399 19727 23029 17816 4023 42531 64711 46377 53372
11443E3372O445j4421m062j8915o62k0549N916j986J163j5400k3621j5172J1538
$$ 53372 59817 45396 41334 22419 21757 1208 7124 5138 6301 -9099 -32720 -47892 -36354
11430c6354M799l289k8355m611J932J274L4197J8393J2275j7107k9692j4153J1740
$$ -36354 -31555 -34844 -63199 -67810 -65878 -64604 -30407 -12014 261 -16846 -46538 -60691 -48951
11417d8951K2302R9m2785J6658k9370j1462K8084L0410J3891L703p844j2843j8357
$$ -48951 -26649 -26550 -69335 -52677 -82047 -93509 -65425 -35015 -21124 -17421 -25265 -38108 -56465
11404e6465J8049r000m799P390J9250O33k4913j8644q395J0974j0561L341P121
$$ -56465 -38416 -47416 -52215 -44825 -25575 -24942 -49855 -68499 -76894 -65920 -76481 -73140 -66019
11391f6019M4877K9863j4234k9515j9944J3611J7905K195n676Q782J2393J0137
$$ -66019 -21142 8721 -5513 -35028 -54972 -41361 -23456 -21261 -26937 -18155 -5762 4375
11379D375J9258k3081J3068K6769J3370K594k048j5095J721j5154k6518K0428
$$ 4375 23633 552 13620 40389 53759 56353 54305 39210 40931 25777 -741 19687
11367A9687J0927J938j430k2165r729J6476J671J6085j4830J8329N715m116r777
$$ 19687 30614 32552 31122 8957 -772 15704 17375 33460 18630 36959 42674 38558 28781
11354B8781m029P274M0515M1287Q752L6609Q4605N7140M7968Q919o73K5771K0250
$$ 28781 24752 32026 72541 113828 122580 159189 243794 300934 348902 357821 357148 382919 403169
11341D03169o329k8427l3288k7374l9859l6789k0690j963l0143o5307j3637J4625
$$ 403169 396840 368413 335125 307751 267892 231103 210413 208450 178307 113000 99363 113988
11329A13988J2407K0781n403N363k9292r599J855K2197L6092K5004L7123J9152
$$ 113988 126395 147176 141773 147136 117844 108245 110100 132297 168389 193393 230516 249668
11317B49668L5136O7125M5671p059J3467K4980k190k3882n8158m3425m1677l4395
$$ 249668 284804 351929 397600 390541 404008 428988 426798 402916 344758 301333 259656 225261
11305B25261k3030j4698J6969J9977j5043J0234L697k1j6807l8197k8605k8462
$$ 225261 202231 187533 204502 224479 209436 219670 223367 223346 206539 168342 139737 111275
11293A11275J0440j2296j1967J243l0717P488R753k6882m0217J7698J7261L027
$$ 111275 121715 109419 97452 98695 67978 75466 85219 58337 18120 35818 53079 56106
11281E6106l423O413J7095J224p033J0298j348n402K2160P686J0169L2339n672
$$ 56106 52683 59096 76191 77415 70382 80680 79332 73930 96090 103776 113945 146284 140612
11268A40612k0778k0178Q479O177k3645k3132r026q41j0465k5587l4245p609J9447
$$ 140612 119834 99656 108135 114312 90667 67535 58509 57668 47203 21616 -12629 -20238 -791
11255g91M5825j0289j2651M741K3684K9970k598l3517r339k6210l979J370K714
$$ -791 45034 34745 22094 26835 50519 80489 77891 44374 35035 8825 4846 6216 8930
11242H930J6812k0980j9828J6652K295k4395m119J5319j7134Q94R558J5128o632
$$ 8930 25742 4762 -15066 1586 3881 -20514 -24633 -9314 -26448 -25554 -15996 -868 -7500
11229g500j4021j4352q762K6899p212j8133J0731k0455m1304k250J0382K3387
$$ -7500 -21521 -35873 -44635 -17736 -24948 -43081 -32350 -52805 -94109 -96359 -85977 -62590
11217f2590K1001M2818N286l195Q421k177k8105J1735K0873k4647j2038j5889
$$ -62590 -41589 1229 6515 3320 11741 9564 -18541 -6806 14067 -10580 -22618 -38507
11205c8507J2408K9391J7617j6559j7245l180J1968O616J4580l82K604K4245O515
$$ -38507 -26099 3292 20909 4350 -12895 -16075 -4107 2509 17089 16707 19311 43556 50071
11192E0071J3064j719j1554j260J0699j9349k0781m2n325K0454k1100j9660k3726
$$ 50071 63135 61416 49862 48602 59301 39952 19171 19129 13804 34258 13158 -6502 -30228
11179c0228K4589K0317N427J7892j3121J5210j8102q794j7744k0970J3382J1596
$$ -30228 -5639 14678 20105 37997 24876 40086 21984 13190 -4554 -25524 -12142 -546
11167e46q936l562k3916j7635J302m680J4654M0338m983k652j8146L668K0303
$$ -546 -9482 -13044 -36960 -54595 -53293 -57973 -43319 -2981 -7964 -10616 -28762 -25094 -4791
11154d791j5401J163K2245J7010n378k0490q62P029R021k20J2197j1466l2964
$$ -4791 -20192 -19029 3216 20226 14848 -5642 -6504 525 9546 9326 21523 10057 -22907
11141b2907J8299J0752k444l719N505J3542k6170l6888J1855L3329n83o142j9398
$$ -22907 -4608 6144 3700 -19 5486 19028 -7142 -44030 -32175 1154 571 -5571 -24969
11128b4969j1018Q563j356R405K3830r177L2616J661l422J1725j8816K314q049
$$ -24969 -35987 -27424 -28780 -19375 4455 -4722 27894 29555 26133 37858 19042 21356 13307
11115A3307k7234J0790l6690K289J4649J668j3889J1943R510L2250J7808l2008
$$ 13307 -13927 -3137 -39827 -37538 -22889 -21221 -35110 -23167 -13657 18593 36401 4393
11103D393j3531j2489m101J0926J7351j3703j559J7506J2354j3991q781J4031
$$ 4393 -9138 -21627 -25728 -14802 2549 -11154 -12713 4793 17147 3156 -5625 8406
11091H406L2654J387n420l1861j8108K3016K5838k1925l6144m073j245m352m011
$$ 8406 41060 42447 37027 5166 -12942 10074 35912 13987 -22157 -26230 -27475 -31827 -35838
11078c5838l1194j7899L977R589o352L9724K7578n455j0245q162K406k4085K0723
$$ -35838 -67032 -84931 -80954 -71365 -77717 -37993 -10415 -15870 -26115 -34277 -31871 -55956 -35233
11065c5233O6006O547m5731l3459O172l875M057J8746R526J94j1312K81j9124
$$ -35233 30773 37320 -8411 -41870 -35698 -39573 -35516 -16770 -7244 -7050 -18362 -18081 -37205
11052c7205J7177j6277J16K1827J9160K6113k656m6686l3898k3187J746K5109
$$ -37205 -20028 -36305 -36189 -14362 4798 30911 28255 -18431 -52329 -75516 -73770 -48661
11040d8661Q722l474K2376K0948L822j8856R812L1211K7745J1307q962j2419l279
$$ -48661 -39939 -43413 -21037 -89 3733 -15123 -5311 25900 53645 64952 55990 43571 40292
11027D0292k0440k8925K1555P922J5855p193l9500n603L5993K8018K0214R063
$$ 40292 19852 -9073 12482 20404 36259 29066 -10434 -16037 19956 47974 68188 77251
11015G7251L3978J0854J8163K6358L3593N6496M2872L2505N0732P6258N995K9796
$$ 77251 111229 122083 140246 166604 200197 256693 299565 332070 382802 459060 465055 494851
11003D94851L969k9147m2950m7615o8230m1297l0970l0650n3377l0383K6224K742
$$ 494851 498820 469673 426723 379108 310878 269581 238611 207961 154584 124201 150425 153167
10991A53167n2407j4148K2633K2767n734j5870q758K4186J8988L6602K2123M2812
$$ 153167 100760 86612 109245 132012 126278 110408 101650 125836 144824 181426 203549 246361
10979B46361L7882L3783L7054L1461K7376j1500O070j3441j8383o3373p2285j9093
$$ 246361 284243 318026 355080 386541 413917 402417 408487 395046 376663 313290 241005 221912
10967B21912J77k4814l9811l1556j0832j6833k232o709j4637k1413o187J1153
$$ 221912 222089 197275 157464 125908 115076 98243 96011 89302 74665 53252 47065 58218
10955E8218p585k897j1946j0736p550P487P574j8675Q080n97j6285K886R98l841
$$ 58218 50633 47736 35790 25054 17504 24991 32565 13890 21970 21373 5088 7974 8972 5131
10941E131l744N62j6459l4239J5704K542j5079O660M795j4427j4776N762J0364
$$ 5131 1387 1949 -14510 -48749 -33045 -30503 -45582 -38922 -34127 -48554 -63330 -57568 -47204
10928d7204k3548o267K9934J3076P262R053K2307J4765K1224j1576j3908m2002
$$ -47204 -70752 -77019 -47085 -34009 -26747 -17694 4613 19378 40602 29026 15118 -26884
10916b6884p699R003L049J3473K409j7026j3341j0120M643K8781J3940n130K4865
$$ -26884 -34583 -25580 -22531 -9058 -6649 -23675 -37016 -47136 -42493 -13712 228 -4902 19963
10903A9963K3750J1267j5658N981j4767l7282n895R348j4194N929L913j3694K4136
$$ 19963 43713 54980 39322 45303 30536 -6746 -12641 -3293 -17487 -11558 -7645 -21339 2797
10890B797O1818K4320M810J9909J2078J4554K4552N0331Q445l3207J8474L4247
$$ 2797 64615 88935 93745 113654 125732 140286 164838 215169 223614 190407 208881 243128
10878B43128O7561Q1526R5813J41333J49807J68274J71895J80280J84729J34451
$$ 243128 310689 392215 488028 629361 779168 947442 1119337 1299617 1484346 1618797
10868A618797J19613Q3260K3446k6685j04527j58227j65921j59207j51124j33352
$$ 1618797 1738410 1821670 1845116 1818431 1713904 1555677 1389756 1230549 1079425 946073
10858I46073j40228q8764p7764p6874o3322k6143l5520p0385m001m1261m6667
$$ 946073 805845 717081 639317 562443 499121 472978 437458 367073 363072 321811 275144
10847B75144k4033l1945M132k1737k3316j372L493k63K0398M442j2672k7466j6046
$$ 275144 251111 219166 223298 201561 178245 176873 180366 180103 200501 204943 192271 164805 148759
10834A48759l0316j2419k3398P361J217k692j7506j5808L936k663j0398m793k861
$$ 148759 118443 106024 82626 89987 91204 88512 71006 55198 59134 56471 46073 41280 38419
10821C8419K108k104j4402j4787n625p223n671q250J6070J2192o32j4063k6003
$$ 38419 40527 38423 24021 9234 3609 -3614 -9285 -17535 -1465 10727 10095 -3968 -29971
10808b9971L081K0662k886p81m031L2481K173j0708o1332m023K2520J6402L189
$$ -29971 -26890 -6228 -9114 -9895 -13926 18555 20728 10020 -51312 -55335 -32815 -16413 -13224
10795a3224k0684o360L288M825O623j5558l2900K6899J532K7329J6933Q141J252
$$ -13224 -33908 -40268 -36980 -32155 -25532 -41090 -73990 -47091 -45559 -18230 -1297 6844 8096
10782H096P15J0659L6832j614p245J6314j6359j5747n108K4058l696l2288j6023
$$ 8096 8811 19470 56302 54688 47443 63757 47398 31651 26543 50601 46905 14617 -1406
10769a406o80K7369K7031j8064l6851q857J9797K9937O072j7629l4325k6768K8396
$$ -1406 -2086 25283 52314 34250 -2601 -11458 8339 38276 44348 26719 -7606 -34374 -5978
10756e978N343J760J5304j9737l070l647J4749J3100R079j6807M984J9602K7008
$$ -5978 -635 1125 16429 -3308 -6378 -10025 4724 17824 26903 10096 15080 34682 61690
10743F1690R998l0448N227r158k9656K951k555q453o834k2857K51M566N357M731
$$ 61690 71688 41240 46467 37309 7653 10604 8049 -404 -7238 -30095 -29844 -25278 -19921 -15190
10729a5190J7673M516j1649r957J0803P651J384k644J3592K1730J3698O860k4141
$$ -15190 2483 6999 -4650 -14607 -3804 3847 5231 2587 16179 37909 51607 58467 34326
10716C4326k9620q204J0911l743l3153j339M9354M6307J6002L9168N1943K7685
$$ 34326 4706 -3498 7413 3670 -29483 -30822 18532 64839 80841 120009 171952 199637
10704A99637J7015p91J0526k3651j7818k2828k9174k0411j7835k0508O030q168
$$ 199637 216652 215861 226387 202736 184918 162090 132916 112505 94670 74162 80192 72024
10692G2024j2745r386P036k042N450k7723k9665j1188j630R71q99M1272M806k8012
$$ 72024 59279 49893 56929 54887 60337 32614 2949 -8239 -9869 -8898 -9797 31475 36281 8269
10678H269l5352N332M627K719k80k9744j6425n07m988j578J0212K3301R397j0652
$$ 8269 -27083 -21751 -17124 -14405 -14685 -44429 -60854 -61361 -66349 -67927 -57715 -34414 -25017 -35669
10664c5669q65j8921k1543L049O548L377l688K1486L9636J6404l3290k5560k1054
$$ -35669 -36534 -55455 -76998 -73949 -67401 -64024 -67712 -46226 -6590 9814 -23476 -49036 -70090
10651g0090j517p120j46O9k020P211J2033j7995j0510J7583n994J0664R105k0777
$$ -70090 -71607 -78727 -78873 -78804 -80824 -73613 -61580 -79575 -90085 -72502 -78496 -67832 -58727 -79504
10637g9504l601K2204L9445K0162l212K1131p253o534L2287j8300m0275k1341
$$ -79504 -83105 -60901 -21456 -1294 -4506 16625 9372 2838 35125 16825 -23450 -44791
10625d4791R375K8487L3162J8776J3671L1362j3144J7005k0285Q255J9873R166
$$ -44791 -35416 -6929 26233 45009 58680 90042 76898 93903 73618 81873 101746 110912
10613A10912L8451k211J9215J2866L1986j2948m339J6400j0608k3039j6671k9080
$$ 110912 149363 147152 166367 179233 211219 198271 193932 210332 199724 176685 160014 130934
10601A30934J2332P8177K8477J3519L1431r276j7618m347o675k2628J8019K1328
$$ 130934 143266 221443 249920 263439 294870 285594 267976 263629 256954 234326 252345 273673
10589B73673J2395K9099N3051K7767m909K7916N9808O4437P0427N0085O1612K2425
$$ 273673 286068 315167 368218 395985 391076 418992 478800 543237 613664 663749 725361 747786
10577G47786L9540M6918M6097j15j8898k2205k5659j2921l5589q687K3165o698
$$ 747786 787326 834244 880341 880226 861328 839123 813464 800543 764954 756267 779432 772734
10565G72734J0086K1517k2L327k378J3935K3082L92J1302l620p105L1801j2789
$$ 772734 782820 804337 804315 807642 805264 819199 842281 842673 853975 850355 843250 875051 862262
10552H62262k767P793J0618J2065J8071J3126L6680K3410Q854J6715L3872O591
$$ 862262 859495 867288 877906 889971 908042 921168 957848 981258 990112 1006827 1040699 1047290
10540A047290R964K7284N0594K9999K5604O6897K7761L9281M1829K0317N2323
$$ 1047290 1057254 1084538 1135132 1165131 1190735 1257632 1285393 1324674 1366503 1386820 1439143
10529A439143P78K4759L8126M8711N0711O3313N4991K2996K8873L3103M2800M8304
$$ 1439143 1439921 1464680 1502806 1551517 1602228 1665541 1720532 1743528 1772401 1805504 1848304 1896608
10517A896608O7106J05716O9361N8257L6691N1520P9945Q9805N5270R8535R2246
$$ 1896608 1963714 2069430 2138791 2197048 2233739 2285259 2365204 2455009 2510279 2608814 2701060
10506B701060P7703R8951R1837J28628J43529J33587J44138J91098J86561J98394
$$ 2701060 2778763 2877714 2969551 3098179 3241708 3375295 3519433 3710531 3897092 4095486
10496D095486K33326K50973K39315K26136K81920L09038L17997L38934L45862
$$ 4095486 4328812 4579785 4819100 5045236 5327156 5636194 5954191 6293125 6638987
10487F638987M23436M79067M86734N60967O10249O42974O73579P34733P74155
$$ 6638987 7062423 7541490 8028224 8589191 9199440 9842414 10515993 11250726 12024881
10478A2024881Q43915R07428R92211J085389J156260J286042J454864J643150
$$ 12024881 12868796 13776224 14768435 15853824 17010084 18296126 19750990 21394140
10470B1394140J867882K148234K433931K736423L110899L592242M192480M930125
$$ 21394140 23262022 25410256 27844187 30580610 33691509 37283751 41476231 46406356
10462D6406356N872408P089402Q583591J0503237J3050419J6196001K0201882
$$ 46406356 52278764 59368166 67951757 78454994 91505413 107701414 127903296
10455A27903296K4999008L0171562L4713942L6904138L4915512K8170484J8421473
$$ 127903296 152902304 183073866 217787808 254691946 289607458 317777942 336199415
10448C36199415Q310160p64012r454354j8694280k7414930l2675003l3007914
$$ 336199415 344509575 343745563 334291209 315596929 288181999 255506996 222499082
10441B22499082k9745814k5144754k0605231j6706616j3593270j1153613r292277
$$ 222499082 192753268 167608514 147003283 130296667 116703397 105549784 96257507
10434I6257507p902598o830761n957054n281491m726376m277428l867430l522434
$$ 96257507 88354909 81524148 75567094 70285603 65559227 61281799 57414369 53891935
10426E3891935l237001k986323k720086k473309k289895k099967j911557j783595
$$ 53891935 50654934 47668611 44948525 42475216 40185321 38085354 36173797 34390202
10418C4390202j645141j509921j369719j288821j215861j111116j040643r84700
$$ 34390202 32745061 31235140 29865421 28576600 27360739 26249623 25208980 24224280
10410B4224280r21547q64865q43312p93147p31159p08025o77368o57020o43759
$$ 24224280 23302733 22437868 21594556 20801409 20070250 19362225 18684857 18027837 17384078
10401A7384078o10827n84833n52033n04451m49301m31586m01998m17393m06803
$$ 17384078 16773251 16188418 15636385 15131934 14682633 14251047 13849049 13431656 13024853
10392A3024853l97882l64074l42443l40759l27788k88869k50589k90062k59202
$$ 13024853 12626971 12262897 11920454 11579695 11251907 10963038 10712449 10422387 10163185
10383A0163185k30127k56547k63697k16110j98127k18330k04503j81272j29783
$$ 10163185 9933058 9676511 9412814 9196704 8998577 8780247 8575744 8394472 8264689
10374H264689j65597j58176j55648j66006j69491j94676j96024j92967j82257
$$ 8264689 8099092 7940916 7785268 7619262 7449771 7255095 7059071 6866104 6683847
10365F683847j74098j58738j64193j73895j42735r1870n9817l0096j5792K2436
$$ 6683847 6509749 6351011 6186818 6012923 5870188 5778318 5718501 5688405 5672613 5695049
10355E695049K8849O7301J21326K03757L10459L96656N71682P11540Q74490J009894
$$ 5695049 5723898 5791199 5912525 6116282 6426741 6823397 7395079 8106619 8981109 9991003
10345I991003J071402J064268R69390P16088M41029J60982j41546m30469o63547
$$ 9991003 11062405 12126673 13096063 13812151 14253180 14414162 14272616 13842147 13178600
10336A3178600q77853r49993r18822q50516p60055o68695n39188m30047l64315
$$ 13178600 12300747 11350754 10431932 9581416 8821361 8152666 7613478 7183431 6819116
10327F819116k98390k27188j90133j63132j16217o5005l573Q573L8763P5886J75806
$$ 6819116 6520726 6293538 6103405 5940273 5824056 5759051 5755478 5764051 5802814 5878700 6054506
10316F054506K58983K90169L85403N07611O23654P65550Q90125R47235R74466
$$ 6054506 6313489 6603658 6989061 7496672 8120326 8885876 9776001 10723236 11697702
10307A1697702R27352Q10909N48802K59088m6822l34683o16506q58069r91987
$$ 11697702 12625054 13435963 13984765 14243853 14197031 13862348 13245842 12387773 11395786
10298A1395786j053422j041355r40696q45022o92201n69083m97474m15630l46622
$$ 11395786 10342364 9301009 8360313 7515291 6823090 6254007 5756533 5340903 4994281
10289D994281k73552k53065k21879j93454j52863j63390j51721j32144j32836
$$ 4994281 4720729 4467664 4245785 4052331 3899468 3736078 3584357 3452213 3319377
10280C319377j07791j05372o5499p3838n4319m2615o1690r5766m7656l6535m8787
$$ 3319377 3211586 3106214 3040715 2966877 2912558 2869943 2808253 2712487 2664831 2628296 2579509
10269B579509o2734p1923j5655j2728l5143j3220j9929j9703l5451k887N918n2338
$$ 2579509 2516775 2444852 2429197 2416469 2381326 2368106 2348177 2328474 2293023 2290136 2296054 2243716
10257B243716p3664p6487l8762k5603l5907k8755k5224l1616o1398l9628j7964
$$ 2243716 2170052 2093565 2054803 2029200 1993293 1964538 1939314 1907698 1846300 1806672 1788708
10246A788708L997j9144l3817l0139o047k944j3064k9167J5178J3855l2421l5777
$$ 1788708 1792705 1773561 1739744 1709605 1703558 1700614 1687550 1658383 1673561 1687416 1654995 1619218
10234A619218l021M153K4625l4178n216k695P223N1172M2481K7289k246p682o630
$$ 1619218 1616197 1620350 1644975 1610797 1605581 1602886 1610109 1661281 1703762 1731051 1728805 1721123 1714493
10221A714493j8322j5962o0576o9693m1773l5631o2705o8328m6561o3290k7668
$$ 1714493 1696171 1680209 1619633 1549940 1508167 1472536 1409831 1341503 1294942 1231652 1203984
10210A203984K6962j5420n5005l7025p013l5768m003o736j7595j6596L372k6615
$$ 1203984 1230946 1215526 1160521 1123496 1116483 1080715 1076712 1069976 1052381 1035785 1039157 1012542
10198A012542q872j0158k0767k4818Q749J1615K808n14k0810j5145l2786k7503
$$ 1012542 1003670 993512 972745 947927 956676 968291 971099 970585 949775 934630 901844 874341
10186H74341J4122k641l5185k814K0063k0094j0918k2376o788l1340k2960r769
$$ 874341 888463 885822 850637 847823 867886 847792 836874 814498 807710 776370 753410 743641
10174G43641K6405P544K857M3937J7683j2185K0885j9606j6355k4463o743l985
$$ 743641 770046 777590 780447 824384 842067 829882 850767 831161 814806 790343 783600 779615
10162G79615j5900N866J7125J6206L0166l406N81o817K1722L905M848P742J6010
$$ 779615 763715 769581 786706 802912 833078 829672 830253 823436 845158 849063 853911 861653 877663
10149H77663j2262j6663J2340J8607J4614J3403N3047L9701j2750Q153J4209l7858
$$ 877663 865401 848738 861078 879685 894299 907702 960749 1000450 987700 995853 1010062 972204
10137I72204L135J3357J2572Q834J2509O051J7076L854K1498N3173L9863P6796
$$ 972204 975339 988696 1001268 1010102 1022611 1028662 1045738 1049592 1071090 1124263 1164126 1240922
10125A240922O8837J30621J82996K73654M12730O45037R78089J319908J503154
$$ 1240922 1309759 1440380 1623376 1897030 2309760 2954797 3932886 5252794 6755948
10116F755948J308188P71483K31932L358q8869l27878q98342j381986j371588
$$ 6755948 8064136 8835619 9067551 9070909 8982040 8654162 7755820 6373834 5002246
10107E002246j032153o86876m62206l11579k48070j60874j06365o8514o6801q8265
$$ 5002246 3970093 3283217 2821011 2509432 2261362 2100488 1994123 1925609 1858808 1770543
10097A770543q3000q5303l6539n7879q1467p1831k3626j2510m2345p5280k7816
$$ 1770543 1687543 1602240 1565701 1507822 1426355 1354524 1330898 1318388 1276043 1200763 1172947
10086A172947K088j7218m557j4829l8941l1251k2418l1262j5296j2316J779k8273
$$ 1172947 1175035 1157817 1153260 1138431 1099490 1068239 1045821 1014559 999263 986947 988726 960453
10074I60453l4696j3623o582R394o661j6337j8721m7747m0821J4170L4344K1709
$$ 960453 925757 912134 905552 914946 908285 891948 873227 825480 784659 798829 833173 854882
10062H54882k5031l6819j0596j4882j7591q759J0310R385J8651K9546K1780l723
$$ 854882 829851 793032 782436 767554 749963 741204 751514 760899 779550 809096 830876 827153
10050H27153R32n882J6486M6584J9329K5976K909l5844j8563J1470J1779j0402
$$ 827153 828085 822203 838689 885273 904602 930578 933487 897643 879080 890550 902329 891927
10038H91927K7936K7252N432M0701P0721R4275P4609J02888J34165J16210J29873
$$ 891927 919863 947115 952547 993248 1063969 1158244 1232853 1335741 1469906 1586116 1715989
10027A715989J98437J76670J50000R3897M6339J2507k9454r5664j67836j42817
$$ 1715989 1914426 2091096 2241096 2334993 2381332 2393839 2364385 2268721 2100885 1958068
10017A958068j39692j70120j35800j08615j20617j06263n2743j1645m557n9897
$$ 1958068 1818376 1648256 1512456 1403841 1283224 1176961 1124218 1112573 1108016 1048119
10007A048119n5168m4226l8590k6095K8575l609l1786j5727j1020j160j4104j5848
$$ 1048119 992951 948725 910135 884040 912615 909006 877220 861493 850473 849313 835209 819361
9995H19361J5615K4521L7811p592L3761L2234Q9234O2949K8447M0187L4848J4404
$$ 819361 834976 859497 897308 889716 923477 955711 1044945 1107894 1136341 1176528 1211376 1225780
9983A225780j1519j0963k6005m8237m5860p8195n2997m7119p2054o4519k5847
$$ 1225780 1214261 1203298 1177293 1129056 1083196 1005001 952004 904885 832831 768312 742465
9972G42465j8102M491J4746K4760j240k5806k2272J1426K4959k3670m6722O269
$$ 742465 724363 728854 743600 768360 767120 741314 719042 730468 755427 731757 685035 691304
9960F91304j059q913m0686l964m026j5520K3241j9563j4386K2607N328j4173j6529
$$ 691304 690245 681332 640646 636682 632656 617136 640377 620814 606428 629035 634363 620190 603661
9947F03661j1240J3397l4017j9137P260M987o074n2435j8376l4212Q237M2516
$$ 603661 592421 605818 571801 552664 559924 564911 558837 506402 488026 453814 462051 504567
9935E04567J6290j0343l7496j0437J6602N411J4839K0214K809K5758L738k5703
$$ 504567 520857 510514 473018 462581 479183 484594 499433 519647 522456 548214 551952 526249
9923E26249p661J0485j0883k9013j7830K4124M348k4876j960L921k1469J6159
$$ 526249 518588 529073 518190 489177 471347 495471 499819 474943 472983 476904 455435 471594
9911D71594R587r08N811L6256j205j264K0286K5295j15L6025J1635L572K5981
$$ 471594 481181 480273 486084 522340 521135 519871 540157 565452 565337 601362 612997 616569 642550
9898F42550L7552M9675K6851j1763L0600j1249n0937j6962l484q497k6340k6057
$$ 642550 680102 729777 756628 744865 775465 764216 713279 696317 692833 684336 657996 631939
9886F31939q336p737j4582k4665k806j0723n048j5386M398J8317J4874l911j3944
$$ 631939 623603 615866 601284 576619 573813 563090 558042 542656 547054 565371 580245 576334 562390
9873E62390Q388J4094J0241o957o777p29P053P467n752o378P332K542l2768l564
$$ 562390 570778 584872 595113 588156 581379 580650 587703 595170 589418 583040 590372 592914 560146 556582
9859E56582P45L0446J5802r368J5662K3962K13j6812o098j213m993j4911J0968
$$ 556582 557327 587773 603575 594207 609869 633831 634044 617232 611134 609921 604928 590017 600985
9846F00985m954j1391j7793k3863j1943L1107L6378O268l0888J935o189K1786
$$ 600985 596031 584640 566847 542984 531041 562148 598526 604794 573906 575841 569652 591438
9834E91438K0590o228r837P751p865n257k2988k7143k3512K5930L1318n533j1969
$$ 591438 612028 605800 595963 603714 595849 590592 567604 540461 516949 542879 574197 568664 556695
9821E56695q773l2761R777R354j3171m605j2462M462J7241j2185o831P048Q758
$$ 556695 547922 515161 524938 534292 521121 516516 504054 508516 525757 513572 506741 513789 522547
9808E22547k2172k9594j0476j2259j4198J8800M2578r40Q424j4355M884N884R385
$$ 522547 500375 470781 460305 448046 433848 452648 495226 494286 502710 488355 493239 499123 508508
9795E08508J6498m486J1428j6246P425R18j0974j005K213k8749J1549M8864L526
$$ 508508 525006 520520 531948 515702 523127 524045 513071 512066 514279 485530 497079 545943 549469
9782E49469l5886j1943L5338K2045J9935j317m5820k7858J009Q890J9934j6507
$$ 549469 513583 501640 536978 559023 578958 577641 531821 503963 504972 513862 533796 517289
9770E17289l519n573J0808N548j0231j5894K7945j1653l1394N071J1206M934l379
$$ 517289 513770 508197 519005 524553 514322 498428 526373 514720 483326 488397 499603 504537 501158
9757E01158j3604j715K0187m0k0127L471R565p05O619L486K2114L4956J6529k2098
$$ 501158 487554 485839 506026 505986 485859 489330 498895 498190 504809 508295 530409 565365 581894 559796
9743E59796j9196N757K5696J1029P46k3494O427K5809l074N977J426m892N679
$$ 559796 540600 546357 572053 583082 583828 560334 566761 592570 589496 595473 596899 592007 597686
9730E97686J3117J5152k398K207k0135j1816j0056j0290J534n534j4009j1880
$$ 597686 610803 625955 623557 625764 605629 593813 583757 573467 575001 569467 555458 543578
9718E43578J6574k1342q210M608k6766J1225K6006M1160J3039j6271j4040j1561
$$ 543578 560152 538810 530600 535208 508442 519667 545673 586833 599872 583601 569561 558000
9706E58000k2347J2711M1966P912m478Q421K030K8314L5312J9371L2491M5566
$$ 558000 535653 548364 590330 598242 593764 602185 604215 632529 667841 687212 719703 765269
9694G65269P8174Q2222R3010J03971R2131J02954O8361M7793M3002R504k7260
$$ 765269 843443 925665 1018675 1122646 1214777 1317731 1386092 1433885 1476887 1486391 1459131
9683A459131m8651n0325q9769j09549r9893p6973o5494o2786n7624n6232m0405
$$ 1459131 1410480 1360155 1270386 1160837 1060944 983971 918477 855691 798067 741835 701430
9672G01430J2958Q084k0551k5881j6666o558j6655k3302l425J1628K3247j0735
$$ 701430 714388 722472 701921 676040 659374 652816 636161 612859 609434 621062 644309 633574
9660F33574j5717j2596J2038o744L536k178j8095j3079K8433L634m2322R793J7339
$$ 633574 617857 605261 617299 610555 614091 611913 593818 580739 609172 612806 570484 580277 597616
9647E97616J9786k4703j2451J1789Q982k0138J6314P755k1159k0543R158j8956
$$ 597616 617402 592699 580248 592037 601019 580881 597195 604950 583791 563248 572406 553450
9635E53450j4465M699j0174j5554J0106J7124O964O628k0061j4125O818K4229
$$ 553450 538985 543684 533510 517956 528062 545186 552150 558778 538717 524592 531410 555639
9623E55639j459J4372Q984o837K2423L5857j7071n3703J9226q333m0088Q735K4746
$$ 555639 554180 568552 577536 570699 593122 628979 611908 558205 577431 569098 529010 537745 562491
9610E62491m889J4358j536q089j8531K2086K1619k0522j2517k1208j44L2872K7201
$$ 562491 557602 571960 570424 562335 543804 565890 587509 566987 554470 533262 533118 565990 593191
9597E93191k939n248k6442j2715n11J297J7574L691j3046k3867l040J7641J2381
$$ 593191 590252 585004 558562 545847 545336 546633 564207 567898 554852 530985 527945 545586 557967
9584E57967q316K3426J9676J0314j8259p631j6156K318K2283O994K2110j1433
$$ 557967 549651 573077 592753 603067 584808 577177 561021 563339 585622 592616 614726 603293
9572F03293l8940J3698K1746J1357p608q000J6320Q124k5212j4915j0708o991
$$ 603293 564353 578051 599797 611154 603546 595546 611866 619990 594778 579863 569155 562164
9560E62164K6163O007O228K0310J434k4646j8696P968J4743L1281m338k0821o535
$$ 562164 588327 594334 600562 620872 622306 597660 578964 586932 601675 632956 628618 607797 601262
9547F01262j2753n592J9376k862k585O087Q052P789R590l3515k7432K2515m708
$$ 601262 588509 582917 602293 599431 596846 602933 610985 618774 628364 594849 567417 589932 585224
9534E85224j8536J4790p362K3609O04r480j6490M525J5172K3396J8988k0338j1050
$$ 585224 566688 581478 574116 597725 598329 588849 572359 576884 592056 615452 634440 614102 603052
9521F03052j3411j4976l411Q844L7862K2073M388j600j2097k3981j6825J1076
$$ 603052 589641 574665 571254 580098 617960 640033 644421 642821 630724 606743 589918 600994
9509F00994J1940J4021O914k421k4015l8004N198L122J5911m550J4192L8237J4580
$$ 600994 612934 626955 633869 631448 607433 569429 574627 577749 593660 589110 603302 641539 656119
9496F56119J909N304J0554j6593k3793j1815R341R838n463J9148p429q599j0480
$$ 656119 658028 663332 673886 657293 633500 621685 631026 640864 635401 654549 647120 638521 628041
9483F28041K839P969j3433J0058m252m760n674n61J649o10q480j8332P63k401
$$ 628041 630880 638849 625416 635474 631222 626462 620788 620227 621876 621266 612786 594454 595217 592816
9469E92816p151K5969K033m769n826l5182J078M0354K9847j5068j1807M601L1363
$$ 592816 585665 611634 613667 608898 603072 567890 568968 609322 639169 624101 612294 616895 648258
9456F48258K6215J2560m1500j3619J4781J9117p002o274o849J2389J291J2125
$$ 648258 674473 687033 645533 631914 646695 665812 658810 652536 645687 658076 659367 671492
9444F71492L7688n846j4255n650j5556K9575J0439J0195K70K6243Q339k4665k3316
$$ 671492 709180 703334 689079 683429 667873 697448 707887 718082 718352 744595 752934 728269 704953
9431G04953j5625j9164n870L1814L9096K101k3482m848J9363J3689l8255j9502
$$ 704953 689328 670164 664294 696108 735204 737305 713823 708975 728338 742027 703772 684270
9419F84270M9506k688j8319K7836K8376Q115r524J1040Q69r144k778k0551l165
$$ 684270 733776 731088 712769 740605 768981 777096 767572 778612 779481 770337 767559 747008 743843
9406G43843O936J37l0067J0087M6121K6996J0759j9421k5608K6605L740K766o593
$$ 743843 750779 750916 720849 730936 777057 804053 814812 795391 769783 796388 800128 802894 796301
9393G96301j1390k0171K8806K8198j1153j7309J9511K1409K9949o835k3013k0624
$$ 796301 784911 764740 793546 821744 810591 793282 812793 834202 864151 857316 834303 813679
9381H13679L7731J0849m589O355J4030J2430J5321J8283r182k8868M741M2742
$$ 813679 851410 862259 857670 864025 878055 890485 905806 924089 914907 886039 890780 933522
9369I33522j0162j5944J096q6K4833l658k2907p852N164j1516o166J6501K3095
$$ 933522 923360 907416 908512 908426 933259 929601 906694 898842 904006 892490 886324 902825 925920
9356I25920l479k393K9510J6015N464M0398J7696q241l615P443k8207l9599J7225
$$ 925920 922441 920048 949558 965573 971037 1011435 1029131 1020890 1017275 1024718 996511 956912 974137
9343I74137L6801K287J0429K8628J9140r662j3858j8241K8473K4046l326m639
$$ 974137 1010938 1013225 1023654 1052282 1071422 1061760 1047902 1029661 1058134 1082180 1078854 1074215
9331A074215J4756J8989N853k281K9047K2360J3717J5878j1930k1112J7657J8599
$$ 1074215 1088971 1107960 1113813 1111532 1140579 1162939 1176656 1192534 1180604 1159492 1177149 1195748
9319A195748K0683K0467J297J2912J8788m21k1636M276l888l1160k530M1936L4428
$$ 1195748 1216431 1236898 1238195 1251107 1269895 1269474 1247838 1252114 1248226 1217066 1214536 1256472 1290900
9306A290900K1234p022K5605K0578K2153M0898L2544R523j154Q739m94J1178L0537
$$ 1290900 1312134 1305112 1330717 1351295 1373448 1414346 1446890 1456413 1455259 1463998 1463504 1474682 1505219
9293A505219P484m384M551K7968J8403m979J7955J3857L3414L0448J7475J1801
$$ 1505219 1512703 1508319 1512870 1540838 1559241 1554262 1572217 1586074 1619488 1649936 1667411 1679212
9281A679212N9389K8348J0400K6388k0800k6083j1229M9120M1669M8324O119K554
$$ 1679212 1738601 1766949 1777349 1803737 1782937 1756854 1745625 1794745 1836414 1884738 1890857 1893411
9269A893411J078K6947L7982N9528J7545J1686J7556K0846N7333M3554K9499K5652
$$ 1893411 1894489 1921436 1959418 2018946 2036491 2048177 2065733 2086579 2143912 2187466 2216965 2242617
9257B242617L954J6780K9182N0239J9052L50L3830K9205N7055M4408N2365L4671
$$ 2242617 2246571 2263351 2292533 2342772 2361824 2362174 2396004 2425209 2482264 2526672 2579037 2613708
9245B613708L4433R395J6390K9963L5071L5059N2549N3949L9397M3968L8390L4787
$$ 2613708 2648141 2657536 2673926 2703889 2738960 2774019 2826568 2880517 2919914 2963882 3002272 3037059
9233C037059N8907N9183L8572N2314M5591M2385J8247L4533L4008J07807J07998
$$ 3037059 3095966 3155149 3193721 3246035 3291626 3334011 3352258 3386791 3420799 3528606 3636604
9222C636604N9532O9907O5118R3450L8683L4297R0117R5263O2087O7065P7159
$$ 3636604 3696136 3766043 3831161 3924611 3963294 3997591 4087708 4182971 4245058 4312123 4389282
9211D389282Q2763R3676J10119R8238O9035P7424J15166J06295P7581R3597J17090
$$ 4389282 4472045 4565721 4675840 4774078 4843113 4920537 5035703 5141998 5219579 5313176 5430266
9200E430266J17791J16055J07522Q9390J43929J45905J17531J23196J53279J54246
$$ 5430266 5548057 5664112 5771634 5861024 6004953 6150858 6268389 6391585 6544864 6699110
9190F699110J85392J97547J50393J48930J64870J55446J64053K06507K11774J90269
$$ 6699110 6884502 7082049 7232442 7381372 7546242 7701688 7865741 8072248 8284022 8474291
9180H474291K19764K29774K41815K30909K31297K13167K62271K82699K90444K98966
$$ 8474291 8694055 8923829 9165644 9396553 9627850 9841017 10103288 10385987 10676431 10975397
9170A0975397K80573K78328K80033L20107L31704L27152K91141L63907M08767
$$ 10975397 11255970 11534298 11814331 12134438 12466142 12793294 13084435 13448342 13857109
9161A3857109L70912L56606L48961L75473L99805M08367L99082M04985L74529
$$ 13857109 14228021 14584627 14933588 15309061 15708866 16117233 16516315 16921300 17295829
9152A7295829L91581M32342M02659M17232M03925M14211M00594M10506M01113
$$ 17295829 17687410 18119752 18522411 18939643 19343568 19757779 20158373 20568879 20969992
9143B0969992M21376L90774L61541L57280L50005L30010K75984K48335K76035
$$ 20969992 21391368 21782142 22143683 22500963 22850968 23180978 23456962 23705297 23981332
9134B3981332K50227K08051J34749J28576J04328J00493O2841K5360k9402j2701
$$ 23981332 24231559 24439610 24574359 24702935 24807263 24907756 24970597 24995957 24966555 24953854
9124B4953854k8404p4423j24152j70591j71798j64538k09873k63323k65986k53841
$$ 24953854 24925450 24851027 24726875 24556284 24384486 24219948 24010075 23746752 23480766 23226925
9114B3226925k71469l33402k96063k88681l50195l55641l30274l48905l46251
$$ 23226925 22955456 22622054 22325991 22037310 21687115 21331474 21001200 20652295 20306044
9105B0306044l49872l48221l74651l90760l31952l59151l84361l45347l59777
$$ 20306044 19956172 19607951 19233300 18842540 18510588 18151437 17767076 17421729 17061952
9096A7061952l40742l27259l13187k98356l35120l27449l20424l16259k83720
$$ 17061952 16721210 16393951 16080764 15782408 15447288 15119839 14799415 14483156 14199436
9087A4199436k95910k66750k76821k95850k77790k30591k53844k78600k75364
$$ 14199436 13903526 13636776 13359955 13064105 12786315 12555724 12301880 12023280 11747916
9078A1747916k18008k49922k15369k35799k20654k31339k22751j84625k01000
$$ 11747916 11529908 11279986 11064617 10828818 10608164 10376825 10154074 9969449 9768449
9069I768449k19210j96347j43051j44046j70897k10411j86123j64553j56175j71131
$$ 9768449 9549239 9352892 9209841 9065795 8894898 8684487 8498364 8333811 8177636 8006505
9059H006505j75216j45236j20723j22525j36291j37819j36275j65444j17803j44532
$$ 8006505 7831289 7686053 7565330 7442805 7306514 7168695 7032420 6866976 6749173 6604641
9049F604641j19302p2004j03625j08055q7210j01525j36931j23890r8080q8555
$$ 6604641 6485339 6413335 6309710 6201655 6114445 6012920 5875989 5752099 5654019 5565464
9039E565464q8051p5026q0792r9286q5095q3960o4829r3347r8234j03445o2403
$$ 5565464 5477413 5402387 5321595 5222309 5137214 5053254 4988425 4895078 4796844 4693399 4630996
9028D630996m8448m4832p5460j07501p6618n8582n7574n8331o2752o7738l9888
$$ 4630996 4582548 4537716 4462256 4354755 4278137 4219555 4161981 4103650 4040898 3973160 3933272
9017C933272l5298m2750n9608q4721o9736k9113m7281o6712m2622l8202l6521
$$ 3933272 3897974 3855224 3795616 3710895 3641159 3612046 3564765 3498053 3455431 3417229 3380708
9006C380708l0782m3917p5839p4194m426l0960o3032n2499l4752o1345k5375j0276
$$ 3380708 3349926 3306009 3230170 3155976 3151550 3120590 3057558 3005059 2970307 2908962 2883587 2873311
8994B873311j3853j7375o618m194k3866q0611o6663o1579q083J6967j7478k9978
$$ 2873311 2859458 2842083 2835465 2831271 2807405 2726794 2660131 2598552 2590469 2607436 2589958 2559980
8982B559980k4623m1405l5097p164N180k0027j7975k9220j7369l1634k3576k5989
$$ 2559980 2535357 2493952 2458855 2451691 2456871 2436844 2418869 2389649 2372280 2340646 2317070 2291081
8970B291081k0725k7114o1898k0603j4473r712j4557m7449p067j947j2662j2371
$$ 2291081 2270356 2243242 2181344 2160741 2146268 2136556 2121999 2074550 2067483 2065536 2052874 2040503
8958B040503j1190j4060O518l7092r825k459k0341q413l9710m1759k6571j2253
$$ 2040503 2029313 2015253 2021771 1984679 1974854 1972395 1952054 1943641 1903931 1862172 1835601 1823348
8946A823348J8647J0751j6820j7629j2698l390K380n846l4857l4072l3368J011
$$ 1823348 1841995 1852746 1835926 1818297 1805599 1802209 1804589 1798743 1763886 1729814 1696446 1697457
8934A697457J3548k2825j6616l815j9655l0095j0142J8761R130j4149k2646j7926
$$ 1697457 1711005 1688180 1671564 1667749 1648094 1617999 1607857 1626618 1635748 1621599 1598953 1581027
8922A581027J2092k7661j3822o516l3799J2976j2436J1647o0656l1967R458L4811
$$ 1581027 1593119 1565458 1551636 1545120 1511321 1524297 1511861 1523508 1462852 1430885 1440343 1475154
8910A475154N470k4849l2422l6016k2967j3627J6480L5932j1418k376j0223n339
$$ 1475154 1480624 1455775 1423353 1387337 1364370 1350743 1367223 1403155 1391737 1389361 1379138 1373799
8898A373799k8646R037R251j8954j4554O09j1307j1365M519J3098K1470j3617
$$ 1373799 1345153 1354190 1363441 1344487 1329933 1330542 1319235 1307870 1312389 1325487 1346957 1333340
8886A333340k3257m1281m9935j6782J9894J9904p035l2076j453Q768l016Q647
$$ 1333340 1310083 1268802 1218867 1202085 1221979 1241883 1234848 1202772 1201319 1210087 1207071 1215718
8874A215718J81j9703m9818k9719O259J8080K2909l820k3616L852Q159J0229j4616
$$ 1215718 1215899 1196196 1146378 1116659 1122918 1140998 1163907 1160087 1136471 1140323 1148482 1158711 1144095
8861A144095j9495l8094k3695J3508K3091L034J3106j2844k1963j4752k4234j2749
$$ 1144095 1124600 1086506 1062811 1076319 1099410 1102444 1115550 1102706 1080743 1065991 1041757 1029008
8849A029008K614k0497j0133L8778l959j7248j9911k2511J6433J1566K40k308
$$ 1029008 1031622 1011125 1000992 1039770 1035811 1018563 998652 976141 992574 1004140 1004380 1002072
8837A002072r198j1808k2719m826P527j7012j0796j4635j83R330J5670M856k5202
$$ 1002072 992874 981066 958347 953521 961048 944036 933240 918605 918422 927752 943422 948278 923076
8824I23076j296K488j0619l963j923N979K7797r221n073P471O987N396k6193j9402
$$ 923076 921780 924268 913649 909686 907763 913742 941539 932318 927245 934716 941703 947099 920906 901504
8810I01504J7889k2978l0899M36J3390R763o793k124j746l0624k0832J6318j1501
$$ 901504 919393 896415 865516 865952 879342 889105 882312 880188 878442 847818 826986 843304 831803
8797H31803p48k219N003K2052Q233m922j0846r402j8050k4843p329K543J6346
$$ 831803 831055 828836 833839 855891 864124 859202 848356 838954 820904 796061 788732 791275 807621
8784H07621m0163l2646J0695K0455L4220Q280J3050J9716j7202k2334K0624K0340
$$ 807621 767458 734812 745507 765962 800182 808462 821512 841228 824026 801692 822316 842656
8772H42656j343j5326j1143J40r054J4368j7981j2611m4149Q88K4215l013L196
$$ 842656 841313 825987 814844 814984 805930 820298 802317 789706 745557 746445 770660 767647 770843
8759G70843k2333j5564K444n154P89l485O289p18J3580j2091J9644j614J6560
$$ 770843 748510 732946 735390 730236 731025 727540 733829 733111 746691 734600 754244 752630 769190
8746G69190J090k2544l7812j5934L0711K2296Q191k5228k8175j1822J9669Q94
$$ 769190 770280 747736 709924 693990 724701 746997 755188 729960 701785 689963 709632 710526
8734G10526j125J60J979m3193k370K6123m966J2136J8474L811m790M809k5666
$$ 710526 709401 709561 711540 668347 665977 692100 687134 699270 717744 721555 716765 721574 695908
8721F95908N130N989k1037n120K6822M4840N0665K3425k8945l5757J4996j0635
$$ 695908 701038 707027 685990 680870 707692 752532 803197 826622 797677 761920 776916 766281
8709G66281k1509k7936k606M280l1098k3475L6485j6253j968K9275R08j4970m0700
$$ 766281 744772 716836 714230 718510 687412 663937 700422 684169 682201 711476 712384 697414 656714
8696F56714O884J6206j2734O298m61p279J3059k5788j0581j3289j4467j1098l128
$$ 656714 663598 679804 667070 673368 672907 665628 678687 652899 642318 629029 614562 603464 600336
8683F00336J6080P654M2109K1512l932l2374k2279R845K5246J193j5574j1150
$$ 600336 616416 624070 666179 687691 683759 651385 629106 638951 664197 665390 649816 638666
8671F38666J9016m141r402q871k2822j6629J1690J1535J2711K0799M106j8154
$$ 638666 657682 653541 644139 635268 612446 595817 607507 619042 631753 652552 656658 638504
8659F38504l410n283J6324K220J34o014N54j6897l008O733o619o321L960J3693
$$ 638504 635094 629811 646135 648355 648489 642475 643029 626132 623124 629857 623238 616917 620877 634570
8645F34570p27K01k920j8367j8483O608K9420M3135J2036J4830K5685O534K336
$$ 634570 633843 634044 631124 612757 594274 600882 630302 673437 685473 700303 725988 732522 734858
8632G34858P290N639J2313N65k3732k3980k4106k4552N602M504k3094j7635L244
$$ 734858 742148 747787 760100 760665 736933 712953 688847 664295 669897 674401 651307 633672 636916
8619F36916k0872j8255K0882N887J7802k4886k0590K1034K4971m066K3202J9654
$$ 636916 616044 597789 618671 624558 642360 617474 596884 617918 642889 638823 662025 681679
8607F81679J1911j2491j5480j6428J0154l631J2675K2022J6538N708Q732k369
$$ 681679 693590 681099 665619 649191 659345 655714 668389 690411 706949 712657 721389 719020
8595G19020L7288M8802L1704L2992J3214J1912k959j2123O930l772R144k8437
$$ 719020 756308 805110 836814 869806 883020 894932 891973 879850 886780 883008 892152 863715
8583H63715j6857j3778k5677l4522j7150P324k1129l2049j0666k065J0350M309
$$ 863715 846858 833080 807403 772881 755731 763055 741926 709877 699211 697146 707496 711805
8571G11805j9960k4950j4151j1607j3423l9283n834R66J1136l3858l7775J4667
$$ 711805 691845 666895 652744 641137 627714 588431 582597 583563 594699 560841 523066 537733
8559E37733n235J1269n704j6952j920K5566l913k9907k6433M3571K2601j416j7108
$$ 537733 532498 543767 538063 521111 519191 544757 540844 510937 484504 528075 550676 549260 532152
8546E32152J4200q296k1790k2491k3884o242J2173M0246j7431j0623J1143K3665
$$ 532152 546352 538056 516266 493775 469891 463649 475822 516068 498637 488014 499157 522822
8534E22822J467m7485o301q458o035J4851K176J88m2783R969L4579J8213J0967
$$ 522822 524289 476804 470503 462045 456010 470861 473037 473225 430442 440411 474990 493203 504170
8521E04170K1214r369k5502l4209m682J3121j5681j448k03j5407q971Q464J1111
$$ 504170 525384 516015 490513 456304 451622 464743 449062 447614 447411 432004 423033 431497 442608
8508D42608R010M141N291j2751J5857k687j368j3351o721J2264l2033l1663L308
$$ 442608 451618 455759 461050 448299 464156 461469 460101 446750 440029 452293 420260 388597 391905
8495C91905J6546P280M16R919J1407N615l293k4774P472J0899J0605m9183l1579
$$ 391905 408451 415731 416147 426066 437473 443088 439795 415021 422493 433392 443997 394814 363235
8482C63235N167J5501M389J4065J199R288J3206k020l306J2376Q927R574n555
$$ 363235 368402 383903 388292 402357 403556 412844 426050 424030 420724 433100 442027 451601 446046
8469D46046k2966J2599l830k0665k4220j391J3260J3590J1474K2385P24k014q450
$$ 446046 423080 435679 431849 411184 386964 385573 398833 412423 423897 446282 447006 444992 436542
8456D36542L618K190O341J8178P469p040q590n200Q310L8045J5487l8196n2901
$$ 436542 440160 442350 448691 466869 474338 467298 458708 453508 461818 499863 515350 477154 424253
8443D24253j9917J2099j0213m706k131J4234p58j1548L648l0562k2222J0717K6613
$$ 424253 404336 416435 406222 401516 399385 413619 412861 401313 404961 374399 352177 362894 389507
8430C89507k731J4725l84J0773m291k2299M268J247j2008k4842j8553l783L5258
$$ 389507 386776 401501 401117 411890 407599 385300 389568 390815 378807 353965 335412 331629 366887
8417C66887L5410K6179L1603j9184n6045k5223K4422Q05n983Q729J9912J3756
$$ 366887 402297 428476 460079 440895 384850 359627 384049 384854 378871 387600 407512 421268
8405D21268j7212J8296L1931O433k2986j5774J0796n3499n5663j3975Q752J4039
$$ 421268 404056 422352 454283 460716 437730 421956 432752 379253 323590 309615 318367 332406
8393C32406j9142M851Q424O962k6451m3029J612m450J5871J7921K0323k2732n254
$$ 332406 313264 318115 326539 333501 307050 264021 265633 261183 277054 294975 315298 292566 287312
8380B87312J7365M673m046P438J0738k4937n938J4106r177k7415o175L0454J6625
$$ 287312 304677 309350 305304 312742 323480 298543 292605 306711 297534 270119 263944 294398 311023
8367C11023J8467p585j8086j5458J568K3140j729k5921j5901K0034J2337p663
$$ 311023 329490 321905 303819 288361 289929 313069 311340 285419 269518 289552 301889 294226
8355B94226l934j5887j920m011J0298K9512L471k0092j3330K6383m82J730K274
$$ 294226 290292 274405 272485 268474 278772 308284 311755 291663 278333 304716 304234 305964 308238
8342C08238q992L984l241j2119m549J2213J6515p395l4333k8860M851P036j0377
$$ 308238 299246 303230 299989 287870 283321 295534 312049 304654 270321 241461 246312 253348 242971
8329B42971k108J6106K9063L0521K3188j0282Q035j5603p317j5721j2452q174
$$ 242971 240863 256969 286032 316553 339741 329459 337494 321891 314574 298853 286401 278227
8317B78227P642P2j5592o411K6278K4357J9436O044J066N095l3218k899j2252
$$ 278227 285869 285941 270349 263938 290216 314573 334009 340053 341119 346214 312996 310097 297845
8304B97845j4834N452J4584j8388k8046O138j8697l2121O036K1284P304L0218
$$ 297845 283011 288463 303047 284659 256613 262751 244054 211933 217969 239253 246557 276775
8292B76775J6855Q824J6641J1092J739N417M560l4868l822o661J6078L144j7422
$$ 276775 293630 302454 319095 330187 331926 337343 341903 307035 303213 296552 312630 315774 298352
8279B98352J1933k0771m234l45k002k2182k6349k0346L6969R125K8631j7040k5180
$$ 298352 310285 289514 285280 284935 282933 260751 234402 214056 251025 260150 288781 271741 246561
8266B46561K981J9431k4671j9111j3943J7366K7637o380j6059r442J9709K4216
$$ 246561 249542 268973 244302 225191 211248 228614 256251 249871 233812 224370 244079 268295
8254B68295J0269p430L682J4412L35q862j927j4586J2526m957j2723r598K3557
$$ 268295 278564 271134 274816 289228 289563 280701 278774 264188 276714 271757 259034 249436 272993
8241B72993J0143O106r953j8504j5676k0025P751j1157n078k9773K533j3179J6446
$$ 272993 283136 289242 279289 260785 245109 225084 232835 221678 216600 186827 189360 176181 192627
8228A92627J1309K5778k8776O974k3813J6966N898J3046J0024k120j0221K3760
$$ 192627 203936 229714 200938 207912 184099 201065 206963 220009 230033 227913 217692 241452
8216B41452P20m0622o357K1813K8021o216k9685q57j1736k2195J8119J1182m495
$$ 241452 242172 201550 195193 217006 245027 238811 209126 208269 196533 174338 192457 203639 199144
8203A99144r884L453j1763k7477P844K1430L4876J4711K34j3842l2459j233L3880
$$ 199144 189260 192713 180950 153473 161317 182747 217623 232334 232568 218726 186267 185034 218914
8190B18914k357j9598m327J6914l1247K466N2279K5133k323k022r210k4111J9560
$$ 218914 216557 196959 192632 209546 178299 180765 233044 258177 255854 253832 244622 220511 240071
8177B40071p255J0771l556j8553j8697J5627J9071m4275j8808P0J6188k7446r661
$$ 240071 232816 243587 240031 221478 202781 218408 237479 193204 174396 174466 190654 163208 153547
8164A53547M407L4795J481r058J3598K229K3478M68l6790j4048N296O301L3040
$$ 153547 157954 192749 194230 185172 198770 200999 224477 224945 188155 174107 179403 185704 218744
8151B18744J4808l2604j1899J6180j4699k1892J696J3630M793j61j1425j0672
$$ 218744 233552 200948 189049 205229 190530 168638 170334 183964 188757 188596 177171 166499
8139A66499L0146K3806k3085l2490J526j350J5553J0485L117J8225j7406l1367
$$ 166499 196645 220451 197366 164876 166402 165052 180605 191090 194207 212432 195026 163659
8127A63659J9436j2712j7149k16J6704k2737k0114K22K3516K8506J7127j513m0455
$$ 163659 183095 170383 153234 153018 169722 146985 126871 127093 150609 179115 196242 194729 154274
8114A54274l5296O004L0503o196j5622L431L5890j56j1322L2665O634j3891l0405
$$ 154274 118978 124982 155485 149289 133667 137098 172988 172832 161510 194175 200809 186918 156513
8101A56513J2556L7959k147k1429m470p597J227j758L681k6131M7048J3440l0351
$$ 156513 169069 207028 204881 183452 178982 171385 172612 170854 174535 148404 195452 208892 178541
8088A78541l054J2192K8983m331o5238k0330L802R491M638J8406K058m840j0774
$$ 178541 175487 187679 216662 212331 147093 126763 130565 140056 144694 163100 165158 160318 149544
8075A49544j9111j0294M357j3279L1026J5062j6282o335J3849J4654L3454K613
$$ 149544 130433 120139 124496 111217 142243 157305 141023 134688 148537 163191 196645 199258
8063A99258O637l0265k2760K4325K8900l93N703K828J0951j0954k5618L739L7152
$$ 199258 205895 175630 152870 177195 206095 205702 211405 214233 225184 214230 188612 192351 229503
8050B29503r62m0618k5047M2371R693k6689j5703P280J1156l2576k745J1680O660
$$ 229503 228541 187923 162876 205247 214940 188251 172548 179828 190984 158408 155663 167343 174003
8037A74003K0605j603j5258k6196J6112R131k5791J253L6915L5052J6242J4775
$$ 174003 194608 193005 177747 151551 167663 176794 151003 152256 189171 224223 240465 255240
8025B55240r824j4679J075J5204r317j2621R040K4403m78j4127k7665j7754j0125
$$ 255240 245416 230737 231812 247016 237699 225078 234118 258521 258043 243916 216251 198497 188372
8012A88372J6709J7429J4214j4328J812N750k0724l1560k1508Q445L0665R103
$$ 188372 205081 222510 236724 222396 224208 229958 209234 177674 156166 164611 195276 204379
8000B04379J6328M970K2352K0693l273j747Q531j9381r259J0133J81j2804k3588
$$ 204379 220707 225677 248029 268722 265449 263702 272233 252852 243593 253726 253907 241103 217515
7987B17515j7685q478j0195k19K48m3752k1286p420R692L4112L6205O943l2035
$$ 217515 199830 191352 181157 180938 181186 137434 116148 108728 118420 152532 188737 195680 163645
7974A63645j0833K2509L081J3582P30r842P34J6900k0056l022K5732K5641L4866
$$ 163645 152812 175321 178402 191984 192714 182872 183606 200506 180450 177428 203160 228801 263667
7961B63667j7345k0235Q92K2115l230J7120Q878q013j4616J3236L7260j743O714
$$ 263667 246322 226087 226979 249094 245864 262984 271862 263849 249233 262469 299729 297986 304700
7948C04700r215m9255k6891j9818R52j4152K281R872K8040R215J4623P900K556
$$ 304700 295485 246230 219339 199521 200473 186321 188602 198474 226514 235729 250352 258252 260808
7935B60808J4944J0562o637p248N212o20m0899j9557K2012K6213k6495k2014l777
$$ 260808 275752 286314 279677 272429 277641 277021 236122 216565 238577 264790 238295 216281 212504
7922B12504J3864k0750j1781J2594K0086J3680L456j3225j1743j6788J4995K5786
$$ 212504 226368 205618 193837 206431 226517 240197 243653 230428 218685 201897 216892 242678
7910B42678m5m265k38l9575N025K7556k1805m9565J1112Q457j0239K7963M4811
$$ 242678 242633 238368 238130 198555 203580 231136 209331 159766 170878 179335 169096 197059 241870
7897B41870j3865l2960j7231K2814k6096l513j312K0217j8480o307k189r608O474
$$ 241870 228005 195045 177814 200628 174532 171019 169707 189924 171444 165137 162948 153340 159814
7884A59814K316J4447j8911p181N308o734J3191m552m741l97J4749m861j8458
$$ 159814 162130 176577 157666 150485 155793 149059 162250 157698 152957 152560 167309 162448 143990
7871A43990k5655j5445J33J8115L3399P644o99j4740k6647j9298L273J1308o65
$$ 143990 118335 102890 103023 121138 154537 162181 161482 146742 120095 100797 104070 115378 114713
7858A14713q714M400O422J0265L5413k4608m13J8685j2194L899J3640k089p230
$$ 114713 105999 110399 116821 127086 162499 137891 137478 156163 143969 147868 161508 159419 152189
7845A52189k1389K177O088j0521l657J1850q037J6678L475Q451J029j6417k2893
$$ 152189 130800 132977 139065 128544 124887 136737 128700 145378 148853 157304 158333 141916 119023
7832A19023k0308L691q402J266j5017J8971J4769J0966p272j8993j5678J0365
$$ 119023 98715 102406 94004 95270 80253 99224 113993 124959 117687 98694 83016 93381
7820I3381J9404O170J790J2265k7513k2064J9317j1576k7944J207J1167n27Q963
$$ 93381 112785 118955 120745 133010 105497 83433 102750 91174 63230 64437 75604 75077 84040
7807H4040J6578L4072L12j7777Q89M277j8500m5164N71K9474K4157K1291k4440
$$ 84040 100618 134690 135002 117225 118114 122391 103891 58727 59298 88772 112929 134220 109780
7794A09780m712q272l3256j1029J9227r123m525K7081J5362k099k0679K1504L2994
$$ 109780 105068 96796 63540 52511 71738 62615 58090 85171 100533 98434 77755 99259 132253
7781A32253Q2Q59l2266j6229j0732L0516K8146j8977l7261j1433k4234l1582j2331
$$ 132253 132335 133194 100928 84699 73967 104483 132629 113652 76391 64958 40724 9142 -3189
7768c189J1939L5446J6215K520M509J1126k1110J0424K396l0726k196J3579J8877
$$ -3189 8750 44196 60411 62931 67440 78566 57456 67880 70276 39550 37354 50933 69810
7755F9810k2045J523j7284J3727K0238P133R47n734J1955j1997M916j0476n976
$$ 69810 47765 49288 32004 45731 65969 73102 74049 68315 80270 68273 73189 62713 56737
7742E6737k3455K545J3764K098r389m844q099K3727J7348q532p493J6200L0444
$$ 56737 33282 35827 49591 51689 42300 37456 29357 53084 70432 61900 54407 70607 101051
7729A01051K3066j8183n657J257r856q563K1437K201q822l6380q954q244k3740
$$ 101051 124117 105934 100277 101534 91678 83115 104552 106753 97931 61551 52597 44353 20613
7716B0613J1880R702o442l077m002J5823J8626j1746m61J9013K8500R651M217
$$ 20613 32493 42195 35753 32676 28674 44497 63123 51377 50916 69929 98429 108080 112297
7703A12297j4396l0158o102P403J0521l027j1745k0305Q981K8269J8051p171k8438
$$ 112297 97901 67743 61641 69044 79565 76538 64793 44488 53469 81738 99789 92618 64180
7690F4180m691r56r662n766r342L692K929o155J3560p22k497J5172j1858J185
$$ 64180 59489 58533 48871 43105 33763 37455 40384 34229 47789 47067 44570 59742 47884 49069
7676D9069j8886k168J1327J5394K4188j1816m981J646p721j2878j5152L393J1063
$$ 49069 30183 28015 39342 54736 78924 67108 62127 63773 56052 43174 28022 31415 42478
7663D2478J1390L1964q763k2051J7772J6273K3620j0252R642Q871N781k2236k3062
$$ 42478 53868 85832 77069 55018 72790 89063 112683 102431 112073 120944 126725 104489 81427
7650H1427k8768J0561k9776k1816k052K2051L8881Q322M935k7716k3030j3732
$$ 81427 52659 63220 33444 11628 9576 31627 70508 78830 83765 56049 33019 19287
7638A9287P907P507K9752K3642q179j1595O09j853j9156j6433J8483P885k9162
$$ 19287 27194 34701 64453 88095 79916 68321 68930 67077 47921 31488 49971 57856 28694
7625B8694J9535J8209l5243j1038j2139L5303L3825j2511j2118K413O449K93k9718
$$ 28694 48229 66438 31195 20157 8018 43321 77146 64635 52517 54930 61379 61672 31954
7612C1954J3555k603K79l40o72K376j6103k679L664P14J012K9154L2167j742l496
$$ 31954 45509 42906 43185 42845 42173 44549 28446 25767 29431 30145 31157 60311 92478 90736 87240
7597H7240r682m529K3120j1460k0881j6281o693L047M341m615k2321j2101J3532
$$ 87240 77558 73029 96149 84689 63808 47527 40834 43881 48222 43607 21286 9185 22717
7584B2717J2581J4301J898k2650N078J2488j8135K967L3142J8011l3931l0876
$$ 22717 35298 49599 51497 28847 33925 46413 28278 31245 64387 82398 48467 17591
7572A7591k037P006k8356j6667L6893L6941o01j0792r741M9324L4093k1727j4829
$$ 17591 15554 22560 -5796 -22463 14430 51371 50770 39978 30237 79561 113654 91927 77098
7559G7098k8798k9444r56J888k743j2512l9838J5909M8992K4091J2161j7192k0715
$$ 77098 48300 18856 17900 19788 17045 4533 -35305 -19396 29596 53687 65848 48656 27941
7546B7941K4598K5429n567l9015k5558j3676L2394K9168J7152j4915k698k2886
$$ 27941 52539 77968 72401 33386 7828 -5848 26546 55714 72866 57951 55253 32367
7534C2367L507M239J362Q704j0346o56r845J1633n249r347k3403J2077L3410M281
$$ 32367 35874 40113 41475 50179 39833 39177 29332 40965 35716 26369 2966 15043 48453 52734
7520E2734P592J8993J358m973j8804l047n949M226J929k6725p574J8462J1612
$$ 52734 60326 79319 80677 75704 56900 53853 47904 52130 54059 27334 19760 38222 49834
7507D9834O166R074l3218m694K1804N695j9144K9290J5145l5972j4792P798n957
$$ 49834 56000 65074 31856 27162 48966 54661 35517 64807 79952 43980 29188 36986 31029
7494C1029j2792j1535n50J7427m378J9032J8649P541k2684n1893J8052J2861j3963
$$ 31029 18237 6702 6152 23579 19201 38233 56882 64423 41739 -10154 7898 20759 6796
7481F796j2657k318N651R530j867k5751j263M8336j1351k1482J8360R185J3887
$$ 6796 -5861 -8179 -2528 7002 5135 -20616 -21879 26457 15106 -6376 11984 21169 35056
7468C5056J7037J7330p284k5219k173M692j3600L3054N017q174j1065K480K365
$$ 35056 52093 69423 62139 36920 34747 39439 25839 58893 63910 55736 44671 47151 49516
7455D9516k2222k0242Q1J6071K3302O390j2299k9062L807J1885l3854K3201M2967
$$ 49516 27294 7052 7133 23204 46506 52896 40597 11535 15342 27227 -6627 16574 59541
7442E9541j9001l377J82K5643P130K292J107l8458m657M6754J3623k1520l766
$$ 59541 40540 37163 37345 62988 70118 72410 73517 35059 30402 77156 90779 69259 65493
7429F5493R775K337j4273m099j302k073R133n504q054r920m0127J2858J4496R320
$$ 65493 75268 77605 63332 59233 57931 55858 64991 59487 51433 41513 1386 14244 28740 38060
7415C8060N178P530R937N205k043J8232k9840k8875j0901j7565n456Q989J8177
$$ 38060 43238 50768 60705 65910 63867 82099 52259 23384 12483 -5082 -10538 -1549 16628
7402A6628l125J0231M229J7047j6591K4985J0094k2411k5124P035r420j2066j0505
$$ 16628 13503 23734 27963 45010 28419 53404 63498 41087 15963 22998 13578 1512 -8993
7389h993n766M528K0689J7828L324p872K2980j8173m685l404N523Q610m2489n938
$$ -8993 -14759 -10231 10458 28286 31610 23738 46718 28545 23860 20456 25979 34589 -7900 -13838
7375a3838J4740j5903j0806L6022K8330j2203k1933m384J8903J183K401n643o535
$$ -13838 902 -15001 -25807 10215 38545 26342 4409 25 18928 20111 22512 16869 10334
7362A0334j052K4815Q081j3664J2061Q102l7604k533N981J513k395M4435r268
$$ 10334 9282 34097 42178 28514 40575 48677 11073 8540 14521 16034 13639 58074 48806
7349D8806k2648K2768K1941L099j6400n72j8476o141N965j1125M99J6580k2757
$$ 48806 26158 48926 70867 73966 57566 56994 38518 32377 38342 27217 27716 44296 21539
7336B1539K3013J1278k4313j753J4594l2632l2104K6798Q634l6467j9886N790
$$ 21539 44552 55830 31517 29764 44358 11726 -20378 6420 15054 -21413 -41299 -35509
7324c5509J0047J4776r898J9547R255R004K6950K3300o883k7440P588j3659k162
$$ -35509 -25462 -10686 -20584 -1037 8218 17222 44172 67472 60589 33149 40737 27078 24916
7311B4916J1964O360J8190J8876j7759p662k0124k4807N721O048L4769j6692k8985
$$ 24916 36880 43240 61430 80306 62547 54885 34761 9954 15675 21723 56492 39800 10815
7298A0815p568n20O576p481j7446k16L6737K0951l815j4515q704N547kn552j067
$$ 10815 3247 2727 9303 1822 -15624 -15840 20897 41848 38033 23518 14814 20361 20359 14807 13740
7283A3740j3672K4830M7210J9915o758j1169l0312l4397p122L4743J5702j0784
$$ 13740 68 24898 72108 92023 85265 74096 43784 9387 2265 37008 52710 41926
7271D1926K342L105J50N492L091J4582l1170n934O626l7612k8327N822L6050J7172
$$ 41926 44268 47373 47523 53015 56106 70688 39518 33584 40210 2598 -25729 -19907 16143 33315
7257C3315R922J121Q101k5115j5458j3595K1523K967k2823n743m885m758P133
$$ 33315 43237 44358 52459 27344 11886 -1709 19814 22781 -42 -5785 -10670 -15428 -8295
7244h295K287M0991n577J3964K9161k362l0007j1370q477m494j9997k5738j9754
$$ -8295 -6008 34983 29406 43370 72531 70169 40162 28792 20315 15821 -4176 -29914 -49668
7231d9668J27J0556k704K0987L1249m584o182k58J4133Q527j1708j7112k1548
$$ -49668 -49541 -38985 -41689 -20702 10547 5963 -219 -477 13656 22183 10475 -6637 -28185
7218b8185k25N466J8296n913K8206R971n041j5589R628K1489J1875K3773N471
$$ -28185 -28410 -22944 -4648 -10561 17645 27616 22575 6986 16614 38103 49978 73751 79222
7205G9222j8470j9468k7p281j7302j878K4489l742P948k7011j4984J0979J5553
$$ 79222 60752 41284 41257 33976 16674 14796 39285 35543 43491 16480 1496 12475 28028
7192B8028j849j228m842K6112J232J1394k1088p589N567J4529k0336R47J7813
$$ 28028 26179 24951 20109 46221 47453 58847 37759 30170 35737 50266 29930 30877 48690
7179D8690L508J0956J4226k2118j3898L784J271j0441l933M5734M304j0872j2481
$$ 48690 52198 63154 77380 55262 41364 45148 46419 35978 32045 77779 82083 71211 58730
7166E8730J501m128M493N335P582k1852r704q867M504J0171o869J3228J2885o556
$$ 58730 60231 56103 60596 65931 73513 51661 41957 33090 37594 47765 40896 54124 67009 60453
7152F0453l0071k8626M1717M0706j7254J1278k4723l0273R939J2138K922k2342
$$ 60453 30382 1756 43473 84179 66925 78203 53480 23207 33146 45284 48206 25864
7140B5864r803K5388J6188K2728j4737k6388J6989J4612j4304m5895k0749N4142
$$ 25864 16061 41449 57637 80365 65628 39240 56229 70841 56537 10642 -10107 44035
7128D4035L818n5600kJ2297M555Q159J5608J5776J4088J437k8939p155L838q525
$$ 44035 47853 -7747 -7749 4548 9103 17262 32870 48646 62734 64171 35232 28077 31915 23390
7114B3390j9223J1784j4920j2293L510K3618K6185K2778k0060j5384m629j0844
$$ 23390 4167 15951 1031 -11262 -7752 15866 42051 64829 44769 29385 24756 13912
7102A3912l4666m471R050L634J2307K4548J7631j5147j0179k6655j1548K7363
$$ 13912 -20754 -25225 -16175 -12541 -234 24314 41945 26798 16619 -10036 -21584 5779
7090E779L9664l0694j8211L873m604J9598O34J5034p432k2409J0698n671n724
$$ 5779 45443 14749 -3462 411 -4193 15405 16039 31073 23641 1232 11930 6259 535
7077E35j1375o417J8930L0133N901j8135M791j040n667j4368P951N161n898J7192
$$ 535 -10840 -17257 1673 31806 37707 19572 24363 23323 17656 3288 11239 16400 10502 27694
7063B7694J8656k802j7145j0062J4366J6625r943k2751j3829J5343J1006J447
$$ 27694 46350 43548 26403 16341 30707 47332 37389 14638 809 16152 27158 28605
7051B8605K222K4308J164l2798j2639R437J9919J0162r885m303j0407r998k572
$$ 28605 30827 55135 56299 23501 10862 20299 40218 50380 40495 36192 25785 15787 13215
7038A3215J0791k552Q294j1116L585j5483j4761K2419k7345k2797M8040K9953
$$ 13215 24006 21454 29748 18632 22217 6734 -8027 14392 -12953 -35750 12290 42243
7026D2243j6217j4622q789k3638j0436l53j068l123j210J874J2134R966n431L728
$$ 42243 26026 11404 2615 -21023 -31459 -31812 -32880 -36003 -37213 -35339 -23205 -13239 -18670 -14942
7012a4942k402L6452J0325L715k3827l449J0067m2763r424Q0K9320J7648J8117
$$ -14942 -17344 19108 29433 33148 9321 5872 15939 -26824 -36248 -36168 -6848 10800 28917
6999B8917l0854j3372Q231J2079r685K2329J9178j3960k6904l428N777N369m277
$$ 28917 -1937 -15309 -7078 5001 -4684 17645 36823 22863 -4041 -7469 -1692 3677 -600
6986f00o129J4493k8189j1692K8899J3451l637L3917J5562j4175p596K5583j6848
$$ -600 -6729 7764 -20425 -32117 -3218 10233 6596 40513 56075 41900 34304 59887 43039
6973D3039q975n215l32L886o399m948k130m858k1908j0630K6825j6766K680K0484
$$ 43039 34064 28849 28517 32403 26004 21056 18926 14068 -7840 -18470 8355 -8411 -5731 14753
6959A4753P72k3769j357L068M384J2271Q452L494j441p224K071J3309m0790l5686
$$ 14753 15525 -8244 -9601 -6533 -2149 10122 18574 22068 20627 13403 15474 28783 -12007 -47693
6945d7693K5582K3267q287r787Q38K4277K1092J504Q685K698j5466m670j8558
$$ -47693 -22111 1156 -7131 -16918 -16080 8197 29289 30793 39478 42176 26710 22040 3482
6932C482j4758l2209J101J7779Q758O744o200M664r981J781M9718J7762P297j3457
$$ 3482 -11276 -43485 -42384 -24605 -15847 -9103 -15303 -10639 -20620 -18839 30879 48641 55938 42481
6918D2481j7922R609n300j4063N745k6229J0239K8351j4500j1669Q465J3516l66
$$ 42481 24559 34168 28868 14805 20550 -5679 4560 32911 18411 6742 15207 28723 28357
6905B8357J0829K6077j594m7848k4735K3090j6632R313R108M522O339M230p356
$$ 28357 39186 65263 63669 15821 -8914 14176 -2456 6857 15965 20487 26826 31056 23700
6892B3700j6210M781R515J969J3283m748R108j0336r024K1389J1974k7137q340
$$ 23700 7490 12271 21786 23755 37038 32290 41398 31062 22038 43427 55401 28264 19924
6879A9924J1328j4095r76n728j0122j1269K504N9757R338l4289p676j3720k1489
$$ 19924 31252 17157 16181 10453 331 -10938 -8434 51323 60661 26372 18696 4976 -16513
6866a6513J0708J0104Q036J269J7024j140j4961q530j018L791n071M156k308l0939
$$ -16513 -5805 4299 12335 13604 30628 29488 14527 5997 4979 8770 3699 7855 5547 -25392
6852b5392L957l84q302K1588o944J0720l29j135Q556K807L862M822J637J9147
$$ -25392 -21435 -21819 -30121 -8533 -15477 -4757 -5086 -6221 2335 5142 9004 13826 15463 34610
6838C4610N041N60j2003o167J0242k6605J8088k0344k1564j3176k368J2300K2617
$$ 34610 39651 40211 28208 22041 32283 5678 23766 3422 -18142 -31318 -33686 -21386 1231
6825A231K6237K3489L963k5840k8927P172K2584J8999k0665r781k9021j979J1215
$$ 1231 27468 50957 54920 29080 153 7325 29909 48908 28243 18462 -10559 -12538 -1323
6812a323j612J1488O027j4002k4L242k818k81r126O148J3218j6495n206j6591
$$ -1323 -2935 8553 14580 578 554 3796 978 697 -8429 -2281 10937 -5558 -10764 -27355
6798b7355J1218j1957k1666l061M2756M3681n136q110J9320j1111q766Q932J7011
$$ -27355 -16137 -28094 -49760 -52821 -10065 33616 28480 20370 39690 28579 19813 28745 45756
6785D5756k8841k3884J1881K4050K7163j0836l8828k1400K7239o467K3244r159
$$ 45756 16915 -6969 4912 28962 56125 45289 6461 -14939 12300 5833 29077 19918
6773A9918m0286j3939J7534J6302k0269K1652L5377K7760j0945r663L57k9585
$$ 19918 -20368 -34307 -16773 -471 -20740 912 36289 64049 53104 43441 43798 14213
6761A4213N417L2803M215k5566k4455l9654k3270K2962K9071Q53k1649j697J3818
$$ 14213 19630 52433 56648 31082 6627 -33027 -56297 -33335 -4264 -3411 -25060 -26757 -12939
6748a2939K7123J2353P173j339N382j5541J1152K1730j6617m1501m399J8824j737
$$ -12939 14184 26537 33710 32371 37753 22212 33364 55094 38477 -3024 -7423 11401 9664
6735I664J1712O346q367J3125K0231M807k2688k5682k1339j7118M6164K4089K0137
$$ 9664 21376 27722 19355 32480 52711 57518 34830 9148 -12191 -29309 16855 40944 61081
6722F1081q699l1760m057K795j1184K707J4295L0952L285J3823p699k2208j6597
$$ 61081 52382 20622 16565 19360 8176 10883 25178 56130 59415 73238 65539 43331 26734
6709B6734n780j6538j9874p738J4236K5747J9892n310o813O499q82R588L010o722
$$ 26734 20954 4416 -15458 -23196 -8960 16787 36679 31369 24556 31055 30173 39761 42771 36049
6695C6049p062l7716J1240j4948k1279J6128K8267j1367l4410N358J3318L449
$$ 36049 28987 -8729 2511 -12437 -33716 -17588 10679 -688 -35098 -29740 -16422 -12973
6683a2973J6345m677J2228j1849j7597k671q20J5255J997n718J8169j0698k3667
$$ -12973 3372 -1305 10923 -926 -18523 -21194 -22014 -6759 -4762 -10480 7689 -3009 -26676
6670b6676n644K0325Q829j217m808k861j3059n453m964J0021q441N360J0328j2071
$$ -26676 -32320 -11995 -3166 -4383 -9191 -12052 -25111 -30564 -35528 -25507 -33948 -28588 -18260 -30331
6656c0331L398j6321k3641j2926L4385Q311N349M3408Q941q212L973o532j5401
$$ -30331 -26933 -43254 -66895 -79821 -45436 -37125 -31776 11632 20573 12361 16334 9802 -5599
6643e599k9800j5100q56J990k837J7394J6195P535k2847Q638K0647N404K087j5440
$$ -5599 -35399 -50499 -51355 -49365 -52202 -34808 -18613 -11078 -33925 -25287 -4640 764 2851 -12589
6629a2589J127J2147m594k8146m812J1060N215N223Q917j613J8796r201k8591
$$ -12589 -11462 685 -3909 -32055 -36867 -25807 -20592 -15369 -6452 -8065 10731 1530 -27061
6616b7061K1966M2123L5288O962N213N44k5242j5349q234K5295K631N515K2345
$$ -27061 -5095 37028 72316 79278 84491 85035 59793 44444 36210 61505 64136 69651 91996
6603I1996j7851m754j1044l4083m9707o195K0710k2447J0756K6546k1141K4132
$$ 91996 74145 69391 58347 24264 -25443 -31638 -10928 -33375 -22619 3927 -17214 6918
6591F918K8626K3717j1478k9602j1723j2632Q893l08K140L5106j1369j8815l819
$$ 6918 35544 59261 47783 18181 6458 -6174 2719 2411 4551 39657 28288 9473 5654
6578E654O899k80n064L1703J6305j7202m0130k7914L1505K3077j5404j4353N399
$$ 5654 12553 12273 7209 38912 55217 38015 -2115 -30029 1476 24553 9149 -5204 195
6565A95K9318j8553k3887r802Q710N997K7712Q927Q513J1777k817m283k479j8316
$$ 195 29513 10960 -12927 -22729 -14019 -8022 19690 28617 37130 48907 46090 41807 39328 21012
6551B1012j8679R795Q056J7676l572k3014j7757N847J2921J9347k5537r383N39
$$ 21012 2333 12128 20184 37860 34288 11274 -6483 -636 12285 31632 6095 -3288 -2749
6538b749k2568j9808J2186K7600n967k5013j543N156L189K8417K6265j9751r055
$$ -2749 -25317 -45125 -32939 -5339 -11306 -36319 -37862 -32706 -29517 -1100 25165 5414 -3641
6525c641l9762K3406M5349J3596r172O768K606j7205l0100n075K7414j4877k5592
$$ -3641 -43403 -19997 25352 38948 29776 36544 39150 21945 -8155 -13230 14184 -693 -26285
6512b6285j908L849J5483J353R38j1117n563M863P158l826N992L1336M798r354
$$ -26285 -28193 -24344 -8861 -7508 -6570 -17687 -23250 -18387 -11229 -15055 -9063 22273 27071 17717
6498A7717k5019j7379k705L6343J0040l9121L729M2639J8648p075k8404Q417j8835
$$ 17717 -7302 -24681 -27386 8957 18997 -20124 -16395 26244 44892 37817 9413 17830 -1005
6485a005k6726L6780L4789l8377j1960J8436l2471L566M0240J1142k0398j0833
$$ -1005 -27731 9049 43838 5461 -6499 11937 -20534 -16968 23272 34414 14016 3183
6473C183k7296L28J1015j1122J0035L7572J5869R841k7782m2634J0302M8596l2812
$$ 3183 -24113 -23785 -12770 -23892 -13857 23715 39584 49425 21643 -20991 -10689 37907 5095
6460E095o831j5896j7225j2574L09M3201J464Q847L013m938J6505J4109J8227
$$ 5095 -1736 -17632 -34857 -47431 -47122 -3921 -2457 6390 9403 4465 20970 35079 53306
6447E3306j6237J9323j5818k7340j7176k9009p605L2132K1340p222j8389J0904
$$ 53306 37069 56392 40574 13234 -3942 -32951 -40556 -8424 12916 5694 -12695 -1791
6435a791L289K0114K4626P841l4862m3678L601O814k0507L0503M9989M809j9779
$$ -1791 1498 21612 46238 54079 19217 -24461 -20860 -14046 -34553 -4050 45939 50748 30969
6422C0969n255J7728M546j6608l0253j3738Q191K6288J7198q662l7324j7051r486
$$ 30969 25714 43442 47988 31380 1127 -12611 -4420 21868 39066 30404 -6920 -23971 -33457
6409c3457J4536J0692q803K3862K8690P459k6357k1023k1656j367k550K359Q612
$$ -33457 -18921 -8229 -17032 6830 35520 42979 16622 -4401 -26057 -27424 -29974 -27615 -19003
6396a9003O792L0115J3698k120j2622j8249j1908j5847j364J1573K2904J4797
$$ -19003 -12211 17904 31602 29482 16860 -1389 -13297 -29144 -30508 -18935 3969 18766
6384A8766j2609j6673r458L2J72l733M095J1527J0445j1060J9370r59j0050J6007
$$ 18766 6157 -10516 -19974 -19942 -19770 -23503 -19408 -7881 2564 -8496 10874 9915 -135 15872
6370A5872q29J2970M306J270m2941k4773P892K1917O19p72j748K0571j5720j5621
$$ 15872 15043 28013 32319 33589 -9352 -34125 -26233 -4316 -3697 -4469 -6217 14354 -1366 -16987
6356a6987J3657M219l9617J1219J3717Q519r511J0339K0586K0963j7672k2830
$$ -16987 -3330 889 -38728 -27509 -13792 -5273 -14784 -4445 16141 37104 19432 -3398
6344c398J4641J3855J6818N914J0616m7624n666J9580r428j984K7280K1556j5006
$$ -3398 11243 25098 41916 47830 58446 10822 5156 24736 15308 13324 40604 62160 47154
6331D7154l3583j7487k5095J0634L898l388k0205p251K8920J872L421J6609J3694
$$ 47154 13571 -3916 -29011 -18377 -14479 -17867 -38072 -45323 -16403 -14531 -11110 5499 19193
6318A9193q468L675J1949J005j7592Q862J8830r428l1247j4099p435K301k1624
$$ 19193 10725 14400 26349 27354 9762 18624 37454 28026 -3221 -17320 -24755 -22454 -44078
6305d4078k0082J2855M815R832L504R991J468K1740K3629P677k7420j4116n494
$$ -44078 -64160 -51305 -46490 -36658 -33154 -23163 -21695 45 23674 31351 3931 -10185 -15679
6292a5679K573J7137N675l3683j6431J0944J4671Q222m186n475J750j3933j2239
$$ -15679 -13106 4031 9706 -23977 -40408 -29464 -14793 -6571 -10757 -16232 -14482 -28415 -40654
6279d0654k473j243J9780J8380J539r001J4049q67p820j6479Q448o530o860j2032
$$ -40654 -43127 -44370 -24590 -6210 -4671 -13672 377 -490 -8310 -24789 -16341 -22871 -29731 -41763
6265d1763P973L7191K6499J7190N929K492o417N307k1296K635k2701Q868p975
$$ -41763 -33790 3401 29900 47090 53019 55511 49094 54401 33105 35740 13039 21907 13932
6252A3932J3524j8740q024k1227K131J3531L9065K1686j0866k4685K2080N327
$$ 13932 27456 8716 692 -20535 -18404 -4873 34192 55878 45012 20327 42407 47734
6240D7734r916r094l338l6360j6884K795J7593J7513N052j9758k7205M266K344
$$ 47734 37818 28724 25386 -10974 -27858 -25063 -7470 10043 15095 -4663 -31868 -27602 -25258
6227b5258l267J0974M2261J3700k0458m0630j0882q6O698l926P581L096l898K2211
$$ -25258 -28525 -17551 24710 38410 17952 -22678 -33560 -33646 -26948 -30874 -23293 -20197 -24095 -1884
6213a884J3565m7355m1394L765O626q87J4993J6125R992r005P655J0274j3051
$$ -1884 11681 -35674 -77068 -73303 -66677 -67564 -52571 -36446 -26454 -35459 -27804 -17530 -30581
6200c0581Q409m542L7998K4227k1579j780K1014n495o8236l2250J2910L0751Q955
$$ -30581 -22172 -26714 11284 35511 13932 12152 33166 27671 -40565 -72815 -59905 -29154 -20199
6187b0199R487J4294K637l717k5272k7840K3733N5798J9791l2807p309J858O692
$$ -20199 -10712 3582 6219 2502 -22770 -50610 -26877 28921 48712 15905 8596 10454 17146
6174A7146O177o083o882j0671J3252J1237Q364l415k0874J7000N2638j4342l6297
$$ 17146 23323 17240 10358 -313 12939 24176 32540 29125 8251 25251 77889 63547 27250
6161B7250l172l3010k066J0962M429J8485M756j6094j3319O488l576J4891o573
$$ 27250 24078 -8932 -10998 -36 4393 22878 27634 11540 -1779 4709 1133 16024 9451
6148I451j7115j5294k222O598M1718L0444k5200l493J0820l3016r197K4263q516
$$ 9451 -7664 -22958 -25180 -18582 23136 53580 28380 24887 35707 2691 -6506 17757 9241
6135I241m2171N273L9095Q285j9678l8193k243M0397J3826k0228m060j7258L7503
$$ 9241 -32930 -27657 11438 19723 45 -38148 -40391 6 13832 -6396 -10456 -27714 9789
6122I789j350l473j4064j42J3528j5413k359L7477L2170l8527j4220L1050j4451
$$ 9789 8439 4966 -9098 -9240 4288 -11125 -13484 23993 56163 17636 3416 34466 20015
6109B0015r652l8641m246L4505J8167j121k6339q133R071K455M435N590J1797
$$ 20015 10363 -28278 -32524 1981 20148 19027 -7312 -15445 -6374 -3919 516 6106 17903
6096A7903m55J0930J7488j3828q33J5833n74j9697K931l425j2480q258J5224J1333
$$ 17903 17448 28378 45866 32038 31205 47038 46464 26767 29698 26273 13793 5535 20759 32092
6082C2092J5502l7527J9434r988k6118k6136M173N154J1117J3623q628l6606j597
$$ 32092 47594 10067 29501 19513 -6605 -32741 -28568 -23414 -12297 1326 -7302 -43908 -45505
6069d5505K6865R81M097n776K5270O026j0178Q935l499r462R830j9696l547J784
$$ -45505 -18640 -17659 -13562 -19338 5932 11958 1780 10715 7216 -2246 7584 -12112 -15659 -13875
6055a3875J1080K2598P464p317k179M7901q988k9818l1861q323K0468L644k0972
$$ -13875 -2795 19803 27267 19950 17771 65672 56684 26866 -4995 -13318 7150 10794 -10178
6042a0178p270J6235J0501j210k758j369j5516j547k5679j9232Q687K6549p64
$$ -10178 -17448 -1213 9288 8078 5320 3951 -11565 -13112 -38791 -58023 -49336 -22787 -23551
6029b3551n558K1776J3765k1448k0736q95L5716Q35q053o356P982J7728O524j0001
$$ -23551 -29109 -7333 6432 -15016 -35752 -36647 -931 -96 -8149 -14505 -6523 11205 17729 7728
6015G728J3308J3460j4143k1965J014P796p467P389Q628J767K663q152K946k0495
$$ 7728 21036 34496 20353 -1612 -598 7198 -269 7120 15748 17515 20178 12026 14972 -5523
6001e523m7300j3313r854q73J6804J984J2572K6207N586o617j8249J2265L0754
$$ -5523 -52823 -66136 -75990 -76863 -60059 -58075 -45503 -19296 -13710 -20327 -38576 -26311 4443
5988D443R509K4538K503q657q741j8752j168k0841j3671k658J9339J8272Q578
$$ 4443 13952 38490 40993 32336 23595 4843 3675 -17166 -30837 -33495 -14156 4116 12694
5975A2694J5104k5260l3278k1579J4466Q823J2799L878q921l570O692J7921L5705
$$ 12694 27798 2538 -30740 -52319 -37853 -29030 -16231 -12353 -21274 -24844 -18152 -231 35474
5962C5474J6999N108r726j9083P952k020r387q752o573K0736M448j9712m9299
$$ 35474 52473 57581 47855 28772 36724 34704 25317 16565 9992 30728 35176 15464 -33835
5949c3835J6123J1768J4613K6992q262k2004k6914M931k105R957k673l489q768
$$ -33835 -17712 -5944 8669 35661 27399 5395 -21519 -16588 -18693 -8736 -11409 -14898 -23666
5936b3666n468j2859m148K7714K4431P266j4183M405j7551k2983K0512j6263R988
$$ -23666 -29134 -41993 -46141 -18427 6004 13270 -913 3492 -14059 -37042 -16530 -32793 -22805
5923b2805J0499O944q805j9266j3046N878R014L0157j5285k6379J5279R125Q71
$$ -22805 -12306 -5362 -14167 -33433 -46479 -40601 -31587 -1430 -16715 -43094 -27815 -18690 -17819
5910a7819l769k4032j5793L0391L7757R802j3104J4067k1933l9046l777L8054
$$ -17819 -21588 -45620 -61413 -31022 6735 16537 3433 17500 -4433 -43479 -47256 -9202
5898i202O1980K1722j4469j6588k7540R785N955J2386Q522j7727j0454r116r743
$$ -9202 52778 74500 60031 43443 15903 25688 31643 44029 52551 34824 24370 15254 5511
5885E511k7330K833O080M32L3457J0591r876k2683J4113q464j5512J8264O336
$$ 5511 -21819 -18986 -12906 -12474 20983 31574 21698 -985 13128 4664 -10848 7416 13752
5872A3752j2374L6349p275j1751k4626l6836k652J2347K2790L7328J8823k8157
$$ 13752 1378 37727 30452 18701 -5925 -42761 -45413 -33066 -10276 27052 45875 17718
5860A7718j8361K0166M872Q823k0299j1337M77j1696p452N420n017j595O563K6519
$$ 17718 -643 19523 24395 33218 12919 1582 2059 -9637 -17089 -11669 -16686 -18281 -11718 14801
5846A4801q171N535k4727n647j1551l11j7874j7770L3645o8k4792l5408l121L4458
$$ 14801 6630 12165 -12562 -18209 -29760 -30071 -47945 -65715 -32070 -32138 -56930 -92338 -95459 -61001
5832f1001L1338N518J5508O180L5768L325n577m1123r75K0002j1425k8964J4051
$$ -61001 -29663 -24145 -8637 -2457 33311 36636 31059 -10064 -11039 8963 -2462 -31426 -17375
5819a7375J0589j0713k6617K2283j951k0763K8906K7465n090m676j1473q736L310
$$ -17375 -6786 -17499 -44116 -21833 -23784 -44547 -15641 11824 6734 2058 -9415 -18151 -14841
5806a4841J3540l4634k6446L4896M3946K134k0377r992j2788N190j1232r543L5220
$$ -14841 -1301 -35935 -62381 -27485 16461 18595 -1782 -11774 -24562 -19372 -30604 -40147 -4927
5793d927J9620K1043J2828M527k8015j2121K530j3142n676p390L1492k1484k2688
$$ -4927 14693 35736 48564 53091 25076 12955 15485 2343 -3333 -10723 20769 -715 -23403
5780b3403K2932K3830j9702j9170P124q643k152N265j4595k1229k1634N417K2439
$$ -23403 -471 23359 3657 -15513 -8389 -17032 -19184 -13919 -28514 -49743 -71377 -65960 -43521
5767d3521K2811K454K1916J4949j2556k39l6552l1462L904m567P882L1790L1352
$$ -43521 -20710 -18256 3660 18609 6053 5814 -30738 -62200 -58296 -62863 -54981 -23191 8161
5754H161j2244J5400M696p334R452m176j4332k7060R651J9440j7167k618o90K360
$$ 8161 -4083 11317 16013 8679 18131 13955 -377 -27437 -17786 1654 -15513 -18131 -18821 -16461
5740a6461J2637M578m053K8099K4683l25j0849J5891K5630k5989j7609k3107j0913
$$ -16461 -3824 754 -3299 24800 49483 49158 38309 54200 79830 53841 36232 13125 2212
5727B212o131J536j1935N388J6510j4920N686K7952j7556l9496J6490J6475k51
$$ 2212 -3919 -2383 -14318 -8930 7580 -7340 -1654 26298 8742 -30754 -14264 2211 1960
5714A960k6505q797p344J4164O44L668k4233J4324L85l0600l623O964m123n413
$$ 1960 -24545 -33342 -40686 -26522 -25878 -22210 -46443 -32119 -31734 -62334 -65957 -58993 -63116 -68529
5700f8529j7440J2077L1444O541K1700K5526q779l3836J382N3002j5284J461R74
$$ -68529 -85969 -73892 -42448 -35907 -14207 11319 2540 -31296 -29914 23088 7804 9265 10239
5687A0239j1895N117r275O061q86J245P589L4459l5511k0026P841J022j6704J500
$$ 10239 -1656 3461 -5814 247 -639 606 8195 42654 7143 -12883 -5042 -4020 -20724 -19224
5673a9224L6476j8602k5612R659J8264J4554r808k4138k1625K3278J1774Q340
$$ -19224 17252 -1350 -26962 -17303 961 15515 5707 -18431 -40056 -16778 -5004 3336
5661C336J3468K7906j0972L989R364N022l575k4415j5746j5204l627J594K404
$$ 3336 16804 44710 33738 37727 47091 52113 48538 24123 8377 -6827 -10454 -8860 -6456
5648f456J894J2919l6843L33K7681J2986r255J2893k550m2094o777p045J6204
$$ -6456 -4562 8357 -28486 -28153 -472 12514 3259 16152 13602 -28492 -35269 -42314 -26110
5635b6110M8197n892j1679K495j4175l998l321r867n854L0948J1995l3613k396
$$ -26110 22087 16195 4516 7011 -7164 -11162 -14483 -24350 -30204 744 12739 -20874 -23270
5622b3270J8139J7404j5662j5090P5J3676J3539j9908j8141J3048J0535L32K1662
$$ -23270 -5131 12273 -3389 -18479 -18404 -4728 8811 -11097 -29238 -16190 -5655 -5323 16339
5609A6339N708J1756j5907k4312j0057j3022M035l043L020K0351j4457o19o905
$$ 16339 22047 33803 17896 -6416 -16473 -29495 -25460 -28503 -25483 -5132 -19589 -20208 -27113
5596b7113J0950M429J741j4741n643j588m08k1236j2062L5017J9771J6062J3955
$$ -27113 -16163 -11734 -9993 -24734 -30377 -31965 -32373 -53609 -65671 -30654 -10883 5179 19134
5583A9134r170l1080m1550J802o866J0477K0577J5349J1062j2565K0326j883j7381
$$ 19134 9964 -21116 -62666 -60864 -67730 -57253 -36676 -21327 -10265 -22830 -2504 -4387 -21768
5570b1768j6189Q406J2739J1698k564k109J801K1977P866Q445j324r878O854m483
$$ -21768 -37957 -29551 -16812 -5114 -7678 -9787 -7986 13991 21857 30302 28978 19100 25954 21471
5556B1471P776J1846k7841r686m203Q620J7850r105K044J6585K46j7694j5033
$$ 21471 29247 41093 13252 3566 -637 7983 25833 16728 18772 35357 35603 17909 2876
5543B876L862K0398q171j626L333j2431r321M787k8568J5804M811n213M1292L0525
$$ 2876 6738 27136 18965 17339 20672 8241 -1080 3707 -24861 -9057 -4246 -9459 31833 62358
5529F2358M952m0679k9259J436J8698J7235k3844m7422j7919Q452K1102L777L200
$$ 62358 67310 26631 -2628 -1192 17506 34741 10897 -36525 -54444 -45992 -24890 -21113 -17913
5516a7913R431J8751R939J6215P244k4448k9833j2479m233O185J4500K2583l189
$$ -17913 -8482 10269 20208 36423 43667 19219 -10614 -23093 -27326 -21141 -6641 15942 12753
5503A2753m476m760L992L0271l045j4188L619L7627l637k6506l0833k9095P33
$$ 12753 8277 3517 7509 37780 34735 20547 24166 61793 58156 31650 817 -28278 -27545
5490b7545J4200r91J2688k4456k254L1025M72j9816j4001J0228K1687J5422P039
$$ -27545 -13345 -14336 -1648 -26104 -28358 2667 3139 -16677 -30678 -20450 1237 16659 23698
5477B3698M2o364k4349P027J0750J2404K1522K166j6884j1643j2508Q80j1227
$$ 23698 23740 17376 -6973 54 10804 23208 44730 46896 30012 18369 5861 6741 -4486
5464d486P280O181Q963j2879J6784P544k0961j4543q788n309l222K3576O342L183
$$ -4486 2794 8975 17938 5059 21843 29387 8426 -6117 -14905 -20214 -23436 140 6482 9665
5450I665K787N106k5687K465N874K456Q279k2162j0426K1482J3037k6524m933
$$ 9665 12452 17558 -8129 -5664 210 2666 10945 -11217 -21643 -161 12876 -13648 -18581
5437a8581j6412n202k8024O497M3986J4140j8530j3607k6275j716M0932J1388
$$ -18581 -34993 -40195 -68219 -61722 -17736 -3596 -22126 -35733 -62008 -63724 -22792 -11404
5425a1404l706r687j3507j4906m312L5186L3880J0274k3311N060P986J0498j6874
$$ -11404 -15110 -24797 -38304 -53210 -57522 -22336 11544 21818 -1493 3567 11553 22051 5177
5412E177k8129M657K6068J2285l456J2387p64j3389M029k394j4162j0069O101
$$ 5177 -22952 -18295 7773 20058 16602 28989 28225 14836 18865 16471 2309 -7760 -1659
5399a659j3628L550J5982J6475m1459K569L3253K5108j8527k4781j0954Q651J9035
$$ -1659 -15287 -11737 4245 20720 -20739 -18170 15083 40191 21664 -3117 -14071 -5420 13615
5386A3615J8249j8859n253J4153J3630l0921l9289n030M2166Q686p14l671O892
$$ 13615 31864 13005 7752 21905 35535 4614 -34675 -39705 2461 11147 10433 6762 13654
5373A3654k1855j2708J9499K4355J2517k5664k5598q073r56o267J8577K300J0951
$$ 13654 -8201 -20909 -1410 22945 35462 9798 -15800 -23873 -24829 -31096 -12519 -10219 732
5360G32O226l2210j2479J827Q274k850L285l405k1730j5523o404j2624R658L2826
$$ 732 6958 -25252 -37731 -35904 -27630 -30480 -27195 -30600 -52330 -67853 -74257 -86881 -77223 -44397
5346d4397L2094k2726j7448k1998N447L7703K9437L7990M524k6461j4614K6416
$$ -44397 -12303 -35029 -52477 -74475 -69028 -31325 -1888 36102 40626 14165 -449 25967
5334B5967q057j2140j4728L176J0104J1514J4549K719J4617k3101m2576k962q809
$$ 25967 17910 5770 -8958 -5782 4322 15836 30385 33104 47721 24620 -17956 -20918 -29727
5321b9727l166L401K2898Q383o33k1737N76J6071k844O667K7529Q926k3334o724
$$ -29727 -32893 -29492 -6594 1789 1156 -20581 -20005 -3934 -6778 -111 27418 36344 13010 6286
5307F286j5280l4347l890j2847j2508J3678J8366j692k6249j4405K2542N823l640
$$ 6286 -8994 -43341 -47231 -60078 -72586 -58908 -40542 -42234 -68483 -82888 -60346 -54523 -58163
5294e8163J933m202J7501J0121j443q369J4348L82j4386k242P576J2256J7221
$$ -58163 -56230 -60432 -42931 -32810 -34253 -42622 -28274 -27892 -42278 -44520 -36944 -24688 -7467
5281g467Q812n225j2301j305Q62P015M07r010P364N313L83K7945K6624k9836k1987
$$ -7467 1345 -3880 -16181 -17486 -16624 -9609 -9202 -18212 -10848 -5535 -5152 22793 49417 19581 -2406
5266b406k133Q754R833o027j9470k375J2335P919p592K1384n145k5489j3710K0067
$$ -2406 -4539 4215 14048 8021 -11449 -13824 -1489 6430 -1162 20222 15077 -10412 -24122 -4055
5252d055N749k4892P114K3960o294l403J9470k201m9367m0696J9834J925j9235
$$ -4055 1694 -23198 -16084 7876 1582 -1821 17649 15448 -33919 -74615 -54781 -52856 -72091
5239g2091K0107K4382j7254J5679k485M2705J3571J3638k0089k342q941n837J003
$$ -72091 -51984 -27602 -44856 -29177 -31662 11043 24614 38252 18163 15821 6880 1043 2046
5226B046Q39M46j868j4585R185J7387J5844j5926J7753r881J4011n39j6973j1788
$$ 2046 2885 3331 1463 -13122 -3937 13450 29294 13368 31121 21240 35251 34712 17739 5951
5212E951q370J0132J7579K333K489k0366r735K1171l626K2363J39k1857N282J0444
$$ 5951 -2419 7713 25292 27625 30114 9748 13 21184 17558 39921 40060 18203 23485 33929
5198C3929M636J0498J0370k3769J1092j8563k1805k6451j5250J4824M647J375
$$ 33929 38565 49063 59433 35664 46756 28193 6388 -20063 -35313 -20489 -15842 -14467
5186a4467m064K7528j6485l5252p742q217P833J5396J7984J6243M861J0016p532
$$ -14467 -18531 8997 -7488 -42740 -50482 -58699 -50866 -35470 -17486 -1243 3618 13634 6102
5173F102J2594l860P06j7911j3287J2558Q735n037l6345Q198K0466J4448n023
$$ 6102 18696 14836 15542 -2369 -15656 -3098 5637 600 -35745 -27547 -7081 7367 2344
5160B344j3182k510r944Q409L983l0058K66K0478Q371J8888L3009K765j7756q234
$$ 2344 -10838 -13348 -23292 -14883 -10900 -40958 -40692 -20214 -11843 7045 40054 42819 25063 16829
5146A6829j9954n204r43J3919K5735k2800j3886R419l0480n76Q047m705k620J287
$$ 16829 -3125 -8329 -9272 4647 30382 7582 -6304 3115 -27365 -27941 -19894 -24599 -27219 -25932
5132b5932O996K708j3583m543O55K9846J51k7717l979J6978k614J1330Mj0034
$$ -25932 -18936 -16228 -29811 -34354 -33699 -3853 -3702 -31419 -35398 -18420 -21034 -9704 -9700 -19734
5118a9734J1421L001l565j1347Q401K0497r242p764P756M730N164L5501M219j9559
$$ -19734 -8313 -5312 -8877 -20224 -11823 8674 -568 -8332 -576 4154 9318 44819 49038 29479
5104B9479l4574j6760l200L2955J6515j7048j2159K0227J9101J356l2967l1783
$$ 29479 -5095 -21855 -25055 7900 24415 7367 -4792 15435 34536 35892 2925 -28858
5092b8858r074k073N703L876j0654K3103K2106j3296J3821J4627p033m980k9971
$$ -28858 -37932 -40005 -34302 -30426 -41080 -17977 4129 -9167 4654 19281 12248 7268 -22703
5079b2703k9383m236J2018K0802K4997P081J6414k1399j7176R359O42j0489k6839
$$ -22703 -52086 -56322 -44304 -23502 1495 8576 24990 3591 -13585 -4226 -3584 -14073 -40912
5066d0912k5112j2341O177K4232K7984P476K014M321L6240J4203k8701k1032j5942
$$ -40912 -66024 -78365 -72188 -47956 -19972 -12496 -10482 -6161 30079 44282 15581 -5451 -21393
5053b1393j285k7128r214L2827K7623O214J12J1465P076l8434j4805j8959j6936
$$ -21393 -22678 -49806 -59020 -26193 1430 7644 7756 19221 26297 -12137 -26942 -45901 -62837
5040f2837K6094K2245J4499k0810l4597o831J9373l565K2780K6705J3629P32k4042
$$ -62837 -36743 -14498 1 -20809 -55406 -62237 -42864 -46429 -23649 3056 16685 17417 -6625
5027f625j4973J9980J2741l0033J3096m516Q531Q707j4350r528k394k2718k0736
$$ -6625 -21598 -1618 11123 -18910 -5814 -10330 -1799 6908 -7442 -16970 -19364 -42082 -62818
5014f2818L082K2148j2553J3342L3260J8296o801k6280j0883Q055J2543J8675
$$ -62818 -59736 -37588 -50141 -36799 -3539 14757 7956 -18324 -29207 -21152 -8609 10066
5002A0066J8552O90k950j3294l817j5939O907j0627j863j4300K0496r3Q576J5979
$$ 10066 28618 29308 26358 13064 9247 -6692 215 -10412 -12275 -26575 -6079 -6172 2404 18383
4988A8383J1249k4889k1608L5841J246o030k1790r944Q017K9750J1732J93j1274
$$ 18383 29632 4743 -16865 18976 20222 14192 -7598 -17542 -9525 20225 31957 32150 20876
4975B0876k3928m782L426p452l4598K693M7722J1611K382Q09p503N558l291j5937
$$ 20876 -3052 -7834 -4408 -11860 -46458 -43765 3957 15568 17950 18759 11256 16814 13523 -2414
4961b414L186k580q175k7232k0215J0838L8721L9356k1019k3373K8868N658p585
$$ -2414 772 -1808 -9983 -37215 -57430 -46592 -7871 31485 10466 -12907 15961 21619 14034
4948A4034j1227j892j3088J1334k328J736j2771K295R160p0R222J117K0240k0687
$$ 14034 2807 915 -12173 -839 -3167 -1431 -14202 -11907 -2747 -2817 6405 7522 27762 7075
4934G075k8623j7809l48L26J5544J1941l3324j3561L2678m712Q630J1329j1605
$$ 7075 -21548 -39357 -39705 -39379 -23835 -11894 -45218 -58779 -26101 -30813 -22183 -10854 -22459
4921b2459m9353k4114L8321J3455k821R799p37K3755k972P622J7801j5626O674
$$ -22459 -71812 -95926 -57605 -44150 -46971 -37172 -37909 -14154 -17126 -9504 8297 -7329 -655
4908f55K6613m577L499J3231l2814L314J5149r167n028k2741j6211r582q771L2192
$$ -655 25958 21381 24880 38111 5297 8611 23760 14593 9565 -13176 -29387 -38969 -47740 -15548
4894a5548p083k2766K0677p043r824J5452L6383R97l0152q012j369J7356O806
$$ -15548 -22631 -45397 -24720 -31763 -41587 -26135 10248 11245 -18907 -26919 -28288 -10932 -4126
4881d126j2799j053m620n774l437K10j8895o442k7921J0731N5353L6039O411j4668
$$ -4126 -16925 -17978 -22598 -28372 -31809 -31599 -50494 -56936 -84857 -74126 -18773 17266 23677 9009
4867I009j3968r27M480J2165j8489N679N652k1457q902J2941J5267P268Q291k2314
$$ 9009 -4959 -5886 -1406 10759 -7730 -2051 3601 -17856 -26758 -13817 1450 8718 17009 -5305
4853e305p19K3072k7131k5786J911K8846J1886m1j373j954N723o744J2694R127
$$ -5305 -6024 17048 -10083 -35869 -33958 -5112 6774 6733 5360 3406 9129 2385 15079 24206
4839B4206m759j6346k7095J3578L4196q296M0021J8166j6908j6148k3056Q825
$$ 24206 19447 3101 -23994 -10416 23780 15484 55505 73671 56763 40615 17559 26384
4827B6384R92P80o566l433J0853J1548J0930Q58k0623k0062m8168l6461J9411
$$ 26384 27376 28156 21590 18157 29010 40558 51488 52346 31723 11661 -36507 -72968 -53557
4814e3557K9099K0607j0188J7626J9381m931k8265l397O560L476K9197r332j0317
$$ -53557 -24458 -3851 -14039 3587 22968 18037 -10228 -13625 -7065 -3589 25608 16276 5959
4801E959p952q332j239K5039N923k2182k051L9J2414j1684l70j3630j9140Q12
$$ 5959 -1993 -10325 -11564 13475 19398 -2784 -4835 -4796 7618 -4066 -4436 -18066 -37206 -36394
4787c6394K1557J993j5481P712K5811J8591k6949j6132N332M511j1730P232J0849
$$ -36394 -14837 -12844 -28325 -20613 5198 23789 -3160 -19292 -13960 -9449 -21179 -13947 -3098
4774c098j3003n92J6655j2248j2116r550P960K0776K2628o448l1997j4485J8662
$$ -3098 -16101 -16693 -38 -12286 -24402 -33952 -25992 -5216 17412 10964 -21033 -35518 -16856
4761a6856P299l0411K3099r066k2675K0485J5507J6607L2855N82k7442l4296l3921
$$ -16856 -9557 -39968 -16869 -25935 -48610 -28125 -12618 3989 36844 37426 9984 -24312 -58233
4748e8233j8091L5270M6802J1521r170r275j9115M493K2636K2925J0495p725q33
$$ -58233 -76324 -41054 5748 17269 8099 -1176 -20291 -15798 6838 29763 40258 32533 31700
4735C1700p929o401Q723j2219o453J2028j1854k2597K195j2959j0945J0116R990
$$ 31700 23771 17370 26093 13874 7421 19449 7595 -15002 -12807 -25766 -36711 -26595 -16605
4722a6605r071k964l3770m7948O91K6071M7045K7668K6805M3092K5703n550l2896
$$ -16605 -25676 -28640 -62410 -110358 -109667 -83596 -36551 -8883 17922 61014 86717 81167 48271
4709D8271q910k6573j4530p361J5450P272o371J4629j0493j5477N686N453j9080
$$ 48271 39361 12788 -1742 -9103 6347 13619 7248 21877 11384 -4093 1593 7046 -12034
4696a2034j8356j829j4457k161k611m754J7501l665q075L4477K7800P505j3664
$$ -12034 -30390 -32219 -46676 -48837 -51448 -56202 -38701 -42366 -50441 -15964 11836 19341 5677
4683E677J5179K5706j5273m1491O044k2446J8530k869K231O548q025J477J2222
$$ 5677 20856 46562 31289 -10202 -4158 -26604 -8074 -10943 -8712 -2164 -10189 -8712 3510
4670C510K8099j342k2168j4579K208L3166K6815J4321M996J546j5071m1346j3843
$$ 3510 31609 30267 8099 -6480 -4272 28894 55709 70030 75026 76572 61501 20155 6312
4657F312m042J062J9107r652j9756M65K2003m524j8704l1091j2763L6348J2004
$$ 6312 2270 3332 22439 12787 -6969 -6504 15499 10975 -7729 -38820 -51583 -15235 -3231
4644c231j5526j576r25J9010R251k5023Q9K6813j5625N591k1196l1013r111J2624
$$ -3231 -18757 -20333 -21258 -2248 7003 -18020 -17931 8882 -6743 -1152 -22348 -53361 -62472 -49848
4630d9848Q741p578P353j2981K758j0500J7267L6055O20j5232M617k9068j0944
$$ -49848 -41107 -48685 -41332 -54313 -51555 -62055 -44788 -8733 -8113 -23345 -18728 -47796 -58740
4617e8740Q884J3835N167j783P228L1047J3205O967j5043l3188q330J3340j5540
$$ -58740 -49856 -36021 -30854 -32637 -25409 5638 18843 25810 10767 -22421 -30751 -17411 -32951
4604c2951J2694J2323m892o970j6289l276J2641J7913m89k3058k6244J4932J1090
$$ -32951 -20257 -7934 -12826 -19796 -36085 -39361 -26720 -8807 -9296 -32354 -58598 -43666 -32576
4591c2576j1976J1002N314J5278o65R143J7495k8351m2350q644K6287L1232O014
$$ -32576 -44552 -33550 -28236 -12958 -13623 -4480 13015 -15336 -57686 -66330 -40043 -8811 -2797
4578b797j7190J042k4763j0468J9938K8020R148K0655J10j5156m403K161K652
$$ -2797 -19987 -18945 -43708 -54176 -34238 -6218 2930 23585 23695 8539 4136 6297 8949
4565H949J7045m242j1679j3005p983m120J8333k2891k9432K1542J0646J4797O909
$$ 8949 25994 21752 10073 -2932 -10915 -15035 3298 -19593 -49025 -27483 -16837 -2040 4869
$$ [...]
##END NTUPLES=NMR SPECTRUM
##END=
