##TITLE=Analysis number 322495
Compound Code cc 58506
Book Reference 196/195
Project Code adrs
Chemist Name jimp
##JCAMPDX= 6.0         $$ Bruker NMR JCAMP-DX V2.0
##DATA TYPE= NMR SPECTRUM
##DATA CLASS= NTUPLES
##ORIGIN= Bruker BioSpin GmbH
##OWNER= nmr
$$ XWIN-NMR		Version 3.5
$$ Thu Sep 28 11:15:54 2006 GMT Daylight Time (UT+1h)  MAYBRIDGE\nmr@NMR_250MHZ
##.OBSERVE FREQUENCY= 250.131544655141
##.OBSERVE NUCLEUS= ^1H
##.ACQUISITION MODE= SIMULTANEOUS (DQD)
##.ACQUISITION SCHEME= undefined
##.AVERAGES= 16
##.DIGITISER RES= 18
##SPECTROMETER/DATA SYSTEM= dpx250
##.PULSE SEQUENCE= zg30
##.SOLVENT NAME= CDCl3
##.SHIFT REFERENCE= (INTERNAL, CDCl3, 0, 16.522)
##AUDIT TRAIL= $$ (NUMBER, WHEN, WHO, WHERE, WHAT)
$$ ##TITLE= Audit trail, XWIN-NMR		Version 3.5
$$ ##JCAMPDX= 5.01
$$ ##ORIGIN= Bruker BioSpin GmbH
$$ ##OWNER= nmr
$$ C:\u/data/dgb/nmr/ADRS/1580/pdata/1/auditp.txt
$$ ##AUDIT TRAIL=  $$ (NUMBER, WHEN, WHO, WHERE, WHAT)
(   1,<2006-09-28 11:15:28.39 +100>,<MAYBRIDGE\nmr>,<NMR_250MHZ>,
      <created by zg, POWCHK disabled, PULCHK disabled
       configuration hash MD5:
       E2 DF 36 D8 04 B2 41 60 5A D7 A3 38 5A 4B D0 FE
       data hash MD5: 64K
       21 FF 7E E2 F1 90 C0 69 C2 A8 1E 86 59 0B C4 2F>)
(   2,<2006-09-28 11:15:43.08 +100>,<MAYBRIDGE\nmr>,<NMR_250MHZ>,
      <Start of raw data processing
       ef LB = 0.3 FT_mod = 6 PKNL = 1 SI = 32K 
       data hash MD5: 32K
       0B E7 F4 0D 7B 2B 29 A8 59 7C 1A BC 88 8D 16 3B>)
(   3,<2006-09-28 11:15:44.95 +100>,<MAYBRIDGE\nmr>,<NMR_250MHZ>,
      <apk 
       data hash MD5: 32K
       0A BF F0 5D 66 41 98 46 2D 66 B1 EB 7F AB 8A 6E>)
(   4,<2006-09-28 11:15:45.83 +100>,<MAYBRIDGE\nmr>,<NMR_250MHZ>,
      <abs ABSG = 5 
       data hash MD5: 32K
       8C 6C 33 66 A1 71 B0 6D 84 73 60 22 37 FA 3E 30>)
$$ ##END=
$$ 
$$ hash MD5
$$ 4D B3 69 7D F6 74 07 38 3D 5B 4D EB DB 16 E4 7A
##$RELAX= 
##$RELAX= 
##$RELAX= 
##$RELAX= 
##$RELAX= 
##$RELAX= 
##$RELAX= 
$$ Bruker specific parameters
$$ --------------------------
##$DU= <C:\u>
##$EXPNO= 1580
##$NAME= <ADRS>
##$PROCNO= 1
##$TYPE= <nmr>
##$USER= <dgb>
##$AMP= (0..31)
100 100 100 100 100 100 100 100 100 100 100 100 100 100 100 100 100 100 
100 100 100 100 100 100 100 100 100 100 100 100 100 100 
##$AQSEQ= 0
##$AQ_mod= 3
##$AUNM= <au_zg>
##$AUTOPOS= <34 >
##$BF1= 250.13
##$BF2= 250.13
##$BF3= 250.13
##$BF4= 250.13
##$BF5= 500.13
##$BF6= 500.13
##$BF7= 500.13
##$BF8= 500.13
##$BYTORDA= 1
##$CFDGTYP= 0
##$CFRGTYP= 5
##$CHEMSTR= <none>
##$CNST= (0..31)
1 1 145 1 1 1 1 1 1 1 1 1 1 1 1 1 1 1 1 1 1 1 1 1 1 1 1 1 1 1 1 1 
##$CPDPRG= <>
##$CPDPRG1= <>
##$CPDPRG2= <>
##$CPDPRG3= <>
##$CPDPRG4= <mlev>
##$CPDPRG5= <mlev>
##$CPDPRG6= <mlev>
##$CPDPRG7= <mlev>
##$CPDPRG8= <mlev>
##$CPDPRGB= <>
##$CPDPRGT= <>
##$D= (0..31)
0 1 0 0 0 0 0 0 0 0.06 0 0 0 0 0 0 0.0002 0 0 0 0 0 0 0 0 0 0 0 0 0 0 
0 
##$DATE= 1159438527
##$DBL= (0..7)
120 120 120 120 120 120 120 120 
##$DBP= (0..7)
150 150 150 150 150 150 150 150 
##$DBP07= 0
##$DBPNAM0= <>
##$DBPNAM1= <>
$$ [...]
##$SUBNAM7= <"">
##$SUBNAM8= <"">
##$SUBNAM9= <"">
##$SW= 20.6930455092707
##$SWIBOX= (0..15)
0 0 3 0 0 0 0 0 0 0 0 0 0 0 0 0 
##$SW_h= 5175.983436853
##$TD= 65536
##$TD0= 1
##$TE= 295.16
##$TE2= 300
##$TE3= 300
##$TEG= 300
##$TL= (0..7)
0 120 120 120 120 120 120 120 
##$TP= (0..7)
150 150 150 150 150 150 150 150 
##$TP07= 0
##$TPNAME0= <>
##$TPNAME1= <>
##$TPNAME2= <>
##$TPNAME3= <>
##$TPNAME4= <>
##$TPNAME5= <>
##$TPNAME6= <>
##$TPNAME7= <>
##$TPOAL= (0..7)
0.5 0.5 0.5 0.5 0.5 0.5 0.5 0.5 
##$TPOFFS= (0..7)
0 0 0 0 0 0 0 0 
##$TUNHIN= 0
##$TUNHOUT= 0
##$TUNXOUT= 0
##$USERA1= <user>
##$USERA2= <user>
##$USERA3= <user>
##$USERA4= <user>
##$USERA5= <user>
##$V9= 5
##$VALIST= <valist>
##$VCLIST= <CCCCCCCCCCCCCCC>
##$VD= 0
##$VDLIST= <DDDDDDDDDDDDDDD>
##$VPLIST= <PPPPPPPPPPPPPPP>
##$VTLIST= <TTTTTTTTTTTTTTT>
##$WBST= 1024
##$WBSW= 4
##$XGAIN= (0..3)
0 0 0 0 
##$XL= 0
##$YL= 0
##$YMAX_a= 411873
##$YMIN_a= -479060
##$ZGOPTNS= <>
##$ZL1= 120
##$ZL2= 120
##$ZL3= 120
##$ZL4= 120
##$ABSF1= 16.522
##$ABSF2= -4.171173
##$ABSG= 5
##$ABSL= 3
##$ALPHA= 0
##$AQORDER= 0
##$ASSFAC= 0
##$ASSFACI= 0
##$ASSFACX= 0
##$ASSWID= 0
##$AUNMP= <proc_1d>
##$AZFE= 0.1
##$AZFW= 0.1
##$BCFW= 0
##$BC_mod= 0
##$BYTORDP= 0
##$COROFFS= 0
##$CY= 12.5
##$DATMOD= 1
##$DC= 0
##$DFILT= <>
##$DTYPP= 0
##$F1P= 14.0000005364418
##$F2P= -0.99999901652339
##$FCOR= 0.5
##$FTSIZE= 32768
##$FT_mod= 6
##$GAMMA= 0
##$GB= 0
##$INTBC= 1
##$INTSCL= 1
##$ISEN= 128
##$LB= 0.3
##$LEV0= 0
##$LPBIN= 0
##$MAXI= 10000
##$MC2= 0
##$MEAN= 0
##$ME_mod= 0
##$MI= 0
##$NCOEF= 0
##$NC_proc= -4
##$NLEV= 6
##$NOISF1= 0
##$NOISF2= 0
##$NSP= 0
##$NTH_PI= 0
##$NZP= 0
##$OFFSET= 16.522
##$PC= 1
##$PHC0= 151.4509
##$PHC1= 4.299604
##$PH_mod= 1
##$PKNL= yes
##$PPARMOD= 0
##$PSCAL= 4
##$PSIGN= 0
##$REVERSE= no
##$SF= 250.13
##$SI= 32768
##$SIGF1= 0
##$SIGF2= 0
##$SINO= 400
##$SIOLD= 32768
##$SREGLST= <1H.CDCl3>
##$SSB= 0
##$STSI= 32768
##$STSR= 0
##$SW_p= 5175.98343685301
##$SYMM= 0
##$S_DEV= 0
##$TDeff= 65536
##$TDoff= 0
##$TI= <Analysis number 999999
Compound Code 99
Book Reference 9
Project Code 9>
##$TILT= no
##$TM1= 0
##$TM2= 0
##$TOPLEV= 0
##$USERP1= <user>
##$USERP2= <user>
##$USERP3= <user>
##$USERP4= <user>
##$USERP5= <user>
##$WDW= 1
##$XDIM= 32768
##$YMAX_p= 284995147
##$YMIN_p= -120467
$$ End of Bruker specific parameters
$$ ---------------------------------
##NTUPLES= NMR SPECTRUM
##VAR_NAME=  FREQUENCY,     SPECTRUM/REAL,   SPECTRUM/IMAG
##SYMBOL=    X,             R,               I
##VAR_TYPE=  INDEPENDENT,   DEPENDENT,       DEPENDENT
##VAR_FORM=  AFFN,          ASDF,            ASDF
##VAR_DIM=   32768,         32768,           32768
##UNITS=     HZ,            ARBITRARY UNITS, ARBITRARY UNITS
##FACTOR=    0.157963299565203, 1,           1
##FIRST=     4132.6476996994, 0,             0
##LAST=      -1043.33573715361, 0,           0
##MIN=       -1043.33573715361, -120467,     0
##MAX=       4132.6476996994, 284995147,     0
$$ Real data points
##PAGE= N=1
##DATA TABLE= (X++(R..R)), XYDATA
$$ [...]
$$ plain form
20324 -6628 -21199 -10460 -3566 10478 28797 31915 20848 17235 7755 -11847 -20978 -11212 -10755
20311 -10755 -15234 -12746 4535 6698 6995 8223 1117 42271 66675 67739 40509 -11631 -36525
20298 -36525 -28952 -4556 -1774 -8353 10533 20185 -3920 -10754 4327 10251 18818 26908 32575
20285 32575 36087 23265 29550 3612 -35211 -36864 -13686 17881 894 7659 4332 -13195 -48151
20272 -48151 -59742 -46840 -27117 10968 40722 38273 19493 5701 17927 10636 6529 -14467
20260 -14467 -883 -8349 -11691 -34060 -4789 -650 -1223 -12744 -2219 21098 15127 16298 9363
20247 9363 10717 14285 27248 25607 31282 32751 23278 -3472 -15085 232 13706 39512 22376
20234 22376 -11314 -20334 -21084 10076 4720 -13933 -47556 -55601 -35917 -8788 11517 33867 36161
$$ packed form
20324f628j4571J0739O894J4044J8319L118j1067l613r480j9602r131R766M57
20311a0755m479K488J7281K163K97J228p106M1154K4404J064k7230n2140k4894
20298c6525P573K4396K782o579J8886R652k4105o834J5081N924Q567Q090N667
20285C2575L512j2822O285k5938l8823j653K3178L1567j6987O765l327j7527l4956
20272d8151j1591J2902J9723L8085K9754k449j8780j3792J2226p291m107k0996
20260a4467J3584p466l342k2369K9271M139n73j1521J0525K3317n971J171o935
20247I363J354L568J2963j641N675J469r473k6750j1613J5317J3474K5806j7136
20234B2376l3690r020p50L1160n356j8653l3623q045J9684K7129K0305K2350K294
$$ plain form
20221 36161 24458 -10187 -39402 -28495 -8452 -5352 -8681 -12011 15548 36193 -4809 -29537
20209 -29537 5189 24633 34382 31186 15295 16288 -1783 21814 59238 60617 33501 17509 1365
20196 1365 -34116 -20682 10145 8735 -13046 -10610 -7424 1565 14527 14249 17117 36956 22253
20183 22253 -2277 11109 -10617 -25266 -23300 -12708 4031 16862 25642 13186 -1939 8500
20171 8500 12592 9435 2727 82 -7427 -14732 -28495 -6925 31987 39505 41686 18212 6828
20158 6828 9232 18170 18267 -4445 -21941 -30353 -41832 -39485 -26891 -42149 -28569 -13705 -33176
20145 -33176 -31808 -24316 -3706 5738 -12550 -11709 -8707 -12353 -27556 -58350 -66795 -44020 -15125
20132 -15125 -871 724 -9978 -8640 4151 40401 58172 45774 32000 22402 14037 22912 18076
$$ packed form
20221C6161j1703l4645k9215J0907K0043L100l329l330K7559K0645m1002k4728
20209b9537L4726J9444R749l196j5891R93j8071K3597L7424J379k7116j5992j6144
20196A365l5481J3434L0827j410k1781K436L186Q989J2962k78K868J9839j4703
20183B2253k4530J3386k1726j4649J966J0592J6739J2831Q780j2456j5125J0439
20171H500M092l157o708k645p509p305j3763K1570L8912P518K181k3474j1384
20158F828K404Q938R7k2712j7496q412j1479K347J2594j5258J3580J4864j9471
20145c3176J368P492K0610R444j8288Q41L002l646j5203l0794q445K2775K8895
20132a5125J4254J595j0702J338J2791L6250J7771j2398j3774r598q365Q875m836
$$ plain form
20119 18076 13328 -11453 -27742 -16037 -19958 -10423 -25053 -4840 -6778 -6134 2295 18792 -4405
20106 -4405 -26288 -27874 -16589 -7846 -19551 -18677 18557 84566 70222 31461 8321 16640 -3048
20093 -3048 339 10870 -11245 -21257 4688 11791 18330 32817 16227 -1727 8973 6061 16025
20080 16025 28434 35026 28645 26713 31766 26397 17341 31672 17708 3662 5604 7904 -8275
20067 -8275 -18337 -47228 -39401 -8405 -15044 -9122 -2186 -17383 -24274 -25954 -5968 25044 26520
20054 26520 -20416 -33396 -19244 -13754 18145 47312 80962 51730 16624 -7178 -10239 -16229
20042 -16229 -14516 -11341 103 8687 43468 58031 27266 4375 23763 11220 -4717 -6925
20030 -6925 9125 6343 -9732 1762 27461 33593 35590 34709 38550 24242 14552 15221 26623 12209
$$ packed form
20119A8076m748k4781j6289J1705l921R535j4630K0213j938O44Q429J6497k3197
20106d405k1883j586J1285Q743j1705Q74L7234O6009j4344l8761k3140Q319j9688
20093c048L387J0531k2115j0012K5945P103O539J4487j6590j7954J0700k912R964
20080A6025J2409O592o381j932N053n369r056J4331j3964j4046J942K300j6179
20067h275j0062k8891P827L0996o639N922O936j5197o891j680J9986L1012J476
20054B6520m6936j2980J4152N490L1899K9167L3650k9232l5106k3802l061n990
20042a6229J713L175J1444Q584L4781J4563l0765k2891J9388j2543j5937k208
20030f925J6050k782j6075J1494K5699O132J997q81L841j4308r690O69J1402j4414
$$ plain form
20016 12209 -17104 -26599 -840 10023 14903 13502 -6966 -14088 -33238 -21345 -27446 -27318 -16744
20003 -16744 10549 1452 -21695 -30863 -22735 -8347 42736 64745 54231 42102 42409 17356 33564
19990 33564 23679 9872 -13649 2484 10169 3186 -4043 13984 8313 7249 -20915 -33921 -32911
19977 -32911 -42834 -56256 -62202 -42775 -42220 -35834 -41744 -36119 -22685 4872 27151 43604 30109
19964 30109 -15305 2401 -3230 -63094 -71648 -40519 -8409 17223 15379 8750 10032 8536 -787
19951 -787 12131 12286 16880 29121 3700 -20141 -57081 -39109 -18754 -29071 -42235 -24423 -2463
19938 -2463 18889 -18223 -52047 -61780 -51136 -46585 -34472 -16874 -28663 -12805 -56 2292
19926 2292 1988 7934 19756 31297 26557 7675 -8897 22570 48550 63398 52867 18348 17264
$$ packed form
20016A2209k9313r495K5759J0863M880j401k0468p122j9150J1893o101J28J0574
20003a6744K7293r097k3147r168Q128J4388N1083K2009j0514j2129L07k5053J6208
19990C3564r885j3807k3521J6133P685o983p229J8027n671j064k8164j3006J010
19977c2911r923j3422n946J9427N55O386n910N625J3434K7557K2279J6453j3495
19964C0109m5414J7706n631n9864q554L1129L2110K5632j844o629J282j496r323
19951g87J2918J55M594J2241k5421k3841l6940J7972K0355j0317j3164J7812K1960
19938b463K1352l7112l3824r733J0644M551J2113J7598j1789J5858J2749K348
19926B292l04N946J1822J1541m740j8882j6572L1467K5980J4848j0531l4519j084
$$ plain form
19913 17264 -3747 -3524 8472 8191 25579 51374 34821 39450 85094 84273 40199 -8372 -21921
19900 -21921 -15367 13181 31299 40581 41491 35846 29704 29454 18481 20540 36465 29943 6503 18115
19886 18115 24391 26905 20140 12754 14440 32429 50430 45405 35814 -8468 -31197 -2825 -2689
19873 -2689 -10863 2909 34234 24679 2214 -11529 -21983 -7919 5378 -9877 -3001 -8435 -17350
19860 -17350 -20042 -27380 -2728 13134 24955 12275 -1594 2295 20548 380 -18100 -21227
19848 -21227 -16540 17245 31517 19174 33699 76025 67233 27288 5270 19102 26006 13026
19836 13026 25419 25225 5843 -11877 21258 25090 -12064 -34549 -21643 -2525 -14776 -2146
19824 -2146 5362 -3155 10401 -13457 -63956 -66870 -38092 -11889 -21217 -18019 -16275 -16307 -21650 -19264
$$ packed form
19913A7264k1011K23J1996k81J7388K5795j6553M629M5644q21m4074m8571j3549
19900b1921O554K8548J8118R282R10n645o142k50j0973K059J5925o522k3440J1612
19886A8115O276K514o765p386J686J7989J8001n025r591m4282k2729K8372J36
19873b689q174J3772L1325r555k2465j3743j0454J4064J3297j5255O876n434q915
19860a7350k692p338K4652J5862J1821j2680j3869L889J8253k0168j8480l127
19848b1227M687L3785J4272j2343J4525M2326q792l9945k2018J3832O904j2980
19836A3026J2393j94j9382j7720L3135L832l7154k2485J2906J9118j2251J2630
19824b146P508q517J3556k3858n0499k914K8778K6203r328L198J744l2n343K386
$$ plain form
19810 -19264 -5972 -16394 600 15093 1697 -12062 -16359 19520 44471 29526 50081 53357
19798 53357 68101 85796 58337 49862 60239 84997 108064 109531 81918 46990 25718 34798
19786 34798 42569 35336 13936 15247 29206 41957 55710 40979 3350 -28032 1474 20870
19774 20870 16814 12215 -19402 -41669 -44942 -24409 -4935 14616 20716 28310 59561 51064 37851
19761 37851 30900 15533 19925 59270 76408 76337 71159 49072 14148 28446 76602 100842 83440
19748 83440 50035 35526 25934 28528 39443 40471 33779 66930 79845 64718 55446 66480 51572
19735 51572 53002 36773 42798 35230 26181 -4733 -17115 -4290 21192 12990 13826 31769 39007
19722 39007 31752 39519 61920 49402 48475 50530 28600 29002 21346 35449 40480 36229 25624 36624
$$ packed form
19810a9264J3292j0422J6994J4493j3396j3759m297L5879K4951j4945K0555L276
19798E3357J4744J7695k7459q475J0377K4758K3067J467k7613l4928k1272R080
19786C4798P771p233k1400J311J3959J2751J3753j4731l7629l1382K9506J9396
19774B0870m056m599l1617k2267l273K0533J9474J9551O100P594L1251q497j3213
19761C7851o951j5367M392L9345J7138p1n178k2087l4924J4298M8156K4240j7402
19748H3440l3405j4509r592K594J0915J028o692L3151J2915j5127r272J1034j4908
19735E1572J430j6229O025p568r049l0914j2382J2825K5482q202Q36J7943P238
19722C9007p255P767K2401j2518r27K055k1930M02p656J4103N031m251j0605J1000
$$ plain form
19708 36624 60538 76852 59130 24756 -2927 12257 41650 48862 27270 45105 56788 22861
19696 22861 -1761 24089 23493 -8768 -13711 -17712 25819 52849 32007 33378 55226 55861 46555
19683 46555 31752 33306 25127 64715 88311 53999 38698 23124 8001 44066 57350 23243
19671 23243 19786 21548 16448 -2264 -5080 459 5366 15465 -2712 -10241 -3015 15617 22185
19658 22185 26257 30415 31028 28670 47036 34076 -8284 -12026 -7291 -14268 -4404 -28759 -46659
19645 -46659 -26708 -7298 16591 32609 32914 22712 -596 1911 -972 5449 37908 71541 62768
19632 62768 21473 20893 36649 33681 9719 8495 4713 19653 53808 37154 39819 48849 98888
19619 98888 84811 45057 48050 55530 56822 60241 70279 66014 70851 55916 15879 -15677 -14831
$$ packed form
19708C6624K3914J6314j7722l4374k7683J5184K9393P212k1592J7835J1683l3927
19696B2861k4622K5850n96l2261m943m001M3531K7030k0842J371K1848O35r306
19683D6555j4803J554q179L9588K3596l4312j5301j5574j5123L6065J3284l4107
19671B3243l457J762n100j8712k816N539M907J0099j8177p529P226J8632O568
19658B2185M072M158O13k358J8366j2960m2360l742M735o977R864k4355j7900
19645d6659J9951J9410K3889J6018L05j0202k3308K507k883O421L2459L3633q773
19632F2768m1295n80J5756k968k3962j224l782J4940L4155j6654K665R030N0039
19619I8888j4077l9754K993P480J292L419J0038m265M837j4935m0037l1556Q46
$$ plain form
19606 -14831 7987 -1589 11814 30815 49501 48468 38575 38139 35884 37403 44678 78768 77574
19593 77574 46686 44882 35804 29125 12575 9905 27899 69482 43007 -10149 -488 13317 14241
19580 14241 9138 34249 30290 38498 18997 4686 841 -14867 -13489 -5427 16078 16985 15713
19567 15713 2953 10928 19937 1453 -4088 12874 34453 57674 68011 65269 76964 74145 54751
19554 54751 49776 72170 82700 73446 44913 20796 34617 43129 28761 13459 24964 55431
19542 55431 56209 66703 44008 32745 54467 66589 52447 54585 40390 39269 52152 63608
19530 63608 81541 47449 44296 38989 56512 104498 74353 46824 43893 32971 14605 19421
19518 19421 6174 -6219 -1967 -2807 802 11301 24675 36452 30538 29675 47369 70607 81301
$$ packed form
19606a4831K2818r576J3403J9001J8686j033r893m36k255J519P275L4090j194
19593G7574l0888j804r078o679j6550k670J7994M1583k6475n3156R661J3805R24
19580A4241n103K5111l959Q208j9501j4311l845j5708J378Q062K1505R07j272
19567A5713j2760P975R009j8484n541J6962K1579K3221J0337k742J1695k819j9394
19554E4751m975K2394J0530r254k8533k4117J3821Q512j4368j5302J1505L0467
19542E5431P78J0494k2695j1263K1722J2122j4142K138j4195j121J2883J1456
19530F3608J7933l4092l153n307J7523M7986l0145k7529k931j0922j8366M816
19518A9421j3247j2393M252q40L609J0499J3374J1777n914q63J7694K3238J0694
$$ plain form
19505 81301 62970 6405 -9544 18688 40538 52305 69297 49588 12295 17909 14907 24957
19493 24957 57575 59302 45028 12389 103 1667 36383 34850 24172 47131 49241 56620 61206
19480 61206 55737 24339 18674 33854 52863 63332 63705 49439 26176 16491 17178 21385 11238
19467 11238 8337 19674 41569 46185 41347 52237 40606 55482 58061 71800 98498 70030
19455 70030 34115 11032 10724 36115 64558 88768 71720 43809 24379 18026 16475 45250
19443 45250 47586 64967 63666 61753 56330 45165 58778 56912 54098 50309 46850 35070 -3133
19430 -3133 -25870 -17422 -3301 16974 12204 2095 3905 12349 39893 46749 44253 35880 22515
19417 22515 50437 71421 57433 35717 37392 10648 25229 32785 42460 51069 41993 30159 22616
$$ packed form
19505H1301j8331n6565j5949K8232K1850J1767J6992j9709l7293N614l002J0050
19493B4957L2618J727j4274l2639j2286J564L4716j533j0678K2959K110P379M586
19480F1206n469l1398n665J5180J9009J0469L73j4266k3263r685O87M207j0147
19467A1238k901J1337K1895M616m838J0890j1631J4876K579J3739K6698k8468
19455G0030l5915k3083l08K5391K8443K4210j7048k7911j9430o353j551K8775
19443D5250K336J7381j301j913n423j1165J3613j866k814l789l459j1780l8203
19430c133k2737Q448J4121K0275m770j0109J810Q444K7544O856k496q373j3365
19417B2515K7922K0984j3988k1716J675k6744J4581P556R675Q609r076j1834p543
$$ plain form
19404 22616 4943 -4725 19253 47388 61959 46686 19675 17464 40314 43901 54783 68767
19392 68767 70359 68251 74869 89478 98088 90442 68712 19771 38793 47473 30691 64904 81077
19379 81077 56790 21493 41807 70501 74208 78534 47295 28316 23112 26990 15144 32586
19367 32586 63259 53064 49338 83157 80930 50530 49047 27761 24630 26522 54657 60383 50275
19354 50275 42928 46468 54783 49801 55581 84697 91987 91715 113510 119317 112870 95847 61406 32319
19340 32319 65970 93957 76552 32923 30105 29533 61984 59110 38774 57562 65012 60214 76594
19327 76594 87208 82250 77161 76233 67635 38465 56611 67305 58591 68101 56926 42747 63788
19314 63788 80513 85775 55874 41024 45705 53951 75796 51971 63201 90839 85522 76096 74073
$$ packed form
19404B2616j7673r668K3978K8135J4571j5273k7011k211K2850L587J0882J3984
19392F8767J592k108O618J4609Q610p646k1730m8941J9022Q680j6782L4213J6173
19379H1077k4287l5297K0314K8694L707M326l1239j8979n204L878j1846J7442
19367C2586L0673j0195l726L3819k227l0400j483k1286l131J892K8135N726j0108
19354E0275p347L540Q315m982N780K9116P290k72K1795N807o447j7023l4441k9087
19340C2319L3651K7987j7405m3629k818n72L2451k874k0336J8788P450m798J6380
19327G6594J0614m958n089r28q598k9170J8146J0694q714R510j1175j4179K1041
19314F3788J6725N262k9901j4850M681Q246K1845k3825J1230K7638n317r426k023
$$ plain form
19301 74073 63975 55792 38983 52832 56350 48081 87670 100428 91375 84699 70378 73621 78861
19288 78861 76361 50459 47390 50123 75367 72576 56032 44224 41479 53409 69322 92733 104959
19275 104959 124272 112676 75283 69655 69747 89154 110242 121295 133167 118284 118898 138104 146946
19262 146946 141803 130913 127905 116719 118381 118236 125074 118701 109341 120528 131354 116557 104324
19249 104324 80653 53260 50617 72874 75791 72165 92726 127903 145029 121789 95997 89849
19237 89849 80886 50065 48045 88310 108841 117026 133060 118221 117070 124210 118257 116793 122945
19224 122945 100497 107997 108205 111133 108113 124639 129896 112154 94262 105077 122675 114353 98675
19211 98675 107911 121354 92427 85494 68233 45193 50180 80819 91710 85011 81247 70247 70127
$$ packed form
19301G4073j0098q183j6809J3849L518q269L9589J2758r053o676j4321L243N240
19288G8861k500k5902l069K733K5244k791j6544j1808k745J1930J5913K3411J2226
19275A04959J9313j1596l7393n628R2J9407K1088J1053J1872j4883O14J9206Q842
19262A46946n143j0890l008j1186J662j45O838o373r360J1187J0826j4797j2233
19249A04324k3671k7393k643K2257K917l626K0561L5177J7126k3240k5792o148
19237H9849q963l0821k020M0265K0531Q185J6034j4839j151P140n953j464O152
19224A22945k2448P500K08K928l020J6526N257j7742j7892J0815J7598q322j5678
19211I8675R236J3443k8927o933j7261k3040M987L0639J0891o699l764j1000j20
$$ plain form
19198 70127 66107 74978 93466 98989 103008 130351 151816 137033 147345 152055 139239 115448 99650
19185 99650 104371 119554 129779 128648 125274 126238 113270 131075 143252 133422 112777 96274 90003
19172 90003 89003 101487 110055 104735 97567 92629 90574 73566 59905 61882 64504 90539 104471
19159 104471 110865 136580 147504 120056 119453 104433 94000 100812 102993 96820 73674 87410 102465
19146 102465 108669 108136 100314 89582 88461 52483 54929 76047 80966 121241 134799 117682 107727
19133 107727 100784 108240 117260 115204 117386 107408 108500 114571 118958 91466 104530 111744 86254
19120 86254 95379 92560 114138 106084 104639 113466 96273 79763 79073 82269 98290 113762 130969
19107 130969 135378 139288 128426 160279 162252 135609 131157 125184 121412 118104 138997 149799 159165
$$ packed form
19198G0127m020Q871J8488N523M019K7343K1465j4783J0312M710j2816k3791j5798
19185I9650M721J5183J0225j131l374R64j2968J7805J2177r830k0645j6503o271
19172I0003j000J2484Q568n320p168m938k055j7008j3661J977K622K6035J3932
19159A04471O394K5715J0924k7448o03j5020j0433O812K181o173k3146J3736J5055
19146A02465O204n33p822j0732j121l5978K446K1118M919M0275J3558j7117r955
19133A07727o943P456R020k056K182r978J092O071M387k7492J3064P214k5490
19120H6254R125k819K1578q054j445Q827j7193j6510o90L196J6021J5472J7207
19107A30969M409L910j0862L1853J973k6643m452n973l772l308K0893J0802R366
$$ plain form
19094 159165 158065 158193 141820 128512 123549 125095 119851 129849 126274 130306 128010 108647 107996 107206
19080 107206 105246 96668 93048 86180 100208 98111 66667 52325 40311 32435 45172 62375 84388
19067 84388 107691 111839 109925 91699 77876 87476 93301 90000 83146 82337 73607 65725 81916 80248
19053 80248 61585 72218 91520 110777 105703 117758 121619 121524 143955 147991 154793 150170 148297
19040 148297 161286 169272 196363 242048 274049 286984 298104 305731 311335 308812 305918 309320 322784
19027 322784 331861 318840 331426 319999 335277 357000 372956 393369 396992 374476 353059 306369
19015 306369 293528 257131 218213 178235 189959 204089 221309 210003 185081 188728 197307 223249
19003 223249 238049 227342 195801 194015 196482 167157 184596 192505 189885 186595 189031 211299 237520
$$ packed form
19094A59165j100J28j6373j3308m963J546n244R998l575M032k296j9363o51p90
19080A07206j960q578l620o868J4028k097l1444j4342j2014p876J2737J7203K2013
19067H4388K3303M148j914j8226j3823R600N825l301o854q09q730p882J6191j668
19053H0248j8663J0633J9302J9257n074J2055L861r5K2431M036O802m623j873
19040A48297J2989P986K7091M5685L2001J2935J1120P627N604k523k894L402J3464
19027C22784R077j3021J2586j1427J5278K1723J5956K0413L623k2516k1417m6690
19015C06369j2841l6397l8918l9978J1724J4130J7220j1306k4922L647Q579K5942
19003B23249J4800j0707l1541j786K467k9325J7439P909k620l290K436K2268K6221
$$ plain form
18990 237520 267588 284969 297889 324395 334913 351552 385858 415868 401856 411544 440514 430304
18978 430304 429787 460476 487091 492416 483653 474969 454340 464571 469961 437463 405216 386677 377222
18965 377222 354316 324614 287334 246999 251171 263319 260595 243938 233474 257004 238159 190222
18953 190222 181418 196440 198201 168633 134014 136371 158917 153354 145299 181338 173829 155305 137121
18940 137121 123519 125775 118078 133772 163329 195070 215062 193294 169094 161086 176488 164029
18928 164029 163062 173491 181104 212370 228966 240405 227366 180591 170007 155641 141237 143216
18916 143216 144423 149497 163291 164959 170386 181521 181915 175373 168159 138356 124605 133059 133067 156991
18902 156991 136549 98003 117696 141444 136149 136539 126235 140567 165507 180405 176521 141929
$$ packed form
18990B37520L0068J7381J2920K6506J0518J6639L4306L0010j4012R688K8970j0210
18978D30304n17L0689K6615N325q763q684k0629J0231N390l2498l2247j8539r455
18965C77222k2906k9702l7280m0335M172J2148k724j6657j0464K3530j8845m7937
18953A90222q804J5022J761k9568l4619K357K2546n563q055L6039p509j8524j8184
18940A37121j3602K256p697J5694K9557L1741J9992k1768k4200q008J5402j2459
18928A64029r67J0429P613L1266J6596J1439j3039m6775j0584j4366j4404J979
18916A43216J207N074J3794J668N427J1135L94o542p214k9803j3751Q454QK3924
18902A56991k0442l8546J9693K3748n295L90j0304J4332K4940J4898l884l4592
$$ plain form
18890 141929 137804 133232 91764 94811 135694 148560 145855 135251 110843 113761 102824 110243 115678
18877 115678 114966 127052 154915 169549 182966 164689 144286 157903 157279 176437 193561 193027 193550
18864 193550 188510 204506 204630 227537 262627 265705 237961 247223 271220 249936 277003 282869 257941
18851 257941 252423 224997 225081 220778 240510 262720 219973 185124 160973 173606 195584 217276
18839 217276 225533 251818 241413 224295 238378 214778 209101 189537 179637 172153 180009 197953
18827 197953 178792 188741 183518 186443 204131 196621 192357 218862 241774 282529 278312 282769 328087
18814 328087 353121 367412 394670 406242 391267 398463 410335 376205 356851 364961 360310 363583
18802 363583 362096 356781 340608 325666 299299 274044 249976 260818 261561 223965 219605 223785 232931
$$ packed form
18890A41929m125m572m1468L047M0883J2866k705j0604k4408K918j0937P419N435
18877A15678p12J2086K7863J4634J3417j8277k0403J3617o24J9158J7124n34N23
18864A93550n040J5996J24K2907L5090L078k7744R262K3997k1284K7067N866k4928
18851B57941n518k7426Q4m303J9732K2210m2747l4849k4151J2633K1978K1692
18839B17276Q257K6285j0405j7118J4083k3600n677j9564r900p484P856J7944
18827A97953j9161R949n223K925J7688p510m264K6505K2912M0755m217M457M5318
18814C28087K5034J4291K7258J1572j4975P196J1872l4130j9354Q110m651L273
18802C63583j487n315j6173j4942k6367k5255k4068J0842P43l7596m360M180R146
$$ plain form
18789 232931 256079 292853 294282 276806 276617 287498 280697 290520 299711 346879 376218 403744 456755
18776 456755 485695 512929 547875 560016 587313 570531 619175 676741 703542 737241 743299 714816
18764 714816 700275 685877 651529 609271 578373 554751 526260 500636 477672 499384 479945
18753 479945 420528 382817 371591 399559 406171 358713 344622 345318 340545 325852 296758 294639
18741 294639 316671 361870 407915 447253 443574 439446 492940 547060 599761 625791 642228 687296
18729 687296 703269 715557 780393 845531 907992 929838 914576 901679 890156 886733 891024 961005
18717 961005 1031900 1023683 1008440 1004196 999921 1004803 985030 980175 942682 893143 857719 806108
18705 806108 710664 671562 661616 626154 627422 599099 558726 541226 512264 487852 474773 485846
$$ packed form
18789B32931K3148L6774J429j7476j89J0881o801R823R191M7168K9339K7526N3011
18776D56755K8940K7234L4946J2141K7297j6782M8644N7566K6801L3699O058k8483
18764G14816j4541j4398l4348m2258l0898k3622k8491k5624k2964K1712j9439
18753D79945n9417l7711j1226K7968O612m7458j4091O96m773j4693k9094k119
18741B94639K2032M5199M6045L9338l679m128N3494N4120N2701K6030J6437M5068
18729F87296J5973J2288O4836O5138O2461K1846j5262j2897j1523l423M291O9981
18717I61005P0895q217j5243m244m275M882j9773m855l7493m9539l5424n1611
18705H06108r5444l9102r946l5462J268k8323m0373j7500k8962k4412j3079J1073
$$ plain form
18693 485846 487138 452391 432676 446110 446542 472112 495299 500737 491178 521368 548040 555796 567307
18680 567307 607552 658399 708101 766393 791675 798777 799109 807124 818740 813812 786958 737892
18668 737892 743407 758445 771140 782892 767092 742021 744360 708963 664205 631709 607168 561534
18656 561534 533520 506996 500040 492748 478571 475418 462564 470871 503505 503839 526573 518734 496953
18643 496953 499641 487246 474077 483018 461538 432502 439185 474294 493817 501215 506632 479316
18631 479316 433580 426928 438620 470949 510403 519132 500206 517002 518457 517123 527763 525454
18619 525454 514057 526696 505677 495526 506913 503304 504404 516622 538705 554456 540461 542085
18607 542085 534779 531992 570912 609160 637523 663042 678693 713558 760483 795701 797372 795730
$$ packed form
18693D85846J292l4747j9715J3434M32K5570K3187N438r559L0190K6672P756J1511
18680E67307M0245N0847M9702N8292K5282P102L32Q015J1616m928k6854m9066
18668G37892N515J5038J2695J1752j5800k5071K339l5397m4758l2496k4541m5634
18656E61534k8014k6524o956p292j4177l153j2854Q307L2634L34K2734p839k1781
18643D96953K688j2395j3169Q941k1480k9036O683L5109J9523P398N417k7316
18631D79316m5736o652J1692L2329L9454Q729j8926J6796J455j334J0640k309
18619E25454j1397J2639k1019j0151J1387l609J100J2218K2083J5751j3995J624
18607E42085p306k787L8920L8248K8363K5519J5651L4865M6925L5218J671j642
$$ plain form
18595 795730 802152 815179 809152 827332 825484 794240 780829 788107 814173 805338 749904 712699
18583 712699 686907 692186 696915 698020 694338 688943 725744 760946 773417 789089 785827 767757 749491
18570 749491 755467 792858 834033 885779 914894 950635 1004367 1045175 1067849 1113887 1190893 1269116
18558 1269116 1359636 1459184 1574375 1680588 1746149 1828106 1936326 2078727 2188188 2257115
18548 2257115 2333933 2476324 2650398 2841474 3087229 3335141 3623397 3994319 4541017 5299432
18538 5299432 6392916 7833657 9596159 11817834 14667556 17994102 21236626 24301263
18530 24301263 27495108 30733394 33437804 35254456 36196006 36561841 36996921 37413265 37430561
18521 37430561 37292007 37263034 37573530 38372404 39183838 38954438 37429953 35332763 33770418
$$ packed form
18595G95730O422J3027o027J8180j848l1244j3411P278K6066q835n5434l7205
18583G12699k5792N279M729J105l682n395L6801L5202J2471J5672l262j8070j8266
18570G49491N976L7391M1175N1746K9115L5741N3732M0808K2674M6038P7006P8223
18558A269116R0520R9548J15191J06213O5561Q1957J08220J42401J09461O8927
18548B257115P6818J42391J74074J91076K45755K47912K88256L70922N46698P58415
18538E299432J093484J440741J762502K221675K849722L326546L242524L064637
18530B4301263L193845L238286K704410J816652R41550L65835M35080M16344J7296
18521C7430561j38554k8973L10496P98874Q11434k29400j524485k097190j562345
$$ plain form
18512 33770418 31909084 28738220 24501285 21117467 18678082 16483598 14225413 12385131
18504 12385131 11111324 10294263 9721921 9287130 8985456 8781507 8673864 8634436 8644387 8778823
18494 8778823 9054203 9501909 10202386 11298152 12889253 14941282 17419515 20487966 24324245
18485 24324245 28577751 32723540 36673399 40221836 43381290 45891768 47631791 48025052
18477 48025052 47712098 47217464 46865957 47154336 47518671 47919303 48546451 49512364 49965518
18468 49965518 49244318 47259839 44482559 41410809 37169867 32003931 27349972 23561072
18460 23561072 20164900 17052948 14696626 13047838 11866975 10970135 10211496 9578349
18452 9578349 9066428 8628047 8217366 7853029 7551463 7284180 7018600 6783304 6581643
$$ packed form
18512C3770418j861334l170864m236935l383818k439385k194484k258185j840282
18504A2385131j273807q17061n72342m34791l01674k03949j07643l9428R951J34436
18494H778823K75380M47706P00477J095766J591101K052029K478233L068451L836279
18485B4324245M253506M145789L949859L548437L159454K510478J740023L93261
18477D8025052l12954m94634l51507K88379L64335M00632O27148R65913M53154
18468D9965518p21200j984479k777280l071750m240942n165936m653959l788900
18460B3561072l396172l111952k356322j648788j180863q96840p58639o33147
18452I578349n11921m38381m10681l64337l01566k67283k65580k35296k01661
$$ plain form
18443 6581643 6401106 6240011 6097831 5935293 5741724 5547615 5353426 5155310 4973508
18434 4973508 4798017 4618251 4486343 4366963 4239080 4134616 4017092 3899124 3772445
18425 3772445 3664633 3579003 3503931 3448669 3400713 3327150 3230815 3136130 3046748 2949930 2885646
18414 2885646 2842299 2804971 2738756 2673731 2622589 2545705 2475126 2429231 2374075 2327388 2278922
18403 2278922 2216565 2165959 2156272 2159369 2145977 2134170 2126643 2094555 2036775 2002686 1957888 1924317
18391 1924317 1876016 1872001 1865246 1786779 1740752 1730652 1698723 1653529 1604990 1563978 1529721 1514933
18379 1514933 1474026 1445064 1427165 1453017 1492189 1518132 1495211 1493273 1526203 1547150 1517608
18368 1517608 1464953 1400827 1406043 1417481 1366901 1327600 1305445 1284235 1250070 1255211 1290410 1300340
$$ packed form
18443F581643j80537j61095j42180j62538j93569j94109j94189j98116j81802
18434D973508j75491j79766j31908j19380j27883j04464j17524j17968j26679
18425C772445j07812q5630p5072n5262m7956p3563r6335r4685q9382r6818o4284
18414B885646m3347l7328o6215o5025n1142p6884p0579m5895n5156m6687m8466
18403B278922o2357n0606r687L097j3392j1807p527l2088n7780l4089m4798l3571
18391A924317m8301m015o755p8467m6027j0100l1929m5194m8539m1012l4257j4788
18379A514933m0907k8962j7899K5852L9172K5943k2921j938L2930K0947k9542
18368A517608n2655o4126N216J1438n0580l9301k2155k1210l4165N141L5199R930
$$ plain form
18356 1300340 1283416 1271525 1301041 1304057 1307691 1291200 1290438 1294424 1278291 1284487 1302836 1282652
18344 1282652 1273589 1263000 1265359 1295528 1318798 1312243 1311851 1321945 1331695 1318017 1328825 1327977 1286558
18331 1286558 1258158 1251765 1250971 1264688 1289086 1325222 1341485 1324909 1329937 1386231 1421657 1413693
18319 1413693 1422616 1439925 1455354 1497747 1531492 1551167 1584527 1642581 1728128 1792490 1855236
18308 1855236 1926381 2000947 2112795 2247949 2356537 2465534 2598621 2730514 2858335 3015326
18298 3015326 3203794 3472153 3847262 4324717 4782098 5130676 5471581 5921955 6405404
18289 6405404 6731957 6772053 6455921 6212846 6284524 6653614 7305397 8259576 9700221 11811539
18279 11811539 14935630 19471286 25363846 31750641 37855792 44025248 50544391 57034955
$$ packed form
18356A300340j6924j1891K9516L016L634j6491p62L986j6133O196J8349k0184
18344A282652r063j0589K359L0169K3270o555l92J0094R750j3678J0808q48m1419
18331A286558k8400o393p94J3717K4398L6136J6263j6576N028N6294L5426p964
18319A413693Q923J7309J5429M2393L3745J9675L3360N8054Q5547O4362O2746
18308A855236P1145P4566J11848J35154J08588J08997J33087J31893J27821J56991
18298C015326J88468K68359L75109M77455M57381L48578L40905M50374M83449
18289F405404L26553M0096l16132k43075P1678L69090O51783R54179J440645K111318
18279A1811539L124091M535656N892560O386795O105151O169456O519143O490564
$$ plain form
18271 57034955 62630856 65246222 62393051 57283906 51428992 46496528 43397322 40769788
18263 40769788 37373900 35001249 34639709 35437014 36277620 36047000 34151534 31962655 29960957
18254 29960957 28284929 26749581 24704307 22094713 19825742 18420519 17702502 17376837
18246 17376837 17214585 17064819 16889419 16880550 17167850 17777740 18833203 20417218 22664933
18237 22664933 25648064 29435038 33721679 38098669 42792417 48406783 55238996 63229442
18229 63229442 71557220 79027522 86465808 94388448 102899028 111962446 120511934 126644326
18221 126644326 129765869 129632064 126416290 121112984 115325603 111370890 111286291 114081208
18213 114081208 116753241 116595485 111715763 104218237 94544973 83416639 72661847 63357089
$$ packed form
18271E7034955N595901K615366k853171n109145n854914m932464l099206k627534
18263D0769788l395888k372651l61540P97305Q40606k30620j895466k188879k001698
18254B9960957j676028j535348k045274k609594k268971j405223p18017l25665
18246A7376837j62252j49766j75400q869K87300O09890J055463J584015K247715
18237B2664933K983131L786974M286641M376990M693748N614366O832213P990446
18229F3229442Q327778P470302P438286P922640Q510580R063418Q549488O132392
18221A26644326L121543j33805l215774n303306n787381l954713q4599K794917
18213A14081208K672033j57756m879722p497526r673264j1128334j0754792r304758
$$ plain form
18205 63357089 55621489 49125275 44081759 40879299 38942655 37244636 35243177 32650968
18197 32650968 30398673 29051021 28517691 28739961 29469232 30289421 30930889 31688864 32917290
18188 32917290 34230469 34922294 34523855 33207758 32310463 32828460 35057296 39226234 45315622
18179 45315622 52801350 60951320 69732293 80342524 93152933 105633281 114061756 117170220
18171 117170220 115779921 113744133 113355209 110962910 103544977 93443227 81032705 71556354
18163 71556354 66428086 63428544 60560004 57352633 53039114 47737457 42740284 37975086
18155 37975086 34176221 31918723 30550258 29097310 27006940 24326856 22096120 20574971
18147 20574971 19446054 18595319 17933597 17415766 16986748 16620108 16296410 16035665 15824264
$$ packed form
18205F3357089p735600o496214n043516l202460j936644j698019k001459k592209
18197C2650968k252295j347652n33330K22270P29271Q20189O41468P57975J228426
18188C2917290J313179O91825l98439j316097q97295N17997K228836M168938O089388
18179D5315622P485728Q149970Q780973J0610231J2810409J2480348Q428475L108464
18171A17170220j390299k035788l88924k392299p417933j0101750j2410522r476351
18163G1556354n128268k999542k868540l207371m313519n301657m997173m765198
18155C7975086l798865k257498j368465j452948k090370k680084k230736j521149
18147B0574971j128917q50735o61722n17831m29018l66640l23698k60745k11401
$$ plain form
18138 15824264 15661145 15598555 15598767 15645172 15826541 16253448 17147391 18695715 21032738 24000678
18128 24000678 27237414 30340658 33242445 36238255 39368063 42012599 43378565 43393322
18120 43393322 42495768 42531279 44008474 47098750 51737569 57584058 62824954 65717512
18112 65717512 66395776 65903849 62733011 56623852 47651280 35963625 27902712 23355916
18104 23355916 20538868 18594677 17145642 16038092 15137605 14416848 13825402 13332286 12914152
18095 12914152 12543522 12249551 12024808 11918674 11890745 11931759 12040247 12256121 12637643 13293858
18085 13293858 14410226 16218313 18936749 22611082 26847981 31181975 35238932 39171648
18077 39171648 43263851 47260846 49733037 50567116 49390000 47844357 47174047 47394721
$$ packed form
18138A5824264j63119o2590K12M6405J81369M26907Q93943J548324K337023K967940
18128B4000678L236736L103244K901787K995810L129808K644536J365966J4757
18120D3393322q97554L5511J477195L090276M638819N846489N240896K892558
18112F5717512O78264m91927l170838o109159q972572j1687655q060913m546796
18104B3355916k817048j944191j449035j107550r00487p20757n91446m93116m18134
18095A2914152l70630k93971k24743j06134k7929M1014J08488K15874L81522O56215
18085A3293858J116368J808087K718436L674333M236899M333994M056957L932716
18077C9171648M092203L996995K472191Q34079j177116j545643o70310K20674
$$ plain form
18069 47394721 48569050 50555402 52982799 54531251 53426607 48937411 41301621 33249688
18061 33249688 26382698 21467169 18257199 16117803 14604423 13485444 12631502 11918121
18053 11918121 11317785 10846839 10451522 10107375 9807364 9524635 9299999 9110916 8968336
18044 8968336 8842095 8764238 8750377 8747295 8800941 8901450 9141637 9627880 10458375 11694884
18034 11694884 13291677 15048679 16765298 18399418 20017813 21692798 23112135 23769200
18026 23769200 23697097 22770004 21938905 21448408 21448428 22035134 23076778 24429625 25556914 26432829
18016 26432829 27178979 28638050 31385180 35400069 40449905 46232092 52482462 58544268
18008 58544268 63278466 66259732 67284002 66638925 64864609 62138539 59040970 56910223
$$ packed form
18069D7394721J174329J986352K427397J548452j104644m489196p635790q051933
18061C3249688o866990m915529l209970k139396j513380j118979q53942p13381
18053A1918121o00336m70946l95317l44147l00011k82729k24636j89083j42580
18044H968336j26241p7857j3861l082N3646J00509K40187M86243Q30495J236509
18034A1694884J596793J757002J716619J634120J618395J674985J419337O57065
18026B3769200p2103r27093q31099m90497K0N86706J041644J352847J127289Q75915
18016B6432829P46150J459071K747130M014889N049836N782187O250370O061806
18008E8544268M734198K981266J024270o45077j774316k726070l097569k130747
$$ plain form
18000 56910223 56228140 56896495 57734396 57382244 54698993 49360305 42417002 34881849 28369720
17991 28369720 23472056 20086095 17776616 16100720 14858327 13869570 13082390 12460184
17983 12460184 11969639 11552172 11171734 10847724 10542949 10289578 10061322 9896150 9837899
17974 9837899 9825482 9890528 10034706 10344910 10892461 11809905 13235732 15300404 17928010
17965 17928010 21008087 24402400 28078608 32086446 36157381 39341793 41347085 42237874
17957 42237874 42578681 42572804 42130430 40956869 39850354 39521311 39944031 40470198 40283887
17948 40283887 38907486 36044170 32054265 27292732 22451729 18402350 15371961 13325171
17940 13325171 11881566 10797130 9950517 9269640 8708285 8226232 7835124 7478274 7175140
$$ packed form
18000E6910223o82083O68355Q37901l52152k683251n338688o943303p535153o512129
17991B8369720m897664l385961k309479j675896j242393r88757p87180o22206
17983A2460184m90545m17467l80438l24010l04775k53371k28256j65172n8251
17974I837899j2417O5046J44178L10204N47551R17444J425827K064672K627606
17965A7928010L080077L394313L676208M007838M070935L184412K005292Q90789
17957D2237874L40807n877m42374j173561j106515l29043M22720N26167j86311
17948D0283887j376401k863316l989905m761533m841003m049379l030389k046790
17940A3325171j443605j084436q46613o80877n61355m82053l91108l56850l03134
$$ plain form
17931 7175140 6873224 6595124 6347304 6104066 5883977 5694135 5517504 5321014 5161009
17922 5161009 4986250 4793593 4635668 4485970 4350513 4252098 4148326 4048598 3953367 3875493
17912 3875493 3759327 3672101 3602401 3530206 3430933 3344451 3261251 3208653 3127704 3059023 3009973
17901 3009973 2944083 2880541 2813073 2734249 2664815 2582906 2503561 2425998 2389600 2363662 2324644
17890 2324644 2277861 2219633 2141977 2089742 2044945 1996760 1980365 1973585 1969414 1952188 1934409 1903720
17878 1903720 1874464 1850588 1798207 1773800 1766930 1777861 1769727 1727075 1694115 1671269 1666215 1649268
17866 1649268 1631592 1622600 1613933 1566701 1484378 1466657 1465697 1458688 1441922 1430561 1440901 1426521
17854 1426521 1417028 1421513 1393531 1372813 1351633 1327354 1324089 1309028 1291159 1295642 1280939 1254950
$$ packed form
17931G175140l01916k78100k47820k43238k20089j89842j76631j96490j60005
17922E161009j74759j92657j57925j49698j35457r8415j03772r9728r5231p7874
17912C875493j16166q7226o9700p2195r9273q6482q3200n2598q0949o8681m9050
17901C009973o5890o3542o7468p8824o9434q1909p9345p7563l6398k5938l9018
17890B324644m6783n8228p7656n2235m4797m8185j6395o780m171j7226j7779l0689
17878A903720k9256k3876n2381k4407o870J0931q134m2652l2960k2846n054j6947
17866A649268j7676q992q667m7232q2323j7721r60p009j6766j1361J0340j4380
17854A426521r493M485k7982k0718k1180k4279l265j5061j7869M483j4703k5989
$$ plain form
17842 1254950 1221647 1190402 1191672 1174825 1191647 1212484 1219137 1244268 1268217 1248502 1241362 1229448
17830 1229448 1244427 1263621 1266804 1285617 1304373 1307508 1314622 1332214 1355227 1386664 1390841 1381978
17818 1381978 1387430 1393759 1431313 1450533 1451139 1460019 1491384 1496212 1484457 1484519 1487677 1517399 1541911
17805 1541911 1556638 1561473 1580813 1582152 1621669 1666099 1688059 1749100 1794679 1829013 1841758 1898850
17793 1898850 1986384 2062043 2152146 2261256 2343554 2454561 2568019 2727399 2902994 3097466
17783 3097466 3327212 3570818 3838365 4135057 4457087 4804857 5120134 5454611 5922097
17774 5922097 6522348 7321962 8410992 9826262 11419196 12947835 14452060 16222736
17766 16222736 18479411 20941651 23100220 24585712 25718312 27656628 31292266 37111699
$$ packed form
17842A254950l3303l1245J270j6847J6822K0837O653K5131K3949j9715p140j1914
17830A229448J4979J9194L183J8813J8756L135P114J7592K3013L1437M177q863
17818A381978N452O329L7554J9220O06Q880L1365M828j1755O2L158K9722K4512
17805A541911J4727M835J9340J339L9517M4430K1960O1041M5579L4334J2745N7092
17793A898850Q7534P5659R0103J09110Q2298J11007J13458J59380J75595J94472
17783C097466K29746K43606K67547K96692L22030L47770L15277L34477M67486
17774E922097O00251P99614J089030J415270J592934J528639J504225J770676
17766A6222736K256675K462240K158569J485492J132600J938316L635638N819433
$$ plain form
17758 37111699 45384758 56401072 69810173 84699790 100893720 118668783 136720608
17751 136720608 152142003 163906206 169702885 168187176 160767917 146921280 128545052
17744 128545052 110595571 96136647 85188692 77277367 71450181 66247229 61082521
17737 61082521 56821257 54027234 52050628 50313850 48982086 48336172 47751815 46069655
17729 46069655 42541518 37866768 33671462 30754512 28986327 27985960 27479829 27300942
17721 27300942 27522297 28198194 29427008 30939448 32620446 35063663 38920913 44421520
17713 44421520 51846721 61460371 72471821 83083987 91636765 100649738 113528784 127933373
17705 127933373 137075838 135828796 124465531 113151546 108025888 105804416 103659894 102234242
$$ packed form
17758C7111699Q273059J1016314J3409101J4889617J6193930J7775063J8051825
17751A36720608J5421395J1764203N796679j515709p419259j3846637j8376228
17744A28545052j7949481j4458924j0947955p911325n827186n202952n164708
17737F1082521m261264k794023j976606j736778j331764o45914n84357j682160
17729D6069655l528137m674750m195306k916950j768185j000367n06131j78887
17721B7300942K21355O75897J228814J512440J680998K443217L857250N500607
17713D4421520P425201R613650J1011450J0612166Q552778R012973J2879046J4404589
17705A27933373R142465j247042j1363265j1313985n125658k221472k144522j425652
$$ plain form
17697 102234242 103414628 107929578 112716129 113264787 107478815 98769060 92201877 89592095
17689 89592095 88328523 84125103 74488704 61793457 51228563 44434788 40251097 37248925
17681 37248925 34539196 31880618 29600008 27979072 26906993 26119341 25567009 25375979
17673 25375979 25631382 26370074 27411337 28264629 28449201 28303866 28956005 30910611 33395221
17664 33395221 35434243 35708650 33925046 32291057 32161061 33632371 35104622 35111392 32354685
17655 32354685 27857566 24405875 22550939 21797352 21196316 20064205 17981212 15583308
17647 15583308 13822812 12637182 11802787 11152657 10597026 10114157 9706554 9377801 9058507
17638 9058507 8773425 8454375 8144461 7910856 7693273 7527530 7342909 7090268 6819900
$$ packed form
17697A02234242J180386M514950M786551N48658n785972q709755o567183k609782
17689H9592095j263572m203420r636399j2695247j0564894o793775m183691l002172
17681C7248925k709729k658578k280610j620936j072079p87652n52332j91030
17673B5375979K55403P38692J041263Q53292J84572j45335O52139J954606K484610
17664C3395221K039022K74407j783604j633989j29996J471310J472251O770k756707
17655C2354685m497119l451691j854936p53587o01036j132111k082993k397904
17647A5583308j760496j185630q34395o50130n55631m82869m07603l28753l19294
17638I058507k85082l19050l09914k33605k17583j65743j84621k52641k70368
$$ plain form
17629 6819900 6569330 6354353 6166727 5999347 5846570 5709402 5566877 5401380 5251914
17620 5251914 5096874 4953227 4834454 4709443 4562564 4438505 4335563 4236458 4138639 4015814
17610 4015814 3885079 3767530 3628389 3501852 3394567 3309968 3203580 3097968 2994107 2903409
17600 2903409 2787364 2692511 2620295 2524493 2481910 2429457 2394024 2331221 2255790 2189158 2156469
17589 2156469 2121857 2074752 2038538 1990946 1923897 1886075 1847837 1819933 1746415 1684535 1673290
17578 1673290 1657638 1628062 1568279 1504510 1462370 1438235 1410315 1371135 1345097 1327044 1302835
17567 1302835 1300409 1304941 1289052 1278948 1258009 1229846 1232168 1205542 1158790 1126257 1082929 1050577
17555 1050577 1011023 976711 951935 902849 840563 810665 792107 784558 757838 704643 681583
$$ packed form
17629F819900k50570k14977j87626j67380j52777j37168j42525j65497j49466
17620E251914j55040j43647j18773j25011j46879j24059j02942r9105r7819j22825
17610D015814j30735j17549j39141j26537j07285q4599j06388j05612j03861r0698
17600B903409j16045r4853p2216r5802m2583n2453l5433o2803p5431o6632l2689
17589B156469l4612m7105l6214m7592o7049l7822l8238k7904p3518o1880j1245
17578A673290j5652k9576n9783o3769m2140k4135k7920l9180k6038j8053k4209
17567A302835k426M532j5889j0104k0939k8163K322k6626m6752l2533m3328l2352
17555A050577l9554l4312k4776m9086o2286k9898j8558p549k6720n3195k3060
$$ plain form
17544 681583 684935 650529 603244 609210 603736 589336 578398 563877 571528 563011 539070 527465
17532 527465 547876 543472 499034 482931 510912 541748 544728 517454 490078 472004 458336 461816
17520 461816 479973 455663 429684 443342 473219 493670 508651 497303 460369 421351 419539 415277
17508 415277 439419 452288 446371 431774 424644 425362 419169 418486 421356 469034 497236 533150 603221
17495 603221 620565 595384 607544 601996 600167 613479 626592 642512 613523 580056 567333 559932
17483 559932 545371 518968 512974 502116 479746 450526 403757 374623 391703 400953 396884 419556
17471 419556 425988 420880 417227 452376 474387 492444 480620 454406 455185 474773 528557 582751
17459 582751 571731 532097 485192 453994 455601 481403 472953 480011 508153 511303 564848 621441
$$ packed form
17544F81583L352l4406m7285N966n474j4400j0938j4521P651q517k3941j1605
17532E27465K0411m404m4438j6103K7981L0836K980k7274k7376j8074j3668L480
17520D61816J8157k4310k5979J3658K9877K0451J4981j1348l6934l9018j812m262
17508D15277K4142J2869n917j4597p130P18o193o83K870M7678K8202L5914P0071
17495F03221J7344k5181J2160n548j829J3312J3113J5920k8989l3467j2723p401
17483E59932j4561k6403n994j0858k2370k9220m6769k9134J7080R250m069K2672
17471D19556O432n108l653L5149K2011J8057j1824k6214P79J9588N3784N4194
17459E82751j1020l9634m6905l1198J607K5802q450P058K8142L150N3545N6593
$$ plain form
17447 621441 650352 703233 743915 786470 815129 809811 783875 746028 723650 688829 674364 660953
17435 660953 619150 563945 525962 489908 454082 448695 431714 398295 401147 403574 391564 403255
17423 403255 388747 372128 371286 340936 391106 457017 463123 451657 466383 480079 531530 545613
17411 545613 528947 486751 457773 450588 428239 434103 428770 396002 351514 317924 299345 281901
17399 281901 267338 280806 264519 253963 265647 272909 254700 265175 298383 294386 268150 267052
17387 267052 241006 217966 206491 222689 248011 254223 250515 206909 168287 154080 168883 183903
17375 183903 142285 120084 128563 127075 122138 154935 144514 140789 149525 177100 191840 224995
17363 224995 224094 205530 218994 215702 224113 210275 177265 167284 163548 160227 157091 146512 118036
$$ packed form
17447F21441K8911N2881M0682M2555K8659n318k5936l7847k2378l4821j4465j3411
17435F60953m1803n5205l7983l6054l5826n387j6981l3419K852K427j2010J1691
17423D03255j4508j6619q42l0350N0170O5911O106j1466J4726J3696N1451J4083
17411E45613j6666m2196k8978p185k2349N864n333l2768m4488l3590j8579j7444
17399B81901j4563J3468j6287j0556J1684P262j8209J0475L3208l997k6236j098
17387B67052k6046k3040j1475J6198K5322O212l708m3606l8622j4207J4803J5020
17375A83903m1618k2201Q479j488m937L2797j0421l725Q736K7575J4740L3155
17363B24995r01j8564J3464l292Q411j3838l3010r981l736l321l136j0579k8476
$$ plain form
17350 118036 123946 136360 117462 88674 83731 68315 31081 57048 92498 95206 55555 61116
17338 61116 58981 49366 61215 63854 13455 2969 48404 81103 82475 59654 31277 38923 62775
17325 62775 50066 61010 82524 79631 69945 55581 52771 39988 15793 11197 -15449 -13187 16450
17312 16450 21085 11005 40787 44067 14441 15643 29676 30645 36182 10601 -10674 676 15895
17299 15895 34891 32469 47598 53346 39121 23484 28357 27131 40584 26522 9202 18251 10039
17286 10039 12557 15394 15983 16378 20686 20826 -8725 -19127 -16715 -19917 5905 -14340 -21600 -10249
17272 -10249 17360 3158 251 31690 58135 61864 75201 73820 87435 112500 128973 139241
17260 139241 140449 156631 187792 218724 252895 301766 286984 284962 344621 403141 430650 434412
$$ packed form
17350A18036N910J2414j8898k8788m943j5416l7234K5967L5450K708l9651N561
17338F1116k135r615J1849K639n0399j0486M5435L2699J372k2821k8377P646K3852
17325F2775j2709J0944K1514k893r686j4364k810j2783k4195m596k6646K262K9637
17312A6450M635j0080K9782L280k9626J202J4033R69N537k5581k1275J1350J5219
17299A5895J8996k422J5129N748j4225j5637M873j226J3453j4062j7320R049q212
17286A0039K518K837N89L95M308J40k9551j0402K412l202K5822k0245p260J1351
17272a0249K7609j4202k907L1439K6445L729J3337j381J3615K5065J6473J0268
17260A39241J208J6182L1161L0932L4171M8871j4782k022N9659N8520K7509L762
$$ plain form
17248 434412 414837 413165 438382 487274 523084 519835 548162 579314 609349 609503 606328 565275
17236 565275 492384 441754 428494 396399 409119 430407 427756 386037 356764 296498 229129 164903
17224 164903 138708 148056 164415 139957 155794 168484 166562 141038 151459 121953 97935 76770
17212 76770 90480 127948 164604 191799 187970 216309 281064 342451 381462 440542 484217 528369
17200 528369 581272 629943 650247 673079 662431 650890 646216 664793 657411 626279 573838 504746
17188 504746 489450 510431 489444 459517 463233 438148 408430 367110 367729 364976 362972 329113
17176 329113 290514 282905 294307 285981 260522 238629 203310 163382 143162 135361 132474 113362
17164 113362 124260 115033 106448 84074 106624 103084 78738 77462 93216 109379 137610 149860
$$ packed form
17248D34412j9575j672K5217M8892L5810l249K8327L1152L0035J54l175m1053
17236E65275p2891n0630j3260l2095J2720K1288k651m1719k9273o0266o7369o4226
17224A64903k6195R348J6359k4458J5837J2690j922k5524J0421k9506k4018k1165
17212G6770J3710L7468L6656K7195l829K8339O4755O1387L9011N9080M3675M4152
17200E28369N2903M8671K0304K2832j0648j1541m674J8577p382l1132n2441o9092
17188E04746j5296K0981k0987k9927L716k5085k9718m1320O19k753k004l3859
17176C29113l8599p609J1402q326k5459k1893l5319l9928k0220p801k887j9112
17164A13362J0898r227q585k2374K2550l540k4346j276J5754J6163K8231J2250
$$ plain form
17152 149860 162003 144268 138771 125030 131796 138437 164065 171528 150415 105058 91515 97612
17140 97612 90954 92133 93265 76772 43464 29711 34947 35629 58192 69194 19503 28771 49135
17127 49135 50594 38594 37515 20321 -2687 -3587 11515 39771 32380 26806 52825 36814 34722
17114 34722 49469 57344 28946 -10834 2321 -998 5116 2517 1551 -7281 -6642 -14993 -2224 4768
17100 4768 9108 348 7622 18411 28991 34426 13679 -6374 -9947 -11369 -7863 -18153 -21593
17087 -21593 -25646 -1804 -29542 -27144 5702 23281 52633 47839 36030 19197 -2672 -23513
17075 -23513 -32663 -31552 -13292 30803 35218 4937 -23648 -15803 1795 -7955 17916 14019 -12175
17062 -12175 -26111 -24776 -5929 -7652 5696 14274 782 -2617 -13956 -21172 -51833 -49619 -44054
$$ packed form
17152A49860J2143j7735n497j3741O766O641K5628P463k1113m5357j3543O097
17140I7612o658J179J132j6493l3308j3753N236O82K2563J1002m9691R268K0364
17127D9135J459j2000j079j7194k3008r00J5102K8256p391n574K6019j6011k092
17114C4722J4747P875k8398l9780J3155l319O114k599r66q832O39q351J2769O992
17100D768M340q760P274J0789J0580N435k0747k0053l573j422L506j0290l440
17087b1593m053K3842k7738K398L2846J7579K9352m794j1809j6833k1869k0841
17075b3513r150J111J8260M4095M415l0281k8585P845J7598r750K5871l897k6194
17062a2175j3936J335J8847j723J3348Q578j3492l399j1339p216l0661K214N565
$$ plain form
17049 -44054 -54128 -42235 -1422 -19953 -25426 -5959 2450 -10509 -11228 -23815 -40657 -51607
17037 -51607 -52984 -49011 -33077 -17673 -12508 4860 5 -2836 -18230 -4435 -5215 -15859 -19544
17024 -19544 -70470 -70284 -66083 -46940 -34511 -33187 -7443 -677 -373 5206 14475 5191 13797 25670
17010 25670 32873 9115 -4980 -16104 -22005 -23837 -20003 -29750 -56424 -40524 -43246 -36995 -3728
16997 -3728 -5060 976 11651 -2360 -27725 -46861 -64308 -35479 -15281 -13279 -16740 -21528 -23611
16984 -23611 -25659 -16171 3152 16063 -4586 -17809 -39119 -22523 5119 -22403 -36502 -38938
16972 -38938 -19966 -12017 -10486 -22893 -22440 -12024 -32274 -10177 -5522 -20676 -54261 -45853 -32019
16959 -32019 -29540 -2702 4257 -31125 -46647 -53753 -48108 -36038 -28426 -41354 -24496 -17159 -16277
$$ packed form
17049d4054j0074J1893M0813j8531n473J9467Q409j2959p19j2587j6842j0950
17037e1607j377L973J5934J5404N165J7368m855k841j5394J3795p80j0644l685
17024a9544n0926J86M201J9143J2429J324K5744O766L04N579R269r284Q606J1873
17010B5670P203k3758j4095j1124n901j832L834r747k6674J5900k722O251L3267
16997c728j332O036J0675j4011k5365j9136j7447K8829K0198K002l461m788k083
16984b3611k048R488J9323J2911k0649j3223k1310J6596K7642k7522j4099k436
16972c8938J8972P949J531j2407M53J0416k0250K2097M655j5154l3585Q408J3834
16959c2019K479K6838O959l5382j5522p106N645J2070P612j2928J6858P337Q82
$$ plain form
16946 -16277 -25173 -33721 -38615 -13667 24909 36492 15394 -19467 -35149 -46712 -51717 -32591
16934 -32591 -30344 -39617 -36831 -50432 -37933 -42977 -54660 -36803 -12983 9112 14374 12349 19303
16921 19303 9431 -2397 -28632 -21253 335 2404 -13119 -27306 -47155 -70318 -73874 -53138
16909 -53138 -57997 -36053 -8109 -12477 -21793 -39547 -42791 -24876 -24735 -28200 2434 31126 14770
16896 14770 -6453 1578 6369 20891 21882 10649 28270 54306 43008 29081 46937 45871 19598
16883 19598 -8742 -17382 -7090 -8246 -1977 -7801 -12863 -13405 11402 4874 -29379 -42634 -21301
16870 -21301 -22842 -57143 -78693 -74956 -69825 -64168 -23112 20931 47735 51567 40034 11301 5651
16857 5651 14854 2588 -26244 -43105 -48141 -53937 -67065 -50608 -61177 -58175 -34976 -14601 189
$$ packed form
16946a6277q896q548m894K4948L8576J1583k1098l4861j5682j1563n005J9126
16934c2591K247r273K786j3601J2499n044j1683J7857K3820K2095N262k025O954
16921A9303r872j1828k6235P379K1588K069j5523j4187j9849k3163l556K0736
16909e3138m859K1944K7944m368r316j7754l244J7915J41l465L0634K8692j6356
16896A4770k1223Q031M791J4522R91j1233J7621K6036j1298j3927J7856j066k6273
16883A9598k8340q640J0292j156O269n824n062n42K4807o528l4253j3255K1333
16870b1301j541l4301k1550L737N131N657M1056M4043K6804L832j1533k8733n650
16857E651R203j2266k8832j6861n036n796j3128J6457j0569L002K3199K0375J4790
$$ plain form
16844 189 10510 -3621 -2266 -14354 -30204 -23384 -21260 -8557 -37 -33348 -24883 -41355 -56444
16831 -56444 -76544 -72683 -46577 -40089 -42162 -22110 -2616 3900 -23002 -34466 -9389 -16351 -26208
16818 -26208 13574 25575 14513 24256 24306 -642 -4760 -25172 -40256 -65184 -69081 -54343 -37234
16805 -37234 -17671 -19501 -41886 -50563 -20770 -6690 -8226 -23711 -22031 -16416 -5099 -6295 4486
16792 4486 8096 5006 -11126 -18688 -4796 6277 -5819 -13456 -15044 -20855 -31089 -27040 -9801
16779 -9801 1480 -7485 -26364 -11237 -35237 -73694 -73349 -87345 -76393 -70252 -35654 -25765 -35196
16766 -35196 -29256 -31998 -41618 -27507 -24945 -55986 -58731 -49199 -77026 -63409 -43968 -43243 -19623
16753 -19623 -11573 -2605 -4730 -9938 -8039 -21617 -26471 -4505 -35251 -59362 -58018 -46465 -52528
$$ packed form
16844A89J0321j4131J355j2088j5850O820K124J2703Q520l3311Q465j6472j5089
16831e6444k0100L861K6106O488k073K0052J9494O516k6902j1464K5077o962r857
16818b6208L9782J2001j1062R743N0k4948m118k0412j5084k4928l897J4738J7109
16805c7234J9563j830k2385q677K9793J4080j536j5485J680N615J1317j196J0781
16792D486L610l090j6132p562J3892J1073j2096p637j588n811j0234M049J7239
16779i801J1281q965j8879J5127k4000l8457L45j3996J0952O141L4598R889r431
16766c5196N940k742r620J4111K562l1041k745R532k7827J3617J9441P25K3620
16753a9623Q050Q968k125n208J899j3578m854K1966l0746k4111J344J1553o063
$$ plain form
16740 -52528 -73093 -52164 -38328 -21487 4848 408 -32884 -55414 -71843 -73357 -31225 5240
16728 5240 4691 -5669 6748 -4691 -18886 3042 46091 28242 -6287 -15885 -9818 -22135 -42293
16715 -42293 -65815 -51240 -35227 -48812 -50201 -24160 -20860 468 -5867 -33267 -41934 -8859
16703 -8859 0 18818 20320 19002 4004 -14549 -26062 -36020 -24024 4511 -4554 -3894 -1073
16690 -1073 14101 13208 -4922 -8774 -1897 -11689 -19292 -27895 -14550 -8539 -28262 -38704 -23405
16677 -23405 -21834 -12274 -22594 -59008 -58249 -39524 -19520 -32365 -34333 -6080 -2960 -27861 -38478
16664 -38478 -41851 -52699 -33535 7846 2991 2124 -8111 -17094 -23679 -51003 -56207 -37775 -42412
16651 -42412 -44258 -27579 -5722 291 -8988 -4265 -5749 12300 4405 -24393 -30429 -37681 -36195
$$ packed form
16740e2528k0565K0929J3836J6841K6335m440l3292k2530j6429j514M2132L6465
16728E240n49j0360J2417j1439j4195K1928M3049j7849l4529r598O067j2317k0158
16715d2293k3522J4575J6013j3585j389K6041L300K1328o335k7400q667L3075
16703h859Q859J8818J502j318j4998j8553j1513r958J1996K8535r065O60K821
16690a073J5174q93j8130l852O877r792p603q603J3345O011j9723j0442J5299
16677b3405J571R560j0320l6414P59J8725K0004j2845j968K8253L120k4901j0617
16664c8478l373j0848J9164M1381m855q67j0235q983o585k7324n204J8432m637
16651d2412j846J6679K1857O013r279M723j484J8049p895k8798o036p252J486
$$ plain form
16638 -36195 -19306 -13584 -16629 -10094 5775 -17343 -21165 -39680 -32856 2086 -15577 -30307 -43249
16625 -43249 -31323 -44766 -40039 -25998 -55950 -69559 -44838 -37318 -35948 -42603 -38290 -43068 -53613
16612 -53613 -27599 -25479 -6054 8410 4919 26966 7202 -37407 -39152 -35571 -19533 -30192
16600 -30192 -32574 -20129 -31103 -24162 -6085 -16572 -31522 -49519 -41336 -35809 -22257 -24964 -22596
16587 -22596 -48078 -34073 -38480 -48520 -25172 -1889 298 -6359 -41316 -66399 -48364 -29148
16575 -29148 -16044 -7141 -24530 -10974 -20981 -31272 -34607 -21734 -16263 -9000 21896 36046
16563 36046 8417 -43877 -25437 19778 35526 29873 9618 -20900 -44680 -41725 888 36365
16551 36365 56904 31706 -32972 -34086 -17139 3635 24671 38282 2715 -29878 -28179 -380
$$ packed form
16638c6195J6889N722l045O535J5869k3118l822j8515O824L4942j7663j4730j2942
16625d3249J1926j3443M727J4041k9952j3609K4721P520J370o655M313m778j0545
16612e3613K6014K120J9425J4464l491K2047j9764m4609j745L581J6038j0659
16600c0192k382J2445j0974O941J8077j0487j4950j7997Q183N527J3552k707K368
16587b2596k5482J4005m407j0040K3348K3283K187o657l4957k5083J8035J9216
16575b9148J3104Q903j7389J3556j0007j0291l335J2873N471P263L0896J4150
16563C6046k7629n2294J8440M5215J5748n653k0255l0518k3780K955M2613L5477
16551C6365K0539k5198o4678j114J6947K0774K1036J3611l5567l2593J699K7799
$$ plain form
16539 -380 8860 -27805 -44999 -28411 -5062 6101 -8788 -47139 -41609 3805 21012 3058
16527 3058 -27030 -7749 -3561 24983 9355 -18185 -32143 -45938 -56841 -64868 -51049 -38819
16515 -38819 -52258 -63519 -60348 -41927 -22006 -26134 -44137 -35942 -39730 -41124 -46093 -63787 -55783
16502 -55783 -1742 25362 20168 16215 -1738 -23727 -55939 -68599 -63534 -44807 -26799 -6219
16490 -6219 -13585 -10661 -25620 -39373 -27654 -6208 13037 26005 14847 9071 -7632 -31989
16478 -31989 -27039 -31765 -39151 -14636 8782 25737 29710 27037 16048 2616 9270 25141 35114
16465 35114 13831 -7612 -30844 -35498 -35023 -39152 -1999 -13929 -27473 -8509 1761 1030 -14485
16452 -14485 -25798 -38093 -18163 -12794 -4971 12425 59658 46357 5890 612 -12765 -33580
$$ packed form
16539c80R240l6665j7194J6588K3349J1163j4889l8351N530M5414J7207j7954
16527C058l0088J9281M188K8544j5628k7540j3958j3795j0903q027J3819J2230
16515c8819j3439j1261L171J8421J9921m128j8003Q195l788j394m969j7694Q004
16502e5783N4041K7104n194l953j7953k1989l2212j2660N065J8727J8008K0580
16490f219p366K924j4959j3753J1719K1446J9245J2968j1158n776j6703k4357
16478c1989M950m726p386K4515K3418J6955L973k673j0989j3432O654J5871R973
16465C5114k1283k1443k3232m654M75m129L7153j1930j3544J8964J0270p31j5515
16452a4485j1313j2295J9930N369P823J7396M7233j3301m0467n278j3377k0815
$$ plain form
16440 -33580 -46006 -54911 -53819 -10949 38880 44728 24335 12449 5665 791 -33019 -24243 -19249
16427 -19249 -14974 305 2473 -12 26505 38976 10394 -456 -49350 -65469 -52261 -30657
16415 -30657 -12496 977 -25567 -18394 -20525 -6794 -18773 -36725 -31377 -18546 -19254 -21219 -10742
16402 -10742 1638 -13374 -1270 1240 39796 26566 5849 6257 -7763 -5686 5783 19550
16390 19550 1378 -5574 311 -17998 -6784 12305 25034 19884 -10058 -18533 -12066 -20232 -30077
16377 -30077 -16139 11448 16 -16594 7450 38660 26352 31818 21081 15733 17111 22022
16365 22022 22937 -5063 -12916 -23607 -37821 -24488 -3490 -957 -12391 -34316 -30721 -40356 -47367
16352 -47367 -55739 -40015 -32373 5036 17668 29301 36717 19360 11360 34704 27389 -5912 -14119
$$ packed form
16440c3580j2426q905J092M2870M9829N848k0393j1886o784m874l3810Q776M994
16427a9249M275J5279K168k485K6517J2471k8582j0850m8894j6119J3208K1604
16415c0657J8161J3473k6544P173k131J3731j1979j7952N348J2831p08j965J0477
16402a0742J2380j5012J2104K510L8556j3230k0717M08j4020K077J1469J3767
16390A9550j8172o952N885j8309J1214J9089J2729n150k9942q475O467q166r845
16377c0077J3938K7587j1432j6610K4044L1210j2308N466j0737n348J378M911
16365B2022R15k8000p853j0691j4214J3333K0998K533j1434k1925L595r635p011
16352d7367q372J5724P642L7409J2632J1633P416j7357q000K3344p315l3301q207
$$ plain form
16339 -14119 -27005 -44682 -53094 -41411 -10977 498 -6341 -13306 -13604 -2030 9496 3833 10346
16326 10346 24680 34187 15745 -12162 -13076 -14263 -27234 -14367 -8403 17321 4999 -6550 10689
16313 10689 20938 39166 43133 25465 -15728 -37520 -31568 -24266 -5205 -12816 1610 13695
16301 13695 -944 8585 28578 -23 -17042 -6249 -10916 9336 9692 5955 26586 15894 16962
16288 16962 4054 18132 5697 -13711 -19125 -20048 -23898 -11037 3722 -4009 -1307 18249 28793
16275 28793 22345 13465 -9764 3799 -12787 -27023 -41286 -46407 -56235 -50038 -31665 -20921 2495
16262 2495 11581 2729 3421 1861 -17847 -13085 -5764 12136 3342 -8237 -777 -4648 -18116 -32385
16248 -32385 -60948 -69871 -39810 -20508 -13427 5551 16458 13734 40850 30794 -9601 -10336 -9322
$$ packed form
16339a4119j2886j7677q412J1683L0434J1475o839o965k98J1574J1526n663O513
16326A0346J4334R507j8442k7907r14j187j2971J2867N964K5724j2322j1549J7239
16313A0689J0249J8228L967j7668m1193k1792N952P302J9061p611J4426J2085
16301A3695j4639R529J9993k8601j7019J0793m667K0252L56l737K0631j0692J068
16288A6962j2908J4078j2435j9408n414r23l850J2861J4759p731K702J9556J0544
16275B8793o448q880k3229J3563j6586j4236j4263n121r828O197J8373J0744K3416
16262B495R086q852O92j560j9708M762P321J7900q794j1579P460l871j3468j4269
16248c2385k8563q923L0061J9302P081J8978J0907k724K7116j0056m0395p35J014
$$ plain form
16235 -9322 -21628 -22112 -19001 -581 18145 -24163 -51546 -65293 -44440 -29251 -10899 -8502 -27442
16222 -27442 -18328 -21867 -23901 -16136 -21492 -9377 -6582 -16492 -16564 -15407 3276 -1376 -26830 -49905
16208 -49905 -33276 2154 18183 29963 14085 22017 21553 4445 -9917 -20641 18242 29331
16196 29331 -655 -12183 -1522 18327 -2329 4886 18862 12158 -39709 -49958 -18015 -20446
16184 -20446 -37867 -39980 -50242 -60046 -40899 -28365 -48668 -32667 -26355 -24871 -38795 -25925
16172 -25925 668 -920 -11243 -4546 8896 20265 20755 14953 4266 -13337 -3208 12188 25509
16159 25509 37278 22233 16694 3313 -9848 -17178 -41805 -31586 2808 17104 15604 20595
16147 20595 34927 28626 26430 29044 1829 -21276 -31927 -31050 -32229 -13410 941 32542 46877
$$ packed form
16235i322j2306m84L111J8420J8726m2308k7383j3747K0853J5189J8352K397j8940
16222b7442R114l539k034P765n356J2115K795r910p2J157J8683m652k5454k3075
16208d9905J6629L5430J6029J1780j5878P932m64j7108j4362j0724L8883J1089
16196B9331k9986j1528J0661J9849k0656P215J3976o704n1867j0249L1943k431
16184b0446j7421k113j0262r804J9147J2534k0303J6001O312J484j3924J2870
16172b5925K6593j588j0323O697J3442J1369M90n802j0687j7603J0129J5396J3321
16159B5509J1769j5045n539j3381j3161p330k4627J0219L4394J4296j500M991
16147B0595J4332o301k196K614k7215k3105j0651Q77j179J8819J4351L1601J4335
$$ plain form
16134 46877 24364 28112 47882 68102 62996 10854 12428 38561 37626 21197 1042 18124 38530
16121 38530 54078 55149 33118 15298 -26451 -47566 -33987 -8705 22885 -3676 -13197 5937
16109 5937 4454 -27357 7259 25637 4503 -7889 -26706 -55045 -41350 -15049 10535 23741
16097 23741 27026 895 -7299 2543 1752 8334 25485 17538 12037 12572 -18505 -14448 17095 36735
16083 36735 9875 3192 17401 22357 14403 8266 31050 20200 10195 -2544 -28471 -40630
16071 -40630 -44016 829 14470 7807 9223 -4831 -27421 -32069 -30793 -10161 -7312 -23258 -24209
16058 -24209 -26596 -35281 -3911 30607 35815 9410 -4206 -36351 -24094 -26906 -24281 -11556 -17040
16045 -17040 -3417 7590 32932 45574 15541 645 -10542 2579 8111 10686 -10721 -30388
$$ packed form
16134D6877k2513L748J9770K0220n106n2142J574K6133r35j6429k0155J7082K0406
16121C8530J5548J071k2031j7820m1749k1115J3579K5282L1590k6561r521J9134
16109E937j483l1811L4616J8378k1134j2392j8817k8339J3695K6301K5584J3206
16097B3741L285k6131q194R842p91O582J7151p947n501N35l1077M057L1543J9640
16083C6735k6860o683J4209M956p954o137K2784j0850j0005j2739k5927j2159
16071d0630l386M4845J3641o663J416j4054k2590m648J276K0632K849j5946r51
16058b4209k387q685L1370L4518N208k6405j3616l2145J2257k812K625J2725n484
16045a7040J3623J1007K5342J2642l0033j4896j1187J3121N532K575k1407j9667
$$ plain form
16033 -30388 -12921 12753 7757 102 -4354 10854 20824 8770 14271 41979 16022 3781 20852
16020 20852 12123 -331 -3691 -14413 -33063 -47083 -30001 -17449 -12988 -8946 1897 26788
16008 26788 41594 51869 56557 87021 65703 35580 7693 -3027 3747 3136 -13111 -8321 13052
15995 13052 12631 13696 22783 23846 35982 20440 27394 36696 28961 6263 13171 18411 22169 14701
15981 14701 17926 31902 41372 30370 4006 4038 9421 -4919 756 -25920 -34625 -25475 4365
15968 4365 12050 -2333 8521 23707 20644 12742 30688 34021 -10589 -51790 -51638 -44035 -27252
15955 -27252 -20403 -34484 -52245 -53751 -27165 -6131 -16510 -23104 -15846 -13069 -29802 -6919 9563
15942 9563 -13966 -35492 -42916 -47585 -36807 -14562 -5003 -15682 -14395 -13489 -20541 -32308 -33810
$$ packed form
16033c0388J7467K5674m996p655m456J5208R970j2054N501K7708k5957j2241J7071
16020B0852q729j2454l360j0722j8650j4020J7082J2552M461M042J0843K4891
16008B6788J4806J0275M688L0464k1318l0123k7887j0720O774o11j6247M790K1373
15995A3052m21J065R087J063J2136j5542O954R302p735k2698O908N240L758p468
15981A4701L225J3976R470j1002k6364L2N383j4340N675k6676q705R150K9840
15968D365P685j4383J0854J5186l063p902J7946L333m4610m1201J52P603J6783
15955b7252O849j4081j7761j506K6586K1034j0379o594P258K777j6733K2883J6482
15942I563k3529k1526p424m669J0778K2245R559j0679J287R06p052j1767j502
$$ plain form
15929 -33810 -15944 -4204 22494 42088 28382 8072 2464 -7723 -8543 -10999 5658 -8751
15917 -8751 -8388 7632 26016 11292 16890 -3993 -27198 -14187 -9503 6858 7086 -189 13326
15904 13326 24487 18577 -203 3065 4607 6455 9243 18798 30222 44846 58207 61089 67761
15891 67761 75507 69907 24899 -34481 -49519 -35088 -22741 -25299 -33766 -25604 -25450 -8796 13707
15878 13707 5383 4677 -11052 -10328 5359 21017 3295 16 -19485 -24387 -6736 6661 16723
15865 16723 3671 11951 9837 -757 2279 13894 10329 -1295 -20799 -19936 -20867 -21647 -42768 -37979
15851 -37979 -23319 -21868 -26831 -29129 -46943 -56675 -33324 -14602 -10742 -11459 -31819 -12710 13614
15838 13614 -26599 -54648 -56199 -16442 19269 34281 17016 3852 18340 23661 5522 -7652
$$ packed form
15929c3810J7866J1740K6698J9594j3706k0310n608j0187q20k456J6657j4409
15917h751L63J6020J8384j4724N598k0883k3205J3011M684J6361K28p275J3515
15904A3326J1161n910j8780L268J542J848K788R555J1424J4624J3361K882O672
15891F7761P746n600m5008n9380j5038J4431J2347k558q467Q162J54J6654K2503
15878A3707q324p06j5729P24J5687J5658j7722l279j9501m902J7651J3397J0062
15865A6723j3052Q280k114j0594L036J1615l565j1624j9504Q63r31p80k1121M789
15851c7979J4660J451m963k298j7814r732K3351J8722L860p17k0360J9109K6324
15838A3614m0213k8049j551L9757L5711J5012j7265j3164J4488N321j8139j3174
$$ plain form
15826 -7652 -12391 -8846 6798 15297 18039 29747 28237 41745 43517 27841 6856 -472 -5127
15813 -5127 13592 5983 16204 26634 2587 16185 15291 -19650 -14133 5011 23887 13652 24309
15800 24309 29546 22503 -5523 8677 37946 22964 -3997 -8827 32577 15684 -16583 -27708
15788 -27708 -16221 -9399 21724 44693 38663 -1168 -28289 -36240 -25557 -57605 -61502 -30623
15776 -30623 -9919 -18428 16474 17873 20367 3122 -9494 -17428 -20753 -9389 -3852 -17218 -2000
15763 -2000 24335 28875 35626 48059 29964 18788 26039 41915 45744 30411 10225 3718 10128
15750 10128 51 103 10514 13682 396 -591 -1142 33245 42838 45557 52155 29174 24480 2458
15736 2458 7182 30409 48838 70581 66453 35338 8183 3743 -12949 -6171 -28849 -39919 -27185
$$ packed form
15826g652m739L545J5644Q499K742J1708j510J3508J772j5676k0985p328m655
15813e127J8719p609J0221J0430k4047J3598q94l4941N517J9144J8876j0235J0657
15800B4309N237p043k8026J4200K9269j4982k6961m830M1404j6893l2267j1125
15788b7708J1487O822L1123K2969o030l9831k7121p951J0683l2048l897L0879
15776c0623K0704q509L4902J399K494j7245j2616p934l325J1364N537j3366J5218
15763b000K6335M540O751J2433j8095j1176P251J5876L829j5333k0186o507O410
15750A0128j0077N2J0411L168j3286r87n51L4387R593K719O598k2981m694k2022
15736B458M724K3227J8429K1743m128l1115k7155m440j6692O778k2678j1070J2734
$$ plain form
15723 -27185 -15911 -13671 12591 51962 52592 39530 29126 17076 38637 36666 32088 28739 8097
15710 8097 7412 19883 39590 26098 14315 31698 19271 -603 -31870 -19149 29905 35637
15698 35637 3680 3764 -8721 -25295 -32189 -5899 547 -8785 -16240 -24389 -5458 12900 8875
15685 8875 10851 3150 -4581 16268 22258 -2262 -4418 -27931 -21252 13024 4661 -16719 -14211
15672 -14211 -19488 5983 23510 47621 56059 28952 23429 25514 25114 18316 17452 28657 29723 27298
15658 27298 42524 23124 35345 43105 29756 -7063 -35707 -33802 -29509 -14058 -14377 -30123 -16897
15645 -16897 18828 18535 25531 25967 21909 8955 -12106 6573 13324 8473 21893 18050 7509
15632 7509 15476 41941 50801 37534 20266 18353 6636 -17109 -8120 21855 33482 33945 30708
$$ packed form
15723b7185J1274K240K6262L9371O30j3062j0404j2050K1561j971m578l349k0642
15710H097o85J2471J9707j3492j1783J7383j2427j9874l1267J2721M9054N732
15698C5637l1957Q4j2485j6574o894K6290O446r332p455q149J8931J8358m025
15685H875J976p701p731K0849N990k4520k156k3513O679L4276q363k1380K508
15672a4211n277K5471J7527K4111Q438k7107n523K085m00o798q64J1205J066k425
15658B7298J5226j9400J2221P760j3349l6819k8644J905M293J5451l19j5746J3226
15645a6897L5725k93O996M36m058j2954k1061J8679O751m851J3420l843j0541
15632G509P967K6465Q860j3267j7268j913j1717k3745Q989K9975J1627M63l237
$$ plain form
15619 30708 5372 7525 -7374 -17119 -9429 13100 31582 21839 25645 56576 71162 67508 53583
15606 53583 41023 59320 87438 81020 68538 43518 39886 23804 20898 35679 16514 36819
15594 36819 42553 37050 25027 -8687 -39750 -40335 -21099 -3275 43426 20693 13468 39253 41190
15581 41190 36671 23206 13216 10915 -5035 -14308 13753 36048 36904 24190 4963 -4775 -28154
15568 -28154 -19675 -10744 -8907 2353 13665 54325 56591 55980 48197 43427 70290 47731 5767
15555 5767 -19772 -19905 -25714 -11644 7650 15675 17344 8406 29898 37237 6889 -44568 -41272
15542 -41272 -24758 -5016 24344 66877 53530 44311 50809 57273 56258 27200 608 8076 -1350
15529 -1350 -29099 -24439 8792 25830 1143 9663 5575 10260 20373 -11153 -9810 402 23088
$$ packed form
15619C0708k5336K153j4899r745P690K2529J8482r743L806L0931J4586l654j3925
15606E3583j2560J8297K8118o418j2482k5020l632j6082k906J4781j9165K0305
15594C6819N734n503j2023l3714l1063n85J9236J7824M6701k2733p225K5785J937
15581D1190m519j3465r990k301j5950r273K8061K2295Q56j2714j9227r738k3379
15568b8154Q479Q931J837J1260J1312M0660K266o11p783m770K6863k2559m1964
15555E767k5539j33n809J4070J9294Q025J669q938K1492P339l0348n1457L296
15542d1272J6514J9742K9360M2533j3347r219O498O464j015k9058k6592P468r426
15529a350k7749M660L3231J7038k4687Q520m088M685J0113l1526J343J0212K2686
$$ plain form
15516 23088 26227 -14315 -7985 14246 31276 63573 41235 -13735 -19827 -12369 15906 -15158
15504 -15158 -47009 -57287 -24656 -19222 -33711 -28030 -19913 -42941 -22247 20611 40954 62609
15492 62609 46428 14988 -5313 -39425 -77240 -71082 -42544 -27931 -6676 9268 28028 36589
15480 36589 24787 10163 7317 7023 -1637 -6223 -1076 -7040 3775 24160 10202 1765 36248
15467 36248 42819 34040 17655 -7597 6036 27497 60337 64577 40523 31419 42878 59393
15455 59393 60958 55300 58040 86599 109969 140142 144767 173926 195952 190287 175998 136496 133356
15442 133356 135043 146552 131583 97550 84866 70980 72881 80042 58079 43642 55004 42065
15430 42065 26774 47972 63451 108002 116043 101215 86047 84033 92822 87292 92095 65717 44765
$$ packed form
15516B3088L139m0542O330K2231J7030L2297k2338n4970o092P458K8275l1064
15504a5158l1851j0278L2631N434j4489N681Q117k3028K0694M2858K0343K1655
15492F2609j6181l1440k0301l4112l7815O158K8538J4613K1255J5944J8760Q561
15480C6589j1802j4624k846k94q660m586N147n964J0815K0385j3958q437L4483
15467C6248O571q779j6385k5252J3633K1461L2840M240k4054r104J1459J6515
15455E9393J565n658K740K8559K3370L0173M625K9159K2026n665j4289l9502l140
15442A33356J687J1509j4969l4033j2684j3886J901P161k1963j4437J1362j2939
15430D2065j5291K1198J5479M4551Q041j4828j5168k014Q789n530M803k6378k0952
$$ plain form
15417 44765 31938 49768 54872 52582 42930 32937 22350 11533 9002 30339 50716 48449 50739
15404 50739 64775 43374 35478 47186 33136 46819 49521 35949 26642 24128 17266 32381 59017
15391 59017 91238 73218 79202 56613 21535 13876 33531 63192 67931 41478 39130 45314 59322
15378 59322 81462 96700 111537 99005 93334 100080 74518 99349 111228 133783 140380 129148
15366 129148 105611 95961 105015 100077 101135 91032 90733 65369 67299 56126 69153 44229 33659
15353 33659 32244 21949 28893 47745 66943 60842 50808 52957 72474 83520 58907 38730
15341 38730 19993 26636 29717 12722 11352 21903 27771 32531 41965 10139 7711 26859 35798
15328 35798 12991 10997 21108 20344 30958 31533 7665 13794 32097 41454 68984 89144 58069
$$ packed form
15417D4765j2827J7830N104k290r652r993j0587j0817k531K1337K0377k267K290
15404E0739J4036k1401p896J1708j4050J3683K702j3572r307k514o862J5115K6636
15391E9017L2221j8020N984k2589l5078p659J9655K9661M739k6453k348O184J4008
15378E9322K2140J5238J4837j2532n671O746k5562K4831J1879K2555O597j1232
15366A29148k3537r650R054m938J058j0103k99k5364J930j1173J3027k4924j0570
15353C3659j415j0295O944J8852J9198o101j0034K149J9517J1046k4613k0177
15341C8730j8737O643L081j6995j370J0551N868M760R434l1826k428J9148Q939
15328C5798k2807j994J0111p64J0614N75k3868O129J8303R357K7530K0160l1075
$$ plain form
15315 58069 40584 36404 40407 31898 34996 57710 59361 49518 60418 58992 57918 54048 48179 36608
15301 36608 32693 15569 19681 47745 50027 50432 34326 -3481 -7056 8781 15039 -8946 5768
15288 5768 33477 62381 73317 80912 75624 80432 74770 66955 78852 82901 49396 26686 14433
15275 14433 23607 32276 25843 16493 19024 4845 17174 21689 18932 28989 66056 66644 82618
15262 82618 87682 60478 54043 42898 30983 15045 35620 46652 31624 23830 42791 46849
15250 46849 56188 64066 54007 43304 31880 34043 41593 76198 48545 39919 40147 68081 44082
15237 44082 27941 61670 67572 42252 26291 31105 21003 53449 47668 56868 76851 88923
15225 88923 101179 89273 59889 76865 84036 107326 91713 90408 80552 53782 61958 70001 89066
$$ packed form
15315E8069j7485m180M003q509L098K2714J651r843J0900j426j074l870n869j1571
15301C6608l915j7124M112K8064K282M05j6106l7807l575J5837O258k3985J4714
15288E768K7709K8904J0936P595n288M808n662p815J1897M049l3505k2710j2253
15275A4433R174Q669o433r350K531j4179J2329M515k757J0057L7067N88J5974
15262H2618N064k7204o435j1145j1915j5938K0575J1032j5028p794J8961M058
15250D6849R339P878j0059j0703j1424K163P550L4605k7653q626K28K7934k3999
15237D4082j6141L3729N902k5320j5961M814j0102L2446n781R200J9983J2072
15225H8923J2256j1906k9384J6976P171K3290j5613j305r856k6770Q176Q043J9065
$$ plain form
15212 89066 71820 65326 76573 85457 84975 71319 81910 87948 82889 91834 86015 99278 103183
15199 103183 117241 118029 79656 65806 74490 98969 110550 109168 101847 129778 118895 96545
15187 96545 120886 126459 120920 136691 158388 166377 159561 178673 159066 141405 132564 126047 127063
15174 127063 143056 157427 197868 258650 309931 349069 432367 516974 609329 754233 889040
15163 889040 1032473 1180039 1347025 1457003 1561845 1586011 1547131 1503470 1397713 1252934
15153 1252934 1089076 913849 779211 631612 516169 449087 371748 309419 288054 278059
15143 278059 252998 249000 274255 281858 283817 268331 242814 255351 242565 230728 190239 166554
15131 166554 161191 169967 189551 181517 185667 191199 212545 193738 163074 160791 154310 165668 160403
$$ packed form
15212H9066j7246o494J1247Q884m82j3656J0591O038n059Q945n819J3263L905
15199A03183J4058P88l8373j3850Q684K4479J1581j382p321K7931j0883k2350
15187I6545K4341N573n539J5771K1697P989o816J9112j9607j7661q841o517J016
15174A27063J5993J4371M0441O0782N1281L9138Q3298Q4607R2355J44904J34807
15163H89040J43433J47566J66986J09978J04842K4166l8880m3661j05757j44779
15153A252934j63858j75227j34638j47599j15443o7082p7339o2329k1365r995
15143B78059k5061l998K5255P603J959j5486k5517J2537j2786j1837m0489k3685
15131A66554n363Q776J9584q034M150N532K1346j8807l0664k283o481J1358n265
$$ plain form
15118 160403 147157 110436 96873 112347 108487 113920 133976 112043 98723 106585 126988 121985
15106 121985 114076 105982 99434 110004 101487 97506 77783 35174 6035 17242 40086 57502
15094 57502 90663 105771 116166 125312 160070 152370 114182 104714 80581 67195 72990 76858 67855
15081 67855 77562 91322 106160 122878 120421 99593 103878 109640 94531 86339 85115 113096 126602
15068 126602 138243 148855 155715 160939 188451 219315 237857 225001 184135 219306 236727 250015
15056 250015 243064 236697 219480 213152 192596 166028 153329 148128 151818 149816 135698 124966 137980
15043 137980 146115 134241 128892 121497 111322 107356 118900 91161 86087 109361 102997 89880 77865
15030 77865 75612 86887 97565 94790 123929 117596 112955 108857 95462 80228 82940 78752 69837
$$ packed form
15118A60403j3246l6721j3563J5474l860N433K0056k1933j3320P862K0403n003
15106A21985p909q094o548J0570q517l981j9723m2609k9139J1207K2844J7416
15094E7502L3161J5108J0395R146L4758p700l8188r468k4133j3386N795L868r003
15081F7855R707J3760J4838J6718k457k0828M285N762j5109q192j224K7981J3506
15068A26602J1641J0612O860N224K7512L0864J8542j2856m0866L5171J7421J3288
15056B50015o951o367j7217o328k0556k6568j2699n201L690k002j4118j0732J3014
15043A37980Q135j1874n349p395j0175l966J1544k7739n074K3274o364j3117j2015
15030G7865k253J1275J0678k775K9139o333m641m098j3395j5234K712m188q915
$$ plain form
15017 69837 90406 95722 102305 109335 115476 122066 117401 95688 96260 96198 69734 82806 96645 122720
15003 122720 131504 126726 121241 141019 149751 163117 157632 163361 196865 188421 241365 303171 325517
14990 325517 375894 424746 441057 455801 483834 503826 498477 510164 495661 467654 407775 315122
14978 315122 255172 197317 159190 155873 176690 195115 179741 165920 175049 193854 195028 185315
14966 185315 208509 222981 222711 233277 227758 229662 242358 256899 265850 258584 264258 284563 304165
14953 304165 304637 325001 324057 309253 324952 337122 317696 297508 285557 262014 254344 240394
14941 240394 212639 184512 187787 163029 142542 147085 146464 165014 142791 130660 121770 136531
14929 136531 168894 166275 164402 142308 137480 167596 177373 199052 191832 204605 179590 145958
$$ packed form
15017F9837K0569N316O583P030O141O590m665k1713N72o2k6464J3072J3839K6075
15003A22720Q784m778n485J9778Q732J3366n485N729L3504q444N2944O1806K2346
14990C25517N0377M8852J6311J4744K8033J9992n349J1687j4503k8007n9879r2653
14978C15122n9950n7855l8127l317K0817J8425j5374j3821R129J8805J174r713
14966A85315K3194J4472k70J0566n519J904J2696J4541Q951p266N674K0305J9602
14953C04165M72K0364r44j4804J5699J2170j9426k0188j1951k3543p670j3950
14941B40394k7755k8127L275k4758k0487M543o21J8550k2223j2131q890J4761
14929A36531L2363k619j873k2094m828L0116R777K1679p220J2773k5015l3632
$$ plain form
14917 145958 130193 146568 166854 174466 168883 168010 170310 180483 181592 178646 187524 172096 150334
14904 150334 153788 169504 188981 222550 227491 267884 286739 309262 331245 325039 326436 323504
14892 323504 334831 310731 268499 243885 265113 268331 238572 225145 236577 261515 254025 247304
14880 247304 238387 223274 224714 232799 219290 226020 261221 272397 283940 274858 261126 269858 279307
14867 279307 263014 259006 260529 241805 230438 205287 208972 225500 227482 219035 210643 221056 236920
14854 236920 249627 265304 287908 319220 300598 278019 297876 286040 304405 329253 338154 351041
14842 351041 367435 363888 362091 385169 411022 432643 472608 473333 470102 504131 523678 547017
14830 547017 578109 619051 630054 638821 622890 621534 606921 600895 620419 640257 635803 627954
$$ packed form
14917A45958j5765J6375K0286P612n583q73K300J0173J109k946Q878j5428k1762
14904A50334L454J5716J9477L3569M941M0393J8855K2523K1983o206J397k932
14892C23504J1327k4100m2232k4614K1228L218k9759j3427J1432K4938p490o721
14880B47304q917j5113J440Q085j3509O730L5201J1176J1543r082j3732Q732R449
14867B79307j6293m008J523j8724j1367k5151L685J6528J982q447q392J0413J5864
14854B36920J2707J5677K2604L1312j8622k2579J9857j1836J8365K4848Q901J2887
14842C51041J6394l547j797K3078K5853K1621L9965P25l231L4029J9547K3339
14830E47017L1092M0942J1003Q767j5931j356j4613o026J9524J9838m454p849
$$ plain form
14818 627954 613547 613364 633937 630461 646604 639054 645749 630826 631504 653023 652143 640183 632855
14805 632855 626721 640459 637776 646870 630670 627796 652093 650075 646632 682838 739006 776548 781358
14792 781358 785119 773428 762860 752025 766189 760977 758521 788042 803850 824000 829659 841299
14780 841299 845158 871831 896478 902268 898988 884792 893130 922394 983656 1024040 1025046 1043600
14768 1043600 1089093 1105382 1125058 1153612 1181649 1191336 1197602 1218835 1279137 1338133 1369699 1392679
14756 1392679 1410856 1459924 1494056 1534076 1616335 1696098 1719857 1768811 1881176 1970040 2062920
14745 2062920 2152113 2268856 2384391 2496116 2626675 2773780 2942905 3112697 3304198 3510670
14735 3510670 3731993 3965705 4222501 4520327 4861098 5247686 5693528 6190000 6786770
$$ packed form
14818F27954j4407j83K0573l476J6143p550O695j4923O78K1519q80j1960p328
14805F32855o134J3738k683R094j6200k874K4297k018l443L6206N6168L7542M810
14792G81358L761j1691j0568j0835J4164n212k456K9521J5808K0150N659J1640
14780H41299L859K6673K4647N790l280j4196Q338K9264O1262M0384J006J8554
14768A043600M5493J6289J9676K8554K8037R687O266K1233O0302N8996L1566K2980
14756A392679J8177M9068L4132M0020Q2259P9763K3759M8954J12365Q8864R2880
14745B062920Q9193J16743J15535J11725J30559J47105J69125J69792J91501K06472
14735C510670K21323K33712K56796K97826L40771L86588M45842M96472N96770
$$ plain form
14726 6786770 7483011 8367385 9452186 10701220 12185551 13971973 16050449 18546285
14718 18546285 21557405 25146858 29713486 35878878 44378041 55903063 71001291 89957471
14710 89957471 112797131 139278548 168616121 199365392 229200286 255217346 274602040
14703 274602040 284941801 284995147 274923981 256125030 230579173 200526989 168646936
14696 168646936 137799497 110725585 89322718 73785194 62980744 55317189 49599500
14689 49599500 45077387 41309912 38015837 35074609 32494784 30198904 28166415 26395676
14681 26395676 24868917 23551349 22353212 21304880 20367083 19489705 18661666 17865174 17132915
14672 17132915 16464086 15895804 15347660 14817608 14322877 13869766 13457964 13116428 12776964
$$ packed form
14726F786770O96241Q84374J084801J249034J484331J786422K078476K495836
14718A8546285L011120L589453M566628O165392Q499163J1525022J5098228J8956180
14710H9957471K2839660K6481417K9337573L0749271K9834894K6017060J9384694
14703B74602040J0339761N3346j0071166j8798951k5545857l0052184l1880053
14696A68646936l0847439k7073912k1402867j5537524j0804450p663555n717689
14689D9599500m522113l767475l294075k941228k579825k295880k032489j770739
14681B6395676j526759j317568j198137j048332r37797q77378q28039p96492p32259
14672A7132915o68829n68282n48144n30052m94731m53111m11802l41536l39464
$$ plain form
14663 12776964 12448940 12141139 11862574 11534379 11220289 10921867 10629033 10317567 10008904
14654 10008904 9699983 9412689 9124265 8852546 8573043 8264997 7988980 7732624 7461989
14645 7461989 7212584 6952568 6731711 6506242 6299440 6126119 5917973 5744797 5592622
14636 5592622 5460535 5322920 5182500 5054420 4941337 4844866 4726560 4610328 4492470 4385471
14626 4385471 4274944 4143702 4002043 3884312 3802399 3687541 3567501 3460007 3321060 3224021
14616 3224021 3159478 3042039 2956310 2910518 2808018 2708122 2634962 2546002 2495455 2438287 2394907
14605 2394907 2342235 2300926 2228969 2151807 2096398 2036086 2006387 1953339 1917841 1875677 1823201
14594 1823201 1759642 1717188 1714513 1705184 1644616 1589842 1557323 1536066 1513966 1492031 1452249 1433079
$$ packed form
14663A2776964l28024l07801k78565l28195l14090k98422k92834l11466l08663
14654A0008904l08921k87294k88424k71719k79503l08046k76017k56356k70635
14645G461989k49405k60016k20857k25469k06802j73321k08146j73176j52175
14636E592622j32087j37615j40420j28080j13083r6471j18306j16232j17858j06999
14626D385471j10527j31242j41659j17731q1913j14858j20040j07494j38947r7039
14616C224021o4543j17439q5729m5792j02500r9896p3160q8960n0547n7168m3380
14605B394907n2672m1309p1957p7162n5409o0312k9699n3048l5498m2164n2476
14594A823201o3559m2454k675r329o0568n4774l2519k1257k2100k1935l9782j9170
$$ plain form
14582 1433079 1410118 1400603 1352925 1306011 1286002 1278985 1243947 1170783 1096443 1061221 1029563 986515
14570 986515 923137 845267 813684 793496 755633 692900 685206 691698 659925 656667 670015 649838
14558 649838 613533 587535 590370 610807 611770 589891 552840 524728 536694 546453 564657 579180
14546 579180 595335 603071 609872 599359 605117 621601 611583 556267 501564 456094 426821 414928
14534 414928 397654 349697 320853 333159 348998 364493 336622 295245 271099 270065 276984 282940
14522 282940 257249 225857 211629 199321 179650 181446 147741 155557 195024 210835 189894 188462
14510 188462 188756 171404 198822 212535 222887 197865 191356 193030 202477 192940 188285 202495 215759
14497 215759 238138 252340 266344 241984 226107 215259 241405 241429 263049 297864 270464 252943
$$ packed form
14582A433079k2961r515m7678m6914k0009p017l5038p3164p4340l5222l1658m3048
14570I86515o3378p7870l1583k0188l7863o2733p694O492l1773l258J3348k0177
14558F49838l6305k5998K835K0437R63k1879l7051k8112J1966R759J8204J4523
14546E79180J6155P736O801j0513N758J6484j0018n5316n4703m5470k9273j1893
14534D14928j7274m7957k8844J2306J5839J5495k7871m1377k4146j034O919N956
14522B82940k5691l1392j4228j2308j9671J796l3705P816L9467J5811k0941j432
14510A88462K94j7352K7418J3713J0352k5022o509J674R447r537m655J4210J3264
14497B15759K2379J4202J4004k4360j5877j0848K6146K4K1620L4815k7400j7521
$$ plain form
14485 252943 250243 226199 231861 231767 214251 196412 203546 235479 238098 241560 235667 239316 227008
14472 227008 199727 175588 145684 130262 157166 178689 185028 187971 196007 186575 173895 157616
14460 157616 149648 145388 154913 177008 193759 183958 160528 183921 206717 199709 212377 250856
14448 250856 270413 260596 248937 225116 211743 219087 172300 153085 131975 118648 104847 106582
14436 106582 99739 91483 75553 76241 66284 78779 109072 101984 90594 78904 60760 65783 88816
14423 88816 57861 51294 64958 76656 82970 47864 40125 60942 47321 45468 49337 69011 71232
14410 71232 67400 82332 104970 75237 37620 30081 61280 57872 44575 33644 53206 61577
14398 61577 69737 56799 44607 25657 26545 23244 3682 -3555 9864 15475 38762 52299 19809
$$ packed form
14485B52943k700k4044N662r4j7516j7839P134L1933K619L462n893L649j2308
14472B27008k7281k4139k9904j5422K6904K1523O339K943Q036r432j2680j6279
14460A57616p968m260R525K2095J6751r801k3430K3393K2796p008J2668L8479
14448B50856J9557r817j1659k3821j3373P344m6787j9215k1110j3327j3801J735
14436A06582o843q256j5930O88r957J2495L0293p088j1390j1690j8144N023K3033
14423H8816l0955o567J3664J1698O314l5106p739K0817j3621j853L869J9674K221
14410G1232l832J4932K2638k9733l7617p539L1199l408j3297j0931J9562Q371
14398F1577Q160j2938j2192j8950Q88l301j9562p237J3419N611K3287J3537l2490
$$ plain form
14385 19809 11572 31963 37738 52250 38166 46005 53545 25656 7838 -1128 -13822 -38497 -15615
14372 -15615 -17827 595 -139 -23731 -38466 -22137 -2159 13168 20321 19183 45057 51155 39810
14359 39810 34016 35634 27119 27283 25326 622 5154 42539 37039 15754 11606 2674 14311 17640
14345 17640 10216 27713 30411 27981 17385 38736 53241 58667 46559 26379 12514 -5501
14333 -5501 -4607 5497 -1374 -40119 -26099 38940 52192 38169 -619 -3797 33373 12493 -14544
14320 -14544 7935 9753 -29735 -54729 -10803 6401 17422 48478 52225 46521 47112 48315 17362
14307 17362 7961 8945 26904 12396 32212 53343 69015 62062 44318 24607 10060 32985
14295 32985 47120 14174 -3972 -710 22943 17171 6544 46332 80029 102591 97112 108398
$$ packed form
14385A9809q237K0391N775J4512j4084P839P540k7889j7818q966j2694k4675K2882
14372a5615k212J8422p34k3592j4735J6329J9978J5327P153j138K5874O098j1345
14359C9810n794J618q515J64j957k4704M532L7385n500k1285m148q932J1637L329
14345A7640p424J7497K698k430j0596K1351J4505N426j2108k0180j3865j8015
14333e501Q94J0104o871l8745J4020O5039J3252j4023l8788l178L7170k0880k7037
14320a4544K2479J818l9488k4994M3926J7204J1021L1056L747n704N91J203l0953
14307A7362r401R84J7959j4508J9816K1131J5672o953j7744j9711j4547K2925
14295C2985J4135l2946j8146L262K3653n772j0627L9788L3697K2562n479J1286
$$ plain form
14283 108398 104084 82830 83053 116622 120574 123618 97217 66241 49398 61947 58108 57665 47043
14270 47043 58758 63022 72649 58066 58693 80287 103842 111974 103598 72962 60310 68797 76367
14257 76367 93124 108006 125209 166879 160795 153637 196560 290712 401521 485957 609431 783431
14245 783431 969554 1118281 1289066 1449332 1534028 1507568 1453668 1360783 1242809 1152090
14235 1152090 1019633 843478 723982 617513 516619 443139 419908 386680 392931 357381
14225 357381 303191 290096 277590 283584 266570 260482 214360 177386 166559 167469 170661 191881
14213 191881 176462 103971 86727 83033 82860 68906 67039 77524 85315 74692 91174 93902 87822
14200 87822 77067 51815 39348 33597 42670 50517 71156 68653 47960 84726 122843 108237
$$ packed form
14283A08398m314k1254K23L3569L952L044k6401l0976j6843J2549l839m43j0622
14270D7043J1715M264R627j4583O27K1594K3555Q132q376l0636j2652Q487P570
14257G6367J6757J4882J7203M1670o084p158M2923R4152J10809Q4436J23474J74000
14245G83431J86123J48727J70785J60266Q4696k6460n3900r2885j17974r0719
14235A152090j32457j76155j19496j06469j00894p3480k3231l3228O251l5550
14225C57381n4190j3095j2506N994j7014o088m6122l6974j0827R10L192K1220
14213A91881j5419p2491j7244l694j73j3954j867J0485P791j0623J6482K728o080
14200H7822j0755k5252j2467n751R073P847K0639k503k0693L6766L8117j4606
$$ plain form
14188 108237 95494 108055 108095 98069 71842 84173 65766 60520 62466 49140 49620 49078 38415
14175 38415 38075 26789 11836 21910 20371 22937 4003 4879 34346 51410 61373 57483 41521
14162 41521 41338 61986 73880 78032 87125 88846 52732 27350 37957 39391 50507 26876 21398
14149 21398 31130 26994 14943 4760 -5437 -9694 2267 22527 8923 15742 2246 16745
14137 16745 21380 10634 -4644 -21645 -51733 -28496 -13871 -1292 -5338 -5732 -12592 1452 33484
14124 33484 33764 22838 9678 10780 -9025 -15558 -32381 -30266 -13349 -11016 -22061 -21062 -8250
14111 -8250 9570 14788 27490 -5900 -20351 -10491 11503 9512 24071 22763 8891 -10516 -20097
14098 -20097 -160 20349 3807 -3434 12302 6890 12115 7221 36140 24558 42893 81906
$$ packed form
14188A08237j2743J2561M0j0026k6227J2331j8407n246J946j3326M80n42j0663
14175C8415l40j1286j4953J0074j539K566j8934Q76K9467J7064R963l890j5962
14162D1521j83K0648J1894M152R093J721l6114k5382J0607J434J1116k3631n478
14149B1398R732m136j2051j0183j0197m257J1961K0260j3604O819j3496J4499
14137A6745M635j0746j5278j7001l0088K3237J4625J2579m046l94o860J4044L2032
14124C3484K80j0926j3160J102j9805o533j6823K115J6917K333j1045R99J2812
14111h250J7820N218J2702l3390j4451R860K1994j991J4559j308j3872j9407r581
14098b0097J9937K0509j6542p241J5736n412N225m894K8919j1582J8335L9013
$$ plain form
14086 81906 121982 155402 182018 222391 252599 278600 321427 370390 366516 325805 275998 228564
14074 228564 170296 163141 142305 109869 47848 39894 41459 40319 41213 51594 25399 -105 13492
14061 13492 28183 24700 18688 6131 9038 3706 15568 16369 13850 50318 52598 37277 19877
14048 19877 -6900 9827 13439 15992 19717 15419 11844 3034 9262 23238 29303 55280 33490
14035 33490 17390 -17196 -39761 -42445 -37008 -46098 -39069 -41021 -49259 -29795 -8630 22249 28395
14022 28395 34013 9749 -2466 -1854 -6134 19800 22955 19937 34230 28415 13319 -3315 -24284
14009 -24284 -47210 -31700 -23188 -31651 -28997 -13476 -10819 -31661 -49699 -35010 -15924 -7190 -7206
13996 -7206 -6842 3959 -23 -9130 2512 -150 -2988 8969 -11316 -11569 1893 16588 1298
$$ packed form
14086H1906M0076L3420K6616M0373L0208K6001M2827M8963l874m0711m9807m7434
14074B28564n8268p155k0836l2436o2021p954J565j140Q94J0381k6195k5504J3597
14061A3492J4691l483o012j2557K907n332J1862Q01k519L6468K280j5321j7400
14048A9877k6777J6727L612K553L725m298l575q810O228J3976O065K5977k1790
14035C3490j6100l4586k2565k684N437r090P029j952q238J9464K1165L0879O146
14022B8395N618k4264j2215O12m280K5934L155l018J4293n815j5096j6634k0969
14009b4284k2926J5510Q512q463K654J5521K657k0842j8038J4689J9086Q734j6
13996g206L64J0801l982r107J1642k662k838J1957k0285k53J3462J4695j5290
$$ plain form
13983 1298 -26362 -32708 -21214 -1642 -24692 -45971 -47211 6176 13643 7763 5580 2642 -7577
13970 -7577 -11642 -7458 11719 15716 34600 29623 9208 15075 -13116 -13060 -15530 -41295 -50516 -62733
13956 -62733 -61437 -34197 -20807 8210 27630 42324 36777 35870 45092 35802 49731 27355 34920
13943 34920 38240 35396 35166 12266 26948 15044 -20121 -35028 -16902 -18540 -7836 848 -29978
13930 -29978 -42438 -1426 11151 14489 -20473 -35148 -2868 4758 -31978 -45331 -64304 -38070
13918 -38070 -15633 -19639 -32861 -16660 -10883 -16692 -5366 24450 24830 8101 3632 6783 -14315
13905 -14315 -3443 4164 22409 31390 31140 33773 27320 24367 10351 -19950 -34085 6616 7455
13892 7455 12795 12935 16515 11446 7207 -14154 -26542 -33119 -8530 7609 15541 12008 13791 -16904
$$ packed form
13983A298k7660o346J1494J9572k3050k1279j240N3387P467n880k183k938j0219
13970g577m065M184J9177L997J8884m977k0415N867k8191N6k470k5765r221j2217
13956f2733J296K7240J3390K9017J9420J4694n547r07R222r290J3929k2376P565
13943C4920L320k844k30k2900J4682j1904l5165j4907J8126j638J0704Q684l0826
13930b9978j2460M1012J2577L338l4962j4675L2280P626l6736j3353j8973K6234
13918c8070K2437m006j3222J6201N777n809J1326K9816L80j6729m469L151k1098
13905a4315J0872P607J8245Q981k50K633o453k953j4016l0301j4135M0701Q39
13892G455N340J40L580n069m239k1361j2388o577K4589J6139P932l533J783l0695
$$ plain form
13878 -16904 -1943 -2485 -48169 -56082 -39658 -8562 6662 19190 26801 7266 -25943 -38063
13866 -38063 -31761 -23391 -5876 -3933 -28578 -51860 -28442 -11685 -15414 -1420 -473 3157 -4734
13853 -4734 -5032 -18191 -28225 -49488 -53413 -24105 -16548 -8897 -8937 -3320 -12261 9081 -9023 -23237
13839 -23237 2589 2111 -6802 5073 -8950 -14353 -21536 -19723 -25898 -19163 8571 25148 28649
13826 28649 47934 45853 26137 16912 13477 9092 4510 22587 21240 14463 450 -22525 -26446
13813 -26446 1792 13927 8476 -27704 -42428 -21706 -743 17363 -1910 -40234 -22569 -2341
13801 -2341 -3749 -6110 -14560 -4035 24916 39545 35181 23514 -8224 -15780 -34320 -40269 -7571
13788 -7571 34440 48065 44758 31597 3298 -11017 -16682 -40841 -12770 -2330 117 -16214
$$ packed form
13878a6904J4961n42m5684p913J6424L1096J5224J2528P611j9535l3209j2120
13866c8063O302Q370J7515J943k4645k3282K3418J6757l729J3994R47L630p891
13853d734k98j3159j0034k1263l925K9308P557P651m0N617q941K1342j8104j4214
13839b3237K5826m78q913J1875j4023n403p183J813o175O735K7734J6577L501
13826B8649J9285k081j9716r225l435m385m582J8077j347o777j4013k2975l921
13813b6446K8238J2135n451l6180j4724K0722K0963J8106j9273l8324J7665K0228
13801b341j408k361q450J0525K8951J4629m364j1667l1738p556j8540n949L2698
13788g571M2011J3625l307j3161k8299j4315n665k4159K8071J0440K447j6331
$$ plain form
13776 -16214 -4809 9535 -14737 -53921 -63494 -45289 -23158 -1213 -16739 -14979 -16527 -14992
13764 -14992 -3447 -11808 -2094 1645 5828 10226 6317 -20118 -25794 -25971 -48257 -23822 13176
13751 13176 5549 8895 9266 -1604 10332 23198 30600 12804 11403 -14094 -21652 -30474 -39859
13738 -39859 -38950 -44995 -32981 -17694 28062 29836 -15483 -40328 -28598 -8600 -11056 -18815 534
13725 534 1821 9040 25736 14253 -782 831 5244 10455 18906 -13030 1587 697 8638 27808
13711 27808 37509 24115 2702 6965 -18674 -64476 -65753 -46136 -25513 -31518 -13412 -33666
13699 -33666 -45336 -51276 -41270 -19064 -38610 -29007 -149 -2971 -22578 -42583 -46327 -52824 -54004
13686 -54004 -55854 -31706 -47946 -41276 -29742 -38660 -57044 -89910 -60723 -35236 -17765 -25520
$$ packed form
13776a6214J1405J4344k4272l9184r573J8205K2131K1945j5526J760j548J535
13764a4992J1545q361R714L739M183M398l909k6435n676j77k2286K4435L6998
13751A3176p627L346L71j0870J1936J2866P402j7796j401k5497p558q822r385
13738c9859R09o045J2014J5287M5756J774m5319k4845J1730J9998k456p759J9349
13725E34J287P219J6696j1483j5035J613M413N211Q451l1936J4617q90P941J9170
13711B7808R701j3394k1413M263k5639m5802j277J9617K0623o005J8106k0254
13699c3666j1670n940J0006K2206j9546R603K8858k822j9607k0005l744o497j180
13686e4004j850K4148j6240O670J1534q918j8384l2866K9187K5487J7471p755
$$ plain form
13674 -25520 -41733 -30960 -19248 -26558 -10858 -3376 -1125 -4881 -38685 -69959 -75323 -56153 -39881
13661 -39881 -70325 -99801 -65794 -47008 -45509 -50122 -38430 -23839 -13230 1374 -2908 2775
13649 2775 5414 15258 -519 -27487 -32564 -32985 -38883 -66221 -87465 -65190 -48109 -33591 -9313
13636 -9313 -6215 12238 31826 20360 -8330 -30363 -5684 22980 39257 32565 30791 32361 37410
13623 37410 40778 37078 32764 27244 58711 58942 41549 51230 29930 15243 -4342 -12088 -13594
13610 -13594 -17836 -10273 -5026 7490 26153 1830 -14945 5331 13671 23168 32823 52663 17734
13597 17734 -12841 -4289 -1670 -6333 -6802 -7624 -22906 -53778 -50544 -33021 -19871 -6785 4196
13584 4196 -7257 -14464 -10697 -1717 16993 45222 31447 29097 30476 -5082 -25051 -15183 -13253
$$ packed form
13674b5520j6213J0773J1712p310J5700P482K251l756l3804l1274n364J9170J6272
13661c9881l0444k9476L4007J8786J499m613J1692J4591J0609J4604m282N683
13649B775K639R844j5777k6968n077m21n898k7338k1244K2275J7081J4518K4278
13636i313L098J8453J9588j1466k8690k2033K4679K8664J6277o692j774J570N049
13623C7410L368l700m314n520L1467K31j7393R681k1300j4687j9585p746j506
13610a3594m242P563N247J2516J8663k4323j6775K0276Q340R497R655J9840l4929
13597A7734l0575Q552K619m663m69q22j5282l0872L234J7523J3150J3086J0981
13584D196j1453p207L767Q980J8710K8229j3775k350J379l5558j9969R868J930
$$ plain form
13571 -13253 -20981 4783 11959 -188 -4211 -329 7573 15092 -6430 -18429 -19315 -6314 13305
13558 13305 18724 28206 15968 -25234 -3176 12998 9673 -24444 -43331 -47286 -41762 -11609 4180
13545 4180 -4249 -4202 6752 9460 -9890 -21273 6810 27954 38212 22005 17796 14286 -14829
13532 -14829 -72646 -71202 -65614 -48152 -58070 -70199 -78156 -69128 -38533 -44099 -57937 -67874 -44857
13519 -44857 -14571 1655 -3376 -12226 -7377 21192 3613 -8001 561 12251 31433 23207 21577
13506 21577 22943 15711 5207 -3023 -388 -23055 -13088 9783 13355 12075 -6795 -13092 -13646 -14136
13492 -14136 -6862 -18943 -28695 -46982 -31981 -23399 -30827 -32021 -32427 2542 47201 24696 31710
13479 31710 32788 4185 189 16328 12630 6721 -5450 -23644 -27865 -10841 19130 -4702 -16789
$$ packed form
13571a3253p728K5764P176j2147m023L882P902P519k1522j1999q86J3001J9619
13558A3305N419R482j2238m1202K2058J6174l325l4117j8887l955N524L0153J5789
13545D180q429M7J0954K708j9350j1383K8083K1144J0258j6207m209l510k9115
13532a4829n7817J444N588J7462r918j2129p957R028L0595n566j3838r937K3017
13519d4857L0286J6226n031q850M849K8569j7579j1614Q562J1690J9182q226j630
13506B1577J366p232j0504q230K635k2667R967K2871L572j280j8870o297n54m90
13492a4136P274j2081r752j8287J5001Q582p428j194m06L4969M4659k2505P014
13479C1710J078k8603l996J6139l698n909j2171j8194m221J7024K9971k3832j2087
$$ plain form
13466 -16789 2529 -5372 -15963 12306 28645 8449 10010 5341 28480 66147 44537 39503
13454 39503 37412 33537 10314 -23800 -9790 -316 24513 26369 14002 4442 9183 -8623 5197
13441 5197 -11927 -24911 -44080 -49072 -41036 -46858 -44972 -44216 -30543 -9865 16445 -3669 3658
13428 3658 -8459 -22850 -5952 23098 27259 42661 -3341 -36462 -23221 12438 23586 27857
13416 27857 31421 30268 37073 -2356 -42035 -30001 -12264 -9476 -19382 -21747 -1083 -5394 -6346
13403 -6346 -19771 -17653 -7105 -12002 -15134 -19738 -7063 -13270 -26372 -39231 -22852 -15513 -658
13390 -658 11745 26259 13160 21813 40083 34059 21917 14310 9230 286 -8594 -7834 10451 -6653
13376 -6653 -18421 -3654 -6939 -5588 -18079 -10491 24325 35019 18203 6682 -3747 -16594
$$ packed form
13466a6789J9318p901j0591K8269J6339k0196J561m669K3139L7667k1610n034
13454C9503k091l875k3223l4114J4010R474K4829J856j2367r560M741j7806J3820
13441E197j7124j2984j9169m992Q036n822J886P56J3673K0678K6310k0114P327
13428C658j2117j4391J6898K9050M161J5402m6002l3121J3241L5659J1148M271
13416B7857L564j153O805l9429l9679J2034J7737K788r906k365K0664m311r52
13403f346j3425K118J0548m897l132m604J2675o207j3102j2859J6379P339J4855
13390f58J2403J4514j3099Q653J8270o024j2142p607n080q944q880P60J8285j7104
13376f653j1768J4767l285J351j2491P588L4816J0694j6816j1521j0429j2847
$$ plain form
13364 -16594 -25222 -12930 2683 -10800 3387 26712 -5798 -42870 -24921 -19204 16669 7072
13352 7072 -22773 -41016 -22141 8094 30223 23973 48281 83353 108365 103727 82678 79976
13340 79976 50898 20024 -3252 -9696 2452 -10002 -21863 -1048 11375 19835 20296 27093 40328
13327 40328 20221 15487 23237 48913 36844 3569 -16558 -21160 4351 23495 17057 15227 23502
13314 23502 24373 4359 9818 33607 37701 39030 42686 31582 4267 36891 65454 49034 32548
13301 32548 17879 43802 88858 115999 112933 86884 70904 51324 28905 24340 45954 34326
13289 34326 11295 359 -10801 383 313 5376 6455 2962 16667 30235 15291 -6180 -17874
13276 -17874 684 10448 29222 43803 44199 16980 14542 861 -18055 -8309 9251 -158 -18883
$$ packed form
13364a6594q628J2292J5613j3483J4187K3325l2510l7072J7949N717L5873r597
13352G072k9845j8243J8875L0235K2129o250K4308L5072K5012m638k1049k702
13340G9976k9078l0874k3276o444J2148j2454j1861K0815J2423Q460M61O797J3235
13327D0328k0107m734P750K5676j2069l3275k0127m602K5511J9144o438j830Q275
13314B3502Q71k0014N459K3789M094J329L656j1104k7315L2624K8563j6420j6486
13301C2548j4669K5923M5056K7141l066k6049j5980j9580k2419m565K1614j1628
13289C4326k3031j0936j1160J1184p0N063J079l493J3705J3568j4944k1471j1694
13276a7874J8558R764J8774J4581L96k7219k438j3681j8916R746J7560r409j8725
$$ plain form
13263 -18883 -18064 -2699 9600 25618 37598 13554 12819 28453 23123 23863 -8680 4523 -2099
13250 -2099 -37792 -27099 -8024 -378 6503 27720 18625 3270 27931 48028 31579 -4213
13238 -4213 7626 24636 7771 1718 -15133 -33314 -15649 -4386 -7779 3869 24600 37953
13226 37953 13111 -4028 -3876 -14243 26503 15846 -23562 -36360 3688 35476 42512 28826
13214 28826 22188 -2315 4756 2949 16559 -4318 10460 33552 30775 15855 7986 -11472 -25017
13201 -25017 -16008 130 14830 -661 9707 15729 -9668 -34593 -65549 -60367 -49238 -47772
13189 -47772 -30207 -19464 3233 -3964 -27366 -14942 9667 -19360 -6603 -16840 -20959 -13208
13177 -13208 21498 13890 -17253 -1393 17875 -5319 -14769 -37400 -28497 2930 -9875 -22570
$$ packed form
13263a8883Q19J5365J2299J6018J1980k4044p35J5634n330P40l2543J3203o622
13250b099l5693J0693J9075P646O881K1217r095j5355K4661K0097j6449l5792
13238d213J1839J7010j6865o053j6851j8181J7665J1263l393J1648K0731J3353
13226C7953k4842j7139J52j0367M0746j0657l9408j2798M0048L1788P036j3686
13214B8826o638k4503P071j807J3610k0877J4778K3092k777j4920p869j9458j3545
13201b5017R009J6138J4700j5491J0368O022k5397k4925l0956N182J1129J466
13189d7772J7565J0743K2697p197k3402J2424K4609k9027J2757j0237m119P751
13177a3208L4706p608l1143J5860J9268k3194r450k2631Q903L1427j2805j2695
$$ plain form
13165 -22570 -45484 -37239 -17523 -33837 -37318 -20884 13292 17579 4181 14865 17144 6500
13153 6500 2745 -1429 -3053 -20062 -21331 -15086 -26937 -20543 -6966 -9089 -4538 -28801 -49401
13140 -49401 -27967 -29230 -16773 -9180 -36763 -46476 -29022 -2060 -9399 -2729 -18850 4349 44017
13127 44017 42005 27020 15625 8397 8448 -16989 -13841 -3179 -27347 -52410 -43559 -39769 -36187
13114 -36187 113 9128 7640 14795 20672 -8684 -33036 -42110 -53391 -22126 8870 19057 19414
13101 19414 22730 655 -14547 -1901 43278 44228 23246 12711 -5936 -35126 -41345 -39045 -45889
13088 -45889 -13229 -17062 -1964 2853 -14547 -39672 -35301 -35134 -1780 11281 20038 20673 24584
13075 24584 29519 30517 23452 14830 17878 42042 14240 -27524 -22404 -13194 -6462 2827 16064 8101
$$ packed form
13165b2570k2914Q245J9716j6314l481J6434L4176M287j3398J0684K279j0644
13153F500l755m174j624j7009j269O245j1851O394J3577k123M551k4263k0600
13140d9401K1434j263J2457P593k7583r713J7454K6962p339O670j6121K3199L9668
13127D4017k012j4985j1395p228N1k5437L148J0662k4168k5063Q851L790L582
13114c6187L6300R015j488P155N877k9356k4352r074j1281L1265L0996J0187L57
13101A9414L316k2075j5202J2646M5179R50k0982j0535j8647k9190o219K300o844
13088d5889L2660l833J5098M817j7400k5125M371J67L3354J3061Q757O35L911
13075B4584M935R98p065q622L048K4164k7802m1764N120R210O732R289J3237p963
$$ plain form
13061 8101 18048 20633 10361 -21340 -10259 15545 -16758 -32401 -41592 -30920 -21815 -4237 -7206
13048 -7206 -968 -20908 -15407 3492 -8486 -44857 -17675 17684 3592 -9228 -14235 -27091
13036 -27091 -24588 -21139 -19804 -15470 -33442 -39227 -26110 -20989 -39747 -49047 -31567 -32019 -29161 -14293
13022 -14293 -296 -13610 -24302 -2250 2704 23441 64950 21380 982 -26151 -37850 -20057
13010 -20057 -17847 -35206 -45509 -45211 -59134 -69170 -48015 -34367 -12081 14690 6034 -13631
12998 -13631 -45403 -38104 -36820 -19076 17992 -5299 6274 1363 3983 -7366 -6679 -17987 -36566
12985 -36566 -46540 -27457 -4953 -13 21248 25971 12348 2322 -5331 -9095 -15180 -34079 -44824
12972 -44824 -56396 -48715 -23277 -5705 -27551 -20791 13763 8818 12376 -2518 -20148 -36278
$$ packed form
13061H101R947K585j0272l1701J1081K5804l2303j5643r191J0672R105J7578k969
13048g206O238j9940N501J8899j1978l6371K7182L5359j4092j2820n007j2856
13036b7091K503L449J335M334j7972n785J3117N121j8758r300J7480m52K858J4868
13022a4293J3997j3314j0692K2052M954K0737M1509m3570k0398k7133j1699J7793
13010b0057K210j7359j0303K98j3923j0036K1155J3648K2286K6771q656j9665
12998a3631l1772P299J284J7744L7068k3291J1573m911K620j1349O87j1308j8579
12985c6566r974J9083K2504M940K1261M723j3623j0026p653l764o085j8899j0745
12972d4824j1572P681K5438J7572k1846O760L4554m945L558j4894j7630j6130
$$ plain form
12960 -36278 -26864 -16796 -7432 -19696 -14230 -11545 2496 37 11016 9189 -17278 -33960 -29898
12947 -29898 -8775 -132 -14363 -31433 -31444 -23540 -9544 -14317 -21428 -41083 -52078 -27511 -13361
12934 -13361 -13987 -20747 -6994 -24820 -46803 -47278 -29845 -27531 -14495 12128 30612 16020 -6150
12921 -6150 -19553 -5294 22914 42528 47911 11831 -37764 -35138 -32447 -28067 -8825 16425 18711
12908 18711 24132 21972 8516 18443 6095 -7414 -20542 -10320 1908 2049 -11733 -12147 -25060
12895 -25060 -4806 3314 -16346 -9021 20079 12609 2154 16418 41822 -2791 9536 22281
12883 22281 13231 7146 -2271 -4438 16732 49196 49225 2630 -13062 7470 27878 -6355 -13252
12870 -13252 296 31612 65452 51533 12112 -12125 -27443 -14341 10098 -2762 -8700 -8568
$$ packed form
12960c6278R414J0068R364j2264N466K685J4041k459J0979j827k6467j6682M062
12947b9898K1123Q643j4231j7070j1P904J3996m773p111j9655j0995K4567J4150
12934a3361o26o760J3753j7826k1983m75J7433K314J3036K6623J8484j4592k2170
12921f150j3403J4259K8208J9614N383l6080m9595K626K691M380J9242K5250K286
12908A8711N421k160j3456R927j2348j3509j3128J0222J2228J41j3782m14j2913
12895b5060K0254Q120j9660P325K9100p470j0455J4264K5404m4613J2327J2745
12883B2281r050o085r417k167K1170L2464K9m6595j5692K0532K0408l4233o897
12870a3252J3548L1316L3840j3919l9421k4237j5318J3102K4439j2860n938J32
$$ plain form
12858 -8568 -7885 -33777 -11827 -8910 -3066 -605 -12539 -1058 917 -1596 -16588 -9151 -18046 -7522
12844 -7522 -2952 6573 23344 803 -22992 -20325 -23750 -41508 -30719 -27960 -45380 -46988 -28701
12831 -28701 -12532 -21403 -37539 -27255 297 24496 28103 8513 10965 34450 42645 22140
12819 22140 25472 26574 32203 48834 57933 64932 89815 105381 89726 69384 28072 29852 37448
12806 37448 859 -22428 -22966 -20773 -7799 -2848 1461 12739 18376 -13237 -36686 -60910 -34920
12793 -34920 -34069 -52232 -41190 -24568 -7775 17814 15325 -6684 13751 14362 11698 27681 21064
12780 21064 14380 -10470 -19582 18210 20762 7189 6799 -4864 -31576 -41868 -43203 -31439 -21345
12767 -21345 -35166 -34465 -22441 -26218 -29562 -28360 -51290 -54668 -30977 -33289 -29680 -5299 3629
$$ packed form
12858h568O83k5892K1950K917N844K461j1934J1481J975k513j4992P437q895J0524
12844g522M570R525J6771k2541k3795K667l425j7758J0789K759j7420j608J8287
12831b8701J6169q871j6136J0284K7552K4199L607j9590K452K3485Q195k0505
12819B2140L332J102N629J6631R099O999K4883J5566j5655k0342m1312J780P596
12806C7448l6589k3287n38K193J2974M951M309J1278N637l1613k3449k4224K5990
12793c4920Q51j8163J1042J6622J6793K5589k489k2009K0435O11k664J5983o617
12780B1064o684k4850r112L7792K552j3573l90j1663k6712j0292j335J1764J0094
12767b1345j3821P01J2024l777l344J202k2930l378K3691k312L609K4381Q928
$$ plain form
12754 3629 10930 10813 -16921 -23221 -12952 -16418 -18470 -13746 -10465 -2943 -1700 -36330 -34720 -40919
12740 -40919 -34789 -32623 -29307 -19817 -22917 -37748 -41698 -23653 -26275 -40330 -12843 -14022 -42263
12727 -42263 -51225 -38221 -45012 -57470 -41016 -27446 -42046 -22733 -6518 -12139 -33179 -27523
12715 -27523 -8236 6255 4976 7980 -6556 -6932 -7339 5745 24376 -17128 -28766 1112 8252
12702 8252 -7146 -8858 -10581 -6127 -9878 -9531 -14171 -24381 -40030 -40690 -41304 -35262 -44296 -63206
12688 -63206 -52177 -53768 -50226 -42412 -46912 -36348 -11629 -6462 18908 41514 44894 30696 55045
12675 55045 75034 65603 19763 5720 11345 4911 -23494 -26747 -25704 -25173 -17096 -9826 875
12662 875 895 1760 -15213 -29018 -24066 -37261 -24896 -30764 -20668 -2514 -10613 -27985 -10844 -19054
$$ packed form
12754C629P301j17k7734o300J0269l466k052M724L281P522J243l4630J610o199
12740d0919O130K166L316R490l100j4831l950J8045k622j4055K7487j179k8241
12727d2263q962J3004o791j2458J6454J3570j4600J9313J6215n621k1040N656
12715b7523J9287J4491j279L004j4536l76m07J3084J8631m1504j1638K9878P140
12702H252j5398j712j723M454l751L47m640j0210j5649o60o14O042r034j8910
12688f3206J1029j591L542P814m500J0564K4719N167K5370K2606L380j4198K4349
12675E5045J9989r431m5840j4043N625o434k8405l253J043N31Q077P270J0701
12662H75K0Q65j6973j3805M952j3195J2365n868J0096J8154q099j7372J7141q210
$$ plain form
12648 -19054 -40722 -63882 -53694 -20590 12893 34489 49417 50879 36535 -8580 -19358 -55038
12636 -55038 -36705 -30338 -27244 -22376 15840 41786 36131 32582 8271 -179 25094 41574 25392
12623 25392 16272 19393 17849 -2374 10093 35750 20693 -9966 6519 21606 14427 11412 13360
12610 13360 -2181 5847 34630 45356 42626 19761 -4887 -15591 -11709 -9224 934 -4336 -6316
12597 -6316 -1547 -20460 -17133 -11080 -1326 -2448 -21381 -3946 23378 9224 12674 -21575 -42219
12584 -42219 -25633 -19588 -9220 -1223 -28157 -4617 13530 30273 54520 31745 28172 6683
12572 6683 -7412 12699 14375 10805 24411 11155 -15226 -6735 -28038 -15564 1945 -20311
12560 -20311 -44913 -39345 -46521 -30743 -37050 -39984 -28787 -9958 -6464 -17151 -6714 6996 7618
$$ packed form
12648a9054k1668k3160J0188L3104L3483K1596J4928J462j4344m5115j0778l5680
12636e5038J8333O367L094M868L8216K5946n655l549k4311q450K5273J6480j6182
12623B5392r120L121j544k0223J2467K5657j5057l0659J6485J5087p179l015J948
12610A3360j5541Q028K8783J0726k730k2865k4648j0704L882K485J0158n270j980
12597f316M769j8913L327O053R754j122j8933J7435K7324j4154L450l4249k0644
12584d2219J6586O045J0368P997k6934K3540J8147J6743K4247k2775l573k1489
12572F683j4095K0111J676l570J3606j3256k6381Q491k1303J2474J7509k2256
12560b0311k4602N568p176J5778o307k934J1197J8829L494j0687J0437J3710O22
$$ plain form
12547 7618 -23616 -33555 -26156 -7197 3953 1907 -11885 -11795 -5645 -26804 -14091 -2070 -14286
12534 -14286 -11579 21642 36170 29500 29334 5121 -18853 -27923 -23417 -15964 -15060 -35348 -27566 -11373
12520 -11373 -16186 -14356 -26157 -31957 -14835 -1383 11539 31595 8039 14440 1721 -1136 10629
12507 10629 15654 18039 10204 6133 -7811 -3362 16792 5182 14941 23854 909 -7764 -13421
12494 -13421 -28540 -27697 -22110 -11454 3437 -1442 -4546 -1152 -13003 5479 12596 22818 23749
12481 23749 -3438 -9357 11540 14597 21476 19182 8226 3138 -10371 -9655 -18800 -27572 -8390
12468 -8390 5918 17938 3802 1339 -12761 -861 20446 3769 2834 -11479 -16611 -20764 -42309
12455 -42309 -23553 -2347 -4134 6335 10390 6415 -18588 -3143 -2482 719 27123 26995 -7868
$$ packed form
12547G618l1234r939P399J8959J1150k046j3792R0O150k1159J2713J2021j2216
12534a4286K707L3221J4528o670j66k4213k3974r070M506P453R04k0288P782J6193
12520a1373m813J830j1801n800J7122J3452J2922K0056k3556O401j2719k857J1765
12507A0629N025K385p835m071j3944M449K0154j1610R759Q913k2945q673n657
12494a3421j5119Q43N587J0656J4891m879l104L394j1851J8482P117J0222R31
12481B3749k7187n919K0897L057O879k294j0956n088j3509P16r145q772J9182
12468h390J4308J2020j4136k463j4100J1900K1307j6677r35j4313n132m153k1545
12455d2309J8756K1206j787J0469M055l975k5003J5445O61L201K6404j28l4863
$$ plain form
12442 -7868 -21796 -4809 -24013 -40519 -25616 -25579 -40968 -35466 -22494 -7291 3464 20647 1680
12429 1680 -12678 -42064 -45657 -48122 -27219 -30640 -19502 1588 39730 38640 47228 30037 32062
12416 32062 10547 -19435 -26279 -24595 19365 47041 28297 15110 -3671 -18363 -19482 -11309
12404 -11309 -9936 8581 25320 20075 8195 4075 25809 39050 13541 -15553 -31853 -34603
12392 -34603 -31415 -26466 8137 -9722 -38144 -47193 -6213 3946 -23817 -60184 -80808 -61503
12380 -61503 -44205 -33949 -14715 -5784 -20142 -13721 -334 -10498 -11466 -9063 -26952 -48909 -47234
12367 -47234 -16120 -10271 -39271 -43783 -33780 -60113 -67021 -55262 -24223 -33574 11541 7432 -2333
12354 -2333 1390 5300 5950 17197 23144 5160 -11221 -12156 -3796 8039 31691 45150 35517 11145
$$ packed form
12442g868j3928J6987j9204j6506J4903L7j5389N502J2972J5203J0755J7183j8967
12429A680j4358k9386l593k465K0903l421J1138K1090L8142j090Q588j7191K025
12416C2062k1515k9982o844J684M3960K7676j8744j3187j8781j4692j119Q173
12404a1309J373J8517J6739n245j1880m120K1734J3241k5509k9094j6300k750
12392c4603L188M949L4603j7859k8422r049M0980J0159k7763l6367k0624J9305
12380f1503J7298J0256J9234Q931j4358O421J3387j0164r68K403j7889k1957J675
12367d7234L1114N849k9000m512J0003k6333o908J1759L1039r351M5115m109r765
12354b333L723L910O50J1247N947j7984j6381r35Q360J1835K3652J3459r633k4372
$$ plain form
12340 11145 -15743 -19442 -22036 -31762 -15115 18533 30972 40728 50213 19005 -11962 -679 7928
12327 7928 43 -18808 -18544 -585 -5984 -29704 -52329 -33669 -19900 -15756 -41217 -41124 -24927
12314 -24927 -23121 -20501 -21878 -14042 -7543 -19972 -31906 -20164 -22611 -39071 -61694 -59979 -54275
12301 -54275 -41363 -53914 -55011 -36891 -30787 -7182 16676 2214 6393 -19258 -22865 -7524
12289 -7524 -17829 -29418 -13272 12497 -9008 -2898 -15913 3344 -7842 -34376 -56479 -50886
12277 -50886 -30772 -8685 35709 65771 65234 26130 -25156 -8058 4068 17414 39324 35938
12265 35938 14028 20429 -995 -11397 14132 24933 35263 38429 18893 12165 -18424 -19084 -16016
12252 -16016 -41263 -50975 -71210 -49840 7255 12450 15249 -3006 -22368 -30937 3300 36073
$$ packed form
12340A1145k6888l699k594r726J6647L3648J2439R756R485l1208l0967J1283Q607
12327G928p885j8851K64J7959n399k3720k2625J8660J3769M144k5461R3J6197
12314b4927J806K620j377P836O499j2429j1934J1742k447j6460k2623J715N704
12301e4275J2912j2551j097J8120O104K3605K3858j4462M179k5651l607J5341
12289g524j0305j1589J6146K5769k1505O110j3015J9257j1186k6534k2103N593
12277e0886K0114K2087M4394L0062n37l9104n1286J7098J2126J3346K1910l386
12265C5938k1910O401k1424j0402K5529J0801J0330L166j9536o728l0589o60L068
12252a6016k5247r712k0235K1370N7095N195K799j8255j9362q569L4237L2773
$$ plain form
12240 36073 60331 36668 27252 18415 36312 41590 32852 16251 39351 32537 5017 -10718 -5049
12227 -5049 33371 22973 27626 13399 20366 2895 -29034 -33455 -26286 -31747 7423 13854 8323
12214 8323 -3530 -28637 -21219 -1972 -4784 -3602 -9465 -12674 6907 5324 -20615 -7183 17134
12201 17134 5369 -29859 -39893 -28815 -18478 -16391 -8825 -6311 -27189 -37067 -44366 -48736 -13112
12188 -13112 -4645 -3485 -300 -11169 -24918 -5639 -2335 -7126 -10065 -29780 -42642 -31594 -49688
12175 -49688 -16056 20350 32707 16748 4322 -3297 -40122 -31805 -14535 -3048 -21237 -19568
12163 -19568 -2117 -19729 -35696 -35353 -42677 -19201 -16307 -28224 -27052 -16069 -29897 -28562 -10859
12150 -10859 5585 31984 -3574 1910 -4991 -16233 -20445 -11507 -17005 -19453 -8690 19807 13857
$$ packed form
12240C6073K4258k3663r416q837J7897N278q738j6601K3100o814k7520j5735N669
12227e049L8420j0398M653j4227O967j7471l1929m421P169n461L9170O431n531
12214H323j1853k5107P418J9247k812J182n863l209J9581j583k5939J3432K4317
12201A7134j1765l5228j0034J1078J0337K087P566K514k0878r878p299m370L5624
12188a3112Q467J160L185j0869j3749J9279L304m791k939j9715j2862J1048j8094
12175d9688L3632L6406J2357j5959j2426p619l6825Q317J7270J1487j8189J669
12163a9568J7451j7612j5967L43p324K3476K894j1917J172J0983j3828J335J7703
12150a0859J6444K6399l5558N484o901j1242m212Q938n498k448J0763K8497n950
$$ plain form
12137 13857 -21638 2808 14925 17083 11087 -1488 -17327 -18709 -18370 -16408 -12905 -6983 -15145
12124 -15145 -15938 -3008 8932 13755 56243 43578 -3904 -11701 3374 1460 12512 14130 -7243
12111 -7243 -15370 -41920 -42244 -33032 -14221 -23362 -11561 1621 10715 -18127 -34144 -50765 -70724
12098 -70724 -69897 -48769 -19532 31140 8434 -3941 -6057 635 1556 -416 1483 7090 25734
12085 25734 32886 -8257 -15870 -7999 10208 11661 -22254 -61249 -53232 -12170 10934 17913 3621
12072 3621 -20540 -40017 -40445 -36876 -39717 -32879 -35330 -23097 -28316 -23768 -8126 -1250 10169 28071
12058 28071 3685 -13917 -27456 -31527 -24642 -5454 3761 11092 32848 31929 3431 -4305 12632
12045 12632 44373 50612 33126 25791 6571 768 8956 11488 3634 18227 28026 37773 32709
$$ packed form
12137A3857l5495K4446J2117K158n996j2575j5839j382L39J962L503N922q162
12124a5145p93J2930J1940M823M2488j2665m7482p797J5075j914J1052J618k1373
12111g243q127k6550l24R212J8811r141J1801J3182R094k8842j6017j6621j9959
12098g0724Q27K1128K9237N0672k2706j2375k116O692R21j972J899N607J8644
12085B5734P152m1143p613P871J8207J453l3915l8995Q017M1062K3104O979j4292
12072C621k4161j9477m28L569k841O838k451J2233n219M548J5642O876J1419J7902
12058B8071k4386j7602j3539m071O885J9188R215P331K1756r19k8498p736J6937
12045A2632L1741O239j7486p335j9220n803Q188K532p854J4593R799R747n064
$$ plain form
12032 32709 24903 35953 48705 34066 21767 13792 2089 -6257 -5524 -13917 -13456 -21591 -28512 -47456
12018 -47456 -31363 -26534 -29151 -20048 7862 6430 -10059 10889 9478 1446 -25863 -29477 -37902
12005 -37902 -46229 -37451 -12981 -9976 -2434 11340 15310 45641 49204 25830 11183 -14818 12334
11992 12334 729 -22526 1823 10607 27526 35679 45075 52310 55052 33735 35688 38765 33683
11979 33683 12663 1910 16295 28843 40224 31600 -7338 3114 39187 14734 -34071 -68089
11967 -68089 -69459 -45471 -22631 -8945 -27498 -51594 -41803 -34751 -9168 -5129 -17991 -29860
11955 -29860 -20589 -9323 14876 21747 15621 25031 17953 -12793 11985 24737 33462 7021 5842
11942 5842 26299 61712 51910 49495 35248 32061 33177 19651 15184 16675 33045 53818 52528
$$ packed form
12032C2709p806J1050J2752j4639j2299p975j1703q346P33q393M61q135o921j8944
12018d7456J6093M829k617R103K7910j432j6489K0948j411q032k7309l614q425
12005c7902q327Q778K4470L005P542J3774L970L0331L563k3374j4647k6001K7152
11992A2334j1605k3255K4349Q784J6919Q153R396P235K742k1317J953L077n082
11979C3683k1020j0753J4385J2548J1381q624l8938J0452L6073k4453m8805l4018
11967f8089j370K3988K2840J3686j8553k4096R791P052K5583M039j2862j1869
11955b9860R271J1266K4199O871o126R410p078l0746K4778J2752Q725k6441j179
11942E842K0457L5413r802k415j4247l187J116j3526m467J491J6370K0773j290
$$ plain form
11929 52528 43799 30059 17312 -9477 -6473 17068 13559 -11874 -36752 -22017 -13099 11792
11917 11792 10100 -26705 -33543 -39824 -24939 -13784 11038 18009 5221 -1692 12395 -9311 21809
11904 21809 25078 12677 5118 -5077 -15630 -19266 -10868 -38042 -27959 -20127 -35867 -78574 -82237
11891 -82237 -26164 -3300 700 28783 32575 23188 28662 7358 -718 -16504 -29732 -8284 9539
11878 9539 -5577 -44272 -54687 -49192 -35174 -40621 -47442 -52364 -53967 -46059 -16171 -21099 -25846
11865 -25846 -25224 -21745 -15689 -25646 -25327 -16418 -27365 -30164 -23286 -167 -11782 -11757 6131 -11578
11851 -11578 -28484 -24926 -16128 -664 -31007 -48679 -57237 -61915 -53657 -52508 -38469 -21295 -1330
11838 -1330 15434 22233 16553 6406 17916 12990 26783 14799 -6723 -11507 1047 -22747 -41613
$$ packed form
11929E2528q729j3740j2747k6789L004K3541l509k5433k4878J4735Q918K4891
11917A1792j692l6805o838o281J4885J1155K4822O971j2788o913J4087k1706L1120
11904B1809L269j2401p559j0195j0553l636Q398k7174J0083P832j5740m2707l663
11891h2237N6073K2864M000K8083L792r387N474k1304q076j5786j3228K1448J7823
11878I539j5116l8695j0415N495J4018n447o821m922j603P908K9888m928m747
11865b5846O22L479O056r957L19Q909j0947k799O878K3119j1615K5J7888j7709
11851a1578j6906L558Q798J5464l0343j7672q558m678Q258J149J4039J7174J9965
11838a330J6764O799n680j0147J1510m926J3793j1984k1522m784J2554k3794j8866
$$ plain form
11825 -41613 -5641 -10981 -18469 -3813 -2364 -8762 -16955 -24769 -67061 -53693 -48753 -31605 -12587
11812 -12587 -14474 6568 14829 16511 -16125 -20575 3041 272 -21106 -26305 -14389 -10622 -7457
11799 -7457 -5126 -21019 -16047 1848 3314 -29593 -44282 -51922 -55560 -36102 -5863 -10169 -1564
11786 -1564 -1405 -1331 -24985 -33583 -26369 -10155 -12024 -4071 256 1777 4821 -3293 -26003 -44695
11772 -44695 -51481 -7825 22141 741 -15954 -29122 -35660 -49402 -71574 -66736 -49358 -34590
11760 -34590 -39067 -50115 -25228 -31141 -2556 -2009 -23309 -55672 -48068 -16988 -1169 -11861 -8992
11747 -8992 -4159 4577 17457 18039 51946 49177 31473 2408 -19581 -3180 7478 -14964 8989
11734 8989 13596 2121 -3379 8055 5358 3655 -21369 -40137 -39196 -9610 6529 34 12680
$$ packed form
11825d1613L5972n340p488J4656J449o398q193p814m2292J3368M940J7148J9018
11812a2587j887K1042Q261J682l2636m450K3616k769k1378n199J1916L767L165
11799g457K331j5893M972J7895J466l2907j4689p640l638J9458L0239m306Q605
11786a564J59P4k3654q598P214J6214j869P953M327J521L044q114k2710j8692
11772d4695o786M3656K9966k1400j6695j3168o538j3742k2172M838J7378J4768
11760c4590m477j1048K4887n913K8585N47k1300l2363P604L1080J5819j0692K869
11747h992M833Q736J2880N82L3907k769j7704k9065k1989J6401J0658k2442K3953
11734H989M607j1475n500J1434k697j703k5024j8768R41K9586J6139o495J2646
$$ plain form
11721 12680 6909 722 8748 35036 53149 32720 26392 19679 11707 -5836 -12772 6683 22700
11708 22700 17709 12077 26431 8567 -8683 -10846 4359 -19740 -7732 15129 7969 -23351
11696 -23351 -18778 -381 14203 19889 30349 475 -12437 4338 7379 32657 32134 15136 10908
11683 10908 12128 15914 14433 -1440 -15833 -22249 7455 27154 25335 24037 -11206 -13370 -33143
11670 -33143 -38993 -14961 -33921 -36750 -41827 -48143 -34872 -33855 -16234 11782 36849 34660 43426
11657 43426 49214 44217 38953 47999 53102 55635 61259 29987 9636 9137 2318 6584 10119 4027
11643 4027 6144 17333 19764 53978 48393 38485 40252 18164 8616 13073 -11578 -13655 30617
11630 30617 57688 42617 46067 12938 -26213 -31114 -13616 -25160 -24591 -29149 -30154 -26127 -29882
$$ packed form
11721A2680n771o187Q026K6288J8113k0429o328o713p972j7543o936J9455J6017
11708B2700m991n632J4354j7864j7250k163J5205k4099J2008K2861p160l1320
11696b3351M573J8397J4584N686J0460k9874j2912J6775L041K5278n23j6998m228
11683A0908J220L786j481j5873j4393o416K9704J9699j819j298l5243k164j9773
11670c3143n850K4032j8960k829n077o316J3271J017J7621K8016K5067k189Q766
11657D3426N788m997n264R046N103K533N624l1272k0351m99o819M266L535o092
11643D027K117J1189K431L4214n585r908J767k2088r548M457k4651k077M4272
11630C0617K7071j5071L450l3129l9151m901J7498j1544N69m558j005M027l755
$$ plain form
11617 -29882 -16544 -53588 -44066 -28366 -8964 -26206 -26150 -7484 -17140 -21598 -10465 -21482 52
11604 52 15621 7914 -6460 -17622 -23488 -14802 7120 989 5770 19870 9484 11980 4180 2431
11590 2431 -12009 -23914 -15327 -16243 -37171 -31663 -9030 4753 8090 1210 11514 -1272 -12462
11577 -12462 -40862 -61252 -46993 -29983 -22235 -19699 -1693 -2790 -11465 -12467 -18463 -34961 -40160
11564 -40160 -30485 -24874 -26616 -7383 -4095 -12049 -19713 -8611 -3726 3166 22493 23808 6423
11551 6423 -1166 735 -8581 -1307 19518 18581 3057 -8178 -28668 -24239 -7977 -9484 8009
11538 8009 10077 2973 15599 17360 8720 -28576 -45091 -16409 7875 3656 -39764 -53271 -60154
11525 -60154 -55089 -49584 -30244 -22362 -41407 -29765 5449 13398 -4124 -5384 -4353 6546 4036
$$ packed form
11617b9882J3338l7044R522J5700J9402j7242N6J8666r656m458J1133j1017K1534
11604E2J5569p707j4374j1162n866Q686K1922o131M781J4100j0386K496p800j749
11590B431j4440j1905Q587r16k0928N508K2633J3783L337o880J0304j2786j1190
11577a2462k8400k0390J4259J7010P748K536J8006j097q675j002n996j6498n199
11564d0160R675N611j742J9233L288p954p664J1102M885O892J9327J315j7385
11551F423p589J901r316P274K0825r37j5524j1235k0490M429J6262j507J7493
11538H009K068p104J2626J761q640l7296j6515K8682K4284m219m3420j3507o883
11525f0154N065N505J9340P882j9045J1642L5214P949j7522j260J031J0899k510
$$ plain form
11512 4036 -17807 -14445 -15425 12945 14639 3743 -7868 -8319 -11544 3138 -2244 -23822 -18440 -3372
11498 -3372 9673 25065 29201 18220 -23798 -18653 -9745 -16348 -16525 -14567 -17611 -19468 1138 15585
11484 15585 28549 41136 24407 6065 -968 22461 22087 -20067 -19875 -27535 -22141 -34019 -27239
11471 -27239 -8687 -7848 -31452 -684 17989 32109 40531 16641 22041 32373 13745 8670 -1229
11458 -1229 -25864 -31520 -32616 -19696 -17687 -2685 -3282 -19287 -44397 -61055 -75434 -59177 -54714
11445 -54714 -41527 -30115 -39089 -41993 -35477 -21655 -37671 -35507 -42766 -47699 -48969 -29235 -26739
11432 -26739 -26111 -15647 7606 20229 24553 46120 43442 33139 22133 49105 61634 61067 40713
11419 40713 44374 38667 6067 10495 29278 22281 15151 -5899 -14252 -10001 -7396 -11979 2206
$$ packed form
11512D036k1843L362r80K8370J694j0896j1611m51l225J4682n382k1578N382J5068
11498c372J3045J5392M136j0981m2018N145Q908o603j77J958l044j857K0606J4447
11484A5585J2964J2587j6729j8342p033K3429l74m2154J92p660N394j1878O780
11471b7239J8552Q39k3604L0768J8673J4120Q422k3890N400J0332j8628n075r899
11458a229k4635n656j096J2920K009J5002n97j6005k5110j6658j4379J6257M463
11445e4714J3187J1412q974k904O516J3822j6016K164p259m933j270J9734K496
11432b6739O28J0464K3253J2623M324K1567k678j0303j1006K6972J2529n67k0354
11419D0713L661n707l2600M428J8783o997p130k1050q353M251K605m583J4185
$$ plain form
11406 2206 2444 1118 6239 4881 -7165 -9490 -8763 -23705 -10654 22152 -535 -11843 -22079
11393 -22079 -35666 -36242 -43050 -34534 -5161 -18191 -17849 -14136 -13440 15640 37669 3678 -15159
11380 -15159 -21224 3994 36150 85261 86975 45309 29905 30657 49266 34719 5892 -6600
11368 -6600 -15295 -31665 -33151 -32334 -36892 -26370 -7084 -33979 -65512 -41491 -13456 6204 7251
11355 7251 16758 18595 -4459 -31757 -41250 -33595 -16338 18823 37923 23188 -26345 -5502 22531
11342 22531 3999 -3244 8511 4856 -25013 -39517 -28348 -17993 -12976 -1511 5422 49 4546
11329 4546 3870 10377 12663 22497 9254 15188 18689 14162 197 -12668 -23098 -41199 -43573 -23895
11315 -23895 5514 14664 7140 16958 21111 42410 34451 13995 -23346 -42386 -34403 -31771 -19719
$$ packed form
11406B206K38j326N121j358j2046k325P27j4942J3051L2806k2687j1308j0236
11393b2079j3587n76o808Q516K9373j3030L42L713O96K9080K2029l3991j8837
11380a5159o065K5218L2156M9111J714m1666j5404P52J8609j4547k8827j2492
11368f600q695j6370j486Q17m558J0522J9286k6895l1533K4021K8035J9660J047
11355G251R507J837k3054k7298r493P655J7257L5161J9100j4735m9533K0843K8033
11342B2531j8532p243J1755l655k9869j4504J1169J0355N017J1465O933n373M497
11329D546o76O507K286R834j3243N934L501m527j3965j2865j0430j8101k374J9678
11315b3895K9409R150p524R818M153K1299p959k0456l7341j9040P983K632J2052
$$ plain form
11302 -19719 11939 5090 8232 24404 15628 1442 24330 15967 -6176 -32176 -21393 16192
11290 16192 2559 -24509 -42860 -40338 -37948 -33621 -53742 -62631 -37525 -25785 -10231 -8138 -15392
11277 -15392 -13393 11810 42259 39360 72168 74926 37251 32510 18754 34799 33446 16738 23470
11264 23470 27941 30183 23702 13372 -4222 5396 15592 25970 47644 39245 15240 7529 9037
11251 9037 -21308 -21875 4637 1312 2301 1026 -14329 -22743 -34482 -34579 -27460 -25999 -6168 14037
11237 14037 41318 35808 33567 39674 12729 -5681 48459 65744 32762 26381 20183 10953 11589
11224 11589 -4761 -33198 -25545 -1153 7714 4535 8537 -6751 -41359 -53352 -60955 -51293 -31592
11211 -31592 -33724 -23068 -6758 -4404 -11177 -11507 -3094 23182 6243 496 11311 -8188 -28892
$$ packed form
11302a9719L1658o849L142J6172q776j4186K2888q363k2143k6000J0783L7585
11290A6192j3633k7068j8351K522K390M327k0121q889K5106J1740J5554K093p254
11277a5392J999K5203L0449k899L2808K758l7675m741j3756J6045j353j6708O732
11264B3470M471K242o481j0330j7594R618J0196J0378K1674q399k4005p711J508
11251I037l0345n67K6512l325R89j275j5355q414j1739r7P119J461J9831K0205
11237A4037K7281n510k241O107k6945j8410N4140J7285l2982o381o198r230O36
11224A1589j6350k8437P653K4392Q867l179M002j5288l4608j1993p603R662J9701
11211c1592k132J0656J6310K354o773l30Q413K6276j6939n747J0815j9499k0704
$$ plain form
11198 -28892 -33744 -2554 -5183 -1738 -23294 -25674 14740 14290 21779 25325 12425 1352 5846
11185 5846 -15231 -9701 -14160 -39706 -13625 391 -3152 -24315 -28742 -6828 -13303 -3586 12293
11172 12293 -6263 -34866 -48167 -50459 -41185 -13363 1833 -1444 -27049 -34686 -24119 -13422
11160 -13422 -1057 16736 13682 42342 30981 1491 12028 44368 59137 52959 55896 71518
11148 71518 108484 116575 105472 99490 132839 146643 198509 255655 307376 328616 336763 364369
11136 364369 409687 394403 300361 223298 141669 56753 41325 19952 6199 4671 23244 35640
11124 35640 3396 844 -9841 8208 58882 110145 108792 90162 81221 93320 112896 89843
11112 89843 54827 32066 17579 2379 -15690 -11365 -13922 3013 12242 21653 38892 51976
$$ packed form
11198b8892m852L1190k629L445k1556k380M0414m50P489L546j2900j1073M494
11185E846k1077N530m459k5546K6081J4016l543k1163m427K1914o475R717J5879
11172A2293j8556k8603j3301k292R274K7822J5196l277k5605p637J0567J0697
11160a3422J2365J7793l054K8660j1361k9490J0537L2340J4769o178K937J5622
11148G1518L6966Q091j1103n982L3349J3804N1866N7146N1721K1240Q147K7606
11136C64369M5318j5284r4042p7063q1629q4916j5428k1373j3753j528J8573J2396
11124C5640l2244k552j0685J8049N0674N1263j353j8630q941J2099J9576k3053
11112H9843l5016k2761j4487j5200j8069M325k557J6935R229R411J7239J3084
$$ plain form
11100 51976 37533 53108 82628 79258 55421 32908 22565 10460 24638 42177 31003 30459
11088 30459 35095 35657 30466 28159 35641 45710 43395 34919 47921 37264 25649 -1599 4795
11075 4795 -3816 -2038 22045 17601 -3315 -8134 -12538 -3629 3374 7146 -1736 11713 13857 15434
11061 15434 11017 9164 22354 -214 3374 3516 -19033 -16667 7388 34940 37274 -3745 -23396
11048 -23396 -21369 -14360 -10552 6420 -1914 8332 7595 -11948 16110 28464 24211 14440 259
11035 259 9012 -4712 -14613 2129 28033 25636 10875 7294 -18740 -40046 -38734 -56553 -40327
11022 -40327 -36183 -26926 -25394 -10939 13778 14025 15029 6182 7066 27110 8967 5868 -10836 -25168
11008 -25168 -13231 -27359 -35759 -22620 -20140 -17881 -22551 -11282 26222 30072 3984 1548 -5363
$$ packed form
11100E1976j4443J5575K9520l370k3837k2513j0343j2105J4178J7539j1174n44
11088C0459M636N62n191k307P482J0069k315q476J3002j0657j1615k7248O394
11075D795q611J778K4083m444k0916m819m404Q909P003L772q882J3449K144J577
11061A5434m417j853J3190k2568L588J42k2549K366K4055K7552K334m1019j9651
11048b3396K027P009L808J6972q334J0246p37j9543K8058J2354m253r771j4181
11035B59Q753j3724r901J6742K5904k397j4761l581k6034k1306J312j7819J6226
11022d0327M144R257J532J4455K4717K47J004q847Q84K0044j8143l099j6704j4332
11008b5168J1937j4128q400J3139K480K259m670J1269L7504L850k6088k436o911
$$ plain form
10995 -5363 -17613 -10692 12994 35934 32802 7255 -25310 -3457 28942 21454 5551 -11780
10983 -11780 6275 -20753 -38856 -41296 -35461 -23896 -6545 7616 -8659 -31085 -40717 -23615
10971 -23615 5593 34594 44202 33090 3936 -8986 -12238 -29242 -48460 -50773 -25444 -30148
10959 -30148 -55606 -47592 -44995 -31440 -17825 -23396 -18419 -668 -8215 -17881 -20501 -2212 15916
10946 15916 -3759 -17902 1032 -17568 -18584 -19438 -47821 -26998 -2843 -15648 -41822 -44814
10934 -44814 -26176 -1344 -16019 -16403 -6463 -36798 -26295 -8510 -5235 695 9757 -10089 -8856
10921 -8856 -19883 -32797 -47171 -59280 -68257 -47802 -28263 -20498 -27723 -33213 -13584 -909 14762
10908 14762 26281 31914 59929 44635 24701 26499 19474 2990 23592 28434 20102 14327 26881
$$ packed form
10995e363j2250O921K3686K2940l132k5547l2565K1853L2399p488j5903j7331
10983a1780J8055k7028j8103k440N835J1565J7351J4161j6275k2426r632J7102
10971b3615K9208K9001R608j1112k9154j2922l252j7004j9218k313K5329m704
10959c0148k5458Q014K597J3555J3615n571M977J7751p547r666k620J8289J8128
10946A5916j9675j4143J8934j8600j016q54k8383K0823K4155j2805k6174k992
10934d4814J8638K4832j4675l84R940l0335J0503J7785L275N930R062j9846J233
10921h856j1027j2914j4374j2109q977K0455J9539P765p225n490J9629J2675J5671
10908A4762J1519N633K8015j5294j9934J798p025j6484K0602M842q332n775J2554
$$ plain form
10895 26881 28783 30886 25898 -11509 -29796 -14842 -12262 -9189 -478 -11650 -20231 -28437 -16712
10882 -16712 -20856 -19195 -12205 4896 -18255 -23542 -11458 -10199 -17221 2974 -6101 -27624 -44089
10869 -44089 -56686 -30561 10440 36323 30500 -26502 -57718 -68370 -57632 -63202 -64270 -65187 -29715
10856 -29715 -11587 -12376 -22184 -42784 -19179 -9689 -10008 -12174 7180 18886 9679 23595 34765
10843 34765 32702 31673 22153 764 1261 14810 38425 36628 10884 -16610 -26329 -10370 -14367
10830 -14367 -7527 -11735 18 -11165 -38112 -37241 -20623 -6698 -18141 -22691 -11529 -28682 -58949
10817 -58949 -46532 -46454 -21824 -21195 -36633 -39741 -41219 -2763 22566 15614 -5457 18921 60354
10804 60354 33534 2113 -10791 -10423 -23829 -17843 -18805 -32173 -15013 11815 54275 65902 40270
$$ packed form
10895B6881J902K103m988l7407j8287J4954K580L073Q711j1172q581q206J1725
10882a6712m144J661O990J7101k3151n287J2084J259p022K0195r075k1523j6465
10869d4089j2597K6125M1001K5883n823n7002l1216j0652J0738n570j068r17L5472
10856b9715J8128p89r808k0600K3605R490l19k166J9354J1706r207J3916J1170
10843C4765k063j029r520k1389M97J3549K3615j797k5744k7494r719J5959l997
10830a4367O840m208J1753j1183k6947Q71J6618J3925j1443m550J1162j7153l0267
10817e8949J2417P8K4630O29j5438l108j478L8456K5329o952k1071K4378M1433
10804F0354k6820l1421j2904L68j3406N986r62j3368J7160K6828M2460J1627k5632
$$ plain form
10791 40270 3827 4283 22239 20157 17670 8441 -29822 -32809 -21614 -11608 5291 12060 18407
10778 18407 15610 613 -9712 -15880 601 -9226 -17064 -36144 -7884 16465 11616 10002 13826
10765 13826 17001 17057 17337 -13954 -24288 -20055 2247 -18548 13267 35689 38679 26799 34648
10752 34648 64177 50803 31017 49270 66401 49386 49857 30586 10734 -14972 -30659 -29701
10740 -29701 -23236 -4877 32979 34030 41132 9437 -28832 -43375 -39771 -21253 -8757 -27582
10728 -27582 -38102 -51847 -32254 -7906 -17626 -7876 7244 -6310 -12545 -21159 -3832 32706
10716 32706 64735 85091 65544 26002 -679 -23310 -49402 -8160 14674 21285 23203 47491
10704 47491 35854 14314 38190 9735 3052 17179 22564 49112 32700 -4302 11106 21673
$$ packed form
10791D0270l6443M56J7956k082k487r229l8263k987J1195J0006J6899O769O347
10778A8407k797j4997j0325o168J6481r827p838j9080K8260K4349m849j614L824
10765A3826L175N6K80l1291j0334M233K2302k0795L1815K2422K990j1880P849
10752C4648K9529j3374j9786J8253J7131j7015M71j9271j9852k5706j5687R58
10740b9701O465J8359L7856J051P102l1695l8269j4543L604J8518J2496j8825
10728b7582j0520j3745J9593K4348r720R750J5120j3554o235q614J7327L6538
10716C2706L2029K0356j9547l9542k6681k2631k6092M1242K2834O611J918K4288
10704D7491j1637k1540K3876k8455o683J4127N385K6548j6412l7002J5408J0567
$$ plain form
10692 21673 16081 31105 45982 45564 212 -19560 -9055 -5839 -14343 -8342 -33 -16316 -16254 3474
10678 3474 -10897 -21411 -25571 -22385 -39418 -45263 -35713 -34980 -65186 -61684 -84387 -61168 -29889
10665 -29889 -915 16011 20100 8719 -1688 -8981 2982 8980 -4068 -13344 -2844 -10988 -30142
10652 -30142 -56759 -45981 -41869 -53092 -59861 -27295 -5556 22511 -12256 -28167 -12315 -11575
10640 -11575 -6847 -3696 17963 22709 27794 36184 26944 23964 35402 29440 39678 54477 66792
10627 66792 56256 21691 17840 34794 57202 25422 24990 3471 -14202 -23076 -25635 -33525 -23669
10614 -23669 -7412 6182 22822 25219 33974 -5276 -38054 -35063 -2318 1502 -29218 -30034 -22250
10601 -22250 -40379 -66847 -68922 -48861 -44066 -11201 -952 1117 -1348 9045 -3978 -14519
$$ packed form
10692B1673n592J5024J4877m18m5352j9772J0505L216q504O001Q309j6283O2J9728
10678C474j4371j0514m160L186j7033n845R550P33l0206L502k2703K3219L1279
10665b9889K8974J6926M089j1381j0407p293J1963N998j3048r276J0500q144j9154
10652c0142k6617J0778M112j1223o769L2566K1739K8067l4767j5911J5852P40
10640a1575M728L151K1659M746N085Q390r240k980J1438n962J0238J4799J2315
10627F6792j0536l4565l851J6954K2408l1780m32k1519j7673q874k559p890R856
10614b3669J6257J3594J6640K397Q755l9250l2778K991L2745L820l0720q16P784
10601b2250j8129k6468k075K0061M795L2865J0249K069k465J0393j3023j0541
$$ plain form
10589 -14519 -8525 -8246 -40316 -25270 24259 63386 53980 27256 23328 25325 -15094 -31929 -40765
10576 -40765 -27021 -13574 -10845 -19253 -8481 -18498 3091 24678 56147 46316 -12993 -36401
10564 -36401 -27645 -22691 -31611 -10484 -25023 -15291 5335 33221 44836 29730 20494 14241 -19256
10551 -19256 -29535 -31323 -22224 -31584 -34097 -31075 -30659 -27343 -1603 -5370 -7264 6663 6686 6164 18950
10536 18950 3151 -8413 25876 41461 28426 19463 15795 37314 28896 10156 20606 11887
10524 11887 -33452 -36505 -10101 -757 -8946 -7376 4046 -2278 -5543 -8090 -39138 -39070 -20648 -12299
10510 -12299 17782 39601 20192 -10672 -8975 12984 191 -31998 -27950 -54394 -46522 -17507
10498 -17507 8602 34501 36197 13382 -4643 -6267 -10598 -9170 20094 3288 -8604 7652
$$ packed form
10589a4519N994K79l2070J5046M9529L9127r406k6724l928J997m0419j6835q836
10576d0765J3744J3447K729q408J0772j0017K1589K1587L1469r831n9309k3408
10564c6401Q756M954q920K1127j4539R732K0626K7886J1615j5106r236o253l3497
10551a9256j0279j788R099r360k513L022M16L316K5740l767j894J3927K3n22J2786
10536A8950j5799j1564L4289J5585j3035q963l668K1519q418j8740J0450q719
10524A1887m5339l053K6404R344q189J570J1422o324l265k547l1048O8J8422Q349
10510a2299L0081K1819j9409l0864J697K1959j2793l2189M048k6444P872K9015
10498a7507K6109K5899J696k2815j8025j624m331J428K9264j6806j1892J6256
$$ plain form
10486 7652 401 -9631 -15544 -3990 -5469 -7353 -11701 -158 -15494 -5898 4795 3676 12107
10473 12107 15369 49667 57781 22600 12453 23626 15243 7570 2017 10364 5550 39624 34279
10460 34279 17809 5831 -17766 -17239 -36066 -24884 -12253 18233 39953 55728 57350 40902
10448 40902 33151 25233 15069 16567 4621 -8654 -12649 -1575 13476 12788 -1596 28073 42403
10435 42403 74066 81195 22026 -41223 -63140 -74070 -52761 -43187 -41670 -53993 -57210 -40958
10423 -40958 -44494 -44003 -30979 -20579 -20744 -29301 -40858 -23249 -13799 -6019 -16615 -17603 -16113 -1872
10409 -1872 3703 -13504 -30446 -6609 37143 41906 27061 1621 -31865 -19869 18681 15764
10397 15764 23992 15156 -1039 10737 47107 52324 47879 27781 -1449 6631 -5475 -21310 2913
$$ packed form
10486G652p251j0032n913J1554j479j884m348J1543j5336R596J0693j119Q431
10473A2107L262L4298Q114l5181j0147J1173q383p673n553Q347m814L4074n345
10460C4279j6470j1978k3597N27j8827J1182J2631L0486K1720J5775J622j6448
10448D0902p751p918j0164J498j1946j3275l995J1074J5051o88j4384K9669J4330
10435D2403L1663P129n9169o3249k1917j0930K1309R574J517j2323l217J6252
10423d0958l536M91J3024J0400j65q557j1557J7609R450P780j0596r88J490J4241
10409a872N575j7207j6942K3837M3752M763j4845k5440l3486J1996L8550k917
10397A5764Q228q836j6195J1776L6370N217m445k0098k9230Q080j2106j5835K4223
$$ plain form
10384 2913 19508 9688 -12080 -25293 -13852 -686 -13658 -11647 -11626 5221 13118 41125 59003
10371 59003 37976 14221 -4297 5286 13659 1838 -4439 -1768 13504 11252 28442 84263 75662
10358 75662 54576 38691 46244 36121 17121 29303 28127 30179 46044 46243 47954 59688 38467
10345 38467 10519 16266 25228 15069 297 -1097 -31858 -35767 -24993 -16402 -15206 -20747 1196
10332 1196 -9000 -37961 -46386 -60938 -73044 -60116 -46255 -39822 -40302 -39052 -31038 -15616 -30810
10319 -30810 -42937 -37519 -58983 -48218 -15475 -5860 -21887 -12169 16285 25567 32700 19234 -25901
10306 -25901 -17009 -14791 -29222 -17206 -5575 7973 9219 5348 -1572 -17025 -4844 5266 3863
10293 3863 34654 56176 45112 39283 18611 -5775 -19784 -25754 -31460 -43473 -38568 -50902 -61906
$$ packed form
10384B913J6595r820k1768j3213J1441J3166j2972K011K1J6847P897K8007J7878
10371E9003k1027k3755j8518R583Q373j1821o277K671J5272k252J7190N5821q601
10358G5662k1086j5885P553j0123j9000J2182j176K052J5865J99J711J1734k1221
10345C8467k7948N747Q962j0159j4772j394l0761l909J0774Q591J196n541K1943
10332A196j0196k8961q425j4552j2106J2928J3861O433m80J250Q014J5422j5194
10319c0810j2127N418k1464J0765L2743R615j6027R718K8454R282P133j3466m5135
10306b5901Q892K218j4431J2016J1631J3548J246l871o920j5453J2181J0110j403
10293C863L0791K1522j1064n829k0672k4386j4009n970n706j2013M905j2334j1004
$$ plain form
10280 -61906 -29756 -33468 -9341 -588 17911 15326 18955 18598 1372 12891 27736 51635 41655
10267 41655 13957 -20066 -46318 -40757 -15996 -16575 12848 5901 13155 38545 42712 33725 46204
10254 46204 29519 26573 16859 27485 46733 47458 8804 13201 7080 15557 15739 -1529 5377 -20128
10240 -20128 -17986 2034 19798 12161 815 789 24813 19030 7405 12171 2573 26998 55936
10227 55936 52712 24414 6918 214 -12618 -17109 -13044 -4365 15937 4918 -10248 -27262 -14719
10214 -14719 -2006 -626 -15612 -12817 -10873 -14584 -4027 6406 29551 68496 56907 -812
10202 -812 -4884 5 -2317 -10595 -13876 -33735 -51798 -43175 -31616 -11088 19609 18719 -5474 -9032
10188 -9032 -273 -16050 -3073 4978 -8693 3964 15610 9163 9582 38705 38908 31808 4261
$$ packed form
10280f1906L2150l712K4127Q753J8499k585L629l57j7226J1519J4845K3899r980
10267D1655k7698l4023k6252N561K4761n79K9423o947P254K5390M167q987J2479
10254D6204j6685k946r714J0626J9248P25l8654M397o121Q477J82j7268O906k5505
10240b0128K142K0020J7764p637j1346k6K4024n783j1625M766r598K4425K8938
10227E5936l224k8298j7496o704j2832m491M065Q679K0302j1019j5166j7014J2543
10214a4719J2713J380j4986K795J944l711J0557J0433K3145L8945j1589n7719
10202h12m072M889k322q278l281j9859j8063Q623J1559K0528L0697q90k4193l558
10188i032Q759j5777J2977Q051j3671J2657J1646o447M19K9123K03p100k7547
$$ plain form
10175 4261 10676 19825 -4385 -55214 -62085 -40851 -35667 -25723 8638 23291 -11076 -12245 26115
10162 26115 45682 27947 -7119 3182 2401 -1725 -4439 15520 5354 2096 15497 35375 59367
10149 59367 52582 30295 -8553 -26492 -11790 2821 32344 59873 61418 44208 35889 49963
10137 49963 70167 37083 -3705 -9809 32321 38868 27748 36915 51248 58638 49102 6535 -28192
10124 -28192 -24978 -11315 -7084 -9777 -8380 8317 43470 49262 75031 80398 57408 72346 56814
10111 56814 42959 51409 56867 39463 25776 15648 16496 40767 47992 43385 57972 77018 78048
10098 78048 74946 73356 99726 98724 94673 101117 121043 145404 181782 208749 226311 230498 291667
10085 291667 391620 451201 563531 715010 942565 1322297 1976703 2974664 4048439 4606957
$$ packed form
10175D261O415R149k4210n0829o871K1234N184R944L4361J4653l4367j169L8360
10162B6115J9567j7735l5066J0301p81m126k714J9959j0166l258J3401J9878K3992
10149E9367o785k2287l8848j7939J4702J4611K9523K7529J545j7210q319J4074
10137D9963K0204l3084m0788o104M2130O547j1120R167J4333P390r536m2567l4727
10124b8192L214J3663M231k693J397J6697L5153N792K5769N367k2990J4938j5532
10111E6814j3855Q450N458j7404j3687j0128Q48K4271P225m607J4587J9046J030
10098G8048l102j590K6370j002m051O444J9926K4361L6378K6967J7562M187O1169
10085B91667R9953N9581J12330J51479K27555L79732O54406R97961J073775N58518
$$ plain form
10075 4606957 4789928 5351845 6570976 7379241 7375712 5772960 3583757 2374469 1736733
10066 1736733 1386878 1152027 986658 847989 747217 678620 613832 552113 520599 522760
10056 522760 518899 476412 458882 443891 417988 416153 419171 386573 352881 321878 305068 315568
10044 315568 292398 280745 275519 246560 199935 196345 185493 155197 170135 187534 190635 201775
10032 201775 181794 139665 115345 106717 116151 129827 158032 177578 170871 161085 152338 139647
10020 139647 123224 92676 80947 81801 99428 119185 134667 133936 102402 89965 96514 115837
10008 115837 119369 115561 122172 104035 88016 72699 63817 78973 96127 95361 65844 34841 34506
9995 34506 29091 32339 50860 37160 33939 60765 93195 82351 63779 67368 51507 35262 10264
$$ packed form
10075D606957J82971N61917J219131Q08265l529j602752k189203j209288o37736
10066A736733l49855k34851j65369j38669j00772o8597o4788o1719l1514K161
10056E22760l861m2487j7530j4991k5903j835L018l2598l3692l1003j6810J0500
10044C15568k3170j1653n226k8959m6625l590j0852l0296J4938J7399L101J1140
10032B01775j9981m2129k4320q628R434J3676K8205J9546o707r786q747j2691
10020A39647j6423l0548j1729Q54J7627J9757J5482p31l1534j2437O549J9323
10008A15837L532l808O611j8137j6019j5317q882J5156J7154p66k9517l1003l35
9995C4506n415L248J8521j3700l221K6826L2430j0844j8572L589j5861j6245k4998
$$ plain form
9982 10264 1934 28136 59135 56966 49513 37059 28979 24634 18738 25982 37454 25624 -838
9969 -838 -2686 1109 32056 70498 65839 45301 52313 74619 72604 34542 1368 1091 -13677 -14585
9955 -14585 -4718 -25798 -20629 28079 54070 48558 14529 20821 40804 43508 51682 56410 33075
9942 33075 26620 5120 7547 -7276 4893 25941 42946 29968 36392 13630 -47510 -7427
9930 -7427 33741 51346 78366 73798 67768 65376 22383 -7846 2252 180 9087 14767 6179
9917 6179 13444 9483 -3417 -14385 -17180 -26555 -33822 -34111 -38714 -16029 -9376 -13084 -19428 -19487 -16044
9902 -16044 -9283 -11316 -1787 6671 -382 -9110 -8458 -17591 -43572 -37814 -67468 -85514 -78849 -59324
9888 -59324 -17261 -9609 -6949 12430 13334 -5022 -11118 -14193 -6522 20333 -6267 -6503 16997 17315
$$ packed form
9982A0264q330K6202L0999k169p453j2454q080m345n896P244J1472j1830k6462
9969h38j848L795L0947L8442m659k0538P012K2306k015l8062l3174k77j4768r08
9955a4585R867k1080N169M8708K5991n512l4029O292J9983K704Q174M728k3335
9942C3075o455k1500K427j4823J2169K1048J7005j2978O424k2762o1140M0083
9930g427M1168J7605K7020m568o030k392m2993l0229J0098k072Q907N680q588
9917F179P265l961j2900j0968k795r375p267k89m603K2685O653l708o344n9L443
9902a6044O761k033R529Q458p053q728O52r133k5981N758k9654j8046O665J9525
9888e9324M2063P652K660J9379R04j8356o096l075P671K6855k6600k36K3500L18
$$ plain form
9874 17315 17495 53258 59084 37928 51999 54816 21515 -2850 5250 -294 6750 29849 9780
9861 9780 18256 39189 48421 43823 2896 -20634 -40695 -27661 -13644 1392 27000 28844 46415
9848 46415 31584 27887 38905 15290 11536 32022 14335 6747 4054 -24248 -48716 -32535 25967
9835 25967 27581 17015 29855 25651 16330 -10590 2679 6392 34705 5875 -4474 14985 5781
9822 5781 -1026 4058 48921 80951 85073 81872 49799 27865 54335 47258 -5986 -10625 4699
9809 4699 34987 31506 14476 7649 27046 19090 2431 13170 9964 3942 -6880 -26782 -16845
9796 -16845 7942 14688 14847 5678 -5278 -19549 -39979 -19574 -20832 -39114 -17897 17874 -7486
9783 -7486 -348 9341 36144 65100 50483 27998 22088 3739 4941 -11299 -9255 10584 -12181
$$ packed form
9874A7315J80L5763N826k1156J4071K817l3301k4365Q100n544P044K3099k0069
9861I780Q476K0933R232m598m0927k3530k0061J3034J4017J5036K5608J844J7571
9848D6415j4831l697J1018k3615l754K0486j7687p588k693k8302k4468J6181N8502
9835B5967J614j0566J2840m204r321k6920J3269L713K8313k8830j0349J9459r204
9822E781o807N084M4863L2030M122l201l2073k1934K6470p077n3244m639J5324
9809D699L0288l481j7030o827J9397p956j6659J0739l206o022j0822j9902R937
9796a6845K4787O746J59r169j0956j4271k0430K0405j258j8282K1217L5771k5360
9783g486P138R689K6803K8956j4617k2485n910j8349J202j6240K044J9839k2765
$$ plain form
9770 -12181 2843 -1795 -17618 -10999 -32844 9354 28112 31760 13064 -22623 -33564 -28183 -19656
9757 -19656 41686 49787 39947 37481 29285 26794 48124 37598 -5443 -7171 16111 989 -12275
9744 -12275 -31385 -29877 -7694 -14279 -15669 -11749 -27345 -53196 -49662 -23609 4109 707 -5427
9731 -5427 -17354 -21499 -44110 -57567 -36923 29696 71218 64191 57811 34329 6607 -1274 -5749
9718 -5749 5987 10120 19904 12685 -2304 -822 -9837 -12603 17142 38837 19767 -2732 5459
9705 5459 17251 3668 -10325 -9841 -20501 -19210 -10951 1220 -8678 -7622 -2421 -27899 -23120 -15472
9691 -15472 -18383 -34253 -14581 -9019 2024 33122 24683 13717 15887 -4340 -3578 -5772 -23096
9678 -23096 -25674 -12568 -19466 -17761 -6544 27432 764 -22963 -19160 -31328 -22522 -32463 -23879
$$ packed form
9770a2181J5024m638j5823O619k1845M2198J8758L648j8696l5687j0941N381Q527
9757a9656O1342Q101r840k466q196k491K1330j0526m3041j728K3282j5122j3264
9744a2275j9110J508K2183o585j390L920j5596k5851L534K6053K7718l402o134
9731e427j1927m145k2611j3457K0644O6619M1522p027o380k3482k7722p881m475
9718e749J1736M133R784p219j4989J482r015k766K9745K1695j9070k2499Q191
9705E459J1792j3583j3993M84j0660J291Q259J2171r898J056N201k5478M779P648
9691a5472k911j5870J9672N562J1043L1098q439j0966K170k0227P62k194j7324
9678b3096k578J3106o898J705J1217L3976k6668k3727L803j2168Q806r941Q584
$$ plain form
9665 -23879 16259 29349 -7359 -42327 -42860 -27711 -6774 -7616 -12029 -10923 3651 14512 6832
9652 6832 18872 25059 543 11190 34186 37358 34865 22923 -787 -5551 8915 19929 22630
9639 22630 3924 -29382 -37815 -24371 -8520 3140 -15558 -26421 -15445 5546 11177 17603
9627 17603 -8084 -29024 -15725 -3356 -115 23045 39552 20736 -9347 -11269 -8005 7378
9615 7378 14396 16152 1308 5551 20125 33448 26934 30905 11786 -9700 11442 20706 11081
9602 11081 19018 17575 -8034 -17105 -40848 -25394 1168 13556 3357 -6098 486 -7845 3866
9589 3866 16105 17225 25945 24976 7401 2355 23522 11665 6306 14383 23224 29656 24975 3132
9575 3132 -17498 -19122 672 -6934 -33820 -24145 -29966 -31433 -17948 -7866 31606 32184 6220
$$ packed form
9665b3879M0138J3090l6708l4968n33J5149K0937q42m413J106J4574J0861p680
9652F832J2040O187k4516J0647K2996L172k493j1942k3710m764J4466J1014K701
9639B2630j8706l3306q433J3444J5851J1660j8698j0863J0976K0991N631O426
9627A7603k5687k0940J3299J2369L241K3160J6507j8816l0083j922L264J5383
9615G378P018J756j4844M243J4574J3323o514L971j9119k1486K1142R264r625
9602A1081P937j443k5609r071k3743J5454K6562J2388j0199r455O584q331J1711
9589C866J2239J120Q720r69j7575n046K1167j1857n359Q077Q841O432m681k1843
9575C132k0630j624J9794p606k6886R675n821j467J3485J0082L9472N78k5964
$$ plain form
9562 6220 -24603 -41330 -27663 2358 22603 21741 49683 74206 71064 40319 19007 25004 38460
9549 38460 23630 28066 9183 -23518 -3276 17796 7027 26775 32066 12893 155 -15042
9537 -15042 -14279 -1840 10786 10035 10788 4489 -18411 -13389 -4494 3468 36431 43524 -533 -31991
9523 -31991 -42950 -21215 13084 25186 14993 8333 4087 8245 29026 21616 27841 6608 -3363
9510 -3363 -8595 -1382 -13722 -12841 -11338 28493 33076 27595 30068 23276 8450 11122 12852 7917
9496 7917 108 14014 -4823 -28144 -16283 16686 42678 10828 -7892 -10205 -23930 -12905
9484 -12905 13244 -25184 -16878 19943 44208 63736 27299 -1628 -11479 21687 27105 19941 3442
9471 3442 -20896 -36558 -34947 -43921 -47539 -34744 -28709 -34144 -24210 -20737 -27015 -31254 -22758 -26337
$$ packed form
9562F220l0823j6727J3667L0021K0245q62K7942K4523l142l0745k1312N997J3456
9549C8460j4830M436j8883l2701K0242K1072j0769J9748N291j9173j2738j5197
9537a5042P63J2439J2626p51P53o299k2900N022Q895P962L2963P093m4057l1458
9523c1991j0959K1735L4299J2102j0193o660m246M158K0781p410O225k1233r971
9510c363n232P213j2340Q81J503L9831M583n481K473o792j4826K672J730m935
9496G917p809J3906j8837k3321J1861L2969K5992l1850j8720k313j3725J1025
9484a2905K6149l8428Q306L6821K4265J9528l6437k8927r851L3166N418p164j6499
9471C442k4338j5662J611q974l618J2795O035n435R934L473o278m239Q496l579
$$ plain form
9457 -26337 -34704 -40184 -21811 -10438 -23261 -36568 -47223 -22774 -18332 -11264 4878 519 10240
9444 10240 -13372 -25240 -19605 -12664 768 -18074 -24009 -23614 18219 13352 -34604 -62105 -65426
9431 -65426 -25122 22998 54420 55087 43490 48785 42541 29010 21624 39786 32152 14140 8453
9418 8453 -5961 7468 11836 -5028 -4465 -26494 -887 27203 29737 17970 10112 -8966 1393
9405 1393 5008 -1705 -21951 -13427 -21573 -17176 -112 28626 15461 2487 3613 -308 -1788 28378
9391 28378 39855 27748 34062 14402 5494 12243 18763 14138 25810 17855 26465 29181 13304
9378 13304 9123 10615 18857 13648 15074 28473 13962 -4232 -4110 -8559 -33064 -47759 -42344 -57083
9364 -57083 -36199 -20870 3936 5792 24333 20931 11950 19090 22513 23329 23586 37806 26361 -9088
$$ packed form
9457b6337q367n480J8373J1373j2823j3307j0655K4449M442P068J6142m359R721
9444A0240k3612j1868N635O941J3432j8842n935L95M1833m867m7956k7501l321
9431f5426M0304M8120L1422O67j1597N295o244j3531p386J8162p634j8012n687
9418H453j4414J3429M368j6864N63k2029K5607K8090K534j1767p858j9078J0359
9405A393L615o713k0246Q524q146M397J7064K8738j3165j2974J126l921j480L0166
9391B8378J1477j2107O314j9660q908O749O520m625J1672p955Q610K716j5877
9378A3304m181J492Q242n209J426J3399j4511j8194J22m449k4505j4695N415j4739
9364e7083K0884J5329K4806J856J8541l402q981P140L423Q16K57J4220j1445l5449
$$ plain form
9350 -9088 3041 -7081 -11818 -5266 1097 -4770 -2855 -18929 -21343 6038 17948 41968 61140
9337 61140 32203 11408 13926 10268 -7435 -17597 -317 14020 35554 45021 17125 -14688
9325 -14688 4378 21771 18902 10564 -150 -3401 -2137 -26485 7292 16514 11909 27348 20249
9312 20249 14459 11112 1618 1772 5622 -207 -16851 -32586 -8388 25188 45037 50468 39303
9299 39303 62297 74357 69119 29190 15302 -5279 4075 9277 12572 17477 24040 -19499 -10662
9286 -10662 5287 14845 31948 50728 71490 62885 30541 17912 8672 35319 41601 42838 58431
9273 58431 51088 26644 11502 -3203 -8477 -22391 1023 17409 -7373 -8804 16609 4632
9261 4632 10877 8013 12042 7871 16894 48980 50249 46605 39103 42306 41611 22578 9454 19276
$$ packed form
9350i088J2129j0122m737O552O363n867J915j6074k414K7381J1910K4020J9172
9337F1140k8937k0795K518l658j7703j0162J7280J4337K1534R467k7896l1813
9325a4688J9066J7393k869q338j0714l251J264k4348L3777R222m605J5439p099
9312B0249n790l347r494J54L850n829j6644j5735K4198L3576J9849N431j1165
9299C9303K2994J2060n238l9929j3888k0581R354N202L295M905O563m3539Q837
9286a0662J5949R558J7103J8780K0762q605l2344j2629r240K6647O282J237J5593
9273E8431p343k4444j5142j4705n274j3914K3414J6386k4782j431K5413j1977
9261D632O245k864M029m171R023L2086J269l644p502L203o95j9033j3124R822
$$ plain form
9247 19276 42272 13426 24419 25332 18920 3960 10783 28106 25924 27741 25586 3358 -11837
9234 -11837 -25080 -42713 -31841 6733 4247 24045 61364 88595 56158 10743 -13265 -4444
9222 -4444 23485 9697 1232 3751 2410 35987 52156 58364 62785 46920 52897 40463 31179
9209 31179 58511 50865 5796 -7808 1526 -2074 14936 25798 33244 48940 82160 108291 70233
9196 70233 80800 78677 45669 31397 56677 67755 72612 64063 50422 40385 11391 -9219
9184 -9219 8179 5001 37540 46794 64523 51002 24384 33531 47383 47411 29715 33074 33528 34521
9170 34521 60113 83415 80220 47953 44108 27484 16739 24513 39367 29986 41027 28293 24504
9157 24504 29483 45450 60720 91055 91519 65225 56457 59918 47984 16455 -4609 -5425 27048
$$ packed form
9247A9276K2996k8846J0993R13o412j4960O823J7323k182J817k155k2228j5195
9234a1837j3243j7633J0872L8574k486J9798L7319K7231l2437m5415k4008Q821
9222d444K7929j3788q465K519j341L3577J6169O208M421j5865N977j2434r284
9209C1179K7332p646m5069j3604R334l600J7010J0862P446J5696L3220K6131l8058
9196G0233J0567k123l3008j4272K5280J1078M857q549j3641j0037k8994k0610
9184i219J7398l178L2539R254J7729j3521k6618R147J3852K8j7696L359M54R93
9170C4521K5592K3302l195l2267l845j6624j0745P774J4854r381J1041j2734l789
9157B4504M979J5967J5270L0335M64k6294q768L461j1934l1529k1064q16L2473
$$ plain form
9144 27048 37759 47260 42449 14581 7628 37409 60687 43247 9878 11222 17174 24181 9026
9131 9026 1658 19984 27382 43839 35463 55383 50573 52479 76590 99732 97403 75157 53336
9118 53336 66142 64316 78850 73345 77209 78529 99200 115747 146704 169591 153007 181665 214837
9105 214837 211864 173953 163115 196226 249985 244978 218081 201340 203341 228487 250498 263424
9093 263424 274988 303528 308189 325185 359465 388754 444310 518354 576429 652877 745248 841082
9081 841082 952615 1139659 1362980 1636159 2032825 2581435 3357507 4488366 6027922
9072 6027922 7800138 9328359 10440780 11499481 12826420 14046274 14289213 12992833
9064 12992833 10353966 7722179 5819753 4570588 3714048 3129281 2691124 2366997 2136434
$$ packed form
9144B7048J0711R501m811k7868o953K9781K3278j7440l3369J344N952P007j5155
9131I026p368J8326P398J6457q376J9920m810J906K4111K3142k329k2246k1821
9118E3336J2806j826J4534n505L864J320K0671J6547L0957K2887j6584K8658L3172
9105B14837k973l7911j0838L3111N3759n007k6897j6741K001K5146K2011J2926
9093B63424J1564K8540M661J6996L4280K9289N5556P4044N8075P6448R2371R5834
9081H41082J11533J87044K23321K73179L96666N48610P76072J130859J539556
9072F027922J772216J528221J112421J058701J326939J219854K42939j296380
9064A2992833k638867k631787j902426j249165q56540n84767m38157l24127k30563
$$ plain form
9055 2136434 1912190 1734396 1571218 1461150 1345586 1261946 1177242 1105978 1078209 1055552
9045 1055552 1015852 949217 912352 880629 818378 758421 736194 712213 704824 664358 627181 568947
9033 568947 550760 562106 561754 578141 588885 591445 550747 527193 510789 482940 464526 461119
9021 461119 442187 434096 401893 374448 354061 348409 362438 359970 354038 361817 370439 346437 324896
9008 324896 305895 287628 258953 265927 259988 236665 230306 199772 185379 179143 167477 211468
8996 211468 228634 216908 206173 215122 221607 210495 181172 171809 149776 140761 143995 132433 134511
8983 134511 128855 158614 154147 127958 102006 104044 81552 84813 96354 100098 86569 76354 84516
8970 84516 103173 145787 174367 131377 105100 111482 113686 108031 64432 70301 102027 116045 113099
$$ packed form
9055B136434k24244j77794j63178j10068j15564q3640q4704p1264k7769k2657
9045A055552l9700o6635l6865l1723o2251n9957k2227k3981p389m0466l7177n8234
9033E68947j8187J1346l52J6387J0744K560m0698k3554j6404k7849j8414l407
9021D61119j8932q091l2203k7445k0387n652J4029k468n932P779Q622k4002k1541
9008C24896j9001j8267k8675O974n939k3323o359l0534j4393o236j1666M3991
8996B11468J7166j1726j0735Q949O485j1112k9323r363k2033r015L234j1562K078
8983A34511n656K9759m467k6189k5952K038k2492L261J1541L744j3529j0215Q162
8970H4516J8657M2614K8580m2990k6277O382K204n655m3599N869L1726J4018k946
$$ plain form
8957 113099 95889 92712 91400 51862 48522 68893 71739 65049 62186 43587 47637 47972 40732 30839
8943 30839 42750 71626 74661 53572 54925 51299 31135 58539 45409 49877 47965 49033 68824
8930 68824 67422 53660 30870 17835 45403 66241 38436 38308 35867 17153 6114 33485 26136
8917 26136 27747 43712 22440 17612 27331 39485 43972 48257 36725 5718 12383 21328 23471
8904 23471 37734 25895 5910 -31554 -44640 -33594 -12495 -2194 30386 45287 48177 42592
8892 42592 20813 1888 27532 43196 50442 53433 67808 71520 84071 67974 46455 26681
8880 26681 -2232 -28974 -29254 -23900 -25404 -22687 -20140 -21085 -4625 -2866 5051 34069 46472 69990
8866 69990 68179 35712 -13608 -35169 -17658 19772 67387 50991 16011 -4337 19012 7708
$$ packed form
8957A13099j7210l177j312l9538l340K0371K846o690k863j8599M050L35p240r893
8943C0839J1911K8876L035k1089J353l626k0164K7404j3130M468j912J068J9791
8930F8824j402j3762k2790j3035K7568K0838k7805j28k441j8714j1039K7371p349
8917B6136J611J5965k1272m828R719J2154M487M285j1532l1007O665Q945K143
8904B3471J4263j1839j9985l7464j3086J1046K1099J0301L2580J4901K890n585
8892D2592k1779j8925K5644J5664P246K991J4375L712J2551j6097k1519j9774
8880B6681k8913k6742k80N354j504K717K547r45J6460J759P917K9018J2403K3518
8866F9990j811l2467m9320k1561J7511L7430M7615j6396l4980k0348K3349j1304
$$ plain form
8854 7708 2499 15751 38068 48174 28657 39092 50347 62577 46280 54673 53546 28908 27591
8841 27591 28228 9295 2482 23736 49342 33212 15793 -72 2119 30441 34609 29905 24861
8828 24861 24512 10558 -929 -5971 -4723 -7442 -6202 171 6297 10561 13919 18938 -6835 -5717
8814 -5717 7069 21175 4378 -3204 13107 -4668 -955 3384 -16613 -16298 3450 28884 13065
8801 13065 21333 26438 16344 2671 12432 23260 3913 -15903 -18657 3855 2887 20867 19260
8788 19260 -20783 -19247 -11412 -4007 1779 105 11524 16529 22591 42677 29860 24796 7429
8775 7429 22872 19411 -16417 -10551 3836 16064 28229 41814 35736 13382 -12682 -8287 83
8762 83 -3431 3658 24181 5302 -7769 8391 23483 30167 50107 77374 80250 61571 87756
$$ packed form
8854G708n209J3252K2317J0106j9517J0435J1255J2230j6297Q393j127k4638j317
8841B7591O37j8933o813K1254K5606j6130j7419j5865K191K8322M168m704n044
8828B4861l49j3954j1487n042J248k719J240O373O126M264L358N019k5773J118
8814e717J2786J4106j6797p582J6311j7775L713M339j9997L15J9748K5434j5819
8801A3065Q268N105j0094j3673R761J0828j9347j9816k754K2512r68J7980j607
8788A9260m0043J536P835P405N786j674J1419N005O062K0086j2817n064j7367
8775G429J5443l461l5828N866J4387J2228J2165J3585o078k2354k6064M395Q370
8762H3l514P089K0523j8879j3071J6160J5092O684J9940K7267K876j8679K6185
$$ plain form
8749 87756 108803 88577 37946 42836 44857 38009 20809 1231 6960 11684 6959 5765 -8589
8736 -8589 -24153 -10430 -19763 -8000 -9152 3732 37575 27156 21796 33760 27164 9322 3322
8723 3322 203 1752 41864 48737 11842 -1458 2637 12065 56285 87252 47727 62221 95547
8710 95547 118267 142658 137034 158005 173876 193023 181856 170967 154348 125634 89887 61224
8698 61224 40669 36892 39451 25829 28326 15752 14617 13346 13061 29638 40071 50058 61984
8685 61984 52187 43476 24457 6789 12394 32608 61395 75209 50735 46937 19431 18188 45353
8672 45353 75813 96436 99798 87359 73518 73854 80123 72935 81032 119650 119118 124080 147978 138241
8658 138241 150056 151454 137852 148037 132670 125482 108954 81854 77031 68170 81241 98838
$$ packed form
8749H7756K1047k0226n0631M890K021o848j7200j9578N729M724m725j194j4354
8736h589j5564J3723r333J1763j152J2884L3843j0419n360J1964o596j7842o000
8723C322l119J549M0112O873l6895j3300M095R428M4220L0967l9525J4494L3326
8710I5547K2720K4391n624K0971J5871J9147j1167j0889j6619k8714l5747k8663
8698F1224k0555l777K559j3622K497j2574j135j271k85J6577J0433R987J1926
8685F1984r797q711j9019j7668N605K0214K8787J3814k4474l798k7506j243K7165
8672D5353L0460K0623L362j2439j3841L36O269p188Q097L8618n32M962K3898r737
8658A38241J1815J398j3602J0185j5367p188j6528k7100m823q861J3071J7597
$$ [...]
##END NTUPLES=NMR SPECTRUM
##END=
