##TITLE=Analysis number 322496
Compound Code cc 58514
Book Reference 196/193
Project Code adrs
Chemist Name jimp
##JCAMPDX= 6.0         $$ Bruker NMR JCAMP-DX V2.0
##DATA TYPE= NMR SPECTRUM
##DATA CLASS= NTUPLES
##ORIGIN= Bruker BioSpin GmbH
##OWNER= nmr
$$ XWIN-NMR		Version 3.5
$$ Thu Sep 28 11:48:46 2006 GMT Daylight Time (UT+1h)  MAYBRIDGE\nmr@NMR_250MHZ
##.OBSERVE FREQUENCY= 250.131544655141
##.OBSERVE NUCLEUS= ^1H
##.ACQUISITION MODE= SIMULTANEOUS (DQD)
##.ACQUISITION SCHEME= undefined
##.AVERAGES= 16
##.DIGITISER RES= 18
##SPECTROMETER/DATA SYSTEM= dpx250
##.PULSE SEQUENCE= zg30
##.SOLVENT NAME= CDCl3
##.SHIFT REFERENCE= (INTERNAL, CDCl3, 0, 16.522)
##AUDIT TRAIL= $$ (NUMBER, WHEN, WHO, WHERE, WHAT)
$$ ##TITLE= Audit trail, XWIN-NMR		Version 3.5
$$ ##JCAMPDX= 5.01
$$ ##ORIGIN= Bruker BioSpin GmbH
$$ ##OWNER= nmr
$$ C:\u/data/dgb/nmr/ADRS/1590/pdata/1/auditp.txt
$$ ##AUDIT TRAIL=  $$ (NUMBER, WHEN, WHO, WHERE, WHAT)
(   1,<2006-09-28 11:48:22.34 +100>,<MAYBRIDGE\nmr>,<NMR_250MHZ>,
      <created by zg, POWCHK disabled, PULCHK disabled
       configuration hash MD5:
       E2 DF 36 D8 04 B2 41 60 5A D7 A3 38 5A 4B D0 FE
       data hash MD5: 64K
       DA CD 2F 07 4E D0 1B 40 BF 47 D2 10 0C 41 20 E9>)
(   2,<2006-09-28 11:48:36.16 +100>,<MAYBRIDGE\nmr>,<NMR_250MHZ>,
      <Start of raw data processing
       ef LB = 0.3 FT_mod = 6 PKNL = 1 SI = 32K 
       data hash MD5: 32K
       75 69 E4 43 E7 51 D1 B2 4E 62 E2 65 02 46 5C 8A>)
(   3,<2006-09-28 11:48:37.78 +100>,<MAYBRIDGE\nmr>,<NMR_250MHZ>,
      <apk 
       data hash MD5: 32K
       CC 03 D4 3B 88 FC 4C 4C 15 04 07 3F 4F BE A6 3B>)
(   4,<2006-09-28 11:48:38.53 +100>,<MAYBRIDGE\nmr>,<NMR_250MHZ>,
      <abs ABSG = 5 
       data hash MD5: 32K
       3C 2C 71 A1 F7 56 92 4C 99 82 6E 03 E4 4C FD 9B>)
$$ ##END=
$$ 
$$ hash MD5
$$ C4 3D 37 E9 79 6D 41 92 0C 03 76 F0 75 D4 BB DE
##$RELAX= 
##$RELAX= 
##$RELAX= 
##$RELAX= 
##$RELAX= 
##$RELAX= 
##$RELAX= 
$$ Bruker specific parameters
$$ --------------------------
##$DU= <C:\u>
##$EXPNO= 1590
##$NAME= <ADRS>
##$PROCNO= 1
##$TYPE= <nmr>
##$USER= <dgb>
##$AMP= (0..31)
100 100 100 100 100 100 100 100 100 100 100 100 100 100 100 100 100 100 
100 100 100 100 100 100 100 100 100 100 100 100 100 100 
##$AQSEQ= 0
##$AQ_mod= 3
##$AUNM= <au_zg>
##$AUTOPOS= <38 >
##$BF1= 250.13
##$BF2= 250.13
##$BF3= 250.13
##$BF4= 250.13
##$BF5= 500.13
##$BF6= 500.13
##$BF7= 500.13
##$BF8= 500.13
##$BYTORDA= 1
##$CFDGTYP= 0
##$CFRGTYP= 5
##$CHEMSTR= <none>
##$CNST= (0..31)
1 1 145 1 1 1 1 1 1 1 1 1 1 1 1 1 1 1 1 1 1 1 1 1 1 1 1 1 1 1 1 1 
##$CPDPRG= <>
##$CPDPRG1= <>
##$CPDPRG2= <>
##$CPDPRG3= <>
##$CPDPRG4= <mlev>
##$CPDPRG5= <mlev>
##$CPDPRG6= <mlev>
##$CPDPRG7= <mlev>
##$CPDPRG8= <mlev>
##$CPDPRGB= <>
##$CPDPRGT= <>
##$D= (0..31)
0 1 0 0 0 0 0 0 0 0.06 0 0 0 0 0 0 0.0002 0 0 0 0 0 0 0 0 0 0 0 0 0 0 
0 
##$DATE= 1159440501
##$DBL= (0..7)
120 120 120 120 120 120 120 120 
##$DBP= (0..7)
150 150 150 150 150 150 150 150 
##$DBP07= 0
##$DBPNAM0= <>
##$DBPNAM1= <>
$$ [...]
##$SUBNAM7= <"">
##$SUBNAM8= <"">
##$SUBNAM9= <"">
##$SW= 20.6930455092707
##$SWIBOX= (0..15)
0 0 3 0 0 0 0 0 0 0 0 0 0 0 0 0 
##$SW_h= 5175.983436853
##$TD= 65536
##$TD0= 1
##$TE= 295.16
##$TE2= 300
##$TE3= 300
##$TEG= 300
##$TL= (0..7)
0 120 120 120 120 120 120 120 
##$TP= (0..7)
150 150 150 150 150 150 150 150 
##$TP07= 0
##$TPNAME0= <>
##$TPNAME1= <>
##$TPNAME2= <>
##$TPNAME3= <>
##$TPNAME4= <>
##$TPNAME5= <>
##$TPNAME6= <>
##$TPNAME7= <>
##$TPOAL= (0..7)
0.5 0.5 0.5 0.5 0.5 0.5 0.5 0.5 
##$TPOFFS= (0..7)
0 0 0 0 0 0 0 0 
##$TUNHIN= 0
##$TUNHOUT= 0
##$TUNXOUT= 0
##$USERA1= <user>
##$USERA2= <user>
##$USERA3= <user>
##$USERA4= <user>
##$USERA5= <user>
##$V9= 5
##$VALIST= <valist>
##$VCLIST= <CCCCCCCCCCCCCCC>
##$VD= 0
##$VDLIST= <DDDDDDDDDDDDDDD>
##$VPLIST= <PPPPPPPPPPPPPPP>
##$VTLIST= <TTTTTTTTTTTTTTT>
##$WBST= 1024
##$WBSW= 4
##$XGAIN= (0..3)
0 0 0 0 
##$XL= 0
##$YL= 0
##$YMAX_a= 253569
##$YMIN_a= -490730
##$ZGOPTNS= <>
##$ZL1= 120
##$ZL2= 120
##$ZL3= 120
##$ZL4= 120
##$ABSF1= 16.522
##$ABSF2= -4.171173
##$ABSG= 5
##$ABSL= 3
##$ALPHA= 0
##$AQORDER= 0
##$ASSFAC= 0
##$ASSFACI= 0
##$ASSFACX= 0
##$ASSWID= 0
##$AUNMP= <proc_1d>
##$AZFE= 0.1
##$AZFW= 0.1
##$BCFW= 0
##$BC_mod= 0
##$BYTORDP= 0
##$COROFFS= 0
##$CY= 12.5
##$DATMOD= 1
##$DC= 0
##$DFILT= <>
##$DTYPP= 0
##$F1P= 14.0000005364418
##$F2P= -0.99999901652339
##$FCOR= 0.5
##$FTSIZE= 32768
##$FT_mod= 6
##$GAMMA= 0
##$GB= 0
##$INTBC= 1
##$INTSCL= 1
##$ISEN= 128
##$LB= 0.3
##$LEV0= 0
##$LPBIN= 0
##$MAXI= 10000
##$MC2= 0
##$MEAN= 0
##$ME_mod= 0
##$MI= 0
##$NCOEF= 0
##$NC_proc= -5
##$NLEV= 6
##$NOISF1= 0
##$NOISF2= 0
##$NSP= 0
##$NTH_PI= 0
##$NZP= 0
##$OFFSET= 16.522
##$PC= 1
##$PHC0= 152.8131
##$PHC1= 12.29419
##$PH_mod= 1
##$PKNL= yes
##$PPARMOD= 0
##$PSCAL= 4
##$PSIGN= 0
##$REVERSE= no
##$SF= 250.13
##$SI= 32768
##$SIGF1= 0
##$SIGF2= 0
##$SINO= 400
##$SIOLD= 32768
##$SREGLST= <1H.CDCl3>
##$SSB= 0
##$STSI= 32768
##$STSR= 0
##$SW_p= 5175.98343685301
##$SYMM= 0
##$S_DEV= 0
##$TDeff= 65536
##$TDoff= 0
##$TI= <Analysis number 999999
Compound Code 99
Book Reference 9
Project Code 9>
##$TILT= no
##$TM1= 0
##$TM2= 0
##$TOPLEV= 0
##$USERP1= <user>
##$USERP2= <user>
##$USERP3= <user>
##$USERP4= <user>
##$USERP5= <user>
##$WDW= 1
##$XDIM= 32768
##$YMAX_p= 475673517
##$YMIN_p= -648030
$$ End of Bruker specific parameters
$$ ---------------------------------
##NTUPLES= NMR SPECTRUM
##VAR_NAME=  FREQUENCY,     SPECTRUM/REAL,   SPECTRUM/IMAG
##SYMBOL=    X,             R,               I
##VAR_TYPE=  INDEPENDENT,   DEPENDENT,       DEPENDENT
##VAR_FORM=  AFFN,          ASDF,            ASDF
##VAR_DIM=   32768,         32768,           32768
##UNITS=     HZ,            ARBITRARY UNITS, ARBITRARY UNITS
##FACTOR=    0.157963299565203, 1,           1
##FIRST=     4132.6476996994, 0,             0
##LAST=      -1043.33573715361, 0,           0
##MIN=       -1043.33573715361, -648030,     0
##MAX=       4132.6476996994, 475673517,     0
$$ Real data points
##PAGE= N=1
##DATA TABLE= (X++(R..R)), XYDATA
$$ [...]
19515A5352L2501R7095P4431p0118j5220n616k6543k34j30685r9507J3916L7019
19503g7609J06463Q7062O5172j9903J0659q565p8458p2189k7750k0635Q5048k5544
19491B3751K6965J7864N5826J42164J7783j07292l0713n2208J51265P230k9671
19480B22964L8129r0257j16081j4762k493J34445o7513j33715k23625k22249Q5595
19469c89562Q7544m1384p243Q9137K26182L1749J14310J87129J07556p3667l5389
19458B96362J7325k1674m8603k1775J43457m3472j83752j54391P3114L0426j5445
19447G1572r058P8204N8719j36712l7365R5820m8015N4033R3441o7976l122J85453
19435C34994J17765k14582q7413O5402k9479j38382M3309K7784m382n2266L5650
$$ plain form
19515 15352 47853 144948 219379 149261 134041 128425 101882 101648 -29037 -128544 -114628 -77609
19503 -77609 28854 115916 181088 161185 171844 163279 84821 12632 -15118 -35753 49295 23751
19491 23751 50716 68580 124406 266570 284353 177061 146348 94140 245405 252635 222964
19480 222964 261093 170836 54755 39993 37500 171945 104432 -29283 -252908 -475157 -389562
19469 -389562 -302018 -343402 -350645 -261508 -35326 -3577 110733 297862 405418 331751 296362
19458 296362 313687 292013 243410 221635 365092 321620 137868 -16523 56591 87017 71572
19447 71572 62514 140718 199437 62725 25360 121180 73165 127198 220639 152663 149541 334994
19435 334994 452759 238177 150764 216166 186687 48305 91614 119398 115016 62750 98400
19424I8400N0516K1427j16726j29779M4581Q1361J07583J4859j35474j76536j05878
19413b45666R8797j6841J87026K01190Q3039j43181m2567O6849k3530P217j13568
19402E8765j9373N3968P5396n5416k3442q8198R6214Q2780N8931M7240k47396
19391C9469j47886J32683J92308N1763j24567n975k21896n2936n6180J2384J08655
19380g2178Q9227Q1377J06311n0152j82764p6893L6692K84256q660O9874o9266
19369B07824j44788o4787j4125o514K0118j48530Q6802J69874P5057l0385j04177
19358D6369r2786P5259M5096P6053K8303p7170K2590j4940j12795q9151O4574
19347b8598J82754Q6329m5284j09818K789j2832O1689K3588J83035p3600k53164
$$ plain form
19424 98400 148916 170343 53617 -76162 -31581 49780 157363 172222 36748 -139788 -245666
19413 -245666 -146869 -163710 23316 224506 307545 164364 121797 188646 165116 172333 58765
19402 58765 39392 93360 168756 113340 89898 1700 97914 180694 239625 286865 39469
19391 39469 -108417 24266 216574 268337 143770 137795 -84101 -137037 -193217 -180833 -72178
19380 -72178 17049 98426 204737 154585 -28179 -105072 -68380 215876 207216 277090 207824
19369 207824 63036 -1751 -15876 -22390 -2272 -150802 -64000 105874 180931 150546 46369
19358 46369 -46417 28842 73938 149991 178294 101124 123714 108774 -4021 -93172 -28598
19347 -28598 154156 240485 195201 85383 88172 75340 137029 160617 343652 270052 16888
19336A6888j74299J48131J01077j0239q5744j01356J02885K18284l8094J21056
19326B98589r2788j88822q4497P270J46705j71059J2725J66369J18450o7439j01180
19315D4323K06726L2105l8228k901O9704j0089q1220J69863j76676m9055M016
19304A68568j03007l7815r9067M915K6686p2536L8578M9732K30311m366K8649
19293B30648j0683j44570k81760m1675K6946q195J68706q1487M0663J68378R9685
19282A66656j32172j0902J33774p138q5683P784J95668J93883p6756j3882R8370
19271D69602m7623k1944o7356p7446j42855m7913O5315N5119j34220l2229J49416
19260A67866j9272j16404N4877k5572L2008j0239m0658J7840K9250J80403r260
$$ plain form
19336 16888 -157411 -9280 91797 81558 -4186 -105542 -2657 215627 177533 298589
19326 298589 205801 16979 -67518 -60248 86457 -84602 -71877 94492 212942 145503 44323
19315 44323 251049 283154 244926 242025 311729 301640 220420 390283 213607 164552 168568
19304 168568 65561 27746 -71321 -66406 -39720 -112256 -73678 -23946 206365 201999 230648
19293 230648 219965 75395 -206365 -248040 -221094 -229289 -60583 -142070 -101407 66971 166656
19282 166656 34484 23582 157356 150218 64535 72319 267987 461870 385114 371232 469602
19271 469602 421979 400035 332679 255233 112378 64465 129780 184899 50679 18450 167866
19260 167866 148594 32190 87067 61495 93503 83264 42606 60446 89696 270099 260839
19249B60839p9055j09059m5183R9422J97784j33114q2985J25860j30301q1296
19239B2912P5068M3533O5404j48567j17093q3750K03208J20834O5381l8089k46061
19228c7220J7672K55003k4563r6715K01397J20553o6452j39743j19148L6293q6531
19217F0546L1212J64955J63155m7710j26871k57798M0417J45778J49167j34638
19207A88213M6712P890J23622j4681m6748k7521N2202j72546Q4067J28216L4491
19196D03917k38877o3206J08014J15674J4885K5960J7196j69818j50736J6726
19186G9735J31384r21j73541p8729J81550p407M5080O817L8258o0031O7833J39659
19174C69687o5098j80970p2265R1682K9924q7510Q8418m2555j11932J04104M7939
$$ plain form
19249 260839 181784 72725 27542 126964 324748 191634 108649 234509 104208 22912
19239 22912 97980 141513 206917 58350 -58743 -142493 60715 181549 246930 208841 -37220
19228 -37220 -19548 235455 210892 114177 315574 436127 369675 229932 110784 147077 60546
19217 60546 91758 256713 419868 372158 245287 -12511 27906 173684 322851 188213
19207 188213 234925 242815 366437 351756 305008 277487 329689 157143 241210 369426 403917
19196 403917 165040 101834 209848 325522 340407 366367 383563 213745 63009 79735
19186 79735 211119 210198 36657 -42072 139478 132071 177151 183968 222226 162195 230028 369687
19174 369687 304589 123619 51354 143036 172960 85450 173868 131313 19381 123485 171424
19163A71424Q5511P124j73482m5955p0130O1378O3834m3921m931K9244M8156j6195
19151A12057L4045O8524q7667j78090j1509J00129j11435j25333O4113R8642O8545
19140C2021N9804M8161L4579K7057n7305r0507P5282J3596m3894J36805J93210
19129D28809l9918n6704o3091j1325k9494N8451J80273m2038l7554L7328j715
19118D23022j78017L3007J09139k9774r6921L3016j7856j44329J69685O8723n6022
19107C13673l6742J30610q5368j11196l9867k7468J10755m7155q2886J03580R6129
19096C24065J17250K3532p7001j07440j50678p7753L4288j3763n935R3312n7206
19085A02671j37734J5789K1203J53372l0870r4381J91867m7196J05829P3559J8353
$$ plain form
19163 171424 256935 264059 90577 44622 -25508 35870 99704 55783 50852 80096 128252 112057
19151 112057 146102 214626 126959 -51131 -62640 37489 -73946 -199279 -135166 -36524 32021
19140 32021 91825 139986 174565 201622 144317 53810 129092 142688 98794 235599 428809
19129 428809 388891 332187 269096 257771 228277 286728 467001 424963 387409 424737 423022
19118 423022 245005 278012 387151 357377 260456 293472 275616 131287 300972 369695 313673
19107 313673 276931 407541 322173 210977 171110 143642 254397 207242 124356 227936 324065
19096 324065 441315 464847 387846 280406 129728 51975 86263 72500 66565 159877 102671
19085 102671 -35063 -19274 1929 155301 124431 30050 221917 174721 280550 354109 372462
19074C72462M045J07268J14412j83237j29487n4044j39698o18n4357J7848p1438
19063a6844O6153J30741j1014J16893l7098N2511q7740j01920q9247J33485m8196
19052A07724j31548Q6439P1111j39407P1856J9537R866R5313M118j01390q3634
19041I985N2478R6481J49293j04106N1799l3653J9528J42491n0434p4008j20009
19030A39845N0242J41909j66931J9058N8q8994M1791J05113K7991j21531m9590
19019I8961N1005l2215j86621N0721K13772R9961j22145k57944J22277J56260
19009A94032R9285k8148K3183K98702N3134j48881k95709j88162o3214M0139R1631
18998G5992J30557m5643p6026J20624N6856j06440m5555K7274J52439k6961N7985
$$ plain form
19074 372462 376507 483775 598187 414950 285463 231419 91721 91103 36746 54594 -16844
19063 -16844 49309 180050 169036 285929 248831 301342 213602 111682 22435 155920 107724
19052 107724 -23824 62615 133726 -5681 66175 85712 95578 190891 195009 93619 9985
19041 9985 62463 158944 308237 204131 255930 222277 241805 384296 333862 259854 139845
19030 139845 190087 331996 165065 184123 184181 95187 136978 242091 270082 148551 98961
19019 98961 149966 117751 -68870 -18149 195623 295584 173439 -84505 37772 194032
19009 194032 293317 265169 288352 587054 640188 491307 195598 7436 -55778 -15639 75992
18998 75992 206549 160906 84880 205504 262360 155920 110365 137639 290078 263117 321102
18987C21102J11280J22613j01181j74233q2156l1475R995l5991L8971m7604L8742
18976A70063K1963P0079J21112O4882k9679n6618o2857P4102p330M644Q361j08434
18964B70288j88253r5758j43070K69247K63247J16854j75167k36104j50693J00865
18954C1456Q7552P8542N9348j4770q0336j29325r0727R1197Q8144J00040l3248
18943A87873J3949K15292m5317k1183o574J04676R59m5203k7451p3116k5435J88081
18931D66551J11020Q4661J9128K7736J57438K26460J25585J57346n2917M7534
18921A370542p189p9033n7230m7867R1673J9888P0432l2409j76581r4567M7871
18910A105530k28958n4102L8629j59807P1397j19612j84233l171r5438Q100J05838
$$ plain form
18987 321102 432382 554995 453814 279581 197425 165950 175945 139954 178925 131321 170063
18976 170063 192026 262105 383217 448099 418420 361802 298945 373047 365717 370361 378722 270288
18964 270288 82035 -13723 -156793 112454 375701 492555 317388 81284 -69409 31456
18954 31456 119008 197550 256898 242128 161792 32467 -58260 32937 121081 221121 187873
18943 187873 201822 417114 371797 350614 344040 448716 449675 404472 377021 303905 278470 466551
18931 466551 577571 662232 681360 709096 866534 1092994 1218579 1375925 1323008 1370542
18921 1370542 1363353 1284320 1227090 1179223 1270896 1290784 1361216 1328807 1152226 1057659 1105530
18910 1105530 876572 822470 861099 701292 772689 653077 468844 465673 370235 378335 484173
18899D84173J38063O3918j07484k4861Q415K7243J0136n6894j7091L4363o9368
18888D90613J9588O3329L8310L2177J01847O7101Q4309J25748K27493R081J25732
18877A385328J73663L6191j82392j30175M8334P0749J08818L9438j11841m88J25407
18866A563032L8132k0746K5561j4027j65387k10028k35091j43679k9812l1601
18856G76354o5024j12647j2479k07862K6341K16810J189j25715M4335M4298M8562
18845F34162R4539J1880j46010q5906j06157p7758J42126J38623P4054p3208r5789
18834E10556R1737m0029J23492R36O550m8700k7306J33122m5857R0180N5393q2777
18822G67297j9927j19677j17443J16338j2789P4227q8900o3604o6074J37846J09774
$$ plain form
18899 484173 622236 686154 578670 553809 562224 589467 599603 542709 525618 559981 490613
18888 490613 510201 573530 611840 644017 745864 812965 897274 1023022 1250515 1259596 1385328
18877 1385328 1558991 1595182 1412790 1282615 1330949 1401698 1510516 1549954 1438113 1437625 1563032
18866 1563032 1601164 1580418 1605979 1591952 1426565 1216537 981446 837767 807955 776354
18856 776354 711330 598683 586204 378342 404683 621493 622682 496967 541302 585600 634162
18845 634162 728701 740581 594571 508665 402508 324750 466876 605499 679553 606345 510556
18834 510556 602293 562264 685756 686692 693242 644542 617236 750358 704501 794681 850074 767297
18822 767297 747370 627693 510250 626588 613799 688026 599126 535522 469448 607294 717068
18811G17068J3139R6721J40456J67810n7309N1564K66512N4183k3574J05929k77480
18800A255019l019R3469m0400L3594m7695L991J01092j8343m6505o1944k44229
18789A025030j02135Q7675j22720p1788j53687M115j7270J50897K8607n9662n206
18778G63856j23226J8954m1418j13798J98054J96826K24989J70620R5644M0060
18768A430561K2269j07284j76474l38368j75370j8100o2061J19881J37730K01860
18758A034644J23783K09678K60031Q7823J54677L6934J77100K0008M3056L9086
18748B186820j5479m0947k3642j2035j73424j50384j2277n2820r1058r8734k3881
18737A492139n9950m2256J0566k36835j82444k03263O2939m1408K5732J05930
$$ plain form
18811 717068 730207 826928 967384 1135194 1077885 1129449 1395961 1450144 1426570 1532499 1255019
18800 1255019 1252000 1345469 1305069 1338663 1290968 1294959 1396051 1377708 1331203 1269259 1025030
18789 1025030 922895 1010570 887850 816062 662375 666490 649220 800117 828724 769062 763856
18778 763856 640630 659584 618166 504368 702422 899248 1124237 1294857 1390501 1430561
18768 1430561 1452830 1345546 1169072 830704 655334 637234 575173 695054 832784 1034644
18758 1034644 1158427 1368105 1628136 1715959 1870636 1907570 2084670 2104678 2147734 2186820
18748 2186820 2171341 2130394 2106752 2094717 1921293 1770909 1758632 1705812 1614754 1516020 1492139
18737 1492139 1432189 1389933 1400499 1163664 981220 777957 840896 799488 825220 931150
18727I31150J57222j85484r3681J27322M5805k08025j93830Q784P3360N9903O5076
18716G87602j92809j99421J60157L5817R6712J11497Q0098m8172j60588j2969
18706F57924K1564j4691l6390k5247J2656R7600J65981J18518m0093N0149J96932
18695A204903Q0322j70360j63355P0713m6233P6510l7542N6356L1179j2390r5504
18684I94599O3988P218o7378O5202M4897M5362K050j56775k1638k208j11556P506
18672H71267j05636Q00p0776o8103n9058J05047n8654N5982K35016R4438o2965
18661I37358l3591P162M3261K3529o3382M4692J35040k1473j89120q0794J7982
18650H20664O642J04973L5141r5572M8284J76717N6884j13311k80745j63987O5641
$$ plain form
18727 931150 1088372 902888 809207 936529 982334 774309 580479 589263 662623 722526 787602
18716 787602 594793 395372 555529 591346 688058 799555 879653 831481 670893 657924
18706 657924 679488 664797 628407 603160 615816 713416 879397 997915 957822 1007971 1204903
18695 1204903 1285225 1114865 951510 1022223 975990 1052500 1014958 1071314 1102493 1090103 994599
18684 994599 1058587 1065805 998427 1063629 1108526 1153888 1155938 999163 977525 975317 863761 871267
18672 871267 765631 766431 695655 627552 568494 673541 614887 670869 905885 1000323 937358
18661 937358 903767 910929 954190 977719 914337 959029 1094069 1072596 883476 802682 820664
18650 820664 827306 932279 967420 871848 920132 1096849 1153733 1040422 759677 595690 661331
18639F61331Q0967L4306J68565K3656j16018L5928R6073j75235k9014n2114J15161
18628H43606k3314j84156J13960J92214J3777J8232M1392o8161J02152l7860k25115
18617G86727N6793J72703O5283L1959k439k0495M8485o4468j08106P3936K6860
18606A067238j11660Q9515J26675P793j19470o9423j78896r444N8363M1639N5089
18595I57419J24027j4458j22156n3850J66312J52169j38262k43124j07913q4281
18585F35883m7182j3844K2523j4136K1504N7747J28893l2048L2818J97230p7426
18574I11962K7931j7740n8947q721K22514r758l7087J38712K58878J33349J37294
18563A698387l3524p4960k24912j46169K7722N6343J05113R0790o5090N2671r4458
$$ plain form
18639 661331 742298 776604 945169 968825 852807 888735 984808 809573 780559 728445 843606
18628 843606 820292 636136 750096 942310 956087 974319 1015711 947550 1049702 1011842 786727
18617 786727 843520 1016223 1081506 1113465 1111026 1090531 1139016 1074548 966442 1040378 1067238
18606 1067238 955578 1045093 1171768 1179561 1060091 990668 811772 802328 860691 902330 957419
18595 957419 1081446 1066988 944832 890982 1057294 1209463 1071201 828077 720164 635883
18585 635883 588701 574857 597380 583244 604748 662495 791388 759340 792158 989388 911962
18574 911962 939893 922153 863206 854485 1076999 1067241 1030154 1168866 1427744 1561093 1698387
18563 1698387 1664863 1589903 1364991 1218822 1246544 1302887 1408000 1498790 1433700 1486371 1391913
18552A391913p9481J9972j8382l9707j88281O46j01093L4244J59422M6984j52388
18541A073849M5931O7420k1729N8576K92691J61971q011j1905M9996N5996j70384
18530A594401j75131k13331P8939K66216J32424r0093m8810j84629n8981N2382
18520A353387J88701J57779J83396N9339L562P1811N2689j72902J6614O0361j56951
18509A817786j87081N4994K67082R4289L8995o3045j97275l7189j8850j75710
18499A593996j98975j47083n048R4534J36491m5157J02231J01675m1229m416J62203
18488A749222J0668J8284j58101j30680K2390N9153j77173J9191O6852l7239p7083
18477A365484j550k4443n6575k4989N9742l4226N1126K59571J51349n5265m8477
$$ plain form
18552 1391913 1312432 1332404 1314022 1274315 1086034 1086680 985587 1019831 1179253 1226237 1073849
18541 1073849 1119780 1187200 1165471 1224047 1516738 1678709 1670698 1658793 1708789 1764785 1594401
18530 1594401 1419270 1205939 1284878 1551094 1683518 1593425 1544615 1359986 1301005 1353387
18520 1353387 1542088 1699867 1883263 1942602 1946164 2017975 2070664 1897762 1914376 1974737 1817786
18509 1817786 1630705 1685699 1952781 2047070 2086065 2023020 1825745 1788556 1769706 1593996
18499 1593996 1395021 1247938 1242890 1337424 1473915 1428758 1530989 1632664 1591435 1587019 1749222
18488 1749222 1759890 1778174 1620073 1489393 1511783 1570936 1393763 1412954 1479806 1442567 1365484
18477 1365484 1363934 1339491 1282916 1257927 1317669 1283443 1334569 1594140 1745489 1690224 1641747
18466A641747J32887n5297r599j72746j99754l0495P5707J2004K88130K51351
18456A933935M7129k11466l47630j60924p5739j13499J2697J10594J8496n6099
18446A157494n0496j94236j71010k2377J00640J31981J25842k3973j09622j7484
18436I26759n6530O7163J57016J41066l4522j10123q2798M6887p2740p2334P7224
18425I87068L8599p3549j88360r0106O3082M8606P0094J09709q8583l1554J01604
18414I46610O8830p2612K2305N1969N1853q3357r290P8285o0567N2546J48547
18403A195119J5638k13465j25736J85176J42270R4169k635k2774l3444q3651K78
18392A150945m0970J146n0685J12900J56950J35401q906M0735O0556M0190n3201
$$ plain form
18466 1641747 1774634 1719337 1709738 1536992 1337238 1306743 1382450 1394454 1682584 1933935
18456 1933935 1981064 1769598 1421968 1261044 1185305 1071806 1084503 1195097 1213593 1157494
18446 1157494 1106998 912762 741752 719375 820015 951996 1077838 1053865 944243 926759
18436 926759 870229 937392 1094408 1235474 1200952 1090829 1008031 1054918 982178 909844 987068
18425 987068 1025667 952118 763758 673652 736734 785340 855434 965143 876560 845006 946610
18414 946610 1015440 942828 965133 1017102 1068955 985598 976308 1054593 994026 1046572 1195119
18403 1195119 1210757 997292 871556 1056732 1199002 1293171 1290536 1267762 1234318 1150667 1150945
18392 1150945 1109975 1111121 1060436 1173336 1330286 1465687 1456781 1497516 1558072 1598262 1545061
18381A545061J9897J38724K39544J18368K19800J1770k32356j71105L9875J51766
18371B081344o5417j8317O4140j31150j7839j34742k3866j05075l6323k8411k5056
18360A559288p9024k8583K3132J88986J49177j12199k08382m8524M4775l3347
18350A455299q3603k5987l0943N6947J20565m9039p8479J64164J12189j30148
18340A510965k7625R0128P2691M8559J72190J92096J61954P0510P4412l0915L2448
18329B367413k0275K76292J13449J9244j38658Q7630N3503N8948k0933q1292j418
18318B713903N5578j29927j62995J11905m0693m4055j32871j25844j08147O7477
18308B204331o864j01447q0441J17631O4209K9094Q9072r7090R1332j12198k38346
$$ plain form
18381 1545061 1564958 1703682 1943226 2061594 2281394 2293164 2060808 1889703 1929578 2081344
18371 2081344 2015927 1997610 2061750 1930600 1912761 1778019 1754153 1649078 1612755 1584344 1559288
18360 1559288 1480264 1451681 1474813 1663799 1812976 1700777 1492395 1443871 1488646 1455299
18350 1455299 1371696 1345709 1314766 1371713 1492278 1443239 1364760 1528924 1641113 1510965
18340 1510965 1483340 1573468 1646159 1694718 1866908 2059004 2220958 2291468 2365880 2334965 2367413
18329 2367413 2347138 2623430 2736879 2756123 2617465 2705095 2758598 2817546 2796613 2715321 2713903
18318 2713903 2769481 2639554 2476559 2588464 2547771 2503716 2370845 2245001 2136854 2204331
18308 2204331 2197467 2096020 2015579 2133210 2197419 2226513 2315585 2218495 2309827 2197629 1959283
18297A959283P5229P3126M3469j11444N9506J60893P9820J02609J36592J32923
18287B712006n4851J314N3844K57492J26548n7598J00238P1625K08220N9098J93772
18276C671708O4000l837J41972j9465M6364K23736J09320O8305J18834J99240
18266D620177K16490M10668M27168N62381R28043J320972J308348J136619J105984
18257A2036850J296536R90386N41618k93999j51003P57626J909979L609809O064937
18248B6762739Q681629R956188J0266496J0096961Q255018N843931J960607m378735
18240G7444834q947106j0315602p987045n154032l909777l763628k498607l6404
18232C4832633J253132J163484J291964P38489p78162k942801m644228m360829
$$ plain form
18297 1959283 2034512 2107638 2151107 2039663 2099169 2260062 2339882 2442491 2579083 2712006
18287 2712006 2657155 2658469 2712313 2969805 3096353 3038755 3138993 3210618 3418838 3477936 3671708
18276 3671708 3735708 3731871 3873843 3854378 3900742 4124478 4233798 4302103 4420937 4620177
18266 4620177 4836667 5247335 5674503 6236884 7164927 8485899 9794247 10930866 12036850
18257 12036850 13333386 14323772 14865390 14571391 14420388 15178014 17087993 20697802 26762739
18248 26762739 35444368 45400556 55667052 65764013 74019031 79862962 81823569 77444834
18240 77444834 68497728 58182126 50195081 45041049 41131272 37367644 34869037 34832633
18232 34832633 36085765 37249249 38541213 39279702 38501540 35558739 30914511 26553682
18224B6553682k692395j591381p67179k49878O7265Q34765Q67373J043553R00265
18215B4966070Q75686Q80968N65344J19524m62646n97020N5123J082536K279793
18206B9765378L970724O105646Q249458J0922121J4779781J6987739J4619667
18199A05400514J1140436R912229P402522K060596n951024r700892l688531M837171
18191A21413021R096054P090637M684229L909146J508769m357406j2508676j8433012
18183A12402762j8952714j5683162j2602001r230504n714525l248483j723839
18176D5247534q88993l47386m393J56248n69216j595851k764926k478315j745254
18167C5009448j346768r43660m06950J82668P60058J495076K496220L543859M163059
$$ plain form
18224 26553682 23861287 22269906 21502727 21252849 21320114 22154879 23022252 24065805 24966070
18215 24966070 25841756 26722724 27288068 27407592 26944946 26347926 26403049 27485585 29765378
18206 29765378 33736102 39841748 48091206 59013327 73793108 90780847 105400514
18199 105400514 116540950 126453179 133855701 135916297 129965273 120264381 116575850 121413021
18191 121413021 130509075 137599712 142283941 146193087 147701856 143344450 130835774 112402762
18183 112402762 93450048 77766886 65164885 55934381 50219856 46971373 45247534
18176 45247534 44358541 44011155 44006762 44163010 43593794 41997943 39233017 36754702 35009448
18167 35009448 33662680 32719020 32312070 32494738 33254796 34749872 37246092 40789951 44953010
18158D4953010L655463L032871L199130K646501N48335j827555k563240m20514
18150E3224001K331256M340812P324383J0747205J2462622J1723250R437692P682142
18142A19273363N758655L009599l862122j2989523j8852738k0593826j5553684
18135E6189724r418247n598865l391906j872877p22959J69148N86643O34608O16403
18126C7191672R34374N94307k92955j370996j744592o98884N11463J987937L869860
18117D0982186O959775J3223725K2495950K7271450J9221792J4875159J9631672
18110A64661709J1790238o057511l0540709m2932329k7742961j4442657q255388
18103D6480392n532623m167710l201462k410147j907149j526026j182594r02514
$$ plain form
18158 44953010 48608473 51641344 54840474 57486975 58035310 56207755 53644515 53224001
18150 53224001 55555257 59896069 67220452 77967657 90430279 102153529 111591221 119273363
18142 119273363 125032018 128041617 124179495 111189972 92337234 71743408 56189724
18135 56189724 46771477 41172612 37780706 35907829 35184870 35354018 35940661 36575269 37191672
18126 37191672 38126046 38720353 38427398 37056402 35311810 34612926 35124389 37112326 40982186
18117 40982186 47941961 61165686 83661636 110933086 130154878 145030037 164661709
18110 164661709 176451947 170394436 139853727 96921398 69178437 54735780 46480392
18103 46480392 40947769 36780059 33578597 31168450 29261301 27735275 26552681 25650167
18095B5650167q53410q68487r10511r86233r81310q05105p83360o35110n43342
18086A8283299n52221l39577m28553o36764m46211k81527j98183j47352k25066
18077A5027845j54277K1928J4568l1953J3752L0247j1011Q8098J81987L36925
18067A5518109M78279N06518O67100P57930Q45141Q80661R33416J064924J340947
18058B2993025J375719J493471J875907K526466L181291L693485M332250M893831
18050D6365445N411741N304347N559508O210985P682634R546330J0531070J0822263
18042A07434323J1199826J0111721O745259K197339l892045q914857j2934908
18035A11946658j5850721j5715922j2818085r068273o589422m811249l680964
$$ plain form
18095 25650167 24796757 23928270 23017759 22031526 21050216 20245111 19461751 18826641 18283299
18086 18283299 17731078 17391501 16962948 16326184 15879973 15598446 15400263 15252911 15027845
18077 15027845 14873568 14895496 14910064 14878111 14891863 14922110 14911099 14999197 15181184 15518109
18067 15518109 15996388 16502906 17170006 17927936 18773077 19653738 20587154 21652078 22993025
18058 22993025 24368744 25862215 27738122 30264588 33445879 37139364 41471614 46365445
18050 46365445 51777186 57081533 62641041 68852026 76534660 86080990 96612060 107434323
18042 107434323 118634149 128745870 135491129 137688468 133796423 124881566 111946658
18035 111946658 96095937 80380015 67561930 58493657 51904235 47092986 43412022
18028D3412022k855046k566669k663072k603695k041630j343652r71541q90880
18020B7475837m86075k94098l19266k73382j63919j7555K79605P39709J083442
18011B8024298J532169K156390K693008K951056L389753L883681M592734N570154
18003E4793243O305592O618206P712705Q983086J0519872J1465724J2133875J4178696
17995A32710999J5874120J5328848J2194790O992009K854843k639135j0163562
17988A73152912j7407504k1912145k0359617j5840089j0936965o310863l188651
17981G7197078j850182j517758k945269n107442o917398p374590o424953m818765
17973D0240721l407103k478781j904021j440087j129060j042205q88349p99006
$$ plain form
18028 43412022 40556976 37990307 35327235 32723540 30681910 29338258 28366717 27475837
18020 27475837 26989762 26695664 26376398 26103016 25939097 25921542 26201147 26940856 28024298
18011 28024298 29556467 31712857 34405865 37356921 40746674 44630355 49223089 54793243
18003 54793243 61098835 67717041 75429746 84412832 94932704 106398428 118532303 132710999
17995 132710999 148585119 163913967 176108757 183100766 185955609 183316474 173152912
17988 173152912 155745408 133833263 113473646 97633557 86696592 80385729 77197078
17981 77197078 75346896 73829138 70883869 65776427 58859029 51484439 45059486 40240721
17973 40240721 36833618 34354837 32450816 31010729 29881669 28839464 27951115 27152109
17965B7152109p31140o58357l82857k98872l84938o19345o62999o12417n64070
17956B2237114n77983l23471p7714J97728N52562J097488J748610L051828M153438
17947C2059600N275646O119147O211814N452721M422524J990706j210485m295248
17939E6026425n694056m630500k627850m86108Q83336J540537J321817J03269
17931D6436870j824158m052252n662804n650503m673011l645653k330121j375430
17923A7222938r99242q87175q92497p07174n67724k40576j28285J7106O1444L4164
17913A2912979N5594k40798k26723k77712m74146m13904l39114k40110j5873j05729
17903A0634464k64617j37475j08001k47002n47007n92029l96230k73780r6398
$$ plain form
17965 27152109 26420969 25762612 25379755 25080883 24695945 24076600 23413601 22801184 22237114
17956 22237114 21659131 21335660 21257946 21455674 22008236 23105724 24854334 27906162 32059600
17947 32059600 37335246 43454393 49666207 55118928 59541452 61532158 60321673 56026425
17939 56026425 50332369 45701869 43074019 42587911 43471247 45011784 46333601 46436870
17931 46436870 44612712 40560460 34897656 29247153 24574142 20928489 18598368 17222938
17923 17222938 16223696 15336521 14444024 13736850 13169126 12928550 12800265 12817371 12878815 12912979
17913 12912979 12968573 12727775 12501052 12223340 11749194 11335290 10996176 10756066 10740193 10634464
17903 10634464 10369847 10232372 10124371 9877369 9330362 8738333 8342103 8068323 7971925
17894G971925l51067k91872n2104k00995k94280k07160K5875p5119n4806j60331
17884F310066j87913j57290k03947j27610j02380K1455m1756j7031j8833j70029
17874E304732j40938j17572O0357J29917J08958j8571k4749K90523K89371L0268
17864E912296j61807M1590M7104q5778l65115k63799j03087m4205j3599K34837
17854E198437N6051J1108m6321k42113j36734k19758j32402r3401l2268M7965
17844D410564O1141n9867j46460j51865N2915l3885J03271M9059o9811j79132
17834D035930j94466J79292Q6497n2177o6400O4711q8967K0944j26341Q7083J27310
17823D073416J22277m7428O8260k2052n915n3249j49149j9432K42217L75879L50401
$$ plain form
17894 7971925 7620858 7328986 7276882 7075887 6781607 6574447 6600322 6525203 6470397 6310066
17884 6310066 6122153 5964863 5760916 5633306 5530926 5552381 5510625 5493594 5474761 5304732
17874 5304732 5163794 5046222 5106579 5236496 5345454 5326883 5302134 5592657 5882028 5912296
17864 5912296 5750489 5792079 5839183 5753405 5388290 5124491 5021404 4977199 4963600 5198437
17854 5198437 5254488 5265596 5219275 4977162 4840428 4620670 4488268 4394867 4362599 4410564
17844 4410564 4471705 4411838 4265378 4113513 4166428 4132543 4235814 4284873 4215062 4035930
17834 4035930 3841464 4020756 4107253 4055076 3988676 4053387 3964420 3985364 3859023 3946106 4073416
17823 4073416 4195693 4148265 4216525 4194473 4188558 4135309 3986160 3966728 4208945 4584824 4935225
17812D935225M06318K21411K73409L44111J17457R3528K27668K9995j0785K17193
17802F855530K19419P8434m53518k56279k04017j19726p5953J36730j99632j97163
17792E783825M9892M4243l0124K376P4207J43187j17245K9660Q9783K28535K64568
17781F562907K48145M84830M45258P07092P19116Q27116J104435J631596K200351
17772A4930846K537809K672206L114751L376662L105383K027174J342989J456375
17764C4564195J839916K662489M246995P037864R624201J1155760J1667473J2287707
17756I5086600J2045412J1119954J0514378J0468461J0556757J0746088J1857573
17749A72395223J1747757O074081n981913j8117328k2749044j8834032j2841429
$$ plain form
17812 4935225 5341543 5562954 5836363 6180474 6297931 6391459 6619127 6649122 6638337 6855530
17802 6855530 7074949 7153383 6699865 6443586 6239569 6119843 6043890 6180620 5980988 5783825
17792 5783825 5833717 5877960 5847836 5850212 5924419 6067606 5950361 5980021 6069804 6298339 6562907
17781 6562907 6811052 7295882 7741140 8448232 9167348 9994464 11098899 12730495 14930846
17772 14930846 17468655 20140861 23255612 26632274 29737657 31764831 33107820 34564195
17764 34564195 36404111 39066600 43313595 50351459 59975660 71131420 82798893 95086600
17756 95086600 107132012 118251966 128766344 139234805 149791562 160537650 172395223
17749 172395223 184142980 190217061 184235148 166117820 143368776 124534744 111693315
17742A11693315r696689r439468q992167o887509m038453j511812J79095J138140
17734G2444452J384072J288351M15635p96919p14088J118414L027944K956175
17726H1124036M91283l194426k982142m27440J36185m25341j626956k251774j295733
17717F9547692q24651m99972J039126K459556K873872K637402K022016J869769
17709H1124810J959336L228451M941119N554864N571832N555995O067088P349036
17701A21352531R202489J0484281R511074N711536j73563n256405o592497m226287
17693A40013159k100342m520827j0261086j4602219j3459357p681345k695674
17686H4692309Q35269L459962L842137K242078J435423L243915N938288O017718
$$ plain form
17742 111693315 101996626 92557158 83564991 76677482 72639029 71127217 71306312 72444452
17734 72444452 73828524 75116875 75532510 74735591 74021503 75139917 78167861 81124036
17726 81124036 81615319 78420893 75438751 75011311 75147496 74722155 73095199 70843425 69547692
17717 69547692 68723041 68223069 69262195 71721751 74595623 77233025 79255041 81124810
17709 81124810 83084146 86312597 91253716 96808580 102380412 107936407 114003495 121352531
17701 121352531 130555020 141039301 150550375 156261911 156088348 150831943 144239446 140013159
17693 140013159 137912817 133391990 123130904 108528685 95069328 87387983 84692309
17686 84692309 85527578 88987540 92829677 95071755 96507178 99751093 105689381 111707099
17678A11707099L563792K215143K548154N04526n634394j1993698j3580949j0400286
17670G8929387p102524n574955n432787m738800l804993l697114m176132m452194
17662C9949888l628716k675272j760252j530392j544009j138184q15141p77043
17654B6080879q69231r91088p43003l10834n79561n71695m35930n42005k82979
17645B0754553N6175K68953P60162J432492K246453K987810K709951K338329K585392
17636C6140270K769930K385222J349257O02201O23872J337553K255016J685164
17628D9148485n45092l427390m884206l567842j964296q99996o94786j843881
17620C1320996l396504l874859k668237j582859r80808o07808m74607o1322n1559
$$ plain form
17678 111707099 115270891 117486034 120034188 120538714 114904320 102910622 89329673 78929387
17670 78929387 71826863 66251908 60819121 56080321 52275328 48578214 44402082 39949888
17662 39949888 36321172 33645900 31885648 30355256 28811247 27673063 26857922 26080879
17654 26080879 25211648 24220560 23477557 23166723 22587162 22015467 21579537 21037532 20754553
17645 20754553 20810728 21079681 21839843 23272335 25518788 28506598 31216549 33554878 36140270
17636 36140270 38910200 41295422 42644679 43246880 43870752 45208305 47463321 49148485
17628 49148485 48603393 45176003 40291797 36723955 34759659 33859663 33164877 31320996
17620 31320996 27924492 24049633 21381396 19798537 18817729 18209921 17735314 17673992 17622433
17611A7622433o3813j87113l91690m63521p18354n46479k45703q0797j96578j85069
17601A4543316n22609r06992p45317o33690n51549j97381l29004n58277l95602
17592I702895m70530l88057k65536l10944n28844k11828j11484l00680j70121
17583F944871k36113j65714R9949r2716o4547j32204q7798j07143Q7976J03626
17573F350187k8596J0423K6711K6947j53449q1934l2405n1071o025j04056m2121
17562E914611R7036K72664K32057J85949L71757L63900J79920M20914K54705j58457
17552H135056j64873k38574o07047k30365j8894k88387m02821n30117n14693l88872
17542D750413l99689j18642j50171l80106k26770j28827j65535j25009q6756q8641
$$ plain form
17611 17622433 17558620 17371507 16979817 16516296 15797942 15251463 15005760 14924963 14728385 14543316
17601 14543316 14020707 13113715 12368398 11734708 11183159 10985778 10656774 10098497 9702895
17592 9702895 9232365 8844308 8578772 8267828 7738984 7527156 7415672 7114992 6944871
17583 6944871 6708758 6543044 6642993 6550277 6485730 6353526 6265728 6158585 6246561 6350187
17573 6350187 6321591 6332014 6358725 6385672 6232223 6150289 6117884 6066813 6060788 5956732 5914611
17562 5914611 6011647 6284311 6516368 6702317 7074074 7437974 7617894 8038808 8293513 8135056
17552 8135056 7970183 7731609 7124562 6894197 6875303 6586916 6184095 5653978 5139285 4750413
17542 4750413 4350724 4232082 4081911 3701805 3475035 3346208 3180673 3055664 2968908 2880267
17532B880267O6885j7353k32641k11886j67441k02405P8885k3855q7114l6219
17522B047123O4748m7460J876J69994N2151n1474k15019K8965J44634L7016O747
17511B239301L7379q9798m3564r4791K22812L5771J03327L2691n0594J48300K57679
17500B798513L44316M35398M53834K67085L37684L10275J93363J6081N5489M8942
17490E260980j64390j06239l00597q1924o4156j78798l04097l52933l87713k27482
17480C092651n09714m22705k13728l05550k60488N2140J73529n8256j42148J37686
17470A543417o4469J24555O0400m6244o6787l7067J75089j6186n1536J26562J40939
17459A888673K7799J38341j8752L1712K13283J20681J28540J26890K07775N11026
$$ plain form
17532 2880267 2947152 2929799 2697158 2485272 2317831 2115426 2194311 2170456 2083342 2047123
17522 2047123 2111871 2064411 2066287 2236281 2288432 2236958 2021939 2050904 2195538 2232554 2239301
17511 2239301 2276680 2186882 2143318 2048527 2271339 2307110 2410437 2443128 2392534 2540834 2798513
17500 2798513 3142829 3578227 4032061 4299146 4636830 4947105 5140468 5156549 5212038 5260980
17490 5260980 5096590 4990351 4689754 4607830 4543674 4364876 4060779 3707846 3320133 3092651
17480 3092651 2582937 2160232 1946504 1640954 1380466 1432606 1606135 1547879 1405731 1543417
17470 1543417 1478948 1603503 1663903 1617659 1550872 1513805 1688894 1672708 1621172 1747734 1888673
17459 1888673 1916472 2054813 2036061 2067773 2281056 2401737 2530277 2657167 2864942 3375968
17449C375968M78802K21141Q9646L78088M99731J04908J23360J27122j04920j35306
17439E158540P4858m493k85845j37416O9303k76668l13316k90341j65433n4710
17429C774479k20861k97500k8288L5918J39081J608k2061J22640L30950J91224
17419D027190K27981K33055J29698O9778r7910j22409k1616J15504J33351M0544
17409D735166j1887j01392R279l7216J26767J70400K11870M74521N45697R53117
17399G076322J427576K001215K752521L955507N356965N906657N556171N490037
17391C9522971M974358L897539K001819J49574j43793N46320J409171J737011
17383E4094970R92847j889880n857960q778068q677752o155775l577110k118625
$$ plain form
17449 3375968 3854770 4075911 4165557 4543645 5043376 5148284 5271644 5398766 5293846 5158540
17439 5158540 5233398 5228905 4943060 4805644 4874947 4598279 4284963 3994622 3829189 3774479
17429 3774479 3553618 3256118 3227830 3263748 3402829 3404437 3382376 3505016 3835966 4027190
17419 4027190 4255171 4488226 4617924 4687702 4589792 4467383 4445767 4561271 4694622 4735166
17409 4735166 4723279 4621887 4631166 4593950 4720717 4891117 5102987 5577508 6123205 7076322
17399 7076322 8503898 10505113 13257634 17213141 22570106 28476763 34032934 39522971
17391 39522971 44497329 48394868 50396687 50546261 50402468 50948788 52357959 54094970
17383 54094970 55087817 53197937 47339977 38561909 29884157 23728382 20151272 18032647
17375A8032647j244162q23397n62269l34434l85283m90740m14809k68211l09762
17366A3199580j34342p3721l45463l77018k43934k41818j15243R7986J16196J44939
17356A2027162L58174O31540R28655J431320K348106L586142N218681O713661
17348C3243441P830159Q641791R102761Q465784P091892N528311M164034L779700
17340H7847873L112959K156211K334484K809643J022136m329374j1209496j5708309
17332F8036127j4904307j0931842o938694m096820k369662j375430p63028j69065
17324B6487279R8064M70574Q77520J128812J470361K386390L462930M273797N414339
17315D6070066P154987Q509248R173440R481067Q778245O937016M508320K500627
$$ plain form
17375 18032647 16788485 15965088 15402819 15068385 14683102 14192362 13777553 13509342 13199580
17366 13199580 13065238 12991517 12646054 12269036 12025102 11783284 11668041 11766027 11882223 12027162
17356 12027162 12385336 13016876 13945531 15376851 17724957 21311099 26529780 33243441
17348 33243441 41073600 49715391 58818152 67283936 74375828 79904139 84068173 87847873
17340 87847873 90960832 93117043 95451527 98261170 99283306 94953932 83744436 68036127
17332 68036127 53131820 42199978 35261284 31164464 28794802 27419372 26656344 26487279
17324 26487279 26585343 27055917 27933437 29062249 30532610 32919000 36381930 40655727 46070066
17315 46070066 53225053 61734301 70907741 80388808 89167053 96104069 100612389 103113016
17307A03113016J314019n10621j882399l219625l627779l287295k787646j927874
17299H7183796j309597j530881k072697l508618m738396n124387m289927k581794
17291F2027499j081890j34794k34746k224971m993471p475382p512883n613136
17283C2756226l647797k362707j701176j398700r51323o89057m04726m03114m08054
17274B0789572j282K61971O57107R30505J556475K672885L960862M971377O535173
17265D2334645P646484Q431629Q976159Q507536O914546N024419L193655J077484
17257I2106557q34244k584412m243463m795875n348853n148391n064187n191728
17249E8895404n485105o167875o185442n153707l960074k615270j889063j660685
$$ plain form
17307 103113016 104427035 103916414 102034015 98814390 95186611 91899316 89111670 87183796
17299 87183796 85874199 84343318 82270621 78762003 74023607 68899220 64609293 62027499
17291 62027499 60945609 60810815 60576069 58351098 53357627 45882245 38369362 32756226
17283 32756226 29108429 26745722 25044546 23645846 22694523 22005466 21600740 21197626 20789572
17274 20789572 20788290 21050261 21707368 22637873 24194348 26867233 30828095 35799472 42334645
17265 42334645 49981129 58412758 67388917 75896453 82810999 87835418 91029073 92106557
17257 92106557 91272313 88687901 84444438 79648563 74299710 69151319 64087132 58895404
17249 58895404 53410299 47242424 41056982 35903275 31943201 29327931 27438868 25778183
17241B5778183j423870j247179j222367j143569r92356j043330r02587q84066
17233A6918859q63462r76840p91089o59693p07654p44094o05970m64352l50526
17224A0755179k80967l19710j79470k22063l08270k36074m2767j92959k72726
17215H700173j70954p152p1729k08044k71572O6145q5226j10002j79722l8479
17205G623438r386j54321k11207j64083j23773J70426M4057J48756J77644J10405
17195G611956l393r7550L4158j16215j46979j71528k05551l5376q3246k30330
17185F555946m57194m61699l29513l25791l55159l36187j56625r0448n5442r6844
17175C891044j49827j07837N8142J03644O4374j33648k12942j65594j15930N2081
$$ plain form
17241 25778183 24354313 23107134 21884767 20741198 19748842 18705512 17802925 16918859
17233 16918859 16055397 15078557 14287468 13627775 12920121 12176027 11570057 11105705 10755179
17224 10755179 10474212 10154502 9975032 9752969 9444699 9208625 9165858 8972899 8700173
17215 8700173 8529219 8522067 8450338 8242294 7970722 8036867 7951641 7841639 7661917 7623438
17205 7623438 7614052 7459731 7248524 7084441 6960668 7131094 7175151 7323907 7501551 7611956
17195 7611956 7608563 7511013 7545171 7428956 7281977 7110449 6904898 6869522 6786276 6555946
17185 6555946 6098752 5637053 5307540 4981749 4626590 4290403 4133778 4043330 3987888 3891044
17175 3891044 3741217 3633380 3691522 3795166 3859540 3725892 3512950 3347356 3231426 3283507
17165C283507R6994Q9494l0825n5999k18699o9522j1199o000j34966O2772j37034
17154B868523k34331m8229O448m3388j43921j59886r8438q5259j37571p1171k19345
17143A633432k04164j10417p111P8198J64890j20800k47513j12939P883n867Q7118
17132A162710k0697k34234j4813j06750j3273J19342J44992k2667m2399Q0127
17122A052338N9836o1964l4400J63618J28934r9852o6142L390L3838N8778p4069
17111A164305N6000O1881j13669j30755m9791j20696k5238K31856n6453k47942
17101G69498j29552N0885J75286J207j46637J1379n2496j33767m1394R1906j8967
17090E77348n5805k14003o9461K4488R9298j09814j32907j18642p6513o1560M8667
$$ plain form
17165 3283507 3380501 3469995 3439170 3383171 3164472 3094950 3083751 3077751 2942785 3005557 2868523
17154 2868523 2634192 2585963 2592411 2549023 2405102 2245216 2146778 2061519 1923948 1852777 1633432
17143 1633432 1429268 1318851 1311740 1389938 1554828 1434028 1186515 1073576 1081459 1075592 1162710
17132 1162710 1142013 907779 892966 786216 772943 892285 1037277 1014610 972211 1052338
17122 1052338 1112174 1050210 1015810 1179428 1308362 1208510 1142368 1145758 1179596 1238374 1164305
17111 1164305 1220305 1282186 1168517 1037762 987971 867275 842037 1073893 1017440 769498
17101 769498 639946 690831 866117 867324 720687 732066 679570 545803 504409 596315 577348
17090 577348 521543 307540 238079 262567 361865 252051 119144 502 -76011 -137571 -88904
17079h8904Q8889J91793o8034J8205J11264j19604J2497M1640K9756K5423o140
17068B36785K428k04747k67942k58384O6625K86798J42686L1826K2479L8229L9853
17057A36636j0796n3619P9995j48044j3746J12049q3366j46677j19290J12911
17047a33947J58624K4721r4327n0597j7399k9555P879J33127r484j26105m55J00325
17035c7193Q0904j5215R1586P9733o3938k08527m3796L9046l0568j68777j8082
17024b94827m037J57069O9599R3951o4775K0491K3666j5371L9786j6861n7136
17013d8445o7112l253n8134k01764K4231J43524N8669j2145N2419K0232l8468
17002a30246L1329l8678l0490j12074j26537N7399j4219M8044J52725j82030o9753
$$ plain form
17079 -88904 -15 191778 123744 141949 253213 133609 146106 187746 217502 242925 236785
17068 236785 239213 34466 -233476 -491860 -425235 -138437 4249 36075 58554 96783 136636
17057 136636 125840 72221 152216 4172 -9574 102475 19109 -127568 -246858 -133947
17047 -133947 24677 49398 -44929 -95526 -112925 -142480 -134601 -1474 -10958 -137063 -137518 -37193
17035 -37193 43711 28496 120082 199815 135877 -72650 -116446 -77400 -107968 -276745 -294827
17024 -294827 -298864 -141795 -72196 21755 -43020 -22529 1137 -14234 25552 8691 -48445
17013 -48445 -115557 -118810 -176944 -378708 -354477 -210953 -152284 -164429 -112010 -91778 -130246
17002 -130246 -98917 -137595 -168085 -280159 -406696 -349297 -363516 -315472 -162747 -344777 -414530
16991d14530Q7535L19375j9715j37530k30933j19450R3468r858L7140O6327l6609
16980c64780K13385R7467r85L4831j40659q8618p2113q0306N0709n2386J72900
16969b30555J27874r972m3428j11726l030P8830l4790L7028r6834j52164j16959
16958e55726M9143J51724J46735K2081o3074M6967p1450J6196M269l987j0449
16947b67571J02318K19610l7952P7833o5224j28598r6518O0475j41178J7382n5047
16936c14470q4730l0742J91610J63336n9448j39790j06867j75589J19208P2417
16926c65065o7341Q8171K587K0660q3360j79415j7770O9979J74701N1986J33605
16915a71262O5701K6761m6026k2126J36832o621k74259j9862J3870N408J0863
$$ plain form
16991 -414530 -326995 -7620 -27335 -164865 -395798 -515248 -421780 -431638 -394498 -328171 -364780
16980 -364780 -151395 -53928 -54913 -20082 -160741 -249359 -321472 -401778 -351069 -403455 -230555
16969 -230555 -102681 -112653 -156081 -267807 -270837 -192007 -226797 -189769 -286603 -438767 -555726
16958 -555726 -506583 -354859 -208124 -186043 -249117 -202150 -273600 -257404 -253135 -257122 -267571
16947 -267571 -165253 54357 16405 94238 29014 -99584 -196102 -135627 -276805 -259423 -314470
16936 -314470 -399200 -429942 -238332 -74996 -134444 -274234 -381101 -556690 -437482 -365065
16926 -365065 -432406 -344235 -341648 -320988 -404348 -583763 -601533 -531554 -356853 -304867 -171262
16915 -171262 -105561 -78800 -124826 -146952 -10120 -16741 -291000 -310862 -296992 -291584 -280721
16904b80721r2538r1527K79915R3310k26989j87898J31580L0687n2039j9577K5151
16893c90646l9402n4601l3893J41549N3517j04654j02086J20730K35222L6787
16883a37477O1365K900j40438k8234k895K03700K41985M3300p5429j82667k80912
16872b94802J27481K27666o2194k5846O7325o7287l8553R1212j841r8782o8491
16861a44112N1398N7975K4694J14424k4028k97988m0503P691J8788O6999L414
16850a61248l7272O6711J22787q7674J8139j07026j18785O3009R8905J04397o6278
16839a04335K7913j0515J2116j6136J61164O9006R7776K7519M9292j8077n8011
16828B37712O8766J39812k8513M0593L4848l6497k7879M4634j3247P9182n2392
$$ plain form
16904 -280721 -373259 -464786 -184871 -91561 -318550 -506448 -374868 -344181 -396220 -415797 -390646
16893 -390646 -430048 -484649 -518542 -376993 -323476 -428130 -530216 -409486 -174264 -137477
16883 -137477 -76112 -73212 -213650 -241884 -244779 -41079 200906 244206 168777 -13890 -294802
16872 -294802 -167321 60345 -1849 -27695 39630 -27657 -66210 25002 23161 -75621 -144112
16861 -144112 -92714 -34739 -10045 104379 80351 -217637 -258140 -250449 -231661 -164662 -161248
16850 -161248 -198520 -131809 -9022 -96696 -78557 -185583 -304368 -241359 -142454 -38057 -104335
16839 -104335 -76422 -86937 -74821 -90957 70207 139213 236989 264508 313800 295723 237712
16828 237712 306478 446290 417777 458370 493218 456721 428842 473476 460229 539411 487019
16817D87019N6554J3598M5916j8102r7816j18646q3146R5317O0778o876k4049
16806D10547m7392r6823j10350K8453J40668j88935p330J02852O056J2460J00456
16795C50662M9575r3911o8218k09792J5589J36604R5189j3863O8490J88075O1272
16784E79672j56219q7864P8409o924j20310j19105N8349J9458k40558r4602J94073
16773A04379J83793L0449K5237L5550j6255Q4725J8238j56730J21081K09713k721
16762F37459k02899j13103K061J4113j0225P2581p9414q1727j13130j1817j7952
16751I5947r2665M24J41290J50202J53603J5718k68247j55896r5677L6195J23845
16740A04739M1828j82221l9870J16360j39671j91811m7990M4467L2920J06411
$$ plain form
16817 487019 543573 557171 603087 584985 487169 368523 285377 380694 441472 434596 410547
16806 410547 363155 266332 155982 184435 325103 136168 128838 231690 237746 250206 350662
16795 350662 400237 306326 238108 28316 43905 180509 275698 261835 330325 518400 579672
16784 579672 423453 335589 413998 407074 286764 167659 226008 245466 4908 -89694 104379
16773 104379 288172 318621 343858 379408 363153 447878 466116 309386 430467 640180 637459
16762 637459 434560 321457 323518 337631 327406 399987 320573 238846 125716 113899 95947
16751 95947 3282 3706 144996 295198 448801 464519 196272 40376 -55301 -19106 104739
16740 104739 146567 -35654 -75524 40836 -98835 -290646 -338636 -294169 -261249 -154838
16730a54838L541q645J50534J64198J33737L2760k08757j16630j03453j2077J35100
16719A5470j14346j3904j02794j34903N3082J8706p4117J08784n2773m5286K4831
16708c17250k6197K31060J10264l8068O5036j46923L291O9744N615k1797j54527
16697b19752o9074k3925O3704J64126J1794j01834j58484j00866j3725O8157j2409
16686c92288j3006j3961R0237J40828L46589J63689k69739j66482m9361Q5696
16676g7798o6580j23837J17711K16671m1259r5238L5687N1082K5935o9734j82652
16665b10012j13939j42506R6139P7690Q4206J02722K2179p9329o0017J08314K514
16654a12039P3744J28635Q2284k44417j00206J07373l8791J1758j77977m4296
$$ plain form
16730 -154838 -151297 -159942 -9408 154790 288527 321287 112530 -4100 -107553 -119630 15470
16719 15470 -98876 -112780 -215574 -350477 -297395 -278689 -352806 -244022 -296795 -342081 -317250
16708 -317250 -343447 -112387 -2123 -40191 24845 -122078 -118787 -49043 -43428 -65225 -219752
16697 -219752 -288826 -312751 -249047 -84921 -73127 -174961 -333445 -434311 -448036 -379879 -392288
16686 -392288 -405294 -419255 -329018 -188190 158399 322088 52349 -114133 -163494 -77798
16676 -77798 -144378 -268215 -150504 66167 24908 -70330 -34643 16439 42374 -27360 -210012
16665 -210012 -323951 -466457 -370318 -292628 -208422 -105700 -83521 -162850 -222867 -114553 -112039
16654 -112039 -38295 90340 172624 -71793 -171999 -64626 -103417 -91659 -269636 -313932
16644c13932K932p2066n15J97519J29113K4709p4565R2495k04053j04303J19691
16633b02975k7042r9196J21999K08379J36178k04773j68407j22981j62781J38051
16623c83548K22241J42528p2685j32508J25005k0291k93904j42609Q1672n6648
16613e30747J16681N8545n4407n0018P0500K26163R899j54635j49143J16575k3554
16602c64141P6869J32494J93939n4925j38329q7616O0551l1836l6313l6138O4816
16591b20629J76093o2573o2366J29755O0328J6332l1700K9145j78760l1668P3753
16580a02290q4219M7814L5057m4788k9919j39084j1445q117J6299N1895J73068
16569i5729N8596M78q0583r4593o5494p8003k9711L2851Q6965l1916q3342q586
$$ plain form
16644 -313932 -311000 -383066 -383581 -186062 -56949 -32240 -106805 -14310 -218363 -322666 -202975
16633 -202975 -230017 -329213 -207214 1165 137343 -67430 -235837 -358818 -521599 -383548
16623 -383548 -161307 -18779 -91464 -223972 -98967 -119258 -413162 -555771 -474099 -530747
16613 -530747 -414066 -355521 -409928 -459946 -389446 -163283 -153384 -308019 -457162 -340587 -364141
16602 -364141 -287272 -154778 39161 -15764 -154093 -241709 -181158 -212994 -249307 -285445 -220629
16591 -220629 -44536 -107109 -169475 -39720 20608 36940 5240 34385 -144375 -176043 -102290
16580 -102290 -186509 -138695 -103638 -148426 -178345 -317429 -328874 -336991 -320692 -268797 -95729
16569 -95729 -37133 -36655 -117238 -211831 -277325 -355328 -385039 -352188 -265223 -297139 -380481 -389067
16557c89067O586J68247l5552P6246J93573n8900j91919q4780J09364J1415Q510
16546a86277j8096j19727k4699J42432J46742k70073o9014J35666l2143p4603
16536c69792Q3404J134l9620J08660J58379o5620p2837J05352j27175n4996N9096
16525b14015J32271j33886j26310o3036m2360L2599J17355J86730k5007J5307
16515a20352Q7193k4794r7970k6481r980Q2284K9669N9371J8506l3381q2613k20772
16503c39320j90221J01296K27952J29384m2571J6497N5918l2069j12299J8589
16493a66844M3605o4372R2304J51099N8491l516k31592l0226j4840Q7715N0226
16482b7950j8581r1565p5223m0674j42952j3094J00747j85934q5241K42303M8688
$$ plain form
16557 -389067 -382481 -214234 -249786 -173540 20033 -38867 -230786 -315566 -206202 -194787 -186277
16546 -186277 -204373 -324100 -348799 -206367 -59625 -329698 -398712 -263046 -295189 -369792
16536 -369792 -286388 -285254 -324874 -216214 -57835 -123455 -196292 -90940 -218115 -273111 -214015
16525 -214015 -81744 -215630 -341940 -404976 -447336 -414737 -297382 -110652 -135659 -120352
16515 -120352 -33159 -57953 -155923 -182404 -192384 -110100 -80431 -21060 -2554 -35935 -118548 -339320
16503 -339320 -529541 -428245 -200293 -70909 -113480 -96983 -41065 -73134 -185433 -166844
16493 -166844 -123239 -187611 -95307 55792 114283 110767 -120825 -151051 -165891 -78176 -27950
16482 -27950 -46531 -138096 -213319 -253993 -396945 -410039 -309292 -495226 -580467 -338164 -289476
16471b89476J1079P0877R8248L4579o4303L3865K4709K5689R597q6213r1546K1765
16459b01130R7510j18962j36749k9316J82772K0801l30260n888J33798J13126
16449b74298l8412J60016J79996n0847k05418n1856o8183o3336J8638K15475r185
16438a87410o9742n1346R3228K9542p4784N1437J05009m4168J53962q3158k54283
16427c31713n2620J11876K76567J00165j68775j09237M0786l5649l8001j8614
16417b25215j0417j09355j60633q3182K91403K727j0931J742n2905M3121L4953
16406b78692n5096r8109N1338L0406J29879K17851J42828l2352o1477n044o1986
16395b0454Q8168o234j31418j42758m0996J35635J22959K8395j34721n960n1127
$$ plain form
16471 -289476 -278397 -207520 -109272 -74693 -138996 -105131 -80422 -54733 -45136 -131349 -222895 -201130
16459 -201130 -103620 -222582 -359331 -388647 -205875 -185074 -515334 -521222 -387424 -274298
16449 -274298 -312710 -152694 27302 -23545 -228963 -280819 -349002 -412338 -393700 -178225 -187410
16438 -187410 -257152 -308498 -215270 -185728 -260512 -209075 -104066 -148234 5728 -77430 -331713
16427 -331713 -384333 -272457 4110 104275 -64500 -173737 -132951 -168600 -206601 -225215
16417 -225215 -235632 -344987 -505620 -588802 -297399 -294672 -305603 -303861 -356766 -313645 -278692
16406 -278692 -333788 -431897 -380559 -350153 -220274 -2423 140405 108053 46576 41532 -20454
16395 -20454 67714 61480 -69938 -212696 -253692 -118057 4902 33297 -101424 -107384 -158511
16384a58511k1088J45892m7047n531q5732l8029K0926j25889j58573J4830L6336
16373d22416K6171J46769K8749j72668j21639K06042O3703j7516j32206J14359
16363b80652N4813j12592N1029N056p3691O2324P4262k2314m2470p8089M9453
16352c12871o3378O5631J95737J06549j18261j47986M2523J66321M1487J52525
16342A28277p6952j21519j74368k04807J38108N0046j04135P5472M9821j0422
16332b50479p3169L9447k3395j00271o5530J12332N4546J753n7767O6674n1000
16321c46859n4669j4297K733J20993Q240J82581J11228R1084M8600k30656j88890
16310b69912j20887k3755m2908j90568Q9592K48291J45719k5487N0427J4167j9419
$$ plain form
16384 -158511 -179599 -33707 -80754 -86285 -172017 -210046 -189120 -315009 -473582 -458752 -422416
16373 -422416 -396245 -249476 -220727 -393395 -515034 -308992 -245289 -262805 -395011 -280652
16363 -280652 -225839 -338431 -287402 -282346 -356037 -293713 -219451 -241765 -284235 -362324 -312871
16352 -312871 -376249 -310618 -114881 -8332 -126593 -274579 -232056 -65735 -24248 128277
16342 128277 51325 -70194 -244562 -449369 -311261 -261215 -365350 -289878 -240057 -250479
16332 -250479 -323648 -284201 -307596 -407867 -473397 -361065 -306519 -304766 -362533 -295859 -346859
16321 -346859 -401528 -415825 -413092 -292099 -283859 -101278 9950 101034 149634 -81022 -269912
16310 -269912 -390799 -414554 -457462 -648030 -558438 -310147 -164428 -189915 -139488 -125321 -144740
16299a44740k22820q8116J44182O4017j37706l2322P8630O9099o5502j33625O6376
16288d02527J33825j2853P1984o869o5678r6263j92661K8989J92405J79951L837
16277a65860j24986J26148m7647n2112J39750J24947m1489N1159P2994p9315j13409
16266a09820j1433k6417Q0984j45096j04035M111O7994J80701K7133n8742k35135
16255c29755j36001O8646J87510J35843O0637K813j32463M7561l5581k45047K8002
16244c47835J73906r8801j11385J48539O8160k2881O4245N0115M9916j58748m5703
16233b30472k1896n2804k9096K12273J30819m475j13051n4349p1575P0397Q0259
16222h3970N3996J5450l42884p4408P9287M1502Q892M2028J02374n3214J43456
$$ plain form
16299 -144740 -367560 -455676 -311494 -247477 -385183 -417505 -338875 -269776 -335278 -468903 -402527
16288 -402527 -268702 -281555 -209571 -216440 -282118 -378381 -571042 -542053 -349648 -169697 -165860
16277 -165860 -290846 -164698 -212345 -264457 -124707 240 -41249 9910 82904 3589 -109820
16266 -109820 -121253 -147670 -66686 -211782 -315817 -311706 -243712 -63011 -35878 -94620 -329755
16255 -329755 -465756 -397110 -209600 -73757 -13120 -10307 -142770 -95209 -130790 -375837 -347835
16244 -347835 -173929 -272730 -384115 -235576 -167416 -190297 -126052 -75937 -26021 -184769 -230472
16233 -230472 -252368 -305172 -334268 -121995 8824 4349 -108702 -163051 -234626 -164229 -83970
16222 -83970 -29974 -14524 -357408 -431816 -352529 -311027 -302135 -260107 -157733 -210947 -67491
16211f7491L5205L7460j05492K2371O3700p0814k748K7767J9771q9534k75795
16200d05600k9673Q6252p1298J75162q47k762j24589M3409J80110J9018l8666
16189a69484J3116p5795M0160J7863J7021P2622m2333j32037j31177j20097J44704
16178c65437K16924N8223j2781r5851J25280l3640j53522l8134o3843n4207n3137
16167d70125R7287L0246j12425k0029J44768J05057K2475J30463n0883q8355L4435
16156a77086k4663p635K44655J44559n1076k60293k60576j81645P687O3314J26136
16145c76623J9850N4850M9727m4424j1431P8542J8616K7158N5365k8794O532J08187
16133d2445p3309m6870N3931K79054O3241m8690j41800j7339P6587L6829K0389
$$ plain form
16211 -67491 -32286 5174 -100318 -77947 -14247 -85061 -87809 -60042 -40271 -129805 -405600
16200 -405600 -435273 -349021 -420319 -245157 -246004 -248766 -373355 -329946 -149836 -130818 -169484
16189 -169484 -156368 -232163 -192003 -174140 -157119 -84497 -126830 -258867 -390044 -510141 -365437
16178 -365437 -148513 -90290 -103071 -198922 -73642 -107282 -260804 -298938 -362781 -416988 -470125
16167 -470125 -372838 -342592 -455017 -475046 -330278 -225221 -202746 -72283 -123166 -211521 -177086
16156 -177086 -201749 -209384 35271 179830 128754 -131539 -392115 -573760 -566073 -502759 -376623
16145 -376623 -356773 -301923 -252196 -296620 -308051 -229509 -210893 -183735 -128370 -157164 -150632 -42445
16133 -42445 -115754 -162624 -108693 170361 233602 184912 43112 25773 102360 139189 159578
16122A59578k05787j16029P3882k4871Q7432l8295J01664J40378j02866r7203
16112b2117r9276O1021m7293j17625j9418j13737J17653J8189n5734N5019l2591
16101b55909m2006L7524O9272N2761N4560P1852l9994j29488P905n131J30261
16090d8393N6045j6734j7866j91572n3633J22106P8525k3664p6725J66507J5117
16079I713L047q1264l072J52634k2582J0312j0324J07490j26943k22930p6098
16068b60017n9334j21268l5337J65537K70371j24493j11666L3662J17207m3580
16058a68918p2201j28674J73149R3108o3515l5310J16p2878Q9801K4553J8625
16047a42144j22644m1869J18853J04110r4801j35951j1927P9519r9079r8897J30376
$$ plain form
16122 159578 -46209 -162238 -88356 -113227 -25795 -64090 37574 177952 75086 -22117
16112 -22117 -121393 -60372 -107665 -225290 -244708 -358445 -240792 -222603 -278337 -223318 -255909
16101 -255909 -297915 -260391 -191119 -138358 -83798 -11946 -51940 -181428 -173523 -178654 -48393
16090 -48393 7652 -9082 -26948 -218520 -272153 -150047 -71522 -95186 -171911 -5404 9713
16079 9713 12760 -68504 -71576 81058 58476 68788 58464 165954 39011 -183919 -260017
16068 -260017 -319351 -440619 -475956 -310419 -40048 -164541 -276207 -242545 -125338 -168918
16058 -168918 -241119 -369793 -196644 -103536 -167051 -202361 -202245 -275123 -185322 -160769 -142144
16047 -142144 -264788 -306657 -187804 -83694 -178495 -314446 -326373 -246854 -345933 -444830 -314454
16036c14454J54220l9874n8118M6984l8247j772m9674o8927K1810J9842n9503
16025c87713J85913L6620N2921m720J57299j1001j25961m6397P3811p6736r099
16014a55063k02852N2521J7485o61J88164J33480j4304r6286j74288M1956L7090
16003a72758r4728j54766L35398J16715j03557r1114J2595l3585K9023J78134
15993B1357j30573p6087O8764J01550Q1891l6707o0698k10078j11667K4500N1515
15982b76233J61376J17086q792j01659m8225J6918J82434k28376O4310J00265
15972b0896n6827j49390j3074j4682L5195p8654K3076J79126K13476J10855j7437
15961B10768j90157q5317k4054o2815q3210O1590J57338j6714j29793M9019R8260
$$ plain form
16036 -314454 -160234 -200108 -258226 -211242 -249489 -251261 -300935 -369862 -348052 -328210 -387713
16025 -387713 -201800 -165180 -112259 -116979 40320 29319 -96642 -143039 -69228 -145964 -155063
16014 -155063 -357915 -305394 -287909 -288570 -100406 33074 18770 -77516 -251804 -209848 -172758
16003 -172758 -267486 -422252 -86854 29861 -73696 -164810 -152215 -185800 -156777 21357
15993 21357 -109216 -185303 -116539 -14989 66902 30195 -30503 -240581 -352248 -327748 -276233
15982 -276233 -114857 2229 -6563 -108222 -156447 -139529 42905 -185471 -121161 -20896
15972 -20896 -77723 -227113 -240187 -254869 -219674 -298328 -275252 -96126 117350 228205 210768
15961 210768 20611 -64706 -88760 -151575 -234785 -173195 -15857 -32571 -162364 -113345 -15085
15950a5085Q546m283j01815q4227J00674o6323L6210R5646j52436K4704O3828
15939i4561l4115J8713M7672M6316L7149o7453q5470k2503j10777q4026K11552
15928a37503J54122q0906m3792N4721K5758q5025q3646O0995J32707K30195o4570
15917A63056k33757j14606o1051J09371J66122k2923p3182L9340k8194j48583
15907b04407k7661L1744J60945O1818j49093k62917j2312P8366K28108P8660l5628
15896e2377L0964M4099n986K5908K6359N4259J602j43223n4062k11752o2365J5346
15884c31228J94533l0161j24061Q2193O1692O43J28224j163j50027N4080K84310
15873A69035K7410m509j9510o5779l151Q7771j83866j23464j23282l6605J20472
$$ plain form
15950 -15085 -6539 -10822 -112637 -196864 -96190 -162513 -126303 -30657 -183093 -158389 -94561
15939 -94561 -128676 -109963 -62291 -15975 21174 -46279 -131749 -154252 -265029 -349055 -137503
15928 -137503 16619 -64287 -108079 -53358 -27600 -112625 -196271 -135276 -2569 227626 163056
15917 163056 -70701 -185307 -246358 -136987 29135 6212 -66970 -27630 -55824 -204407
15907 -204407 -232068 -200324 -39379 22439 -126654 -389571 -401883 -323517 -95409 -16749 -52377
15896 -52377 -21413 22686 16700 42608 68967 123226 124828 -18395 -72457 -284209 -346574 -331228
15884 -331228 -136695 -166856 -290917 -208724 -147032 -146389 -18165 -19328 -169355 -115275 169035
15873 169035 196445 191936 172426 106647 103496 191267 7401 -116063 -239345 -275950 -155478
15862a55478J29843L8888q6187o4388R6195j67188K5138N9049J11213n7655r2933
15851a63503P9181J80809l8660J43848l6936p9809j7288O2421q2906j47791j1868
15840a12502J28082k3025k04913n8664J53433J07675M4067k99438K1956K9859
15830b13470L4124R5998J42538K127n8761j35914j36375j10698l492J00516N2157
15819b31250K23496K14133M8468r6174m9494q8465l247r6052r6133J59000P6207
15808F0489j36342M8589k145J81913N8331j47058N6824l6087p0028o9739K4159
15797c1094O9008L7232r3585q4619n0195l4904N8645K9307J72572k573J19972
15786A89766l1241Q5517j36257o1028O6822j14659j6070p2155k7914q547P4101
$$ plain form
15862 -155478 -25635 13253 -72934 -137322 -41127 -208315 -183177 -124128 -12915 -70570 -163503
15851 -163503 -84322 96487 57827 201675 164739 84930 67642 130063 47157 -100634 -112502
15840 -112502 15580 -7445 -212358 -271022 -117589 -9914 34153 -265285 -243329 -213470
15830 -213470 -179346 -83348 59190 61317 2556 -133358 -269733 -380431 -383923 -283407 -231250
15819 -231250 -7754 206379 254847 158673 109179 20714 17467 -78585 -174718 -15718 60489
15808 60489 -75853 -27264 -29409 152504 210835 63777 120601 84514 14486 -55253 -31094
15797 -31094 37914 75146 -18439 -103058 -153253 -188157 -129512 -100205 72367 69794 189766
15786 189766 158525 244042 107785 46757 113579 -1080 -17150 -89305 -117219 -125766 -51665
15775e1665N5788r522k02009k00005J02108Q17J24091Q0434Q5656j76277J64272
15764b6312j1422J4543L5299j86525m5486J52620K4107o3658k284J39095L4674
15753F4651q2053P069m2207k793l4264N3560P0183j7342l8588q0352k4901J00775
15741b6262J28043j25720k10627l9732L1899K3595M2667J02341o9668j38412j9720
15730c01596J3084J30820J50249J18981K3693q0826k36062k01866N6968P7945
15720b48610J9283o4344k5858N367J56420J54387M5925L7131k4241o262j03699
15709e4501k2377M9293O9109m8505j04686O6922j46452j01461J29073J41055Q9033
15698F6503O4584Q020l4240J7464j1663J41431K1801J6086k8553R4477j7576J17742
$$ plain form
15775 -51665 4123 -5399 -207408 -407413 -305305 -304488 -180397 -99963 -14307 -190584 -26312
15764 -26312 -37734 -23191 12108 -174417 -219903 -67283 -43176 -106834 -109118 29977 64651
15753 64651 -17402 -10333 -52540 -55333 -89597 -36037 34146 16804 -21784 -102136 -127037 -26262
15741 -26262 101781 -23939 -234566 -274298 -242399 -218804 -176137 -73796 -143464 -281876 -301596
15730 -301596 -288512 -157692 -7443 111538 135231 54405 -181657 -383523 -326555 -248610
15720 -248610 -229327 -293671 -319529 -314162 -157742 -3355 42570 79701 55460 49198 -54501
15709 -54501 -76878 -27585 41524 -6981 -111667 -44745 -191197 -292658 -163585 -22530 66503
15698 66503 131087 139107 104867 122331 110668 252099 273900 289986 261433 355910 338334 456076
15686D56076J72510J37306P785J35547K63309L44569L82813N17042O42879Q71389
15676C931225Q09842N23417N23375L59683J00531p1454k68549l99671l85619p07201
15666D415579n60371m92179o20291m80119l46931l04201j90669j5050j49529j86884
15656A069355k35621q0525K8232j7266L0975j26026p0405r2539j83399L5689J60438
15645E18908J36713l7412m4472j03124j01300l5400k8330N9949L5638L3422n9588
15634C75004j49082j53109R6421J20749r9709j04149J06290L2371M661J79966
15624D09413p2061q1411j09576k11592k9908P4315K80889L4018j58142j81268
15614d5323O8143M0783o1649j39896N7399L0724J11738q7339n1676J776K9939
$$ plain form
15686 456076 628586 765892 773677 909224 1172533 1517102 1899915 2416957 3059836 3931225
15676 3931225 4741067 5264484 5787859 6147542 6248073 6176619 5908070 5508399 5122780 4415579
15666 4415579 3855208 3363029 2742738 2262619 1915688 1611487 1420818 1405768 1256239 1069355
15656 1069355 833734 753209 781441 764175 795150 669124 598719 506180 322781 358470 518908
15645 518908 655621 618209 573737 470613 369313 333913 305583 365532 401170 434592 375004
15634 375004 225922 72813 169234 289983 190274 86125 192415 224786 229447 409413
15624 409413 337352 255941 146365 -65227 -95135 -20820 260069 294087 135945 -45323
15614 -45323 22820 63603 1954 -137942 -80543 -49819 61919 -25420 -77096 -75320 -45381
15603d5381O0395R4295p2484p7275q0568j992Q0651M3227l0647Q682J55510k57796
15591a23383p1502J03101J52344p48L6796J27611J4700K4978Q7255n2980r8386
15580A99786j0747n4000k03554K2210k1463K0199j9507m842n0825j40901k9065
15569b92709J11113R0713K7414J55250M2297q0884j71315j6148N6472O0224L1087
15558A3514m4700j67244l9611p567J88809q8861m477J01990Q0831n4806j55088
15547a77210K2874j2507L259J0379k49653J94849J0260k3793M2961J66826m3534
15536e5289l0540J04899K1725O0850Q6936q0641k8526N5156L3919L0052J7088
15525B15629p9307k027J01267P6956o4778j08949j80809j44970L25o2707O6813
$$ plain form
15603 -45381 15014 109309 36825 -40450 -121018 -123010 -42359 868 -29779 -21097 134413 -123383
15591 -123383 -194885 -91784 60560 59812 96608 224219 238919 263897 351152 298172 199786
15580 199786 189039 135039 -68515 -46305 -67768 -47569 -67076 -71918 -122743 -263644 -292709
15569 -292709 -181596 -90883 -63469 91781 134078 53194 -118121 -134269 -77797 -17573 13514
15558 13514 -31186 -198430 -238041 -245608 -56799 -145660 -150137 -48147 32684 -22122 -177210
15547 -177210 -154336 -166843 -163584 -153205 -402858 -208009 -197749 -221542 -178581 -11755 -55289
15536 -55289 -85829 19070 40795 101645 188581 107940 79414 134570 168489 198541 215629
15525 215629 136322 134295 235562 312518 247740 138791 -42018 -186988 -186663 -249370 -182557
15514a82557j01066K824O7914P4579P4022J28365j18468k2433M5046N7006o1091
15503c5859J9363M5111M0707P2538P05j04416l15984j80883J30988K90050l7106
15492g4786j3092k8252n2918N1714Q8069q1453j65276j02343j7281Q0363K53311
15481f1944m9380r6328R2910O7802J19141m6686R119j5801j7212j55615k01094
15470c55088p545J46477J26733P0449J00147N746n9426o2029n2293P7132l629
15459a3326k55971J2819L6343J28594J35260p5567J2909P9365m5704j39768J7037
15448a08009j17256j12653q6828J12546J92632L1996J0j84246j50108J15975l7317
15437c43258L4617J94195J0277k6615p0407P1288L9638K7873M1648L9906j4381
$$ plain form
15514 -182557 -283623 -280799 -212885 -138306 -64284 64081 -54387 -76820 -31774 25232 -35859
15503 -35859 -16496 28615 69322 141860 142565 38149 -277835 -458718 -327730 -37680 -74786
15492 -74786 -87878 -116130 -169048 -117334 -29265 -110718 -275994 -378337 -395618 -315255 -61944
15481 -61944 -111324 -207652 -114742 -46940 72201 25515 34634 18833 1621 -153994 -355088
15470 -355088 -362633 -216156 -89423 -18974 81173 86919 27493 -34536 -86829 -9697 -13326
15459 -13326 -269297 -256478 -220135 -91541 43719 -31848 -18939 60426 14722 -125046 -108009
15448 -108009 -225265 -337918 -424746 -312200 -119568 -87572 -87562 -271808 -421916 -305941 -343258
15437 -343258 -308641 -114446 -104169 -130784 -201191 -129903 -90265 -62392 -20744 19162 4781
15426D781L4837o1448r2281p0045k6389N86K96264J37280o815N8460j22444m3081
15414A09705M7055n8595n9832j36165j95069o7J51900J88723j56339j64242j05706
15403c78632p488J62541J64732k60298J8239J59833Q9487P2623N1243p4012j10219
15392a11951J81519r572j32527Q5613N645N377L1671J2122j06939J9768m5899
15381f5173j5610l416L1246p8358o5283m2347M869M24r9320J56152K8608k3585
15369a71793k3025O2240N0063p7554j15425R9189J37328R605L0414J693L3197
15358C5932k471j04985k1449N3709P9594R5975k4705r1714o9430l1780N1916K0198
15346i210J44305J27673J28379J8770L8722L5279J71246J0272k31044q1820k9968
$$ plain form
15426 4781 39618 -21830 -114111 -184156 -210545 -209959 86305 223585 216770 275230 152786 109705
15414 109705 156760 98165 38333 -97832 -292901 -292968 -141068 47655 -108684 -272926 -378632
15403 -378632 -386120 -223579 -58847 -319145 -300906 -141073 -51586 21037 72280 -1732 -111951
15392 -111951 69568 59996 -72531 13082 18727 24104 55775 67897 -39042 -19274 -65173
15381 -65173 -80783 -84199 -52953 -131311 -196594 -238941 -234072 -233648 -332968 -176816 -148208 -171793
15369 -171793 -194818 -132578 -82515 -160069 -275494 -176305 -38977 -29372 1042 2735 35932
15358 35932 33461 -71524 -92973 -39264 40330 136305 111600 19886 -49544 -81324 -29408 -9210
15346 -9210 135095 262768 391147 409917 448639 483918 655164 665436 434392 352572 322604
15335C22604j81219l1557Q5526n211p383m6923m2643j4090K373J00238j08574
15324G3141K5566K70889M7149k06169p3155n4368J6733j1247j47435M0700n418
15313b3614j55456K4172O7171Q7271r4808r2009P1518P5525p6698j58361M3677
15302b31612J556N2322j46318k8738J32045j32009L2088K37232L3701M418j94068
15291b39383r3237J16514O0483p4838n0470J67821K15007Q6052R2501K7143n7850
15280B49743o9407J4338r199q0067j03357n1678L9416R7456o6483q9824j88049
15269b57111P121K14340J73976N9294k0593j93616l37912j2364J08558P7611K80022
15258I9326J08023j82637q7377j14009j93874K3084J09325o06J06307N0379j38112
$$ plain form
15335 322604 141385 109828 195354 190143 182760 135837 93194 79104 81477 181715 73141
15324 73141 98707 369596 416745 210576 137421 83053 99786 88539 -58896 -18196 -23614
15313 -23614 -179070 -154898 -87727 -456 -95264 -187273 -115755 -40230 -116928 -275289 -231612
15302 -231612 -230056 -177734 -324052 -352790 -220745 -352754 -320666 -83434 -49733 -45315 -239383
15291 -239383 -332620 -216106 -155623 -230461 -280931 -113110 101897 187949 280450 307593 249743
15280 249743 180336 194674 185475 105408 2051 -49627 -10211 87245 20762 -69062 -257111
15269 -257111 -249990 -35650 138326 197620 177027 -16589 -354501 -366865 -258307 -180696 99326
15258 99326 207349 24712 -62665 -176674 -370548 -347464 -238139 -238745 -132438 -82059 -220171
15247b20171Q9074R3753J21083j58994j31749l4497O8990l3456N8055K2960M354
15236a20598N6074L1148Q1029m5784k5505K5370O9867j1072j64529P4096J9601
15225a0303O1866J46482P3536k02206l4276J10741j06771l663k8615j54843j7984
15214a66036J85426R3644k00402j66599q486J1818J2310N4446j7396J41260J90195
15203A30180M1980j65425j59465j31565R241j8182Q7421l6403M1960Q2968J47748
15192C0458N3895p3404k4899J08619j01099q8184m1916M0846o295j21985k33079
15181d57043r157J565L78549J47763m2262o3496l8498k2396K66806o1618k07484
15170a07271J749K18669o7194j12789J14989Q9915K45846k9859n7921j49400j23341
$$ plain form
15247 -220171 -131097 -37344 83739 -75255 -207004 -241501 -172511 -205967 -147912 -124952 -120598
15236 -120598 -64524 -33376 47653 1869 -23636 1734 71601 60529 -104000 -29904 -10303
15225 -10303 51563 198045 271581 69375 35099 145840 39069 35406 6791 -148052 -166036
15214 -166036 19390 113034 -87368 -253967 -262453 -250635 -238325 -183879 -201275 -60015 130180
15203 130180 172160 6735 -152730 -284295 -275054 -293236 -205815 -242218 -200258 -117290 30458
15192 30458 84353 10949 -13950 94669 -6430 -94614 -136530 -95684 -101979 -223964 -457043
15181 -457043 -466200 -464635 -86086 61677 19415 -44081 -82579 -104975 161831 100213 -107271
15170 -107271 -105522 113147 45953 -66836 48153 138068 383914 354055 296134 146734 23393
15159B3393J72355N5907j92743j99783L9695j5896L2322r0116Q926M2095O0235
15148f3610p546k31053j88248L0030J10119J25911J00025j5647q3653J20151J93225
15137H9704J22172j65387j66946J897J83877M6086M6921J34686q1971k16187K598
15126b550J77334J00520j12053j51491o5101l7348o2645r3596M1032J65568R4199
15115E3869j8270p6158P7668Q9794J47416O168m8899l9317j71094M3736q8747
15104b3834k611J51860Q2790r5339n9552J66262J21501Q3371J8132r0757m1119
15093C10704K5258p614R7898q2408j57277p3172j10489j32846l8215N2327Q3398
15082c2436M9102k83j01129j77909J06218M0556J22629j41923j05404P3640K71551
$$ plain form
15159 23393 195748 251655 58912 -140871 -101176 -117072 -84750 -174866 -165940 -123845 -63610
15148 -63610 -71156 -302209 -490457 -460427 -350308 -224397 -124372 -140019 -223672 -103521 89704
15137 89704 211876 46489 -120457 -118560 65317 111403 158324 293010 211039 -5148 -2550
15126 -2550 174784 275304 163251 11760 -53341 -90689 -153334 -246930 -205898 -40330 53869
15115 53869 35599 -40559 37109 126903 274319 280487 231588 192271 21177 64913 -23834
15104 -23834 -26445 125415 208205 112866 53314 219576 341077 424448 442580 351823 310704
15093 310704 335962 328348 426246 343838 186561 113389 2900 -129946 -168161 -115834 -32436
15082 -32436 16666 16383 -84746 -262655 -156437 -115881 6748 -135175 -240579 -166939 104612
15071A04612R7905J4865l8150k1219j14455m3909j37477K01377K08619L9909j4477
15060B97600r4390N2853N0579L6036O3763M0712p5327n9981L8790J54474K23328
15049G28437Q5494P2842K31588L33273M09195K61847J22811J24558j4726j64599
15039B190720j45455j87875k97092k12688j97647p4825M247k50747j02333P7667
15029H03972o6822j04675j43482j10492j53507q2271J9739k895J35410J04314
15019C99291q0643j40266J48933J06485Q4323j02548n1415k3815j6476l2456n9049
15008B32364l7913o2982L7704n3672j30792J13250J17037j0247k05624n1752J61927
14997A09300J71186J14397R090l03241j44509P1528k16k363O5486J10778J8976
$$ plain form
15071 104612 202517 217382 179232 158013 43558 -351 -137828 63549 272168 312077 297600
15060 297600 203210 256063 306642 342678 406441 447153 371826 311845 350635 505109 728437
15049 728437 813931 886773 1118361 1451634 1860829 2122676 2245487 2370045 2355319 2190720
15039 2190720 2045265 1857390 1560298 1347610 1149963 1075138 1079385 828638 726305 803972
15029 803972 737150 632475 488993 378501 224994 142723 162462 159567 294977 399291
15019 399291 318648 178382 327315 433800 518123 415575 364160 340345 323869 291413 232364
15008 232364 194451 131469 169173 115501 -15291 97959 214996 204749 -875 -52627 109300
14997 109300 280486 394883 403973 100732 -43777 27751 27535 25172 90658 201436 220412
14986B20412k393J18578R3126K2474n465R06j38668p3858Q00j53583P0355Q0228
14974B32912K9173L6136L0282k7511k1529r3943j30232r4213L5860p5337q6486
14963a64888J19986P7361J1722M0918q5703j58061J24188J39935O6495L2479R039
14952B13471J06707o518j19507Q7205J01450m6174L7909j86642j55268K2469j12816
14941e7714n6606N7655O7098R7461J25531J04049P0763M0426Q3958M1568P8496
14930F52685q1162k19491r2735j46908J75618O9475r1211j11690L5831J26330
14920C16742j41064j7269m8474J18166N3427P2975Q045n6146m9167M8577J47482
14909D53294r5135J4902Q3233M8919N0464J1956j09903j12684k0440j07792j49772
$$ plain form
14986 220412 218019 336597 429723 452197 446732 447638 308970 235112 235912 82329 152684 232912
14974 232912 262085 298221 328503 300992 279463 185520 55288 -38925 -3065 -78402 -164888
14963 -164888 -44902 32459 44181 85099 -604 -158665 -34477 105458 171953 204432 213471
14952 213471 320178 313660 194153 281358 382808 336634 374543 187901 32633 55102 -57714
14941 -57714 -114320 -56665 10433 107894 233425 337474 408237 448663 532621 574189 652685
14930 652685 571523 352032 259297 112389 288007 357482 266271 154581 190412 316742
14920 316742 175678 158409 109935 228101 281528 354503 362548 306402 257235 305812 453294
14909 453294 358159 373061 456294 505213 555677 567633 457730 345046 324606 216814 67042
14898F7042q9047N8791k2931J9743Q1323J07302J44598N8074M2649r2822n5565
14887C19157J16073L1876j69945o9179L7832n5364n3875l9605n1775R3784l0859
14876A28120j84279N772J96315q5227k00641j01495N9236L3313n963J48996Q1071
14865G5218n8763O1503N0900O070j05680j36573J5453m997K00704J21225l16262
14854i1202j5802J26512J5768o2604j10389K36513J29732P1581J2115j93881j8831
14843I9512J31214K12866k378j31490j46809P6241K35817m6736l8140l2817L3104
14832C90384r6459L086k1270m1054k6524o4149j0092J04247K7052K6921N1140
14821C43282N3128P0522q9761r2707J49897j1154N0176J33479r1722j83158r058
$$ plain form
14898 67042 -22005 36786 13855 33598 114921 222223 366821 424895 467544 374722 319157
14887 319157 435230 467106 297161 227982 265814 210450 156575 116970 65195 158979 128120
14876 128120 -56159 -50387 145928 60701 -139940 -241435 -182199 -148886 -154849 -5853 75218
14865 75218 16455 77958 128858 134928 29248 -107325 -91872 -96869 103835 225060 -91202
14854 -91202 -107004 19508 35276 -27328 -137717 98796 228528 300109 312224 118343 99512
14843 99512 230726 443592 441214 309724 162915 239156 474973 428237 390097 357280 390384
14832 390384 293925 297011 275741 234687 208163 144014 133922 238169 265221 292142 343282
14821 343282 396410 466932 377171 284464 434361 423207 473383 606862 515140 331982 322924
14810C22924p0626p4794N3280j934k0532Q898J0258P4813M06J0895P0665p509
14798C76744J34039k3926j45749j15857j47928J6765R7178J0461m4889j1739Q6003
14787B31102J14606M3054j1432j90966M1963N1328K6370M5945j07015j46768J25911
14776B24098n5751o0881K5289r6494J28899K03860N9191J41304k1807J22178K00277
14765H70163J44787K847j42486q6136O8820q3665o2055M8598K01780k38754k00013
14754E23886n7382O0024q3432q4933r5314q2319n3899P6686J8927J48301l6115
14743C34430R4157j012q3417K01100N9579o6174r5681o8213q8836m2367R1533
14732C35099J62902q9093P5297j9230k8648K51341L2117k58191L8699K3671j64018
$$ plain form
14810 322924 252298 177504 230784 228850 208318 217216 227474 302287 302693 313588 384253 376744
14798 376744 510783 486857 341108 225251 77323 94088 191266 201727 156838 145099 231102
14787 231102 345708 388762 377330 186364 228327 279655 306025 351970 244955 98187 224098
14776 224098 168347 107466 132755 36261 165160 369020 428211 569515 547708 669886 870163
14765 870163 1014950 1017797 875311 789175 857995 774330 712275 760873 962653 723899 523886
14754 523886 466504 526528 443096 358163 262849 180530 126631 203317 222244 370545 334430
14743 334430 428587 427575 344158 545258 604837 538663 442982 374769 285933 243566 335099
14732 335099 498001 408908 484205 464975 436327 687668 719785 461594 500293 523964 359946
14721C59946J33886p7364J33988P1733j1552J24130J99176k015k45340k13028
14711D73560j19769J4562J33981l9545P5361K13615O1331K6575K6315L1021P4451
14700I71458J1511j06704O124J27831p0926L8941l481j80684J14695R4169J14883
14689A117817L3389j20513j30433j14524N5669L9065O5224R7635P335n8708k06
14678I91750M6776l3965N5359Q1614q8719q388N0003p3859r6658Q0938K58922
14667A263773j22265k31466J34031J21706l5589j04923M0191q582J26849K34925
14657A418650J00762J02986j03570j91919J09466P6265J16795o5349J8111M0922
14647A623119R0054J81308L004k286L04993K13239j54942j49588J44615J44804
$$ plain form
14721 359946 493832 416468 550456 622189 610637 734767 933943 931928 686588 473560
14711 473560 353791 368353 502334 462789 538150 751765 813096 839671 865986 897007 971458
14700 971458 982969 876265 882389 1010220 939294 978235 974754 794070 908765 1002934 1117817
14689 1117817 1151206 1030693 900260 785736 841405 880470 945694 1043329 1050664 991956 991750
14678 991750 1038526 1004561 1059920 1141534 1052815 1044427 1094430 1020571 923913 1004851 1263773
14667 1263773 1141508 910042 1044073 1165779 1130190 1025267 1065458 1056876 1183725 1418650
14657 1418650 1519412 1622398 1518828 1326909 1436375 1512640 1629435 1564086 1582197 1623119
14647 1623119 1713173 1894481 1897485 1895199 2200192 2413431 2258489 2108901 2253516 2398320
14637B398320K1469J3944r3870R3412K40053K4615N5531M7007J88055J39842J41273
14626C269651M65200K8962O1108L99108M21402L53420J50692L74630O45469N54387
14616F724029K98395O06934Q78708P71098J007182J380721J791013J834197K414984
14607A7707261K687732K877938L642458M389987N003819O084821P762236J1000104
14599F1156356J5910847K2541529L1059457M1003816N0339739N7515582O0378015
14592C39905341N6715087M5715066K7933618N404405j8415634l8619714n2157622
14585C66480547n7778025n6090688m8901558l8398034k7763487j9205790j3582348
14578A04760617j0102346q247517o982340o461335o043577n473468m971142m268379
$$ plain form
14637 2398320 2419789 2433733 2339863 2433275 2673328 2697943 2753474 2800481 2988536 3128378 3269651
14626 3269651 3734851 3763813 3824921 4224029 4645431 4998851 5149543 5524173 6169642 6724029
14616 6724029 7022424 7629358 8508066 9279164 10286346 11667067 13458080 15292277 17707261
14607 17707261 20394993 23272931 26915389 31305376 36309195 42394016 50156252 61156356
14599 61156356 77067203 99608732 130668189 171672005 222011744 279527326 339905341
14592 339905341 396620428 442335494 470269112 475673517 457257883 418638169 366480547
14585 366480547 308702522 252611834 203710276 165312242 137548755 118342965 104760617
14578 104760617 94658271 86410754 79428414 72967079 66923502 61450034 56478892 52210513
14570E2210513l601840k992946k539957k500993k019704j740182j642508j352865
14562C3819518j192458j190856j154341j109116j209552j083925r82579r76519
14554B4920172o92716q21492q37725p76919o99611m83515n32944n17801n00946
14545A9056503o39484m25115k60787m15274k94331l98633n60118k91444n15115
14536A5256202l91177l60809o15574m89745m39257n7910m60373l80695j85584
14527A1875078l68273m44769l19227r1229j68014l65029k96213j60798k88491
14518I373035l33645l46309l21854q1220j44310k27950l2299j44560l43685k46563
14508G150640k59129k68515k73824j35719r9038r1141M0486J0644k07107k13420
$$ plain form
14570 52210513 48608673 45615727 43075770 40574777 38555073 36814891 35172383 33819518
14562 33819518 32627060 31436204 30281863 29172747 27963195 26879270 25896691 24920172
14554 24920172 24227456 23405964 22568239 21791320 21091709 20608194 20075250 19557449 19056503
14545 19056503 18417019 17991904 17731117 17315843 17021512 16622879 16062761 15771317 15256202
14536 15256202 14865025 14504216 13888642 13398897 12959640 12901730 12441357 12060662 11875078
14527 11875078 11506805 11062036 10742809 10651580 10483566 10118537 9822324 9661526 9373035
14518 9373035 9039390 8693081 8371227 8290007 8145697 7917747 7885448 7740888 7397203 7150640
14508 7150640 6891511 6622996 6349172 6213453 6114415 6023274 6063760 6074404 5867297 5653877
14498E653877J7675Q6922k9104N3490L8641R6023l7156p5445j81653q1635l90589
14487E151046k95621j87599j42307l07487l04279k54093j3092j39073j83058k41914
14477C082523j19653Q1328Q2021q8193r8504k3740k51755k6481Q815j00490r6371
14466B449500m2921j34368m3839k6150R4782J54829j62476k8555J3264j87485
14456B086581j02069l4376Q0373J26656k1320l7365j60768j46146j17644m1868
14446A632054J49152P553k9390R2594l4786M90k71553q8757M4480J31564j9090
14435A614311n7152o4380m2798j00520p9698R866k3900j92186j93990l0457P0106
14424I09202p8525l3270m3293j09838m5359M5294N4616p4155K3977q9039J5216
$$ plain form
14498 5653877 5671552 5758474 5729370 5782860 5821501 5917524 5880368 5804923 5623270 5541635 5151046
14487 5151046 4855425 4667826 4525519 4218032 3913753 3659660 3646568 3507495 3324437 3082523
14477 3082523 2962870 3044198 3126219 3038026 2939522 2915782 2664027 2637546 2646361 2545871 2449500
14466 2449500 2406579 2272211 2228372 2202222 2297004 2451833 2289357 2260802 2274066 2086581
14456 2086581 1984512 1950136 2030509 2157165 2135845 2098480 1937712 1791566 1673922 1632054
14446 1632054 1781206 1788759 1759369 1851963 1817177 1817667 1546114 1457357 1501837 1633401 1614311
14435 1614311 1557159 1492779 1449981 1349461 1269763 1279629 1255729 1063543 869553 839096 909202
14424 909202 830677 797407 754114 644276 598917 644211 698827 624672 648649 559610 574826
14413E74826J25924R3553Q4431M53k19013o341r0776j95455j19755N4191m4191
14402B57847m982M5735N5574K50292M1321O8894j01474q5252N4323l803L9923
14391F18398j18690j59206Q6303k552m5487k8234m510m2347o0132L7560Q7719
14380C68822N0571R0973P3550N5350j2365p0618R1868k5552R3643N3343k37337
14369E32248k5339J75820j59664R198J2508J0946j26280J82090K24554j55562
14359F80519r4720j69215Q2891Q4510p8726M328J37841O6984J28529J1020J32920
14348I86881J8015m7677n3762r8006j75808j12807l8225n0894J3756L1595J6709
14337D89777J05310q1939j60622k44064K9618P3306K4663o4591J57595O2815J68032
$$ plain form
14413 574826 700750 794303 878734 879187 660174 653833 563057 367602 247847 302038 257847
14402 257847 252865 298600 354174 604466 645787 714681 613207 527955 582278 578475 618398
14391 618398 499708 340502 426805 424253 378766 350532 346022 303675 243543 281103 368822
14380 368822 419393 510366 583916 639266 626901 556283 648151 622599 716242 769585 532248
14369 532248 506909 682729 523065 532263 544771 555717 429437 611527 836081 680519
14359 680519 585799 416584 499475 583985 505259 509587 647428 714412 842941 853961 986881
14348 986881 1004896 957219 903457 805451 629643 516836 478611 427717 441473 473068 489777
14337 489777 595087 513148 352526 108462 138080 211386 236049 171458 329053 391868 559900
14326E59900J0587k06174L6906k404j01921n5008L056K5352J3258j17037j0170
14315A56345J00863M4623L6609m7499O020j9059j00991J28917J04997k22680j68771
14304A9374J81057L2944P4066k6971R8782M5384j31471O2132l8882J36377J16981
14293E69773p6872p7115k0958P3040J78424K5628o5153R8231K7337J32688J06876
14282I71899j09407j95236n7413j59258M5437p9065n8970j45972K1941L4377k19901
14271D8432k093n8570J27126J16841L0501M8663j10339j50812j00346p9069J20862
14260h804K16417O7491q2834j94626j26109J09079K0811J41127j961r2585J6475
14249F4481k0778J87653J30656l328j43367n6103L0711j55178r904j42000j23224
$$ plain form
14326 559900 570487 364313 401219 398815 296894 241886 244942 270294 283552 166515 156345
14315 156345 257208 301831 338440 290941 296961 277902 176911 305828 410825 188145 19374
14304 19374 200431 233375 307441 280470 379252 424636 293165 355297 316415 452792 569773
14293 569773 492901 415786 394828 467868 646292 671920 606767 704998 732335 865023 971899
14282 971899 862492 667256 609843 450585 496022 416957 357987 212015 233956 268333 48432
14271 48432 46339 -12231 114895 231736 262237 310900 200561 49749 -50597 -129666 -8804
14260 -8804 207613 275104 192270 -2356 -128465 -19386 1425 142552 140591 48006 64481
14249 64481 43703 231356 362012 358684 215317 159214 189925 34747 24843 -117157 -240381
14238b40381J37390J45949J3839r6478j17011n1827J59982n6946j38562K7573
14228b16472J61699M1l4740Q8440j2367Q1951j4595j3892M9433L0039m9902j29579
14216e9944k5672l9980l9974k1816J28878J04059j29926m6576J81840J00077M8683
14205A99649r6272r6772O7800K4842j9604P0892j39800j14930q4169m3835K3253
14194b08946K7921M5413J21053O1120o5919p0052J05707L1309k0436p9290J2277
14183c9843N7397J23518P0894j0322j3178q3550j32907q4957J43867J6289M5741
14172I2949r646K14456J87409n3938j93939q2492r9147J9782j25879j74699m8801
14161b73945Q349N2166N0749r5271L8930J30832m7641r2501j05172N9581J99541
$$ plain form
14238 -240381 -102991 42958 56797 -39681 -156692 -208519 -48537 -105483 -244045 -216472
14228 -216472 -54773 -54732 -89472 -1032 -13399 68552 53957 40065 89498 119537 69635 -59944
14216 -59944 -85616 -125596 -165570 -187386 -58508 45551 -84375 -130951 50889 150966 199649
14205 199649 103377 6605 74405 99247 79643 150535 10735 -104195 -188364 -232199 -208946
14194 -208946 -181025 -135612 -14559 46561 -19358 -89410 16297 47606 27170 -52120 -39843
14183 -39843 17554 141072 211966 201644 188466 104916 -27991 -112948 30919 47208 92949
14172 92949 83303 297759 485168 431230 237291 154799 55652 75434 -50445 -225144 -273945
14161 -273945 -265596 -213430 -162681 -257952 -219022 -88190 -135831 -228332 -333504 -273923 -74382
14150g4382Q0110K0984p7867J4318K45413Q4896J21894l5118k5417k8630n9506
14139B66695m0198Q8094L50527L32070L78611N38429L31639m8282m4522R1512
14129B244575J58661j11347j36080k98713l10230l88998k21669j76968r1342N0196
14119G18085M5341J7794n5064k56384n2434M5286j9J7866p8283J4069K0396j01867
14107C34786J5865o0681J1844P8735l0031l8526O9051q8127n1573O4300J233k95924
14095A0952K0940J44143J11524O4039p1545j52859k12840Q442L2954k03363j13382
14084c60995p7564L21536J68492J13481Q7591j29404K8359r904j32333N359J11153
14073A25771P9680l2079O2093p3102p245O6701n0823N3565J49695k198n7499m8571
$$ plain form
14150 -74382 5728 26712 -51155 -36837 208576 293472 415366 380248 354831 326201 266695
14139 266695 226497 314591 665118 997188 1375799 1914228 2245867 2197585 2153063 2244575
14129 2244575 2403236 2291889 2155809 1857096 1546866 1157868 936199 759231 667889 718085
14119 718085 763426 781220 726156 469772 417338 462624 462605 480471 402188 416257 436653 334786
14107 334786 350651 289970 301814 380549 350518 311992 381043 292916 241343 305643 306876 10952
14095 10952 31892 176035 287559 351598 280053 127194 -85646 -77204 -44250 -247613 -360995
14084 -360995 -438559 -117023 51469 164950 252541 123137 151496 141592 9259 14618 125771
14073 125771 205451 173372 235465 162363 155118 221819 170996 224561 374256 372058 314559 265988
14061B65988r9528j10763J77632K8793k2017N7534q2097j03687n5337Q8368M663
14050A49549n3493L3614l1188o3568J241l3480n8027J46743J23609J18334P4976
14039D08310J1179R5592L25966L0732j28643l3859k8008r980J53622m7498j93028
14028E84385j68712j7884j33872J12125J34786l2014o977r3938j56250J62809
14018C84458j07305q9390n3781R9511J97762L0523j51374j90258m1709k0731j9321
14007C8385l6344J77183m2419q5183J63159l0985O1225p0418j19889R0228j0262
13996A34680K2612M8598O6654N7895p6215n0577j54407Q9773K81106m2671j65527
13985B11921l7152r268P7227m699Q7530O6920R5238k5496r9016p1619l752j1234
$$ plain form
14061 265988 166460 55697 233329 262122 240105 297639 215542 111855 56518 144886 149549
14050 149549 96056 129670 98482 34914 36155 2675 -55352 91391 215000 333334 408310
14039 408310 419489 515081 841047 871779 743136 709277 681269 671289 824911 777413 584385
14028 584385 415673 397789 263917 376042 510828 478814 471837 377899 221649 384458
14018 384458 277153 187763 133982 233493 431255 461778 310404 120146 78437 57706 38385
14007 38385 2041 179224 136805 51622 214781 183796 245021 174603 54714 144942 134680
13996 134680 157292 205890 272544 330439 254224 203647 49240 139013 420119 377448 211921
13985 211921 174769 165501 242728 238029 325559 392479 487717 462221 363205 291586 287834 276600
13973B76600J7380r193K6577j1111k0427r8510q2407n8039n7054P6724N2028n5470
13961E7098n1926m2506J14736L4084O7734m8241j38592J00374Q7365K3397J1857
13950B15380P7187n9086R7283K58103J1668l25360j52414K43708Q0490r5074J24928
13939D76813O090k27648j95809P114q600J01956k9586J4524O7870N8114O4171
13928C35009L8847j547j8818O7548J33924j2544k3924j7948J20978P8713M3198
13917G43436M0987J9057j8153L264M4421N1787m3680k7100Q3660K9222k30206
13906F96695j85436p5799O0813j39330k2605J28250J40435P8477j00071j52343
13896D29086q8165q181J19727P2230r4520j52753P0413R1973o5981O022R5273
$$ plain form
13973 276600 293980 284787 311364 300253 279826 181316 98909 40870 -16184 60540 112568 57098
13961 57098 5172 -37334 77402 111486 179220 130979 -7613 92761 180126 203523 215380
13950 215380 292567 233481 330764 588867 600535 275175 122761 366469 446959 351885 476813
13939 476813 482903 255255 59446 66560 57960 159916 130330 144854 212724 270838 335009
13928 335009 373856 372309 353491 421039 554963 542419 518495 500547 621525 700238 743436
13917 743436 784423 803480 785327 788591 833012 884799 841119 814019 897679 926901 696695
13906 696695 511259 435460 496273 356943 334338 462588 603023 681500 581429 429086
13896 429086 340921 332740 452467 524697 430177 277424 347837 439810 373829 379851 475124
13885D75124O697K3420J37261P260l5780N5586N1549j04799j59210j09324J26002
13874D73786l8272R0906J11072J31852K2030j55980k8148n1028p5404j26657J37087
13863D91244J53656k8329j53972o7638M2180R7441L4896o8913J74249j08280j74669
13852C91865k2581J64482m104j27496L6540J38886R8373Q0916M3617j34687J8169
13841F83980p51j12296l0938k4208o7165k8256O6374K1209K6664k2209M7410P0415
13829F30229P9263N3311P4818j59171k13543n4154P6571J11501J27286K05804
13819I31915l2091k01401j64587m8839R3119R0891q2731J1001N9076q2807q9219
13808D84327K9360J25987j8034j94387p3943k851J58524K93262N9062k2673n5443
$$ plain form
13885 475124 481821 505241 642502 649762 613982 669568 721117 616318 457108 347784 473786
13874 473786 435514 526420 637492 769344 791374 635394 607246 556218 480814 354157 491244
13863 491244 644900 616571 462599 394961 437141 534582 569478 500565 674814 566534 391865
13852 391865 369284 533766 529662 402166 438706 577592 675965 756881 800498 665811 683980
13841 683980 683229 570933 539995 515787 448622 420366 486740 507949 534613 512404 559814 630229
13829 630229 709492 762803 837621 678450 464907 410753 487324 598825 726111 931915
13819 931915 899824 698423 533836 484997 578116 669007 586276 597277 656353 573546 484327
13808 484327 513687 639674 621640 427253 353310 350459 508983 802245 861307 838634 783191
13797G83191n288P2431L5658J316J998p6488q6306J61853O2602j31703K9921J64142
13785A013327K4613J8090Q1459P2438P6649P024O2810L6148j18068k7812P3883
13774A320561j49302r7375q1047J36089J7379j31441j67329j39554R2084j6938
13764G83127q178r401J04987q8314l0969j58947K1834J66987Q4425R2803j31805
13753H26549r3115j22241q6798O1336N5209J00051r851Q232N8382K0608K236p963
13741H12635j98740j04356J53162K4424Q9040o7713k13475l8612L2264Q439k06003
13730B91065O3003l5227n0666J07009J52363J08323l0128o3269k1838p9149l4740
13719D06746M6179m719N8939O9056M9450j46729l8350K86859M088j19547J3564
$$ plain form
13797 783191 777903 850334 885992 887308 889306 812818 726512 888365 950967 819264 849185 1013327
13785 1013327 1037940 1056030 1137489 1209927 1286576 1293600 1356410 1392558 1274490 1246678 1320561
13774 1320561 1171259 1073884 992837 1128926 1146305 1014864 847535 707981 800065 783127
13764 783127 774949 765548 870535 782221 751252 592305 614139 781126 865551 958354 826549
13753 826549 733434 611193 524395 585731 640940 740991 731140 739372 797754 818362 820598 812635
13741 812635 613895 509539 662701 687125 776165 708452 494977 456365 488629 497068 291065
13730 291065 354068 318841 268175 375184 527547 635870 605742 542473 520635 441486 406746
13719 406746 452925 448206 507145 576201 625651 478922 440572 727431 731519 611972 625536
13708F25536Q9109M8255j86966j31879l9513n2227K42203k00535o3507J45162
13698D75638R4052o4906P7748j03957k53336J52556O4663m8397L5232M1623r1332
13687C79584Q6169N4119o3640R4868K7228o8389j09191N3257J32566j9306o9333
13676D97932n9699l7116L6659k50510r359K38608j7313p4498M7036O2821M8135
13665D82696P515j75667j8343J20794M6295q8337p3563J68841Q6261q7228O3400
13654E32664K7455o6145j1175o8013k3611l973L5948N1867j621M1319J0977Q4517
13642F10209j01851j11857J08989J52797j02679j53128k6673j28943j1426M4740
13632B80178J27994J71807j7725J40645J21396p2815j05466J33537J7555k29298
$$ plain form
13708 625536 714645 762900 575934 444055 404542 352315 594518 393983 330476 475638
13698 475638 569690 504784 582532 478575 225239 377795 442458 394061 429293 470916 379584
13687 379584 465753 519872 456232 551100 578328 509939 400748 454005 586571 567265 497932
13676 497932 438233 401117 437776 187266 177907 416515 399202 324704 371740 434561 482696
13665 482696 490211 314544 296201 416995 463290 374953 301390 470231 556492 469264 532664
13654 532664 560119 493974 482799 414786 391175 387202 423150 475017 473396 514715 525692 610209
13642 610209 508358 396501 505490 658287 555608 402480 375807 246864 235438 280178
13632 280178 408172 579979 562254 702899 824295 751480 646014 779551 797106 567808
13622E67808j47648l4984k8463j649R0408O8727l7364N3869k825k30l9298J13426
13610F01777M3737r028j61084r5822n7259q1464K29980M14363r256k28283o9188
13599E78473p8251L3369N1942J08359n2730P3146J51061k6975j65782p0739q632
13588E93241l2442k632j58693j90137L6475J26244q0271O281O0452m6310O4243
13577C76451j06806J18196K7021P2807m5340j1675l0267J43537O4817Q1159J10801
13566H00701n0560j75807n4400O6706p3830L0575L4267j40617m907q9937P9761
13555D21952o5122k02066J08674Q0243J41958N1790j5615N9527M4460k1399k94510
13544C09892M181Q8559R7697Q7382J38374M7004l0115j82594k24024K9162J89281
$$ plain form
13622 567808 420160 385176 356713 355064 445472 514199 476835 530704 527879 527649 488351 601777
13610 601777 645514 636486 475402 379580 322321 240857 470837 885200 875944 647661 578473
13599 578473 500222 533591 585533 693892 641162 714308 865369 838394 672612 601873 593241
13588 593241 560799 558167 399474 209337 245812 372056 291785 298066 358518 312208 376451
13577 376451 269645 387841 414862 487669 442329 430654 400387 543924 608741 689900 800701
13566 800701 750141 574334 519934 586640 512810 543385 577652 437035 432128 342191 421952
13555 421952 356830 154764 263438 343681 485639 537429 521814 581341 625801 604402 309892
13544 309892 314073 402632 500329 587711 726085 773089 742974 560380 336356 365518 554799
13533E54799P9712q0063l8891O0191p260o4171K9713j91882j09198J52727O1160
13522D46837P1102M6396l7770O3084O7745J0163P9418p2625j00302j03389n3538
13511D17121O4242l4829O6948J14843j18891O6024R0861o2192L888n4903j9258
13500E33854J15355P3137J2271J5088q4498P883j11112l4225J29773K1500m6916
13489F32110R4866N2414Q3514j76527j05237R4942O4076q3820Q2557O9016p4052
13478G33859m7489K2339K0071r6828p6817l8726N5291n7211N3408J17261J36379
13467H21537N4686l1473J69349J03267r4751j91522n0987k09736M1056J18537
13457G29963R9251O0911o488r9644n3157j4741L7544J0190j24621j6291J82404
$$ plain form
13533 554799 634511 554448 515557 575748 568488 504317 534030 342148 232950 385677 446837
13522 446837 517939 564335 526565 589649 657394 667557 746975 674350 574048 470659 417121
13511 417121 481363 446534 513482 628325 509434 575458 666319 604127 608015 553112 533854
13500 533854 649209 722346 734617 749705 665207 673090 561978 527753 657526 679026 632110
13489 632110 726976 779390 862904 686377 581140 676082 740158 656338 738895 807911 733859
13478 733859 686370 708709 728780 631952 555135 516409 571700 514489 567897 685158 821537
13467 821537 876223 844750 1014099 1117366 1022615 831093 780106 570370 611426 729963
13457 729963 829214 890125 883637 783993 730836 716095 753639 763829 639208 622917 805321
13446H05321J94078O6065j33096k01905m9720P7921J60939l6693P7135M7277l4992
13435I72330J10969J5233j18493O6313L2161P5963r6317r5943N7044q1073q5588
13424H52599M9678J33203O4177p3453R6431J41005Q3241J19294J05805p8953o7157
13413A425870K35717J85945q774M7329o4197J28120Q789n7521J50383K92157M22206
13402B766024P2701J96070M32721L89570K00275K63280K93756M09833N81586O40405
13392F246221P32086P95590O03924O16348L32443K62938K03406q029L345k50950
13382I537322p06445l56865l94541p06484n92648n39689p66771m78172l32773
13373D662934l07886j27508j27329k85198k87098j30873n6560j14783j51554k31877
$$ plain form
13446 805321 999399 1065464 932368 730463 680743 758664 919603 882910 960045 1007322 972330
13435 972330 1083299 1098532 980039 1046352 1078513 1154476 1058159 962216 1019260 938187 852599
13424 852599 902277 1035480 1099657 1026204 1122635 1263640 1346881 1466175 1571980 1493027 1425870
13413 1425870 1661587 1847532 1838758 1886087 1821890 1950010 1958799 1901278 2051661 2343818 2766024
13402 2766024 2838725 3034795 3467516 3857086 4057361 4320641 4614397 5024230 5605816 6246221
13392 6246221 6978307 7773897 8377821 8994169 9326612 9589550 9792956 9784927 9788272 9537322
13382 9537322 8830877 8474012 8079471 7372987 6780339 6240650 5473879 4995707 4662934
13373 4662934 4355048 4227540 4100211 3815013 3527915 3397042 3340482 3225699 3074145 2842268
13363B842268N6786J47060r1195m9347n5765k15450j82684K6609J50346J39624
13353B768252M9032k09007k7554k49659j51120Q9191L5311j49664o662N0079o4189
13342B134010k85241o5454K35531J58559k3851J36904j03470j90669r2581q4418
13332A819320m6959K9800J56464J10707p3489j18226M3637K33003J63016j43033
13322B174240k395l29384j18052J58284J17876R0745J13914q1121q211J43542
13312B259438K9946j98521j81300k8721J63665J99036J61083j21762j59501J9139
13302B142502o0214j49323L1066K5076j215J99345R1816r5312r3429L2906J86970
13291B310188R4514k24753j59568j30243r9348J71391N3458j06483R3754J76456
$$ plain form
13363 2842268 2899054 3046114 2954919 2905572 2849807 2634357 2451673 2478282 2628628 2768252
13353 2768252 2817284 2608277 2580723 2331064 2179944 2269135 2304446 2154782 2148120 2198199 2134010
13342 2134010 1848769 1783315 2018846 2177405 2153554 2290458 2186988 1996319 1903738 1819320
13332 1819320 1772361 1802161 1958625 2069332 1995843 1877617 1921254 2154257 2317273 2174240
13322 2174240 2171845 1842461 1724409 1882693 2000569 2091314 2205228 2124107 2115896 2259438
13312 2259438 2289384 2090863 1909563 1880842 2044507 2243543 2404626 2282864 2123363 2142502
13302 2142502 2082288 1932965 1964031 1989107 1987892 2187237 2279053 2183741 2090312 2123218 2310188
13291 2310188 2404702 2179949 2020381 1890138 1790790 1962181 2015639 1909156 2002910 2179366
13281B179366R5142J5829Q4711K05544k5639j17353k6410m4618q095p6955k7670
13270B253852M5249M2292J2320K22929K69561o1286p7297J79374J09595m2454
13260B954135L8682J99408J05241o2061j53166m7192N65l575k8796M7881m8287
13249C002835p6416o623K6290J54155K95177n3499K1766j11000k42884q8659K01535
13238C122677R2117o8769J76139r9970l6618J84021K18330o6282p9868Q0674J87706
13227C710157J11764j02628K29751k1150J50167J73491N8659L39236K21255J38173
13217E008875O0716J4284o1564j58118k01379p4921J92066J45118K4387R9061
13207E048525r1427p5135L677J33502J77437j40379n8644k5961M7568J77181P1853
$$ plain form
13281 2179366 2274508 2290337 2375048 2580592 2554953 2437600 2411190 2366572 2358477 2281522 2253852
13270 2253852 2299101 2341393 2353713 2576642 2846203 2784917 2707620 2886994 2996589 2954135
13260 2954135 2992817 3192225 3297466 3235405 3082239 3035047 3035612 3032037 3003241 3051122 3002835
13249 3002835 2926419 2919796 2946086 3100241 3395418 3341919 3363685 3252685 3009801 2921142 3122677
13238 3122677 3214794 3146025 3322164 3222194 3185576 3369597 3587927 3521645 3441777 3522451 3710157
13227 3710157 3821921 3719293 3949044 3927894 4078061 4251552 4310211 4649447 4870702 5008875
13217 5008875 5069591 5083875 5022311 4864193 4662814 4587893 4779959 4925077 4949464 5048525
13207 5048525 4957098 4881963 4885640 5019142 5196579 5056200 4997556 4971595 5019163 5196344 5268197
13196E268197K4006J2692j17566J43275K18856J35355J61905J36795P3299K66573
13186F323387K19133q2267J1289J13968J24423L58805L69654M26388M61452L68235
13176H694467M06429L23731L59654M60881J54343L679l92111m83466m17454l15659
13166H794494j8649K44028K76543L0084J3524Q4798O797M7783K74669K92874L03971
13155A0350916R9529J22475J46251J66419O1281m5901J09988J54394L81532M17450
13145A1964334L36247K39184K48956L91298J98589J69637L42250N37593K47475
13136A4675563L67613N20238N45742O74125R43256O83327N53141O30483N65504
13127B0158992K93114J04612K5695j06234l9206j3428J56183N77062M07322L27233
$$ plain form
13196 5268197 5292203 5304895 5187329 5330604 5549460 5684815 5846720 5983515 6056814 6323387
13186 6323387 6542520 6460253 6471542 6585510 6709933 7068738 7438392 7864780 8326232 8694467
13176 8694467 9100896 9424627 9784281 10245162 10399505 10403184 10011073 9527607 9110153 8794494
13166 8794494 8775845 9019873 9296416 9326500 9340024 9424822 9431619 9479402 9754071 10046945 10350916
13155 10350916 10450445 10572920 10719171 10885590 10946871 10900970 11010958 11165352 11546884 11964334
13145 11964334 12300581 12539765 12788721 13180019 13378608 13548245 13890495 14428088 14675563
13136 14675563 15043176 15563414 16109156 16783281 17726537 18409864 18963005 19593488 20158992
13127 20158992 20452106 20556718 20582413 20476179 20436973 20423545 20579728 21156790 21564112 21891345
13117B1891345M24604L98539L99767M92315N89273P58188O91092O55306N21967
13108B6822396O92975O95842Q00491Q48299R17197P54638P33440P95113Q39546
13099C3899937Q84215R51500P57996Q57146Q48509J020786J088577J024596R41414
13090D2274676J094469J139211J218254J221736J224941J065197J039572J027544
13082E1305600J172786R85982R38466P62912P16628O44501P55938Q40847P62784
13073E8886444P10418P52893O94553O23760N75509N35853M16783L59439L04399
13064F3860051O4222P4471P3858n6954j14171j52920k22555l21304m81710m24546
13054F2298442n31654n64524m33644o17760p49636p36941q94208q86316o92805
$$ plain form
13117 21891345 22315949 22714488 23114255 23606570 24195843 24954031 25645123 26300429 26822396
13108 26822396 27515371 28211213 29011704 29860003 30777200 31531838 32265278 33060391 33899937
13099 33899937 34784152 35735652 36493648 37350794 38199303 39220089 40308666 41333262 42274676
13090 42274676 43369145 44508356 45726610 46948346 48173287 49238484 50278056 51305600
13082 51305600 52478386 53464368 54402834 55165746 55882374 56526875 57282813 58123660 58886444
13073 58886444 59596862 60349755 61044308 61668068 62243577 62779430 63196213 63555652 63860051
13064 63860051 63924273 63998744 64072602 64015648 63901477 63748557 63526002 63204698 62722988 62298442
13054 62298442 61766788 61202264 60768620 60150860 59401224 58664283 57770075 56883759 56190954
13045E6190954q31621p75336q04089r08429p09027p29858r50901j107284j037182
13036D8337227q09908q55686q34744r89667j050179r40701p57653p19447o52156
13027D0727086p71930p52123q51426p61025p11246p86791p43515n99416n87256
13018C4162358n54337o90495p24428n80401o16446o40688o04312n05173n28409
13009B8717669o24454p14638m60825n85633m54388n68047o83760l24034k05944
13000B4095946m47180m30326l78091o83173p30422m44884j41383k85959m19724
12991B0134804l54241l56727k99944k97080n06089k96317k21545l37735n41424
12982A6923702m40498k21356k47105k61469k51948l76983m99364k28805l2562
$$ plain form
13045 56190954 55359333 54583997 53779908 52871479 52162452 51432594 50481693 49374409 48337227
13036 48337227 47527319 46671633 45836889 44847222 43797043 42856342 42098689 41379242 40727086
13027 40727086 39955156 39203033 38351607 37590582 36879336 36092545 35349030 34749614 34162358
13018 34162358 33608021 32917526 32193098 31612697 30996251 30355563 29751251 29246078 28717669
13009 28717669 28093215 27378577 26917752 26332119 25877731 25309684 24625924 24301890 24095946
13000 24095946 23648766 23218440 22840349 22157176 21426754 20981870 20840487 20554528 20134804
12991 20134804 19780563 19423836 19123892 18826812 18320723 18024406 17802861 17465126 16923702
12982 16923702 16483204 16261848 16014743 15753274 15501326 15124343 14624979 14396174 14363612
12973A4363612q9792j77343j24092k17055l57632j84982j61810k04584k43585
12964A2602737j86901k10200j06735j16514k88162k30507l05314j48312k70015
12955A0740077k37521j45784j43532m7845j36273L6585j01416k77050k85843k15670
12945I185728j50353l7158j54072K7947K4055j55639k32359k21074k58433j09346
12935G919296r8653l1516j17916l17278r0233j29058r4034j0568P8452J3886j90325
12924F932053j08816j96469l31163j22554j222j4025J03468n2556k176K1857q7586
12913F140811k42239j7501j39922j02325n2021j18500r8366k9481j24781k80858
12903D934817q6234P8343J5896k3357M2212o7800r2720R6205l2430J12861n5730
$$ plain form
12973 14363612 14273820 14096477 13972385 13755330 13397698 13212716 13050906 12846322 12602737
12964 12602737 12415836 12205636 12098901 11982387 11694225 11463718 11158404 11010092 10740077
12955 10740077 10502556 10356772 10213240 10165395 10029122 10065707 9964291 9687241 9401398 9185728
12945 9185728 9035375 8998217 8844145 8872092 8896147 8740508 8508149 8287075 8028642 7919296
12935 7919296 7820643 7789127 7671211 7353933 7263700 7134642 7040608 7030040 7108492 7122378 6932053
12924 6932053 6823237 6626768 6295605 6173051 6171829 6157804 6261272 6208716 6206540 6228397 6140811
12913 6140811 5898572 5881071 5741149 5638824 5586803 5468303 5369937 5340456 5215675 4934817
12903 4934817 4848583 4926926 4942822 4919465 4961677 4893877 4801157 4897362 4864932 4977793 4922063
12892D922063j89356J03347m5872k62009j84580k6914l1988j43084q4565r6237
12882C960805j67632j26739O9510l9249o4751Q5475o8099r4083k0966L6027J35420
12871C705718j56380j69106m970l5177q7824l1155j15293K9867J23267j16840
12861C142107r4013j99575j09480J8003N9283J17424j079j23563J2772j02072
12851B719807M8532J80163k2261k26244n5644J15824P779q8473j04166j06890
12841B468427q3125P4308K10432J52994k21030j524K07961Q8507k37927q7485
12831B571538j80618j10763J02913k3332j21257N021p3455j41633O8995Q6920
12821B184329Q9659k5464j63254P3676m9968j10767J38064K50256k42007j27589
$$ plain form
12892 4922063 4732707 4836054 4790182 4528173 4343593 4316679 4284691 4141607 4057042 3960805
12882 3960805 3793173 3666434 3735944 3696695 3631944 3717419 3649320 3555237 3534271 3570298 3705718
12871 3705718 3549338 3380232 3375262 3340085 3252261 3221106 3105813 3135680 3258947 3142107
12861 3142107 3048094 2848519 2739039 2757042 2816325 2933749 2932670 2809107 2821879 2719807
12851 2719807 2768339 2948502 2926241 2699997 2644353 2760177 2767956 2679483 2575317 2468427
12841 2468427 2385302 2459610 2670042 2823036 2602006 2600482 2808443 2896950 2659023 2571538
12831 2571538 2390920 2280157 2383070 2359738 2238481 2243502 2170047 2028414 2097409 2184329
12821 2184329 2273988 2248524 2085270 2158946 2108978 1998211 2136275 2386531 2144524 2016935
12811B016935o034j1279J71386m6909k17695O1189o0146Q5169J01768j58395j39075
12800A796914n8326j7605M5254o3877O1615j1038j01222M1386j06187k16071O8274
12789A439117J24916P544j01613n8901q8469J81494P5789o5569O6892p9265j20414
12778A381521J81887K54681l1118k96413k92244k1900R5208J49366j5764j34752
12768A270472j15710K15192P2758n8524J39225j02625l4500o8294r1675P3611
12758A299930M9963k8368O5924l3400j00414O8483K3754n6774k31755J30818M4282
12747A232443k31009m0705J23689O7789j24534l4004K2326q9840q5131o4989n3609
12736G22426R9593Q3619R6180R8524n4815n0511N4516R1752N5960N72j94156q5993
$$ plain form
12811 2016935 2010901 1999622 2171008 2124099 1906404 1967593 1907447 1992616 2094384 1935989 1796914
12800 1796914 1738588 1720983 1766237 1702360 1763975 1752937 1651715 1693101 1586914 1370843 1439117
12789 1439117 1564033 1571577 1469964 1411063 1322594 1504088 1579877 1514308 1581200 1501935 1381521
12778 1381521 1563408 1818089 1786971 1490558 1198314 1176414 1271622 1420988 1405224 1270472
12768 1270472 1154762 1369954 1442712 1384188 1523413 1420788 1386288 1317994 1226319 1299930
12758 1299930 1349893 1321525 1387449 1354049 1253635 1322118 1345872 1289098 1057343 1188161 1232443
12747 1232443 1001434 960729 1084418 1152207 1027673 993669 1015995 926155 841024 776035 722426
12736 722426 822019 905638 1001818 1100342 1045527 995016 1049532 1141284 1197244 1197816 1003660 917667
12724I17667K08858L31065Q2777o54Q2918R5204J32670K23864Q1194l3762J49522
12713B271323J8226j67931k7280l0782o4803j87853k14155k26306r9394M9662
12703A320707o8885j40142l3465J46299k5620r4291o3971K6526J6809r5956k3813
12692I64198J38634J81313J36894k2578o6073O248J12600j42145k2090M2801j41768
12681A188034p0870l1634j4631K1712L5874J56720j09874J56011j06984j1155
12671A213203J12398j26526j77357M2998N7733P6436Q7999J21669J61542K01478
12661A771573l9622m1768L6394L2092M5892j7647k7334J5278l7974r232q019j68650
12649A550983j08743p4246j70038r9959r6157K6469m7571K0292j98279k69766
$$ plain form
12724 917667 1126525 1457590 1540367 1539713 1622631 1717835 1850505 2074369 2155563 2121801 2271323
12713 2271323 2289549 2121618 2094338 2063556 1998753 1810900 1596745 1370439 1271045 1320707
12703 1320707 1251822 1111680 1078215 1224514 1198894 1104603 1040632 1067158 1083967 988011 964198
12692 964198 1102832 1284145 1421039 1398461 1332388 1338636 1451236 1309091 1287001 1329802 1188034
12681 1188034 1117164 1085530 1070899 1092611 1128485 1285205 1175331 1331342 1224358 1213203
12671 1213203 1325601 1199075 1021718 1064716 1122449 1198885 1286884 1408553 1570095 1771573
12661 1771573 1731951 1690183 1726577 1758669 1804561 1786914 1759580 1774858 1736884 1727652 1719633 1550983
12649 1550983 1442240 1367994 1197956 1097997 1001840 1028309 980738 1001030 802751 532985
12639E32985p3952J28580P4759K65940K3015k85877j52972J54090J66080J02695
12629I35343L1863j78162j63176Q2323j343P491k8931j27041r6614K277J4643
12618D78673J27563K30136J05261q9645O807o0039q9883j72857J02486m836J62128
12607G95794K4629M9541j98581k2669J35715k7183k35407P42J46601K80186K1274
12596I70642m0085q9651r7539L317j93419j25692M3957O1687J51453n5793J00339
12585G29216j60564j95670N4041J56971m6874k01012J17708p3262k5067K7440
12575C82927r2246P7613Q0361M9097J24610q219l931n5491L867j06811K2874J9044
12563D93695o0405j10877K0102K7440O879o0484P444P0110j8734n7220J6054J19357
$$ plain form
12639 532985 459033 587613 662372 928312 951327 665450 512478 666568 832648 935343
12629 935343 967206 789044 625868 708191 706848 714339 685408 558367 461753 464030 478673
12618 478673 606236 836372 941633 851988 858795 798756 708873 536016 638502 633666 795794
12607 795794 820423 869964 671383 648714 784429 757246 521839 522581 669182 949368 970642
12596 970642 930557 840906 743367 746684 553265 427573 471530 533217 684670 628877 729216
12585 729216 568652 372982 427023 583994 537120 336108 453816 380554 355487 382927
12575 382927 290681 368294 448655 497752 622362 614143 610212 554721 558588 451777 474651 493695
12563 493695 433290 322413 342515 369955 376834 316350 323794 393904 375170 317950 334004 453361
12551D53361J57892P4053k35687j56700R6284J46385R1388q8745l074n4395L9741
12540E20503N6117j1606q8420j25217p1955k9367N6680K8429J4291J13821o0299
12529D02977o573j03556j21256j54958J11948K85804j1319j24026j4699K1738
12519B86080J75603l5818j37991m3757M4708p4990j56754m2263J19132J84241
12509C18191Q12L6324J01733j33636n1998j5705q5343P6351p3885l740J39967
12498C09071R5920j2575k5473m8203p7196o194l4812j3927R4207Q4119P7620n0905
12486C91652o4311J03821q6338R947P032j08320Q7667n9704j98889J952J09596
12475A94105n1992R8831N8315j72784j03864J35669J34015n2287k3304j35072
$$ plain form
12551 453361 611253 685306 449619 292919 389203 535588 626976 538231 535157 480762 520503
12540 520503 576620 565014 476594 351377 279422 250055 306735 335164 349455 463276 402977
12529 402977 396404 292848 171592 16634 128582 414386 403067 279041 264342 286080
12519 286080 461683 425865 287874 244117 288825 213835 57081 14818 133950 318191
12509 318191 319003 355327 457060 323424 271426 255721 170378 246729 172844 169104 309071
12498 309071 404991 392416 366943 318740 241544 235350 200538 186611 280818 364937 442557 391652
12486 391652 327341 431162 344824 354771 361803 253483 341150 281446 82557 84509 194105
12475 194105 142113 240944 299259 126475 22611 158280 292295 240008 216704 81632
12465H1632q8796P3504J18335J04894P25m003j736p7613J29412M0247p8544R261
12453C07318l8394m9264n3561K0256m8333R0886l2013J37712J23096L1711p2452
12442D16962J3228j94159k28912J18416J12103O2420J22503j3423j14603j3360
12432B81175j57901k0998J49167Q8953p595J82P1676k2632J7701j87351k51960
12421c9583Q7438r976J37484J84961P4060p6281o7128p9630l0737J10369k4124
12410B66853J36750K12735p8706r4388k7977N0866j00366n9813j36616o9995l9881
12399E9462m8459J26318m7609K4883j3746J01222P9273o6012p3291p557J82315
12388C16799r199j9627J4945k1163J899m1535J8639J25130k5877o6239l7987m7429
$$ plain form
12465 81632 -7164 66340 184675 289569 290294 286291 284555 206942 336354 376601 298057 307318
12453 307318 268924 219660 166099 186355 138022 228908 196895 334607 457703 489414 416962
12442 416962 430190 236031 7119 125535 237638 300058 422561 409138 294535 281175
12432 281175 123274 102276 251443 340396 332801 332983 404659 382027 399728 212377 -39583
12421 -39583 47855 37879 175363 360324 434384 358103 290975 211345 180608 290977 266853
12410 266853 403603 616338 537632 443244 415267 466133 365767 305954 169338 99343 59462
12399 59462 11003 137321 89712 114595 100849 202071 281344 215332 142041 134484 316799
12388 316799 307600 287973 302918 281755 283654 242119 260758 385888 360011 293772 255785 208356
12376B08356J73096j4889j15372l15822O6772P4714N986j9553Q9204J86899j25368
12365B14023k04610m8435M0954j1426M769K8381R6552J00248P9836R0953O5591
12354D56836j11234m7453j21131R983J55804j69076j04812Q4857M3805J6349J63274
12343C77202j77276j57986p545N9697j32512P2526P9241j6026q4514p2645O0959
12332A121k511n173J57049P3338k6942q0556p4029J41988R6632p5542j30015J92177
12320B67537J5463m3804N5126J2580m4644J4987J55533J03701q552k22917q5236
12309B19774p7850q7903j59305q7355Q3499n777P2628K03481L4067j32670l9936
12298B2653r3680j1303R9281P70o8237j16708J55748J44024l2560L1706j05074
$$ plain form
12376 208356 381452 366563 251191 -64631 2141 76855 82841 63288 152492 339391 214023
12365 214023 9413 -39022 1932 -9494 -4725 23656 120208 220456 300292 391245 456836
12354 456836 345602 298149 177018 187001 342805 173729 68917 153774 197579 213928 377202
12343 377202 199926 41940 34395 94092 -38420 34106 113347 97321 12807 -59838 1121
12332 1121 -1390 -6563 150486 223824 196882 116326 42297 184285 280917 205375 75360 267537
12320 267537 283000 239196 294322 306902 262258 277245 432778 536479 527927 305010 219774
12309 219774 141924 54021 -105284 -192639 -109140 -114917 -42289 161192 195259 62589 22653
12298 22653 -71027 -82330 16951 17721 -50516 -167224 -11476 132548 99988 131694 26620
12287B6620M988o8011J3575p4753J75247J26063j4276J37308k07776j29655J46039
12276A35369O398p0334K0759J41296M0316J04798n3395q6413L5391j09347o7572
12265I7266J28809j09947O6416J34624o2417q9560R321j79299j83945k3127Q2096
12254a29763N4595J26209J6266o6209M9529m8192n6270M1700J14096J55628P3971
12243C31560k08731k23548J6351j8631O8420p2318J2593K08095J0467j87871o2335
12232a25948R5177J62814J5087o5164L7246J22987l3073j54503J71154N0637K7106
12221C03520j20883k4436J22263K4965Q073o0806j54620J25024m0498r8924p4542
12210I136j06279J86712P2984J3832J3069J82782J02637j88896k95562J0599L26988
$$ plain form
12287 26620 31608 -36403 -22828 -97581 77666 203729 189453 326761 118985 -10670 135369
12276 135369 141767 71433 92192 233488 273804 378602 325207 238794 274185 164838 97266
12265 97266 226075 116128 182544 317168 254751 165191 174512 -4787 -188732 -211859 -129763
12254 -129763 -75168 51041 67307 1098 50627 2435 -53835 -12135 101961 257589 331560
12243 331560 122829 -100719 -84368 -102999 -34579 -106897 -94304 113791 124258 -63613 -125948
12232 -125948 -30771 132043 147130 81966 119212 242199 209126 54623 225777 276414 303520
12221 303520 182637 158201 280464 305429 313502 252696 98076 223100 182602 83678 9136
12210 9136 -97143 89569 162553 176385 189454 372236 474873 285977 -9585 1014 328002
12199C28002J96038J7263j60237k27665r1139q3507J2150m9123J00371r7490j45159
12188b00496K7450L0236Q5742J38664j8248L3223k4376q0246k08964j81691J94013
12177b04693K42976P5570N3811j45340o5470M2846o4213J26707P2678J92977N2044
12166C79893p6294o3688l309P839J08935o6471j48060l8811N8348J4640N6943
12155B29965j66095j1590J71327J60681L9404p4288R5219k5408k30907j45613
12145D2695o595j06198N9967J06429k06253k666p2878q598J19936J46967o7591
12134E215N5057J18241J8632j26894M8435M9448j77017K8013P1660L0938m0335
12123H1393m1133l4566K4611m6041J90706J65007J31148p1721o6093j44019j53042
$$ plain form
12199 328002 524040 541303 381066 153401 62262 -21245 -9095 -58218 42153 -55337 -200496
12188 -200496 -173046 -142810 -57068 81596 63348 96571 72195 -8051 -217015 -398706 -204693
12177 -204693 38283 113853 167664 22324 -43146 -300 -64513 62194 134872 327849 379893
12166 379893 303599 239911 236602 244441 353376 286905 138845 100034 158382 173022 229965
12155 229965 63870 52280 223607 384288 423692 349404 444623 419215 188308 42695
12145 42695 36100 -70098 -10131 96298 -109955 -112621 -185499 -194097 -74161 72806 5215
12134 5215 60272 178513 197145 70251 118686 168134 -8883 19130 90790 121728 81393
12123 81393 40260 5694 30305 -15736 174970 339977 471125 399404 333311 189292 36250
12112C6250Q6361K48265P2773j27298o5238n6411j10034J4080K6728o7532q03
12101E7141L4355k1391N9649L708p9476j18395j88087N9634R6162P2202k0446
12090d4944Q9846K27757o4917k03936K8796N2455l0964p0648J003o0192j83549
12079b59293P0310K45153K30314k578q4610r4667l7746L0346j65652j1705J11198
12068C1070j5131J38189O8536j35687l3700l523r4185J29101R7821j11699k00829
12057a30037j72274M0942l5852k5214L02845J69534l5762K6568Q7715L1923r483
12046B50905q0408L0202l4302L5150j40235Q4475M3572R7784J11874n4049k17099
12035A27869R3343Q2652j45440k02472L3199K01841R1156P3333j46979j04857
$$ plain form
12112 36250 122611 370876 443649 316351 251113 194702 84668 98748 125476 57944 57141
12101 57141 91496 70105 129754 133462 53986 -64409 -252496 -192862 -96700 -24498 -44944
12090 -44944 44902 272659 207742 3806 32602 85057 54093 -16555 -15552 -75744 -259293
12079 -259293 -188983 56170 286484 283906 199296 104629 66883 97229 -68423 -80128 31070
12068 31070 15939 154128 222664 86977 53277 49754 -44431 84670 182491 70792 -130037
12057 -130037 -302311 -261369 -297221 -322435 -19590 149944 114182 140750 228465 260388 250905
12046 250905 170497 200699 166397 201547 61312 145787 189359 287143 399017 344968 127869
12035 127869 221212 303864 158424 -44048 -10849 190992 282148 355481 208502 103645
12025A03645k28941j799l3460J53133J22666k02298o6632J18188N4861p1342m6030
12014i8009m0914K08747K10340j39566q8258p7848o779K207L6342K68063J5165
12003B89490j05092m3300j30260j90391O7566J34235J27441R2081L1237L3072
11993C06079J5950o4342q9520k98927J0939K26782J20516k17527j91374O7275
11983a14149J95681p7330k2457J07140P5166l0798m5063j856p1598j8476n2923
11972e6663j3542R6668K21035L5925k84117k29454J08314K01397r4508j5565O6370
11961C5860r7775K3608q9187l4891K3065j4774j54418o5782J68231J28406l3117
11950a10774r0385O2411J00538r2323o9528J81090P7928K394J06069N5072j71604
$$ plain form
12025 103645 -125296 -127095 -160555 -7422 115244 -87054 -153686 -35498 19363 -51979 -98009
12014 -98009 -138923 69824 280164 140598 52340 -25508 -32287 -30080 6262 274325 289490
12003 289490 184398 141098 10838 -179553 -111987 22248 149689 241770 273007 306079
11993 306079 322029 257687 168167 -130760 -119821 106961 227477 9950 -181424 -114149
11983 -114149 81532 4202 -18255 88885 164051 133253 88190 86334 14736 -3740 -56663
11972 -56663 -70205 26463 247498 283423 -694 -230148 -121834 79563 -14945 -30510 35860
11961 35860 -61915 -38307 -127494 -162385 -139320 -154094 -308512 -374294 -206063 -77657 -110774
11950 -110774 -201159 -138748 -38210 -130533 -200061 -18971 58957 61351 167420 222492 50888
11939E0888q4462l9640l0504j05385l6022j44742m94J98824K01201j57999o6433
11928b14768k1215R4256N9076J02108k8582P5738J3806m0371J28302R4887j8207
11917B45030l6301j26562n1730O2247J09478j08051p4548k2763O2489l0404n4398
11906b5513m3510J27957m7155n7290O9650j07577j06888L3539M4667P4498J24482
11895H6860L3791N597K3455L7444j97763o2954J58913P2959o6349m9703O3327
11884A05577j5328j69801q8577j41662K3406K22769L1791k6562Q1417j42290j6659
11873a35919n371o7802K8860P1878J72686J66749l3233j20476j83177j81015R6132
11862a90688K77734J06696n215r3103K6979j1787j44714j95513J11197K04824
$$ plain form
11939 50888 -33574 -73214 -103718 -209103 -245125 -389867 -390361 -191537 9664 -148335 -214768
11928 -214768 -235983 -141727 -82651 19457 -9125 66613 80419 40048 168350 263237 245030
11917 245030 208729 82167 30437 92684 202162 94111 19563 -3200 59289 28885 -25513
11906 -25513 -69023 58934 11779 -45511 24139 -83438 -190326 -156787 -112120 -37622 86860
11895 86860 120651 126248 149703 187147 -10616 -73570 85343 158302 91953 42250 105577
11884 105577 90249 -79552 -168129 -309791 -286385 -63616 -31825 -58387 23030 -119260 -135919
11873 -135919 -141290 -209092 -180232 -108354 64332 231081 197848 77372 -105805 -286820 -190688
11862 -190688 87046 193742 188527 95424 122403 110616 -34098 -229611 -118414 86410
11852H6410K09713M446m6276k18763k39964l9179J57464J70881O2826j92156Q0101
11841C5503m6793j99417o2726K1549m6192L10378K26560j54226j99953l5968p780
11830a59065N6544L5669q7985m5845K4199J33218J23573P7369p115j06178q0392
11819c6008j60957j25626l7980J50542r3451o7242N8395J09079J15747J73442
11809H5941M3918j60904j13992j20850N5662J72436M1828m4796l9043j15399P7936
11798a17263K102J63365K46529k08354j58384J58495P6622J5233n0153j59288
11788c1096Q4142J4728j1977l0389K3908N5128j4611j2196j42228J78408J844
11777A15661l1220j88293J29529J01733p2591m6724r4195P9166J4415p6734O3024
$$ plain form
11852 86410 296123 300569 254293 35530 -204434 -243613 -86149 84732 147558 -44598 35503
11841 35503 -11290 -210707 -273433 -251884 -298076 12302 238862 84636 -115317 -151285 -159065
11830 -159065 -102521 -66852 -154837 -200682 -176483 -43265 80308 157677 150562 44384 -36008
11819 -36008 -196965 -322591 -360571 -210029 -303480 -370722 -312327 -203248 -87501 85941
11809 85941 129859 -31045 -145037 -265887 -210225 -37789 4039 -40757 -79800 -195199 -117263
11798 -117263 -115161 48204 294733 86379 -72005 86490 163112 178345 128192 -31096
11788 -31096 53046 67774 55797 25408 49316 104444 89833 77637 -64591 113817 115661
11777 115661 84441 -103852 25677 127410 54819 8095 -86100 -6934 7481 -69253 -6229
11766f229J02537q9629J3810r006m706K7002n4482r575O4078Q0640M2688j73488
11754a6360j08374j44030J2430O9015N8383K8864J00421p4555M7363K5910j55392
11743a56325j52201O1389J8282J18256l7131k2608j0652P8058k1290J05057R7773
11732G8608K36716J44420o2717j60350j75879J660J5329m9836n2656J05548q5887
11721e044m0760M1303p8538o413P9035j4038j15807j56952n9328J39537J61066
11710e5939P2585J49557j87461r2018M4612L762m9125J07638J37092N2943j5449
11699A68197K6059j88162M7068O9740r7987k27352O5314J45908q656o4746K00554
11688A35937o1874k8657k0396p7014j12972n7903O6051l28j01488P3377K62632
$$ plain form
11766 -6229 96308 6679 20489 11483 6777 33779 -20703 -30278 33800 114440 157128 -16360
11754 -16360 -124734 -268764 -256334 -187319 -128936 -100072 349 -74206 -26843 -933 -156325
11743 -156325 -308526 -247137 -228855 -110599 -147730 -170338 -180990 -102932 -124222 -19165 78608
11732 78608 315324 459744 397027 236677 60798 62458 77787 27951 -24705 80843 -5044
11721 -5044 -45804 -4501 -83039 -89452 -10417 -24455 -140262 -297214 -356542 -217005 -55939
11710 -55939 16646 166203 -21258 -113276 -68664 -64902 -114027 -6389 130703 183646 168197
11699 168197 194256 6094 53162 122902 24915 -202437 -137123 8785 129 -64617 135937
11688 135937 74063 45406 25010 -52004 -164976 -222879 -156828 -157156 -258644 -185267 77365
11677G7365q5325j36917Q9107J34199l0116n5809j20871o2604K80872P1590j51047
11666A0444j55903m4755L9377M4238j08424J05039J82223J6456j42288J74105
11656A20512j414j48218J17533n7845J908j32111L693N023M6383n8279m8048Q3149
11644f7714K9055r323P2544K6773q5526q5739N5108J11413j02733p4159l4889
11633a65190O5099K5282l7691k3208J39785O571r1228m0153J04645j8447j34205
11622a68740M9143O068N7656M6547j1266r376J34301J82127j05955l24679r4550
11611b38724R484K11195J07302j33963j64284m529j9265K8872J29837n7896j2973
11600a44944M9701r2366J20901K58490k1901n5936p6642Q9016L1164o9771j70932
$$ plain form
11677 77365 -7960 -144877 -55770 78429 48313 -7496 -128367 -190971 89901 161491 10444
11666 10444 -145459 -190214 -150837 -106599 -215023 -109984 72239 88695 -53593 120512
11656 120512 119098 -29120 88413 30568 32476 -99635 -95942 -90919 -44536 -102815 -150863 -67714
11644 -67714 -38659 -47982 24562 51335 -34191 -119930 -64822 46591 -56142 -130301 -165190
11633 -165190 -100091 -74809 -112500 -135708 4077 10648 -80580 -120733 -16088 -34535 -168740
11622 -168740 -119597 -113529 -55873 -9326 -20592 -29968 104333 286460 180505 -144174 -238724
11611 -238724 -229240 -18045 89257 -44706 -208990 -213519 -232784 -203912 -74075 -131971 -144944
11600 -144944 -95243 -187609 -66708 191782 169881 113945 37303 126319 157483 87712 -83220
11589h3220j07760J40497R8116j5423J14520l0033R32O3600j9512n8785j3489
11578H9443m2720j08362q0021l8721l0019n6209K6203J95898J09654l0302j4044
11567B0800N6294j83823k33414J04579J50275N1731K7600j597j29786j15966J8857
11556b34450J3294l0448j58632M5186J65949J80682p537j0551J43773J13319r8079
11545A22506P4450k41416r8482J61904J29982O0175m1574r6271j75159m2263Q9840
11534e6308J14156M70J4737J05785R038K8293k22270j15467p8853J54069j56984
11523b03334j23146M7462J86874J89940K4129N8492l806p5587R141O3567j2028
11512A61704R031L2703L9403j89967j68256K1990R652N4255R1118K57279l5409
$$ plain form
11589 -83220 -190980 -50483 47633 32210 146730 116697 117629 181229 161717 102932 89443
11578 89443 46723 -61639 -141660 -180381 -210400 -266609 -240406 -44508 65146 34844 20800
11567 20800 77094 -106729 -340143 -235564 -85289 -33558 -5958 -7555 -137341 -253307 -234450
11556 -234450 -221156 -251604 -410236 -365050 -199101 -18419 -25956 -36507 107266 220585 122506
11545 122506 196956 -44460 -142942 18962 148944 209119 167545 71274 -103885 -146148 -56308
11534 -56308 57848 58318 73055 178840 187878 216171 -6099 -121566 -200419 -46350 -203334
11523 -203334 -326480 -279018 -92144 97796 121925 180417 176611 101024 110165 173732 161704
11512 161704 170735 203438 242841 52874 -115382 -93392 -83740 -29485 61633 318912 283503
11501B83503k70150j6309J56058J06369l2067j64362n896J47401l3834j75865
11491e152j03516P0324k3485P4564Q016j73087L9498j05243o100Q1748L6852O268
11479i9313o7357r6395O5024L993j97790j0475J36635K1478J87022J2974n4363
11468i8567M366J54472n7329j6652Q9593r9527n2264m233R1716j88496R9652L2134
11456d5135j59549j06235O0468m4250J08308L21806J12422n4573q7942j32232
11446b6912o9306n9138J02079J12854J83867p86k18156n2104q222k03349O1779
11435a77394K38495M3323j21858P3894K8140N2643M0212j47180j14712o8990J49321
11424d106m8155n2618J53140p8343j27395R4374J03677K50154n8990k18543L3035
$$ plain form
11501 283503 13353 -2956 153102 259471 227404 63042 57146 204547 170713 -5152
11491 -5152 -108668 -38344 -61829 12735 20751 -152336 -112838 -218081 -224181 -142433 -105581 -99313
11479 -99313 -166670 -263065 -198041 -194048 -391838 -402313 -265678 -244200 -57178 -44204 -98567
11468 -98567 -94201 60271 2942 -13710 75883 -23644 -75908 -80141 11575 -176921 -77269 -45135
11456 -45135 -204684 -310919 -250451 -294701 -186393 135413 247835 193262 105320 -26912
11446 -26912 -96218 -155356 -53277 59577 243444 242658 24502 -27602 -35824 -239173 -177394
11435 -177394 61101 104424 -17434 56460 84600 137243 177455 30275 -84437 -153427 -4106
11424 -4106 -52261 -104879 48261 -30082 -157477 -63103 40574 290728 231738 13195 46230
11413D6230n1959j90202o7229k1904r6865j5768J16913O69l9831M2734R9604Q1455
11401i6153m8903m8706o048J9538n5635K9005Q818J61203J37157R6894p9066J151
11389A19255j09746k54600j04257M8841L9926N2857n8050J50929r6748o5022P4340
11378b02275N5765m0143n1747J03156J77219R6520o4479n7558M496n8011o7047
11367a04104o2843J19031r6524p4561o4056Q8882J26900J41285L4772J4305j7290
11356A05797J29903j2147q2308k6620O9470m0625j85463j20284O1588l9195M8808
11345i1076j31998M120n863J0918P8420K31864Q3124j80080j33016J5354p3241
11334a91474K5782M2747R861R0912N1420L2592r7236o9095K523J4050Q232Q4888
$$ plain form
11413 46230 -5729 -195931 -263160 -285064 -381929 -397697 -280784 -280115 -319946 -277212 -177608 -96153
11401 -96153 -145056 -193762 -199810 -180272 -235907 -206902 -198084 -36881 100276 197170 118104 119255
11389 119255 9509 -245091 -349348 -300507 -260581 -207724 -265774 -114845 -211593 -276615 -202275
11378 -202275 -146510 -186653 -238400 -135244 41975 138495 74016 16458 20954 -37057 -104104
11367 -104104 -166947 -47916 -144440 -219001 -283057 -194175 -67275 74010 108782 123087 105797
11356 105797 235700 223553 141245 114625 184095 143470 -41993 -162277 -100689 -139884 -91076
11345 -91076 -223074 -218954 -224817 -213899 -135479 96385 179509 -571 -133587 -118233 -191474
11334 -191474 -165692 -122945 -113084 -22172 29248 61840 -35396 -104491 -101968 -87918 -79686 5202
11322E202j08503RJ63229J09206M3506n5319j68235O1806R3609j71032n7979J31
11310h4370R5068q1379j24579j8255P6674K36288M8419N2798J62199r3035j17586
11299A52242Q0309o5287r3852r8984P3052J43415J16107P5464J71481k523q2860
11288D68564j33413k82068j11067R2297O7007P0476q6107l4389J06609n4733k2591
11277H0585r6027K60888O5842j4301j7661j95691j49706j19560N4042Q5486j30022
11266a76125j71690l3306L8422J21455K04862O5551p0830O6688J20884J49915
11256C15826J63216j48096j54076j87392N4352l7541m2442k3110J27638P3162
11246A41537k52919j38770J98199K57524J57938n43j27674k31136p1039J73385
$$ plain form
11322 5202 -103301 -103292 59937 169143 212649 157330 -10905 50901 144510 -26522 -84501 -84370
11310 -84370 10698 -70681 -195260 -213515 -136841 99447 147866 200664 362863 269828 152242
11299 152242 232551 167264 73412 -25572 47480 190895 307002 382466 553947 551424 468564
11288 468564 335151 53083 -57984 34313 101320 171796 85689 51300 157909 103176 80585
11277 80585 -15442 245446 311288 296987 279326 83635 -66071 -185631 -131589 -46103 -176125
11266 -176125 -347815 -381121 -342699 -221244 -16382 49169 -21661 45027 165911 315826
11256 315826 479042 330946 176870 -10522 43830 6289 -36153 -59263 68375 141537
11246 141537 -111382 -250152 -51953 205571 363509 362966 235292 4156 -66883 106502
11236A06502n4999J21785N2596l1786m5420j1931Q8192O1429q43o0887j93856
11225C0782n4860J4385m6674j16532o6846R7607K04J3779m4295J6133m3824p9427
11213b79568J5745M0131K614n8311n5041j00028J11832l8332J55692J24803L4865
11202d5598J37642J04121m5982j17463q6209P2018J62067J42950j26958K0485
11192B17073j33629J0948O642J0374j4601j10310P4150J82046p3662l2826M9347
11181A85552N8597p4488n5507n4894j66916j26240N4569J39319L5192J28233l485
11170A19932q2343Q804K5177M0787Q4632j4632Q5864j1532j12756j34673q4984
11159g5724k05914m8729N5424P4891J59637K05764j20864q5041l3466J05363r3122
$$ plain form
11236 106502 51503 173288 225884 194098 148678 136747 224939 286368 285525 224638 30782
11225 30782 -24078 -9693 -56367 -172899 -239745 -142138 -141934 -128155 -172450 -156317 -200141 -279568
11213 -279568 -263823 -223692 -221078 -279389 -334430 -434458 -322626 -360958 -205266 -80463 -45598
11202 -45598 92044 196165 150183 32720 -53489 18529 180596 323546 196588 217073
11192 217073 83444 94392 101034 111408 96807 -13503 60647 242693 169031 136205 185552
11181 185552 244149 169661 114154 59260 -107656 -233896 -179327 -40008 -4816 123417 119932
11170 119932 37589 46393 71570 112357 196989 182357 268221 256689 143933 9260 -75724
11159 -75724 -281638 -330367 -274943 -200052 -40415 165349 44485 -40556 -74022 31341 -61781
11148f1781r6355j0113J9587K24917n796p8227j59572o2351n5356K04772L01802
11137B21527R8161j3226o6853j16765l1441j05619m3K49946K8524j95103j41575
11126g2467m3160j60375J1250J51901P2724K03014m7971j75731j0644J34870j86297
11115a22886k5645J64455j11718n0889k6963m2285l1733J555p416J88311o2370
11104a27584k1225J67196K23764m8695k51129j82621r3598O5918P6167K5105P6272
11093i0430p156m6066L3503J43549O1001j9398k60396j19755Q4523J88631L0241
11082a753K8263J31086J40859K7651q1447j51144j70025M4949P9781J27767J29210
11071C05197q7332j01575R8725Q013J172J40933K1231j18327P4747j6464j77222
$$ plain form
11148 -61781 -158136 -168249 -148662 76255 70459 -7768 -167340 -229691 -285047 -80275 221527
11137 221527 319688 306462 239609 122844 91403 -14216 -14259 235687 264211 69108 -72467
11126 -72467 -115627 -276002 -264752 -112851 -40127 162887 114916 -60815 -71459 63411 -122886
11115 -122886 -148531 15924 -95794 -146683 -173646 -215931 -247664 -246109 -253525 -65214 -127584
11104 -127584 -148809 18387 242151 193456 -57673 -240294 -333892 -267974 -191807 -166702 -90430
11093 -90430 -97586 -143652 -110149 33400 94401 75003 -185393 -305148 -220625 -31994 -1753
11082 -1753 26510 157596 298455 326106 244659 93515 -76510 -31561 48220 175987 305197
11071 305197 217865 116290 215015 223028 224200 365133 386364 268037 342784 326320 149098
11060A49098p2479l1199K827J24L6996R4500l2751l512r8904M1489J8654j44832
11048c9989J20971J22450o1547p5973j30305j69511J24498J60579Q7331p5182
11038F3322M0699l7190k60190j46370P9439J52464n8979j6648K27683J49038l9073
11027A54195k14263k93001L2926J06771o570J18678J44471k5222j31053n3045
11017a66113J28968p0736l772N7643P3453l4727k00303k9669l1880J34512J68714
11006B6090K5209o0836j0210n3462Q5200M6187j22225j73321L3069L6263J50687
10995a7349J15544J02291q2990l779J16481K519o9331j5545J06149P7730k18247
10984A13473j96740r0608J46100l3445p3509J15075R6463o9607j0940J6144N4186
$$ plain form
11060 149098 76619 45420 48247 48371 85367 179867 147116 143604 44700 86189 104843 -39989
11048 -39989 80982 203432 141885 65912 -64393 -233904 -109406 51173 138504 63322
11038 63322 104021 66831 -193359 -339729 -260290 -107826 -166805 -183453 44230 193268 154195
11027 154195 -60068 -353069 -320143 -213372 -219942 -101264 43207 17985 -113068 -166113
11017 -166113 -37145 -107881 -111653 -54010 19443 -15284 -215587 -245256 -277136 -142624 26090
11006 26090 51299 -9537 -19747 -73209 11991 58178 -64047 -237368 -204299 -168036 -17349
10995 -17349 98195 200486 117496 113717 230198 232717 163386 147841 253990 331720 113473
10984 113473 -83267 -173875 -27775 -61220 -134729 -19654 76809 7202 -3738 12406 66592
10973F6592J10842j52021j05650p0874j7101j27219J56749M7126j46719m3912
10963b82187K06594J59658p042o4275m0367L7241q3198l8438j02384q9712q1141
10952c85251K439k679Q105N9405J12956J77651K0115N2793N6533m0080j63716
10941a01729q9690J06448l3826j41289P7863J85910l4584L8781L1046r8925K9685
10930c0310L9407m905K44100J15075n1695k26306j25214L611K35660L4413q2969
10919A50867J09176R0590p1486k20828p7864J65559j49084r3762J02217L8093
10909D3478J45441j15312k47197M1801J92639J27549R8998P6005J66119M02534
10899I32055J83527r4782J0525Q8594J5587K38191J99124k81072m72330k23458
$$ plain form
10973 66592 177434 25413 -80237 -151111 -168212 -295431 -138682 -91556 -238275 -282187
10963 -282187 -75593 84065 77023 12748 -27619 9622 -73576 -112014 -214398 -304110 -385251
10952 -385251 -382812 -385491 -377386 -317981 -205025 -27374 -7259 45534 102067 61987 -101729
10941 -101729 -191419 -84971 -118797 -260086 -182223 3687 -30897 7884 38930 -59995 -30310
10930 -30310 9097 4192 248292 363367 311672 85366 -39848 -36237 199423 233836 150867
10919 150867 260043 350633 279147 58319 -19545 146014 -3070 -96832 5385 43478
10909 43478 188919 73607 -173590 -131789 60850 188399 287397 363402 529521 932055
10899 932055 1115582 1020800 1031325 1119919 1135506 1373697 1572821 1291749 819419 595961
10889E95961j13347j76448o9157j01079Q3355R9988O697m1212l7961k888k3022
10878B20887n4570R2147J05731M8640j52047K1017J1563j69313r7855J5725J84096
10867B26021j44785R7538J68480J01017j14471k3191P3892j36617j77115l4501
10857C6268m2154P1914J29530Q8659L3212k15O4457l4667j85989o6825K6668k975
10845A17883j26R9908K0047j1707j10799j21710q5225J9055R0234K82834l7083
10834B63311j12938p7074J70940O2425j38024j8221l7263m3129k0825L3382o9756
10823A2828l7768j49205O2078J70367R4923P8218j1420P4929j45218r3761o0177
10812d206R0334M4808m1895o3880j39275k7370k2735j327Q9261J22953k2503l10444
$$ plain form
10889 595961 482614 306166 237009 135930 219285 319273 325970 284758 246797 243909 220887
10878 220887 166317 258464 364195 412835 260788 281805 293368 124055 26200 41925 226021
10867 226021 81236 178774 347254 448271 333800 310609 384501 247884 70769 36268
10857 36268 -5886 66028 195558 284217 317429 317214 381671 347004 161015 94190 120858 117883
10845 117883 117757 217665 237712 226005 115206 -6504 -91729 -72674 17560 300394 263311
10834 263311 150373 73299 244239 306664 168640 150419 113156 70027 49202 82584 12828
10823 12828 -24940 -174145 -112067 58300 153223 231441 220021 294950 149732 55971 -4206
10812 -4206 86128 130936 89041 25161 -114114 -141484 -164219 -165546 -76285 46668 24165 -286279
10800b86279O277J72828J32025O3960r5791J0336J46623R4938J0655m5559j79340
10789C0673m0156O1720q0198J1742J6198q9237j60846P2406O2686J17077o1352
10778e9287k63753o1813J55844j35562O2763J82224N5743N8595n6180j12023O5994
10767a07455R0332M6705K2451o1140n0434P6462R0880K3583r0857o2920K5594
10756C201L136l0232k09808k10540J00260R8509l0368L842J5855K03589P9051
10745B6495K34754k01963j43826M2062L0836r979J2078n3389J57782O4261j05145
10734E3966J0242O0463p3639j09119m5130K11285J06948j02165j4846k4778j38853
10723f5626l5290R7053K9318j16961R2227L4016m5673q4465J4413Q3518j03191
$$ plain form
10800 -286279 -280002 -107174 24851 88811 -6980 3356 149979 244917 255572 210013 30673
10789 30673 -9483 52237 -27961 -16219 -21 -89258 -250104 -177698 -115012 2065 -59287
10778 -59287 -323040 -384853 -229009 -364571 -301808 -119584 -63841 -5246 -61426 -173449 -107455
10767 -107455 -17123 29582 52033 -9107 -59541 16921 107801 131384 40527 -22393 3201
10756 3201 6337 -23895 -233703 -444243 -343983 -245474 -275842 -272000 -256145 -52556 26495
10745 26495 261249 59286 -84540 -42478 -11642 -21621 -9543 -62932 94850 159111 53966
10734 53966 64208 124671 51032 -58087 -103217 108068 215016 112851 98005 73227 -65626
10723 -65626 -100916 -3863 25455 -91506 721 34737 -10936 -95401 -80988 2530 -100661
10712a00661K16729L7094o9244m185k7588p3297j22346o6254k9298m0167P3496
10701b05721K18362n5493r7725O2741R2957p3949j5244N7689k2737p0029j17382
10690b26531J46968J40987Q3490o6085L1143m3802k687p1443j66017N9973R3070
10679b0934n916m9561j15154j06455J67453J95633r4527o7484J14376L6895j97152
10668a42826J15487J39956n1383j40150N3868J72639J02475m6890j47690j52725
10658i7239k2489J88426J18281j9441K8057J8398o3781o5332j09998j19852r6389
10647b41359K8488R4626p5371K2196K18895J57102M6041l9403P355j11288K4014
10636A31296j96351q8888O5618Q6065l8030M4431j04887j07759K488J95785k1051
$$ plain form
10712 -100661 116068 153162 83918 79733 52145 -21152 -143498 -209752 -239050 -279217 -205721
10701 -205721 12641 -42852 -140577 -77836 15121 -58828 -74072 -16383 -39120 -109149 -226531
10690 -226531 -79563 61424 144914 78829 109972 66170 63483 -7960 -173977 -114004 -20934
10679 -20934 -26850 -76411 -191565 -298020 -130567 65066 -29461 -96945 17431 54326 -142826
10668 -142826 -27339 112617 61234 -78916 -25048 147591 250066 203176 55486 -97239
10658 -97239 -119728 68698 186979 167538 195595 213993 150212 84880 -25118 -144970 -241359
10647 -241359 -212871 -118245 -193616 -171420 47475 204577 250618 211215 218570 107282 131296
10636 131296 -65055 -153943 -88325 -2260 -40290 4141 -100746 -208505 -206017 -10232 -31283
10625c1283m3259j71989N0498Q2666J09080L0168M6141q8050j8754R545n5886
10614h1123q6371j85203k241R3829M0237Q146L8656K2141N8016j44561j50523
10603c88997p5049P7493M5505r429n3889J13795J03355r207J16470J72606J2177
10592A04830r9099j9240M7826m357k06423j30025r1671l8683K16618J63946K00404
10581A44126M5467j36152j51868k5736O7522r2680l1517L7041q024j18314L963
10570b66172J49661N0883m3418N5157n7040Q1346M5648Q2844l7034j80368o1054
10559a79547K37865M2707m3821j6438j21172n7800L3442j09710K1513Q505o1422
10548b45878j29056J07436J03263m9702j41553K5829n0350r3148J01693K7429
$$ plain form
10625 -31283 -74542 -246531 -196033 -113367 -4287 25881 72022 -16028 -34782 -25237 -81123
10614 -81123 -167494 -352697 -354938 -261109 -220872 -212726 -174070 -151929 -93913 -238474 -388997
10603 -388997 -464046 -386553 -341048 -350477 -404366 -290571 -187216 -196423 -79953 92653 104830
10592 104830 5731 -13509 34317 29960 -176463 -306488 -398159 -436842 -220224 -56278 144126
10581 144126 189593 53441 -98427 -124163 -56641 -149321 -180838 -143797 -151821 -270135 -266172
10570 -266172 -116511 -65628 -109046 -53889 -110929 -29583 16065 98909 61875 -118493 -179547
10559 -179547 58318 101025 57204 40766 -80406 -138206 -104764 -214474 -192961 -184456 -245878
10548 -245878 -374934 -267498 -164235 -213937 -355490 -329661 -380011 -473159 -371466 -344037
10538c44037Q5865J99843k3328j367L0000j1862J57327O3302l7582n7172r2808
10527c1819j33452k888M1361n2248l8685Q7577M1378m2923J5727J45574n4662
10516b5060M4455j04654L1887Q5036J17679k4581o2761p3737j34871j31485k9164
10505c07256M0117K1594J84478R6146J00551q9704j62252j79193J4731P0979N0898
10494a58911j25954j22471q2939p7919M3707M8521P1630K28762J16190N2783j8663
10483b5264j39938N5024R7359L7256n1293l3347R934l1007k4310J50314J12313
10472A57041j15444r6451K1130l8558L8644n7286j66472k9315l773Q1290K2843
10461a86351M1275J04786n0760m429K4852O2717J43538R7930O8280q1196m2851
$$ plain form
10538 -344037 -258172 -58329 -81657 -83024 -53024 -64886 92441 155743 118161 60989 -31819
10527 -31819 -165271 -168159 -126798 -179046 -217731 -130154 -88776 -131699 -115972 29602 -25060
10516 -25060 19395 -85259 -53372 31664 149343 124762 62001 -11736 -146607 -278092 -307256
10505 -307256 -267139 -245545 -61067 35079 135630 45926 -116326 -295519 -280788 -209809 -158911
10494 -158911 -284865 -407336 -490275 -568194 -524487 -475966 -404336 -175574 -59384 -6601 -25264
10483 -25264 -165202 -110178 -12819 24437 -26856 -60203 -50269 -81276 -105586 44728 157041
10472 157041 41597 -54854 -33724 -72282 -33638 -90924 -257396 -286711 -290484 -209194 -186351
10461 -186351 -145076 -40290 -91050 -95479 -70627 -7910 135628 233558 301838 220642 177791
10450A77791n7369j60973j00898J0727O8044P4608L1881j5153J6180j40462p1457
10439a67081J20863l6819o3109M8402p720L7768J02139p6398j63074j31518M2205
10428b94342O7582K95017P0973j57743j24740J98274K20837j03648k13176n8880
10418i9846L0053j36502K8195J25543R4622R6852k5039m8773l5653q7468j3675
10407g1691N7528p6499m1237J27822N8980l0090r6338j12344j4649J14720P1665
10396a2133m470O5699Q3973j14682j17984r710J18566R1907q4843r4444m4609
10385a22730m8373N4643M8022J88601K0454j25188k3251j96017P2045J4558O5103
10374e2133J14864J06522j91558j02763l3316J33647m5398P2982L5476K4220R6501
$$ plain form
10450 177791 120422 -40551 -141449 -130722 -62678 11930 43811 28658 44838 -95624 -167081
10439 -167081 -46218 -83037 -146146 -97744 -105464 -67696 34443 -41955 -205029 -336547 -294342
10428 -294342 -226760 68257 139230 -18513 -143253 55021 275858 172210 -40966 -99846
10418 -99846 -69793 -206295 -178100 -52557 42065 138917 113878 65105 29452 -58016 -71691
10407 -71691 -14163 -90662 -131899 -4077 54903 24813 -71525 -183869 -198518 -83798 -12133
10396 -12133 -16603 49096 133069 18387 -99597 -109307 9259 101166 16323 -78121 -122730
10385 -122730 -171103 -116460 -68438 120163 140617 15429 -7822 -203839 -131794 -117236 -52133
10374 -52133 62731 169253 -22305 -125068 -158384 -24737 -70135 2847 38323 62543 159044
10363A59044j05851l0162N2863r9488p9587P7569J9211j20143K9351J81862J74626
10352B59295q6793j36592q5739q7973Q5696J6465j53913Q2892l2466q5989N5359
10341a69758J46656J32225n9097J63499K5612j84901j13067k18090l3629K15683
10331i4867M8195J8886K9308j10744j30077j4316J31772J79862K0244j75410j6483
10320a13630q9366J9977j24498O8004J87256J34822r2627J2108J1754l5313K4068
10309B555l5405l6966l2258L0489J02826P7315j04601o4727J89847L8324j6785
10298A50614n8353p3192l5817M34O1790j0821k45433k38412r9542J75680M8509
10287c24543Q7148J42181l3556J26673N2789K07868k0550j13785J75330l3472
$$ plain form
10363 159044 53193 23031 75894 -23594 -103181 -25612 -6401 -126544 -97193 84669 259295
10352 259295 172502 35910 -49829 -137802 -52106 -35641 -189554 -106662 -139128 -225117 -169758
10341 -169758 -23102 109123 50026 213525 239137 54236 -58831 -276921 -310550 -94867
10331 -94867 -46672 -27786 1522 -109222 -239299 -253615 -121843 58019 78263 -97147 -113630
10320 -113630 -202996 -183019 -307517 -239513 -52257 82565 -10062 2046 13800 -21513 2555
10309 2555 -32850 -69816 -102074 -71585 31241 108556 3955 -60772 129075 167399 150614
10298 150614 92261 19069 -16748 -16314 45476 34655 -210778 -449190 -548732 -373052 -324543
10287 -324543 -237395 -95214 -128770 -2097 50692 258560 238010 124225 299555 266083
10277B66083J06154m6429m8665Q765J375k35898j08042n4614R695K0931O8279
10266a2366K0919p9596N031L9124n0694R6563N5280l7465r6700q1200J52180K32015
10254B43091l6947k64481j38930k3805j89381r8504J69302Q223J59352J64501
10244g579o8j9754m2218o1904J8671q0507K79705M140l25761j5857O5821J16450
10232f8861J06030p6797p520N2803j9912N3786M3751p9613l4212j4018J22322
10221G7759j1201j06603P749r6101l0601j76379m3345K33482P8216L7345M8598
10210A8919J11386L1500K3392q438n9133j4767K2931Q8210k1522j40917l11083
10199b59522j6961K75867P8392k93514k73803J31514K40534P7314n1389m0078
$$ plain form
10277 266083 372237 325808 277143 285908 287283 51385 -56657 -111271 -101576 -80645 -12366
10266 -12366 8553 -71043 -66012 -26888 -77582 18981 74261 36796 -59904 -141104 11076 243091
10254 243091 206144 -58337 -197267 -221072 -410453 -508957 -339655 -331432 -172080 -7579
10244 -7579 -7647 -27401 -69619 -131523 -112852 -193359 86346 90486 -235275 -251132 -185311 -68861
10232 -68861 37169 -39628 -47148 5655 -14257 39529 83280 3667 -30545 -44563 77759
10221 77759 66558 -40045 -32296 -128397 -158998 -335377 -378722 -145240 -67024 -29679 18919
10210 18919 130305 161805 185197 176759 117626 102859 125790 214000 192478 51561 -259522
10199 -259522 -276483 -616 77776 -215738 -489541 -358027 -117493 -40179 -91568 -131646
10189a31646m1624J54277K8245r5144j43668P4000J10741j455r817n94J50455
10178I3770K2755k86436j70086N9862L42512O6243j58989j51300R5362K25011
10168A38704m5891r3876j33697q4226o3059J89236O0876R4917N7256p2686j3163
10157C4391M4760j1137J7935P9564o7506m9488m8120P2577n1177q1275j29610
10146a89086R1047L0121l0802J36307J97651j5190j42438k94267K91J16479p840
10135a07727j9128K66783J27428n3429J55369j07965k55740j49813P9936r2294
10125a56580m4125J26866K22942K8027J91657J7017j93789j52013M0127j16836
10115c6707O8385O7048J0557l6605K3974j19285j19584J13367J18797m4758l7623
$$ plain form
10189 -131646 -173270 -18993 9252 -85892 -229560 -155560 -44819 -46274 -56091 -56685 93770
10178 93770 116525 -169911 -339997 -280135 62377 128620 -30369 -181669 -86307 138704
10168 138704 92813 -1063 -134760 -218986 -282045 -92809 -31933 62984 120240 47554 34391
10157 34391 79151 68014 85949 165513 98007 48519 399 72976 21799 -59476 -189086
10146 -189086 -98039 -67918 -98720 37587 235238 220048 77610 -216657 -216366 -99887 -107727
10135 -107727 -126855 139928 267356 213927 369296 261331 5591 -144222 -64286 -156580
10125 -156580 -200705 -73839 149103 177130 368787 385804 192015 40002 80129 -36707
10115 -36707 31678 98726 109283 72678 96652 -22633 -142217 -28850 89947 45189 7566
10104G566L7187R1298j03540k2945J05290k9066q8448J2724Q5981K63772J59192
10093E19011j56309p3701J07882o3161j73239j11221p39p2649l2093J3241J04994
10082F2016N1013L273J51194J40385J19868K40071K89021J60895J55200K157K87499
10071A662592N63055O56376R03604J515252K656345M562223O766136O169869L705199
10062B9160651M764706M834104R72166m399621j0895014r318439m738605k372453
10054H007495j456157r36604n44271m26815n12105l80812j38044j41125l14698
10045C156864L149j16303l09833o9089j10751r6211k77243j91547j01138j47891
10035A740007j64518j01365J49851Q7955q8228q0128k1719j38588p2067m314J8853
$$ plain form
10104 7566 44753 136051 32511 9566 114856 85790 -2658 10066 96047 359819 519011
10093 519011 362702 289001 396883 333722 160483 49262 48523 -24126 -56219 -42978 62016
10082 62016 113029 116302 267496 407881 527749 767820 1056841 1217736 1372936 1375093 1662592
10071 1662592 2225647 2882023 3785627 5300879 7957224 12519447 19285583 25455452 29160651
10062 29160651 33925357 38759461 39731627 35332006 24436992 15118553 10379948 8007495
10054 8007495 6551338 5614734 5070463 4643648 4131543 3750731 3612687 3471562 3156864
10045 3156864 3160013 3043710 2733877 2664788 2554037 2457826 2180583 1989036 1887898 1740007
10035 1740007 1575489 1474124 1623975 1711930 1623702 1543574 1521855 1383267 1311200 1306886 1325739
10024A325739j57805j4519j08658r8951O4269k21426J3809O5576O5187r2491k8712
10013H12018L9569R639O4530J34341k2081j46659j29034P4599K59532n5107j42784
10002H98563j44626k3527N2316j33102k15048J06250Q2033J2945o7060q5243o2371
9991D21130j12892o3631R0095J15595l0220n9024o2409K5143o4648k9882J06517
9980C35774r6415P0345J29334j91626j5150N6596K16970P841k10842j1583J173
9969B92417K7467L9341k8231k4660J0557P668J0990N2435J05466q3888r4672k40641
9957G4249j8283M6059Q4226o2492N0556Q2264j60658o3149p537l7377j8845l0139
9945f1126J92679M8632j71158k5762K2302R0751J16700K9979n2485j6939J9423
$$ plain form
10024 1325739 1167934 1153415 1044757 945806 1010075 788649 802458 868034 933221 840730 812018
10013 812018 851587 861226 925756 1060097 1038016 891357 762323 836922 1096454 1041347 898563
10002 898563 753937 730410 782726 649624 434576 540826 622859 635804 568744 483501 421130
9991 421130 308238 244607 334702 450297 420077 361053 298644 323787 259139 229257 335774
9980 335774 239359 309704 439038 247412 232262 288858 505828 513669 302827 291244 292417
9969 292417 319884 359225 330994 306334 316891 324559 335549 387984 493450 409562 314890 74249
9957 74249 55966 102025 186251 123759 174315 256579 95921 32772 25235 -12142 -30987 -61126
9945 -61126 131553 180185 9027 -16735 5567 96318 213018 242997 190512 173573 192996
9934A92996j87599q3890O5104J55261K4285o4293L7268j13010p1039P0107N3992
9923G9182N2993m4466J49797K9706j96022m3214m133j05712n0049M5232p629P4396
9911a9919N3882J57636J01649l7266r822l7788r1902J56069O642N8007L8623l4652
9899C41159l00121j63623r9769J72195J43389j3849N2436J7666o310J06393K29442
9888D79008M9383j05802n4071P2222k55314l1074R0711R7363O2339J33564j665
9877E36664j69861n2058O489K40745K10508K68600M20243Q26005J170149J751029
9867E208513J919909J655321J602779J391519J112417l98729k131939k807037
9859G552753k429696j481819p99005m06403l03323m38347j95218J2029L4379j09856
$$ plain form
9934 192996 5397 -78493 -13389 141872 166157 101864 139132 26122 -44917 25190 79182
9923 79182 132175 87709 237506 267212 71190 27976 23843 -81869 -131918 -86686 -94315 -19919
9911 -19919 33963 191599 293248 255982 246160 208372 116470 272539 279181 337188 375811 341159
9899 341159 41038 -122585 -222354 -50159 93230 79381 131817 149483 143173 249566 479008
9888 479008 528391 422589 368518 440740 185426 154352 245063 342426 404765 538329 536664
9877 536664 366803 314745 321234 561979 772487 1041087 1461330 2287335 3457484 5208513
9867 5208513 7128422 8783743 10386522 11778041 12890458 12491729 10359790 7552753
9859 7552753 5123057 3641238 2842233 2435830 2132507 1694160 1498942 1510971 1545350 1435494
9849A435494j2385j05486q5176j17086o9632k19898j25950k8351O96j09379j30717
9838D32130p7006L8683p42J06258j536p4787q4879J28497R3142l6514k42935o2123
9826B18188K7247K5412r2188J00960r5219N6777R7891j34598R3352J12058m7738
9815C62142k03742K05416O5134j10153m8086o5190j5876p5416p2248J18272J7875
9804A78128K4826N9692q7176J54588J04842o0289j11031O1996L1435j32426P5603
9793C00188q2119L6788J64311r0798o7559k08021p1822Q4512K4102J7023J43832
9782B50437n0394o9794J76814N4741k76197P202J77335M7682n9918k08328M1836
9771I1416k748J7684R8002j21373k4233J48714O9982r4801j94792J1159O5052
$$ plain form
9849 1435494 1423109 1317623 1232447 1115361 1045729 825831 699881 671530 672226 562847 432130
9838 432130 355124 393807 393065 499323 497787 423000 338121 466618 559760 523246 280311 218188
9826 218188 245435 270847 178659 279619 184400 241177 339068 204470 297822 409880 362142
9815 362142 158400 363816 428950 318797 270711 205521 189645 114229 41981 160253 178128
9804 178128 202954 262646 175470 330058 434900 374611 263580 325576 357011 224585 300188
9793 300188 218069 254857 419168 328370 260811 52790 -19032 65480 89582 106605 250437
9782 250437 200043 130249 307063 361804 85607 92809 270144 317826 257908 49580 91416
9771 91416 88668 106352 204354 82981 58748 207462 277444 182643 -12149 -990 64062
9760F4062o6484J02934k8763m5345P31J64819j12759j07283N1978K3917N2941
9749A00748q3321j03866K01613O6754N9528L1658N0204n7454q6638j02867Q003
9738H4362r9792Q9688M0339K966J8656j15737j19593q993M9960R423Q5274J53713
9726A90266J10527q2884k6714j15853k21344Q092J38984J6187m6286n4872j43073
9715b26970o1837l469O391r393p7852Q1340P1108R6749M0126J07472r6199n369
9703g7903K48506n6130l6572N3860j36720q3009N7351l2826m6156P193q2568N8813
9691a26161J59512P7868o9908n7594O088K6004M8823j63224n6898J78229k813
9680A9926M1830j11139p703R5968l1617J09438J08494l1676l2764R335q922n7706
$$ plain form
9760 64062 -2422 100512 71749 26404 27135 191954 79195 -28088 23890 47807 100748
9749 100748 17427 -86439 115174 181928 241456 273114 323318 265864 179226 76359 84362
9738 84362 -15430 74258 114597 117563 136219 20482 -99111 -108104 -58144 -48721 36553 190266
9726 190266 300793 217909 191195 75342 -146002 -137910 1074 17261 -29025 -83897 -226970
9715 -226970 -288807 -292276 -285885 -295278 -373130 -291790 -220682 -123933 -83807 23665 -72534 -77903
9703 -77903 170603 114473 77901 131761 -4959 -87968 -30617 -63443 -109599 -102406 -184974 -126161
9691 -126161 33351 111219 41311 -16283 -10195 15809 64632 -98592 -155490 22739 19926
9680 19926 61756 -49383 -57086 38882 7265 116703 225197 193521 160757 170092 161170 103464
9668A03464p7362O4994J43472k4289j20583J6458m9098j02423J36838Q7890k9706
9657A49655j04227l7164J18831L2952P4167o1099k1272R273p3810k4531R4576
9646A57351j6242k6543j14544K8707K10077l6812n6958m5787M9159m3842m9656
9635E4910j05715j28335k9109Q4322l1114n5311K1645J30438J73392j6769j2710
9624H5644l5891j00052J6699L5874Q661J33779L2926p7980M9576M6981j36040
9613F0177j19286O3220M1826p1935o9686J47274m9428k03224K1010j02471Q8322
9602a94201P3165j0953n7670J9778K1945J33658j10614m961O39J22047P3376K5671
9590I1880m1202j46330k181Q4551O3621O5495K7731Q3507j11979o6717K21945
$$ plain form
9668 103464 26102 91096 234568 210279 89696 106154 57056 -45367 91471 179361 149655
9657 149655 45428 8264 127095 160047 234214 173115 151843 161116 87306 62775 157351
9646 157351 141109 114566 22 28729 238806 201994 145036 99249 148408 104566 54910
9635 54910 -50805 -179140 -208249 -123927 -155041 -210352 -188707 -58269 115123 98354 85644
9624 85644 49753 -50299 -33600 2274 10935 144714 177640 99660 149236 196217 60177
9613 60177 -59109 4111 45937 -25998 -95684 51590 2162 -201062 -180052 -282523 -194201
9602 -194201 -121036 -131989 -189659 -169881 -147936 -14278 -124892 -129853 -129214 -7167 66209 91880
9590 91880 50678 -95652 -97833 -13282 50339 115834 143565 227072 115093 48376 270321
9579B70321Q8935l6596j15741r5727j70721J911Q9431j7350l0862o8297K2494
9568f2202o0063j8906J63303K05014j28414j77768O8519J26808O971o8466O0926
9557A15722J12862J01140K2206P8626j77489k52838N7125o7870K073K2656J34821
9546A49034K0852J4293O5928j10521j52852j02158J33300o8834K581l2047J97235
9535A16811J13941o0242j25959P1666M7014J49245J01035m590r2694l32659j77248
9524a93680J39009J03132J83458r7783l6863j78636l4805j0909m0007k5702J10813
9513h1973J01884J68182j49207j33523N1617J21235m0283j60528n599J79619J83405
9502B34829p6833j19468j35132J29268K6677P0064J881O8335n472p7905j31170
$$ plain form
9579 270321 359256 322660 206919 111192 -59529 -57618 31813 14463 -16399 -84696 -62202
9568 -62202 -122265 -141171 22132 227146 98732 -79036 -10517 116291 123262 54796 115722
9557 115722 228584 329724 351930 430556 253067 229 57354 -10516 -8443 14213 149034
9546 149034 169886 184179 250107 139586 -13266 -115424 17876 -50958 -48377 -80424 116811
9535 116811 230752 170510 44551 116217 163231 312476 413511 408921 316227 -16432 -193680
9524 -193680 -54671 48461 231919 134136 97273 -81363 -116168 -127077 -167084 -192786 -81973
9513 -81973 19911 188093 38886 -94637 -43020 78215 37932 -122596 -128195 51424 234829
9502 234829 157996 38528 -96604 32664 59341 129405 131286 199621 194149 116244 -14926
9491a4926o3846O998P5988Q2892l2489M577J68749k8322q5221J29799K17848k35130
9479B26917k25266J8117P7333j7415j24955q358J63827J22889j2497o5415J4667
9468A69844j23183l3504p5430R6224Q7842L0785l3684l8764L6810J25K7249r697
9456A34617r306p9867J12337Q2383J45333K4198M9278p1927j17347j38050M795
9445A36444l807j03226N0237N3444P0314o0672j09507p2738j5584R927M5565j34771
$$ plain form
9491 -14926 -78772 -71774 4214 87106 54617 59194 227943 199621 114400 244199 462047 226917
9479 226917 1651 19768 97101 79686 -45269 -53627 110200 233089 220592 155177 169844
9468 169844 46661 13157 -62273 33951 121793 152578 118894 80130 116940 117065 144314 134617
9456 134617 125311 45444 157781 240164 385497 409695 458973 387046 269699 131649 136444
9445 136444 132637 29411 79648 133092 203406 142734 33227 -39511 -55095 -45168 397 -134374
$$ [...]
##END NTUPLES=NMR SPECTRUM
##END=
