##TITLE=Analysis number 321032
Compound Code cc 58516
Book Reference 196/174
Project Code adrs
Chemist Name jimp
##JCAMPDX= 6.0         $$ Bruker NMR JCAMP-DX V2.0
##DATA TYPE= NMR SPECTRUM
##DATA CLASS= NTUPLES
##ORIGIN= Bruker BioSpin GmbH
##OWNER= nmr
$$ XWIN-NMR		Version 3.5
$$ Thu Jul 20 12:19:27 2006 GMT Daylight Time (UT+1h)  MAYBRIDGE\nmr@NMR_250MHZ
##.OBSERVE FREQUENCY= 250.131544655141
##.OBSERVE NUCLEUS= ^1H
##.ACQUISITION MODE= SIMULTANEOUS (DQD)
##.ACQUISITION SCHEME= undefined
##.AVERAGES= 16
##.DIGITISER RES= 18
##SPECTROMETER/DATA SYSTEM= dpx250
##.PULSE SEQUENCE= zg30
##.SOLVENT NAME= CDCl3
##.SHIFT REFERENCE= (INTERNAL, CDCl3, 0, 16.4321)
##AUDIT TRAIL= $$ (NUMBER, WHEN, WHO, WHERE, WHAT)
$$ ##TITLE= Audit trail, XWIN-NMR		Version 3.5
$$ ##JCAMPDX= 5.01
$$ ##ORIGIN= Bruker BioSpin GmbH
$$ ##OWNER= nmr
$$ C:\u/data/dgb/nmr/ADRS/3190/pdata/1/auditp.txt
$$ ##AUDIT TRAIL=  $$ (NUMBER, WHEN, WHO, WHERE, WHAT)
(   1,<2006-07-20 12:18:53.77 +100>,<MAYBRIDGE\nmr>,<NMR_250MHZ>,
      <created by zg, POWCHK disabled, PULCHK disabled
       configuration hash MD5:
       E2 DF 36 D8 04 B2 41 60 5A D7 A3 38 5A 4B D0 FE
       data hash MD5: 64K
       81 C4 3B 20 34 6C 0A 2D 10 A7 1C 9D 41 30 0A 33>)
(   2,<2006-07-20 12:19:10.68 +100>,<MAYBRIDGE\nmr>,<NMR_250MHZ>,
      <Start of raw data processing
       ef LB = 0.3 FT_mod = 6 PKNL = 1 SI = 32K 
       data hash MD5: 32K
       6F FF 8E D8 6D 4F 79 89 7C 18 2D 86 C6 30 1A 41>)
(   3,<2006-07-20 12:19:12.59 +100>,<MAYBRIDGE\nmr>,<NMR_250MHZ>,
      <apk 
       data hash MD5: 32K
       11 4B 96 72 25 31 E8 FF 28 63 9C 39 28 94 AF 6B>)
(   4,<2006-07-20 12:19:13.40 +100>,<MAYBRIDGE\nmr>,<NMR_250MHZ>,
      <abs ABSG = 5 
       data hash MD5: 32K
       E3 02 A1 81 4F 4E 4A A1 E2 C4 1F 69 E5 C3 13 82>)
$$ ##END=
$$ 
$$ hash MD5
$$ 82 C0 A8 7B 57 EB D9 06 DE DB B1 FE F3 BD D8 CD
##$RELAX= 
##$RELAX= 
##$RELAX= 
##$RELAX= 
##$RELAX= 
##$RELAX= 
##$RELAX= 
$$ Bruker specific parameters
$$ --------------------------
##$DU= <C:\u>
##$EXPNO= 3190
##$NAME= <ADRS>
##$PROCNO= 1
##$TYPE= <nmr>
##$USER= <dgb>
##$AMP= (0..31)
100 100 100 100 100 100 100 100 100 100 100 100 100 100 100 100 100 100 
100 100 100 100 100 100 100 100 100 100 100 100 100 100 
##$AQSEQ= 0
##$AQ_mod= 3
##$AUNM= <au_zg>
##$AUTOPOS= <39 >
##$BF1= 250.13
##$BF2= 250.13
##$BF3= 250.13
##$BF4= 250.13
##$BF5= 500.13
##$BF6= 500.13
##$BF7= 500.13
##$BF8= 500.13
##$BYTORDA= 1
##$CFDGTYP= 0
##$CFRGTYP= 5
##$CHEMSTR= <none>
##$CNST= (0..31)
1 1 145 1 1 1 1 1 1 1 1 1 1 1 1 1 1 1 1 1 1 1 1 1 1 1 1 1 1 1 1 1 
##$CPDPRG= <>
##$CPDPRG1= <>
##$CPDPRG2= <>
##$CPDPRG3= <>
##$CPDPRG4= <mlev>
##$CPDPRG5= <mlev>
##$CPDPRG6= <mlev>
##$CPDPRG7= <mlev>
##$CPDPRG8= <mlev>
##$CPDPRGB= <>
##$CPDPRGT= <>
##$D= (0..31)
0 1 0 0 0 0 0 0 0 0.06 0 0 0 0 0 0 0.0002 0 0 0 0 0 0 0 0 0 0 0 0 0 0 
0 
##$DATE= 1153394332
##$DBL= (0..7)
120 120 120 120 120 120 120 120 
##$DBP= (0..7)
150 150 150 150 150 150 150 150 
##$DBP07= 0
##$DBPNAM0= <>
##$DBPNAM1= <>
$$ [...]
##$SUBNAM7= <"">
##$SUBNAM8= <"">
##$SUBNAM9= <"">
##$SW= 20.6930455092707
##$SWIBOX= (0..15)
0 0 3 0 0 0 0 0 0 0 0 0 0 0 0 0 
##$SW_h= 5175.983436853
##$TD= 65536
##$TD0= 1
##$TE= 295.16
##$TE2= 300
##$TE3= 300
##$TEG= 300
##$TL= (0..7)
0 120 120 120 120 120 120 120 
##$TP= (0..7)
150 150 150 150 150 150 150 150 
##$TP07= 0
##$TPNAME0= <>
##$TPNAME1= <>
##$TPNAME2= <>
##$TPNAME3= <>
##$TPNAME4= <>
##$TPNAME5= <>
##$TPNAME6= <>
##$TPNAME7= <>
##$TPOAL= (0..7)
0.5 0.5 0.5 0.5 0.5 0.5 0.5 0.5 
##$TPOFFS= (0..7)
0 0 0 0 0 0 0 0 
##$TUNHIN= 0
##$TUNHOUT= 0
##$TUNXOUT= 0
##$USERA1= <user>
##$USERA2= <user>
##$USERA3= <user>
##$USERA4= <user>
##$USERA5= <user>
##$V9= 5
##$VALIST= <valist>
##$VCLIST= <CCCCCCCCCCCCCCC>
##$VD= 0
##$VDLIST= <DDDDDDDDDDDDDDD>
##$VPLIST= <PPPPPPPPPPPPPPP>
##$VTLIST= <TTTTTTTTTTTTTTT>
##$WBST= 1024
##$WBSW= 4
##$XGAIN= (0..3)
0 0 0 0 
##$XL= 0
##$YL= 0
##$YMAX_a= 416658
##$YMIN_a= -539807
##$ZGOPTNS= <>
##$ZL1= 120
##$ZL2= 120
##$ZL3= 120
##$ZL4= 120
##$ABSF1= 16.43213
##$ABSF2= -4.26104
##$ABSG= 5
##$ABSL= 3
##$ALPHA= 0
##$AQORDER= 0
##$ASSFAC= 0
##$ASSFACI= 0
##$ASSFACX= 0
##$ASSWID= 0
##$AUNMP= <proc_1d>
##$AZFE= 0.1
##$AZFW= 0.1
##$BCFW= 0
##$BC_mod= 0
##$BYTORDP= 0
##$COROFFS= 0
##$CY= 12.5
##$DATMOD= 1
##$DC= 0
##$DFILT= <>
##$DTYPP= 0
##$F1P= 14.0000005364418
##$F2P= -0.99999901652339
##$FCOR= 0.5
##$FTSIZE= 32768
##$FT_mod= 6
##$GAMMA= 0
##$GB= 0
##$INTBC= 1
##$INTSCL= 1
##$ISEN= 128
##$LB= 0.3
##$LEV0= 0
##$LPBIN= 0
##$MAXI= 10000
##$MC2= 0
##$MEAN= 0
##$ME_mod= 0
##$MI= 0
##$NCOEF= 0
##$NC_proc= -4
##$NLEV= 6
##$NOISF1= 0
##$NOISF2= 0
##$NSP= 0
##$NTH_PI= 0
##$NZP= 0
##$OFFSET= 16.43213
##$PC= 1
##$PHC0= 163.2478
##$PHC1= 7.787423
##$PH_mod= 1
##$PKNL= yes
##$PPARMOD= 0
##$PSCAL= 4
##$PSIGN= 0
##$REVERSE= no
##$SF= 250.130022478273
##$SI= 32768
##$SIGF1= 0
##$SIGF2= 0
##$SINO= 400
##$SIOLD= 32768
##$SREGLST= <1H.CDCl3>
##$SSB= 0
##$STSI= 32768
##$STSR= 0
##$SW_p= 5175.98343685301
##$SYMM= 0
##$S_DEV= 0
##$TDeff= 65536
##$TDoff= 0
##$TI= <Analysis number 999999
Compound Code 99
Book Reference 9
Project Code 9>
##$TILT= no
##$TM1= 0
##$TM2= 0
##$TOPLEV= 0
##$USERP1= <user>
##$USERP2= <user>
##$USERP3= <user>
##$USERP4= <user>
##$USERP5= <user>
##$WDW= 1
##$XDIM= 32768
##$YMAX_p= 366735362
##$YMIN_p= -166383
$$ End of Bruker specific parameters
$$ ---------------------------------
##NTUPLES= NMR SPECTRUM
##VAR_NAME=  FREQUENCY,     SPECTRUM/REAL,   SPECTRUM/IMAG
##SYMBOL=    X,             R,               I
##VAR_TYPE=  INDEPENDENT,   DEPENDENT,       DEPENDENT
##VAR_FORM=  AFFN,          ASDF,            ASDF
##VAR_DIM=   32768,         32768,           32768
##UNITS=     HZ,            ARBITRARY UNITS, ARBITRARY UNITS
##FACTOR=    0.157963299565203, 1,           1
##FIRST=     4110.16924977135, 0,            0
##LAST=      -1065.81418708166, 0,           0
##MIN=       -1065.81418708166, -166383,     0
##MAX=       4110.16924977135, 366735362,    0
$$ Real data points
##PAGE= N=1
##DATA TABLE= (X++(R..R)), XYDATA
$$ [...]
20481f4553Q063K525J7562M4766J6536r429j6805L023p617n537j2917J2684N3379
$$ -64553 -56490 -53965 -36403 8363 24899 15470 -1335 1688 -5929 -11466 -24383 -11699 41680
20468D1680R968m1211r460N2199L3496L597k0120n1553q556L2506p075m6056j5292
$$ 41680 51648 10437 977 53176 86672 90269 70149 18596 10040 42546 35471 -10585 -25877
20455b5877K6181K056J1703r447l5981j3077K1432K5850M410Q972Q299j136q398
$$ -25877 304 2360 14063 4616 -31365 -44442 -23010 2840 7250 16222 24521 23385 14987
20442A4987J957J3763m2067O818O758j8392K1559o471k2001l85L6297j0886j5262
$$ 14987 16944 30707 -11360 -4542 2216 -16176 5383 -1088 -23089 -23474 12823 1937 -13325
20429a3325N785k9101m1318k2689L0281P7839J6661l1788k026L1046K0653Q971
$$ -13325 -7540 -36641 -77959 -100648 -70367 7472 24133 -7655 -9681 21365 42018 50989
20417E0989n898l2770k1036N883M2988O858L907k3732j5840K4888k9285R720R408
$$ 50989 45091 12321 -8715 -2832 40156 47014 50921 27189 11349 36237 6952 16672 26080
20404B6080j6994J08o494J773j5334j1284J021R016K1594L2481j9203n4344M091
$$ 26080 9086 9194 2700 4473 -10861 -22145 -21124 -12108 9486 41967 22764 -31580 -27489
20391b7489L6376L0307j5014n2159j5801L9623K1962N327J6107N401R365N1786
$$ -27489 8887 39194 24180 -27979 -43780 -4157 17805 23132 39239 44640 54005 105791
20379A05791J228r725j3299r566l7051j3075o918p730m3102q973N290K2400L0847
$$ 105791 107019 97294 83995 74429 37378 24303 17385 9655 -33447 -42420 -37130 -14730 16117
20366A6117J0501M286j8992O08m8914l6601R594O1349L3589j4893k6492j9060
$$ 16117 26618 30904 11912 12520 -36394 -72995 -63401 -2052 31537 16644 -9848 -28908
20354b8908j5433j6979l93J4866N6148J2280j5603j6291J0587L781k7766k1461
$$ -28908 -44341 -61320 -61713 -46847 9301 21581 5978 -10313 274 4055 -23711 -45172
20342d5172J3368P591r578M8887l061k9872k0320J7219K5048l0656L363Q884j2986
$$ -45172 -31804 -24213 -33791 15096 12035 -17837 -38157 -20938 4110 -26546 -23183 -14299 -27285
20329b7285K1293J8560j1627p88L6153j1684j5426j0862J2557j4292k2245N431
$$ -27285 -5992 12568 941 153 36306 24622 9196 -1666 10891 -3401 -25646 -20215
20317b0215K372P027L745K2411P51K3642N6647K3231l4852k1278l6394J9471M5114
$$ -20215 -17843 -10816 -7071 15340 16091 39733 96380 119611 84759 63481 27087 46558 91672
20304I1672k6439r859k457j0505j959L0761Q502J5671j3708o4019k7434K5106
$$ 91672 65233 55374 52917 42412 40453 71214 79716 95387 81679 17660 -9774 15332
20292A5332l243k1844K3931L2613N1863r534j5912O687J4481l407o651l965k2737
$$ 15332 12089 -9755 14176 46789 98652 89118 73206 79893 94374 90967 84316 80351 57614
20279E7614l500j4912o0960J2554K051l041M2858j7470o548k4608k397P916K6188
$$ 57614 54114 39202 -21758 -9204 -7153 -10194 32664 15194 8646 -15962 -18359 -10443 15745
20266A5745J832j6330n7693r809L1210M3117K4772m341m0495j1429k950j0728
$$ 15745 17577 1247 -56446 -66255 -35045 8072 32844 28503 -11992 -23421 -26371 -37099
20254c7099L2816O6802K2365m6340J0713l3039j8725l5248p3409n810P1637M0166
$$ -37099 -4283 62519 84884 38544 49257 16218 -2507 -37755 -111164 -116974 -45337 -5171
20242e171O567K50l8775K1084p504K028m349J0972J7572M4318o954k8161K7987
$$ -5171 1396 1646 -37129 -16045 -23549 -21521 -25870 -14898 2674 46992 40038 11877 39864
20229C9864J024j3833k4344J9791L2998j0037k8144r027j1184L4685K3217q168
$$ 39864 40888 27055 2711 22502 55500 45463 17319 8292 -2892 31793 55010 46842
20217D6842l4565p619K0460j604k474j5598J9214j2057k1546j0308o063K01N3922
$$ 46842 12277 4658 25118 23514 21040 5442 24656 12599 -8947 -19255 -25318 -25117 28805
20204B8805O625p874J4938K8359K7068k2677j5515o482p527j9929o164R516L1824
$$ 28805 35430 27556 42494 70853 97921 75244 59729 53247 45720 25791 19627 29143 60967
20191F0967k796J208P048K6041j582k3887j6359q315j974l995j8491j1713M2051
$$ 60967 58171 59379 66427 92468 90886 66999 50640 42325 40351 36356 17865 6152 48203
20178D8203J6468J8282q985m5118k1087k7870J3777L084N50j2272K0700O710m9108
$$ 48203 64671 82953 73968 28850 7763 -20107 -6330 -3246 -2696 -14968 5732 12442 -36666
20165c6666J8216L3978L2677l5149o6520k7279j0929m14M0007O595K3807P9160
$$ -36666 -18450 15528 48205 13056 -53464 -80743 -91672 -92086 -52079 -45484 -21677 57483
20153E7483J1546j8835J4019j0644r26O631J5213l2342q375L9150k7841l1594
$$ 57483 69029 50194 64213 53569 52643 59274 74487 42145 33770 72920 45079 13485
20141A3485J9583j0966J9393L7349m6260l4263k888r934j116P962J4027j4816
$$ 13485 33068 22102 41495 78844 32584 -1679 -4567 -14501 -15617 -7655 6372 -8444
20129h444q676M3218L4526j3798l3585l741n9248o810Q752m9089L5472L3595j4809
$$ -8444 -17120 26098 60624 46826 13241 9500 -49748 -56558 -47806 -96895 -61423 -27828 -42637
20116d2637J3550K7133K2713j9934k4178K5141J8817K51J9920j935l423o496l4726
$$ -42637 -29087 -1954 20759 825 -23353 1788 20605 20856 40776 38841 35418 28922 -5804
20103e804L7170L9886o681l2373l0788m0195J1552K2686l9506k599J5045j3403
$$ -5804 31366 71252 64571 32198 1410 -38785 -27233 -4547 -44053 -46652 -31607 -45010
20091d5010l274O1203M3384M1627J5268J7858l0616k2867J9427k5428m0173K2001
$$ -45010 -48284 12919 56303 97930 113198 131056 100440 77573 97000 71572 31399 53400
20079E3400k933q262J7460j5035k439k2846k5132j48J7277o011j7339M3704Q5836
$$ 53400 50467 42205 59665 44630 42191 19345 -5787 -5935 11342 5331 -12008 31696 117532
20066A17532L797m6722l0069K2947K1033K1162J857l5422l6335k6547K2784J6848
$$ 117532 121329 74607 44538 67485 88518 109680 111537 76115 39780 13233 36017 52865
20054E2865M1089j8954p941j9248k0552J6146k3964J538J4889J0523r02J767j1628
$$ 52865 93954 75000 67059 47811 27259 43405 19441 20979 35868 46391 45489 47256 35628
20041C5628P658Q224m305J3367L2853K0929m904l4333l3698n0196R804M1486J1172
$$ 35628 43286 51510 47205 60572 93425 114354 109450 75117 41419 -8777 1027 42513 53685
20028E3685M722J0868j026R713N938k8177k218J6451r494n416K7889n006l206
$$ 53685 58407 69275 68249 77962 83900 55723 53505 69956 60462 55046 82935 77929 74723
20015G4723m2699M757J8702J6904j0904j368J6892q358j8481j2849J6200K5824
$$ 74723 32024 36781 55483 72387 61483 60115 77007 68649 50168 37319 53519 79343
20003G9343k0311j8732l35J6719N004k0088j150k1281N069k7652P429R31l5973
$$ 79343 59032 40300 39965 56684 61688 41600 40450 19169 24238 -3414 4015 4946 -31027
19990c1027L1462O056q114K0677K3470j5868J619K9594o288R179r076O907l4556
$$ -31027 435 6491 -1623 19054 42524 26656 28275 57869 51581 60760 51684 58591 24035
19977B4035j3332L2092L2236j2253n4365l7485M4220L9167l5701J0512L3656j3142
$$ 24035 10703 42795 75031 62778 8413 -29072 15148 54315 18614 29126 62782 49640
19965D9640J2429O546j091n5869l7010J7121J4295K0826K5051R531j4619k7735
$$ 49640 62069 68615 67524 11655 -25355 -8234 6061 26887 51938 61469 46850 19115
19953A9115k4104J7203M6797k3442m321J6508o084l8177O131J4000K2996l4617
$$ 19115 -4989 12214 59011 35569 31248 47756 41672 3495 9626 23626 46622 12005
19941A2005l3454R252K1451k603L2658J2206k0357M322K589j5580L5328K2647
$$ 12005 -21449 -12197 9254 6651 39309 51515 31158 35480 38069 22489 57817 80464
19929H0464k7747l4232o559K936K7928K02r334j715k1347L9073K2902m190l1590
$$ 80464 52717 18485 11926 14862 42790 42992 33658 31943 10596 49669 72571 68381 36791
19916C6791l1936J8909J9686R775L4086K6271k5015m5587q081M6484M1613j5345
$$ 36791 4855 23764 43450 53225 87311 113582 88567 42980 34899 81383 122996 107651
19904A07651l2708j0812j6219K4532J0652o848l1070j6641j2448l7418M7632M1372
$$ 107651 74943 64131 47912 72444 83096 76248 45178 28537 16089 -21329 26303 67675
19892F7675k1217m0770K7986J7443j7094L042J0409m3263J581o282j4318L4295
$$ 67675 46458 5688 33674 51117 34023 37065 47474 4211 5792 -490 -14808 19487
19880A9487O4582N447K78q599m6594j6819K9464R071j8293p596r68m7978q836
$$ 19487 84069 89516 89794 81195 34601 17782 47246 56317 38024 30428 29460 -18518 -27354
19867b7354L6347N8044N2880k88k6503j2704m2535k935L6024m722k3141k3583
$$ -27354 8993 67037 119917 119629 93126 80422 37887 34952 70976 66254 43113 19530
19855A9530J3836J4382j3940n524k5606K0064P1015k9600j7948n29l7741J8289
$$ 19530 33366 47748 33808 28284 2678 22742 93757 64157 46209 45680 7939 26228
19843B6228M1852K3332l7703o308L1024O457J0943j3716j608R945k4639m3549
$$ 26228 68080 91412 53709 47401 78425 84882 95825 82109 80501 90446 65807 22258
19831B2258j9976J6914n029k663k6086m404K0068o127M1569k061o401n629j210
$$ 22258 2282 19196 14167 11504 -14582 -18986 1082 -5045 36524 34463 28062 22433 21223
19818B1223l46m139M610k042m935K910M644J4791K8386m429n884k4138J7000j3668
$$ 21223 20877 16738 21348 19306 14371 17281 21925 36716 65102 60673 54789 30651 47651 33983
19804C3983q786J1418j8936J3281p254O536K0744J6172l0248k9828R276k512q095
$$ 33983 25197 36615 17679 30960 23706 30242 50986 67158 36910 7082 16358 13846 5751
19791E751J1241K3461L1832J3761q659j3917j2286j9952j8555R281R16m7299J4224
$$ 5751 16992 40453 72285 86046 77387 63470 51184 31232 12677 21958 22874 -24425 -10201
19778a0201J4618N0585J6489n1436j6962n559J012k9333l2432K7352O064M1498
$$ -10201 4417 55002 71491 20055 3093 -2466 -1454 -30787 -63219 -35867 -29803 11695
19766A1695K2727j2572k2611R731m449j3579k3030K086L5640k9432K4584O8815
$$ 11695 34422 21850 -761 8970 4521 -9058 -32088 -30002 5638 -23794 790 69605
19754F9605q787j3974k0894J2587j1422M6476L6538j8937k935M666j5012p488
$$ 69605 60818 46844 25950 38537 27115 73591 110129 91192 88257 92923 77911 70423
19742G0423k1696k4431m0818J64Q724O631M1646J3725L3870k658j3837o4285l8934
$$ 70423 48727 24296 -16522 -16358 -7634 -1003 40643 54368 88238 85580 71743 7458 -31476
19729c1476K7683K5715j268n738l413L4034J7106j009j3469K091M0061R207P268
$$ -31476 -3793 21922 20654 14916 11503 45537 62643 61634 48165 50256 90317 99524 106792
19716A06792M559k6133k4481k3416N950l913l4195k2840p435J8357r327j2336
$$ 106792 111351 85218 60737 37321 43271 39358 5163 -17677 -25112 -6755 -16082 -28418
19704b8418J5545J6336K863K966L2754R758r635p930q44j7415N761n998J0287
$$ -28418 -12873 3463 6326 9292 42046 51804 42169 34239 33395 15980 21741 15743 26030
19691B6030L4913m233K4542L1747j4007p0779m9817O094N2337M5670J8502o655
$$ 26030 60943 56710 81252 112999 98992 28213 -21604 -15510 36827 82497 100999 94344
19679I4344j5770j5262K3796k366K1081J0451j8490k4593j9285j8913K921K5245
$$ 94344 78574 63312 87108 84742 105823 116274 97784 73191 53906 34993 37914 63159
19667F3159j2745j0963k4033L078J5901K0850K2842k0414o1100J0304L3519L0420
$$ 63159 50414 39451 15418 18496 34397 55247 78089 57675 -3425 6879 40398 70818
19655G0818O185o417J9575K4892k5323j8772L3892J6691J553k0146l4322O058
$$ 70818 77003 70586 90161 115053 89730 70958 104850 121541 123094 102948 68626 74684
19643G4684M0142J1018k0437k4916l3409j7602J7885L0594k8286J1776J9996K815
$$ 74684 114826 125844 105407 80491 47082 29480 47365 77959 49673 61449 81445 84260
19631H4260k1168j0569K7003M1055Q89j861n0695l2034j2437J7082L106J7766
$$ 84260 63092 52523 79526 120581 121470 119609 68914 36880 24443 41525 44631 62397
19619F2397K4712J1280j8925j0783J2178J2730K3178k2306l2776j1249M3365R278
$$ 62397 87109 98389 79464 68681 80859 93589 116767 94461 61685 50436 93801 103079
19607A03079p910n5550l3907l818J521K2780r127j8287o494J6423j1318J1711
$$ 103079 95169 39619 5712 1894 3415 26195 17068 -1219 -7713 8710 -2608 9103
19595I103L5406K5484L7497K8583n205k8698R248J5824k91m1206J2768K0031K3856
$$ 9103 44509 69993 107490 136073 130868 102170 111418 127242 126951 85745 98513 118544 142400
19582A42400Q194k3896J0741q273o6347m5108M958K0186p663k7324R092K4539
$$ 142400 150594 126698 137439 129166 62819 17711 22669 42855 35192 7868 16960 41499
19570D1499J8583k0261l6015n810N376N4285M6667m477j4505m0164l6094J7628
$$ 41499 60082 39821 3806 -2004 3372 57657 104324 99847 85342 45178 9084 26712
19558B6712L6197p389K6820J7538l6766O596m255k010j3k3197P282K6703J7318
$$ 26712 62909 55520 82340 99878 63112 69708 65453 63443 63430 40233 47515 74218 91536
19545I1536q9J9860n253j2742P296L0797l8211k282j20L32K1072l1530j8962M147
$$ 91536 91447 111307 106054 93312 100608 131405 93194 90912 90792 91124 112196 80666 61704 65851
19531F5851O691J472j2672R740J9390n989J0827R250n3896m4667k4121L4971L2693
$$ 65851 72542 74014 61342 71082 90472 84483 95310 104560 50664 5997 -18124 16847 49540
19518D9540K6292J4613j2262P25k611j3603j6785O334J8036N525j2713J3540L4878
$$ 49540 75832 90445 78183 78908 76297 62694 45909 52243 70279 75804 63091 76631 111509
19505A11509k116l0417M1287J4038k9874N9062m0140p0167J5710J9334k2939l3195
$$ 111509 109393 78976 120263 134301 104427 163489 123349 53182 68892 88226 65287 32092
19493C2092L6975L2254K0872j2348k5016j006N0978J1344j5223O773J8910r369
$$ 32092 69067 101321 122193 109845 84829 83823 134801 146145 130922 137695 156605 147236
19481A47236j4514J4555m8322j2687N623J2297p346L1070M353l1205J0966Q810
$$ 147236 132722 147277 98955 86268 91891 104188 96842 127912 132265 101060 112026 120836
19469A20836k0026L638L873j392l1765k6052L6253J8119K4656R700j5510j8320
$$ 120836 100810 104448 108321 106929 75164 49112 85365 103484 128140 137840 122330 104010
19457A04010j3440l7534J4101J7794J6546j39K0242l540M448Q923j6349j5301
$$ 104010 90570 53036 67137 84931 101477 101338 121580 118040 122488 131411 115062 99761
19445I9761k3274k941j5678R758L0390M19p609k0046K588K1412L3581j151j2564
$$ 99761 76487 73546 57868 67626 98016 98435 90826 70780 73368 94780 128361 127210 114646
19432A14646k9573J0768K5354k6725K9581O370j1136N683n6368J1147k2877j5695
$$ 114646 85073 95841 121195 94470 124051 130421 119285 124968 68600 79747 56870 41175
19420D1175k465J6734M4465j6254o978J4682K4841o944l4874p037L9360j558J2582
$$ 41175 38710 55444 99909 83655 76677 91359 116200 109256 74382 67345 106705 105147 117729
19407A17729L0195m5259k6044Q496O176q347M7404k218J1393N5472R17m9708n5494
$$ 117729 147924 102665 76621 85117 91293 82946 130350 128132 139525 194997 195914 146206 90712
19394I0712k4227R679J3566N031j7726M7082O8964K5385k3335j3292j2699M940
$$ 90712 66485 76164 89730 94761 77035 124117 193081 218466 195131 181839 169140 174080
19382A74080L565j4165j5968K6375K8977L4253K4611N8341O8861K822K5415K7055
$$ 174080 177645 163480 147512 173887 202864 237117 261728 320069 388930 391752 417167 444222
19370D44222O4220N2275n570J0882K8879Q314N9234K4640l569K0696m949l3735
$$ 444222 508442 560717 555147 566029 594908 603222 662456 687096 683527 704223 699274 665539
19358F65539l2891M276K7389k739m3253j462P663n7356n5670n1262j7138N456
$$ 665539 632648 636924 664313 661574 618321 616859 624522 567166 511496 460234 443096 448552
19346D48552r830k6273j4058K5177k6875o6853p4799J5045k0928j6959k2547l6383
$$ 448552 438722 412449 398391 423568 396693 329840 255041 270086 249158 232199 209652 173269
19334A73269K1651J5191L1373J775J3582K2479M3010M0821O230J8496Q93M2104
$$ 173269 194920 210111 241484 243259 256841 279320 322330 363151 369381 387877 388770 430874
19322D30874P0292O7393L3341L9575M5280P0746K1303J909J1927L0537j4801k6901
$$ 430874 501166 568559 601900 641475 686755 757501 778804 780713 792640 823177 808376 781475
19310G81475J6389m3820Q055k1789n0353k5147J0433Q908j4191k7624J5803m019
$$ 781475 797864 754044 762099 740310 689957 664810 675243 684151 669960 642336 658139 654120
19298F54120j5710n9087q0483j3279q889j5552m7781o4697p0902K9862k39j9454
$$ 654120 638410 579323 498840 485561 476672 461120 413339 348642 277740 307602 307363 287909
19286B87909m37J7279K3452n1079l621N800J637j7119r013l3151L1930L4943l53
$$ 287909 287472 304751 328203 277124 273503 279303 280940 263821 254808 221657 253587 288530 288177
19273B88177L6113P994q696J0026K8839Q570P247l224j578r311j9901l157j4616
$$ 288177 324290 332284 323588 333614 362453 371023 378270 375046 373468 364157 344256 341099 326483
19260C26483K1331k8276K656l5450Q406j1083J712J7116n8673p554j6165m7727
$$ 326483 347814 319538 322194 286744 295150 284067 285779 302895 244222 236668 220503 172776
19248A72776K795K9033J9342J0947j1688p706K1495K8504q365j7086L4950j9427
$$ 172776 175571 204604 223946 234893 223205 215499 236994 265498 257133 240047 274997 255570
19236B55570m6701l3989J6412L8836M5877q404J388K7999j760L272l089M1770
$$ 255570 208869 174880 191292 230128 276005 267601 268989 296988 295228 298500 295411 337181
19224C37181N6823L151K9639L5116N0248N1117r202l6697N1J8222O203K404k27
$$ 337181 394004 397155 426794 461910 512158 563275 554073 517376 517427 535649 541852 544256 544029
19211E44029m6306k6232k5012l7284k2525j6896l5921j6012l0631l2151k4852
$$ 544029 497723 471491 446479 409195 386670 369774 333853 317841 287210 255059 230207
19200B30207j5220K2130J6138j1375j8211M3027N8379l7173k2278n2425m7227
$$ 230207 214987 237117 253255 241880 223669 266696 325075 287902 265624 213199 165972
19189A65972K4599L2567j3619J3087M5731J9183J2175K7022k1100l1994J3119
$$ 165972 190571 223138 209519 222606 268337 287520 299695 326717 305617 273623 286742
19178B86742m777K276P571N5840N2979p063K3075L1925K9612J0047l2983R175
$$ 286742 281965 284241 291812 347652 400631 393568 416643 448568 478180 488227 455244 464419
19166D64419L0202k7938j3437K5167j9762K756R049o7620l7313n1774m6968m3414
$$ 464419 494621 466683 453246 478413 458651 461407 470456 402836 365523 313749 266781 223367
19154B23367q524K7176J6187J9058j2263p440k847j2194N106J6727L315m280Q067
$$ 223367 214843 242019 258206 277264 265001 257561 254714 242520 247626 264353 267668 263388 271455
19141B71455j624p471l609r334j6320m8983l52K4963R117K0213j2026j116m451
$$ 271455 269831 262360 258751 249417 233097 184114 183762 208725 217842 238055 226029 224913 220462
19128B20462M486J4407L7827q025l9356P776J4660J2415k5606J0082k2203M828
$$ 220462 224948 239355 277182 269157 229801 237577 252237 264652 239046 249128 226925 231753
19116B31753M9249P4693J001k3839l3219k6620r606j6877p139K1622N1896J8393
$$ 231753 281002 355695 356696 332857 299638 273018 263412 246535 239396 261018 312914 331307
19104C31307R503P806P091M45m488l0013p89k0221j1529J9325N0664L290n2961
$$ 331307 340810 348616 355707 356152 351664 321651 320862 300641 289112 308437 359101 362391 309430
19091C09430l0976j5346r38j5436O113M1157q620j0661K3212L8749J8550k4765
$$ 309430 278454 263108 262170 246734 252847 294004 285384 274723 297935 336684 355234 330469
19079C30469j8344l6006k6763K651L3367L215j1755K2510J4930L1009k9779j2876
$$ 330469 312125 276119 249356 252007 285374 288589 276834 299344 314274 345283 315504 302628
19067C02628k073q936k8515N556J0626J3175m461P810L6112K5485K7266j5195
$$ 302628 300555 291619 263104 268660 279286 292461 288000 295810 331922 357407 384673 369478
19055C69478l4742o953L9099O786R062l0284N698K2806J673L1692L8545K4273
$$ 369478 334736 327783 366882 373668 382730 352446 358144 380950 382623 414315 452860 477133
19043D77133R709o1721j47m070k8186L3192K0532k8656j4034k5359J3144K4869
$$ 477133 486842 425121 424974 420904 392718 425910 446442 417786 403752 378393 391537 416406
19031D16406L0777k2590j4425k3455l9822M600J3866k0285P698j870n726L8742
$$ 416406 447183 424593 410168 386713 346891 351491 365357 345072 352770 350900 345174 383916
19019C83916O093j2022j8371k9987j7936L1169M214j1376j7845L201K0387J9868
$$ 383916 390009 377987 359616 329629 311693 342862 347076 335700 317855 321056 341443 361311
19007C61311l346r258k9317M918M9645K0173k6782j271L7508k2437K7856P142
$$ 361311 357965 348707 319390 324308 373953 394126 367344 366073 403581 381144 409000 416142
18995D16142L909J168K2464R828o265l8635k3320J708K6998M0988L5472k3693
$$ 416142 420051 421219 443683 453511 447246 408611 385291 386999 413997 454985 490457 466764
18983D66764k8844R672P897k1161j3664j4460O053L6124K9101K318k065O535M9444
$$ 466764 437920 447592 455489 434328 420664 406204 412257 448381 477482 479800 477735 484270 533714
18970E33714K8263J3949J4367J9372r81K9995J9753L4529m7585r661p520l984
$$ 533714 561977 575926 590293 609665 608684 638679 658432 692961 645376 635715 628195 624211
18958F24211L6935L7788M96o944J1997l550k632K211M896k915q524J6812M2711
$$ 624211 661146 698934 699430 692486 704483 700933 698301 700512 705408 702493 693969 710781 753492
18945G53492j1602j5852j5098j1822n5136K6936L3433k1592K2859R669q999N114
$$ 753492 741890 726038 710940 699118 643982 670918 704351 682759 705618 715287 706288 711402
18933G11402K6379k591k1476j8496o794L3832P7235K6701L7280K3981J5690M1988
$$ 711402 737781 735190 713714 695218 688424 722256 799491 826192 863472 887453 903143 945131
18921I45131N1929J1010J4614L3694L7262M5968O347l6266j8925N418L2992k3583
$$ 945131 997060 1008070 1022684 1056378 1093640 1139608 1145955 1109689 1090764 1096182 1129174 1105591
18909A105591j8978J8945M3856N3797n761n4145J7849N737J7066M5777L3468j9236
$$ 1105591 1086613 1105558 1149414 1203211 1197450 1143305 1161154 1166891 1183957 1229734 1263202 1243966
18897A243966m5494K1154N0322N9365L4783N2965L2856L51M2902K3977K9191O7975
$$ 1243966 1198472 1219626 1269948 1329313 1364096 1417061 1449917 1450268 1493170 1517147 1546338 1614313
18885A614313M2341N5598O0160O3961O4761O1310J25369J81269J63258J87398
$$ 1614313 1656654 1712252 1772412 1836373 1901134 1962444 2087813 2269082 2432340 2619738
18875B619738K25046J98329J97094K39978K94580L03773K87185L02782L55114
$$ 2619738 2844784 3043113 3240207 3480185 3774765 4078538 4365723 4668505 5023619
18866E023619L90138L68868M32730N56618O15401Q00471J015962J363262J989319
$$ 5023619 5413757 5782625 6215355 6771973 7387374 8187845 9203807 10567069 12556388
18857A2556388K831505L749402M963167O475505Q467337J0204876J0179038Q861119
$$ 12556388 15387893 19137295 24100462 30575967 39043304 49248180 59427218 68288337
18849F8288337P709938P366395O879736L982568k13492k019520j434956L69563
$$ 68288337 75998275 83364670 90244406 94226974 94013482 91993962 90559006 90928569
18841I0928569K46237l57129j064369k281537m447500p089038q304443q401826
$$ 90928569 91174806 90817677 89753308 87471771 83024271 75935233 67630790 59228964
18833E9228964p790743p792612o767226m664406l123855k542205k518062k046458
$$ 59228964 51438221 43645609 36878383 32213977 29090122 26547917 24029855 21983397
18825B1983397j384883r41516o82342n06042l72010k36996j20713l8589K8027
$$ 21983397 20598514 19656998 18974656 18468614 18096604 17859608 17738895 17700306 17728333
18816A7728333J39528L49042M98809P55997J096185J608403K391652L603155N364285
$$ 17728333 17867861 18216903 18715712 19471709 20567894 22176297 24567949 28171104 33535389
18807C3535389P353761Q898106J0182859J1993259J4124154J4694109J2404423
$$ 33535389 40889150 49787256 59970115 71963374 86087528 100781637 113186060
18800A13186060R774728Q716097Q127241O679283M487333M567566N010475L833946
$$ 113186060 122960788 131676885 139804126 146483409 150970742 155538308 160548783 164382729
18792A64382729J764421L67951m0560l731757j1748359j6511635j6438894j6430220
$$ 164382729 166147150 166515101 166474541 162742784 150994425 134482790 118043896 101613676
18784A01613676j5436746j1447365q489024q064120p596932n803164m217302l686542
$$ 101613676 86176930 74729565 66240541 58176421 50579489 44776325 40559023 36872481
18776C6872481l315040k613277j943929j558751j312279j156083j039444r23799
$$ 36872481 33557441 30944164 29000235 27441484 26129205 24973122 23933678 23009879
18768B3009879q22510o73182n58337n10308m28309k55786k9926K36280P10396
$$ 23009879 22187369 21514187 20955850 20445542 20017233 19761447 19731521 19967801 20678197
18759B0678197J510725K502316L699185M805231N254030M950825M202355L789771
$$ 20678197 22188922 24691238 28390423 33195654 38449684 43400509 47602864 51392635
18751E1392635K955026J553487n9873k184017k360452j387398l50933R6755J07543
$$ 51392635 54347661 55901148 55841275 53657258 51296806 49909408 49558475 49655230 49762773
18742D9762773j010735k597451m275258o374551o621117n240580l466203k233300
$$ 49762773 48752038 46154587 41879329 35504778 28883661 23643081 20176878 17943578
18734A7943578j476852j070486q20371n45327m44972l65019l11337k84605k36559
$$ 17943578 16466726 15396240 14575869 14030542 13585570 13220551 12909214 12624609 12388050
18725A2388050k33375j68117j04454m9054J7196R7248J65809K52301M59475O03953
$$ 12388050 12154675 11986558 11882104 11833050 11850246 11947494 12113303 12365604 12825079 13429032
18715A3429032R33421J510273K274069L417810M798370O139882P249287P719897
$$ 13429032 14362453 15872726 18146795 21564605 26362975 32502857 39752144 47472041
18707D7472041P320161O966637O210641M551580L069772j67249l372948m576730
$$ 47472041 54792202 61758839 67969480 72521060 75590832 75423583 72050635 67473905
18699F7473905m140043k261583j266060k771675n299949n395213l633406k416920
$$ 67473905 63333862 61072279 59806219 57034544 51734595 46339382 42705976 40289056
18691D0289056k171188l040450m318018m919500m429467l135783k114857j522883
$$ 40289056 38117868 35077418 30759400 25839900 21410433 18274650 16159793 14636910
18683A4636910j132470q57261o32521n43731m90265m36336l51326k76904k50338
$$ 14636910 13504440 12647179 12014658 11470927 10980662 10544326 10193000 9916096 9665758
18674I665758j67694j05824m0839l3152n0172J9788R6447K06522L47585N27262
$$ 9665758 9498064 9392240 9351401 9318249 9268077 9287865 9384312 9590834 9938419 10465681
18664A0465681P06572Q71229J230217J799969K321332K509198K191355J721747
$$ 10465681 11172253 12043482 13273699 15073668 17395000 19904198 22095553 23817300
18656B3817300J430545J398127J218794P72016K76765n10283q58043l69740J45276
$$ 23817300 25247845 26645972 27864766 28636782 28913547 28403264 27545221 27175481 27320757
18647B7320757K85649m66981j426624k499009l598907l507570l090939k385880
$$ 27320757 27606406 27139425 25712801 23213792 19614885 16107315 13016376 10630496
18639A0630496j580682j014638p36961n83525l99527k96010k71535j91820k22002
$$ 10630496 9049814 8035176 7298215 6714690 6315163 6019153 5747618 5555798 5333796
18630E333796k36719k08388j96492j91816j63727j15857q9620j12091j44901j30514
$$ 5333796 5097077 4888689 4692197 4500381 4336654 4220797 4131177 4019086 3874185 3743671
18620C743671j41770j28225j29469j13842j45527q7332p1848p8171q0794q5616
$$ 3743671 3601901 3473676 3344207 3230365 3084838 2997506 2925658 2847487 2766693 2681077
18610B681077q2505q6835j22577j11917j4494l9384j07399m6151q3683o9552m0154
$$ 2681077 2598572 2511737 2389160 2277243 2262749 2223365 2115966 2069815 1986132 1916580 1876426
18599A876426l3529m7576n1155l5655j08633p8959l6361k1164P226j8817q7148
$$ 1876426 1842897 1795321 1744166 1708511 1599878 1520919 1484558 1463394 1470620 1451803 1364655
18588A364655l3598L967k1826m5277k1494j7005l3794M688r86k8442N247M6298
$$ 1364655 1331057 1335024 1313198 1267921 1246427 1229422 1195628 1200316 1199330 1170888 1176135 1222433
18576A222433K959K611J36j3974k4747l9109m6812k7492n84l1168J2756J6204
$$ 1222433 1225392 1228003 1228139 1214165 1189418 1150309 1103497 1076005 1075421 1044253 1057009 1073213
18564A073213K9296k455j2537m9890l1833k3893n1775k2121k3628k9430j2995
$$ 1073213 1102509 1100054 1087517 1037627 1005794 981901 930126 908005 884377 854947 841952
18553H41952n6551k4013J313J9311j9129j1607k7343m0928J2560L1937K747k0108
$$ 841952 785401 761388 762701 782012 762883 751276 723933 683005 695565 727502 730249 710141
18541G10141R506k0922m5327k2527l5286j83P2219M5376K862r289J6382L0791
$$ 710141 719647 698725 653398 630871 595585 595402 667621 712997 715859 706570 722952 753743
18529G53743j7596M0363P2387L5978m896q704N9894M3775k076j3544l8470j3656
$$ 753743 736147 776510 848897 884875 879979 871275 931169 974944 972868 959324 920854 907198
18517I07198o17l6504j3903K6103j2650Q053m1096k1398j3038j2509l0705K2184
$$ 907198 906581 870077 856174 882277 869627 877680 836584 815186 802148 789639 758934 781118
18505G81118j0280R04K834R065O80k8161n3307o2354K5025L3513K0035j7185k858
$$ 781118 770838 771742 774576 783641 784321 756160 702853 640499 665524 699037 719072 701887 699029
18492F99029J8454M6062J611J0675L2028j2495k20K5750O080N0579N7538J4608
$$ 699029 717483 763545 765156 775831 807859 795364 795144 820894 826974 877553 935091 949699
18480I49699L3381O4781R549j2138o836K0503K394L4331K2203Q659M3089O1075
$$ 949699 983080 1047861 1057410 1045272 1038436 1058939 1061333 1095664 1117867 1126526 1169615 1230690
18468A230690O4515O5006J01064P3287K9133O5374J15796O1515Q4954R6118O3652
$$ 1230690 1295205 1360211 1461275 1534562 1563695 1629069 1744865 1806380 1891334 1987452 2051104
18457B051104M8121P7473R6587J15463J31013J26657J69077K27723K98397L60926
$$ 2051104 2099225 2176698 2273285 2388748 2519761 2646418 2815495 3043218 3341615 3702541
18447C702541N19030P88028J055388J442681K065556K756495L247703L752138
$$ 3702541 4221571 5009599 6064987 7507668 9573224 12329719 15577422 19329560
18439A9329560M567743M755032L939335L163169K294865J679954J207715n82961
$$ 19329560 23897303 28652335 32591670 35754839 38049704 39729658 40937373 40354412
18431D0354412j743519n32784L72324j13365j23313J06455n13272j104621k389058
$$ 40354412 38610893 38078109 38450433 38337068 38213755 38320210 37806938 36702317 34313259
18422C4313259m046374l838173l335009l423832l581106k774838j776304j110248
$$ 34313259 30266885 26428712 23093703 19669871 16088765 13313927 11537623 10427375
18414A0427375o48763m76393m19266k86992k04440j32659r7778q4128k0724K3893
$$ 10427375 9778612 9302219 8882953 8595961 8391521 8258862 8161084 8076956 8056232 8080125
18404H080125N7077J35317K44973L56370N12981Q16861J292653J885332K723324
$$ 8080125 8137202 8272519 8517492 8873862 9386843 10203704 11496357 13381689 16105013
18395A6105013L707856M652728N563766O193372O413436O586018O175470M447937
$$ 16105013 19812869 24465597 30029363 36222735 42636171 49222189 55397659 59845596
18387E9845596K533906N83913j179937j149833j691460k222324j231326l95782
$$ 59845596 62379502 62963415 61783478 60633645 58942185 56719861 55488535 55092753
18379E5092753n00607q7699N1319m33300j879211n315472p268205o445171n475055
$$ 55092753 54592146 54504447 54555766 54122466 52243255 46927783 39659578 33214407 27739352
18370B7739352m835851l969384k703072j742415j237613q56133o73152n32106
$$ 27739352 22903501 18934117 16231045 14488630 13251017 12394884 11721732 11189626
18362A1189626m35820l59739k85384k45920k22485k11351j44946j15182j9722
$$ 11189626 10753806 10394067 10108683 9862763 9640278 9428927 9283981 9168799 9149077
18353I149077J14659K48599M09719M92963N82320R14447J411463J956945K245927
$$ 9149077 9263736 9512335 9922054 10415017 10997337 11911784 13323247 15280192 17526119
18344A7526119J759636J390316J743943K066221J785934P07992p43004p73607
$$ 17526119 19285755 20676071 22420014 24486235 26272169 26980161 26237157 25463550
18336B5463550j10709M00298O25835N68864K74580k06958o87257r36669j595783
$$ 25463550 25352841 25753139 26378974 26947838 27222418 27015460 26328203 25391534 23795751
18327B3795751k913568k985613k324906k251271k132496j587594j017435o65237
$$ 23795751 20882183 17896570 15571664 13320393 11187897 9600303 8582868 7917631
18319G917631m47796l20760k10942j71179j30607j25755j41333j91277k13206
$$ 7917631 7469835 7149075 6938133 6766954 6636347 6510592 6369259 6177982 5964776
18310E964776j98488j63187j23723j14305p5911o6544r5558j27485p3970p1804
$$ 5964776 5766288 5603101 5479378 5365073 5289162 5222618 5127060 4999575 4925605 4853801
18300D853801j25295n2056l2294n0097l6988j1756L1521K6398N1428J12207J67411
$$ 4853801 4728506 4676450 4644156 4594059 4557071 4545315 4576836 4603234 4654662 4766869 4934280
18289D934280L67149N62212P61829P59748N09395M19915M64010M48277K69655
$$ 4934280 5301429 5863641 6625470 7385218 7894613 8314528 8778538 9226815 9496470
18280I496470l78215o94223l30567J51375O12097J032171J637765K632784M197164
$$ 9496470 9118255 8424032 8093465 8244840 8856937 9889108 11526873 14159657 18356821
18271A8356821O361623Q067245Q027634P521234P227757O280155N548105K391256
$$ 18356821 24718444 32785689 40813323 48334557 55562314 61842469 67390574 69781830
18263F9781830l669842o597566q306028p282756m426364l191321l394303k410335
$$ 69781830 66111988 59514422 51208394 43925638 39499274 36307953 32913650 30503315
18255C0503315j405655p19839K5191K74804j94070j903578l452741k908744j707788
$$ 30503315 29097660 28377821 28403012 28677816 28483746 26580168 23127427 20218683 18510895
18246A8510895p58328k72973j23284j72537r7424J26829L71199M43638L51754
$$ 18510895 17752567 17479594 17356310 17183773 17086349 17213178 17584377 18028015 18379769
18237A8379769M84736J026912J539675J744275J849573K364217L125546L947026
$$ 18379769 18864505 19891417 21431092 23175367 25024940 27389157 30514703 34461729
18229C4461729L794763K320763J774277K963117M811510O553192P012928O169598
$$ 34461729 38256492 40577255 42351532 45314649 50126159 56679351 63692279 69861877
18221F9861877P091786J0098670J2204043J1264149P849109K444621q04140p41740
$$ 69861877 76953663 87052333 99256376 110520525 118369634 120814255 120010115 119268375
18213A19268375k325288m913196o494267o663357m550523j844519j085443m213477
$$ 119268375 116943087 112029891 105535624 98872267 94321744 92477225 91391782 87178305
18205H7178305r677758j1131985r566545o777039m088008j716878k60503j76493
$$ 87178305 77500547 66368562 56802017 50024978 45936970 44220092 43959589 43783096
18197D3783096j203682k296048j981436j084780r99938j863445j956224j539380
$$ 43783096 42579414 40283366 38301930 37217150 36217212 34353767 32397543 30858163
18189C0858163r60922n13812n97300j261982k126937k213188j593262q84002k83229
$$ 30858163 29897241 29383429 28786129 27524147 25397210 23184022 21590760 20706758 20423529
18180B0423529K60613R28462J719513K721837L583814L932451M200698N333867
$$ 20423529 20684142 21612604 23332117 26053954 29637768 33570219 37770917 43104784
18172D3104784O121148N817678N916783O891130Q683638R348632P114480L567008
$$ 43104784 49225932 55043610 60960393 67851523 76535161 85883793 92998273 96565281
18164I6565281J728320J739188j614927p792051j2185304j7481227j5709278r998656
$$ 96565281 98293601 100032789 98417862 90625811 78440507 60959280 45250002 35251346
18156C5251346n892746l602291k208087j067805j95625K69329Q6831k94547j57653
$$ 35251346 29358600 25756309 23548222 22480417 22284792 22554121 22640952 22346405 22188752
18147B2188752p2629k83471j221524k518036k436874j724223j164413q14368p08236
$$ 22188752 22116123 21832652 20611128 18093092 15656218 13931995 12767582 11953214 11244978
18138A1244978n80508m29372l52297l14616k82582k18141k27282k21524k77618
$$ 11244978 10664470 10235098 9882801 9568185 9285603 9067462 8840180 8618656 8341038
18129H341038l04054k65682k42220k09895j46863j27119l3314L5720J17023K25309
$$ 8341038 8036984 7771302 7529082 7319187 7172324 7045205 7011891 7047611 7164634 7389943
18119G389943L68083O33369J038710J808587L213576N542093P137020M697487
$$ 7389943 7758026 8391395 9430105 11238692 14452268 19994361 27131381 31828868
18111C1828868J742521K569259L218673K429485k198282j1305215r794079n227476
$$ 31828868 33571389 36140648 39359321 41788806 39590524 28285309 18491230 13263754
18103A3263754k736455j656083j100333p45230n58036l82853l19047k83376k67894
$$ 13263754 10527299 8871216 7770883 7025653 6467617 6084764 5765717 5482341 5214447
18094E214447k44425k28789j51614j81667k09385j85703j50902k13451j41255
$$ 5214447 4970022 4741233 4589619 4407952 4198567 4012864 3861962 3648511 3507256
18085C507256j51067j21468r1866q4157q2803j07271j17194q6742o5245n6048
$$ 3507256 3356189 3234721 3142855 3058698 2975895 2868624 2751430 2664688 2599443 2543395
18075B543395j02121j24829j04879p6508n0272m6059k5531n3055n6766l1650l6845
$$ 2543395 2441274 2316445 2211566 2135058 2084786 2038727 2013196 1960141 1903375 1871725 1834880
18064A834880j05150q4991m9496p2882n4333p1268j9154l361l6650o0749m2676
$$ 1834880 1729730 1644739 1595243 1522361 1468028 1396760 1377606 1374245 1337595 1276846 1234170
18053A234170k6136r283j6388o9918l0058l9115m0214p866J5070l1o325q711j983
$$ 1234170 1208034 1198751 1182363 1112445 1082387 1043272 1003058 995192 1010262 1010231 1003906 995195 993212
18040I93212o7618m8444l5716J34R414k6079m8170l506J367k0998p430m173J7320
$$ 993212 925594 877150 841434 841568 850982 824903 776733 773227 774594 753596 746166 741993 759313
18027G59313l9526l9375L6206K4707O283r022n856j3153k8993q8J4442j0901l7784
$$ 759313 719787 680412 716618 741325 747608 738586 732730 719577 690584 690496 704938 694037 656253
18014F56253j4284l685j3319o747l8755k3835L3171L2120J3840k577l4324k6132
$$ 656253 641969 638284 624965 618218 579463 555628 588799 620919 634759 632182 597858 571726
18002E71726q653l704l6686p892j7718k4829l278K7001J9691j153k203L48m61
$$ 571726 563073 559369 522683 514791 497073 472244 468966 495967 515658 514505 512302 512650 512189
17989E12189n345k8362m3323k1641J9664N2765J9442p974n716M5891l2233l6529
$$ 512189 506844 478482 435159 413518 433182 485947 505389 497415 491699 537590 505357 468828
17977D68828j783k8913m664j834J1129l4102J2854L0971J0521J9542j0318P338
$$ 468828 467045 438132 433468 431634 442763 408661 421515 452486 463007 482549 472231 479569
17965D79569L8682J3528q21k5431q030l1790m7636n1807q547k5475J4751O2074
$$ 479569 518251 531779 530958 505527 497497 465707 418071 366264 357717 332242 346993 409067
17953D09067L1807k6385p853j2242Q470R770p304l0673M464L324K7335n043K4058
$$ 409067 440874 414489 406636 394394 402864 412634 405330 374657 379121 382445 409780 404737 428795
17940D28795L6067j9134j1276K615k0176r720R36k5773k0683j0434Q094L5548
$$ 428795 464862 445728 434452 437067 416891 407171 408107 382334 361651 351217 359311 394859
17928C94859L4942n664k6960N7378q37q915K7469K0335m4363Q077J4829L6678
$$ 394859 429801 424137 397177 454555 453718 444803 472272 492607 448244 456321 471150 507828
17916E07828O5348k636n9982r911j3298l304J9586o968N594J4202m705J461j1092
$$ 507828 573176 570540 510558 500647 487349 484045 503631 496663 502257 516459 511754 513215 502123
17903E02123J9474J6578k9723l9618k2669P892j6451J1460j1995j0380m574J6726
$$ 502123 521597 538175 508452 468834 446165 454057 437606 449066 437071 426691 422117 438843
17891D38843N878K409q958j2880j4321L7991N5009M304j9105j9045m070J9854
$$ 438843 444721 447130 438172 425292 410971 448962 503971 508275 489170 470125 466055 485909
17879D85909L2626L5544J0123L7324M1565P1505Q8759M0362K6631Q719K3850j5368
$$ 485909 518535 554079 564202 601526 643091 714596 803355 843717 870348 879067 902917 887549
17867H87549j9478J1849M4848K9082n099j8675k2809j1679N3449O7402O224J6170
$$ 887549 868071 879920 924768 953850 948751 930076 907267 895588 949037 1016439 1022663 1038833
17855A038833j8573k8044N693l1312n6478m7904m1683m203j2970r469k3788P523
$$ 1038833 1020260 992216 997909 966597 910119 862215 820532 816329 803359 793890 770102 777625
17843G77625J3530L0951M9766J0944j0593J0374p005j055K6823P454j9505n2056
$$ 777625 791155 822106 871872 882816 872223 882597 875592 874537 901360 908814 889309 837253
17831H37253J4117M0676K5197m308j2832K8499O3898O769J6156L013K978J8181
$$ 837253 851370 892046 917243 912935 900103 928602 992500 999269 1015425 1018438 1021416 1039597
17819A039597K3332N2628O4895l991j6728L1593N9775M3012L4781L1242P280K9555
$$ 1039597 1062929 1115557 1180452 1176461 1159733 1191326 1251101 1294113 1328894 1360136 1367416 1396971
17807A396971K0076K7290J7986n042N9357N8966J7936K2998O8391J31222J33266
$$ 1396971 1417047 1444337 1462323 1457281 1516638 1575604 1593540 1616538 1684929 1816151 1949417
17796A949417P8995Q8823J24837J16462J09699Q4063J39830J76451J79249K01367
$$ 1949417 2028412 2117235 2242072 2358534 2468233 2552296 2692126 2868577 3047826 3249193
17786C249193J86729J86709J70621J67277K32324L10897M13120N71459O96724
$$ 3249193 3435922 3622631 3793252 3960529 4192853 4503750 4916870 5488329 6185053
17777F185053Q70943J042454J351062J753520K121738K339386K858223L618933
$$ 6185053 7055996 8098450 9449512 11203032 13324770 15664156 18522379 22141312
17769B2141312L997364L960132L910586M738096O436024P072112N991588O083131
$$ 22141312 26138676 30098808 34009394 38747490 45183514 52255626 58247214 64330345
17761F4330345P937065Q251542O530721M393245L320930N465498P594746O491211
$$ 64330345 72267410 80518952 87049673 91442918 94763848 100229346 107824092 114315303
17753A14315303O411439P435301P960730R569835J0383656N905457l505836j0454836
$$ 114315303 120726742 128162043 136122773 145692608 156076264 161981721 158475885 148021049
17745A48021049r732359n798529n570575q881416j0293140q355864o718687p881187
$$ 148021049 138288690 132490161 126919586 118038170 107745030 99389166 92670479 84789292
17737H4789292r397870p757456m159793j518066m28367K74777P62839N42227q53582
$$ 84789292 75391422 67633966 63474173 61956107 61527740 61802517 62565356 63107583 62254001
17728F2254001k748513l030319j784755o92923N73420K063863K936384L529954
$$ 62254001 59505488 56475169 54690414 53997491 54570911 56634774 59571158 63101112
17720F3101112L690600N123849Q327742R079837O765634N845225P529593Q473302
$$ 63101112 66791712 71915561 80243303 89323140 96088774 101933999 109463592 117936894
17712A17936894M941382l208014r725473q299857l058546n9093j066725l118303
$$ 117936894 122878276 119670262 109944789 101644932 98586386 98527293 97460568 94342265
17704I4342265l509487j528750J469054L430448M087939L252671K333579L116764
$$ 94342265 90832778 89304028 90773082 94203530 98291469 101544140 103877719 106994483
17696A06994483M976221O743582O748606L178264k307463o086067n994540l437028
$$ 106994483 111970704 118714286 125462892 128641156 126333693 120247626 114253086 110816058
17688A10816058k660754o714141j3851577j6254313j2429039p512832m296376
$$ 110816058 108155304 101441163 87589586 71335273 58906234 51393402 47097026
17681D7097026k614777j736468o62983Q24964J372384J019344J291900J956104
$$ 47097026 44482249 42745781 42082798 42907762 44280146 45299490 46591390 48547494
17673D8547494K454959K262865j55729k108856k470387j653776n31749k35973
$$ 48547494 51002453 53265318 53109589 51000733 48530346 46876570 46344821 46108848
17665D6108848j787570m780346n177074l723018k227650j352919j203031j970483
$$ 46108848 44321278 39540932 34363858 30640840 28413190 27060271 25857240 23886757
17657B3886757k962932k600859j834718j247651r53365q13200o40829n70632n49900
$$ 23886757 20923825 18322966 16488248 15240597 14287232 13474032 12833203 12262571 11712671
17648A1712671m75278m17193l95900l96840l55441l84646l61762k71592l05608
$$ 11712671 11237393 10820200 10424300 10027460 9672019 9287373 8925611 8654019 8348411
17639H348411l12227l48163l29588k29394k13727k28286k05276k05716k45251
$$ 8348411 8036184 7688021 7358433 7129039 6915312 6687026 6481750 6276034 6030783
17630F030783k45615k38413j68276j78026j75929j65182j43874j87248j78818
$$ 6030783 5785168 5546755 5378479 5200453 5024524 4859342 4715468 4528220 4349402
17621D349402j56851r8411j05812j40169j62954j14363j13654r0222r7630j01646
$$ 4349402 4192551 4094140 3988328 3848159 3685205 3570842 3457188 3366966 3269336 3167690
17611C167690j10829o0328j14386j12594j07947r5937o4182n1649o9365l7418
$$ 3167690 3056861 2996533 2882147 2769553 2661606 2565669 2501487 2449838 2380473 2343055
17601B343055p3375j01093p1303r3561o9471n0787p0260n5374K5915m1254l7467
$$ 2343055 2269680 2168587 2097284 2003723 1934252 1883465 1813205 1757831 1783746 1742492 1705025
17590A705025r5325p1438n5680l4362l6303m7550l0325n9664p6760o2302m8949
$$ 1705025 1609700 1538262 1482582 1448220 1411917 1364367 1334042 1274378 1197618 1135316 1086367
17579A086367o7379n9306k0662k6287L671j0729m3589l9932r220m349j6510m3095
$$ 1086367 1018988 959682 939020 912733 916404 905675 862086 822154 812934 808585 792075 748980
17567G48980j6160l716m601n4835m9366l6666m4524k0978N337L2436j2543J6818
$$ 748980 732820 729104 724503 669668 620302 583636 539112 518134 523471 555907 543364 560182
17555E60182M7124j6858m8588j4776k575n5384k1744j4218j5354K9245j5368k4430
$$ 560182 607306 590448 541860 527084 524509 469125 447381 433163 417809 447054 431686 407256
17543D07256M864o975j909J6283j1091J112J60K8001O78J9251j6601l6761l6782
$$ 407256 412120 405145 403236 419519 408428 409540 409700 437701 438379 457630 441029 404268 367486
17530C67486J9124L8493K5367j6034l1667j7943k1450K1378J8702j1669J946K308
$$ 367486 386610 425103 450470 434436 402769 384826 363376 384754 403456 391787 393733 396041
17518C96041n8289k2423n959k9151l1205N325J5833K6330K1653J1698J0313K3588
$$ 396041 337752 315329 309370 280219 249014 254339 270172 296502 318155 329853 340166 363754
17506C63754o904J0749k4092l1480l0479N77L0937n322k7601j9354k1420j7947
$$ 363754 356850 367599 343507 312027 281548 282125 313062 307740 280139 260785 239365 221418
17494B21418L1640J7877j7414J1445j7518o588K3597k0871j5467j4646k3926o476
$$ 221418 253058 270935 253521 264966 247448 240860 264457 243586 228119 213473 189547 183071
17482A83071m873o69m11j7140j952j1728k293j0520J8452k6177J7043L6466J2301
$$ 183071 178198 177529 177118 159978 158026 146298 144005 133485 151937 125760 142803 179269 191570
17469A91570k751j6092n4131O616k0690j0916N5562j849J4059M1040k2032l5788
$$ 191570 188819 172727 118596 125212 104522 93606 149168 147319 161378 202418 180386 144598
17457A44598j1931j8123k3834M0923J8743l7427L5739j196m2512L2011O657M1882
$$ 144598 132667 114544 90710 131633 150376 112949 148688 147492 104980 136991 143648 185530
17445A85530K5508N00J7614K104o994M921l2530j00471l1353K2011j6150k3454
$$ 185530 211038 211538 229152 231256 224262 229183 196653 96182 64829 86840 70690 47236
17433D7236K1463j4769P296l2364j7123P451L0284L928k4724n829L2624l2342
$$ 47236 68699 53930 61226 28862 11739 19190 49474 53402 28678 22849 55473 23131
17421B3131K2756M531l3692k9418j2090L626j2862P538L5240r668M1804N649j2613
$$ 23131 45887 50418 16726 -12692 -24782 -21156 -34018 -26480 8760 -908 40896 46545 33932
17408C3932j2928j0098k1647m20k175L763K8307k6569l9340o697J422j8315O5734
$$ 33932 21004 10906 -10741 -11161 -13336 -9573 18734 -7835 -47175 -53872 -52450 -70765 -5031
17395e031O4998j8996j0749J4549j8950J365K8723k048l1137o648K3306j722j1076
$$ -5031 59967 40971 30222 44771 25821 27186 55909 53861 22724 16076 39382 37660 26584
17382B6584l7029L948n478M047K9521n335l6113j8566L2009l571N514j1735n0073
$$ 26584 -10445 -6497 -11975 -7928 21593 16258 -19855 -38421 -6412 -9983 -4469 -16204 -66277
17369f6277q010K4736o8n77M562L4476J6275L5672l026j9844j6036O728p990k886
$$ -66277 -74287 -49551 -49619 -50196 -45634 -11158 5117 40789 37763 17919 1883 8611 621 -2265
17355b265L1674j1046k5890j1853K6285K8300M1437J2774l8041K0546J239n7108
$$ -2265 29409 18363 -7527 -19380 6905 35205 76642 89416 51375 71921 73160 16052
17343A6052k7128k7343N2685Q511j4294K450q596L87k1062K5462j6228o5884K235
$$ 16052 -11076 -38419 14266 22777 8483 10933 2337 2724 -18338 7124 -9104 -74988 -72753
17330g2753J2713l6007l009M9468K0757N692K0847J1703L358j0006o1950m0755
$$ -72753 -60040 -96047 -99056 -49588 -28831 -23139 -2292 9411 12769 2763 -59187 -99942
17318i9942J5658K4938K1862K9086p45p984j964N088m0905r272n822P992J94o248
$$ -99942 -84284 -59346 -37484 -8398 -9143 -17127 -19091 -14003 -54908 -64180 -70002 -62010 -61816 -68064
17304f8064M0448n718m44j3142l9352k778J2060K6376L5153l2027l7503O0959
$$ -68064 -27616 -33334 -33778 -46920 -86272 -89050 -76990 -50614 -15461 -47488 -84991 -24032
17292b4032J8818M944Q458K338k9011j0372j3471m517j6820j0666m015M1272Q657
$$ -24032 -5214 -270 8188 10526 -18485 -28857 -42328 -46845 -63665 -74331 -78346 -37074 -28417
17279b8417J93k948M5880L5984m9227m7235l5813L4283J2183j0579J4531K2188
$$ -28417 -28224 -31172 14708 50692 1465 -45770 -81583 -47300 -35117 -45696 -31165 -8977
17267h977N1855J3763o231l7909L0842M7866J5903N0440N7601N0280N1876K8354
$$ -8977 42878 56641 50410 12501 43343 91209 107112 157552 215153 265433 317309 345663
17255C45663L6429P4610O0221M7020O300j1407k4724K7660L2438J2120J7435K2905
$$ 345663 382092 456702 516923 563943 570243 558836 534112 561772 594210 606330 623765 646670
17243F46670R926j7883k4046J0828k5404n3543r4574l5941J8578J9681J7926k3292
$$ 646670 656596 638713 614667 625495 600091 546548 451974 416033 434611 454292 472218 448926
17231D48926J844O227m3439o3039m5497m600l1251o0317j4323j1036J0106O346
$$ 448926 450770 456997 413558 350519 305022 300422 269171 208854 194531 183495 193601 199947
17219A99947P591j4342l27M7832j1279k291J2149L8542M9584J8803l174N2441
$$ 199947 207538 193196 192869 240701 229422 227131 239280 277822 327406 346209 343035 395476
17207C95476N6777N6361P1838M8606R5667Q6598O6785N373m0036n4781o9601k4173
$$ 395476 452253 508614 580452 629058 724725 811323 878108 883481 843445 788664 719063 694890
17195F94890K3096k3055m7847p2959k3616n5234n2876k9191R454m707J0199R309
$$ 694890 717986 694931 647084 574125 550509 495275 442399 413208 422662 417955 428154 437463
17183D37463J7608Q462Q628j9377l0205q329l3657p239K7049N2777L3566l4871
$$ 437463 455071 463533 472161 452784 422579 414250 380593 373354 400403 453180 486746 451875
17171D51875r1529n3530m5515m7448j6857M208J914l1132n968N2741K9017m544
$$ 451875 360346 306816 261301 213853 196996 201204 203118 171986 166018 218759 247776 243232
17159B43232J615J2462J2144k5757n2372m6386K7135l8096n589L5434l787k8300
$$ 243232 244847 257309 269453 243696 191324 144938 172073 133977 128388 163822 160035 131735
17147A31735l4027j7259j3137j0451O358J8566P527l1571Q292l3445o2122J2140
$$ 131735 97708 80449 67312 56861 63219 81785 89312 57741 66033 32588 -29534 -17394
17135a7394q819j1090L0039L068J2383k6185k0471K2135M0789m323k756K927m651
$$ -17394 -26213 -37303 -7264 -4196 8187 -17998 -38469 -16334 24455 20132 17376 20303 15652
17122A5652o320M1885j223j6773r612l8968n7201J4992K9505O238K3325q442K6096
$$ 15652 9332 51217 49994 33221 23609 -15359 -72560 -57568 -28063 -21825 1500 -6942 19154
17109A9154P405K959l267j0213j735J0538M1235k4322K493j2381k3126k9602j3485
$$ 19154 26559 29518 26251 16038 14303 24841 66076 41754 44247 31866 8740 -20862 -34347
17096c4347M703J1300Q4L6043L865l8445k2267j9871L3475L2874j8800l0702L2643
$$ -34347 -29644 -18344 -18260 17783 21648 -16797 -39064 -58935 -25460 7414 -11386 -42088 -9445
17083i445j2991m6466Q090K0639K419j4309J78L2898M8101N1018K4909n2271l9925
$$ -9445 -22436 -68902 -60812 -40173 -37754 -52063 -51885 -18987 29114 80132 105041 52770 12845
17070A2845o534M472J1013N089l4272j3422l0434k7415K6062J8860L5598R910
$$ 12845 6311 10783 21796 26885 -7387 -20809 -51243 -78658 -52596 -33736 1862 11772
17058A1772K445o432J7264r181j7514j783j7743Q936q994j4434q318k4026j4971
$$ 11772 14217 7785 25049 15868 -1646 -3429 -21172 -12236 -21230 -35664 -43982 -68008 -82979
17045h2979J6436J5596j2929L5631J7962q888O758L86r215k1345M971J4941M39
$$ -82979 -66543 -50947 -63876 -28245 -10283 -19171 -12413 -12027 -21242 -42587 -37616 -22675 -22236
17032b2236p655r538J8578m065J3841L0010j0957k1359L1998K5782j4631k9939
$$ -22236 -29891 -39429 -20851 -24916 -11075 18935 7978 -13381 18617 44399 29768 -171
17020a71j3640l8804o953M488J7087l2646N35J2713j2176j819K3234K8801l0604
$$ -171 -13811 -52615 -59568 -55080 -37993 -70639 -70104 -57391 -69567 -71386 -48152 -19351 -49955
17007d9955J6370J6413j456R087n069k4836L41K7574J5311J1443l5774k1948o84
$$ -49955 -33585 -17172 -18628 -9541 -14610 -39446 -39105 -11531 3780 15223 -20551 -42499 -43183
16994d3183k7777N809L5714L3570q878J054K525q806o7123p1395j7893L4372N8013
$$ -43183 -70960 -65151 -29437 4133 -4745 -3691 -1166 -9972 -77095 -148490 -166383 -132011 -73998
16981g3998J7918O951j9089p270R981M260L4394L212q719K6658L0559N631m6598
$$ -73998 -56080 -49129 -68218 -75488 -65507 -61247 -26853 -23641 -32360 -5702 24857 30488 -16110
16968a6110j4273J0639j460L315J076K0941j8195l9160J0341K3369k3392m9578
$$ -16110 -30383 -19744 -21204 -17889 -16813 4128 -14067 -53227 -42886 -19517 -42909 -92487
16956i2487j6286J6153L9888m259L5417k0742k7060N099K372M436J4631l711L340
$$ -92487 -108773 -92620 -52732 -56991 -21574 -42316 -69376 -64277 -61905 -57469 -42838 -46549 -43209
16943d3209K2820N3417r242j1104R264l3164n1133k4344o555K0423L3008k379
$$ -43209 -20389 33028 23786 12682 21946 -11218 -62351 -86695 -93250 -72827 -39819 -42198
16931d2198J0721r849M4305K0384l9984l6336k3490j6297L0449k310K7392j3166
$$ -42198 -31477 -41326 2979 23363 -16621 -52957 -76447 -92744 -62295 -64605 -37213 -50379
16919e0379l3113K0263K2731l5342j3254L1478N7412j5349K879Q531J9163m0887
$$ -50379 -83492 -63229 -40498 -75840 -89094 -57616 -204 -15553 -12674 -4143 15020 -25867
16907b5867p889K1614R602k3770m2399K5116K2753J5951k0559j1929R33J2750
$$ -25867 -33756 -12142 -2540 -26310 -68709 -43593 -20840 -4889 -25448 -37377 -36444 -23694
16895b3694J3821q650J2460Q771M433J1766j2788l449k4169l9166M146l3538j9447
$$ -23694 -9873 -18523 -6063 2708 7141 18907 6119 2670 -21499 -60665 -56519 -90057 -109504
16882a09504R012N6675J9951J0034K1893j1375k9036j1228j2702J8286R729L124
$$ -109504 -100492 -43817 -23866 -13832 8061 -3314 -32350 -43578 -56280 -37994 -28265 -25141
16870b5141k5958J6007J1387j8493M201J0911j4709J1639L1440o312Q5j4740p812
$$ -25141 -51099 -35092 -23705 -42198 -37997 -27086 -41795 -30156 1284 -5028 -4943 -19683 -27495
16857b7495L992j245j0781k98J5935N649k1608j4016M845L8163J6588k6267J190
$$ -27495 -23503 -24748 -35529 -35827 -19892 -14243 -35851 -49867 -45022 -6859 9729 -16538 -15348
16844a5348k1248k6501K0502P575K3586l855j6990J4307J400J3253J1805P463
$$ -15348 -36596 -63097 -42595 -35020 -11434 -15289 -32279 -17972 -16572 -3319 8486 15949
16832A5949N538j2975p749Q182K1176k0455R676k0811j2638k7665j5744L2869
$$ 15949 21487 8512 763 8945 30121 9666 19342 -1469 -14107 -41772 -57516 -24647
16820b4647L6191n280m9645k6054L9498M3393J9240m4227j2250k424k8283l5773
$$ -24647 11544 6264 -43381 -69435 -29937 13456 32696 -11531 -23781 -26205 -54488 -90261
16808i0261j0267L3725L9062J7361m783q35J4643J6784K341j9691p380l4001m3237
$$ -90261 -100528 -66803 -27741 -10380 -15163 -15998 -1355 15429 17770 -1921 -9301 -43302 -86539
16795h6539k6362n164L6451K7317K9723J2634j1364j1870j0607Q273J5099j6154
$$ -86539 -112901 -118065 -81614 -54297 -24574 -11940 -23304 -35174 -45781 -37508 -22409 -38563
16783c8563J7199M2018J5334k7916k9840j8892k898J9944J0495j337p075r413
$$ -38563 -21364 20654 35988 8072 -21768 -40660 -43558 -23614 -13119 -14456 -21531 -30944
16771c0944j9899o054j5610L202K7692N462m4934j1210K8957K6793O668n9899
$$ -30944 -50843 -56897 -72507 -69305 -41613 -36151 -81085 -92295 -63338 -36545 -29877 -89776
16759h9776j3214K001J4622J2640L8780N386r872k31q895j3644j41l4757J1894
$$ -89776 -102990 -100989 -86367 -73727 -34947 -29561 -39433 -39664 -48559 -62203 -62344 -97101 -85207
16746h5207K2079M806J8850k2881J1096P091J6744J6134j9465J8921L376j6214
$$ -85207 -63128 -58322 -39472 -62353 -51257 -44166 -27422 -11288 -30753 -11832 -8456 -24670
16734b4670K6522J4910Q486L2788L025n6050m4637L283Q47j233j2108n459J8936
$$ -24670 1852 16762 25248 58036 61061 5011 -39626 -36343 -35496 -36729 -48837 -54296 -35360
16721c5360O685L671J5418K3956L793o615k4257q483j4029j3062K2873Q855K2377
$$ -35360 -28675 -25004 -9586 14370 18163 11548 -12709 -21192 -35221 -48283 -25410 -16555 5822
16708E822L808O093q824K1797L5390l8714j6125l2737k4523L7817J5584K4216
$$ 5822 9630 15723 6899 28696 64086 25372 9247 -23490 -48013 -10196 5388 29604
16696B9604N656K476k5348j7160k1670J6187L4857k461k0242j174O849k5660l1752
$$ 29604 35260 37736 12388 -4772 -26442 -10255 24602 22141 1899 725 7574 -18086 -49838
16683d9838j4795j2786J6572j2501J4484N4289J5391l901L2190J2605m9350p1944
$$ -49838 -64633 -77419 -60847 -73348 -58864 -4575 10816 6915 39105 51710 2360 -69584
16671f9584j1190L4066L6681J27q622j7844l1228R832K3586k0483k9770o46J8999
$$ -69584 -80774 -46708 -10027 -9900 -18522 -36366 -67594 -57762 -34176 -54659 -84429 -85075 -66076
16658f6076M5569M7317K3286j0985k5420k4550J8768Q193k2137j935J9881k5127
$$ -66076 -20507 26810 50096 39111 13691 -10859 7909 16102 -6035 -7970 11911 -13216
16646a3216k5831J1347J5836M57J7380j430j2839O69k2871L1356J1786l9092p408
$$ -13216 -39047 -27700 -11864 -11407 5973 4543 -8296 -7627 -30498 858 12644 -26448 -33856
16633c3856J922r996l692K1254j0977K0522k0312r550J1529P05L5046O58j7598
$$ -33856 -31934 -41930 -45622 -24368 -35345 -14823 -35135 -44685 -33156 -32451 2595 3253 -14345
16620a4345j0533J161m141R530J2377j6980o987j7610J1387K1600J0745P577M271
$$ -14345 -24878 -23717 -27858 -18328 -5951 -22931 -29918 -47528 -36141 -14541 -3796 3781 8052
16607H052k137k0131k8333K149K8257K7398L304l2066O184L760l2708q474M2687
$$ 8052 5915 -14216 -42549 -40400 -12143 15255 18559 -13507 -7323 -3563 -36271 -44745 -2058
16594b058J3558J3657J9327J5785n9722l6370k0042l6560L477J9522j8742K8210
$$ -2058 11500 25157 44484 60269 547 -35823 -55865 -92425 -88948 -69426 -88168 -59958
16582e9958J9828l862k8854J4027n32J5445j2659K3182K1519Q40K5989K3302l5198
$$ -59958 -40130 -43992 -72846 -58819 -59351 -43906 -56565 -33383 -11864 -11024 14965 38267 3069
16569C069n9648l3442M124L278o749K2812M2244k1748l0532K4842K0837K3323
$$ 3069 -56579 -90021 -85897 -82619 -89368 -66556 -24312 -46060 -76592 -51750 -30913 -7590
16557g590M0277r899m1640j6587Q352M734m2995l8771k0228k3578j5058L0647
$$ -7590 32687 22788 -18852 -35439 -27087 -22353 -65348 -104119 -124347 -147925 -162983 -132336
16545a32336J0037K2333L052J2855J3413L7836J1330l5286J0933M3798L7663k5473
$$ -132336 -122299 -99966 -96914 -84059 -70646 -32810 -21480 -56766 -45833 -2035 35628 10155
16533A0155p217K0699p475k376k0853L545J13J7475K313j2066j2676K0514J0102
$$ 10155 2938 23637 16162 13786 -7067 -3522 -3409 14066 16379 4313 -8363 12151 22253
16520B2253J2822k1407k8467q917k9534k542k486P930J398J4860M2548M3992m7200
$$ 22253 35075 13668 -14799 -23716 -53250 -55792 -58278 -50348 -48950 -34090 8458 52450 5250
16507E250j2552J8131J1638j563m264p209l9566l7360L516j1047J3746J1527K9790
$$ 5250 -7302 10829 22467 20904 16640 9431 -30135 -67495 -63979 -75026 -61280 -49753 -19963
16494a9963O990L0421L7791q344J2553k3822p856R330P735j0466k3213l3737k2712
$$ -19963 -12973 17448 55239 46895 59448 35626 27770 37100 44835 34369 11156 -22581 -45293
16481d5293K2289L5462J5695m4936l7268k1074J6034K941J0190J6218J1764J209
$$ -45293 -23004 12458 28153 -16783 -54051 -75125 -59091 -56150 -45960 -29742 -17978 -16769
16469a6769K183j1691L3484j4464l9758j9040J5055K348J5297j4918K6338Q475
$$ -16769 -14586 -26277 7207 -7257 -47015 -66055 -51000 -48652 -33355 -48273 -21935 -13460
16457a3460l0952k7552K3613N274k1913l3333J7392L8402K4206J3369L4294J3902
$$ -13460 -44412 -71964 -48351 -43077 -64990 -98323 -80931 -42529 -18323 -4954 29340 43242
16445D3242j2016O054l337l679k3450j9088n156J0636k976K1311K2955J8123K966
$$ 43242 31226 37280 33943 30264 6814 -12274 -17430 -6794 -9770 11541 34496 52619 55585
16432E5585j8478J1937o194m9085O294J9047k6079k464o685M865J811j6761L1187
$$ 55585 37107 49044 42850 -6235 59 19106 -6973 -9437 -16122 -11257 -9446 -26207 4980
16419D980L909j3260J733j0794Q121J6482R302r969m9967P873L3786O688K765
$$ 4980 8889 -4371 -2638 -13432 -5311 11171 20473 10504 -39463 -31590 2196 8884 11649
16406A1649K7321k4634L639j0915k7751o905J8278j8812K283J5036j9860m388
$$ 11649 38970 14336 17975 7060 -20691 -27596 -9318 -28130 -25847 -10811 -30671 -35059
16394c5059K3600J513N108o688J4776N746L7581R143l5652m8770M0480J8661j4371
$$ -35059 -11459 -9946 -4838 -11526 3250 8996 46577 55720 20068 -28702 11778 30439 16068
16381A6068k680O4j9067J0837p629l2758j4211K9625K0378N898k4210J7409N425
$$ 16068 13388 13452 -5615 5222 -2407 -35165 -49376 -19751 627 6525 -17685 -276 5149
16368E149K5214k7545q930L593L2086j481m6432k4642l585N4190r873j3620K580
$$ 5149 30363 2818 -6112 -2519 29567 28086 -18346 -42988 -46573 7617 -2256 -15876 -13296
16355a3296m3955j3938L5614J5121L4140L1183j9146l6822j0715J88p885q088
$$ -13296 -57251 -71189 -35575 -20454 13686 44869 25723 -11099 -21814 -21626 -29511 -37599
16343c7599l9308k136J386J2310k3152N232P4717L3354j1349j3418N688j5930
$$ -37599 -76907 -79043 -77657 -65347 -88499 -83267 -8550 24804 13455 37 5725 -10205
16331a0205q55j5096O723m762l9259j0831j180L0293J961j8292N7992L8329l3540
$$ -10205 -11060 -26156 -19433 -24195 -63454 -74285 -75465 -45172 -43211 -61503 -3511 34818 1278
16318A278p038K0572o587m234J0399o246K8215L6857J4235n5546n002J7865j0180
$$ 1278 -5760 14812 8225 3991 14390 8144 36359 73216 87451 31905 26903 44768 34588
16305C4588l2284m363R160j8303j2556M0991K9170K278J3226l903j4052k9495
$$ 34588 2304 -2059 7101 -11202 -23758 17233 46403 48681 61907 58004 43952 14457
16293A4457n7263J5384M5327J7812j5714m2797q37K4344m1173k6M848Q809q651
$$ 14457 -42806 -27422 17905 35717 20003 -22794 -23631 713 -40460 -40486 -35638 -26829 -35480
16280c5480J0382J2345O583o468m3037o475M0783L6529K2439O682l2134m5622
$$ -35480 -25098 -12753 -6170 -12638 -55675 -62150 -21367 15162 37601 44283 12149 -33473
16268c3473k8313j2860k3324J9248j6634k090J5699L667o604P620l320J5242K3660
$$ -33473 -61786 -74646 -97970 -78722 -95356 -97446 -81747 -78080 -84684 -77064 -80384 -65142 -41482
16255d1482L3900J4425J7217J2484n680o594k5361l3420m0921K6558O0271K3465
$$ -41482 -7582 6843 24060 36544 30864 24270 -1091 -34511 -75432 -48874 11397 34862
16243C4862Q004n084m9301J2310N9901n389l2926J4519J3172k7411n5963j0262
$$ 34862 42866 37782 -11519 791 60692 55303 22377 36896 50068 22657 -33306 -43568
16231d3568m522O930K8K0745q702K0793o839j9764M2363L2883j2197n7177k7523
$$ -43568 -48090 -41160 -41132 -20387 -29089 -8296 -15135 -34899 7464 40347 28150 -29027 -56550
16218e6550k5113K8014j9118N507M5062L1759m889k6600m323K7069j0634k3765
$$ -56550 -81663 -53649 -72767 -67260 -22198 9561 4672 -21928 -26251 818 -9816 -33581
16206c3581j2917J2201M1633J5768J610J1314l5479j5144L2754M009m8214k9238
$$ -33581 -46498 -34297 7336 23104 24714 36028 549 -14595 18159 22168 -26046 -55284
16194e5284L2582N0267j740n4322J1818o529j9340J420Q955j2574o939Q488o188
$$ -55284 -22702 27565 25825 -28497 -16679 -23208 -42548 -41128 -32173 -44747 -51686 -43198 -49386
16181d9386l8655M597M0978K9899m668j0953j8573o375M0319O0436K1538m8502
$$ -49386 -88041 -83444 -42466 -12567 -17235 -28188 -46761 -53136 -12817 47619 69157 20655
16169B0655k6202K6410J5598k1974O284J3190k1258j4630K3705l8301l1442r914
$$ 20655 -5547 20863 36461 14487 20771 33961 12703 -1927 21778 -16523 -47965 -57879
16157e7879p548M3129J6830L3242o629j2853P699k091p221n798J4138Q906J5671
$$ -57879 -65427 -22298 -5468 27774 21145 8292 15991 13900 6679 881 15019 23925 39596
16144C9596J4846l4112j6336n3837L095J2189j4276J1200j554j5867M4794J067
$$ 39596 54442 20330 3994 -49843 -46748 -34559 -48835 -37635 -39189 -55056 -10262 -9195
16132i195J1070K238K3566N82m69j4773K8362J0961j3866o736n2808l9931L0439
$$ -9195 1875 4113 27679 28261 27792 13019 41381 52342 38476 31740 -21068 -60999 -30560
16119c0560L4265K8170k136j5676N11j4807j1029K6841J5574l2987k0673L2584
$$ -30560 3705 31875 29739 14063 14574 -233 -11262 15579 31153 -1834 -22507 10077
16107A0077K2795q085p035j6698j4034O205J9387j5887N965n405J8205L5568J1803
$$ 10077 32872 24787 17752 1054 -12980 -6775 12612 -3275 2690 -2715 15490 51058 62861
16094F2861l133k2430L07O282r885q762j5410l3951J3954j9126k3442j6496L1414
$$ 62861 59728 37298 37605 43887 34002 25240 9830 -24121 -10167 -29293 -52735 -69231 -37817
16081c7817L0036j7768j0227J1709K8257K2852j5926J2669j3603m766K009m3046
$$ -37817 -7781 -25549 -35776 -24067 4190 27042 11116 23785 10182 5416 7425 -35621
16069c5621p660j0007L679L3557K7584k0553j1090j0872K6229J8437J1869L970
$$ -35621 -43281 -53288 -49609 -16052 11532 -9021 -20111 -30983 -4754 13683 25552 29522
16057B9522M073J8566J4745j2948k7247r929j2827L0396L1913j9609J1661j9653
$$ 29522 33595 52161 66906 53958 26711 16782 3955 34351 66264 46655 58316 38663
16045C8663J2708j9072k479J5834L618J9891j3346j3553m8323k1672R409J4330
$$ 38663 51371 32299 29820 45654 49272 69163 55817 42264 -6059 -27731 -18322 -3992
16033c992J6533K8876q749m1029p3149J477L9475M2979M549k1241R110l3405l2212
$$ -3992 12541 41417 32668 -8361 -81510 -80033 -40558 2421 6970 -14271 -5161 -38566 -70778
16020g0778r550k1237m864N3132L9568L7520l88p697k1091l505p553L70M1270
$$ -70778 -80328 -101565 -106429 -53297 -13729 23791 23403 15706 -5385 -8890 -16443 -16073 25197
16007B5197J3075M458J0251k8623l1040K1181l776L0300n334k5834L58k0825m829
$$ 25197 38272 42730 52981 24358 -6682 14499 10723 41023 35689 9855 10213 -10612 -15441
15994a5441j8267j2157L57l7831K1329L3094J4256J4184K866k859k238O833l7908
$$ -15441 -33708 -45865 -45508 -83339 -62010 -28916 -14660 -476 2390 -469 -2707 4126 -33782
15981c3782O536L71L166J6894j0496M632L687K3657O325j0205l851J2060J4641
$$ -33782 -27246 -26875 -23709 -6815 -17311 -12679 -8992 14665 20990 10785 6934 18994 33635
15968C3635q104j7678o369j702n279k6248L7265K2644K331l438k8740P842J2805
$$ 33635 25531 7853 1484 -218 -5497 -31745 5520 28164 30495 27057 -1683 6159 18964
15955A8964l6909J4946Q891j7952N252K3445q972j2959L1127N2289l2395j88k1079
$$ 18964 -17945 -2999 5892 -12060 -6808 16637 7665 -5294 25833 78122 45727 45539 24460
15942B4460k5465Q704J9856K5713L528j3418J7974R747o4038m0326M7232k0186
$$ 24460 -1005 7699 27555 53268 56796 43378 61352 71099 7061 -33265 13967 -6219
15930f219M722J92j5643j9707J8602L2397j9541k2854J18j4703k1831K1833J5335
$$ -6219 -1497 -1305 -16948 -36655 -18053 14344 -5197 -28051 -27933 -42636 -64467 -42634 -27299
15917b7299M3983K2143k6450j698R775n727J106k1587r500j1045P363O867j764
$$ -27299 16684 38827 12377 10679 20454 14727 15833 -5754 -15254 -26299 -18936 -12069 -13833
15904a3833M1033J7007J9509L5300K849J948j6837k0996r50k0635K385R262k3709
$$ -13833 27200 44207 63716 99016 101865 103813 86976 65980 65030 44395 46780 56042 32333
15891C2333m5714J3769L3507J3886j8843k1243J1452J0940j7709k7690o696J7507
$$ 32333 -13381 388 33895 47781 28938 7695 19147 30087 12378 -15312 -22008 -4501
15879d501N140j3499K014k4236J3660L403q533K9159j235j6298N129J9263K8242
$$ -4501 639 -12860 -10846 -35082 -21422 -18019 -26552 2607 1372 -14926 -9797 9466 37708
15866C7708k0553j7372l4046k0477K6324j988k385q449j3184Q870J699L1666K2360
$$ 37708 17155 -217 -34263 -54740 -28416 -30404 -32789 -41238 -54422 -45552 -43853 -12187 10173
15853A0173J0280L3745n1115m9483K4226K0051q088J2317J6557J86K019k4401
$$ 10173 20453 54198 3083 -46400 -22174 -2123 -10211 2106 18663 18849 20868 -3533
15841c533p805Q331q592m8040J9679Q032J9450o611j2953K0731J3211j6216l4659
$$ -3533 -11338 -3007 -11599 -59639 -39960 -31928 -12478 -19089 -32042 -11311 1900 -14316 -48975
15828d8975R099L4228K4448K5605r172n7036l2601k6774j5994J8233j1706m520
$$ -48975 -39876 -5648 18800 44405 35233 -21803 -54404 -81178 -97172 -78939 -90645 -95165
15816i5165K9946L5271N0083p201j0753m1420J8801N5127l281r726j3795n0010
$$ -95165 -65219 -29948 20135 12934 2181 -39239 -20438 34689 31408 21682 7887 -42123
15804d2123N230Q680L875k864J7546L7248K45J2460K5644k0896j2180L5447j7949
$$ -42123 -36893 -28213 -24338 -27202 -9656 27592 27837 40297 65941 45045 32865 68312 50363
15791E0363o5791m2159J1338K2389J4130o196l349K5356K4648k147P184L5500
$$ 50363 -15428 -57587 -46249 -23860 -9730 -15926 -19275 6081 30729 28582 35766 71266
15779G1266m995J414J3382p299m0291m6092k1850L7427O444j630j935J0978M7938
$$ 71266 66271 67685 81067 73768 33477 -12615 -34465 2962 9406 7776 5841 16819 64757
15766F4757J9497k5258m998J3775j6892k1127j3761J9151L0069K2174m1404p917
$$ 64757 84254 58996 53998 67773 50881 29754 15993 35144 65213 87387 45983 38066
15754C8066J6311k4884n2979J5271Q623j2744n594r344N5552K3924n34j2030k1797
$$ 38066 54377 29493 -23486 -8215 408 -12336 -17930 -27274 28278 52202 51668 39638 17841
15741A7841K1980Q417m5842q536r703J9407L6760q46M502Q311k1072m2833j6212
$$ 17841 39821 48238 2396 -6140 -15843 3564 40324 39478 43980 52291 31219 -11614 -27826
15728b7826Q238R604J3708K4563m4940l2923K6923K3811L6786L7302p173m9546
$$ -27826 -19588 -9984 3724 28287 -16653 -49576 -22653 1158 37944 75246 68073 18527
15716A8527j7058J7563J4032o451j9828k5336j3140l5573J0322N7565K6622l6097
$$ 18527 1469 19032 33064 26613 6785 -18551 -31691 -67264 -56942 623 27245 -8852
15704h852R978k8424J1014J2540j1324n759o844J8942M138j4799j4007p785J9399
$$ -8852 1126 -27298 -16284 -3744 -15068 -20827 -27671 -8729 -4591 -19390 -33397 -41182 -21783
15691b1783o90j1868j679j1971J4513L6067M7394L9657P617k3891N868n7733k5691
$$ -21783 -22473 -34341 -36020 -47991 -33478 2589 49983 89640 97257 73366 79234 21501 -4190
15678d190K8268J1804k5133j8124K4262M1803K284l8610l2134k5143m833N0782
$$ -4190 24078 35882 10749 -7375 16887 58690 60974 22364 -9770 -34913 -39746 11036
15666A1036M12J4702M1902R122j4619K7967N884k3127n8532l4638k69L3984L3919
$$ 11036 11448 26150 68052 77174 62555 90522 96406 73279 14747 -19891 -20160 13824 47743
15653D7743J9834k2409m2912m3772J756L0052J0964J6777r497J7503k7677k2426
$$ 47743 67577 45168 2256 -41516 -39760 -9708 1256 18033 8536 26039 -1638 -24064
15641b4064k0257J4305R521p145M6387k018J3572J0791q788P057N066m7156j536
$$ -24064 -44321 -30016 -20495 -27640 18747 16729 30301 41092 32304 39361 44427 -2729 -4265
15628d265L8024N0370k9074J2923M4830N900n5111l4130J0225l606J4037j0865
$$ -4265 33759 84129 55055 67978 112808 118708 63597 29467 39692 36086 50123 39258
15616C9258m272P48k7624l1654j3207m966k0576J7816K3195K3522j8572r550J0035
$$ 39258 34986 35734 8110 -23544 -36751 -41717 -62293 -44477 -21282 2240 -16332 -25882 -15847
15603a5847k4469k1744M4013L4648N547K7860K3239J8839j9719o3899j6412L8503
$$ -15847 -40316 -62060 -18047 16601 22148 50008 73247 92086 72367 8468 -7944 30559
15591C0559K5209J709j2029q878k7952j9813l299R543l3155L155M4105j1836k6630
$$ 30559 55768 57477 45448 36570 8618 -11195 -14494 -4951 -38106 -34951 9154 -2682 -29312
15578b9312J5482j4822R298K4809m0649l2070K0364n421J620L5231p419j1782
$$ -29312 -13830 -28652 -19354 5455 -35194 -67264 -46900 -52321 -50701 -15470 -22889 -34671
15566c4671L9610J5883O914K897k189K1221l210j9752M775M642M5097q449n724
$$ -34671 4939 20822 27736 30633 28444 49665 46455 26703 31478 36120 81217 72768 67044
15553F7044K450r227k5679j2306k0213n87L9874L1414o651k065j34j0715k9464
$$ 67044 69494 60267 34588 22282 2069 1482 41356 72770 66119 64054 63920 53205 23741
15540B3741q943L0087L0225j8692n914K0903j6259p617j5547j9802j2940L4985
$$ 23741 14798 44885 75110 56418 50504 71407 55148 47531 31984 12182 -758 34227
15528C4227J6048j5753l799N3k8911k9038L3889J2535k2556k1216M2781M6904
$$ 34227 50275 34522 30723 30776 1865 -27173 6716 19251 -3305 -24521 18260 65164
15516F5164M551L885J033m3054k5697M8831L9711J1776j7719o2403m664J7648
$$ 65164 69715 73600 74633 31579 5882 54713 94424 106200 88481 26078 21414 39062
15504C9062M047M71O584L4215l427j456n259l7497n3508J513K9409O650j1779
$$ 39062 43109 43580 50164 84379 80952 79496 74237 36740 -16768 -15255 14154 20804 9025
15491I025J9109K9659J9844k2651o0418l9472L0337K8445j791K6960K7770L4196
$$ 9025 28134 57793 77637 54986 -5432 -44904 -14567 13878 12087 39047 66817 101013
15479A01013j2644n2504l5403L585K4203J1722o433J3296K7897L1274o086j0819
$$ 101013 88369 35865 462 4047 28250 39972 33539 46835 74732 106006 99920 89101
15467H9101k1689k8010Q380o443r893k981J8130k9850k3726J5098K6733k75r321
$$ 89101 67412 39402 47782 41339 31446 28465 46595 16745 -6981 8117 34850 34575 25254
15454B5254o021L816j9040j118Q079M0224L6459K5723l3684j1328K4056L4326
$$ 25254 19233 23049 4009 2891 10970 51194 87653 113376 79692 68364 92420 126746
15442A26746L2119N1186L7300M0680L8970L3698M6405O6927J02554J26758J56960
$$ 126746 158865 210051 247351 288031 327001 360699 407104 474031 576585 703343 860303
15431H60303J86482J90391K15609K16269J54684Q0116N5315L2190n0274j57175
$$ 860303 1046785 1237176 1452785 1669054 1823738 1903854 1959169 1991359 1941085 1783910
15421A783910k27982k03222k30965k09330j18851r7660r5617j56362q0061l921
$$ 1783910 1555928 1352706 1121741 912411 793560 695900 600283 443921 363860 359939
15411C59939l838p541k4627N428o81J448j2062j849n2745n0862j7603r971J314
$$ 359939 356101 348560 323933 329361 328680 330128 318066 316217 263472 212610 195007 185036 186350
15398A86350m3390k1458Q057J0855N1992j0745k4679l9123k619L4043M0228J3476
$$ 186350 142960 121502 129559 140414 192406 181661 156982 117859 115240 149283 189511 202987
15386B02987j5807p5482n3750J2230K9099M732j4192Q138L102l410j5727N24J218
$$ 202987 187180 111698 57948 70178 99277 104009 89817 97955 101057 97647 81920 82444 83662
15373H3662J193K4186P431J0957K3121K3618k4189n5547m0736l7237j6654K8383
$$ 83662 84855 109041 116472 127429 150550 174168 149979 94432 53696 16459 -195 28188
15361B8188J6529k3873j173j2990k7562M0679K4026L2797r222m0977j3227j1469
$$ 28188 44717 20844 19671 6681 -20881 19798 43824 76621 67399 26422 13195 1726
15349A726L488L8884n39k4886j9156Q942p416j9450R441M8029Lk2160l533L3753
$$ 1726 5214 44098 43559 18673 -483 8459 1043 -18407 -8966 39063 39066 16906 13373 47126
15335D7126J5194j8168J644R023K3255k9019l0203P908J3079p598j3302K7141
$$ 47126 62320 44152 45796 54819 78074 49055 18852 26760 39839 32241 18939 46080
15323D6080L5636m431k6349j2839M780j064J3914L2551k0292k4931j6907L8354
$$ 46080 81716 77285 50936 38097 42877 41813 55727 88278 67986 43055 26148 64502
15311F4502M4473L748L889L054J5154n2k2758n1901k783o095j385L0464K4017
$$ 64502 108975 112723 116612 119666 134820 134768 112010 60109 57326 51231 49846 80310 104327
15298A04327M243j524J6999J7582k2775k0264n0560k1498L2147k25r813o85N669
$$ 104327 108570 107046 124045 141627 118852 98588 48028 26530 58677 58452 48639 47954 53623
15285E3623j6090J8607K6182J4111q054j0584L5337L8893j6176j9378K237j0753
$$ 53623 37533 56140 82322 96433 88379 77795 113132 152025 135849 116471 118708 107955
15273A07955p28J1271Q726j9817j558l4208l4185J3899J0051M3379J0282j5774
$$ 107955 107227 118498 127224 107407 105849 71641 37456 51355 61406 104785 115067 99293
15261I9293j2751K6924J0856j9269K6182K1298l8528O195J450j2704j7803j1384
$$ 99293 86542 113466 124322 105053 131235 152533 114005 120200 121650 108946 91143 79759
15249G9759L9191K892J3401K2038j7550J255L1336j3756J6574l2368j9516J7742
$$ 79759 118950 121842 135243 157281 139731 140986 172322 158566 175140 142772 123256 140998
15237A40998n3267k509K4026J5874j0138j0530O495L1174K9828J6076L5598L2404
$$ 140998 87731 85222 109248 125122 114984 104454 110949 142123 171951 188027 223625 256029
15225B56029J9857L8968K0287K850k9756R259k3504j9080o716p832k6356L2084
$$ 256029 275886 314854 335141 337991 308235 317494 293990 274910 268194 260362 234006 266090
15213B66090K4681L2344K7409l6549k9492r0382n2761p704J7018J8289J5025N745
$$ 266090 290771 323115 350524 313975 284483 194101 141340 133636 150654 168943 183968 189713
15201A89713K5202L6300K0528l0910k3049j6059N0390q941n0594k5012J92l931
$$ 189713 214915 251215 271743 240833 217784 201725 252115 243174 192580 167568 167760 163829
15189A63829p056L1013J9642J7633k0952j9006J2600p427j4154R405P169k430
$$ 163829 156773 187786 207428 225061 204109 185103 197703 190276 176122 185527 192696 190266
15177A90266j0491K9288J3367o66J724p568o5556j8045J8522K1521m886P796k442
$$ 190266 179775 209063 222430 221764 223488 215920 150364 132319 150841 172362 167476 175272 172830
15164A72830M0482M486k2867j3423m6124J6036r346j5568L0076N7761K0624J1968
$$ 172830 213312 217798 194931 181508 135384 151420 142074 126506 156582 214343 234967 246935
15152B46935N747j82j8133O185M8991J1358n862k8654O821j6602L805o192o345
$$ 246935 252682 252500 234367 240552 289543 300901 295039 266385 273206 256604 260409 254217 247872
15139B47872L9927J7804n0736M453K7280J7804j659L995K4853M848j5098k3209
$$ 247872 287799 305603 254867 259320 286600 304404 302745 306740 331593 336441 321343 298134
15127B98134m1013k2999J0020M5724Q600j0745k0675j2406M811o400J7120j7720
$$ 298134 257121 234122 244142 289866 298466 287721 267046 254640 259451 253051 270171 252451
15115B52451O164K5777L4068r403J0326J475Q220m4680l808O5948N1316J2141
$$ 252451 258615 284392 318460 309057 319383 320858 329078 284398 280590 346538 397854 409995
15103D09995k35L7222J9674O503M0662L6704O2687K379J3253L7710j1297j7764
$$ 409995 409760 446982 466656 473159 513821 550525 613212 615591 628844 666554 655257 637493
15091F37493l1730l5811l9731j9943n3356k0997L690K4757N2451J5349O309M1566
$$ 637493 605763 569952 530221 510278 456922 435925 439615 464372 516823 532172 538481 580047
15079E80047M5767L749o0407l0748M3055L5983j1997J7621L3870j3423M804K7137
$$ 580047 625814 629563 569156 538408 581463 617446 605449 623070 656940 643517 648321 675458
15067F75458L086Q077L1990q372l3739j3993L1452j3407L79Q081j188L8810L8198
$$ 675458 678544 686621 718611 710239 676500 662507 693959 680552 680931 689012 687824 726634 764832
15054G64832j1314j0411o180o822K0920P223j3840J6286N5781L2379K5218J4683
$$ 764832 753518 743107 736927 730105 751025 758248 744408 760694 816475 848854 874072 888755
15042H88755j2596j3771k8966j563k2358j5664k810m5389k1084J0265J6801P906
$$ 888755 876159 862388 833422 831859 809501 793837 791027 745638 724554 734819 751620 759526
15030G59526R79L1699N9205M5957N7064P3154R5607J11238L3224P6079R1818R4110
$$ 759526 760505 792204 851409 897366 954430 1027584 1123191 1234429 1267653 1343732 1435550 1529660
15018A529660J34882J07389Q8616J22048J25713J15704R1864Q2812J31774J82900
$$ 1529660 1664542 1771931 1860547 1982595 2108308 2224012 2315876 2398688 2530462 2713362
15008B713362K00375K86818M01587M48848L62329K36053L01979M10578L95260
$$ 2713362 2913737 3200555 3602142 4050990 4413319 4649372 4951351 5361929 5757189
14999E757189J10608q9562P3237L03852M95244O11480P29622R39052J137959J316911
$$ 5757189 5867797 5778235 5851472 6155324 6650568 7262048 7991670 8930722 10068681 11385592
14989A1385592J626442J966621K412359K869864L385777M121140N175235O674312
$$ 11385592 13012034 14978655 17391014 20260878 23646655 27767795 32943030 39617342
14981C9617342Q927580J2052239J5888993J9990263K4649882L0322656L6445472
$$ 39617342 48544922 60597161 76486154 96476417 121126299 151448955 187894427
14974A87894427M0874669M0850854L5969905K8660151K0834646J1650710j213891
$$ 187894427 228769096 269619950 305589855 334250006 355084652 366735362 365521471
14967C65521471j7277452l1958183m0421683m1416414l7820367l3355345k9262303
$$ 365521471 348244019 316285836 275864153 234447739 196627372 163272027 134009724
14960A34009724k4692411j9160378j3626200r468238o881840n276454m282058
$$ 134009724 109317313 90156935 76530735 67062497 60180657 54904203 50622145
14953E0622145l697988l309758l085638k776161k522684k302670k072070j881353
$$ 50622145 46924157 43614399 40528761 37752600 35229916 32927246 30855176 28973823
14945B8973823j696313j477943j323995j230885j068757r87848q98023q23401
$$ 28973823 27277510 25799567 24475572 23244687 22175930 21188082 20290059 19466658
14937A9466658p38835p60780o92078o50700o23521n81537n49609o13450n74405
$$ 19466658 18727823 17967043 17274965 16624265 16000744 15419207 14869598 14256148 13681743
14928A3681743n11134n06757m94248m79913l94022l98323l59363l27069l24093
$$ 13681743 13170609 12663852 12169604 11689691 11295669 10897346 10537983 10210914 9886821
14919I886821l14728k68421k21817k61636k25348k01065k01788k17098k07816
$$ 9886821 9572093 9303672 9081855 8820219 8594871 8393806 8192018 7974920 7767104
14910G767104j29795j85593j93781k31064k27641k03900j98681k09659k34500
$$ 7767104 7637309 7451716 7257935 7026871 6799230 6595330 6396649 6186990 5952490
14901E952490j95793j47408j79699k36317j62161j38836j28405j34256j15018
$$ 5952490 5756697 5609289 5429590 5193273 5031112 4892276 4763871 4629615 4514597
14892D514597j25630j29956r0201j14804j66290j32708q5836j27510j07850q5242
$$ 4514597 4388967 4259011 4168810 4054006 3887716 3755008 3669172 3541662 3433812 3348570
14882C348570n8875p7707j13973m3192l5646r6800j01899j10835j05156r9079
$$ 3348570 3289695 3211988 3098015 3054823 3019177 2922377 2820478 2709643 2604487 2505408
14872B505408q0934p4376j04126j27192r9968j20273j37924p9187m3580j19356
$$ 2505408 2424474 2350098 2245972 2118780 2018812 1898539 1760615 1681428 1637848 1518492
14862A518492j33037n8985n8222n3850m7194l7190o6144n5926J832l5797o2849
$$ 1518492 1385455 1326470 1268248 1214398 1167204 1130014 1063870 1007944 1009776 973979 911130
14851I11130m9522m3836k3147O789L670p527l2766n0512j3897J6267k0151q0031
$$ 911130 861608 817772 794625 801414 805084 797557 764791 714279 700382 716649 696498 616467
14839F16467l5030J6778l255l6629n462j3932j5648l7236J3104j5116k0527n0731
$$ 616467 581437 598215 594960 558331 552869 538937 523289 486053 499157 484041 463514 412783
14827D12783k338K2690J1463j9629J4189l569l076l2824j161j6676r83L2534J9839
$$ 412783 410445 433135 444598 424969 439158 435589 432513 399689 398528 381852 380869 413403 433242
14814D33242l5135j7981M053L560q034J4403n932l8749j0766m0504p769K9605
$$ 433242 398107 380126 384179 387739 379705 394108 388176 349427 338661 298157 290388 319993
14802C19993j3761J9659k571j0410q608j6057j1070k7825k4566q891J7961N962
$$ 319993 306232 325891 323320 312910 304302 288245 277175 249350 224784 215893 233854 239816
14790B39816K6396K1500J241Q118j2111N748J3110J3960K0220k0428J3837J7177
$$ 239816 266212 287712 288953 297071 284960 290708 303818 317778 337998 317570 331407 348584
14778C48584j8147k8196p716j5336K3641j707k1538O564R626j736L239N669j0894
$$ 348584 330437 302241 294525 279189 302830 301123 279585 286149 295775 294039 297278 302947 292053
14765B92053j3532K6383q109r177r080j8599q85J1167j3287K5325n511J2813J1498
$$ 292053 278521 304904 296795 287618 278538 259939 259054 270221 256934 282259 276748 289561 301059
14752C01059J6472L215j5753k2606r196L6052K3398l5868Q865J5624M602j8977
$$ 301059 317531 320746 304993 282387 273191 309243 332641 296773 305638 321262 325864 306887
14740C06887l1808j3212m3474m1999m1486L5449P1581k0465N939M166j8809J3884
$$ 306887 275079 261867 218393 176394 134908 170357 241938 221473 227412 231578 212769 226653
14728B26653J6353n695o210k2120j4637m189l7509L941M53L1319L587q916j281
$$ 226653 243006 237311 231101 208981 194344 190155 152646 156587 157040 188359 191946 183030 181749
14715A81749l4787l2499q225M7741K4911K3237j7329k4683m1556k2826l0438j371
$$ 181749 146962 114463 106238 153979 178890 202127 184798 160115 118559 95733 65295 63924
14703F3924k1940j41q005K915M076J0871K4579m9171n9154K3958J3897O231m243
$$ 63924 41984 41843 33838 36753 40829 51700 76279 27108 -32046 -8088 5809 12040 7797
14690G797J9122L6576o267k4030J859J9719l350r057j0650k502j3178L2790J2006
$$ 7797 26919 63495 57228 33198 35057 54776 51426 42369 31719 29217 16039 48829 60835
14677F0835p637P301j1514R763L3946l476J5665R360l9516l1096k451j3285J5808
$$ 60835 53198 60499 48985 58748 92694 89218 104883 114243 74727 43631 41180 27895 43703
14664D3703J7659k5030q3L6504k4791o9415N316L5652K0855j0981O111l093j2863
$$ 43703 61362 36332 36249 72753 47962 -21453 -16137 19515 40370 29389 35500 32407 19544
14651A9544L768J7728R722k3636l3666P538O557L7384K8746j3498j8597j0270
$$ 19544 23312 41040 50762 27126 -6540 998 7555 44939 73685 60187 41590 31320
14639C1320J7680K6463l0312l5732K0505J1047j4406P70j7729l491J8112K3661
$$ 31320 49000 75463 45151 9419 29924 40971 26565 27335 9606 6115 24227 47888
14627D7888j4066j160K9655k2071l8457n935l9003l0171r435L8613O6857J2787
$$ 47888 33822 32662 62317 40246 1789 -4146 -43149 -73320 -82755 -44142 22715 35502
14615C5502J130k7223K737J6581n053L330n654j7061o314J7347l489j2630l4211
$$ 35502 36632 9409 12146 28727 23674 27004 21350 4289 -2025 15322 11833 -797 -35008
14602c5008J9045K5113j5693K9278m0354m934L2597M4954J7119l5156m1935J4839
$$ -35008 -15963 9150 -6543 22735 -17619 -22553 10044 54998 72117 36961 -4974 9865
14590I865K4139J3755j2515p406l694K4809R078k6802n5861J3649J9177k2666
$$ 9865 34004 47759 35244 27838 24144 48953 58031 31229 -24632 -10983 8194 -14472
14578a4472o4399K0830L5288L9661M8754j2142m5960j9454J1384Q018J7246k3200
$$ -14472 -78871 -58041 -22753 16908 65662 53520 7560 -11894 -510 7508 24754 1554
14566A554k4802J9422j0115l7428j9624L2032K2387K1955N5780K3819j4341k8229
$$ 1554 -23248 -3826 -13941 -51369 -70993 -38961 -16574 5381 61161 84980 70639 42410
14554D2410M411j197j7649j4619M0814J5374k4967j8162j0417j6053j9701L3483
$$ 42410 46821 45624 27975 13356 54170 69544 44577 26415 15998 -55 -19756 13727
14542A3727k2441k5985J8636M7757Q16J1909k3604j1493M277L6405m921j3552
$$ 13727 -8714 -34699 -16063 31694 32510 44419 20815 9322 13599 50004 45083 31531
14530C1531j3392L297J5170k5713K3027M9012K1746R385N0623L4724K0518K4848
$$ 31531 18139 21436 36606 10893 33920 82932 104678 114063 164686 199410 219928 244776
14518B44776N1904Q8490J18484J21824J09562J39060K03346K07798K20637J81304
$$ 244776 296680 385170 503654 625478 735040 874100 1077446 1285244 1505881 1687185
14508A687185J65289P3337L2024p6174j25210j48710j72275k06585j97490j72816
$$ 1687185 1852474 1925811 1957835 1881661 1756451 1607741 1435466 1228881 1031391 858575
14498H58575j39949j25967r7980n5813l5960j5816K275m9373k0684j1820p254
$$ 858575 718626 592659 494679 438866 402906 387090 389365 339992 319308 307488 300234
14487C00234o022l1111k0512p761N783N846k61j5277l4855l6219M0975j7786m4171
$$ 300234 294212 263101 242589 234828 240611 246457 246196 230919 196064 159845 200820 183034 138863
14474A38863j7970j7410k8885Q329L6396K3461k76J2957J6926j8626N984k22r456
$$ 138863 120893 103483 74598 82927 119323 142784 142508 155465 172391 153765 159749 159527 150071
14461A50071n64p025k2916l418P45j4302J1183P197m688J4286O591J1353l1505
$$ 150071 149507 142482 119566 116148 116893 102591 113774 120971 116283 130569 137160 148513 117008
14448A17008o629j9016p184m3907Q52J5900M8436j1875p840o422o461Q938j5712
$$ 117008 110379 91363 84179 40272 41124 57024 105460 93585 85745 79323 72862 81800 66088
14435F6088k0003l9342J874K174R922L2904j5752Q028L9442m201m0815k7244n990
$$ 66088 46085 6743 8617 10791 20713 53617 37865 45893 85335 81134 40319 13075 7085
14422G085j7143q155J3830O5966o520J4834J9482J4494J4070r567L8397k132J6566
$$ 7085 -10058 -18213 -4383 61583 55063 69897 89379 103873 117943 108376 146773 144641 161207
14409A61207N4905K0552N6104N1267J15642J08397R7343P7203P1765N2832J6561
$$ 161207 216112 236664 292768 344035 459677 568074 665417 742620 814385 867217 883778
14398H83778j462k1099p0013p2752m1298o4280q0350o5619o9847r7950p3050m2811
$$ 883778 882316 861217 791204 718452 677154 612874 532524 466905 397058 299108 226058 183247
14386A83247l8869k7777K1587K3040Q511l5806K045j5557j8851j287j25l2171
$$ 183247 144378 116601 138188 161228 169739 133933 135978 120421 101570 100283 100158 67987
14374F7987l635j6568j3001L1164l358K2151L1103P614J5646p1253o4505j2508
$$ 67987 64352 47784 34783 65947 62589 84740 115843 123457 139103 67850 3345 -9163
14362i163j5037l727M5229K8955p062N245J8094l2903m789j6221O204L868J8968
$$ -9163 -24200 -27927 17302 46257 39195 44440 62534 29631 24842 8621 14825 18693 37661
14349C7661J2318n1505m1057m999J8388N0915J4150l0520j418P727q393j8005
$$ 37661 49979 -1526 -42583 -47582 -29194 21721 35871 5351 3933 11660 3267 -14738
14337a4738l517K517M3022J0017k5422n238j1913j8737J0546Q216K1991L0537
$$ -14738 -18255 -15738 27284 37301 11879 6641 -5272 -24009 -13463 -5247 16744 47281
14325D7281l0317j2294J7572L4822l936o2018l0122J1079K8630n478k1050L0859
$$ 47281 16964 4670 22242 57064 53128 -8890 -39012 -27933 697 -4781 -25831 5028
14313E028K4512j2809n312Q288J9977Q246j3569l863o2758p492K0490O762q084
$$ 5028 29540 16731 11419 19707 39684 47930 34361 30498 -32260 -39752 -19262 -12500 -20584
14300b0584N270J5193O7786J0822m7193l1182J390K460K4112L0846k8704m961
$$ -20584 -15314 -121 67665 78487 31294 112 1502 3962 28074 58920 30216 25255
14288B5255R80J8828j2852n809N439j5503p307O860k544m470n933n1513j3304
$$ 25255 26235 45063 32211 26402 31841 16338 9031 15891 13347 8877 2944 -48569 -61873
14275f1873L327k224J5177J6973q70l237k022K3555O308P480k3165K6684K8861
$$ -61873 -58546 -60770 -45593 -28620 -29490 -32727 -34749 -11194 -4886 2594 -20571 6113 34974
14262C4974j1614J9794k3506l9085O179L8694R665J390K412M528l3418o772J4577
$$ 34974 23360 43154 19648 -19437 -13258 25436 35101 36491 38903 43431 10013 3241 17818
14249A7818k1633k1076K230N2496M3516l3022k1102j7076J2746j3812o894R540
$$ 17818 -3815 -24891 -22661 29835 73351 40329 19227 2151 14897 1085 -5809 3731
14237C731l0249k8670J9930N790K811L8876J5271j9965k2877p627p969k2357N189
$$ 3731 -26518 -55188 -35258 -29468 -26657 12219 27490 7525 -15352 -22979 -30948 -53305 -48116
14224d8116j1969j019N2741K7940l0316n0197Q162J6670n964J4101J7135K5886
$$ -48116 -60085 -61104 -8363 19577 -10739 -60936 -52774 -36104 -42068 -27967 -10832 15054
14212A5054J9711P055K7577k5217m8884R854L4593n278j5531J2517j5446k4059
$$ 15054 34765 41820 69397 44180 -4704 5150 39743 34465 18934 31451 16005 -8054
14200h054j3897m421J2238M9094K6499k5771m8324k3511n217K5264L2427m915
$$ -8054 -21951 -26372 -14134 34960 61459 35688 -12636 -36147 -41364 -16100 16327 11412
14188A1412K906J1855n4470l9949K0357M4529N3857j4626l5491K6782K2630j9235
$$ 11412 14318 26173 -28297 -68246 -47889 -3360 50497 35871 380 27162 49792 30557
14176C0557j7447J050L2064L0003k9931k2741k4089J2605L1385J90j0934l3583
$$ 30557 13110 14160 46224 76227 46296 23555 -534 12071 43456 43646 32712 -871
14164h71j5557M186K8057P027J2638j7831l081J5493j2149J3057k3117m2001l399
$$ -871 -16428 -12242 15815 22842 35480 17649 14568 30061 17912 30969 7852 -34149 -37548
14151c7548n40K0826L0395Q284M833j6611k5561k0781K0834M285j4881l9776P603
$$ -37548 -38088 -17262 13133 21417 26250 9639 -15922 -36703 -15869 -11584 -26465 -66241 -58638
14138e8638L4944M2343J2519P81m1821J270K5503L9133m8845j4478J283J5876
$$ -58638 -23694 18649 31168 31949 -9872 -8602 16901 56034 7189 -7289 -6006 9870
14126I870K7330K6519Q610k4817j8591k2727j3958j5051R704K6870M4102j7997
$$ 9870 37200 63719 72329 47512 28921 6194 -7764 -22815 -13111 13759 57861 39864
14114C9864k2753m5017j9666K9970M0837L956r34J2912n2868m8287N317M9409
$$ 39864 17111 -27906 -47572 -17602 23235 27191 26257 39169 -13699 -61986 -56669 -7260
14102g260L036j6071J2656O0365M693p737k9321l1785j6973j1635q910L2531K2574
$$ -7260 -4224 -20295 -7639 52726 57419 49682 20361 -11424 -28397 -40032 -48942 -16411 6163
14089F163O1415L2693l3220k5270l1998l5862n860k097J0854M2137j9585J2284
$$ 6163 67578 100271 67051 41781 9783 -26079 -31939 -34036 -23182 18955 -630 11654
14077A1654l4235m1838l8650q57L1933N2196L0422j2641k5979J3038j0337l0069
$$ 11654 -22581 -64419 -103069 -103926 -71993 -19797 10625 -2016 -27995 -14957 -25294 -55363
14065e5363L6871j7849m2737k401M6088K1045M4394k2920k0763o342N1950K8189
$$ -55363 -18492 -36341 -79078 -81479 -35391 -14346 30048 7128 -13635 -19977 31973 60162
14053F0162j7873o1527k0091K5959L2597K5626k0051k5937O1327J0608j5030k2106
$$ 60162 42289 -19238 -39329 -13370 19227 44853 24802 -1135 60192 70800 55770 33664
14041C3664Q160K8070j7345j9407M657j0075j8157k463n1141J7836R335K3667
$$ 33664 41824 69894 52549 33142 37799 27724 9567 7104 -44037 -26201 -16866 6801
14029F801K1588j7473k9341m223Q141O518M496L9859j260M1783K4767k8094l2206
$$ 6801 28389 10916 -18425 -22648 -14507 -7989 -3493 36366 35106 76889 101656 73562 41356
14016D1356k2656j6245j3165K9868K988n5784l2940J3962Q804M6713j3388J6929
$$ 41356 18700 2455 -10710 19158 22146 -33638 -66578 -52616 -43812 2901 -10487 6442
14004F442M6570j3783j6849Q995K2467j4254M986K7689P714Q598k6710l1805l0748
$$ 6442 53012 39229 22380 31375 53842 39588 44574 72263 79977 88575 61865 30060 -688
13991f88M874J4587J0174J9734k9251m6304j0175o476J3284K8168J6732L4419
$$ -688 4186 18773 28947 48681 19430 -26874 -37049 -43525 -30241 -2073 14659 49078
13979D9078M3662j2561l9085n0812j7269L3842k8983m2509l5851K0595N531N4199
$$ 49078 92740 80179 41094 -9718 -26987 6855 -22128 -64637 -100488 -79893 -74362 -20163
13967b0163L1109j4982n704j3187N397M3855Q071o9518m518J391L3283k1888J125
$$ -20163 10946 -4036 -9740 -22927 -17530 26325 34396 -35122 -39640 -38249 -4966 -26854 -25729
13954b5729J9763k2596J8606j845J629K3406j0145l8093J4305k3281J1524J8650
$$ -25729 -5966 -28562 -9956 -11801 -10172 13234 3089 -35004 -20699 -43980 -32456 -13806
13942a3806l5399P641M5343j9407N641L837k5173j7847J0855j0861j4818J3893
$$ -13806 -49205 -41564 3779 -15628 -9987 -6150 -31323 -49170 -38315 -49176 -63994 -50101
13930e0101Q688l436L1201N7911L3890K1125m6547l3694k3054N643q725L8029
$$ -50101 -41413 -44849 -13648 44263 78153 99278 52731 19037 -4017 1626 -7099 30930
13918C0930j3036j0755j6262j3724J5223j1403k8530L533K2779K6876j961j2047
$$ 30930 17894 7139 -9123 -22847 -7624 -19027 -47557 -44024 -21245 5631 3670 -8377
13906h377N866j18o703K9792k0217N35m058P568L1841k790o107k2898k537l8218
$$ -8377 -2511 -2629 -9332 20460 243 778 -3280 4288 36129 33339 27232 4334 1797 -36421
13892c6421K4063L089K16j4202r047k9081K0887L2719m837R053k5215j3643L6692
$$ -36421 -12358 -9269 -9053 -23255 -32302 -61383 -40496 -7777 -12614 -3561 -28776 -42419 -5727
13879e727M901K264J2918j5343K333o500J0407j0510p137q092N6238L589m6612
$$ -5727 -826 1438 14356 -987 1346 -5154 5253 -5257 -12394 -20486 35752 39341 -7271
13866g271k3949l8329M79M5534N1776j5208o212l953k3699J4637M3939J7147m2005
$$ -7271 -31220 -69549 -69070 -23536 28240 13032 6820 2867 -20832 -6195 37744 54891 12886
13853A2886k000J6560k2789j4105l511o078L8171J3178k3238l6460k3516q142
$$ 12886 10886 27446 4657 -9448 -12959 -19037 19134 32312 9074 -27386 -50902 -59044
13841e9044L5630K5868j9081l6911m536N1882L3610l7918l3559j0723J0291Q609
$$ -59044 -23414 2454 -16627 -53538 -58074 -6192 27418 -10500 -44059 -54782 -44491 -35882
13829c5882k54Q554K0127M8008K731Q953m202q184k6468p34L1105l0m1409l2020
$$ -35882 -36136 -27582 -7455 40553 43284 52237 48035 39851 13383 12649 43754 43724 2315 -29705
13815b9705k0331K2982q138J4507M0975j1454l3451q82m162J6865j0909K7950
$$ -29705 -50036 -27054 -35192 -20685 20290 8836 -24615 -25497 -29659 -12794 -23703 4247
13803D247M022M5J534j5875k7918k5909k3612j019j2599M577j1459o707O3567
$$ 4247 8269 8314 9848 -6027 -33945 -59854 -83466 -84485 -97084 -92507 -103966 -110673 -47106
13790d7106M3144J2912l5634l672N715j0250j1264N3345J6129R847l928j4574
$$ -47106 -3962 8950 -26684 -30356 -24641 -34891 -46155 7190 23319 33166 29238 14664
13778A4664j2354J7218n7316j2112J338L465p175L2193K3071n055p295j2730J6222
$$ 14664 2310 19528 -37788 -49900 -48562 -45097 -52272 -20079 2992 -2063 -9358 -22088 -5866
13765e866j427O402O031l942m7611k9980k6511M3543L3570j729j6090P796J3743
$$ -5866 -7293 -891 5140 1198 -46413 -76393 -102904 -59361 -25791 -27520 -43610 -35814 -22071
13752b2071N0327M8185l8730k7161J8713K926l2245j1457J1519K0619j7218l1945
$$ -22071 28256 76441 37711 10550 29263 32189 -56 -11513 6 20625 3407 -28538
13740b8538j6465J994L7960R163r598P845m6541j3038K5620j5986k0533L624K8830
$$ -28538 -45003 -43009 -5049 4114 -5484 2361 -44180 -57218 -31598 -47584 -68117 -64493 -35663
13727c5663K0724K3679L148J0444j8652P989n771J335J3302o760j7712j4407R438
$$ -35663 -14939 8740 11888 22332 3680 11669 5898 7233 20535 13775 -3937 -18344 -8906
13714h906L679J6343R892k477j0858J4389J3193k0240r598k3742N379J9116m704
$$ -8906 -5227 11116 21008 18531 7673 22062 35255 15015 5417 -18325 -12946 6170 1466
13701A466J4993L1005n1381n8615M450O9043L2185m3406k1362k3230K2496O9037
$$ 1466 16459 47464 -3917 -62532 -58082 10961 43146 -260 -21622 -44852 -22356 46681
13689D6681Q08l6429k0905L2922j9500j7110K1381P144m3016L633j1868n703j36
$$ 46681 47489 11060 -9845 23077 3577 -13533 7848 14992 -28024 -24391 -36259 -41962 -42098
13676d2098r899J6848P804R422K6246J0076J3762j8332m698j9682m4393r160j1414
$$ -42098 -51997 -35149 -27345 -17923 8323 18399 32161 13829 9131 -10551 -54944 -64104 -75518
13663g5518O844N0626K0836j6195P537K9423j6430j7127k2009J5129k6296k4627
$$ -75518 -68674 -18048 2788 -13407 -5870 23553 7123 -10004 -32013 -16884 -43180 -67807
13651f7807k7769L0545N0129J9129J0900k1404j6992j3036l0207l126M7241O4217
$$ -67807 -95576 -65031 -14902 4227 15127 -6277 -23269 -36305 -66512 -69638 -22397 41820
13639D1820J7565m0989l9677P664J9051J699L3073m8625K4957K8440J337P627
$$ 41820 59385 18396 -21281 -13617 5434 7133 40206 -8419 16538 44978 46315 53942
13627E3942q267l287m0798J6607K2702m7888l1883O786M0651O3l1194j2748k1842
$$ 53942 45675 42388 1590 18197 40899 -6989 -38872 -32086 8565 8628 -22566 -35314 -57156
13614e7156J5402L0120O40l452M3207J014J4697j4730q918j6008l208J2252L554
$$ -57156 -41754 -11634 -10994 -14446 28761 29775 44472 29742 20824 4816 1608 13860 17414
13601A7414L115m0788j7328r033o940j5080M5378k5078k1106J2128N0800K2956
$$ 17414 20529 -20259 -37587 -46620 -53560 -68640 -23262 -48340 -69446 -57318 -6518 16438
13589A6438j766J8590n164m368O985j5727J3389k6978k0869K8900m8808l4154
$$ 16438 14672 33262 28098 23730 30715 14988 28377 1399 -19470 9430 -39378 -73532
13577g3532N1551J2789J5597K0651n0530j8179L5977N5100J1550j7311m4410l2768
$$ -73532 -21981 -9192 6405 27056 -23474 -41653 -5676 49424 60974 43663 -747 -33515
13565c3515K506L9621l4668n3397Q503L1763J2704l323L3031O079j1085n475P966
$$ -33515 -31009 8612 -26056 -79453 -70950 -39187 -26483 -29806 3225 9304 -1781 -7256 710
13552G10R748l3086r371m525M488n656p382J9010L8198J4085j1953q427J188Q038
$$ 710 10458 -22628 -31999 -36524 -32036 -37692 -45074 -26064 12134 26219 14266 5839 7027 15065
13538A5065j7958P826K3315q772l0160n5681n4181J9378M6908r367J1045M033
$$ 15065 -2893 4933 28248 19476 -10684 -66365 -120546 -101168 -54260 -63627 -52582 -48549
13526d8549K1895K1122K2941k7788O786K4513K0748m2523K8128K0645k7294k7979
$$ -48549 -26654 -5532 17409 -10379 -3593 20920 41668 -855 27273 47918 20624 -7355
13514g355P186j054J755L4338J0234K0205j0368m4618j4941l674J4300K8766K4665
$$ -7355 -169 -1223 532 34870 45104 65309 54941 10323 -4618 -8292 6008 34774 59439
13501E9439j9026j3345j8101k3337N1150q808j4657l901o520L987j7121l8963
$$ 59439 40413 27068 8967 -14370 36780 27972 13315 9414 2894 6881 -10240 -49203
13489d9203M770J9656L2619j0327k3962J8385r957o624l1564j1974M6578j5731
$$ -49203 -44433 -24777 7842 -2485 -26447 -8062 -18019 -24643 -56207 -68181 -21603 -37334
13477c7334j9616L0016L6217K77P552j2566j2133j1156M8305K037j3877j7227
$$ -37334 -56950 -26934 9283 9560 17112 4546 -7587 -18743 29562 31599 17722 495
13465D95q394k105P341o884j407L827J7036J0875P232m22k2837m5240j9833L2170
$$ 495 -7899 -10004 -2663 -9547 -10954 -7127 9909 20784 28016 27594 4757 -40483 -60316 -28146
13451b8146J4891j1732l180J4922K0252n280k2803j5953k025J701k542L1960K470
$$ -28146 -13255 -24987 -28167 -13245 7007 1727 -21076 -37029 -39054 -37353 -39895 -7935 -5465
13438e465m280N07K8573m095j7686J5843j962M966J0445j7695n0166m5252j2111
$$ -5465 -9745 -9238 19335 15240 -2446 13397 11435 16401 26846 9151 -41015 -86267 -98378
13425i8378J4023J8195J3365k810L6614L9839L3551l181j5780j2477j3152J847
$$ -98378 -84355 -66160 -52795 -55605 -18991 20848 54399 51218 35438 22961 9809 11656
13413A1656j6849j2167J9425M591k1350l0486K5462J0364j4045J8318k2228O010
$$ 11656 -5193 -17360 2065 6656 -14694 -45180 -19718 -9354 -23399 -5081 -27309 -21299
13401b1299r723N655q397o518n559k869K9375O649J3150J28q035m67K2893Q313
$$ -21299 -31022 -25367 -33764 -40282 -45841 -48710 -19335 -12686 464 592 -7443 -7910 14983 23296
13387B3296k2140J3691J9635J701P97l3693L8592N1202J0524k1788q754k9276
$$ 23296 1156 14847 34482 36183 36980 3287 41879 93081 103605 81817 73063 43787
13375D3787j0385J9434K7247K1926J9860k0572j5718K071k2069m2890Q915K8838
$$ 43787 33402 52836 80083 102009 121869 101297 85579 87650 65581 22691 31606 60444
13363F0444j2930l468n4245p014j1594m1451L4269O6674L594R735l6248m434J8163
$$ 60444 47514 44046 -10199 -17213 -28807 -70258 -35989 30685 34279 44014 7766 3332 21495
13350B1495m725M697J3966k7612m6837L4209L7001k0033K5738J5363n555k0435
$$ 21495 16770 21467 35433 7821 -39016 -4807 32194 12161 37899 53262 47707 27272
13338B7272j4528l3056J4867L1431L1546j7713k8473q51K5595m7382j4717P242
$$ 27272 12744 -20312 -5445 25986 57532 39819 11346 10495 36090 -11292 -26009 -18767
13326a8767j6949O3506L8071p771q6515n8538M0621O8951k3828k615K9079Q062
$$ -18767 -35716 27790 65861 58090 -28425 -86963 -46342 22609 -1219 -3834 25245 33307
13314C3307J5747J0957l5474o0278K1262L2357q035k432j642k6029N186J9706
$$ 33307 49054 60011 24537 -35741 -14479 17878 9843 7411 5769 -20260 -15074 4632
13302D632j6226p748l813R042O863J9482j0864j261K4098l2372k1537r16J8707
$$ 4632 -11594 -19342 -23155 -14113 -7250 12232 1368 107 24205 -8167 -29704 -30620 -11913
13289a1913O060J58N679n971J211j1666K7547J1664O364j5303J4708m6768n828
$$ -11913 -5853 -5695 -16 -5987 -4776 -16442 11105 22769 29133 13830 28538 -18230 -24058
13276b4058J4619J6612K7363j3518L471j2329k9072j2581j8143L485K0424J4099
$$ -24058 -9439 7173 34536 21018 24489 12160 -16912 -29493 -47636 -44151 -23727 -9628
13264i628Q221K9347j4203K2290k763k9028J854k0438o883l884O137j0307M6388
$$ -9628 -1407 27940 13737 36027 33264 4236 6090 -14348 -21231 -25115 -18978 -29285 17103
13251A7103J4141r678j1323k744Q523L3686N857j6750J8706k4728n6175n703o4
$$ 17103 31244 21566 10243 7499 16022 49708 55565 38815 57521 32793 -23382 -29085 -29149
13238b9149J3121j9807l5064P362J5661O0288J8336k2072m6882l226K0318j792
$$ -29149 -16028 -35835 -70899 -63537 -47876 12412 30748 8676 -38206 -41432 -21114 -22906
13226b2906M615j914j7509k2049M3745M8699o115j6755l774J7842R938R897k7057
$$ -22906 -18291 -20205 -37714 -59763 -16018 32681 26566 9811 6037 23879 33817 43714 16657
13213A6657M399l0126l3479K2295L0682l343j9202o860J3686J8203M0776L6257
$$ 16657 21056 -9070 -42549 -20254 10428 7085 -12117 -18977 -5291 12912 53688 89945
13201H9945M2987j4551n2494k1209K3094L0906L3195l0976j9112K913o117n768
$$ 89945 132932 118381 65887 44678 67772 98678 131873 100897 81785 84698 78581 72813
13189G2813j083p508r747P520o627J0239n657j3804M715j0536%L75n208K9760
$$ 72813 71730 64222 54475 61995 55368 65607 59950 46146 50861 40325 40325 40700 35492 65252
13175F5252R202J428L2145k8580j6509p215j6731j6433J9743l1463j6746N2896
$$ 65252 74454 75882 108027 79447 62938 55723 38992 22559 42302 10839 -5907 46989
13163D6989K0346m4056l1300K2845L2681o489p24l935n121k5103j5621J30Q890
$$ 46989 67335 23279 -8021 14824 47505 41016 40292 36357 31236 6133 -9488 -9358 -468
13150d68K7209J2940m4291k5030N908L8422R414p738j7772j9965K383r75K0577
$$ -468 26741 39681 -4610 -29640 -23732 14690 24104 16366 -1406 -21371 -18988 -19963 614
13137F14K2283J8557j0759K3200k751k6373J766r151l0860K3689J1888l0261j3627
$$ 614 22897 41454 30695 53895 51144 24771 26537 17386 -13474 10215 22103 -8158 -21785
13124b1785o714L1863p368Q111J7822J0928r949n569L1114k2515Q446J0826j82
$$ -21785 -28499 3364 -4004 4107 21929 32857 22908 17339 48453 25938 34384 45210 45028
13111D5028o115J930K4013P05l3218j9444M132K6362K8557J104R957J5621l830
$$ 45028 38913 40843 64856 65561 32343 12899 17031 43393 71950 73054 83011 98632 94802
13098I4802k7798m5704k8414k4430K07M3700J7906K1371M305k6275j6250o4N940
$$ 94802 67004 21300 -7114 -31544 -31337 12363 30269 51640 55945 29670 13420 13356 19296
13085A9296l5252k2840J400K3979j0875m2651M3513R7905m460m0352k2554k0030
$$ 19296 -15956 -38796 -37396 -13417 -24292 -66943 -23430 74475 70015 29663 7109 -12921
13073a2921K7517k098o968Q644K5366k2077j1454q642M658J3432J3293l584j8073
$$ -12921 14596 12498 5530 14174 39540 17463 6009 -2633 2025 15457 28750 25166 7093
13060G093j6797L5543p429l2449L2046L4688l793j1358k4432l2090J8591J2617
$$ 7093 -9704 25839 18410 -14039 18007 52695 48902 37544 13112 -18978 -387 12230
13048A2230L2501M0501n3485o9959o9829L410P0915L1811R171r014o57N972L6118
$$ 12230 44731 85232 31747 -38212 -108041 -104631 -33716 -1905 7266 -1748 -2405 3567 39685
13035C9685K4628J0563m8969m9149K8513K89j4436l7051J9339J7020L698N767
$$ 39685 64313 74876 25907 -23242 5271 5560 -8876 -45927 -26588 -9568 -5870 -103
13023a03J7904M1537o496K58J1520J0464l5303k2624r740L127o748o728K7473
$$ -103 17801 59338 52842 53100 64620 75084 39781 17157 7417 10544 3796 -2932 24541
13010B4541J743j7024L9061M7040r415q087k762n2774k4312L3052K1493l890m0213
$$ 24541 26284 9260 48321 95361 85946 77859 75097 22323 -1989 31063 52556 48666 8453
12997H453J32r372J0289k1599P150L8533m859k661J0080L6766P591j1752N316
$$ 8453 8585 -787 9502 -12097 -4947 33586 28727 26066 36146 72912 80503 68751 74067
12984G4067p247J5436k4217j3984J3573k031k5583l1671p985M866k1558R684L8820
$$ 74067 66820 82256 58039 44055 57628 55597 30014 -1657 -9642 -4776 -26334 -16650 22170
12971B2170p053J0465K3935K3171n5277k6433n6290J5424M3084J2034Q56M1442
$$ 22170 15117 25582 49517 72688 17411 -9022 -65312 -49888 -6804 5230 6086 47528
12959D7528N736o5315o484K6336N3023j0588n4668k2832r303J5487j8708o333
$$ 47528 53264 -12051 -18535 7801 60824 50236 -4432 -27264 -36567 -21080 -39788 -46121
12947d6121k9644J793K1969J1277O27J6347j514l8390j9843K4887R772J2471Q946
$$ -46121 -75765 -73972 -52003 -40726 -40099 -23752 -25266 -63656 -83499 -58612 -48840 -36369 -27423
12934b7423L9389N8771K1073j6221j6751k3289l8518K419p761j4206K61N1755
$$ -27423 11966 70737 91810 75589 58838 35549 -2969 -550 -8311 -22517 -22256 29499
12922B9499N63K2517N4768P848n6939k2980N206k9993j7376o917J6279J4728q150
$$ 29499 30062 52579 107347 115195 58256 35276 40482 10489 -6887 -13804 2475 17203 9053
12909I053J3313j2696J4204o228p922n2179j276M1136J1550j5911k2956O963p986
$$ 9053 22366 9670 23874 17646 9724 -42455 -43731 -2595 8955 -6956 -29912 -22949 -30935
12896c0935J0055L645J5650O611J6514J455L5964Q695r863k3817J744K4844j6593
$$ -30935 -20880 -17235 -1585 5026 21540 22995 58959 67654 57791 33974 35718 60562 43969
12883D3969m8840l6406R675J4990j3679j0685K1947q582K5118P0948J5653m0925
$$ 43969 -4871 -41277 -31602 -16612 -30291 -40976 -19029 -27611 -2493 68455 84108 43183
12871D3183l2097n618K5764K3990j1442n114j9627k7838J3039m663J0997K0681
$$ 43183 11086 5468 31232 55222 43780 38666 19039 -8799 4240 -423 10574 31255
12859C1255m6402J3522L030J4419k3430k513j992J6489o039k6455o264J4669j1523
$$ 31255 -15147 -1625 1405 15824 -7606 -10119 -12111 4378 -1661 -28116 -34380 -19711 -31234
12846c1234R895K3589K7086k7382m0998k7031J5507j0003J0365N2581K0518l235
$$ -31234 -21339 2250 29336 1954 -39044 -66075 -50568 -60571 -50206 2375 22893 19658
12834A9658r709k1003L3667m1729j9571J0377k4917M545K1044R75J5552N828m375
$$ 19658 9949 -11054 22613 -19116 -38687 -28310 -53227 -48682 -27638 -26663 -11111 -5283 -9658
12821i658J5143o603O674J2499O994k618l9283k8554k8262k2676O1378N5584J3919
$$ -9658 5485 -1118 5556 18055 25049 22431 -16852 -45406 -73668 -96344 -34966 20618 34537
12808C4537j6646o2168j9084K4466j4395r455M1578j5674k047K6361J0247j1604
$$ 34537 17891 -44277 -63361 -38895 -53290 -62745 -21167 -36841 -38888 -12527 -2280 -13884
12796a3884l028J6738p204l1017J5710R284J6808K1907j4854l9656l6446j629
$$ -13884 -16912 -174 -7378 -38395 -22685 -13401 3407 25314 10460 -29196 -65642 -67271
12784f7271N4048L8138L2142R955l5062j2091j5395j2829j7565P008N103L69M6593
$$ -67271 -13223 24915 57057 67012 31950 19859 4464 -8365 -25930 -18922 -13819 -13450 33143
12771C3143J3225m5047q985j7089J0801O171Q495J2881j7833m691J4365L3934
$$ 33143 46368 1321 -7664 -24753 -13952 -7781 714 13595 -4238 -8929 5436 39370
12759C9370J6243k4559l0717Q627l548K04L1550q693K3389K4575k5472j8588O932
$$ 39370 55613 31054 337 8964 5416 5620 37170 28477 51866 76441 50969 32381 39313
12746C9313M050l200J0288j0620r813K7878J8633K5881n7239j8307n0167L459
$$ 39313 43363 40163 50451 39831 30018 57896 76529 102410 45171 26864 -23303 -19844
12734a9844J6854k2513k0746o821M2225N0332L5617l1106j2090j5887j1516k2896
$$ -19844 -2990 -25503 -46249 -53070 -10845 39487 75104 43998 31908 16021 4505 -18391
12722a8391L955k5100Q896o754J9720Q462J6670L9469l9981l8971p61K3001J1707
$$ -18391 -14436 -39536 -30640 -37394 -17674 -9212 7458 46927 6946 -32025 -32786 -9785 1922
12709A922J5984K1708j5482J1183j0956j9049R714q876n2218k3999K7533K9806
$$ 1922 17906 39614 24132 35315 24359 5310 15024 6148 -46070 -70069 -42536 -12730
12697a2730L056p887N356J6505K6922k1561K6535J5180m8313o5800K0618n57n525
$$ -12730 -9674 -17561 -12205 4300 31222 9661 36196 51376 3063 -62737 -42119 -42676 -48201
12684d8201M501j1140r985L3508j4402J6898M7979K96n640j3626k8068j3406J3975
$$ -48201 -43700 -54840 -64825 -31317 -45719 -28821 19158 19454 13814 188 -27880 -41286 -27311
12671b7311M4398k3358k6827P962J3399K7421Q432j2987o8j2806j1181l0303j7546
$$ -27311 17087 -6271 -33098 -25136 -11737 15684 24116 11129 11061 -1745 -12926 -43229 -60775
12658f0775N4187N5544K191k8010R425j2447l9272j6946L2577j4160k45k6411
$$ -60775 -6588 48956 51147 23137 32562 20115 -19157 -36103 -3526 -17686 -17931 -44342
12646d4342M4388K0535L3508k5797l7919J3781K1983m977J2267j2227J0283J4379
$$ -44342 46 20581 54089 28292 -9627 4154 26137 21160 33427 21200 31483 45862
12634D5862J4522l8611L268k1587J3661j0356m2822r877J4922L3637L929r483
$$ 45862 60384 21773 25041 3454 17115 6759 -36063 -45940 -31018 2619 6548 -2935
12622b935q755m248N837m987k6940K0915K7746j2101l7117k8459k9027K0725K4955
$$ -2935 -11690 -15938 -10101 -15088 -42028 -21113 6633 -5468 -42585 -71044 -100071 -79346 -54391
12609e4391Q622M2537M0003n7957k5648J7823j926J8765L1067r682k0276J8453
$$ -54391 -45769 -3232 36771 -21186 -46834 -29011 -30937 -12172 18895 9213 -11063 7390
12597G390O392n557J9001j0954n732L942N92j9238K3789o764o486O87l4294n783
$$ 7390 13782 8225 27226 16272 10540 14482 15074 -4164 19625 12861 6375 7062 -27232 -33015
12583c3015P646J3134J181J8809j5851k2947k0219R898J7323K7250J4207j1737
$$ -33015 -25369 -12235 -11054 7755 -8096 -31043 -51262 -41364 -24041 3209 17416 5679
12571E679J0858j2682k8152O220K0313K0955Q067m0526l9792L9306j0189l0619
$$ 5679 16537 3855 -24297 -18077 2236 23191 31258 -9268 -49060 -9754 -19943 -50562
12559e0562N723J3907k3430J3548k7318k8630O5969N3207q185j4554m0891j0152
$$ -50562 -44839 -30932 -54362 -40814 -68132 -96762 -30793 22414 14229 -325 -41216 -51368
12547e1368J7944J7420M8495L3808J2271l7680m7861K042L4501j3223j7156j8723
$$ -51368 -33424 -16004 32491 66299 78570 40890 -6971 -4929 29572 16349 -807 -19530
12535a9530M7965L0417l1570K017M801o45l0859K1004j0249k7421J2025R203j5111
$$ -19530 28435 58852 27282 29299 34100 33455 2596 23600 13351 -14070 -2045 7158 -7953
12522g953O18R282J4929k5064m8694K1944L9188K3079m0274O408M1464r806Q146
$$ -7953 -7335 1947 16876 -8188 -56882 -34938 4250 27329 -12945 -6537 34927 25121 33267
12509C3267K2002m5789m8368j3616K3948j2658R017L4435M4853p37k6873J3208
$$ 33267 55269 9480 -38888 -52504 -28556 -41214 -32197 2238 47091 46354 19481 32689
12497C2689K0137j1472r46j3764K49P297J4003j699l2794k0899J0292J2749N562
$$ 32689 52826 41354 40408 26644 26893 34190 48193 46494 13700 -7199 3093 15842 21404
12484B1404j7604J3042K3128j9433l0254j053j5690K9637L7984P087n3533M805
$$ 21404 3800 16842 39970 20537 -9717 -10770 -26460 3177 41161 48248 -5285 -480
12472d80m661k1105K712Q928j9460L219k5286J710L0416j5209J5917M8783k731
$$ -480 -5141 -26246 -23534 -14606 -34066 -30847 -56133 -54423 -24007 -39216 -23299 25484 22753
12459B2753q066k2615J3032n998m1114k0704K7212Q957N1530m287n912j1285l5703
$$ 22753 14687 -7928 5104 -894 -42008 -62712 -35500 -26543 24987 20700 14788 3503 -32200
12446c2200j7045J2232K5700K2006l371r76K4589o371M266j6407l8956r396K8271
$$ -32200 -49245 -37013 -11313 10693 7322 6346 30935 24564 28830 12423 -26533 -35929 -7658
12433g658K9204l2023n372L3793j3560j8715L3294K2176m649n1876l6939J8996
$$ -7658 21546 -10477 -15849 17944 4384 -14331 18963 41139 36490 -15386 -52325 -33329
12421c3329p187K1017o309J6807M1364j8923m9982J471L5367j798k6092m3614
$$ -33329 -40516 -19499 -25808 -9001 32363 13440 -36542 -35071 296 -1502 -27594 -71208
12409g1208R623O874j971M2418L9109r549o023j46K3177J4274L524o0095m3286
$$ -71208 -61585 -54711 -56682 -14264 24845 15296 9273 9127 32304 46578 50102 -9993 -53279
12396e3279k9909J8629M0329L1294M710r112j4912K1251j6410l0446l4521J3357
$$ -53279 -83188 -64559 -24230 7064 11774 2662 -12250 9001 -7409 -37855 -72376 -59019
12384e9019M9410q891o504K3937K1023m754k1883K0801o695Q196K1850J0963k4675
$$ -59019 -9609 -18500 -25004 -1067 19956 15202 -6681 14120 7425 15621 37471 48434 23759
12371B3759m1198J0076Q679r617j4742k0705K0150j2000j6578K6549m589J5520
$$ 23759 -17439 -7363 1316 -8301 -23043 -43748 -23598 -35598 -52176 -25627 -30216 -14696
12359a4696J5201l293j2137q594j0465K8026l318K7105K6318j1112m0865j9655
$$ -14696 505 -2788 -14925 -23519 -33984 -5958 -9276 17829 44147 33035 -7830 -27485
12347b7485k5270j708K0310j852R107K3540j4300Q093K0216m1262k7399N6525
$$ -27485 -52755 -54463 -34153 -36005 -26898 -3358 -17658 -9565 10651 -30611 -58010 -1485
12335a485M4532k7968j8455j0546q999j0406J8796K0152k3873n6341K7459J4891
$$ -1485 43047 15079 -3376 -13922 -22921 -33327 -14531 5621 -18252 -74593 -47134 -32243
12323c2243r326J9891j0946J3966K95P326K1175J5616K6221Q00l4357J4470k4774
$$ -32243 -41569 -21678 -32624 -18658 -18363 -11037 10138 25754 51975 52775 18418 32888 8114
12310H114J4160l456Q795j3348p416J7221k145l3297p024J38J2899O799L296J2983
$$ 8114 22274 18818 27613 14265 6849 24070 21925 -11372 -18396 -18258 -5359 1440 4736 17719
12296A7719o0194k6191j1448L0322J2598M5492M099n016k4399j9296N398q455
$$ 17719 -42475 -68666 -80114 -49792 -37194 8298 12397 7381 -17018 -36314 -30916 -39371
12284c9371j6678J3593P219K0149O121J3024J8535L1933L7794j7710n1398l1739
$$ -39371 -56049 -42456 -35237 -15088 -8967 4057 22592 54525 92319 74609 23211 -8528
12272h528M2153J5047m5751j2313L8051K1650k24J520L299j2797L523M8505j6701
$$ -8528 33625 48672 2921 -9392 28659 50309 50085 51605 54904 42107 45630 94135 77434
12259G7434q6964n4229M658o472J3436O4362R049l3368p429K800K0409K5565k4106
$$ 77434 -9530 -63759 -59101 -65573 -52137 12225 21274 -12094 -19523 -16723 3686 29251 5145
12246E145o6765n751K2202N3130J1818Q41k2509k5833L4682K4477k3455k0337
$$ 5145 -61620 -67371 -45169 7961 19779 20620 -1889 -27722 6960 31437 7982 -12355
12234a2355j4947J8912R143n0033J6150N7701M8639k7927l6529J516P589j3889
$$ -12355 -27302 -8390 753 -49280 -33130 24571 73210 45283 8754 10270 17859 3970
12222C970k3775N818p687r802m967L1402l5305j8335q431k3630j9889K5111J5726
$$ 3970 -19805 -13987 -21674 -31476 -36443 -5041 -40346 -58681 -67112 -90742 -110631 -85520 -69794
12209f9794N0376p901P765M5628J3275k7309k5177M704k2956j4575K3845J28j3042
$$ -69794 -19418 -27319 -19554 26074 39349 12040 -13137 -8433 -31389 -45964 -22119 -21991 -35033
12196c5033K5131L5648L7739k207j4598l8444K2718J0525q73k6618k3607M2378
$$ -35033 -9902 25746 63485 61278 46680 8236 30954 41479 40606 13988 -9619 32759
12184C2759o24J8822l233m585o076r80J3647L3569R635r520m4769l9512J0451
$$ 32759 32135 50957 47724 43139 37063 36083 49730 83299 92934 83414 38645 -867 9584
12171I584K5601K1144l9902p745K2760J3711L2818l0574l4787M556p258l7960
$$ 9584 35185 56329 16427 8682 31442 45153 77971 47397 12610 17166 9908 -28052
12159b8052k2390n606J6812M0563M370q086L0298L4709j9269q7042j5598k4193
$$ -28052 -50442 -56048 -39236 1327 5697 -2389 27909 62618 43349 -43693 -59291 -83484
12147h3484J51J6429K1463j2133P238n792L542K7431L3892J2797j3471m242J4529
$$ -83484 -83333 -66904 -45441 -57574 -50336 -56128 -52586 -25155 8737 21534 8063 3821 18350
12134A8350N68J958k8412j8414j13j517k9709j2372J1139K5374K2187k5678k9784
$$ 18350 18918 20876 -7536 -25950 -26063 -27580 -57289 -69661 -58522 -33148 -10961 -36639 -66423
12121f6423M938J9977k570K1686K2382k3844m1806L6005M5117K7146J4003j4795
$$ -66423 -61485 -41508 -44078 -22392 -10 -23854 -65660 -29655 15462 42608 56611 41816
12109D1816l7789k3157R801P11j3181l697P725K6689J1470o91K2771N977J0947
$$ 41816 4027 -19130 -9329 -8618 -21799 -25496 -17771 8918 20388 19697 42468 48445 59392
12096E9392q253n3839j0509J0693L4865M656J0147K8489k2173m1140l876P532
$$ 59392 51139 -2700 -13209 -2516 32349 37005 47152 75641 53468 12328 8452 15984
12084A5984j6742j0288k025k1549o991j9626j2417J695O309p764K0508N0616K0052
$$ 15984 -758 -11046 -13071 -34620 -41611 -61237 -73654 -71959 -65650 -73414 -52906 -2290 17762
12071A7762J2269j3248k043k8898l9687L1914J4247O593K2866K1819j094o542
$$ 17762 30031 16783 14740 -14158 -53845 -21931 -7684 -1091 21775 43594 42500 35958
12059C5958O429K07o547m6304n9710m884P452M2505K7178J6679J4186j4302k5266
$$ 35958 42387 42594 36047 -10257 -69967 -74851 -67399 -24894 2284 18963 33149 18847 -6419
12046f419j6311j4040j5159K7679N3365q102j2679J1288K815j4121k0608k8087
$$ -6419 -22730 -36770 -51929 -24250 29115 21013 8334 19622 22437 8316 -12292 -40379
12034d0379l6446L2229N2826J724k8679j2123J4131p097j3197k3378j9343J6455
$$ -40379 -76825 -44596 8230 9954 -18725 -30848 -16717 -23814 -37011 -60389 -79732 -63277
12022f3277L7978N749q347j0396K1512M9815j6184k7942m3807j0569j0277J9407
$$ -63277 -25299 -19550 -27897 -38293 -16781 33034 16850 -11092 -54899 -65468 -75745 -56338
12010e6338K2360l1430L4020j9606j0449K4846M477O5090M638L948m770m7633
$$ -56338 -33978 -65408 -31388 -50994 -61443 -36597 -32120 32970 37608 41556 36786 -10847
11998a0847J3166K5926N911j4272l0313J8372L1044k8850m1843j2417K673J7400
$$ -10847 2319 28245 34156 19884 -10429 7943 38987 10137 -31706 -44123 -41450 -24050
11986b4050J5352J1178r164J2915j8449j5955K8178o534K0579K8026k2150l4751
$$ -24050 -8698 2480 -6684 6231 -12218 -28173 5 -6529 14050 42076 19926 -14825
11974a4825k440l5218l546O1365K4912m6429k4760j2140L2470k3525k6752N086
$$ -14825 -17265 -52483 -56029 5336 30248 -16181 -40941 -53081 -20611 -44136 -70888 -65802
11962f5802k7178k6218J6836L5222K5936L8748K8918n490l9034o680k8782K2593
$$ -65802 -92980 -119198 -102362 -67140 -41204 -2456 26462 20972 -18062 -24742 -53524 -30931
11950c0931J5885J4798Q067K0642k0229m3276J8561J5062O575q263K6697K9860
$$ -30931 -15046 -248 7819 28461 8232 -35044 -16483 -1421 5154 -3109 23588 53448
11938E3448l794m5931q875Q229R080J3217k8240m7094M625J0667k3553k485J8936
$$ 53448 49654 3723 -5152 3077 12157 25374 -2866 -49960 -45335 -34668 -58221 -60706 -41770
11925d1770J8194J5329k3603n143n256K5937L8470o449j1058P732J8998M8097
$$ -41770 -23576 -8247 -31850 -36993 -42249 -16312 22158 15709 4651 12383 31381 79478
11913G9478J8862j1727k8347j0377k8918k3705J8430j7391R140p960J7919K4392
$$ 79478 98340 86613 58266 47889 18971 -4734 13696 -3695 5445 -2515 15404 39796
11901C9796j3643m886n238j83j8949j4890R562M798J6953j4092k2452m604k7288
$$ 39796 26153 21267 16029 15846 -3103 -17993 -8431 -3633 13320 -772 -23224 -27828 -55116
11888e5116K9492J7439k3317N769N98k00L8287J8990K0815l0873l5972j0028L362
$$ -55116 -25624 -8185 -31502 -25733 -25135 -25335 12952 31942 52757 21884 -14088 -24116 -20754
11875b0754K2301J5563j6923k2983k8492l6163M3526L5860j754l5712j4636P2724
$$ -20754 1547 17110 187 -22796 -51288 -87451 -43925 -8065 -9819 -45531 -60167 12557
11863A2557L1809k8419q218l9557n8919Q452l334k4358K0657K2680N2455j3596
$$ 12557 44366 15947 7729 -31828 -90747 -82295 -85629 -109987 -89330 -66650 -14195 -27791
11851b7791j8939L0561K6321N876L118k307n199n162k2163j3462R367j0151M590
$$ -27791 -46730 -16169 10152 16028 19146 16839 11640 6478 -15685 -29147 -19780 -29931 -25341
11838b5341J9743J3615Q173K146K297L69J951k7715l1351j8519K4239J578J806
$$ -25341 -5598 8017 16190 18336 20633 21002 22953 -4762 -36113 -54632 -30393 -28815 -27009
11825b7009J4743P521M3584O089k4631m5471k4939K0288L760m0410J0937P77N0181
$$ -27009 -12266 -4745 38839 44928 20297 -25174 -50113 -29825 -26065 -66475 -55538 -54761 -4580
11812d580J8684k8265J376K6194K546k1935n615K3131J9843r172o739p854j2415
$$ -4580 14104 -14161 -12785 13409 15955 -5980 -11595 11536 31379 22207 15468 7614 -4801
11799d801L4754l9927m0678q972O293L3124M4760j2216m3520j8394J4580Q899
$$ -4801 29953 -9974 -50652 -59624 -53331 -20207 24553 12337 -31183 -49577 -34997 -26098
11787b6098l442L827J1360Q822M734j3665O601M7906j1382K1562K7411k9796m1653
$$ -26098 -29540 -25713 -14353 -5531 -797 -14462 -7861 40045 28663 50225 77636 47840 6187
11774F187J8682L3020l3545j2245O148P361q320l5074k4523l1713j2913M8540
$$ 6187 24869 57889 24344 12099 18247 25608 17288 -17786 -42309 -74022 -86935 -38395
11762c8395O8934m914l659j4851j1520o678J985k0291J9039j5718j1725K8409
$$ -38395 30539 25625 21966 7115 -4405 -11083 -9098 -29389 -10350 -26068 -37793 -9384
11750i384L3145k1022k2066n565J1868k5743K0891K6392o370j841k2392p904N487
$$ -9384 23761 2739 -19327 -24892 -13024 -38767 -17876 8516 2146 305 -22087 -29991 -24504
11737b4504L6880l361l0027j634J9938O532k0652k6622L5001M8214j0936M128
$$ -24504 12376 9015 -21012 -22646 -2708 3824 -16828 -43450 -8449 39765 28829 32957
11725C2957J5727J7752Q691n349n897K2552o335n372l9150l5018p077O741p878
$$ 32957 48684 66436 75127 69778 63881 86433 80098 74726 35576 558 -6519 222 -7656
11712g656j9012J5276K5179m6814o0014K5449K5319N4831K7402J4653K4051J7473
$$ -7656 -26668 -11392 13787 -33027 -93041 -67592 -42273 12558 39960 54613 78664 96137
11700I6137j6670Q165o238n0078J8494k6192j511k2485l4651J8060N9854L8355
$$ 96137 79467 87632 81394 31316 49810 23618 22107 -378 -35029 -16969 42885 81240
11688H1240j9015l2217m2922k2865J7491R259r888J325L8770K2551l1369J5282
$$ 81240 62225 30008 -12914 -35779 -18288 -9029 -18917 -17592 21178 43729 12360 27642
11676B7642K3577q945k8521m845M934L8009Q160k1553m1091k7100k702j6302k0310
$$ 27642 51219 42274 13753 8908 13842 51851 60011 38458 -2633 -29733 -32435 -48737 -69047
11663f9047K9088P1827q30j4197m5083n148J6558o84j8120K2367J4399J6084J8912
$$ -69047 -39959 31868 31038 16841 -28242 -33390 -16832 -17516 -35636 -13269 1130 17214 36126
11650C6126J9374j0498j8824n147L5697J4037k1032j6570m067r097n493K4624
$$ 36126 55500 45002 26178 21031 56728 70765 49733 33163 29096 19999 14506 39130
11638C9130K4724n9334o7440l5340M7392Q791K3472K8237m227k8127K000N475
$$ 39130 63854 4520 -62920 -98260 -50868 -42077 -18605 9632 5405 -22722 -20722 -15247
11626a5247K9399k671l4804j5666q70J5551j9820q681L5346M1545J7877J4352
$$ -15247 14152 11481 -23323 -38989 -39859 -24308 -44128 -52809 -17463 24082 41959 56311
11614E6311n372k5481O680j682r513j3677J5712j1731j5596K2459M8025l3422
$$ 56311 50939 25458 32138 30456 20943 7266 22978 11247 -4349 18110 66135 32713
11602C2713J4546M1942l5603k8820k0402J9493k4387J2906l760L93P672m011K4892
$$ 32713 47259 89201 53598 24778 4376 23869 -518 12388 8628 9021 16693 12682 37574
11589C7574J2024j1572n6164l5357R061J2542J7489r535m0676R225K3590P745
$$ 37574 49598 38026 -18138 -53495 -44434 -31892 -14403 -23938 -64614 -55389 -31799 -24054
11577b4054P179K1500k679j4742M992Q670L3405k9244n9471k0515J1167k606L4115
$$ -24054 -16875 4625 1946 -12796 -7804 866 34271 5027 -54444 -74959 -63792 -66398 -32283
11564c2283r552L417L7185j230j6415n329j0307K5353O5029M4115k6068j3371
$$ -32283 -41835 -38418 -1233 -2463 -18878 -24207 -34514 -9161 55868 99983 73915 60544
11552F0544l7590l1466q450j469p382J0069J0524J0238m1661O016n103J2035l6324
$$ 60544 22954 -8512 -16962 -18431 -25813 -15744 -5220 5018 -36643 -30627 -35730 -23695 -60019
11539f0019k158M6762K2189n290K2792o4909n5800J1963J8549L418K629Q998L9465
$$ -60019 -62177 -15415 6774 1484 24276 -40633 -96433 -84470 -65921 -62503 -59874 -50876 -11411
11526a1411J4820k1206k7189j8780j1287k786J8428q019J8216N9506K3177J474
$$ -11411 3409 -17797 -44986 -63766 -75053 -77839 -59411 -67430 -49214 10292 33469 34943
11514C4943j1141l0705m6647j1240J652K0073J6985o617l9277K8821J9217j1423
$$ 34943 23802 -6903 -53550 -64790 -63138 -43065 -26080 -32697 -71974 -43153 -23936 -35359
11502c5359J2149K7201k0025m0447o387p558M184N1770K4819k5136k1513Q085
$$ -35359 -23210 3991 -16034 -56481 -62868 -70426 -66242 -14472 10347 -14789 -36302 -28217
11490b8217K7258J4579l1966J1821K1077J8473l013j9897K314k403j3362K6372
$$ -28217 -959 13620 -18346 -6525 14552 33025 30012 10115 12429 10026 -3336 23036
11478B3036M4497J6255L875l8929n235l6289m1145m4046K9045J6235M540M592
$$ 23036 67533 83788 87663 48734 43499 7210 -33935 -77981 -48936 -32701 -28161 -23569
11466b3569q74l8969n618j2199O823J6836n504J8936J7713L2384L1373R012r199
$$ -23569 -24443 -63412 -69030 -81229 -74406 -57570 -63074 -44138 -26425 5959 37332 46344 37145
11453C7145m956K4338j1891n183K5458j0007J572m0915j9456J9929M293J5443
$$ 37145 32189 56527 44636 39453 64911 54904 56476 15561 -3895 16034 20327 35770
11441C5770P86l2321j5559o113K7001k7282P556l24k2149K083k8891K3887K5633
$$ 35770 36556 4235 -11324 -17437 9564 -17718 -10162 -10486 -32635 -30552 -59443 -35556 -9923
11428i923j932P838K294j9869j9678O237J9218L673K979L17L4712J274m71L4232
$$ -9923 -11855 -4017 -1723 -21592 -41270 -35033 -15815 -12142 -9163 -8846 25866 27140 26669 60901
11414F0901J742l075m6261l0654Q948j4068N204L1141J2000J6475k3791j4426
$$ 60901 62643 59568 13307 -17347 -8399 -22467 -17263 13878 25878 42353 18562 4136
11402D136j5470k805j7470k1323J3415M1991K0247l199m410j6480r227r379n3337
$$ 4136 -11334 -14139 -31609 -52932 -39517 2474 22721 19522 15112 -1368 -10595 -19974 -73311
11389g3311m4529L8900M3112K2485K6359K8858O447P709k5792j2808k95k0701
$$ -73311 -117840 -78940 -35828 -13343 13016 41874 48321 56030 30238 17430 17135 -3566
11377c566L6688J8724j29m1082l5288k0299K594j0070K108j7531M1965L4954M1705
$$ -3566 33122 51846 51717 10635 -24653 -44952 -42358 -52428 -50320 -67851 -25886 9068 50773
11364E0773n258n182o596N860J0617n1676k1576r82Q311K7688J0261k7216k4426
$$ 50773 45515 40333 33737 39597 50214 -1462 -23038 -24020 -15709 11979 22240 -4976 -29402
11351b9402k3197K879L7564M940k4243Q119M4571O342j0713l5536k1707K0845
$$ -29402 -52599 -49720 -12156 -7216 -31459 -23340 21231 27573 16860 -18676 -40383 -19538
11339a9538K1847r027q280l8981j6704J8404M6947K2771j0406O046O486J9917
$$ -19538 2309 -6718 -14998 -53979 -70683 -52279 -5332 17439 7033 13079 19565 39482
11327C9482j4864l5456l8928j241M1750k1356J6695k9839j6240L2657J1898j2360
$$ 39482 24618 -10838 -49766 -51007 -9257 -30613 -13918 -43757 -59997 -27340 -15442 -27802
11315b7802m8429K0917Q187L8350j9611J0603L4281k6785J5034N664l1355J347
$$ -27802 -76231 -55314 -47127 -8777 -28388 -17785 16496 -10289 4745 10409 -20946 -19599
11303a9599K4656K4690J1976J1215m3819k5285M660J4605p864j3991k839j9173
$$ -19599 5057 29747 41723 52938 9119 -16166 -11506 3099 -4765 -18756 -21595 -40768
11291d0768q847K2450L6107K2589L182N237m965j6083j8839k6900l4253j988J1366
$$ -40768 -49615 -27165 8942 31531 34713 39950 34985 18902 63 -26837 -61090 -63078 -51712
11278e1712j6499p715L7013J0850k2682l4525m925O2486J2040O555k0030J002
$$ -51712 -68211 -75926 -38913 -28063 -50745 -85270 -90195 -27709 -15669 -9114 -29144 -28142
11266b8142J259l416l1089K8296p318M1309l324o135k5621j7841Q081K2409J6041
$$ -28142 -26883 -30299 -61388 -33092 -40410 899 -2425 -8560 -34181 -52022 -43941 -21532 -5491
11253e491J0625o589j293J082k132K8018n545j7108J0370M1430J7803k2394O565
$$ -5491 5134 -1455 -2748 -1666 -3798 24220 18675 1567 11937 53367 71170 48776 55341
11240E5341n822j2666p3061K837J9722M0062J7136L4316k539l4290m0845j9353
$$ 55341 49519 36853 -36208 -33371 -13649 26413 43549 77865 75326 41036 191 -19162
11228a9162O428l2444k4802m431P431K844L0756J1232J7288p388l1710j4207K7505
$$ -19162 -12734 -45178 -69980 -74411 -66980 -64136 -33380 -22148 -4860 -12248 -43958 -58165 -30660
11215c0660N8412K8820l270j0399J7729j6079l2386n745Q554l2612j6846J4265
$$ -30660 27752 56572 53302 42903 60632 44553 12167 6422 14976 -17636 -34482 -20217
11203b0217Q847l946J3856j9628j3599L344J9413j1366J0595K1759J4573l3405
$$ -20217 -11370 -15316 -1460 -21088 -34687 -31343 -11930 -23296 -12701 9058 23631 -9774
11191i774j0736O876j7896q758p261n428R293K4642M3738j1257j8650J1670o7088
$$ -9774 -20510 -13634 -31530 -40288 -47549 -52977 -43684 -19042 24696 13439 -5211 6459 -60629
11178f0629k1664K3989J4763K1873L687J3530m08l1557K7320M4170J8878J5645
$$ -60629 -82293 -58304 -43541 -21668 -17981 -4451 -4859 -36416 -9096 35074 53952 69597
11166F9597p035L2058J394k9089j8860J2660k2374m9164j2158J7220N472K0594
$$ 69597 62562 94620 96014 66925 48065 60725 38351 -10813 -22971 -5751 -279 20315
11154B0315J4293L289q334j7407M1581J6720k6055k6191p672K7489J749J3106
$$ 20315 34608 37897 29563 12156 53737 70457 44402 18211 10539 38028 39777 52883
11142E2883p348j6250j2409J2718J5353k0689j74N698o676M284P193P501o527
$$ 52883 45535 29285 16876 29594 44947 24258 24084 29782 23106 27390 34583 42084 35557
11129C5557J0423Q167J9241J4858O120J197j6901J2350M6738p629l4824k6581
$$ 35557 45980 54147 73388 88246 94366 95563 78662 91012 137750 130121 95297 68716
11117F8716m1161r695P045k3428k1218P395j3914K6374O252l5058P01j651n302
$$ 68716 27555 17860 24905 1477 -19741 -12346 -26260 114 6366 -28692 -27991 -29642 -34944
11104c4944Q504j0277M281K9117J4246r877l8630J4462Q830K6352L6143J0988
$$ -34944 -26440 -36717 -32436 -3319 10927 1050 -37580 -23118 -14288 12064 48207 59195
11092E9195J2746j9396L1274r095j4148k8507J2180j5230j1820J4785K6610o862
$$ 59195 71941 52545 83819 74724 60576 32069 44249 29019 17199 31984 58594 51732
11080E1732j7207J1227J3060L155J5989J5089L2174M5129R5655J26072J68939
$$ 51732 34525 45752 58812 61967 77956 93045 125219 170348 266003 392075 561014
11069E61014K12036K72700L09113L10265K63227K07262J59203M3760r6175k98588
$$ 561014 773050 1045750 1354863 1665128 1928355 2135617 2294820 2338580 2242405 1943817
11059A943817m37093l88795k84591k02030j24489o8308n2053o1757n3137j4916
$$ 1943817 1506724 1117929 833338 631308 506819 438511 386458 324701 271564 256648
11049B56648r188k889m7966m1900R608L047N158Q02o587j68j0536o2249l9418
$$ 256648 247460 244571 196605 154705 164313 167360 172518 173320 166733 166565 156029 93780 54362
11036E4362K3003L6081R527p973N483m3662m390J0846R177J180J7965k423l458
$$ 54362 77365 113446 122973 115000 120483 76821 72431 83277 92454 93634 111599 109176 105718
11023A05718l8531k2804j7979n253P763L1330Q745L117j1302m5991j05j1553k9123
$$ 105718 67187 44383 26404 21151 28914 60244 68989 72106 60804 14813 14708 3155 -25968
11010b5968J690J5261J6918L3876K6077j4370l0523r678j9718r043k0832j6844
$$ -25968 -24278 -9017 7901 41777 67854 53484 22961 13283 -6435 -15478 -36310 -53154
10998e3154K6961L2639N236r679J913j5160q477K5795J7605M2815J0794j4977
$$ -53154 -26193 6446 11682 2003 3916 -11244 -19721 6074 23679 66494 77288 62311
10986F2311M970k1132p2153n2983K3688K5998j639L1901J9335k5149k8113J0328
$$ 62311 67281 46149 -26004 -78987 -55299 -29301 -30940 961 20296 -4853 -32966 -22638
10974b2638K1279m354K124R080K7423K0141k4724l5325k6670k230j7075o39j5889
$$ -22638 -1359 -5713 -3589 5491 32914 53055 28331 -6994 -33664 -35894 -52969 -53608 -69497
10961f9497p039K7994O6153K627j7390L818k4565k6626L0028K2282J033r300J424
$$ -69497 -76536 -48542 17611 20238 2848 6666 -17899 -44525 -14497 7785 8818 -482 942
10948I42j2796k7758k6430J057J6847K229J8201Q113k559k6424j0294j8063J5257
$$ 942 -11854 -39612 -66042 -64985 -48138 -45909 -27708 -19595 -22154 -48578 -58872 -76935 -61678
10935f1678R485l654J223J0244L7821N6310O083l7537j6190K7799J5331L0359
$$ -61678 -52193 -55847 -54624 -44380 -6559 49751 55834 18297 2107 29906 45237 75596
10923G5596l5730k2250N1651j2793n3101m3003j1254N1887J6193K997L6995K4993
$$ 75596 39866 17616 69267 56474 3373 -39630 -50884 1003 17196 20193 57188 82181
10911H2181J1369k7338l7523J6746m6391m3908n218J0083K1959R374L2131K0751
$$ 82181 93550 66212 28689 45435 -956 -44864 -50082 -39999 -18040 -8666 23465 44216
10899D4216l7235O094j7316l3707l222J472K3853J5419J429K4730L2214l8916
$$ 44216 6981 13075 -4241 -37948 -41170 -39698 -15845 -426 1003 25733 57947 19031
10887A9031l263L3140j0480q208O908J426J2201k8550m1905R093J9367p936J4602
$$ 19031 15768 48908 38428 30220 37128 38554 50755 22205 -19700 -10607 8760 824 15426
10874A5426j5707k7472p020j697K1265k8708k6645O508k744j395k453M623K124
$$ 15426 -281 -27753 -34773 -36470 -15205 -43913 -70558 -64050 -66794 -68189 -70642 -66019 -63895
10861f3895J1777N6173Q0850J4583n7952o916j818j4298j9328k1004K762j8307
$$ -63895 -52118 4055 84905 99488 41536 34620 32802 18504 -824 -21828 -19066 -37373
10849c7373J06N142J719J1136K8384k2747m5984K4580K9028L209P671k2424O350
$$ -37373 -37267 -32125 -30406 -19270 9114 -13633 -59617 -35037 -6009 -2800 4871 -17553 -11203
10836a1203q318r115k0076k9508r098K4995M7715Q308m19K000K2024J2501j1894
$$ -11203 -19521 -28636 -48712 -78220 -87318 -62323 -14608 -6300 -6719 -4719 17305 29806 17912
10823A7912J239n0274k964M4066J0900n2715Q674M409r499J5040J1866J8203k5522
$$ 17912 19151 -31123 -34087 9979 20879 -31836 -23162 -18753 -28252 -13212 -1346 16857 -8665
10810h665j0803M8443l0578n7267J7422K4173O353l2673K8238M9502q057l4126
$$ -8665 -19468 28975 -1603 -58870 -41448 -17275 -10922 -43595 -15357 34145 26088 -8038
10798h038J9703J7058k6811k4255K5023j5640l713m2531L171O056k1969J8001
$$ -8038 11665 28723 1912 -22343 2680 -12960 -16673 -59204 -56033 -49977 -71946 -53945
10786e3945M4275P059K3623k354j8110k141k3066o127J3278J0111J626J7832l765
$$ -53945 -9670 -2611 21012 18658 548 -1593 -24659 -30786 -17508 -7397 -5771 12061 8296
10773H296j5023j5958l446K8923L4006K823j3638j23l696K5687j769l1294M170
$$ 8296 -6727 -22685 -26131 2792 36798 39621 25983 25860 22164 47851 46082 14788 18958
10760A8958K1042M1025M1160K8187R037M8241J6437Q211j4031p6954q6696n8583
$$ 18958 40000 81025 122185 150372 159409 207650 224087 232298 218267 141313 54617 -3966
10748c966O6020N2080l7841m0850l3331k146M6171Q744m9217k3975R057J2046
$$ -3966 62054 114134 76293 35443 2112 -34 46137 54881 5664 -18311 -9254 2792
10736B792O806n641j6985k2466J946O875K6831K3969J7468m506l6447k3045Q536
$$ 2792 9598 3957 -13028 -35494 -33548 -26673 158 24127 41595 37089 642 -22403 -13867
10723a3867M9489K5858m592N796k0850l8011M336j6650j9429L1429J4572L308
$$ -13867 35622 61480 56888 62684 41834 3823 8159 -8491 -27920 3509 18081 21389
10711B1389M420L2151m3389J8307L5821N523j0698k1361j1779j9311k3849m2684
$$ 21389 25809 57960 14571 32878 68699 74222 63524 42163 30384 11073 -12776 -55460
10699e5460m440L1722j321k5016r742J8248M9762N9456K7107m4942R065J543r545
$$ -55460 -59900 -28178 -29499 -54515 -64257 -46009 3753 63209 90316 45374 54439 55982 46437
10686D6437l8469j0253K119L3716J0805j8214N211J0356K700l5641M385O779l7123
$$ 46437 7968 -2285 -166 33550 44355 26141 31352 41708 44408 8767 13152 19931 -17192
10673a7192K6823O5697Q06k1871P171R664K8021M7691k087J7666K8279j4839l7651
$$ -17192 9631 75328 76134 54263 61434 71098 99119 146810 144723 162389 190668 175829 138178
10660A38178L517N54o950n75k5145l2556l0912k9028K66J8739m2284o291L8425
$$ 138178 141695 142249 135299 134724 109579 77023 46111 17083 17349 36088 -6196 -12487 25938
10647B5938R308J6963n0986m146K1631j3379K6991M0668k5049j3383j7428k1584
$$ 25938 35246 52209 1223 -2923 18708 5329 32320 72988 47939 34556 17128 -4456
10635d456k5511J9841L7673J213k6215n0673k8133P754J8376N5690k349N372J1637
$$ -4456 -29967 -10126 27547 28760 2545 -48128 -76261 -68507 -50131 5559 3210 8582 20219
10622B0219j4053l7306k8619K1239L7902M3978J5227K5551O306l3614o6629j3262
$$ 20219 6166 -31140 -59759 -38520 -618 43360 58587 84138 90444 56830 -9799 -23061
10610b3061Q993K0368j5264j0028J4204j0628q322p408k4959L8996l1277j7658
$$ -23061 -14068 6300 -8964 -18992 -4788 -15416 -23738 -31146 -56105 -17109 -48386 -66044
10598f6044J9061L2172J6556m2918K1367M9558L366N7154j4624k3518m708L2504
$$ -66044 -46983 -14811 1745 -41173 -19806 29752 33118 90272 75648 52130 47422 79926
10586G9926o0433m2793k2874j9773m4279m3876K2086N0894M6393J4110L5069N970
$$ 79926 19493 -23300 -46174 -65947 -110226 -154102 -132016 -81122 -34729 -20619 14450 20420
10574B0420l2578J568l3300j6991L3299N7919O945K3468j4421p479j9943l5125
$$ 20420 -12158 -10590 -43890 -60881 -27582 30337 37282 60750 46329 38850 18907 -16218
10562a6218k8819j0956m105K7422Q757J3872J2400j3183M2999R37m5806J670J0425
$$ -16218 -45037 -55993 -60098 -32676 -23919 -10047 2353 -10830 32169 33106 -12700 -11030 -605
10549f05j7312n8441J4889N2202J6141p671K708K048j81k0565K1418L0472p378
$$ -605 -17917 -76358 -61469 -9267 6874 -797 1911 3959 3778 -16787 4631 35103 27725
10536B7725r17k5668j6049N4311q303k6451j5970O215O3195J7733M138l8861k8007
$$ 27725 26808 1140 -14909 39402 31099 4648 -11322 -5107 58088 75821 79959 41098 13091
10523A3091R742K2488K920M863k2041j6450p754J4369P034q460k0889k4710j3441
$$ 13091 22833 45321 48241 53104 31063 14613 6859 21228 28262 19802 -1087 -25797 -39238
10510c9238O988L1284J5517n067k8512J4152M911J0080R43k02o503l0P919k0145
$$ -39238 -32250 -966 14551 9484 -19028 -4876 35 10115 11058 10856 4353 4323 12242 -7903
10496g903k5654O521j4907J699K7667O4K080r567l6964N371K0152J4354k155l349
$$ -7903 -33557 -27036 -41943 -40244 -12577 -12513 -10433 -20000 -56964 -51593 -31441 -17087 -19242 -22591
10482b2591j6347M8177l879q285j6742Q702P28J9831k9083j1221p949L79r862
$$ -22591 -38938 9239 5360 -2925 -19667 -10965 -10237 9594 -19489 -30710 -38659 -38280 -48142
10469d8142N1833M7743K8833j9380j7211L013R111k6164j8094J133K5421j243
$$ -48142 3691 51434 80267 60887 43676 46689 55800 29636 11542 12675 38096 36853
10457C6853n8864j1692j3196M6499O7884n96k6468m3043k3445J93J7115m7677
$$ 36853 -22011 -33703 -46899 -400 67484 66888 40420 -2623 -26068 -25875 -8760 -56437
10445e6437R260K9323J2886J1745M548M82l463N591M694l4855l3526J0539J5394
$$ -56437 -47177 -17854 -4968 6777 11325 11807 8344 13935 18629 -16226 -49752 -39213 -23819
10432b3819r68k644r28j1924j5027M0235K6663k7593o955J7167K1769O621J588
$$ -23819 -24787 -27431 -28359 -40283 -55310 -15075 11588 -16005 -22960 -5793 15976 22597 24185
10419B4185q638l7077j2628L5794M5277k6888n6153j9972k383p658J0551K5317
$$ 24185 15547 -21530 -34158 1636 46913 20025 -36128 -56100 -58483 -66141 -55590 -30273
10407c0273J8465o34J6362j0054j1472L417Q331J2682J2740K4224j2883l2635
$$ -30273 -11808 -12442 3920 -6134 -17606 -14189 -5858 6824 19564 43788 30905 -1730
10395a730L0571j6183j5557J5137m0151p246L1262K1126n0919m7704M2523N1649
$$ -1730 28841 12658 -2899 12238 -27913 -35159 -3897 17229 -33690 -81394 -38871 12778
10383A2778J195j095n4176j6450R516K0445m148j5663N349r036L5160K8501K0415
$$ 12778 13973 12878 -41298 -57748 -48232 -27787 -31935 -47598 -42249 -51285 -16125 12376 32791
10370C2791j1463k1851q324Q618O0494K1667N98k7631n3108k6156j165M4526J9116
$$ 32791 21328 -523 -8847 -229 60265 81932 82530 54899 1791 -24365 -25530 18996 38112
10357C8112j3114j1894J8235K2606q125l7932M984L0348J5821O434k2254k4040
$$ 38112 24998 13104 31339 53945 45820 7888 12872 43220 59041 65475 43221 19181
10345A9181k6321l1746N9647N4941k2040j450J5742j6008j5303k596j2706j6555
$$ 19181 -7140 -38886 20761 75702 53662 52212 67954 51946 36643 34047 21341 4786
10333D786n913J4375K9320m4263k9571J6634j11l168M94j2802J6663J9557J119
$$ 4786 -1127 13248 42568 -1695 -31266 -14632 -14743 -17911 -17417 -30219 -13556 6001 7120
10320G120M734j8437j4423Q669R47k9276k4354R433M0211j4048p164J4054L3506
$$ 7120 11854 -6583 -21006 -12337 -11390 -40666 -65020 -55587 -15376 -29424 -36588 -22534 10972
10307A0972J7555q581J0130j3691l0811n1400L6792N2087J6056j2780j9243o036
$$ 10972 28527 19946 30076 16385 -14426 -65826 -29034 23053 39109 26329 7086 1050
10295A050K9186N258m5513r622K1903J5652l9084j1946L8736L7916j0997K299
$$ 1050 30236 35494 -10019 -19641 2262 17914 -21170 -33116 5620 43536 32539 34838
10283C4838k543k6779J262l970k6080j4320L58j9194L3131K5615J0298k5731k1699
$$ 34838 32295 5516 6778 2808 -23272 -37592 -37234 -56428 -23297 2318 12616 -13115 -34814
10270c4814j7932J9974m680p944L7877M3954k3754k2179L1918P215k7142o206
$$ -34814 -52746 -32772 -37452 -45396 -7519 36435 12681 -9498 22420 29635 2493 -3713
10258c713j6361L59R332J7304m3169j4499N66K6966L4752k3310j2453j0637M2501
$$ -3713 -20074 -19715 -10383 6921 -36248 -50747 -50181 -23215 11537 -11773 -24226 -34863 7638
10245G638M0318k6764l565K993M626O651q599J5189P485q361j427k3007m8189
$$ 7638 47956 21192 17627 20620 25246 31897 23298 38487 45972 37611 36184 13177 -35012
10232c5012J1993P150L7874j5922J789L5399j906o6705k3546n772J2575L4501
$$ -35012 -23019 -15869 22005 6083 7872 43271 41365 -25340 -48886 -54658 -42083 -7582
10220g582K8133K2166k1592k0486R619K3032K0944l1525q663J9387P165j1283
$$ -7582 20551 42717 21125 639 10258 33290 54234 22709 14046 33433 40598 29315
10208B9315J0256j2962M864j1321m1108R911J3445k9863J6571l30J5863k88P189
$$ 29315 39571 26609 31473 20152 -20956 -11045 2400 -27463 -10892 -11222 4641 4353 11542
10195A1542N503R109P518n319K7579l3451p369j6830q093K830K0094l1294J8904
$$ 11542 17045 26154 33672 28353 55932 22481 15112 -1718 -9811 -6981 13113 -18181 723
10182G23K8213j1570J5593O12l4818r695K6927O220J2531k6046j8392j31K4798
$$ 723 28936 17366 32959 33571 -1247 -10942 15985 22205 34736 8690 -9702 -9833 14965
10169A4965r315P357L814m92l3681j1151K7675L1230q573j9206j4772J5752q732
$$ 14965 5650 13007 16821 16329 -17352 -28503 -828 30402 21829 2623 -12149 3603 -5129
10156e129O736m4R144O0625Q333k4909J0315q312k5301K542j9398K5781N2386
$$ -5129 1607 1563 10707 71332 79665 54756 65071 56759 31458 34000 14602 40383 92769
10143I2769j1496k5589k84J3765N246o7886j2520L1348o719k3614j8983J9410
$$ 92769 81273 55684 55400 69165 74411 6525 -5995 25353 18634 -4980 -23963 -4553
10131d553k8654m0264K4226p51M5608m782j5104L2528K7543l180l9153j0078J3596
$$ -4553 -33207 -73471 -49245 -49996 -4388 -9170 -24274 8254 35797 32617 -6536 -16614 -3018
10118c018o570M418r86Q71j694P602j9793l8646K9651K8678L853J9666p682k4374
$$ -3018 -9588 -5170 -6156 -5285 -6979 623 -19170 -57816 -28165 513 4366 24032 16350 -8024
10104h024p005k746L4736J6144l5035r906J8841J2105k4350J1628J3825j796j4682
$$ -8024 -15029 -17775 16961 33105 -1930 -11836 7005 19110 -5240 6388 20213 18417 3735
10091C735K7139R264j6572j6308l4372l39M3508L1259k7930N826m828M612j7774
$$ 3735 30874 40138 23566 7258 -27114 -27453 16055 47314 19384 25210 20382 24994 7220
10078G220k750J4065L270M246J8646Q928K7204K5746l0942n346K2409l30N2017
$$ 7220 4470 18535 21805 26051 44697 53625 80829 106575 75633 70287 92696 92366 144383
10065A44383Q7962R5931J29780Q5261N0762O8549P5522J9801o8523k20042j56166
$$ 144383 232345 328276 458056 543317 594079 662628 738150 757951 689428 469386 313220
10054C13220r8182o5389k3115l7907j2545L4697q786k8790l4036O986K4464n32
$$ 313220 215038 149649 126534 88627 76082 110779 101993 73203 39167 46153 70617 70085
10042G0085j3676l2336K3633j0944q266K6124l7863J2501J0975k7114k7341l327
$$ 70085 56409 24073 47706 36762 28496 54620 16757 29258 40233 13119 -14222 -17549
10030a7549N8244N646m5016J3356M6996L9869O96k6867k3343l4760r216K6363
$$ -17549 40695 46341 1325 14681 61677 101546 102242 75375 52032 17272 8056 34419
10018C4419j1928n7158J4458J2864J1441k8259j6260J7858K3624R573J733j307
$$ 34419 22491 -34667 -20209 -7345 4096 -24163 -40423 -22565 1059 10632 12365 11058
10006A1058J3452l3521k542K2108k7241r605K7214p315O672M848N516k4277J9285
$$ 11058 24510 -9011 -11553 10555 -16686 -26291 923 -6392 280 5128 10644 -13633 5652
9993E652n352j475J4059J2265p909L8623q126q4356m2433j3072p556L4219L9129
$$ 5652 300 -1175 12884 25149 17240 55863 47737 -36619 -79052 -92124 -99680 -65461 -26332
9980b6332L2709K9000K7638j1991k003k6684j0505M118m0982j6430n117M057Q566
$$ -26332 6377 35377 63015 51024 49021 22337 11832 15950 -25032 -41462 -46579 -42522 -33956
9967c3956m238N3101J4275j5094j8831l9583q692k5230l61M9676R782M5811l2895
$$ -33956 -38194 14907 29182 14088 -4743 -44326 -53018 -78248 -78609 -28933 -19151 26660 -6235
9954f235k1311k161j2051M511M6333K359j0810L9753K8571k4055k7194n471k778
$$ -6235 -27546 -29707 -41758 -37247 9086 11445 635 40388 68959 44904 17710 12239 9461
9941I461k4103m7027R00J2203N057K2678J2054j3481l1449k9613L9886M5242l8558
$$ 9461 -14642 -61669 -60769 -48566 -43509 -20831 -8777 -22258 -53707 -83320 -43434 1808 -36750
9928c6750j1355m371K2249L1653J972j6658l1870m111K8817J0698k3013k3097
$$ -36750 -48105 -52476 -30227 1426 3398 -13260 -45130 -49241 -20424 -9726 -32739 -55836
9916e5836L181J6702l753j0516L2750O1915n102l9995M983N438r735K8758m320
$$ -55836 -52655 -35953 -39706 -50222 -17472 44443 39341 -654 4329 9767 32 28790 24470
9903B4470k292l6035L1787K9062j9886j9077J863L8740J9482l6823l3015q099
$$ 24470 22178 -13857 17930 46992 27106 8029 9892 48632 68114 31291 -1724 -9823
9891i823Q364l229r081O570j3024K4564J9221j16j7958J342j3837j4986Q129R928
$$ -9823 -1459 -4688 -13769 -7199 -20223 4341 23562 23446 5488 6830 -7007 -21993 -13864 -3936
9877c936N421K0315J0628q253m5958R442J7519p874q952K8930m602n575l113J2146
$$ -3936 1485 21800 32428 24175 -21783 -12341 5178 -2696 -11648 17282 12680 7105 3992 16138
9863A6138r396j985P803p378k4406L1151K8669M873L9251l104k7542k1875K9284
$$ 16138 6742 4757 12560 5182 -19224 11927 40596 45469 84720 81616 54074 32199 61483
9850F1483J9201j2714k5012J6222k0112k4110j0595K9359K9401k8234n0859m4556
$$ 61483 80684 67970 42958 59180 39068 14958 4363 33722 63123 34889 -15970 -60526
9838f0526J4401M3564M074j717R499J747j9568o4052K051J9686J7940J7479J4645
$$ -60526 -46125 -2561 1513 -204 9295 11042 -8526 -72578 -70527 -50841 -32901 -15422 -777
9825g77l696p010J2982k2940k4056J6839m198o033J7153M5714L113p983J7703
$$ -777 -4473 -11483 1499 -21441 -45497 -28658 -32856 -38889 -21736 23978 27091 19108 36811
9812C6811L0368k3534l8736K4065J2139n973N564J1259l3513o130L974K6324K60
$$ 36811 67179 43645 4909 28974 41113 35140 40704 51963 18450 12320 16294 42618 42878
9799D2878K179Q338J7943J8815K4402N1371L5622P2543J10318J79182K58276M07271
$$ 42878 45057 53395 71338 90153 114555 165926 201548 274091 384409 563591 821867 1229138
9787A229138N37981L77776J45662J54356K20086J56739j98502q14222o84292l54391
$$ 1229138 1767119 2144895 2290557 2444913 2664999 2821738 2623236 1809014 1124722 770331
9777G70331k02565j25430p9140p2895l9797j0181P128m183k4706j6303l1749j0797
$$ 770331 567766 442336 363196 290301 250504 240323 247451 243268 218562 202259 170510 159713
9765A59713k832J0556L1983j1929j0447J3698j9491l8831l787J1421j9200p327
$$ 159713 156881 167437 199420 187491 177044 190742 171251 132420 128633 140054 120854 113527
9753A13527L849J5983j0782j0110L2432N776m7594j1124P301J5992l9573Q195
$$ 113527 117376 133359 122577 112467 144899 150675 103081 91957 99258 115250 75677 83872
9741H3872L6819J9125l5576L926O322m2716l0995M6271J0975k9245l0145l1500
$$ 83872 120691 139816 104240 108166 114488 71772 40777 87048 98023 68778 38633 7133
9729G133j2318J8232L8704K0501L561M668k1085m5831J7617K4466j764O589k7456
$$ 7133 -5185 13047 51751 72252 75813 80481 59396 13565 31182 55648 53884 60473 33017
9716C3017k7850J3985K1416K3765l5745p0617k7187J5191q179O173K7353J2614
$$ 33017 5167 19152 40568 64333 28588 -42029 -69216 -54025 -62204 -56031 -28678 -16064
9704a6064J0248K8554j61M369l0140j1048j557J5549J1043o209k7158k7066j0982
$$ -16064 -5816 22738 22577 26946 -3194 -14242 -15799 -250 10793 4584 -22574 -49640 -60622
9691f0622J4353j0457r23K4804M631l179k5282N265m994k8148m07O900M4348N2719
$$ -60622 -46269 -56726 -57649 -32845 -28214 -31393 -56675 -51410 -56404 -84552 -84959 -78059 -33711 19008
9677A9008O0733k5853k6555l1609K399K3927o462l3002O766L2073L2640j5233
$$ 19008 79741 53888 27333 -4276 -1877 22050 15588 -17414 -10648 21425 54065 38832
9665C8832n132K9332j9197R37J5765j6642R627J487m0115m0317p207j2900l5941
$$ 38832 33700 63032 43835 44772 60537 43895 53522 55009 14894 -25423 -32630 -45530 -81471
9652h1471K667K2585J9373K397K3376o120J5574k2401l7934N065O2558K5612l3320
$$ -81471 -78804 -56219 -36846 -34449 -11073 -17193 -1619 -24020 -61954 -56889 5669 31281 -2039
9639b039N980L5979N201o1338o98K788J6350q074O547K1217K114j335J957j6297
$$ -2039 3941 39920 45121 -16217 -16915 -14127 2223 -5851 696 21913 24027 22692 24649 8352
9625H352j8461k5814k1511k9079j8318L3439K7805L4190l423M4429M370r946n586
$$ 8352 -10109 -35923 -57434 -86513 -104831 -71392 -43587 -9397 -12820 31609 35979 26033 20447
9612B0447Q801k7624k7960r49K5232K1528K6636q956l4507k465L121L1044J8039
$$ 20447 29248 1624 -26336 -27285 -2053 19475 46111 37155 2648 183 3304 34348 52387
9599E2387M54q293l813p540k3361l4171K5942K5547j8445j6577j8812N538o60
$$ 52387 52841 44548 40735 33195 9834 -24337 1605 27152 8707 -7870 -26682 -21144 -21804
9586b1804J4871k1802j1592Q29J844L5412R441j5586j074j1981m943J827j1725
$$ -21804 -6933 -28735 -40327 -39498 -37654 -2242 7199 -8387 -9461 -21442 -26385 -24558 -36283
9573c6283R577l773K7224N5506r084l0403l802m9904j2972q798L486L2474J0156
$$ -36283 -26706 -30479 -3255 52251 43167 12764 8962 -40942 -53914 -62712 -59226 -26752 -16596
9560a6596J9543K2375J9016k294M207L2114m229k9479j0146r616j4576J0679o06
$$ -16596 2947 25322 44338 42044 46251 78365 74136 44657 34511 24895 10319 20998 20392
9547B0392m4031j4745N5148J5985k641Q64n558N421K992j727j3383l0679k718
$$ 20392 -23639 -38384 16764 32749 30108 30972 25414 30835 33827 32100 18717 -11962 -14680
9534a4680j6762j4171L3292J9020J3510o971L193m0802K2254K1815R683L3086
$$ -14680 -31442 -45613 -12321 6699 20209 13238 16431 -24371 -2117 19698 29381 62467
9522F2467j384n0558j827j0071K5694J4856r640k7663J7538k3343L255k3627J8843
$$ 62467 61083 10525 8698 -1373 24321 39177 29537 1874 19412 -3931 -676 -24303 -5460
9509e460J9363O034K58l884j0824K6960J793k7573K299q503M0818J1762m2264
$$ -5460 13903 19937 20195 16311 5487 32447 34240 6667 8966 463 41281 53043 10779
9496A0779k1801J6839m234j9893j988J0401P647j949J1353m9447N775M1486J435
$$ 10779 -11022 5817 1583 -18310 -20298 -9897 -2250 -4199 7154 -42293 -36518 4968 6403
9483F403j3586J659r724l1104K2970M2124L1273j5823k1879p788J2226l4960K748
$$ 6403 -7183 -5524 -15248 -46352 -23382 18742 50015 34192 12313 4525 16751 -18209 -15461
9470a5461J5100l4479l2627K4453J490L620j0975k643P939k4267l4815J7639L3954
$$ -15461 -361 -34840 -67467 -43014 -41524 -37904 -48879 -51522 -43583 -67850 -102665 -85026 -51072
9457e1072J8334K2798k116J2223o959Q479J2935K4972l3629m3497k7235Q359O3974
$$ -51072 -32738 -9940 -12056 167 -6792 1687 14622 39594 5965 -37532 -64767 -56408 7566
9444G566L4447P248k5992j4570l0688J6476o132J3037K9902O264K8356l746j8756
$$ 7566 42013 49261 23269 8699 -21989 -5513 -11645 1392 31294 37558 65914 62168 43412
9431D3412k3461J2225O3906O664O10n1082l7115M350k1910M3073k6057J7384r474
$$ 43412 19951 32176 96082 102746 103356 52274 15159 19509 -2401 40672 14615 31999 22525
9418B2525N344K2439l4978j9441O4j0175J1595L0838m0683j4663J3592Q535o179
$$ 22525 27869 50308 15330 -4111 -4047 -14222 -2627 28211 -12472 -27135 -13543 -5008 -11187
9405a1187J246R044K1677O571l2908l7964J6011L5891J2550q815j0384j702M1532
$$ -11187 -9941 -897 20780 27351 -5557 -43521 -27510 8381 20931 12116 1732 30 41562
9392D1562k2393l4350K2258J763k3362Q434j6764L784K4255L8309K752r025M117
$$ 41562 19169 -15181 7077 8840 -14522 -6088 -22852 -19068 5187 43496 46248 37223 41340
9379D1340J1409M763j8607l2849Q699J4158j224r686q893j1382R640j9749J902
$$ 41340 52749 57512 38905 6056 14755 28913 27689 18003 9110 -2272 7368 -12381 -10479
9366a0479j4611P052L328k0105K598J5417L5933J1726J1456l0534j6990j156q937
$$ -10479 -25090 -18038 -14710 -34815 -32217 -16800 19133 30859 42315 11781 -5209 -6365 -15302
9353a5302J3490J8767R787k7723p237k7885k346M3414K6857k698L899j1950L94
$$ -15302 -1812 16955 26742 -981 -8218 -36103 -38449 4965 31822 29124 33023 21073 21467
9340B1467J6241L407j3228m719m3421l2310J47K4233N9625N4384n1469o8467r118
$$ 21467 37708 41115 27887 23168 -20253 -52563 -52416 -28183 31442 85826 34357 -34110 -43228
9327d3228o264k1744L0087K4217j7985M513K2560M236j0646K9394J773J837m374
$$ -43228 -49492 -71236 -41149 -16932 -34917 -30404 -7844 -3608 -14254 15140 16913 18750 14376
9314A4376K8400k1085j7711J5853K4139j71n8533j6546K4354n724k9605k12p764
$$ 14376 42776 21691 3980 19833 43972 43801 -14732 -31278 -6924 -12648 -42253 -42465 -50229
9301e0229O6949N706k4908n852M392j9004L6455K1655m6944k5352L5383O6631
$$ -50229 16720 22426 -2482 -8334 -3942 -22946 13509 35164 -11780 -37132 -1749 64882
9289F4882J5768j9901j7985L0901k9333k9340j1084j854j3014j252K4632J5446
$$ 64882 80650 60749 42764 73665 44332 14992 3908 2054 -10960 -12212 12420 27866
9277B7866M4222J4883l2235j0030k207L982j528J8494j0165l2513j7787o01J0911
$$ 27866 72088 86971 54736 44706 42499 46481 44953 63447 53282 20769 2982 2381 13292
9264A3292J5710j971j915L6730J4298l415J5987N45l4169J0980j5633k5788l286
$$ 13292 29002 27031 25116 61846 76144 72729 88716 89261 55092 66072 50439 24651 21365
9251B1365J7719J2419r545J9827k9328l9927K1951K6800j0016j5506r348M619
$$ 21365 39084 51503 41958 61785 32457 -7470 14481 41281 31265 15759 6411 11030
9239A1030k415j1568l702K1086k4147J6667K0192j9457Q469j5718k9425L6549
$$ 11030 8615 -2953 -6655 14431 -9716 6951 27143 7686 16155 437 -28988 7561
9227G561L0356J1053l2271m6239L4663K2695J9348K5588K3726J4641k0603j6756
$$ 7561 37917 48970 16699 -29540 5123 27818 47166 72754 96480 111121 90518 73762
9215G3762o062l987L825r72q611K060k8987m216M2888n62m5789R060L0395J6066
$$ 73762 67700 63713 67538 66566 57955 60015 31028 26812 69700 69138 23349 32409 62804 78870
9201G8870j4362n277q468O912m108j9270M0767O211J0383j0O831R781j9649N237
$$ 78870 64508 59231 50763 57675 53567 34297 75064 81275 91658 91648 98479 108260 88611 93848
9187I3848K709k3089p13P330j5179J3059J6202k103j2504K4125K474K9194q701
$$ 93848 96557 73468 72755 80085 64906 77965 94167 92064 79560 103685 106159 135353 126652
9174A26652k4379n086L3463P222J5852n437j2813l6106j6344L944K2614L6184
$$ 126652 102273 97187 130650 137872 153724 148287 135474 99368 83024 86968 109582 145766
9162A45766J4029n285M5872J6258L3371n501l0260P174K8281M2724P398j4132
$$ 145766 159795 154510 200382 216640 250011 244510 214250 221424 249705 292429 299827 285695
9150B85695L4979J210M2092M4540K7710m017R849N5557L6511O6180N2517O5042
$$ 285695 320674 321884 363976 408516 436226 432209 442058 497615 534126 600306 652823 717865
9138G17865M5788P3820P9287J04263J06129J22622J75871J85634K42905K80707
$$ 717865 763653 837473 916760 1021023 1127152 1249774 1425645 1611279 1854184 2134891
9128B134891L70643M58351N72212P05757R49354J203732J545624J895514K034620
$$ 2134891 2505534 2963885 3536097 4241854 5191208 6394940 7940564 9836078 11870698
9119A1870698J956361J682710J293927Q34307K00145n77511j534387k228168k323154
$$ 11870698 13827059 15509769 16803696 17638003 17838148 17260637 15726250 13498082 11174928
9110A1174928k005754j564491j169378r21569p09997n53498m31401l61476k98408
$$ 11174928 9169174 7604683 6435305 5513736 4803739 4250241 3818840 3457364 3158956
9101C158956k47198j99008j69605j64353j25228j04756j07261j17800j06750j34691
$$ 3158956 2911758 2712750 2543145 2378792 2253564 2148808 2041547 1923747 1816997 1682306
9091A682306q1863l0174n6975j17461o7086o0571k8558n6735p1171l8067m7381
$$ 1682306 1600443 1570269 1513294 1395833 1328747 1268176 1239618 1182883 1111712 1073645 1026264
9080A026264k4653k3183p3829m1163k1696n3630m4388k4155n6206Q548M5687O097
$$ 1026264 1001611 978428 904599 863436 841740 788110 743722 719567 663361 671909 717596 723693
9068G23693p826p0361m5133l3361j204J5837j5852m6340k9608k6941L247N022
$$ 723693 715867 645506 600373 567012 565808 581645 565793 519453 489845 462904 466151 471173
9056D71173q511j3640M692L40j268l7739m4597l0558j7547J6446j6210l2008P711
$$ 471173 462662 449022 453714 454054 452786 415047 370450 339892 322345 338791 322581 290573 298284
$$ [...]
##END NTUPLES=NMR SPECTRUM
##END=
