##TITLE=Analysis number 322482
Compound Code cc 58901
Book Reference 494/60
Project Code adrs
Chemist Name craigr
##JCAMPDX= 6.0         $$ Bruker NMR JCAMP-DX V2.0
##DATA TYPE= NMR SPECTRUM
##DATA CLASS= NTUPLES
##ORIGIN= Bruker BioSpin GmbH
##OWNER= nmr
$$ XWIN-NMR		Version 3.5
$$ Thu Sep 28 09:10:43 2006 GMT Daylight Time (UT+1h)  MAYBRIDGE\nmr@NMR_250MHZ
##.OBSERVE FREQUENCY= 250.131544655141
##.OBSERVE NUCLEUS= ^1H
##.ACQUISITION MODE= SIMULTANEOUS (DQD)
##.ACQUISITION SCHEME= undefined
##.AVERAGES= 16
##.DIGITISER RES= 18
##SPECTROMETER/DATA SYSTEM= dpx250
##.PULSE SEQUENCE= zg30
##.SOLVENT NAME= DMSO
##.SHIFT REFERENCE= (INTERNAL, DMSO, 0, 16.522)
##AUDIT TRAIL= $$ (NUMBER, WHEN, WHO, WHERE, WHAT)
$$ ##TITLE= Audit trail, XWIN-NMR		Version 3.5
$$ ##JCAMPDX= 5.01
$$ ##ORIGIN= Bruker BioSpin GmbH
$$ ##OWNER= nmr
$$ C:\u/data/dgb/nmr/ADRS/1510/pdata/1/auditp.txt
$$ ##AUDIT TRAIL=  $$ (NUMBER, WHEN, WHO, WHERE, WHAT)
(   1,<2006-09-28 09:10:19.58 +100>,<MAYBRIDGE\nmr>,<NMR_250MHZ>,
      <created by zg, POWCHK disabled, PULCHK disabled
       configuration hash MD5:
       E2 DF 36 D8 04 B2 41 60 5A D7 A3 38 5A 4B D0 FE
       data hash MD5: 64K
       DB AD C0 EC E3 AE 06 3C 0E 94 25 1A D8 B7 D9 1F>)
(   2,<2006-09-28 09:10:32.02 +100>,<MAYBRIDGE\nmr>,<NMR_250MHZ>,
      <Start of raw data processing
       ef LB = 0.3 FT_mod = 6 PKNL = 1 SI = 32K 
       data hash MD5: 32K
       AB 3F 09 C2 74 2A 16 0E EA D1 DD 4E 14 3D 78 C8>)
(   3,<2006-09-28 09:10:33.62 +100>,<MAYBRIDGE\nmr>,<NMR_250MHZ>,
      <apk 
       data hash MD5: 32K
       FB 3A EA 06 3A 39 DF 6E DF 01 C0 CD 28 CD 07 FA>)
(   4,<2006-09-28 09:10:34.44 +100>,<MAYBRIDGE\nmr>,<NMR_250MHZ>,
      <abs ABSG = 5 
       data hash MD5: 32K
       FA 97 FC D0 9E 7A 93 7D EA 87 C4 5A E8 88 E0 4B>)
$$ ##END=
$$ 
$$ hash MD5
$$ 1C 70 EE D6 BF FA F3 88 4C F0 F1 68 7C 6C 40 3D
##$RELAX= 
##$RELAX= 
##$RELAX= 
##$RELAX= 
##$RELAX= 
##$RELAX= 
##$RELAX= 
$$ Bruker specific parameters
$$ --------------------------
##$DU= <C:\u>
##$EXPNO= 1510
##$NAME= <ADRS>
##$PROCNO= 1
##$TYPE= <nmr>
##$USER= <dgb>
##$AMP= (0..31)
100 100 100 100 100 100 100 100 100 100 100 100 100 100 100 100 100 100 
100 100 100 100 100 100 100 100 100 100 100 100 100 100 
##$AQSEQ= 0
##$AQ_mod= 3
##$AUNM= <au_zg>
##$AUTOPOS= <18 >
##$BF1= 250.13
##$BF2= 250.13
##$BF3= 250.13
##$BF4= 250.13
##$BF5= 500.13
##$BF6= 500.13
##$BF7= 500.13
##$BF8= 500.13
##$BYTORDA= 1
##$CFDGTYP= 0
##$CFRGTYP= 5
##$CHEMSTR= <none>
##$CNST= (0..31)
1 1 145 1 1 1 1 1 1 1 1 1 1 1 1 1 1 1 1 1 1 1 1 1 1 1 1 1 1 1 1 1 
##$CPDPRG= <>
##$CPDPRG1= <>
##$CPDPRG2= <>
##$CPDPRG3= <>
##$CPDPRG4= <mlev>
##$CPDPRG5= <mlev>
##$CPDPRG6= <mlev>
##$CPDPRG7= <mlev>
##$CPDPRG8= <mlev>
##$CPDPRGB= <>
##$CPDPRGT= <>
##$D= (0..31)
0 1 0 0 0 0 0 0 0 0.06 0 0 0 0 0 0 0.0002 0 0 0 0 0 0 0 0 0 0 0 0 0 0 
0 
##$DATE= 1159431018
##$DBL= (0..7)
120 120 120 120 120 120 120 120 
##$DBP= (0..7)
150 150 150 150 150 150 150 150 
##$DBP07= 0
##$DBPNAM0= <>
##$DBPNAM1= <>
$$ [...]
##$SUBNAM7= <"">
##$SUBNAM8= <"">
##$SUBNAM9= <"">
##$SW= 20.6930455092707
##$SWIBOX= (0..15)
0 0 3 0 0 0 0 0 0 0 0 0 0 0 0 0 
##$SW_h= 5175.983436853
##$TD= 65536
##$TD0= 1
##$TE= 295.16
##$TE2= 300
##$TE3= 300
##$TEG= 300
##$TL= (0..7)
0 120 120 120 120 120 120 120 
##$TP= (0..7)
150 150 150 150 150 150 150 150 
##$TP07= 0
##$TPNAME0= <>
##$TPNAME1= <>
##$TPNAME2= <>
##$TPNAME3= <>
##$TPNAME4= <>
##$TPNAME5= <>
##$TPNAME6= <>
##$TPNAME7= <>
##$TPOAL= (0..7)
0.5 0.5 0.5 0.5 0.5 0.5 0.5 0.5 
##$TPOFFS= (0..7)
0 0 0 0 0 0 0 0 
##$TUNHIN= 0
##$TUNHOUT= 0
##$TUNXOUT= 0
##$USERA1= <user>
##$USERA2= <user>
##$USERA3= <user>
##$USERA4= <user>
##$USERA5= <user>
##$V9= 5
##$VALIST= <valist>
##$VCLIST= <CCCCCCCCCCCCCCC>
##$VD= 0
##$VDLIST= <DDDDDDDDDDDDDDD>
##$VPLIST= <PPPPPPPPPPPPPPP>
##$VTLIST= <TTTTTTTTTTTTTTT>
##$WBST= 1024
##$WBSW= 4
##$XGAIN= (0..3)
0 0 0 0 
##$XL= 0
##$YL= 0
##$YMAX_a= 345719
##$YMIN_a= -385050
##$ZGOPTNS= <>
##$ZL1= 120
##$ZL2= 120
##$ZL3= 120
##$ZL4= 120
##$ABSF1= 16.522
##$ABSF2= -4.171173
##$ABSG= 5
##$ABSL= 3
##$ALPHA= 0
##$AQORDER= 0
##$ASSFAC= 0
##$ASSFACI= 0
##$ASSFACX= 0
##$ASSWID= 0
##$AUNMP= <proc_1d>
##$AZFE= 0.1
##$AZFW= 0.1
##$BCFW= 0
##$BC_mod= 0
##$BYTORDP= 0
##$COROFFS= 0
##$CY= 12.5
##$DATMOD= 1
##$DC= 0
##$DFILT= <>
##$DTYPP= 0
##$F1P= 14.0000005364418
##$F2P= -0.99999901652339
##$FCOR= 0.5
##$FTSIZE= 32768
##$FT_mod= 6
##$GAMMA= 0
##$GB= 0
##$INTBC= 1
##$INTSCL= 1
##$ISEN= 128
##$LB= 0.3
##$LEV0= 0
##$LPBIN= 0
##$MAXI= 10000
##$MC2= 0
##$MEAN= 0
##$ME_mod= 0
##$MI= 0
##$NCOEF= 0
##$NC_proc= -4
##$NLEV= 6
##$NOISF1= 0
##$NOISF2= 0
##$NSP= 0
##$NTH_PI= 0
##$NZP= 0
##$OFFSET= 16.522
##$PC= 1
##$PHC0= 143.3074
##$PHC1= 2.646468
##$PH_mod= 1
##$PKNL= yes
##$PPARMOD= 0
##$PSCAL= 4
##$PSIGN= 0
##$REVERSE= no
##$SF= 250.13
##$SI= 32768
##$SIGF1= 0
##$SIGF2= 0
##$SINO= 400
##$SIOLD= 32768
##$SREGLST= <1H.DMSO>
##$SSB= 0
##$STSI= 32768
##$STSR= 0
##$SW_p= 5175.98343685301
##$SYMM= 0
##$S_DEV= 0
##$TDeff= 65536
##$TDoff= 0
##$TI= <Analysis number 999999
Compound Code 99
Book Reference 9
Project Code 9>
##$TILT= no
##$TM1= 0
##$TM2= 0
##$TOPLEV= 0
##$USERP1= <user>
##$USERP2= <user>
##$USERP3= <user>
##$USERP4= <user>
##$USERP5= <user>
##$WDW= 1
##$XDIM= 32768
##$YMAX_p= 314948796
##$YMIN_p= -190073
$$ End of Bruker specific parameters
$$ ---------------------------------
##NTUPLES= NMR SPECTRUM
##VAR_NAME=  FREQUENCY,     SPECTRUM/REAL,   SPECTRUM/IMAG
##SYMBOL=    X,             R,               I
##VAR_TYPE=  INDEPENDENT,   DEPENDENT,       DEPENDENT
##VAR_FORM=  AFFN,          ASDF,            ASDF
##VAR_DIM=   32768,         32768,           32768
##UNITS=     HZ,            ARBITRARY UNITS, ARBITRARY UNITS
##FACTOR=    0.157963299565203, 1,           1
##FIRST=     4132.6476996994, 0,             0
##LAST=      -1043.33573715361, 0,           0
##MIN=       -1043.33573715361, -190073,     0
##MAX=       4132.6476996994, 314948796,     0
$$ Real data points
##PAGE= N=1
##DATA TABLE= (X++(R..R)), XYDATA
$$ [...]
15629c7784l1073k9996M2706J7827j7920K9252K9971p616J1075j591O0907k5151
15617D0607n6963m9291O2714M9853R311r735k6946j1712o772j2929k006p906N2019
15604C0244P537M418J0192L0533J2851l615n0454m1612k7844M9377K150M9263
15592G3040k6329m277J1007J9268j6831p4023l5184l4922N3828N1773j3667n5403
15580e1720L6461M8543M4375k0146p5226k4781M295j38k1464k2030K0516L7027
15568b4288L9342N2789k177k0754k9938j6239l2040K6466L2518K7146L3411M153
15556I0389q0719n1526j3476j9151M0708q278m569M09L2175j1348P8796J8462
15544G1872o7759J8108K7188M9647K6554p7899n0906p094k4962l2785m568J8449
$$ y = [-37784, -68857, -98853, -56147, -38320, -56240, -26988, 2983, -4633, 6442, 4851, 65758, 40607, -16356, -65647, -2933, 46920, 56231, 46496, 19550, 7838, 1066, -11863, -13869, -21775, 30244, 37781, 42199, 52391, 82924, 95775, 92160, 41706, 94, -27750, 21627, 23777, 73040, 46711, 42434, 53441, 72709, 55878, -18145, -53329, -88251, -34423, 17350, 3683, -51720, -15259, 33284, 77659, 57513, -17713, -42494, -38199, -38337, -59801, -81831, -61315, -24288, 15054, 67843, 65666, 44912, 14974, -1265, -33305, -6839, 25679, 52825, 86236, 90389, 9670, -41856, -55332, -74483, -33775, -42053, -46622, -46213, -14038, -25386, 53410, 71872, 4113, 22221, 49409, 99056, 125610, 47711, -3195, -10289, -35251, -68036, -72604, -54155]
15532e4155J9199j5647L8122M43J5726p157j5946J8511n856j2329m4221J9863
15520d3447k8086K7017M0322l20o026k0857k6070q962N5376M3234n9141J977L0870
15507E887l5177K1478J3134k7456J756K5773K1169K9105j7284K8637q796M9015
15495A07241k1168l4224j217l864K0856o034k0982n948l1725j0261l2535q031
15483d7892j945J630L7099L5008j2695o1048j7482j1146O5597J5385p59L9618
15471D1370l5019j9551K6640j6664m3852l4228M2770O2946L9468m7431l1407k2194
15459c7152p98p969O42K650L911k3407J8456M624J9712M2393P826o1774M6765
15446A5879O2761m449k6611k5647m4969k9651n463M4935P7272P061k7478l5113
$$ y = [-54155, -34956, -50603, -12481, -12038, 3688, -3469, -19415, -904, -6760, -19089, -63310, -43447, -71533, -44516, -4194, -4514, -10540, -31397, -57467, -66429, -11053, 32181, -26960, -24983, 5887, -29290, -7812, 5322, -22134, -20378, 5395, 26564, 55669, 38385, 67022, 58226, 107241, 86073, 51849, 50632, 46768, 67624, 61590, 40608, 34660, 2935, -7326, -39861, -47892, -49837, -48207, -11108, 23900, 11205, -49843, -67325, -78471, -12874, 2511, 1752, 41370, 6351, -13200, 13440, -3224, -47076, -81304, -38534, 24412, 63880, 16449, -14958, -37152, -37950, -45919, -45277, -42627, -38716, -62123, -43667, -39043, -19331, 23062, 30888, -30886, 15879, 78640, 74191, 47580, 21933, -23036, -52687, -58150, -13215, 64057, 71118, 43640, 8527]
15434H527n6147l9903l7890Q341M3741L0441N9774O801j4736L6002L2741k9162
15422D8530o2258q8216K3223N6731K8844P903M014m2876l8444K6500P1729M3817
15410G9497j563l8613j6626q797k8364M763K5778M1086n9856r8606L2703K6436
15398d2162q02k3950P600j6328K1479N6523K3034k2222J2623O615L7856K7106
15386H7372n2083o2883M2997R1255j6810j01431o4500J085n64O490L5170N6372
15374B2470L3299K0640M330o2329L7509j6185J8923R682o943j02274n8968j3889
15362a13735m0341J2828M7754L1386L5129n5808k6998M7022M4424M9978P0129
15351A01768m0975p2601j4077p683M544K3204k4401n737j4525J5356j3276k4656
$$ y = [8527, -47620, -87523, -125413, -117072, -73331, -42890, 16884, 23685, 8949, 44951, 77692, 48530, -13728, -101944, -78721, -21990, 6854, 14757, 18771, -24105, -62549, -36049, 35680, 79497, 77934, 39321, 22695, 13898, -14466, -9703, 16075, 57161, -2695, -101301, -68598, -42162, -42964, -66914, -59314, -75642, -54163, 2360, 25394, 3172, 15795, 22410, 60266, 87372, 35289, -27594, 15403, 106658, 89848, -11583, -76083, -74998, -75562, -69072, -33902, 22470, 55769, 76409, 80739, 18410, 55919, 39734, 58657, 68339, 61396, -40878, -99846, -113735, -154076, -141248, -93494, -62108, -26979, -82787, -109785, -62763, -18339, 31639, 101768, 60793, -11808, -25885, -33568, -29024, -5820, -30221, -35958, -50483, -35127, -48403, -73059]
15339g3059L0503O2605j9842J8494J4325J6790k3707l2119J7885j5414p2069m9752
15327a25360j7795L3420O4782M1347M123p8267j8370j6645M4331L8185M3903N6310
15315F9964r0003m1094J7148N5971k5603J404K779K1282J9543l1176n7805J482
15303e6108j2429Q0064J7240l767L7585k8514p8750l365Q953M2744K8972j9811
15291A2814L7237K1556o685k6634k2358l1989k2809O9566L7264Q481k0196l4281
15279B1966k4213m295k0775n203J5685L0225M2868k9845k6356l8149J160J3363
15267b3569j5710K3574Q1705L1350l4112j4647k0323N143P9q680M5103m645K0502
15254H5770K611l9600r454j2216p1653N9984J0751o1354L8772L6706N3444o0189
$$ y = [-73059, -42556, 20049, 207, 18701, 33026, 49816, 26109, -6010, 11875, -3539, -75608, -125360, -143155, -109735, -44953, -3606, 517, -77750, -96120, -112765, -68434, -30249, 13654, 69964, -20039, -61133, -43985, 11986, -13617, -12213, -9434, 11848, 31391, 215, -57590, -56108, -68537, 11527, 28767, 25000, 62585, 34071, -44679, -48044, -39091, 3653, 32625, 12814, 50051, 71607, 64922, 38288, 15930, -16059, -38868, 30698, 67962, 76443, 56247, 21966, -2247, -6542, -27317, -32520, -16835, 13390, 56258, 26413, 57, -38092, -36932, -23569, -39279, -15705, 66000, 97350, 63238, 48591, 28268, 33411, 33490, 24810, 69913, 65268, 85770, 88381, 48781, 39327, 27111, -44542, 15442, 26193, -35161, 3611, 40317, 93761, 33572]
15242C3572q6174M200K4317J9728M8865L7886P931j8020K0863J3559l4624K7979
15230A00082J2218p3914o7603K038L9915Q326j831k6309j8735L717p53R400K8693
15217A5244j0168J0059L4098j1918o5951r967n678J5621J3513p297j2412K6999
15205g857r524j9093N1682L5684n184J9145l2424l9990j6969M2338K9014n909
15193D0913n9039j5930k958q613L8088L8370J4170j2706j6187L1817j9101o0573
15181c1749j1084M2210O5267N2192l6709j6024m2103L6083K7411l6715n1600J1935
15169I114n366J4070K5949j0964l6893K460J3032O55K1253M551k59j0981K8252
15156E4873k7286n2104p478O864J6009k1603j4779j5872O6448K0702n76j6104
$$ y = [33572, -52602, -48402, -24085, -4357, 44508, 82394, 90325, 72305, 93168, 106727, 72103, 100082, 112300, 38386, -29217, -27179, 12736, 21062, 19231, -7078, -25813, -22096, -22849, -13449, 15244, 5076, 15135, 49233, 37315, -28636, -38603, -44281, -28660, -15147, -22444, -34856, -7857, -17381, -36474, 15208, 50892, 45708, 64853, 32429, -7561, -24530, 17808, 46822, 40913, -18126, -34056, -37014, -45627, -7539, 30831, 45001, 32295, 16108, 47925, 28824, -31749, -42833, -623, 64644, 116836, 80127, 64103, 22000, 58083, 85494, 48779, -2821, 9114, 3748, 17818, 43767, 32803, -4090, -1630, 11402, 12057, 33310, 37861, 37602, 26621, 54873, 27587, -24517, -31995, -25131, -9122, -30725, -45504, -61376, 5072, 25774, 25198, 9094]
15144I094L3651M5212o5164q484m1143j0960K3950J0570L8640j1870j5878j8220
15132a0602J5895J4959R817M2499J3222o6212k8708J5645k516K2674k2140l4993
15120c0460J2267K5043K9741j3436j3868K4554l904n6618j8737q344L0632K4609
15108A479K6283q231p0856n9051J0940J8406j4513J1510O307L3204M4920K4615
15096B5013m1113m3667m4742J4752O3519j5379J3880M5335j5468m7876K3363N659
15084a6724j9840l199K711K3143p42M3854O4668k9125n1038K0085J6610p6304
15072b5901m3152o686l556J6915m965N1539L4969j3412m1690K860N5092P933K659
15059C2605m4165m8165M8044K79l1051n213M6012Q090J6749l2557l6934K4696
$$ y = [9094, 42745, 87957, 22793, 14309, -26834, -37794, -13844, -3274, 35366, 23496, 7618, -10602, 5293, 20252, 30069, 72568, 85790, 19578, -9130, 6515, 3999, 26673, 4533, -30460, -18193, 6850, 36591, 23155, 9287, 33841, 29937, -26681, -45418, -53762, -23130, 1479, 27762, 19531, -51325, -110376, -99436, -81030, -95543, -84033, -77726, -44522, 398, 25013, -16100, -59767, -104509, -89757, -26238, -41617, -27737, 17598, 2130, -45746, -22383, -16724, -36564, -39763, -37052, -13909, -14651, 29203, 93871, 64746, 13708, 33793, 50403, -25901, -69053, -75739, -79295, -62380, -67345, -15806, 19163, 5751, -35939, -33079, 22013, 29946, 32605, -11560, -59725, -11681, -11402, -42453, -47666, -1654, 6436, 23185, -9372, -46306, -21610]
15047b1610M0339j9307k1839N3085k6872l9959M876K7145j659k8911m531k622
15035d1865K2030M5389L4995K3479m0298J5229J8157k6717m1411m4887k1204M1753
15023a5350K8615j1876m8949j6604K5246M5722J0658M82J3234l568q947J551J5
15010B0229m6672K3378L9451l7112p239L5155k5973j4648R567m3581K7292M9683
14998B9530j5319L6178O1395n4206l0271j1856J7126K3592p622j4796n5115M829
14986a6535K0154j0318j6568k1301N9557J2128m1333j8616L3135n101K433k7836
14974c0201l1464J5531L04K5237J6401M897j3661N6443m3553o6338l67j5958K7135
14961e5594N9747k6562q2359L8251K8271k6969l7197N342J2769M8275j9236k7209
$$ y = [-21610, 18729, -578, -22417, 30668, 3796, -36163, -31287, -4142, -5801, -34712, -39243, -41865, -19835, 25554, 60549, 84028, 43730, 58959, 77116, 50399, 8988, -35899, -57103, -15350, 13265, 1389, -47560, -64164, -38918, 6804, 17462, 17944, 31178, 27610, 18663, 20214, 20229, -26443, -3065, 36386, -726, -7965, 27190, 1217, -13431, -3864, -47445, -20153, 29530, 14211, 50389, 111784, 57578, 27307, 15451, 32577, 56169, 48547, 33751, -21364, -16535, 3619, -6699, -23267, -44568, 14989, 27117, -14216, -32832, 303, -4798, -2365, -30201, -61665, -46134, -45830, -20593, -4192, 705, -12956, 43487, -66, -66404, -66771, -82729, -55594, 4153, -22409, -104768, -66517, -38246, -65215, -102412, -97070, -84301, -36026, -55262, -82471]
14949h2471J3725K7238P1150L943r324k1694j4278k1698L3690O0870K0225k9300
14937E2076J4658K264m7463p0773l5592j8895L3311J953r282M6989o839j5168
14925e2761j0508O7885K3103k6626L2652l1594o70j8650L0182Q33O058m090L764
14912A9578O3200M7039o5289n2363l86J0512L0754k763N799m266n8613O073J422
14899F97J1115q546K9243L0136j4600m4280k4447L6853J8607m5893m1699o998
14887e9812K077J9190l9356m7966L408N4311M2806N4997K6064q863R813K0022
14875G6691L0986Q293k0016n1253k2658j6512m1394J0185O312n1822N2351p822
14863b6659j1480K429m3674Q580J2533L9547l0653k3107M7366K2838k181p8598
$$ y = [-82471, -68746, -41508, 29642, 33585, 24261, 2567, -11711, -33409, 281, 61151, 81376, 52076, 66734, 68998, 21535, -49238, -84830, -103725, -70414, -68461, -77743, -30754, -37593, -52761, -63269, 4616, 27719, 1093, 33745, 2151, 1481, -17169, 13013, 13846, 19904, 15814, 19578, 82778, 129817, 64528, 12165, 11779, 22291, 53045, 50282, 56081, 51815, -6798, -725, 697, 11812, 3266, 32509, 62645, 48045, 3765, -20682, 16171, 34778, -11115, -52814, -59812, -57735, -38545, -77901, -125867, -122459, -68148, -25342, 29655, 55719, 46856, 56669, 76691, 107677, 115970, 95954, 44701, 22043, 5531, -35863, -25678, -19366, -71188, -18837, -26659, -38139, -35710, -79384, -70804, -58271, -18724, -49377, -72484, -25118, -2280, -4461, -83059]
14851h3059k0738J8253K2570M5608M4674K569m4439j1730L3302O2904Q973k8139
14839E0748O194j8685L8964J6347K2998K9194j7373l8413j8618j382l0846p8838
14827c9710j3064M5196n478k6271j1157L934k3332P8405N7748l390m4690O004
14815B4195L36l0658L2713K1380m6957j8397j506K5240J2314l837L009Q584L0507
14802E6923K2974j08274n3960M0436Q9994N6939k3976K2140m099k8834l3995j1672
14790B4596o0859J8717J2912j4792M1724M823o488K7039K4612K5750j6867m1586
14778C9581k6945Q076L2271J1161n0533n7027k5076K691L7596K3276L6536k6597
14766E010m8598J4482r233K7454O672L3037Q455L7037n7803j00433j2027L3315
$$ y = [-83059, -103797, -85544, -62974, -17366, 27308, 29877, -14562, -26292, 7010, 69914, 78887, 50748, 56942, 38257, 77221, 93568, 116566, 145760, 128387, 89974, 71356, 69974, 39128, -39710, -52774, -7578, -13056, -39327, -50484, -46550, -69882, 8523, 66271, 62881, 18191, 24195, 24531, -6127, 26586, 47966, 1009, -17388, -18894, 6346, 18660, 14823, 17832, 26416, 56923, 79897, -28377, -82337, -41901, 48093, 105032, 81056, 103196, 99097, 70263, 36268, 24596, -36263, -17546, -4634, -19426, 22298, 27121, 20633, 47672, 72284, 98034, 81167, 39581, 12636, 20712, 52983, 64144, 13611, -43416, -68492, -65801, -28205, -4929, 31607, 5010, -43588, -29106, -38339, -10885, -4213, 28824, 37279, 74316, 16513, -83920, -95947, -62632]
14754f2632J2628J7260o950K0635L4751j9229K8505K1928o677l5927j7298L8392
14742B5386Q432k760K0995L4126j2462k6588l826j4331n3881k2602j960J7295
14730c2176j2010M8791N6038L280m9916k5837j2332k4246k5763M8632M0859j8286
14718b966L52k6048L29l5134N4183K9498n5836m5882J799j2816L4380K8029L4524
14705D412K9580L7033k7120n9772L2782L7270K7751p2501o1823K4367J2624r948
14693b5345J05520M1776n5327k8832j7145l0822n6566j8808j8949l5709K5307
14682a14900M9115j2908K2550N3085Q526k4451j2466J5758m3608k0216k4102O491
14670i7126K6712K7059N1182N5808p8346l3115n237j0230j2120L216O6579M7400
$$ y = [-62632, -50004, -32744, -39694, -19059, 15692, -3537, 24968, 46896, 40219, 4292, -13006, 25386, 33818, 31058, 52053, 86179, 73717, 47129, 43303, 28972, -24909, -47511, -49471, -32176, -44186, 4605, 60643, 63923, 14007, -11830, -24162, -48408, -74171, -25539, 15320, -2966, -2614, -28662, -28333, -63467, -9284, 20214, -35622, -81504, -79705, -92521, -58141, -30112, 4412, 33992, 71025, 43905, -15867, 16915, 54185, 81936, 9435, -52388, -28021, -15397, -25345, 80175, 121951, 66624, 37792, 20647, -10175, -66741, -85549, -104498, -140207, -114900, -65785, -78693, -56143, -3058, 5468, -18983, -31449, -15691, -59299, -79515, -103617, -97126, -70414, -43355, 7827, 63635, -14711, -47826, -53063, -63293, -75413, -72197, -5618, 41782]
14658D1782J0948J3488k6072L1880K7482k3417p6271K1901j6272n2249l786J0612
14646c9974J4412j1748p159L8817N2377j5884J5576J7591L9411l6410n7077l2470
14634b2538p456p281L4363K5374j5689j4062J8953J2616j1882l6612k9972M5865
14622h321O5390L7987j878O922k7691J1166j1024K442N8415j1988m615p635o6369
14609D2801j08815n5729M4495M1130R595j33k2364o210M1009L2168j5873k9468
14597b7394K4504L5558K8171L5350r909m3556m2675%j0511n813R770j8759r309
14584c4573K2196J5008J5964L5318j801m4316j2314m4715m4943J688M6939J5509
14572c0040K6356J700n9709p9383j7509K2828O7887P0880r579K2540j8636n2502
$$ y = [41782, 52730, 66218, 40146, 72026, 99508, 76091, -180, 21721, 5449, -46800, -50586, -39974, -25562, -37310, -44469, -5652, 46725, 30841, 46417, 64008, 103419, 67009, 9932, -22538, -29994, -37275, -2912, 22462, 6773, -7289, 11664, 24280, 12398, -24214, -54186, -8321, 57069, 95056, 93178, 100100, 72409, 83575, 72551, 74993, 133408, 121420, 116805, 109170, 42801, -66014, -121743, -77248, -36118, -26523, -26656, -49020, -55230, -14221, 17947, 2074, -27394, -2890, 32668, 60839, 96189, 86280, 42724, 49, 49, -10462, -16275, -6505, -25264, -34573, -12377, 2631, 18595, 53913, 52112, 7796, -4518, -49233, -94176, -92488, -45549, -30040, -3684, -1984, -61693, -141076, -158585, -135757, -67870, 3010, -6569, 15971, -2665, -55167]
14560e5167K4433L4577k0619J0654J2744K4699j1822k5098O823M6836J6046l3736
14548C0370r64k4455M6236Q3586J2598K3404j2680Q533j2294r304j635j2524k3586
14535A07285n2014o7095J484N8657k1490p890j5302l1769K0959K5753K4511J2737
14523E5826m0227l6732J1561O8792N412l7891m2453M6111L0645K8487j8620l319
14511F7592j5329k5161N3357Q0234l4465p9128n6176k0042J8857r497J0615J2423
14499C280j151m837j9082J08l6866J6356N8214L8975m133m10l0633K1797j5740
14486B5878M709n297M851M3915K2509n8276p424R092k3661K4591l2662q773Q257
14473G709o2101j757R0197j535J3002J5383j9125l5120l9593J9783J0053m2797
$$ y = [-55167, -30734, 3843, -16776, -6122, 6622, 31321, 19499, -5599, 1224, 48060, 64106, 30370, 29406, 4951, 51187, 134773, 147371, 170775, 158095, 166628, 154334, 145030, 143395, 130871, 107285, 55271, -11824, -10340, 48317, 26827, 18937, 3635, -28134, -7175, 18578, 43089, 55826, 15599, -21133, -9572, 59220, 64632, 26741, -15712, 30399, 61044, 89531, 70911, 67592, 52263, 27102, 80459, 160693, 126228, 47100, -9076, -29118, -10261, -19758, -9143, 3280, 2129, -2708, -21790, -21682, -58548, -42192, 16022, 54997, 50864, 50454, 19821, 41618, 25878, 30587, 25290, 30141, 74056, 96565, 38289, 30865, 39957, 16296, 40887, 8225, -548, 7709, -54392, -56149, 34048, 32513, 45515, 60898, 41773, 6653, -32940, -13157, -3104, -45901]
14461d5901o5098l7690K5166J7810R5074J5161k8599k7375M0118L7267J6990k7601
14449A5322p2757n2183J3403P2223J0997m285j4995j862o7650J1114L7512k7320
14437h0481J3623N1160K5781M9199O0675j8961r215p642m4184p671K6193j0876
14425D7601L188J6484k3406Q152M4503k1330K1759p115n405J2854K153K249j7971
14412H3716J728j8559m8072J41J2125K4403n8567L4640K3944P0j0259j2988N005
14399C7327K5912p2164k6574j3714J345J4180J2022n770L553J2402L5681N4442
14387G8642k4634q4661q4548L5251J3769j8641J8832K4599N798K408N3952J7971
14375C8738o8570o1634N7763K5309l629J1377j0092M0567K4159q5948M221P199
$$ y = [-45901, -110999, -148689, -123523, -105713, -10639, 4522, -24077, -51452, -11334, 25933, 42923, 15322, -57435, -109618, -96215, -23992, -12995, -17280, -32275, -34137, -101787, -90673, -53161, -80481, -66858, -15698, 10083, 59282, 119957, 100996, 91781, 84139, 39955, 32284, 58477, 47601, 50789, 67273, 43867, 52019, 96522, 75192, 96951, 89836, 84431, 97285, 99438, 101687, 83716, 85444, 66885, 18813, 18954, 31079, 55482, -3085, 31555, 55499, 55569, 45310, 32322, 37327, 63239, -8925, -35499, -49213, -47868, -33688, -21666, -27436, -23883, -11481, 24200, 78642, 54008, -30653, -115201, -79950, -66181, -84822, -65990, -41391, -35593, -33185, 20767, 38738, -29832, -91466, -33703, -8394, -12023, -646, -10738, 29829, 53988, -31960, -27739, -20540]
14363b0540J0259K951J088M0354k1193m7239J9558K2133K0870l0416j399o226
14351i800l7137L7429N2744N258M8928R682l8393l8059m05K450j5630o654K5190
14338C5603M6380r56n9650m6570J5260P66l337K9106k4871m9073j678L7742M21
14325b0857J1645O0260R863j7209k3479O494J7071J5868J0404R884k8122k7786
14313B4036k2972N369K6612k9525k2980L023j2827M1696p234n4131P513J5740
14301b5680q207n82J0319J0788L5162m326O373K1608M92n6873q948p133J5684
14288a1323o159o8258k0677r229j395J1219O8770N9098n745r328L2525n8826K2526
14275C198k2746m672K4715M807j0794K9586l3357k7723n4285J9956N1015O3052
$$ y = [-20540, -10281, -7330, -6242, 34112, 12919, -34320, -14762, 7371, 28241, -2175, -3574, -9800, -46937, -9508, 43236, 48494, 97422, 107104, 68711, 30652, 30247, 32697, 17067, 10413, 35603, 81983, 81027, 21377, -25193, -9933, -9167, -12504, 16602, -8269, -57342, -59020, -21278, -20857, -9212, 51048, 60911, 43702, 20223, 26717, 43788, 59656, 70060, 79944, 51822, 24036, 1064, 6433, 33045, 3520, -19460, -16437, -29264, 12432, 5198, -48933, -41420, -25680, -33887, -34469, -24150, -13362, 21800, 17474, 23847, 45455, 45947, -10926, -19874, -27007, -11323, -17482, -85740, -106417, -115646, -117041, -105822, -37052, 22046, 16301, 6973, 39498, -19328, 3198, -19548, -24220, 495, 5302, -5492, 24094, -9263, -36986, -91271, -71315, -20300, 42752]
14263D2752q299l9004k621L6399J351J9659J6707l2592m2991l0780o259J7953
14251b7725L2568J1539k1658j2399N415L938O0883j1549J3038q12k2362m0908
14239a0032L6781j231L8832O4498l7464n9251j2546n577Q776R454K0147k3913
14227B8474o0100k1928K2115n740K657J8639K0439R076K8350p391j3748M6364
14215F7207l0506q470k0161M8784o54k0781K7875L3486p309j8628n4653o8986
14203e2796L5749L4253k9493j0719K0017J5316p024r634k7506Q346J7031j4176
14191b0636m5827M5763j9369L1431N2906L2695l3613j3052M287L3583k1465k0247
14179B6456K8471J377J1684j2305k0345J4823m8107J9999M5689k8831o0773J6575
$$ y = [42752, 34453, -4551, -7172, 29227, 30578, 50237, 66944, 34352, -8639, -39419, -45678, -27725, 4843, 16382, -5276, -17675, -12260, -8322, 52561, 41012, 54050, 53238, 30876, -10032, 26749, 25518, 64350, 128848, 91384, 32133, 19587, 14010, 22786, 32240, 52387, 28474, -31626, -53554, -31439, -37179, -34522, -15883, 4556, 13632, 41982, 34591, 20843, 67207, 36701, 28231, 8070, 56854, 56200, 35419, 63294, 96780, 89471, 70843, 16190, -52796, -17047, 17206, -12287, -23006, -2989, 12327, 5303, -4331, -31837, -23491, -6460, -20636, -66463, -20700, -40069, -8638, 44268, 76963, 43350, 30298, 34585, 68168, 46703, 26456, 54927, 56304, 67988, 55683, 35338, 50161, 2054, 22053, 67742, 38911, -21862, -5287]
14167e287N5038M957J3615M2886l8881l6268O351j7112j3759j2638L5625L4229
14155F8756R704j9300l5873j6139j1072o292j2453K1887K6215K9956M0841l5835
14143F0395n2129J1493j1861k4675L0446m0137K8556j2904l8905L2567L7276L0735
14131E0857q706l0368m0316j0777N4631k0508L1264p278k86K34L2406L2260J2506
14118I5919k7691n1032K3001j70l8560j3645J8975k8787O6794K7345N0160j3179
14106A09130K3933M8759j7926o7048j4395j8468n1651K3999K4800J827k487r7914
14094c7441j5261J0898K5724M8352L3118K0215L1861J2731j3513n3697m4394j0138
14082H455K3318O823L6737M8143m2207l5901j1507J0457l301k7589L9441Q641
$$ y = [-5287, 49751, 54708, 68323, 111209, 72328, 36060, 42411, 25299, 11540, -1098, 34527, 68756, 78460, 59160, 23287, 7148, -3924, -10216, -22669, -782, 25433, 55389, 96230, 60395, 8266, 19759, 7898, -16777, 13669, -26468, 2088, -10816, -49721, -17154, 20122, 50857, 42151, 11783, -28533, -39310, 15321, -5187, 26077, 18799, 18513, 18747, 51153, 83413, 95919, 68228, 17196, 40197, 40027, 1467, -12178, 6797, -21990, 44804, 72149, 122309, 109130, 133063, 181822, 163896, 96848, 82453, 63985, 12334, 36333, 61133, 62960, 60473, -37441, -52702, -41804, -16080, 32272, 65390, 85605, 117466, 130197, 116684, 62987, 18593, 8455, 31773, 38596, 75333, 123476, 81269, 45368, 33861, 44318, 41017, 13428, 52869, 61510]
14070F1510J5828J5484Q756J412m3189k4678m1516l1698o750l1008M8091O6862
14058C9104O7100k7410k151N151l1414n4795j6025k9462J0408n099L7466Q722
14046A595L8452p702q881J00l1969L1274J451p2931J8046M6081m1072l7925L7679
14033b5802m0170m2525L5691J5974J6210J8349K7229m1966J7469k3115m9584K4047
14021f8193P8940K2608m0954Q756j741J8536N473K4095Q464j727O2762n659o2747
14008D8613J6664R278J0130K9852l1271l4809m6471j317J9573M144K5159R072
13996E8617n1818M206K0738L809O045K6726j6054K1424j1315m0284M3400M7777
13984A13271p3122k2688N6871j1303j8105o2014k6238M2538K5229k2753Q845L7317
$$ y = [61510, 77338, 92822, 101578, 102990, 59801, 35123, -6393, -38091, -44841, -75849, -27758, 39104, 106204, 78794, 76643, 81794, 50380, -4415, -20440, -49902, -39494, -44593, -7127, 1595, 40047, 32345, 23464, 23564, -8405, 22869, 24320, -48611, -30565, 15516, -25556, -63481, -25802, -65972, -108497, -72806, -56832, -40622, -22273, 4956, -37010, -19541, -42656, -92240, -68193, 10747, 33355, -7599, 1157, -584, 17952, 23425, 47520, 55984, 54257, 117019, 111360, 48613, 65277, 74555, 84685, 114537, 83266, 48457, 1986, 669, 20242, 24386, 49545, 58617, 6799, 11005, 31743, 35552, 41597, 68323, 52269, 73693, 62378, 22094, 65494, 113271, 40149, 17461, 74332, 63029, 44924, -17090, -43328, -790, 24439, 1686, 10531, 47848]
13972D7848l9643j514k0552K2040j293m5370k1247k6820K5322N4989N0872M8895
13960I3527L0893j9073m3190k1373n8821l9625q418M0804L1138p86k084K1709
13948B4701j1101J7853J7627k3475m1660Q114O7470L9693n2417j8801k3367J2462
13936A7099k0070k4837K7353j3927N833m1771J2709L5781j7704R196Q772K4798
13924B3232l5864J8483L6990j0684Q156L558K8522K7634k8009l2492J716m5746
13912d504q787m8042M931L9528j0904k0059l248J5380J3317k0229K2418L9606
13900A9407N9066N531J2467m4324l2695k5829k0912m6738p509J512O1788L7910
13888A9674K8502K3359J0461n0344j8520L3776J6485L040J3155M8650q876j1952
$$ y = [47848, 8205, 6691, -13861, 8179, 6886, -38484, -59731, -86551, -61229, -6240, 44632, 93527, 124420, 105347, 62157, 40784, -18037, -57662, -66080, -25276, 5862, 5076, 2992, 24701, 13600, 31453, 49080, 25605, -16055, -7941, 59529, 99222, 46805, 28004, 4637, 17099, -2971, -27808, -455, -14382, -8549, -50320, -37611, -1830, -19534, -10338, -1566, 23232, -12632, 5851, 42841, 32157, 40313, 43871, 72393, 100027, 72018, 39526, 41242, -4504, -13291, -61333, -56402, -16874, -27778, -47837, -51085, -35705, -22388, -42617, -20199, 19407, 78473, 84004, 96471, 52147, 19452, -6377, -27289, -74027, -81536, -80024, -18236, 19674, 48176, 71535, 81996, 31652, 13132, 46908, 63393, 66433, 79588, 128238, 119362, 107410]
13876A07410J1878R166J1779k2842n1624k258o8501k8447J5459N1973J6859k1208
13864B9644J580K7224M5158K3069m0097n9674O494K1168L1141R587l7580k0264
13852C7450L5278J711n53K5230k8330P379k0373L4825N4676L8259k7623p2379
13840H5550r075Q573j7796l5551n5685K5532K8761l0747O8914L9630K2479m0727
13828H9858k9204l3196P687N5446L4469K029j9897p875J2283K9093j5410K783
13816A28066J6024j4558O8643j3755k6958K5510N9657k9775l3515j5411l3601
13805A30327J071J2485P1007k3256J109L7216O9748L9638m7848k7710r662m727
13793B49398j4961j585m3648R625j0763l6466j5552P3320Q609n7239M232K747
$$ y = [107410, 119288, 128454, 140233, 117391, 65767, 63509, -4992, -33439, -17980, 33993, 50852, 29644, 31224, 58448, 103606, 126675, 86578, 26904, 33398, 54566, 85707, 95294, 57714, 37450, 72728, 74439, 73886, 99116, 70786, 78165, 57792, 92617, 147293, 185552, 157929, 85550, 76475, 85048, 67252, 31701, -23984, 1548, 30309, -438, 68476, 108106, 130585, 89858, 60654, 27458, 35145, 90591, 125060, 127089, 107192, 99317, 111600, 140693, 125283, 128066, 144090, 129532, 198175, 184420, 157462, 182972, 242629, 212854, 179339, 163928, 130327, 131398, 143883, 214890, 191634, 192743, 229959, 299707, 339345, 291497, 263787, 254125, 249398, 234437, 232852, 189204, 198829, 188066, 151600, 136048, 209368, 217977, 160738, 164970, 167717]
13781A67717k5095k529m339j5656P7329j2252m2395j3682m2583M0794O0312p0999
13769A16622n8750l7067J6740J03800K2367k0232K331k2571k03j258k820J2036
13757A30995L1335k8473n2897j6680J8269k9984j4487J9248K9857L4948K2964
13746A45095K9035j4455O3539N706l934K1112m3819m7504n5988M552L6863K3719
13734A63921J1817K4576O101j8780K0194j1850p143n312m2416j8810R2274M394
13722B18966J7669j0012n906R847j1047K0146L1038m156L504l3920k5693O1855
13710B72291L8088N873j3446l1114L084m6447l9950K9682J3768l5892m4530j3375
13698A38032R498j7634m6233K4356j7231j8087J9407M2191K2457J6677K0407k7396
$$ y = [167717, 142622, 140093, 135754, 120098, 197427, 185175, 142780, 129098, 86515, 127309, 187621, 116622, 57872, 20805, 37545, 141345, 163712, 143480, 145811, 123240, 123037, 121779, 118959, 130995, 162330, 133857, 80960, 64280, 82549, 52565, 38078, 57326, 87183, 122131, 145095, 174130, 159675, 223214, 228920, 224986, 246098, 202279, 154775, 98787, 103339, 140202, 163921, 175738, 200314, 206415, 187635, 207829, 195979, 188836, 183524, 141108, 122298, 214572, 218966, 236635, 226623, 220717, 230564, 219517, 239663, 270701, 266545, 270049, 236129, 210436, 272291, 310379, 316252, 302806, 271692, 274776, 228329, 188379, 218061, 231829, 195937, 151407, 138032, 147530, 129896, 83663, 108019, 90788, 72701, 92108, 134299, 156756, 173433, 193840, 166444]
13686A66444k3164r299J479K4532K4562n9268l1698M7124J5121L9880M007k6590
13674A73130O89m1776n9459J8189N6228k1886l205m2657K5571N0458l7824m2164
13662G5294M0489M1865j7108o8776m454M0570J6358k8747l4525O838J1227J0009
13650H9040l1547p3707j2742N4026M9325N0688J7506k9977J633k470Q2719L110
13638A97604m7816k2091M535K3054L6188l927n125J4394l8805k6714l7825q280
13626H5192O891M1733J5167p067k2358p05K7421k456Q362n2855l0413K9316J9522
13613A17750k1644q42J3253J3754l803J3592J6598K1061N4673L5307m7952l7068
13601A74679j1431K8228n4792j26491j0900O2143M4978k8491J262m1481j1377
$$ y = [166444, 143280, 133981, 135460, 159992, 184554, 125286, 93588, 140712, 155833, 195713, 199720, 173130, 173819, 132043, 72584, 90773, 147001, 125115, 121910, 79253, 104824, 155282, 117458, 75294, 115783, 157648, 140540, 71764, 67310, 107880, 124238, 95491, 60966, 67804, 79031, 89040, 57493, -16214, -28956, 25070, 74395, 125083, 142589, 112612, 114245, 111775, 194494, 197604, 149788, 127697, 132232, 155286, 191474, 187547, 182422, 196816, 158011, 131297, 93472, 85192, 92083, 133816, 148983, 141916, 119558, 118853, 146274, 143818, 152180, 99325, 68912, 98228, 117750, 96106, 95264, 108517, 122271, 118468, 132060, 148658, 169719, 224392, 259699, 211747, 174679, 163248, 191476, 136684, 10193, -707, 61436, 106414, 77923, 79185, 37704, 26327]
13590B6327o932M4463J3553Q185o260K4644J5602k7401K7230M2946r997K3917
13578A76277j8039K436k6320n2079k4072J5117N4863J1748k3115J8218q505k5447
13566A01082O2154M8832j4672l4407m8875J3031N728n6213J1300K3855L2464K6646
13554A70925k274k0814j0439R228l3869J8709L2444K4750K9059j081Q910l2983
13542A92565m596K2364l4292j6938Q8555P204q1308m8876K6015j6539M9509l235
13530A80428k704M4983n9590q2507j8898Q7069L9846j9062l7341L5642R746j5257
13518A62355R540l8149n3862q673L6212m7955o7527K7702P6745N1005m933l0879
13506A11581l9715L1241R7521O3462n378k0011o9363J0868K6761J1422L7948k3003
$$ y = [26327, 19395, 63858, 77411, 85596, 79336, 103980, 119582, 92181, 119411, 162357, 152360, 176277, 158238, 160674, 134354, 82275, 58203, 73320, 128183, 139931, 116816, 135034, 126529, 101082, 163236, 212068, 197396, 162989, 114114, 127145, 132873, 76660, 87960, 111815, 144279, 170925, 168651, 147837, 137398, 146626, 112757, 131466, 163910, 188660, 217719, 216638, 225548, 192565, 187969, 210333, 176041, 159103, 247658, 254862, 173554, 124678, 150693, 134154, 183663, 180428, 177724, 222707, 163117, 80610, 61712, 148781, 188627, 169565, 132224, 167866, 177612, 162355, 171895, 133746, 79884, 71211, 107423, 59468, -8059, 19643, 96388, 147393, 142460, 111581, 71866, 103107, 200628, 264090, 258712, 238701, 169338, 180206, 206967, 218389, 256337, 233334]
13494B33334j2312O5982M9772l0600j5503k0638j16831J9006N1855J1111l327
13483B31849M236k6223P1807J3709m6886R783j4510k4189K5422P807m052j7184
13471B31569j2007J8486M4410L1963K0709K6889K298o7764k3145j5249J6339K4270
13459B98768l994M8934L904J3499p790L3995P8983j9710k8385l1579l6452R646
13447C59819L0643N5099l6917N7532O4977J7166l1654j8276n1617J9269O844j9615
13435D53270j1292O9654N9529L4606k852o39L1203P2244L0429o1207L1584M7771
13423G54300J6781j7707k2489L1649K3286J3364N6451L6833J05289J00998R3139
13412A191894K1244K7485J00765P9980J16466J19770J24991J35449R9002R5299
$$ y = [233334, 221022, 287004, 336776, 306176, 290673, 270035, 153204, 172210, 224065, 235176, 231849, 236085, 209862, 281669, 295378, 248492, 258275, 243765, 219576, 244998, 252805, 248753, 231569, 219562, 238048, 282458, 314421, 335130, 362019, 364317, 296553, 273408, 258159, 274498, 298768, 294774, 343708, 347612, 361111, 353321, 387316, 466299, 446589, 418204, 386625, 350173, 359819, 390462, 445561, 408644, 466176, 531153, 548319, 516665, 498389, 446772, 466041, 472885, 453270, 441978, 511632, 571161, 605767, 602915, 602276, 633479, 705723, 736152, 674945, 706529, 754300, 771081, 753374, 730885, 762534, 785820, 799184, 855635, 892468, 997757, 1098755, 1191894, 1213138, 1240623, 1341388, 1421368, 1537834, 1657604, 1782595, 1918044, 2017046, 2112345]
13402B112345J67315K20454K10261K94120L36998L67263L84566M50728N12802
13393E056852N09539O26291P48343Q18721R21228R63668R67122J036819R98213
13384A2646796R56666R76735Q43057O89746O20344M97717L87820L33833J58093
13375A8110807J02458O3347Q5242J23592R1819K28516L33739N42428Q11037J031853
13365B1524838J248540J492924J730418J827711J910458J916913J834153J696086
13357C5182041J432262J125997P07225K39114k22896o28772j020546j366969j530775
13348C3916681j613122j641670j559378j585121j436099j079282q55624o18496
13340B3527889l81613j23984L4354J03744J92038K79295K88651K35363N9485l3073
$$ y = [2112345, 2279660, 2500114, 2710375, 3004495, 3341493, 3708756, 4093322, 4544050, 5056852, 5566391, 6192682, 6941025, 7759746, 8680974, 9644642, 10611764, 11648583, 12646796, 13603462, 14580197, 15423254, 16113000, 16733344, 17231061, 17618881, 17952714, 18110807, 18213265, 18276612, 18361854, 18485446, 18577265, 18805781, 19139520, 19681948, 20492985, 21524838, 22773378, 24266302, 25996720, 27824431, 29734889, 31651802, 33485955, 35182041, 36614303, 37740300, 38447525, 38686639, 38463743, 37834971, 36814425, 35447456, 33916681, 32303559, 30661889, 29102511, 27517390, 26081291, 25002009, 24146385, 23527889, 23146276, 23022292, 23056646, 23160390, 23352428, 23631723, 23920374, 24155737, 24215222, 24182149]
13330B4182149j63226l41372m81396o17266p44585q39187q81315q85823r06201
13321A8321778r00852r96537r52835q30076p27992n78688m85602k81374j52289
13312A2415533q0172M1536J82787L75771M88813O43961P55300P65955Q65736R87997
13302A7443217J023210J046508J010567Q94944P76859O54534N58654M69979L23059
13293B4201531K01708R6815k1717q8260r2156j56646j36006j8752J98800M44545
13283B4629862O80935R64308J245579J427057J650570J936912J990070J984974
13275C6510267J864806J692424J369984J035554O28275K31586k58135o14445r63232
13266D1497084j392280j746809j870370j905248j879504j824137j611072j285621
$$ y = [24182149, 24018923, 23677551, 23196155, 22578889, 21834304, 20995117, 20113802, 19227979, 18321778, 17420926, 16424389, 15471554, 14641478, 13913486, 13334798, 12849196, 12567822, 12415533, 12335361, 12376897, 12559684, 12935455, 13424268, 14068229, 14823529, 15589484, 16455220, 17443217, 18466427, 19512935, 20523502, 21418446, 22195305, 22849839, 23408493, 23878472, 24201531, 24403239, 24500054, 24478337, 24390077, 24297921, 24141275, 24005269, 23986517, 24185317, 24629862, 25310797, 26275105, 27520684, 28947741, 30598311, 32535223, 34525293, 36510267, 38375073, 40067497, 41437481, 42473035, 43101310, 43332896, 43074761, 42460316, 41497084, 40104804, 38357995, 36487625, 34582377, 32702873, 30878736, 29267664, 27982043]
13258B7982043j128848q24315n82673l64642j70243p7585j3036K3128R1833K6553
13248B4962215n3535j65367l12483m72649o14126o91349p74705r66061j110665
13239A9801275j086943j097095j123604j096606j055794r93998r24971r21704
13231A1500560p99007o76799n26765m74367m99248l98914m36115l39245k91515
13222G058585k78267k27627j98241k97536k81992k46924j19750j44978k01917
13213E061353j21886j85892j54633j07250j69323j74459j03408j25526o6081j23231
13203C729664j13286q4758o6400l1594n6019j43889j13427o4029p5243n7168j10204
13192B813647r4667j14296m7664k4825o2976o5922q1610n1528k7984n6178p5431
$$ y = [27982043, 26853195, 26028880, 25446207, 25081565, 24911322, 24833737, 24820701, 24843829, 24935662, 24962215, 24908680, 24743313, 24430830, 23958181, 23344055, 22652706, 21878001, 20911940, 19801275, 18714332, 17617237, 16493633, 15397027, 14341233, 13347235, 12422264, 11500560, 10701553, 10024754, 9497989, 9023622, 8524374, 8125460, 7689345, 7350100, 7058585, 6780318, 6552691, 6354450, 6056914, 5774922, 5527998, 5408248, 5263270, 5061353, 4939467, 4753575, 4598942, 4491692, 4322369, 4147910, 4044502, 3918976, 3852895, 3729664, 3616378, 3531620, 3465220, 3433626, 3377607, 3233718, 3120291, 3056262, 2981019, 2923851, 2813647, 2718980, 2604684, 2557020, 2532195, 2469219, 2403297, 2321687, 2270159, 2242175, 2185997, 2110566]
13181B110566o7937m6739m179J4025n6553p0859l6781j6110l0918m1799j7934
13170A734782o3882n3837o745n1934j01090m8222n2837n607L6919K1442k0468
13159A388521m7023m1821R456k6614p8249n9511n7225l1796n5239J4712m353j6005
13147I94853J44l0870l0224r084l1661n6620j7277j8646K1626K1897J4346j1686
13135H46798k1596j4596k178k3091l0582o3979k6659N46l6645K8079Q7181k6172
13123G17106j4355K3071l2874n4444J3744K2869q9326m3685m6567J2329M0817
13112E48685K9520l010Q429j9590K2405m1063n3672M3235k8270p4321n4753J8302
13100C95897N2702J5226k4708J4486J3661R026n148m1937L2376k9555m6986l0683
$$ y = [2110566, 2042629, 1995890, 1991711, 2005736, 1949183, 1878324, 1841543, 1825433, 1794515, 1752716, 1734782, 1670900, 1617063, 1610318, 1558384, 1457294, 1409072, 1356235, 1350628, 1387547, 1408989, 1388521, 1341498, 1299677, 1309133, 1282519, 1204270, 1144759, 1087534, 1055738, 1000499, 1015211, 1010858, 994853, 994997, 964127, 933903, 924819, 893158, 836538, 819261, 800615, 822241, 844138, 858484, 846798, 825202, 810606, 808428, 785337, 754755, 690776, 664117, 664663, 628018, 656097, 743278, 717106, 702751, 725822, 692948, 638504, 652248, 675117, 585791, 542106, 495539, 507868, 548685, 578205, 575195, 583624, 564034, 586439, 545376, 491704, 534939, 506669, 432348, 377595, 395897, 448599, 463825, 439117, 453603, 467264, 476290, 471142, 429205, 461581, 432026, 385040, 354357]
13088C54357J8745L4353J0616n9503J0630L8586J0784p9044j6968L3532n000J4740
13076C65828m362l7680L1155m5652j08638j7907L4043K7468K6045j5974j9704
13065B34622j9116R184J3258j9824K5924K0794n0581j9696j2469K3437m3916j4856
13053A46761M6652k9092j0171N6623o15P67j6323m19n500P426K0104m5883m2834
13040A27496j605L2790K8278n430k3699j5216J0522N3718M9027J5339M2513j9379
13028B94354n9483k5056L7972K7394R891J4185j0426l1552K6085k8601K0632O1061
13016C36456j7697l8570j3242j5171m3357p0021K6013O9620k418l7185n5175k1980
13004A17273J257L0892J8149J274p182J0723m8928J0525K3001M0996l5071m5121
$$ y = [354357, 373102, 407455, 418071, 358568, 369198, 407784, 418568, 339524, 322556, 356088, 351088, 365828, 361466, 323786, 354941, 309289, 200651, 182744, 216787, 244255, 270300, 254326, 234622, 215506, 224690, 237948, 218124, 244048, 264842, 214261, 194565, 182096, 205533, 161617, 146761, 193413, 164321, 154150, 210773, 210158, 210925, 194602, 194183, 188683, 196109, 216213, 170330, 127496, 125891, 158681, 186959, 181529, 157830, 142614, 153136, 206854, 255881, 271220, 313733, 294354, 234871, 209815, 247787, 275181, 285072, 299257, 288831, 257279, 283364, 254763, 275395, 336456, 318759, 280189, 266947, 251776, 208419, 138398, 164411, 234031, 231613, 194428, 139253, 117273, 118530, 149422, 167571, 168845, 161663, 172386, 123458, 133983, 156984, 197980, 162909, 117788]
12992A17788j6779m9062j8366J0501M599L6508M1483K5667k1670M13J1049l0146
12980A11985K7005j4036O0721L3477O267n796L5774L302j1380O7931O6189o8005
12968C13434p3878m8735n4155j3573m8033L1167J968K5833l9662j751K0591k779
12956A10427n274J109K6450j6933j353J9342l7479J3596J014J7532O615J322M3026
12943A79394P763k5340L646K9019K2979L0075M6341k6301k0912L0423K0623r182
12931B88528j5065k3193L185k2920k0284n0336k8201L5061J1100M1413m492L4530
12919B49326J445J7104k6196j6780j0374L0047N8382K2679N6445J6364r5844o4499
12907B38099k9954m0863J3636j4533K973M3308J2905K6104j6447k6898K2188L7238
$$ y = [117788, 101009, 51947, 33581, 44082, 48681, 85189, 126672, 152339, 130669, 131082, 142131, 111985, 138990, 124954, 185675, 219152, 225419, 219623, 255397, 258699, 247319, 315250, 381439, 313434, 239556, 190821, 136666, 123093, 75060, 106227, 108195, 134028, 94366, 92615, 113206, 110427, 105153, 106262, 132712, 115779, 114426, 133768, 96289, 109885, 110899, 128431, 135046, 136368, 179394, 187157, 161817, 165463, 194482, 217461, 247536, 293877, 267576, 246664, 277087, 297710, 288528, 273463, 250270, 253455, 230535, 210251, 159915, 131714, 166775, 177875, 219288, 214796, 249326, 250771, 267875, 241679, 224899, 214525, 244572, 302954, 325633, 382078, 398442, 302598, 238099, 208145, 167282, 180918, 166385, 169358, 212666, 225571, 251675, 235228, 208330, 230518, 267756]
12895B67756l1375m1160j2259J6743L4420J2841m1510k3014m131l3910l131j4932
12883A26338K504j2617n042M6268L1142M4236M0511o9011p8274j2285M6629L743
12871A64142J0370L813m9447m5548L5603j1543J9255M1806M3092j736n4004k5953
12859A29850K3039K1259j2686n4075L8495Q6847R106p170l5787k1198j459m6100
12847A30121J8774L25J7992j7861k5412j5689L0216L6793P213N25N149O0555M5896
12834B94597k6622k5995k4442K7182N0492N7765J355l1701o671P3306K4101n6007
12822C57360o2954n9960J32L4806l0572m6626M0894L2634L6466L0010k3776n4823
12810B53591k9385j1345L73j4416K2403l5026o298M2802N9216j3844l8495o571
$$ y = [267756, 236381, 195221, 182962, 199705, 234125, 246966, 205456, 182442, 178311, 144401, 141270, 126338, 128842, 116225, 111183, 157451, 188593, 232829, 273340, 204329, 126055, 113770, 160399, 164142, 174512, 178325, 128878, 83330, 118933, 107390, 126645, 168451, 211543, 209807, 155803, 129850, 152889, 174148, 161462, 107387, 145882, 232729, 241835, 234665, 198878, 177680, 176221, 130121, 148895, 149220, 167212, 149351, 123939, 108250, 138466, 175259, 182472, 182997, 188146, 248701, 294597, 267975, 241980, 217538, 244720, 295212, 352977, 354332, 322631, 315960, 389266, 413367, 357360, 294406, 234446, 234578, 269384, 238812, 192186, 233080, 265714, 302180, 332190, 308414, 253591, 224206, 212861, 213234, 198818, 221221, 186195, 179897, 222699, 281915, 268071, 229576, 223005]
12798B23005m3062k0387M2010J12269J4980J8053o591l3122k0083m5945o2968
12787A78159k3182K0609K6467l6462o0810O3071J980j0261q166l2047K6075J6101
12775A61534J6457l1992K3550L9779J617l2486p3460k4499N1691K0128k9605N2766
12763A75480j7301k568m6861m7441M6021L8083o6305l9131N1300O3873o1069m2483
12751E1598O6653K0336K176J1485m0374J4924K2511K9647L4417k092r333o8295
12739A33653m3067o87M0540M6828N055k2289j9678M2336Q2625L588l9153k9614
12727B00137j2657L060o799Q229j5190m0560l850J2821j1082L386M5647J2348
12715A95490j3253L2340K920K075K195p532l607J9269k9286q99k815k9047j9771
$$ y = [223005, 179943, 159556, 201566, 313835, 328815, 346868, 340277, 307155, 287072, 241127, 178159, 154977, 175586, 202053, 165591, 104781, 167852, 169832, 159571, 151405, 119358, 145433, 161534, 177991, 145999, 169549, 209328, 210945, 178459, 104999, 80500, 132191, 152319, 122714, 175480, 158179, 155611, 108750, 61309, 107330, 145413, 79108, 39977, 91277, 155150, 94081, 51598, 118251, 138587, 140763, 152248, 111874, 126798, 149309, 178956, 213373, 211281, 201948, 133653, 90586, 89899, 130439, 177267, 182322, 160033, 140355, 182691, 265316, 268904, 229751, 200137, 187480, 190540, 183741, 191970, 176780, 136220, 132370, 145191, 134109, 137495, 183142, 195490, 182237, 214577, 217497, 219572, 221767, 214235, 210628, 229897, 200611, 199712, 196897, 167850, 148079]
12702A48079M6330K0759n6981j7201O4411K6120N8259O5174L5033k9252k8784
12691C31947K721Q035j2180J9661M3705J6149j3582K5076m1643O95K4525j7553
12679C87556J2838K7033n0376K9205J00723K8946J0554J3203M5332J4342m6673
12668E72683o6657l8812L9399M6940L7723o335j6286l2330J9253N8088k2593k3487
12656E67586q4271n3963k9389p008l837Q641j6649J1792J5045K0539q758j9544
12644D00184l1226m6627K7832m5479k5314J23N961n744K0645O9014K9559o4420
12632C34508k8330L5407j6216O314l169K2100K443j3571R600j6828m5163j8101
12620B68994K2826J0447J086m3627L408O0608P0836O302l9972j5057q004M8742
$$ y = [148079, 194409, 215168, 158187, 140986, 205397, 231517, 289776, 354950, 389983, 360731, 331947, 334668, 342703, 330523, 350184, 393889, 410038, 396456, 421532, 379889, 380584, 405109, 387556, 400394, 427427, 377051, 406256, 506979, 535925, 546479, 559682, 605014, 619356, 572683, 506026, 467214, 506613, 553553, 591276, 584941, 568655, 536325, 555578, 613666, 591073, 567586, 483315, 429352, 399963, 392955, 389118, 397759, 381110, 392902, 407947, 428486, 419728, 400184, 368958, 322331, 350163, 304684, 279370, 279493, 285454, 279710, 300355, 369369, 398928, 334508, 306178, 341585, 325369, 331683, 328514, 350614, 353057, 339486, 349086, 332258, 287095, 268994, 291820, 302267, 303353, 259726, 263134, 323742, 394578, 400880, 360908, 345851, 337847, 386589]
12608C86589J304j8052J6576M3377P2870L302r725q343j0435K088L0266l3249
12596D76568O587N0737k2740n7167N1942J4270L5426O6935M1191M7682j6455l6840
12584F58136m3470J1947j4167m0615n6356K5559J3710J5033L4888o4639k7770
12573E12256L6342J0485r914J1110r453J2909j5481n0611n0557K1102j9652j0033
12561D38503j3116m800K8589j8910n6637k1234M9215J513j5483k8595j8443j5649
12549C24953Q79l5723l8815J2427M0257j4817p9132l5589J0571M5544m9569o6046
12537A14940L7572P6448J163k2862l9396k2327M2656N9737K1979l2758n7955K1114
12525B00311J8808M023k5221p2628j6338N0567M7703j8207n5455p117j3971m2274
$$ y = [386589, 387893, 369841, 386417, 429794, 502664, 505966, 496241, 487898, 477463, 479551, 509817, 476568, 483155, 533892, 511152, 453985, 505927, 520197, 555623, 622558, 663749, 711431, 694976, 658136, 614666, 626613, 612446, 571831, 515475, 541034, 554744, 569777, 604665, 540026, 512256, 548598, 559083, 549169, 560279, 550826, 563735, 548254, 497643, 447086, 468188, 448536, 438503, 425387, 420587, 449176, 430266, 373629, 352395, 401610, 403123, 387640, 359045, 340602, 324953, 325832, 290109, 251294, 263721, 303978, 289161, 210029, 174440, 185011, 230555, 180986, 114940, 152512, 228960, 230123, 207261, 167865, 145538, 188194, 247931, 269910, 237152, 179197, 200311, 219119, 223142, 197921, 125293, 108955, 159522, 207225, 189018, 133563, 126446, 112475, 70201]
12513G0201J3253L3042J9J3987o511K5960M9457N072O919K9356R838n0100R511
12500B10004J0868j0686K9698j0375j734j9213n5801m1515K0652L222M4416k4213
12488A55323l6361K7573M905n273j0182K6946p418j553l2890l6699l5307K103
12476E1167L3365O513L1106O7957L0227j1919p6513m8173L0076K6078k6270r633
12464A03981N9806K281l1495k2398L7773K2594k7672l4210l619J6975K6487q269
12452A42234j4770J353j3953J8497L4163K3195p109L5109p661J4817n8589l2255
12440A35031J2799J5953J3620O072k939k3678k4164l5423k3543J7149J6913N0978
12428A58768O6131M9954k7942m9976j0056o7725p2098j9546L9462L5286J3331
$$ y = [70201, 83454, 116496, 116515, 130502, 123991, 149951, 199408, 204480, 211399, 240755, 250593, 200493, 210004, 220872, 210186, 239884, 229509, 227775, 208562, 152761, 111246, 131898, 135120, 179536, 155323, 118962, 146535, 151440, 146167, 135985, 162931, 155513, 153960, 121070, 84371, 49064, 51167, 84532, 91045, 122151, 190108, 220335, 208416, 131903, 83730, 113806, 139884, 113614, 103981, 163787, 166068, 134573, 112175, 149948, 172542, 144870, 110660, 107041, 124016, 150503, 142234, 127464, 128817, 114864, 133361, 167524, 190719, 183610, 218719, 211058, 225875, 167286, 135031, 147830, 163783, 177403, 183475, 180536, 156858, 132694, 97271, 73728, 90877, 107790, 158768, 224899, 274853, 246911, 196935, 186879, 119154, 47056, 27510, 66972, 102258, 115589]
12417A15589N2147P1678k5025o5556o3261k307q436M2155L2042K040K4846M8578
12405B24490J0352p6431l4508J1612j127K3173L7772k3225k1822p029j1573J2224
12393A43908M8098n8756J9943K9309l3541K4518j9785J9253j439L0435p574m55
12381A93914L627K035j990n6368o6635Q934p398J6166M0043j9179Q27L2769N7291
12368B04036N3207q314k4708k1614J4356k4093Q431j482O0095m6320J0384k8408
12356A95570q1950j9720L814L9100J9035l0069k3837L0464O4715L6483l0452m6688
12344A56465m8902m0415m303J367K6273P494j8714k267l8467N1037N4383M7192
12332A91143K8573m5470k2710n8627m536N9514K7795j3025O8558j0050q838k8369
$$ y = [115589, 167736, 239414, 214389, 148833, 85572, 83265, 74829, 116984, 149026, 151066, 175912, 224490, 234842, 158411, 123903, 135515, 134388, 157561, 195333, 172108, 150286, 143257, 131684, 143908, 192006, 133250, 153193, 182502, 148961, 173479, 153694, 172947, 171508, 201943, 194369, 193914, 197541, 199576, 197586, 141218, 74583, 83517, 76119, 92285, 132328, 113149, 113976, 146745, 204036, 257243, 248929, 224221, 202607, 216963, 192870, 201301, 199819, 259914, 213594, 223978, 195570, 113620, 93900, 97714, 136814, 155849, 125780, 101943, 132407, 197122, 233605, 203153, 156465, 107563, 67148, 62845, 64212, 90485, 97979, 79265, 76998, 38531, 89568, 143951, 191143, 219716, 174246, 151536, 92909, 88373, 147887, 175682, 162657, 231215, 221165, 212327, 183958]
12320A83958m2028k7676M8137K1379m941K7359L811K5747o857K9081j8082l2641
12308B07247l2431r516k5274m3596Q977O5475N8376M818n5667l7619l7712j6438
12296H6640M8367P7292l9348l3134K2918j3733l2261k4553N786L4776L2446m963
12284A60233l662p9111k093K6906L6543L1412L8164P938L4190M548k9607L5010
12272B60471k2347l1495K1460O737n7558o536L2022L9924J724j5928K0990K6788
12260B76252j9622k1960L428j427J6965j1624L1251L3954k9943k5117o9058l9367
12248A43732M7696L3445J4171j1317l3234R957Q774p980J5200M2612Q3739J8267
12236C65062j6120m7765p4051L700o734j2686k6997N2309j4545m2010j0061M4985
$$ y = [183958, 141930, 114254, 162391, 183770, 178829, 206188, 209999, 235746, 228889, 257970, 239888, 207247, 174816, 165300, 140026, 96430, 105407, 170882, 229258, 234076, 178409, 140790, 103078, 86640, 135007, 212299, 172951, 139817, 162735, 149002, 116741, 92188, 97974, 132750, 165196, 160233, 156571, 77460, 75367, 102273, 138816, 170228, 208392, 216330, 250520, 255068, 225461, 260471, 238124, 206629, 228089, 234826, 177268, 170732, 202754, 242678, 244402, 228474, 249464, 276252, 256630, 234670, 238098, 236671, 253636, 242012, 273263, 307217, 277274, 252157, 183099, 143732, 191428, 224873, 239044, 227727, 194493, 204450, 213224, 205244, 220444, 263056, 346795, 365062, 348942, 301177, 227126, 230826, 224092, 211406, 184409, 236718, 222173, 180163, 170102, 215087]
12224B15087J6607N0468K9736m4211j3758J9193K4876J3382n3316K0678J8864
12213B97606J6781j317q193r805j788K7208N8241L1080J8167l5527J3060J5210
12201D20723j2893l6589K2834J4818J1015J920l4551m4991N5908N8631R068K787
12189D68680K7516j8346K2256J7285q9829j4648J8476K5471m1837L2714J9444
12178D67182q778N113m5932r0123J0477P033L1129k576J7472L2059O288j5002
12166D14342j7036l4516j351J8552o992L9589l6376k2490L8189K2374K3426O0668
12154D98379N415j7506m9987p3877l00M8820J4313j439L0034l379m2340j8027
12142C90106m101M7484O1700N9561n1583k4788m4864J9822M8137l6051J948P982
$$ y = [215087, 231694, 282162, 311898, 267687, 253929, 273122, 297998, 311380, 258064, 278742, 297606, 314387, 313070, 304877, 295072, 293284, 320492, 378733, 409813, 427980, 392453, 405513, 420723, 407830, 371241, 394075, 408893, 419908, 421828, 387277, 342286, 398194, 456825, 465893, 468680, 496196, 477850, 500106, 517391, 427562, 412914, 431390, 456861, 415024, 447738, 467182, 458404, 463517, 417585, 327462, 337939, 344972, 376101, 373525, 390997, 423056, 429344, 414342, 397306, 362790, 361439, 379991, 372999, 412588, 376212, 353722, 391911, 414285, 437711, 498379, 503794, 486288, 436301, 362424, 362124, 410944, 425257, 423818, 453852, 450473, 408133, 390106, 386005, 433489, 495189, 554750, 503167, 478379, 433515, 453337, 501474, 465423, 467371, 475353]
12130D75353Q312j756k2563k4490j6610O0899P3468J7694K7845K2158j4852j2762
12118E92696O086q907k63J2496m2684l6830j8469K8846j4515k0555r280O6224
12106E54845j0801O3712O7322O435l442J1828J9805l7776j4563l4059J6963J4870
12094F55139O0562P541Q81o943O1720L9002m3594p847j3643m679L2120L5946M6512
12081H62717l146J5852R3818j863o9595P604J9648j7398p857j672K2155P6173
12069I96436R869L232j327K2587J810r853j6206K0275L3857J1806K7022J1270
12057A110778J685K3766O3598j5802m7800J3488p952N4965N0689K8812l31J7444
12045A293340p400l680p062L7332M1975L5008K6122K4778j9767M7286N2729L2376
$$ y = [475353, 483665, 481909, 459346, 434856, 418246, 479145, 552613, 570307, 598152, 620310, 605458, 592696, 598782, 589875, 589612, 602108, 559424, 522594, 504125, 532971, 518456, 497901, 488621, 554845, 544044, 607756, 675078, 681513, 678071, 689899, 709704, 671928, 657365, 623306, 640269, 655139, 715701, 723242, 724123, 717180, 778900, 817902, 774308, 766461, 752818, 748139, 780259, 816205, 862717, 859571, 875423, 969241, 967378, 897783, 905387, 925035, 907637, 899780, 898108, 920263, 996436, 1006305, 1009537, 1008210, 1030797, 1032607, 1022754, 1006548, 1026823, 1060680, 1072486, 1099508, 1110778, 1112463, 1136229, 1199827, 1184025, 1136225, 1149713, 1141761, 1196726, 1247415, 1276227, 1275896, 1293340, 1285940, 1282260, 1275198, 1312530, 1354505, 1389513, 1415635, 1440413, 1420646, 1467932, 1520661, 1553037]
12033A553037m5696M367O9212J07185J6956M3695J6420J4996k963K5409J4929
12022A817547O0930Q0772L7043K7692M0156M2302J9978j45M0139J08868J0928
12011B286210N380M4480M7140J06016N8478Q3516P8631J02907P9864P9565N3039
12000C025226O6824P4805J24376J30796J15963O3262N6879R3979N9803J11122
11990C923035K04541J59589N1839Q2936J35221J47947J70456J49779P9509J18590
11980E223442J68322J92838K50582K24135J75319K32798K51049K94216K50621
11971G263322K83188L21457K81692L51863L98912M30644L89969M32641M43730
11962A0597418M90776N45684N24134N60851O34825O79166P15983P35732Q16944
$$ y = [1553037, 1507341, 1511708, 1580920, 1688105, 1705061, 1748756, 1765176, 1780172, 1777209, 1802618, 1817547, 1878477, 1959249, 1996292, 2023984, 2064140, 2106442, 2126420, 2126275, 2166414, 2275282, 2286210, 2291590, 2336070, 2383210, 2489226, 2547704, 2631220, 2709851, 2812758, 2892622, 2972187, 3025226, 3092050, 3166855, 3291231, 3422027, 3537990, 3601252, 3658131, 3752110, 3811913, 3923035, 4127576, 4287165, 4339004, 4421940, 4557161, 4705108, 4875564, 5025343, 5104852, 5223442, 5391764, 5584602, 5835184, 6059319, 6234638, 6467436, 6718485, 7012701, 7263322, 7546510, 7867967, 8149659, 8501522, 8900434, 9331078, 9721047, 10153688, 10597418, 11088194, 11633878, 12158012, 12718863, 13353688, 14032854, 14748837, 15484569, 16301513]
11953A6301513Q90621R47011J030585R78262J070336J125978J204449J302788
11945B4851543J409366J388918J450312J537669J539493J545662J591431J577556
11937C6891950J483783J376247J304072J205211J085443R33473P05979M92269
11929D5478427L38442J52621j72156l77768n31764p15100q63371j035808j133889
11920D1139634j236534j345925j357541j349186j323045j295051j252110j251738
11912C0728504j217772j196536j207988j098326j009780r89353j000912r02434
11904B2105403q55552q13297p55773p04445o98642p20949o49981n70240n15988
11895A5820536n35470n30648m54957m92534n07551m50934l94450l81910l02042
$$ y = [16301513, 17192134, 18139145, 19169730, 20147992, 21218328, 22344306, 23548755, 24851543, 26260909, 27649827, 29100139, 30637808, 32177301, 33722963, 35314394, 36891950, 38375733, 39751980, 41056052, 42261263, 43346706, 44280179, 44986158, 45478427, 45816869, 45969490, 45797334, 45419566, 44887802, 44172702, 43309331, 42273523, 41139634, 39903100, 38557175, 37199634, 35850448, 34527403, 33232352, 31980242, 30728504, 29510732, 28314196, 27106208, 26007882, 24998102, 24008749, 23007837, 22105403, 21249851, 20436554, 19680781, 18976336, 18277694, 17556745, 16906764, 16336524, 15820536, 15285066, 14754418, 14299461, 13806927, 13299376, 12848442, 12453992, 12072082, 11770040]
11886A1770040k49977l47900l17819l08442l07039k80318k81141k76610k71177
11877I129617j83209k40066k58761k69049j88577j90808j86736j76234j21517
11868G314660j62183k22040j92502j67309q3926j89639j82104k03509j86830j34113
11858E590505r4995j17406q8329j26234j04897r8003o6688j11270j00770o8017
11848D613896q9400j34337j26268o7816q3809j04999n7366q5063q8209o5653m4343
11837C666633r3159m7481m8027k9288n6264o8567p0171j05245m3894q0299r5706
11826B928532r4159n2183K2606p584l7189n5524j1261k8764q9439n8813q9954
11815B426268n1783k2077m9071R833J9360l3417l1239j15475n4596j9299j1255
$$ y = [11770040, 11520063, 11172163, 10854344, 10545902, 10238863, 9958545, 9677404, 9400794, 9129617, 8946408, 8706342, 8447581, 8178532, 7989955, 7799147, 7612411, 7436177, 7314660, 7152477, 6930437, 6737935, 6570626, 6486700, 6297061, 6114957, 5911448, 5724618, 5590505, 5495510, 5378104, 5289775, 5163541, 5058644, 4960641, 4893953, 4782683, 4681913, 4613896, 4524496, 4390159, 4263891, 4196075, 4112266, 4007267, 3949901, 3864838, 3776629, 3710976, 3666633, 3573474, 3525993, 3477966, 3448678, 3392414, 3323847, 3253676, 3148431, 3104537, 3024238, 2928532, 2834373, 2782190, 2804796, 2797212, 2760023, 2704499, 2693238, 2664474, 2575035, 2516222, 2426268, 2374485, 2352408, 2303337, 2313170, 2332530, 2299113, 2267874, 2152399, 2097803, 2078504, 2067249]
11804B067249m8833n6888q6800k5499o3715k2566K3667k0614m7153J6603l0786
11793A704665m0113k5483l9744k8972P233m7364l2515L45j3898k9980N4153N113
11781A513440n5401m8006k6503l0446K5620j0996m5401l45N9412m51l7739J1662
11769A354846l9610R545K0158l3410o9496p1688K0952P0930J986n9987n0048r039
11757A145139M7718R618m3669l3433J5944k6553j4783K1753M3502O129m9987o2449
11745A058929k0530j0737k072L488k8043q0339l1156K9200k6606J4432O0115K2413
11733I89094J4101m6321o9387m4916k4161K5525L3627o6060m8093J6664J8353
11722G98426L937k2319m4241j0853j9828r6994k4524O1041K1179j8364p021M3539
$$ y = [2067249, 2018416, 1961528, 1874728, 1849229, 1785514, 1762948, 1786615, 1766001, 1718848, 1735451, 1704665, 1664552, 1639069, 1599325, 1570353, 1577586, 1530222, 1497707, 1498052, 1484154, 1454174, 1508327, 1513440, 1458039, 1410033, 1383530, 1353084, 1378704, 1367708, 1322307, 1321962, 1381374, 1380923, 1343184, 1354846, 1315236, 1324781, 1344939, 1311529, 1242033, 1170345, 1191297, 1262227, 1264213, 1204226, 1154178, 1145139, 1192857, 1202475, 1158806, 1125373, 1141317, 1114764, 1099981, 1121734, 1165236, 1171365, 1121378, 1058929, 1038399, 1027662, 1025590, 1029078, 1001035, 920696, 889540, 918740, 892134, 906566, 966681, 989094, 1003195, 956874, 887487, 842571, 818410, 843935, 877562, 811502, 763409, 780073, 798426, 802363, 780044, 735803, 724950, 705122, 608128, 583604, 644645, 665824, 647460, 640439, 683978]
11710F83978J0545q200q642J4405k6890l7487j1947l16J6535o3426j2374k5405
11698E30776k1006k2544l5171j8960N5494M825K7362k813J5610l1055l9081N6585
11686E20022N7457p657J577j8254L4075j46k6993m9163l6461J4299O6799L2572
11674E88127l1669K0746J0443j343J4592o4234K704l0035k4448l0492l5648K8428
11662D47171R1152M7172k8782m953j1523m0607j061K3820J6858M4767m779k7056
11650E52179p7213n4851N091n890j5398O3108O6300o3331p807M706k3663n0768
11638C92463p5784J9220J1433k5181k9255N2464M8773m4577L985O428l8708K3161
11626C44422K3931r279l0604P873K2436J2467l4132N6983L9192k3956k7050l6858
$$ y = [683978, 694523, 686323, 677681, 692086, 665196, 627709, 615762, 615446, 631981, 568555, 556181, 530776, 509770, 487226, 452055, 433095, 488589, 493414, 520776, 517963, 533573, 502518, 463437, 520022, 577479, 569822, 571399, 553145, 587220, 587074, 560081, 510918, 474457, 488756, 555555, 588127, 556458, 577204, 587647, 586304, 600896, 536662, 539366, 509331, 484883, 454391, 418743, 447171, 538323, 585495, 556713, 551760, 540237, 499630, 498569, 522389, 539247, 584014, 579235, 552179, 474966, 420115, 425206, 419316, 403918, 467026, 533326, 469995, 462188, 466894, 443231, 392463, 316679, 335899, 347332, 322151, 292896, 345360, 394133, 349556, 353541, 359969, 321261, 344422, 368353, 359074, 328470, 336343, 358779, 371246, 337114, 394097, 433289, 409333, 382283, 345425]
11614C45425m8499Q253J2632M4830l4086m4066M136l100J565j296K2926o1826
11602B46894l1650j2816J9935L5373N5694l217k8441M9366L9371k1406n6791K8303
11590C20615L2381K1330k1083k1409k2253k2468O921K5319m506J0915J6377N6245
11578C98384k0538j7938p296K0980j4114K0846J1361k3047j8708m8833o1155p935
11566B32007L2953O2785P081N4875j0637j5076L3570m0281n6072j2911k3504M0
11554B64830O1083P3881p557j1091n382n9574K440m8484m8069M828L5691L2986
11542B95582l4439N608O8400J1114k1462P263j0481O2806Q569q061l505l1226
11530C50168m7789k2430j4998m9649K3495N2085P3702N3174R90m1361n728k3167
$$ y = [345425, 296926, 305179, 317811, 362641, 328555, 284489, 288625, 285525, 287090, 285794, 308720, 246894, 215244, 202428, 222363, 257736, 313430, 310213, 281772, 331138, 370509, 349103, 292312, 320615, 352996, 374326, 353243, 331834, 309581, 287113, 294034, 319353, 314847, 325762, 342139, 398384, 377846, 359908, 352612, 373592, 359478, 380324, 391685, 368638, 349930, 301097, 239942, 232007, 264960, 327745, 334826, 389701, 379064, 363988, 397558, 357277, 301205, 288294, 264790, 264830, 325913, 399794, 392237, 381146, 375764, 316190, 318630, 270146, 222077, 226905, 262596, 295582, 261143, 266751, 335151, 346265, 324803, 332066, 321585, 384391, 392960, 384899, 381394, 350168, 302379, 279949, 264951, 215302, 238797, 290882, 364584, 417758, 418748, 377387, 371659, 348492]
11518C48492m4053l0014p964L4081N7593L2413N9123l6735o266K1303j7877J049
11506D11145l408R176k3776o64j4507J3172n586k333m3198L791K1467L5086K8529
11493D28894L793p5943j9314L781O1921J1410K7776R053J2703L0010L780k6021
11481D71843m284L9665M0650j1331r826J1025k7378j5885L706j6045o154q637
11469D67349J9938N855K0358m95L9061K8700Q577P27k479J9353R427N6708P1659
11456G44738N5920N7211O686J4794j9594n925N9205O9637N1942J4805L3152O9999
11444A152570M3237K2548P1031J21447O8218M5809M4413O2226Q0167J37405Q7224
11433A936295J25246K07687J82378K33505K35679K85272L46119L55876M58176
$$ y = [348492, 304439, 274425, 266461, 300542, 358135, 390548, 449671, 412936, 406670, 427973, 410096, 411145, 407737, 416913, 393137, 392473, 377966, 391138, 385552, 383219, 340021, 343812, 365279, 400365, 428894, 432687, 356744, 337430, 341211, 403132, 414542, 442318, 451371, 464074, 494084, 497864, 471843, 467559, 507224, 547874, 536543, 526717, 537742, 510364, 494479, 498185, 482140, 475986, 467349, 487287, 493142, 513500, 513005, 552066, 580766, 589343, 590070, 587591, 606944, 616371, 673079, 744738, 800658, 857869, 864555, 879349, 859755, 853830, 913035, 982672, 1034614, 1049419, 1082571, 1152570, 1195807, 1218355, 1289386, 1410833, 1479051, 1524860, 1569273, 1631499, 1711666, 1849071, 1936295, 2061541, 2269228, 2451606, 2685111, 2920790, 3206062, 3552181, 3908057, 4366233]
11424D366233N46228O43062P64166R15412J021878J165970J299635J410648J391805
11415A3525037J486943J455071J360275J259451J092218P80841M83325J49717
11407B1592878j98643l90103m87206m70205m28550j99274O2437L76954O78669
11398B0536957Q66241R40538R08048Q66503Q00082N66892K59739J1057m35407
11389B5320650r00573j329963j588892j781731j747468j585206j480890j336154
11381A3569773j217657j001998q49583o97880o15069n73071m95874l48175k65652
11372G504814k12432j99067j66897j69970j60818o0978o1482p8940m3306J1236
11362F362160L9066M4661R8745R4342Q1747R7994K03169L55051M06458M50341
$$ y = [4366233, 4912461, 5555523, 6319689, 7235101, 8256979, 9422949, 10722584, 12133232, 13525037, 15011980, 16467051, 17827326, 19086777, 20178995, 20959836, 21443161, 21592878, 21394235, 21004132, 20516926, 20046721, 19618171, 19418897, 19481334, 19858288, 20536957, 21403198, 22343736, 23251784, 24118287, 24918369, 25485261, 25745000, 25756057, 25320650, 24420077, 23090114, 21501222, 19719491, 17972023, 16386817, 14905927, 13569773, 12352116, 11350118, 10500535, 9802655, 9187586, 8614515, 8118641, 7770466, 7504814, 7292382, 7093315, 6926418, 6756448, 6595630, 6534652, 6473170, 6394230, 6350924, 6362160, 6401226, 6445887, 6544632, 6638974, 6720721, 6818715, 7021884, 7376935, 7783393, 8233734]
11352H233734N58883O43694P55258Q54347J030599J285118J477974J613079J833245
11343A8285931J906066K013720K078580J972734J932117J816050J634293J401833
11335C3041324J155513Q62904P71854P19050P10678P92206R20450J078717J173585
11326D1226281J285413J227874R87349O63577L18145l1641k00428k56567l51770
11317D4868233m99808p70096j095214j266835j286999j179458j068459r97993
11309C6703371r95865j087331j180111j311954j536741j764483j965612k110176
11301B4751098k040480j835279j582979j469843j305877j127575r97930q80695
11293A3510440p27724o58402n64513n07518m24299m25743l22162k31012k84650
$$ y = [8233734, 8792617, 9436311, 10191569, 11045916, 12076515, 13361633, 14839607, 16452686, 18285931, 20191997, 22205717, 24284297, 26257031, 28189148, 30005198, 31639491, 33041324, 34196837, 35059741, 35831595, 36550645, 37261323, 38053529, 38973979, 40052696, 41226281, 42511694, 43739568, 44726917, 45390494, 45708639, 45676998, 45476570, 45220003, 44868233, 44368425, 43598329, 42503115, 41236280, 39949281, 38769823, 37701364, 36703371, 35707506, 34620175, 33440064, 32128110, 30591369, 28826886, 26861274, 24751098, 22710618, 20875339, 19292360, 17822517, 16516640, 15389065, 14391135, 13510440, 12782716, 12124314, 11559801, 11052283, 10627984, 10202241, 9880079, 9649067, 9364417]
11284I364417k71217k24077j77196j53501j47814j16579j46461q8733r5779K4952
11274G968012J1732K1688P2047J29936K37824L27488M16560M85381N90118P03175
11264A0963961Q81440J084324J180775J377864J501448J613131J618049J580296
11256B1801288J481567J270625J066812Q28422M44934l399m14588p90798j022683
11247B4662180j006587q63151o47656l77355j12621J78227M75912N67899N72771
11238B3449619N34059M84239L00020J5157j86771n73216r21298j208452j452476
11229B0440881j667142j626320j494290j374107j300939j095860r07983q28866
11221A0145374p07881n55165n56605m50154m30549l98061m49528l86854k79366
$$ y = [9364417, 9093200, 8869123, 8691927, 8538426, 8390612, 8274033, 8127572, 8038839, 7943060, 7968012, 7979744, 8001432, 8073479, 8203415, 8441239, 8768727, 9185287, 9670668, 10260786, 10963961, 11845401, 12929725, 14110500, 15488364, 16989812, 18602943, 20220992, 21801288, 23282855, 24553480, 25620292, 26448714, 26893648, 26890249, 26475661, 25684863, 24662180, 23655593, 22792442, 22144786, 21767431, 21654810, 21833037, 22308949, 22876848, 23449619, 23983678, 24467917, 24767937, 24783094, 24596323, 24023107, 23101809, 21893357, 20440881, 18773739, 17147419, 15653129, 14279022, 12978083, 11882223, 10974240, 10145374, 9437493, 8882328, 8325723, 7875569, 7445020, 7046959, 6597431, 6210577, 5931211]
11212E931211k05898j65807k04523k58567k18452j74005j59500j43449j32174
11203D268836j58298j19410j7208n9478q0649r0818j11346j57348j27568j45728
11193C200985j03958l2355r26k1896o0989q5780o5117j59841j46469k9506m0134
11182B454014n4429p5192p2774r968L0681l5888M0004m7702o3418j11412l9375
11171B014541J3342m0616M896l0930k6189l9623n3853J6569K859m7461P196k9424
11159A791307r8729p0602l7907l0649m118J563q454j8224k3081k6127k4016j8601
11147A432362k1671n2522j4627l5477k9352k5993q9164m3562N415N600k3724o9736
11135A037549l884m3709r8264j3510K6820l1540l8965j7835j0474N2929P46n1172
$$ y = [5931211, 5725313, 5559506, 5354983, 5096416, 4877964, 4703959, 4544459, 4401010, 4268836, 4110538, 3991128, 3973920, 3914442, 3833793, 3742975, 3631629, 3474281, 3346713, 3200985, 3097027, 3064672, 3063746, 3041850, 2980861, 2895081, 2829964, 2670123, 2523654, 2494148, 2454014, 2399585, 2324393, 2251619, 2241651, 2272332, 2236444, 2276448, 2228746, 2165328, 2053916, 2014541, 2027883, 1987267, 1992163, 1961233, 1935044, 1895421, 1841568, 1858137, 1860996, 1813535, 1820731, 1791307, 1692578, 1621976, 1584069, 1553420, 1549302, 1550865, 1542411, 1524187, 1501106, 1474979, 1450963, 1432362, 1410691, 1358169, 1343542, 1308065, 1278713, 1252720, 1163556, 1119994, 1125409, 1131009, 1107285, 1037549, 1033665, 989956, 891692, 878182, 905002, 873462, 834497, 816662, 806188, 859117, 859863, 808691]
11123H08691p4782k9547l5410k535K8072q108K4325j2625l5686k9222J6393L3479
11111F83045L112m9295k0342j7736j9431N8217M4140M7516J3087p0226l6333o6497
11099E69257n5767j7877M8959N3734l7570l6415l2104J6593L7493m2289J6244
11088E20258L291J782L5285j6540m5664k9314K8877k1387J632L198j5923k3958
11076D41537j3751k2110k0192M3493O110k8556J0588L304K398J3296J2372m1727
11064D06762n1983K0451R098L9761l0846J3414o446j2813P46L5853l5501j315
11052C87181J2568O790K6057O020j4718N5187J9355j8231k0095J5005m0640N641
11040D40120M5660N2733M6799k017j2750L9780L8778k0244J025L3855m1159q78
$$ y = [808691, 733909, 704362, 668952, 666417, 694489, 686381, 710706, 698081, 662395, 633173, 649566, 683045, 686157, 636862, 616520, 598784, 579353, 637570, 681710, 729226, 742313, 672087, 635754, 569257, 513490, 495613, 544572, 598306, 560736, 524321, 492217, 508810, 546303, 504014, 520258, 523549, 525331, 560616, 544076, 498412, 469098, 497975, 476588, 478220, 481418, 465495, 441537, 427786, 405676, 385484, 428977, 435087, 406531, 417119, 420423, 422821, 436117, 448489, 406762, 354779, 375230, 384328, 424089, 393243, 406657, 400211, 387398, 388144, 423997, 388496, 387181, 399749, 406539, 432596, 438616, 423898, 479085, 498440, 480209, 460114, 475119, 434479, 440120, 485780, 538513, 585312, 583295, 570545, 610325, 649103, 628859, 629884, 663739, 622580, 621702]
11028F21702L9567J6748K748k5325n0338j5000P7705K7568k0664m7394p430l7164
11016E82723m6382K3852L909M4301O0783k2811j01080j8079K5781N853j4771o8299
11004D75780l4744k8662K5882K5789o8014k9307J6202J4830l6234l029J6593r58
10992C74128R437J4875r933j5906k8423K0052L0500J4841k4091l0734J2762K2400
10980C89908M1437K0746m3820L673L0459j2228l5721l2006k3636l9680k6766N0782
10968C23148O4872L5886j9947j536M1880M1301o240k989j4779m8342q2930K1176
10956C51500Q0435J9803k4888k2778m1711m6507K1170M6523M5880q4750L732N1565
10944C99974M3201l2377n4260L2R43J4645J4045n994n5069m9116j7989L6064K0121
$$ y = [621702, 661269, 678017, 680765, 655440, 605102, 590102, 667807, 695375, 674711, 627317, 619887, 582723, 536341, 560193, 564102, 608403, 669186, 646375, 545295, 527216, 552997, 558850, 544079, 475780, 441036, 412374, 438256, 464045, 396031, 366724, 382926, 397756, 361522, 358493, 375086, 374128, 383565, 398440, 388507, 372601, 344178, 364230, 394730, 409571, 385480, 354746, 367508, 389908, 431345, 452091, 408271, 411944, 442403, 430175, 394454, 362448, 338812, 299132, 272366, 323148, 388020, 423906, 403959, 402423, 444303, 485604, 479364, 476375, 461596, 413254, 330324, 351500, 431935, 451738, 426850, 404072, 362361, 315854, 337024, 383547, 429427, 344677, 348409, 399974, 443175, 410798, 356538, 356570, 357513, 372158, 386203, 380209, 325140, 276024, 258035, 294099, 314220]
10931C14220j6147J1969K3928l2363p5159K2363L0587k5363J4106N3877l1548
10920B90470q203j5057K4394K9064J8815J4957j1880M169L7763j5655n4763j5852
10908B98222O0384j3652m074k6353Q878O1649j607J6928J4965k9814O326K2054
10896D13906R79J5747j1098J239K342K0447M2077o340k1646J2022q32l808K2453
10883D87488J4994l8997l8735n8125R708P432K5586K9222L0764k6293L2996P930
10871D83970j04868q2588j0566L4781J0689n3453m2343K6728k5677J8546P6851
10860C32070l041R209K5564l7555k2798L6908j5134n5234m6420k0964M9831P907
10848B60343L0092m370m9069o8519K2122J03678O6722m736k2830k5146r567k5482
$$ y = [314220, 298073, 310042, 333970, 301607, 226448, 248811, 279398, 254035, 268141, 322018, 290470, 282267, 267210, 291604, 320668, 339483, 354440, 342560, 346729, 384492, 368837, 314074, 298222, 358606, 344954, 340880, 314527, 323405, 385054, 383447, 400375, 415340, 385526, 391852, 413906, 414885, 430632, 419534, 420773, 423115, 443562, 485639, 479299, 457653, 469675, 468843, 465035, 487488, 502482, 463485, 424750, 366625, 376333, 383765, 409351, 438573, 469337, 443044, 476040, 483970, 379102, 296514, 285948, 320729, 331418, 277965, 235622, 262350, 236673, 255219, 332070, 329029, 338238, 363802, 326247, 303449, 340357, 325223, 269989, 223569, 202605, 252436, 260343, 290435, 286065, 236996, 168477, 190599, 294277, 360999, 356263, 333433, 308287, 298720, 273238]
10836B73238j8093k8591O5492M5178K2592Q732j6552Q92O0833M8344l9541r915
10824D12609K4679j5254j8893J7454m435l0534k485K0531o55P586j1060K0362
10812D19905L8842L5809k0903m6717k2902j9948L1646J3840j4595R515m348k4333
10800C95811r278K6575O326K9675J2668k2169l8043m7879o8032o7585r746P4946
10788B83269N4749m6280l3577P297L2661l9025J549J0169L5051N8540M2294j0718
10776C95979l1194k1118k8753o684L7456j9331k9247j9589K5965Q108L683J0306
10764C25581J2558j4407m054k3592J0477L766m933M0321J7474J5542m518k1695
10752C52520O642l0924O7444M862L1474O8323K859n5961k8985J9008N2605P032
$$ y = [273238, 255145, 226554, 292046, 337224, 359816, 368548, 351996, 352888, 413721, 462065, 422524, 412609, 437288, 422034, 403141, 420595, 416160, 385626, 383141, 403672, 403017, 410603, 399543, 419905, 458747, 494556, 473653, 426936, 404034, 384086, 415732, 429572, 414977, 424492, 420144, 395811, 386533, 413108, 419434, 449109, 461777, 439608, 401565, 353686, 285654, 218069, 208323, 283269, 338018, 291738, 258161, 265458, 298119, 259094, 260643, 270812, 305863, 364403, 406697, 395979, 364785, 343667, 314914, 308230, 345686, 326355, 297108, 277519, 303484, 311592, 315275, 325581, 338139, 323732, 319678, 296086, 306563, 310329, 305396, 345717, 363191, 378733, 374215, 352520, 359162, 328238, 395682, 400544, 432018, 500341, 503200, 447239, 418254, 437262, 489867, 496899]
10740D96899L5648L5781N397N1268M0744j002q30j2526k0274L6313N9077L3672
10728G60167P7502O2635M8563M2459J0524Q4821J45403J39035J26375K08774K53817
10717A960075K19851K98530K74953L11433L32771L47989L20192L68166L60862
10708D794822J64037J53581J18851K4463l0015j93951k45214k21366j37940j37836
10698D289432o0594l2970M9927J84993K32671L08575M17726N26923O49481O90494
10688G256658P00967P14243O41091O40794N60846M00606K15228j5800k81627m65851
10678A0367155o00776p68397p23399p03021n63904m34470l51211k73654j86451
10669E761872q9811J9001J57572K08270K97552M05721M62559M30503M30984M70506
$$ y = [496899, 532547, 568328, 573725, 624993, 665737, 664735, 663905, 651379, 631105, 667418, 726495, 760167, 837669, 900304, 948867, 991326, 1001850, 1086671, 1232074, 1371109, 1497484, 1706258, 1960075, 2179926, 2478456, 2753409, 3064842, 3397613, 3745602, 4065794, 4433960, 4794822, 4958859, 5112440, 5231291, 5255754, 5225739, 5031788, 4786574, 4565208, 4427268, 4289432, 4228838, 4195868, 4245795, 4430788, 4663459, 4972034, 5389760, 5916683, 6566164, 7256658, 7957625, 8671868, 9312959, 9953753, 10514599, 10915205, 11130433, 11114633, 10833006, 10367155, 9766379, 8997982, 8274583, 7571562, 7007658, 6573188, 6221977, 5948323, 5761872, 5672061, 5691062, 5848634, 6056904, 6354456, 6760177, 7222736, 7653239, 8084223, 8554729]
10659H554729M67555L91752K54073J95662J06354n1583j90014l01563k40967j59671
10649I026327m6397j451M8521K82432M75575O00444O76813P05750P45483O94972
10639A3208469O10850O14107N21136K81598m3467k36377l70027l93924k89801
10630A3902564R322L48432P91399J208034J588844J829155J949163K031485K349463
10621B6007861K775780L038880L154664K919635K545954K392851K633982K967655
10613D8437262K940751K542752K058191J668775J402669J125316M58063p85852
10605E9847927j927615k003185j055596J68124R74454J247936J440925J978677
10597F0671647K687016K802857J767530l88159k552204l370443k641271j432820
$$ y = [8554729, 9022284, 9414036, 9668109, 9863771, 9970125, 9918542, 9728528, 9426965, 9185998, 9026327, 8979930, 8978479, 9027000, 9309432, 9785007, 10385451, 11062264, 11768014, 12513497, 13208469, 13819319, 14433426, 14954562, 15236160, 15192693, 14956316, 14586289, 14192365, 13902564, 13911886, 14260318, 15051717, 16259751, 17848595, 19677750, 21626913, 23658398, 26007861, 28783641, 31822521, 34977185, 37896820, 40442774, 42835625, 45469607, 48437262, 51378013, 53920765, 55978956, 57647731, 59050400, 60175716, 60633779, 59847927, 57920312, 55917127, 54861531, 55029655, 56004109, 57252045, 58692970, 60671647, 63358663, 66161520, 67929050, 67540891, 64988687, 61618244, 58976973, 57544153]
10589E7544153o07618k57935n1686J54170K24482j58922j216860k928230m329434
10580D8372120m635387l894975k779258j846351j255475q48885l76751j30850
10572C2604188k49613o92536j396979j941518k076460j910271j605887j395197
10564B1335727j270805j218667j170448j043409q82966p34903o02820m75232k93691
10555A3642786k08768r4097O1942K06196L30795N00370O01982O88789P40800O62113
10545A7132908O07053N06395L09424J31912r6969l92466p90669j046356j219464
10536A5141768j210824j032513q86972p60409n75254m94259l77766k33657j04518
10527I465596l6255J8497J07593J24267J39205K41832J62876J26879R7618M6402
$$ y = [57544153, 56936535, 56678600, 56626914, 56781084, 57005566, 56846644, 55629784, 52701554, 48372120, 43736733, 39841758, 37062500, 35216149, 33960674, 33111789, 32735038, 32604188, 32354575, 31662039, 30265060, 28323542, 26247082, 24336811, 22730924, 21335727, 20064922, 18846255, 17675807, 16632398, 15749432, 15014529, 14411709, 13936477, 13642786, 13434018, 13339921, 13401863, 13608059, 13938854, 14439224, 15041206, 15729995, 16470795, 17132908, 17739961, 18246356, 18555780, 18687692, 18590723, 18198257, 17407588, 16361232, 15141768, 13930944, 12898431, 12011459, 11251050, 10675796, 10181537, 9803771, 9570114, 9465596, 9429341, 9447838, 9555431, 9679698, 9818903, 10060735, 10223611, 10350490, 10448108, 10494510]
10517A0494510q0657j42294k58232m08334n79937o09854n91327n10730m64180
10508F848965l87769l71742l09972l25336k88074k34912k75801k46017j08302
10499D301040j67760j55262j00582j07311j03960j32318j22763p0105r6791q2558
10489C161630j02047m0363j3376m7018o0737o5674r1662p8635l8608p7656j00996
10478B444858n4519r031n4108q6702q8402o3889k3671j7919l2743m5547l6004
10467A932323J4000j00193j8467K8455o9422o6353k3009k5898j6163l1748k8499
10456A595026r459k5264q6781n5245j4119j8680k2956m0593k0772r076j7493o313
10444A268275k3497k7246p4201l8038J7186K4343k7296Q700k682j0298J7991J1347
$$ y = [10494510, 10413853, 10271559, 10013327, 9604993, 9025056, 8415202, 7823875, 7313145, 6848965, 6461196, 6089454, 5779482, 5454146, 5166072, 4931160, 4655359, 4409342, 4301040, 4133280, 3978018, 3877436, 3770125, 3666165, 3533847, 3411084, 3340979, 3244188, 3161630, 3059583, 3019220, 3005844, 2958826, 2898089, 2832415, 2740753, 2662118, 2623510, 2545854, 2444858, 2390339, 2381308, 2327200, 2240498, 2152096, 2088207, 2064536, 2046617, 2013874, 1968327, 1932323, 1946323, 1846130, 1827663, 1856118, 1786696, 1720343, 1697334, 1671436, 1655273, 1623525, 1595026, 1585567, 1560303, 1473522, 1418277, 1404158, 1385478, 1362522, 1321929, 1301157, 1292081, 1274588, 1268275, 1244778, 1217532, 1143331, 1105293, 1122479, 1146822, 1119526, 1128226, 1125544, 1115246, 1133237, 1144584]
10432A144584L2647j8646m1970o9467j5743O233m2312L0764k3643k0875r0238
10421H91334n7754P085O990j3170K5704K6807l194m0387m383j2170m2187J8968
10409H03643j7103R882M3936J0447l7350l2895n0453J8727L8068K5907j2863J7795
10397H17741L1165M8487l5377o950N0335N0918P8362J22862L6957M8750J40445
10386A383695J30380J54274J98905K88313L73419L97556M33192M48611M42847
10377D251192M40958M97154M24789J96676r4849l15464k40139k76001m64435p29905
10367C689976o67380m19104l27377k50497j14084p8823j50998q2408k0996m0018
10357A538291m9850m9510J2558K6431M521k7840n6045k6061l1062K1838l7700
$$ y = [1144584, 1177231, 1158585, 1116615, 1047148, 1031405, 1037638, 995326, 1026090, 1002447, 981572, 891334, 833580, 840665, 847655, 834485, 860189, 886996, 883802, 843415, 839032, 826862, 784675, 803643, 786540, 796422, 840358, 850805, 813455, 780560, 730107, 748834, 786902, 812809, 799946, 817741, 848906, 897393, 862016, 855066, 905401, 956319, 1034681, 1157543, 1194500, 1243250, 1383695, 1514075, 1668349, 1867254, 2155567, 2528986, 2926542, 3359734, 3808345, 4251192, 4692150, 5189304, 5614093, 5810769, 5715920, 5400456, 5160317, 4884316, 4419881, 3689976, 3022596, 2603492, 2276115, 2025618, 1911534, 1832711, 1681713, 1599305, 1578309, 1538291, 1488441, 1438931, 1451489, 1477920, 1482441, 1454601, 1398556, 1372495, 1341433, 1363271, 1325571]
10346A325571K3090k6209k2751K3519o715k1510R326L9226j3959k0362J3461M6743
10334A369430n634j2702n2045K1387p151K0664J7941n0541o1559K1024K8106L1142
10322A320062P0278j1222j946j3428L3682J9849M5485K2862K3606O5569K6716
10311A601513o754M5756K5944N7630P2956M0693l57J2396O7090N9155J23572R0642
10299B190236L2779K5314P0979R5760P0914J21164J79528Q9820Q6564J11427J45090
10288C219575J97463K74429K52895K87526K14992K27822M00676M21273N11090
10279F007741O33688O92234P06372P66696R28221J066296J168838J423480J568181
10270A4961747J873728K283660K750450L401595M405561O033366Q294646J1501860
$$ y = [1325571, 1348661, 1322452, 1299701, 1323220, 1316505, 1294995, 1304321, 1343547, 1329588, 1309226, 1322687, 1369430, 1363796, 1351094, 1299049, 1320436, 1313285, 1333949, 1351890, 1301349, 1239790, 1260814, 1288920, 1320062, 1390340, 1379118, 1377172, 1363744, 1397426, 1417275, 1462760, 1485622, 1509228, 1574797, 1601513, 1594759, 1640515, 1666459, 1724089, 1797045, 1837738, 1837381, 1849777, 1916867, 1976022, 2099594, 2190236, 2223015, 2248329, 2319308, 2415068, 2485982, 2607146, 2786674, 2876494, 2963058, 3074485, 3219575, 3417038, 3691467, 3944362, 4231888, 4446880, 4674702, 5075378, 5496651, 6007741, 6641429, 7333663, 8040035, 8806731, 9734952, 10801248, 11970086, 13393566, 14961747, 16835475, 19119135, 21869585, 25271180, 29676741, 35710107, 44004753, 55506613]
10262E5506613J5550577J9485400K2264913K4497636K7892081L1241561L1723071
10255B28161852K9191952K4929046J8516167J0463546L686233m538599j7347489
10248B93062708k9738852l3003250l0992915l0822057l1236692k7185273k0070847
10241I0012822j4040484r967373p241187n479976m305949l484955k980976k444137
10233D0067785k102891j895316j686870j550453j459308j434661j373655j331141
10225B7233490j314333j210375j132398j110196j019897q75714q23354p69233
10217A8977990p28800o17497n13999m44655m98938n23804m27152l53294l30982
10208A4538869m45034l48278k99118k98369l44416l71280l39141l38248l38127
$$ y = [55506613, 71057190, 90542590, 112807503, 137305139, 165197220, 196438781, 228161852, 257353804, 282282850, 300799017, 311262563, 314948796, 310410197, 293062708, 263323856, 230320606, 199327691, 168505634, 137268942, 110083669, 90012822, 75972338, 66004965, 58763778, 53283802, 48977853, 45492898, 42511922, 40067785, 37964894, 36069578, 34382708, 32832255, 31372947, 29938286, 28564631, 27233490, 25919157, 24708782, 23576384, 22466188, 21446291, 20570577, 19747223, 18977990, 18249190, 17631693, 17117694, 16673039, 16174101, 15650297, 15223145, 14869851, 14538869, 14093835, 13745557, 13446439, 13148070, 12803654, 12432374, 12093233, 11754985, 11416858]
10199A1416858l46040k76149l27235k99561k79813k76224k65951k02781k01930
10190H941174k48278k36122k90276k24159j55631j22034j77337k30240j62963
10181G094134j88701j85086j47938q4721j38894j59002j66874j60002j67483r1490
10171E603943j00624j17397m1294j73653k12657j20348j06824r5417j05041o2611
10161D468077j04122j40334o1561n3434q5246j65667j52005r2527q3172q6033
10151C443976n2525n4425q4287p3308j19149q2699m5504l1273o2780m7533m4896
10140B745597m2583p9047q0835J4198J7623m1680q6187o8372k8452k2792r6184
10129B231286j05813r7073n7245K7168k42n2139n6903p9144o2963l309l1303q3072
$$ y = [11416858, 11070818, 10794669, 10467434, 10167873, 9888060, 9611836, 9345885, 9143104, 8941174, 8692896, 8456774, 8166498, 7942339, 7786708, 7664674, 7487337, 7257097, 7094134, 6905433, 6720347, 6572409, 6487688, 6348794, 6189792, 6022918, 5862916, 5695433, 5603943, 5503319, 5385922, 5344628, 5170975, 4958318, 4837970, 4731146, 4635729, 4530688, 4468077, 4363955, 4223621, 4162060, 4108626, 4023380, 3857713, 3705708, 3613181, 3530009, 3443976, 3391451, 3337026, 3252739, 3179431, 3060282, 2977583, 2932079, 2900806, 2838026, 2790493, 2745597, 2703014, 2623967, 2543132, 2557330, 2574953, 2533273, 2447086, 2378714, 2350262, 2327470, 2231286, 2125473, 2028400, 1971155, 1998323, 1998081, 1945942, 1889039, 1809895, 1746932, 1743623, 1712320, 1629248]
10117A629248o0320Q580k5299n4781M830J337j8369j2493m7330n4848J5524P373
10105A393452k4964k497n537J1088L4040k4275J0453n106j4833n2589m5168K6639
10093A300703M1756l1406m9879k4399n0733o9782k8278j4441j0331n3947o0350
10082I48913M8411J9199n0935q1475k5516m2880j2170O7975l5204l2153J2521
10071H16686o1m93j0107j1812m8678n9892q635J2087r865o433K0645k9017q525
10058F55900l2786k0463M7514J8944k7566l2203R149j6822n1298p0649j9609j1740
10046D48371K2651L9175M1317l9800n0314J886J0523O4582K1150k4174K058r084
10034E28341J0510n477N60l5139m3048o0394l3576l35L4629L6256J3761q973k7119
$$ y = [1629248, 1568928, 1577508, 1552209, 1497428, 1502258, 1503595, 1485226, 1472733, 1425403, 1370555, 1386079, 1393452, 1368488, 1365991, 1360454, 1371542, 1405582, 1381307, 1391760, 1386654, 1371821, 1319232, 1274064, 1300703, 1342459, 1311053, 1261174, 1236775, 1186042, 1116260, 1087982, 1073541, 1063210, 1009263, 948913, 997324, 1016523, 965588, 884113, 858597, 815717, 803547, 871522, 836318, 804165, 816686, 816625, 816132, 806025, 794213, 745535, 685643, 677008, 689095, 679230, 672797, 693442, 664425, 655900, 623114, 602651, 650165, 669109, 641543, 609340, 618489, 601667, 550369, 479720, 460111, 448371, 471022, 510197, 551514, 511714, 461400, 463286, 473809, 538391, 559541, 535367, 537425, 528341, 538851, 533374, 533934, 498795, 455747, 395353, 361777, 361442, 396071, 432327, 446088, 437115, 409996]
10021D09996K0031L1946m6567o44o491J5442p3273m8538K4670L284O0917k579
10009C88194K394n386L5148n6226L4600O8174K7415K932n9310k4688k1511J4339
9997D06075p751J5532N5185J5765j3601P478m565l5616J0922N2865J1828p5410
9985D38707m1699M7466M8890j5519k6429K9917O493L8239M5980n021m1832k2896
9973E02296l6793J8929l923k2182j8138l5588L5359Q8763l109l9095k0308j4270
9961D51941L6051j2739k2984l654o5337l8420L981p4865L8454k7329M166K5998
9949C15263l1324K2026m0268k6824N532K2643l9893k1000Q871j9773n5767J1276
9937A50762k1570Q350J9825l209n856L6322K1950m0192l2764N4874P6388r646
$$ y = [409996, 430027, 461973, 415406, 414762, 408271, 423713, 350440, 301902, 326572, 329856, 390773, 388194, 390588, 385202, 420350, 364124, 398724, 466898, 494313, 497245, 437935, 413247, 391736, 406075, 398324, 413856, 469041, 484806, 471205, 478683, 474118, 438502, 449424, 502289, 514117, 438707, 397008, 444474, 493364, 477845, 451416, 481333, 487826, 526065, 572045, 567024, 525192, 502296, 465503, 484432, 480509, 458327, 440189, 404601, 439960, 528723, 525614, 486519, 466211, 451941, 487992, 475253, 452269, 448615, 383278, 344858, 348839, 273974, 312428, 285099, 289265, 315263, 283939, 305965, 265697, 238873, 244405, 267048, 227155, 206155, 215026, 195253, 139486, 150762, 129192, 137542, 157367, 154158, 148302, 184624, 206574, 166382, 133618, 188492, 264880, 255234]
9925B55234q601j8805m5111J8330N0305j2800K459Q971K9766l4540o819L0971
9913B69360l8242j5330k9076K8577O1022l4210l6204p8470p1749M4463L0610N8514
9901A89265K9348j8975k2733K6500J02809o522n9213m1271m5411J7981J6545j0640
9889A77683l0443o335R661L4067P953n1102Q689J5495j9359o854J5022L2997m393
9876A83081k4239M8225M0087m124o50M5493L3248K6248j1627l5498m4804J2595
9864B68035L0151K1947P0592O9221L9355j2193J7645R6189J10073J13085J31404
9853I55504J20477J30518J80054J57130J42677Q8568M9060O4994o8694j12292
9843A707996j38104j41833j07393j59790j44566j34322j73422j29855o7971n230
$$ y = [255234, 246633, 227828, 182717, 201047, 251352, 238552, 241011, 249982, 279748, 245208, 238389, 269360, 231118, 215788, 186712, 215289, 276311, 242101, 205897, 127427, 55678, 100141, 130751, 189265, 218613, 199638, 176905, 203405, 306214, 299692, 240479, 199208, 153797, 171778, 188323, 177683, 147240, 140905, 150566, 184633, 192586, 141484, 150173, 165668, 146309, 139455, 154477, 187474, 183081, 158842, 207067, 247154, 243030, 242380, 287873, 321121, 347369, 335742, 300244, 255440, 268035, 298186, 320133, 390725, 459946, 499301, 487108, 504753, 600942, 711015, 824100, 955504, 1075981, 1206499, 1386553, 1543683, 1686360, 1774928, 1823988, 1888982, 1820288, 1707996, 1569892, 1428059, 1320666, 1160876, 1016310, 881988, 708566, 578711, 510740, 505510]
9833E05510L0867m2760q2357K794L4039K7580k5082j3825O1347k378j8934l1132
9821D45669l6770k3766n67l1450J608J4610j6338J6051K7644J9589j1302m7819
9809C57159j4846r034m2864K137M6600q232O676M088k4705j1962O0542L5067N2955
9796D53581O615k8877q780o0855m7842K8924J1333M466K2091L5687J4794J6663
9784D47800L5465L5320l9998p883l4385n987K6757M893k201L5457j6760l2806
9772D45672K6266k0850L275K6637m828k3989O816M590O2314J0338j2176M7054
9760E71119M2810K6247r15L5362Q593L000k7446K6440L2757L2305K8309j7129
9748G61452J0000j4385K8558L5214J3103L3255N1779M281R469K8675k027j9557
$$ y = [505510, 536377, 493617, 411260, 414054, 448093, 475673, 450591, 436766, 498113, 495735, 476801, 445669, 408899, 385133, 384566, 353116, 354724, 369334, 352996, 369047, 396691, 416280, 404978, 357159, 342313, 333279, 290415, 292552, 339152, 330920, 337596, 341684, 316979, 305017, 365559, 400626, 453581, 460196, 431319, 422539, 361684, 313842, 342766, 354099, 358565, 380656, 416343, 431137, 447800, 483265, 518585, 478587, 470704, 436319, 430332, 457089, 461982, 459781, 495238, 478478, 445672, 471938, 451088, 454363, 481000, 476172, 452183, 458999, 463589, 525903, 536241, 524065, 571119, 613929, 640176, 639261, 674623, 683216, 686216, 658770, 685210, 717967, 750272, 778581, 761452, 771452, 757067, 785625, 820839, 833942, 867197, 918976, 923257, 932726, 961401, 959374, 939817]
9736I39817J2968L4396k4760K9578K9778l3043L5668K0263k6276j4846j1521P6698
9724A068720N6023O0144K4201N6029P6535L5968Q2863J6645j766j0505O9967N6288
9712A591112M2006N9924J09508P0945J01787J53341J87867J56031J83731K49261
9702B905513K36879K63570L03403M02608M38505M94506L86749N21557N71151N26903
9692G051344M98632N10447N09440M88723M59570L97807L76709M00561L74348L59371
9682A1426952M00539N30702N32078N34460O47232O87945Q24053R12300J008219
9673A7504480J167509J173208J047249J063684J039937R42929P59714O03099M04021
9664B5705830L05801J36335M23r3449j70708k01350k49463j86033j18868j23729
$$ y = [939817, 952785, 987181, 962421, 991999, 1021777, 988734, 1024402, 1044665, 1018389, 1003543, 992022, 1068720, 1124743, 1184887, 1209088, 1265117, 1341652, 1377620, 1460483, 1477128, 1475362, 1464857, 1534824, 1591112, 1633118, 1693042, 1802550, 1873495, 1975282, 2128623, 2316490, 2472521, 2656252, 2905513, 3142392, 3405962, 3709365, 4111973, 4550478, 5044984, 5431733, 5953290, 6524441, 7051344, 7549976, 8060423, 8569863, 9058586, 9518156, 9915963, 10292672, 10693233, 11067581, 11426952, 11827491, 12358193, 12890271, 13424731, 14071963, 14759908, 15583961, 16496261, 17504480, 18671989, 19845197, 20892446, 21956130, 22996067, 23938996, 24698710, 25301809, 25705830, 26011631, 26147966, 26148389, 26054940, 25884232, 25682882, 25433419, 25247386, 25128518, 25004789]
9654B5004789r390J1262J09367K96635M09261M47673N25685N28607M74669L51469
9644B8150027J91450M8584r6838l45848m99504o04837o45154p29082q44819q97228
9634B3726751r59707r84745q62826p00131o86205o41042n25800l73194l34858
9625A7658243k67659j36883j12702j41686j38271j10656q5875p7999j7389K0358
9615A6589481Q178J18424J17906J69487J85959J96499K11072J71248J63156K21456
9605A8152866K75872K50084K31654K42467L09312L65159M29614M23538M20604
9596B1101170M01345N18231N77678O47340P50221R06906J031904J251623J346455
9587B8532873J393929J350937J217817J139800R69579P90762O30292M35867K33636
$$ y = [25004789, 24995399, 25006661, 25116028, 25412663, 25821924, 26269597, 26795282, 27323889, 27798558, 28150027, 28341477, 28390061, 28293223, 27947375, 27447871, 26843034, 26197880, 25468798, 24623979, 23726751, 22767044, 21782299, 20919473, 20219342, 19533137, 18892095, 18366295, 17993101, 17658243, 17390584, 17253701, 17140999, 16999313, 16861042, 16750386, 16664511, 16586512, 16569123, 16589481, 16597659, 16716083, 16833989, 17003476, 17189435, 17385934, 17597006, 17768254, 17931410, 18152866, 18428738, 18678822, 18910476, 19152943, 19462255, 19827414, 20257028, 20680566, 21101170, 21502515, 22020746, 22598424, 23245764, 23995985, 24902891, 25934795, 27186418, 28532873, 29926802, 31277739, 32495556, 33635356, 34604935, 35395697, 36025989, 36461856, 36695492]
9578C6695492J8196j55323l05321m07097m80792m40501m27032m41759l33252k32144
9568C3490467j18183O3540K47187L87995M35913M08717L83902L26773K46171J04413
9558C5976895r8922k32495m48833o15884p67435r30956j116316j284595j353170
9549B9128289j394294j337887j242531j192698j068105r01768p89796o65276n70865
9540A9965069n49290m88998m16896m53898m79053n35125n55236o03619o17814
9531A5265140n80980o61137p14344o72875p02640p14594o88325o50269o02678
9522I277298n99533m70305m28522l85530l11123k89950k69563k17518k86347k44092
9512E774815k21224k24814j99675j84399j34482j19117j17781j18234j25331j07604
$$ y = [36695492, 36713688, 36558365, 36253044, 35845947, 35365155, 34924654, 34497622, 34055863, 33722611, 33490467, 33372284, 33435824, 33683011, 34071006, 34506919, 34915636, 35299538, 35626311, 35872482, 35976895, 35877973, 35645478, 35196645, 34580761, 33813326, 32882370, 31766054, 30481459, 29128289, 27733995, 26396108, 25153577, 23960879, 22892774, 21991006, 21201210, 20535934, 19965069, 19415779, 18926781, 18509885, 18055987, 17576934, 17041809, 16486573, 15882954, 15265140, 14684160, 14023023, 13308679, 12635804, 11933164, 11218570, 10530245, 9879976, 9277298, 8677765, 8207460, 7778938, 7393408, 7082285, 6792335, 6522772, 6305254, 6018907, 5774815, 5553591, 5328777, 5129102, 4944703, 4810221, 4691104, 4573323, 4455089, 4329758, 4222154]
9502D222154j11927j28675j18410j31346p5635r0308l4107k5351j45658j18184
9492C242553r1342p6899o7892n2707m1418p2977r4803j33153q587o7243n8844
9481B476688l6871o7120k4756p4027r4608l6946n5417m9329n5951m8693k2903
9470A910067l698j4013l5088m3763k2100m9099k6668j6330j6503o3654k1505k4079
9458A573567r9961l3703N4785k4210n0131k7836j6585o5848J0179M4497j0750
9447A354004r1651k8416l3476n8458k3017m5262m453k4491M0744K2916l3024J2183
9435A087599J2565l5697n5537m7874m1462j9629K6465M262K4957p938n2577Q414
9423I03548M9407m2131l4747m866J254N135O675j7009k7247K4540j6594k4898
$$ y = [4222154, 4110227, 3981552, 3863142, 3731796, 3656161, 3565853, 3531746, 3506395, 3360737, 3242553, 3151211, 3074312, 3006420, 2953713, 2912295, 2839318, 2744515, 2611362, 2602775, 2535532, 2476688, 2439817, 2372697, 2347941, 2273914, 2179306, 2142360, 2086943, 2037614, 1981663, 1932970, 1910067, 1906369, 1892356, 1857268, 1813505, 1791405, 1742306, 1715638, 1699308, 1682805, 1619151, 1597646, 1573567, 1473606, 1439903, 1494688, 1470478, 1420347, 1392511, 1375926, 1310078, 1320257, 1364754, 1354004, 1262353, 1233937, 1200461, 1142003, 1118986, 1073724, 1069271, 1044780, 1085524, 1108440, 1075416, 1087599, 1100164, 1064467, 1008930, 961056, 919594, 899965, 926430, 930692, 955649, 947711, 895134, 903548, 952955, 910824, 876077, 871211, 872465, 877600, 884275, 867266, 840019, 864559, 847965, 823067]
9411H23067j5354P453j681L3441k2343n9153r92J5935M6057j212j4083M8084M0883
9398I00102o029n2477q793J0090l8693O21j543j8439n220k6392j7435j4145l6031
9385F85616m1264j0192p956K9229q239j5919M5702P5546J2377o8306j0931l5215
9373F50448J8301j3357N1677n1525n0768k0686M5757K020l9305j8306m8084j053
9361E25119j4973m1744k8412q530M3468L0605M94l1591k8836m2691m3766L521
9349C62664l5830O28Q876J508Q437K2945r593K8398P2965L2830K6851j3246l5995
9336D71438J0432k8046o899Q6196O1837L3873k762j547J6269J1577L0993m440
9324F78921l7412n950J1386O0858M4286k2059j4946q004j4704L407m1142m5423
$$ y = [823067, 807713, 815166, 813485, 846926, 824583, 765430, 764438, 780373, 826430, 825218, 811135, 859219, 900102, 894073, 841596, 832803, 842893, 804200, 804821, 803278, 784839, 779619, 753227, 735792, 721647, 685616, 644352, 634160, 626204, 655433, 647194, 631275, 676977, 752523, 764900, 696594, 685663, 650448, 668749, 655392, 707069, 655544, 604776, 584090, 629847, 631867, 592562, 574256, 526172, 525119, 510146, 468402, 439990, 431460, 474928, 505533, 506027, 474436, 445600, 402909, 359143, 362664, 326834, 327462, 336338, 337846, 346283, 369228, 359635, 388033, 460998, 493828, 520679, 507433, 471438, 481870, 453824, 446925, 533121, 594958, 628831, 626069, 624522, 640791, 652368, 683361, 678921, 641509, 635559, 646945, 707803, 752089, 730030, 715084, 707080, 692376, 695783, 654641, 609218]
9312F09218K1306K7014P36r524J5365J8440J01510L9904o3780n4781n4289O2766
9300G13885Q6399K8588J8241r4757n6291L0R791K4740L6647j1683m8222L2j0968
9287F96432k6352n850o9486q67l644M8736k2862o3131l5184j7517n7116m2957
9275D00202J2412K2991k2329k1139L0231K2014p703J3484K3749M7458K9971J6560
9263E67901j4388m5553l1360L5281J9946L2299L2440M0405J7669K6492J0278N6039
9251G47449L2677l7241o4791M4490K5263j2836L0666L1543j5659Q803k8390q128
9239G53846L8993o427k9403M3152K2319k2225o5007L7693N2952m624n0440R684
9227G80513K5989k8196O43O3190l0937j3689m0146J82K0294O190M0411k9589l723
$$ y = [609218, 630524, 657538, 658274, 648750, 664115, 682555, 784065, 823969, 760189, 705408, 651119, 713885, 800284, 828872, 847113, 752356, 696065, 696095, 705886, 730626, 767273, 755590, 707368, 707400, 696432, 670080, 664230, 594744, 593877, 590233, 638969, 616107, 552976, 517792, 500275, 443159, 400202, 412614, 435605, 413276, 392137, 422368, 444382, 436679, 450163, 473912, 521370, 551341, 567901, 553513, 507960, 476600, 511881, 531827, 564126, 596566, 636971, 654640, 681132, 691410, 747449, 780126, 742885, 678094, 722584, 747847, 735011, 765677, 797220, 781561, 790364, 761974, 753846, 792839, 786412, 757009, 800161, 822480, 800255, 735248, 772941, 825893, 821269, 770829, 780513, 806502, 778306, 778949, 842139, 811202, 797513, 757367, 757549, 777843, 784033, 824444, 794855, 791132]
9214G91132J5394k91P496L423l5634k6671J5086p725L0325j7588l0850l6375j7946
9201F89776l203L7230M9381J1850K2581K7275J7899K0862l1209K930K1059O2406
9189I28837L0616j3627M4175K7621k6728M5437Q3013P6423N9001O6132M9446N3245
9177A423591J25856P9877J06928R8538J14316J77617J86789K59846K83174L18676
9167C175208L59349L87716M35762N11761O33484P21002P78603Q19527P73828P88396
9157I384636P68875P22421O69010N30184L25818J19945p0721k87307m30576n47652
9147A1184633n59823n91324n23687m29320l37747k23727j10849O691K19308L37305
9137H971460M03303N13253O19489O47157O93742O61952O81980N66134M49189K85275
$$ y = [791132, 806526, 806235, 813731, 817154, 781520, 754849, 769935, 762210, 792535, 774947, 744097, 707722, 689776, 686573, 723803, 773184, 785034, 807615, 834890, 852789, 873651, 842442, 845372, 866431, 928837, 959453, 945826, 990001, 1017622, 990894, 1036331, 1119344, 1195767, 1254768, 1320900, 1370346, 1423591, 1549447, 1629324, 1736252, 1834790, 1949106, 2126723, 2313512, 2573358, 2856532, 3175208, 3534557, 3922273, 4358035, 4869796, 5503280, 6224282, 7002885, 7822412, 8596240, 9384636, 10153511, 10875932, 11544942, 12075126, 12400944, 12520889, 12450168, 12162861, 11732285, 11184633, 10624810, 10033486, 9509799, 9080479, 8742732, 8519005, 8408156, 8414847, 8634155, 8971460, 9374763, 9888016, 10507505, 11154662, 11848404, 12510356, 13192336, 13758470, 14207659, 14492934]
9127A4492934J16844p2957l30545o07571p63168q26965q30835q09879p37201p04707
9117H925950o17849n23851m37958m25068l43457k50093j79845j17071j34442j66008
9107E730308p8059m2439P2635Q3705P9707J10786J96678K45886K53424M23804
9097G076435M73790N86691O72731P78820R04838J026320J218373J286843J456639
9088A5481480J555191J632854J548480J485616J379282J191028R19316O74981
9080B5868228M33469J57342j42166l03891l95099l51861k67064j39865j08916
9071B4750177j10655n7613J75116K85276K70790M12614L89343L50408M32970O02922
9061B7501348P63548P78745P76572O99269N16191M21157P2287k39127n27426q45892
$$ y = [14492934, 14609778, 14536821, 14206276, 13598705, 12835537, 12008572, 11177737, 10367858, 9630657, 8925950, 8308101, 7784250, 7346292, 6921224, 6577767, 6327674, 6147829, 6030758, 5896316, 5730308, 5652249, 5609810, 5682445, 5766150, 5845857, 5956643, 6153321, 6399207, 6652631, 7076435, 7550225, 8136916, 8809647, 9588467, 10493305, 11519625, 12737998, 14024841, 15481480, 17036671, 18669525, 20218005, 21703621, 23082903, 24273931, 25193247, 25868228, 26301697, 26459039, 26316873, 26012982, 25617883, 25266022, 24998958, 24859093, 24750177, 24639522, 24581909, 24757025, 25042301, 25313091, 25725705, 26115048, 26465456, 26898426, 27501348, 28264896, 29043641, 29820213, 30519482, 31035673, 31456830, 31529117, 31289990, 30762564, 29916672]
9051B9916672j056613j145377j086537j139196j101199r79042r31143q87781q29713
9042B0760071q31807q14669q64922r36236r44430r60537r15954p97238p18203
9033A2976075o81581n65775m98360l26982k88607k45040j11277q8491M5688J61708
9023A0377358K32160K07558L00028M53433N52474O49477O53022P63821Q49946
9014A5039277Q53121Q16070Q12599Q09128P27221P14752O01400N20256N15584
9005B1409408N77806O08898O70498O82737P82741P16380N70983M62175L15799
8996B6797425P9729r0058k30843m21503n54216n29338m66759l67589k21346p9883
8986B3915619O7378O1533O0632P9358L2261m8012r0662n6003l5137k5017O6612
$$ y = [29916672, 28860059, 27714682, 26628145, 25488949, 24387750, 23408708, 22477565, 21589784, 20760071, 19928264, 19113595, 18248673, 17312437, 16368007, 15407470, 14491516, 13694278, 12976075, 12294494, 11728719, 11230359, 10903377, 10614770, 10369730, 10258453, 10169962, 10215650, 10377358, 10609518, 10817076, 11117104, 11570537, 12123011, 12772488, 13425510, 14189331, 15039277, 15892398, 16708468, 17521067, 18330195, 19057416, 19772168, 20373568, 20893824, 21409408, 21987214, 22596112, 23266610, 23949347, 24732088, 25448468, 26019451, 26481626, 26797425, 26877154, 26787096, 26556253, 26134750, 25580534, 25051196, 24584437, 24216848, 23995502, 23915619, 23982997, 24044530, 24105162, 24184520, 24216781, 24168769, 24078107, 24022104, 23986967, 23961950, 24028562]
8975B4028562Q280k5400j32462k03481l48410n97634q18671j062465j291346j334423
8965A8222550j306915j316279j212445j123747j077160q80937p44695p08549n86748
8956I265075m88376m01709l92780k94678l32033k80855k20120j96965j44421j05069
8946F408069j11103j61019j29629N546O5945P6034N6288J45660K11247K58035
8936F825073L04822L68771M13066M64829N19042M96402M73929M07551L84291L19865
8926A0977641J96458J28676n191k20054l95497n48993n80856n31462n38688m94917
8916G987117m09255k88337k33304j77582o6203O5967J18665K27188L24038L80640
8906G928934L88602L44796L08906K77655K54274J71268L5399p4224j56587l38353
$$ y = [24028562, 24036842, 24011442, 23878980, 23675499, 23327089, 22729455, 21910784, 20848319, 19556973, 18222550, 16915635, 15599356, 14386911, 13263164, 12186004, 11305067, 10560372, 9851823, 9265075, 8776699, 8374990, 7982210, 7687532, 7355499, 7074644, 6854524, 6657559, 6513138, 6408069, 6296966, 6135947, 6006318, 6011864, 6077809, 6153843, 6210131, 6355791, 6567038, 6825073, 7129895, 7498666, 7911732, 8376561, 8895603, 9392005, 9865934, 10273485, 10657776, 10977641, 11174099, 11302775, 11297584, 11077530, 10682033, 10133040, 9552184, 9020722, 8482034, 7987117, 7577862, 7289525, 7056221, 6878639, 6812436, 6878403, 6997068, 7224256, 7548294, 7928934, 8317536, 8662332, 8971238, 9248893, 9503167, 9674435, 9709834, 9635610, 9479023, 9140670]
8896I140670n05776n14690n68593o44037o29740n10621m20502m44279l85836l30899
8886D185697l23878k15737j89297j85722k01707j61612j47356j13570r9082j02605
8876B445131m0884j05777r1132m1497n1682l1686q4145r1235q9909o4270J0309
8865A763223j6627k6277k7193o6647q2053n4622l1704m679p5921m7524m3674l0760
8853A255542J5908n8634p6352n7543K1064j7466l7225j3735j3509l6686K9885
8842A011249m825n9658L498m79M3983O390k1206l6934o4696q8847k5154j5184
8830G48137j8096R274m259m9601n7572K0601K9423J4598j7420j9000n6690m7926
8818E51469j7019j7687M6775M4679J8319k4286l9414j4090m3102m326k4199k3048
$$ y = [9140670, 8634894, 8120204, 7551611, 6907574, 6277834, 5767213, 5346711, 4902432, 4516596, 4185697, 3861819, 3646082, 3456785, 3271063, 3069356, 2907744, 2760388, 2646818, 2547736, 2445131, 2404247, 2298470, 2207338, 2165841, 2114159, 2082473, 1998328, 1907093, 1817184, 1752914, 1763223, 1746596, 1720319, 1693126, 1626479, 1544426, 1489804, 1458100, 1453421, 1377500, 1329976, 1286302, 1255542, 1271450, 1212816, 1136464, 1078921, 1099985, 1082519, 1045294, 1031559, 1018050, 981364, 1011249, 1006424, 946766, 950264, 949785, 993768, 1000158, 978952, 942018, 877322, 788475, 763321, 748137, 730041, 739315, 735056, 685455, 627883, 648484, 677907, 692505, 675085, 656085, 599395, 551469, 534450, 516763, 563538, 608217, 626536, 602250, 562836, 548746, 505644, 501318, 477119, 454071]
8806D54071j7942l6585M4593J8908K6171K1012j5994j7787p5097l8625M7602k2079
8794C88248j8933M690M4512J5702l8095O647J8675J6043J4671j029L2646j8639
8782D65138m1837m1853K4337k9841p0116l857l4350J9213J1482n7314k1262M0721
8770B60461R128l5853k3383O658K007L9009n808m9383j593J3567J3715k2284M5977
8757B52218l4595n4306l124P111j516K6770L9531N516J4292k4094K0020n0459
8745A97364j653l4472k3800L3002K6620P642Q2436L898j8484J647m9037m4072
8733A81091j0654m502L3778L7403m606n0891J479M712K600k0939K671L7033K9116
8720B38291k6782J2174q744r232Q161L3925J7170p1654j0385j2370j2022K1079
$$ y = [454071, 436129, 399544, 444137, 463045, 489216, 510228, 494234, 476447, 401350, 362725, 410327, 388248, 369315, 374005, 418517, 434219, 396124, 402771, 421446, 437489, 452160, 451131, 483777, 465138, 423301, 381448, 405785, 375944, 305828, 301971, 267621, 286834, 298316, 241002, 219740, 260461, 269589, 233736, 210353, 217011, 219018, 258027, 252219, 202836, 201243, 214810, 228525, 206241, 252218, 217623, 163317, 160193, 167304, 165788, 192558, 232089, 237605, 251897, 227803, 247823, 197364, 195711, 161239, 137439, 170441, 197061, 204703, 287139, 291037, 272553, 274200, 225163, 181091, 170437, 165935, 199713, 237116, 232510, 181619, 183098, 187810, 190410, 169471, 172142, 209175, 238291, 211509, 223683, 214939, 205707, 213868, 247793, 264963, 193309, 182924, 170554, 158532, 179611]
8708A79611K1199M796j4309k553J2010m5611m6003L1778K1363n4100k0918M5836
8696A33099p274o4155n3444N4607O3826K0012K5043O2317J7766m6987l7240J6646
8684A84216L8009k8612k3324m463l7028L7416L9312j9119k5947q984r842j4945
8672A26689j9838J2054L5348Q5835K8773m3161N2570j2810j9503Q004J8712N4876
8660C27549k3230J427l8186k5271N330k8726O479k3424l2301m1829m8224M6797
8648A26391P1428o524j3188K1312O7596l2543p0358R969R561k0597J5276L5020
8636B13343j8695k7172L1815P471J0853N695m541j7705j9421j5940L0038O7123
8624B62864j4669m8165k4353N8120J8647J7315j6791j4066K8679j3230m7499K9352
$$ y = [179611, 200810, 205606, 191297, 188744, 200754, 155143, 109140, 140918, 162281, 108181, 87263, 133099, 125825, 61670, 8226, 62833, 126659, 146671, 171714, 234031, 251797, 204810, 167570, 184216, 222225, 193613, 170289, 165826, 128798, 166214, 205526, 186407, 160460, 151476, 141634, 126689, 106851, 118905, 154253, 240088, 268861, 225700, 278270, 265460, 245957, 253961, 272673, 327549, 304319, 305746, 267560, 242289, 247619, 218893, 225372, 201948, 169647, 127818, 79594, 126391, 197819, 191295, 178107, 199419, 267015, 234472, 164114, 174083, 183644, 163047, 178323, 213343, 194648, 167476, 199291, 206762, 217615, 223310, 218769, 201064, 181643, 165703, 195741, 262864, 248195, 200030, 175677, 233797, 252444, 269759, 252968, 238902, 267581, 254351, 206852, 236204]
8612B36204O371m9007k2255m3949P735N164j8303J2974Q918P051j2374L486J1788
8599A53803J0092M843j5529K6703k3092K7184M1615j8618Q841L1761P2614K3099
8587C43316K2456l3521k5927O705k7003q603J3818k4641l2079j02927j8702R2629
8575B05521L9620k0028k8093L9257J1128k5900l8408n799O364L0354K3470j4790
8563B22696k9327o220N9409K3789K4535O344n7568k8458m024J9020L2148k9523
8551B32821l3099p4252k4330J9548J5784K821R780M5998L4246k6219K688j8970
8539A86816n461j5302m2545k5487N3090K5266j0248K4385P451J1889L5291O3399
8527C08544K7918j3527o6471q1030k4386m6283J8313J1120r982L6386M7358k3037
$$ y = [236204, 242575, 193568, 171313, 127364, 135099, 140263, 121960, 134934, 143852, 150903, 138529, 142015, 153803, 163895, 168738, 153209, 179912, 156820, 184004, 225619, 207001, 215842, 247603, 320217, 343316, 365772, 332251, 306324, 313029, 286026, 277423, 291241, 266600, 234521, 131594, 112892, 205521, 245141, 225113, 197020, 236277, 247405, 221505, 183097, 177298, 183662, 214016, 237486, 222696, 193369, 187149, 246558, 270347, 294882, 301226, 243658, 215200, 211176, 230196, 262344, 232821, 199722, 125470, 101140, 120688, 136472, 139293, 149073, 195071, 229317, 203098, 205786, 186816, 181355, 166053, 123508, 98021, 151111, 176377, 166129, 190514, 197965, 209854, 245145, 308544, 336462, 322935, 256464, 175434, 151048, 104765, 123078, 134198, 124216, 160602, 207960, 184923]
8515A84923K7296N9348L0780j4984L4975l6918l2795j2748O569L519m7076j6030
8503A86859k1076J7346k148m4007j8884J4306l667n1831J2638L9317N9391Q304
8491A96548K0889M6280K805O1213L5018N2971Q299j4236J2167J9108Q6471l3629
8479D93904j02230j06572p4496M9972k9868r6237k8628L2980J3153l571j8978
8468A29429K8285M3468L59m3677p8143n566O113N882L5142K1578M994K9089k6418
8455A50535n268o527o037j3738J706M0108M1752J4458O832r445j06671k4258K6682
8442A10129J1372K5315L9935K92L8761Q0888J3666l2860n9405K8742m1085n5997
8430A59753j1625l2636o602K3897n373J529k5933k2494j9749l7727L5108r245
$$ y = [184923, 212219, 271567, 302347, 287363, 322338, 285420, 252625, 239877, 246446, 249965, 202889, 186859, 165783, 183129, 180981, 136974, 118090, 132396, 128729, 76898, 89536, 128853, 188244, 196548, 217437, 263717, 266522, 327735, 362753, 415724, 424023, 409787, 421954, 441062, 527533, 493904, 391674, 285102, 210606, 260578, 230710, 134473, 105845, 138825, 151978, 148407, 129429, 157714, 201182, 201541, 157864, 79721, 74155, 80268, 86150, 121292, 142870, 147864, 176953, 150535, 145267, 138740, 132703, 118965, 120671, 160779, 202531, 216989, 223821, 214376, 107705, 83447, 110129, 121501, 146816, 186751, 187043, 225804, 306692, 320358, 287498, 228093, 256835, 215750, 159753, 148128, 115492, 108890, 132787, 127414, 128943, 103010, 80516, 60767, 23040, 58148, 48903]
8418D8903l5237K2153J8371l1440l0051K9647K0637j8884r04r171J6046o166L9487
8405F3391K6398j1051L3700K920k1165k0214K7723J6265J586l6155o4493J0378
8393B9283J157j5930J7301k3341j7702l8091n641N0471L2636m512k0658j253K3682
8380B7402L5307n945j6434m2787K6665M6126J8728l7263l0424j3260J6153K2908
8368D7176q193L2519k4737j4410q3117j7843J8074J3784K0287N082M4284k3951
8356H955k7742J6238M3501J5108j4975R482l3010L4750r62k0497K7900r062k6994
8343B2692M040l1904o8515m4813l329J11516N9988m4353M0956L8547k0137m2787
8331B1901K7593O8600r304n2544p2966k4195L0819K898J4143J1569L2924j5813
$$ y = [48903, 13666, 35819, 54190, 22750, -7301, 22346, 42983, 24099, 23195, 14024, 30070, 23904, 63391, 89789, 78738, 112438, 115358, 94193, 73979, 101702, 117967, 119553, 83398, 18905, 29283, 30440, 14510, 31811, 8470, -9232, -47323, -52964, -2493, 30143, 25631, 4973, 3720, 27402, 62709, 56764, 40330, -2457, 24208, 70334, 89062, 51799, 21375, 8115, 24268, 47176, 38983, 71502, 46765, 32355, -50762, -68605, -50531, -36747, -16460, -11378, 32906, 8955, -18787, -2549, 40952, 56060, 41085, 50567, 17557, 52307, 51345, 30848, 58748, 49686, 22692, 26732, -5172, -73687, -118500, -121829, -10313, 49675, 5322, 46278, 84825, 64688, 21901, 49494, 118094, 108790, 56246, -16720, -40915, -10096, -7198, 6945, 18514, 51438, 35625]
8319C5625K894L8783N9459O463k3345m3099J1047l734j3941k3313q813K9084l4044
8306C3066j3790J859q627k7436k6634O1824j4445K8667J4724l1764n8745L2517
8294h784K1752J0567K0867L7430j6065m9433Q249l021j5731k689m247M7532O20
8281D7047j903O807m253J7533Q25k9936o25k5841k3807k5708N2325J5680Q380
8268C6524k75k4264J9296j5774o9465J593J5196Q4772Q616K6657J2775k2361m2121
8255C1169l2636j2290L2740J7767j9753l1389j3724N9804J2305l4886M328K1121
8243C4556k0157J5635q308J507N5091L0224l885m6996l6546R44n1997K7464M4844
8230D2376J5034M8159J4969l8287k4618m3677o549l459J0537N5138M8300l6614
$$ y = [35625, 38519, 77302, 136761, 143224, 119879, 76780, 87827, 84093, 70152, 46839, 38026, 67110, 33066, 19276, 21135, 12508, -14928, -41562, 20262, 5817, 34484, 49208, 17444, -41301, -8784, 12968, 23535, 44402, 81832, 65767, 16334, 24583, 21562, 5831, 3142, -1105, 46427, 47047, 45144, 51951, 47698, 65231, 66056, 36120, 35495, 9654, -14153, -39861, 12464, 28144, 36524, 36249, 11985, 31281, 15507, -53958, -52365, -37169, 47603, 56219, 82876, 95651, 73290, 31169, -1467, -13757, 18983, 36750, 16997, -14392, -28116, 31688, 43993, 9107, 13435, 34556, 14399, 30034, 21726, 23233, 78324, 108548, 104663, 57667, 21121, 22065, -29932, -2468, 42376, 57410, 105569, 120538, 82251, 57633, 13956, 7407, 3948, 14485, 69623, 117923, 81309]
8218H1309o7029p979N9312J5177j7262L864k318m2932j834Q227j8889P577K1236
8205C8459k7116m0496m3844L199N998J8489K9123l602p543m40J1855J030J5720
8192H32j50L0239k6643J1884n7651j690O5849n332q6319j3678M4373n194q009
8179e1489O8978J9286m9913q977L1701L642k4101L4174L3695j2268O147j2712
8167C8163j6958l198L2390J0558p1404j5415k6626l3866J1142K9011N7746l351
8155H192K2762j47q612r501o337L3141n9918l8971p66p096R955O1576O4250l5702
8141C2826l706M1282L4814k2067j7532j3746Q455m2004K698O862K4817R584Q725
8128G1008o1319k1184J4568N66N894k1531n180k1879k9779K3624M7787N4411L5747
$$ y = [81309, 14280, 6301, 65613, 80790, 63528, 67392, 65074, 22142, 20308, 28535, 9646, 17223, 38459, 11343, -29153, -72997, -69798, -63800, -45311, -16188, -19790, -27333, -27773, -15918, -14888, 832, 682, 30921, 4278, 16162, -41489, -43179, 22670, 17338, -68981, -82659, -38286, -43480, -51489, 17489, 36775, -13138, -22115, 9586, 13228, -10873, 23301, 56996, 44728, 50875, 38163, 21205, 18007, 50397, 60955, -10449, -25864, -52490, -86356, -75214, -46203, 11543, 8192, 30954, 30807, 22195, 12694, 6357, 39498, -20420, -59391, -60157, -67253, -57298, 4278, 68528, 32826, 29120, 70402, 105216, 83149, 65617, 51871, 60326, 18322, 21020, 27882, 52699, 62283, 71008, 9689, -11495, 3073, 3639, 9533, -11998, -17178, -39057, -68836, -45212, 2575, 56986, 92733]
8115I2733L1360J581l8815l2738j1449l3083n3028l4492R604K3435L0892l7601
8103e1601k3399r48Q044M2477l451n143k5985l3157L9632O7699M6865J4394l4772
8090D0655k5967l4673K6982K5759K3581m514j5769o1786p5699J7651K2506L1396
8078b9878N1844r283n378R289L0405k0700j6550j0719K047j6740k2268J5834J6048
8065f049j228o6847K359P922K4085K8015l1067O773L5969R940J4764O389o7571
8052c6546M782K1772L8846K1579K2061K8791J4645m5242m0391L7821j3981q275
8040D5862l1887L131k0071j3504K4153K3122K7370l3279J983k2522L2440j2512
8028B4286K15r616L4801M0285R399J5991J9453q2373l2833L4332P430k156l2458
$$ y = [92733, 124093, 125674, 86859, 54121, 42672, 9589, -43439, -77931, -68327, -44892, -14000, -51601, -75000, -75948, -67904, -25427, -28878, -34021, -60006, -93163, -53531, 14168, 61033, 75427, 40655, 14688, -19985, 6997, 32756, 56337, 51823, 36054, -25732, -101431, -83780, -61274, -29878, 21966, 12683, 7305, 16594, 46999, 26299, 9749, -970, 1077, -15663, -37931, -22097, -6049, -7277, -74124, -71765, -63843, -39758, -11743, -42810, -36037, -68, 9872, 24636, 31025, -36546, -31764, -9992, 28854, 50433, 72494, 101285, 115930, 70688, 30297, 68118, 54137, 45862, 13975, 17106, -2965, -16469, 7684, 30806, 58176, 24897, 26880, 4358, 36798, 24286, 24501, 14885, 49686, 89971, 99370, 115361, 134814, 52441, 19608, 53940, 61370, 59214, 26756]
8015B6756k4752L4564o842k4378J9833K4797j4989n4112j1905j9670K2771J0812
8003a7115P5808K0125j7595j1275J6148K3499L5123L466m1269l5079j7614j3413
7991B0809N977K578P4321L6914j4295M828k8197l9565K249j3748l571m6777l5175
7978c3652j5152K3307K6753l1177l4000R395J1320L1644L9171j1292j7960m758
7966f401k256M2201K3300k8813j5656M0842K7879n1252j03517M461N2341L5966
7954A9095K5053j775r404m115Q030K568k7167J5357m284j6271j5763L5913j0015
7941A7222j6068l1348K4928J1039L53m342n2818k9805J3074M346K9847n519O2316
7928B3225K2693M278M415m4379K9236p457j7954j1441J5962j3422R14J8739j7221
$$ y = [26756, 2004, 36568, 29726, 5348, 25181, 49978, 34989, -19123, -31028, -50698, -27927, -17115, 58693, 78818, 61223, 49948, 66096, 89595, 124718, 128184, 86915, 51836, 34222, 20809, 26786, 29364, 103685, 140599, 126304, 131132, 102935, 63370, 65619, 51871, 48300, 1523, -33652, -48804, -25497, 1256, -29921, -63921, -54526, -43206, -11562, 27609, 16317, -1643, -6401, -8657, 33544, 56844, 28031, 12375, 53217, 81096, 29844, -73673, -69212, -16871, 19095, 44148, 42373, 32969, 28854, 36884, 39452, 12285, 27642, 23358, 7087, -8676, 27237, 17222, 1154, -30194, -5266, 5773, 6126, 1784, -51034, -80839, -67765, -63419, -33572, -39091, 23225, 45918, 50196, 54611, 10232, 39468, 32011, 14057, 2616, 18578, 5156, 6070, 24809, 7588]
7915G588l1070O3785J1561l0588k4789k1515L9043J0129M8439j2118Q1j2529m1880
7902F137N3182q786p1228q221Q4550P4087n1587n2868n5170J994R093j6281R436
7889b5662M6969p416n6517J9859L3536J11762q694m5638p513L061n1400j035J0697
7876B2009l3035k5910M5279J5604m7746j6126J5329l542J2284n508l264K103K4299
7863A776K702o954O2873K5578l2863k7732l988j9376J2515N1592L6532l4800l9547
7850B8308m7781P883L7513j7513J875J897j9337n9580M259M4427L3104l0482l2004
7837d7431L2109K0790J4034l492q366p455M0016n804Q574j4651L190m7024K287
7824a3223L5422K7670q2803k1290n926J8754K3888N1317J7440J153J8091j3857
$$ y = [7588, -23482, 40303, 51864, 21276, -3513, -25028, 14015, 24144, 72583, 60465, 60546, 48017, 6137, 59319, 50533, -20695, -28916, 55634, 129721, 78134, 25266, -29904, -27910, -18817, -35098, -25662, 21307, 13891, -42626, -22767, 10769, 122531, 113837, 68199, 60686, 63747, 12347, 11312, 22009, -11026, -36936, 8343, 23947, -23799, -39925, -24596, -28138, -15854, -21362, -24626, -22523, 1776, 4478, -2476, 60397, 85975, 53112, 25380, 21392, 2016, 14531, 66123, 102655, 67855, 28308, -19473, -11590, 25923, 8410, 10285, 12182, -7155, -66735, -62476, -18049, 15055, -15427, -47431, -15322, 5468, 19502, 16010, 7644, 189, 40205, 34401, 42975, 28324, 31514, -15510, -13223, 22199, 49869, -32934, -54224, -60150, -41396, -17508, 33809, 51249, 52402, 70493, 56636]
7812E6636k8215n227m9154l6975k5627K7255K8606K3526n406l8221M0419M3900
7800C1517j9590K8736J3294m9256l4334m7192k609J6053p544K1279K2572K5005
7788b069j382J0451N3403J5717o1282k9332k4120K1395P5963L4047m1651m4538
7776F602j0066j9438Q81Q7321R061n3004n2329J7617K8964j7922K353M2600n0153
7763g513o2222n1724N1046M8957Q6942Q5628k4300p7932l3714l6719K5285J907
7751E641J719m9248p1233L9028K1499J3117M1607M495q482k5329O5563K4790L3652
7738I6819o549k441p159l8802l8794l7135J2834J2681k6682j6203L7832j4371
7726b7970K198J1380M7776N2942N56m8209M0005O648n0618k7775l3035m0137K1688
$$ y = [56636, 28421, 23194, -25960, -62935, -88562, -61307, -32701, -9175, -14581, -52802, -12383, 31517, 11927, 40663, 53957, 4701, -29633, -76825, -79434, -63381, -70925, -49646, -27074, -2069, -3451, 7000, 60403, 76120, 14838, -14494, -38614, -17219, 58744, 92791, 51140, 6602, -3464, -22902, -22021, 65300, 74361, 21357, -30972, -13355, 15609, -2313, 40, 42640, -7513, -69735, -121459, -70413, -21456, 65486, 151114, 126814, 48882, 15168, -21551, 3734, 5641, 7360, -41888, -113121, -74093, -52594, -39477, 2130, 6625, -1857, -27186, 38377, 63167, 96819, 90270, 87829, 80670, 41868, 3074, -34061, -21227, -8546, -35228, -51431, -13599, -27970, -25772, -14392, 33384, 86326, 86882, 38673, 78678, 85326, 34708, 6933, -26102, -66239, -44551]
7713d4551L3771R545J0096q986k3169P783M9626K5563N823R244J8537l6096l554
7700E3632J8743R733l7952l4113p733j7154K5669L0732l4201o8445M426N7824
7688A161j4139k0662M108K5827q137N3506M1840m2984m2340o510M1079o916p4072
7675d8239J0952M5837j4379j2222N227J0470k3531O797K3989O0514j0899k3601
7663C0915M1565j7842m0443j7438L014l7J4172j6811r674K4209J437n5180l7648
7650g9761k2664Q792L2719K5584k3423k069K2272L0693J2907K7583j7530J0784
7638B5887n401j2480j3191J4547K1564l2077O0907M0168j644p0676k0482K0407
7626B7529j8990k9904J8497J8782k1103m4953M6853N6144l6511k1559L3347l0248
$$ y = [-44551, -10780, -1235, 8861, -125, -23294, -15511, 34115, 59678, 65501, 74745, 93282, 57186, 53632, 72375, 82108, 44156, 10043, 2310, -14844, 10825, 41557, 7356, -61089, -56663, 1161, -12978, -33640, -29532, -3705, -11842, 41664, 83504, 40520, -1820, -8330, 32749, 25833, -48239, -37287, 8550, -5829, -18051, -12824, -2354, -25885, -19088, 4901, 65415, 54516, 30915, 72480, 54638, 14195, -3243, -229, -266, 13906, -2905, -12579, 11630, 13067, -42113, -79761, -102425, -93633, -60914, -35330, -58753, -60822, -38550, -7857, 5050, 32633, 15103, 25887, 20486, 8006, -5185, 9362, 30926, -1151, 59756, 99924, 98280, 27604, 7122, 27529, 8539, -21365, -2868, 15914, -5189, -50142, -3289, 52855, 16344, -5215, 28132, -2116]
7614b116o452j9297r0487J9911L9450L9844K3675m127K4252Q922R25L4759l7346
7601C1913J1521o59n1656J8801M2672m2651J4125J7235J4302R217j6001m7363
7589A456R570J2576J0233k0190R537M4442N268M953l4222j7132k4210k6613k1169
7576d5501o2999L2290N0102j4508M0055O4474J000j7886n1461J5648k6509k322
7564a7617J588o045l9374k2625L6904P349K906k9951k5461K3216J6453L7751L1215
7551A6309J4244o3971l7768L4954L4460j8242j3729l3663m055P692L7584O823
7539a9362m4942k9664K5035M2403j2268n042L2176K101j5843L5916O6824J0410
7527H7744m6603k0220l0758k3071l952j5016J5942K9333K6725O553M5216n5501
$$ y = [-2116, -8568, -27865, -118352, -98441, -58991, -19147, 4528, 401, 24653, 33575, 34500, 69259, 31913, 43434, 42775, -8881, 9920, 52592, 9941, 24066, 41301, 55603, 64820, 48819, 1456, 11026, 23602, 33835, 13645, 23182, 67624, 72892, 77845, 43623, 26491, 2281, -24332, -45501, -108500, -76210, -26108, -40616, -561, 63913, 64913, 47027, -4434, 11214, -15295, -17617, -16029, -22074, -61448, -84073, -47169, -39820, -36914, -66865, -92326, -69110, -52657, -14906, 16309, 30553, -33418, -71186, -36232, -1772, -20014, -33743, -67406, -71461, -63769, -26185, -19362, -64304, -93968, -68933, -26530, -38798, -43840, -11664, -9563, -25406, 10510, 77334, 87744, 41141, 20921, -9837, -32908, -36860, -51876, -35934, -6601, 20124, 26677, 71893, 16392]
7515A6392J3416k5852m5769k5184L0125P3907J1461j0373j5938k8127m4584K3060
7503b7466K1539j4950K0415L3930J3788K0183l1536j3213K5950J316K7599Q953
7491H6508m466m4512l469k8615l6569R894O1369Q2498J441j9468n2462m123J01053
7478A49079K6342o1117o1857m2232k6288o030l632l9781l6122L7418N9366N3582
7466D8728L2097j9249n7267k7017R88N622j8654M71K8861K9979l924J047k477
7453A9205K0242J3132k3974M700K4323L3758m98m9706l4034j9154M394M7938r494
7440C0832J2061k7705K4349l654l047K3402r796q841l1869J1719k4667j5610j9298
7427d2124M9027K0305l0323N5862j4491j3963n273j9668r056L0457J7947l4322
$$ y = [16392, 29808, 3956, -41813, -66997, -36872, 37035, 48496, 38123, 22185, -5942, -50526, -27466, -5927, -20877, -462, 33468, 47256, 67439, 35903, 22690, 48640, 49956, 77555, 86508, 82042, 37530, 34061, 5446, -31123, -21229, 40140, 122638, 124079, 104611, 52149, 48026, 149079, 175421, 114304, 52447, 10215, -16073, -22103, -25735, -65516, -101638, -64220, -4854, 48728, 80825, 61576, 4309, -22708, -21720, -16098, -34752, -34281, -5420, 24559, 20635, 21682, 19205, 39447, 52579, 28605, 33305, 57628, 91386, 90888, 41182, 7148, -12006, -7612, 40326, 30832, 42893, 15188, 39537, 35883, 32836, 56238, 46442, 37601, 5732, 17451, -7216, -22826, -42124, 6903, 27208, -3115, 52747, 38256, 24293, 19020, -648, -9704, 20753, 38700, 4378]
7415D378j4293N2819j1648o7637Q7510j0418k9209k4171j5547L7322J778j9962
7403i078K330J9091o02J7898K3089q484K3765k2230J7420m0030m0035K3985O3261
7390G0380o838m0967M660K5468J9823n9607q9276k9071Q242R1083R5703N133K87
7377I5020p4737l4821M971j6988l0844M0350K5175j1821j6499j9582L3579M4263
7365C8066J7453j4097K2350K8699m4430k148K249L9078m2159k2005K4792J1753
7353E9601n3094l4010p570J6354J1222L89N659K1546k072K6892K1959k3465M088
7340D7499J509m07N245O575R226M141N2485m042l3851j4241j5353j5837j4094
7327B8855K0653Q554l6222k0869j5239J7991J8719l3765L658K4063m160j3425
$$ y = [4378, -9915, 42904, 31256, -36381, 51129, 40711, 11502, -12669, -28216, 9106, 10884, -9078, -6748, 12343, 11741, 29639, 52728, 44244, 68009, 45779, 63199, 23169, -16866, 7119, 70380, 63542, 22575, 27235, 52703, 72526, 12919, -76357, -105428, -97186, -6103, 89600, 94733, 95020, 20283, -14538, -9567, -26555, -57399, -17049, 8126, -3695, -20194, -39776, -6197, 38066, 55519, 41422, 63772, 92471, 48041, 45893, 48142, 87220, 45061, 23056, 47848, 59601, 6507, -27503, -35073, -18719, -7497, -7108, -1449, 20097, 18025, 44917, 66876, 43411, 47499, 49008, 48601, 53846, 60421, 69647, 73788, 126273, 122231, 88380, 74139, 58786, 42949, 28855, 49508, 58062, 21840, 971, -14268, 3723, 22442, -11323, -7665, 16398, 12238, -1187]
7315a187K0560J357j8717k2746K6441K0041J2098l337m4501k318m0912j3401K6439
7302d0183L1370l497o0767l0151p288O6564M8075k3509J5262L220K7326J7524
7290D3946j9621m4507J0549J6361K0280L1250l3249j1017k90j6833M532m1126
7278c9725K1285l0907m3878K9195N4239K4016J278l6520n287L675J5844J908O9997
7265F5120J1888k3339K8296J6173n1861K0165M3598O775m9837j5775j0191k1836
7253A9176R170k262m7739j9825J9128L2670J1046L2296L9222q5920l8771J6643
7241a5166j6874L4979K9520J9877K1540p846k7722o136N966j2403k5698r115l253
7228a2331J3482N7612L1194k4122k3436n647j6163J4817j3091j2719k3797M513
$$ y = [-1187, 19373, 20730, 2013, -20733, 5708, 25749, 37847, 34510, -9991, -12309, -53221, -66622, -40183, -8813, -12310, -73077, -103228, -110516, -43952, 4123, -19386, -4124, -904, 26422, 43946, 24325, -20182, -9633, 6728, 27008, 58258, 25009, 13992, 13702, -3131, 1401, -39725, -18440, -49347, -93225, -64030, -9791, 14225, 15503, -21017, -26304, -22629, -6785, -4877, 65120, 77008, 53669, 81965, 98138, 46277, 66442, 110040, 116815, 66978, 51203, 41012, 19176, 28346, 26084, -21655, -41480, -22352, 10318, 21364, 53660, 92882, 6962, -31809, -15166, -32040, 2939, 32459, 52336, 73876, 66030, 38308, 32172, 38138, 25735, 37, -9078, -12331, 1151, 58763, 89957, 65835, 42399, 36752, 20589, 35406, 22315, 9596, -14201, -9688]
7216i688K6252m697q830n337K4165K8216J3583j8382l7478n146J3373K7948j2108
7203C1871q2398O0774J9399L4624k7374l9142L6051m453r262k9702K4118L0432
7191D4938l5597j6996M7507J8899l6920j0799N198K634n8045l7898L0058N991
7179d1030Q840j0689Q424K6994k4160j9837N4498R8989Q362l2060n2541o1019
7167c5229k4334K4393j1595k5574j1337L0135L4858j2800j0198q1053m2461J4471
7155a50724L1048N3527M1480k7737J92j8837j0925J4513O195j4814K7458R2592
7143D3968M7094J2786l8021p66q808r429N485j5399k9391k7847L0348N7855k7526
7130D0349o3413j5911N4851N7211k4172l9657L0496L4116N355j5453J3458K3145
$$ y = [-9688, 16564, 11867, 3037, -2300, 21865, 50081, 63664, 45282, 7804, 2658, 16031, 43979, 31871, -50527, 10247, 29646, 64270, 36896, -2246, 33805, 29352, 20090, -9612, 14506, 44938, 9341, -7655, 39852, 58751, 21831, 11032, 16230, 18864, -39181, -77079, -47021, -41030, -32190, -42879, -34455, -7461, -31621, -51458, 3040, 102029, 110391, 78331, 25790, -35229, -59563, -35170, -46765, -72339, -83676, -53541, -18683, -31483, -41681, -122734, -165195, -150724, -119676, -66149, -24669, -52406, -52214, -71051, -81976, -67463, -61268, -76082, -48624, 43968, 91062, 103848, 65827, 65061, 56253, 46824, 52309, 36910, 7519, -20328, 10020, 67875, 40349, -23064, -38975, 15876, 73087, 48915, 9258, 39754, 73870, 79225, 63772, 77230, 100375]
7118A00375p1156n3827l1476j8596P39j7801j5838O7466P8078nL9710m37l6138
7105D1094L268l905k8378l5179q827O2451M598O1536m4545m1665k3792m2595k4095
7092h0034p430K5145K5938k6203J8926L203R870o436k6436j4408j674o1608K5032
7079a16115N0172L6086j6899J8043N4725n037n921K1642m2010R175P2440p3897
7067B404n8909N31M4573L6280q864k355o481n8200J2706j1139J0593J7251J4373
7054g237l4593K2326J3857O336j1605K8339j0433M3845N9067J9325l8401n1667
7042C9159M934N0999l6472m7911K8849k598M9212k5307p3827k1854J5615N505
7030a3696L8112J8818K883p205k4912o7221k2477J7532K7675Q1516N4386k3919
$$ y = [100375, 29219, -24608, -56084, -74680, -73941, -91742, -107580, -40114, 37964, 37959, 77669, 77232, 41094, 44362, 40457, 12079, -23100, -31927, 30524, 35122, 96658, 52113, 10448, -13344, -55939, -80034, -87464, -62319, -36381, -62584, -43658, -40455, -30585, -37021, -63457, -77865, -79539, -141147, -116115, -65943, -29857, -46756, -28713, 26012, 20975, 15054, 36696, -5314, 3861, 76301, 2404, -56505, -55974, -11401, 24879, 16015, 13660, 7179, -51021, -38315, -49454, -38861, -21610, -7237, -41830, -19504, -5647, 689, -10916, 17423, 6990, 50835, 109902, 129227, 90826, 39159, 44093, 95092, 58620, 10709, 39558, 36960, 86172, 60865, -12962, -34816, -19201, -13696, 24416, 43234, 46117, 38912, 14000, -53221, -75698, -58166, -30491, 51025, 105411, 81492]
7018H1492k8476j9051j6010m7560k4185K2360K7969R72n4084l4619L9715M0657
7006a0820j5626j1374K843J9788J0549J4642j7012m2755r062L3271K4694K7932
6994B7070o2041n151m875P615J2731K9738p025k1261r654K3605M6242j96q324
6981B8474K0497j6104J8892J4452K9899k8274j967J4416j3543n4774m1418J914
6969b7536J3938K9782N5595J0666m0100m1254K10j0685k7971k9002O2212O3497
6957E9352l8084n2237M342j0996k2162K5890j0086j1674K1197L4954L4241j9712
6945A5025l0424J6012P989l9894K7517P618o215l6887o652q641Q142M4568K9383
6932B7541j9043K199m8860j8972l0391K0501N2452K0177j570l2679K6515P105
$$ y = [81492, 53016, 33965, 17955, -29605, -53790, -31430, -3461, -2489, -56573, -91192, -51477, -10820, -26446, -37820, -34977, -15189, -4640, 10002, -7010, -49765, -58827, -25556, -862, 27070, -34971, -40122, -44997, -37382, -24651, 5087, -1938, -23199, -32853, -9248, 36994, 36798, 28474, 48971, 32867, 51759, 66211, 96110, 67836, 65869, 80285, 66742, 11968, -29450, -27536, -13598, 16184, 71779, 82445, 42345, 1091, 1301, -9384, -37355, -66357, -4145, 59352, 21268, -30969, -26627, -37623, -59785, -33895, -43981, -55655, -34458, 496, 34737, 15025, -15399, 613, 8602, -31292, -3775, 3843, -2372, -39259, -45911, -54552, -46410, -1842, 27541, 8498, 10697, -38163, -57135, -87526, -67025, -14573, 5604, 4034, -28645, -2130, 4975]
6920D975N6522l3662m6927j9298L9789o0732m0700L8111k0500M616L9078M4690
6908E962k4975j6853m0330K6865M0677j897K0143M1968k2170k9526K8442K8746
6896E7052k5589k6556p343J7697O343L4663P55K4072l2095J865M548k1608m8090
6883a4286K938K1227K3173m3478j1795j5028J4371M1512Q20Q997r837M4460j6457
6870D6617j154m53m1848m1976N8996N8192O0153M5250l8179N019K4528j0946J3223
6857A77422o3450m8837p2954m9369J6484Q1733j4814k3322K2965K173K696l7272
6845f545n540N1317k2196k7894J481l787k0389k6022l9309R707N9583M5915M7693
6832F4014L6632M538n108k8650k6551j4138l6656j6753M9936R632R952n4025m475
$$ y = [4975, 61497, 27835, -19092, -38390, 1399, -59333, -100033, -61922, -82422, -77806, -38728, 5962, -19013, -35866, -76196, -49331, -8654, -10551, 9592, 51560, 29390, -136, 28306, 57052, 31463, 4907, -2436, 15261, 21604, 56267, 57022, 81094, 48999, 50864, 55412, 33804, -14286, -11348, 9879, 33052, -10426, -22221, -37249, -22878, 18634, 19454, 28451, 18614, 63074, 46617, 45463, 45010, 3162, -38814, 20182, 78374, 138527, 183777, 145598, 150617, 175145, 164199, 177422, 113972, 65135, -7819, -57188, -40704, 41029, 26215, 2893, 25858, 28031, 30727, -6545, -12085, 39232, 17036, -10858, -9377, -13164, -33553, -59575, -98884, -89177, -29594, 16321, 64014, 100646, 105184, 100076, 71426, 44875, 30737, -5919, -22672, 27264, 36896, 46848, -7177, -11652]
6819a1652K3375J5601K408J9995n8639l4950M2293N9642K7855l535l8937j2942
6807C0514j093k3506j1639k3025m649j5439L9472N6790k7321j6240k4247k8870
6795d9253k2027M0953o8847m33J26988J7343m6391m4688m7475J7050J5518P828
6783e3434l5398K3595O4583q198j1553j6506k9471m984n17m2416l2932L104K6707
6770a17420J02629Q6349M771n472p3350l9178O2739M9157n6036M35L0395q444
6758C6575k9631n1478O1501P8185k4360l3841k0909l5637n0232m5675K3682Q662
6746h3158J5199K1219l3592j3993N0990J9938o286M9266L5986l7527J8884m4956
6734h030n7913j8882J1534L130j735K8604O4948J8329l3268k3145n2983m5297
$$ y = [-11652, 11723, 27324, 29732, 49727, -8912, -43862, -1569, 58073, 85928, 82393, 43456, 30514, 29421, 5915, -5724, -28749, -33398, -48837, -9365, 47425, 20104, 3864, -20383, -49253, -71280, -30327, -99174, -99607, 27381, 44724, -1667, -46355, -93830, -76780, -61262, -53434, -88832, -65237, -654, -8852, -20405, -36911, -66382, -71366, -71883, -114299, -147231, -144127, -117420, -14791, 71558, 76329, 70857, -2493, -41671, 21068, 70225, 14189, 14624, 45019, 36575, 6944, -44534, 16967, 95152, 70792, 36951, 16042, -19595, -69827, -115502, -91820, -83158, -67959, -46740, -80332, -94325, -43335, -23397, -29683, 19583, 55569, 18042, 36926, -8030, -65943, -84825, -73291, -70161, -71896, -43292, 21656, 39985, 6717, -16428, -69411, -114708]
6722a14708L9512N0512K0021J1082N0158l5969o8470J2101P6676J8424r811m3198
6710F330j1119m010L517k5896m1542K5831J2656j2184L6355M9657N4008k2646
6698G0957q402j4748n1312J735L5755k4406l0548l4726K305K1789N2753L9935
6686F1087j7683P668J527m8607N553O399J1202j541K0017n108Q911o450k5703
6673A7272l2693o873o606j6246J9762k83p065K3460J6483L5127N917J115n905
6660D3465O950R51o052J1151k9270J7440K0496o056j0604l6905k8631l7548J5081
6647c9532O87j4565N5704L4371O0861k8577k4828l4562J074m686o633O847L4117
6634D0278j9577j0888q084l1037k7648M9235L1462j4357J8306N3085k8812l556
$$ y = [-114708, -75196, -24684, -4663, 6419, 56577, 20608, -47862, -35761, 40915, 59339, 49528, 6330, -4789, -8799, -5282, -31178, -72720, -46889, -34233, -46417, -10062, 39595, 93603, 70957, 62555, 47807, -3505, -1770, 33985, 9579, -20969, -55695, -53390, -31601, 21152, 61087, 43404, 51072, 52599, 3992, 9545, 15944, 27146, 25605, 45622, 40514, 49425, 42975, 17272, -15421, -22294, -28900, -45146, -25384, -25667, -32732, -9272, 7211, 42338, 48255, 49370, 43465, 50415, 51366, 45314, 56465, 27195, 44635, 65131, 59075, 48471, 11566, -17065, -54613, -39532, -38845, -53410, 2294, 36665, 97526, 68949, 44121, 9559, 10633, 5947, -686, 6161, 40278, 20701, 9813, 1729, -29308, -56956, -7721, 23741, 9384, 27690, 80775, 51963, 48407]
6622D8407O542m6976K9685J4653o8984n1153K8587K5918J4037K2273l1414k3301
6610c1726k7267O561O9259J3500p360n5194j022N812m034p258p84K3029K1030
6597D546K6943o6075k9855r686L1029j8967K8326K8693J0534k4644j3614l4955
6585f7725K917j3621Q268L4269k1890L5488j8527J6654N9993K6273j2379k0639
6573B9081J1366J6838j4804k6950j5917J545J0437j8132q765p273L5155l3409
6561b0828P620L0283K4171L561k9041l6921j0285M1154R379o9553m4928M2043
6549e3345K0177J4143N2438N387k3183O74j7937n3766L5816O5352M0984J33k1248
6536F5625k892k2157J6543K4520l0988k8749K8068j2428J8854j0703K053Q047
$$ y = [48407, 54949, 7973, 37658, 52311, -16673, -67826, -39239, -13321, 716, 22989, -8425, -31726, -58993, -52432, 16827, 30327, 22967, -32227, -33249, -27437, -31471, -38729, -39513, -16484, 4546, 31489, -34586, -64441, -74127, -43098, -62065, -33739, -5046, 5488, -19156, -32770, -67725, -64808, -78429, -70161, -35892, -57782, -22294, -40821, -24167, 35826, 62099, 49720, 29081, 40447, 57285, 42481, 15531, -386, 1159, 11596, -6536, -15301, -22574, 12581, -20828, -13208, 17075, 41246, 44807, 15766, -21155, -31440, 9714, 19093, -50460, -95388, -53345, -33168, -19025, 33413, 38800, 15617, 16291, -1646, -55412, -19596, 45756, 86740, 86873, 65625, 62733, 40576, 57119, 81639, 50651, 21902, 49970, 37542, 56396, 45693, 47746, 55793]
6524E5793l4166K4868M4624K5735L7471N682n2223j2592l179q0069k4033K9673
6512A7584m948J4532j0158o5349j2281J3211Q0175j8907l435J1106j9350M0797
6500D2977m9091k0892J455P213J5926j2288J8639k0865o5219K8109M6654R2805
6488H5423k0664m4036O3517J5140n0258o585L8455n6788j8389j9239J1000j4058
6476a6482L2759k4459j7447M9454J6785j386q31K334r685O234J3564j9716k6850
6463D274m7317M1084J4993j4941J9052K2568q297N0649m3273k269J0384k6008
6451B0899l4885K3267l42j0941n1256l1862l4760M429L6768N2743k836l1666j1695
6438g2137o749O383J2675j0580N138M6530L7669k1077m7220K377J5922m4299r161
$$ y = [55793, 21627, 46495, 91119, 116854, 154325, 160007, 107784, 95192, 92013, 11944, -12089, 17584, 12636, 27168, 17010, -48339, -60620, -47409, 32766, 13859, 10424, 21530, 2180, 42977, -6114, -27006, -25551, -18338, -2412, -14700, 3939, -16926, -82145, -54036, -7382, 85423, 64759, 20723, 84240, 99380, 49122, 42537, 80992, 24204, 5815, -13424, -2424, -16482, 16277, -8182, -25629, 23825, 40610, 39224, 38393, 40727, 31042, 37276, 50840, 31124, 4274, -43043, -1959, 13034, -1907, 17145, 39713, 31416, 82065, 38792, 36523, 46907, 20899, -13986, 9281, 8939, -2002, -53258, -85120, -119880, -115451, -78683, -25940, -28776, -60442, -72137, -78886, -72503, -59828, -70408, -65270, -18740, 18929, -2148, -49368, -46991, -31069, -75368, -84529]
6425h4529K3913K9763O1232J1987o5199K5393M2430J3534j5425l2396n4829l633
6413d7759J3175j623L9867m444m492M092L3874L2718r233m1745M4997N425P748
6400G2600j5088j3241l7011l9733P3761P0432m643l4595l6697q2678L207M7033
6388C347k037k505J539m7015k008O1127k527Q480n0227J2090N722o4577j3941
6375i2532O9919K7389k4336l5309K2207L482j3039J2294J3633j1628n1910j4992
6363i4822P3324R8219K4178M304m6129n5212q058o4224l2093j0697J3004K648
6351i5558K0199K383M5036P891j6242k9790P133k349k4550l1869M8409J05053
6339C5746J1973k7942j5073k1255k3340M405n167q35m1904P30R0833m817m7226
$$ y = [-84529, -60616, -30853, 30379, 42366, -22833, 2560, 44990, 58524, 43099, 10703, -44126, -47759, -34584, -36207, 3660, -784, -5276, -1184, 32690, 65408, 56175, 14430, 59427, 64852, 72600, 57512, 44271, 7260, -32473, 41288, 111720, 107077, 72482, 35785, -46893, -43686, 3347, 1310, -1195, 344, -46671, -48679, 12448, 9921, 18401, -31826, -19736, -14014, -78591, -92532, -22613, 4776, -19560, -54869, -32662, -29180, -42219, -29925, -16292, -27920, -79830, -94822, -21498, 76721, 100899, 105203, 59074, 3862, -4196, -68420, -100513, -111210, -98206, -95558, -75359, -72976, -27940, -20049, -36291, -66081, -58948, -61297, -85847, -117716, -69307, 35746, 47719, 19777, 4704, -16551, -39891, -35486, -40653, -41488, -83392, -82662, 8171, 3354, -43872]
6326d3872j0983L8407L7801o080K6620L8425j8525p7690p7331k1196M2844Q3116
6314A1536o221l8816k0016Q011K8145L9750l0364j7334K7414O042n0600n6517
6302i8970q022M3194N853J4935L8113J8123l6442J1814L2795j6690O2352J8495
6290H5550j0870j4630j338J9880m5169o2545m936O9015M6546j5263j9535o2807
6278a6102Q135L7533K5928J5264j250l755k90k5251l3834M86j0844j4185N4761
6265C6596K1107L840Q053J7203R097j2809Q750J8641M187k1218J3980n1279k9128
6252B7020L2760k5495k7509n544R808j4142L7788J2542n5055P329K3528l5050
6240a2020q525K4978R382j8926j7225K0120K3358L5287k7890J3610K1935l2701
$$ y = [-43872, -54855, -16448, 21353, 15273, 41893, 80318, 61793, -15897, -93228, -114424, -71580, 11536, 5315, -33501, -53517, -45506, -17361, 22389, -7975, -25309, 2105, 8147, -42453, -98970, -106992, -63798, -57945, -43010, -4897, 13226, -23216, -11402, 21393, 4703, 67055, 85550, 74680, 60050, 58712, 78592, 33423, -29122, -34058, 34957, 81503, 66240, 46705, -16102, -7967, 29566, 55494, 70758, 69508, 65753, 65463, 40212, 6378, 6864, -3980, -18165, 36596, 57703, 61543, 69596, 86799, 95896, 83087, 91837, 110478, 114665, 93447, 107427, 56148, 27020, 59780, 34285, 6776, 1232, 11040, -3102, 34686, 47228, -7827, -498, 23030, -12020, -20545, 4433, 13815, -5111, -22336, -2216, 21142, 56429, 28539, 42149, 64084, 31383]
6228C1383k7226L2284p0529l4262r612M0469O8899J9753j9075o4479q440k3807
6216f4642J8299L9724o620R816m5760p4084m0605M4197L3114L3791N568J5164
6204c2038O6412K6487K2662l4058m2879p39K2683j1382m0433j5101J4215J3499
6192a0672R862n9961j5703K1940J6070L899J7172j7409k0279L2492K4607K2663
6180B4681j5373k8231l6631k0577L8576K9086J0604k9748P13L1513l4057n9021
6168h8465K0316L0973J0833k8695j2685m322N3887L4237j0572P291L6615q911
6156D0502j7005L7072j5111j884j3678r8231N1745N3282j7841Q170J3034Q513
6144D8568N615p810L0889p1620n3645o0041j7734N3119K7678j3063j7737N92J6073
$$ y = [31383, 4157, 36441, -34088, -68350, -77962, -37493, 31406, 51159, 32084, -32395, -40835, -64642, -46343, -6619, -13239, -3423, -49183, -123267, -163872, -119675, -86561, -52770, -47202, -32038, 34374, 60861, 83523, 49465, 6586, 5847, 28530, 17148, -23285, -38386, -24171, -10672, -810, -60771, -76474, -54534, -38464, -34565, -17393, -34802, -55081, -22589, 2018, 24681, 9308, -18923, -55554, -76131, -37555, -8469, 2135, -27613, -26900, 4613, -29444, -88465, -68149, -37176, -26343, -55038, -67723, -72045, -18158, 16079, 5507, 12798, 49413, 40502, 23497, 60569, 45458, 43574, 29896, -68335, -16590, 36692, 18851, 27021, 40055, 48568, 54183, 46373, 77262, 5642, -48003, -108044, -125778, -72659, -44981, -58044, -75781, -75189, -59116]
6131e9116K7409j6814r463N4863M2541n3687l1771N460j3990o1262M9882K5885
6119d0063J7538l1753O963q899l3950M9326L7503N3154P110m3043m3622R587K0011
6106a38J579Q325J8793j8296o474J1859k1162J5616M7846M3333R391p9133l2015
6093d76m2840k6030k6575O1776N6193K9296J3636j742j3895k743P726J6027m2549
6080B7804L07J9169k667P722j5323J7343l8570n7496P71L640j9346l492M8305
6067a1833M3255L7781J1611o5916k9622Q308J4210J0588K7977l445k9975m4685
6055c1746k0472K6782L1311J5775J0339M050n2479J2427j6233l0195O6367p108
6043H818k0943M917J0636l5242M4656L8606m4805q06M5311J4537q003L053l1520
$$ y = [-59116, -31707, -48521, -57984, -3121, 39420, -14267, -46038, -40578, -54568, -115830, -65948, -40063, -22525, -54278, -47315, -56214, -90164, -40838, -3335, 49819, 56929, 13886, -29736, -20149, -138, 1441, 9766, 28559, 10263, 3789, 15648, -5514, 10102, 57948, 101281, 110672, 31539, -476, -43316, -69346, -95921, -34145, 22048, 51344, 64980, 63238, 49343, 46600, 54326, 70353, 27804, 28111, 47280, 44613, 52335, 37012, 54355, 15785, -41711, -40940, -37300, -56646, -60138, -11833, 31422, 69203, 80814, 14898, -14724, -6416, 7794, 18382, 46359, 42914, 12939, -31746, -52218, -25436, 5875, 21650, 31989, 36039, -16440, -4013, -20246, -50441, 15926, 8818, -12125, -7208, 3428, -31814, 12842, 51448, 6643, 5837, 51148, 65685, 57682, 60735, 29215]
6030B9215k6044L8052L882m6057j4503J733J5215J3255k9978n366L1182P427j1127
6017F886k0995k853K8347K8658O0488k0559m0495m0232k5312R913j411p790l0858
6004e6213l7461N8656M3380k7664M08P8014M9681k6843K2345l7610o5224k0366
5992a8897K0243q115l0916l4162l070l3335L2758N2071O3096o741p2499N232L2585
5979a750L6989N556o658m5127O493J9406j7222k39l25O9790K2451K0512J8905
5966A28781n66o652l4614m7221n7837K5550m852p1379L3415K8630j1415l2934
5954e1094n910M251K0702J9567j1203M3276M9992J110l2450m177j8578o5038m1301
5941i0853K7741L6352j8473l4308R299M6841N6464Q8672l4520m2359m9408n3036
$$ y = [29215, 3171, 41223, 45105, -952, -15455, -13722, 1493, 14748, -15230, -20596, 10586, 18013, 6886, -14109, -16962, 11385, 40043, 100531, 79972, 39477, -755, -26067, -16154, -17565, -25355, -56213, -93674, -35018, 8362, -19302, -18894, 59120, 108801, 81958, 104303, 66693, 1469, -18897, 1346, -6769, -37685, -71847, -74917, -108252, -75494, -23423, 39673, 32932, -39567, -34335, -1750, 35239, 40795, 34137, -10990, -4497, 14909, -2313, -2552, -2877, 66913, 89364, 109876, 128781, 128215, 121563, 86949, 39728, -18109, 7441, 2589, -68790, -35375, -6745, -18160, -51094, -57004, -52753, -32051, -12484, -23687, 19589, 69581, 70691, 38241, 34064, 15486, -49552, -90853, -63112, -26760, -45233, -79541, -70242, -23401, 33063, 121735, 87215, 44856, -4552, -57588]
5929e7588n170j3680R137K8811K7747L5067m1387n7440P999k9106Q253m140M0574
5916e0923K2898K0271N3346l3000n5622p1552K660O9282O7215K9025K9034L1261
5904A13895k593k2924j6160n8096J7909L5021j7185l7285N786J2083j6965k5278
5892a1792r660K3509K6296L9929L7856j8060j794o1448j624J0508L6932N544o3335
5879A2861L56O5693J765j6925O165l3529o8646o410J8757L1332K844p9185k4679
5866h9601L8894K7647J7999k9167m2032N1914K2379N4955L4191k2808m4945j6669
5854B757l610k4609K333n205n7467n681N6616O7716K4945P642N0414J5525p137
5841A24239l4333j05924m0992K3312K9202N1196j8980j5622L6546J6405l914J7419
$$ y = [-57588, -62758, -76438, -67301, -38490, -10743, 24324, -17063, -74503, -66504, -95610, -87357, -91497, -50923, -28025, -7754, 45592, 12592, -43030, -114582, -111922, -42640, 24575, 53600, 82634, 113895, 111302, 88378, 72218, 14122, 32031, 67052, 49867, 12582, 18368, 30451, 13486, -11792, -21452, 2057, 28353, 68282, 106138, 88078, 86284, 24836, 23212, 33720, 70652, 76196, 12861, 13217, 78910, 80675, 63750, 69915, 36386, -32260, -38670, -19913, 11419, 14263, -64922, -89601, -50707, -23060, -5061, -34228, -76260, -24346, -1967, 52988, 87179, 64371, 19426, 2757, -853, -25462, -23129, -28334, -85801, -91482, -34866, 32850, 57795, 65437, 115851, 131376, 124239, 89906, -16018, -57010, -33698, -4496, 46700, 27720, 12098, 48644, 65049, 61135, 78554]
5829G8554l24o8198q962J0930n3639n4606J7924J7443R2826l153M468K175k4396
5816A1042P432l6008J4525l7317M6471j234L795K1363O386J0237o0990j0814o592
5803c1704J8340m033K3896M2246L824k5246l0979k594L5066m208l1683N10K3030
5790A6465j9340j6690L7094k2699m1542k8942L8668K0844m5228J0592o670L6764
5778b0684k3224n2477J7782N2421M7595j5915l2629L9109J1820K1712o663l7950
5766H97J0348M180L6586o927o1102M5042K6385k7539j5518j4582l5326n0850k6759
5753a15165O5623O0713N9292R666m7152o4427n5203l6807j7686K7202M9466L4059
5741c0419j8236k6853M7032O3446K8698j8030l4731J3529j0874L4947N4536l1350
$$ y = [78554, 78230, 10032, 1070, 12000, -41639, -96245, -78321, -60878, 31948, 28795, 33263, 35438, 11042, 18474, -17534, -3009, -40326, 6145, 4911, 8706, 30069, 36455, 46692, -14298, -25112, -31704, -13364, -17397, 6499, 48745, 52569, 27323, -3656, -6250, 28816, 24608, -7075, -6565, 16465, -2875, -19565, 17529, -5170, -46712, -75654, -36986, -16142, -61370, -50778, -57448, -20684, -43908, -96385, -78603, -26182, 21413, 5498, -27131, 11978, 23798, 45510, 38847, 897, 11245, 15425, 52011, 45084, -16018, 29024, 55409, 27870, 12352, -2230, -37556, -88406, -115165, -49542, 11171, 70463, 80129, 32977, -31450, -86653, -123460, -141146, -113944, -64478, -30419, -48655, -75508, -28476, 34970, 63668, 45638, 10907, 24436, 13562, 48509, 103045, 71695]
5729G1695l9312l0313o8765k1323l2216N844J34957k0983o4706k2228L192N1782
5717c2376L0715N0221M6739l8831n3235K5084O0675L4773J6401m2780r9279j3297
5705a5190k715o0047j4372L5094K5502j5795J6565L9562k1594l3909L2K6634L2362
5692A2129l945M7638M3935k3529j0922O506J7493l2670O307m0488o2652J9950
5680b0248L5990J5767k5932k4570j0278P1378J5094j8867j3026k0467l7184j971
5668c4314j1463l9199J5190L0145M660J8635L0086p545L7627K1531Q2983j3769
5656A34567p4670j4497j8691k4101k2672j9254K2551L5588J8670j0437j9938J8910
5644B6026K3025l7986j5024J4687m3953k3774M8357p44k9104L6633L2301j6218
$$ y = [71695, 32383, 2070, -66695, -88018, -120234, -114390, 20567, -416, -65122, -87350, -84158, -32376, -1661, 48560, 95299, 56468, 3233, 28317, 88992, 123765, 140166, 97386, -1893, -15190, -17905, -77952, -92324, -57230, -31728, -47523, -30958, 8604, -12990, -46899, -46867, -20233, 12129, 8184, 55822, 99757, 76228, 65306, 71812, 89305, 56635, 62942, 22454, -40198, -20248, 15742, 31509, 5577, -18993, -29271, 42107, 57201, 38334, 25308, 4841, -32343, -34314, -45777, -84976, -69786, -39641, -34981, -16346, 13740, 6195, 43822, 65353, 148336, 134567, 59897, 45400, 26709, 2608, -20064, -39318, -16767, 18821, 37491, 27054, 7116, 26026, 49051, 11065, -3959, 10728, -33225, -56999, -8642, -9386, -38490, -1857, 30444, 14226]
5632A4226k7836J5197K9784n6831k3686q389k2899K1625J35227K6211r5977R848
5620A6500K9791k1479O360k6016k6382l1392k6817k330K2187L3099K4871O9278
5608F7670L6476Q2445L6997m4807j38291j04308K1421N2734L7436j4838m075l301
5596B5559k5592J138L6651q923j1770O887k8738Q7104J9215o0092n0779k5712
5584c5052k5709m869M1325M2638O313p0186K6573M1952L6176P15q170l5001k8416
5571a1711l0213k6394l9798J2933K9776R2520R667O469q396n4719L1858K3091
5559C5083J1482J7342k2660N425L578l5587r040L202q06M25l0440l8379l761l2467
5545i6603K3721M5620R294J4422l1485j6904L3615J8004o31j4945N680K9840n959
$$ y = [14226, -13610, 1587, 31371, -25460, -49146, -57535, -80434, -58809, 76418, 102629, 6652, 16500, 46291, 24812, 31172, 5156, -21226, -52618, -79435, -81765, -59578, -26479, -1608, 67670, 104146, 186591, 223588, 178781, 40490, -63818, -42397, 10337, 47773, 32935, 28860, 25559, -33, 1105, 37756, 28833, 17063, 23950, -4788, 82316, 101531, 41439, -9340, -35052, -60761, -65630, -24305, 18333, 24646, -45540, -18967, 22985, 59161, 59876, 51706, 16705, -11711, -41924, -68318, -108116, -95183, -65407, 27113, 36780, 43249, 34853, -19866, 11992, 35083, 46565, 63907, 41247, 46672, 50250, 14663, 5623, 8825, 8019, 8444, -21996, -60375, -64136, -96603, -72882, -27262, -17968, -3546, -35031, -51935, -18320, -316, -947, -15892, -10212, 19628, 13669]
5532A3669l1461p580k0901j1362L3748R973j3890k584M9086j5130k315M021p855
5519b581K0097N279k211q504m432P737k8596l7818m1156J6653J7409K2366L6095
5506C38p1841m8490K2984M6725n198J4938O4980K7725K8273j7126n984l5661k0273
5493A390o637O965l8205j1976N641L6005R879l2904J1849l68o224j7968N092M2704
5479E243l6495o95L6268N3001j0836m8739K8465K7010l8115o782k3005R968m7899
5466e2611l8455K4132L3238N0408L8890l2319k8498K2337M8622k535j8474K3474
5454F8209P475n6453p6958L4797N1517J7013O563K8170l4946L5329j0525k950
5442F7241L2137k1863j1246l0781l7937M5919k0022o4568J9545K5492N1676J4030
$$ y = [13669, -17792, -25372, -46273, -57635, -23887, -13914, -27804, -30388, 18698, 3568, 1253, 5274, -2581, 17516, 22795, 20584, 12080, 7648, 15385, -13211, -51029, -92185, -75532, -58123, -35757, 338, -71503, -119993, -97009, -50284, -55482, -40544, 24436, 52161, 80434, 63308, 57324, 21663, 1390, -5247, 1718, -36487, -48463, -42822, -6817, 3062, -29842, -17993, -18361, -24585, -42553, -37461, 5243, -31252, -31947, 4321, 57322, 46486, -2253, 26212, 53222, 15107, 8325, -14680, -4712, -52611, -91066, -66934, -33696, 16712, 55602, 23283, -5215, 17122, 65744, 63209, 44735, 68209, 75684, 19231, -57727, -22930, 28587, 45600, 52163, 80333, 45387, 80716, 70191, 67241, 99378, 77515, 66269, 35488, -2449, 43470, 23448, -41120, -21575, 3917, 55593, 69623]
5430F9623j7118M630Q465k4526l0683j9016O7624j3690j4091P231l8145K5147
5418B5451n8458l8652K9543k3174L905L9803l1072j7580J3397Q8599k021o7714
5406c7973k7857L2910J327l3264N1126K7345l7561J656K7042J6062k216l0097
5394a1500l7588r951L7779l5899L2179j2951m8727J8240M7368K3398L0925K2609
5382E5882k4247m8150j0505j3583M2830L0836p265L847n659k2367J3598o932K7506
5369C5791j0071k2523l5842o83J2343l6131L548M9423M7967K5248o9371o7735
5357f8036j9084J8938K2134J3940m4616m6746M4099O1661O8793K411m2860m3916
5345c3282j4902K082L8388q051p409K2933K9690K2750l3998m2507q998L2140M2071
$$ y = [69623, 52505, 57135, 65600, 41074, 10391, -8625, 58999, 45309, 31218, 38449, 304, 25451, -33007, -71659, -42116, -65290, -61385, -21582, -52654, -70234, -56837, 31762, 29741, -37973, -65830, -32920, -31593, -64857, -13731, 13614, -23947, -22291, 4751, 20813, 18597, -11500, -49088, -59039, -21260, -57159, -24980, -37931, -86658, -68418, -21050, 2348, 33273, 55882, 31635, -16515, -27020, -40603, 2227, 33063, 25798, 29645, 23986, 1619, 15217, 8285, 35791, 25720, 3197, -32645, -33328, -20985, -57116, -53568, -4145, 43822, 69070, -301, -68036, -87120, -68182, -46048, -32108, -76724, -123470, -79371, -17710, 51083, 53494, 10634, -33282, -48184, -46102, -7714, -15765, -23174, -241, 29449, 52199, 18201, -24306, -33304, -1164, 40907]
5332D0907j5151k1388N7869M6172l8122o4239k361J5873J9309J2259j6066l6790
5320a728K7157L2580J4707L2335n6930l1710O57n91n9960p575J4558l1820J5102
5307e3218m1778M9807L0050m067k2941M0680M4060o448j00313j8228K5184L3268
5295b3944j7618j1916P5721Q115l1623k0571k4258K0822L634O3431L8492j5581
5283F4704k1267m2972R949M1166Q4481K9132k8952r0169p1853N745N548j5082
5271b9570J515L5892O4935k771j960l3045q808L4706K8496J4041l4898l0816j2248
5258B5469l5437L5169M7162m214O461P428k7565p5297M730M8312j721j1721J1466
5245C0242j7993M7290M8080J3074k3918o0293m1248m6283j55N0414P1974L7352
$$ y = [40907, 25756, 4368, 62237, 108409, 70287, 6048, 3687, 19560, 38869, 51128, 35062, -1728, 25429, 58009, 72716, 105051, 48121, 16411, 17068, 16477, -43483, -51058, -36500, -68320, -53218, -94996, -45189, -15139, -19206, -42147, -1467, 42593, 36145, -64168, -82396, -57212, -23944, -41562, -53478, 22243, 30358, -1265, -21836, -46094, -25272, -21638, 41793, 80285, 64704, 43437, 465, 10414, 51580, 136061, 165193, 136241, 46072, -25781, -20036, -14488, -29570, -28055, 7837, 72772, 70001, 68041, 34996, 26188, 60894, 89390, 103431, 68533, 37717, 25469, -9968, 25201, 72363, 68149, 74610, 82038, 54473, -20824, -16094, 32218, 30497, 18776, 30242, 12249, 59539, 107619, 120693, 96775, 36482, -4766, -51049, -51204, -790, 71184, 108536]
5233A08536J1702m1017l9414o0998n2510O9541L3494J3188K5315J3437K5660k5555
5221H1379l0490J2387j12K5981N787k1365l3724p2658j6524k372k5351M266k7498
5208a00294L1800j6170J3977J5192j5484K1724J6368l1949l0105O2466O0400L9903
5196F7828L2611q0926n3579k6409k9169l755N3854r08k8197R053J5463J6737L2107
5183D710K9038l4459o8924m492j0385M0441K605M3742J6000m049l197m548l8482
5170c2000J5132k291J2725p476P638K5598k9530K4486K3387j1297n8015K1521
5158a0122J1720M6755k2534p7561k0027l2806J1572K4433Q101l7957j401K4190
5146g5637P126j4939j9628K5931K0840M4481M2902N5789l2188m6359K3596p9755
$$ y = [108536, 120238, 79221, 39807, -21191, -73701, -4160, 29334, 42522, 67837, 81274, 106934, 81379, 50889, 63276, 63164, 89145, 94932, 73567, 39843, -32815, -49339, -51711, -77062, -72796, -100294, -68494, -84664, -70687, -55495, -70979, -49255, -32887, -64836, -94941, -32475, 27925, 67828, 100439, 19513, -34066, -60475, -89644, -93399, -39545, -40453, -68650, -59597, -44134, -27397, 4710, 33748, -711, -69635, -74127, -84512, -44071, -41466, 2276, 18276, 14227, 11030, 6482, -32000, -16868, -19159, -6434, -13910, -6272, 19326, -10204, 14282, 37669, 26372, -31643, -10122, 1598, 48353, 25819, -51742, -71769, -104575, -93003, -68570, -60469, -98426, -99827, -75637, -68511, -83450, -103078, -77147, -56307, -11826, 31076, 86865, 54677, 8318, 31914, -47841]
5134d7841n036M4396L1266k671m5562R532J4328J953j0591j470J9198l2923J16
5121b5305M8216L7769J7723K6851L0508l1937m9377n528j8444J8091J090j4942
5109C4715K336k5585J5293O67p537M861K336p226l8817l0104j4850m6609j4611
5096a25131J676O7145P6994K6522j3653J7241k0592k1413k6916L3906M1919p903
5084D9795j9079q476k272l4363n3331j9886M6804J3464M214K5284k0474k3427
5072d1747j7203J6577k8088r607m977P2691O4445k1030K923M8926j3617j8033
5060E1260P510K4598M4295j2553p1323m2596P2426n0618n0699j248R074m222K4953
5047H57k2649O3620m5616l4120M8844N8078J9763k6220m8081J4699L1323j0666
$$ y = [-47841, -52877, -8481, 22785, 20114, -25448, -15916, -1588, 365, -10226, -11696, 7502, -25421, -25305, 22911, 60680, 78403, 105254, 135762, 103825, 54448, 48920, 30476, 48567, 49657, 34715, 37051, 11466, 26759, 27426, 19889, 24750, 27086, 19860, -18957, -49061, -63911, -110520, -125131, -123455, -56310, 20684, 47206, 33553, 50794, 30202, 8789, -18127, 15779, 57698, 49795, 30716, 22240, 19968, -14395, -67726, -87612, -40808, -27344, -23130, 2154, -18320, -41747, -58950, -42373, -70461, -80068, -85045, -12354, 52091, 31061, 33984, 82910, 69293, 51260, 58770, 83368, 127663, 115110, 43787, 1191, 73617, 22999, -27700, -28948, -19874, -24096, 857, -21792, 41828, -3788, -37908, 10936, 69014, 88777, 62557, 14476, 29175, 60498, 49832]
5035D9832o7442J1234J7295l3918m3299J3410J2655K5376L6378M5653J892m8394
5023B0672N8144O2957k5722k0167n2667k0658L7437n5094p5626j1456k0112J2959
5011h9333O4985M205l2026J3042J2572P523l0053qJ1132L128l136K2415M8240
4998C2686L3923n869k8490j8460l2213J6332J0451K9883Q0665K2262m0098k6055
4986G5017k5326j5817K6667k6563J9962n973n4207n1217p928j380l267N3681K8543
4973A2192k1664r297R883l4247J5572M0690m8442j7310J0482N9094J912p722P471
4960A8614K0477J4556M061J4090k3924n5336r057j4900m2010j3239k914K5218
4948f4364R626L8708M2437o3566p3449K4762L3312P4314K1241m2128J332M2503
$$ y = [49832, -17610, -6376, 10919, -22999, -66298, -52888, -40233, -14857, 21521, 67174, 69066, 20672, 78816, 141773, 116051, 95884, 43217, 22559, 59996, 4902, -70724, -82180, -102292, -89333, -24348, -20143, -52169, -39127, -26555, -19032, -49085, -49093, -37961, -34833, -37969, -15554, 32686, 66609, 60740, 32250, 13790, -18423, -2091, 8360, 38243, 118908, 141170, 101072, 75017, 49691, 33874, 60541, 33978, 53940, 47967, -6240, -57457, -65385, -66765, -70032, -16351, 12192, -9472, -18769, -8886, -43133, -27561, 13129, -35313, -52623, -42141, 16953, 18865, 11143, 18614, 39091, 53647, 57708, 71798, 47874, -7462, -16519, -31419, -73429, -86668, -89582, -64364, -54738, -16030, 26407, -37159, -110608, -85846, -52534, 21780, 43021, 893, 2225, 44728]
4936D4728M0859k9200k8141K0644j7275o1394n8148l1094M4959m344j6177N9898
4924c4685K436n3598l6292J2942K4786M1840J1865J5705P390k5484q051J5799
4912b5347N3363K243j8248M852J424k802K3176m4706r331K011j2695O2J805R454
4898a4739K3460j5799q021J9600M4518p960m9405l9199K5216K0860J5120K8221
4886D1872m9613o6422o175M7851J471o2128J1499P8228O4163k6184k0271r930
4874D361l4461N0366J0554J0782n3765j13771l75L0013L871O5052M9295o074k9588
4861a3740k379M049N2749K2665j2803K3815l4051j8807k3842L802q906J2227j3334
4848h555K2507q58o844o984m1720l8391J7399J2945K3258J1778q56L5586j1537
$$ y = [44728, 85587, 56387, 28246, 48890, 31615, -29779, -87927, -119021, -74062, -78406, -94583, -34685, -32249, -85847, -122139, -109197, -84411, -42571, -30706, -15001, -7611, -33095, -41146, -25347, 28016, 30259, 12011, 16863, 18287, 15485, 38661, -6045, -15376, -13365, -26060, -25998, -24193, -14739, 8721, -7078, -15099, 4501, 49019, 41059, -8346, -47545, -22329, -1469, 13651, 41872, -7741, -74163, -80338, -32487, -31016, -93144, -81645, -3417, 60746, 34562, 14291, 4361, -30100, 20266, 30820, 41602, -12163, -125934, -126309, -96296, -92425, -27373, 21922, 15848, -13740, -16119, -12070, 40679, 63344, 50541, 74356, 40305, 21498, -2344, 1458, -7448, 4779, -8555, 13952, 13094, 6250, -734, -42454, -80845, -63446, -50501, -27243, -15465, -16321, 19265, 7728]
4835G728k2408j3525J1772O586k9670l2528J9159M3449o61j6926M19k8885J1633
4822d3857L2365N2528L5076k8819J4531k6840m8463l2284O5987K5989k795l2980
4810A0438K9339J6865J7697j7320l4674q6557j4462M2786j5804P252K6200j6194
4798c4434K2052M890L381r850O8917J3647o8820m2107M9103O0709J6094k7157
4786E6425q5792M0804M8252n854j2166L2396l5113k6566j6584J8919n0947k1127
4774e7353K6566l3780m5398K7004N2043L5560K0404N740l9302l5380K3362O9794
4762D9260p080p0369K8340O8086j6539j415K642l4863J0352J9628J7390l0948
4750C4484k4922k6703n002M1358J075J6206J676j8902K9301L1915l4121o0306
$$ y = [7728, -14680, -28205, -16433, -9847, -39517, -72045, -52886, -9437, -10098, -27024, -26605, -55490, -43857, -11492, 41036, 76112, 47293, 61824, 34984, -13479, -45763, 20224, 46213, 43418, 10438, 39777, 56642, 74339, 57019, 22345, -64212, -78674, -35888, -51692, -44440, -18240, -34434, -12382, -7492, -4111, -13961, 54956, 68603, -217, -42324, 6779, 67488, 83582, 56425, -29367, 11437, 59689, 53835, 41669, 74065, 38952, 12386, -4198, 14721, -36226, -57353, -30787, -64567, -109965, -82961, -30918, 4642, 25046, 30786, -8516, -43896, -20534, 49260, 42180, -28189, 151, 68237, 51698, 50283, 52925, 18062, 28414, 48042, 65432, 34484, 9562, -17141, -22143, 19215, 20290, 36496, 38172, 19270, 48571, 80486, 46365, -13941]
4738a3941p1889J7346N1877R123L2608j0342O45j7315l5895M3186K9346j8446
4726A6303J1782l6090k7511K60K8944L8128M4247n5621p9713l7333o092N6869
4714d5827L2231Q081O6520M8520k2375j9094O789m1317k2684L2445K6675n4155
4702A5809K160j6432K7743j1146J8941K0813m6771O782j9886m4234l4752K1619
4690e9354j0713n0387j1117j0190R3927N3714K28k3208J2699J660n47M4514J25
4677D1351m8414J0272K7443J9967j5523J1432j8353k3231k638K6737k0190m1950
4665c3097j97J1328J2774J7320j2651k4008J3377O2002m544m4182j7222j7536
4653c6636k6710o093J4415l6700J3809P1555k7942l9104N7890J2676j2692q910
$$ y = [-13941, -85830, -68484, -16607, -7484, 25124, 14782, 15427, -1888, -37783, 5403, 34749, 16303, 28085, -8005, -35516, -35256, -6312, 31816, 76063, 20442, -59271, -96604, -102696, -45827, -13596, -5515, 61005, 109525, 87150, 68056, 74845, 33528, 10844, 43289, 69964, 15809, 17969, 1537, 29280, 18134, 37075, 57888, 11117, 17899, -1987, -46221, -80973, -59354, -70067, -120454, -131571, -141761, -47834, 5880, 6108, -17100, -4401, -2741, -3288, 41226, 41351, -7063, 3209, 30652, 50619, 35096, 46528, 28175, 4944, 2306, 29043, 8853, -33097, -33294, -21966, -9192, 8128, -4523, -28531, -15154, 46848, 42304, -1878, -19100, -36636, -63346, -69439, -55024, -91724, -77915, -6360, -34302, -73406, -15516, -2840, -15532, -24442]
4641b4442j2881l8162Q198M7637J5059M287q090O1666p441m7020o3780K8117N1954
4628A5102N6222N151l886J4552j0616k0486l5805l6040L4647K2088r494m4387
4616a2952j8275p305L9562K6033K5489J7713j4136K3207j7428n2921q5651K822
4604g3842j4134M6057K8317M5133M4053k1323k0743k2949J061p0415j431N4629
4592e587O617o2270n4417N4057M9490J2493J4501k6295j6028l2084L6572Q248
4580a4703M522M9362K3642j8033j0261R704k2944K5671k0842k8085J0230l5882
$$ y = [-24442, -37323, -75485, -67287, -19650, -4591, -304, -8394, 53272, 45831, -1189, -64969, -36852, 15102, 71324, 76475, 72589, 87141, 76525, 56039, 20234, -15806, 18841, 40929, 31435, -12952, -31227, -38532, 1030, 27063, 52552, 70265, 56129, 79336, 61908, 8987, -76664, -73842, -87976, -41919, -13602, 31531, 75584, 54261, 33518, 10569, 11630, -58785, -60216, -5587, 1030, -61240, -115657, -61600, -12110, 383, 14884, -11411, -27439, -59523, -22951, -14703, -10181, 39181, 62823, 44790, 34529, 44233, 21289, 46960, 26118, -1967, 8263, -27619]
$$ [...]
##END NTUPLES=NMR SPECTRUM
##END=
