##TITLE=Analysis number 322456
Compound Code cc 58923
Book Reference 494/56
Project Code adrs
Chemist Name craigr
##JCAMPDX= 6.0         $$ Bruker NMR JCAMP-DX V2.0
##DATA TYPE= NMR SPECTRUM
##DATA CLASS= NTUPLES
##ORIGIN= Bruker BioSpin GmbH
##OWNER= nmr
$$ XWIN-NMR		Version 3.5
$$ Wed Sep 27 10:54:48 2006 GMT Daylight Time (UT+1h)  MAYBRIDGE\nmr@NMR_250MHZ
##.OBSERVE FREQUENCY= 250.131544655141
##.OBSERVE NUCLEUS= ^1H
##.ACQUISITION MODE= SIMULTANEOUS (DQD)
##.ACQUISITION SCHEME= undefined
##.AVERAGES= 16
##.DIGITISER RES= 18
##SPECTROMETER/DATA SYSTEM= dpx250
##.PULSE SEQUENCE= zg30
##.SOLVENT NAME= CDCl3
##.SHIFT REFERENCE= (INTERNAL, CDCl3, 0, 16.522)
##AUDIT TRAIL= $$ (NUMBER, WHEN, WHO, WHERE, WHAT)
$$ ##TITLE= Audit trail, XWIN-NMR		Version 3.5
$$ ##JCAMPDX= 5.01
$$ ##ORIGIN= Bruker BioSpin GmbH
$$ ##OWNER= nmr
$$ C:\u/data/dgb/nmr/ADRS/1450/pdata/1/auditp.txt
$$ ##AUDIT TRAIL=  $$ (NUMBER, WHEN, WHO, WHERE, WHAT)
(   1,<2006-09-27 10:54:19.07 +100>,<MAYBRIDGE\nmr>,<NMR_250MHZ>,
      <created by zg, POWCHK disabled, PULCHK disabled
       configuration hash MD5:
       E2 DF 36 D8 04 B2 41 60 5A D7 A3 38 5A 4B D0 FE
       data hash MD5: 64K
       6F 75 82 52 49 81 23 E3 1B 52 91 33 32 BC 4B 38>)
(   2,<2006-09-27 10:54:35.51 +100>,<MAYBRIDGE\nmr>,<NMR_250MHZ>,
      <Start of raw data processing
       ef LB = 0.3 FT_mod = 6 PKNL = 1 SI = 32K 
       data hash MD5: 32K
       1A C8 9A 9A 8C 49 8B 07 1F 88 22 23 66 1F 02 A3>)
(   3,<2006-09-27 10:54:37.34 +100>,<MAYBRIDGE\nmr>,<NMR_250MHZ>,
      <apk 
       data hash MD5: 32K
       12 EE A0 7D 10 8B F1 B9 A7 72 FA 71 A2 42 9A 68>)
(   4,<2006-09-27 10:54:38.27 +100>,<MAYBRIDGE\nmr>,<NMR_250MHZ>,
      <abs ABSG = 5 
       data hash MD5: 32K
       1B 7E 42 4C 9E 71 63 15 17 E8 21 6C B9 FE 52 1C>)
$$ ##END=
$$ 
$$ hash MD5
$$ 7E 7F 6A EE 58 07 17 13 5A 29 C5 D9 74 B3 B5 73
##$RELAX= 
##$RELAX= 
##$RELAX= 
##$RELAX= 
##$RELAX= 
##$RELAX= 
##$RELAX= 
$$ Bruker specific parameters
$$ --------------------------
##$DU= <C:\u>
##$EXPNO= 1450
##$NAME= <ADRS>
##$PROCNO= 1
##$TYPE= <nmr>
##$USER= <dgb>
##$AMP= (0..31)
100 100 100 100 100 100 100 100 100 100 100 100 100 100 100 100 100 100 
100 100 100 100 100 100 100 100 100 100 100 100 100 100 
##$AQSEQ= 0
##$AQ_mod= 3
##$AUNM= <au_zg>
##$AUTOPOS= <10 >
##$BF1= 250.13
##$BF2= 250.13
##$BF3= 250.13
##$BF4= 250.13
##$BF5= 500.13
##$BF6= 500.13
##$BF7= 500.13
##$BF8= 500.13
##$BYTORDA= 1
##$CFDGTYP= 0
##$CFRGTYP= 5
##$CHEMSTR= <none>
##$CNST= (0..31)
1 1 145 1 1 1 1 1 1 1 1 1 1 1 1 1 1 1 1 1 1 1 1 1 1 1 1 1 1 1 1 1 
##$CPDPRG= <>
##$CPDPRG1= <>
##$CPDPRG2= <>
##$CPDPRG3= <>
##$CPDPRG4= <mlev>
##$CPDPRG5= <mlev>
##$CPDPRG6= <mlev>
##$CPDPRG7= <mlev>
##$CPDPRG8= <mlev>
##$CPDPRGB= <>
##$CPDPRGT= <>
##$D= (0..31)
0 1 0 0 0 0 0 0 0 0.06 0 0 0 0 0 0 0.0002 0 0 0 0 0 0 0 0 0 0 0 0 0 0 
0 
##$DATE= 1159350857
##$DBL= (0..7)
120 120 120 120 120 120 120 120 
##$DBP= (0..7)
150 150 150 150 150 150 150 150 
##$DBP07= 0
##$DBPNAM0= <>
##$DBPNAM1= <>
$$ [...]
##$SUBNAM7= <"">
##$SUBNAM8= <"">
##$SUBNAM9= <"">
##$SW= 20.6930455092707
##$SWIBOX= (0..15)
0 0 3 0 0 0 0 0 0 0 0 0 0 0 0 0 
##$SW_h= 5175.983436853
##$TD= 65536
##$TD0= 1
##$TE= 295.16
##$TE2= 300
##$TE3= 300
##$TEG= 300
##$TL= (0..7)
0 120 120 120 120 120 120 120 
##$TP= (0..7)
150 150 150 150 150 150 150 150 
##$TP07= 0
##$TPNAME0= <>
##$TPNAME1= <>
##$TPNAME2= <>
##$TPNAME3= <>
##$TPNAME4= <>
##$TPNAME5= <>
##$TPNAME6= <>
##$TPNAME7= <>
##$TPOAL= (0..7)
0.5 0.5 0.5 0.5 0.5 0.5 0.5 0.5 
##$TPOFFS= (0..7)
0 0 0 0 0 0 0 0 
##$TUNHIN= 0
##$TUNHOUT= 0
##$TUNXOUT= 0
##$USERA1= <user>
##$USERA2= <user>
##$USERA3= <user>
##$USERA4= <user>
##$USERA5= <user>
##$V9= 5
##$VALIST= <valist>
##$VCLIST= <CCCCCCCCCCCCCCC>
##$VD= 0
##$VDLIST= <DDDDDDDDDDDDDDD>
##$VPLIST= <PPPPPPPPPPPPPPP>
##$VTLIST= <TTTTTTTTTTTTTTT>
##$WBST= 1024
##$WBSW= 4
##$XGAIN= (0..3)
0 0 0 0 
##$XL= 0
##$YL= 0
##$YMAX_a= 333409
##$YMIN_a= -376362
##$ZGOPTNS= <>
##$ZL1= 120
##$ZL2= 120
##$ZL3= 120
##$ZL4= 120
##$ABSF1= 16.522
##$ABSF2= -4.171173
##$ABSG= 5
##$ABSL= 3
##$ALPHA= 0
##$AQORDER= 0
##$ASSFAC= 0
##$ASSFACI= 0
##$ASSFACX= 0
##$ASSWID= 0
##$AUNMP= <proc_1d>
##$AZFE= 0.1
##$AZFW= 0.1
##$BCFW= 0
##$BC_mod= 0
##$BYTORDP= 0
##$COROFFS= 0
##$CY= 12.5
##$DATMOD= 1
##$DC= 0
##$DFILT= <>
##$DTYPP= 0
##$F1P= 14.0000005364418
##$F2P= -0.99999901652339
##$FCOR= 0.5
##$FTSIZE= 32768
##$FT_mod= 6
##$GAMMA= 0
##$GB= 0
##$INTBC= 1
##$INTSCL= 1
##$ISEN= 128
##$LB= 0.3
##$LEV0= 0
##$LPBIN= 0
##$MAXI= 10000
##$MC2= 0
##$MEAN= 0
##$ME_mod= 0
##$MI= 0
##$NCOEF= 0
##$NC_proc= -4
##$NLEV= 6
##$NOISF1= 0
##$NOISF2= 0
##$NSP= 0
##$NTH_PI= 0
##$NZP= 0
##$OFFSET= 16.522
##$PC= 1
##$PHC0= 146.5741
##$PHC1= 5.099504
##$PH_mod= 1
##$PKNL= yes
##$PPARMOD= 0
##$PSCAL= 4
##$PSIGN= 0
##$REVERSE= no
##$SF= 250.13
##$SI= 32768
##$SIGF1= 0
##$SIGF2= 0
##$SINO= 400
##$SIOLD= 32768
##$SREGLST= <1H.CDCl3>
##$SSB= 0
##$STSI= 32768
##$STSR= 0
##$SW_p= 5175.98343685301
##$SYMM= 0
##$S_DEV= 0
##$TDeff= 65536
##$TDoff= 0
##$TI= <Analysis number 999999
Compound Code 99
Book Reference 9
Project Code 9>
##$TILT= no
##$TM1= 0
##$TM2= 0
##$TOPLEV= 0
##$USERP1= <user>
##$USERP2= <user>
##$USERP3= <user>
##$USERP4= <user>
##$USERP5= <user>
##$WDW= 1
##$XDIM= 32768
##$YMAX_p= 314447855
##$YMIN_p= -502956
$$ End of Bruker specific parameters
$$ ---------------------------------
##NTUPLES= NMR SPECTRUM
##VAR_NAME=  FREQUENCY,     SPECTRUM/REAL,   SPECTRUM/IMAG
##SYMBOL=    X,             R,               I
##VAR_TYPE=  INDEPENDENT,   DEPENDENT,       DEPENDENT
##VAR_FORM=  AFFN,          ASDF,            ASDF
##VAR_DIM=   32768,         32768,           32768
##UNITS=     HZ,            ARBITRARY UNITS, ARBITRARY UNITS
##FACTOR=    0.157963299565203, 1,           1
##FIRST=     4132.6476996994, 0,             0
##LAST=      -1043.33573715361, 0,           0
##MIN=       -1043.33573715361, -502956,     0
##MAX=       4132.6476996994, 314447855,     0
$$ Real data points
##PAGE= N=1
##DATA TABLE= (X++(R..R)), XYDATA
$$ [...]
$$ plain form
15917 21749 40823 10356 -4721 -16331 -24506 -5703 -11267 -1683 4243 17836 18518 12411 10897
15904 10897 29071 30698 -22175 -54872 -55421 -46909 -40720 -44860 -22001 -23367 -9207 -7168 -13032
15891 -13032 2981 17996 17907 11089 -15252 -18753 7781 40694 26859 14541 20000 13083 -1100
15878 -1100 -15403 -23561 -38413 -50537 -45608 -39109 -33393 -21468 -13071 -7301 -21975 -40917 -44779
15865 -44779 -55107 1302 10701 -12617 -26199 -45142 -38141 -49090 -47320 -17098 -25658 -54326
15853 -54326 -52914 -40426 -32592 -32642 -34733 -16286 -12634 -45246 -56506 -37800 -27315 -24769 -8556
15840 -8556 -6802 -8211 -9808 6873 8340 21288 27259 -7008 -16770 -17087 -1071 14411 3850
15827 3850 -13340 11265 12017 -3072 12644 32792 26485 33464 18583 -11555 -31249 -34835 -30170
$$ packed form
15917B1749J9074l0467j5077j1610q175J8803n564R584N926J3593O82o107j514
15904A0897J8174J627n2873l2697n49Q512O189m140K2859j366J4160K039n864
15891a3032J6013J5015q9o818k6341l501K6534L2913j3835j2318N459o917j4183
15878a100j4303q158j4852j2124M929O499N716J1925Q397N770j4674j8942l862
15865d4779j0328N6409R399k3318j3582j8943P001j0949J770L0222q560k8668
15853e4326J412J2488P834n0k091J8447L652l2612j1260J8706J0485K546J6213
15840h556J754j409j597J6681J467J2948N971l4267r762l17J6016J5482j0561
15827C850j7190K4605P52j5089J5716K0148o307O979j4881l0138j9694l586M665
$$ plain form
15814 -30170 -8062 1640 -1159 -11177 9386 15026 -1790 -11202 -10048 -25000 -26437 984 35735
15801 35735 29992 29139 40839 23450 -2934 9050 30341 34045 19555 -2802 -12518 -12880 -7593
15788 -7593 13750 46790 26805 20350 7455 -14052 -24945 -15140 1256 -10859 -13739 16044
15776 16044 41851 16067 18211 39206 9609 -9268 -26584 -5389 11956 22939 11342 -3497
15764 -3497 -27969 -37640 -603 -10113 -31975 -35297 -36584 -35051 -30560 -9743 -7752 -13510 -16926 -2749
15750 -2749 25534 31448 21550 2587 8342 -198 -15736 -17445 10383 13633 13466 15351 -110 11498
15736 11498 21011 28852 15288 -27296 -49344 -31948 -6868 -10982 5929 7389 -7156 -13026 -17737
15723 -17737 -31241 -11138 6774 13703 3127 -10621 733 -11163 -26278 -27054 -38040 -36408
$$ packed form
15814c0170K2108R702k799j0018K0563N640j6816r412J154j4952j437K7421L4751
15801C5735n743q53J1700j7389k6384J1984K1291L704j4490k2357r716l62N287
15788g593K1343L3040j9985o455j2895k1507j0893R805J6396j2115k880K9783
15776A6044K5807k5784K144K0995k9597j8877j7316K1195J7345J0983j1597j4839
15764c497k4472r671L7037r510k1862l322j287J533M491K0817J991n758l416J4177
15750b749K8283N914r898j8963N755q540j5538j709K7828L250j67J885j5461J1608
15736A1498R513P841j3564m2584k2048J7396K5080m114J6911J460j4545n870m711
15723a7737j3504K0103J7912O929j0576j3748J1354j1896j5115p76j0986J632
$$ plain form
15711 -36408 -26235 -16676 -3660 3221 7703 8313 14523 -6181 -15811 -10386 -6729 -10650 -12487 -1202
15697 -1202 16733 26675 -2060 10179 21733 7238 16876 -10888 -39286 -2258 23456 -146
15685 -146 -19396 -22656 -36673 -30099 -31971 -32646 -16530 2903 9064 9594 -4143 17956 36810 11775
15671 11775 -1224 -5099 -17676 -8188 -31895 -39755 -30521 -36628 -32789 -19207 -938 565 26164
15658 26164 47794 37236 15273 11187 9574 430 -14727 -13599 -19783 -15774 -1220 -18728 5874
15645 5874 19602 -4544 -17014 -34439 -56537 -63213 -60940 -43008 -38081 -37698 -36029 -10298 -13511
15632 -13511 -20512 -20714 -22752 -24463 -30011 -40568 -40404 -22475 -28878 -25157 -22270 -6423 -1394 3779
15618 3779 11382 -6547 -11373 -9935 7253 50535 44979 -6674 -24662 -12035 -5736 7697 -5920
$$ packed form
15711c6408J0173R559J3016O881M482O10O210k0704r630N425L657l921j837J1285
15697a202J7935R942k8735J2239J1554j4495R638k7764k8398L7028K5714k3602
15685a46j9250l260j4017O574j872o75J6116J9433O161N30j3737K2099J8854k5035
15671A1775j2999l875j2577R488k3707p860R234o107L839J3582J8269J503K5599
15658B6164K1630j0558k1963m086j613r144j5157J128o184M009J4554j7508K4602
15645E874J3728k4146j2470j7425k2098o676K273J7932M927L83J669K5731l213
15632a3511p001k02k038j711n548j0557J64J7929o403L721K887J5847N029N173
15618C779P603j7929m826J438J7188M3282n556n1653j7988J2627O299J3433j3617
$$ plain form
15605 -5920 -24803 -32019 -27344 -15108 -8189 -4334 -29857 -33967 -3537 18849 13886 14413 27676
15592 27676 30704 15272 -17478 -19677 -9173 -13592 -26395 -26348 5700 -5078 -21433 -10338 3060
15579 3060 -23981 -22640 -15805 -3016 -415 14831 9974 -4821 8280 32911 63632 84409 57592
15566 57592 22130 -13081 -28758 -36850 -32176 -18660 -21314 -10007 34747 40666 -3634 -43559
15554 -43559 -37035 -11400 16352 -121 -16868 5225 -11227 -16753 -7228 -3248 998 -29329 -32261
15541 -32261 2492 -12723 -25556 -11923 -12552 -18759 13335 38659 41485 12171 12792 14679 -15134
15528 -15134 -825 12860 22897 23870 2989 -32395 -29191 11304 10366 -16300 -27768 -39062 -35023
15515 -35023 -38593 -5184 -16609 -34102 -40481 -27542 -16608 3399 -10308 -20998 -21730 -40578
$$ packed form
15605e920j8883p216M675J2236O919L855k5523m110L0430K2386m963N27J3263
15592B7676L028j5432l2750k199J0504m419j2803M7L2048j0778j6355J1095J3398
15579C060k7041J341O835J2789K601J5246m857j4795J3101K4631L0721K0777k6817
15566E7592l5462l5211j5677q092M674J3516k654J1307M4754N919m4300l9925
15554d3559O524K5635K7752j6473j6747K2093j6452n526R525L980M246l0327k932
15541c2261L4753j5215j2833J3633o29o207L2094K5324K826k9314O21J887k9813
15528a5134J4309J3685J0037R73k0881l5384L204M0495r38k6666j1468j1294M039
15515c5023l570L3409j1425j7493o379J2939J0934K0007j3707j0690p32j8848
$$ plain form
15503 -40578 -36698 -19514 -15441 -6316 -1481 -8673 -28216 -36513 -23740 -24846 -19176 -17111 -17153 -28072
15489 -28072 -54185 -45660 -2594 14100 16707 9716 -17665 -12667 -6802 7333 -13480 -18340 -11572
15476 -11572 -4819 6386 19192 21893 16543 -13139 -23488 -9259 -3023 -12646 -31295 2763 3310
15463 3310 -3881 -11320 -12543 -27514 -18344 2721 3389 -32884 -56169 -41498 -10807 -112 1288
15450 1288 -9278 9951 24470 11608 24937 6196 -26172 -38311 -17646 -14597 -22689 -19644
15438 -19644 -14639 -7888 682 24743 11469 6639 3003 19658 17157 7655 -11007 -28562 -17408
15425 -17408 1407 -24633 -31385 -24218 -40421 -65527 -24596 -7629 -20140 -5488 14976 22224
15413 22224 17450 -15923 -14870 3149 -5795 35814 30388 14926 13251 28669 27278 39165 28679
$$ packed form
15503d0578L880J7184M073R125M835p192j9543q297J2773j106N670K065m2j0919
15489b8072k6113Q525M3066J6694K607o991k7381M998N865J4135k0813m860O768
15476a1572O753J1205J2806K701n350k9682j0349J4229O236r623j8649L4058N47
15463C310p191p439j223j4971R170K1065O68l6273k3285J4671L0691J0695J400
15450A288j0566J9229J4519j2862J3329j8741l2368j2139K0665L049q092L045
15438a9644N005O751Q570K4061j3274m830l636J6655k501r502j8662j7555J1154
15425a7408J8815k6040o752P167j6203k5106M0931J6967j2511J4652K0464P248
15413B2224m774l3373J053J8019q944M1609n426j5462j675J5418j391J1887j0486
$$ plain form
15400 28679 24840 20687 30367 14920 -6481 -14937 18265 48101 44048 40490 40675 18167 -2053
15387 -2053 -16486 -6815 -20166 -35154 -57754 -45977 -23986 995 -4637 -8301 -16939 -11334 10456
15374 10456 11665 23428 42807 32777 2477 -6783 9049 30610 28890 9355 -2184 14015
15362 14015 -1129 -8449 -31186 -30455 14884 1093 758 8412 11225 -13243 -9121 10550 -10123
15349 -10123 -11474 2399 4752 1370 -4684 -13420 -2857 6556 16563 -3126 -5824 1095 644 7363
15335 7363 -16133 -27667 -40926 -33582 -43225 -63329 -66487 -45078 -30264 -9222 6378 -11027
15323 -11027 -24645 -20751 -17735 -20606 -25959 -3993 -7821 6194 30145 25762 -7464 -29946 -43216
15310 -43216 -14951 4245 -11471 -41384 -49930 -21366 -1930 -22736 -35540 -37646 -38767 -32084
$$ packed form
15400B8679l839m153R680j5447k1401q456L3202K9836m053l558J85k2508k0220
15387b053j4433R671j3351j4988k2600J1777K1991K4981n632l664q638N605K1790
15374A0456J209J1763J9379j0030l0300r260J5832K1561j720j9535j1539J6199
15362A4015j5144p320k2737P31M5339j3791l35P654K813k4468M122J9671k0673
15349a0123j351J3873K353l382o054q736J0563R413J0007j9689k698O919m51O719
15335G363k3496j1534j3259P344r643k0104l158K1409J4814K1042J5600j7405
15323a1027j3618L894L016k871n353K1966l828J4015K3951m383l3226k2482j3270
15310d3216K8265J9196j5716k9913q546K8564J9436k0806j2804k106j121O683
$$ plain form
15298 -32084 -29718 -24169 -14973 19487 33233 13426 6741 15954 18330 33816 40606 33746 29016
15285 29016 31181 16452 3492 -10387 -19381 -14198 486 -12524 -36326 9758 46901 48376
15273 48376 50516 47174 38738 39283 30184 5420 -2947 -4860 -17804 -23334 -17209 5310 8159 1909
15259 1909 -12898 -18160 -17566 -26836 -39257 -32886 -20048 -14960 3769 9547 -22545 -37877 -24491
15246 -24491 -10248 15450 38756 30915 3264 3527 -3907 -17615 -12202 -6134 2055 25400 17150
15233 17150 7473 -5463 -16563 -32311 -35775 -16720 -5882 7910 -4920 -5658 19180 35638
15221 35638 22925 -1537 8654 -840 -39345 -28424 -20350 -2926 13777 6892 -16834 -39513
15209 -39513 -28136 -19351 -7878 -1944 -5356 -5574 -2924 -7374 -23296 -27885 -39991 -42545 -21738
$$ packed form
15298c2084K366N549R196L4460J3746j9807o685R213K376J5486O790o860m730
15285B9016K165j4729j2960j3879q994N183J4684j3010k3802M6084L7143J475
15273D8376K140l342q436N45r099k4764q367j913j2944n530O125K2519K849o250
15259A909j4807n262N94r270j2421O371J2838N088J8729N778l2092j5332J3386
15246b4491J4243K5698K3306p841k7651K63p434j3708N413O068Q189K3345q250
15233A7150r677j2936j1100j5748l464J9055J0838J3792j2830p38K4838J6458
15221C5638j2713k4462J0191r494l8505J0921Q074J7424J6703o885k3726k2679
15209c9513J1377Q785J1473N934l412k18K650m450j5922m589j2106k554K0807
$$ plain form
15196 -21738 -35304 -55473 -56502 -50028 -24724 353 8175 24200 14874 -29345 -31393 -30333 -12948
15183 -12948 13968 13131 4262 18344 25637 11967 861 -12125 -32726 -38922 -39559 -19753 2486
15170 2486 -22414 -21347 17524 35188 21438 10419 10363 11294 38442 25101 1500 -12485 -12799
15157 -12799 -5004 13250 18836 13724 3767 13910 33188 24877 -11587 -33950 -40580 -9969 2312
15144 2312 -11114 -39118 -30494 18877 26436 20694 -1084 -21199 -4378 14839 18110 4986 18729
15131 18729 11217 8697 20661 396 -16470 -19425 -16402 -2773 4502 4117 -4010 -22723 -27785
15118 -27785 -10007 10516 -1027 -11364 -33876 -24025 -21181 -9966 -9348 -12585 -23901 3600 16502
15105 16502 8729 -1287 3257 14902 25877 28946 38396 48158 15313 10594 10689 -23976 -51143
$$ packed form
15196b1738j3566k0169j029O474K5304K5077P822J6025r326m4219k048J060J7385
15183a2948K6916q37q869J4082P293j3670j1106j2986k0601o196o37J9806K2239
15170B486k4900J067L8871J7664j3750j1019n6R31K7148j3341k3601j3985l14
15157a2799P795J8254N586n112r957J0143J9278q311l6464k2363o630L0611J2281
15144B312j3426k8004Q624M9371P559n742k1778k0115J6821J9217L271j3124J3743
15131A8729p512k520J1964k0265j6866k955L023J3629P275l85q127j8713n062
15118b7785J7778K0523j1543j0337k2512R851K844J1215O18l237j1316K7501J2902
15105A6502p773j0016M544J1645J0975L069R450R762l2845m719R5l4665k7167
$$ plain form
15092 -51143 -46271 -48848 -52322 -34474 -20156 -33055 -45479 -29949 -19422 -33026 -50816 -27265
15080 -27265 -30778 -46060 -41047 -45535 -36143 -35912 -6012 2832 -3351 -19852 -34470 -22788 -11477
15067 -11477 10248 -10784 -21934 -12119 -4864 -5697 -11292 -3611 -16873 -25056 -28865 -32458 -16125
15054 -16125 6420 10624 -15480 -1779 -10130 -10881 -23627 -26407 2769 -12523 -464 702 -6647
15041 -6647 674 -4260 -1772 29906 28829 9736 -3998 -8131 -1350 21833 16893 4686 -3888
15028 -3888 154 -2024 -16447 -31970 -14437 -19947 -14912 14998 56706 50455 15904 -7096 -15740
15015 -15740 21878 42771 46702 30710 4427 -6804 -5799 -24116 -5839 -8844 -10562 -19051 -6523
15002 -6523 -8418 -43110 -41388 -35283 -21841 -6895 -5 39626 59709 54363 42293 32242 1997
$$ packed form
15092e1143M872k577l474J7848J4318j2899j2424J5530J0527j3604j7790K3551
15080b7265l513j5282N013m488R392K31K9900Q844o183j6501j4618J1682J1311
15067a1477K1725k1032j1150R815P255q33n595P681j3262q183l809l593J6333
15054a6125K2545M204k6104J3701q351p51j2746k780K9176j5292J2059J166p349
15041f647P321m934K488L1678j077j9093j3734m133O781K3183m940j2207q574
15028c888M042k178j4423j5523J7533n510N035K9910M1708o251l4551k3000q644
15015a5740L7618K0893L931j5992k6283j1231J005j8317J8277l005j718q489J2528
15002f523j895l4692J722O105J3442J4946O890L9631K0083n346j2070j0051l0245
$$ plain form
14989 1997 6157 -6807 -11847 -11812 3042 3152 -35562 -49292 -29967 -30316 -29653 -34666 -35453 -34296 -33520
14974 -33520 -1614 20329 35524 56207 68526 49344 28184 39095 76014 70005 35684 14853
14962 14853 4641 17863 9434 11292 7894 -17026 -7621 8333 -1284 -7704 -2998 20945 6374
14949 6374 -14917 -24202 -12156 -14086 5563 7706 -25891 -51823 -48126 -20839 -5596 -38009 -60054
14936 -60054 -70357 -26901 -6771 -8841 -9668 -3488 5476 11843 2933 1383 -22425 -44415 -26699
14923 -26699 -26464 -12140 6368 -14079 -27982 -53850 -59906 -75914 -53495 -17843 -8074 -30687
14911 -30687 -36463 3331 23017 23771 -2234 -19565 -22365 5898 24278 44709 33361 0
14899 0 7764 12850 -16293 -10710 10142 27820 17628 13536 45796 56348 70634 78543 45440
$$ packed form
14989A997M160j2964n040L5J4854J10l8714j3730J9325l49O63n013p87J157P76
14974c3520L1906K1943J5195K0683J2319j9182k1160J0911L6919o009l4321k0831
14962A4853j0212J3222q429J858l398k4920R405J5954r617o420M706K3943j4571
14949F374k1291r285J2046j930J9649K143l3597k5932L697K7287J5243l2413k2045
14936f0054j0303M3456K0130k070q27O180Q964O367q910j550k3808k1990J7716
14923b6699K35J4324J8508k0447j3903k5868o056j6008K2419L5652R769k2613
14911c0687n776L9794J9686P54k6005j7331k800K8263J8380K0431j1348l3361
14899@P764N086k9143N583K0852J7678j0192m092L2260J0552J4286P909l3103
$$ plain form
14886 45440 33866 48991 84542 76483 59827 27484 7613 -4374 -2639 32518 10742 -15142
14874 -15142 11204 21916 27937 16939 3300 14799 25278 22457 26238 18740 10637 10044 1647
14861 1647 -27726 -42654 -15528 -1593 -1207 15900 -1966 -11767 -4139 2644 -16521 -14413 -20187
14848 -20187 -14797 -34434 -10126 12494 21557 11253 9924 23215 24217 31488 43057 41313 36916
14835 36916 20446 27001 48966 47000 44431 30707 8003 -20811 -27893 -37956 -44821 -33382 -27591
14822 -27591 335 7335 4165 -11499 548 -1713 -16701 -3167 8451 9672 -2062 -11254 -12784
14809 -12784 -15698 -9083 -7667 -2068 -2224 14198 15431 -11548 2255 29882 45528 54118 -2703
14796 -2703 -26004 -35084 -24498 -6073 -3861 25459 13188 -2256 -19155 -11375 15621 12374 -14912
$$ packed form
14886D5440j1574J5125L5551q059j6656l2343j9871j1987J735L5157k1776k5884
14874a5142K6346J0712O021j0998j3639J1499J0479k821L781p498q103n93q397
14861A647k9373j4928K7126J3935L86J7107j7866r801P628O783j9165K108n774
14848b0187N390j9637K4308K2620R063j0304j329J3291J002P271J1569j744m397
14835C6916j6470O555K1965j966k569j3724k2704k8814p082j0063o865J1439N791
14822b7591K7926P000l170j5664J2047k261j4988J3534J1618J221j1734r192j530
14809a2784k914O615J416N599j56J6422J233k6979J3803K7627J5646Q590n6821
14796b703k3301r080J0586J8425K212K9320j2271j5444j6899P780K6996l247k7286
$$ plain form
14783 -14912 -14729 -10064 -29246 -42032 -10452 3934 -21734 -36461 -31469 -15259 -3746 -8516 -20438
14770 -20438 -26588 -4770 21603 19408 5556 -13259 -11422 -18186 -24217 13711 3262 -4796 -10712
14757 -10712 -12454 777 302 20979 4154 -2477 7849 2748 2169 -9920 5870 7930 -12493
14744 -12493 -31551 -32420 -29775 -14520 10701 13477 7884 36627 49844 39352 4212 -13948 -9814
14731 -9814 -13010 -4007 27354 26001 4382 -14736 -29941 -29630 -31389 -11256 -17588 -11481 23197
14718 23197 43852 1770 -27285 -33563 -40461 -50770 -18864 -2903 -1779 18420 2399 5182
14706 5182 4508 -32445 -47171 -51935 -31795 -30165 -38146 -18914 -17239 -39034 -36680 -28723 -12585
14693 -12585 -2145 450 32607 42483 -303 -27387 -33017 -39831 -11235 -12784 -10734 -21426 3979
$$ packed form
14783a4912J83M665j9182j2786L1580J4386k5668j4727M992J6210J1513m770j1922
14770b0438o150K1818K6373k195j3852j8815J837o764o031L7928j0449q058n916
14757a0712j742J3231m75K0677j6825o631J0326n101n79j2089J5790K060k0423
14744a2493j9058q69K645J5255K5221K776n593K8743J3217j0492l5140j8160M134
14731i814l196R003L1361j353k1619j9118j5205L11j759K0133o332O107L4678
14718B3197K0655m2082k9055o278o898j0309L1906J5961J124K0199j6021K783
14706E182o74l6953j4726m764K0140J630p981J9232J675k1795K354P957J6138
14693a2585J0440K595L2157R876m2786k7084n630o814K8596j549K050j0692K5405
$$ plain form
14680 3979 33989 13588 -41355 -38031 -16245 -1914 -14980 27512 27789 2104 -40859 -54312
14668 -54312 -47609 -25958 -20397 -23448 -27471 -29711 -23669 -20791 -9199 -12109 -20944 -6722 15913
14655 15913 17843 -4813 836 17743 21343 1599 5761 22617 2382 6919 14432 29772 36785
14642 36785 30267 3854 13221 13103 22730 35848 32231 34918 38646 11542 -13501 -1285 10138
14629 10138 -1178 -833 16674 6261 -16678 11787 50342 42598 24727 5998 -92 10455
14617 10455 16336 22508 27183 11799 13473 -1586 5748 -5343 -37248 -35092 -31969 -34208 -33600 -25792
14603 -25792 -39396 -34645 -17905 -18270 -18634 -23989 -28670 -15749 -632 23342 16130 19746 11872 6146
14589 6146 15461 27019 56400 53314 40155 36056 2809 -24881 -30721 1389 25768 17417 23359
$$ packed form
14680C979L0010k0401n4943L324K1786J4331j3066M2492K77k5685m2963j3453
14668e4312O703K1651N561l051m023k240O042K878J1592k910q835J4222K2635
14655A5913J930k2656N649J6907L600j9744M162J6856k0235M537P513J5340P013
14642C6785o518k6413R367j18R627J3118l617K687L728k7104k5043J2216J1423
14629A0138j1316L45J7507j0413k2939K8465L8555p744j7871j8729o090J0547
14617A0455N881O172M675j5384J674j5059P334j1091l1905K156L123k239O08P808
14603b5792j3604M751J6740l65l64n355m681J2921J5117K3974p212L616p874n726
14589F146R315J1558K9381l086j3159m099l3247k7690n840L2110K4379q351N942
$$ plain form
14576 23359 38538 33393 10546 8930 6682 15225 36895 39154 37132 50659 46154 36529 30518
14563 30518 5109 3002 -14154 -34850 -49433 -26386 985 993 -3371 -4696 2536 10416 21640
14550 21640 17698 -8623 -17865 -23314 -33218 -29110 -13425 -10266 2303 8022 21795 23133 34265
14537 34265 26427 18505 -1584 -8753 1445 22653 36778 37739 33798 30547 21069 16983 31160
14524 31160 42035 55548 46655 29435 3052 18040 7254 -18476 -34944 -38498 -33179 -37904
14512 -37904 -26838 3628 -5237 13314 13142 19143 21491 2014 11587 32009 49224 61327 18027
14499 18027 -3731 18723 7468 -13591 -2798 10937 -12985 -9930 -7706 20329 15476 -986
14487 -986 -3386 15251 11251 24350 13699 -20054 -36512 -22959 8360 12504 -1364 18882 45464
$$ packed form
14576B3359J5179n145k2847j616k248Q543K1670K259k022J3527m505r625o011
14563C0518k5409k107j7156k0696j4583K3047K7371Qm364j325P232P880J1224
14550B1640l942k6321r242n449r904M108J5685L159J2569N719J3773J338J1132
14537C4265p838p922k0089p169J0198K1208J4125R61l941l251r478m086J4177
14524C1160J0875J3513q893j7220k6383J4988j0786k5730j6468l554N319m725
14512c7904J1066L0466q865J8551j72O001K348j9477R573K0422J7215J2103m3300
14499A8027k1758K2454j1255k1059J0793J3735k3922L055K224K8035m853j6462
14487i86k400J8637m000J3099j0651l3753j6458J3553L1319M144j3868K0246K6582
$$ plain form
14474 45464 39299 -16007 -36882 -53461 -42255 -9974 18574 54769 72685 58899 35989 4530
14462 4530 257 -10841 -13017 1905 -847 14642 13875 -2515 -4630 -8297 -5399 -9485 -41848 -38098
14448 -38098 -17889 7703 -8674 8996 14335 43137 22675 -6014 20986 37290 13724 -23474
14436 -23474 -10076 8964 1861 -4726 -11486 -16243 -8507 18013 7798 -3032 25692 36687 36842
14423 36842 26327 36794 7393 3668 15430 24195 13885 9520 16368 20341 31200 40316 31664
14410 31664 39598 43542 22354 5097 20861 29966 36983 38403 18510 -8879 2559 -3264 -53732
14397 -53732 -42389 -10825 6475 7042 2629 7980 23549 13026 17464 17981 11893 -6607 28048
14384 28048 16170 4665 28722 52325 39505 35226 -50 -31761 -19384 4569 -1597 -5338
$$ packed form
14474D5464o165n5306k0875j6579J1206L2281K8548L6195J7916j3786k2910l1459
14462D530m273j1098k176J4922k752J5489p67j6390k115l667K898m086l2363L750
14448c8098K0209K5592j6377J7670N339K8802k0462k8689K7000J6304k3566l7198
14436b3474J3398J9040p103o587o760m757P736K6520j0215j0830K8724J0995J55
14423C6842j0515J0467k9401l725J1762Q765j0310m365O848L973J0859R116q652
14410C1664P934L944k1188j7257J5764R105P017J420j9893k7389J1438n823n0468
14397e3732J1343L1564J7300N67m413N351J5569j0523M438N17o088j8500L4655
14384B8048j1878j1505K4057K3603j2820m279l5276l1711J2377K3953o166l741
$$ plain form
14372 -5338 3990 42435 51919 24285 14222 12579 16482 29611 22097 40927 43897 44452 55915
14359 55915 40425 4647 -8887 -6969 22944 15311 7081 -4771 -46775 -69307 -40311 -11553
14347 -11553 20512 34268 24456 28885 39840 55667 23075 2668 6084 1500 4188 -13471 -5730
14334 -5730 14439 35556 16177 7808 35897 32886 809 -8209 11338 8872 2068 12474 11645
14321 11645 4021 -15187 -19598 6022 21895 35729 34708 46411 78954 77633 96762 87958 72846
14308 72846 36295 -1393 8433 -12890 -33770 -32419 -44804 -60110 -23351 4156 31885 45410
14296 45410 29087 15170 7588 25913 1526 -16733 -414 23570 22611 23675 16349 3309 2214
14283 2214 15954 28643 30765 11320 6735 -8549 -24261 -7298 15354 6361 -6639 -5068 2622
$$ packed form
14372e338R328L8445R484k7634j0063j643L903J3129p514J8830K970N55J1463
14359E5915j5490l5778j3534J918K9913p633q230j1852m2004k2532K8996K8758
14347a1553L2065J3756r812M429J0955J5827l2592k0407L416m584K688j7659P741
14334e730K0169K1117j9379q369K8089l011l2077r018J9547k466o804J0406q29
14321A1645p624j9208m411K5620J5873J3834j021J1703L2543j321J9129q804j5112
14308G2846l6551l7688R826k1323k0880J351j2385j5306L6759K7507K7729J3525
14296D5410j6323j3917p582J8325k4387j8259J6319K3984r59J064p326j3040j095
14283B214J3740J2689K122j9445m585j5284j5712J6963K2652q993j3000J571P690
$$ plain form
14270 2622 15319 19038 9998 22694 19802 36025 37493 34806 18839 12472 3170 -31121 -36363
14257 -36363 -1073 -392 -12422 8996 1555 -3776 19928 48343 28653 19743 27147 16704 15769
14244 15769 27737 23184 4477 -5636 8555 39082 21850 -10400 -3653 -5405 -8485 -5254 34932
14231 34932 45809 37900 47906 55959 50832 8409 -6976 -14161 -12521 -5930 -9218 2069 3848
14218 3848 720 1499 7345 13575 20562 45673 55107 39091 56584 65632 55686 45900 36334 47377
14204 47377 39706 30762 24418 33594 34996 26706 41077 39491 35296 37911 21428 8162 23199
14191 23199 16515 20138 49023 41665 57346 56417 42978 44044 42511 28891 17267 34664 32410
14178 32410 -6454 14232 47986 39621 49899 62398 64538 56299 82674 80473 76008 74138 64631
$$ packed form
14270B622J2697L719r040J2696k892J6223J468k687j5967o367r302l4291n242
14257c6363L5290O81j2030K1418p441n331K3704K8415j9690q910P404j0443r35
14244A5769J1968m553j8707j0113J4191L0527j7232l2250O747j752l080L231M0186
14231C4932J0877p909J0006Q053n127m2423j5385p185J640O591l288J1287J779
14218C848l128P79N846O230O987K5111R434j6016J7493R048r946r786r566J1043
14204D7377p671q944o344R176J402q290J4371j586m195K615j6483j3266J5037
14191B3199o684L623K8885p358J5681r29j3439J066j533j3620j1624J7397k254
14178C2410l8864K0686L3754q365J0278J2499K140q239K6375k201m465j870r507
$$ plain form
14165 64631 33204 17229 7919 25019 28698 11374 2521 23614 52595 57933 29834 -1836
14153 -1836 -9887 -18498 -2190 8910 21618 43260 17088 2881 12417 18713 34064 53636 36498
14140 36498 42115 58078 47687 48221 20010 7605 -3493 16469 8312 10726 15295 17958 7956
14127 7956 12125 9972 9310 21428 63109 55236 37119 47773 49622 42538 49779 76374 62002
14114 62002 34132 15256 5340 36107 65266 43389 40682 19326 23846 52050 35864 24832
14102 24832 35961 19573 17118 22189 17095 16019 4279 -18426 -26533 10352 44082 34925 24962
14089 24962 7147 -10266 -25628 -29091 -15108 -25294 -15379 2961 -8948 -29264 -28165 -26350
14077 -26350 -43139 -44055 -14520 4356 -162 35796 53233 41134 22928 15925 15922 23905 20631 27768
$$ packed form
14165F4631l1427j5975r310J7100L679j7324q853K1093K8981N338k8099l1670
14153a836q051q611J6308J1100J2708K1642k6172j4207R536O296J5351J9572j7138
14140C6498N617J5963j0391N34k8211j2405j1098J9962q157K414M569K663j0002
14127G956M169k153o62J2118M1681p873j8117J0654J849p084P241K6595j4372
14114F2002k7870j8876r916L0767K9159k1877k707k1356M520K8204j6186j1032
14102B4832J1129j6388k455N071n094j076j1740k2705q107L6885L3730r157r963
14089B4962j7815j7413j5362l463J3983j0186R915J8340j1909k0316J099J815
14077b6350j6789r16K9535J8876m518L5958J7437j2099j8206p003lP983l274P137
$$ plain form
14063 27768 19158 -6573 -4866 43045 51437 61809 65031 80333 67875 48012 61762 35422
14051 35422 19708 19907 484 658 14627 7044 -1774 3509 -322 -14302 564 13948 11095
14038 11095 -9893 -2292 21413 51101 50889 48204 15250 -26457 -46641 -44655 1370 5597 -20998
14025 -20998 3263 1882 -7539 36135 67994 39447 35072 42164 23659 2534 17917 49689
14013 49689 81883 68583 63390 57817 49132 27283 22031 17172 16250 22821 28659 36622 38335 52897
13999 52897 48783 37230 34601 8394 16339 34718 28023 32432 39839 26146 7561 10684 24194
13986 24194 41827 33846 26186 21688 17633 30270 19136 19282 25834 20882 18568 38449 53169
13973 53169 56841 39807 28316 14500 28947 38458 41015 31724 41466 38700 56316 42994 37921
$$ packed form
14063B7768q610k5731J707M7911Q392J0372L222J5302j2458j9863J3750k6340
14051C5422j5714J99j9423J74J3969p583q818N283l831j3980J4866J3384k853
14038A1095k0988P601K3705K9688k12k685l2954m1707k0184J986M6025M227k6595
14025b0998K4261j381r421M3674L1859k8547m375P092j8505k1125J5383L1772
14013D9689L2194j3300n193n573q685k1849n252m859r22O571N838P963J713J4562
13999E2897m114j1553k629k6207P945J8379o695M409P407j3693j8585L123J3510
13986B4194J7633p981p660m498m055J2637j1134J46O552m952k314J9881J4720
13973E3169L672j7034j1491j3816J4447R511K557r291R742k766J7616j3322n073
$$ plain form
13960 37921 45306 64327 63410 42711 37004 11725 17686 31835 46715 44545 33622 43568 62115
13947 62115 82085 65717 54303 64206 56415 46340 51052 57834 60504 62199 46689 53085 53419
13934 53419 45504 44781 32439 18341 27964 20286 5460 -8899 2047 16500 21690 26040 32286
13921 32286 26555 30503 27999 9722 21970 26779 57270 58223 54932 41139 19965 -15971 -9735
13908 -9735 -11347 21126 57428 60960 31641 9808 23951 42827 39636 48074 30662 21069 28719
13895 28719 32889 47972 46921 47813 31081 -1225 -2764 22165 54650 68311 55077 56658 45853
13882 45853 48018 44475 25602 11912 11225 21815 42616 52497 63307 99822 98581 67502 58631
13869 58631 64952 62620 59062 37366 34448 48702 30657 15844 24238 31363 45905 40737 57876
$$ packed form
13960C7921P385J9021r17k0699n707k5279N961J4149J4880k170j0923R946J8547
13947F2115J9970j6368j1414R903p791j0075M712O782K670J695j5510O396L34
13934E3419p915p23j2342j4098R623p678j4826j4359J0946J4453N190M350O246
13921C2286n731L948k504j8277J2248M809L0491R53l291j3793k1174l5936O236
13908i735j612L2473L6302L532k9319k1833J4143J8876l191Q438j7412r593P650
13895B8719M170J5083j051Q92j6732l2306j539K4929L2485J3661j3234J581j0805
13882D5853K165l543j8873j3690o87J0590K0801R881J0810L6515j241l1079q871
13869E8631O321k332l558k1696k918J4254j8045j4813Q394P125J4542n168J7139
$$ plain form
13856 57876 59962 53599 21792 32005 49931 46585 91954 116842 108728 98004 107588 111566 132265
13843 132265 136516 155199 168589 156320 128875 120752 132372 152680 153118 131006 128584 133296 104070
13830 104070 92775 110011 129259 116445 121357 112819 122240 128503 99961 111274 130843 144680
13818 144680 177447 186388 198862 188813 169820 204780 203776 185161 186507 184010 182139 194914
13806 194914 218492 194265 184211 204485 176820 170495 153055 150616 130222 103534 106243 114847
13794 114847 116797 119800 111516 132586 136976 124909 116201 142813 161663 178450 187584 154146 145615
13781 145615 165550 156518 161543 143111 96183 88888 97991 125062 140817 145187 133178 112470
13769 112470 114809 123749 149521 131083 127770 147612 144479 135136 124369 126542 160066 162483 176785
$$ packed form
13856E7876K086o363l1807J0213J7926l346M5369K4888q114j0724R584L978K0699
13843A32265M251J8683J3390j2269k7445q123J1620K0308M38k2112k422M712k9226
13830A04070j1295J7236J9248j2814M912q538R421O263k8542J1313J9569J3837
13818A44680L2767Q941J2474j0049j8993L4960j004j8615J346k497j871J2775
13806A94914K3578k4227j0054K0274k7665o325j7440k439k0394k6688K709Q604
13794A14847J950L003q284K1070M390j2067q708K6612J8850J6787R134l3438q531
13781A45615J9935r032N025j8432m6928p295R103K7071J5755M370j2009k0708
13769A12470K339Q940K5772j8438l313J9842l133r343j0767K173L3524K417J4302
$$ plain form
13756 176785 187609 153571 149805 141665 155310 153684 159063 161560 180995 192829 197634 194363 202941
13743 202941 191096 179822 182251 191025 181604 168578 172427 179737 203070 234438 244454 241734 258914
13730 258914 248041 218189 230406 263674 270211 244059 233228 244729 245221 244517 240194 230362 207468
13717 207468 207405 206176 186888 181726 196670 187341 189760 188740 206661 248452 248464 223237 241922 298678
13703 298678 349475 382672 388662 355055 305105 251128 235123 230455 200624 205907 200840 171780
13691 171780 161809 181513 175562 148101 122294 125346 145227 155548 136170 113618 101867 113186
13679 113186 113498 113031 139002 133533 118794 106026 101983 124118 137352 164175 191868 201642 182736
13666 182736 188690 204678 198179 201942 228542 269283 313143 388834 483141 612557 685985 681490
$$ packed form
13756A76785J0824l4038l766q140J3645j626N379K497J9435J1834M805l271Q578
13743B02941j1845j1274K429Q774r421j3026L849P310K3333L1368J0016k720J7180
13730B58914j0873k9852J2217L3268O537k6152j0831J1501M92p04m323r832k2894
13717B07468o3j229j9288n162J4944r329K419j020J7921M1791J2k5227J8685N6756
13703B98678N0797L3197N990l3607m9950n3977j6005m668k9831N283n067k9060
13691A71780r971J9704n951k7461k5807L052J9881J0321j9378k2552j1751J1319
13679A13186L12m67K5971n469j4739j2768m043K2135J3234K6823K7693R774j8906
13666A82736N954J5988o499L763K6600M0741M3860P5691R4307J29416P3428m495
$$ plain form
13654 681490 556889 389775 303342 268510 253316 218649 188569 177572 163814 168063 182081
13643 182081 175369 163810 150862 161844 162620 156329 150847 159550 144001 140862 134421 101806 119558
13630 119558 150421 158153 171030 174011 180652 183285 195549 188545 161240 163508 195272 205513 206674
13617 206674 197589 228278 308120 405898 548653 692274 768675 704820 585783 501482 421459
13606 421459 361139 330533 320405 319778 300423 286284 233189 197463 184501 183232 186407 150944
13594 150944 128291 165077 167631 139069 108512 90082 104314 141928 168545 152386 151720 148921
13582 148921 139499 138074 140067 151470 154304 175857 174317 176828 178989 183664 187938 208465 248669
13569 248669 292472 343709 414059 445346 374750 284941 236058 212800 217229 212564 236205 236829
$$ packed form
13654F81490j24601j67114q6433l4832j5194l4667l0080j0997j3758M249J4018
13643A82081o712j1559j2948J0982P76o291n482Q703j5549l139o441l2615J7752
13630A19558L0863P732J2877K981O641K633J2264p004k7305K268L1764J0241J161
13617B06674r085L0689P9842R7778J42755J43621P6401o3855j19037q4301q0023
13606D21459o0320l0606j0128o27j9355j4139n3095l5726j2962j269L175l5463
13594A50944k2653L6786K554k8562l0557j8430J4232L7614K6617j6159o66k799
13582A48921r422j425J993J1403K834K1553j540K511K161M675M274K0527M0204
13569B48669M3803N1237P0350L1287p0596q9809m8883k3258M429m665K3641O24
$$ plain form
13557 236829 189612 172310 162442 161922 173306 159203 158019 175599 193775 186819 174550 173720 162127
13544 162127 131889 125271 137257 166240 179816 186179 198539 176528 177617 177284 196730 167344
13532 167344 145480 147533 162694 161336 156788 188533 203980 205515 183993 186413 205583 237259
13520 237259 229008 235019 253446 255636 230564 234974 266908 288873 264514 248906 242608 264577
13508 264577 285021 291021 269648 265140 238058 223361 186216 136036 125381 154123 167665 155988
13496 155988 179825 210044 222134 206860 191804 218274 240020 257393 258525 254768 234342 208355
13484 208355 206165 201583 216396 229098 243519 235851 233266 243715 237729 213845 249400 271665
13472 271665 302810 319872 332698 345233 360465 358837 368399 391180 425020 414182 380754 352136
$$ packed form
13557B36829m7217j7302r868n20J1384j4103j184J7580J8176o956j2269q30j1593
13544A62127l0238o618J1986K8983J3576O363J2360k2011J089l33J9446k9386
13532A67344k1864K053J5161j358m548L1745J5447J535k1522K420J9170L1676
13520B37259q251O011J8427K190k5072M410L1934K1965k4359j5608o298K1969
13508B64577K0444O000k1373m508k7082j4697l7145n0180j0655K8742J3542j1677
13496A55988K3837L0219J2090j5274j5056K6470K1746J7373J132l757k0426k5987
13484B08355k190m582J4813J2702J4421p668k585J0449n986k3884L5555K2265
13472B71665L1145J7062J2826J2535J5232j628R562K2781L3840j0838l3428k8618
$$ plain form
13460 352136 374678 389539 403976 362419 302579 288794 303506 359499 385946 395876 424144 421706
13448 421706 445439 468977 466184 438783 430256 436988 462304 466362 480419 498469 511251 508733
13436 508733 516016 528567 542923 557619 565929 593360 630583 680876 715736 765765 823163 872334
13424 872334 951845 1012123 1052395 1094156 1189903 1280665 1368498 1451035 1569673 1727033 1898784
13413 1898784 2113598 2336698 2624848 2989415 3457713 4084250 4903987 5965748 7274579
13404 7274579 8715251 10182770 11563147 12722059 13638899 14274834 14735290 15100352 15458965
13395 15458965 15786714 16057382 16092309 15832120 15232141 14342003 13411092 12537145 11860982
13386 11860982 11457293 11352703 11566422 12132769 13100403 14575366 16578210 19021481 21742216
$$ packed form
13460C52136K2542J4861J4437m1557n9840j3785J4712N5993K6447R930K8268k438
13448D21706K3733K3538k793k7401q527O732K5316M058J4057J8050J2782k518
13436E08733P283J2551J4356J4696Q310K7431L7223N0293L4860N0029N7398M9171
13424H72334P9511O0278M0272M1761R5747R0762Q7833Q2537J18638J57360J71751
13413A898784K14814K23100K88150L64567M68298O26537Q19737J061761J308831
13404G274579J440672J467519J380377J158912R16840O35935M60456L65062L58613
13395A5458965L27749K70668L4927k60189n99979q90138r30911q73947o76163
13386A1860982m03689j04590K13719N66347R67634J474963K002844K443271K720735
$$ plain form
13377 21742216 24577362 27369267 29937185 32070086 33564576 34291328 34250770 33587960 32570304
13368 32570304 31411913 30158905 28629566 26681641 24383954 21953493 19692061 17783759
13360 17783759 16313754 15325253 14738616 14530008 14772168 15401218 16356583 17524487 18711945
13351 18711945 19682316 20345753 20700347 20745382 20533181 20211608 19860313 19504957 19163650
13342 19163650 18781899 18244547 17451057 16428820 15191583 13882912 12645217 11582037
13334 11582037 10763907 10138777 9701967 9406874 9252873 9257469 9427336 9714205 10129404 10736166
13324 10736166 11567990 12616728 13854717 15201400 16604104 17914109 18998804 19793483
13316 19793483 20392924 20849828 21247209 21662782 22120521 22582622 22835562 22811676 22483552
$$ packed form
13377B1742216K835146K791905K567918K132901J494490P26752m0558o62810j017656
13368C2570304j158391j253008j529339j947925k297687k430461k261432j908302
13360A7783759j470005r88501n86637k08608K42160O29050R55365J167904J187458
13351A8711945R70371O63437L54594M5035k12201l21573l51295l55356l41307
13342A9163650l81751n37352p93490j022237j237237j308671j237695j063180
13334A1582037q18130o25130m36810k95093j54001M596J69867K86869M15199O06762
13324A0736166Q31824J048738J237989J346683J402704J310005J084695P94679
13316A9793483N99441M56904L97381M15573M57739M62101K52940k3886l28124
$$ plain form
13307 22483552 21765061 20708416 19475352 18282375 17397332 16830813 16645548 16867421 17536807
13298 17536807 18702800 20349418 22513001 25053698 27746507 30308316 32502182 34375653
13290 34375653 36036827 37610958 39022463 40042067 40377216 39851366 38504603 36482837
13282 36482837 33992559 31178630 28249528 25437410 22902324 20879816 19337370 18230881
13274 18230881 17518048 17185494 17243880 17719000 18553332 19603907 20739233 21751434 22455616
13265 22455616 22836971 22922250 22872225 22766048 22696294 22617479 22359201 21837238 20975297 19762271
13255 19762271 18305368 16754430 15244418 13993713 13082489 12496331 12205547 12153303 12378325
13246 12378325 12895799 13862522 15636428 18746605 23819409 30940761 38408088 42784507
$$ packed form
13307B2483552p18491j056645j233064j192977q85043n66519j85265K21873O69386
13298A7536807J165993J646618K163583K540697K692809K561809K193866J873471
13290C4375653J661174J574131J411505J019604L35149n25850j346763k021766
13282C6482837k490278k813929k929102k812118k535086k022508j542446j106489
13274A8230881p12833l32554N8386M75120Q34332J050575J135326J012201P04182
13265B2455616L81355Q5279n0025j06177o9754p8815k58278n21963q61941j213026
13255A9762271j456903j550938j510012j250705r11224n86158k90784n2244K25022
13246A2378325N17474R66723J773906L110177N072804P121352P467327M376419
$$ plain form
13238 42784507 41244013 34793518 27468626 21976647 18389807 16028280 14415233 13285009
13230 13285009 12390820 11602063 10894429 10234471 9622334 9146414 8748563 8432310 8173715
13221 8173715 7990091 7871360 7784892 7758797 7764822 7792501 7861624 7954109 8051669 8128474 8215637
13210 8215637 8338224 8508789 8791871 9160078 9695543 10529495 11659975 13126549 14924917
13201 14924917 17231518 20591641 25942593 34837684 49385382 70958669 95898179 113559309
13193 113559309 112771432 93264362 68293334 49435458 37750228 30577562 25972599
13186 25972599 22825000 20480599 18574604 16838192 15238900 13838607 12673753 11735274
13178 11735274 10954291 10292226 9768167 9362318 9076101 8893043 8826415 8832548 8824806 8754567
$$ packed form
13238D2784507j540494o450495p324892n491979l586840k361527j613047j130224
13230A3285009q94189p88757p07634o59958o12137m75920l97851l16253k58595
13221H173715j83624j18731q6468k6095O025K7679O9123R2485R7560P6805Q7163
13210H215637J22587J70565K83082L68207N35465Q33952J130480J466574J798368
13201A4924917K306601L360123N350952Q895091J4547698K1573287K4939510J7661130
13193A13559309p87877j9507070k4971028j8857876j1685230p172666m604963
13186B5972599l147599k344401j905995j736412j599292j400293j164854r38479
13178A1735274p80983o62065n24059m05849k86217j83058o6628O133p742p0239
$$ plain form
13168 8754567 8579721 8434293 8386541 8443665 8581261 8816244 9186227 9751703 10558026 11685331
13158 11685331 13218322 15130648 17547395 20937663 26178874 34687204 48573685 69523475
13150 69523475 95017804 115290302 118332980 101130046 75618615 55277221 42639155
13143 42639155 35122593 30582437 27624964 25268073 23059914 20919882 18824068 16957433
13135 16957433 15424013 14120103 12996562 12074487 11303436 10697667 10190041 9793692 9521000
13126 9521000 9346551 9203929 8936103 8583017 8239839 7971194 7742856 7598388 7558128 7590082
13116 7590082 7667137 7825447 8105275 8508523 9093779 9897718 11034119 12804869 15607340
13107 15607340 20049873 26723894 34898730 41743759 43596194 39129896 31528876 24935737
$$ packed form
13168H754567j74846j45428m7752N7124J37596K34983L69983N65476Q06323J127305
13158A1685331J532991J912326K416747L390268N241211Q508330J3886481K0949790
13150F9523475K5494329K0272498L042678j7202934k5511431k0341394j2638066
13143D2639155p516562m540156k957473k356891k208159k140032k095814j866635
13135A6957433j533420j303910j123541r22075p71051o05769n07626l96349k72692
13126I521000j74449j42622k67826l53086l43178k68645k28338j44468m0260L1954
13116G590082P7055J58310K79828M03248N85256Q03939J136401J770750K802471
13107A5607340M442533O674021Q174836O845029J852435m466298p601020o593139
$$ plain form
13099 24935737 20706718 18300924 17024815 16261833 15497322 14475253 13252364 12053532
13091 12053532 10994331 10094910 9322324 8568688 7951002 7422676 6943963 6568030 6282135
13082 6282135 6024757 5791670 5578642 5367532 5137509 4905184 4725996 4548407 4407351
13073 4407351 4263750 4139386 3982821 3856746 3741527 3633932 3543882 3492579 3445881 3415473
13063 3415473 3393586 3361269 3386101 3444119 3507864 3542652 3577033 3639493 3741703 3848842 4002061
13052 4002061 4187775 4371683 4439124 4338394 4114567 3826481 3602999 3381469 3196734 2989870
13042 2989870 2821539 2686560 2558918 2426545 2329860 2253892 2164268 2112277 2047528 1971653
13032 1971653 1895598 1841624 1772914 1695820 1655279 1623659 1586710 1553746 1485353 1414680 1353224
$$ packed form
13099B4935737m229019k405794j276109p62982p64511j022069j222889j198832
13091A2053532j059201q99421p72586p53636o17686n28326m78713l75933k85895
13082F282135k57378k33087k13028k11110k30023k32325j79188j77589j41056
13073D407351j43601j24364j56565j26075j15219j07595r0050n1303m6698l0408
13063C415473k1887l2317K4832N8018O3745L4788L4381O2460J02210J07139J53219
13052D002061J85714J83908O7441j00730k23827k88086k23482k21530j84735k06864
13042B989870j68331j34979j27642j32373r6685p5968q9624n1991o4749p5875
13032A971653p6055n3974o8710p7094m0541l1620l6949l2964o8393p0673o1456
$$ plain form
13021 1353224 1326249 1302521 1292333 1269960 1239619 1200683 1184533 1157346 1125722 1122510 1136454
13010 1136454 1111037 1082156 1072597 1068384 1059886 1037754 983314 935722 910203 889301 893223 846098
12998 846098 814081 782923 761067 764930 797724 789017 770919 758279 746713 706695 678000 677345
12986 677345 676382 633029 614734 611767 602985 599912 579450 547206 538339 515232 450062 402016 424790
12973 424790 427791 429875 426483 438219 456573 444128 459653 452673 472082 471481 471802 477092 474615
12960 474615 488976 493389 463954 459799 450492 439777 425778 406318 400919 416465 387326 367312
12948 367312 363521 361766 354716 343539 334340 322869 337590 341683 346437 356048 337899 312514 304284
12935 304284 331338 370056 419803 435005 430851 381321 360048 330575 322848 344692 345162 349276
$$ packed form
13021A353224k6975k3728j0188k2373l0341l8936j6150k7187l1624l212J3944
13010A136454k5417k8881r559m213q498k2132n4440m7592k5519k0902L922m7125
12998H46098l2017l1158k1856L863L2794q707j8098j2640j1566m0018k8695o55
12986F77345r63m3353j8295k967q782l073k0462l2244q867k3107o5170m8046K2774
12973D24790L001K084l392J1736J8354j2445J5525o980J9409o01L21N290k477
12960D74615J4361M413k9435m155r307j0715j3999j9460n399J5546k9139k0014
12948C67312l791j755p050j1177r199j1471J4721M093M754R611j8149k5385q230
12935C04284K7054L8718M9747J5202m154m9530k1273k9473p727K1844M70M114
$$ plain form
12923 349276 350543 352699 340801 334783 335550 314300 294803 285527 288280 274092 268855 273384 289590
12910 289590 280741 278353 276304 278613 282686 291818 254623 229123 225808 210688 214589 249472 238441
12897 238441 234405 259833 228601 214462 220511 271635 277497 254835 211602 208982 215430 220191 203452
12884 203452 168107 156430 165872 160917 165607 166028 153804 149085 143906 132967 121942 138217 160513
12871 160513 166021 145975 124358 133344 148521 148068 167531 225536 253331 256426 227807 204449
12859 204449 205136 212540 235994 238309 268935 299238 301265 282399 275034 306420 328454 343624 353800
12846 353800 364687 354411 387313 439799 457800 449163 440340 415142 357712 271058 236897 222917
12834 222917 189191 155807 153821 184094 182886 153478 135101 134459 130043 147681 145717 169620 154454
$$ packed form
12923C49276J267K156j1898o018P67k1250j9497r276K753j4188n237M529J6206
12910B89590q849k388k049K309M073R132l7195k5500l315j5120L901L4883j1031
12897B38441m036K5428l1232j4139O049N1124N862k2662m3233k620O448M761j6739
12884B03452l5345j1677R442m955M690M21j2224m719n179j0939j1025J6275K2296
12871A60513N508k0046k1617Q986J5177m53J9463N8005K7795L095k8619k3358
12859B04449O87P404K3454K315L0626L0303K027j8866p365L1386K2034J5170J0176
12846C53800J0887j0276L2902N2486J8001q637q823k5198n7430q6654l4161j3980
12834B22917l3726l3384j986L0273j208k9408j8377o42m416J7638j964K3903j5166
$$ plain form
12821 154454 148070 157086 160788 133995 142115 163908 143068 148752 161138 175846 164119 169339 191274
12808 191274 194908 194467 169968 153506 135682 138322 177478 168033 142397 126387 102592 102846 100025
12795 100025 75565 61015 34663 49379 91517 91566 84280 92345 60807 41434 21449 26231 20856
12782 20856 34564 50266 64043 69914 92480 108893 122852 131769 117139 89455 100154 122645
12770 122645 143800 175801 203599 219133 205139 140433 87766 68387 72946 64740 57935 48852
12758 48852 27557 34406 36301 48297 63966 55276 40040 31931 14369 17702 35976 48108 50277
12745 50277 75720 83594 75877 60510 31876 21236 28870 38366 19096 -6389 -5358 -1384 29557
12732 29557 66967 80137 66666 72110 109916 168424 239120 371280 533749 628627 588140
$$ packed form
12821A54454o384R016L702k6793Q120K1793k0840N684J2386J4708j1727N220K1935
12808A91274L634m41k4499j6462j7824K640L9156r445k5636j6010k3795K54k821
12795A00025k4460j4550k6352J4716M2138M9p286Q065l1538j9373j9985M782n375
12782B0856J3708J5702J3777N871K2566J6413J3959Q917j4630k7684J0699K2491
12770A22645K1155L2001K7798J5534j3994o4706n2667j9379M559q206o805r083
12758D8852k1295O849J895J1996J5669q690j5236q109j7562L333J8274J2132K169
12745E0277K5443P874p717j5367k8634j0640P634R496j9270k5485J031L974L0941
12732B9557L7410J3170j3471N444L7806N8508P0696J32160J62469R4878m0487
$$ plain form
12721 588140 477068 356570 259909 202197 198786 165976 123153 111900 116005 131395 111189
12710 111189 100831 110766 68132 27719 45995 40218 52511 67072 60034 55803 54369 46697 29325
12697 29325 34270 51732 64726 64682 51925 48994 45485 41701 74341 111783 106524 103844 111243 138810
12683 138810 169525 203892 241495 303396 415923 524348 562539 500161 395372 294127 207596
12672 207596 171802 167697 174756 134365 114356 101623 69491 71170 86315 111211 98258 87636
12660 87636 82106 89981 82904 99089 88707 79775 76242 74794 58237 70452 90469 76772 86655
12647 86655 82376 59632 55864 51666 62818 68920 66621 63436 77017 106462 137575 133754 166056
12634 166056 205139 206254 207507 205369 168500 168721 134230 108008 107242 91285 72579 67888 72402
$$ packed form
12721E88140j11072j20498r6661n7712l411l2810m2823j1253M105J5390k0206
12710A11189j0358R935m2634m0413J8276n777J2293J4561p038m231j434p672j7372
12697B9325M945J7462J2994m4j2757k931l509l784L2640L7442n259k680P399K7567
12683A38810L0715L4367L7603O1901J12527J08425L8191o2378j04789j01245q6531
12672B07596l5794m105P059m0391k0009j2733l2132J679J5145K4896j2953j0622
12660H7636n530P875p077J6185j0382q932l533j448j6557J2215K0017j3697R883
12647H6655m279k2744l768m198J1152O102k299l185J3581K9445L1113l821L2302
12634A66056L9083J115J253k138l6869K21l4491k6222p66j5957j8706m691M514
$$ plain form
12621 72402 68342 66600 80584 62710 52597 36725 8582 -4056 12473 8115 6597 5842 27135
12608 27135 31499 31438 7671 14381 40119 53173 69297 58906 38724 51333 55581 89087 83013
12595 83013 40908 46491 51924 43590 39152 47211 12260 -523 9126 36602 48099 63054 70175
12582 70175 61179 35673 38295 64032 54538 34074 55097 41398 32284 31377 37099 17347 3620
12569 3620 -15513 -16850 -11585 -13956 30623 25522 24176 17739 17393 32731 36177 46384 26544 25696
12555 25696 33427 17758 -312 31280 36212 41224 34808 15808 18835 33139 15679 -7988 -9845
12542 -9845 16472 41718 40403 33676 4660 -2183 15128 33061 18687 20821 -4939 -10100 -23174
12529 -23174 -44018 -54462 -49607 -17349 10279 13509 14082 9084 3007 33063 2974 7702 9268
$$ packed form
12621G2402m060j742J3984j7874j0113j5872k8143j2638J6529m358j518p55K1293
12608B7135M364o1k3767O710K5738J3054J6124j0391k0182J2609M248L3506o074
12595H3013m2105N583N433q334m438Q059l4951j2783R649K7476J1497J4955P121
12582G0175q996k5506K622K5737r494k0464K1023j3699r114r07N722j9752j3727
12569C620j9133j337N265k371M4579n101j346o437l46J5338L446J0207j9840q48
12555B5696P731j5669j8070L1592M932N012o416j9000L027J4304j7460k3667j857
12542i845K6317K5246j315o727k9016o843J7311J7933j4374K134k5760n161j3074
12529b3174k0844j0444M855L2258K7628L230N73m998o077L0056l0089M728J566
$$ plain form
12516 9268 17370 39772 44024 7692 -3297 -3832 13945 25748 3474 8661 4267 -3068 -13449
12503 -13449 16623 28492 23993 3075 21087 12002 3703 24430 15410 24836 18231 17083 8135
12490 8135 4542 10150 13594 15277 1960 7790 28384 8723 12859 8105 4537 6372 3238 8835
12476 8835 -1991 6038 -22395 -50844 -30136 -29377 -38896 -61362 -42073 -13324 -36629 -35015 -2542
12463 -2542 45284 56300 75568 155898 257710 359046 483026 604887 658869 548259 383493
12452 383493 268948 194832 142334 121580 103148 70981 79710 69718 42633 23217 31044 57548
12440 57548 84305 78093 56465 55541 34040 22429 39061 38623 24671 45657 44994 57915 57345
12427 57345 36060 18472 12715 34591 36259 34186 39159 48094 62932 77160 93651 86435 74566
$$ packed form
12516I268Q102K2402M252l6332j0989n35J7777J1803k2274N187m394p335j0381
12503a3449L0072J1869m499k0918J8012r085q299K0727r020R426o605j148q948
12490H135l593N608L444J683j3317N830K0594j9661M136m754l568J835l134N597
12476H835j0826Q029k8433k8449K0708P59r519k2466J9289K8749k3305J614L2473
12463b542M7826J1016J9268Q0330J01812J01336J23980J21861N3982j10610j64766
12452C83493j14545p4116n2498k0754j8432l2167Q729r992k7085j9416P827K6504
12440E7548K6757o212k1628r24k1501j1611J6632m38j3952K0986o63J2921n70
12427E7345k1285j7588n757K1876J668k073M973Q935J4838J4228J6491p216j1869
$$ plain form
12414 74566 78738 84022 92080 108873 128848 133119 162516 145457 118298 117984 109006 131189 141250
12401 141250 100219 99989 104461 102963 85795 123966 166487 175061 168014 159579 193953 219647 238108
12388 238108 228232 214677 209977 226010 212302 220318 232193 192940 188061 160163 145431 127518
12376 127518 110364 122603 120989 135056 142343 142095 139337 175489 194030 170552 155709 155361 151164
12363 151164 154421 130248 131352 126501 127286 128517 113915 120734 136538 143506 136199 121634 119057
12350 119057 98317 86776 88895 99903 83624 103792 109012 88497 80807 85212 79560 89230 77562
12337 77562 85614 100433 125402 152817 178963 184954 185281 160799 164351 175139 160754 168470 187251
12324 187251 207504 190121 171850 170796 145743 152332 174131 190774 191614 152705 159217 206051
$$ packed form
12414G4566M172N284Q058J6793J9975M271K9397j7059k7159l14q978K2183J0061
12401A41250m1031k30M472j498j7168L8171M2521Q574p047q435L4374K5694J8461
12388B38108r876j3555m700J6033j3708Q016J1875l9253m879k7898j4732j7913
12376A27518j7154J2239j614J4067P287k48k758L6152J8541k3478j4843l48m197
12363A51164L257k4173J104m851P85J231j4602O819J5804O968p307j4565k577
12350A19057k0740j1541K119J1008j6279K0168N220k0515p690M405n652R670j1668
12337G7562Q052J4819K4969K7415K6146N991L27k4482L552J0788j4385P716J8781
12324A87251K0253j7383j8271j054k5053O589K1799J6643Q40l8909O512M6834
$$ plain form
12312 206051 206905 201587 209046 219913 205187 199699 224706 263340 286170 277368 250826 243036 252608
12299 252608 271746 275166 256876 234704 209103 197285 181954 184190 193699 166737 149230 156555
12287 156555 183461 180812 172541 174204 191618 185741 194598 185235 172051 191753 202642 191871 175378
12274 175378 182183 183689 180691 153418 113261 102329 93891 104820 119608 131712 106092 97954
12262 97954 90367 92651 84474 77171 96111 115046 107325 101461 101262 100459 92345 84922 81310 78201
12248 78201 96363 79239 70881 103698 97850 83166 80860 75773 79478 73229 61036 64422 58088
12235 58088 25907 14067 31143 43834 44364 63352 60117 37028 25493 34364 45533 45860 34224
12222 34224 33035 49853 72001 84172 93104 82523 81576 55754 50154 48149 55529 91556 109603
$$ packed form
12312B06051Q54n318P459J0867j4726n488K5007L8634K2830q802k6542p790R572
12299B52608J9138L420j8290k2172k5601j1818j5331K236R509k6962j7507P325
12287A56555K6906k649q271J663J7414n877Q857r363j3184J9702J0889j0771j6493
12274A75378O805J506k998k7273m0157j0932q438J0929J4788J2104k5620q138
12262I7954p587K284q177p303J8940J8935p721n864j99q03q114p423l612l109
12248G8201J8162j7124q358L2817n848j4684k306n087L705o249j2193L386o334
12235E8088l2181j1840J7076J2691N30J8988l235k3089j1535Q871J1169L27j1636
12222C4224j189J6818K2148J2171Q932j0581r47k5822n600k005P380L6027J8047
$$ plain form
12209 109603 78257 54530 35388 35237 44798 52897 38831 44285 39762 20680 13146 16265 26138
12196 26138 20420 23230 62643 62737 44804 34024 8383 8282 933 16915 25334 54721 66347
12183 66347 27079 -290 23172 35228 14140 23715 34892 14202 9141 12454 -13023 -10613
12171 -10613 879 20978 52162 54546 66043 67722 31815 6354 32270 52519 47423 38982
12159 38982 25388 15561 34252 11072 -21953 -45931 -45577 -24772 -699 10000 5444 13392 6576
12146 6576 2547 20148 24816 61121 71704 22173 -7102 -6719 18545 36682 52614 51117 35666
12133 35666 35036 49107 50586 72931 76912 79876 86508 78245 62330 50130 34297 25572 11793
12120 11793 17327 23695 35904 30976 363 -9277 12921 -8998 -20417 -25587 6834 -59 -8938
$$ packed form
12209A09603l1346k3727j9142j51R561Q099j4066N454m523j9082p534L119R873
12196B6138n718K810L9413R4j7933j0780k5641j01p349J5982Q419K9387J1626
12183F6347l9268k7369K3462J2056k1088R575J1177k0690n061L313k5477K410
12171a0613J1492K0099L1184K384J1497J679l5907k5461K5916K0249n096q441
12159C8982j3594r827J8691k3180l3025k3978L54K0805K4073J0699m556P948o816
12146F576m029J7601M668L6305J0583m9531k9275L83K5264J8137J5932j497j5451
12133C5666o30J4071J479K2345L981K964O632q263j5915j2200j5833q725j3779
12120A1793N534O368J2209m928l0613r640K2198k1919j1419n170L2421o893q879
$$ plain form
12107 -8938 -6015 5913 38672 47737 45944 50732 53080 82024 78529 56203 34082 21553 -11517
12094 -11517 -10886 21182 16949 12257 -2949 4085 20446 37204 64174 52051 37630 35860 42512
12081 42512 56478 55216 50427 21221 28452 10759 -32156 -25820 -1896 -955 -22105 -13555 18442
12068 18442 41703 32959 38551 75316 110102 97367 96304 111781 118962 101865 59881 18069
12056 18069 9320 9362 2806 -2615 4482 5308 -13941 -18830 -13804 4405 7289 14495 18069 10224 -7875
12041 -7875 18806 8633 -6235 2178 1753 -18835 -14217 9643 29919 39864 41410 29047 3286
12028 3286 -88 20266 27433 46594 53291 78472 115105 113080 68824 40835 27371 38003 31337
12015 31337 41583 41445 24166 25015 26189 36203 25353 13841 -10138 -83 26737 32489 27113
$$ packed form
12107h938K923J1928L2759R065j793M788K348K8944l495k2326k2121j2529l3070
12094a1517O31L2068m233m692j5206P034J6361J6758K6970j2123j4421j770O652
12081D2512J3966j262m789k9206P231j7693m2915O336K3924R41k1150Q550L1997
12068A8442K3261q744N592L6765L4786j2735j063J5477P181j7097m1984m1812
12056A8069q749M2o556n421P097Q26j9249m889N026J8209K884P206L574p845j8099
12041g875K6681j0173j4868Q413m25k0588M618K3860K0276R945J546j2363k5761
12028C286l374K0354P167J9161O697K5181L6633k025m4256k7989j3464J0632o666
12015C1337J0246j38j7279Q49J174J0014j0850j1512k3979J0055K6820N752n376
$$ plain form
12002 27113 50537 48558 12249 -10967 25088 31302 38349 81694 76874 59119 61127 60243 48513
11989 48513 36262 41624 61994 64251 41572 24244 15161 15476 14736 23891 21502 10343 8571 -6081
11975 -6081 11857 36597 32854 6512 -18379 -19301 21546 39401 18732 11624 17483 55150 88653
11962 88653 91097 87090 64625 71537 72196 58429 44416 12610 13823 32286 28848 30144 36643
11949 36643 34305 34672 32969 51368 60362 66512 88254 95005 58207 66235 69652 57041 27037
11936 27037 -5353 13971 7272 7291 16972 16466 9171 14167 3578 -6515 10400 366 -27121
11923 -27121 14961 21766 67497 65847 59907 45936 36555 24209 15004 32915 70598 85450 59219
11910 59219 37716 29726 54093 46725 45171 37335 29510 34319 49992 43447 41941 41857 37266 60495
$$ packed form
12002B7113K3424j979l6309k3216L6055O214P047M3345m820j7755K008q84j1730
11989D8513j2251N362K0370K257k2679j7328r083L15p40R155k389j1159j772j4652
11975f081J7938K4740l743k6342k4891r22M0847J7855k0669p108N859L7667L3503
11962H8653K444m007k2465O912O59j3767j4013l1806J213J8463l438J296O499
11949C6643k338L67j703J8399Q994O150K1742O751l6798Q028L417j2611l0004
11936B7037l2390J9324o699J9R681n06p295M996j0589j0093J6915j0034k7487
11923b7121M2082O805M5731j650n940j3971r381j2346r205J7911L7683J4852k6231
11910E9219k1503p990K4367p368j554p836p825M809J5673o545j506q4m591K3229
$$ plain form
11896 60495 92230 86441 79675 96434 66583 25708 6780 28457 42188 49034 47170 54535 59885
11883 59885 59475 67859 78228 57973 54706 35990 34334 45770 34786 21038 15082 18186 29195
11870 29195 5652 -2161 31703 82054 99017 57574 50228 71635 84564 68900 40958 48008
11858 48008 35792 59279 85001 110613 130393 168882 190714 201422 210963 195757 170691 148034
11846 148034 117711 105903 107139 119522 109702 80114 74520 74874 80869 78706 86467 102553 111921
11833 111921 128629 180615 188081 161351 132314 114696 111482 91363 64986 58972 88389 88956
11821 88956 69979 78647 84369 75730 66117 41790 43859 60494 58266 48393 51248 52617 71974
11808 71974 83883 84516 66142 36883 34454 57025 69832 62665 49924 82189 108579 94413
$$ packed form
11896F0495L1735n789o766J6759k9851m0875j8928K1677J3731O846j864P365N350
11883E9885m10Q384J0369k0255l267j8716j656J1436j0984j3748n956L104J1009
11870B9195k3543p813L3864N0351J6963m1443p346K1407J2929j5664k7942P050
11858D8008j2216K3487K5722K5612J9780L8489K1832J0708R541j5206k5066k2657
11846A48034l0323j1808J236J2383r820k9588n594L54N995k163P761J6086R368
11833A11921J6708N1986P466k6730k9037j7618l214k0119k6377o014K9417N67
11821H8956j8977Q668N722q639r613k4327K069J6635k228r873K855J369J9357
11808G1974J1909O33j8374k9259k429K2571J2807p167j2741L2265K6390j4166
$$ plain form
11796 94413 82982 66250 47932 32578 39336 74630 115332 96448 69836 89026 108850 128062
11784 128062 165018 176371 187169 195445 222230 245475 251131 244621 235903 205371 172991 142804
11772 142804 130866 151906 174759 176562 180325 201929 221498 216052 194014 178507 219845 219055
11760 219055 227448 263886 287812 280284 259426 232472 217338 202343 177177 177863 189278 211560
11748 211560 241118 231503 197099 181923 169382 159961 143435 151917 120495 101537 113311 131240
11736 131240 130973 118099 102916 111559 132982 120745 84268 86666 105082 119994 106533 78986
11724 78986 114942 145444 144592 127938 121085 126041 124656 113482 136511 144691 139006 114611 98703
11711 98703 105309 109449 81626 70066 87431 114563 141362 144659 148447 119914 73039 66331 82422
$$ packed form
11796I4413j1431j6732j8318j5354O758L5294M0702j8884k6612J9190J9824J9212
11784A28062L6956J1353J0798Q276K6785K3245N656o510q718l0532l2380l0187
11772A42804j1938K1040K2853J803L763K1604J9569n446k2038j5507M1338p90
11760B19055Q393L6438K3926p528k0858k6954j5134j4995k5166O86J1415K2282
11748B11560K9558r615l4404j5176j2541r421j6526Q482l1422j8958J1774J7929
11736A31240k67j2874j5183Q643K1423j2237l6477K398J8416J4912j3461k7547
11724G8986L5956L0502q52j6654o853M956j385j1174K3029Q180n685k4395j5908
11711I8703O606M140k7823j1560J7365K7132K6799L297L788k8533m6875o708J6091
$$ plain form
11698 82422 106732 140153 153584 193352 217149 192517 206387 213317 195450 146378 149127 145139
11686 145139 151519 171806 168720 153329 167480 203257 172383 136338 167968 241909 250239 230589
11674 230589 210542 187744 188580 192847 186360 156057 127653 126920 104254 84182 116273 139684 132107
11661 132107 123668 120280 115659 128560 141756 147436 136310 116867 104631 64562 57620 86796
11649 86796 109697 98126 98934 73763 74166 99333 91960 78451 94636 78143 62971 52691 50245
11636 50245 54563 72282 63997 54031 47069 28203 24910 16693 34826 45615 65553 70480 31707
11623 31707 42520 38876 27693 48634 65027 77560 66778 54980 56189 75320 71439 58094
11611 58094 75878 105357 126670 108685 98210 93404 89319 90660 92675 79704 70916 67649 84185
$$ packed form
11698H2422K4310L3421J3431L9768K3797k4632J3870O930j7867m9072K749l988
11686A45139O380K0287l086j5391J4151L5777l0874l6045L1630P3941Q330j9650
11674B30589k0047k2798Q36M267o487l0303k8404p33k2666k0072L2091K3411p577
11661A32107q439l388m621J2901J3196N680j1126j9443j2236m0069o942K9176
11649H6796K2901j1571Q08k5171M03K5167p373j3509J6185j6493j5172j0280k446
11636E0245M318J7719q285r966o962j8866l293q217J8133J0789J9938M927l8773
11623C1707J0813l644j1183K0941J6393J2533j0782j1798J209J9131l881j3345
11611E8094J7784K9479K1313j7985j0475m806m085J341K015j2971q788l267J6536
$$ plain form
11598 84185 57145 58688 56973 76005 135070 132272 125203 112419 104168 119240 139404 128950 130270
11585 130270 123312 120379 101122 116115 141545 151362 123015 99796 115503 131438 144779 133628
11573 133628 147005 158112 129768 132734 132800 119246 95373 106331 120124 108455 99719 117086
11561 117086 147082 154646 129619 124798 119909 97348 106068 115947 93518 89375 106171 132168 118142
11548 118142 92823 82924 92087 104053 105120 119547 128095 109895 94208 121222 150068 170553
11536 170553 162760 150073 148430 166979 155033 104727 93056 116870 126938 116924 121560 142006
11524 142006 146318 131870 113506 105227 134398 155236 163944 164789 191227 224403 220350 205244 204017
11511 204017 199087 206704 190416 183421 200060 246574 273080 277709 328081 361363 339235 317701
$$ packed form
11598H4185k7040J543j715J9032N9065k798p069j2784q251J5072K0164j0454J320
11585A30270o958k933j9257J4993K5430R817k8347k3219J5707J5935J3341j1151
11573A33628J3377J1107k8344K966O6j3554k3873J0958J3793j1669q736J7367
11561A17086K9996P564k5027m821m889k2561Q720R879k2429m143J6796K5997j4026
11548A18142k5319r899R163J1966J067J4427Q548j8200j5687K7014K8846K0485
11536A70553p793j2687j643J8549j1946n0306j1671K3814J0068j0014M636K0446
11524A42006M312j4448j8364q279K9171K0838Q708Q45K6438L3176m053j5106j227
11511B04017m930P617j6288o995J6639M6514K6506M629N0372L3282k2128k1534
$$ plain form
11499 317701 304778 313142 303619 292344 292761 304824 281044 289902 292216 294820 305400 314139 297628
11486 297628 303876 312554 332965 355370 344774 333620 322526 347543 379154 385981 394195 374970
11474 374970 394351 410877 418668 432537 439551 444209 489779 499071 467822 486360 520156 530071
11462 530071 513974 514519 521314 558136 601219 589833 594283 616500 637939 664788 693152 749247
11450 749247 823585 868979 903660 954341 1026723 1119034 1205594 1343627 1482966 1673716 1890274
11439 1890274 2144876 2533394 3023641 3648933 4397789 5333129 6463286 7785781 9449946
11430 9449946 11554996 14226832 17383252 20584846 22993350 23902407 23178536 21355527
11422 21355527 19147100 16977853 15063546 13465261 12260526 11426326 11032651 11100025 11635555
$$ packed form
11499C17701j2923Q364r523j1275M17J2063k3780Q858K314K604J0580Q739j6511
11486B97628O248Q678K0411K2405j0596j1154j1094K5017L1611O827Q214j9225
11474C74970J9381J6526P791J3869P014M658M5570R292l1249J8538L3796R915
11462E30071j6097N45O795L6822M3083j1386M450K2217K1439K6849K8364N6095
11450G49247P4338M5394L4681N0681P2382R2311Q6560J38033J39339J90750K16558
11439A890274K54602L88518M90247O25292P48856R35340J130157J322495J664165
11430I449946K105050K671836L156420L201594K408504R09057p23871j823009
11422B1355527k208427k169247j914307j598285j204735q34200l93675O7374N35530
$$ plain form
11413 11635555 12667539 14191440 16153132 18445123 20876426 23121462 24708034 25173370
11405 25173370 24279947 22286411 19859958 17551441 15566732 13844431 12288917 10864282
11397 10864282 9590029 8497712 7544003 6715028 6080262 5590487 5167255 4837730 4598501
11388 4598501 4403131 4268353 4159096 4117241 4115193 4145405 4225743 4334090 4431376 4531127 4632534
11377 4632534 4771993 4906847 5023906 5165868 5321506 5465128 5594603 5713046 5878056
11368 5878056 6055872 6289434 6630239 7153229 7892690 8805067 9957934 11331779 12908656
11359 12908656 14799514 17146168 20029481 23371068 26681165 29224483 30431952 30313691
11351 30313691 29469913 28477717 27594044 26850450 26351581 26416409 27403171 29427771 32207976
$$ packed form
11413A1635555J031984J523901J961692K291991K431303K245036J586572M65336
11405B5173370q93423j993536k426453k308517j984709j722301j555514j424635
11397A0864282j274253j092317r53709q28975o34766m89775m23232l29525k39229
11388D598501j95370j34778j09257m1855k048L0212Q0338J08347R7286R9751J01407
11377D632534J39459J34854J17059J41962J55638J43622J29475J18443J65010
11368E878056J77816K33562L40805N22990P39461R12377J152867J373845J576877
11359A2908656J890858K346654K883313L341587L310097K543318J207469j18261
11351C0313691q43778r92196q83673p43594m98869O4828R86762K024600K780205
$$ plain form
11342 32207976 35069915 37240481 38296852 38591907 38746105 39247240 40026661 40557622 40083028
11333 40083028 38172295 35170229 32029140 29549282 28035208 27415457 27389711 27741222 28297122
11324 28297122 28882913 29350861 29271743 28248581 26228836 23597504 20890310 18457462 16427251
11315 16427251 14744927 13303105 12066532 11049238 10236973 9578230 9079744 8720114 8438549
11306 8438549 8208911 8013440 7898580 7848289 7822703 7859176 7873198 7855064 7814632 7768468 7691953
11295 7691953 7622326 7608858 7606976 7642644 7722249 7843820 7946719 8081804 8258098 8407957
11285 8407957 8573986 8814279 9084821 9452565 9929162 10556341 11342607 12308327 13444908
11276 13444908 14699851 16110426 17754068 19755068 22238183 24972907 27307924 28480671
$$ packed form
11342C2207976K861939K170566J056371K95055J54198N01135P79421N30961m74594
11333D0083028j910733l002066l141089k479858j514074o19751k5746L51511N55900
11324B8297122N85791M67948p9118j023162k019745k631332k707194k432848k030211
11315A6427251j682324j441822j236573j017294q12265o58743m98486l59630k81565
11306H438549k29638j95471j14860n0291k5586L6473J4022j8134m0432m6164p6515
11295G691953o9627j3468j882L5668P9605J21571J02899J35085J76294J49859
11285H407957J66029K40293K70542L67744M76597O27179P86266R65720J136581
11276A3444908J254943J410575J643642K001000K483115K734724K335017J172747
$$ plain form
11268 28480671 28108790 26449829 24164162 21753191 19429670 17376964 15726429 14558207
11260 14558207 13915649 13778343 14134917 14924738 16152721 17807152 19822574 22077349 24377713
11251 24377713 26297122 27188260 26533104 24295219 21215028 18139003 15576211 13577902
11243 13577902 12009294 10705691 9639736 8702459 7859301 7166855 6577938 6060666 5644424
11234 5644424 5271473 4986568 4772400 4592609 4467605 4365393 4293076 4241175 4167148 4161610
11224 4161610 4199533 4205334 4226929 4246750 4266708 4298970 4351574 4395312 4428800 4407859 4319119
11213 4319119 4201568 4062259 3949475 3853013 3755019 3663099 3605365 3588567 3564504 3576614 3606986
11202 3606986 3650408 3680741 3700731 3703836 3711168 3718362 3676634 3570304 3407831 3227364 3067056
$$ packed form
11268B8480671l71881j658961k285667k410971k323521k052706j650535j168222
11260A4558207o42558j37306L56574P89821J227983J654431K015422K254775K300364
11251B4377713J919409Q91138o55156k237885l080191l076025k562792j998309
11243A3577902j568608j303603j065955r37277q43158o92446n88917n17272m16242
11234E644424l72951k84905k14168j79791j25004j02212p2317n1901p4027n538
11224D161610L7923N801K1595J9821J9958L2262N2604M3738L3488k0941q8740
11213D319119j17551j39309j12784r6462r7994r1920n7734j6798k4063J2110L0372
11202C606986M3422L0333J9990L105P332P194m1728j06330j62473j80467j60308
$$ plain form
11191 3067056 2916386 2759134 2617310 2476934 2338811 2247680 2169576 2062911 1935517 1862919
11181 1862919 1826403 1760430 1722350 1659615 1613901 1574208 1519922 1462659 1428464 1395794 1364398
11170 1364398 1356890 1357866 1346169 1318889 1277346 1239942 1215455 1194909 1199396 1225544 1248855 1225259
11158 1225259 1213737 1195085 1210347 1178343 1105083 1090653 1072372 1024198 979218 951915 934077
11147 934077 962727 941289 919199 899781 885359 852821 806329 776561 788530 767144 718693
11136 718693 690926 677672 640705 622185 624030 616876 628876 620737 583952 568718 556724 518908
11124 518908 489801 505539 506378 477774 460974 445953 440179 412137 406927 439897 458000 439468
11112 439468 415841 401101 358622 332275 344475 361630 352293 377716 410158 456454 470418 466801
$$ packed form
11191C067056j50670j57252j41824j40376j38123r1131p8104j06665j27394p2598
11181A862919l6516o5973l8080o2735m5714l9693n4286n7263l4195l2670l1396
11170A364398p508R76j1697k7280m1543l7404k4487k0546M487K6148K3311k3596
11158A225259j1522j8652J5262l2004p3260j4430j8281m8174m4980k7303j7838
11147I34077K8650k1438k2090j9418j4422l2538m6492k9768J1969k1386m8451
11136G18693k7767j3254l6967j8520J845p154J2000q139l6785j5234j1994l7816
11124E18908k9107J5738Q39k8604j6800j5021n774k8042n210L2970J8103j8532
11112D39468k3627j4740m2479k6347J2200J7155r337K5423L2442M6296J3964l617
$$ plain form
11100 466801 481350 487888 496710 497643 490622 479544 459481 462329 450792 478379 506691 499078 483882
11087 483882 509509 530793 553184 531391 500313 501536 505832 516267 531081 524551 531948 565688
11075 565688 574481 569591 567272 576050 580189 589537 599447 578934 539268 515811 493312 460419 434891
11062 434891 452611 480953 503487 521837 494173 475023 466137 454699 447948 418967 388854 361000
11050 361000 341731 366102 362933 341940 321315 328122 347738 326997 306726 287103 275593 261093
11038 261093 273575 289412 320518 358862 391593 418904 408745 412020 402063 371290 365295 334271
11026 334271 278408 248693 243945 233075 229011 244413 248605 269682 278862 278021 266160 272201 294905
11013 294905 301748 292951 281233 300053 319597 326861 342466 338582 356055 379577 371566 373582 381062
$$ packed form
11100D66801J4549O538Q822R33p021j1078k0063K848j1537K7587K8312p613j5196
11087D83882K5627K1284K2391k1793l1078J223M296J0435J4814o530P397L3740
11075E65688Q793m890k319Q778M139R348R910k0513l9666k3457k2499l2893k5528
11062D34891J7720K8342K2534J8350k7664j9150q886j1438o751k8981l0113k7854
11050C61000j9269K4371l169k0993k0625O807J9616k0741k0271j9623j1510j4500
11038B61093J2482J5837L1106L8344L2731K7311j0159L275r957l0773n995l1024
11026C34271n5863k9715m748j0870m064J5402M192K1077R180q41j1861O041K2704
11013B94905O843q797j1718J8820J9544P264J5605l884J7473K3522q011K016P480
$$ plain form
11000 381062 359773 337611 309437 353087 391863 427801 453457 427511 421616 439925 420129 399999
10988 399999 374078 360555 384278 382559 388418 410247 376222 360470 348058 338289 310239 304227
10976 304227 346761 399294 402537 368297 344717 344537 313872 285835 269650 263926 267138 278042
10964 278042 290417 288997 276223 277013 246791 219239 213475 193559 177129 158323 144129 138649
10952 138649 143470 185102 215577 222206 210183 212364 194426 202779 205825 197264 200495 179622 166167
10939 166167 179537 189005 175436 149298 148510 161406 192825 178192 141329 140614 134977 145707 181438
10926 181438 209683 224223 247160 261281 275625 292631 307646 309249 281794 259038 244805 243353
10914 243353 230166 247926 266640 306094 318920 308675 293225 282511 296810 292420 293564 307106
$$ packed form
11000C81062k1289k2162k8174M3650L8776L5938K5656k5946n895J8309j9796k0130
10988C99999k5921j3523K3723j719N859K1829l4025j5752j2412r769k8050o012
10976C04227M2534N2533L243l4240k3580j80l0665k8037j6185n724L212J0904
10964B78042J2375j420j2774P90l0222k7552n764j9916j6430j8806j4194n480
10952A38649M821M1632L0475O629j2023K181j7938Q353L046q561L231k0873j3455
10939A66167J3370R468j3569k6138p88J2896L1419j4633l6863p15n637J0730L5731
10926A81438K8245J4540K2937J4121J4344J7006J5015J603k7455k2756j4233j452
10914B43353j3187J7760J8714L9454J2826j0245j5450j0714J4299m390J144J3542
$$ plain form
10902 307106 311958 305608 298321 289408 259958 242828 229248 229042 235504 247516 277293 294686 279268
10889 279268 261988 253276 223388 214939 193748 195728 192044 173680 160190 184550 175391 146704
10877 146704 124453 145443 174569 202553 185280 144727 142719 162205 154802 139848 131802 106286
10865 106286 96607 92763 110062 121277 117277 114571 135959 169086 187167 195561 183935 158031
10853 158031 131586 154560 188515 181502 150309 132841 115833 128710 128646 151039 163873 184600
10841 184600 217270 231152 249846 270795 274101 272189 271766 263148 280129 276294 223750 183376 195089
10828 195089 218801 222937 210219 222994 281458 343378 399030 440517 488442 526013 558209 542893
10816 542893 514386 483726 448369 398733 346652 303725 252897 234828 237437 280119 261860 244202
$$ packed form
10902C07106M852o350p287q913k9450j7130j3580k06O462J2012K9777J7393j5418
10889B79268j7280q712k9888q449k1191J980l684j8364j3490K4360r159k8687
10877A46704k2251K0990K9126K7984j7273m0553k008J9486p403j4954q046k5516
10865A06286r679l844J7299J1215m000k706K1388L3127J8081Q394j1626k5904
10853A58031k6445K2974L3955p013l1193j7468j7008J2877o4K2393J2834K0727
10841A84600L2670J3882J8694K0949L306j912m23q618J6981l835n2544m0374J1713
10828A95089K3712M136j2718J2775N8464O1920N5652M1487M7925L7571L2196j5316
10816E42893k8507l0660l5357m9636n2081m2927n0828j8069K609M2682j8259j7658
$$ plain form
10804 244202 243788 281423 301641 286431 258853 237115 238484 245855 270164 283015 282939 304856 336169
10791 336169 331365 322744 304133 256153 232449 238532 255726 275358 259209 242947 245152 273264
10779 273264 306006 276948 246637 258775 267083 242732 256333 279379 308204 313051 284966 248126
10767 248126 239101 238225 252766 280123 301238 317192 340819 374586 385727 393385 377039 392048
10755 392048 422998 414673 392286 394828 399186 402304 406618 405917 444117 472441 515388 541033 592991
10742 592991 662385 720784 802755 863373 959521 1108192 1307948 1612076 2027836 2526064
10732 2526064 3055439 3690619 4491921 5403022 6192357 6725894 6959790 6847805 6354811
10723 6354811 5585246 4746635 4006761 3450346 3038610 2764323 2574655 2453803 2419317 2418720
$$ packed form
10804B44202m14L7635K0218j5210k7578k1738J369P371K4309J2851p6K1917L1313
10791C36169m804q621j8611m7980k3704O083J7194J9632j6149j6262K205K8112
10779B73264L2742k9058l0311J2138Q308k4351J3601K3046K8825M847k8085l6840
10767B48126r025q76J4541K7357K1115J5954K3627L3767J1141P658j6346J5009
10755C92048L0950q325k2387K542M358L118M314p01L8200K8324M2947K5645N1958
10742E92991O9394N8399Q1971O0618R6148J48671J99756L04128M15760M98228
10732B526064N29375O35180Q01302R11101P89335N33537K33896j11985m92994
10723F354811p69565q38611p39874n56415m11736k74287j89668j20852l4486n97
$$ plain form
10713 2418720 2457717 2541024 2676430 2873623 3140056 3541746 4156718 5057622 6257136 7767619
10703 7767619 9442549 10940522 11912520 12107798 11487485 10263031 8752091 7275132 6063886
10694 6063886 5130927 4433782 3948674 3606937 3390853 3233196 3123057 3025967 2996779 3022095
10684 3022095 3135001 3296891 3603656 4060615 4700548 5526966 6452810 7344178 7989819
10675 7989819 8240474 7995739 7396855 6604377 5787132 5140214 4668380 4365180 4245609
10666 4245609 4237236 4383959 4687799 5192656 5933370 7013863 8474379 10249735 12094342
10657 12094342 13602401 14343592 14137898 13136143 11741143 10254410 8966587 7982913
10649 7982913 7317040 6832334 6465886 6230907 6099682 6027500 6037119 6124635 6337735 6710880
$$ packed form
10713B418720L8997Q3307J35406J97193K66433M01690O14972R00904J199514J510483
10703G767619J674930J497973R71998J95278o20313j224454j510940j476959j211246
10694F063886r32959o97145m85108l41737k16084j57657j10139r7090k9188K5316
10684C022095J12906J61890L06765M56959O39933Q26418R25844Q91368O45641
10675G989819K50655k44735n98884p92478q17245o46918m71834l03200j19571
10666D245609q373J46723L03840N04857P40714J080493J460516J775356J844607
10657A2094342J508059P41191k05694j001755j395000j486733j287823r83674
10649G982913o65873m84706l66448k34979j31225p2182R619Q7516K13100L73145
$$ plain form
10639 6710880 7300885 8280032 9754424 11930939 14949590 18643675 22482028 25691838
10631 25691838 27461189 27253415 25173793 21923174 18360942 15130358 12592484 10731911
10623 10731911 9387897 8443320 7754237 7225879 6874418 6608876 6461686 6423377 6517281
10614 6517281 6743594 7168118 7845137 8804038 10121685 11779244 13608785 15256045 16291726
10605 16291726 16411426 15603360 14107608 12363226 10693683 9277921 8166349 7323804
10597 7323804 6722194 6309752 6035411 5947103 6052449 6404977 6994468 7848120 8905832
10588 8905832 9982649 10796554 11094190 10808065 10051561 9102059 8197287 7471804 6964944
10579 6964944 6596193 6327202 6122029 5915677 5740812 5610090 5495543 5467651 5558897 5740749
$$ packed form
10639F710880N90005R79147J474392K176515L018651L694085L838353L209810
10631B5691838J769351k07774k079622l250619l562232l230584k537874j860573
10623A0731911j344014r44577o89083n28358l51461k65542j47190l8309R3904
10614F517281K26313M24524O77019R58901J317647J657559J829541J647260J035681
10605A6291726J19700q08066j495752j744382j669543j415762j111572q42545
10597G323804o01610m12442k74341q8308J05346L52528N89491Q53652J057712
10588H905832J076817Q13905K97636k86125p56504r49502r04772p25483n06860
10579F964944l68751k68991k05173k06352j74865j30722j14547k7892R1246J81852
$$ plain form
10569 5740749 6057302 6638702 7547665 8893030 10700874 12827395 14972349 16648514 17355826
10560 17355826 16896713 15444857 13465311 11446330 9702272 8372713 7404727 6705182
10552 6705182 6186880 5781961 5474941 5214887 5011581 4888939 4808609 4806585 4879644 5074185
10542 5074185 5443920 6030214 6827445 7799380 8817494 9640367 10046339 9880999 9242752
10533 9242752 8315242 7269019 6260981 5429632 4832266 4390261 4078898 3838859 3608564
10524 3608564 3389846 3163337 2937856 2764296 2648128 2532482 2464374 2458196 2475946 2490000
10514 2490000 2544453 2620379 2714283 2797590 2842679 2880457 2881433 2808696 2715510 2592606 2442747
10503 2442747 2319397 2221032 2142232 2045911 1986171 1928061 1886570 1834234 1796759 1755838 1742301
$$ packed form
10569E740749L16553N81400R08963J345365J807844K126521K144954J676165P07312
10560A7355826m59113j451856j979546k018981j744058j329559r67986o99545
10552F705182n18302m04919l07020k60054k03306j22642q0330k024P3059J94541
10542E074185L69735N86294P97231R71935J018114Q22873M05972j65340o38247
10533I242752r27510j046223j008038q31349n97366m42005l11363k40039k30295
10524C608564k18718k26509k25481j73560j16168j15646o8108o178J7750J4054
10514B490000N4453P5926R3904Q3307M5089L7778R76p2737r3186j22904j49859
10503B442747j23350r8365p8800r6321n9740n8110m1491n2336l7475m0921j3537
$$ plain form
10492 1742301 1725760 1688722 1692102 1695638 1707561 1718044 1724819 1752682 1734365 1691970 1683194 1639333
10480 1639333 1569843 1528387 1484740 1440023 1401531 1349090 1333771 1306988 1267425 1222669 1181812
10469 1181812 1164159 1163700 1123556 1098010 1099577 1104949 1106716 1122188 1154211 1168880 1172678 1168610 1162692
10456 1162692 1168378 1195139 1186126 1143705 1091827 1050671 977695 875440 840283 822867 824528 825080
10444 825080 836835 868550 868111 842198 858254 841760 820890 791569 797407 797370 786769 739908 726625
10431 726625 731878 758391 796556 806568 801389 776108 757538 757151 743975 759077 761490 763678 787508
10418 787508 843110 863132 875087 904089 909441 945171 979460 1006345 1055904 1107377 1144873 1178167
10406 1178167 1186649 1226727 1265120 1327555 1413723 1467855 1471914 1459551 1467462 1473838 1436025 1437243
$$ packed form
10492A742301j6541l7038L380L536J1923J0483O775K7863j8317m2395q776m3861
10480A639333o9490m1456m3647m4717l8492n2441j5319k6783l9563m4756m0857
10469A181812j7653m59m0144k5546J567N372J767J5472L2023J4669L798m068n918
10456A162692N686K6761r013m2421n1878m1156p2976j02255l5157j7416J661N52
10444H25080J1755L1715m39k5913J6056j6494k0870k9321N838l7j0601m6861j3283
10431G26625N253K6513L8165J0012n179k5281j8570l87j3176J5102K413K188K3830
10418G87508N5602K0022J1955K9002N352L5730L4289K6885M9559N1473L7496L3294
10406A178167Q482M0078L8393O2435Q6168N4132M059j2363P911O376l7813J218
$$ plain form
10394 1437243 1411814 1391943 1430023 1457290 1445634 1430579 1435675 1433962 1499663 1539758 1552840 1581034
10382 1581034 1636799 1661001 1670112 1674379 1693508 1713117 1746095 1744912 1784124 1817624 1837912 1818192
10370 1818192 1823522 1849547 1861199 1872822 1911502 1949406 2021488 2110674 2215313 2368448 2532344
10359 2532344 2733613 2986168 3225458 3530332 3944937 4453878 5046636 5690974 6391203
10350 6391203 7177307 8092881 9008219 9851584 10715995 11794856 13130022 14750029 16787852
10341 16787852 19423351 23021151 28198696 35978719 47885587 66901993 97337378 139267586
10333 139267586 183077229 218773201 247235073 281473476 312116138 314447855 284418774
10326 284418774 251121863 226566262 196336476 153181292 112771889 85636447 68464587
$$ packed form
10394A437243k5429j9871L8080K7267j1656j5055N096j713O5701M0095J3082K8194
10382A581034N5765K4202R111M267J9129J9609L2978j183L9212L3500K0288j9720
10370A818192N330K6025J1652J1623L8680L7904P2082Q9186J04639J53135J63896
10359B532344K01269K52555K39290L04874M14605N08941N92758O44338P00229
10350F391203P86104R15574R15338Q43365Q64411J078861J335166J620007K037823
10341A6787852K635499L597800N177545P780023J1906868J9016406L0435385M1930208
10333A39267586M3809643L5695972K8461872L4238403L0642662K331717l0029081
10326B84418774l3296911k4555601l0229786m3155184m0409403k7135442j7171860
$$ plain form
10319 68464587 57042927 48973387 42943198 38319640 34654558 31634581 29080146 26957980
10311 26957980 25129507 23497606 22165124 21039701 19922249 18828797 17898046 17059889
10303 17059889 16285726 15530498 14872238 14337789 13935985 13627789 13398099 13221345 13087462
10294 13087462 13025900 13045136 13160882 13377539 13697127 14119857 14719663 15481765 16351672 17318015
10284 17318015 18436510 19741325 21310064 23148908 25026684 26616057 27902223 29078333
10276 29078333 30031257 30091132 29165263 27902358 26603337 24965075 22988950 21014339 19229607
10267 19229607 17722204 16419832 15316799 14351804 13452320 12679629 11993970 11378058 10821948
10258 10821948 10333334 9881768 9470055 9064709 8674469 8321148 7999415 7730581 7457080
$$ packed form
10319F8464587j1421660q069540o030189m623558l665082l019977k554435k122166
10311B6957980j828473j631901j332482j125423j117452j093452r30751q38157
10303A7059889p74163p55228o58260n34449m01804l08196k29690j76754j33883
10294A3087462o1562J9236J15746K16657L19588M22730N99806P62102Q69907R66343
10284A7318015J118495J304815J568739J838844J877776J589373J286166J176110
10276B9078333R52924N9875r25869j262905j299021j638262j976125j974611j784732
10267A9229607j507403j302372j103033r64995q99484p72691o85659o15912n56110
10258A0821948m88614m51566m11713m05346l90240l53321l21733k68834k73501
$$ plain form
10249 7457080 7160069 6872020 6592733 6347689 6133924 5932783 5775243 5600925 5399105
10240 5399105 5264796 5124754 4974312 4828723 4681957 4591772 4527213 4419852 4277838 4186773
10230 4186773 4122476 4036257 3958872 3882512 3811953 3779312 3710932 3581292 3448299 3324383 3215772
10219 3215772 3144013 3064294 3015298 2965880 2891265 2808199 2780540 2748759 2691099 2607409 2530821
10208 2530821 2477078 2428357 2368026 2289545 2184760 2133150 2058882 2014895 1965854 1921907 1887810
10197 1887810 1835985 1779298 1729476 1723499 1683962 1621705 1589801 1547868 1518341 1502397 1471141
10186 1471141 1443924 1448045 1446893 1438847 1368192 1317994 1304541 1330346 1338214 1336746 1289991 1287810
10174 1287810 1272945 1234137 1198063 1200657 1217602 1212613 1207448 1183967 1160738 1150543 1152154 1129003
$$ packed form
10249G457080k97011k88049k79287k45044k13765k01141j57540j74318k01820
10240E399105j34309j40042j50442j45589j46766r0185o4559j07361j42014r1065
10230D186773o4297q6219p7385p6360p0559l2641o8380j29640j32993j23916j08611
10219C215772p1759p9719m8996m9418p4615q3066k7659l1781n7660q3690p6588
10208B530821n3743m8721o0331p8481j04785n1610p4268m3987m9041m3947l4097
10197A887810n1825n6687m9822n977l9537o2257l1904m1933k9527j5944l1256
10186A471141k7217M121j152q046p0655n0198j3453K5805P868j468m6755k181
10174A287810j4865l8808l6074K594J6945m989n165k3481k3229j0195J611k3151
$$ plain form
10162 1129003 1121462 1139123 1158137 1170259 1164939 1176391 1182918 1180611 1203398 1224514 1238371 1249716
10150 1249716 1237911 1203708 1196580 1176800 1174337 1152856 1136065 1121044 1122832 1147776 1139206 1092659
10138 1092659 1087102 1047895 1012627 971602 901008 845144 802590 793232 763046 739853 701864 673796
10126 673796 674760 655468 611302 596112 563056 531016 493013 488616 480279 430838 410423 414513
10114 414513 408277 421840 420088 442349 437731 408458 383847 369749 338543 314199 317833 343270
10102 343270 376686 381306 384831 383822 374085 368874 335488 340149 362956 372877 386521 403801 405665
10089 405665 428869 426147 375818 374378 344599 337682 317782 298673 260576 284789 303574 290867
10077 290867 281395 263446 293944 307535 279748 278691 268535 269807 244490 234086 232637 234576
$$ packed form
10162A129003p541J7661J9014J2122n320J1452O527k307K2787K1116J3857J1345
10150A249716j1805l4203p128j9780k463k1481j6791j5021J788K4944q570m6547
10138A092659n557l9207l5268m1025p0594n5864m2554r358l0186k3193l7989k8068
10126F73796R64j9292m4166j5190l3056l2040l8003m397q337m9441k0415M090
10114D14513o236J3563j752K2261m618k9273k4611j4098l1206k4344L634K5437
10102C43270L3416M620L525j009r737n211l3386M661K2807R921J3644J7280J864
10089D05665K3204k722n0329j440k9779o917j9900j9109l8097K4213J8785j2707
10077B90867r472j7949L0498J3591k7787j057j0156J272k5317j0404j449J939
$$ plain form
10065 234576 267881 302183 314512 305754 293686 281584 262347 246233 230338 239560 262037 285357
10053 285357 266666 279357 260905 243353 229264 236413 273438 282829 249463 255569 247287 267638
10041 267638 291240 285262 276180 249644 267475 301242 320060 316174 317183 318121 359578 389928 417665
10028 417665 435893 443715 463004 452112 468775 478613 463509 448722 412714 337663 278400 254093
10016 254093 214202 156455 121296 123419 134510 159653 171414 126173 128403 139614 135906 142911
10004 142911 129341 139771 167700 186198 174194 157309 163901 165493 168455 179719 177390 156682
9992 156682 137359 144661 109364 110972 135562 117890 132297 159729 153603 157020 187179 199894
9980 199894 202284 182835 143940 112797 107332 151603 170686 156265 162461 175455 181545 201491
$$ packed form
10065B34576L3305L4302J2329q758j2068j2102j9237j6114j5895R222K2477K3320
10053B85357j8691J2691j8452j7552j4089P149L7025R391l3366O106q282K0351
10041B67638K3602n978r082k6536J7831L3767J8818l886J009R38M1457L0350K7737
10028D17665J8228P822J9289j0892J6663R838j5104j4787l6008p5051n9263k4307
10016B54093l9891n7747l5159K123J1091K5143J1761m5241K230J1211l708P005
10004A42911j3570J0430K7929J8498j2004j6885O592J592K962J1264k329k0708
9992A56682j9323P302l5297J608K4590j7672J4407K7432o126L417L0159J2715
9980A99894K390j9449l8895l1143n465M4271J9083j4421O196J2994O090J9946
$$ plain form
9968 201491 206845 212876 226984 219012 220142 210839 191226 190591 203356 204245 193822 207052 221824
9955 221824 209844 194874 199520 206498 229497 213180 188175 179622 152671 149740 160370 158357 158247
9942 158247 158222 204528 248402 249102 260688 261387 291594 285781 304860 335847 371359 453645 594090
9929 594090 795334 1022438 1257611 1449445 1628035 1803146 1918143 1848467 1683628 1524886
9919 1524886 1366865 1177823 995871 867772 760614 676676 624089 616469 569280 553733 565104
9908 565104 535053 492279 461590 483198 507222 508942 508081 505383 519037 506828 478534 452724
9896 452724 458834 486865 514085 520140 532507 545108 552379 598812 618052 641385 646635 659481
9884 659481 669751 681835 693072 664786 647202 654863 671880 713593 732527 770680 811800 859544
$$ packed form
9968B01491N354O031J4108p972J130r303j9613o35J2765Q89j0423J3230J4772
9955B21824j1980j4970M646O978K2999j6317k5005q553k6951k931J0630k013j10
9942A58247k5M6306M3874P00J1586O99L0207n813J9079L0987L5512Q2286J40445
9929E94090K01244K27104K35173J91834J78590J75111J14997o9676j64839j58742
9919A524886j58021j89042j81952j28099j07158q3938n2587p620m7189j5547J1371
9908E65104l0051m2774l0689K1608K4024J720q61k698J3654j2209k8294k5810
9896D52724O110K8031K7220O055J2367J2601P271M6433J9240K3333N250J2846
9884F59481J0270J2084J1237k8286j7584P661J7017M1713J8934L8153M1120M7744
$$ plain form
9872 859544 907613 929059 984705 1027893 1072523 1148062 1199268 1265540 1337407 1443344 1580681
9861 1580681 1748151 1974417 2277639 2646593 3117114 3637428 4204387 4815211 5365779 5788944
9851 5788944 6131689 6421807 6630887 6833477 7076652 7355587 7692021 8002321 8203777 8207969
9841 8207969 8056354 7852388 7750336 7832979 8152778 8765348 9675257 10838878 12115356
9832 12115356 13479158 14941906 16434584 17873851 19133818 19963230 20268331 20161208 19940974
9823 19940974 19724054 19468254 19123107 18760396 18324151 17821532 17172484 16381386 15574154
9814 15574154 14978649 14758002 15004027 15631926 16531409 17488409 18378118 19122524 19731555
9805 19731555 20240961 20629450 20861827 20959915 20902022 20783330 20589570 20294455 19729367 18829266
$$ packed form
9872H59544M8069K1446N5646M3188M4630P5539N1206O6272P1867J05937J37337
9861A580681J67470K26266L03222L68954M70521N20314N66959O10824N50568M23165
9851E788944L42745K90118K09080K02590K43175K78935L36434L10300K01456M192
9841H207969j51615k03966j02052Q2643L19799O12570R09909J163621J276478
9832A2115356J363802J462748J492678J439267J259967Q29412L05101j07123k20234
9823A9940974k16920k55800l45147l62711m36245n02619o49048p91098q07232
9814A5574154n95505k20647K46025O27899Q99483R57000Q89709P44406O09031
9805A9731555N09406L88489K32377R8088n7893j18692j93760k95115n65088r00101
$$ plain form
9795 18829266 17717583 16551294 15474309 14457176 13483961 12725307 12163209 11816081 11766660
9786 11766660 11946839 12177836 12360771 12487473 12489982 12403901 12287545 12203569 12205129 12311040
9776 12311040 12539650 12963861 13532325 14216794 14937738 15568781 15914469 15951474 15792970 15539991
9766 15539991 15380443 15381321 15557718 15867637 16322376 16830623 17349519 17749513 17920183 17800432
9756 17800432 17458210 17031632 16796578 16956834 17625507 18713072 20077815 21609772 23261843
9747 23261843 25085984 26974376 28724174 30151456 31130824 31803418 32351383 32816891 33134633
9738 33134633 33193999 33027716 32611970 31989117 31177968 30134845 28855168 27447478 26141363
9729 26141363 25213818 24921632 25261673 26098397 27184918 28214276 29048729 29664642 30205818
$$ packed form
9795A8829266j111683j166289j076985j017133r73215p58654n62098l47128m9421
9786A1766660J80179K30997J82935J26702K509q6081j16356q3976J560J05911
9776A2311040K28610M24211N68464O84469P20944O31043L45688L7005j58504k52979
9766A5539991j59548Q78J76397L09919M54739N08247N18896L99994J70670j19751
9756A7800432l42222m26578k35054J60256O68673J087565J364743J531957J652071
9747B3261843J824141J888392J749798J427282R79368O72594N47965M65508L17742
9738C3134633N9366j66283m15746o22853q11149j043123j279677j407690j306115
9729B6141363r27545k92186L40041Q36724J086521J029358Q34453O15913N41176
$$ plain form
9720 30205818 30808861 31407716 31889432 32223360 32402512 32423231 32123748 31328233 30073149
9711 30073149 28411169 26566752 24698537 22918305 21214917 19718794 18536124 17693262
9703 17693262 17208690 17006976 17006818 17122273 17179504 17001383 16674110 16342302 16060078 15862413
9693 15862413 15738740 15674489 15587698 15373562 15002089 14462876 13719065 12876627 11996036 11172621
9683 11172621 10453003 9807235 9314031 8881569 8503795 8194815 7877000 7619188 7420549
9674 7420549 7258034 7147619 7073908 6978290 6897271 6846269 6763621 6714219 6658989 6555679 6443760
9663 6443760 6368928 6303324 6188117 6059916 5907039 5731564 5518388 5329251 5137877 4957786
9653 4957786 4827028 4696730 4560111 4413983 4292806 4216015 4148933 4086879 4018333 3939381
$$ packed form
9720C0205818O03043N98855M81716L33928J79152K0719k99483p95515j255084
9711C0073149j661980j844417j868215j780232j703388j496123j182670q42862
9703A7693262m84572k01714j58J15455N7231j78121l27273l31808k82224j97665
9693A5862413j23673o4251q6791k14136l71473n39213p43811q42438q80591q23415
9683A1172621p19618o45768m93204m32462l77774l08980l17815k57812j98639
9674G420549j62515j10415p3711r5618q1019n1002q2648m9402n5230j03310j11919
9663F443760p4832o5604j15207j28201j52877j75475k13176j89137j91374j80091
9653D957786j30758j30298j36619j46128j21177p6791o7082o2054o8546p8952
$$ plain form
9643 3939381 3883086 3773863 3681178 3589693 3481314 3421693 3355517 3236383 3132740 3021068
9633 3021068 2915081 2808248 2688343 2596272 2486144 2380072 2312995 2236879 2190199 2141167
9623 2141167 2073807 2017062 1978451 1953182 1916264 1853654 1788935 1742331 1724280 1707052 1673495
9612 1673495 1624860 1592202 1605090 1566287 1541024 1509026 1477800 1442004 1399291 1375047 1362389
9601 1362389 1349459 1357368 1326538 1299503 1272555 1241709 1216262 1207484 1221883 1223925 1208127 1230747
9589 1230747 1250302 1265424 1263254 1241008 1226536 1241050 1240242 1226851 1218228 1225310 1264941 1293648
9577 1293648 1298587 1296887 1305727 1279853 1279605 1290824 1301716 1298854 1321247 1376351 1407570 1457833 1510663
9564 1510663 1529970 1561183 1633921 1727044 1811754 1912863 2007140 2099259 2249685 2464770 2697453
$$ packed form
9643C939381n6295j09223r2685r1485j08379n9621o6176j19134j03643j11672
9633C021068j05987j06833j19905r2071j10128j06072o7077p6116m6680m9032
9623B141167o7360n6745l8611k5269l6918o2610o4719m6604j8051j7228l3557
9612A673495m8635l2658J2888l8803k5263l1998l1226l5796m2713k4244j2658
9601A362389j2930P909l0830k7035k6948l0846k5447q778J4399K042j5798K2620
9589A230747J9555J5122k170k2246j4472J4514q08j3391q623P082L9631K8707
9577A293648M939j700Q840k5874k48J1219J0892k862K2393N5104L1219N0263N2830
9564A510663J9307L1213P2738R3123Q4710J01109R4277R2119J50426K15085K32683
$$ plain form
9553 2697453 2998241 3355005 3791819 4326354 4994527 5841206 6876705 8038271 9221252
9544 9221252 10250507 10856004 10870882 10328651 9380337 8281715 7238869 6352896 5610745
9535 5610745 4993687 4495235 4081561 3736507 3425413 3175798 2997179 2859606 2751894 2674184
9525 2674184 2620568 2600064 2587723 2593016 2659968 2706320 2769014 2893926 3129595 3475324 3895069
9514 3895069 4409948 5083093 5907084 6905452 8137922 9640798 11461121 13480727 15246300
9505 15246300 16179093 16051642 15101633 13798960 12456150 11198881 10061542 9030459 8153985
9496 8153985 7427716 6866902 6472480 6233980 6137968 6120337 6224823 6435212 6808007 7388663
9486 7388663 8215874 9303285 10588977 11949532 13389383 14820415 15986828 16490763 16078043
$$ packed form
9553B697453L00788L56764M36814N34535O68173Q46679J035499J161566J182981
9544I221252J029255O05497J4878n42231r48314j098622j042846q85973p42151
9535E610745o17058m98452m13674l45054l11094k49615j78619j37573j07712p7710
9525B674184n3616k0504j2341N293O6952M6352O2694J24912K35669L45729M19745
9514C895069N14879O73145Q23991R98368J232470J502876J820323K019606J765573
9505A5246300R32793j27451r50009j302673j342810j257269j137339j031083q76474
9496H153985p26269n60814l94422k38500r6012j7631J04486K10389L72795N80656
9486G388663Q27211J087411J285692J360555J439851J431032J166413N03935m12720
$$ plain form
9477 16078043 14912534 13498036 12293824 11297905 10415750 9518211 8594710 7660998 6831861
9468 6831861 6144909 5589097 5181800 4888917 4701145 4555507 4453358 4421970 4399864 4385076
9458 4385076 4399269 4427230 4505499 4607202 4702608 4841468 4987704 5144678 5302542 5478359
9448 5478359 5695847 5996447 6429921 7003132 7797243 8868297 10241318 11955469 14016466
9439 14016466 16493212 19318555 22331406 25173908 27355508 28375307 28074302 26690839
9431 26690839 24865529 23138252 21674582 20484544 19475403 18634078 17965424 17598209 17622288
9422 17622288 18062255 18791756 19554625 19987576 19972112 19756764 19717647 20163256 21148816 22645095
9412 22645095 24582784 26756876 28841560 30376636 31007294 30511165 29006117 26884825
$$ packed form
9477A6078043j165509j414498j204212r95919q82155q97539r23501r33712q29137
9468F831861o86952n55812m07297k92883j87772j45638j02149l1388k2106j4788
9458D385076J4193K7961P8269J01703R5406J38860J46236J56974J57864J75817
9448E478359K17488L00600M33474N73211P94111J071054J373021J714151K060997
9439A4016466K476746K825343L012851K842502K181600J019799l01005j383463
9431B6690839j825310j727277j463670j190038j009141q41325o68654l67215K4079
9422A7622288M39967P29501P62869M32951j5464k15348l9117M45609R85560J496279
9412B2645095J937689K174092K084684J535076O30658m96129j505048k121292
$$ plain form
9404 26884825 24702356 22771013 21107930 19715905 18535340 17571007 16816998 16304287 16064112
9395 16064112 16080826 16208857 16138515 15650575 14772161 13714861 12712900 11840396 11102785
9386 11102785 10468970 9939934 9512279 9185037 8932092 8714043 8547149 8410106 8296161
9377 8296161 8234986 8210815 8280633 8480727 8789514 9226171 9857133 10680207 11655432 12782114
9367 12782114 14072788 15476315 16802874 17807497 18217254 18064870 17685794 17395486 17267743
9358 17267743 17310531 17519077 17854041 18372553 19038117 19932669 21091606 22475279 23786823
9349 23786823 24657773 24788477 24163468 23048201 21788931 20691618 19901564 19524315 19545918
9340 19545918 19959649 20661520 21258400 21326900 20631580 19435375 18219665 17259932 16656965
$$ packed form
9404B6884825k182469j931343j663083j392025j180565r64333p54009n12711k40175
9395A6064112J6714J28031p0342m87940q78414j057300j001961q72504p37611
9386A1102785o33815n29036m27655l27242k52945k18049j66894j37043j13945
9377H296161o1175k4171O9818K00094L08787M36657O30962Q23074R75225J126682
9367A2782114J290674J403527J326559J004623M09757j52384l79076k90308j27743
9358A7267743M2788K08546L34964N18512O65564Q94552J158937J383673J311544
9349B3786823Q70950J30704o25009j115267j259270j097313p90054l77249K1603
9340A9545918M13731P01871N96880O8500o95320j196205j215710r59733o02967
$$ plain form
9331 16656965 16400956 16420728 16627603 16984317 17539508 18398736 19535180 20762265 21652702
9322 21652702 21776560 20957002 19359060 17425376 15502187 13791626 12353736 11149384
9314 11149384 10159154 9357152 8711867 8179818 7725716 7376069 7071733 6827257 6621936
9305 6621936 6443859 6320259 6195872 6062671 5971270 5944075 5935739 5925959 5943840 5945703 5955251
9294 5955251 5939017 5911040 5915709 5961326 6047791 6218734 6480090 6845159 7291565 7816886 8306287
9283 8306287 8791868 9271196 9809251 10485643 11257592 11922760 12119061 11700007 10949827 10087197
9273 10087197 9261235 8468220 7736572 7109430 6603419 6195724 5856488 5612284 5425217
9264 5425217 5306121 5271891 5324456 5451459 5645172 5960849 6384632 6927103 7590997 8346435
$$ packed form
9331A6656965k56009J9772K06875L56714N55191Q59228J136444J227085Q90437
9322B1652702J23858q19558j597942j933684j923189j710561j437890j204352
9314A1149384r90230q02002o45285n32049m54102l49647l04336k44476k05321
9305F621936j78077j23600j24387j33201r1401k7195q336r780J7881J863R548
9294E955251j6234k7977M669M5617Q6465J70943K61356L65069M46406N25321M89401
9283H306287M85581M79328N38055O76392P71949O65168J96301m19054p50180q62630
9273A0087197q25962p93015p31648o27142n06011m07695l39236k44204j87067
9264E425217j19096l4230N2565J27003J93713L15677M23783N42471O63894P55438
$$ plain form
9254 8346435 9115287 9855855 10358106 10387926 9766228 8717418 7613954 6643517 5893167
9245 5893167 5289246 4753361 4313656 3918318 3603167 3356668 3163320 2999803 2881961 2791178
9235 2791178 2717168 2672783 2651992 2610800 2544706 2513582 2487899 2460829 2451469 2433711 2385198 2326577
9223 2326577 2269510 2203519 2124236 2037142 1973171 1899242 1815990 1749213 1729683 1716558 1669952
9212 1669952 1629131 1596647 1589854 1593234 1589158 1613151 1614419 1607110 1623857 1642183 1654099 1656465 1681028
9199 1681028 1672299 1632873 1583023 1509533 1435917 1353893 1303668 1260416 1188516 1123557 1097639 1070044
9187 1070044 1048197 1011024 1009508 985197 944836 900496 863885 825131 781512 765960 754339 732534
9175 732534 727585 736574 711057 678110 648848 652929 684593 675871 630374 622819 630920 633763 590249
$$ packed form
9254H346435P68852P40568N02251K9820o21698j048810j103464r70437p50350
9245E893167o03921n35885m39705l95338l15151k46499j93348j63517j17842r0783
9235B791178p4010m4385k0791m1192o6094l1124k5683k7070r360j7758m8513n8621
9223B326577n7067o5991p9283q7094o3971p3929q3252o6777j9530j3125m6606
9212A669952m0821l2484o793L380m076K3993J268p309J6747J8326J1916K366K4563
9199A681028q729l9426m9850p3490p3616q2024n0225m3252p1900o4959k5918k7595
9187A070044k1847l7173j516k4311m0361m4340l6611l8754m3619j5552j1621k1805
9175G32534m949Q989k5517l2947k9262M081L1664q722m5497p555Q101K843m3514
$$ plain form
9162 590249 572213 597819 590920 595151 598772 579561 541907 517594 491790 452363 436039 449016
9150 449016 466311 476913 467315 451007 436766 429730 413525 414205 419898 423563 404946 396098 377351
9137 377351 362680 358661 357199 382139 420826 432445 430610 420521 413460 379111 353339 381933
9125 381933 375486 327301 297345 295129 286432 278067 288045 268865 229968 231144 236375 232205 274167
9112 274167 279495 267105 275385 280789 299831 287355 273313 252448 234685 227055 212540 191242
9100 191242 198108 200336 202788 204654 217630 227286 263787 278956 279527 275586 267987 250072 245105 224066
9086 224066 186220 212715 246007 230206 205284 185121 178598 182625 173913 177055 182722 190605 198930
9073 198930 197807 209355 231572 264271 259989 234792 217956 228051 221164 207650 224358 262011
$$ packed form
9162E90249j8036K5606o899M231L621j9211l7654k4313k5804l9427j6324J2977
9150D49016J7295J0602r598j6308j4241p036j6205O80N693L665j8617q848j8747
9137C77351j4671m019j462K4940L8687J1619j835j0089p061l4349k5772K8594
9125C81933o447m8185k9956k216q697q365R978j9180l8897J176N231m170M1962
9112B74167N328j2390Q280N404J9042j2476j4042k0865j7763p630j4515k1298
9100A91242O866K228K452J866J2976R656L6501J5169N71l941p599j7915m967k1039
9086B24066l7846K6495L3292j5801k4922k0163o523M027q712L142N667P883Q325
9073A98930j123J1548K2217L2699m282k5197j6836J0095o887j3514J6708L7653
$$ plain form
9061 262011 257424 224442 185247 182790 181303 173416 181873 184398 214807 219135 204419 189757 195884
9048 195884 205591 216774 223536 261601 326994 380754 470520 630856 764110 771729 660162 527639
9036 527639 431639 354347 298142 246277 208816 216480 237799 231326 211901 211583 240100 253031
9024 253031 252404 257018 276557 319052 319590 303443 297593 274568 284864 301758 260824 241312 263080
9011 263080 263784 237489 228432 243326 247062 245237 275445 311640 324074 318489 353428 422914 500081
8998 500081 665701 906782 1231546 1504296 1525336 1308328 1022975 794212 666742 588213
8988 588213 506811 432470 408730 349606 304263 271059 264395 296423 340543 305810 272821 277662
8976 277662 290803 269646 220543 187551 169871 158322 155560 152666 162438 180794 149462 144829
$$ packed form
9061B62011m587l2982l9195k457j487p887Q457K525L0409M328j4716j4662O127
9048A95884R707J1183O762L8065O5393N3760Q9766J60336J33254P619j11567j32523
9036E27639r6000p7292n6205n1865l7461P664K1319o473j9425l18K8517J2931
9024B53031o27M614J9539M2495N38j6147n850k3025J0296J6894m0934j9512K1768
9011B63080P04k6295r057J4894L736j825L0208L6195J2434n585L4939O9486P7167
8998E00081J65620K41081L24764K72750K1040k17008k85353k28763j27470p8529
8988E88213q1402p4341k3740n9124m5343l3204o664L2028M4120l4733l2989M841
8976B77662J3141k1157m9103l2992j7680j1549k762k894R772J8356l1332m633
$$ plain form
8964 144829 155039 201173 198799 197677 228026 252480 254633 269613 291095 320030 397948 471462
8952 471462 577314 711640 807482 838361 734790 572152 449956 352266 292100 290566 303036
8941 303036 304680 284187 285878 307495 341926 351770 325352 296661 290710 274582 250887 249144 212082
8928 212082 200893 201960 221067 233630 241276 261308 275761 285564 278015 240526 211515 206290 227689
8915 227689 208117 177440 161251 168196 237438 258287 278537 265032 255465 233736 182072 119875
8903 119875 58468 41088 43761 71949 85628 87721 110470 126983 126899 114785 99135 106479 110531
8890 110531 109641 77540 34466 49415 83176 106111 95994 105352 115885 141447 137260 162001
8878 162001 210395 225380 200432 178517 177973 168950 164576 156688 140984 145109 150907 148700 148254 157207
$$ packed form
8964A44829J0210M6134k374j122L0349K4454K153J4980K1482K8935P7918P3514
8952D71462J05852J34326R5842L0879j03571j62638j22196r7690o0166j534J2470
8941C03036J644k0493J691K1617L4431R844k6418k8691n951j6128k3695j743l7062
8928B12082j1189J067J9107J2563P646K0032J4453R803p549l7489k9011n225K1399
8915B27689j9572l0677j6189O945O9242K0849K0250j3505r567k1729n1664o2197
8903A19875o1407j7380K673K8188J3679K093K2749J6513q4j2114j5650P344M052
8890A10531q90l2101m3074J4949L3761K2935j0117R358J0533K5562m187K4741
8878A62001M8394J4985k4948k1915n44r023m374p888j5704M125N798k207m46Q953
$$ plain form
8864 157207 168284 176606 172831 174285 187011 161541 102728 82782 112743 115298 110111 107599 130859
8851 130859 137131 151069 186893 193275 171915 179537 183237 165513 142649 148158 165247 191719 206111
8838 206111 184911 148128 170012 180691 186384 248331 268204 225102 126770 61507 53663 66771
8826 66771 91541 137942 143767 151506 162788 152508 137440 141089 118182 94245 110430 135192
8814 135192 135123 137879 161502 188533 165964 131968 132866 157151 178653 193132 215191 192292 171408
8801 171408 164962 181030 183823 194819 197663 202826 198273 176095 165345 130890 143420 163771 174464
8788 174464 192308 179155 106459 38927 24338 64709 128419 158326 139082 132460 155212 175494
8776 175494 184545 183425 185146 197316 178535 203451 225769 232086 249205 277504 257814 215859
$$ packed form
8864A57207J1077Q322l775J454J2726k5470n8813j9946K9961K555n187k512K3260
8851A30859O272J3938L5824O382k1360P622L700j7724k2864N509J7089K6472J4392
8838B06111k1200l6783K1884J0679N693O1947J9873m3102r8332o5263p844J3108
8826F6771K4770M6401N825P739J1282j0280j5068L649k2907k3937J6185K4762
8814A35192o9K756K3623K7031k2569l3996Q98K4285K1502J4479K2059k2899k0884
8801A71408o446J6068K793J0996K844N163m553k2178j0750l4455J2530K0351J0693
8788A74464J7844j3153p2696o7532j4589M0371O3710K9907j9244o622K2752K0282
8776A75494R051j120J721J2170j8781K4916K2318O317J7119K8299j9690m1955
$$ plain form
8764 215859 176776 177433 203077 227781 216004 196079 209070 221382 232608 229527 234839 237479 220468
8751 220468 204574 207478 212167 231611 221039 207024 187397 200242 212063 221242 216917 220523 224105
8738 224105 227900 225532 200066 200204 207197 242465 257882 275091 289626 285844 311715 364609 421773
8725 421773 497317 565770 601122 587381 546104 500894 467332 456735 461698 470468 507391 545591
8713 545591 564903 556172 561189 535657 529605 530312 523083 504415 484355 500805 512881 504798 499319
8700 499319 485767 522715 556502 594892 599566 578823 568885 574621 565765 587765 602996 637512
8688 637512 682233 704599 710951 724098 756096 771476 753141 759797 809345 894622 924317 972207
8676 972207 1019290 1007724 1023733 1029883 1069491 1172908 1265646 1389038 1509740 1601559 1651393
$$ packed form
8764B15859l9083O57K5644K4704j1777j9925J2991J2312J1226l081N312K640j7011
8751B20468j5894K904M689J9444j0572j4015j9627J2845J1821R179m325L606L582
8738B24105L795k368k5466J38O993L5268J5417J7209J4535l782K5871N2894N7164
8725D21773P5544O8453L5352j3741m1277m5210l3562j0597M963Q770L6923L8200
8713E45591J9312q731N017k5532o052P07p229j8668k0060J6450J2076q083n479
8700D99319j3552L6948L3787L8390M674k0743r938N736q856K2000J5231L4516
8688F37512M4721K2366O352J3147L1998J5380j8335O656M9548Q5277K9695M7890
8676I72207M7083j1566J6009O150L9608J03417R2738J23392J20702R1819M9834
$$ plain form
8665 1651393 1696516 1733350 1812546 1986386 2217280 2454220 2672572 2906299 3198923 3575256
8655 3575256 4041209 4545184 5099530 5716784 6504076 7662490 9311625 11562457 14816525
8646 14816525 19887992 28152282 41966826 64289193 93633044 117806987 121688109 100244745
8638 100244745 70718408 49369161 36362422 28270720 22929667 19225441 16593968 14676346
8630 14676346 13252471 12202159 11428546 10925113 10587968 10279232 9877434 9426545 8913365
8621 8913365 8430275 8048866 7822330 7739680 7787543 7950221 8159442 8420002 8758251 9167693
8611 9167693 9744963 10534871 11474978 12427181 13412351 14724539 16775128 19757710 23874754
8602 23874754 29718175 38737996 53385549 78355575 121123843 182666523 238600732
$$ packed form
8665A651393M5123L6834P9196J73840K30894K36940K18352K33727K92624L76333
8655C575256M65953N03975N54346O17254P87292J158414J649135K250832L254068
8646A4816525N071467Q264290J3814544K2322367K9343851K4173943L881122k1443364
8638A00244745k9526337k1349247j3006739q091702n341053l704226k631473j917622
8630A4676346j423875j050312p73613n03433l37145l08736m01798m50889n13180
8621H913365m83090l81409k26536q2650M7863J62678K09221K60560L38249M09442
8611I167693N77270P89908R40107R52203R85170J312188K050589K982582M117044
8602B3874754N843421R019821J4647553K4970026M2768268O1542680N5934209
$$ plain form
8595 238600732 254955015 213154099 149613026 104289230 77499309 61452067 51285280
8588 51285280 44458352 39284123 35003956 31443714 28525027 26280321 24690925 23492353
8580 23492353 22425890 21181886 19747801 18261972 16832640 15690899 14827386 14204946
8572 14204946 13717862 13277175 12923095 12676934 12552932 12537498 12644034 12806979 13027025 13338223
8562 13338223 13719425 14264004 15178821 16575034 18544956 21438838 25835682 32825783 44267964
8553 44267964 62987283 89821956 116605374 128397890 115575429 87645390 64530413
8546 64530413 50624766 42818572 38476653 36025116 33695100 30825088 27814545 25070442
8538 25070442 22809196 21056138 19657482 18425701 17216649 16000016 14845235 13768698
$$ packed form
8595B38600732J6354283m1800916o3541073m5323796k6789921j6047242j0166787
8588E1285280o826928n174229m280167l560242k918687k244706j589396j198572
8580B3492353j066463j244004j434085j485829j429332j141741q63513o22440
8572A4204946m87084m40687l54080k46161j24002j5434J06536J62945K20046L11198
8562A3338223L81202N44579R14817J396213J969922K893882M396844O990101J1442181
8553D4267964J8719319K6834673K6783418J1792516j2822461k7930039k3114977
8546F4530413j3905647p806194m341919k451537k330016k870012l010543k744103
8538B5070442k261246j753058j398656j231781j209052j216633j154781j076537
$$ plain form
8530 13768698 12843483 12073324 11476989 10961034 10459217 9988415 9551401 9208808 8877744
8521 8877744 8580576 8287711 8012111 7757435 7547708 7362816 7176649 7015450 6919012 6818105
8511 6818105 6766177 6790483 6858622 6995409 7188426 7352652 7519306 7752050 8032858 8336061
8501 8336061 8732444 9265738 9933793 10579606 10878338 10557991 9824527 9004343 8263219 7656192
8491 7656192 7148923 6699829 6288016 5892097 5547090 5284827 5039206 4806180 4613899 4418389
8481 4418389 4231892 4088275 3959152 3833992 3710818 3574224 3468155 3368264 3265545 3159745
8471 3159745 3026152 2900364 2775086 2648602 2551323 2517179 2478654 2413753 2343690 2296614 2282714
8460 2282714 2224105 2157919 2106005 2063582 2009050 1973900 1957283 1922093 1873229 1817472 1736559
$$ packed form
8530A3768698r25215p70159n96335n15955n01817m70802m37014l42593l31064
8521H877744k97168k92865k75600k54676k09727j84892j86167j61199r6438j00907
8511F818105n1928K4306O8139J36787J93017J64226J66654K32744K80808L03203
8501H336061L96383N33294O68055O45813K98732l20347p33464q20184p41124o07027
8491G656192n07269m49094m11813l95919l45007k62263k45621k33026j92281j95510
8481D418389j86497j43617j29123j25160j23174j36594j06069r9891j02719j05800
8471C159745j33593j25788j25278j26484r7279l4144l8525o4901p0063m7076j3900
8460B282714n8609o6186n1914m2423n4532l5150j6617l5190m8864n5757q0913
$$ plain form
8449 1736559 1696443 1668701 1639152 1588206 1574904 1545561 1485225 1432991 1370140 1319652 1309176
8438 1309176 1314046 1301630 1244928 1211099 1186509 1191508 1210902 1197451 1164958 1128039 1112972 1112853
8426 1112853 1087632 1040284 966589 917162 848185 857508 911597 907834 887113 883784 874141 877069
8414 877069 855730 847233 850541 849933 831045 816916 853736 857670 818545 765966 709091 689440 668473
8401 668473 642762 627748 611249 632640 604871 553469 534510 520868 514110 456686 447720 456535
8389 456535 457137 445071 435712 432757 423827 381607 357381 359999 378264 369428 339276 332565 344408
8376 344408 331204 327799 340618 348910 336623 327470 321949 315423 306288 286504 277692 287956 305097
8363 305097 325694 359929 377769 365876 339347 312893 329728 322044 295204 280425 252411 236713
$$ packed form
8449A736559m0116k7742k9549n0946j3302k9343o0336n2234o2851n0488j0476
8438A309176M870j2416n6702l3829k4590M999J9394j3451l2493l6919j5067j19
8426A112853k5221m7348p3695m9427o8977R323N4089l763k0721l329r643K928
8414H77069k1339q497L308o08j8888j4129L6820L934l9125n2579n6875j9651k0967
8401F68473k5711j5014j6499K1391k7769n1402j8959j3642o758n7424q966Q815
8389D56535O02j2066r359k955q930m2220k4226K618J8265q836l0152o711J1843
8376C44408j3204l405J2819Q292j2287r153n521o526r135j9784q812J0264J7141
8363C05097K0597L4235J7840j1893k6529k6454J6835p684k6840j4779k8014j5698
$$ plain form
8351 236713 249057 258466 254132 235257 214335 227380 233688 249933 233582 210516 210521 225235 220757
8338 220757 221453 241958 257401 286157 287429 255761 206438 150378 131232 141528 164778 185913
8326 185913 196491 175713 153669 168254 157205 146675 157959 166316 142741 115026 119604 123218
8314 123218 99775 66896 87150 109789 121928 137783 133466 124833 110047 111942 147125 170869
8302 170869 187754 189439 175589 171497 174059 211801 223673 211995 196094 213121 236158 255039
8290 255039 246825 274206 284294 224816 149037 89301 74737 75720 76815 66972 77913 83753 83264
8277 83264 78792 64918 33170 43265 54756 63964 100569 96369 63859 52982 67493 84611
8265 84611 89367 100021 94624 87177 71452 59479 68349 81412 79995 86275 70727 45425 43495
$$ packed form
8351B36713J2344R409m334j8875k0922J3045O308J6245j6351k3066NJ4714m478
8338B20757O96K0505J5443K8756J272l1668m9323n6060j9146J0296K3250K1135
8326A85913J0578k0778k2044J4585j1049j0530J1284Q357k3575k7715M578L614
8314A23218k3443l2879K0254K2639J2139J5855m317q633j4786J895L5183K3744
8302A70869J6885J685j3850m092K562L7742J1872j1678j5901J7027K3037J8881
8290B55039q214K7381J0088n9478p5779n9736j4564R83J095r843J0941N840m89
8277H3264m472j3874l1748J0095J1491R208L6605m200l2510j0877J4511J7118
8265H4611M756J0654n397p447j5725j1973Q870J3063j417O280j5548k5302j930
$$ plain form
8252 43495 53262 34966 44753 74668 96396 116022 119721 152432 208958 213141 208125 222137 240774
8239 240774 305491 409306 533368 640757 642704 526609 390336 278405 220461 164099 111283
8228 111283 79013 63748 74547 76052 56591 69053 70740 85175 111594 83008 56415 49678
8216 49678 46066 43908 20120 -724 6587 31588 9302 8194 32371 18417 16261 38124 47768
8203 47768 76084 69183 55940 70967 120548 178512 202469 224195 290119 436380 716345 1030034
8191 1030034 1251393 1251765 1027773 757990 523006 374384 298212 241030 216047 181537 156348
8180 156348 126309 105030 89167 90167 66911 66394 78307 78022 86133 83092 55490 25539 39706
8167 39706 58166 66712 71636 67200 82618 80959 71052 52810 39896 50451 49938 49924 56888 52915
$$ packed form
8252D3495R767j8296R787K9915K1728J9626L699L2711N6526M183n016J4012J8637
8239B40774O4717J03815J24062J07389J947j16095j36273j11931n7944n6362n2816
8228A11283l2270j5265J0799J505j9461J2462J687J4435K6419k8586k6593o737
8216D9678l612k158k3788k0844P311K5001k2286j108K4177j3954k156K1863R644
8203D7768K8316o901j3243J5027M9581N7964K3957K1726O5924J46261K79965L13689
8191A030034K21359L72k23992k69783k34984j48622p6172n7182k4983l4510k5189
8180A56348l0039k1279j5863J000k3256n17J1913k85Q111l041k7602k9951J4167
8167C9706J8460Q546M924m436J5418j659r907j8242j2914J0555n13j4O964l973
$$ plain form
8153 52915 66515 118297 157788 202319 256295 346334 518971 654435 647990 546444 400182
8142 400182 291452 212032 187338 179246 171458 159477 160000 183111 168112 133199 121855 98548
8130 98548 86003 75319 49502 25910 4635 16972 7879 17464 23233 6468 29578 33968 45686
8117 45686 73370 68247 82272 43049 27750 31663 67049 65290 52230 48627 7789 16005 21667
8104 21667 15621 10967 812 -3021 3963 10144 22231 28532 37850 36583 77099 107097 81509
8091 81509 73932 49075 10751 12172 45199 51320 31506 31479 28024 35726 25576 34787 41790 58796
8077 58796 52072 15221 6960 23594 32221 28843 19198 26436 18527 3898 9271 27263 11691
8064 11691 4841 -297 -10980 -8171 586 15811 16642 19850 -2548 5061 12789 27906 54694 59001
$$ packed form
8153E2915J3600N1782L9491M4531N3976R0039J72637J35464o445j01546j46262
8142D00182j08730p9420k4694q092p788j1981N23K3111j4999l4913j1344k3307
8130I8548j2545j0684k5817k3592k1275J2337r093R585N769j6765K3110M390J1718
8117D5686K7684n123J4025l9223j5299L913L5386j759j3060l603m0838Q216N662
8104B1667o046m654j0155l833O984O181J2087O301R318j267M0516K9998k5588
8091H1509p577k4857l8324J421L3027O121j9814k7l455P702j0150R211P003J7006
8077E8796o724l6851q261J6634Q627l378r645P238p909j4629N373J7992j5572
8064A1691o850n138j0683K809Q757J5225Q31L208k2398P609P728J5117K6788M307
$$ plain form
8050 59001 63922 66420 46389 32355 31868 55818 81272 79933 84243 50455 30733 43825 20938
8037 20938 -7641 -41116 -19751 -2046 5927 13753 23497 15285 -625 -13141 9607 50613 59341
8024 59341 65458 53034 71284 89279 84604 67398 59583 51537 45524 62050 96415 102008 84508
8011 84508 71010 79724 81897 69426 38031 26983 40688 34232 34609 50581 24380 -13331 -7437
7998 -7437 1439 8799 34528 39621 46222 55069 48549 63575 70677 68626 71578 72511 61224 74498
7984 74498 120689 120576 109011 128105 116900 140893 169015 160930 171105 150342 131828 142082
7972 142082 165111 166054 167558 130210 110162 84840 77913 64074 53281 59554 52721 52045 52214 55344
7958 55344 69239 76968 95176 89368 80121 83771 89685 81904 75464 95558 96002 90509 96962 88600
$$ packed form
8050E9001M921K498k0031j4034m87K3950K5454j339M310l3788j9722J3092k2887
8037B0938k8579l3475K1365J7705P973P826R744q212j5910j2516K2748M1006Q728
8024E9341O117j2424J8250J7995m675j7206p815q046o013J6526L4365N593j7500
8011H4508j3498Q714K173j2471l1395j1048J3705o456L77J5972k6201l7711N894
7998g437Q876P360K5729N093O601Q847o520J5026P102k051K952R33j1287J3274
7984G4498M6191j13j1565J9094j1205K3993K8122q085J0175k0763j8514J0254
7972A42082K3029R43J504l7348k0048k5322o927j3839j0793O273o833o76J69L130
7958E5344J3895P729J8208n808r247L650N914p781o440K0094M44n493O453q362
$$ plain form
7944 88600 97665 105330 98566 114401 97814 95276 106079 117610 119375 112521 106388 131173 138359
7931 138359 138064 129868 119892 86724 61942 27633 36074 49298 29443 -6995 -1357 15550 50686
7918 50686 84261 82764 54982 60924 67960 58300 47816 62755 53520 54528 41421 28204 11115
7905 11115 10623 52952 93540 91970 77598 88745 86531 55964 63673 59241 64827 56501 42969
7892 42969 61638 78248 50775 45000 43983 47663 47860 36912 47087 52668 46177 42451 7012
7879 7012 -7714 16564 21728 9550 -26214 -40608 -39683 -2179 12114 -29669 -26948 -22190 -19994
7866 -19994 -6438 19851 25082 21554 14970 -12713 -26492 -16515 2226 -11894 22557 31045 32793
7853 32793 16188 28754 23009 13834 5514 20759 46745 55068 59320 24244 -12231 -12357 8899
$$ packed form
7944H8600R065P665o764J5835j6587k538J0803J1531J765o854o133K4785P186
7931A38359k95q196r976l3168k4782l4309Q441J3224j9855l6438N638J6907L5136
7918E0686L3575j497k7782N942P036r660j0484J4939r235J008j3107j3217j7089
7905A1115m92M2329M0588j570j4372J1147k214l0567P709m432N586q326j3532
7892D2969J8669J6610k7473n775j017L680J97j0948J0175N581o491l726l5439
7879G012j4726K4278N164j2178l5764j4394R25L7504J4293m1783K721M758K196
7866a9994J3556K6289N231l528o584k7683j3779R977J8741j4120L4451Q488J748
7853C2793j6605J2566n745r175q320J5245K5986Q323M252l5076l6475j26K1256
$$ plain form
7840 8899 37651 49315 28893 19120 30985 36566 -1865 -24100 -9999 17416 46953 62630
7828 62630 47489 29114 6379 14426 13505 1287 -16110 -15046 -9317 -20503 2338 15950 6108
7815 6108 -5536 -25211 -4382 10710 18711 -10461 -16243 -17975 -22242 -9807 6771 -5125 -13983
7802 -13983 -24216 -30604 -20679 145 4471 4726 7749 -11844 -993 41982 33986 25700 35310 18150
7788 18150 16543 13006 26116 27028 47748 39225 15340 8782 2641 -1268 14061 -14369 -5187 13033
7774 13033 12684 -5349 -6137 -3049 -16614 -6882 -18161 -20841 -14853 -16418 -10676 -18392 -39795 -71502
7760 -71502 -74094 -61053 -32371 -13518 6360 42936 7742 -16629 -31022 -51342 -58305 -40830
7748 -40830 -29927 -24799 -24476 -8897 4414 -20232 -39780 -43152 -19516 -10524 -16042 -38255 -37658
$$ packed form
7840H899K8752J1664k0422r773J1865N581l8431k2235J4101K7415K9537J5677
7828F2630j5141j8375k2735Q047r21j2218j7397J064N729j1186K2841J3612r842
7815F108j1644j9675K0829J5092Q001k9172n782j732m267J2435J6578j1896q858
7802a3983j0233o388R925K0824M326K55L023j9593J0851M2975p996q286R610j7160
7788A8150j607l537J3110R12K0720q523k3885o558o141l909J5329k8430R182J8220
7774A3033l49j8033p88L088j3565R732j1279k680N988j565N742p716k1403l1707
7760g1502k592J3041K8682J8853J9878L6576l5194k4371j4393k0320o963J7475
7748d0830J0903N128L23J5579J3311k4646j9548l372K3636Q992n518k2213N97
$$ plain form
7735 -37658 -23430 -2789 -21522 -25034 12225 6753 -31689 -37912 -40494 -60367 -61003 -69824 -79193
7722 -79193 -53375 -50732 -44020 -33397 -27388 -41221 -32826 -13879 -12656 -3420 7567 -12531 -28776
7709 -28776 -30758 -30295 -27442 -18591 3766 -4983 -8509 -25154 -29580 1419 34630 29774 10702 -20595
7695 -20595 -16905 -4875 23979 5393 -21565 -56713 -66219 -37315 -30214 -53624 -30757 -17619
7683 -17619 -29949 -49806 -54281 -22219 -5771 -17513 -15282 -5437 16916 25037 13664 20719 12759
7670 12759 21370 19519 -7984 -23537 -14633 2075 -15533 -20019 -13668 9410 31656 14353 -2375
7657 -2375 -27603 -13768 2987 -2672 -1095 18584 20338 12866 7933 333 -13116 -37177 -45618
7644 -45618 -38701 -26756 -26982 -32303 -30946 -21350 -19321 -18070 1747 -26956 -27281 -45290 -62290 -18121
$$ packed form
7735c7658J4228K0641j8733l512L7259n472l8442o223k582j9873o36q821r369
7722g9193K5818K643O712J0623O009j3833Q395J8947J223R236J0987k0098j6245
7709b8776j982M63K853Q851K2357q749l526j6645m426L0999L3211m856j9072l1297
7695b0595L690J2030K8854j8586k6958l5148r506K8904P101k3410K2867J3138
7683a7619j2330j9857m475L2062J6448j1742K231R845K2353Q121j1373P055p960
7670A2759Q611j851k7503j5553Q904J6708j7608m486O351K3078K2246j7303j6728
7657b375k5228J3835J6755n659J577J9679J754p472m933p600j3449k4061q441
7644d5618O917J1945k26n321J357R596K029J251J9817k8703l25j8009j7000M4169
$$ plain form
7630 -18121 24706 49545 38541 21991 10935 2100 -12223 -14930 791 11485 9233 4105 37736
7617 37736 35789 6551 -1802 16065 8603 -16053 -51401 -73347 -66856 -54836 -43478 -45732 -50719
7604 -50719 -59839 -64049 -47404 -31495 -23884 -7445 -30132 -60385 -58596 -58207 -55155 -61544 -63211 -46009
7590 -46009 7389 17465 16434 -12726 -19849 -14711 -24008 -20245 -10800 -13673 -51832 -53221 -27100
7577 -27100 -25883 -43669 -34031 -28651 -30432 -31127 -22076 -15384 -4504 20466 18784 15000 6310 6711
7563 6711 1532 -8829 -5650 -19703 -18804 -20268 -18928 -17073 -35847 -53721 -47335 -1777 21137 6144
7549 6144 -24530 -19463 -5636 -2626 -14712 -26451 -39480 -26687 -39082 -35829 -39753 -24249 -24153
7536 -24153 -49085 -36282 -24049 -11947 6236 -19626 -28463 -49326 -18451 -45728 -45786 -33690 -9653
$$ packed form
7630a8121M2827K4839j1004j6550j1056q835j4323k707J5721J0694k252n128L3631
7617C7736j947k9238q353J7867p462k4656l5348k1946O491J2020J1358k254m987
7604e0719r120m210J6645J5909P611J6439k2687l0253J789L89L052o389j667J7202
7590d6009N3398J0076j031k9160p123N138r297L763R445k873l8159j389K6121
7577b7100J217j7786R638N380j781o95R051O692J0880K4970j682l784q690M01
7563F711n179j0361L179j4053Q99j464J340J855j8774j7874O386M5558K2914j4993
7549F144l0674N067J3827L010j2086j1739j3029J2793j2395L253l924J5504R6
7536b4153k4932J2803J2233J2102J8183k5862q837k0863L0875k7277n8J2096K4037
$$ plain form
7523 -9653 -2093 -12718 -12303 -16674 -12351 -16169 -33359 -15195 -11723 -14366 -17039 -1044 -19591 -46069
7509 -46069 -13772 14051 565 -11728 -24961 -6838 13781 13212 -11412 -34563 -48404 -54505
7497 -54505 -60131 -41361 -36855 -26398 -41753 -33397 -40296 -51439 -68157 -48875 -18169 -25493 -12822
7484 -12822 -13537 -9187 -14617 3029 20022 -9357 -2033 24409 -4834 -36442 -39537 -28150 -41847
7471 -41847 -62364 -58505 -31979 -28468 -24046 -24198 -8068 6797 -26635 -28157 -14948 -6310 -18859
7458 -18859 -49312 -44030 -54512 -57854 -45704 -43875 -38014 -15398 17938 16530 20648 19422 4964
7445 4964 5972 -13527 5769 6462 -5288 -9583 -12520 -33211 -56836 -88149 -100671 -79360 -68311
7432 -68311 -41102 -7755 -35907 -57083 -41273 -8064 -9729 -41473 -36393 -41094 -71093 -49218
$$ packed form
7523i653P560j0625M15m371M323l818j7190J8164L472k643k673J5995j8547k6478
7509d6069L2297K7823j3486j2293j3233J8123K0619n69k4624k3151j3841o101
7497e4505n626J8770M506J0457j5355Q356o899j1143j6718J9282L0706p324J2671
7484a2822p15M350n430J7646J6993k9379P324K6442k9243l1608l095J1387j3697
7471d1847k0517L859K6526L511M422j52J6130J4865l3432j522J3209Q638j2549
7458a8859l0453N282j0482l342J2150J829N861K2616L3336j408M118j226j4458
7445D964J008j9499J9296O93j1750m295k937k0691k3625l1313j2522K1311J1049
7432f8311K7209L3347k8152k1176J5810L3209j665l1744N080m701k9999K1875
$$ plain form
7420 -49218 -47778 -30255 -5672 -4178 3308 -14287 -39059 -23066 -19051 -30201 -35883 -29679 2240
7407 2240 -24465 -51467 -23345 -7580 -21509 -15013 -15787 -8616 -2486 -4605 -6051 8563 4701 -14489
7393 -14489 -29023 -46814 -58854 -48393 -47617 -57849 -56005 -52866 -48594 -30973 -32138 -51320 -14757
7380 -14757 18985 39720 771 -21499 -42608 -51002 -42270 -43105 -12386 1292 10044 24263 30589
7367 30589 403 -3303 18107 21796 13303 -2197 -21194 -28746 -17614 -21833 -41185 -34181 -23316
7354 -23316 -16848 -10010 -19339 -10114 9311 23114 13562 -20753 -47198 -51605 -68468 -35090 -6340
7341 -6340 -531 2774 -3118 -17030 -17755 -33340 -49614 -39486 -44338 -59439 -91146 -77457 -48521
7328 -48521 -16313 -42223 -47950 -52204 -41190 -11095 4575 11085 -2875 -28862 -26444 -39322 -23495
$$ packed form
7420d9218J440J7523K4583J494P486j7595k4772J5993M015j1150n682O204L1919
7407B240k6705k7002K8122J5765j3929O496p74P171O130k119j446J4614l862j9190
7393a4489j4534j7791j2040J0461P76j0232J844L139M272J7621j165j9182L6563
7380a4757L3742K0735l8949k2270k1109q394Q732q35L0719J3678Q752J4219O326
7367C0589l0186l706K1410L689q493j5500j8997p552J1132m219j9352P004J0865
7354b3316O468O838r329R225J9425J3803r552l4315k6445m407j6863L3378K8750
7341f340N809L305n892j3912p25j5585j6274J0128m852j5101l1707J3689K8936
7328d8521L2208k5910n727m254J1014L0095J5670O510j3960k5987K418j2878J5827
$$ plain form
7315 -23495 -19994 -11815 -31713 -52473 -26332 11453 -87 -25622 -47115 -55049 -53457 -49606 -24793
7302 -24793 -13343 -17709 -13994 -30035 -35144 -23242 -12451 -6969 -15214 -5008 -28657 -22186 9185
7289 9185 15514 5884 -13961 -1194 5786 1523 -6662 -8537 -29069 -41671 -39202 -32069 -38198 -41669
7275 -41669 -7852 -17735 -41094 -87059 -66696 -22295 -2635 24826 11785 -19864 -10131 -2820
7263 -2820 16695 16167 19349 -13288 -32103 -13849 27806 48523 37321 16023 -18676 -24487 20327
7250 20327 -653 -23796 -40502 -36320 -1590 9378 -1755 -14977 -27226 -31829 -37578 -21673
7238 -21673 17966 17002 -28428 -34588 8092 30052 19312 -14326 -29046 -13377 -7954 -29272 -30134
7225 -30134 -33434 -34114 -42704 -43820 -55677 -59474 -60224 -65257 -29912 16960 18916 12045 13487 6948
$$ packed form
7315b3495L501Q179j9898k0760K6141L7785j1540k5535k1493p934J592L851K4813
7302b4793J1450m366L715j6041n109J1902J0791N482q245J0206k3649O471L1371
7289I185O329r630j9845J2767O980m263q185j875k0532j2602K469P133o129l471
7275d1669L3817r883k3359m5965K0363M4401J9660K7461j3041l1649R733P311
7263b820J9515n28L182l2637j8815J8254M1655K0717j1202k1298l4699n811M4814
7250B0327k0980k3143j6706M182L4730J0968j1133j3222j2249m603n749J5905
7238b1673L9639r64m5430o160M2680K1960j0740l3638j4720J5669N423k1318q62
7225c0134l300o80q590j116j1857l797p50n033L5345M6872J956o871J442o539
$$ plain form
7211 6948 116 -8666 -115 5343 3860 -228 -13385 -32982 -29520 -16387 -24850 -49700 -54219 -34670
7197 -34670 -11809 -13994 -19229 -21322 -23892 -24001 -38330 -27001 -11121 -19480 -14927 -6164 -10024 -25533
7183 -25533 -10943 13747 29476 24326 25497 8099 2887 19010 13206 36085 6510 -36287 -43791
7170 -43791 -26220 -32126 -34228 -28990 -37043 -34060 -22589 -38911 -58248 -77347 -55203 -67282 -46373
7157 -46373 -11807 89 -10406 -1159 -19564 -42822 -45923 -36891 -61377 -75974 -67392 -23764 -13640
7144 -13640 -15989 -2335 28729 38083 1055 -33748 -46701 -71497 -69042 -41825 -61840 -79531
7132 -79531 -62531 -39357 -26896 -18575 -8286 -25990 -5388 -21476 -12169 13821 1696 4914
7120 4914 8143 22716 7407 10528 9931 4250 -3654 -750 -9621 -29316 -20831 -18086 3836 28826
$$ packed form
7211F948o832q782Q551N458j483m088j3157j9597L462J3133q463k4850m519J9549
7197c4670K2861k185n235k093k570j09j4329J1329J5880q359M553Q763l860j5509
7183b5533J4590K4690J5729n150J171j7398n212J6123n804K2879k9575m2797p504
7170d3791J7571n906k102N238q053K983J1471j6322j9337j9099K2144j2079K0909
7157d6373L4566J1896j0495R247j8405k3258l101R032k4486j4597Q582M3628J0124
7144a3640k349J3654L1064R354l7028l4803j2953k4796K455K7217k0015j7691
7132g9531J7000K3174J2461Q321J0289j7704K0602j6088R307K5990j2125L218
7120D914L229J4573j5309L121n97n681p904K904q871j9695Q485K745K1922K4990
$$ plain form
7106 28826 -3370 -22394 -29316 -29452 -43283 -39163 -32413 -32764 -48335 -48850 -24310 -22932 -2510 5964
7092 5964 -3288 -28710 -19616 -21838 -40470 -41235 -19798 -11585 -10947 -15594 -17225 -33163 -33610 -24529 -19989
7077 -19989 -51868 -65712 -71467 -90710 -67226 -43095 -24413 -14024 -21453 -20391 -7867 662 944
7064 944 -5860 -5935 -9510 -33670 -46672 -42428 -19923 3593 7060 12845 2181 -8642 -21808 -10351
7050 -10351 -338 9332 26222 4858 -17948 -2092 1990 -6153 4151 10951 8977 -12865 -14563
7037 -14563 -13386 -43808 -56188 -55776 -28453 -19588 -16465 -6655 20992 12832 -5165 11229 34571
7024 34571 36676 19595 5638 8628 -18161 -9631 5891 -13954 -70051 -91571 -76990 -66203
7012 -66203 -33982 -34408 -38626 -51192 -43764 -47319 -58967 -56415 -44464 -20498 -2115 4663 -19543
$$ packed form
7106B8826l2196j9024o922j36j3831M120O750l51j5571n15K4540J378K0422Q474
7092E964r252k5422R094k222j8632p65K1437Q213O38m647j631j5938m47R081M540
7077a9989l1879j3844n755j9243K3484K4131J8682J0389p429J062J2524Q529K82
7064I44o804p5l575k4160j3002M244K2505K3516L467N785j0664j0823j3166J1457
7050a0351J0013R670J6890k1364k2806J5856M082q143J0304O800j974k1842j698
7037a4563J177l0422j2380M12K7323Q865L123R810K7647q160j7997J6394K3342
7024C4571K105j7081j3957K990k6789Q530J5522j9845n6097k1520J4581J0787
7012f6203L2221m26m218j2566P428l555j1648K552J1951K3966J8383O778k4206
$$ plain form
6999 -19543 -30218 -41486 -48095 -64934 -39114 -17173 -3941 19872 46057 70068 55895 42025
6987 42025 40223 12849 -5322 -6806 10124 13267 -26684 -27778 1944 14066 17463 31134 46892
6974 46892 24753 10460 19369 1377 3395 27883 42520 28360 3108 -838 -29549 -30452 -1766
6961 -1766 3140 -6316 -22739 -34533 -50388 -57508 -36640 -686 22007 1314 -4881 22028 21786
6948 21786 14137 5615 3878 -15590 -9201 694 -20407 -37594 -17535 -12134 -36221 -62813 -90572
6935 -90572 -74011 -58393 -27663 -33833 -41731 -8307 22999 36873 19646 -4990 -20462 -20805 -24161
6922 -24161 -25706 -12164 -17985 -43845 -46165 -60919 -57219 -22624 2080 8857 -6705 -1546 330
6909 330 -17777 -10376 -7410 14310 3325 -12635 -7564 -15282 -5475 7863 -8778 -18790 -35998
$$ packed form
6999a9543j0675j1268o609j6839K5820K1941J3232K3813K6185K4011j4173j3870
6987D2025j802k7374j8171j484J6930L143l9951j094K9722J2122L397J3671J5758
6974D6892k2139j4293Q909j7992K018K4488J4637j4160k5252l946k8711r03K8686
6961a766M906r456j6423j1794j5855p120K0868L5954K2693k0693o195K6909k42
6948B1786p649q522j737j9468O389R895k1101j7187K0059N401k4087k6592k7759
6935i0572J6561J5618L0730o170p898L3424L1306J3874j7227k4636j5472l43l356
6922b4161j545J3542n821k5860k320j4754L700L4595K4704O777j5562N159J876
6909C30j8107P401K966K1720j0985j5960N071p718R807J3338j6641j0012j7208
$$ plain form
6896 -35998 -38232 -16954 -11531 -21281 -15889 -18086 -13543 -36226 -41708 -9355 12999 15425 -11553
6883 -11553 -49922 -56096 -34048 -18968 2585 18699 7489 3095 8216 -11226 -24491 -11485
6871 -11485 -631 -13127 -26970 -26761 -27172 -28422 1674 21126 18363 14467 52185 57139 19912
6858 19912 -37101 -48665 -36190 -56923 -66424 -59592 -54847 -55312 -27220 -25347 -19284 -11159 8526
6845 8526 7319 16096 -1272 1345 1474 26119 -1658 -40496 -50439 -26771 1913 9879 -805
6832 -805 7665 39157 56698 30667 -459 -10156 -21263 -1743 19229 34764 52860 52391 53776
6819 53776 52242 50050 28298 23607 8284 -4314 -8392 -172 -22760 -15600 7573 -27254 -66162
6806 -66162 -77744 -80316 -60881 6861 14856 -35133 -50589 -36259 -3818 -7043 -10804 -16392 -23933
$$ packed form
6896c5998k234K1278N423r750N392k197M543k2683n482L2353K2354K426k6978
6883a1553l8369o174K2048J5080K1553J6114j1210m394N121j9442j3265J3006
6871a1485J0854j2496j3843K09m11j250L0096J9452k763l896L7718M954l7227
6858A9912n7013j1564J2475k0733r501O832M745m65K8092J873O063Q125J9685
6845H526j207Q777j7368K617J29K4645k7777l8838r943K3668K8684P966j0684
6832h05Q470L1492J7541k6031l1126r697j1107J9520K0972J5535J8096m69J385
6819E3776j534k192k1752m691j5323j2598m078Q220k2588P160K3173l4827l8908
6806f6162j1582k572J9435O7742P995m9989j5456J4330L2441l225l761n588p541
$$ plain form
6793 -23933 -6801 13336 18343 -17468 -35073 -34327 -52780 -56363 -27171 -12099 -11423 -13329 -19299
6780 -19299 -29129 -11951 -8648 -4019 12450 -15174 -34081 -27471 -29704 -30022 10539 5015 13133 6418
6766 6418 -28579 -53857 -4091 19466 -1229 -4858 -28852 -10753 -26459 -57096 -22501 -2969
6754 -2969 -7097 4409 -12714 -27719 -9513 -753 21121 28722 -2245 3338 2372 4076 17737
6741 17737 38699 13983 -11438 -9736 20573 40601 35232 14289 15863 24710 9027 -18913 -11382
6728 -11382 -2250 -19916 7760 34612 30589 11417 35181 27377 21653 14377 13580 -19569 -48668
6715 -48668 -33532 -17381 -10629 3592 22631 8378 15904 19390 -692 1857 5050 -2310 6895
6702 6895 19432 11873 18913 7717 23784 21274 -1477 28930 37671 8911 -21209 -40259 -36262
$$ packed form
6793b3933J7132K0137N007l5811j7605P46j8453l583K9192J5072O76j906n970
6780a9299r830J7178L303M629J6469k7624j8907O610k233l18M0561n524Q118o715
6766F418l4997k5278M9766K3557k0695l629k3994J8099j5706l0637L4595J9532
6754b969m128J1506j7123j5005J8206Q760K1874P601l0967N583r66J704J3661
6741A7737K0962k4716k5421J702L0309K0028n369k0943J574Q847j5683k7940P531
6728a1382R132j7666K7676K6852m023j9172K3764p804n724p276p97l3149k9099
6715d8668J5136J6151O752J4221J9039j4253P526L486k0082K549L193p360R205
6702F895J2537p559P040j1196J6067k510k2751L0407Q741k8760l0120j9050L997
$$ plain form
6689 -36262 -4397 4062 2498 35221 45371 24282 532 -7562 -20597 -30453 -19071 -10147 -14538
6676 -14538 -20883 -18495 -14964 -13404 -11566 -8423 8561 -5328 -17756 -3775 21864 13438 18295
6663 18295 19869 7140 25004 37431 36698 7558 7397 -843 -5908 -16791 -12795 -20950 11266 23907
6649 23907 28994 645 -7376 -24556 -38760 -55883 -45491 -21902 1636 -1361 -30189 -22986 -13469
6636 -13469 10289 -2202 -31518 -12712 -5300 -23734 -52529 -47282 -8276 37682 34883 -2149
6624 -2149 -28275 -25545 -17461 -17231 -20289 -8423 30032 49899 12968 -17637 -17278 -21360 -17099 -6173
6610 -6173 -9944 -8624 -14320 2327 -4499 -18551 -16404 12360 26406 8815 -24327 -69682 -63026
6597 -63026 -28037 8806 16957 -19681 -24278 -16547 -8189 -8284 -13041 -12539 -7044 4728 -19603 -15089
$$ packed form
6689c6262L1865Q459j564L2723J0150k1089k3750q094j3035r856J1382Q924m391
6676a4538o345K388L531J560J838L143J6984j3889j2428J3981K5639q426M857
6663A8295J574j2729J7864J2427p33k9140j61q240n065j0883L996q155L2216J2641
6649B3907N087k8349q021j7180j4204j7123J0392K3589K3538k997k8828P203R517
6636a3469K3758j2491k9316J8806P412j8434k8795N247L9006M5958k799l7032
6624b149k6126K730Q084K30l058J1866L8455J9867l6931l0605L59m082M261J0926
6610f173l771J320n696J6647o826j4052K147K8764J4046j7591l3142m5355O656
6597f3026L4989L6843Q151l6638m597P731Q358r5m757N02N495J1772k4331M514
$$ plain form
6583 -15089 -21353 -42851 -41253 -24994 -38592 -33455 -38394 -38776 -25270 -4553 1510 9036 14532 34701
6569 34701 41221 -3891 -7243 31467 32939 27114 19680 18487 22674 359 -36602 -25928 -26436 -30926
6555 -30926 -42731 -36417 -17018 -33801 -41405 -9953 24759 5082 -26588 -39409 -1962 14409
6543 14409 -7079 -13686 -14624 -17802 -30066 -44580 -16063 19075 15532 -11185 15981 13888 -18216
6530 -18216 -27165 -34085 -51988 -30416 -8395 -6908 -8620 -20362 -19503 10436 15018 2380 -28864
6517 -28864 -43170 -44009 -18179 -4442 -6349 -5736 -1395 -12101 -8720 8080 6278 -20199 -12891 536
6503 536 -5389 -7905 -25367 -24496 -9344 -31968 -82780 -68752 -78733 -65503 -34131 -9401 7953
6490 7953 18216 11991 -27672 -49470 -47414 -21164 -3252 34054 38707 15498 -1437 -741 -5133
$$ packed form
6583a5089o264k1498J598J6259j3598N137m939l82J3506K0717O063P526N496K0169
6569C4701O520m5112l352L8710J472n825p434j193M187k2315l6961J0674n08m490
6555c0926j1805O314J9399j6783p604L1452L4712j9677l1670j2821L7447J6371
6543A4409k1488o607r38l178j2264j4514K8517L5138l543k6717K7166k093l2104
6530a8216q949o920j7903K1572K2021J487j712j1742Q59K9939M582j2638l1244
6517b8864j4306q39K5830J3737j907O13M341j0706L381J6800j802k6477P308J3427
6503E36n925k516j7462Q71J5152k2624n0812J4028r981J3230L1372K4730J7354
6490G953J0263o225l9663k1798K056K6250J7912L7306M653k3209j6935O96m392
$$ plain form
6477 -5133 -16269 -17089 -28201 -15230 -5351 3562 14695 17346 -3129 -4444 -12988 -27423 -22794 1628
6463 1628 36852 31318 17530 27395 9808 -13914 -21200 -22797 -8287 3397 1158 5768 -18505
6450 -18505 -848 2460 -20088 -39239 -28132 -16636 -18329 -22164 -14287 -36485 -29048 10939 32902
6437 32902 22799 -1075 -1214 -5427 3771 3015 -4741 15189 47889 35122 -2677 -26197 -30729
6424 -30729 -49144 -47907 -29183 -13810 -15791 -41836 -54081 -64847 -54843 -40494 -17521 -1558
6412 -1558 -11356 -25489 -32208 -26114 -39300 -41044 -45071 -54776 -37105 -25182 -25205 -24628 2252 30840
6398 30840 39541 -8862 -29984 -33869 -18405 1179 -13070 -34281 -28985 6904 17107 5510
6386 5510 9604 6764 10049 10027 12387 13528 25231 39737 25128 17660 10820 -6375 -15731 -10475
$$ packed form
6477e133j1136q20j1112J2971R879Q913J1133K651k0475j315q544j4435M629K4422
6463A628L5224n534j3788R865j7587k3722p286j597J4510J1684k239M610k4273
6450a8505J7657L308k2548j9151J1107J1496j693l835P877k2198P437L9987K1963
6437C2902j0103k3874j39m213R198p56p756J9930L2700j2767l7799k3520m532
6424c0729j8415J237J8724J5373j981k6045j2245j0766J0004J4349K2973J5963
6412a558r798j4133o719O094j3186j744m027r705J7671J1923k3N77K6880K8588
6398C0840Q701m8403k1122l885J5464J9584j4249k1211N296L5889J0203j1597
6386E510M094k840L285k2K360J141J1703J4506j4609p468o840j7195r356N256
$$ plain form
6372 -10475 -16844 -11016 7978 27103 34383 23881 713 -24788 -284 1605 -12059 -16491 -12840
6359 -12840 7721 17281 8482 -14832 -33736 -40646 -32539 -24605 -3061 17975 4763 -18092 -9351
6346 -9351 -17434 -15510 3678 -14811 -12540 -2047 9282 14647 18910 5679 861 -1279 -14706
6333 -14706 -11306 -11389 -26336 -40850 -51559 -28769 8463 15244 -10824 -48156 -42209 -5730 -12154
6320 -12154 -4624 0 -11735 -19167 -1947 -2165 -27025 -16289 -25264 -22928 -9591 -8144 2125
6307 2125 5822 742 10166 1494 -4434 15622 21698 31291 26066 23628 22337 -10493 -24512 -15758
6293 -15758 13047 17802 -7181 -30379 -36403 -26788 -20314 -15330 24432 39799 64677 54945 28275
6280 28275 42989 57100 41227 19224 33654 24469 25336 28170 -836 -30446 -17351 -863 -18802
$$ packed form
6372a0475o369N828J8994J9125P280j0502k3168k5501K4504J889j3664m432L651
6359a2840K0561R560q799k3314j8904o910Q107P934K1544K1036j3212k2855Q741
6346i351q083J924J9188j8489K271J0493J1329N365M263j3231m818k140j3427
6333a4706L400q3j4947j4514j0709K2790L7232O781k6068l7332N947L6479o424
6320a2154P530M624j1735p432J7220k18k4860J0736q975K336J3337J447J0269
6307B125L697n080R424q672n928K0056O076R593n225k438j291l2830j4019Q754
6293a5758K8805M755k4983k3198o024R615O474M984L9762J5367K4878r732k6670
6280B8275J4714J4111j5873k2003J4430r185Q67K834k9006k9610J3095J6488j7939
$$ plain form
6267 -18802 -27962 -14781 333 -13459 -6539 -12323 -27871 -23444 -16498 -6398 -24899 -19364 -12742
6254 -12742 -10975 -8809 -5032 -9536 -21397 -13125 -10267 -3174 23378 16833 -2053 14975 13433 -18553
6240 -18553 -35183 -35463 -31478 -14191 8037 12733 8666 23731 18290 18740 15124 18942 20199 4116
6226 4116 11609 35747 11176 4705 -11481 -2997 8938 27439 22831 1516 14459 21762 5526
6213 5526 -21253 1889 22986 36404 43243 33725 -5226 -5635 4727 13758 34855 41477 35941
6200 35941 24938 21242 1306 6469 -4555 -24898 -26413 -1492 16249 42900 36092 24076 18696
6187 18696 9300 10673 2513 -16784 -48766 -54614 -34379 -14306 -20384 -20516 -9339 2112 22643
6174 22643 -4872 -17526 -11396 -21772 -12288 -1153 2482 -9067 -14451 1541 9048 11169 16546
$$ packed form
6267a8802r160J3181J5114j3792O920n784j5548M427O946J0100j8501N535O622
6254a2742J767K166L777m504j1861Q272K858P093K6552o545j8886J7028j542l1986
6240a8553j6630k80L985J7287K2228M696m067J5065n441M50l616L818J257j6083
6226D116P493K4138k4571o471j6186Q484J1935J8501m608k1315J2943P303j6236
6213E526k6779K3142K1097J3418O839r518l8951m09J0362R031K1097O622n536
6200C5941j1003l696j9936N163j1024k0343j515K4921J7741K6651o808j2016n380
6187A8696r396J373q160j9297l1982n848K0235K0073o078j32J1177J1451K0531
6174B2643k7515j2654O130j0376R484J1135L635j1549n384J5992P507K121N377
$$ plain form
6161 16546 14257 8376 18952 -7139 -8980 13069 17048 11217 -7040 -11656 3365 15561 19665
6148 19665 25221 42703 52370 35792 19663 6944 -3049 -14070 -17544 -22369 -19661 -10488 -36994
6135 -36994 -35903 -34100 -48569 -49214 -43808 -43607 -37506 -25070 2799 15619 -5637 5100 -2255 -16864
6121 -16864 -13211 -1084 1181 514 -8616 -36960 -48314 -28216 -18723 -2726 -22571 -39143 -35687
6108 -35687 -39574 -47614 -48563 -36859 -37985 -26801 3156 27571 20269 4225 -26774 -46520 -49216
6095 -49216 -39579 -23451 -25699 -26301 -23521 -4482 3398 -4761 -25927 -52893 1367 9484 18527 22230
6081 22230 24538 5902 -4792 -20194 -15754 -33277 -24727 -4448 -7393 -13604 -3094 6468 -14648
6068 -14648 -15946 8126 5988 1439 17699 35920 34201 27966 34266 38895 46124 14858 -677
$$ packed form
6161A6546k289n881J0576k6091j841K2049L979n831j8257m616J5021J2196M104
6148A9665N556J7482R667j6578j6129j2719r993j1021l474m825K708R173k6506
6135c6994J091J803j4469o45N406K01O101J2436K7869J2820k1256J0737p355j4609
6121a6864L653J2127K265o67r130k8344j1354K0098R493J5997j9845j6572L456
6108c5687l887q040r49J1704j126J1184K9957K4415p302j6044l0999j9746k696
6095d9216R637J6128k248o02K780J9039P880q159k1166k6966N4260Q117R043L703
6081B2230K308j8636j0694j5402M440j7523Q550K0279k945o211J0510R562k1116
6068a4648j298K4072k138m549J6260J8221j719o235O300M629P229l1266j5535
$$ plain form
6055 -677 19950 26638 -19236 -18399 12271 35973 38557 9691 -21136 -44918 -6598 -4857 -12644
6042 -12644 -41338 -25228 -3718 -678 11152 14608 21826 30935 15452 -3958 357 1524 11623
6029 11623 11880 685 -21616 -28827 -65371 -56845 -34327 -22278 -12252 11497 10130 -5527 -17765
6016 -17765 -29633 -38326 -53125 -35209 -27162 -14983 -3547 -29291 -23374 -36103 -66530 -54449
6004 -54449 -22838 -7943 -18853 -10877 -8574 -25467 -35033 -4108 -14216 -30677 -24578 -7328 -2283
5991 -2283 -2047 2786 6736 22582 49026 41025 -1466 -8649 -8446 -42410 -37570 -27944 -65867 -55194
5977 -55194 -33202 -39467 -30947 -31305 -37178 -844 20281 -5627 -21958 5329 33784 58324 53856
5964 53856 17772 -15315 -27162 -39287 -39256 -5722 4850 2464 -15475 -6692 -1256 -15990 -35202
$$ packed form
6055f77K0627O688m5874Q37L0670K3702K584k8866l0827k3782L8320J741p787
6042a2644k8694J6110K1510L040J1830L456P218R109j5483j9410M315J167J0099
6029A1623K57j1195k2301p211l6544Q526K2518J2049J0026K3749j367j5657j2238
6016a7765j1868q693j4799J7916Q047J2179J1436k5744N917j2729l0427J2081
6004e4449L1611J4895j0910P976K303j6893r566L0925j0108j6461O099J7250N045
5991b283K36M833L950J5846K6444q001m2491p183K03l3964M840R626l7923J0673
5977e5194K1992o265Q520l58n873L6334K1125k5908j6331K7287K8455K4540m468
5964E3856l6084l3087j1847j2125L1L3534J0572k386j7939Q783N436j4734j9212
$$ plain form
5951 -35202 -44026 -8047 -20334 -23565 -5389 -25937 -16905 -8322 -7130 -20868 -3464 8674 27044
5938 27044 18053 -1747 -15338 7921 8152 15354 8979 6649 30267 43176 29486 16821 14274
5925 14274 11925 597 -15730 -9499 -59183 -59269 -22159 -9738 -15329 -15527 -9841 -21474 -25306 -29810
5911 -29810 -61754 -65734 -51185 -39064 -27206 -1964 21507 23929 1716 -26986 -43387 -28547
5899 -28547 -16541 -37966 -32066 -22092 -31106 -49053 -41981 -41440 -45768 -23837 -7512 -20327 -37604
5886 -37604 -32833 649 -8510 -8251 8127 14408 1954 -17538 -12972 5146 -10900 -27426 -26954
5873 -26954 3393 17017 -4945 -29703 -66649 -74796 -66387 -32743 -8365 -16414 -19755 -25409 -29324
5860 -29324 -23248 -15190 -24153 -16044 -8509 9628 20684 45707 45775 57507 29607 15574 -24492
$$ packed form
5951c5202q824L5979j2287l231J8176k0548R032Q583J192j3738J7404J2138J8370
5938B7044q991j9800j3591K3259K31P202o375k330K3618J2909j3690j2665k547
5925A4274k349j1328j6327O231m9684q6L7110J2421n591j98N686j1633l832m504
5911b9810l1944l980J4549J2121J1858K5242K3471K422k2213k8702j6401J4840
5899b8547J2006k1425N900R974r014j7947P072N41m328K1931J6325j2815j7277
5886c7604M771L3482r159K59J6378O281j2454j9492M566J8118j6046j6526M72
5873b6954L0347J3624k1962k4758l6946q147Q409L3644K4378q049l341n654l915
5860b9324O076Q058q963Q109P535J8137J1056K5023O8J1732k7900j4033m0066
$$ plain form
5847 -24492 -44241 -63583 -82940 -69891 -37936 -22723 -15422 -6405 -14185 -5171 6820 -7914 -18556
5834 -18556 -24426 -12693 -9889 -12548 -5787 -7483 -4336 -4610 -12788 -18580 -14102 2019 -10747 -19611
5820 -19611 -19299 -17724 -4131 17812 17649 -16239 -10171 1299 -38379 -44336 -27504 -38060 -56885
5807 -56885 -47884 -35231 -12542 22401 17104 3959 -18515 -18496 -30217 -31944 -20158 -36355 -50175
5794 -50175 -25702 -5789 -15889 -47605 -40835 -12231 -12013 7238 22019 26513 -2327 9933 39225
5781 39225 65015 59799 32676 20738 16677 29121 41172 23551 -15060 -21590 -10293 -4297 -11627
5768 -11627 9235 36538 16979 25388 32277 2006 -17937 -4230 -2086 -11702 -8729 4833 8604
5755 8604 6610 -11445 -16816 -6505 -25519 -48076 -56687 -30714 -29705 -5228 -21209 6810 24425
$$ packed form
5847b4492j9749j9342j9357J3049L1955J5213P301R017p780R014J1991j4734j0642
5834a8556n870J1733K804k659O761j696L147k74q178n792M478J6121j2766q864
5820a9611L12J575J3593K1943j63l3888O068J1470l9678n957J6832j0556j8825
5807e6885R001J2653K2689L4943n297j3145k2474J9j1721j727J1786j6197j3820
5794e0175K4473J9913j0100l1716O770K8604K18J9251J4781M494k8840J2260K9292
5781C9225K5790n216k7123j1938m061J2444J2051j7621l8611o530J1297N996p330
5768a1627K0862K7303j9559Q409O889l0271j9943J3707K144r616K973J3562L771
5755H604j994j8055n371J0311j9014k2557q611K5973J009K4477j5981K8019J7615
$$ plain form
5742 24425 -15569 -23680 2315 -5017 -29414 -44580 -28980 -12906 3411 21925 18600 35098
5730 35098 52012 27903 20123 27460 13202 -10960 -11479 -17033 -8639 -15830 -31039 -27659 810
5717 810 15857 -11441 -24778 -13285 7206 4598 -5148 -6269 7376 26872 17341 -5594 -1898
5704 -1898 33093 46313 15333 -16141 -19206 1260 26352 31571 19599 10320 -14105 -7754 14488
5691 14488 1831 -9768 11855 15889 4724 14113 16911 9518 -9765 -2900 -601 -8872 10463
5678 10463 6673 -4927 720 5567 -8915 -20072 -22387 -28167 -35771 -42595 -40616 -42150 -37440 -15920
5664 -15920 -10060 -28190 -33094 -24202 -15917 -17351 3721 1345 -146 -3925 -9421 -11224 -6225 -12740
5650 -12740 -23895 -16301 -4934 -6416 3853 22320 11437 -17374 -7956 -12095 12716 27230 33571
$$ packed form
5742B4425l9994q111K5995p332k4397j5166J5600J6074J6317J8514l325J6498
5730C5098J6914k4109p780P337j4258k4162n19n554Q394p191j5209L380K8469
5717H10J5047k7298j3337J1493K0491k608r746j121J3645J9496r531k2935L696
5704a898L4991J3220l0980l1474l065K0466K5092N219j1972r279k4425O351K2242
5691A4488j2657j1599K1623M034j1165R389K798p393j9283O865K299q271J9335
5678A0463l790j1600N647M847j4482j1157k315n780p604o824J979j534M710K1520
5664a5920N860j8130m904Q892Q285j434K1072k376j491l779n496j803M999o515
5650a2740j1155P594J1367j482J0269J8467j0883k8811R418m139K4811J4514O341
$$ plain form
5637 33571 53177 65479 41077 20441 28599 41259 30131 6161 -22886 -31508 -27636 10514
5625 10514 33591 28904 -9420 -23050 -61885 -86628 -67021 -62524 -30258 6572 -12636 -25858
5613 -25858 -25192 -32489 -14244 -10528 -17280 -7302 -17398 -13009 -19192 -10312 -1498 1951 -3138 -27379
5599 -27379 -21216 -10177 -18084 -2871 8674 10379 -3430 -31805 -29491 -14753 -25452 -44275 -40787
5586 -40787 -46708 -38205 -11414 -704 -15414 -6995 -12449 -34619 -46333 -43200 -38267 -48450 -27975
5573 -27975 -23381 -18791 6029 12162 -31832 -23972 4640 -10831 -21771 -8746 -39767 -42637 -28893
5560 -28893 -20727 -16422 -16330 -4068 -14436 -29168 -9584 -4157 -22328 -12922 5544 -15200 -39842
5547 -39842 -13088 -4237 -29421 -32451 -25211 -800 10485 22679 16674 -12367 -14940 -34605 -50052
$$ packed form
5637C3571J9606J2302k4402k0636Q158J2660j1128k3970k9047q622L872L8150
5625A0514K3077m687l8324j3630l8835k4743J9607M497L2266L6830j9208j3222
5613b5858O66p297J8245L716o752R978j0096M389o183Q880Q814L449n089k4241
5599b7379O163J1039p907J5213J1545J705j3809k8375K314J4738j0699j8823L488
5586d0787n921Q503K6791J0710j4710Q419n454k2170j1714L133M933j0183K0475
5573b7975M594M590K4820O133m3994P860K8612j5471j0940J3025l1021k870J3744
5560b8893Q166M305R2J2262j0368j4732J9584N427j8171R406J8466k0744k4642
5547c9842K6754Q851k5184l030P240K4411J1285J2194o005k9041k573j9665j5447
$$ plain form
5534 -50052 -16655 -3554 -4704 -29035 -15671 -7959 10604 37354 12393 20024 26205 3764 3156
5521 3156 -6609 -31691 -31085 -46178 -42508 -17341 -3788 -313 -3548 -7363 -44351 -47098 -38815 -15171
5507 -15171 -7105 -17953 -8858 2870 -21321 -21465 -6475 -2709 -37717 -23202 -52 -16905 -36085
5494 -36085 -18616 -17497 -3087 15462 5236 -315 10622 19749 21933 7431 -30936 -38941 -5007
5481 -5007 10038 4535 26833 19984 23262 -3700 -28351 -30348 -19473 -12239 -22890 -41950 -42129
5468 -42129 -28756 -24342 -1673 2949 -16177 -21960 -9125 -4310 -20358 -1979 13115 19421 11477
5455 11477 -32557 -23106 5143 15905 31520 1963 -14862 -5787 -13656 -16311 -28390 -47453 -23161
5442 -23161 -24630 -36451 -37642 -12525 10818 -7331 10744 12043 13793 28695 30214 23576 -870
$$ packed form
5534e0052L3397J3101j150k4331J3364P712J8563K6750k4961P631O181k2441o08
5521C156r765k5082O06j5093L670K5167J3553L475l235l815l6988k747Q283K3644
5507a5171Q066j0848R095J1728k4191j44J4990L766l5008J4515K3150j6853j9180
5494c6085J7469J119J4410J8549j0226n551J0937R127K184j4502l8367q005L3934
5481e007J5045n503K2298o849L278k6962k4651j997J0875P234j0651j9060j79
5468d2129J3373M414K2669M622j9126n783J2835M815j6048J8379J5094O306p944
5455A1477m4034R451K8249J0762J5615k9557j6825R075p869k655j2079j9063K4292
5442b3161j469j1821j191K5117K3343j8149J8075J299J750J4902J519o638k4446
$$ plain form
5429 -870 -18786 -36780 -14794 12968 20289 22909 14654 10348 2209 -7211 -19158 -25630 -22874 -13409
5415 -13409 -21834 -23793 -53782 -76915 -66436 -38076 -10518 -4970 -881 -17534 -26875 -27795 -30209
5402 -30209 -9958 16803 5254 6138 -4369 -5535 14216 37715 29100 1151 -33213 -15925 15351
5389 15351 39523 46652 39126 30685 21325 -4968 -13102 -12311 8465 30332 30488 15927 8563 13924
5375 13924 8925 4280 33390 48878 26671 7757 -11319 -33710 -26676 -11097 2705 -4957 -23623
5362 -23623 -13712 2740 5642 17205 37306 32917 3935 -10529 -8260 -4133 21608 47525 39516
5349 39516 6894 12261 27320 3484 -33895 -41315 -44077 -36924 -28407 -20135 -5540 3284 -26335
5336 -26335 -43123 -35341 -32932 -25186 -23507 -21496 24267 38575 28193 11441 -19038 -25740 -27654
$$ packed form
5429h70j7916j7994K1986K7762P321K620q255m306q139r420j1947o472K756R465
5415a3409q425j959k9989k3133J0479K8360K7558N548M089j6653r341r20k414
5402c0209K0251K6761j1549Q84j0507j166J9751K3499q615k7949l4364J7288L1276
5389A5351K4172P129p526q441r360k6293q134P91K0776K1867J56j4561p364N361
5375A3924m999m645K9110J5488k2207j8914j9076k2391P034J5579J3802p662j8666
5362b3623R911J6452K902J1563K0101m389k8982j4464K269M127K5741K5917q009
5349C9516l2622N367J5059k3836l7379p420k762P153Q517Q272J4595Q824k9619
5336b6335j6788P782K409P746J679K011M5763J4308j0382j6752l0479o702j914
$$ plain form
5323 -27654 -7469 32425 67374 48566 17448 23 6948 8944 -15613 -18231 -24326 -12413 47
5310 47 3332 -1206 -22452 -23580 4034 4115 -10998 -16238 -42943 -32851 -11457 -22213 -13609 -1517
5296 -1517 13164 22657 14464 -14801 -5260 9868 24644 5085 -6390 -11734 -1447 3912 -22289
5283 -22289 -4839 -25814 -37914 -32214 -13745 15633 10276 12859 21660 22672 10251 8165 27130
5270 27130 28303 27436 4881 3497 23266 39783 27760 51140 53694 28399 29323 13781 -29386
5257 -29386 -39886 -10365 25937 15370 -17679 -11896 -12350 3880 7670 1610 8914 1478 -808
5244 -808 -4454 -12936 -29361 -41633 -39988 -5493 5655 -29021 -46319 -40319 4941 46896 49084
5231 49084 27205 12359 2153 -6175 -4381 -3507 -8743 -9172 20771 20216 -17441 -17523 -31384 -32311 -32252
$$ packed form
5323b7654K0185L9894L4949j8808l1118j7425O925J996k4557k618o095J1913J2460
5310D7L285m538k1246j128K7614Q1j5113n240k6705J0092K1394j0756Q604J2092
5296a517J4681R493q193k9265R541J5128J4776j9559j1475n344J0287N359k6201
5283b2289J7450k0975j2100N700J8469K9378n357K583Q801J012j2421k086J8965
5270B7130J173q67k2555j384J9769J6517j2023K3380K554k5295R24j5542m3167
5257b9386j0500K9521L6302j0567l3049N783m54J6230L790o060P304p436k286
5244h08l646q482j6425j2272J645L4495J1148l4676j7298O000M5260M1955K188
5231D9084k1879j4846j0206q328J794Q74n236m29K9943n55l7657q2j3861r27N9
$$ plain form
5216 -32252 -40024 -31545 -30198 -25354 -19678 -14687 -5864 2764 10734 -7073 8370 19938 16555 16683
5202 16683 17653 40209 21638 -1922 2282 8432 10288 9395 -1722 -4251 -3516 -16832 -18729 -26290
5188 -26290 -31258 -34927 -44934 -60376 -21188 -6797 -14845 11798 14664 -714 -6943 -7024 -16868 -3815
5174 -3815 6261 -9848 -3191 -5947 17113 14555 20620 44342 32609 25932 33224 43732 24618
5161 24618 10826 -16758 -18120 -3128 -2261 6901 20055 -443 -16714 -32713 -25479 -29118 -42137
5148 -42137 -30699 -13629 6899 34752 25992 20022 -39127 -60467 -51632 -24299 -6112 -4575 -13228
5135 -13228 -37079 -63450 -59379 -54601 -15649 -19265 -20016 -35508 -21657 -15813 -2748 87 24291
5122 24291 47132 46964 32546 18335 17557 13587 10222 -1088 5271 9437 1287 -8531 -10850 -18960
$$ packed form
5216c2252p772Q479J347M844N676M991Q823Q628P970j7807J5443J1568l383J28
5202A6683R70K2556j8571k3560M204O150J856q93j1117k529P35j3316j897p561
5188b6290m968l669j0007j5442L9188J4391q048K6643K866j5378o229q1r844J3053
5174c815J0076j6109O657k756K3060k558O065K3722j1733o677P292J0508j9114
5161B4618j3792k7584j362J4992Q67R162J3154k0498j6271j5999P234l639j3019
5148d2137J1438J7070K0528K7853q760n970n9149k1340Q835K7333J8187J537q653
5135a3228k3851k6371M071M778L8952l616p51j5492J3851N844J3065K835K4204
5122B4291K2841j68j4418j4211p78l970l365j1310O359M166q150r818k319q110
$$ plain form
5108 -18960 -34080 -12061 332 5045 -19314 -26868 -58362 -40448 -20168 6060 28283 19066
5096 19066 435 -12715 -19907 -11826 -5633 -10796 -7573 -29373 1435 15412 -7893 -6782 2523
5083 2523 -8672 -29453 -35306 -6555 8920 8466 13991 -141 -2794 14939 39458 47124 51785
5070 51785 43132 25900 16878 28044 -19246 -34913 -18105 -17807 156 29153 30473 39151 30975
5057 30975 10144 29672 31628 34395 30829 25576 19122 2319 -26928 -16953 -18631 -37652 -21692
5044 -21692 -1247 -8747 -25360 -31031 -9577 -10720 -24291 -34171 -13502 13104 24253 13209 1417
5031 1417 11215 26319 40551 59597 26065 -6546 -20346 -23825 -40153 -23333 -17014 -16048 -5486
5018 -5486 6083 7246 9201 495 25145 13088 26391 27344 43137 36106 20201 10124 -14639
$$ packed form
5108a8960j5120K2019J2393M713k4359p554l1494J7914K0280K6228K2223r217
5096A9066j8631j3150p192Q081O193n163L223k1800L0808J3977k3305J111R305
5083B523j1195k0781n853K8751J5475m54N525j4132k653J7733K4519P666M661
5070E1785q653j7232r022J1166m7290j5667J6808K98J7963K8997J320Q678q176
5057C0975k0831J9528J956K767l566n253o454j6803k9247R975j678j9021J5960
5044b1692K0445p500j6613n671K1454j143j3571r880K0669K6606J1149j1044j1792
5031A417R798J5104J4232J9046l3532l2611j3800l479j6328J6820O319R66J0562
5018e486J1569J163J955q706K4650j2057J3303R53J5793p031j5905j0077k4763
$$ plain form
5005 -14639 -19689 -15566 3227 24823 -2299 -14160 12975 15401 16909 25366 33385 18740 16951
4992 16951 -3892 -30464 -59091 -62782 -26869 -5411 2342 -8047 -44145 -37683 -15432 2464
4980 2464 4833 7910 -26826 -52622 -42824 -27082 -25811 -27127 -40699 -39872 -76700 -81857 -64331 -12622
4966 -12622 -15700 -9998 5354 1787 9911 22986 29601 11115 -28309 -18922 -19922 -36971 -35928
4953 -35928 -41108 -47169 -19122 3122 22165 32733 29124 17798 -80 2612 5553 -2859 -13848
4940 -13848 -25929 -21998 1138 45742 30758 11738 -7954 -42247 -24415 11429 30950 38239
4928 38239 17959 -95 -4833 698 17961 8241 -8401 -35984 -61233 -72923 -57027 -46917
4916 -46917 -39096 -17077 -8663 -5113 -543 3234 38955 25710 15523 -6092 -17244 5216 12480
$$ packed form
5005a4639n050M123J8793K1596k7122j1861K7135K426J508Q457Q019j4645j789
4992A6951k0843k6572k8627l691L5913K1458P753j0389l6098O462K2251J7896
4980B464K369L077l4736k5796R798J5742J271j316j3572Q27l6828n157J7526N1709
4966a2622l078N702J5352l567Q124J3075O615j8486l9424R387j000j7049J043
4953c5928n180o061K8047K2244J9043J0568l609j1326j7878K692K941q412j0989
4940a3848j2081L931K3136M4604j4984j9020j9692l4293J7832L5844J9521P289
4928C8239k0280j8054m738N531J7263r720j6642k7583k5249j1690J5896J0110
4916d6917P821K2019Q414L550M570L777L5721j3245j0187k1615j1152K2460P264
$$ plain form
4903 12480 15423 11413 6611 4227 -12494 13686 34363 11532 5095 7239 11816 15928 7181 4093
4889 4093 -20704 -29049 -8889 -35639 -27385 -3251 21726 10563 -13676 -11022 2397 10355 6414
4876 6414 1864 1972 -12079 -21458 -11026 12369 32326 30928 27431 -9016 -25153 -8728 22317
4863 22317 35884 30164 12403 3036 -12429 -14719 -22636 7003 20208 9789 31166 67474 67351
4850 67351 36161 38084 47802 60738 39951 3062 7962 22420 30141 -8381 -24570 -988 29906
4837 29906 23415 1799 -15509 -5006 35939 49058 56551 41346 -9214 -22361 -47143 -45797
4825 -45797 -50889 -41699 -12528 20581 14998 18576 18442 27052 32726 40620 37842 37753 47636 10501 6799
4810 6799 -5972 -26096 861 34027 20458 19554 34389 24535 22520 -9204 -9183 -7367 -4177 354
$$ packed form
4903A2480K943m010m802k384j6721K6180K0677k2831o437K144M577M112q747l088
4889D093k4797q345K0160k6750Q254K4134K4977j1163k4239K654J3419P958l941
4876F414m550J08j4051r379J0432K3395J9957j398l497l6447j6137J6425L1045
4863B2317J3567n720j7761r367j5465k290p917K9639J3205j0419K1377L6308j23
4850F7351l1190J923R718J2936k0787l6889M900J4458P721l8522j6189K3582L0894
4837B9906o491k1616j7308J0503M0945J3119P493j5205n0560j3147k4782J346
4825d5797n092R190K9171L3109n583L578j34Q610N674P894k778q9R883l7135l702
4810F799j2771k0124K6957L3166j3569r04J4835r854k015l1724K1J816L190M531
$$ plain form
4796 354 4946 11248 31688 47414 46038 22006 12576 5574 -14181 -15097 -16222 -26770 -12634 -25461
4782 -25461 -15143 3982 -17554 -20258 10470 38721 71460 75442 22975 -7653 11014 5711
4770 5711 -10812 -7414 -6532 954 -8796 3579 8074 -10495 -33866 -24999 -14933 -5181 16436 14178
4756 14178 8277 3928 29172 51187 88963 83672 67851 43582 9235 -9696 -32849 -59490
4744 -59490 -50499 -29725 -18490 -3447 -1512 22367 39322 38900 31286 28960 6820 9414 14225
4731 14225 -4593 -3202 -30161 -48403 -8286 -520 -9921 -32062 -19185 -5568 2407 2014 15568
4718 15568 -1187 -12161 -30200 -19525 -1424 15914 29784 1531 -2389 606 14382 7612
4706 7612 -25330 -27144 9547 31388 10034 -6028 -11304 -8935 -7842 -19728 -11880 -4767 -36863
$$ packed form
4796C54M592O302K0440J5726j376k4032r430p002j9755r16j125j0548J4136j2827
4782b5461J0318J9125k1536k704L0728K8251L2739L982n2467l0628J8667n303
4770E711j6523L398Q82P486r750J2375M495j8569k3371Q867J0066R752K1617k258
4756A4178n901m349K5244K2015L7776n291j5821k4269l4347j8931k3153k6641
4744e9490Q991K0774J1235J5043J935K3879J6955m22p614k326k2140K594M811
4731A4225j8818J391k6959j8242M0117P766r401k2141J2877J3617P975l93J3554
4718A5568j6755j0974j8039J0675J8101J7338J3870k8253l920K995J3776o770
4706G612l2942j814L6691K1841k1354j6062n276K369J093j1886P848P113l2096
$$ plain form
4693 -36863 -42689 -42248 -20736 -10510 -13101 -21557 3614 14551 10010 12826 2106 -693 8789 20500
4679 20500 220 -17586 8399 20856 12492 -13620 -21178 15416 18085 -17956 -1961 29169
4667 29169 -2215 -9520 9255 1527 -18099 -14012 493 -4131 -8354 20844 56417 57816 21680
4654 21680 19621 38431 22835 2555 4741 -8767 -18668 -31879 -49581 -27093 -22743 -13507 -20562
4641 -20562 -23604 -16860 -27677 -31590 -25027 -5651 16174 -554 -12581 -21133 -23817 -39128 -15402
4628 -15402 -15394 -11237 -18319 -16045 -24461 -29884 -19862 -2113 20367 41427 35276 -13477 -47177 -46169
4614 -46169 -25830 -31601 -35988 -28394 -33689 -39640 -38939 -28144 -47168 -49563 -39217 -25770 -27353 -29210
$$ packed form
4693c6863n826M41K1512J0226k591q456K5171J0937m541K816j0720k799R482J1711
4679B0500k0280j7806K5985J2457q364k6112p558L6594K669l6041J5995L1130
4667B9169l1384p305J8775p728j9626M087J4505m624m223K9198L5573J399l6136
4654B1680k059J8810j5596k0280K186j3508r901j3211j7702K2488M350R236p055
4641b0562l042O744j0817l913O563J9376K1825j6728j2027q552k684j5311K3726
4628a5402QM157p082K274q416n423J0022J7749K2480K1060o151m8753l3700J008
4614d6169K0339n771m387P594n295n951P01J0795j9024k395J0346J3447j583j857
$$ [...]
##END NTUPLES=NMR SPECTRUM
##END=
