##TITLE=Analysis number 322079
Compound Code cc 60346
Book Reference 470/89/1
Project Code adrs
Chemist Name mikem
##JCAMPDX= 6.0         $$ Bruker NMR JCAMP-DX V2.0
##DATA TYPE= NMR SPECTRUM
##DATA CLASS= NTUPLES
##ORIGIN= Bruker BioSpin GmbH
##OWNER= nmr
$$ XWIN-NMR		Version 3.5
$$ Tue Sep 12 12:07:27 2006 GMT Daylight Time (UT+1h)  MAYBRIDGE\nmr@NMR_250MHZ
##.OBSERVE FREQUENCY= 250.131544655141
##.OBSERVE NUCLEUS= ^1H
##.ACQUISITION MODE= SIMULTANEOUS (DQD)
##.ACQUISITION SCHEME= undefined
##.AVERAGES= 16
##.DIGITISER RES= 18
##SPECTROMETER/DATA SYSTEM= dpx250
##.PULSE SEQUENCE= zg30
##.SOLVENT NAME= CDCl3
##.SHIFT REFERENCE= (INTERNAL, CDCl3, 0, 16.522)
##AUDIT TRAIL= $$ (NUMBER, WHEN, WHO, WHERE, WHAT)
$$ ##TITLE= Audit trail, XWIN-NMR		Version 3.5
$$ ##JCAMPDX= 5.01
$$ ##ORIGIN= Bruker BioSpin GmbH
$$ ##OWNER= nmr
$$ C:\u/data/dgb/nmr/ADRS/580/pdata/1/auditp.txt
$$ ##AUDIT TRAIL=  $$ (NUMBER, WHEN, WHO, WHERE, WHAT)
(   1,<2006-09-12 12:07:05.75 +100>,<MAYBRIDGE\nmr>,<NMR_250MHZ>,
      <created by zg, POWCHK disabled, PULCHK disabled
       configuration hash MD5:
       E2 DF 36 D8 04 B2 41 60 5A D7 A3 38 5A 4B D0 FE
       data hash MD5: 64K
       3A 3C 15 B3 F4 38 BC 48 D3 04 F9 5C 3C 68 00 3D>)
(   2,<2006-09-12 12:07:18.28 +100>,<MAYBRIDGE\nmr>,<NMR_250MHZ>,
      <Start of raw data processing
       ef LB = 0.3 FT_mod = 6 PKNL = 1 SI = 32K 
       data hash MD5: 32K
       C5 5A EB CC 5B 28 5D AC 65 CF 41 6A BA DB 68 87>)
(   3,<2006-09-12 12:07:20.19 +100>,<MAYBRIDGE\nmr>,<NMR_250MHZ>,
      <apk 
       data hash MD5: 32K
       BB BC 7B 6C C4 B4 43 4A 89 4E 2F 85 0A D5 BD D2>)
(   4,<2006-09-12 12:07:21.03 +100>,<MAYBRIDGE\nmr>,<NMR_250MHZ>,
      <abs ABSG = 5 
       data hash MD5: 32K
       62 41 63 9F 31 59 5A 20 CF 37 1C 49 D1 8A 05 35>)
$$ ##END=
$$ 
$$ hash MD5
$$ F6 BD C1 ED 00 2B 58 8F F3 0F 88 AE 82 14 9F 85
##$RELAX= 
##$RELAX= 
##$RELAX= 
##$RELAX= 
##$RELAX= 
##$RELAX= 
##$RELAX= 
$$ Bruker specific parameters
$$ --------------------------
##$DU= <C:\u>
##$EXPNO= 580
##$NAME= <ADRS>
##$PROCNO= 1
##$TYPE= <nmr>
##$USER= <dgb>
##$AMP= (0..31)
100 100 100 100 100 100 100 100 100 100 100 100 100 100 100 100 100 100 
100 100 100 100 100 100 100 100 100 100 100 100 100 100 
##$AQSEQ= 0
##$AQ_mod= 3
##$AUNM= <au_zg>
##$AUTOPOS= <44 >
##$BF1= 250.13
##$BF2= 250.13
##$BF3= 250.13
##$BF4= 250.13
##$BF5= 500.13
##$BF6= 500.13
##$BF7= 500.13
##$BF8= 500.13
##$BYTORDA= 1
##$CFDGTYP= 0
##$CFRGTYP= 5
##$CHEMSTR= <none>
##$CNST= (0..31)
1 1 145 1 1 1 1 1 1 1 1 1 1 1 1 1 1 1 1 1 1 1 1 1 1 1 1 1 1 1 1 1 
##$CPDPRG= <>
##$CPDPRG1= <>
##$CPDPRG2= <>
##$CPDPRG3= <>
##$CPDPRG4= <mlev>
##$CPDPRG5= <mlev>
##$CPDPRG6= <mlev>
##$CPDPRG7= <mlev>
##$CPDPRG8= <mlev>
##$CPDPRGB= <>
##$CPDPRGT= <>
##$D= (0..31)
0 1 0 0 0 0 0 0 0 0.06 0 0 0 0 0 0 0.0002 0 0 0 0 0 0 0 0 0 0 0 0 0 0 
0 
##$DATE= 1158059224
##$DBL= (0..7)
120 120 120 120 120 120 120 120 
##$DBP= (0..7)
150 150 150 150 150 150 150 150 
##$DBP07= 0
##$DBPNAM0= <>
##$DBPNAM1= <>
$$ [...]
##$SUBNAM7= <"">
##$SUBNAM8= <"">
##$SUBNAM9= <"">
##$SW= 20.6930455092707
##$SWIBOX= (0..15)
0 0 3 0 0 0 0 0 0 0 0 0 0 0 0 0 
##$SW_h= 5175.983436853
##$TD= 65536
##$TD0= 1
##$TE= 296.16
##$TE2= 300
##$TE3= 300
##$TEG= 300
##$TL= (0..7)
0 120 120 120 120 120 120 120 
##$TP= (0..7)
150 150 150 150 150 150 150 150 
##$TP07= 0
##$TPNAME0= <>
##$TPNAME1= <>
##$TPNAME2= <>
##$TPNAME3= <>
##$TPNAME4= <>
##$TPNAME5= <>
##$TPNAME6= <>
##$TPNAME7= <>
##$TPOAL= (0..7)
0.5 0.5 0.5 0.5 0.5 0.5 0.5 0.5 
##$TPOFFS= (0..7)
0 0 0 0 0 0 0 0 
##$TUNHIN= 0
##$TUNHOUT= 0
##$TUNXOUT= 0
##$USERA1= <user>
##$USERA2= <user>
##$USERA3= <user>
##$USERA4= <user>
##$USERA5= <user>
##$V9= 5
##$VALIST= <valist>
##$VCLIST= <CCCCCCCCCCCCCCC>
##$VD= 0
##$VDLIST= <DDDDDDDDDDDDDDD>
##$VPLIST= <PPPPPPPPPPPPPPP>
##$VTLIST= <TTTTTTTTTTTTTTT>
##$WBST= 1024
##$WBSW= 4
##$XGAIN= (0..3)
0 0 0 0 
##$XL= 0
##$YL= 0
##$YMAX_a= 437029
##$YMIN_a= -491735
##$ZGOPTNS= <>
##$ZL1= 120
##$ZL2= 120
##$ZL3= 120
##$ZL4= 120
##$ABSF1= 16.522
##$ABSF2= -4.171173
##$ABSG= 5
##$ABSL= 3
##$ALPHA= 0
##$AQORDER= 0
##$ASSFAC= 0
##$ASSFACI= 0
##$ASSFACX= 0
##$ASSWID= 0
##$AUNMP= <proc_1d>
##$AZFE= 0.1
##$AZFW= 0.1
##$BCFW= 0
##$BC_mod= 0
##$BYTORDP= 0
##$COROFFS= 0
##$CY= 12.5
##$DATMOD= 1
##$DC= 0
##$DFILT= <>
##$DTYPP= 0
##$F1P= 14.0000005364418
##$F2P= -0.99999901652339
##$FCOR= 0.5
##$FTSIZE= 32768
##$FT_mod= 6
##$GAMMA= 0
##$GB= 0
##$INTBC= 1
##$INTSCL= 1
##$ISEN= 128
##$LB= 0.3
##$LEV0= 0
##$LPBIN= 0
##$MAXI= 10000
##$MC2= 0
##$MEAN= 0
##$ME_mod= 0
##$MI= 0
##$NCOEF= 0
##$NC_proc= -4
##$NLEV= 6
##$NOISF1= 0
##$NOISF2= 0
##$NSP= 0
##$NTH_PI= 0
##$NZP= 0
##$OFFSET= 16.522
##$PC= 1
##$PHC0= 140.4138
##$PHC1= 8.691329
##$PH_mod= 1
##$PKNL= yes
##$PPARMOD= 0
##$PSCAL= 4
##$PSIGN= 0
##$REVERSE= no
##$SF= 250.13
##$SI= 32768
##$SIGF1= 0
##$SIGF2= 0
##$SINO= 400
##$SIOLD= 32768
##$SREGLST= <1H.CDCl3>
##$SSB= 0
##$STSI= 32768
##$STSR= 0
##$SW_p= 5175.98343685301
##$SYMM= 0
##$S_DEV= 0
##$TDeff= 65536
##$TDoff= 0
##$TI= <Analysis number 999999
Compound Code 99
Book Reference 9
Project Code 9>
##$TILT= no
##$TM1= 0
##$TM2= 0
##$TOPLEV= 0
##$USERP1= <user>
##$USERP2= <user>
##$USERP3= <user>
##$USERP4= <user>
##$USERP5= <user>
##$WDW= 1
##$XDIM= 32768
##$YMAX_p= 359747806
##$YMIN_p= -119566
$$ End of Bruker specific parameters
$$ ---------------------------------
##NTUPLES= NMR SPECTRUM
##VAR_NAME=  FREQUENCY,     SPECTRUM/REAL,   SPECTRUM/IMAG
##SYMBOL=    X,             R,               I
##VAR_TYPE=  INDEPENDENT,   DEPENDENT,       DEPENDENT
##VAR_FORM=  AFFN,          ASDF,            ASDF
##VAR_DIM=   32768,         32768,           32768
##UNITS=     HZ,            ARBITRARY UNITS, ARBITRARY UNITS
##FACTOR=    0.157963299565203, 1,           1
##FIRST=     4132.6476996994, 0,             0
##LAST=      -1043.33573715361, 0,           0
##MIN=       -1043.33573715361, -119566,     0
##MAX=       4132.6476996994, 359747806,     0
$$ Real data points
##PAGE= N=1
##DATA TABLE= (X++(R..R)), XYDATA
$$ [...]
16008f52j6860k6162J1457K4006O906k2684l1248j4348Q879M2047J4361k6441
15996c0739j3754J6331J1136m860R206m199j8800O219K6171j2326n025Q085r243
15983b1798N770j3590m5388p701J7642J5122P800R014L1637J5077j0222j9405
15971a6042P249m414j382j2659j227Q525k3056M436N504j7837n026j298K4502
15958c2725K4132j9803L524J6669j054m181k0257p38J298J4080K460j2493J4613
15945a4475k0597j1992R964K389k4416n845M3887l563O459J5916j0191m323R064
15932g723q138l4384k2931j8601K0475M1753J6371j6531J253Q456p727Q639P531
15919a1557k8865j8007Q064J4568j278j1035J860J7639R795N444J2818N009j2050
$$ y = [-652, -17512, -43674, -32217, -8211, -1305, -23989, -55237, -69585, -60706, -18659, -4298, -30739, -44493, -28162, -17026, -21886, -12680, -16879, -35679, -29460, -3289, -15615, -20640, -12555, -21798, -16028, -29618, -75006, -82707, -65065, -49943, -42143, -33129, -1492, 13585, 3363, -16042, -8793, -13207, -14589, -27248, -28475, -19950, -43006, -38570, -33066, -50903, -55929, -57227, -32725, -8593, -28396, -24872, -8203, -9257, -13438, -33695, -34433, -33135, -19055, -16595, -29088, -14475, -35072, -47064, -37100, -34711, -59127, -64972, -21085, -24648, -18189, -2273, -12464, -16787, -7723, -15861, -50245, -73176, -91777, -71302, -29549, -13178, -29709, -28456, -20000, -27727, -19088, -11557, -40422, -58429, -50365, -35797, -37075, -48110, -46250, -28611, -18816, -13372, -554, 4455, -7595]
15906g595J2914J6405j3829l6522j4787J4317J7002r663m165k2161j3583J0078
15894e1589K7353P866k3895J3382J7751J3659j1465l7263l6214J4734J6893K8337
15882b0451N006n463q067o873L182q348R69q44m872j9466j4668K3521j046L671
15868e3749J5663K0374J2641J878P934r740l9868j1823P900q061Q648K4709Q53
15855b2641j987o891J1738q719p269l676k681o332L489M5644J9958j9318q763
15842g448O32j379j2614m478j7993j1918J0509k001N709l994q555J0475L786J470
15828c7799J4496K8395J5920J289k5278k2529l534K6677J6621j6857k2655j664
15816b6918n198j540J3219L211K852J3029J5302l099r307k9461k4085j0790K1675
$$ y = [-7595, 5319, 21724, 7895, -28627, -43414, -29097, -12095, -21758, -25923, -48084, -61667, -51589, -24236, -16370, -40265, -26883, -9132, 4527, -6938, -44201, -80415, -65681, -48788, -20451, -15445, -20908, -28975, -35848, -32666, -41014, -40045, -40889, -45761, -65227, -79895, -56374, -57420, -53749, -38086, -17712, -5071, -3193, 4741, -4999, -44867, -56690, -48790, -56851, -48203, -23494, -22641, -24628, -31519, -19781, -28500, -35769, -39445, -42126, -48458, -44969, 675, 20633, 1315, -7448, -6816, -8195, -20809, -25287, -43280, -55198, -44689, -46690, -40981, -44975, -53530, -43055, -39269, -37799, -23303, 5092, 21012, 22301, -2977, -25506, -29040, -2363, 14258, -2599, -25254, -26918, -32116, -33656, -20437, -17226, -14374, -1345, 13957, 10858, 1551, -27910, -51995, -62785, -41110]
15803d1110K3951j742r769m071O365j5239P261J3413K2527J397j6511k4475P383
15790c0620j4821k435J728M533J5295P542O368l6445o597J5121J5306J0563n711
15777b0173m714k38J2130J377k4936k1136l675k4852j2683O2854K0598q139j4868
15764c8455k697J7672J241J9132R330k7288M18K3107J1183J0029m828m4411l792
15751b9359Q267K7628J495l0758k2382n661O09J5011n01l148J3537J8082N292
15738a888j9682j1620o37O509K1743j2045l4447J1341K4320O454M390j0845P818
15725h589J6537m1118L843k4773j0222J9114L160J6545k3228j6793K5223K5689
15713a4612J1925l093j1151J1592k3775K189K642K5273J7749k2617k8937l690
$$ y = [-41110, -17159, -18901, -28670, -32741, -26376, -41615, -34354, -20941, 1586, 2983, -13528, -38003, -30620, -45441, -47876, -46148, -41615, -26320, -18778, -12410, -48855, -55452, -40331, -25025, -14462, -20173, -24887, -25125, -12995, -11618, -36554, -57690, -61365, -86217, -98900, -36046, -15448, -23587, -38455, -41152, -23480, -22239, -3107, 6223, -21065, -20647, 2460, 13643, 23672, 18844, -25567, -29359, -21092, 6536, 8031, -22727, -45109, -50770, -50161, -35150, -35651, -38799, -25262, -7180, -1888, -21570, -33190, -33827, -27318, -5575, -17620, -52067, -40726, -16406, -9952, -5562, -16407, -8589, 7948, -33170, -29327, -54100, -64322, -45208, -42048, -25503, -48731, -65524, -40301, -14612, -2687, -5780, -16931, -5339, -29114, -26925, -24283, 990, 18739, -3878, -32815, -36505]
15701c6505J1999m12k4374k7852K706J1163J2321J4010l7579Q635M1250J1486
15689a3152k6504l0505r619K4926K7249J8029J8276j365r392k9461J1795J9128
15677e95K7238r386l4339l1290R877J7464k793J6996O258m915k4280K2774M1543
15664C4552q329l1767k8756K8347R940m192j9919j4638J5328L2838Q278K595k4469
15651a92k5942K437j1125j474l417M446K882j3048N734p112J7562l0554p747J3628
15637e3922J457J6613m902j2396P255j5942p933K5408J6379j5664L247P907O2850
15624C0357K6467r482P276m129l4851n617l208p285l39J2447k8088j597l578q291
15610b9918j0386k5175j8722K4414K3636J2230q225M88l496j2220K0249K1642
$$ y = [-36505, -24506, -24918, -49292, -77144, -74438, -63275, -50954, -36944, -74523, -65888, -24638, -13152, -39656, -70161, -79780, -54854, -27605, -9576, 8700, 7335, -2057, -31518, -19723, -595, 26643, 17257, -17082, -48372, -38495, -21031, -23824, -6828, -570, -5485, -29765, -6991, 34552, 26223, -5544, -34300, -5953, 3987, -205, -20124, -34762, -19434, 13404, 21682, 24277, -192, -26134, -23697, -34822, -36296, -39713, -35267, -32385, -45433, -39699, -46811, -29249, -59803, -67550, -53922, -52465, -35852, -40754, -53150, -45895, -61837, -69770, -44362, -27983, -43647, -40400, -32493, 30357, 56824, 47342, 54618, 50489, 15638, 10021, 6813, -472, -811, 11636, -16452, -18049, -21627, -29918, -40304, -65479, -84201, -59787, -36151, -23921, -32146, -31658, -35154, -47374, -27125, -5483]
15598e483o676j0946R342M663K4084j2612j5431J8027P104N919Q258J5517j8664
15585B3102k5749j2039m2821L956J719j0552J4733Q880j0058j1924L507m184r704
15572g1134J1706L575J785j813j3120J9212R560o56j0203j8498j9505L8144K0489
15559c0458p134M555J0679K0783m269M818L031L2613j6840j8062j5465j6061j7234
15546d9044j3403r164K2316J8348J7918L1076K0988n569m0108k8401J6752O643
15534a1648M0811J7095k6391k1420r053j0128j7093m484j2611k6715j8147R575
15522i0209M0492L3256n036J0978j926K2011k1465j8340K9364N922k8161Q198
15510a4916J9254J7743P122k1118k5424J7954J1367r386k1385l4080r489J2695
$$ y = [-5483, -12159, -23105, -13763, -9100, 14984, 2372, -13059, 4968, 12072, 17991, 26249, 41766, 23102, -2647, -14686, -57507, -53551, -51832, -62384, -47651, -38771, -48829, -60753, -57246, -61430, -71134, -59428, -55853, -54068, -55881, -69001, -49789, -40229, -40885, -51088, -69586, -89091, -50947, -30458, -37592, -33037, -22358, -1575, -5844, -1026, 2005, 34618, 17778, -284, -15749, -31810, -49044, -62447, -71611, -49295, -30947, -13029, 18047, 39035, 33466, -6642, -35043, -18291, -11648, 29163, 46258, 19867, -1553, -10606, -20734, -37827, -42311, -54922, -81637, -99784, -90209, -49717, -16461, -21497, -10519, -12445, 9566, -11899, -30239, -875, 5047, -23114, -14916, 4338, 22081, 29203, 8085, -17339, 615, 11982, 2596, -18789, -52869, -62358, -49663]
15498d9663k0671K6252L0095m290k3895q834j5114j5956q53J9472Q507J6217M1682
15485B949J024K968k6169j8658q116p959K0658J0766J9301o843N803K5610j451
15472A9883k1164k2333j6198k256K8162K4215j6016n02p050J914L137j7388j3437
15459c9033J5344l652J1236K2428Q338k8475k4795P720J3476q121J2754J9193
15447F413L351p423j2679J0272k7129j7502J2042N862K1416k442j5819k2740k6598
15434g2976l68p345p669m444J9917J7977K2588j1474n48K5684Q686j8021L197
15421b4796J7821P018N495j9646m700K2606k33R489L2199N783m0780l6912o496
15408c3152J4452k4298J0615J0142J1755m286k3113J0274l3174O360M5673J3543
$$ y = [-49663, -70334, -44082, -13987, -18277, -42172, -51006, -66120, -82076, -82929, -63457, -54950, -38733, 2949, 3973, 6941, -19228, -37886, -46002, -53961, -33303, -22537, -3236, -10079, -4276, 21334, 19883, -1281, -23614, -39812, -42068, -13906, 10309, -5707, -6209, -13259, -11345, -8208, -25596, -39033, -23689, -27341, -16105, 6323, 14661, -13814, -38609, -30889, -17413, -25534, -12780, 6413, 9764, 2341, -10338, -66, -27195, -44697, -32655, -26793, -5377, -7819, -23638, -46378, -72976, -73344, -80689, -88358, -92802, -72885, -54908, -32320, -43794, -44342, -18658, -9972, -27993, -24796, -6975, 43, 5538, -14108, -18808, 3798, 3565, 13054, 45253, 51036, 10256, -26656, -33152, -18700, -42998, -32383, -22241, -10486, -14772, -37885, -27611, -60785, -54425, -8752, 4791]
15396D791j1921L146j1727j5786J3481J6725P558k2628l743R343k388j142O880
15383g411l458m5811l342M4923K0994J4179m214l4843j2766j2218k1610k1049
15371h6626K3587K8013K8322N979j7339j910L5159R816j7209j7145j8087l405
15359c0845r336J051M082M576j0035r21l559L715J1631q692K776O23J7322K2015
15345D403o752k3891L808k2478j8283k9724k621L8479K9688J3166m725Q443J5069
15332D582j4204k1479l881M349k2119L104L1217j192k631k626k497j0349j3622
15319e1348J5323L0229j77l1707p094p691j5855K1137K5181j5089q347K0822j115
15306b5731j3152p029L71O125r854L288K1248q443m147m014j0983M065J3554P683
$$ y = [4791, -7130, -3984, -15711, -31497, -18016, -1291, 6267, -16361, -20104, -10761, -13149, -14291, -7411, -10869, -56680, -60022, -15099, 5895, 20074, 15860, -18983, -31749, -43967, -65577, -86626, -63039, -35026, -6704, -725, -18064, -19974, 15185, 25001, 7792, -9353, -27440, -30845, -40181, -39130, -35048, -30472, -40507, -41428, -44987, -41272, -29641, -38333, -35557, -34934, -17612, 4403, -2349, -26240, -22432, -44910, -63193, -92917, -95538, -57059, -27371, -14205, -18930, -10487, 4582, -9622, -31101, -34982, -30633, -52752, -49648, -18431, -19623, -22254, -24880, -27377, -37726, -51348, -36025, -5796, -5973, -37680, -44774, -52465, -68320, -47183, -22002, -37091, -45438, -24616, -25731, -38883, -45912, -45541, -39416, -49270, -45982, -24734, -33177, -37324, -41338, -52321, -48256, -34702, -27019]
15292b7019K1162J3542j7420N18J4512j0794K651l201j0962M245J0634r016n599
15279a6747O91l03K429J6275J6409j5756j0721K0873n604k9530j1744K4618N828
15266c282o184j1220R365K0297j6756K851j0717q691j581k1523L097m75L1973
15253a2846J798l0246J6329K0872k4058m475p129j1334p016j6501J1334L6672
15241b6600Q343J3330j3096l199N712J5026q206q477p34J1366j5961j8993O946
15228c4543r788K8770J4633m646k5273J6831J6375L110p716J6181j947K239M667
15215A8893r391Q169O58j861m553k1921J1414J2775l473N916p773l2542L922j0397
15201c0164l056L6125J9422q213N087j6831P286j3037l1925j7299P953M0k1348
$$ y = [-27019, -5857, 7685, -9735, -9217, 5295, -5499, -2848, -6049, -17011, -12766, -2132, -11148, -16747, -16056, -16359, -13930, 2345, 18754, 2998, -7723, 13150, 7546, -21984, -33728, -9110, -3282, -9466, -20686, -11321, 8976, -7780, -4929, -15646, -24337, -25918, -47441, -44344, -44819, -12846, -11048, -41294, -24965, -4093, -28151, -32626, -39755, -51089, -58105, -74606, -63272, -26600, -18257, -4927, -18023, -21222, -15510, -484, -8690, -17167, -17901, -6535, -22496, -41489, -34543, -44331, -15561, -928, -5574, -30847, -14016, 2359, 5469, -2247, 13934, 11987, 14226, 18893, 9502, 17671, 18329, 16468, 11915, -10006, 1408, 14183, 10710, 16626, 8853, -23689, -19767, -30164, -33220, 2905, 22327, 14114, 19201, 2370, 9656, -3381, -35306, -52605, -44652, -44612, -65960]
15188f5960p500R761J2015L6695k888M444J207j2799k8021r531K0429M0171R936
15175G959j1970j737R942j929j5249m503L4022J9754o081j6176m0503O629q967
15162b8809k1893m95N053J6391K250j5026J326K5308Q716P302p414q137l639j445
15148b0512P002k6659j1306J7334K1773R238M368j7516L383j6972o530j1425K2237
15135b5585J5001O994n624k3209j2227O274r516j3423K4675K6782k8443k4972
15123f3273L107O450n845K6742R537p713J0521p44q416K273K1568Q999l264k6223
15109b6281J66L3870N955l592l595q686j020K1651L0422P28J0938k4137n949j7654
15095A2816p650k918k215J5363K755r416j4433p883L920J9538N161j9312m2566
$$ y = [-65960, -73460, -63699, -51684, -14989, -17877, -13433, -12226, -25025, -53046, -62577, -42148, -1977, 7959, -4011, -5748, 4194, 2265, -12984, -17487, 16535, 36289, 30208, 14032, -26471, -19842, -28809, -50702, -51197, -46144, -29753, -27503, -42529, -41203, -15895, -7179, 123, -7291, -15428, -19067, -20512, -13510, -40169, -51475, -34141, -12368, -3130, 1238, -16278, -12895, -29867, -36397, -47822, -25585, -10584, -3590, -9214, -32423, -44650, -38376, -47892, -61315, -36640, -9858, -38301, -63273, -60166, -53716, -59561, -32819, -23282, -30995, -20474, -21218, -29634, -27361, -5793, 3206, -58, -26281, -26115, 7755, 13710, 10118, 6523, -2163, -3183, 18468, 48890, 49618, 60556, 36419, 30470, 12816, 5166, 2248, 33, 15396, 18151, 8735, -5698, -13581, -9661, 9877, 15038, -4274, -46840]
15082d6840j5103K1895J8275l52J1601Q928j3378o223J2048O754k6006r317J7600
15069b0118K1728K1848R109N524j7899k1385k7044j7776J5381K0616k818k8069
15057d0903Q023J0831l093j438q474l059J9212Q169n532k6453n835J6749J336
15044c0467K536l766L681J9899j2130k2775o768l180O315J1134L8864j1536j5453
15031b3646q069p860J1950r455J8987L6323p357O779l733p993k2217k0447L030
15018c3708P960o946L3512J4747J3196k88j8983j925l8330l084J5585J2553j8636
15005b4347q253K845l419q152J2591K7421J2051k6742K1113J3070j9635k318j0652
14992a4427l0870j8606l973j7171L3678L1744j6996l599K8521J7383M446k326
$$ y = [-46840, -61943, -40048, -21773, -22125, -10524, -1596, -14974, -21197, -9149, -2395, -28401, -37718, -20118, 1610, 23458, 32567, 38091, 20192, -1193, -28237, -46013, -30632, -10016, -12834, -40903, -32880, -22049, -25142, -26580, -35054, -38113, -18901, -10732, -16264, -42717, -48552, -31803, -30467, -27931, -31697, -28016, -8117, -20247, -43022, -49790, -52970, -46655, -35521, 3343, -8193, -23646, -31715, -39575, -27625, -37080, -18093, 18230, 10873, 17652, 13919, 5926, -16291, -36738, -33708, -25748, -32694, 818, 15565, 28761, 28473, 9490, 7565, -30765, -33849, -18264, -5711, -24347, -32600, -29755, -33174, -41326, -28735, -1314, 10737, -16005, 5108, 18178, -1457, -3775, -14427, -45297, -63903, -67876, -85047, -51369, -19625, -36621, -40220, -11699, 5684, 10130, 7804]
14980G804m1348k8080n820J4929N8335K7969j4425k9236M946q434l5021J5362
14968c3019j4881j4040M7958L3265J3994k0192k9065k91J6189J6865m1547r079
14956c3843J1535j420J4777L1512l2990k8108R141K6051J4004L864n206k0911
14944a1594o10n171k3194J3257K5403M0688K360j6158n140j4651r558N376j7245
14931a6237j9216J7061o595N27M3046K324k6521k1266n654R621K5626l717k9215
14918c0216r774l219K3251K9268k0631j3700J6750k756k648j3390M35K3106O65
14905b859N319j3396j3712o714j0927K9227J7195J1034L149k1280m573j3119K739
14892a7917o493j790K6614j6046j6544J5602J158m613l122M941Q169K6493j4981
$$ y = [7804, -33544, -61624, -67444, -52515, 5820, 33789, 19364, -9872, -4926, -13360, -48381, -33019, -47900, -61940, -13982, 19283, 33277, 13085, -15980, -16271, -82, 16783, -24764, -33843, -22308, -23728, -8951, 22561, -10429, -38537, -29396, -3345, 10659, 14523, 9317, -11594, -12204, -17375, -40569, -27312, -1909, 38779, 41139, 24981, 19841, 5190, -4368, 1008, -16237, -35453, -18392, -24987, -24460, 18586, 20910, -5611, -26877, -32531, -22910, 2716, -1001, -30216, -39990, -43209, -19958, 9310, -11321, -25021, -8271, -11027, -13675, -27065, -26630, -3524, -2859, 2460, -10936, -24648, -31362, -42289, -13062, 4133, 15167, 18316, -2964, -7537, -20656, -17917, -24410, -26200, 414, -15632, -32176, -16574, -15416, -20029, -23151, -18210, -10041, 16452, 1471]
14879A471k6641m377K7395K8724j9882j6046L353q755j5985j5967K0662J7187
14867h861J7491l799o939l517J768J2887r577k296J0446K8640L4863N949o187
14854G0868j0333j4962k5984k0260l304m166P666l266K154J1494J4753k2494J0640
14841A2806J0737k2970p431j294J7306J9475j8810j3835m569j8811j6242J0185
14829c3453K6294Q231j4207o398q060K3387J3839Q096k1036m56m654j2850n842
14816b7109k3694k8766J7347J6308K8939O510j0846J8918L632o962J1454J426
14804G157K0840R947N512k2741j7848O996J604J1558J0011k2320k6547j7621M546
14791b8906N542j70L1977k55k6883O52K6449j0552j3656J3423K436L691K551p282
$$ y = [1471, -25170, -29547, -2152, 26572, 6690, -9356, -6003, -14758, -30743, -46710, -26048, -8861, 8630, 4831, -2108, -5625, -3857, 9030, -547, -2843, 7603, 36243, 71106, 77055, 70868, 60535, 45573, 19589, -671, -3975, -8141, -475, -3741, -1587, 9907, 24660, 2166, 12806, 23543, 573, -6858, -8152, 9154, 28629, 9819, -4016, -8585, -27396, -43638, -33453, -7159, 1072, -13135, -19533, -27593, -4206, 9633, 17729, -3307, -3763, -8417, -21267, -27109, -50803, -79569, -62222, -45914, -16975, -10465, -21311, -2393, 1239, -5723, 5731, 7157, 27997, 37944, 43456, 20715, 2867, 9863, 11467, 23025, 33036, 10716, -15831, -33452, -28906, -23364, -23534, 8443, 8188, -18695, -18043, 8406, -2146, -15802, -2379, 57, 3748, 6299, -983]
14777i83k7338q408m18M175K1870j5567L1248J3171K4044J1197M324k0540K3178
14764E9953R247j4662j3308j1513J2553R936j0926j0716M2213p38l4195j8809
14752A9035l3129J322J7172J1473J2667j8910j6490j4470J6756L907j6034j9138
14740c5839K0843Q95j0413J0936k163J2754L704K4479j5560j4315j2888m044j4857
14727c6468K354J3222Q539p700r214k602J4790O127l339J4322K3910P366J037
14714C2344j8649n083n704O226m1205J7576K5781J5781K294q524N273P401k8036
14701E475k7645J4798K0602J8319P628n780J404R113k0711q786q701k4978Q794
14688a0468J5138K168n078N776n333L484k824k0942k8941K1181J2279J6194o526
$$ y = [-983, -28321, -36729, -37147, -32972, -11102, -26669, 4579, 17750, 41794, 52991, 57315, 36775, 59953, 69200, 54538, 41230, 29717, 42270, 52206, 41280, 30564, 72777, 72039, 37844, 19035, -14094, -12772, 4400, 15873, 28540, 9630, -6860, -21330, -4574, -667, -16701, -35839, -14996, -14101, -24514, -13578, -15741, -2987, 717, 25196, 9636, -4679, -17567, -21611, -36468, -34114, -20892, -12353, -20053, -29267, -31869, -17079, -10952, -14291, 31, 23941, 31307, 32344, 13695, 8612, 2908, 9134, -32071, -14495, 11286, 27067, 29361, 20837, 26110, 33511, 5475, -22170, -7372, 13230, 31549, 39177, 33397, 34801, 43914, 23203, 14417, 5716, -19262, -10468, 4670, 6838, 1760, 7536, 2203, 5687, 2863, -18079, -47020, -25839, -13560, 2634, -3892]
14675c892p910L4704K241j127J2483j4130L879P540J3608k6686M964K5557J6752
14662F7983m492k2081j9392o120j2717J6868J6472O089j7807j1463k5939L955
14650h644J4888j0471R833j072L694j6880k8053J170J3156J2191p467Q404j0632
14637a9883L110Q591q263k0960L4126p223J1761J7219j2567k7944O936J7037J4313
14624A6253J9967r308J5292L246q092P010m612j1255m8840J8504J3055K2178Q122
14611D1520o490j7181K351K489j8545o747K1042K7328N577k1898l3323J440N709
14598C272J1268M46j4262j3788O397K3430R766l3708l4035n692K5563P560N887
14585g896J5909M654N925K8855J1821k6514k4205J1487K1217k6099k8447j3030
$$ y = [-3892, -11802, 22902, 25143, 24016, 36499, 22369, 26248, 33788, 47396, 20710, 25674, 51231, 67983, 63491, 41410, 22018, 15898, 3181, 20049, 36521, 42610, 24803, 13340, -12599, -8644, 6244, -4227, 5606, 4534, 8228, -8652, -36705, -35535, -22379, -10188, -17655, -9251, -19883, -16773, -8182, -16445, -37405, -3279, -10502, 1259, 18478, 5911, -22033, -15097, 1940, 16253, 36220, 26912, 42204, 45450, 37358, 44368, 39756, 28501, -20339, -1835, 11220, 33398, 41520, 35030, 17849, 20200, 22689, 4144, -2603, 18439, 45767, 51344, 29446, -3877, -2437, 3272, 14540, 14986, 724, -13064, -6667, 16763, 26529, -7179, -41214, -46906, -21343, -13783, -7896, 8013, 12667, 18592, 47447, 59268, 32754, 8549, 20036, 41253, 15154, -13293, -26323]
14573b6323K0960L105L446L7452Q42j5991k2326l7865j3344J8547P323J1749j6814
14560b9239K534j405J8941J9653J2253K0887J8128k2781l4075K783J2453m082
14548A6050J4012M976j5306l650J6850l838k277J8211m153q854j4147j0039R062
14535A6897j0437r374K8891N394j8203k0043M74j5324J3149l816J8233J9810K639
14522B8290l0605k1147J5523K0376R627R257o971l7228k0100m147L3421M042L542
14509C880m03k0345K5746L2373K013K8P748J6329j9809j6102O734K956l7154j8813
14495a4819R813J8300j2974k6719J374K0231R580J1731k5773j0873K214k847J5733
14482e029J5514j3394k1362K402J3622O407J6070l069M505j2851j427j2769R281
$$ y = [-26323, -5363, -2258, 1188, 38640, 39482, 23491, 1165, -36700, -50044, -31497, -24174, -12425, -29239, -26705, -28110, -9169, 10484, 22737, 43624, 61752, 38971, 4896, 7679, 20132, 16050, 30062, 35038, 19732, 16082, 32932, 29094, 26817, 45028, 40875, 32021, 17874, 7835, 16897, 6460, -2914, 25977, 31371, 13168, -6875, -6401, -21725, -8576, -12392, 5841, 25651, 28290, -2315, -23462, -7939, 12437, 22064, 31321, 24350, -12878, -32978, -37125, -3704, 338, 3880, 3477, -16868, 8878, 41251, 43264, 43292, 51040, 67369, 47560, 31458, 38192, 41148, 3994, -14819, -5006, 13294, 320, -26399, -25025, -4794, 4786, 16517, -9256, -20129, -17915, -20762, -5029, 10485, -2909, -24271, -21869, -8247, -1840, 14230, 11161, 15666, 2815, 1388, -11381, -2100]
14469b100K1929r812j0844L1527K0314q508n546j7286j8505l41J650K0757k832
14456B0403p865k1220P929j0775l1083J1400J7539K045K0766m502k4037J9894
14444D94J4885K1427j0283j3020m083l932K789j674j9301j96K4323J1780M2656
14431F5865J695l8862k7550l9756J7395K7057L737R777o251j4525r291j146j6998
14418b8853K3978k123p499M694j319j4912p924r697RM80j2140J5334K9559J7882
14404G469J6257k3622k1669o338k900J2488R451j0822K8288K8839K8673l3679
14392C2435l3411j0959l1632o175k593J3687J0848J5751K8217K897R091k820j7016
14379H320q969J342m463j887k2514j565J1853K1863J58r941J6634k502O0J5921
$$ y = [-2100, 19829, 10017, -827, 30700, 51014, 42506, 36960, 19674, 1169, 828, 2478, 23235, 20403, 12538, -8682, -753, -11528, -42611, -31211, -13672, -11627, 9139, 4637, -19400, 494, 15379, 36806, 26523, 13503, 9420, 5488, 8277, 6603, -12698, -12894, 11429, 23209, 65865, 67560, 28698, 1148, -38608, -21213, 5844, 9581, 19358, 13107, -1418, -10709, -11855, -28853, -4875, -6998, -14497, -9803, -11122, -26034, -33958, -43655, -43646, -43166, -55306, -39972, -10413, 7469, 23726, 104, -21565, -27903, -30803, -18315, -8864, -19686, 8602, 37441, 66114, 32435, -976, -11935, -43567, -49742, -52335, -38648, -27800, -12049, 16168, 19065, 28156, 25336, 8320, -649, 693, -3770, -5657, -28171, -29736, -17883, 3980, 4138, -5803, 10831, 8329, 8389, 24310]
14365B4310J6791N418p458j4386J3075R469k883k3036j7327l810J3081J6854j3382
14352A6716R355J2248J6052l0261J1519L400j4665k5430k4966J7673K3430m021
14340A1050r513j7374k533J0329j3771k431j838P392k828K3916J8012k6135O257
14327E33N668j4864O613k872l0098o849M6298J2565o498j9945k9386K1581N1656
14314C4402O145k1712p420j7463J081j097K6818j674r564O185m533o736k8849
14301b4417J7990j5140J202M217J399k4545O97L3616n985J0176J0371p428j3634
14288a1481j3873j3611m427M2544K7827p064J815J6437j3228l449N779k0286N016
14275A1999o385L1102p133j3771p388j4029J147r864m035p375J1417J5676j650
$$ y = [24310, 41101, 46519, 39061, 24675, 37750, 47219, 44336, 21300, 3973, 163, 13244, 30098, 16716, 26071, 38319, 54371, 24110, 35629, 39029, 24364, -1066, -26032, -8359, 15071, 11050, 1537, -15837, -18370, -8041, -21812, -24243, -26081, -18689, -21517, 2399, 20411, -5724, 533, 6201, -8663, -2050, -4922, -35020, -41869, 4429, 16994, 10496, -9449, -38835, -17254, 34402, 40547, 18835, 11415, -6048, -4967, -6064, 20754, 19080, 9516, 15701, 11168, 4432, -24417, -6427, -21567, -20365, -16148, -14749, -39294, -38597, -4981, -10966, -790, 9581, 2153, -11481, -25354, -38965, -43392, -848, 26979, 19915, 21730, 38167, 24939, 21490, 27269, 6983, 11999, 5614, 36716, 29583, 15812, 8424, -5605, -4458, -14322, -18357, -25732, -14315, 1361, -289]
14262b89R75J973M867N784p201K0638j2084N210L3409K924m018P70M808j115k2848
14247C3803l8940k1583K1410P453J3428j6750r716j0686J2256N467J3558J1043
14235B0743n080k110J8626J1914j0416k6684n474q245j4665J0155K094L557l851
14222i436L27l1816l0219K3800M1449K3413M288K225j0162k8661k1633J847K3437
14209a1141O425o260K2210M1493j8901m4638k3568J8876K8283J8863p219K107
14197B6530l021j0634p400J1059J1908q085J1400J3598K065k2980j0756j5117
14185a433K949R76K9685Q793n62j637l3916R744k756J16j8575J0796K4244m608
14171B3816j7208J0612j996l5112r055m94K0615K7820J2881J2454J298j6830L859
$$ y = [-289, 686, 2659, 7526, 13310, 6109, 26747, 14663, 19873, 53282, 56206, 52188, 52958, 57766, 56651, 33803, -5137, -26720, -5310, 2143, 15571, -1179, -10895, -21581, -9325, -3858, 9700, 20743, 15663, 13553, 32179, 44093, 33677, 6993, 1519, -6726, -21391, -11236, -9142, -5585, -9436, -9109, -40925, -71144, -47344, -5895, 17518, 21806, 24031, 13869, -14792, -36425, -34578, -11141, -4716, -10976, 11234, 52727, 33826, -10812, -34380, -15504, 12779, 31642, 24423, 26530, 23509, 12875, 5475, 16534, 28442, 20357, 31757, 45355, 47420, 24440, 13684, -1433, 1516, 2492, 32177, 40970, 40408, 38771, 4855, 14599, 11843, 11959, -6616, 4180, 28424, 23816, 6608, 17220, 15224, -19888, -28943, -29437, -8822, 18998, 31879, 44333, 45631, 28801, 32660]
14158C2660J5285o984j0957J1605j5791r586j286Q305m296k32Q937O939j5322
14145A9277J683j4670K2037J2228J0051O058p713k7405O674p51J0022p543k8762
14132A186r00L4499J0255l6855j054J5985k234m513J429J3670L604j4568j5826
14119D678K3690J5894l539k8356m977J8838N86m755J0255Q668P517k6058k3488
14106a047l4131M918L7168J6506K3749j1715k9770k5413R120P971J0341K1279
14094B8976N318k5196J1010p674n385Q45k2733k0031R539K4972l401L2463J7588
14081D6291r470j2297m6300n719J1159J7317K7445J657l844K1334j0443j6268
14069B0862N469L999K876k924M797K3390O82j4539Q834m1455j0977J0233J2031
$$ y = [32660, 47945, 40961, 30004, 41609, 25818, 16232, 14946, 23251, 18955, 18723, 27660, 34599, 19277, 20960, 6290, 28327, 40555, 50606, 56664, 48951, 21546, 28220, 27469, 37491, 29948, 1186, 286, 34785, 45040, 8185, 7131, 23116, 20882, 16369, 17798, 31468, 35072, 20504, 4678, 28368, 44262, 40723, 12367, 7390, 26228, 26814, 22059, 32314, 40982, 48499, 22441, -1047, -35178, -30260, 6908, 23414, 47163, 35448, 5678, -19735, -10615, -2644, 7697, 28976, 34294, 9098, 20108, 12434, 7049, 7894, -14839, -34870, -25331, -359, -3760, 28703, 46291, 36821, 24524, -21776, -27495, -16336, 981, 28426, 30083, 26239, 47573, 37130, 20862, 26331, 30330, 33206, 30282, 35079, 58469, 59151, 44612, 53446, 11991, 1014, 11247, 23278]
14056B3278N372J1847j2998j054n815j3291J7382J698r86j6467l2692l4903Q828
14043d9801J8214j7093K0934M1662J4766M03j7157n445M198k2j6448p61M5239
14030C8689o450K4870j7042l787l5669j6481K0171R340K0827J1690k0377j7531
14018H250k785J0354N093o891n395j6402K901L1654J2293J1492J6966m716K6371
14005H9185j0561j1523j3204k2344j0755P998k903J1078j8595j5683J6925L5536
13993E5154Q176k0000o294m363N761k015k1845N241J6615K0067J0789j1701l904
13980E1681j8878r026k720j1152J4648M354Q176L508N823J5298j5773J6613J4179
13967G6731q986k5421o06J9501m0109l5366j5808K9025K1886J1160J1350O063
$$ y = [23278, 28650, 40497, 27499, 26445, 20630, 7339, 24721, 26419, 25433, 8966, -23726, -58629, -49801, -31587, -48680, -27746, 13916, 28682, 29085, 11928, 6483, 10681, 10659, -5789, -6550, 38689, 32239, 57109, 40067, 36280, 611, -15870, 4301, 13641, 34468, 46158, 25781, 8250, 5465, 15819, 20912, 14021, 8626, -7776, -4875, 26779, 39072, 50564, 67530, 62814, 89185, 78624, 67101, 53897, 31553, 20798, 28796, 25893, 36971, 18376, 2693, 19618, 55154, 63330, 43330, 37036, 32673, 38434, 36419, 14574, 19815, 36430, 56497, 67286, 55585, 51681, 32803, 23777, 21057, 9905, 24553, 28907, 37083, 40591, 46414, 61712, 45939, 62552, 76731, 67745, 42324, 41718, 61219, 21110, -14256, -30064, -1039, 20847, 32007, 43357, 49420]
13955D9420o46L369O729j0427k2257m2149k5363q064K9208J6094L057R270J1247
13942A9488r357r088M906J7136K0830K5838j7770o420M650K239k4707J6646J1469
13929E5860l0995j390o492M187J598k9373j9726J0988J4592k395L3914R049j8265
13916B1552j1905O326k3744J3692K98K430j7751J3202K3310k7237P801J0249o338
13903A1885J025K3439K6596l369j0281K1332l2893l3318J2213M532J2154J5817
13891D9132L473K4698J9269Q930k2282l3214n352R294m853j8809j8932l082L1233
13878C9505J1832o135j3998k1230j2000k3621M432K0508M375j340L2567k3937
13866A0958m022O999R821L886K649l30j1426j9792M4870J1313n0549m7552Q375
$$ y = [49420, 48774, 52143, 58872, 48445, 26188, -15961, -41324, -49388, -20180, -4086, -1029, 8241, 19488, 10131, 1043, 5949, 23085, 43915, 69753, 51983, 45563, 50213, 52452, 27745, 44391, 55860, 24865, 23475, 16983, 21170, 22768, -6605, -26331, -15343, -751, -3146, 30768, 39817, 21552, 9647, 15973, -7771, 5921, 6219, 8649, -9102, 4100, 27410, 173, 7974, 18223, 11885, 12910, 36349, 62945, 59576, 49295, 70627, 37734, 4416, 16629, 21161, 33315, 49132, 52605, 77303, 96572, 105502, 83220, 50006, 44654, 53948, 49095, 30286, 11354, 8272, 39505, 51337, 45202, 31204, 9974, -2026, -25647, -21215, -707, 3668, 2328, 34895, 10958, 6936, 13935, 23756, 27642, 30291, 29961, 18535, -1257, 43613, 54926, 4377, -43175, -34800]
13853c4800L2133J9762O590p937k089J2240O412m917Q142l049J1236N7922M046
13840A05691m115j8157j2908k8588k2767Q01K5073K4667j4180l3115k8875N438
13828a035J3495J6349l302J8317M3938J581k8225j6658J0314Q878l901k0480j0650
13815B8621K8545N446j8644R912N84p970N839L271Q860J8732J8557m002k7179
13802G0572p218j2354j751p823r371L767j6091J0203P588l0336j9800L8204N2282
13789G7872j4736k7435k7341m420P643J3255J1648O327k016R982M721N82l7169
13776A8913O986r141Q912J935J5413R904j5159j1266K023p899J2162K8081j7294
13763D3570j4118j1970l2213K2096k3628P295j5413M604J8080J8937k788j0407
$$ y = [-34800, -2667, 17095, 23685, 15748, 13659, 25899, 32311, 27394, 35536, 32487, 43723, 101645, 105691, 101576, 83419, 70511, 41923, 19156, 19957, 45030, 69697, 55517, 22402, -6473, -1035, 12460, 28809, 25507, 43824, 87762, 89343, 61118, 44460, 54774, 63652, 59751, 39271, 28621, 57166, 62612, 43968, 53880, 54464, 46494, 52333, 55604, 64464, 83196, 101753, 97751, 70572, 63354, 51000, 49249, 41426, 32055, 35822, 19731, 29934, 37522, 7186, -12614, 25590, 77872, 63136, 35701, 8360, 3940, 11583, 24838, 36486, 42813, 40797, 50779, 55500, 56082, 18913, 25899, 16758, 25670, 27605, 43018, 52922, 37763, 26497, 28520, 20621, 32783, 60864, 43570, 29452, 17482, -14731, 7365, -16263, -8968, -24381, -19777, -1697, 17240, 14452, 4045]
13751D045K755J0841J517J8544K9030k1496k4098P663k306P768k274J684M411
13738C8084r220J4348O617j0231j9958n292M850J5452K1013p954m3350l6080K6469
13725e252M4104J2181k7689o05k1214K1915L901k6268m680L5064J1391M02l0628
13712A2622J789o44P622J0499q884j736j0023j4843K2959J5227P750j3440j5235
13699A3663K946L8009n899j959k1319J0172L5686r11n4132q645K2859M752k0403
13686A4819K5461N870j3993l685J0905k3398M360K6423l32Q23K6330n990j3180
13673E4413K002q352J5686J2709P748j0795l2285L1523L1663k9843l665k2477
13661D8327r821P241J7229J4889l0345k3234j5084J0402n707j2304J650J8972
$$ y = [4045, 6800, 17641, 19158, 37702, 66732, 45236, 21138, 28801, 26495, 34263, 31989, 33673, 38084, 28864, 43212, 49829, 39598, 19640, 14348, 19198, 34650, 55663, 47709, 4359, -31721, -5252, 38852, 51033, 23344, 22739, 1525, 23440, 27341, 1073, -3607, 31457, 42848, 43250, 12622, 14411, 13767, 21389, 31888, 23004, 21268, 11245, -3598, 19361, 34588, 42338, 28898, 13663, 16609, 54618, 48719, 46760, 25441, 35613, 71299, 70388, 16256, 7611, 30470, 35222, 14819, 40280, 46150, 32157, 28472, 39377, 15979, 20339, 46762, 46430, 47253, 73583, 67593, 54413, 56415, 48063, 63749, 76458, 84206, 73411, 41126, 72649, 104312, 74469, 70804, 48327, 38506, 45747, 62976, 77865, 47520, 24286, 9202, 19604, 13897, 1593, 3243, 22215]
13649B2215J7567O824k7562J289P475m869M006q512n179J4594j8751P546O693
13636B3336K2319K2912r355l9736j9848m635J8640k12o842O823r7J5494Q282M521
13622D1602J7072r953p257k37J8674l2870m3429r922J3026K8745K9394N172L084
13609E3101K8648q451m7274j6036K468R012j0888J7401K5338J2670k1347J838
13597D6480J3625J0609N573p905k0146m771J4600m341k2140J5660p764j887K2602
13584F0195J0682M295j6704j0116j238J1984m4906j4970J1617Q008K5148J4033
13572E8028J0736M30M376L99q291J3741K9137k5558k6689j9634k8802j8903m690
13559a5720P339L4520M118M712o8j4143o616J1468k002n598P530L809Q991J8319
$$ y = [22215, 39782, 46606, 19044, 20333, 27808, 22939, 26945, 18433, 13254, 27848, 9097, 16643, 23336, 45655, 68567, 59212, 19476, -372, -5007, 13633, 13421, 6579, 13402, 13305, 28799, 37081, 41602, 58674, 48721, 41464, 41227, 59901, 27031, -16398, -26320, -13294, 15451, 44845, 50017, 53101, 81749, 73298, 26024, 9988, 12456, 21468, 10580, 27981, 53319, 65989, 44642, 46480, 60105, 70714, 76287, 68382, 48236, 43465, 58065, 53724, 31584, 47244, 39480, 37593, 60195, 70877, 75172, 58468, 48352, 47114, 59098, 14192, -778, 10839, 18847, 43995, 58028, 68764, 69194, 73570, 73969, 65678, 79419, 108556, 82998, 56309, 36675, 7873, -11030, -15720, -8381, 26139, 30257, 34969, 34901, 20758, 14142, 25610, 23608, 18010, 25540, 29349, 38340, 56659]
13545E6659Q404N124K69j3931L096j0731j7433J828J0015J903p852N931O550M650
13531E4482K227K424l867j1628l450j2818o560P417K1082n319n353p513K0887
13518E2011J0592j3646l6555M805J5732j0366l2986k2648K4471N2212M7364k5454
13506F5532r195j732m029n272J1293r172j0584P738K3948j4928r664O973l374
13493D7534r105j3920J6482J5812K88r175N08M979j3872k7645j0168K4403J6840
13480D2961p35K3238J1536l7353r616J9531j9118j247J8546J0037J7423L070q891
13467F9382j6287J1849N192O640k7135l2364J9088L442J6495l075q983p019l2232
13454D993j2915O350J0188q298P309K9048J8442k2290j8650m327k1895K00J8386
$$ y = [56659, 65063, 70187, 70456, 56525, 59621, 48890, 31457, 33285, 43300, 45203, 37351, 43282, 49832, 54482, 56709, 59133, 55266, 43638, 40188, 27370, 20810, 28227, 49309, 43990, 38637, 31124, 52011, 62603, 48957, 12402, 17207, 32939, 22573, -10413, -33061, -8590, 43622, 90986, 65532, 56337, 54605, 50576, 45304, 56597, 47425, 36841, 44579, 68527, 53599, 43935, 50908, 47534, 38429, 24509, 40991, 56803, 57091, 47916, 48424, 53403, 39531, 11886, 1718, 26121, 42961, 42226, 65464, 77000, 39647, 30031, 49562, 30444, 29197, 47743, 57780, 75203, 78273, 69382, 53095, 64944, 70136, 76776, 49641, 17277, 36365, 39807, 56302, 53227, 44244, 37225, 4993, -7922, -1572, 8616, 318, 7627, 36675, 55117, 32827, 14177, 9850, -12045, -11845, 6541]
13441F541M236j943j1058N524j2821J1427R044q461K1681M01j463q564j0327K0494
13427B4711k969j6937J8363Q570J7701J6365r266j3073R051J5419K3816l2450
13415E9301j1229J5911J6677Q70R918M816m3845k7794j1921K4980J5379k7597
13403B5466j4670J9038N113j9622j8580K9722J8380l679j3086k217O543O228j612
13390C7024M06Q403O576q958j6651o973K7521J010l0739q015J5793K1540o429
13377D0508O276j0440k207N471j3038j7100k7063M751L4801J3338N170K4441j1097
13364E3811k9629j4164J7239q666K5050j6312p193l572L0335O615j0910j2998
13352B9606O505M3854J6381o241n517o971L486K9413j9399j1873N28j9069j9615
$$ y = [6541, 10777, 8834, -2224, 3300, -9521, 1906, 10950, 2489, 24170, 24571, 23108, 14544, 4217, 24711, 21742, 4805, 23168, 31738, 49439, 65804, 56538, 43465, 52516, 67935, 91751, 59301, 48072, 63983, 80660, 81530, 91448, 96264, 52419, 24625, 12704, 37684, 53063, 25466, 10796, 29834, 34947, 15325, -3255, 26467, 44847, 41168, 28082, 25865, 32408, 38636, 37024, 37430, 45833, 52409, 43451, 26800, 19827, 47348, 48358, 17619, 9604, 25397, 46937, 40508, 46784, 36344, 34137, 39608, 26570, 9470, -17593, -12842, 21959, 35297, 40467, 64908, 53811, 24182, 10018, 27257, 18591, 43641, 27329, 20136, 16564, 46899, 53514, 42604, 29606, 36111, 79965, 96346, 90105, 84588, 77617, 81103, 110516, 91117, 79244, 79772, 60703, 41088]
13339D1088J1791K0055K328j337j3893k5438L7075J4236j3331q018k4027j856
13327C8673o931K8922K9519J2649r450k0571q249k0915j2232L50j728J5186K9086
13314G4309j2691J5191J489J6096j0819K474J1457k2512m1253k424K3112K6567
13302H0996N477k4232j8628N54J6326J3841k5762R52K0968j2425j6148O202j0578
13289C7543j3754O464m826k084j647J9536r389m0092J6452J2295J823L7839K4212
13276H4372j566j897k1170k1871J5349O357q267Q048P650P848L457j449k1650
13263E5211J890J9396K4031K719j4982M518j1833p876K6700k541j5038Q956O990
13250I8141j1756J2152K4585L618l9163J93K1708j9903j5136n683J3428l035M427
$$ y = [41088, 52879, 72934, 75262, 73925, 60032, 34594, 71669, 85905, 72574, 64556, 40529, 38673, 31742, 60664, 90183, 102832, 93382, 72811, 64562, 43647, 31415, 31765, 30037, 45223, 74309, 61618, 76809, 78298, 94394, 83575, 86049, 97506, 74994, 33741, 31317, 54429, 80996, 86473, 62241, 43613, 44167, 60493, 74334, 48572, 49524, 70492, 58067, 41919, 48121, 37543, 23789, 30253, 25427, 23343, 21696, 41232, 31843, -8249, 8203, 20498, 22321, 60160, 84372, 82806, 80909, 59739, 37868, 53217, 59574, 51307, 59355, 67005, 74853, 78310, 76861, 55211, 57101, 76497, 100528, 103247, 88265, 92783, 80950, 73074, 99774, 97233, 82195, 91151, 98141, 86385, 98537, 123122, 126740, 87577, 87770, 109478, 89575, 74439, 68756, 82184, 79149, 83576]
13237H3576k505o514l330n595K6665J66J2167k149j2493k4343J3642K6341j4375
13224I1253j3994J1900J3551j3576k0844q082J6818K608n051r022J4015K4528
13212A04104N088J5109r2j8986n134J3237J699l4118r651J9657K5541L036k8179
13199I1311k0510j2989j3571j3343j7191L230P738R76J3730J5058K2858J3423
13187I0720J825n052L0750J4780l3181k631K974j5276j9603K6158R691n456k4583
13174G1116j124j0435j2631K1345M1631L0666R7l8181j8114K0062p575J5499N382
13161A17738j0339j7006n664j3966j2512K9297j5833p817J8551J0764J2080k6656
13149G8637p218K7963J3700j2602j2338k8444k8101J3777L6121P357k6159j2468
$$ y = [83576, 81071, 74557, 71227, 65632, 92297, 92463, 104630, 102481, 89988, 65645, 79287, 105628, 91253, 77259, 89159, 102710, 89134, 68290, 60208, 77026, 79634, 74583, 65561, 79576, 104104, 109192, 124301, 124209, 105223, 100089, 113326, 115025, 80907, 71256, 90913, 116454, 119490, 91311, 70801, 57812, 44241, 30898, 13707, 16937, 24675, 25651, 39381, 54439, 77297, 90720, 92545, 87493, 118243, 133023, 99842, 97211, 100185, 84909, 65306, 91464, 101155, 95699, 71116, 69992, 59557, 46926, 68271, 109902, 140568, 140665, 102484, 84370, 104432, 96857, 112356, 117738, 107399, 90393, 84729, 70763, 58251, 87548, 71715, 63898, 82449, 93213, 105293, 78637, 71419, 99382, 113082, 100480, 88142, 59698, 31597, 45374, 81495, 88852, 62693, 50225]
13137E0225K0018J5411J4487J2621ql7386L880J5030q363r922q14R883K1568K285
13123A08915K011q952K0801L7225k9658l0882J0199r471l298k1847l981J7684
13111H8746R980N803K1086J7030j7099j2472j2251j2773k2580L1312J2877k1522
13099H8137m1037q844J4489R130j4645k1602K0983J7012J4078L4633K0540j368
13087A31506l6664j3964L9959N542j3931J2413q562j4513J6574K9253j7291k7334
13075A02988j502K1870P033l5983k9348R567K7790J5649j0798l928K1841Q543
13063A33722j2523k873p731j5705O023L592j4184K4700K8818k5850Q535m2555
13051H3969l388M5875Q084k3435k125j0447k808r265J313J6155M605L4685L368
$$ y = [50225, 70243, 85654, 100141, 112762, 112754, 75368, 79248, 94278, 85915, 75993, 75179, 85062, 106630, 108915, 110926, 101974, 122775, 160000, 130342, 99460, 109659, 100188, 96890, 75043, 71062, 88746, 98726, 104529, 125615, 142645, 125546, 113074, 100823, 88050, 65470, 96782, 109659, 88137, 47100, 38256, 52745, 61875, 47230, 25628, 46611, 63623, 77701, 112334, 132874, 131506, 94842, 80878, 120837, 126379, 112448, 124861, 116299, 101786, 118360, 147613, 130322, 102988, 101486, 123356, 130389, 94406, 65058, 74625, 102415, 118064, 107266, 103338, 125179, 133722, 121199, 118326, 110595, 94890, 100913, 104505, 90321, 115021, 143839, 117989, 126524, 83969, 80581, 126456, 134540, 111105, 108980, 98533, 95725, 86460, 87773, 103928, 108533, 143218, 146586]
13038A46586j7946j3432Q318k856j6726n737J5705J1503j1082m976K613j894r875
13025A00201J7043M1057K256j3470m0025j8255k165K7110j904k5137k1118P278
13013G2871L7201N4606J9400k3985k1247L239r869J0234k6633k5746K6664K0504
13001A37239p323j275j2348o642R433K0771o956j2885m486l0352K7402P329j2105
12988A07802L103Op29R114o258J2901K0780K7309k585k0618j6453J2256J869j0575
12974A37922l3217O460K6558J5800Q42j0038K550N104k601R371J3445j3845j9418
12961A38933k2577J493j174N207K5141J3543j2026m628J1794j6439L9142N836
12949A84245k9570j633m17l0094j7694J920J0942m535p466K94O711J1312j2842
$$ y = [146586, 128640, 115208, 123526, 120670, 103944, 98207, 113912, 125415, 114333, 109357, 111970, 110076, 100201, 117244, 158301, 160557, 147087, 107062, 88807, 86642, 113752, 111848, 86711, 65593, 72871, 110072, 164678, 184078, 160093, 138846, 142085, 132216, 142450, 115817, 90071, 116735, 137239, 129916, 128641, 116293, 109651, 119084, 139855, 132899, 120014, 115528, 85176, 112578, 119907, 107802, 110905, 110911, 110182, 119296, 113038, 125939, 146719, 174028, 171443, 150825, 134372, 146628, 148497, 137922, 104705, 111165, 137723, 153523, 154365, 144327, 146877, 151981, 149380, 158751, 172196, 158351, 138933, 116356, 117849, 116675, 121882, 147023, 160566, 148540, 143912, 155706, 139267, 178409, 184245, 154675, 153042, 152625, 122531, 104837, 106757, 117699, 113164, 105698, 105992, 112703, 124015, 111173]
12936A11173r71M795J9970N506k170l050K995L911J7797K9686J1512j6713j457
12923A82984j4930K2609J9669l9180j3814n433J2563m323l3045O558Q459j5635
12911A26482J8400R126q602k1799k0152J5245J8840q110K3254J465l0282J9236
12899A43103K4165J7876J7514j9462n587L17J0841o451L070j7339j5622J5018
12887A67443J6219J9637L729k3376j6264J3736o958Q479J1292j9803j634K4973
12875A97473N383k911l8485l641J3230L94k5380r165J3097L2685R465q378l312
12862A80455J1640K4262j0834j5370p442j3169J6768L9713J3021K181l136m1057
12850A97032j0820J2830r449j8433M004L002l5903k4156j1063K5669j0463m655
$$ y = [111173, 110202, 114997, 134967, 140473, 138303, 135253, 138248, 142159, 159956, 189642, 201154, 184441, 182984, 168054, 190663, 210332, 171152, 157338, 151905, 164468, 160145, 127100, 133658, 142117, 126482, 144882, 154008, 145406, 123607, 103455, 118700, 137540, 129430, 152684, 154149, 123867, 143103, 167268, 185144, 202658, 183196, 177609, 177926, 188767, 182316, 185386, 168047, 152425, 167443, 183662, 203299, 207028, 183652, 167388, 181124, 174166, 182645, 193937, 174134, 172500, 197473, 202856, 199945, 161460, 157819, 171049, 171443, 146063, 136898, 149995, 182680, 192145, 183767, 180455, 192095, 216357, 205523, 190153, 182711, 169542, 186310, 226023, 239044, 241225, 238089, 197032, 186212, 199042, 189593, 171160, 175164, 178166, 142263, 118107, 107044, 132713, 122250, 117595]
12838A17595J2169M984J6228P19J0992J6450r832k5312J1804J1812o779K4276
12826A85106O604j1306j5595m156J2542K1127j1306J7030J2286j2732m78m593
12814A94529j1904j4551N559J2192Q963K4457J2419k1488k0418l4074m448J1172
12802A62408L2718L850n15K5058J4467M1091j6444l8115k5312m746M5718N3206
12790B93384K0605R040J0076l7021p056j9019M907M5263K0259K5699N2297P3682
12778D92116P6189P6049Q4770R8142R1947P6108N8384M0832L0503j6724o0672
12767A047644p7921q6443j04439j02938o5642o0881m2552l8710m0321k4918k0755
12756C82124k0818o093J0026j241o421j9110p791R546J6546l4935k8397J7103
$$ y = [117595, 129764, 134748, 150976, 151695, 162687, 179137, 169305, 143993, 155797, 167609, 160830, 185106, 191710, 180404, 164809, 160653, 173195, 194322, 183016, 200046, 212332, 199600, 199122, 194529, 182625, 168074, 173633, 185825, 194788, 219245, 231664, 210176, 189758, 155684, 151236, 162408, 195126, 198976, 198461, 223519, 237986, 279077, 262633, 224518, 199206, 194460, 240178, 293384, 313989, 323029, 333105, 296084, 289028, 270009, 274916, 320179, 340438, 366137, 418434, 492116, 568305, 644354, 729124, 827266, 919213, 995321, 1053705, 1094537, 1125040, 1108316, 1047644, 969723, 883280, 778841, 675903, 610261, 549380, 506828, 468118, 427797, 402879, 382124, 361306, 355213, 365239, 363998, 357577, 338467, 330676, 340222, 356768, 321833, 293436, 310539]
12744C10539j373j0251L533j2570k3839P47J427R156m5669J3605L7266N390n030
12731B82931J7741R177j4754n016o353j0903j3303j1501k40K8008R558L733K5273
12718C14351J9034j1793j3006P5R08l5810J1479M826j5157O136L7481K5222J7548
12705C61294Q513P99R640K2981K3757L0426K3771l48Q312N957J1224j1536q33
12692D93957j8199k2692m912j9280J3693j4417O652l0056p844n038J6266m584
12680D03546L4249L7814P166K042r898q344R017J9928J2370o729j1460M277K6006
12667E19984N2669J1635J4078j5251k8397l2713j0818j7714M031j7242j5089K3326
12655D88499M5745J2258l4391l3203N08k463j6323J2037o56L0073K9662j1863
$$ y = [310539, 309166, 298915, 302448, 289878, 266039, 266786, 268213, 277369, 231700, 245305, 282571, 287961, 282931, 300672, 309849, 295095, 290079, 283726, 272823, 259520, 248019, 247779, 275787, 285345, 289078, 314351, 333385, 321592, 308586, 308661, 309569, 273759, 285238, 290064, 274907, 281043, 318524, 343746, 361294, 369807, 370606, 380246, 403227, 426984, 457410, 481181, 480833, 489145, 495102, 506326, 494790, 493957, 475758, 453066, 448154, 428874, 442567, 428150, 434802, 404746, 396902, 391864, 408130, 403546, 437795, 475609, 482775, 484817, 474919, 466575, 475592, 495520, 507890, 501161, 489701, 493978, 519984, 572653, 584288, 598366, 583115, 554718, 522005, 511187, 493473, 497504, 480262, 465173, 488499, 534244, 546502, 512111, 478908, 479416, 476953, 460630, 472667, 472011, 502084, 531746, 519883]
12643E19883k2406N944J9604K0185M2411K0929R325k2761k9240r474L822j5321
12631E42901j1467l0074k4445j3546L776j3405j9539j2412J233J5180J761Q771
12619D48734j7885R75l88J4624K8602J9083N534l242l45J9439J2533Q105L775
12606E39544r112l0333k1795J359K0065J9941J5421p659l1783k6380j4033j0681
12594D44554P184j2026J696Q355l2483m764J8919L3127n001l6555k0997r907J0622
12581D02724R130K1759K163M850k5544j7204Q983J0467p748M4393M5454K6427
12569E25854K9905K6786K4099J5224K9588J9273R805r336j7148k8468l6819J7308
12557F06071P967k1839q606K9639K8099J2894p018j8283O986l555k2095J620r802
$$ y = [519883, 497477, 503421, 523025, 543210, 585621, 606550, 615875, 593114, 563874, 554400, 558222, 542901, 531434, 501360, 476915, 463369, 467145, 453740, 434201, 421789, 423022, 438202, 439963, 448734, 430849, 431824, 431436, 446060, 474662, 493745, 499279, 496037, 495692, 515131, 527664, 535769, 539544, 530432, 500099, 478304, 479663, 499728, 519669, 535090, 527431, 495648, 469268, 455235, 444554, 451738, 439712, 441408, 449763, 417280, 412516, 431435, 464562, 459561, 423006, 402009, 392102, 402724, 411854, 433613, 435776, 440626, 415082, 397878, 406861, 417328, 409580, 453973, 499427, 525854, 555759, 582545, 606644, 621868, 651456, 670729, 680534, 671198, 654050, 625582, 588763, 606071, 614038, 592199, 583593, 613232, 641331, 654225, 647207, 628924, 635910, 632355, 610260, 611880, 602078]
12544F02078p383l522j4312j0733Q253K9131K639l0795M796J8215M6127L7010
12532F81504L0959L7918M3187O1852P2292N4138K5790K4343K5853j0682k8165
12521A018989l1174j678k6774J7552L0815J1579K9164K9333j0426J4480K5374
12510A107234j0616l8001m3094k0325P23j223j0300K0211M8683P4150J06210N1154
12498A284806O8465P9430R2494J06225J02091J02954J17908J41652R0443M1961
12488B228429O1525J2577m9015q1306j13777j41256j29352j36110j11157j01724
12478A438834n4316q6600n2872k6703m471q185j2703Q875p521k5631L65J820r387
12465A161505J0815J5279l6326k3514L032j3688q813l5048J982j3100j1872l15
$$ y = [602078, 594695, 591173, 576861, 566128, 574381, 603512, 606151, 575356, 580152, 598367, 644494, 681504, 712463, 750381, 793568, 855420, 927712, 981850, 1007640, 1031983, 1057836, 1047154, 1018989, 987815, 986137, 959363, 976915, 1007730, 1019309, 1048473, 1077806, 1067380, 1081860, 1107234, 1096618, 1058617, 1015523, 995198, 995921, 994698, 984398, 1004609, 1053292, 1127442, 1233652, 1284806, 1353271, 1432701, 1525195, 1631420, 1733511, 1836465, 1954373, 2096025, 2186468, 2228429, 2289954, 2302531, 2253516, 2172210, 2058433, 1917177, 1787825, 1651715, 1540558, 1438834, 1384518, 1297918, 1245046, 1218343, 1213872, 1205687, 1192984, 1201859, 1194338, 1168707, 1169072, 1170892, 1161505, 1172320, 1187599, 1151273, 1127759, 1130791, 1117103, 1108290, 1073242, 1075224, 1062124, 1050252, 1049937]
12453A049937J752J1648j11k7359n303O742J5915K1046J0742M1284P147j9242
12441A114198k9577J4569L8408L5419N509L1404N6640M2841L8135K9668L1964
12430A409178J5253J387L8116L0361L2125K5983N226K2471M0329K5311J2187K6803
12418A684730K4213L1463N3180N3166N7023N5446Q2463J05096Q0323O1642P9092
12407B367837J09888Q9332Q6413M9870N2924K9714K6591m576J3241M2994L844
12396B868072K517L0514M6065Q8633J03852J06821J09416R8438J25449J18637
12386C698414J71809J91748K39677K46948K90458L49020M24732M45816N12629
12377F571251O10324O73273P89263Q62213J028370J255717J405627J569321J772473
$$ y = [1049937, 1051689, 1063337, 1063226, 1035867, 1030564, 1037306, 1053221, 1074267, 1085009, 1126293, 1133440, 1114198, 1084621, 1099190, 1137598, 1173017, 1178526, 1209930, 1266570, 1309411, 1347546, 1377214, 1409178, 1424431, 1425818, 1463934, 1494295, 1526420, 1552403, 1557629, 1580100, 1620429, 1645740, 1657927, 1684730, 1708943, 1740406, 1793586, 1846752, 1903775, 1959221, 2041684, 2146780, 2227103, 2288745, 2367837, 2477725, 2567057, 2653470, 2703340, 2756264, 2785978, 2812569, 2807993, 2821234, 2864228, 2868072, 2870589, 2901103, 2947168, 3035801, 3139653, 3246474, 3355890, 3454328, 3579777, 3698414, 3870223, 4061971, 4301648, 4548596, 4839054, 5188074, 5612806, 6058622, 6571251, 7181575, 7854848, 8644111, 9506324, 10534694, 11790411, 13196038, 14765359, 16537832]
12368A6537832J992425K268424K690627L296635M246158N610099P381321R614707
12360E3638228J2103378J4567538J6828086J8564527J9087457J7801165J4595757
12353A67186136R882249M175909k341524q973813j4304183j7497870j8729804
12346A19397100j8390266j6672847j3904821j0809113q092186o003752m521957
12339D1002158l527331k840240k410928k148551k004763j845826j712825j590046
12331B2921648j452092j291741j123793j036781q82633p80382o68631n86705n46645
12322A4552245n37725m97899m76518m49867m46203m29436l74211l21103l33715
12313A0685568l43574k84285k42857k35967k32427k17226j66751j42610j40755
$$ y = [16537832, 18530257, 20798681, 23489308, 26785943, 31032101, 36642200, 44023521, 53638228, 65741606, 80309144, 97137230, 115701757, 134789214, 152590379, 167186136, 177068385, 181244294, 178902770, 169928957, 155624774, 138126904, 119397100, 101006834, 84333987, 70429166, 59620053, 51527867, 45524115, 41002158, 37474827, 34634587, 32223659, 30075108, 28070345, 26224519, 24511694, 22921648, 21469556, 20177815, 19054022, 18017241, 17134608, 16354226, 15685595, 15098890, 14552245, 14014520, 13516621, 13040103, 12590236, 12144033, 11714597, 11340386, 11019283, 10685568, 10341994, 10057709, 9814852, 9578885, 9346458, 9129232, 8962481, 8819871, 8679116]
12304H679116j35324j04875j03026r6520n1395O247M6199O4914Q2112J50062J75253
12293H712763K08923K72662L33890M48880N47039O50009P97990J046368J315392
12284A4333916J671045K149880K709999L351571L911643M389719M687288M686125
12276D1891186M291980L446652K149861N47196j127715k622483l642478m043692
12268D0890507l969898l571932k925628k242875j584692r43696k86887K78536
12260B5643435Q49973J293440J656544J928038K132903K151694K096943J905509
12252C9658479J665258J544614J529036J652971J833818J899058J777501J417202
12244E2977937P76540K7981o95589j293812j739421k008962k019652j838810j551654
$$ y = [8679116, 8543792, 8438917, 8335891, 8239371, 8187976, 8194223, 8240422, 8305336, 8387448, 8537510, 8712763, 8921686, 9194348, 9528238, 9977118, 10524157, 11174166, 11972156, 13018524, 14333916, 16004961, 18154841, 20864840, 24216411, 28128054, 32517773, 37205061, 41891186, 46183166, 49629818, 51779679, 52326875, 51199160, 48576677, 44934199, 40890507, 36920609, 33348677, 30423049, 28180174, 26595482, 25651786, 25364899, 25643435, 26493408, 27786848, 29443392, 31371430, 33504333, 35656027, 37752970, 39658479, 41323737, 42868351, 44397387, 46050358, 47884176, 49783234, 51560735, 52977937, 53754477, 53782458, 53086869, 51793057, 50053636, 48044674, 46025022, 44186212, 42634558]
12235D2634558j259359j059607j029005j183153j461659j760330j883311j803469
12227C1194665j539641j068960m94299J95329Q56842J559452K335733L095764
12219C6134885L729513M207762M421360M202810L562098K467622R36228q61289
12211E8800989k759071m385323n425064n732252n388811m688008l839632l084443
12203B3498385k443128j923595j572247j314247j087083r81501q85579p83827
12195A2507178o69115n89828n46742m63999m22309l66259l23429l24313k73261
12186H527923k62774k48238k24262k01099k10508k07028j77528j74900j51935
12177F669651j41152j42094j23996j08659p3364n3537n7298o9442n1638l0333
$$ y = [42634558, 41375199, 40315592, 39286587, 38103434, 36641775, 34881445, 32998134, 31194665, 29655024, 28586064, 28091765, 28287094, 29143936, 30703388, 33039121, 36134885, 39864398, 44072160, 48493520, 52696330, 56258428, 58726050, 59662278, 58800989, 56041918, 51656595, 46231531, 40499279, 35110468, 30422460, 26582828, 23498385, 21055257, 19131662, 17559415, 16245168, 15158085, 14176584, 13291005, 12507178, 11838063, 11248235, 10701493, 10237494, 9815185, 9448926, 9125497, 8801184, 8527923, 8265149, 8016911, 7792649, 7591550, 7381042, 7174014, 6996486, 6821586, 6669651, 6528499, 6386405, 6262409, 6153750, 6080386, 6026849, 5969551, 5900109, 5848471, 5818138]
12167E818138j5210M674L1483K2873M4717N8994Q5130J50437K16404K58962K79207
12156F955809L69372M53924N30071O75518Q86801J140012J481979J985884K560277
12147A7039647L174283L841997M458829M755033M776130M378709L517493K144305
12139D8086426L15525j747298l588157m757775n072081m698820l951053l157185
12131B1429582k396488j781399j346179r98752p39076n49455m05427k69048j37658
12122A2806100n0039N9410K51496L72705M67106O41751Q26259R92645J173293
12113A7540726J425430J706157K077307K602990L401429M431519N625297O820597
12105D5631452P916411Q630835Q715509Q048719O599073M206272J048792k535265
$$ y = [5818138, 5802928, 5807602, 5839085, 5861958, 5906675, 5965669, 6050799, 6201236, 6417640, 6676602, 6955809, 7325181, 7779105, 8309176, 8984694, 9871495, 11011507, 12493486, 14479370, 17039647, 20213930, 24055927, 28514756, 33269789, 38045919, 42424628, 45942121, 48086426, 48401951, 46654653, 43066496, 38308721, 33236640, 28537820, 24586767, 21429582, 19033094, 17251695, 15905516, 14906764, 14167688, 13618233, 13212806, 12943758, 12806100, 12756061, 12815471, 13066967, 13439672, 13906778, 14548529, 15374788, 16367433, 17540726, 18966156, 20672313, 22749620, 25352610, 28754039, 33185558, 38810855, 45631452, 53547863, 62178698, 70894207, 78942926, 85541999, 89748271, 90797063, 88261798]
12097H8261798n869978q244246r294330r058937q021501o679750n276844m033298
12089C1782914l046435k371865j863352j527853j352397j240592j137011j007291
12081A8236118r01809p51308n68486m48350k80616j49907K587J69427L26464N24788
12071A6158908P91938J111696J552262K106110K742559L438936M100430M608402
12063C6611241M802528M554084L908418K784451J120704r95451l166882m863564
12055D4755529n722776n671360n071878m167799l250132k546709k016050j563083
12047A4745742j253102j031308q75511p54220o74721n90199n16541m36665m18287
12038H195188l97001l56362l34341l07599k68213k37540k05432k25290k12627
$$ y = [88261798, 82391820, 74147574, 64853244, 55794307, 47772806, 41093056, 35816212, 31782914, 28736479, 26364614, 24501262, 22973409, 21621012, 20380420, 19243409, 18236118, 17334309, 16583001, 16014515, 15566165, 15285549, 15135642, 15138229, 15307656, 15634120, 16158908, 16950846, 18062542, 19614804, 21720914, 24463473, 27902409, 32002839, 36611241, 41413769, 45967853, 49876271, 52660722, 53781426, 52785975, 49619093, 44755529, 39032753, 33361393, 28289515, 24121716, 20871584, 18324875, 16308825, 14745742, 13492640, 12461332, 11585821, 10831601, 10156880, 9566681, 9050140, 8613475, 8195188, 7798187, 7441825, 7107484, 6799885, 6531672, 6294132, 6088700, 5863410, 5650783]
12029E650783k09087j80041j70745j65263k04469j83406j63184j81408j35781
12020D057399j28968j06780j15360j12549j28681j27112r1076r9912j06200p5699
12010B965062j01409q8877p7447r5919q6082r2541p7716m6592p3461q8844m4462
11999B091712k8581j4998N331k0275l3458q2801o5207J444j6461k6529k9308n9599
11987A721270q5746m6302K363j5997m8691o0038o2366o081l1759m2016o3283l9174
11975A222180m2594k4380k6784l8429l2110o2079m9422p797l2891l2390l1751
11964H41553p355L07j3048j7581k0825K594k4333j7045o0394l5400J8421M2048
11952G08942L1184M532k6361k4100j4803o780J9206q518m477j057M308M295j3052
$$ y = [5650783, 5441696, 5261655, 5090910, 4925647, 4721178, 4537772, 4374588, 4193180, 4057399, 3928431, 3821651, 3706291, 3593742, 3465061, 3337949, 3246873, 3146961, 3040761, 2965062, 2863653, 2774776, 2697329, 2601410, 2515328, 2422787, 2345071, 2298479, 2225018, 2136174, 2091712, 2063131, 2048133, 2053464, 2033189, 1999731, 1916930, 1851723, 1853167, 1836706, 1810177, 1780869, 1721270, 1635524, 1589222, 1591585, 1575588, 1526897, 1466859, 1404493, 1398412, 1366653, 1324637, 1261354, 1222180, 1179586, 1155206, 1128422, 1089993, 1057883, 995804, 946382, 938585, 905694, 873304, 841553, 834198, 834505, 821457, 803876, 783051, 785645, 761312, 744267, 683873, 648473, 666894, 708942, 740126, 744658, 718297, 694197, 679394, 672614, 691820, 683302, 678825, 677768, 682076, 686371, 673319]
11939F73319P003k245J8408K9246M2946P3974Q7839J22746R7370O4241L8462K2679
11927A275988j4284m4192m8648p2382j18447j01588n4283p6678o4382o0388n5772
11916E64944o6477k3396l0707k8808p851r381k0755j6164k3537o50l330j4757
11904C19131j0571j19J0268L580m9829k5632K8101K4275o424l7739j984k0782
11892B32275n023K8028o277p449N58k6423j0154R718M0130M468J872k051n502
11879B54170L8809l569k7443l2004k0279k7874K2364J3166Q13J5506N183K8111
11867B66953P575m4142j6328P419n927n289k58J4257k777p290J3086K3790J7871
11854B68940L3207M2756K5747N1828R211P856M9746M5506K6148M0432N0218j1185
$$ y = [673319, 680322, 678077, 696485, 725731, 768677, 842651, 930490, 1053236, 1150606, 1214847, 1253309, 1275988, 1261704, 1217512, 1168864, 1096482, 978035, 876447, 822164, 745486, 681104, 620716, 564944, 498467, 475071, 444364, 415556, 407705, 398324, 377569, 361405, 337868, 337218, 333888, 319131, 308560, 308441, 318709, 322289, 272460, 246828, 274929, 299204, 292780, 255041, 253057, 232275, 227252, 255280, 249003, 241554, 242112, 215689, 205535, 215253, 255383, 259851, 261723, 259672, 254170, 292979, 289410, 261967, 229963, 209684, 181810, 204174, 217340, 218153, 233659, 238842, 266953, 274528, 230386, 214058, 221477, 215550, 210261, 210003, 224260, 221483, 214193, 227279, 251069, 268940, 302147, 344903, 370650, 422478, 431689, 439545, 489291, 534797, 560945, 601377, 651595, 640410]
11842F40410k038j1446r366j8334l4523o6713m0084m4356l6625p796l7985O898
11830C38042K1943o55J62j2032K149q221k2154J1633P077K3523K7814r773l4540
11817C44968j7761p374L2845M348K9563r74k6184j6368L446q143j7211J1203l6024
11804B96334k3539k2729n983Q32n911l1024k5104L3809J4181J469k7525k4530
11792A80280j1584O5176L8304K1174N087K3592K1407K6735k7223J302j8334l9430
11780B86486n176J8162k0573o7145m4799r362q589j0623p688J7958R423j0242
11768A47832k5658j5175%J4000K784l30O449j8888r405k0062J2003K754Q632n536
11754I9400r812J8281M077o294k4576j7754J1254Q364O693P206j695j771J0849
$$ y = [640410, 638372, 626926, 617560, 599226, 564703, 497990, 457906, 413550, 376925, 369129, 331144, 338042, 359985, 359330, 359492, 347460, 349609, 341388, 319234, 330867, 337944, 361467, 389281, 379508, 344968, 327207, 319833, 352678, 357026, 386589, 385615, 359431, 343063, 346509, 338366, 321155, 332358, 296334, 272795, 250066, 244083, 244915, 239004, 207980, 182876, 216685, 230866, 232335, 204810, 180280, 168696, 233872, 272176, 293350, 298437, 322029, 343436, 370171, 342948, 344250, 325916, 286486, 281310, 299472, 278899, 211754, 166955, 157593, 149004, 138381, 130693, 148651, 158074, 147832, 122174, 106999, 106999, 120999, 123783, 123453, 129902, 111014, 101609, 81547, 93550, 96304, 104936, 99400, 89588, 107869, 111946, 105652, 81076, 63322, 74576, 82940, 89633, 96839, 95144, 93373, 104222]
11741A04222k0213P700l03K5234K5202r065J629j4193l0433k941j3790l511L923
11728G3461j6582J3829L4936n731k1047Q310J9054j6844n803J7009J0969J8880
11716A30441K6805Q928K9101l9K4116J2164J7298N5775J5259q043j3285j1898
11704B86622J0144k1341o0188l4407k857Q447r83k9402m614K129j3650O72Q798
11691A49370P761j1412p819L9161L0790l5477j5494j5054l7K6184L9262P572J6906
11678B31713Q67J4523K0810J1587L6516N7819K8721K3205L7657K7635L7045J3634
11666E41732l1449j5468k4206l9682n3879m3323j391r073j3850j8755j9771k8295
11654B42590L308J2692j1850Q495j553k058j4078l8258j1794l0655j4509R281
$$ y = [104222, 84009, 91709, 91406, 116640, 141842, 132777, 134406, 120213, 89780, 86839, 73049, 69538, 73461, 56879, 70708, 105644, 99913, 78866, 87176, 106230, 89386, 83583, 100592, 111561, 130441, 157246, 166174, 195275, 195236, 219352, 231516, 248814, 304589, 319848, 311805, 298520, 286622, 296766, 275425, 215237, 180830, 177973, 186420, 185437, 156035, 151421, 153550, 139900, 140572, 149370, 157131, 145719, 137900, 177061, 207851, 172374, 156880, 141826, 141789, 167973, 207235, 214807, 231713, 232580, 247103, 267913, 279500, 316016, 373835, 402556, 425761, 463418, 491053, 528098, 541732, 510283, 494815, 470609, 430927, 377048, 333725, 332334, 323261, 309411, 290656, 270885, 242590, 245898, 258590, 246740, 255235, 253682, 251624, 237546, 199288, 187494, 156839, 142330, 151611]
11642A51611j54k5358k1252R591L5949J7673M2627L9936J1504J6306J2358L2782
11630C23573L6243J0122L3287k2283j3824k859k8295l5427k6088k2964n264k4054
11618B22167j4102k7037j6102k0114j2503j7348j5163n92O304O082J6374p456
11606A20510p790M057J9851K7178q660m2586j5260j6367J3480J6265N896L7979
11594A54553K5215J984J76j6564J1305Q254O747J3870r190j1071L175K651J5927
11581B07032r453j9427J2509J0887k0619o858J1073j9067J1734J3636K7088j3398
11569B05137K35L7887L3147L596J7215L1247N758k6929j6828J9542L9877J2868
11557C62752M498k3936m5866k6009j1976k0836j4591p374J1639k0227j7252k259
$$ y = [151611, 151457, 126099, 104847, 114438, 150387, 168060, 210687, 250623, 262127, 278433, 290791, 323573, 359816, 369938, 403225, 380942, 367118, 364259, 335964, 300537, 274449, 251485, 246221, 222167, 208065, 181028, 164926, 144812, 132309, 114961, 99798, 99206, 105510, 111592, 127966, 120510, 112720, 116777, 136628, 163806, 155146, 112560, 97300, 80933, 94413, 110678, 116574, 154553, 179768, 181752, 181928, 165364, 176669, 184923, 191670, 205540, 196350, 185279, 188454, 191105, 207032, 197579, 178152, 190661, 201548, 180929, 174071, 185144, 166077, 177811, 191447, 218535, 205137, 205372, 243259, 276406, 280002, 297217, 328464, 334222, 307293, 290465, 310007, 349884, 362752, 367250, 343314, 297448, 271439, 259463, 238627, 224036, 216662, 228301, 208074, 190822, 188563]
11545A88563J9243M9707K572K591J1400J0785j2667j9794k4562O887k637r880
11533B22208M0105M033K370J1875J4945K1681K1699j2020k337k2203J2351L62
11521C15069k5530p383O529m562J5768j9938m7154m2702J4957K3572j7454j7221
11509A93951N615J4149j2427k472k5945l8989j0571p302k5214J5160M9371j7197
11497A38129k427R96k195j1644Q69m721q407j1232O204J3712N25J0991m878j0852
11483A15070K0525J6339J5549j5476J1446J4716r651k4624K737j7543N49k1168
11471A08469j5702L640j76J2805q038J2071M2443J6863j5002K511o667Q592j4636
11458A47173j5J332j732j9315J0558r366k2134j2252J2727K7827K2817J3381k0404
$$ y = [188563, 207806, 257513, 260085, 262676, 274076, 284861, 272194, 252400, 227838, 234725, 232088, 222208, 262313, 266346, 268716, 280591, 295536, 317217, 338916, 326896, 324559, 302356, 314707, 315069, 289539, 282156, 288685, 284123, 299891, 279953, 232799, 190097, 205054, 228626, 211172, 193951, 199566, 213715, 201288, 198816, 172871, 133882, 123311, 116009, 90795, 105955, 155326, 138129, 135702, 136698, 134503, 122859, 123728, 119007, 110600, 99368, 105572, 119284, 119809, 130800, 125922, 115070, 135595, 151934, 167483, 152007, 163453, 178169, 168518, 143894, 146631, 129088, 129637, 108469, 92767, 96407, 96231, 109036, 100998, 113069, 155512, 172375, 157373, 159884, 153217, 161809, 147173, 147158, 148490, 146758, 127443, 138001, 128635, 106501, 94249, 106976, 134803, 157620, 171001, 150597]
11445A50597p898K9056L0728K3003K6247J0790j2326j1873J0461J9943L0304K5722
11433C24754J2642Q102J0483m473J7627J7343m617p68k3862l0738n530r570j1712
11420B99681j0802k0285k5686J0085L2213J3903K582J5645K470l83j7611l3445
11408B68367J1640J029N01L852j0095l6796L546L1266K5298J6148p984K4432J5681
11395C46885j3324O543J3434J0561j5508r259J007p843o723l3587l2634l6179
11383B23373Q152J4432K18P487l017j3454L862l170K97r49J9397j6023k0391r959
11369B10255J6756M0130K7018l554k6665k2136j2542p354M298j0403J5148J0421
11357B41372q018J2589j6991k3029R43l884K0246r893l6892n337J3610P238p298
$$ y = [150597, 142699, 171755, 202483, 225486, 251733, 262523, 250197, 238324, 248785, 268728, 299032, 324754, 337396, 345498, 355981, 351508, 369135, 386478, 381861, 381093, 357231, 326493, 320963, 311393, 299681, 288879, 268594, 242908, 252993, 285206, 299109, 301691, 317336, 319806, 319423, 301812, 268367, 280007, 281036, 281537, 285389, 275294, 238498, 242044, 273310, 298608, 314756, 306772, 331204, 346885, 333561, 340104, 353538, 364099, 348591, 339332, 340339, 332496, 325773, 292186, 259552, 223373, 231525, 245957, 246175, 253662, 250645, 237191, 241053, 237883, 238180, 237231, 256628, 240605, 220214, 210255, 227011, 267141, 294159, 290605, 263940, 241804, 229262, 221908, 226206, 215803, 230951, 241372, 233354, 245943, 228952, 205923, 206866, 202982, 223228, 213335, 176443, 171106, 184716, 191954, 184656]
11344A84656M72j3662m751J927J4872o079P38j5179m308j2600L889j031p173k314
11330A39457J9439P364M490j3291N430p163Q749K4563j3132N278K6974J1864j0971
11317B09051O717M2180L0199L7561J4150K9218K6821n730l093M7459M1807k7128
11305D49212m926k6663l7183j9598L131L0284k6175k8894J397J5864j231J004
11293C56222J4119k909M96J7176M396k8639m094Q891K5888l643M1137K7769k547
11280D54262K412M6897P2532K7600L0359J1009R765K3745n283n7453k1964l2149
11268E61732k9574k8639r978j6145j5399j4551k344l0648O303o521k5936j2547
11256C75753o817P417L1173K2519K1695L3471K1767n470r575q193K346P488l5114
$$ y = [184656, 185128, 171466, 166715, 168642, 183514, 177435, 178173, 162994, 158686, 146086, 149975, 148944, 141771, 139457, 158896, 166260, 170750, 157459, 162889, 155726, 164475, 189038, 175906, 181184, 208158, 220022, 209051, 215768, 257948, 288147, 325708, 339858, 369076, 395897, 390167, 387074, 434533, 476340, 449212, 444286, 417623, 380440, 360842, 363973, 394257, 368082, 339188, 340585, 356449, 355218, 356222, 370341, 367432, 367928, 385104, 389500, 360861, 356767, 365658, 391546, 387903, 429040, 456809, 454262, 456674, 503571, 576103, 603703, 634062, 645071, 654836, 678581, 673298, 615845, 593881, 561732, 532158, 503519, 493541, 477396, 461997, 447446, 445102, 414454, 420757, 414236, 388300, 375753, 368936, 376353, 407526, 430045, 451740, 485211, 506978, 501508, 491933, 483740, 486086, 493574, 458460]
11243D58460k0513l4299k9678k0774q855r113N420J9240J7324j0213l3705q006
11231C25288l6130j52K4665J4295L2660J4240p503M544j6957o636L384j0731l3274
11218C07693k8311k6335Q652J0752K6587J9331J756K1101J5283K3762k212k4565
11206C53494k593K596j4449k2641q180q747Q641K5286J9178J6746j8366k8077
11194C22888m5429j6565l028L9253k972j1114K070J6047j826K524J4923q674J7898
11181C25995J2895J787j1423k2738j9883J0496J1184n809J3123K5179n018l6226
11169B99562j097J6348J1213j5331o864O243J4785R439r736j3987k1431P809L0532
11156C27485J6558Q095J6999R526J11j5536k0701m3866j1068J7663j934K8595
$$ y = [458460, 437947, 403648, 373970, 353196, 344341, 335228, 340648, 359888, 377212, 366999, 333294, 325288, 289158, 289006, 313671, 327966, 360626, 374866, 367363, 371907, 354950, 348314, 351698, 340967, 307693, 279382, 253047, 261699, 272451, 299038, 318369, 320125, 341226, 356509, 380271, 378059, 353494, 350901, 353497, 339048, 316407, 308227, 299480, 308121, 333407, 352585, 369331, 350965, 322888, 277459, 260894, 257866, 297119, 294147, 283033, 285103, 301150, 299324, 301848, 316771, 308097, 325995, 338890, 340677, 329254, 306516, 286633, 297129, 308313, 302504, 315627, 340806, 335788, 299562, 298465, 314813, 326026, 310695, 303831, 310074, 324859, 334298, 324562, 310575, 289144, 296953, 327485, 344043, 352138, 369137, 378663, 378774, 363238, 342537, 298671, 287603, 305266, 303332, 331927]
11144C31927L2607q746m3346r697J4075K6632L0875J2555j056k4444P021k701
11132C65702k0565Q332l330l2771j1701o09k2035J4896L5094J2711J3294J4410
11120C73428m377M161r756j0713l690N176J1596M336l293P010k2474j4999R227
11107C45632L0458M1870L1492K2551j9878k346M862J1918K3647J5452j633r073
11095D94952K6952j185o652M3946K9572K5188J3554N106k208O837k4235l3812
11083E78015j6393k1207k0080j8945N792R89p847j6873M124m549K6909J4483J0840
11070E35258J8771K3912J0336k1762k178L8404K8493J2915l3215J5709L0532J3467
11058F70642j335K1066m923o382M0007J8513J6717J5349R060O67J5488p809n432
$$ y = [331927, 364534, 355788, 312442, 302745, 316820, 343452, 374327, 386882, 385826, 361382, 368403, 365702, 345137, 353469, 350139, 317368, 305667, 305058, 283023, 297919, 333013, 345724, 359018, 373428, 369051, 373212, 363456, 352743, 349053, 354229, 365825, 370161, 366868, 373878, 351404, 336405, 345632, 376090, 417960, 449452, 472003, 452125, 449779, 454641, 466559, 490206, 505658, 504025, 494952, 521904, 520719, 514067, 558013, 587585, 612773, 626327, 631433, 629225, 636062, 611827, 578015, 561622, 540415, 520335, 501390, 507182, 508171, 500324, 483451, 487575, 483026, 509935, 524418, 535258, 554029, 577941, 588277, 566515, 564337, 602741, 631234, 644149, 610934, 626643, 657175, 670642, 669307, 690373, 685450, 679068, 719075, 737588, 754305, 769654, 778714, 779381, 794869, 787060, 781628]
11045G81628J5379M6854N2455j3114K983J7293Q695P100n0399l8447l5550n1796
11033G43081m3468m6593j610L1441L4181O4196J5199l552O560J2093J3966J0760
11021H36254J814K8376K2443j4214l2081j9713j4058m2820l5833l4062P306R86
11009G04398j5343P250q856j3760j4541l359K8035j1371l7495j2612L412K2158
10997F47916J8365L8396J7526K2699K1728j9216k5329j110K3098j2133k158K2976
10985G52758O336J478j0176p571J7524M0776J2186K496J036K7980L882k4228O3
10972H24540L4931N948M703R392K7388K4651O527J6202J6641p649K2136K8998
10960A014408m522R087O717j1061j6241J1655N2810Q580p117K1906M8367M7537
$$ y = [781628, 797007, 843861, 896316, 883202, 886185, 903478, 912173, 919273, 868874, 830427, 794877, 743081, 699613, 653020, 651410, 682851, 717032, 781228, 796427, 792875, 799435, 811528, 825494, 836254, 838068, 866444, 888887, 874673, 842592, 822879, 808821, 766001, 730168, 696106, 703412, 704398, 689055, 696305, 687449, 673689, 659148, 655789, 683824, 672453, 634958, 622346, 625758, 647916, 666281, 704677, 722203, 744902, 766630, 747414, 722085, 720975, 744073, 731940, 729782, 752758, 759094, 760572, 750396, 742825, 760349, 801125, 813311, 815807, 816843, 844823, 848705, 824477, 824540, 859471, 865419, 870122, 879514, 906902, 931553, 938080, 954282, 970923, 963274, 985410, 1014408, 1009886, 1018973, 1025690, 1014629, 998388, 1010043, 1062853, 1071433, 1064316, 1086222, 1134589, 1182126]
10948A182126K8000L3132J3340N897M1456N9770K9163K7778J420K7615L1532K2840
10936A504069N1130M9949L4551L5456P0760P5772O3385L6951M7401P7637R5643
10925B142704O1739O0884J08312J22533J55118J68010J84098J51528K12479K39030
10915C606435K84778K94862L37299L76859M54805N18294N92127P18496Q86583
10906H070538J084573J354047J747316K177284K699882L334385L995849M654631
10898B9118505N167351N421694N313709M719318L638082K069901J90814j664981
10890E3974393l259680m267826m642812m375583l671826k914171k276004j640621
10882B6925870r31337j46285N48233J059380J448485J781901J988784J940381
$$ y = [1182126, 1210126, 1243258, 1256598, 1262495, 1303951, 1363721, 1392884, 1420662, 1422082, 1449697, 1481229, 1504069, 1555199, 1605148, 1639699, 1675155, 1745915, 1821687, 1885072, 1922023, 1969424, 2047061, 2142704, 2204443, 2265327, 2373639, 2496172, 2651290, 2819300, 3003398, 3154926, 3367405, 3606435, 3891213, 4186075, 4523374, 4900233, 5355038, 5873332, 6465459, 7183955, 8070538, 9155111, 10509158, 12256474, 14433758, 17133640, 20468025, 24463874, 29118505, 34285856, 39707550, 45021259, 49740577, 53378659, 55448560, 55639374, 53974393, 50714713, 46446887, 41804075, 37428492, 33756666, 30842495, 28566491, 26925870, 25994533, 25848248, 26396481, 27455861, 28904346, 30686247, 32675031, 34615412]
10874C4615412J631718J191319P92305P03213Q73275J290436J810265K395767
10866D5303710K740042K724023K291065J482241M52320o84332j711002k367804
10858E0230263k536652k342169j959639j469852j094306r77267j115169j397362
10850C7337847j785074k193748k392574k159215j579613q94262j73909N10897
10842B6670349J194588J873290K522501L161808L670362L905245L848700L478179
10834E0325022K706142J473570j05146j742519l191786m279187m902772m943058
10826C5340266m571817l920518l258876k594486k085482j720596j397324j172866
10818A4618301j016339q73376p03770o18310n80529n30433m87666m64689l95186
$$ y = [34615412, 36247130, 37438449, 38230754, 38933967, 39807242, 41097678, 42907943, 45303710, 48043752, 50767775, 53058840, 54541081, 54993401, 54309069, 52598067, 50230263, 47693611, 45351442, 43391803, 41921951, 40827645, 39850378, 38735209, 37337847, 35552773, 33359025, 30966451, 28807236, 27227623, 26333361, 26159452, 26670349, 27864937, 29738227, 32260728, 35422536, 39092898, 42998143, 46846843, 50325022, 53031164, 54504734, 54399588, 52657069, 49465283, 45186096, 40283324, 35340266, 30768449, 26847931, 23589055, 20994569, 18909087, 17188491, 15791167, 14618301, 13601962, 12728586, 12024816, 11406506, 10825977, 10295544, 9807878, 9343189, 8948003]
10809H948003l68067l26006l03743l09582k45290k38863k14113k02801k02087
10800F537451k19128j81526j69765j82925j87003j43906j52676j30616j30949
10791E038957j17849j04695r8471j17183p7893q4991p9075o0468n7172l1776J7536
10780D226920M9388Q6284J00960J11000J28460R1233O3651K8301q3606k10067
10770D592524k88291l00672k46064j85227j85800j73593j08126r1703q3983n8503
10760B870562m4052o6291r2700m5267m1537l4003l5935l3121n0520m1668o0343
10749B325125n7247k0316J861j1635k080k3885K3k0968j9776j5011j3345l4071
10737B108675k0267M445M981J7605k3165J0688M69j7727J8516K8051L1476J7673
$$ y = [8948003, 8579936, 8253930, 7950187, 7640605, 7395315, 7156452, 6942339, 6739538, 6537451, 6318323, 6136797, 5967032, 5784107, 5597104, 5453198, 5300522, 5169906, 5038957, 4921108, 4816413, 4717942, 4600759, 4522866, 4437875, 4358800, 4298332, 4241160, 4209384, 4226920, 4276308, 4362592, 4463552, 4574552, 4703012, 4794245, 4857896, 4886197, 4802591, 4592524, 4304233, 4003561, 3757497, 3572270, 3386470, 3212877, 3104751, 3013048, 2929065, 2870562, 2826510, 2760219, 2667519, 2622252, 2580715, 2546712, 2510777, 2477656, 2427136, 2385468, 2325125, 2267878, 2247562, 2249423, 2237788, 2235708, 2211823, 2211846, 2190878, 2171102, 2156091, 2142746, 2108675, 2088408, 2092853, 2097834, 2115439, 2092274, 2102962, 2103431, 2085704, 2104220, 2132271, 2163747, 2181420]
10725B181420M4247L1263j6261k7161J0228L5993J8613l981j4401K3807L4822
10714B318589k3824j8540K1860M2885Q830M3415M3707K9879M5992O2443N9361
10703B634597P3743P9980J31689J52430J59979J72105J45736J80323K13180K64712
10693D208474L13279L37802L76758M10583N08254O12178P55806R69633J224927
10684I717694J537415J933367K412888K956905L503940L951570M214802M272284
10676C4500865M065603L360573K166894P57997o27525j831464k727570l253762
10668C6411611l237484k774899k168861j630002j249386j049521q81001o94146
10660B2726311m46716j58857K31294P04207J127970J488416J744125J834344J825665
$$ y = [2181420, 2225667, 2256930, 2240669, 2213508, 2223736, 2259729, 2278342, 2274361, 2259960, 2283767, 2318589, 2294765, 2276225, 2298085, 2340970, 2349800, 2393215, 2436922, 2466801, 2512793, 2575236, 2634597, 2708340, 2788320, 2920009, 3072439, 3232418, 3404523, 3550259, 3730582, 3943762, 4208474, 4521753, 4859555, 5236313, 5646896, 6155150, 6767328, 7523134, 8492767, 9717694, 11255109, 13188476, 15601364, 18558269, 22062209, 26013779, 30228581, 34500865, 38566468, 41927041, 44093935, 44851932, 44224407, 42392943, 39665373, 36411611, 33174127, 30399228, 28230367, 26600365, 25350979, 24301458, 23420457, 22726311, 22279595, 22120738, 22352032, 23056239, 24184209, 25672625, 27416750, 29251094, 31076759]
10651C1076759J617543J270789R88789Q28302R05619J226873J698512K248171
10643D1861357K625264K623301K251471J560621N50023o59647j758603k596056
10635D6457731l063779l067434k608244j886072j151273m90142m0455J90622J16452
10626C4457406k13035o83067j159100j485416j619671j560079j222349p11729
10618B5802960j20831M41882R17369J373679J783647K180814K544476K949592
10610C7873588L307805L542336L639945L515468L063732K128616O61530j177286
10602E6555734l095045m656643n524067n656390n171213m329920l505647k769057
10594B1847752k204035j786829j489560j259471j050598q62477p32823o09486
$$ y = [31076759, 32694302, 33965091, 34953880, 35782182, 36687801, 37914674, 39613186, 41861357, 44486621, 47109922, 49361393, 50922014, 51472037, 50812390, 49053787, 46457731, 43393952, 40326518, 37718274, 35832202, 34680929, 34190787, 34150332, 34340954, 34457406, 34244371, 33561304, 32402204, 30916788, 29297117, 27737038, 26514689, 25802960, 25682129, 26124011, 27041380, 28415059, 30198706, 32379520, 34923996, 37873588, 41181393, 44723729, 48363674, 51879142, 54942874, 57071490, 57733020, 56555734, 53460689, 48804046, 43279979, 37623589, 32452376, 28122456, 24616809, 21847752, 19643717, 17856888, 16367328, 15107857, 14057259, 13194782, 12461959, 11852473]
10586A1852473n51838m57235m12603m06975m41060m02981l70912l75225l08081
10577H125563k76133k91721l01138k68404k43191k31625j50880j18522j26691
10568F117258j41605j41581j13054j27849j42393j08304j22817j24773p9242o0198
10558D955442q3739j12671j11023j08128o7352o2712n7431n1822o7723p0208q8627
10547D074006o9339p0595o8862m8867o5846p8853o3194l2338n6028l3069k7505
10536C459510P631K3549L842R403J9654L2561J5896K9252J2202J8303N1358O0615
10524C743776O6390M4068M7986M6082P1263N7918K8768O9299M5304O9719J08820
10513D399393J42655J46343J89561K46338L01708L89804L97975L76538L43390
$$ y = [11852473, 11300635, 10843400, 10430797, 10023822, 9582762, 9179781, 8808869, 8433644, 8125563, 7849430, 7557709, 7256571, 6988167, 6744976, 6513351, 6362471, 6243949, 6117258, 5975653, 5834072, 5721018, 5593169, 5450776, 5342472, 5219655, 5094882, 5015640, 4955442, 4871703, 4759032, 4648009, 4539881, 4472529, 4409817, 4352386, 4300564, 4232841, 4162633, 4074006, 4004667, 3934072, 3865210, 3816343, 3750497, 3671644, 3608450, 3576112, 3520084, 3487015, 3459510, 3467141, 3490690, 3494532, 3503935, 3523589, 3556150, 3572046, 3601298, 3613500, 3631803, 3683161, 3743776, 3810166, 3854234, 3902220, 3948302, 4019565, 4077483, 4106251, 4175550, 4220854, 4290573, 4399393, 4542048, 4688391, 4877952, 5124290, 5425998, 5815802, 6213777, 6590315, 6933705]
10504F933705L60405M01302L55574Q4720j55526j15632M8155K02537L48807M66184
10494H930231N75859O74443P90226Q89247J022287J184165J362592J546063J720082
10485A8695195J930573K120911K342911K814042L602378M708768O259039Q442099
10477E0915916J1538099J6105984K2776563L1429096M0078516M3693902L8960917
10470B55498993L2488399L1905132K9901652R953630l3596941o4810810o0968821
10463B00371234m4755384l1277607k2191858j6010413j1766368q820470o776834
10456E8772300n352153m252799l458800k928706k538841k242845j961071j865065
10448C4172020j929301j861339j702237j492343j293499j115600r75677q44669
$$ y = [6933705, 7294110, 7695412, 8050986, 8135706, 7980180, 7864548, 7912703, 8115240, 8464047, 8930231, 9506090, 10180533, 10970759, 11860006, 12882293, 14066458, 15429050, 16975113, 18695195, 20625768, 22746679, 25089590, 27903632, 31506010, 36214778, 42473817, 50915916, 62454015, 78559999, 101336562, 132765658, 172844174, 216538076, 255498993, 287987392, 319892524, 349794176, 359747806, 326150865, 261340055, 200371234, 155615850, 124338243, 102146385, 86135972, 74369604, 65549134, 58772300, 53420147, 49167348, 45708548, 42779842, 40241001, 37998156, 36037085, 34172020, 32242719, 30381380, 28679143, 27186800, 25893301, 24777701, 23802024, 22957355]
10440B2957355p61471p01585o77873o74898o82744p60825p56814p02599o37320
10431A6601226o12429n53595m90005m41827m14783l58692l17280l17049k95924
10422A2799642l22547l14926l16096l34472l08286k70061k22994k25319k22149
10413A0262792j48352j02474r8173j28465j55779j46911j32333j29656r3694n1512
10403I075443q2779p4659o7702r2432n5590l2952k0009n0857o5035o1909k4827
10392H446692P376K8757M2594Q2147J30557J89678K37817L13035L90904M56922
10382A0326479N27298O33796P72551Q32775R75342J191126J343536J477460J679129
10373A9759492J881489K122167K387813K619611K943585L682451M842455O520941
$$ y = [22957355, 22195884, 21494299, 20816426, 20141528, 19458784, 18697959, 17941145, 17238546, 16601226, 15988797, 15435202, 14945197, 14503370, 14088587, 13729895, 13412615, 13095566, 12799642, 12477095, 12162169, 11846073, 11511601, 11203315, 10933254, 10710260, 10484941, 10262792, 10114440, 10011966, 9913793, 9785328, 9629549, 9482638, 9350305, 9220649, 9126955, 9075443, 8992664, 8918005, 8850303, 8757871, 8702281, 8669329, 8649320, 8598463, 8533428, 8471519, 8446692, 8454068, 8482825, 8525419, 8607566, 8738123, 8927801, 9165618, 9478653, 9869557, 10326479, 10853777, 11487573, 12260124, 13092899, 14068241, 15259367, 16602903, 18080363, 19759492, 21640981, 23763148, 26150961, 28770572, 31714157, 35396608, 40239063, 46760004]
10365D6760004Q870887J2237003J7089747K3657870L1545387L8419500M0214948
10358B18795346L5815937L0902878K9160278K2955972M00945l5913042n7395709
10351B44722605n3509706m0499295k9035722k0863576j5199215j1270991q478749
10344F5865351o533308n115326m071915l359530k882676k529281k267128k192846
10336C6913341k240613k225422k084798j848480j608621j401749j217394j054090
10328B3232174r76623q84741q04766p81959p31034p14885p38574p33008o90669
10319A6175915o59935o38646n47268n21218m84439m31794m26683m09021l77959
10310A1678952l67258l27831l60922l82693l70742l74145l47932k99176k64954
$$ y = [46760004, 55630891, 67867894, 84957641, 108615511, 140160898, 178580398, 218795346, 254611283, 285514161, 314674439, 337630411, 338031356, 302118314, 244722605, 191212899, 150713604, 121677882, 100814306, 85615091, 74344100, 65865351, 59332043, 54216717, 50144802, 46785272, 43902596, 41373315, 39106187, 36913341, 34672728, 32447306, 30362508, 28514028, 26905407, 25503658, 24286264, 23232174, 22255551, 21370810, 20566044, 19784085, 19053051, 18338166, 17599592, 16866584, 16175915, 15515980, 14877334, 14330066, 13808848, 13324409, 12892615, 12465932, 12056911, 11678952, 11311694, 10983863, 10622941, 10240248, 9869506, 9495361, 9147429, 8848253, 8583299]
10301H583299k34701k12079k09965k10002j76797j81531j91091j87299j71463
10292F808371j65311j58413j39923j53608j62260j51063j70465j89369j72521
10283E345438j52816j28056j60676j98477j80342j88813j42127j10605j13601
10274C969925j04187q6186q6398r6208p6671q7329o6828k8809l8208q3225n6654
10263C159222o9874o2123l6821m6976k5708o724j1815j9055J0952N789k4480l2904
10251B839483l2389r051p394j9921k8883j2253l601r265l7473q2563p2846p5029
10239B448815o0524m2886p9672j15290j00992p9600n5794m0317k1909k1846j6545
10228A813440l6881n8872r7087j05868r3908n5850n1929l3706m2347m5340p465
$$ y = [8583299, 8348598, 8136519, 7926554, 7716552, 7539755, 7358224, 7167133, 6979834, 6808371, 6643060, 6484647, 6344724, 6191116, 6028856, 5877793, 5707328, 5517959, 5345438, 5192622, 5064566, 4903890, 4705413, 4525071, 4336258, 4194131, 4083526, 3969925, 3865738, 3779552, 3693154, 3596946, 3520275, 3432946, 3366118, 3337309, 3299101, 3215876, 3159222, 3089348, 3027225, 2990404, 2943428, 2917720, 2910996, 2899181, 2880126, 2891078, 2896867, 2872387, 2839483, 2807094, 2798043, 2790649, 2770728, 2741845, 2729592, 2725991, 2716726, 2679253, 2596690, 2523844, 2448815, 2388291, 2345405, 2265733, 2150443, 2049451, 1969851, 1914057, 1873740, 1851831, 1829985, 1813440, 1776559, 1717687, 1620600, 1514732, 1420824, 1364974, 1313045, 1279339, 1236992, 1191652, 1184187]
10217A184187m030k1448l4442p8781p0267q360R723j1721J5871J1893O51j0448
10205I82828M749j1576j2112l3378m6978l8894j4145K4206K4949l858m2337n4764
10193G78690P502M7399L8056J8735L4895L4048J3978O387k462k4719l0701k1667
10181I00141j4583k9905k6507k2665j3659L2685N661K0894j5019k0178j6256m4392
10169G56217k5554r554k9253o6225m3682n1475p1657j4867j83M975k3249l7596
10157C87897N168J8981j3670j1760L3679J1619J8603L500K657j0911j3329j2200
10145D20234j1971J8733K3536L028P762L3747K5216J554j840J9316q660l778J5502
10132E42379O031R092O119J314J2416j3398j5099r464n915N426l972Q40J84M2892
$$ y = [1184187, 1180157, 1158709, 1124267, 1045486, 975219, 966859, 976582, 964861, 980732, 992625, 993276, 982828, 987577, 976001, 963889, 930511, 883533, 844639, 830494, 854700, 879649, 875791, 833454, 778690, 786192, 833591, 871647, 890382, 925277, 959325, 973303, 979690, 977228, 952509, 921808, 900141, 885558, 855653, 829146, 806481, 792822, 825507, 831168, 852062, 837043, 816865, 800609, 756217, 730663, 721109, 691856, 625631, 581949, 530474, 458817, 443950, 443767, 448742, 425493, 387897, 393065, 412046, 398376, 386616, 420295, 431914, 450517, 454017, 456674, 445763, 432434, 420234, 408263, 426996, 450532, 453560, 461322, 495069, 520285, 521839, 519999, 539315, 530655, 526877, 542379, 548410, 557502, 563621, 564935, 577351, 563953, 548854, 539390, 533475, 538901, 534929, 535769, 535953, 578845]
10118E78845K8059K9993N7572Q2195R5170J17300J24512R5149Q3825N3028J9324
10107A364972l5030j54001j60611j17060j03012r2538r1265m8324r930q321l2207
10096E12673j1911M40j6849p368k1946k4815l4891J1034j306l2554o1124l3674
10084B77709j6479J0800L5288J0957n935N287j7028k4549N242j7601N617J148
10072B70456N471O06o450R848K4661K699Q457j1581L2878J315k1573k7496j190
10059B88101K0964M2085M0052M5383J0921M6122P6074P8718J35380J60605K13672
10048A158077K25450K16618J80269J62563J58729M5765j57278l16704l07266k44770
10038A121453j51580j46283j19396r3111o9059k1927l0597l3544k9592j1987M834
$$ y = [578845, 606904, 636897, 694469, 776664, 871834, 989134, 1113646, 1208795, 1292620, 1345648, 1364972, 1329942, 1175941, 1015330, 898270, 795258, 702720, 611455, 563131, 553201, 544880, 512673, 500762, 501202, 484353, 476985, 455039, 430224, 395333, 406367, 405061, 372507, 311383, 277709, 261230, 272030, 307318, 318275, 312340, 317627, 300599, 276050, 281292, 263691, 269308, 270456, 275927, 276533, 270083, 279931, 304592, 307291, 315748, 304167, 337045, 338360, 316787, 289291, 288101, 309065, 351150, 391202, 436585, 447506, 493628, 569702, 648420, 783800, 944405, 1158077, 1383527, 1600145, 1780414, 1942977, 2101706, 2147471, 1990193, 1673489, 1366223, 1121453, 969873, 823590, 704194, 611083, 542024, 520097, 489500, 455956, 426364, 414377, 419211]
10027D19211j8757j2559j0392k7521k2120K2196J340l4676J2074J53l549k9626
10015B95774k2550j7853j5244M836K3570k740k7527j9949n338N629L8101M2525
10003B99234R018N932L411o696j837K3642P416J4539o529j2383n118R547Q584
9990C48760j97k2273q269J2335q619l313Q3n328n968k7197j7114P609L6117K5784
9976C32410j7901j3683j2521r001j209m622M17L4810M7615J6608O778J8938K5154
9963D23793L514J1890O154j145K9212K0609K2901J3985r979p384J1555M1721r055
9950E57771l3468j8430j2310n891j4066J6153O3024M7927K9592L5221O7379O8622
9938H01524Q2844J32452J45697J93227K05871J79960J33579J23926N1443r5324
$$ y = [419211, 400454, 387895, 377503, 349982, 327862, 350058, 351398, 316722, 328796, 328949, 325400, 295774, 273224, 255371, 240127, 244963, 268533, 265793, 238266, 218317, 212979, 218608, 256709, 299234, 308252, 314184, 317595, 310899, 309062, 332704, 340120, 354659, 348130, 335747, 330629, 340176, 348760, 348563, 326290, 318021, 330356, 321737, 318424, 318507, 313179, 307211, 280014, 262900, 270509, 306626, 332410, 314509, 300826, 288305, 279304, 278095, 273473, 273890, 308700, 356315, 372923, 379701, 398639, 423793, 427307, 439197, 445351, 444206, 473418, 494027, 516928, 530913, 520934, 513550, 525105, 566826, 557771, 524303, 505873, 493563, 487672, 473606, 489759, 552783, 600710, 630302, 665523, 732902, 801524, 884368, 1016820, 1162517, 1355744, 1561615, 1741575, 1875154, 1999080, 2050523, 1955199]
9928A955199k34535k53521k32308j65548j20334o9155n9842m7077m0045l8906
9918F93928l1137q129L2483j7386k4461n359n587O704J0247j4538j749n76N061
9905F39501N218p334l8188j2150P082j8142J4740K4721J2182m715q350q738O415
9892F12242J9180L0668M4404K1018p462q111J4723J5686n931K1032P4783M2489
9880H74721J2226K9004N0299M7452M2358L2605O6974M0401M6093N6511R7315J19159
9868A515118J37190J36126J30691K06839K37891K70998L39408M46209N35057O51534
9858D607061Q20472J038305J269163J414234J438268J379139J265215J022734
9850A4254591N83295m7814p51758j215342j282071j073036q15768n81020m00572
$$ y = [1955199, 1720664, 1467143, 1234835, 1069287, 948953, 879798, 819956, 772879, 732834, 693928, 662791, 654662, 687145, 669759, 645298, 639939, 634352, 641056, 651303, 636765, 635016, 634440, 639501, 644719, 637385, 599197, 587047, 594129, 575987, 590727, 615448, 627630, 622915, 614565, 605827, 612242, 631422, 662090, 706494, 727512, 720050, 711939, 726662, 742348, 736417, 757449, 832232, 874721, 886947, 915951, 966250, 1013702, 1056060, 1088665, 1155639, 1196040, 1242133, 1298644, 1395959, 1515118, 1652308, 1788434, 1919125, 2125964, 2363855, 2634853, 2974261, 3420470, 3955527, 4607061, 5427533, 6465838, 7735001, 9149235, 10587503, 11966642, 13231857, 14254591, 14837886, 14790072, 14038314, 12822972, 11540901, 10467865, 9652097, 9071077, 8670505]
9841H670505k64762j92394k21744k21298j71527k0404J03830K68209M17752M92371
9831H860538N61057O47854O82513O65214N35604M25933M01184M97747P61464J014653
9821A5053761J233998J488087J834100K146423K401178K524836K453867K293205
9813C1429455K043173J588164Q80416J09648m59420j026168j669300k097563k063661
9804B8734744j719213j452181j309531j274719j182391r35522o32383l52931q0975
9795A9794898J94523M57907P17347Q96980R56484R65380R04049P65359O14178
9786B6267105O16955Q36755J153507J490036J783992J881938J686943J306756
9778C7023987R35368Q18500P46155N74435K46677j52741m65255p40914j005841
$$ y = [8670505, 8405743, 8213349, 7991605, 7770307, 7598780, 7578376, 7682206, 7950415, 8368167, 8860538, 9421595, 10069449, 10751962, 11417176, 11952780, 12378713, 12779897, 13277644, 14039108, 15053761, 16287759, 17775846, 19609946, 21756369, 24157547, 26682383, 29136250, 31429455, 33472628, 35060792, 35941208, 36050856, 35591436, 34565268, 32895968, 30798405, 28734744, 27015531, 25563350, 24253819, 22979100, 21796709, 20861187, 20228804, 19875873, 19794898, 19989421, 20447328, 21164675, 22061655, 23018139, 23983519, 24887568, 25652927, 26267105, 26884060, 27720815, 28874322, 30364358, 32148350, 34030288, 35717231, 37023987, 37959355, 38777855, 39524010, 40098445, 40345122, 40192381, 39727126, 38986212, 37980371]
9769C7980371j267700j653261j920378j885084j596721j215179r77789j061311
9761B6402948j284148j310844j217783j021261p12189m03061l9739L00980N41329
9752B1256232O85537P92508R32783J055600J047024R76508R73142J021508J142148
9743B9882990J141282R05091N54576K20487j55827o22041j166046j679932j945696
9734B7134884j917557j720066j445444j310358j212210j080270r31289p89186
9726A6728504p04092o17387n86830o04275p17860q39850q51958p29231n51906
9717A0525115l69851k63131j56136k8938L8456O1252J37210J62849J85841K68770
9707A0561437L74845N30226O50988P35134O69929N26046L26474j7257n16455j011326
$$ y = [37980371, 36712671, 35059410, 33139032, 31253948, 29657227, 28442048, 27464259, 26402948, 25118800, 23807956, 22590173, 21568912, 20856723, 20453662, 20413923, 20714903, 21256232, 21941769, 22734277, 23667060, 24722660, 25769684, 26746192, 27719334, 28740842, 29882990, 31024272, 31929363, 32483939, 32704426, 32548599, 31926558, 30760512, 29080580, 27134884, 25217327, 23497261, 22051817, 20741459, 19529249, 18448979, 17517690, 16728504, 16024412, 15407025, 14820195, 14215920, 13498060, 12658210, 11806252, 11077021, 10525115, 10155264, 9892133, 9735997, 9707059, 9745515, 9806767, 9943977, 10106826, 10292667, 10561437, 10936282, 11466508, 12117496, 12852630, 13522559, 14048605, 14375079, 14357822, 13841367, 12830041]
9697A2830041j372135j377653j205651j024473q06637o48032n18975m26512l39478
9688E110495k86421k60605k40863k13788k02473j97355j90013j38414j42491j19526
9678C118546r4961j17850j15155o0643p6521o6556r0775q5430o2920p5927m8043
9667B223765l3182q2043q8123p1908n4496o9602n1570m4410j6688n8084m8172
9656A605487m022o3621m3134m2414m3866j1888m7212m1121k6097m1009l1907k4286
9644A184910o2026k1874j8540k2076r126j8763j4898K09k1456l6682j0272l3497
9632I15909k5651j5702j8287l0716r064j6918j9082k7862n831j2140j4488l5705
9620F84463k2111N239j7192k7623k1364J2040r263l7378J2976J0294o324k221
$$ y = [12830041, 11457906, 10080253, 8874602, 7850129, 7043492, 6395460, 5876485, 5449973, 5110495, 4824074, 4563469, 4322606, 4108818, 3906345, 3708990, 3518977, 3380563, 3238072, 3118546, 3023585, 2905735, 2790580, 2729937, 2653416, 2586860, 2496085, 2410655, 2347735, 2271808, 2223765, 2190583, 2108540, 2020417, 1948509, 1894013, 1824411, 1772841, 1728431, 1711743, 1653659, 1605487, 1601465, 1537844, 1494710, 1452296, 1408430, 1396542, 1349330, 1308209, 1282112, 1241103, 1209196, 1184910, 1122884, 1101010, 1082470, 1060394, 1051268, 1032505, 1017607, 1017816, 996360, 959678, 949406, 915909, 890258, 874556, 856269, 825553, 816489, 799571, 780489, 752627, 746796, 734656, 720168, 684463, 662352, 667591, 650399, 622776, 601412, 613452, 604189, 566811, 579787, 590081, 583757, 581536]
9608E81536m6650k771J895k1750k1394K917J6198k002j283j6130n026L32j3353
9595D72519o410Q268j6656j8849k7344j6474J6573N846j5719k1444l547k2475
9583C54288k8080k2532Q592K2291J4594j5162J103J4717q898k126l4083l0600
9571B74104K0573l122o066R417J2521j3617m76R910j3038p057J0728J1965n252
9558C00590m200M4082J0458j664L628j6268l9656l2408l9485j8772K05R252K3722
9545B39484J4785j9217j8645K948K491j4339NJ5397K506K640q952L983J5926M30
9531B39442j5268j8907J2824J4101J8627j717k9112j2350j0431J0831J8631K068
9519B28739J2867r511m6183j9178R430Q864M263k2681r601J375J6050P362O026
$$ y = [581536, 534886, 532115, 534010, 512260, 490866, 493783, 509981, 507979, 506696, 490566, 485540, 485872, 472519, 466109, 474377, 457721, 438872, 411528, 395054, 411627, 417473, 401754, 380310, 376763, 354288, 326208, 303676, 312268, 334559, 349153, 333991, 335094, 349811, 340913, 338787, 304704, 274104, 294677, 291555, 285489, 294906, 307427, 293810, 293334, 303244, 290206, 283149, 293877, 305842, 300590, 296390, 340472, 350930, 349266, 352894, 336626, 296970, 264562, 225077, 206305, 206510, 215762, 239484, 254269, 235052, 216407, 219355, 221846, 207507, 207512, 222909, 225415, 228055, 219103, 223086, 239012, 239442, 224174, 205267, 218091, 232192, 250819, 249102, 219990, 207640, 197209, 208040, 226671, 228739, 241606, 232095, 185912, 166734, 176164, 185028, 189291, 166610, 157009, 158384, 174434, 181796, 187822]
9506A87822L710q003j4036r944L0140j6564O32J0993j3610k0980j932J4591L363
9493A66182R661J8632R088j0000k2463K45k1932p710j8785k5963O533K5041L5918
9480A64447J6173j3186j3098K1446P475k0628J229L0198p558J2757r085N677j4757
9467A81090j1383j0330l613K3854j2333j7271n23K4601r29L148J9518p53r237
9454A85839K1156L1790J0707J5863j2407k6805J3904J1607J2950j9022j1164Q437
9442B42855o544o911m3181k3018J2972J9265q580p22N536p025k4086J2268K8358
9429B01187J4167J8878J0123j3194J1540L1473k1408l6267j349K7372J6363J8506
9417B77391P0M535J7298N12R171L3803K5713k4771j0841M390J9162o020j0457
$$ y = [187822, 191532, 183529, 169493, 159549, 189689, 173125, 173757, 184750, 171140, 150160, 148228, 162819, 166182, 175843, 194475, 203563, 193563, 171100, 171345, 149413, 141703, 122918, 96955, 103488, 128529, 164447, 180620, 167434, 154336, 175782, 183257, 162629, 163858, 194056, 186498, 199255, 190170, 195847, 181090, 169707, 159377, 155764, 179618, 167285, 150014, 149491, 174092, 173163, 176311, 195829, 195076, 185839, 206995, 238785, 249492, 265355, 252948, 226143, 240047, 251654, 264604, 245582, 234418, 242855, 236311, 229400, 186219, 163201, 176173, 195438, 186858, 186136, 191672, 184647, 160561, 172829, 201187, 215354, 234232, 244355, 231161, 242701, 274174, 252766, 216499, 215150, 242522, 258885, 277391, 277461, 281996, 299294, 299806, 308977, 342780, 368493, 343722, 332881, 337271, 356433, 350413, 339956]
9404C39956r865K494L039j2711m9792m4560j5109j3073N843L6635M4914J9711
9392C07482k025j2231O07K123o038M7482L4570k8930O400M537k835o399k455m793
9378C37495K4727J6710J7464k252K208L585k4819l1623r212L4476k1391k0211
9366C27157K4978P65K975j5985j0091j119k419j2065m2961L247K3352L8q495j355
9352B88022r585L852R512K7243L27j0170J8014L3524K7351J931j6115k1196k7221
9339C25489J4365J0482J8469j0156m2036P211J9286P059k5157l3704l0163p972
9327B53173N62J3599k054o444L585J7956J1180j6880q131k0693k4896J9317R009
9314B49283p804J4747J2785j175j3819j3022k1647n911Q720K0346L2817L680j7820
$$ y = [339956, 330091, 332585, 335624, 322913, 273121, 228561, 213452, 200379, 206222, 242857, 287771, 307482, 305457, 293226, 293833, 295956, 289918, 337400, 371970, 343040, 349440, 353977, 351142, 344743, 342288, 337495, 362222, 378932, 396396, 394144, 396352, 399937, 375118, 343495, 334283, 368759, 347368, 327157, 352135, 352900, 355875, 339890, 329799, 328680, 326261, 314196, 271235, 274482, 297834, 297872, 289377, 288022, 278437, 282289, 291801, 319044, 319371, 309201, 327215, 360739, 388090, 390021, 373906, 352710, 325489, 339854, 350336, 368805, 358649, 316613, 323824, 343110, 350169, 325012, 291308, 261145, 253173, 253735, 267334, 265280, 258836, 262421, 280377, 291557, 274677, 266546, 245853, 220957, 240274, 249283, 241479, 256226, 269011, 267836, 254017, 240995, 219348, 213437, 222157, 242503, 275320, 279000, 261180]
9301B61180q790J1466o58O874j799l2J6154J1892l444j3852j4319n654k785n771
9287B50462R456K4525l031j6078m634J5284J437j69k8568q548K9833K671q021
9274B64619M586j4171j3820K4506O969k1133k5266j6Q961M649N11J9585j8775
9261B41205l2334O518N96J5675K9058q962k1158M6341J3315j4528j0775J9432
9249B84383k225j4415m737k2375r683K2766J9439n950p594n295R542n066j3329
9236B45461J1322L856k008j7528Q70J6353k662m721M363j651n661k2401J9584
9223B45177q29j2515K8839j1482j8082j2166R766j363k874J2679Q401J6786J8492
9210B80829j1001j36J821J8654m757p781l101N707q627J5883P176k1742j8541
$$ y = [261180, 252390, 263856, 263198, 270072, 268273, 268241, 284395, 296287, 292843, 278991, 264672, 259018, 256233, 250462, 259918, 284443, 281412, 265334, 260700, 275984, 277421, 277252, 248684, 240136, 269969, 272640, 264619, 269205, 255034, 241214, 265720, 272689, 251556, 226290, 226274, 235235, 239884, 240395, 259980, 241205, 208871, 215389, 215985, 231660, 260718, 251756, 230598, 276939, 290254, 275726, 264951, 284383, 282158, 267743, 263006, 240631, 230948, 253714, 273153, 267203, 259609, 254314, 263856, 258790, 245461, 256783, 260639, 258631, 241103, 241973, 258326, 255664, 250943, 255306, 253655, 247994, 225593, 245177, 244348, 231833, 260672, 249190, 231108, 218942, 228708, 227345, 224471, 237150, 245551, 262337, 280829, 269828, 269692, 271513, 290167, 285410, 277629, 274528, 280235, 271608, 287491, 294667, 272925, 254384]
9197B54384K6430P201j6765N440Q334J5228J0989j099J748r72j6647K528J1050
9184C07849J1125j4140j6052J9847m035j0523K1599Q606r816j0025o10J2103j1816
9171C04112k8715j0867l342K9661K5993n858J6287P385n002j72j1301j1257p861
9158B99063Q668J4315j346K1446K1943l905j3417k3094j5928J9559R152M7484
9146C83940L4473l1294l7731j5850N249K3666k471k9994L4283j7677l4493J1622
9134C23723J3299J6807L5211K622q319j3914m603p799P797L7918P284j0980r490
9121C89556O490J566p637O557j146q01J7453l051j4551k2808J527K084r354j4563
9107C51322J9481K2839j3268O366j2531K680Q065m410J8588L3119j0565o991j4572
$$ y = [254384, 280814, 288015, 271250, 276690, 285024, 300252, 311241, 310142, 311890, 310918, 294271, 296799, 307849, 318974, 304834, 288782, 308629, 304594, 294071, 315670, 324276, 314460, 304435, 303825, 315928, 304112, 275397, 264530, 261188, 290849, 316842, 310984, 327271, 334656, 329654, 329482, 318181, 306924, 299063, 307731, 322046, 320700, 342146, 364089, 360184, 346767, 323673, 307745, 327304, 336456, 383940, 418413, 387119, 349388, 333538, 338787, 362453, 359982, 329988, 364271, 346594, 312101, 323723, 337022, 353829, 389040, 391662, 383343, 369429, 364826, 357027, 364824, 402742, 410026, 399046, 389556, 396046, 397612, 389975, 396532, 395386, 394585, 412038, 408987, 394436, 371628, 373155, 375239, 365885, 351322, 370803, 393642, 380374, 386740, 374209, 376889, 384954, 380544, 399132, 432251, 421686, 414695, 400123]
9094D00123J4754O360o4j3735O692J257k0422m188K3124J0817J046J5090K4067
9081D64921j808j451j330N634J4215Q094j879L899k7805J744J2486J6347o940
9068D86127k2656N275r787m620J1168M3195K6453M114k4640j5506L011j0610J0937
9055E02461J4312r997j0418k7064l2017J1724O0799L1821j7971k2639k3146J6752
9043D94617K5824n569k91K5853k2994o788j5781j0951K1166n473K2202M0746J9808
9030E82369j5750l0137j9923M427J9714K2368K3020Q584J977J999k917K103L072
9017F00906N944l1045K451L71m971k854K0044L5367O8j1935J6751J6901l0732
9004F17266p776L2668N338k344J2752R521L961P626J861K24r288k6124p028j0306
$$ y = [400123, 414877, 421237, 421173, 407438, 414130, 415387, 394965, 390777, 413901, 424718, 425764, 440854, 464921, 463113, 461662, 460332, 465966, 480181, 488275, 486396, 490295, 462490, 464234, 476720, 493067, 486127, 463471, 468746, 458959, 454339, 465507, 508702, 535155, 539269, 514629, 499123, 502134, 491524, 502461, 516773, 506776, 496358, 469294, 437277, 449001, 509800, 541621, 523650, 501011, 477865, 494617, 520441, 514872, 514581, 540434, 517440, 510652, 494871, 483920, 505086, 499613, 521815, 562561, 582369, 566619, 536482, 516559, 520986, 540700, 563068, 586088, 594672, 596649, 598648, 595731, 597834, 600906, 606850, 575805, 578256, 578627, 573656, 570802, 590846, 626213, 626281, 614346, 631097, 647998, 617266, 609490, 642158, 647496, 645152, 657904, 667425, 671386, 679012, 680873, 681097, 671809, 645685, 638657, 628351]
8990F28351K5594J1729R813o57n249L296M716M025L4690K4262k4756o660k684
8977G06470l6918j7334K0696M018j9635J8795J3145r576R991M6741K2451K0876
8965G79720R436K17r200j8344m795j2649j1899N370Q148M6129M1376R214Q106
8952H50829J082k924l2816n198J6785N657L6295J7998k6788j8308P326k45K3660
8939H73353J6707n205J514J5040K741k928n525J3179O175k4032J5698J1671j2285
8926I06103j9008Q980K8151L4156J8737L680J360J5178j0065k3554r811J958J0290
8913I66155J5842K8702k546m849j4319j5493J6577K4815j7082M829K3059R303
8901A034993n472J6745J0211R261r623r894L7691M9360j1616j821J369J6544J384
$$ y = [628351, 653945, 665674, 675487, 674830, 669581, 672877, 677593, 681618, 716308, 740570, 715814, 709154, 706470, 669552, 652218, 672914, 676932, 657297, 676092, 689237, 679661, 689652, 736393, 758844, 779720, 789156, 789373, 780173, 761829, 757034, 744385, 732486, 737856, 746004, 792133, 833509, 842723, 850829, 851911, 848987, 816171, 810973, 827758, 833415, 869710, 887708, 860920, 842612, 849938, 849693, 873353, 890060, 884855, 886369, 901409, 904150, 901222, 895697, 908876, 915051, 891019, 906717, 918388, 906103, 887095, 896075, 924226, 958382, 977119, 980799, 982159, 997337, 987272, 963718, 953907, 955865, 966155, 981997, 1010699, 1008153, 1003304, 988985, 973492, 990069, 1014884, 997802, 1002631, 1025690, 1034993, 1029521, 1046266, 1056477, 1065738, 1056115, 1046221, 1083912, 1133272, 1121656, 1119835, 1121204, 1137748, 1139132]
8888A139132J1244L0297l730k0236J8451j5336j7907L2820R395Q372o493J501
8876A187510L4324j64p851K947J5114M96j9282P186K1259m654N277K9044K0709
8863A291915J1010j1607J0302L441L66J3491L6388M8616K2804k5123l463j8494
8851A379646J1683J6100L851L1595L8506j7374j5784j6911M4277N3363j7902l725
8839A507325J8689M64K7464r44j0670n191l379M2561K063Q510K0174J7512R519
8826A634097J4719K4190r481j390Q34M1291J3687O919J2677o713L3808J0755J2870
8813A788263n284j0489L0099J5693N761n434M01J8877K8341J2427m760J4718M3091
8800A931704J4134K452o692K3946J9538J0141K6016L1237M490R697N0000K6417
$$ y = [1139132, 1150376, 1180673, 1176943, 1156707, 1175158, 1159822, 1141915, 1174735, 1184130, 1192502, 1186009, 1187510, 1221834, 1221670, 1213819, 1216766, 1231880, 1232376, 1213094, 1220280, 1241539, 1236885, 1242162, 1271206, 1291915, 1302925, 1291318, 1301620, 1305061, 1305427, 1318918, 1355306, 1403922, 1426726, 1401603, 1398140, 1379646, 1391329, 1407429, 1411280, 1442875, 1481381, 1464007, 1448223, 1431312, 1475589, 1528952, 1511050, 1507325, 1526014, 1526478, 1553942, 1552998, 1542328, 1537137, 1533758, 1576319, 1578382, 1586892, 1607066, 1624578, 1634097, 1648816, 1673006, 1663525, 1662135, 1662969, 1704260, 1717947, 1724866, 1737543, 1730830, 1764638, 1775393, 1788263, 1782979, 1772490, 1802589, 1818282, 1824043, 1818609, 1819010, 1837887, 1866228, 1878655, 1873895, 1888613, 1931704, 1945838, 1948290, 1941598, 1965544, 1985082, 1995223, 2021239, 2052476, 2056966, 2066663, 2116663, 2143080]
8788B143080J2637R013k1443j1437K7399M9326J3951k870J6925L6536j027O573
8776B278663k833M3104K6152K4958J1677N287J9697J7951J1603M2932J6050n55
8764B494686K3160j07J4494K1588M578p986L3753M0428L6950j5998j2703K4953
8752B657796L0864K3638N0187K3295k3793K3209L8074J2872J5412L3245L1602
8741B916401K9739L3232K8351o238o849K5924K5145L211K9113J2429K5208M3277
8729C158943J2277M6273J7798L2533L5737q4M1142M3732M380R963K1066K0126
8717C443886L5656L656Q694k119j3720Q465K8347K1723J3035N7911M8154J8054
8705C671742L7037J5380l9690n276M5197L7269M1071J4786J7739J4970P519K6258
$$ y = [2143080, 2155717, 2164730, 2143287, 2131850, 2159249, 2208575, 2222526, 2219656, 2236581, 2273117, 2272090, 2278663, 2275830, 2318934, 2345086, 2370044, 2381721, 2387008, 2406705, 2424656, 2436259, 2479191, 2495241, 2494686, 2517846, 2517739, 2532233, 2553821, 2558399, 2550413, 2584166, 2624594, 2661544, 2645546, 2632843, 2657796, 2688660, 2712298, 2762485, 2785780, 2761987, 2785196, 2823270, 2836142, 2851554, 2884799, 2916401, 2946140, 2979372, 3007723, 3001485, 2994636, 3020560, 3045705, 3048916, 3078029, 3090458, 3115666, 3158943, 3171220, 3217493, 3235291, 3267824, 3303561, 3303477, 3344619, 3388351, 3392731, 3402694, 3423760, 3443886, 3479542, 3483198, 3491892, 3489773, 3476053, 3484518, 3512865, 3534588, 3547623, 3605534, 3653688, 3671742, 3708779, 3724159, 3684469, 3679193, 3724390, 3761659, 3802730, 3817516, 3835255, 3850225, 3857744, 3884002]
8693C884002J6100K7077K8739M1369L3544L2061K8800J8043O784K1991L7200L8467
8681D214177J8684N646K2747J5879L4446L9317K0Q023J6546K7021L8678J9841
8669D461025J8855P781l765J5137N8382J3841J8456J6567l201P310J6575L1069
8657D658032K8734M1587L1575N024J0289R501L2601p072j8478K228J9732J3088
8645D826841J0712L3901K124l228J940K8289K4264J3534R702j7431J3658P403
8633D951709K7302L889Q149j205K062J3322J7456n58Q013K0934K4915J0248j0905
8620E075331k9328l4294j713J366j3196k9951J5902L7185k541J2337K4009J1692
8608E066799O686l746l9529m4900j4815m038L406j3893K0567m291l3944L220J6448
$$ y = [3884002, 3900102, 3927179, 3955918, 3997287, 4030831, 4062892, 4091692, 4109735, 4116519, 4138510, 4175710, 4214177, 4232861, 4238507, 4261254, 4277133, 4311579, 4350896, 4350916, 4358939, 4375485, 4402506, 4441184, 4461025, 4479880, 4487661, 4483896, 4499033, 4557415, 4571256, 4589712, 4606279, 4603078, 4610388, 4626963, 4658032, 4686766, 4728353, 4759928, 4764952, 4775241, 4784742, 4817343, 4810271, 4791793, 4794021, 4813753, 4826841, 4837553, 4871454, 4873578, 4870350, 4872290, 4900579, 4924843, 4938377, 4948079, 4930648, 4944306, 4951709, 4979011, 4982900, 4991049, 4989844, 4991906, 5005228, 5022684, 5022126, 5030139, 5051073, 5075988, 5086236, 5075331, 5046003, 5011709, 5009996, 5011362, 4998166, 4968215, 4984117, 5021302, 5018761, 5031098, 5055107, 5066799, 5073485, 5069739, 5030210, 4985310, 4970495, 4966457, 4969863, 4955970, 4976537, 4972246, 4938302, 4941522, 4957970]
8595D957970j4960j2543j9452j4123Q431J6461Q700j6907L630o513k5652l8209
8583D846833l4901k2285J6399m7159n4283j3981K796j4554k1963j8641m6823n3107
8571D538331k6270l9845k0118J4829P011l0796p761j676K528n9908m1818k8487
8559D306020J2241Q857m7524l9898l7345k7025j8287J7497J527k5818k2672l9218
8547D088355m4608j2080r101k8142k2175o888j7368l9244m3926j4060l511m4595
8535C802657m5260k9364j1545m648l3878k9974K669N703k8885k2408l3636l7909
8523C533522j8039k2996j1755l0102m6156l2686k5960k3266k2151R525j2497k3633
8511C273806l9141n4590k4973L552j7521O358p505r757k7492m319j8274n2293
$$ y = [4957970, 4943010, 4930467, 4911015, 4896892, 4905323, 4921784, 4930484, 4913577, 4917207, 4910694, 4885042, 4846833, 4811932, 4789647, 4806046, 4758887, 4704604, 4690623, 4693419, 4678865, 4656902, 4638261, 4591438, 4538331, 4512061, 4472216, 4452098, 4466927, 4473938, 4443142, 4435381, 4433705, 4436233, 4376325, 4334507, 4306020, 4318261, 4327118, 4279594, 4239696, 4202351, 4175326, 4157039, 4174536, 4176063, 4150245, 4127573, 4088355, 4043747, 4031667, 4022566, 3994424, 3972249, 3965361, 3947993, 3908749, 3864823, 3850763, 3847252, 3802657, 3757397, 3728033, 3716488, 3711840, 3677962, 3647988, 3650657, 3656360, 3627475, 3605067, 3571431, 3533522, 3515483, 3492487, 3480732, 3450630, 3404474, 3371788, 3345828, 3322562, 3300411, 3309936, 3297439, 3273806, 3234665, 3180075, 3155102, 3158654, 3141133, 3147491, 3139986, 3130229, 3102737, 3098418, 3080144, 3027851]
8499C027851o2188j7920j8673l9919k1727o379K4226n931l5005j4785k4245k0754
8487B784551p133j1458k4486l1645l2440N367j7368l6186k0188M672k997k783
8475B607906j4813k2200n683k3287j0683j2078l081j3062n8283k3712m7111n0119
8463B323794l6256k4894o765j497q582l5094m4399n624J5473L525p797k7285j3316
8450B131283l2239l0539M914J5000K281m900j2908l7353l4840l3535K317R402
8438A978883k0356l2128j3322J5937p64l7248l1666k6572j3657l260R029k1130
8426A803746l100J1396j4982m3156P07R26j1155r986L037l5492k3299Q901J121
8413A688664J0777m294k0668p778l512o661l4762j7414j7899J883j1545l2625
$$ y = [3027851, 2965663, 2947743, 2929070, 2889151, 2867424, 2861045, 2885271, 2879340, 2844335, 2829550, 2805305, 2784551, 2777418, 2765960, 2741474, 2709829, 2677389, 2682756, 2665388, 2629202, 2609014, 2613686, 2610689, 2607906, 2593093, 2570893, 2565210, 2541923, 2531240, 2519162, 2516081, 2503019, 2444736, 2421024, 2373913, 2323794, 2287538, 2262644, 2255879, 2254382, 2245800, 2210706, 2166307, 2160683, 2176156, 2179681, 2171884, 2144599, 2131283, 2099044, 2068505, 2073419, 2088419, 2090700, 2085800, 2072892, 2035539, 2000699, 1967164, 1969481, 1978883, 1958527, 1926399, 1913077, 1929014, 1928250, 1891002, 1859336, 1832764, 1819107, 1815847, 1824876, 1803746, 1800646, 1812042, 1797060, 1753904, 1754611, 1755537, 1744382, 1734396, 1737433, 1701941, 1678642, 1687543, 1688664, 1699441, 1695147, 1674479, 1666701, 1663189, 1656528, 1621766, 1604352, 1586453, 1588336, 1576791, 1544166]
8401A544166k1433j1302k5723q592j3309p740j2463j3115M353K6486l07j8248
8389A442773j5379j9697j1030m4116P03R974Q941L53o264J0328k65j4832m1404
8376A320085k8631j8946n278j8053j8997m975k872J4766Q017j6640J2153j8526
8364A222103O376K4767k1846l2574m5149l5866K1871j2027l5661j8583m820N513
8352A074104J6399k1112M145J3612m789K8472J0273q212k7937m4078k0407k5404
8340I95066j3775n514J6594m016n550N6L143j710k817K3135j5855R476l4389l1076
8326I32768J3857J1245k831m169l3039l7499J4818K2722r848j8219k072J5155
8314I02888k6244k5603q409k216J943j812J4079J5375l8752l7802R297r143j6173
$$ y = [1544166, 1522733, 1511431, 1485708, 1477116, 1463807, 1456067, 1443604, 1430489, 1434842, 1461328, 1461021, 1442773, 1427394, 1407697, 1396667, 1352551, 1353254, 1363228, 1372169, 1372522, 1366258, 1376586, 1376321, 1361489, 1320085, 1291454, 1272508, 1267230, 1249177, 1230180, 1225205, 1222333, 1237099, 1245116, 1228476, 1240629, 1222103, 1228479, 1253246, 1231400, 1198826, 1153677, 1117811, 1139682, 1127655, 1091994, 1073411, 1068591, 1074104, 1090503, 1069391, 1073536, 1087148, 1082359, 1110831, 1121104, 1112892, 1084955, 1040877, 1020470, 995066, 981291, 975777, 992371, 988355, 982805, 982861, 986004, 984294, 981477, 1004612, 988757, 998233, 963844, 932768, 946625, 957870, 955039, 950870, 917831, 880332, 895150, 917872, 908024, 889805, 887733, 902888, 876644, 851041, 842632, 840416, 842359, 840547, 854626, 870001, 831249, 793447, 802744, 793601, 777428]
8301G77428p795n026J1280K6534j591j5571r885j5903p450K858k962R220P827
8288G68964P700N660j7210P955L1819n138k9211l4923k8779J4080k3963j1333
8276F85621P548n418R377R379j6913k4004r384n958j2753l713J9004J2438J3715
8263F78939j1795j5484n021k2920r708J3155k534k8371l4528l329J7405P792K7025
8250F10626j8589k1003o242J990K0796M7211L018q680l5419J870K0047j5291O51
8237F00985q746m4225j6736J5466J9515m7k5158j0417j7462k9538L077K2138O463
8224E15315k7566r804K8889O320J9856Q084m332k6104Q175J3023k3483k6067j723
8211D80583M424o336O547m842q11J4751J101L294j7984m302K5187j1043r787l880
$$ y = [777428, 769633, 764607, 775887, 802421, 800830, 785259, 775374, 759471, 752021, 754879, 751917, 761137, 768964, 776664, 782324, 765114, 773069, 804888, 799750, 770539, 735616, 706837, 720917, 696954, 685621, 693169, 687751, 697128, 706507, 689594, 665590, 656206, 650248, 637495, 633782, 652786, 665224, 678939, 667144, 651660, 646639, 623719, 614011, 627166, 624632, 596261, 561733, 558404, 575809, 583601, 610626, 592037, 571034, 564792, 566782, 587578, 634789, 637807, 629127, 593708, 595578, 615625, 600334, 600985, 592239, 548014, 531278, 546744, 566259, 566212, 541054, 530637, 513175, 483637, 486714, 508852, 515315, 487749, 477945, 506834, 513154, 533010, 541094, 536762, 510658, 518833, 531856, 508373, 482306, 480583, 485007, 478671, 485218, 480376, 479565, 494316, 495417, 498711, 480727, 476425, 501612, 490569, 480782, 476902]
8197D76902LL1457Q288k7136j4755k6504k8843j8857l19J6058L1822N264j2501
8184D40879k3814n534J8545l160M681j4906j3126m698k64k7674l9816j2259K4632
8171C43486L6141M302j8430j7287j2514K7831M3483j0276k1398p629M0461J1411
8159D19581K1685J2357q102r639k046o746k1515J1272k0486k7978R79k984k3300
8146C43078k0020Q798L9772J3698K5152M2807l531l1258k1642l1898R104L2878
8134D06938j3261l2526J3785M550o069n516Q521Q502k0277j8182j7399r443k2236
8121B97387j572J886K8829j980k4084o27J5837J2426n689R579J8172N69k4279
8108C26454k0096r513J1174J6935l116k6661O002j2834j5914K5836j6094k4191
$$ y = [476902, 476905, 508362, 516650, 489514, 474759, 448255, 419412, 400555, 400236, 416294, 448116, 453380, 440879, 417065, 411531, 430076, 426916, 431597, 416691, 403565, 398867, 398603, 370929, 331113, 318854, 343486, 379627, 383929, 365499, 348212, 335698, 363529, 407012, 396736, 375338, 367709, 408170, 419581, 441266, 453623, 445521, 435882, 433836, 427090, 405575, 416847, 396361, 368383, 369362, 366378, 343078, 323058, 331856, 371628, 385326, 410478, 453285, 449754, 418496, 396854, 364956, 374060, 406938, 393677, 361151, 374936, 379486, 373417, 367901, 376422, 384924, 364647, 346465, 329066, 319623, 297387, 295815, 297701, 326530, 324550, 300466, 299839, 315676, 328102, 322413, 331992, 350164, 350733, 326454, 306358, 296845, 308019, 324954, 321838, 295177, 301179, 288345, 272431, 298267, 282173, 257982]
8096B57982j19J4025J9533K5707j6608K0007J3476k0030O006K5258K219k9307
8084C18149k4828p704j3361j4980k97j3945L638K4278K8117L3430J0624m9277
8072B93844m3304m350J1817j0398N64K0127P494q524J831j9749N135J4162l338
8059B65311j0550J8772K248l0087k7724j3094K0289Q548K984j0084j2475J9738
8047B33876K5702n533k7579K0613j3505k9444J4947J7166J8922r435j4281k785
8035B28664K311j510j0494Q091p302L3833j5100j3059n227M174K683q204R875
8022B28735O584k106N630j7617K467r892J0039J4470j2785o435M792j4062K3241
8009B33061N669m012L263P117k4907n492p244l007j3020J037Q364r0L469J3351
$$ y = [257982, 257863, 271888, 291421, 317128, 300520, 320527, 334003, 313973, 319979, 345237, 347456, 318149, 293321, 285617, 272256, 257276, 256979, 243034, 246672, 270950, 299067, 332497, 343121, 293844, 250540, 246190, 258007, 247609, 248173, 268300, 275794, 267270, 269101, 249352, 254487, 268649, 265311, 254761, 273533, 275781, 245694, 217970, 204876, 225165, 233713, 236697, 226613, 214138, 233876, 259578, 254045, 226466, 247079, 233574, 204130, 219077, 236243, 255165, 245730, 231449, 228664, 230975, 229465, 218971, 227062, 219760, 253593, 238493, 225434, 220207, 224381, 227064, 218860, 228735, 235319, 233213, 238843, 221226, 223693, 213801, 223840, 238310, 225525, 219090, 223882, 209820, 233061, 238730, 234718, 237981, 245098, 220191, 214699, 207455, 204448, 191428, 192465, 200829, 200739, 204208, 217559]
7995B17559R972p209k5538J5288J6754j3066l4199J1013J7422k434J0987R811
7983B26360j5474M963j3423k6680J227J6034O464M378o91J0101J3157r77j9736
7970B05703l1431r578J4091L4961J623J35k1337K1681M118J1103j2625k4977j4960
7957A78507j9686P215K5319N880k3683j0038J2026J6533q028P604k3540k7874
7945A40235j287J9231K2611n142o315O68J1860J4202J1797r805r353r30n206M629
7931A87195j1186r807o281q307K4061J1647j7006j0303J3456Q552m3036j3363
7919A25622J415J8107R664M399q969M213J9416J2584K4092N631l3265j1008K3767
7906A95668Q168k9746j3779J7336L4114j0560q074o959j583Q853j7308k4384L295
$$ y = [217559, 227531, 220322, 194784, 210072, 226826, 213760, 179561, 190574, 207996, 205562, 216549, 226360, 210886, 215849, 202426, 175746, 176973, 193007, 199471, 203849, 203158, 213259, 226416, 225439, 205703, 174272, 164694, 178785, 213746, 215369, 215504, 194167, 215848, 219966, 231069, 218444, 193467, 178507, 158821, 166036, 191355, 197235, 173552, 163514, 175540, 192073, 184045, 191649, 168109, 140235, 138948, 158179, 180790, 175648, 169333, 170001, 181861, 196063, 207860, 198055, 188702, 187772, 182566, 187195, 176009, 166202, 159921, 151614, 175675, 187322, 170316, 160013, 173469, 182021, 138985, 125622, 127037, 145144, 154808, 159207, 150238, 154451, 173867, 186451, 210543, 216174, 182909, 171901, 195668, 203836, 174090, 160311, 177647, 211761, 201201, 193127, 186168, 184585, 193438, 176130, 151746, 155041]
7893A55041J7228R885N218Q440J5601j8098j8186p438l6642l5302o029J1566J5503
7880A16787J4652K0364Q595J1177L1897j5277J0104j8331k4092P933j3651o966
7868A43192J4662P120J0119j9587l5500P618J6599K665P289j1238L1602L0993
7856B05534j9120k1634l9769j0449M621l3021j1348P640J3610j9466J2003O666
7844I5267m23L9157J0244J9869j8189J3728N518o30k2764j645l376j3178j3834
7831A09744R81J097j3398j4286J2793L5607K7494k4130j0424R763q165J8825L686
7818A49587j5432k236p280O008J6803l7215p244J5353J1562p253j4956J53J3958
7805A21808j7629k9521j4476J4928m524R10R253J5021L881m43m1823N701j0814
$$ y = [155041, 172269, 182154, 187372, 195812, 211413, 193315, 175129, 167691, 131049, 95747, 89718, 101284, 116787, 131439, 151803, 160398, 171575, 203472, 188195, 198299, 179968, 155876, 163809, 150158, 143192, 157854, 164974, 175093, 155506, 120006, 127624, 144223, 146888, 154177, 142939, 174541, 205534, 186414, 164780, 125011, 114562, 119183, 86162, 74814, 82454, 96064, 76598, 88601, 95267, 94844, 134001, 144245, 164114, 145925, 159653, 165171, 164541, 141777, 140132, 136756, 123578, 109744, 110725, 111822, 98424, 84138, 96931, 132538, 160032, 135902, 125478, 135241, 127076, 145901, 149587, 134155, 131919, 124639, 130647, 147450, 110235, 102991, 118344, 129906, 122653, 107697, 107850, 121808, 104179, 74658, 60182, 75110, 70586, 71496, 80749, 95770, 99651, 99208, 57385, 63086, 52272]
7792E2272K4691l867j7558K8114O331q230n869R707J9277L341j7868o191j3732
7779G0418j4373N754K9821J1448J7681n972M087k3048r409k491l8104N551O389
7766E7752M463J9676M202K0354N428k0299r011J246o978j0840j2963M997K2053
7753H0080R085j4211J904K1647J2043j1282Q538j1359j603k4676j4881K3128M467
7740H2880J5142l44P557l117l943o290K0345r660l8186M546K4029j1372l1636
7727D9951o207k0922K0096J4894p866j4119L9484k912j1697J9371K897j1741r896
7714F1333p413J5799J3580q228J1679k274j4185j5424R338q531N666K3576K074
7701H6990j9541k0817k1486k5291M262L1146J7555K1586J8419j1434j6507p155
$$ y = [52272, 76963, 73096, 55538, 83652, 89983, 81753, 75884, 85591, 104868, 108209, 90341, 84150, 70418, 56045, 61799, 91620, 103068, 120749, 114777, 118864, 95816, 86407, 83916, 45812, 51363, 57752, 62215, 81891, 86093, 106447, 111875, 91576, 82565, 83811, 76833, 65993, 53030, 58027, 80080, 89165, 74954, 76858, 98505, 110548, 99266, 107804, 96445, 94842, 70166, 55285, 78413, 82880, 98022, 97678, 105235, 102118, 98175, 91885, 112230, 102570, 64384, 68930, 92959, 81587, 49951, 43744, 22822, 42918, 57812, 49946, 35827, 75311, 72399, 60702, 80073, 82970, 71229, 61333, 53920, 69719, 83299, 75071, 86750, 84476, 70291, 54867, 64205, 55674, 61340, 84916, 86990, 67449, 46632, 25146, -145, 4117, 35263, 52818, 74404, 92823, 81389, 64882, 57727]
7689E7727K097J5492J4812k1133j3786K019M3524K498l6298j0499k650j3027M188
7676D4964K0110J1978K6395Q348k2154K522k1453j9267q849J660n902J9931K7258
7663H5541j4078m523J6024k0840k9259q390o951Q419K4390P609R57j348J0785
7650F8336R834Q313L381N053j8471j432j7217k5646j806J7993R280m2171l4997
7637a9550K2192L3220j7545N771K8764J9670l0488j1173k4127r137R050K0593
7625B7240l311K5528J8341k0780J1539J8066J1443M58M854N678m840k8906o139
7612E9171N643j5163k4770j4700J3437J6968o41k717J0453P831k8230j4211L1753
7599D4824K2103k0832k675J0567j1955q678J4409j237o151k7863q363L0440J5711
$$ y = [57727, 59824, 75316, 90128, 68995, 55209, 57228, 100752, 103250, 66952, 56453, 53803, 40776, 44964, 65074, 77052, 103447, 111795, 89641, 92163, 70710, 51443, 42594, 44254, 38352, 58283, 85541, 71463, 66940, 82964, 62124, 32865, 24475, 17524, 25943, 50333, 57942, 58899, 57551, 68336, 78170, 86483, 89864, 94917, 76446, 75014, 57797, 32151, 30345, 48338, 57618, 15447, -19550, 2642, 35862, 18317, 24088, 52852, 72522, 42034, 30861, 6734, -2403, 6647, 27240, 23929, 49457, 67798, 47018, 58557, 76623, 88066, 88524, 93378, 99056, 94216, 65310, 59171, 64814, 49651, 24881, 10181, 23618, 40586, 39945, 37228, 47681, 55512, 27282, 13071, 44824, 66927, 46095, 43420, 53987, 42032, 33354, 47763, 46526, 40375, 12512, 4149, 34589, 50300]
7586E0300L705r884k081J3813J2921j4587q906L688j888j7918j0546K3651J170
7573D3438j6480k1259K3432K4236J8163k4604j5354k709p975J8782j1073K4501
7561E3098m280O01j5769j3456K546J0866J8236J9022j0567K425M496J101k4742
7548D3577j9095M208J5520J5197j7596n927Q205k294J5628J0670k1085m2653l09
7535D046J1381n410J5139J2653j1346l880N221N886j3424J4818N12k6110q44M6106
7521E4748n141o778l4125j4025J9508J8805J7808J5661j5098k0810R554k0022
7509B0085j1061q829M793L7912L6132q453j4678j3136k627q79j0002j577J0152
7496C7832k4116K030K3656J6984k4763k0026k2816J8173J6343k237k8701j9444
$$ y = [50300, 54005, 44121, 42040, 55853, 68774, 54187, 45281, 48969, 47081, 29163, 18617, 42268, 43438, 26958, 5699, 29131, 53367, 71530, 46926, 31572, 28863, 20888, 39670, 28597, 53098, 48818, 49419, 33650, 20194, 22740, 33606, 51842, 70864, 60297, 62722, 67218, 68319, 43577, 24482, 28690, 44210, 59407, 41811, 35884, 44089, 41795, 57423, 68093, 47008, 4355, 4046, 15427, 10017, 25156, 37809, 26463, 22583, 27804, 33690, 20266, 35084, 35596, 9486, 8642, 54748, 49607, 42829, 8704, -5321, 14187, 32992, 50800, 66461, 51363, 30553, 40107, 20085, 9024, 195, 4988, 42900, 79032, 70579, 55901, 42765, 40138, 39259, 29257, 27680, 37832, 13716, 15746, 39402, 56386, 31623, 11597, -11219, 6954, 23297, 21060, -7641, -27085]
7484b7085J9228K5444J7355P479o559L46K0366j3906p589k019J866J6155M619
7471E5700j4447O33l629j126J5313O365m502k1418r984N632R953K7243n153k8223
7457C2357k0634p164O586j077l107Q342J0569J9822M3312K9526k2851m5106j6098
7444C4477J425J3375N626k0023r013k4225K5775k322m155J5891L4149L184N570
7431G9734j1667l1843j3756l8413N780l581K5452J5173j4903j754K3464k2467
7419A1219l2135j0820J7171L0428m21r953m779J626K6020q606j6013k1245j758
7406a9266J4502P049Q086j1465O541K4904M777l1119L5662J5745m052q710q639
7393C4015N805K430q876r601J808N434J2734j0632R922J9102j2341j6068L675
$$ y = [-27085, -7857, 17587, 34942, 42421, 35862, 36208, 56574, 42668, 35079, 33060, 34926, 51081, 55700, 41253, 41886, 38257, 37131, 52444, 58809, 54307, 32889, 22905, 28537, 38490, 65733, 60580, 32357, 11723, 4559, 11145, 10068, 6961, 15303, 25872, 45694, 89006, 118532, 95681, 50575, 34477, 35902, 49277, 54903, 34880, 25867, 1642, 27417, 25095, 20940, 36831, 70980, 74164, 79734, 68067, 36224, 22468, -15945, -10165, -13746, 11706, 26879, 11976, 10222, 33686, 11219, -20916, -31736, -14565, 15863, 15442, 5489, 710, 2336, 28356, 19750, 3737, -17508, -19266, -4764, 2285, 10371, -1094, 5447, 30351, 35128, 4009, 39671, 55416, 51364, 42654, 34015, 39820, 42250, 33374, 23773, 25581, 31015, 43749, 33117, 43039, 62141, 49800, 33732, 37407]
7380C7407J8707P474q379n307j7754q731J7593M22L950K0185l6748l8511J0754
7367A062J7590J0025j9386l860K9279J9059j3982R447k382o937N061l2380N453
7354A8049K047k4051j0401o744J0341R677j9368m482J1253J9566J730J7388p747
7341A7258k3989k1428J7789N0939J5235j2271n831j1088k3754l539K738N817q135
7328b59K862P326Q063j1746j4416J0023j9903k6046j5956L4361K1045O114o227
7315d759K8885L7390L056k0666n164j52q018k1460k3335J6633K0863l7844J0695
7302c876L2478J1284j4832k560k1337J6430J467j2735j1717P745l679N242p012
7289c102J1464m589L386K475k4678l131j1098J0936K0499J5762m274P195n470
$$ y = [37407, 56114, 63588, 55209, 49902, 32148, 23417, 41010, 41432, 45382, 65567, 28819, -9692, 1062, 18652, 28677, 9291, 5431, 34710, 53769, 39787, 49234, 46852, 39915, 44976, 12596, 18049, 20096, -3955, -14356, -21100, -10759, -1082, -20450, -24932, -13679, 5887, 7617, 25005, 17258, -6731, -28159, -10370, 40569, 55804, 43533, 37702, 26614, 2860, -679, 2059, 7876, -259, 2603, 9929, 17992, 6246, -8170, 1853, -18050, -44096, -60052, -25691, -4646, 1468, -4759, 24126, 61516, 64572, 43906, 38742, 38590, 30572, 9112, -14223, 2410, 23273, -14571, -3876, 28602, 39886, 25054, 22494, 1157, 17587, 19054, 6319, -5398, 2347, -1332, 3910, -3102, 8362, 3773, 7159, 9634, -15044, -18175, -29273, -18337, 2162, 17924, 13650, 20845, 15375]
7276A5375j5953N763J6700j2844r062J7502q062M981J1116M978q584k1508j796
7263a394o08K195M2354K2491J2530k5726j5773q087J271k1016P93J7298N158p539
7249B3947j3255j7526O260J0861J98m252J109K9597j0693J204J331j9053p065
7236B663l418M706K0363O211k0023p396k716J4653P983K9411j1371k4353N269
7223B1982k614r499J2905O294j751p065j2236j8483m758N422n269N035J4000Q281
7209A2244k1242O788O629l948k492R226J8277P200j8652k8L498j916K094q976
7195H702k8524J4106l849J4339o550N905l781J0742O4p303k157L2102J1451J1605
7181E6852k06k7061j0517M605j4007j0588k4709K2015M1492j8614j9234j6372
$$ y = [15375, -578, 5185, 21885, 9041, -21, 17481, 9419, 14400, 25516, 30494, 21910, 402, -1394, -2002, 193, 42547, 65038, 77568, 51842, 36069, 27982, 29253, 8237, 9030, 26328, 31486, 23947, 10692, -6834, -574, 10287, 10485, 6233, 7342, 36939, 26246, 27450, 28781, 9728, 2663, -755, 3951, 24314, 30525, 10502, 3106, 390, 15043, 23026, 52437, 41066, 16713, 21982, 19368, 9869, 22774, 29068, 27317, 20252, 8016, -10467, -15225, -9803, -15072, -10037, 3963, 12244, -8998, -2210, 4419, 471, -2021, 7205, 25482, 32682, 14030, 14002, 17500, 15584, 17678, 8702, -19822, -5716, -9565, 4774, -1776, 4129, 348, 11090, 11154, 3851, 1694, 33796, 45247, 56852, 56646, 29585, 19068, 23673, 9666, -922, -25631, -3616, 37876, 19262, 28, -16344]
7169a6344J1018J9337j921j4106k0031l022P189J5978J8568K345j8199K558K873
7156F243J9680P408j6300O702K1642q903j9501L151K1718k3162j7446n20j1427
7143a0715j0621J9860K5064k4312k4867k8463K4879J0113l23J4892K0061J6252
7131C1820J1050j562K0161N577j8209k5445j4074n412j2217O325N099P374r792
7118F95J864J0231j3878l7951q286l334n577J3871M1399P842o482q371N346K2181
7104A9550k484j5021o660O154O091Q702M384l227n772J0832J910k0070k4259O463
7090a3407M598p403l756J0815P690M744J4915Q433j4288j6021Q504r645n476O593
7076c704N907J2735J2093J1766K273k0606q191N803l392l3341k541K2543J7900
$$ y = [-16344, -5326, 14011, 12090, -2016, -22047, -25069, -17880, -1902, 16666, 19011, 812, 3370, 6243, 25923, 33331, 17031, 23733, 45375, 36472, 16971, 20122, 41840, 18678, 1232, 712, -10715, -21336, -1476, 23588, -724, -25591, -54054, -29175, -19062, -19385, -4493, 15568, 31820, 42870, 41308, 61469, 67046, 48837, 23392, 9318, 3906, -8311, -1986, 3113, 10487, 695, 2559, 12790, -1088, -39039, -47325, -50659, -56236, -42365, -966, 6876, 394, -7977, -2631, 19550, 17066, 2045, -4615, 1539, 7630, 16332, 20716, 17489, 11717, 22549, 24459, 4389, -19870, -13407, -8809, -16212, -19968, -9153, -1463, 3281, 18196, 26629, 12341, -3680, 4824, -4821, -10297, -3704, 2203, 14938, 27031, 38797, 41070, 20464, 12273, 18076, 14684, -18657, -21198, 1345, 19245]
7063A9245J1747N345j2044L988Q325k9094r44j5952M028k1497r510J9600L566
7050a3197o352J787J284j2761K1655N577O994J6984j3324p374J1761j2357q75
7037a98j00N813K4491j8540P03N415k1018k9745M0080L1275j5366n4111J5309
7024a5992P571P882J7900J518M714P297J4945m561l617k926k7409J158j2587j4974
7010a9081m623K7769J2258j1821k321k7571l847K4910l054K5074L202K229j1711
6997A1413o746R002j1474r87j678J3499K529j1483P346q964j2333J9920N96J2857
6983B3497M77q455q130N236J5864j4737q370j5231J7502k5859k7830P042J0913
6970b8081M2590K0031P135j0246J100k0870k2012j7321j189J080M0206K1955k0035
$$ y = [19245, 30992, 36337, 24293, 28281, 36606, 7512, 6568, -9384, -5356, -26853, -36363, -16763, -13197, -19549, -17762, -16478, -29239, -7584, -2007, 4987, 21971, 8647, 1273, 13034, 677, -198, -298, 5515, 30006, 11466, 12169, 17584, -3434, -33179, 6901, 38176, 22810, -31301, -15992, -8421, -539, 17361, 18879, 23593, 30890, 45835, 41274, 37657, 34731, 7322, 8480, -4107, -19081, -23704, 4065, 16323, 4502, 2181, -25390, -29237, -4327, -7381, 17693, 20895, 23124, 11413, 4667, 13669, 2195, 1208, -470, 13029, 15558, 4075, 11421, 2457, -9876, 10044, 10640, 23497, 23974, 15519, 7389, 12625, 28489, 13752, 5382, -9849, 7653, -18206, -46036, -38994, -28081, 14509, 34540, 41675, 31429, 32529, 11659, -10353, -27674, -28863, -27783, 12423, 34378, 14343]
6957A4343o383j795K6702n924j2705J4156K2684k3516o883k6938o40o378L048
6944a0229K352j2181k0879J3852L3936Q963K795j4444j0925N103J5277j4272j0006
6931a0658L4875K8598m058k0634k3413m260J1695J7146K4484O603o764l0759j3953
6918H902j3536L078N288k1726l690q716P607j6202q385q447K0361K3059K8576
6905A6169J3788K6513o476J9783j5705j4380k2596P260O579l0593j8777O576J9615
6892G756r229Q700J2133R78p174J8458j0211m1646J6179L8013p960J3360p483
6879C1874k7441J1420J290J4040l513m5903o490J8100J7630p739j4283O479j3272
6866a7808R393L250K4820k190j751j1425M21J7338o728j6210j776J7444L7537
$$ y = [14343, 7960, 6165, 32867, 26943, 14238, 28394, 51078, 27562, 20679, -6259, -6899, -13277, -10229, -7877, -20058, -40937, -27085, 6851, 15814, 18609, 4165, -6760, -1657, 13620, -652, -10658, 24217, 52815, 48757, 28123, 4710, 450, 12145, 29291, 53775, 60378, 53614, 22855, 8902, -4634, -1556, 3732, -17994, -21684, -30400, -22793, -38995, -47380, -55827, -35466, -12407, 16169, 29957, 56470, 49994, 69777, 54072, 39692, 17096, 24356, 30935, 342, -18435, -11859, 7756, -1473, 7227, 19360, 20338, 13164, 31622, 21411, -20235, -4056, 33957, 25997, 39357, 31874, 4433, 15853, 17143, 31183, 27670, -18233, -24723, -6623, 11007, 3268, -11015, -4536, -17808, -8415, -5165, 19655, 17465, 15714, 4289, 4710, 22048, 15320, -890, -2666, 14778, 52315]
6853E2315J6745l786l3020n278K4166J1731k2601L127m219k368j9096k154m243
6840A1319J0501M17r379O569J4569J3818r324j8966m0605j1733l6053J0249M0791
6827a7827O72j8719N48P843l107M140J3148L6502N393l306J4047q478j660N644
6813C4840k4291l8796P351L504J3735J0085j2579J556j9984R46J9975K1039R938
6800B7319J0315P546r651m0479j9229j2636q428j4023R318J9745K8590K3870J3850
6787C6107J4815k3958k665J7887M013l681J1225k3195j8136J6523O236k2832J4585
6774B6924K8676j5019n8209l3430J588J972m585K0024J8319J1697J2978j2180
6762a245J6555k0479l4569K0746J1100k39R656M454K4183k946l253K6515j2305
$$ y = [52315, 69060, 65274, 32254, 26976, 51142, 62873, 40272, 43399, 39180, 36812, 17716, 15562, 11319, 21820, 22237, 12858, 19427, 33996, 47814, 38490, 19524, -21081, -32814, -68867, -58618, -17827, -17155, -35874, -35326, -27483, -30590, -26450, -13302, 23200, 28593, 25287, 39334, 30856, 29196, 34840, 10549, -28247, -20896, -17392, -3657, 6428, -6151, -4595, -24579, -23633, -3658, 17381, 27319, 37634, 45180, 35529, -4950, -24179, -36815, -45243, -59266, -49948, -30203, -1613, 22257, 36107, 50922, 26964, 24299, 42186, 46199, 42518, 53743, 30548, 12412, 28935, 35171, 12339, 26924, 55600, 40581, -17628, -51058, -49470, -47498, -52083, -32059, -13740, -2043, 10935, -1245, 15310, -5169, -39738, -18992, -7892, -8131, 1525, 5979, 30162, 27216, 23963, 50478, 38173]
6749C8173j9920j2890J549K767J5556Q210m2910k4050J3040L0071M0035k985K385
6736D9031M414j5110k7318q227J2101j4751Q527M794k3841Q097n856j8409J2841
6723a3707L2659K766N728J440j5771K1076j3956n158k2986P937j5150j9488Q498
6710b6112Q71m316N011J1791J0477N521n785j243r117q114J4693L9265j962k9180
6696A800k0412j7779K3939L8728J0860P906l1251j9093P874j4894r159J0207j7808
6683b9082K263o70O03L092J5671L1597j5302j0762m552l15r420L5080P815j1061
6669A4957l2508k7655Q678K9115k2269P935q889m812K1501Q50l3653j6167j4870
6656g7787K5982L4427j0983j0348R366Q946J3181J614K560k4398K3947J8180r174
$$ y = [38173, 18253, 5363, 6912, 9679, 25235, 33445, -9465, -33515, -20475, 9596, 49631, 46646, 49031, 53445, 38335, 11017, 2790, 14891, 140, 8667, 13461, -10380, -2283, -8139, -26548, -13707, 18952, 21718, 27446, 28886, 13115, 34191, 20235, 15077, -7909, 28, -15122, -34610, -26112, -25241, -29557, -24546, -12755, -2278, 3243, -2542, -3785, -12902, -21016, -6323, 32942, 30980, 1800, -18612, -36391, -12452, 26276, 37136, 45042, 13791, -5302, 2572, -12322, -21481, -11274, -29082, -26819, -27489, -26886, -23794, -8123, 23474, 8172, -2590, -7142, -7457, -16877, 18203, 26018, 14957, -17551, -45206, -36528, -7413, -29682, -21747, -30636, -35448, -13947, -13097, -46750, -62917, -77787, -51805, -17378, -28361, -38709, -29343, -20397, -7216, -5602, -3042, -27440, -3493, 14687, 5513]
6643E513k0722k0356m083J1838K2582P579L19q779k136j59j7905J3205k0021L53
6629c2772J3234J4985j9301J5543J2734j6870L985J0128k4199M06R103l050k3853
6616c9927P037J5658K6143O793N774n0744j651J8016q122R899R174K5601L52j4052
6602I951p101q266j3833P213J3109n05O219Q01p853p982l0668j6768J3475J9875
6588b2333k179J196K949R82K8839j162k4065j8985K1542K2283q047j8530q200
6575b5710j4754m235J3910K1662J4563R406M002j1490k1907j2068J9654J2049
6563E082j5977K439R290K3661K2533q378j4350l4550P23O442j598j477r963p987
6549b4110k2295O481L094J9461Q506M247K5704n382j6647J2607J3778j035j7329
$$ y = [5513, -15209, -35565, -39648, -27810, -5228, 2351, 2670, -6109, -8245, -8404, -26309, -13104, -33125, -32772, -19538, -4553, -23854, -8311, 4423, -12447, -8462, 1666, -22533, -22127, -13024, -16074, -39927, -32890, -17232, 8911, 15704, 21478, -29266, -30917, -12901, -21023, -11124, -1950, 23651, 24003, 9951, 2850, -5416, -19249, -12036, 1073, 568, 6787, 7588, -265, -8247, -38915, -55683, -42208, -22333, -24512, -23316, -20367, -19385, 9454, 8292, -15773, -34758, -13216, 9067, 1020, -17510, -25710, -40464, -44699, -30789, -9127, 5436, 14842, 18844, 7354, -14553, -26621, -6967, 5082, -10895, -8456, 834, 24495, 47028, 38650, 24300, -10250, -9527, -3085, -4683, -6160, -16123, -24110, -46405, -39924, -36830, -17369, -8863, -4616, 21088, 15706, -941, 11666, 25444, 24409, 7080]
6536G080j0533j9806K7489L4184n877j9271j3692j2416P681l531j8410J921K850
6523b2331l734J1661R572J4627k230l1387j2686K3135j754l4871k1546K5128K1354
6510b5062j1356m678J7738J6201k923j8458J6141N161j2467N438K4042q438k0130
6497a8791K372P435J4548j7777K056K3594J7767n559o036j3201p487R9J2882K2582
6483C4484J3823n841l7556j6142j1386j3619m68n61M837Q963o395o046K0390J5114
6469d03k767j5799j0787J1206O896R40J5495K745j6597k1234P039K0780N0487
6456D8001J5044j3128k6476j8497j9916N969Q522Q124K538L604R497j0600r648
6443C034J97J0891K139j9154k4314J6641J7399k5568P503L3958P331k1147k8554
$$ y = [7080, -3453, -23259, 4230, 38414, 32537, 13266, -426, -12842, -5161, -8692, -27102, -25181, -22331, -26065, -14404, -4832, 9795, 7565, -23822, -36508, -13373, -15127, -49998, -71544, -46416, -25062, -36418, -41096, -23358, -7157, -10080, -28538, -12397, -7236, -19703, -14265, 9777, 1339, -18791, -16419, -8984, 5564, -12213, -10157, 13437, 31204, 25645, 19609, 6408, -1079, -980, 11902, 34484, 48307, 42466, 4910, -11232, -22618, -36237, -36705, -37266, -32429, -23466, -29861, -35907, -15517, -403, -3170, -18969, -29756, -18550, -11654, -10714, 4781, 7526, -9071, -30305, -23266, -2486, 48001, 63045, 49917, 23441, 4944, -14972, -9003, -481, 7643, 10181, 13785, 23282, 12682, 3034, 3231, 14122, 16261, -2893, -27207, -10566, 6833, -18735, -11232, 22726, 30057, 8910, -19644]
6430a9644J2522K1852j373j1975M523j0186q434L342J6451K4207j1442k2712j0904
6417a3773N820q19j8349q242Q601r206P215K2217J5105R432k1691r593O105q772
6403a5950K3646k1395P094J0108o516j8161J325J3147k3197j9372n633N68K506
6390e1830J2545P953o374m934k4643N223J0620p75k5613J9290K5465j5087K0847
6377b7313J7634O309L398K0428M037K058r15k2682l025j5165p099K3606J4543
6364A5814k2743k3606j859k264J1577N515J635K466J2694k2752l355L973p040
6351b9945j5219L628K0558J8729j8201k6688k619P474K71l719K8260J6271j0443
6338a1643r170K1253l493k5476J4550K6429J7910j4733m967m0007j095K2381J5372
$$ y = [-19644, -7122, 14730, 13357, 1382, 5905, -4281, -12715, -9373, 7078, 31285, 19843, -2869, -13773, -7953, -8772, -27121, -35363, -26762, -35968, -28753, -6536, 8569, 18001, -3690, -13283, -7178, -15950, 7696, -13699, -6605, 3503, -3013, -21174, -19849, -6702, -29899, -49271, -54904, -54336, -51830, -39285, -31332, -37706, -42640, -67283, -62060, -51440, -52215, -77828, -58538, -33073, -48160, -27313, -9679, -3370, 28, 20456, 24493, 26551, 25636, 2954, -71, -15236, -22335, 1271, 15814, -6929, -30535, -32394, -34658, -23081, -17566, -15931, -13465, -771, -23523, -26878, -22905, -29945, -45164, -41536, -20978, -2249, -20450, -47138, -49757, -42283, -42012, -45731, -17471, -1200, -11643, -20813, 440, -3053, -28529, -13979, 12450, 30360, 15627, 10660, -29347, -30442, -8061, 7311]
6325G311J2764j007O980o172n910q645j2857L5129J434j2082n608m774K2369L135
6311C2067j4997k8260J8523L111k77M4433j3447k1114j5641P715J0266j2784l0637
6298b1042m592M367K8628J5529P351N771P855l1915o400Q143j6140n1851P304
6285d6992J9515L7273K0342j2399j8222J1915j2018q763J0224p790j9661j1073
6273c7649j6031K6349L9748M247M707K1751j8416m2780j960K2823k110j6987p147
6260b3455j9500j1913R269N239L613K0427k878k2431j5432L281L4476K5230k8676
6247b2750k9534K1174Q611O978P787K4620l4547K62K7678N544p402j8506Q340
6234a745M396j4686j0652r879j6292l036J3831K970M156J4506J188j3359q016
$$ y = [7311, 20075, 19068, 26048, 19876, 13966, 5321, -7536, 27593, 29027, 16945, 11337, 6563, 28932, 32067, 17070, -11190, 7333, 10444, 10167, 54600, 41153, 20039, 4398, 12113, 22379, 9595, -21042, -25634, -21267, 7361, 22890, 30241, 36012, 43867, 11952, 5552, 13695, -2445, -54296, -46992, -27477, 9796, 30138, 17739, -483, 11432, -586, -9349, 875, -6915, -26576, -37649, -53680, -27331, 12417, 16664, 21371, 43122, 24706, -18074, -20034, 2789, 679, -16308, -23455, -42955, -54868, -45599, -40360, -36747, -16320, -19198, -41629, -57061, -53780, -19304, 5926, -22750, -52284, -31110, -22499, -15521, -7734, 16886, -17661, -17399, 10279, 15823, 8421, -10085, -1745, 2651, -12035, -22687, -32566, -48858, -51894, -38063, -35093, -30937, -16431, -15243, -28602, -36618]
6221c6618n54K2760R701o926k1320J0737K6462J770N259j0088P938K3550m64j23
6207C2084j077k7208p674J5340J762Q26K364k3949j0581J4478j2793J5973J0269
6194I814l0565r069J1562J0493J5048k34j5188j3452K7992J527M865j3185J8302
6181A7910J4640j6371J0861l2777k9004P187k3629j3514J5412K1725K0591l1198
6169c8167l763K0527m747K1370K3904q661k7551k8905n410J4238K9844K7184n335
6156A4528m5431j9771O532J5326J1365L9982N313k4111J0416m145k1993n465K3526
6143F072o611j7684K6800O833j2700j0396J0042j4666K5742j7419m0832r480K8605
6130b5694K277M304r147N016R645M223k7956r663Q571K80M54R251K566J8568P716
$$ y = [-36618, -37172, -14412, -4711, -11637, -32957, -22220, 4242, 6012, 11271, 1183, 9121, 32671, 32207, 32084, 31007, 3799, -3875, 11465, 13227, 14053, 16417, -7532, -18113, -3635, -16428, -455, 9814, -20751, -29820, -18258, -7765, 7283, 7049, -8139, -21591, 6401, 7928, 12793, -392, 17910, 32550, 16179, 27040, -5737, -34741, -27554, -51183, -64697, -49285, -27560, -6969, -38167, -41930, -21403, -26150, -4780, 19124, 10463, -17088, -45993, -51403, -37165, -7321, 19863, 14528, -30903, -50674, -44142, -28816, -17451, 22531, 27844, 3733, 14149, 10004, -11989, -17454, 6072, -539, -18223, 8577, 15410, 2710, -7686, 2356, -12310, 13432, -3987, -44819, -54299, -25694, -23417, -19113, -28260, -23244, -13599, -9376, -37332, -46995, -38424, -38144, -37690, -28439, -25873, -7305, 411]
6115D11J794P150j5683n033P499J6804k9071j8881j2277Q429K0181P942J5677
6102D942J1756r851j0654k315J198p453j464l341J717O752K2018q992J1666K0242
6088C6221r373r161Q910m868q448o934j8363j575N892K2969Q24q430j1683l8857
6074d2876q643K7307Q102n853j4033r436l622J7510J7292R234N176m787M58j1611
6060a5782L45n922Q638J2576J0308m466R233j3402N312J5730j1174k9220r298
6047b7122j4868r409L2597J3932L92j9212j1706J3916k2896o410M021K241J7327
6034b7197N731j1919J5093L0606j8811q349N370o014J162j7587K2103L2909J1956
6021C5053n253M798K426l6128j3491r722o487P664k848o223j4900J2419J812o412
$$ y = [411, 2205, 9355, -6328, -11361, -3862, 12942, -16129, -35010, -47287, -38858, -18677, -10735, 4942, 16698, 6847, -3807, -6122, -4924, -12377, -13841, -17182, -15465, -8713, 13305, 4313, 15979, 36221, 26848, 17687, 26597, 21729, 13281, 6347, -12016, -13591, -7699, 15270, 16094, 7664, -4019, -42876, -51519, -24212, -16110, -21963, -35996, -45432, -49054, -31544, -14252, -5018, 158, -4629, -4171, -15782, -15437, -21359, -12721, -145, 10163, 5697, 14930, 1528, 6840, 22570, 11396, -17824, -27122, -41990, -51399, -18802, -4870, -4478, -23690, -35396, -21480, -44376, -50786, -46765, -44524, -27197, -21466, -33385, -18292, 12314, -6497, -14846, -9476, -15490, -14328, -31915, -9812, 23097, 35053, 29800, 34598, 37024, 896, -12595, -22317, -28804, -21140, -23988, -30211, -45111, -32692, -30880, -37292]
6007c7292J6451p825M421N239K7582n426j5003j0136J0681K2179K1144J6774j3841
5994C4948O884o632k2785j7643j1538J3823K977M409J0948k1470k5229j0940J2670
5981b9578J1002J1712q95j301l88L57K8555k555j6942k97q248J7145R644L390
5967B1601J5487K38k7412l8884k9967J6579R590J2444K0360K8689J6577l4343
5955A0959m0127R689K371o853R748K775j4154R427K4081J275r92J313K303j1196
5941F19k399J1308J8157K091k515J1192j6375O423K812J921j0248j279r934j0624
5927A149j1110j9557r748J1560P453J0175J3143M353j1177k3985n967M249k5275
5914e4737k1483K1865P584L1600M8109q147l1649j268j9204q045J9932j3200j5397
$$ y = [-37292, -20841, -28666, -24245, -19006, 8576, 3150, -11853, -21989, -11308, 10871, 32015, 48789, 34948, 41832, 35200, 12415, -5228, -16766, -2943, 34, 4443, 15391, -6079, -31308, -42248, -29578, -18576, -6864, -7759, -9060, -9448, -9091, 19464, 16909, -33, -330, -8578, 8567, 18211, 21601, 37088, 37326, 9914, -28970, -58937, -42358, -32768, -20324, 36, 28725, 45302, 10959, -29168, -19479, -17108, -23961, -14213, -11438, -25592, -16165, 7916, 9191, 8199, 9512, 11815, 619, -1780, 9528, 27685, 29776, 27261, 38453, 22078, 28501, 31313, 33234, 22986, 21707, 11773, 1149, -9961, -29518, -39266, -27706, -20253, -10078, 3065, 7418, -3759, -27744, -33711, -29462, -54737, -76220, -54355, -46771, -15171, 32938, 24791, -6858, -8126, -27330, -35375, -15443, -28643, -44040]
5901d4040p851K0312K5885k668O189J5343n746n922M453p607J0921j6290k2616
5888b9637J2703K8535j097j3930K188K3863j2182o98j6614O640q883j5852j0261
5875c5225J0518K6616J5850k979q287j1616p00P577J5202K5444k333n106k1649
5862A3312j850j4709j6104K61J1413p362L988J8406J3821N28n047K184J5063J4206
5848D8110k1885k4865J3659K0387J4633K138j5004k7809j9127R554L9791j2976
5836B6606O803K9263L579m5319l0679Q383m028K377j3480K3944N1545R919k0903
5823D8010j572j8847j6165j9753K7029M8438K117k3829j5061lJ2010r884j3346
5810A9144k1655r900j0735J3414M1196k565k348J4796j0329l086n631o094o485
$$ y = [-44040, -51891, -31579, -5694, -8362, -2173, 13170, 7424, 1502, 5955, -1652, 9269, -7021, -29637, -16934, 11601, 10504, -3426, -1238, 22625, 10443, 9745, -6869, -229, -9112, -24964, -35225, -24707, 1909, 17759, 14780, 6493, -5123, -5823, 1754, 16956, 42400, 40067, 34961, 13312, 11462, -3247, -19351, -19090, -7677, -15039, -11051, 7355, 21176, 21704, 16657, 18841, 33904, 48110, 26225, 1360, 15019, 35406, 50039, 52177, 37173, 9364, -9763, -209, 39582, 26606, 33409, 62672, 66251, 20932, -9747, -1364, -5392, -3015, -16495, 7449, 58994, 68913, 48010, 46438, 27591, 11426, -8327, 18702, 67140, 69257, 45428, 30367, 30364, 42374, 32490, 19144, -2511, -12411, -23146, -9732, 31464, 28899, 26551, 41347, 31018, 27932, 22301, 16207, 9722]
5797I722L819P976j238L375p465m4813k7670K8931K0661k354J7946J863j0432
5784C21k152l870l638J159K6573o380j6074m079J0580K1574k203k0892L611J2550
5770A7080N91j7178p043K7253P739Q165R162j4360r299j284L304j5401n094j7760
5756a4125j9015k847L6361J0240j5154j6219Q214j639J2072n827j7569l152K4709
5743c951K2712j983N94k044k121k2518P853k2173k3322J8700n248j7376K286L4871
5729a3720K0588l5043r615r420J4082j4559O332L1637K7292P586m801q982q237
5716C140J2268j1918l8189K8735o84j4826k155j440j8994k7664K8779K2240K586
5703a8122l2224K945K4271o120q989j4176L396L9688J573J0444J4149J5968J880
$$ y = [9722, 13541, 21517, 20279, 23654, 16189, -28624, -56294, -27363, -6702, -9056, 8890, 10753, 321, -1831, -5701, -9339, -8180, 18393, 12013, -4061, -8140, 2440, 24014, 21811, 919, 4530, 17080, 17671, 493, -6550, 20703, 28442, 36607, 45769, 31409, 22110, 20826, 24130, 8729, 3635, -14125, -33140, -35987, 374, 10614, -4540, -20759, -12545, -14184, -2112, -7939, -25508, -28660, -3951, 18761, 16778, 17372, 15328, 13207, -9311, -1458, -23631, -46953, -28253, -33501, -50877, -48591, -13720, 6868, -28175, -37790, -47210, -33128, -47687, -41355, -9718, 17574, 25160, 20359, 11377, 3140, 15408, 3490, -34699, -5964, -6648, -21474, -23629, -25069, -44063, -71727, -42948, -20708, -18122, -50346, -47401, -23130, -29250, -38239, -52415, -49019, -9331, -7758, 2686, 16835, 32803, 34683]
5690C4683l1536m205J6717J081L9323j0994k0507j9017l3810q752M2036K8880
5678C3899j9139n3275j2986K8388L9452L286M892J1649k4140k2723l645r729p598
5665c1669j646m016J3292J9134J5858o040J7433m42j4117r140J385J9485k0206
5652f89n551p265j1848K081Q125N003j4606k2976J4621j4748J3114j6224M477
5639d6486J9671J5459j0453j1665J6537Q079K1364m489m416j268j7239o028J4736
5626f198O41k6543m620R041l334J4227K5435k0157j7084l365J9691K5868J1389
5613B4991J7673k08j9323j0543L3506m530j8156m710K3486L740J0320j6436j5402
5600B4408k3861m843m779M825P565o528j9348m96J5372j7269j391K8766K9148
$$ y = [34683, 3147, -1058, 15659, 16740, 56063, 45069, 24562, 5545, -28265, -37017, 5019, 33899, 14760, -38515, -51501, -23113, 16339, 19625, 24517, 36166, 12026, -10697, -14342, -24071, -31669, -33315, -37331, -24039, -4905, 10953, 4913, 22346, 21904, 7787, -1353, 32, 19517, -689, -6240, -13505, -25353, -23272, -15147, -10144, -24750, -47726, -33105, -47853, -34739, -50963, -46486, -26815, -11356, -21809, -33474, -16937, -8858, 12506, 8017, 3601, 2333, -14906, -20934, -6198, -5557, -32100, -36720, -27679, -31013, -16786, 8649, -11508, -28592, -31957, -12266, 13602, 24991, 42664, 42456, 23133, 12590, 46096, 41566, 23410, 18700, 42186, 45926, 56246, 39810, 24408, 547, -4296, -9075, -4250, 3315, -3213, -22561, -23057, -7685, -24954, -26345, 2421, 31569]
5587C1569O67l3714p122l89j603L485o778o569K8306l524M40J9691K743k795M74
5572B4881m760m2099j3844J326J2747L4728J1796j9610k1195j9896K2637K2398
5560I109K2732K139l485j2864m442K375l9312j2402j1814K3496J470j4551k401
5547c9950J3677K4754L2882j0990J5554J0049l9528j8536j25J8139J4386n706
5535A4606p222p66n457L912J1591m516J4088n453k2906n490q658J1745K3537J0658
5521B9669J258l9613k8056J5227k0815q102N477p99J7207K2101q881j0167P720
5508a7774J0118J6882J043Q056k719m710K633j146K3689l6524m4985L633K7599
5495a4205L5408N513k0143j7631J3662j1195l556q010K7512l274k7547J0504o338
$$ y = [31569, 32236, -1478, -8600, -8989, -10592, -7107, -13885, -20454, 7852, 4328, 4768, 24459, 27202, 24407, 24881, 20121, -21978, -35822, -34496, -21749, 12979, 24775, 5165, -16030, -35926, -13289, 9109, 31841, 33980, 30495, 17631, 13189, 15564, -23748, -36150, -47964, -24468, -22998, -37549, -39950, -26273, -1519, 31363, 20373, 35927, 45976, 6448, -12088, -12213, 5926, 20312, 14606, 7384, 6618, 1161, 5073, 16664, 12148, 26236, 20783, -2123, -7613, -16271, -4526, 19011, 29669, 30927, -8686, -36742, -21515, -42330, -50432, -44955, -45754, -28547, -6446, -15327, -25494, -17774, -7656, 9226, 10269, 18325, 15606, 10896, 13529, 12383, 36072, -452, -45437, -41804, -14205, 21203, 26716, 6573, -11058, 2604, -8591, -12147, -20157, 7355, 4081, -23466, -12962, -19300]
5482a9300q414O10L278Q234J345m493k292k0095Q873K5203J0082J0355k922j7554
5468g090r69R655M432J1391P284m776k621k008L1148R432M122j6403j4189j133
5454B8275k0209j5247J1278q302J988J0689j9164J8083j2843j5355K0856K408
5442B457J9957r285J307k460J778N465l6113k8393J1516J8270j5776k38J3942
5429a7573j0538k0660j3253n692L2229J0809Q169J3383J4633o194j846k9829J3059
5416a3303l145m497K6259m415k067j7501J8409J9433J1055J3857k4824l0042j7086
5403b7867J4534k015J2105L0785L620j6554j4323j2193j9927L501M255j1064K420
5390c2723L1687Q099j1059l168M5005J1988k4401l7695j9805k847j8987M050K3300
$$ y = [-19300, -27714, -27104, -23826, -15592, -14247, -18740, -21032, -41127, -32254, -7051, 3031, 13386, 10464, -7090, -8059, 1596, 6028, 17419, 24703, 19927, 17306, 15298, 46446, 55878, 60000, 43597, 29408, 28275, 8066, -7181, 4097, -4205, -2217, 8472, -10692, 7391, -5452, -20807, 49, 2457, 22414, 13129, 14436, 11976, 13754, 19219, -16894, -45287, -33771, -15501, -31277, -31515, -17573, -28111, -48771, -62024, -67716, -35487, -24678, -16509, -3126, 11507, 5313, 3467, -26362, -13303, -16448, -20945, 5314, 899, -1168, -18669, -260, 19173, 30228, 44085, 19261, -10781, -27867, -13333, -15348, -3243, 27542, 31162, 14608, 285, -11908, -31835, -28334, -24079, -35143, -32723, -1036, 7063, -3996, -7164, 37841, 49829, 25428, -12267, -32072, -34919, -53906, -49856, -26556]
5377b6556L1022J3946l7964j8699N249L1789j9301J353L84L22J273Q958q973N064
5363a2133m632k0553K1130p517M57R794j4350j3831J5919J6133K8230J1329M888
5350C4864r044K351M852K614J3423l9679k0654k786j4245L2272n83k1003m969
5337b2587L2172K4853J1785l1703m5106k3412K8450j1493Q915K3323K966k7046
5325b8883J5646N016k6543O274J5170L948J7428K189n63L308J7174O933J5817
5312E2914Q379k1696j4538j7071k7364l0133p351k1826N662K4847J7927Q164K4063
5299A977N139r045j0279j1866J557m186q783K2261j1318r136K0768K7144K0864
5286C5097J688o227k0873l222p005K991j5942q720K0739k0845R570L440P151K5912
$$ y = [-26556, 4466, 18412, -19552, -38251, -33002, -1213, -20514, -19161, -18777, -18455, -17182, -8224, -17197, -12133, -16765, -37318, -16188, -23705, -23248, -13454, -27804, -41635, -25716, -9583, 18647, 29976, 34864, 25820, 28171, 33023, 35637, 49060, 9381, -11273, -14059, -28304, 3968, 3385, -17618, -22587, 9585, 34438, 46223, 14520, -30586, -53998, -25548, -37041, -28126, -4803, -1837, -28883, -13237, -8221, -34764, -28490, -13320, -9372, 8056, 10245, 9682, 12990, 30164, 37097, 52914, 61293, 39597, 25059, 7988, -19376, -49509, -56860, -78686, -73024, -48177, -30250, -22086, 1977, 7116, -1929, -12208, -24074, -22517, -26703, -35486, -13225, -24543, -33679, -12911, 14233, 35097, 36785, 30558, 9685, 6463, -542, 2449, -13493, -22213, -1474, -22319, -12749, -9309, -2158, 23754]
5272B3754j3537l4810j5431L671J7748J7860J9396R063l7980k5671K4415K1188
5260I666p116k1841k787n596k891j3415J0175K8613J0340O014J6269k442Q1r899
5246A5171l0142r971l666J7934K1937M312K796l0367j1359L41k6428j619K9150
5233b1911K6243l764j8384J8341j2300J1664K3792N908O306M877k4439J6809N816
5220C8958n2779r893J7437J1185O79j2926L1243J8427j8936l6694M77j3537J5995
5207a0364L0982K79l4233j7315J4549j6259N486J9901K5319J2223P056J1452J3475
5194F2551r023l8764q413M891j0281j9886P172m639j4853N221K8037q972Q85n689
5180a1763m773j010k4956o52j7258m90J1346J3888K905p572k0075P331M7229L7886
$$ y = [23754, 10217, -24593, -40024, -36353, -18605, -745, 18651, 27714, -10266, -35937, -11522, 9666, 2550, -19291, -22078, -27674, -30565, -43980, -33805, -5192, 5148, 11162, 27431, 24989, 25070, 15171, -14971, -24942, -28608, -10674, 11263, 15575, 18371, -11996, -23355, -23014, -49442, -51061, -21911, 4332, 568, -17816, 525, -11775, -111, 23681, 29589, 35895, 40772, 16333, 33142, 38958, -13821, -23714, -6277, 4908, 5587, -7339, 23904, 42331, 23395, -13299, -12822, -26359, -10364, 20618, 20897, -13336, -30651, -16102, -32361, -26875, -6974, 18345, 30568, 37624, 49076, 62551, 53528, 14764, 6351, 11242, 961, -18925, -11753, -16392, -31245, -26024, 2013, -6959, -6074, -11763, -16536, -17546, -42502, -43154, -60412, -60902, -49556, -35668, -32763, -40335, -60410, -53079, -5850, 32036]
5166C2036j686r949j4353k2276o552J664Q827j3188k3008Q154L2107o535k7947
5153d2706l641L4308j661k0192O332J0963K8138k693n234j7942q575p940K4101
5140f742j061O671j0716m323L3263j2368k3957j8r696J2161J6637j2545m975R514
5126h155J9832M151j020J7907r208k0572L758l5618k5512J3233K6468J4658q793
5113h871k6032o441J9057n971j0401q963J0423K5927N697o491M65J0361K510j9100
5099a7830l1692j8592K2303J9070r907P665j3593j226L0820j833O471L3077Q405
5086C3138r77j3936l2374L03R154J4184J4406K2540l0134l8482l211K2531J0713
5073G855K8665n533m5260j4956N065j5654l549j87O620J6120Q322K1839K7119
$$ y = [32036, 30350, 20401, 6048, -16228, -22780, -21116, -12289, -25477, -48485, -40331, -8224, -14759, -42706, -46347, -12039, -13700, -33892, -27560, -16597, 11541, 8848, 3614, -14328, -22903, -30843, -6742, -7803, -1132, -11848, -16171, 17092, 4724, -19233, -19251, -28947, -16786, -149, -12694, -17669, -8155, 11677, 15828, 14808, 32715, 23507, 2935, 6693, -28925, -54437, -41204, -14736, -78, -8871, -34903, -41344, -22287, -28258, -38659, -47622, -37199, -11272, -5575, -12066, -11601, -1240, 1270, -17830, -49522, -68114, -45811, -26741, -36648, -28983, -42576, -43802, -12982, -14815, -8344, 24733, 33138, 32161, 18225, -14149, -13846, -4692, 9492, 23898, 46438, 16304, -22178, -25389, -2858, 7855, 36520, 30987, -14273, -29229, -24164, -39818, -43367, -43554, -36934, -20814, -12492, 9347, 36466]
5060C6466l7120l2045K016J6334Q201J188j3044L872L160K0535J1577j4296j7357
5047a0513J9515K2702l706j8562k443m263O901j5955q638k398J4355N337K7980
5034C0312k2465m4356J1331J5073l263j819P421j2643j0911M0543J2699j9092
5022B830m0639j5316K3755K7710J0820j1023k4715j9660J7616J8237J5596j4007
5010h796N3K7610P61n151k1944j7182j826K0521k131j7034j7726l889N37N273
4996d0924R990O689J2904M054J4013l451j2711n62k2379P376L5070J694J8469
4983C0232J894j9263k3821m39J5951J7948P658J3709l324n1J6506l978l4292k0296
4969a566k8598J4291J8640K1897j6878k0729j4132j9040L2062M387k3690n3K3111
$$ y = [36466, -654, -32699, -30683, -14349, -6148, -4960, -18004, -14132, -10972, 9563, 21140, 6844, -10513, 9002, 31704, 27998, 9436, 6993, 2730, 9631, -6324, -14962, -17360, -3005, 2332, 30312, 7847, -36509, -25178, -10105, -13368, -15187, -7766, -20409, -31320, 9223, 21922, 2830, -37809, -53125, -29370, -1660, 9160, -1863, -26578, -46238, -28622, -10385, 5211, -8796, -8743, 18867, 19628, 14477, -7467, -24649, -26475, -5954, -8085, -25119, -42845, -46734, -46197, -40924, -30934, -24245, -11341, -7287, 6726, 3275, -9436, -9998, -32377, -25001, 10069, 11763, 30232, 32126, 12863, -10958, -11397, 4554, 22502, 30160, 43869, 40545, 40494, 57000, 53022, 18730, -1566, -30164, -15873, 2767, 24664, 7786, -12943, -27075, -46115, -14053, -9666, -33356, -33409, -10298]
4956a0298J5631J3419j804j9692j1863J3374P297N389N25Q276j3435P473L3986
4943D8278j864j9150l5619j03j112n703L1123r000p256J9211n60q88k3159n169
4929a0971J2398p093l2348j8303R727L0342L8588j7119j3863q837M236L092p70
4916a0921K32k1494j939J6920M878j041n602k6457n338J0693K5385j9053k808
4903c6545K0745J463k53J6310R205Q665R147l965J786j6226n93K8520m541l2801
4889I17M286J4818O703M341K3949j5544j5608k7534M314n574q124K400K3742p698
4875E388k7464L483J321j4491M7708L2958j6144n613j0917N712J263l1683L744
4862d735m430J7806O302j6174P882K0231o351k2870r585J1850K926J3596J5245
$$ y = [-10298, 5333, 18752, 16948, -2744, -14607, -1233, 6064, 11453, 11978, 20254, 6819, 14292, 48278, 46414, 27264, -8355, -8458, -9570, -15273, 15850, 6850, -406, 18805, 18245, 17357, -5802, -10971, 1427, -5666, -38014, -56317, -46590, -16248, 22340, 5221, -8642, -17479, -13243, -10151, -10921, -10689, -32183, -34122, -17202, -12324, -13365, -18967, -45424, -50762, -40069, -14684, -33737, -36545, -15800, -14337, -14590, 1720, 10925, 19590, 28737, 24772, 26558, 10332, 9739, 38259, 33718, 917, 5203, 20021, 26724, 31065, 55014, 39470, 23862, -3672, 642, -4932, -13056, -10656, 13086, 5388, -22076, -18593, -17272, -31763, 15945, 48903, 32759, 27146, 16229, 21941, 23204, -8479, -4735, -9165, 8641, 14943, -1231, 6651, 26882, 20531, -2339, -11924, -74, 2852, 16448, 31693]
4849C1693j1969q093K646k912n348j8142k279L7278J0293q385j3432q332l4714
4836c1696k1111J5016R863L972K5972m99j2324o39j1995n702q231K738J0656J1622
4822a2358j0990k7612k305K5756J7311P349r77M909J4825J2843O827j4655k5465
4809d542N71J1616L299k2162m082K4204j9357l9894j9101J2736L3184J2953Q586
4796a989l7402k2948L7865J3839J729K0171j4645M984J8741L323j152j3401o848
4783B267Q05j346m09j294J0582J5456K519O620k2042j2904j6898L923r662J8568
4769c815K871q024j8097K124J3759R874L130L4630j243j31j8377m1020j9246K2338
4755b1227K0775j4588q043K7781J4751j0121k4753j7014j2144J5846O363K6231
$$ y = [31693, 19724, 11631, 14277, 11365, 6017, -12125, -14404, 22874, 33167, 24782, 11350, 3018, -31696, -52807, -37791, -27928, -23956, 2016, 1517, -10807, -11446, -23441, -29143, -37374, -34636, -23980, -12358, -23348, -50960, -53265, -27509, -10198, -2849, -3826, 1083, 15908, 28751, 35578, 20923, -4542, -3971, 7645, 10944, -11218, -15300, 8904, -10453, -50347, -69448, -56712, -23528, -10575, -1989, -39391, -62339, -24474, -10635, -8906, 11265, -3380, 1604, 20345, 23668, 22516, 9115, 2267, 3072, 1726, 1317, 23, 10605, 26061, 28580, 35200, 13158, 254, -16644, -12721, -22383, -3815, -944, -8968, -27065, -24941, -11182, -1308, 1822, 36452, 35209, 35078, 16701, -24319, -43565, -21227, -452, -15040, -23083, 4698, 19449, 9328, -15425, -32439, -44583, -28737, -22374, 3857]
4743C857J7818o814m096l6010j2849J4133K2575j8421j4442o25n653K0419K2675
4730B567L231l43o541j0434J9047o701o131o12p606N727O24j1619n860N672M2405
4715B3426r63k200l228k386q7j1914j8767k0404n347K1059L804k3092l952j3485
4701e7536j2565J1612J5173M7669q26k6589k4496Q397N948j8083j362l228J7068
4688c8818J3627J1380K6172j4825k0188j4071J3851P894k0572Q823j9893k1163
4676f7783L3077q328J4655L5914j1750j3606K3057J90k576O403J3699O063J3114
4663D2129q82j1506J3570j0350m9820k0667J9173J2428j596j0634R948L0578P3
4650B2444q463R892R923j2338J1377J4896k8011N036j4920j7627Q391k415q286
$$ y = [3857, 21675, 14861, 10765, -25245, -38094, -23961, -1386, -19807, -34249, -34874, -40527, -20108, 2567, 5798, 5455, -1086, -11520, 7527, 826, -5305, -5917, -13523, -7796, -7172, -18791, -24651, -18979, 23426, 22463, 20263, 17035, 14649, 14562, 2648, -16119, -36523, -41870, -20811, -17007, -40099, -44051, -57536, -70101, -58489, -43316, 4353, 3527, -23062, -47558, -39161, -33213, -51296, -52658, -55886, -38818, -25191, -13811, 12361, -2464, -22652, -36723, -22872, -14978, -35550, -26727, -46620, -67783, -34706, -43034, -28379, 7535, -4215, -17821, 5236, 5426, 2850, 9253, 22952, 29015, 42129, 41247, 29741, 43311, 32961, -16859, -37526, -18353, -5925, -7521, -18155, -8207, 22371, 22444, 13981, 23873, 33796, 21458, 32835, 47731, 19720, 24756, 9836, -7791, 600, -1815, -10101]
4637a0101q155j5230J8648K2212j2074j5453m775P230L365P233J5162J4458m970
4624A7550o36J2553r003m802J392r623l218L321k2192k859j43k2498K4936Q699
$$ y = [-10101, -18256, -33486, -14838, 7374, -4700, -20153, -24928, -17698, -14333, -7100, 8062, 22520, 17550, 16914, 29467, 20464, 15662, 17054, 7431, 4213, 7534, -14658, -17517, -17660, -40158, -15222, -6523]
$$ [...]
##END NTUPLES=NMR SPECTRUM
##END=
