##TITLE=Analysis number 321388
Compound Code cc 60351
Book Reference 470/75
Project Code adrs
Chemist Name mikem
##JCAMPDX= 6.0         $$ Bruker NMR JCAMP-DX V2.0
##DATA TYPE= NMR SPECTRUM
##DATA CLASS= NTUPLES
##ORIGIN= Bruker BioSpin GmbH
##OWNER= nmr
$$ XWIN-NMR		Version 3.5
$$ Tue Aug  8 13:41:33 2006 GMT Daylight Time (UT+1h)  MAYBRIDGE\nmr@NMR_250MHZ
##.OBSERVE FREQUENCY= 250.131544655141
##.OBSERVE NUCLEUS= ^1H
##.ACQUISITION MODE= SIMULTANEOUS (DQD)
##.ACQUISITION SCHEME= undefined
##.AVERAGES= 16
##.DIGITISER RES= 18
##SPECTROMETER/DATA SYSTEM= dpx250
##.PULSE SEQUENCE= zg30
##.SOLVENT NAME= DMSO
##.SHIFT REFERENCE= (INTERNAL, DMSO, 0, 16.522)
##AUDIT TRAIL= $$ (NUMBER, WHEN, WHO, WHERE, WHAT)
$$ ##TITLE= Audit trail, XWIN-NMR		Version 3.5
$$ ##JCAMPDX= 5.01
$$ ##ORIGIN= Bruker BioSpin GmbH
$$ ##OWNER= nmr
$$ C:\u/data/dgb/nmr/ADRS/440/pdata/1/auditp.txt
$$ ##AUDIT TRAIL=  $$ (NUMBER, WHEN, WHO, WHERE, WHAT)
(   1,<2006-08-08 13:40:58.85 +100>,<MAYBRIDGE\nmr>,<NMR_250MHZ>,
      <created by zg, POWCHK disabled, PULCHK disabled
       configuration hash MD5:
       E2 DF 36 D8 04 B2 41 60 5A D7 A3 38 5A 4B D0 FE
       data hash MD5: 64K
       74 0D 77 8E FD A7 43 C2 01 6A 27 F3 AA 10 9F 58>)
(   2,<2006-08-08 13:41:15.07 +100>,<MAYBRIDGE\nmr>,<NMR_250MHZ>,
      <Start of raw data processing
       ef LB = 0.3 FT_mod = 6 PKNL = 1 SI = 32K 
       data hash MD5: 32K
       F5 94 79 28 60 F6 C5 FC AD DC BA 59 55 7D 64 79>)
(   3,<2006-08-08 13:41:19.28 +100>,<MAYBRIDGE\nmr>,<NMR_250MHZ>,
      <apk 
       data hash MD5: 32K
       20 58 90 DC 07 5D 47 2B 51 19 5D 43 0A C4 53 31>)
(   4,<2006-08-08 13:41:20.52 +100>,<MAYBRIDGE\nmr>,<NMR_250MHZ>,
      <abs ABSG = 5 
       data hash MD5: 32K
       D1 8B 03 C2 5E 2E 04 72 0D B6 33 FF 82 73 10 2C>)
$$ ##END=
$$ 
$$ hash MD5
$$ F0 DD 66 79 E8 FB AF 07 C2 3E DB E3 22 6F DA E4
##$RELAX= 
##$RELAX= 
##$RELAX= 
##$RELAX= 
##$RELAX= 
##$RELAX= 
##$RELAX= 
$$ Bruker specific parameters
$$ --------------------------
##$DU= <C:\u>
##$EXPNO= 440
##$NAME= <ADRS>
##$PROCNO= 1
##$TYPE= <nmr>
##$USER= <dgb>
##$AMP= (0..31)
100 100 100 100 100 100 100 100 100 100 100 100 100 100 100 100 100 100 
100 100 100 100 100 100 100 100 100 100 100 100 100 100 
##$AQSEQ= 0
##$AQ_mod= 3
##$AUNM= <au_zg>
##$AUTOPOS= <33 >
##$BF1= 250.13
##$BF2= 250.13
##$BF3= 250.13
##$BF4= 250.13
##$BF5= 500.13
##$BF6= 500.13
##$BF7= 500.13
##$BF8= 500.13
##$BYTORDA= 1
##$CFDGTYP= 0
##$CFRGTYP= 5
##$CHEMSTR= <none>
##$CNST= (0..31)
1 1 145 1 1 1 1 1 1 1 1 1 1 1 1 1 1 1 1 1 1 1 1 1 1 1 1 1 1 1 1 1 
##$CPDPRG= <>
##$CPDPRG1= <>
##$CPDPRG2= <>
##$CPDPRG3= <>
##$CPDPRG4= <mlev>
##$CPDPRG5= <mlev>
##$CPDPRG6= <mlev>
##$CPDPRG7= <mlev>
##$CPDPRG8= <mlev>
##$CPDPRGB= <>
##$CPDPRGT= <>
##$D= (0..31)
0 1 0 0 0 0 0 0 0 0.06 0 0 0 0 0 0 0.0002 0 0 0 0 0 0 0 0 0 0 0 0 0 0 
0 
##$DATE= 1155040856
##$DBL= (0..7)
120 120 120 120 120 120 120 120 
##$DBP= (0..7)
150 150 150 150 150 150 150 150 
##$DBP07= 0
##$DBPNAM0= <>
##$DBPNAM1= <>
$$ [...]
##$SUBNAM7= <"">
##$SUBNAM8= <"">
##$SUBNAM9= <"">
##$SW= 20.6930455092707
##$SWIBOX= (0..15)
0 0 3 0 0 0 0 0 0 0 0 0 0 0 0 0 
##$SW_h= 5175.983436853
##$TD= 65536
##$TD0= 1
##$TE= 295.16
##$TE2= 300
##$TE3= 300
##$TEG= 300
##$TL= (0..7)
0 120 120 120 120 120 120 120 
##$TP= (0..7)
150 150 150 150 150 150 150 150 
##$TP07= 0
##$TPNAME0= <>
##$TPNAME1= <>
##$TPNAME2= <>
##$TPNAME3= <>
##$TPNAME4= <>
##$TPNAME5= <>
##$TPNAME6= <>
##$TPNAME7= <>
##$TPOAL= (0..7)
0.5 0.5 0.5 0.5 0.5 0.5 0.5 0.5 
##$TPOFFS= (0..7)
0 0 0 0 0 0 0 0 
##$TUNHIN= 0
##$TUNHOUT= 0
##$TUNXOUT= 0
##$USERA1= <user>
##$USERA2= <user>
##$USERA3= <user>
##$USERA4= <user>
##$USERA5= <user>
##$V9= 5
##$VALIST= <valist>
##$VCLIST= <CCCCCCCCCCCCCCC>
##$VD= 0
##$VDLIST= <DDDDDDDDDDDDDDD>
##$VPLIST= <PPPPPPPPPPPPPPP>
##$VTLIST= <TTTTTTTTTTTTTTT>
##$WBST= 1024
##$WBSW= 4
##$XGAIN= (0..3)
0 0 0 0 
##$XL= 0
##$YL= 0
##$YMAX_a= 349548
##$YMIN_a= -428332
##$ZGOPTNS= <>
##$ZL1= 120
##$ZL2= 120
##$ZL3= 120
##$ZL4= 120
##$ABSF1= 16.522
##$ABSF2= -4.171173
##$ABSG= 5
##$ABSL= 3
##$ALPHA= 0
##$AQORDER= 0
##$ASSFAC= 0
##$ASSFACI= 0
##$ASSFACX= 0
##$ASSWID= 0
##$AUNMP= <proc_1d>
##$AZFE= 0.1
##$AZFW= 0.1
##$BCFW= 0
##$BC_mod= 0
##$BYTORDP= 0
##$COROFFS= 0
##$CY= 12.5
##$DATMOD= 1
##$DC= 0
##$DFILT= <>
##$DTYPP= 0
##$F1P= 14.0000005364418
##$F2P= -0.99999901652339
##$FCOR= 0.5
##$FTSIZE= 32768
##$FT_mod= 6
##$GAMMA= 0
##$GB= 0
##$INTBC= 1
##$INTSCL= 1
##$ISEN= 128
##$LB= 0.3
##$LEV0= 0
##$LPBIN= 0
##$MAXI= 10000
##$MC2= 0
##$MEAN= 0
##$ME_mod= 0
##$MI= 0
##$NCOEF= 0
##$NC_proc= -6
##$NLEV= 6
##$NOISF1= 0
##$NOISF2= 0
##$NSP= 0
##$NTH_PI= 0
##$NZP= 0
##$OFFSET= 16.522
##$PC= 1
##$PHC0= 149.4969
##$PHC1= -3.429904
##$PH_mod= 1
##$PKNL= yes
##$PPARMOD= 0
##$PSCAL= 4
##$PSIGN= 0
##$REVERSE= no
##$SF= 250.13
##$SI= 32768
##$SIGF1= 0
##$SIGF2= 0
##$SINO= 400
##$SIOLD= 32768
##$SREGLST= <1H.DMSO>
##$SSB= 0
##$STSI= 32768
##$STSR= 0
##$SW_p= 5175.98343685301
##$SYMM= 0
##$S_DEV= 0
##$TDeff= 65536
##$TDoff= 0
##$TI= <Analysis number 999999
Compound Code 99
Book Reference 9
Project Code 9>
##$TILT= no
##$TM1= 0
##$TM2= 0
##$TOPLEV= 0
##$USERP1= <user>
##$USERP2= <user>
##$USERP3= <user>
##$USERP4= <user>
##$USERP5= <user>
##$WDW= 1
##$XDIM= 32768
##$YMAX_p= 554258727
##$YMIN_p= -1322014
$$ End of Bruker specific parameters
$$ ---------------------------------
##NTUPLES= NMR SPECTRUM
##VAR_NAME=  FREQUENCY,     SPECTRUM/REAL,   SPECTRUM/IMAG
##SYMBOL=    X,             R,               I
##VAR_TYPE=  INDEPENDENT,   DEPENDENT,       DEPENDENT
##VAR_FORM=  AFFN,          ASDF,            ASDF
##VAR_DIM=   32768,         32768,           32768
##UNITS=     HZ,            ARBITRARY UNITS, ARBITRARY UNITS
##FACTOR=    0.157963299565203, 1,           1
##FIRST=     4132.6476996994, 0,             0
##LAST=      -1043.33573715361, 0,           0
##MIN=       -1043.33573715361, -1322014,    0
##MAX=       4132.6476996994, 554258727,     0
$$ Real data points
##PAGE= N=1
##DATA TABLE= (X++(R..R)), XYDATA
$$ [...]
19563 -102707 -251240 -124227 139384 11169 -192988 -367362 -689692 -762061 -706754 -934531
19553 -934531 -585110 -5131 38769 -95674 -250202 -301564 -591398 -819210 -805419 -874201
19543 -874201 -874715 -817049 -828343 -683601 -646184 -697862 -807915 -794277 -607539 -425632 -329040
19532 -329040 91839 -195325 -367990 -328693 -255208 -71600 -144851 -219419 -188812 167872
19522 167872 -55644 -194070 -178837 -381226 14424 173203 -239761 -390074 -228311 -423248
19512 -423248 -737735 -779605 -852065 -576622 -119087 -240172 -599048 -634132 -648222 -751285
19502 -751285 -728511 -707896 -518171 -987446 -1003015 -398299 -36115 -311999 -453033 -243240
19492 -243240 -97601 -115245 19463 -124702 -320672 -647802 -582015 -350897 -120056 -134946
19482 -134946 -300411 -325006 -181921 -201638 -253936 -224363 -267934 -31254 72886 126226 39757
19471 39757 118494 182210 428560 480142 254826 147556 205788 253504 103222 193151 196861
19460 196861 336318 157342 65411 232527 276022 218238 33541 -61269 -202983 -401426
19450 -401426 -309637 -485962 -531080 -375262 79588 -26354 -325193 -89832 -122568 -168138
19440 -168138 -184365 -146138 -85836 38669 10924 375418 250970 129542 -215903 -819140
19430 -819140 -878488 -397755 -266964 -348557 -238040 -97649 127717 237413 240852 211227
19420 211227 64407 96311 220822 646950 738290 651818 572434 667875 874372 712742
19410 712742 703435 951276 1220099 1429795 1288768 979459 653613 215945 8775 134167
19400 134167 90532 123917 36493 164192 -196695 -167522 -163039 -158695 68954 -96261 91049
19389 91049 179794 310400 317606 -71168 -134875 -319341 -552000 -628273 -541394 -501420 -757037
19378 -757037 -720353 -379849 -114215 -385541 -280968 -384704 -238259 -94404 -232228 -267043
19368 -267043 -221328 -696717 -1216061 -1313308 -1084475 -756547 -448983 -343313 -417497 -472312
19358 -472312 -210345 -149954 -349773 -434214 -432031 -288239 -378524 -316899 -228359 -477372 -455314
19347 -455314 -515247 -579285 -235101 -140067 -16422 270724 393483 104018 -2345 -6089
19337 -6089 165725 159277 19766 -203695 -235216 39022 36661 110173 28474 -29981 -94797
19326 -94797 -278182 -7031 492612 410439 497970 353623 255985 98608 -64521 -188647
19316 -188647 -156745 -286166 270555 589215 864755 975646 839677 778453 1078489 1223932
19306 1223932 1527402 1575120 1656537 1576427 1548929 1332433 1109016 898376 519727 174340
19296 174340 323773 703872 710966 475718 117818 -167590 280034 902183 1035111 949582
19286 949582 721326 623462 560472 781115 876452 796391 954429 613038 364506 391368
19276 391368 210123 -7880 -173395 81298 152624 138424 -256960 -777718 -1124409 -989147
19266 -989147 -664701 -545709 -157097 -163696 -94262 32524 69997 14978 135176 348748
19256 348748 417071 266171 343664 498712 772228 1049707 1300974 1660443 1436917 1632233
19246 1632233 1412062 787311 614113 337835 24889 42477 16195 -18060 110467 134941
19236 134941 135781 225510 189780 261728 266267 383317 375346 314680 49175 -496072 -605355
19225 -605355 -203426 -65939 -192731 -250982 -292315 -416953 -424425 -367035 -467036 -553110 -326872
19214 -326872 -161616 -66552 -39282 -331198 -581398 -710765 -488205 -266921 -427085 -576115
19204 -576115 -535644 -349018 -115397 -114200 -301994 -450609 -486119 -566179 -202279 251919
19194 251919 224133 -244744 -548135 -280329 -102428 -134421 -61695 -28792 171958 160651
19184 160651 -148399 -226387 -247863 -371259 -396055 -428714 -467289 -470985 -424784 -542328 -297519
19173 -297519 65766 176251 -372 -340887 -427908 -441203 -304587 -324644 -59149 247790
19163 247790 114976 -205790 -308296 -415822 -529227 -738649 -661534 -615638 -569033 -278380
19153 -278380 -381903 -776384 -690392 -555073 -471437 -856007 -738882 -536753 -380054 -315768
19143 -315768 -259046 -331032 -197544 -30670 117609 64132 -180429 -433914 -400687 -180989
19133 -180989 45276 557824 465936 -92657 -405553 -270548 2741 69645 -300896 -289865
19123 -289865 -193899 -24189 50939 -21506 42876 398255 412189 -12190 -465257 -370113 -315270
19112 -315270 -285526 -190009 63048 -347746 -714072 -583640 -368413 -143503 67651 66498
19102 66498 -26473 -17382 -107009 100692 35244 36196 -53626 177132 389226 315925 -8184
19091 -8184 -246521 -525267 -458459 -192178 -83095 -448932 -281693 -101365 -117566 161914
19081 161914 650831 759131 285855 -3658 137876 399440 560511 334928 49561 149015
19071 149015 -35725 -206180 -392173 -275449 -271310 -179205 190181 165645 -173831 -80940
19061 -80940 -9411 215180 302331 448973 502206 374697 378340 350531 178565 237497 352286
19050 352286 79526 255874 296305 500986 656779 580482 311829 247772 251163 341966 349963
19039 349963 384750 318874 187689 299253 234619 206509 549069 508086 473585 590178 300365
19028 300365 132930 331237 554040 711488 598831 307297 296111 332522 368364 689200
19018 689200 1030640 1114948 1136349 1232089 1496895 1332312 1263009 1092360 1470225 1728333
19008 1728333 1686412 1886844 1986420 2012043 2422906 2498918 2835221 3203718 3751817 3830197
18998 3830197 4048536 4312051 4881955 5547919 6177907 6478234 6856621 7380267 8190926
18989 8190926 9181432 10108415 11435426 12823238 14254209 15645439 17244016 18937746
18981 18937746 20470297 22329903 24024659 25260158 26508945 27709134 28951628 30331740
18973 30331740 32089479 34269785 36610700 39905293 44851177 52032243 61287437 73622463
18965 73622463 89554665 108126280 127252790 144656065 159392404 171782582 181758493
18958 181758493 189149341 192676014 190670264 182769009 169843299 155101427 140623955
18951 140623955 127721065 117045165 108522940 101396726 95402039 90107594 85017246 80333945
18943 80333945 75788216 71399975 66339662 61356959 57238203 53382439 49966255 47315041
18935 47315041 45552400 44229358 42988187 42038381 41410094 41475531 41871833 42160227 42289246
18926 42289246 42979976 44062943 44999216 47091919 49916862 53099779 56866553 60796700
18918 60796700 65023773 69762166 74469326 79744082 85474364 92314887 99748111 107692119
18910 107692119 117446743 129612039 143696869 159762055 176792762 191909581 202842358
18903 202842358 209232189 212072309 211910720 208213694 199205234 184513835 164578526 141898453
18895 141898453 120436025 102630771 88206672 77709383 70263135 64657575 60316125
18888 60316125 57192781 54683958 52500901 50056276 47572018 45630138 43824835 41731151
18880 41731151 39427669 37301698 35213122 32780488 30456490 28316147 27029789 25483624
18872 25483624 24113293 22719614 21797825 20594580 19424965 18277673 17259248 16419815
18864 16419815 15361021 14727711 14502434 14547764 14208104 13318240 12604792 12091957 11909610
18855 11909610 11826773 11328893 10837496 10559594 10253645 9827680 9184497 8845712 8944297 9002704
18845 9002704 8672896 8466132 8265925 7902132 7396565 7299906 7441195 7265075 6783169 6512566
18835 6512566 6438863 6301217 6242705 6005704 5691767 5777681 6167387 6105589 5685725 5367363
18825 5367363 5321638 5515470 5338202 5278235 5224060 4950754 4830110 4747167 5001079 4578287
18815 4578287 4031480 3662620 3392281 3626347 3784693 3506026 3267050 3155540 3040479
18806 3040479 2949300 3046349 2794725 2568244 2339668 2238376 2293554 2224784 2413256 2615567
18796 2615567 2749677 2774175 2579138 2186659 2133975 2145338 2161704 2318019 2469041 2594738
18786 2594738 2324910 2272772 2307698 2481047 2335962 2112613 1982124 2036774 1867390 1919571
18776 1919571 1696376 1932091 2018124 1470506 1357167 1594632 1409083 1352872 1552245 1555331
18766 1555331 1498299 990958 965526 938012 915417 926625 1127752 1136431 1136346 1085287 1346244
18755 1346244 1413242 1383759 1313210 1430463 1505067 1481374 1350259 1374762 1430121 1429961 1355561
18744 1355561 884521 996762 1387547 1345319 1166531 871360 863896 1062290 968304 1027886
18734 1027886 748086 646637 891336 946167 706064 637201 801000 475488 420744 618696
18724 618696 498626 541870 638476 432620 268369 222545 214063 257385 510405 762614 623603
18713 623603 686407 738849 537457 684861 713795 749903 739417 671128 499397 414447 536748
18702 536748 1062873 1225297 904377 978959 652097 413963 767065 830081 659943 502651
18692 502651 354424 621047 957162 1022191 949328 1179334 1060699 892018 963789 552954
18682 552954 345955 78026 45186 -229414 -136891 270949 90382 -86586 58075 12242
18672 12242 209803 320362 268492 630901 685825 455346 403074 352744 164373 134913 53064
18661 53064 330700 414337 274845 365505 452862 316221 154957 426829 326573 303442
18651 303442 199211 -22907 -72128 -14620 309244 678188 583707 622961 739608 902552
18641 902552 754791 894985 932647 747460 569968 565622 429430 371072 152105 26983
18631 26983 42820 129837 177972 223684 249254 221663 120861 154330 -159469 -723391 -1212732
18620 -1212732 -811866 -179788 244345 362778 -14690 -450238 -567740 -266561 48221
18611 48221 227871 424514 701063 590459 241731 68996 138473 123659 129506 21115
18601 21115 113836 224790 318054 114911 217612 257515 412611 711752 -79700 -343228
18591 -343228 -129239 -23555 322972 824476 588320 315915 -210062 -614132 -238867 24867
18581 24867 -79587 49127 -111583 -165635 120985 265654 535513 338535 -187848 -131050
18571 -131050 181047 464279 351751 -11676 -282855 -287184 92361 289911 163951 -76537
18561 -76537 240762 287681 303639 219105 -285488 -352677 -490146 -571650 -334119 75316 149256
18550 149256 -87126 -2966 -250089 -11822 162165 -29948 60258 308913 575666 525478
18540 525478 308248 160506 276002 412188 -34879 -94361 -191018 -31998 82393 3065
18530 3065 -2927 206935 364218 538302 641616 580959 46436 -12475 45700 -63847 126843
18519 126843 39817 -316630 -474658 -588794 -737437 -694744 -531584 -64652 191056 542180
18509 542180 416384 259379 27779 -341542 -294293 -353803 -349581 71964 220719 454527
18499 454527 559651 507466 417287 179270 -70427 -108953 61727 -71118 -249970 -431474
18489 -431474 -230291 -210894 -53894 51471 75326 57600 111182 22394 -100132 -39420 -55437
18478 -55437 -168182 139445 201703 -51311 -11755 75465 -9605 -124638 149647 273950
18468 273950 458931 500215 457798 287415 326630 144530 274966 278663 298250 352925 395181
18457 395181 135197 386288 756066 796092 608800 519388 658422 845495 783873 627987
18447 627987 804189 844879 1013509 849686 887544 668659 543579 657576 550415 415653
18437 415653 553625 700501 604465 886402 880473 723129 532081 319934 84685 192944
18427 192944 213135 184326 314785 404608 398538 571954 749750 848745 753864 476267 215837
18416 215837 358619 291338 146394 252705 177198 -4124 333855 469522 181084 86666
18406 86666 384740 455940 765001 1142546 1412633 1240456 954636 962238 1099022 1018177
18396 1018177 955496 927251 707342 276718 196364 514729 575722 496824 566338 597986 324774
18385 324774 106759 501285 382751 440198 636340 552201 355516 544988 240145 177964
18375 177964 146956 231126 338812 291582 329501 510078 359260 270476 339797 321814 160714
18364 160714 91112 144274 -335574 -615452 -61756 197099 -43471 19712 -310034 -357008
18354 -357008 -216485 -417566 -492693 -26647 23115 252031 248816 260489 139090 -1227
18344 -1227 -160642 -458118 -459504 -474541 -67569 111288 121578 51249 49190 43266 -5735 -46823
18332 -46823 -278034 -194970 202162 193639 128301 83447 -31877 48537 96250 363768 494693
18321 494693 -34866 -116235 18496 -107592 3997 133564 242694 315237 226842 136281
18311 136281 216380 434630 309148 293167 649177 296199 31366 77686 -121646 -304895
18301 -304895 -270066 64298 95865 -119573 -341083 -202327 -312779 -192787 -134880 110431
18291 110431 110136 -50041 -331571 -397004 161599 504180 192304 278021 543116 555116 475685
18280 475685 636615 777299 672923 378675 62195 46881 259142 467115 719968 961873
18270 961873 984630 1002559 802793 687343 964658 953804 717369 604159 493312 131023
18260 131023 179613 -23859 -213865 -141677 151626 547019 826799 617937 631250 778338
18250 778338 600635 -197638 -450188 -552058 -375799 123379 105615 335331 440181 571900
18240 571900 984882 995929 825223 648136 602004 632721 438693 539361 498104 309321
18230 309321 282393 366812 531527 201784 298581 482503 952284 1150937 1173151 1383978
18220 1383978 1299336 1462791 1683112 1600523 1391449 1249613 1426994 1135088 1067983 864057
18210 864057 632660 524250 644408 645452 310409 -50757 -39541 176483 436482 761969
18200 761969 719098 356432 331471 757950 690971 314916 -94565 -217271 -212022 -77343
18190 -77343 263764 157149 126444 -344054 -659895 -253438 -40577 51837 -83530 54227
18180 54227 557426 734880 593652 465141 313366 208285 399829 426364 407877 553220
18170 553220 576734 528997 218539 375889 375179 228613 60632 -57733 184301 554853
18160 554853 765595 351966 -193864 -418236 -377499 -328560 -278071 -57503 175709 355123
18150 355123 442570 302377 5140 -247753 -452296 -370244 -72309 76265 195647 95261
18140 95261 -47677 -91059 -105166 10697 71510 283853 649348 567394 395133 104888
18130 104888 -255806 -459858 -354619 -145752 70167 190463 50510 -42563 -209690 -349403
18120 -349403 -562094 -227245 42844 -13465 -291967 -554681 -725826 -763411 -383145 -238545
18110 -238545 -83159 26300 -51937 -17225 -402782 -228569 -272336 -446452 -492483 -393834
18100 -393834 164520 591534 425597 297868 266474 222732 417589 251236 119574 83577
18090 83577 212460 287102 357973 263668 144285 305853 360429 155029 -170043 74478
18080 74478 140715 33878 124732 -45040 -263704 -192841 -230644 -78236 -193575 -88886
18070 -88886 3019 170323 38258 -18681 31857 214222 682904 639478 362600 86422
18060 86422 107338 229619 32797 -295924 -426578 -455791 -231544 -360142 -384531 -214118
18050 -214118 -288339 -380605 -506324 -634170 -346874 9378 -32909 55105 -54585 -189370
18040 -189370 -297774 -478268 -501076 -392700 -206759 -168651 -316 151267 -314036 -571003
18030 -571003 -815256 -657446 -705346 -308389 -18490 57154 -119259 -205778 -91648 -11293
18020 -11293 -33107 7541 311141 210227 336970 -12934 -472441 -457026 -107613 111346
18010 111346 308461 155540 1957 -91588 -153688 -291076 -507632 -484087 -188351 -51672
18000 -51672 -300740 -282891 -113064 -157893 -205703 -152905 -26984 -41447 179217 426206 504024
17989 504024 682819 701901 631139 801638 979894 1150512 1333588 1170458 928518 640535
17979 640535 237823 19068 -117667 -142820 -372666 -60453 459918 556860 679310 608401
17969 608401 594619 214423 284767 481545 392007 429633 736654 368897 122976 -75796
17959 -75796 -114682 -107468 285752 223243 58548 126098 280088 -4108 -82067 -147009 78918
17948 78918 191185 470806 120355 181829 260824 754280 761508 497205 330054 177548
17938 177548 209592 325790 503220 640226 429435 477402 714715 1021023 1445523 1448518
17928 1448518 1128030 1303304 1409061 1243417 1159891 1191855 1034403 1231872 1410071 1086790
17918 1086790 736733 471678 383546 615112 584626 451381 328087 375398 252982 182965
17908 182965 136056 92627 133595 -99337 -335980 -127686 -243028 -241629 -333825 -445376 -221425
17897 -221425 110665 234139 109121 151030 187751 211209 122310 381487 -48849 -291287
17887 -291287 114538 323736 529129 302713 155132 262885 389052 721152 757348 481830
17877 481830 -23890 175887 410018 449679 393206 292495 271422 342603 419859 386405 742188
17866 742188 799717 386215 278889 -13054 -177846 2192 122868 223033 436067 707555
17856 707555 619439 578662 307417 145558 -160139 -270086 -102395 559365 509822 257350
17846 257350 97774 259737 215044 19085 -362885 -323022 -137851 -79797 85023 -40133
17836 -40133 -299650 -224974 -82118 -52673 -134435 -69996 -486864 -509070 -234829 -163054 -340403
17825 -340403 -649529 -747670 -477631 -609417 -815815 -510642 -148392 93157 106009 194822
17815 194822 387697 658180 532605 134051 44929 362775 325063 405968 262314 182240
17805 182240 444161 520302 559016 398250 94059 -39505 -5306 247867 -99971 -365198
17795 -365198 -268112 -426966 -127287 171497 257178 333161 349601 303222 389218 830418 753005
17784 753005 100673 161021 620528 277860 232435 116129 10959 -245902 -349071 25519
17774 25519 87216 23047 160625 339492 311456 361506 204519 318944 17469 62747 -260714
17763 -260714 -243031 197955 346117 239001 324116 805750 930009 1099330 1163751 1161842
17753 1161842 1601685 1749986 1675595 1664843 1466290 1148764 1036470 1051489 760539 780106
17743 780106 657057 557970 555254 347467 230209 439615 356747 26229 254546 396558
17733 396558 456516 663909 728789 696924 751415 690784 446521 220580 129970 -14621 72114
17722 72114 394277 363381 371194 341056 362301 225061 184475 113230 342757 337127 666453
17711 666453 678924 568897 464387 619336 954849 1093164 601504 646610 706541 535735
17701 535735 385654 623952 1009954 1062035 998421 1085403 984047 1070324 1347614 1376779
17691 1376779 1230310 1466407 1098819 1252740 1276699 1060477 777974 579208 436791 727000
17681 727000 916214 686036 452267 593742 514909 406348 611785 474723 243778 -79658
17671 -79658 104867 248348 293820 112341 244514 236365 386778 380536 247223 559370 299895
17660 299895 312032 426389 550374 558012 445667 5556 -213318 -435437 -303212 104763
17650 104763 490614 536547 495645 444590 -92034 -341579 38530 308350 191662 183652
17640 183652 -156633 -578537 -523079 -373390 -184910 197530 648489 452285 285941 189489
17630 189489 -124779 33956 561320 583741 59327 -93954 6944 302775 388272 350924
17620 350924 322421 433611 533423 518445 268556 249493 383961 384012 466974 569582 483495
17609 483495 390451 529484 350916 189043 -59411 -74752 -250767 -402590 -315876 -165173
17599 -165173 -225807 -136413 -71841 -234405 -495187 -519407 -245675 -334696 -62164 -80099 -756462
17588 -756462 -540242 -200269 -297386 -94190 264299 247707 413897 652480 482182 80301
17578 80301 75748 40628 73753 335562 553257 513424 463786 208025 -187344 -128510 12750
17567 12750 26531 404921 640965 686729 427759 235247 379782 288445 383023 579702
17557 579702 884206 880297 361859 257434 352647 364782 394475 421591 825872 1037012 1023301
17546 1023301 831600 826815 748515 607616 483662 523353 634303 710831 768065 659448
17536 659448 766033 638570 504939 356508 547796 714966 372454 178043 97500 225632
17526 225632 259938 168098 345116 408369 434379 574590 892886 810692 617449 629593 560175
17515 560175 803775 942628 1108815 1238248 1051285 996910 1009290 1142800 1230313 1073828
17505 1073828 1083148 1202909 1198086 953509 1000644 1067311 1001689 1005478 1065458 950767 1104742
17494 1104742 1057973 1030703 1182200 1584860 2144849 1985021 1853847 1951952 2156426 2344093
17484 2344093 2602690 2720870 2685803 2966366 3353829 3452134 3386963 3629733 4066592 4568706
17474 4568706 4923352 4959907 5235186 5738248 6060442 6472137 7076531 7808386 8830546
17465 8830546 9998223 10896723 11642399 12436667 13524824 14898951 16168566 17264269 18298574
17456 18298574 19415259 20875300 22089421 23371305 25317170 26980867 28777472 30272214
17448 30272214 31823358 33762648 36086095 38329171 40826001 44411674 48849877 54669430
17440 54669430 62666210 72979756 85458076 99592261 115748363 132159036 147011647
17433 147011647 159480267 169507542 177454962 182601442 183811453 180931557 173555838 162728421
17425 162728421 150657367 138630416 127785946 118704269 110571027 103745295 98280158
17418 98280158 93664007 88988298 84438460 80089500 75651672 70906006 66271463 61932978
17410 61932978 58141192 54699464 51858521 49743881 47937590 46056007 44302134 43172781
17402 43172781 42419352 41766385 41436324 41606463 41524641 41970713 43521853 45433319 47812872
17393 47812872 50479025 53884469 57506603 61607772 65716748 70208870 74792168 79652260
17385 79652260 84560981 89932281 96342167 103518079 112095606 121495096 132286907 143846710
17377 143846710 154800404 164138318 171583181 176396447 178225641 176647711 171873634 163936071
17369 163936071 152838721 138440730 122537815 107144460 93726030 82663292 73917408
17362 73917408 67177042 62095116 57787686 54472708 51889830 49732033 47794910 45930603
17354 45930603 44030937 41737379 39445528 37641093 36024655 33891822 31475608 29324336
17346 29324336 27644420 25874632 24217391 22799471 21583333 20394806 19339179 18123952
17338 18123952 17468574 16726425 15895124 15531275 15208298 14809689 14122849 13253617 12834451
17329 12834451 12616626 12545414 12096890 11129195 10313242 10085450 9952258 9662924 9179429
17320 9179429 8974707 8711334 8552198 8748899 8668968 8229070 7819408 7581329 7520024 7303642
17310 7303642 6974029 6820847 6945455 6744492 6551151 6532110 6084486 5817019 6023865 6211273
17300 6211273 5841114 5745519 5855193 5742496 5384210 5024844 4758296 4683268 4443975 4242205
17290 4242205 4219405 4090651 4077062 4411228 4191195 3903916 4036749 4086191 3625420 3407728
17280 3407728 3713791 3780104 3491583 3366777 3195257 3041745 3175129 3328547 3027396 2823224
17270 2823224 2616588 2749302 2781872 2555280 2496693 2308205 2117875 1839076 1764747 1705494
17260 1705494 1968454 2318915 2749793 2702488 2705237 2427625 2316819 2187262 2194342 2276394
17250 2276394 1969325 1901419 2226380 2065383 1758312 1349455 1229325 1517972 1790597 1906054
17240 1906054 2102153 2185266 2180280 1851867 1620054 1716915 1504678 1339361 1304993 1666515
17230 1666515 1874703 1839604 1548278 1323955 1309969 1194814 755947 928746 963408 932034
17220 932034 1139492 1267769 1394438 1155199 1078447 1441983 1028863 597209 577871 1081228
17210 1081228 1035197 1043406 1427289 1509760 1347330 1203593 830729 711788 779856 864068
17200 864068 783167 880637 731854 623614 1061342 1154033 905534 1039471 1119707 887697
17190 887697 774095 548234 421108 171325 335421 585422 982334 925985 824904 928665
17180 928665 1053747 1036787 1013198 963584 790727 408239 241662 401763 484482 374831
17170 374831 243067 547436 541470 372366 600992 633792 523330 123639 268871 434229
17160 434229 815385 1084750 1233760 1361759 1021663 720531 542276 584879 553375 418646
17150 418646 439807 357135 475673 503228 279905 99906 24730 262247 707643 214675
17140 214675 83710 -59115 -76773 -67241 -57827 130436 299576 142156 155861 280316 393438
17129 393438 379824 470935 505173 435238 656147 451995 105057 305680 414998 654346
17119 654346 412315 296877 336698 368609 733263 720535 395679 302665 501262 628268
17109 628268 449605 589531 475950 171863 -150293 -240470 -158688 159428 -25924 -131030
17099 -131030 -86213 33915 187812 332959 396040 174387 404555 539188 526177 409062
17089 409062 504129 396969 262085 23650 -32294 91325 296939 451162 470669 424708
17079 424708 553536 1056486 1096898 467220 -76158 -37519 -76432 -128397 42414 399403
17069 399403 692986 752780 382268 241602 408574 506218 411422 213620 344012 716042
17059 716042 745794 749269 700143 725072 527371 359413 115821 -259002 88477 501336
17049 501336 406676 147406 251295 375830 30119 185105 414290 123165 309785 361540
17039 361540 378727 203063 191912 351331 218702 8680 -12297 170132 34743 -247294
17029 -247294 -270068 -403041 -71551 53559 44759 339028 193089 214571 437463 381171
17019 381171 418909 161557 -63323 194748 -61465 -33264 388004 441052 297364 323172
17009 323172 574154 958368 862892 561849 595229 884444 897256 544673 146083 425958
16999 425958 458131 66117 -114234 30388 -57461 -294579 -96800 -200101 169275 24491
16989 24491 117596 250665 100658 -61965 133452 359130 728124 689653 624221 430549
16979 430549 232040 315677 81948 -53950 98904 370801 116101 18638 -108386 -94510
16969 -94510 -208914 -86815 -101576 -89023 116022 145238 424168 564427 535724 349016
16959 349016 127478 468470 368774 350268 388562 611930 613415 219759 126204 359701 343111
16948 343111 413227 297056 451446 394460 351556 230344 418973 609146 838510 1037973
16938 1037973 702434 433900 353630 576260 1124483 1278385 1265121 1146129 1318926 1353936
16928 1353936 1349536 1328942 1117774 872723 277070 245635 596115 848024 939626 698768
16918 698768 720531 784415 867435 921093 667070 216409 199583 353602 370403 778670 1257251
16907 1257251 1166040 632918 569282 560023 439291 452111 456509 351965 17344 67407 216393
16896 216393 333098 650356 716161 811517 513257 427016 65906 -179481 55006 580532
16886 580532 873479 940795 1203500 1254741 1324880 1422142 1400059 1199781 736130 479739
16876 479739 475017 578187 677284 318279 238308 626976 446096 447741 668041 821789 918143
16865 918143 674937 608006 831158 911258 887695 1006694 1058045 1131796 898144 844650 711502
16854 711502 503882 561325 542589 939896 1300161 967644 561570 248139 74113 -47549
16844 -47549 -159949 216478 416012 130393 -85541 -34411 216329 -86405 -149868 -156345
16834 -156345 44874 78033 -105641 -187631 -33383 -108686 76703 105200 -4687 94336
16824 94336 85292 331322 436447 144254 234757 281588 188738 159155 133042 -359759 -263011
16813 -263011 -151599 -137001 -6167 -117802 -273698 -32395 -182960 -119380 -312549 -337674
16803 -337674 -163345 -143328 -304496 -217150 -42814 129891 -38611 -6169 286424 393669
16793 393669 279603 387249 271804 33377 16017 341933 390364 442683 264578 122405
16783 122405 206124 -125683 -161786 -54293 244159 186079 -395557 -182733 47450 -95771
16773 -95771 275050 320862 134169 -222579 -338026 -39465 83925 -46017 -380455 -707277
16763 -707277 -1052180 -993118 -699867 -375446 -287466 -185860 25671 -20845 39531 -29138
16753 -29138 -140441 -77977 63230 135013 5171 224725 249829 346577 223800 -15839
16743 -15839 -61739 -201624 -36057 20786 -181255 -370330 -283063 -62119 40726 -41677
16733 -41677 77718 147168 201055 -52700 -29394 -36165 98230 85749 -13358 -65630 -17335
16722 -17335 16165 89393 152930 132692 -154328 -224994 -338731 -88344 -29950 -91523 248506
16711 248506 544319 541538 633703 509370 173777 -51071 -40632 22324 306 -165738 -155216
16700 -155216 86374 357955 327052 226080 303300 183641 -64676 -70178 17636 336868
16690 336868 495565 355466 413987 491874 580721 398244 399231 660820 406062 192102 232557
16679 232557 144754 135176 257571 302875 -145677 -275873 -210270 -42566 -8551 53889 165776
16668 165776 322358 7071 -125905 -218168 165234 207260 125556 193430 386446 498617
16658 498617 184716 -174945 -426032 -307055 -188774 -409642 -315684 -25055 251700 81103
16648 81103 -239660 -329546 -430559 -450903 -248411 -184857 -333488 -403693 -169620 331177
16638 331177 421889 135323 -343525 -98243 37441 16949 77987 438282 130897 95865
16628 95865 296870 544280 212400 -190619 25642 350200 667345 638066 679967 629904
16618 629904 437750 225460 81193 9338 14874 205296 51079 -427182 -328982 -167542
16608 -167542 -257462 -445395 -464716 -356427 -309033 -351548 -96925 93961 396497 451068
16598 451068 322416 542511 362431 140460 139262 146958 122980 -166266 -450213 -287828
16588 -287828 150752 17147 31119 -324272 -333605 -184261 -224667 -151346 -102782 -243546 -217179
16577 -217179 75771 -16918 -386387 -58659 57747 95118 148432 15985 108993 488729
16567 488729 425459 190870 347841 340596 228477 135416 -49586 -550975 -663409 -352156
16557 -352156 -82541 54498 151513 34294 -374996 -494464 -30735 154741 113643 119917
16547 119917 180116 151237 61491 90595 87150 -107878 -245118 105022 257230 131753 117710
16536 117710 210030 251255 215922 -102507 -340851 -278837 -238646 -18593 -186391 26801
16526 26801 133305 -13125 81328 136387 183329 -67512 -155058 -239212 -324886 -423501 -106867
16515 -106867 -2608 -105490 -372513 -324527 94751 219146 77244 278581 440702 36269
16505 36269 -451052 -565197 -823172 -691484 -435044 -160257 31259 100216 323556 408095
16495 408095 412142 248599 159811 127595 188784 325745 256641 14794 -286790 -94913 4470
16484 4470 431810 478926 371228 23026 170872 292419 -122656 -61414 12345 67371 91572
16473 91572 -3189 92029 127051 15000 -288069 -237808 6900 -508780 -375613 -233193
16463 -233193 -358356 -171170 -78000 -46456 -172426 -187058 -332184 -488731 -426433 -307466
16453 -307466 -73541 267967 175649 -6116 54584 127691 -135864 -6430 111632 -136330
16443 -136330 -268520 -118466 -175689 151662 182457 189169 268517 322203 424548 583922 312443
16432 312443 20554 -75214 -220276 -37397 -214308 -72193 -27519 -141765 -253208 -50392
16422 -50392 210899 46414 128102 349198 -107306 -278497 17464 -92610 -54125 -312620
16412 -312620 -481281 -226286 -224822 -371812 -79479 -102125 -240612 -380700 -623355 -779905
16402 -779905 -646783 -592064 -331018 -150068 -247556 -325479 -133127 170671 360608 170083
16392 170083 349247 280884 402436 200353 147613 -102450 116008 286089 304680 67538
16382 67538 101328 130729 -299534 -330607 -430353 -494481 -280584 -60724 -115381 -147410 -338721
16371 -338721 -157230 236022 492167 537550 350066 294244 284738 134420 164541 257131 317888
16360 317888 186334 205624 81112 117863 150220 399673 161798 -57293 178419 237398
16350 237398 497747 281918 105683 -14881 86078 511430 309732 327436 260685 222258
16340 222258 23386 -418491 -409460 -9686 243755 341830 312514 205645 -67579 81570
16330 81570 397658 457353 313798 294354 179163 156764 77420 -63317 -40614 176015 -242329
16319 -242329 -501468 -446299 -141540 -175985 5779 3897 -68047 70841 300011 273279 88476
16308 88476 90821 -136086 -225363 -347487 -651340 -658541 -497448 -203541 -302079 -591757 -430515
16297 -430515 -442281 -544534 -569664 -513815 -404148 -404146 -445321 -103503 -88572 -20714 -100104 -66443
16285 -66443 -10344 235019 694291 669220 562563 526898 538979 518020 412477 277521 148876
16274 148876 411134 490918 459022 414841 228646 -44884 -434473 -326578 100965 154642
16264 154642 68745 133606 9895 -530391 -514001 -375728 -446708 -157831 -144230 -235754 196404
16253 196404 383051 194167 161775 270084 239049 202119 -21599 -33928 65429 72775 -104171
16242 -104171 244849 296330 -76936 15731 460013 471964 427830 350122 377830 322641 340243
16231 340243 409882 322078 443715 359332 374222 448400 315215 -50947 97658 325270
16221 325270 244583 192604 329818 484361 471083 324412 355324 201207 427758 497125
16211 497125 454348 224742 197191 189678 11122 -895 -124155 -500255 -546902 -99107 36089
16200 36089 -26120 -236207 -347798 -348318 -235120 -175609 -290969 -354074 -376476 -378852 -610652
16189 -610652 -788713 -686200 -405084 -315166 -68412 131640 189260 40515 -74330 89906
16179 89906 688691 621484 348523 282784 222262 -344171 -476246 -420888 -465545 -157782 -97292
16168 -97292 89024 73185 -161845 -322749 -275805 -286595 110661 308677 352670 489227
16158 489227 657483 568317 852308 768279 250528 -159517 -535198 -455386 -458775 -599371
16148 -599371 -622298 -707108 -804916 -596936 -234244 -100082 -284740 -360155 -224862 -197942
16138 -197942 104409 403835 296050 98969 -73280 63780 6598 108039 74213 94989
16128 94989 139865 28436 127612 124952 197567 621714 728538 333764 56743 -2439 -109045
16117 -109045 62379 125133 -67684 -40794 -61864 -137359 -111525 -73310 -341262 -454057 -559655
16106 -559655 -630731 -980276 -1072210 -754463 -350935 -220214 511288 601432 222620 167359
16096 167359 -1855 83782 -6639 -220232 -106139 124486 74275 53572 -56022 -494692
16086 -494692 -227666 34833 -29161 -69933 49555 69212 332539 372236 131283 130698 175742
16075 175742 583239 288263 -220212 -669266 -694314 -487590 -261784 -234970 -244942 -60709
16065 -60709 -32207 146219 16157 -221251 -501706 -211393 -157126 101824 306790 353982
16055 353982 439377 67026 -43934 -40303 -48798 -201134 -315535 -135019 -360875 -614613
16045 -614613 -768869 -512207 -138293 -278701 -308303 -217444 66491 121371 -152928 -157841
16035 -157841 16636 -39984 -10374 135449 157409 90126 111342 101584 183061 3800 252927
16024 252927 474177 374467 152476 120883 314029 274378 296805 265304 172574 51715 137479
16013 137479 -49697 -193208 -360722 -282322 -16000 207435 3198 -170280 -41385 -253858
16003 -253858 -317521 -263173 -109444 30369 -36614 356170 735829 587728 546482 760484
15993 760484 517860 404052 418776 636959 771525 953411 902876 529221 490360 478406
15983 478406 590709 533878 495331 278331 176524 170234 302522 76488 -94882 -264539
15973 -264539 -456823 -532796 -517452 -402964 -203215 41739 338149 506220 464046 295475
15963 295475 -17673 18437 179052 251105 156362 280864 287770 100500 22776 48633 218891
15952 218891 189652 -35581 -58105 -8484 -119710 -160296 -370555 -81087 123748 22009
15942 22009 74095 191682 383836 394696 523269 405297 148964 321860 179864 89147
15932 89147 237821 399048 231844 15555 134318 672584 551964 47942 -106528 -23641
15922 -23641 82954 37725 11174 34245 203350 194533 -4534 -244359 -291955 -289237 -235975
15911 -235975 98228 252322 140350 266378 430600 -86582 -630814 -747324 -470820 -68365
15901 -68365 -142593 -197262 -189350 -154906 -24531 -348641 -497427 -485915 -440360 -207763 72291
15890 72291 -98379 -457247 -331280 147275 240660 -51975 -384637 -321656 -384222 -173655
15880 -173655 -113942 56904 74448 -186373 -385485 -297196 -375301 -655045 -371461 103120
15870 103120 265949 199355 193857 -122168 -473587 -444110 -389314 -504873 -457042 -370883 -253497
15859 -253497 -542825 -578373 -516430 -437460 -289415 -358584 -536486 -468092 -130658 -194125 -521112
15848 -521112 -244599 86014 123698 363847 486619 259887 -26021 -289585 -507125 -308908
15838 -308908 63738 291757 107625 77804 154914 192369 569266 607272 235728 -9904
15828 -9904 231339 554427 727336 967073 1024843 938737 622718 7562 -293153 -468335
15818 -468335 -450016 19609 -52323 176631 157970 54896 190759 130182 -33305 178213
15808 178213 425656 120374 -189323 109782 -9596 -163915 56168 172384 208303 113325
15798 113325 27083 -221121 7061 -179386 129859 210490 -243996 -478832 -206616 -123854
15788 -123854 -117409 -33756 137634 257621 316108 260356 -26171 -336939 -123367 109927
15778 109927 399575 367829 325994 300590 92778 -31474 -358343 -519138 -543600 -549107 -493310
15767 -493310 -193494 -43425 190884 259758 181606 177662 236275 -108059 -289366 -108318
15757 -108318 -213501 -319706 -12093 97582 -126823 -319926 -204311 -314943 -407702 -29731
15747 -29731 -92880 -7144 -1456 3526 -239136 -353473 -236409 57820 287750 18329 57511
15736 57511 219787 299806 269027 217279 188954 -78421 -414641 -590791 -524900 -409412 -329836
15725 -329836 110960 103921 13985 104399 -100976 -48989 -199449 -69208 -124974 117450 248997
15714 248997 43074 -418726 -491684 -280577 170515 130569 -383807 -408917 -446592 -407360
15704 -407360 -27451 80982 -111508 -267 162330 442786 234816 -125621 -320767 -198656
15694 -198656 94012 191740 48933 64087 389184 485096 419979 522589 639332 242311
15684 242311 41528 306908 651991 1029141 1194910 747327 568039 330531 255744 74983
15674 74983 -13132 64789 58347 265627 597811 92296 -444772 -643784 -949629 -729366
15664 -729366 -453395 -148955 421195 375854 468513 384033 353621 310246 121568 16512
15654 16512 -191731 -820919 -893413 -800765 -464116 -152138 11472 -61796 -263426 -280424
15644 -280424 -200901 -161913 -226637 -177283 -228520 -154588 -93666 -337327 -26811 139723 -78958
15633 -78958 -195570 179898 321573 -93738 -108495 291203 420470 558793 575042 259510
15623 259510 398640 592613 368744 163122 -15571 -131965 -301208 -571284 -447009 -350104
15613 -350104 -85430 255789 -51511 -225368 -140632 300370 239662 331201 117222 -138776
15603 -138776 -65098 471584 354479 240905 111716 131115 337750 546166 476667 136870
15593 136870 -321481 -562858 -334195 -101879 143857 156301 -52832 -110781 -185796 -353110
15583 -353110 -466737 -268831 85895 16331 -65322 172696 206305 205598 208344 -31681 57403
15572 57403 53582 223074 95438 142978 272583 199481 -153286 -263887 -135008 -13896
15562 -13896 -30252 -186829 80142 404083 2024 -124913 -93984 66161 -101059 -137726
15552 -137726 -64672 31480 240548 641371 42509 -453138 -330008 275117 527889 -58128
15542 -58128 -343086 -42269 167261 81656 42231 -49330 -292409 -499072 -471375 -330881
15532 -330881 -302591 -526204 -608599 -744782 -968140 -731860 -643259 -765593 -668588 -595294
15522 -595294 -559292 -94819 -116458 -278966 -578562 -464115 -286197 -219039 -32276 -301969
15512 -301969 25881 165491 -359261 -646340 -752949 -696247 -415285 72640 -6805 -203313
15502 -203313 -380083 -284584 -488572 -406497 -494466 -804342 -876845 -669350 -462812 -72770
15492 -72770 119374 10844 73269 174323 -219318 -419533 -319772 163312 205156 10883
15482 10883 -347852 -361513 -215427 -13466 -18139 -246134 -274087 -279563 -131199 -174899 -360879
15471 -360879 -198617 -467878 -665180 -226235 -137817 -299051 -249354 -90810 110384 155183
15461 155183 39916 212366 428937 430107 257894 244617 233017 376076 352689 355126 261873
15450 261873 93890 -52116 -162028 47334 327624 324175 -61439 -253502 162291 290333
15440 290333 408549 560361 111582 75521 52614 -24985 205710 468861 278127 -60701
15430 -60701 -289890 -341712 80142 279843 38665 -146240 -339485 -202567 9056 -157350
15420 -157350 -248706 -233319 -252825 -151246 -110253 -339006 -4762 189920 129561 -14148
15410 -14148 161923 50975 358233 219527 47611 92456 -116489 -89470 138537 256683
15400 256683 216802 -24712 -541905 -560720 -575199 -511186 -511647 -474447 -568509 -380185 -35911
15389 -35911 448587 195250 33049 115185 145593 -53826 65328 217412 147533 -144753
15379 -144753 -36797 416357 387740 205125 -62483 -241370 -318992 -308253 -338232 -362299
15369 -362299 -204942 -82846 16768 58802 243365 164542 160487 267819 87333 -185493
15359 -185493 -321001 -53967 68710 301446 607225 481102 612149 701545 750647 756501
15349 756501 634236 356889 355795 261065 -120898 -313182 -469008 -203206 253736 221459
15339 221459 163216 397378 244768 83484 72998 -20895 -105247 -236514 -212488 -497619
15329 -497619 -532726 -447913 -303403 -328583 -99400 -194666 -272451 -82991 190524 332173
15319 332173 539261 521556 41406 -463996 -599223 -476054 -568511 -366148 -41966 -25763
15309 -25763 45017 -126306 -94358 104062 -65063 24141 320593 458415 350997 384465
15299 384465 236081 -266530 -635795 -492038 -449402 -774169 -709665 -266972 -86246 111396
15289 111396 345020 368795 247040 24188 38984 96826 -8170 85291 197638 306494
15279 306494 148406 65408 104136 169016 150698 -47487 -151090 -23825 -115845 -79222 69076
15268 69076 233507 253493 310204 566780 544736 553246 435895 199730 23454 -56639 -88872
15257 -88872 35923 183511 594299 368756 548796 391862 32668 -3643 199555 -71395
15247 -71395 -117765 35942 144571 -30813 54282 187444 122894 219527 429071 328694
15237 328694 40407 -19974 257291 78282 148406 -2561 252 58179 68935 -184702 -94540
15226 -94540 -162780 -47929 5861 -30893 56115 159157 -41739 -80924 83448 79897 -105133
15215 -105133 -57720 -157667 -282459 -260181 -111186 -25015 -16397 38930 221504 158224 163174
15204 163174 152372 -290251 -346997 -108373 134064 -173695 -249703 -20386 -188373 -611612
15194 -611612 -524574 -430190 -337568 -369432 -178232 -483458 -900081 -844079 -379730 92407
15184 92407 -118432 -261396 -364974 -140847 17091 66871 127158 269084 33955 85479
15174 85479 250524 285510 364520 477588 632858 508002 460997 564530 458030 252111
15164 252111 25685 -198547 -192832 -232381 -517016 -378303 -429161 -573221 -229763 -76717
15154 -76717 -26431 -147475 -431161 -640864 -208758 96819 -15925 -86337 197644 30246
15144 30246 -264165 -151170 -252507 -381919 -403531 45907 169669 19545 -24608 -156236
15134 -156236 -145940 -67381 -3240 -96579 6167 198833 -47380 -262159 -292907 53501
15124 53501 367423 354586 -26861 14410 73338 3368 33577 161996 31251 -46869 -148651
15113 -148651 94585 437131 482963 186765 -198783 -345748 -85621 222047 176889 331343
15103 331343 430632 52115 -328262 -203356 230664 -77684 -397209 -372420 -177145 199244
15093 199244 159325 167139 231104 87320 -116080 -89572 98645 593043 619031 194416 80260
15082 80260 270750 197618 -221621 -553914 -647381 -394020 -400437 -277266 30318 269663
15072 269663 117445 66244 -63628 -403630 -213758 235949 515806 558794 523998 226749
15062 226749 -4232 66820 -19236 -57028 -73265 -212412 -109433 23709 33584 -251641 -605350
15051 -605350 -604338 -596156 -437615 -278296 -15012 89887 138199 -97537 -269333 -170466 71991
15040 71991 423964 355252 366789 235356 426736 822180 653783 290690 45174 -100546
15030 -100546 -119258 -150720 222309 263380 32980 -196770 49869 76242 274960 326259
15020 326259 210846 -61743 -57803 -160253 11092 -119424 -400009 -126933 50512 94720
15010 94720 -89982 123101 428755 795021 428159 274610 340496 206760 219366 256910
15000 256910 219810 149919 101799 -222773 -491675 -593834 -549261 -238246 382860 268318
14990 268318 -110132 42914 172844 204739 283001 76873 -114703 -322597 -261148 2029
14980 2029 233245 142429 -142690 -368675 -315940 -235039 -120764 -118575 -82989 -167078 -451573
14969 -451573 -809704 -782982 -545717 -522585 -455170 -266267 -440575 -249410 -47242 237889
14959 237889 -32499 -132163 -41846 112579 -45926 -205397 -116717 -72008 58591 229878
14949 229878 126191 -107720 -381925 -260028 -29544 -425927 -481885 -98881 -50348 81105
14939 81105 292471 -54026 -358659 -266281 -291390 -801178 -507482 -377546 -216182 -123612
14929 -123612 -14634 172370 430951 242989 -24742 -296107 -132936 152984 180004 -108444
14919 -108444 70681 178330 393112 376301 351475 502380 149670 -174683 -314586 -219420
14909 -219420 -148822 49600 -84741 -140340 94504 224507 281583 255440 337160 602687
14899 602687 461638 322862 629141 744988 517810 417465 266741 -79998 -133573 -404658
14889 -404658 -536148 -188291 117406 82564 -57827 -328875 -301233 -110208 218423 500000
14879 500000 361775 359853 125548 4755 -105238 79707 111118 212899 360315 395552
14869 395552 173747 165301 150705 74861 82235 -137618 -360826 -258369 -86339 -2712 -32324
14858 -32324 -10319 165378 289259 -84539 40690 319637 119618 194130 185777 371103
14848 371103 722835 619874 548291 525787 326484 226566 143831 253762 406888 716309
14838 716309 609072 306902 241132 275886 126718 -66989 -173415 -283318 -357956 -200562
14828 -200562 -190219 -161420 -356762 -247876 -101413 -8404 130419 169620 422189 390611
14818 390611 52751 -170597 336142 495271 475971 415603 326285 76256 -15328 95878
14808 95878 243147 146256 360051 630578 456874 276817 359027 227612 9085 -240898
14798 -240898 -203148 -25840 150879 447675 412241 128949 205297 499536 549013 263014
14788 263014 72542 -45839 59613 -174175 -281025 -255537 -168035 -353011 -521231 -664784
14778 -664784 -93247 236671 -81901 102552 -211209 -191297 -187705 -361617 -308331 -125622
14768 -125622 -61050 -178904 -203471 145642 310456 702390 522963 487474 451090 275370
14758 275370 350543 512428 478188 142034 -231347 -255749 -244882 -471024 -84136 244191
14748 244191 26082 -283148 -293729 -608352 -560789 -308433 -110459 -29244 -59040 162701
14738 162701 81509 -20901 226156 262365 109863 -264235 -564571 -246614 -205931 -384150
14728 -384150 -543545 -611845 -262404 -117028 -294201 -39927 18525 78180 136326 45146
14718 45146 94595 -124076 -247343 -53387 212211 183076 172057 360819 222775 -76042
14708 -76042 -38358 -146371 -331341 -260347 -300566 -381261 -146574 35196 171285 124041 215200
14697 215200 329568 -49440 -157795 55351 471751 736340 644981 389499 372003 333005
14687 333005 -13795 -469729 -613104 -456152 -177954 -9933 72628 225543 -55386 -17691
14677 -17691 38155 240566 61904 -237067 -381459 -430669 -259215 -212381 -317239 -264399
14667 -264399 -142304 -467771 -636609 -448097 -215847 -231482 -278947 -151243 -209022 -309346
14657 -309346 -461199 -395216 -137306 -46919 -339678 -366246 -346034 -458018 -454142 -78585 -17805
14646 -17805 -233806 -261875 -140263 -131462 410 116692 35593 234216 336393 378508 242349
14635 242349 213629 333767 2316 -206599 -174859 45506 349337 235663 -136679 -517502
14625 -517502 -691038 -366343 -31649 -124640 -358438 -574068 -639478 -457242 -293951 -359812
14615 -359812 -481655 -747964 -757021 -685623 -324721 -254954 -129217 282752 410459 265167
14605 265167 -27303 -106789 -130161 74418 92255 28076 -56662 -279178 -100436 351881
14595 351881 461051 580928 536874 465892 74220 -133774 154308 348629 167375 -48381
14585 -48381 302227 149394 257163 260274 302685 192311 430499 604016 502019 605369
14575 605369 388592 494710 514015 546065 419971 280852 137710 -418413 -366889 189193
14565 189193 633803 545050 269981 349214 542829 582851 401345 205174 -131736 5122
14555 5122 -13712 -374464 -563944 -450981 -211683 -135665 -168602 38773 -7220 -249936 -143294
14544 -143294 90356 134965 107143 -33536 116448 61679 185696 89533 -86597 -112972
14534 -112972 -33825 -183456 -174860 -31233 -82325 -13417 290349 88875 -39235 87487
14524 87487 178044 -45327 -115700 46164 226622 428913 814340 602798 586528 191244
14514 191244 -189456 -243417 -312722 -195506 14898 -251774 -489096 -410393 -525139 -342779
14504 -342779 69844 -21157 -406530 -487524 58482 215274 -111517 -375565 -445036 -68565
14494 -68565 282747 63741 -377922 -503562 -381253 -136565 -338237 -472760 -425743 -342097
14484 -342097 -170518 -66626 -57507 92108 394712 329634 322813 265252 117139 154778 193546
14473 193546 256331 138402 14989 -215055 -359860 -219760 -169073 -171691 -312738 -437635
14463 -437635 -476130 -370928 -122527 -151391 -457797 -587944 -295538 36622 204616 105343
14453 105343 -31988 252756 329011 16630 177697 227863 -71943 -25961 157868 56153
14443 56153 141959 228601 331539 259827 122153 11372 18830 -127771 -163266 6480 36374
14432 36374 456828 446704 321196 159626 79044 -263723 -394850 -238416 141492 311923
14422 311923 231156 220697 473505 416633 556797 621982 636486 299277 119786 -213925
14412 -213925 -461314 -390073 -231115 -377941 -432998 -285054 -262384 -34575 246708 169050
14402 169050 -185755 -321090 -360333 -520745 -381440 -174540 -321823 -398573 -406081 -126813
14392 -126813 -143576 -129578 66612 136822 297197 509990 487808 388382 403088 322724 403071
14381 403071 510800 270751 23180 83227 47529 52490 7867 58923 279930 350207 90966
14370 90966 55997 -101926 -85557 -30839 55199 136570 -81662 -196363 -283903 -362345 -102226
14359 -102226 85424 148898 230973 154258 396139 194162 -117502 -258053 -188451 80726
14349 80726 -81096 -191718 -319403 -9378 53898 -95147 -116500 -227562 -253570 -54831
14339 -54831 -4760 -124726 68746 478823 727692 310757 243403 309395 -44005 -239397
14329 -239397 256579 343351 225845 -14718 -107082 238194 185751 176274 -164642 -406674
14319 -406674 -240702 -96510 -18870 -233988 -350008 -71579 43332 -73580 131544 260398
14309 260398 57868 -13507 -38073 -33293 -138490 -14986 387995 254261 321606 -31920
14299 -31920 127497 373150 244606 -231778 -242454 -83759 297466 166629 -280184 -56031
14289 -56031 20252 -8953 19591 75489 191427 15033 -69640 -107730 -214124 -22897 264008
14278 264008 107762 -263144 -171667 116936 116163 165284 35557 62430 289335 393831 211011
14267 211011 53267 154814 193536 129087 95979 246922 274796 156615 34530 -85150
14257 -85150 5037 111100 216584 258058 277316 106853 -28697 155550 24962 -112652
14247 -112652 -412202 -651474 -215325 83284 226644 259862 176517 239535 298335 89019
14237 89019 70265 -144110 2019 -335494 -850433 -580393 -130980 134957 220574 45223
14227 45223 -141082 -457918 -458033 -306936 -112801 144390 -37097 -283011 -290890 -542284 -400920
14216 -400920 -283648 -390826 -168634 -228320 -54760 34353 273796 289483 176829 13856
14206 13856 12006 -37440 102969 545181 667973 831018 771772 581888 432989 418276 308210
14195 308210 222540 169457 253843 160640 238888 383827 255695 112956 321658 520443
14185 520443 172987 -130346 -63318 -46356 55121 32028 43196 35318 25746 -88302 164040
14174 164040 437015 470162 152127 29548 189677 404201 459676 783875 602423 387333
14164 387333 331098 10249 -55895 322958 497028 345634 -234902 -299554 -297057 -200435 -74552
14153 -74552 -20163 99284 -35101 43558 101383 118072 259051 13388 -213701 -450148
14143 -450148 -366882 -138569 31472 142790 163099 23676 -343960 -515039 -642820 -388800
14133 -388800 -86100 -24859 -172256 -113031 -66229 184166 36729 105812 254812 435442
14123 435442 248955 159039 37999 203956 163240 -28802 -234124 -270112 -148111 -123420
14113 -123420 359604 224230 24502 -258013 -527855 -333486 -375711 -476590 -252709 173485
14103 173485 466744 380880 230449 -281030 -88897 303588 343982 64851 41855 103788
14093 103788 212996 386910 135886 75967 269632 364818 311638 220853 291582 322950 226150
14082 226150 396769 724512 874388 645176 587142 502989 398589 384331 279046 -118262
14072 -118262 -236271 -206181 -413688 -715493 -795751 -548060 -384136 -200711 -65540 19305
14062 19305 -235767 -366282 -295683 -282658 -394190 -324264 -339231 -230836 94917 226562
14052 226562 389521 699934 809404 570378 224783 221186 -26242 -264676 24247 -117223
14042 -117223 76331 265284 319945 250039 208600 207513 521699 747662 312642 -158707
14032 -158707 -475918 -378465 -167499 -181609 48195 311265 432955 145697 -54307 50169
14022 50169 431332 144856 -8879 -43404 -307437 -157667 25108 -53031 26395 115403
14012 115403 148891 93493 -86808 -136562 -85992 31530 342809 228300 28262 195009
14002 195009 378051 332281 451059 315113 549512 544371 281302 -105599 -237737 97818
13992 97818 490247 128102 2808 -164197 -511988 -110418 75815 28796 91397 295853
13982 295853 480202 389456 125694 107077 338217 185265 186099 399918 379442 302087 580596
13971 580596 668732 387720 372727 264861 167493 152526 305283 146067 -52840 99569
13961 99569 -65099 49938 -125492 -557917 -696751 -315306 -24069 -56991 130169 64355
13951 64355 47726 164615 291143 -6546 -19931 60966 -120734 -312209 -169052 286545
13941 286545 16762 -17295 69811 546828 689714 556838 405802 518383 634642 441805
13931 441805 -59199 -492944 -564622 -203988 3881 -77767 -176502 224919 -100908 -215022
13921 -215022 -378101 -406404 -55365 196737 54055 -226066 -224315 8660 155297 258005
13911 258005 -62450 -368175 -166386 -153545 -178551 -390702 -165389 -140691 -172466 -312589
13901 -312589 -282173 -256705 -42858 171230 -82494 42836 346073 372542 356897 294233
13891 294233 134719 274071 152072 144458 398706 661470 638155 191837 131237 326554
13881 326554 295813 222737 36451 337340 180885 271838 238924 185475 184894 104334 220792
13870 220792 546080 692349 354333 -17387 -85278 230361 289241 -111633 -185734 -306846
13860 -306846 -416219 -464116 -210461 -360528 -408344 -515708 30540 363959 411088 577961
13850 577961 482157 318166 373629 565522 694244 852242 383074 399462 657482 461368
13840 461368 246856 390600 349013 130171 -135797 -220778 -237116 -463299 -783716 -402147
13830 -402147 -205717 -139733 17848 61211 180604 237410 -110378 -106259 -71029 336218 300820
13819 300820 213983 269478 407818 471454 597350 459588 81409 -178362 -164210 94405
13809 94405 169362 7438 116460 288865 230558 177571 337409 437177 482101 409464 480941
13798 480941 405198 414836 325035 405646 120467 -241456 -397744 225377 546088 577810 188342
13787 188342 -446843 -636363 -285054 -46783 651038 740705 496683 481396 336306 285144
13777 285144 147273 34296 -49694 -50441 -110364 -211643 -51484 61491 -216103 -271575 -59904
13766 -59904 494399 608916 347679 141918 -63476 29827 -258506 -151201 104210 94788
13756 94788 -276011 -495783 -541890 -196284 147170 42344 -133288 -338826 -346248 -300963
13746 -300963 -137495 20415 -115862 -276750 -253862 -193391 51324 95990 195279 263057
13736 263057 370291 320800 696627 858269 423997 165951 231509 -12256 -189438 -222304
13726 -222304 -13435 43742 190541 -104330 -115095 -160414 -123960 -457947 -572132 -187542
13716 -187542 -47478 -373392 -480028 -528829 -740722 -543766 -323440 68361 97965 303370
13706 303370 390727 333077 198710 196089 322375 471337 -69977 -163141 112145 425949
13696 425949 542257 137180 -377857 -137464 246305 118017 42254 279863 83902 178994
13686 178994 306573 200787 406750 316815 -6802 8920 200812 191225 148409 300540
13676 300540 279490 529794 581452 228245 -58644 -10400 388240 422177 469098 421238 253222
13665 253222 507511 122104 -212264 -259419 -204736 7388 17243 -87554 246348 172981
13655 172981 79306 -26263 369130 397960 379110 540440 527373 259610 379379 556419
13645 556419 549193 683862 613925 604792 676488 354141 59033 -88773 105591 298721 350597
13634 350597 373752 424120 46186 1535 61139 309596 286951 267013 324224 110449 181826
13623 181826 20193 -199101 -209807 -280323 -290084 -128678 22081 28149 -171961 -110004 162987
13612 162987 61739 -4429 114088 61574 20085 230919 364412 360133 391627 369515 234448
13601 234448 92288 -63433 39820 137521 250523 240439 308065 349329 174002 36776
13591 36776 80823 -166407 -165483 93358 206900 462775 755825 818745 839545 886926 328515
13580 328515 172039 334630 583663 619092 419218 377329 593721 438841 321764 545363
13570 545363 833625 566401 102094 -141955 -16151 20979 -34775 260826 104154 -42540
13560 -42540 205260 -33790 177577 61787 -67882 -136096 197586 347235 224206 354777
13550 354777 488526 254099 505421 709484 676202 515929 539243 960690 1004438 954787
13540 954787 676177 464315 801469 668156 428913 144057 229175 432854 495561 532191
13530 532191 509721 357544 235897 148845 55494 74398 359121 544324 142330 -126464
13520 -126464 283970 289074 324233 527973 553226 375535 390770 588783 768145 850052 635469
13509 635469 407745 325614 -78003 -220311 -41643 -7340 197341 206430 127532 209629 247410
13498 247410 62868 64118 318097 717632 809899 283021 -14508 -66671 -303736 -7097
13488 -7097 -146982 -215019 -267054 -37670 -248235 -299791 -432781 -251129 8982 6314 197545
13477 197545 202653 106925 -80959 -69164 -262606 -181013 128212 273016 165259 17924
13467 17924 -200328 -138257 -354438 -231364 298049 272493 -53105 190752 263201 510835
13457 510835 685390 994820 810143 548040 529417 609716 489437 302071 277952 29648
13447 29648 -6398 86949 262314 275034 506244 512828 634589 533214 395181 472180 420344
13436 420344 -83602 -87760 181114 384592 233525 181501 184460 323182 359273 265959 269983
13425 269983 350227 379080 213351 154970 104792 235334 323369 366503 513070 540385 316257
13414 316257 243985 242269 414030 299148 199657 365615 530927 444475 431584 271820 482887
13403 482887 619306 492690 381187 19132 121597 412711 667445 640208 764036 966305
13393 966305 1153236 1187458 1313985 1280236 1243791 1513130 1654648 1670103 1650802 1569990 2020877
13382 2020877 2127050 2065177 1801329 1357727 1063511 941767 862015 867585 547343 120285
13372 120285 238713 683306 934103 670240 595170 488334 381092 537485 752451 589799
13362 589799 307446 371803 510401 423039 522317 537648 417472 585727 1073251 1446941
13352 1446941 1625719 1702647 1955813 2359907 2710403 3630643 4448386 4809705 5121405 5154771
13342 5154771 5330983 5597631 5747538 5735144 5271589 4708225 3961715 3343698 2527098 2119563
13332 2119563 1971175 1706481 1509236 1212642 934994 843874 1341281 1313453 1168740 1003681
13322 1003681 1212344 1268160 1119983 945466 1303302 1680185 1540515 1108492 1058575 1175782
13312 1175782 1271548 1304962 1445912 1522661 1562563 1624872 1994903 2318970 3064476 3701986
13302 3701986 4192282 4721054 5066983 5648812 5516515 5250894 4930778 4778916 5014045
13293 5014045 5327432 4557794 3980474 3223921 2201342 1517478 1654069 1776396 1483692
13284 1483692 1640110 1667656 1437916 1378215 1443870 1624293 1362969 1041575 810330 1047671
13274 1047671 1296611 1264155 1162617 1074516 1257506 1071583 1113690 1499733 1200563 1076665
13264 1076665 1256116 1157568 1231332 1504866 1610794 1504372 1607690 1655898 1923770 2221594
13254 2221594 2463490 2148821 2483619 2565997 2426778 2378774 2189816 1848276 1311657 975728
13244 975728 1160902 1420740 1569947 1441181 1022639 653206 751549 1212333 1449399 1248560
13234 1248560 1091081 936410 778142 1102418 984599 847206 663472 446376 443804 568973
13224 568973 873060 1042376 1141306 1304473 1005032 911888 1098971 1166222 1069747 1038666
13214 1038666 785120 886621 566441 451596 637953 760759 580777 367763 339398 404096
13204 404096 593023 967433 1157681 1305399 1271739 999635 631322 317676 693781 993570
13194 993570 705385 414464 168784 205299 439886 631149 563579 793912 891683 1000822
13184 1000822 1057102 1249540 1393776 1165204 578464 717034 980173 914402 952329 1172026
13174 1172026 1064126 1006918 899319 527302 162188 315762 594753 451549 635041 777461
13164 777461 739613 764606 890136 857255 742465 766151 705353 599171 791828 895142
13154 895142 916991 1175835 1218894 924984 566157 429751 746322 1103183 1213480 1272376
13144 1272376 1039493 829504 832386 736643 631069 591358 839625 1230030 1517734 1402064
13134 1402064 1269424 1468312 1597730 1500201 1202580 988273 985152 853679 983450 1015168
13124 1015168 1105954 1057133 1104411 1027613 883588 1117765 1267464 1041059 876425 871728
13114 871728 848447 628311 546730 379085 408239 414890 726311 931817 998704 1030013 812736
13103 812736 653126 698881 456838 123086 -42860 206705 702237 942327 1271697 1366118
13093 1366118 1209719 1094043 887560 792818 799604 848116 940999 916815 924164 1238578 1488953
13082 1488953 1417747 1228144 802585 399546 233403 705893 682523 762422 813031 760325
13072 760325 970010 881800 653456 755370 943053 1264277 1538425 1423422 1239266 1143621
13062 1143621 1134343 1361457 1278819 1020366 934266 884795 1124548 1343110 1260061 1231104 1097333
13051 1097333 872546 946318 969708 940551 929647 912807 1139944 1122690 1054409 890292 983207
13040 983207 877993 591224 979042 1118133 1314032 1557516 1223161 1080754 1206363 1280222
13030 1280222 1283829 1759993 1995088 1653815 1466794 1296818 1367921 1630132 1419814 1482465
13020 1482465 1562386 1376991 1343121 1235023 1438897 1696713 1882271 1409758 1400032 1642322
13010 1642322 1726042 1657816 1559495 1682167 1972172 2380179 2204015 1491854 1442820 1730647
13000 1730647 1879262 1698254 1971867 2242869 2176736 1940948 1725639 1645955 1448343 1640872
12990 1640872 1978394 1883541 1863019 2055878 1885113 2165259 2565780 2332942 2094847 2237458
12980 2237458 2058282 2034161 2258319 2030462 2075494 2035731 2168675 2314684 2040897 1895747
12970 1895747 2044739 2197426 2242221 2311722 2041197 2187787 2654455 2667142 2662434 2510669
12960 2510669 2614787 2292826 2465307 2704086 2439175 2250531 2606433 2793654 2858727 2937062
12950 2937062 2768962 2687632 2778668 2704890 3001300 3084761 3285342 3258891 3265822 3388395 3349959
12939 3349959 3346522 3131837 3097811 3296641 3269436 3454108 3475622 3408983 3318222 3535107 3497537
12928 3497537 3568276 3817356 3422865 3240484 3455289 3750079 3993749 3971127 4032151 3973716
12918 3973716 4103812 4013098 4040195 4004758 4259898 4683915 4886313 4851323 4570101 4270257
12908 4270257 4258442 4598347 4792347 4803348 4552066 4644243 4829915 5020501 4874356 4715838
12898 4715838 4979902 5371704 5509798 5743426 5933295 6183223 5972389 5963696 5985237 5676361
12888 5676361 5326356 5186062 5247775 5515797 5614526 5689321 5855633 6235502 6458018 6628757
12878 6628757 6515606 6194241 6358589 6339061 6430621 6428170 6666203 6350838 6301621 6395147
12868 6395147 6500385 6636078 6759925 7270217 7621762 7583241 7246460 7227473 7610620 7718850
12858 7718850 7496145 7828854 8163195 8328506 8150915 8263904 8425168 8407053 8351389 8337360
12848 8337360 8856153 9103456 9341729 9509570 9550714 9566243 9365241 9608354 9817277 9786228
12838 9786228 9672946 9457298 9494326 10060407 10612147 10746301 10927845 11099720 10951750 10861828
12828 10861828 10892445 10985010 11501684 11711430 11866503 11978646 11854750 12359444 12781467 12769905
12818 12769905 12757047 12599706 12799383 13244106 13270008 13100796 13429816 14090099 14222483 14229427
12808 14229427 14433743 14728936 15039279 15135624 15169425 15610215 15566073 15800478 16029516 16428294
12798 16428294 17291650 17689326 17629489 17958748 18009789 18171657 18768852 18958977 19473661 19791967
12788 19791967 20090649 20171546 20527548 20651652 20604816 21212702 22129753 22682797 22938008 23068359
12778 23068359 23577116 24326093 24952388 25232371 25314083 25389185 25816112 26049648 26620214 26922214
12768 26922214 27381722 27848470 28506235 28950846 29226289 29565284 30017873 30693932 31108320
12759 31108320 31726709 32025010 31796442 32066058 32667604 33203710 33845066 34124284 33995203
12750 33995203 34337425 34605911 34632373 34742288 35087877 35730047 36205676 36341581 36561419
12741 36561419 37276209 37178841 36982396 36903499 36925409 37236148 37653061 37938526 38120483 38186620
12731 38186620 38063322 38248191 37930428 37827304 38220515 38762269 38737909 38465590 38453740 38704345
12721 38704345 38855278 38932426 38874162 38974567 39009106 39004208 38662010 38716436 38976972 39045096
12711 39045096 39086688 39218775 39021233 38798868 38711344 38217132 38240994 38206300 38236374 38245873
12701 38245873 38294072 37921757 37790475 38108907 38503270 38328099 38230442 38188680 37802152 37773715
12691 37773715 38078860 38375378 38350568 38121042 38047911 37931528 38150522 38182383 38181532 37952061
12681 37952061 37918978 37998101 38480055 38534954 38312807 38292636 38349168 38417053 38395391 38678015
12671 38678015 38448394 38312039 38314741 37932503 37806330 37349067 37131401 37527046 38169731 38162703
12661 38162703 37902988 38432440 38869477 38766961 38422710 38172061 38094950 38543243 38667094
12652 38667094 38360592 38097432 37822191 37682481 37796703 38259228 38226768 37966569 37999885 37898780
12642 37898780 38061107 37893046 37862996 38015546 37751394 37645894 37436078 37393023 37190465 36799550
12632 36799550 36667677 36915587 36624824 36375119 36038761 35963085 35750660 35515828 35099401
12623 35099401 35147784 35366821 35354463 35114546 35355369 35310148 35086338 34683702 34480489 34499556
12613 34499556 33937747 33904288 33588764 33125179 33267467 33360775 33134351 33143166 33139564 33214430
12603 33214430 33277431 32836691 32535000 31870228 31251236 31154926 31062655 30493059 30202614 30033481
12593 30033481 29974223 29799811 29655825 29319153 28991366 28781029 28704097 28626386 28254471 28156077
12583 28156077 27972164 27730956 27378420 26790279 26191143 25707732 25373915 24802893 24278420
12574 24278420 23953075 23457599 23141441 23073510 22970273 22716164 22507515 22211101 21843100
12565 21843100 21562430 21476635 21063420 20738833 20519302 20007310 19655579 19533498 19354456
12556 19354456 19185705 18748269 18434607 18392283 18207790 17785625 17331560 17124068 16995141
12547 16995141 16706194 16830063 16587407 16055125 16219426 16204331 16019417 16047812 15870265 15258696
12537 15258696 15032576 15148083 14964599 14835801 14530638 14162881 13773401 13433412 13390424
12528 13390424 13242298 13062762 13105184 12808787 12418168 12174286 12351259 12342476 12361307 12478638
12518 12478638 12344336 12305930 12102985 11486370 10773126 11051540 11404268 11491065 11035847 10826069
12508 10826069 10682892 10933578 10861559 10875836 10592557 10326101 10413648 10326954 9944323 9988811
12498 9988811 10019266 9970199 9859810 9550514 9538285 9620524 9706520 9530741 9385564 9228979
12488 9228979 9385292 9751752 9509036 9242458 8900091 8783632 8590923 8404443 8666227
12479 8666227 8634671 8422010 8617279 8800532 8754104 8733883 8750662 8437591 8293098 8554027
12469 8554027 8545612 8522816 8446630 8396950 8777020 9071844 8533493 7753024 7274469 7286962
12459 7286962 7283382 7034299 7025345 7111722 6970666 7117309 7127929 6849759 6803168 6648803 6763533
12448 6763533 7059365 6961287 7010118 6966734 6850014 6650361 6685062 6649194 6664192 6601089 6449188
12437 6449188 6201870 6254389 6386466 6009678 6017028 5638595 5174917 5455172 6036602 6337512
12427 6337512 6080110 6046329 6065890 6003546 5925349 5640266 5617886 5818656 5639662 5483871
12417 5483871 5556694 5539003 5757437 5830156 6036832 6339853 6000555 5630300 5895884 6135845
12407 6135845 5689284 5108781 4999552 5145077 5177404 5187233 5539646 5574492 5274201 5212179
12397 5212179 5171564 5237704 5039128 4583764 4559590 4461460 4259719 4466476 4748663 4734647
12387 4734647 4634938 4712751 4807152 4856716 5018699 5299225 5131560 5070258 4873196 4726257
12377 4726257 4503690 4426045 4351312 4418970 4536883 4443679 4655867 4796488 4854501 4913462
12367 4913462 4831995 4871998 5018050 5331579 5350290 5218756 5361194 5194934 4952451 5085649
12357 5085649 5194374 5332232 5520382 5792489 5993498 5861918 5242491 4897257 5409689
12348 5409689 5689259 5497601 5321698 5278980 5323729 5232505 5467693 5661741 5606677 5683692
12338 5683692 5665443 5450547 5779795 6175258 6433890 6578962 6297315 6170014 6332777 6245718
12328 6245718 6169485 6135767 6346502 6343565 6656058 6819382 6806083 6949867 7018598 6561333
12318 6561333 6137796 6050710 6405604 6793803 6824061 6887598 6835533 7094730 7161943 7329011
12308 7329011 7181647 6977496 6826875 6721421 6337714 6375614 6837546 7338860 7306593 7293332
12298 7293332 7515349 7414266 7312218 7602593 7942326 8180805 8251745 8458570 8489112 8327189
12288 8327189 8359988 8255616 8146816 8066192 8125488 8244213 8386441 8275950 8458591 8414266
12278 8414266 8507911 8532581 8794349 8934521 9071470 9422074 9506321 9882173 10239489 10499208
12268 10499208 10370030 10230489 10380113 10412419 10454234 10402870 10428333 10733513 11224962 11419023
12258 11419023 11189256 11375141 11741873 12176827 12319261 12182431 12416931 12966185 13332666
12249 13332666 13339401 13303345 13658790 14343171 14643248 14844037 15258899 15656521 15930460 16636784
12239 16636784 17565042 18245549 18828303 19295931 19904171 20516250 21455106 22735103 23924511
12230 23924511 25215430 26888715 28652476 30261711 32202534 34321325 36787430 39945174
12222 39945174 43421105 47424919 51845064 56838811 62274950 67902824 73268211 78554388
12214 78554388 83421815 87810990 91610014 94443034 96076765 96704630 95892228 94211540
12206 94211540 91995127 88553598 84962031 81348292 77730416 74397521 71687313 69615287
12198 69615287 67631945 66336101 65154357 64702887 64989943 65105760 65538446 66561294 68545558
12189 68545558 70693499 72780660 75436225 78830153 83355851 88494128 93883199 99994097
12181 99994097 106902701 114934351 123673658 132427721 141302312 150323740 159325791 167704813
12173 167704813 174638500 179663156 182633084 183317468 181852283 178722782 173687658 167183035
12165 167183035 159384739 150942350 142567613 134395280 126146349 118955761 112435343 106613734
12157 106613734 101845740 97821333 94527927 91658617 89280566 87545144 85862317 84745923
12149 84745923 83980515 83485664 83574937 84056020 84694506 85805317 87172502 88872158 90919594
12140 90919594 93258533 95873814 98363700 101232733 104300007 106775166 109187860 111302430
12132 111302430 112611054 113524300 113594681 113045603 111324195 109148121 106605690 103409502
12124 103409502 99570013 95580567 91557736 87417121 83432285 79780996 76464700 73379883
12116 73379883 70666064 68380714 66286562 64046749 61993267 60251537 58827132 57857422
12108 57857422 56532903 55258756 54071357 53429495 52659776 51751486 50997347 50144736 49036273
12099 49036273 48611713 48343606 48122012 47899113 47552010 47305710 46913004 46204651 45697790
12090 45697790 45496894 45210518 45001876 44784140 44778526 44431234 44246131 44197361 44113605 44032384
12080 44032384 43737070 43813269 43940388 43890477 44182447 43940541 43623791 43858409 43877304 43711664
12070 43711664 43820630 43485488 43145391 43151046 43290981 43232056 43329936 43485043 43561785 43589048
12060 43589048 43882153 44032899 44081507 44164289 44010140 43817278 43644651 43612081 43737135 44059339
12050 44059339 44033347 44233796 44397086 44444127 44244548 43745494 43609279 43758364 43927481 43627975
12040 43627975 43465330 43600482 43837891 43976190 43899141 44174246 44128280 43900950 43968727 44444005
12030 44444005 44794436 44689133 44683722 44221471 44215891 44525600 44536728 44378766 44076922 44162389
12020 44162389 44334408 44491819 44520134 44229748 44229986 44491601 44821769 45059853 45198234 45334540
12010 45334540 45394750 45267473 45347222 45492411 45676257 45884975 46177699 46493046 46719364 46949349
12000 46949349 46869082 47121790 47606641 48193464 48329996 48350809 48292140 48467179 48551431 48673407
11990 48673407 48962431 49457506 50165529 50873857 51075780 51009304 51119242 51291185 51661125
11981 51661125 52221945 52517887 53152922 53499959 53936806 54749290 55430832 56285558 57147027
11972 57147027 57994603 58563851 59132057 59892384 61117388 62109508 63066006 64346389 65426349
11963 65426349 66556165 67786900 69563136 71192525 72663582 74392379 76356356 78106169
11955 78106169 80012874 82255638 84573949 87263609 90411228 93389809 96635314 100362086
11947 100362086 104490293 109081597 113744099 118914794 124319809 130184136 136446513 143191799
11939 143191799 150587329 158590060 167489904 177660933 188403851 200155041 212858271
11932 212858271 226207160 240388852 256020931 272516889 290036755 308482336 327070344
11925 327070344 345296323 363194350 380698578 396966926 411234295 423432242 433527743
11918 433527743 440512320 444111199 444290750 440794510 434388227 425510996 413734072 400178388
11910 400178388 385207691 368759422 351262605 334302709 317804363 301556368 285746603
11903 285746603 270995519 256828017 243603838 231040286 219571561 208774272 198375072
11896 198375072 188542124 179943004 172452118 164795200 157862750 150976613 144716596 139282916
11888 139282916 133921438 128852758 123794084 119218045 115446574 112000122 108030516 104415428
11880 104415428 101141924 98004459 94800280 91944906 89492291 86961750 84531437 82374123
11872 82374123 80336416 78491760 76125383 74086899 72396590 70568613 68464159 66422626
11864 66422626 64782255 63557051 62249206 60680204 59512693 58374923 57051614 56120464
11856 56120464 55193298 54083243 53129590 52432595 51488109 50474258 49484605 48362385 47319493
11847 47319493 46384947 45591358 45124894 44731753 43690318 42850327 42376795 41950016 41523362
11838 41523362 40982240 40503825 39599144 38749485 38330056 37978686 37721360 37128906 36148611
11829 36148611 35725368 35720181 35274767 34926872 35055957 34466914 33769118 33181337 32809006 32751056
11819 32751056 32308351 31770783 31019848 30673092 30881745 30927553 30838101 30224479 30044979 29965886
11809 29965886 29480469 28916564 28893766 28599675 28448001 28316563 28048228 27852766 27601405
11800 27601405 27807705 28071085 27846074 27209932 26983985 27036882 26961480 26560648 26260312 26191951
11790 26191951 26230581 26199402 26130241 25896244 25568117 25336996 25294918 25032950 25256423 25325215
11780 25325215 25068546 25070944 25028589 24762368 24683729 24847189 25543561 25626553 25367538 25245773
11770 25245773 25464447 25260148 25136688 25044997 25082397 24977581 24604915 25211391 25546510 25384609
11760 25384609 24981505 24913853 24710155 24518740 24442833 24468040 24799561 25111862 25153532 24861570
11750 24861570 24634595 25034373 25390614 25523811 25641905 25696781 25403014 25279938 25658623
11741 25658623 25598810 25573371 26036684 26047944 25751226 25683157 26172888 26292901 26493323 26875156
11731 26875156 26822859 27140075 27377448 27483259 27463422 27216908 26932876 27364697 27646008 27304736
11721 27304736 27181500 27238931 27665326 27985670 27986080 27984703 28022238 28083955 28160308 27956793 27837256
11710 27837256 28181379 28699830 29048743 28935046 28687305 28282425 28410934 28928519 29061586
11701 29061586 29434944 29697824 29418816 29426701 29473128 29530786 29723727 29985685 29988189 30170120
11691 30170120 30157855 30349139 30836598 31001920 31151576 31225660 31217074 31311437 31091242 30961154
11681 30961154 30908290 31085719 31385914 31703228 31789628 31369157 31135274 31606475 31759819 31306530
11671 31306530 31264698 31345517 31786610 32364673 32461487 32541371 32739021 32611569 32191958 32118921
11661 32118921 32234149 32458399 32717771 32854595 32698378 32869707 33147304 33104084 33010262 32824607
11651 32824607 32944402 32949928 32813121 33021053 32904809 32862200 33257737 33512533 33676082 33770517
11641 33770517 33666233 33603806 33527558 33435240 33629963 33932727 33838636 33767276 33361311 33637235
11631 33637235 33638792 33578261 33673386 33460101 33637811 33964881 33931368 33890582 34059532 33873880
11621 33873880 33946820 34165310 34277763 34386625 34084830 34050181 34244502 34068584 33834819 33775552
11611 33775552 33593876 33489216 33169526 33135173 33342960 33448535 33643956 33554533 33545209 33470909
11601 33470909 33348154 33426649 33500989 33519351 33730845 33671157 33431747 33262836 33399190 33384713
11591 33384713 32963763 32891864 33049477 33008244 32976514 32789982 32741086 32541684 32322389 32357885
11581 32357885 32796848 32930515 33201863 32766089 32133293 32135129 32022119 31757477 31739231 31944035
11571 31944035 31967973 32037825 32195144 31904520 31886689 31864090 31809818 31509789 30970304 30699445
11561 30699445 30611885 30532259 30481794 30406784 30585610 30524566 30394134 30262876 29821438 29858850
11551 29858850 29955923 30066297 29844255 29849062 29961250 29736784 29728242 29367790 29105004 29130450
11541 29130450 28844678 28706368 28576086 28175863 27919772 27876975 27714961 27200979 26669940
11532 26669940 26402768 26727956 26705992 26556820 26780708 26786871 26255066 25553074 25096381 25133293
11522 25133293 25260966 25351663 25405354 25021694 24840711 24789792 24805492 24694009 24551481 24277943
11512 24277943 23817443 23571574 23852519 23734451 23578846 23374766 23297046 23158279 23478974
11503 23478974 23342457 23058959 22658497 22072340 21791787 21558953 21238249 21189903 21352775
11494 21352775 21675788 21737975 21554551 21049373 20658367 20340446 20560333 20678771 20136445
11485 20136445 19630542 19848515 19895558 19858495 19906249 19758942 20071310 19864486 19249879 18851941
11475 18851941 18655073 18440619 18826680 18930548 18771272 18566147 18488182 18403208 18605522 18678596
11465 18678596 18786085 18909253 18716955 18461164 18181323 18132187 17824155 17612894 17797142
11456 17797142 17814382 17451107 17076663 16900171 16537304 16268623 16087632 15611160 15344144
11447 15344144 15057344 14820593 14835869 14881872 14778630 14494878 14352398 14037135 13579785 13514690
11437 13514690 13199954 12984252 12813673 12772675 12877291 12896718 12722659 12683858 12639374 12470645
11427 12470645 12095244 11727193 11681170 11703296 11283311 11427791 11541455 11129395 10680347 10435031
11417 10435031 10458715 10547641 10517379 10468929 10423489 10183089 10174724 10162229 9924402 9472602 9107785
11406 9107785 8999050 9143368 8999332 8643393 8759834 8908588 8930913 8920283 8649313 8458853
11396 8458853 8481260 8652625 8562276 8493612 8190914 8206232 8212401 8025192 8222008 8374302
11386 8374302 8133874 8122244 8091709 7665379 7549993 7569198 7503157 7481919 7109011 7102226 7079292
11375 7079292 7178567 6755119 6737475 6616572 6611009 6449939 6433707 6616055 6687892 6594843 6802671
11364 6802671 6869297 6797509 6368494 6608391 7024172 6851582 6589816 6363671 6483899 6682299
11354 6682299 6376275 6108191 6011986 5899300 5770731 5716781 5764912 5887955 5747784 5896850
11344 5896850 5816994 5363040 5391475 5058253 4645553 4889860 5153324 5283550 5528813 5430184
11334 5430184 5323906 5408994 5584574 5324893 4938916 4491795 4422782 4465730 4462339 4402411
11324 4402411 4079881 3900566 4079734 4321891 4178759 4282210 4458187 4467938 4273201 4100010
11314 4100010 4117040 3841246 4156225 4522630 4685160 4131280 4119876 4213558 4452544 4798044
11304 4798044 4762526 4260850 3805935 3503475 3463746 3682651 3619217 3602841 3427817 3136969
11294 3136969 3288154 3626950 3580881 3600250 3589069 3534141 3407149 3213215 3120967 3317416
11284 3317416 3614177 3605378 3767394 3726292 3457643 3050025 3315600 3478022 3429412 3334789
11274 3334789 3279920 3583356 3854534 3663343 3433984 3604458 3891097 3701865 3369044 3172469
11264 3172469 3352467 3615279 3339428 3288894 3263147 2815836 2850349 3218119 3121670 3145817
11254 3145817 3396402 3388049 3472872 3512802 3692501 3610025 3620845 3303436 3075657 3025087 3195532
11243 3195532 3090762 2805681 2911908 3194391 3177198 2794886 2622085 2484336 2578083 2610654
11233 2610654 2767567 2602879 2663803 2837023 2898356 2925498 3295330 3069153 2735599 2922142
11223 2922142 2969785 2722788 2643612 2781088 2695192 2643891 2697542 3014191 2948958 2902731 2824078
11212 2824078 2656474 2474364 2861578 3163712 2645504 2493550 2842635 3309996 3177301
11203 3177301 2642046 2618224 2511619 2739578 2842606 2668061 2749939 2739425 2376977 2430663
11193 2430663 2320751 2395835 2274283 2344538 2678758 2809700 3174207 3186776 3156941 3102003
11183 3102003 2765680 2296922 2360647 2673509 2849065 3277451 3505216 3578328 3041074 2602565
11173 2602565 2675155 2725182 2585215 2457998 2542413 2924071 2939591 2905295 3019527 3071273
11163 3071273 2596966 2844764 3096968 3080407 2918268 3106926 3162631 3347991 3597965 3618479
11153 3618479 3497871 3618297 3843740 3677051 3660269 3468795 3405649 3638731 4005416 3962337
11143 3962337 3970343 4365891 4963064 5050778 4946563 4638168 4689830 4609561 4468574 4475400 4478610
11132 4478610 4725474 4946079 4872856 4985356 4961265 4750372 4534950 4399152 4314774 4383980
11122 4383980 4387292 4153716 4141656 4124387 4438917 4999465 4908705 4848117 4908553 4921741 4944784
11111 4944784 4894496 4980200 5028236 4982384 4743882 4914363 4880788 4922170 4970827 4902488 5016702
11100 5016702 4948538 5030873 5533392 5726952 5515825 5571552 5576448 5726162 5834058 6018064
11090 6018064 6042944 6259077 6583146 6594359 6814164 7273314 7291888 6800621 6941446 7243363
11080 7243363 7355908 7355800 7478319 7682050 7907861 8295286 8711698 9043510 9472939 9535779
11070 9535779 9733785 10257366 10505174 10772175 11036772 11423268 11627108 12214362 12745610
11061 12745610 13365511 13542465 13684829 14215048 15020401 15655897 16274987 17146083 18025132
11052 18025132 18865886 19291832 20413769 21736469 22567717 23437463 24882960 26103367 27515627
11043 27515627 28867259 30700438 32588872 34920699 37648068 40571757 43642745 47127650
11035 47127650 50674416 54803536 59365603 64330674 70417545 77178355 84897039 93580049
11027 93580049 103894406 115957412 129617014 145820896 164592734 186800993 212596595
11020 212596595 242645055 277311953 316109618 358578152 402472048 444638325 482150811
11013 482150811 512970411 535625131 549760520 554258727 548233522 531214751 503791598
11006 503791598 467457271 425882046 383491620 342052121 304217902 271250477 242723275
10999 242723275 218220560 197210924 179060977 163478281 149787302 137753607 127640640
10992 127640640 118765783 110829591 103651647 97225507 91252424 85996977 81289379 76745090
10984 76745090 72417972 68491570 64946482 62184444 59453506 56680432 54403628 52347187
10976 52347187 50168115 47984468 46003136 44037586 42465370 40782381 38884737 37203096
10968 37203096 36259625 35191745 33812891 32679960 31407340 29860188 28532186 27840118
10960 27840118 26946718 26169016 25392265 24732071 23848403 22825005 22000445 21448442 20984357
10951 20984357 20266683 19911423 19387634 19047541 18818788 18200992 17337161 16750121 16378182
10942 16378182 16164320 16201504 15784723 15193000 14489144 13808464 13452079 13297656 13328849 12880421
10932 12880421 12281428 11606914 11443416 11218036 11113699 10634201 10383535 10309437 10167634
10923 10167634 9742473 9788157 9088734 8832491 8817791 8776688 8609846 8370710 8064567 8075221
10913 8075221 7764277 7351514 7194183 6656668 6345643 5927423 6055619 6174434 6162996 6237232
10903 6237232 6106726 6281570 6536328 6511793 6455589 6111776 6198220 6199533 6265546 6088041
10893 6088041 5700066 5613968 5388280 5328751 5091698 4966750 4255489 3907319 4152311 4465811
10883 4465811 4502149 4175731 3962258 4090163 4084401 3638493 3854732 3862542 3681939 3609505
10873 3609505 3379332 2917690 2748207 3047802 3004552 2736980 2345016 2274142 2366461 2660668
10863 2660668 2467786 2295892 2420201 2885056 2894080 2751121 2747200 2768685 2963021 3165744
10853 3165744 3230758 3268236 3277072 3151845 2975921 2812229 2348999 2290690 2285886 2183997 2485339
10842 2485339 2563797 2643853 2713280 2607928 2584758 2620945 2682903 2563030 2652466 2606688 2399960
10831 2399960 2106264 2185616 2435780 2544058 2329136 2101001 2107157 2223979 2163695 1949945
10821 1949945 1862212 2205805 2222262 1979815 1814880 1786666 1784284 1877598 1556741 1512978 1854809
10810 1854809 1714514 1688429 1777332 1832186 1998508 2076734 2278276 1993508 1910924 1924572
10800 1924572 1982284 1895401 1631135 1719472 1957885 1941616 1979518 2111939 2332328 2215788
10790 2215788 1868571 1860681 1766761 1937364 1802046 1589272 1289521 1353480 1585407 1805426
10780 1805426 1864930 1783869 1533836 1638948 1659679 1812885 1826775 1635959 1682833 1887647
10770 1887647 1713926 1751749 1763049 1785080 1861988 1729770 1844990 2091551 2345222 2224490
10760 2224490 1760652 1740403 2278350 2308133 2178783 1875656 2020135 2481422 2399799 2311515
10750 2311515 1999999 1847739 1873963 1618092 1662333 1980164 2148310 2353635 2538508 2126165
10740 2126165 2180538 1996701 2033262 2352380 2511247 2502954 2681354 2298160 2484208 2387603
10730 2387603 2484790 2451009 2318084 2456730 2661275 2494482 2581047 2840985 3114464 3010433
10720 3010433 2877525 2884579 2949650 3178730 2821383 2563582 2539031 2933868 3046537 3315200
10710 3315200 3474220 3491171 3467486 3253955 3043934 3140928 3204936 3023533 3134877 3253593
10700 3253593 3373855 3185690 2676381 2564649 2774924 2750946 2860524 2781001 3019918 3168010
10690 3168010 3162958 3031852 2907269 2976364 3016292 2921587 2615226 2607014 2585194 2844034 3071274
10679 3071274 3421482 3752151 3567261 3362640 3479720 3123957 2972409 2985697 3192441 3259268
10669 3259268 3232177 3123667 3087245 3120823 3163803 3459430 3842581 3926259 3668797 3222120
10659 3222120 3274128 3596943 3734029 3766042 3749389 3919452 4215974 4539146 4626923 4972878
10649 4972878 5100666 5174362 5241817 5679588 5856151 5993678 6131754 6246736 6397299 6555763
10639 6555763 6748309 7196023 7785001 8020258 7880602 7825272 8270184 8525235 9302422 10270823
10629 10270823 11525855 12751413 14216180 15374075 16798429 18403494 19882502 21318920
10621 21318920 22985254 25193914 27825253 31087626 35084201 40571093 48095190 57578914
10613 57578914 69494622 83862727 99351022 114359258 127332545 138911584 150225116
10606 150225116 161196122 171723942 181930045 191108595 201269483 215335195 234657695
10599 234657695 257400734 278599339 295945151 310501696 324635323 338593588 351162316
10592 351162316 359585560 362393420 363536681 369254791 383748510 403713481 422125946
10585 422125946 435359850 445707361 454586825 461511172 463437975 456450666 438634782
10578 438634782 413091543 390640297 377463980 371466159 367971289 363807977 360060184
10571 360060184 356538965 351599654 343457288 328865783 306571813 279698261 255139848
10564 255139848 236930344 224478833 215107546 207055516 199407437 192243420 184655943 174734032
10556 174734032 161575138 145355740 127784494 110985115 96439268 84804968 76305502
10549 76305502 69278510 63708007 59431603 56098527 53189534 50197226 47944993 45639455
10541 45639455 43446868 41809007 39852056 38129403 36444101 34738018 33659624 32741601
10533 32741601 31921356 30810991 29687522 28790778 27866855 26619414 25676366 25565685 25057657
10524 25057657 24069169 23249146 22883532 22382332 21527642 20750941 20068898 19368389 19190766
10515 19190766 18536143 18059332 17835245 17688061 17387031 16587926 15950132 15572250 15253932
10506 15253932 15149921 14613111 14127765 13832087 13683919 13226193 12635195 12714079 12828181
10497 12828181 12645517 12104341 11696273 11318788 11276655 11504999 11683427 11323338 11136904
10488 11136904 11028887 10854642 10782546 10701924 10533110 10066844 9922118 9851493 10052194 9885697
10478 9885697 9554586 9167188 8493101 8320434 8684693 8462515 8079471 8232341 8639055
10469 8639055 8523874 8277746 7720352 7877118 7853942 7955382 8250573 8214740 7839080 7545577
10459 7545577 7447518 7027711 6724400 7204355 7296621 7194100 7149983 7407930 7447218 7486346
10449 7486346 7654785 7749778 7452872 6944912 6469766 6621005 6749593 6732904 6883291 6901446
10439 6901446 7441156 7677108 7278370 6703141 6615741 6872897 6884661 6587469 6629342 6896875
10429 6896875 6947227 7077487 7153276 7378673 7347490 7233513 7397222 7985850 7728236 7788025
10419 7788025 8089580 8248249 8017004 8006440 8223056 8530454 8719103 8507775 8037986 7886157
10409 7886157 7927169 7936962 8181907 8381298 8406003 8331495 8294569 8753342 9269923 9384460
10399 9384460 9508934 9666688 9448535 9415994 9501183 9546186 9781739 9957124 10239634 10499081
10389 10499081 10471834 10428818 10504704 10491798 10845291 11171699 11241076 10886107 10940492 11026618
10379 11026618 11392491 11486919 11573639 11721384 11960028 12288288 11885962 12002615 12224314 12216304
10369 12216304 12344875 12652755 12713794 12838590 12882786 13241641 13437295 13756609 13595215 13334744
10359 13334744 13693764 13852161 14046447 14249107 14292480 14172499 13961696 14243160 14371881
10350 14371881 14389818 14452801 14739462 15011228 15050684 15119867 15063860 15206147 15588115 15777265
10340 15777265 15965643 15955671 15930788 16231525 16550308 16804660 17161828 17202945 17303203 17266609
10330 17266609 17146580 17250091 17666681 17969400 18431112 18517918 18579127 18825025 18643568 18592442
10320 18592442 18582107 18893149 19118824 19059092 18756288 19089228 19184678 19545345 19912516 19767136
10310 19767136 19384372 18995585 19309425 19699853 19657967 19621045 19976680 20210712 20230932 20265344
10300 20265344 20479982 21011372 20969691 21053554 21143815 21288791 21408659 21626745 21518904 21920363
10290 21920363 22139880 22132011 22049106 22045872 22432453 22882791 22948994 22957747 23032493 23268712 23360706
10279 23360706 23267605 23264468 23319104 22906623 22980969 23497907 23416207 23465272 23887735 23909196 23373067
10268 23373067 23513889 23787220 24082025 24183820 24196013 24165673 24028659 24070347 24195578 24427872
10258 24427872 24347603 24523205 24485969 24402967 24488823 24910444 24967866 24814277 25061758 25236133
10248 25236133 24989266 24960279 24831312 24648299 24840916 24605724 24527732 24663269 24770288 24896220
10238 24896220 24973577 25195785 25252580 25400910 25240831 24979134 25060620 25305470 25446772 25132679
10228 25132679 25040859 24717882 24958188 25241548 25233953 25445939 25537267 25390976 25223091 25166553
10218 25166553 25086785 24951567 24687032 24782824 24974897 25130947 24967013 24988409 25177034 25383744
10208 25383744 25222869 25156168 24911456 25091304 25410749 25627575 25558075 25239810 25057334 24852997
10198 24852997 24905370 24971736 25033142 25120813 24842377 24786172 24991173 25133867 25216469 25224753 25397902
10187 25397902 25465029 25260860 25070671 25416202 25804316 25685628 25645674 25778035 26156443 26466419
10177 26466419 26339598 26509389 26659033 26839612 26629051 26479394 26779766 27228057 27065685
10168 27065685 27374003 27299199 27380512 27690893 27852068 27707429 27835813 28047469 28263437 28545664
10158 28545664 28599807 28897714 29153350 29205872 29775580 29782895 29709088 29651239 29482407 29717674
10148 29717674 29996566 29947900 30161679 30341959 30377172 30394064 30601904 30899043 31182660 31123918
10138 31123918 30790817 30719813 30638333 30378528 30643950 30925575 30633329 30327701 30369797 30398724
10128 30398724 30312234 30228249 30132031 30070248 29915893 29765973 29558790 29608790 29582174 29572298 29339456
10117 29339456 29569590 29291256 29230476 29273142 29010579 29089215 29257199 29380597 28884872 28698885
10107 28698885 28891155 28884673 28787313 28941943 29127858 29058294 28887803 28659453 28420464 28242349
10097 28242349 28284933 28367424 28179647 28026775 27927102 27813161 27523108 27274453 27232106 27275217
10087 27275217 27358148 27243918 26791717 26659007 26583177 26178513 26035642 25846443 25698655 25752294
10077 25752294 25758324 25416924 25176860 25023723 25005559 24701243 24429253 24113866 23653678 23531271
10067 23531271 23363165 23168646 22982034 22844448 22977908 23022789 22660012 22119609 21642508
10058 21642508 21521076 21485445 21438585 21359145 20900893 20609906 20403796 20112888 20301831 20111713
10048 20111713 19618114 19322268 19198334 19212554 19159342 18807075 18433236 18318115 18075311 17824461
10038 17824461 17558588 17351777 17136018 16672356 16304818 16265214 16371889 16181824 15920572
10029 15920572 15738192 15723024 15287383 14925053 14740525 14727808 14538299 14100810 13964653 14089551
10019 14089551 14140522 13885855 13479073 13048778 12576739 12058131 12214159 12441442 12555846
10010 12555846 12735247 12436546 12041771 11797951 11473285 11521047 11355032 11393538 11165843 11078402
10000 11078402 10835150 10508805 10619982 10568665 10348765 10101154 9785955 9718359 9414674 9371703
9990 9371703 9871554 9908083 9612774 9596009 9200143 9038768 8802951 8542011 8367656 8507540
9980 8507540 8646180 8183032 8000656 8089697 8015877 8186916 7777282 7706700 7793966 8060612
9970 8060612 8132206 7991921 7948261 7752048 7671658 7637860 7417480 6958082 6513964 6013038
9960 6013038 6079590 6648206 6525942 6459636 6270697 5882579 5894724 5800365 5817434 5907169 5856984
9949 5856984 5934659 6003670 6049593 5925440 5562694 5567966 5593155 5361856 5088756 4938769 4968060
9938 4968060 4719573 4555082 4319486 4250267 4199099 4166520 4294490 4372123 4418475 4423505 4464423
9927 4464423 4590311 4711460 4686500 4614955 4480037 4370724 4350440 4315095 3887769 3708339
9917 3708339 3562303 3543924 3733475 3855100 3437107 3064273 3273276 3206876 2755250 2464169
9907 2464169 2745889 2952278 3127177 2991072 3092621 3192966 3023076 3068169 2864467 2651447
9897 2651447 2600395 2779791 2510681 2521463 2438146 2466077 2457337 2454228 2453935 2490929 2601851 2668824
9885 2668824 2567741 2652504 2965116 2930759 2852110 2726169 2343073 2503448 2336624 2448163
9875 2448163 2417078 2372921 2355309 2122890 1949301 1834187 1867724 1949141 2081220 1679461
9865 1679461 1306074 1771612 1964491 1939045 1750362 1696742 1680788 1722814 1806665 1804297 2210960
9854 2210960 2338536 2052867 2151664 2287662 1849973 1779089 1739401 1680237 1694716 1722284 1560221
9843 1560221 1454919 1576331 1397553 1199181 1044244 1068511 1282761 994722 677022 622355
9833 622355 947693 1173900 1186184 1348888 1526384 1444477 1389532 1526578 1469805 1575165
9823 1575165 1646341 1255435 884261 951847 1206803 1257107 1033595 1177840 1342489 1289509
9813 1289509 1409352 1664150 1278791 1209684 1368614 1607485 1271349 944169 1057656 991131
9803 991131 947262 1033846 1007846 828736 848151 1037427 950808 866756 1000909 848491 960787
9792 960787 841730 335230 123933 381838 566371 413766 494190 285219 631473 684716
9782 684716 624885 474439 609708 671005 861728 910889 1074380 1250416 1132848 979029
9772 979029 879199 1114242 1094362 1184542 1283415 1099701 1110985 1154122 1007275 1075304 1093725
9761 1093725 1271759 1417130 1160993 645976 577137 739853 641890 549725 436826 167784
9751 167784 72173 404722 687938 986118 948407 838157 676019 599730 585967 438032
9741 438032 392869 556686 666732 461463 246510 479869 681064 632921 442023 442642 590013
9730 590013 751827 670978 414315 153934 51227 396709 512639 174135 -5120 193674
9720 193674 261444 235954 293758 170123 121774 277357 526672 840798 787459 1001631 1212624
9709 1212624 1113049 911379 920120 704650 525656 711576 925380 615289 532747 797108
9699 797108 856675 689399 615877 650438 586154 665340 792187 925159 946516 898405 742513
9688 742513 448018 354362 293327 363420 759799 870254 1002153 880088 631160 487742
9678 487742 300996 423623 811865 679693 494813 766258 713776 572519 390298 418312
9668 418312 798348 685165 624203 473673 633922 552145 816603 644935 195723 298293
9658 298293 308332 379815 294147 344677 825289 847120 664103 396618 297971 -100261 -180018
9647 -180018 140048 110778 226561 207339 142399 266211 323103 675595 935313 480024
9637 480024 553892 739287 545586 222287 151452 180900 188212 35503 -179852 60856 -114938
9626 -114938 -21024 179827 320702 339848 524666 438313 62288 187151 361536 208083
9616 208083 36053 216646 377146 474355 558520 552788 205303 -163076 -116629 -24967 -64998
9605 -64998 -302004 -299993 -78048 503156 533569 550502 542272 616785 288951 150543 52719
9594 52719 -10862 92655 20858 196252 285949 36842 236078 243535 219102 169980 63907
9583 63907 -14473 157280 -105334 -123641 131154 39311 -372223 -210730 -34183 74732
9573 74732 180662 -50612 -181366 86695 367044 111705 -56543 -26459 95564 149003
9563 149003 -236860 -357442 -155028 27216 24135 -243718 -540461 -710371 -583315 -437322
9553 -437322 -292418 -360332 -494740 -7145 419264 178182 -166863 -43811 352281 369736
9543 369736 408943 591933 744321 589616 308795 248274 532229 872932 643064 131453
9533 131453 213550 118309 -119336 267082 432864 -5751 -366526 -470367 -669697 -689753
9523 -689753 -429478 -189018 -365990 -364742 -229553 -113694 -250974 -191457 132964 193657
9513 193657 252258 329433 40396 -290994 -469259 -642184 -835263 -503911 -361122 -386102
9503 -386102 -198531 -435105 -226044 204480 365443 278234 65260 117731 -104912 -99547
9493 -99547 -72407 69833 215314 -130438 -40960 58676 -55303 -122898 -14587 -24563 58029
9482 58029 275594 253565 57615 18621 204001 155986 -147899 -135180 -208596 -165843 -131577
9471 -131577 -52815 -47131 -269104 -81765 4862 97492 323204 203424 -271228 29980 226921
9460 226921 5010 -340906 -158352 -272820 -301752 -92661 10283 -166990 -423869 -354356
9450 -354356 -141103 -33554 -19883 -235751 -250275 -287756 -301298 -388158 -166822 42380 136679
9439 136679 -91109 -65668 -119450 -69441 128930 159108 463047 630539 432343 -5911
9429 -5911 -251690 -319738 -340251 -43388 262857 143814 -8024 -167647 -332422 -636291
9419 -636291 -754752 -377952 -377981 -439920 -871701 -914022 -740821 -331904 -60698 -52201 -243989
9408 -243989 -183526 -160877 -37569 -3183 90228 77686 97010 55603 -411649 -739410 -912978
9397 -912978 -988890 -964158 -610632 -402804 -116248 -141936 -292216 -72546 517858 402701
9387 402701 42110 -382904 -297706 -178659 -349060 -154009 52837 211140 89212 283939
9377 283939 203650 -89424 -275221 -183167 -316546 -221671 -214793 -438149 -448288 -407986 -302014
9366 -302014 -220761 -315594 -165986 58319 145465 91777 65961 98795 323984 574646 756186
9355 756186 961725 623685 297315 22389 334961 401932 -661 -51402 93698 313429
9345 313429 217411 502287 564642 556079 469073 516372 350680 234285 -122702 59501 266952
9334 266952 181490 66501 -196001 -334393 33320 121732 166354 315883 185567 93926
9324 93926 228598 -76615 -215432 -80075 -46454 29997 87138 287537 122983 31983 111000
9313 111000 -202020 -127045 -43834 -335935 -553158 -622336 -529253 -494597 -280403 -31504 -8768
9302 -8768 -93796 -201606 -75494 9815 -208551 -276588 58167 207786 256693 -110122 -304318
9291 -304318 -26941 -99495 -63369 -59800 -175277 -419615 -356614 83822 20107 -387339 -384812
9280 -384812 -272204 -367991 -337175 -148318 14686 359053 493231 291080 67986 -72496
9270 -72496 15858 168377 62774 196310 116788 -120511 -259976 -66862 282628 71571
9260 71571 -366095 -729832 -426059 -117618 216334 305969 198441 129958 385098 515033
9250 515033 397303 222676 162314 131645 230673 298710 211951 182975 122829 329394 212724
9239 212724 244380 96695 52551 -8667 -270534 -406965 -357887 -15509 -173371 -253610 -336331
9228 -336331 -11282 192352 257749 284177 98255 124469 96539 -98026 -121038 -252328 34978
9217 34978 -21739 -61541 -315592 -521699 -351854 62453 118039 -269821 -195769 -32794 -155335
9206 -155335 -323088 -298327 -146754 41191 49156 -51625 -72527 189811 153403 169628 419068
9195 419068 227106 -7338 96655 33618 -27783 -91971 -75075 -116191 -106261 186067 487607
9184 487607 529006 314674 291921 289276 6012 -336240 -189739 -190536 -69973 266265 274978
9173 274978 51668 -263446 -467001 -492875 -550552 -345430 -98379 -64988 302191 703016
9163 703016 534195 218890 146658 22880 -213259 -507054 -275881 -133388 -111114 -53315
9153 -53315 -50647 -30509 169046 286998 -24689 -304649 -188385 -202466 -303661 -55126 -1836
9142 -1836 -201796 -515054 -360866 -200031 -306787 -379401 -694809 -616820 -304371 -146636
9132 -146636 265222 253580 -141729 -601274 -525541 -515658 -895964 -521549 -255831 -179940 -157646
9121 -157646 -304864 -682680 -611362 -590759 -674500 -600062 -426413 -708641 -988580 -745193
9111 -745193 -480287 -288937 -352895 -637939 -618017 -81652 73092 -132119 -144614 -94787
9101 -94787 -234618 -385420 -322600 -238152 -200089 -121342 61187 -71207 73403 97588 294287
9090 294287 419742 164507 -37768 34995 -247381 -472187 -363891 -397995 -397096 -574438 -778790
9079 -778790 -617481 -564383 -504896 -10423 411637 211655 -64256 -47352 245756 297488
9069 297488 -40796 -167607 -209624 -228286 43656 -460825 -638145 -335341 -515288 -679825
9059 -679825 -556762 -217598 -97590 122367 398611 206258 -318628 -158962 357007 486417
9049 486417 -20053 -285553 -197175 -77097 -54905 112349 337153 539959 478181 263069
9039 263069 657 185553 131434 -239777 -58405 214231 382598 329782 -119795 -64691
9029 -64691 -23238 -232142 -234330 86126 197393 356075 193680 266577 122371 -110676 4075
9018 4075 -164205 -302054 76324 135469 268722 399793 613625 460875 308187 -43950
9008 -43950 161092 12488 -315422 -371559 -342546 -245010 19502 432019 535197 154387
8998 154387 160654 285596 243921 150720 204502 129280 212460 127831 -405601 -441629 -434177 41159
8986 41159 222256 -6815 -542680 -413984 -220528 -337569 -286420 -78221 135454 -89278
8976 -89278 -348746 -278648 -170655 168834 -180123 -428731 -547319 -614531 -365821 -99231
8966 -99231 -111535 -378121 -493656 -336269 -305237 -310321 -298057 -230273 -29357 -12922 -76752
8955 -76752 -280132 -493995 -405890 121990 479974 501246 315989 -104790 -218581 -205964
8945 -205964 -115208 206060 150251 85966 95463 -172018 -430552 -349018 -8229 293545 424106
8934 424106 328419 86505 -277075 -242235 -341367 -477913 -700243 -617847 -148801 410119
8924 410119 508007 -12559 -363269 -350090 -297110 -198318 -268176 -95272 87846 130968 114292
8913 114292 115459 181311 447067 645520 488002 62605 127689 106335 72458 279529 282578
8902 282578 12427 -127863 -144806 19255 40301 -120044 -179490 -328364 -186314 174386
8892 174386 280136 453002 301617 232108 168132 166286 198998 199453 -138249 -429696 -480235
8881 -480235 -544906 -409650 -45419 -36005 -235126 -364704 -77949 2622 -27686 -453467 -614739
8870 -614739 -415132 -266354 -200928 -2236 -204358 -287161 -337140 20593 115184 2630
8860 2630 191646 451338 249374 114162 -37790 177037 339144 135926 120893 299108
8850 299108 123936 17018 -298010 -421530 -562887 -957935 -912207 -716626 -384304 211069
8840 211069 496356 343036 154537 -52179 30833 119983 165459 221764 247913 156641 -146615
8829 -146615 -377279 -271643 -129017 263727 76208 111016 145238 -82210 -540805 -517758
8819 -517758 -572115 -758464 -719180 -703171 -567187 -162516 -68580 -160902 -360249 -375865 263310
8808 263310 155637 -141463 -298858 -423568 -434151 -328852 -407671 -630063 -295706 -172877
8798 -172877 -254914 -211199 -206799 46518 -126391 -231935 -193948 -238469 -531486 -804270 -953449
8787 -953449 -744282 -66975 385463 215893 143125 -39591 -42649 163197 589967 873436
8777 873436 654099 325875 186465 157923 57705 -444630 -308989 -217551 -154135 -125818
8767 -125818 234733 521433 822237 455188 415227 79416 -2136 324321 298703 186850
8757 186850 309739 146187 68031 277560 48481 -181180 -127183 210551 632706 839732
8747 839732 582682 445841 401516 391818 386473 107756 -41341 105789 173748 345704 610844
8736 610844 377393 315106 212831 237989 193554 77818 228910 311067 215325 289931 223201
8725 223201 -320926 -376599 -365506 -289894 260745 615843 550644 140861 -54330 331074
8715 331074 393734 105717 314582 531283 537092 673138 644793 563367 853380 795220 1017029
8704 1017029 1472492 1884715 2483562 3063329 4062453 4590625 4995730 5298602 5774205 5768132
8694 5768132 5687979 5530487 4974848 4387033 3538351 2699657 2138013 1555496 1300372 1517020
8684 1517020 1317112 757596 594212 946878 936055 1052923 1004905 534829 86199 215287
8674 215287 265879 137225 472174 632442 557604 816144 879006 1123335 1030414 877597
8664 877597 875903 1081123 1742874 2300561 2685233 3094565 3747719 4649459 6115091 7838884
8654 7838884 9029047 9658382 10366665 10665737 10900253 11248146 11092833 10393379 8605520
8645 8605520 6730827 5096309 3700141 2979873 2554421 2106063 1907517 2049732 1859824
8636 1859824 1583399 1461268 1462036 1448197 1575152 1784354 1581066 1058511 1143399 1158155 1254820
8625 1254820 1083854 1411793 1660177 1846722 1626373 1432203 1272093 1450922 1739724 1605100
8615 1605100 1610723 1960536 2290569 2558339 3207546 3806629 4411663 4819373 4830713 4882259
8605 4882259 4971319 5116411 5141612 4908569 4108928 3331846 3030272 2733282 2536514 2116231
8595 2116231 1569229 1171430 1064091 1139589 1165712 1144542 936265 667702 538110 820837
8585 820837 825952 761790 730777 699266 580249 462221 247789 419560 493565 650374 1232662
8574 1232662 1461967 1324248 1184840 1281416 1241108 1238488 975940 759958 833890 774206 488158
8563 488158 729721 962913 770466 517148 634480 850279 482972 607598 571230 469840
8553 469840 434449 423157 265755 -97424 -133511 -17572 -2147 70693 -167085 -57715 317428
8542 317428 397434 283552 217388 465721 185875 -35412 -487365 -695049 -687100 -422803
8532 -422803 -386623 -228363 -234234 121658 454317 332028 228314 251987 630775 618214 670076
8521 670076 862746 127320 47242 -78219 -98590 168464 6139 171822 454339 418490
8511 418490 487589 694235 499227 4590 -81505 409073 531759 645250 663546 349940
8501 349940 48520 247812 197867 -322375 -425667 -447612 -423376 -273437 99862 223626
8491 223626 41921 106004 -228623 -500835 -425349 -564939 -615756 -361500 -482671 -711940
8481 -711940 -725383 -516295 -575028 -965064 -1032390 -910168 -609463 -232442 -340173 -571430
8471 -571430 -441123 -489110 -64224 256747 34393 73358 50268 117395 -107560 -272079
8461 -272079 -554798 -430748 -121090 140178 113414 178595 361509 228521 -68435 3475
8451 3475 134441 28048 -97804 -157184 -247717 -52543 102125 284357 -126127 -434319
8441 -434319 -340411 -65576 68201 157911 83602 151431 70301 -117591 148436 368903 155635
8430 155635 -141088 -168235 -252662 100628 232450 300669 346175 24692 -57061 -106073 -65612
8419 -65612 132214 257515 214768 406854 335728 118152 235421 4593 -223289 -196229
8409 -196229 -150387 -97891 57521 340261 187637 -78227 -4727 -122421 -69590 -85815 19621
8398 19621 -60998 -73727 180352 -28515 -12741 -115705 -209087 -118585 39215 125826 21380
8387 21380 -123856 -235853 109420 325415 -554 -33039 169270 105031 -119054 170956
8377 170956 221462 403986 522578 443752 205488 88148 71990 -106907 -115157 190555 609107
8366 609107 396104 408543 349797 32739 -311508 -410289 -291274 -290177 -487791 -744870 -584491
8355 -584491 -370767 -305025 -218715 -103154 -147789 -298452 274364 342957 382177 527153 351399
8344 351399 -75250 -501527 -772156 -451804 17338 176124 163894 450925 746874 616130
8334 616130 282224 261258 556686 514454 823313 1021502 758899 575061 488588 104914
8324 104914 -210548 -211926 -173652 -75929 78004 -106583 -18327 -85227 -309624 -202349 157524
8313 157524 26036 -328914 -301516 -162078 127902 49469 -15557 363837 442271 132625
8303 132625 239286 439014 357568 207933 5259 -122481 26360 327174 562011 636984
8293 636984 964116 1168361 871527 894873 1124240 1709694 1577399 1669532 1777527 1520642
8283 1520642 719222 202942 87172 105439 228090 232494 16337 52813 132465 -174445
8273 -174445 -251242 100417 30679 182928 463664 201806 -134572 -138608 -133018 195421 472770
8262 472770 352656 154851 83165 261693 165194 312803 120064 -32680 -97392 6256
8252 6256 60498 -30819 -134466 -43507 539561 896650 875423 822683 1030747 1003053 639218
8241 639218 483942 411173 426177 328204 115780 261216 321926 190451 267621 416721 505515
8230 505515 430239 265612 16258 -34867 -69442 -75977 -206127 -373760 -445931 -297035 -74826
8219 -74826 129193 -51690 -443468 -452134 -95891 -561881 -674507 -489126 -449822 -175426
8209 -175426 -116582 216312 310478 293403 228525 298977 185411 189969 -1722 58452 260366
8198 260366 23221 -51453 177647 140280 -14813 10573 115591 59137 -108970 -218378
8188 -218378 -437170 26713 209060 230450 1191 -58634 -263803 -583118 -540788 -683895
8178 -683895 -505225 154444 220782 236375 157394 -38534 -220144 -482752 -584947 -64242
8168 -64242 240663 -242994 -602970 -724849 -451528 -269690 12217 -6350 83548 -72684
8158 -72684 -124662 -212216 258878 337885 206043 -387651 -891689 -1094319 -884709 -793131 -384432
8147 -384432 64596 -75159 20933 125675 323187 277213 56411 268209 415779 335147
8137 335147 361705 537823 351716 102016 112433 451612 312874 247207 7601 82894
8127 82894 123961 -161313 -94778 -134432 -100003 -217400 -391291 -324349 -42066 160418 -39209
8116 -39209 -47669 91209 110697 173570 333074 290600 93589 -96314 -214448 -3121 99103
8105 99103 92406 -39512 -52267 -109332 -253600 -221625 226715 336871 215197 176778 283047
8094 283047 260676 114905 260072 130191 283166 267826 37108 -89149 -102648 -247678
8084 -247678 -396605 -198425 26028 25609 -20736 -32490 143767 170066 255790 557868 644930
8073 644930 528076 301451 352190 414401 560405 459921 500726 653898 531968 140645
8063 140645 -143162 167582 397085 411775 -11489 -238982 -271739 -179341 -297902 -330797
8053 -330797 -179219 -208001 -219467 -198899 -214120 -430145 -237251 -362998 -385144 -312076 -698476
8042 -698476 -561304 -218625 -137031 -170684 -146442 -141026 370690 416258 153791 -66011 -321805
8031 -321805 -658211 -711497 -510687 -480364 -418806 -578183 -376018 -287127 -396684 -422112 -330844
8020 -330844 -302502 -375344 -593454 -477901 -502934 -221683 -40008 89910 71619 83274 228091
8009 228091 197792 46714 -34731 45872 -362695 -667975 -231271 67649 -143646 -194711
7999 -194711 -68161 36677 35615 -232846 -375256 -53983 371884 289350 217269 350323
7989 350323 394782 392275 -13615 -150969 -242062 -529172 -421166 -229104 -272539 123160 -28903
7978 -28903 -444088 -740592 -427005 -294544 -396136 -348455 84052 -36565 -31741 -193138
7968 -193138 239160 728314 712289 284017 197885 -31510 -354403 -260044 -155900 -163742 -138443
7957 -138443 78360 333531 377009 364109 111169 -192456 -255692 -488347 -615735 -256657
7947 -256657 -251929 -402592 -329205 36911 289318 230231 522857 560193 277888 171094 420963
7936 420963 336050 199168 180586 79832 -69969 -5757 18093 -88098 -106182 56389 88060
7925 88060 123125 35004 -100508 -176890 -167187 19987 36806 -209033 -155439 -60848 -42940
7914 -42940 270180 90928 -387122 -141479 -233081 -369012 -50933 133327 271367 119661
7904 119661 -93827 -149165 26811 316351 559393 454437 132651 123190 217670 -2592
7894 -2592 -147020 -37135 -167327 -298300 -146039 84354 192890 35885 -137065 -204904
7884 -204904 -290665 -229064 -264127 -215612 -146177 -124260 139735 -88749 -284515 -327815 -397697
7873 -397697 -247640 -338925 -534807 -264529 -104689 -157684 113716 332028 488440 666866
7863 666866 502388 192630 321183 610154 527156 259643 76892 383596 452298 129990
7853 129990 -205475 -250218 -124515 -244384 -292070 -92749 -322746 -244367 91446 250728
7843 250728 134584 81111 59929 54870 -124504 -237128 56102 214223 3099 207222
7833 207222 68788 -12134 109778 151752 93108 -20852 303188 -61021 -37912 194345
7823 194345 334745 227013 101823 -57561 -345844 -508209 -392734 -272446 -348222 -360005
7813 -360005 -239668 -242781 -424631 -618935 -423513 -113080 -126193 -109316 249592 537735
7803 537735 419202 319536 354662 247276 251336 242242 -108656 -327748 -379360 -188862 30835
7792 30835 -179615 -276695 -18839 44755 76244 -270492 -224779 -179401 -269599 64828 -80250
7781 -80250 -50275 1099 -436568 -637952 -320746 -23 82602 11144 -246226 -522676 -254536
7770 -254536 -135445 -70295 -55062 65221 -64402 -267754 -400391 -700668 -351683 -104838
7760 -104838 168054 160612 -47334 49555 98449 -35788 -236268 -336739 -265712 121689 47793
7749 47793 24100 36790 -93778 -506192 -339574 -268616 -395312 -248263 233061 270587 42275
7738 42275 296369 470899 613268 313697 58595 -259723 -227449 -345601 -672636 -558984
7728 -558984 -465999 -359977 -414420 -170627 181499 372695 351226 375655 380023 193190 132205
7717 132205 -149059 -268712 -220410 -82348 -27262 67336 -103087 -403666 -450656 67093
7707 67093 -172 31888 -42181 -381987 -265094 -251630 -370635 -93261 -214876 -304182 -296224
7696 -296224 -303215 -394411 -347189 -216625 -232446 -259828 -48278 -413376 -541430 -318070 -158928
7685 -158928 -138392 -292030 -180966 31803 22992 -221926 -475675 -320547 87933 228035
7675 228035 141877 76450 68709 34088 -264475 -242910 -239929 -174763 -71191 139085 -74231
7664 -74231 -226882 -87107 192041 -68293 -268676 -244434 -479863 -570741 -640842 -601166 -591113
7653 -591113 -453197 -90970 308846 517448 235970 -102214 -368890 -354110 -192533 -78272
7643 -78272 180843 675686 699128 720653 686339 509360 415969 333120 360767 197745 151480
7632 151480 -255577 -254517 -266480 -392270 -620460 -435421 -171743 -55288 124110 96076
7622 96076 123755 -162298 -153222 -63225 -27751 109892 103017 306995 344024 182135 -105176
7611 -105176 -188368 -375429 -310857 -74750 -260604 -490588 -597720 -422481 -490774 -521487
7601 -521487 -342999 -116923 -313623 -315429 -240214 -349820 -645354 -554465 -253848 -340511 -529898
7590 -529898 -703471 -438787 -145272 -137119 -202530 -402366 -437971 -502029 -341952 112082 166472
7579 166472 -69210 207962 447278 331147 116487 -107652 -51353 -245624 -216686 -269473
7569 -269473 -281378 -105844 -22012 -230706 -183158 53434 -35424 -250127 -68353 43206
7559 43206 97555 -11580 35641 -78334 -4700 -75886 56956 167355 -237624 -475137 -252044
7548 -252044 208464 367172 207592 282135 17263 -90892 67290 -75917 -182990 -116817
7538 -116817 -158329 -166144 -102077 -44829 -160789 61254 191497 171509 328883 388440 183031
7527 183031 137953 131346 461786 472638 405681 382426 482073 361049 474646 130364 -185195
7516 -185195 -287905 -620726 -812030 -954782 -942125 -778502 -989217 -794655 -315733 -147554
7506 -147554 -88218 -302814 -236061 -299624 -274783 -123520 -154405 -223258 -68978 58981 76914
7495 76914 50780 457809 306285 -25841 -239930 222193 261276 76827 180674 241732
7485 241732 230218 -26838 156488 187733 322326 131441 -328636 -400523 -171654 -415236
7475 -415236 -864152 -968939 -570112 -317055 -195513 -264699 -143941 -143500 -137810 -74607 -116292
7464 -116292 -98340 -247541 -178004 -111464 -189459 -337282 -187815 -105061 129452 -50434 -14742
7453 -14742 182329 -113689 -550518 -324488 98746 -34401 -185149 -201055 -304130 -349404
7443 -349404 -291017 -368615 -161344 -253780 -226917 195382 19861 -56921 37315 30995 -347747
7432 -347747 -571225 -384475 -380410 -239575 -34304 28917 -139993 -115142 -301999 -408486
7422 -408486 -36278 144031 -75400 15087 -118596 -296088 175173 64267 177114 165154
7412 165154 74812 24223 184729 662715 343341 78956 386603 240729 -125872 -275871
7402 -275871 -291391 -6624 228293 137432 -221853 -129432 235458 373903 355629 66285
7392 66285 -371858 -489032 -305019 -184294 -95703 -93944 -105723 -199595 -16455 -258371 -229967
7381 -229967 3746 -88570 29689 187305 8004 151047 201857 52346 -394559 -526458
7371 -526458 -443507 -248287 -198493 -226921 -71620 229863 401996 270871 -42963 -214059
7361 -214059 -225606 -103647 -22494 76252 -189897 -126161 -65346 -375322 -220177 -314529 -298833
7350 -298833 -377285 -461848 -490922 -308319 -11104 139658 72531 -217783 -259868 -372604 -238226
7339 -238226 -202008 -373806 -107127 225881 178448 232818 463904 499994 177835 100270 112618
7328 112618 -137978 -285607 43544 500896 571393 375470 -90767 -271347 79610 166425
7318 166425 -62368 -29757 -75907 -143155 -136022 -25774 16329 -10546 -79412 -271721 -463325
7307 -463325 -196874 92785 131398 233209 362140 476701 407088 534066 469295 173803
7297 173803 62597 94611 321441 47503 72106 66509 -278175 -439188 -570198 -244597
7287 -244597 -231429 -154029 168372 -50495 -122782 42941 -231141 -144249 -30363 194801
7277 194801 42436 24903 50010 306920 220642 -202272 -366216 -133502 507031 676650
7267 676650 336356 250918 54407 -378064 -180338 -35279 -31484 -290044 -719859 -816437
7257 -816437 -467040 -465198 -374634 -187333 -300288 -278147 -457622 -314738 -216889 35640 -182035
7246 -182035 -248569 -49309 32141 -29972 -393190 -241595 -299968 -334469 101224 60856 -2557
7235 -2557 -121399 -363268 -298807 -168685 -74120 -97049 88242 -287783 -573792 -558068 -468705
7224 -468705 -52183 302590 76922 -11968 25536 60034 -269685 30036 234826 324629
7214 324629 417495 300560 42629 -140582 -40163 37505 234706 589973 208744 -100642
7204 -100642 -99011 -434766 -43177 421085 545612 268148 73075 -100497 -125126 -31341
7194 -31341 121735 180921 86448 -217001 -521142 -626681 -500947 -265839 224268 512410
7184 512410 527847 822038 657507 432558 360786 334197 206004 92939 49338 -259048
7174 -259048 -735009 -832294 -626702 -208388 -181231 -270391 -227259 -153074 -460511 -320976 -188148
7163 -188148 -12187 -40086 -487647 -372438 -11136 37676 30930 233670 143455 -64599 23028
7152 23028 19636 -116393 -59260 -145044 -461670 -469310 -253382 294334 182355 30626 337590
7141 337590 531325 379747 150777 -68408 -299974 -423395 -584104 -616210 -501301 -162182
7131 -162182 83332 -429175 -468040 -225104 155635 328243 306778 -53887 -157940 143407
7121 143407 -9456 114713 272759 -138234 89425 83348 163840 388313 321062 -139923
7111 -139923 -156584 115359 525567 632408 328950 301301 78262 9864 373900 520505
7101 520505 317496 517769 157209 -111427 -201837 128529 100132 111212 233905 -89953
7091 -89953 -409446 -599780 -186134 39632 -245758 -572439 -894905 -747438 -701003 -585283
7081 -585283 -550166 -253414 142050 148458 243611 262204 48139 165587 146706 -240241 -352306
7070 -352306 -380696 -323358 4560 76113 31536 -324085 -308856 -291836 -169564 57471 221635
7059 221635 111325 -1593 34166 -123181 92242 -55336 -303851 -433210 -499344 -433791
7049 -433791 -268959 -388770 -146929 -202905 -310223 -38865 104109 -28803 -102998 -393134
7039 -393134 -360674 8803 -180862 -129480 -64287 -70240 -68203 -332334 -178273 -6638 337504
7028 337504 231770 302734 -74607 -183712 -190971 -313347 -388780 -368953 -525581 -435390 -404596
7017 -404596 -453696 -255502 7711 63118 185781 220655 24767 -37823 -272223 -216120 -163374
7006 -163374 -246055 -426996 -321739 -231570 -422497 -846536 -982084 -723610 -521690 -388556
6996 -388556 -273935 -71020 -71369 -230192 -266396 -127237 -320069 -270039 -313689 -410510 -330959
6985 -330959 -61655 48024 -139395 -348478 -402496 -208733 -175441 18242 -159469 -396090
6975 -396090 -455576 -219341 -54120 112286 214248 109886 292226 203916 43190 -22484
6965 -22484 -239962 -350186 -193226 195530 214988 6598 86603 262054 256189 -8225 -379616
6954 -379616 -555654 -422505 -195211 8075 88930 213441 210754 537567 566025 540986 201388
6943 201388 92177 275908 321035 190873 276545 532756 140750 -149092 -373527 -148706
6933 -148706 -120296 -341790 -298920 -205669 163286 382313 314978 106085 -251266 -285171 -347944
6922 -347944 -381504 -267173 -558348 -520016 -195561 60457 -213644 28365 334090 515998
6912 515998 635694 344196 27325 -167624 -127672 -14485 -73367 26950 126396 -51015
6902 -51015 104273 124898 50514 3744 89087 379502 272840 231707 292838 -91634 -198270
6891 -198270 124393 -106507 -251963 3492 -119724 101209 522956 374737 291769 547070
6881 547070 588205 460608 90769 95183 -31430 -189769 -102172 -416335 -441808 254413 405288
6870 405288 448215 530687 401407 16734 -326425 -44247 352194 59384 -111613 153166
6860 153166 280828 191598 84354 70963 -49707 -359254 -225055 -94863 -123854 -25875
6850 -25875 -60027 -30952 193406 522145 396320 -148572 -269926 -271202 -692741 -456849 -24670
6839 -24670 -76332 202121 573180 70801 -338039 -470827 -324089 -258520 -243906 -274176 226265
6828 226265 451957 601170 391009 395312 214185 -297679 -306208 -191009 -139787 -563596 -794461
6817 -794461 -559891 -300955 -352511 -268863 6016 373469 433676 291203 40930 -326214
6807 -326214 -428044 -455077 -444559 -433613 -496378 -511514 -131528 105221 -45452 -135317 -391721
6796 -391721 -415708 -461759 -740389 -647426 -457299 -241133 13889 -117760 -8966 307716
6786 307716 329117 304093 594291 542236 124003 -151884 -231348 -162291 2689 74916 87239
6775 87239 -178279 -137448 -96626 -183315 -305409 -541121 -288644 -378383 -179319 -61761 -171658
6764 -171658 114662 112686 -47767 86266 65788 -289886 -356156 -348490 30046 161564 149661
6753 149661 103593 -73518 -196797 -109889 -98205 208229 331747 487359 458603 346321
6743 346321 222759 -29967 -95812 -122333 -300046 -238266 -69023 -302862 -524696 -235810
6733 -235810 -318576 -402046 -134347 85533 38053 136844 141477 -90693 -402676 -400376 -328994
6722 -328994 -639427 -481045 -7347 878 235405 396117 285809 340542 403 -261421
6712 -261421 -178434 -212962 -76427 -94297 -50205 113027 200728 402184 415651 170200 155747
6701 155747 165808 214573 178600 108384 299509 482923 868537 801481 530521 89476 -247642
6690 -247642 -293248 -71912 346904 271821 179815 205191 183486 82130 164995 115980 6378
6679 6378 98475 28498 54265 256730 612517 311609 447716 429350 144932 204615 213421
6668 213421 322243 16687 -231753 -246521 -219274 -616202 -568870 -267666 -195818 -383672
6658 -383672 -449036 -453229 -258934 -461443 -425051 -175318 -175300 -452311 -505815 -459862 121068
6647 121068 191828 -26444 -80479 -146432 -266941 19458 141969 176933 -18097 -302950
6637 -302950 -381526 -125239 -85579 212089 156759 317110 435472 228863 237469 337297 400191
6626 400191 -19761 -148149 -203439 -272178 -174028 -210169 -221026 -597196 -563174 -610055 -461899
6615 -461899 -151010 105875 232513 403267 307401 -97320 -343962 -220388 77414 374472
6605 374472 134717 -469 36253 52156 230247 471886 555498 470295 391487 116023 -196775
6594 -196775 -73437 149229 363309 146225 -188734 -199438 -186568 -253392 -414236 -448497
6584 -448497 -282104 -237526 -451868 -536847 -356059 -262867 -409769 -355725 -387283 -414170 -471297
6573 -471297 -331660 -102857 -19178 331900 192356 10795 291703 320594 -128852 -158350
6563 -158350 -95661 -208925 -194626 -91783 -27446 53441 98422 248652 263603 454237 701723
6552 701723 743852 390712 592125 555426 279924 -178681 -593881 -250084 217975 134258
6542 134258 36320 317909 27514 -215709 -234864 -143534 -286330 -332726 -271082 -293810 -79901
6531 -79901 140760 387852 357264 314714 83543 156057 266653 129075 -64307 -142631 -258172
6520 -258172 34002 331000 15801 -302061 -63542 307394 644174 492824 368778 228039
6510 228039 27759 -120609 124047 92648 65984 273320 238131 144865 157274 -16919 36023
6499 36023 112177 -4089 178042 365251 74946 -105594 -2725 178454 58631 113042
6489 113042 49710 185772 269809 395764 399385 102497 -7980 -66320 -103139 -88563 -84268
6478 -84268 -135110 -341469 -260039 -106497 -44376 6225 52714 315378 153255 -191874 -388555
6467 -388555 -88162 99867 419589 418954 368192 624332 313836 418457 520482 771158
6457 771158 423515 293594 -10344 -48182 -39598 -103259 197031 459558 349418 550648
6447 550648 595196 528295 284783 318101 480069 499382 33956 -56447 286232 86466 62899
6436 62899 245226 158777 -51807 -204559 -249089 -224987 -108573 -159437 120577 -71330 -359426
6425 -359426 -131687 253710 179004 261635 47165 253065 395913 457128 534039 443959 432200
6414 432200 187681 -109821 205417 178700 29655 -54572 -221485 -242314 -183760 -179871 -125427
6403 -125427 -66294 -82260 197082 665039 509980 298943 211993 134692 -6981 -127334
6393 -127334 -344790 -366774 16565 47958 92737 95055 60623 125114 271156 273328 52610
6382 52610 -180172 -274802 -71523 83570 70091 19360 -152039 -291734 -438550 -143530
6372 -143530 -53441 12434 169101 104314 508870 708457 384125 179249 61621 -47423
6362 -47423 -4851 20121 75471 278157 254740 544272 670847 146789 -211360 -344566 -167741
6351 -167741 131048 189974 -60 -279875 -441868 -249920 -415505 -452589 -307957 -404279
6341 -404279 -149080 -476602 -648106 -326062 -614444 -849363 -541422 -521220 -472144 -118729
6331 -118729 -106277 -217583 -468237 -525554 -377516 161923 175138 313593 658138 544223
6321 544223 80275 -36550 -410267 -669444 -510003 -271162 -266875 -115438 8771 657
6311 657 189324 -95453 -116954 -96283 181084 106641 -190516 -132157 265312 343817 323328
6300 323328 249962 476373 559426 469292 365365 258200 137368 137345 -387 69617 353369
6289 353369 315622 458411 130000 -257372 109542 582075 565815 758809 707461 206930
6279 206930 -25944 -111311 -350422 -172709 -113015 -221872 29173 99317 3018 -41403 -88114
6268 -88114 184096 442772 394801 -53248 -157110 -240822 -192927 -133656 -120993 -162764 73112
6257 73112 326582 130244 147546 -6092 -85267 -35495 51281 140281 314919 250147 46361
6246 46361 -7214 -192188 -15455 -265818 -466188 -285111 294517 500321 468849 587749
6236 587749 632497 750568 631192 469694 260554 298443 205190 235105 194286 -251232 -536108
6225 -536108 -550528 -503114 -341556 -178726 -141240 48397 -40677 169625 86448 32747 -102445
6214 -102445 -444882 -417241 -201927 21407 147461 100828 -7443 -46590 82240 196571
6204 196571 60309 16981 -330049 -191980 216487 391873 348195 267434 545135 307545
6194 307545 45285 30295 -254807 -401653 -388727 -136064 77163 193767 382525 439312
6184 439312 267022 1474 -41277 -115145 -79580 -27284 121921 485911 267642 -47146
6174 -47146 -341381 -494966 -429628 -77375 -111844 -109856 -59701 202930 186101 -178571 -296591
6163 -296591 -482251 -558948 -663441 -451477 -71371 216161 180327 113007 240959 -122240
6153 -122240 -343432 -148534 174096 43385 -172111 -307329 -577598 -659510 -400195 -139733
6143 -139733 -62664 235459 413369 262144 96770 -38425 68610 130004 62653 322375
6133 322375 273642 -9550 279676 112404 -52714 208178 308136 299760 174218 245396 207530
6122 207530 1843 -254125 -112358 -220544 -62670 167257 138495 -181743 130376 144054
6112 144054 198800 405428 536590 711817 598115 599408 -593 -318246 -207081 19569
6102 19569 -402097 -555964 -98408 -61828 50328 211652 163045 -207212 -576011 -274036
6092 -274036 -204548 -245507 -20391 -219064 -451419 -379296 -476365 -329160 -384987 -655566 -466471
6081 -466471 10991 450136 271321 -39899 -64730 56882 457932 436272 805895 788228
6071 788228 517948 287387 281213 534665 346442 428930 679719 782462 352867 127751
6061 127751 7362 -17747 84972 -234372 -132118 -320923 -228654 -126042 -81523 -222365
6051 -222365 -294846 -267370 6656 138675 208514 290968 368305 20948 -250985 98017 186605
6040 186605 -148715 -191410 -36547 -168277 -541279 -730475 -208050 62056 -224823 -482706
6030 -482706 -688656 -492290 -507542 -99943 -64385 -121714 43613 -47404 -161571 -27852
6020 -27852 79973 -116990 -410517 -501616 -512865 -479844 -455741 -221002 104327 -9740 53385
6009 53385 -12009 -385301 -114130 107255 -144662 15889 133762 47361 -71656 91973
5999 91973 -68617 -267512 -240916 -7917 123444 -206760 -367867 -317602 -175284 -477117
5989 -477117 -564817 -443605 -341302 -351393 -542496 -617211 -408503 -439555 -182723 127620
5979 127620 46087 129845 -52124 -83899 -165707 -82158 17046 -338128 -578423 -853714 -884584
5968 -884584 -643554 -549430 -279495 -43169 6863 31552 -31258 75178 338877 219747
5958 219747 192070 57827 -493374 -376811 -140006 137381 307609 347476 264564 412703
5948 412703 235031 -42818 397876 507285 338206 205045 381482 154927 284581 312893
5938 312893 268707 365916 477482 219673 269458 80235 -51918 302741 110738 -277044
5928 -277044 -399209 -119684 -188834 -49308 -32182 2640 -255218 -179496 -152931 -121920 -164352
5917 -164352 -9416 355247 629593 211305 246464 349309 337560 343368 156865 30097
5907 30097 -117686 -147531 3094 445245 528789 578182 754148 644872 652518 769261 849850
5896 849850 641224 491100 758365 534350 348818 219620 100394 170445 179203 289348
5886 289348 170795 371692 209250 -138687 -10403 -85604 77841 443722 526941 472055
5876 472055 169797 286737 92740 -292222 -252598 57901 63981 302936 413439 337513
5866 337513 74354 2779 -42868 69490 -124177 -433854 -577182 -371402 -525445 -548153
5856 -548153 -115086 329928 149723 248717 223636 242258 92881 217539 558456 387979
5846 387979 44951 415684 297585 -422021 -421552 -355061 -519461 -732273 -513304 -698926
5836 -698926 -712977 -463031 14426 199331 -47959 -157031 -83280 -265657 -387557 -270328
5826 -270328 -20068 -64332 -23436 -236807 -534177 -408641 42283 -6352 -372715 -565903
5816 -565903 -707798 -541457 -288948 -227243 -159248 -177246 -247664 -291890 -318396 -400907 -404892
5805 -404892 -325847 -323513 -209332 -40102 337874 232967 -86230 -60904 -102760 -395227 -499182
5794 -499182 -369060 -341938 -300194 -436809 -517793 -178910 -118031 -258222 -325120 -298280 -215529
5783 -215529 37358 -189867 -366262 -748941 -581130 6139 -150194 -259845 -265035 -251196
5773 -251196 -324595 -385539 48037 336021 282830 -182835 -126892 -87864 -343719 -141103 132466
5762 132466 158478 486618 679799 856303 794398 494668 95136 -103355 -72843 28837
5752 28837 -18073 -158889 -155462 71160 104044 51660 149490 282428 196287 207630 353473
5741 353473 272309 22756 -545583 -663263 -190182 -170128 -207949 24319 -10445 -236753
5731 -236753 -252120 -190808 -7179 147759 -72112 100939 568242 695798 393437 209476
5721 209476 254737 557896 390073 263210 194702 21178 -24338 20117 -180738 -21605
5711 -21605 293822 518066 609787 260219 86800 464758 798452 362012 1038 -225939
5701 -225939 15360 228336 228231 217924 -13870 -379183 -236060 -193991 -234912 -115067 -69434
5690 -69434 -340395 -346294 -195561 -228441 -149341 71242 -54358 -450256 -160353 35808 -209013
5679 -209013 -236369 278710 466426 438518 278968 137470 -110842 -300704 -395340 147002
5669 147002 730132 606709 587250 361491 -16835 -256478 -320243 -179908 -275702 -466860
5659 -466860 -640335 -393395 -126093 55269 132296 187154 21412 -590237 -934145 -539657
5649 -539657 -164122 -274189 -331473 -368866 -514977 -474107 -267075 -428267 -522802 -697258
5639 -697258 -720503 -889631 -754088 -410569 -247789 -366197 -303364 -29016 153432 129581
5629 129581 112369 172366 -166112 -127964 -54015 -217669 -129932 -175665 -234938 -375771 -169344
5618 -169344 4074 -21700 355516 348119 52859 26085 -66517 -128768 2303 183979 306103
5607 306103 529000 152404 -184237 -127410 -426654 -622593 -507854 -256128 -156454 -420889
5597 -420889 -480898 -463680 -24650 41820 -86727 -79262 258471 768461 797227 664658 449932
5586 449932 127555 190474 -7198 232636 311136 454603 190021 -46165 188426 346702
5576 346702 478816 370973 210723 251798 383428 82124 -14756 -97229 -200535 -410517
5566 -410517 -226914 -106311 -79672 -145283 -430792 -463218 -626361 -681121 -565489 -470087 -228672
5555 -228672 123659 200962 313456 140984 33502 -238159 -368367 -267817 -199912 -250875
5545 -250875 -95551 200971 81167 -24584 -43754 183590 355570 426356 620699 522134
5535 522134 59949 -174317 131096 186643 186665 9626 198907 142652 -188373 -212025 17525
5524 17525 -96291 -86590 20769 345701 549984 604220 40734 -181320 17736 111820 -298016
5513 -298016 -701868 -401501 -443335 -403374 -322961 -195400 -196772 -516659 -652001 -156696 -201128
5502 -201128 -174090 -166095 81437 399813 166917 236998 54235 -121902 37556 180785
5492 180785 467827 503842 192033 193634 260548 -111999 -320534 -273684 -319811 -108027 122079
5481 122079 132423 117777 327505 269863 -175571 -202095 23542 80225 -68185 -191421 -445992
5470 -445992 -465244 -454711 -43953 -826 -394646 -931378 -820330 -379512 -74249 -234724
5460 -234724 -150910 -229882 -208479 337621 691211 386351 270649 220568 67022 -82394
5450 -82394 112056 195824 269142 130930 -110793 -341451 -142806 -123257 -111193 36512 174134
5439 174134 153959 -209589 -424565 -486115 -360969 -175306 -438176 -330229 -220321 -175430
5429 -175430 -130555 23393 325580 76224 -71491 -32671 -77563 -382460 -130237 78018
5419 78018 253895 614115 515866 -181682 -115509 -13816 5162 69230 226094 123528 22874
5408 22874 117767 7229 -282239 -251048 225067 190450 176584 -80493 -230996 -179760 -23061
5397 -23061 236038 168395 -34050 83115 79486 -45864 38517 -2723 -63031 -175794 -35938
5386 -35938 451385 620940 459180 148993 -196069 -650647 -268594 387870 318384 7056
5376 7056 -342995 -35788 74905 -27074 -216146 -243379 117295 660878 630316 314947
5366 314947 -157649 -93754 -71249 -193733 -11686 63390 -226929 97328 515597 389580
5356 389580 257396 145075 -73237 -53087 37472 -160477 -305057 -190783 -88660 -252057
5346 -252057 -70737 194091 327619 574894 567179 198688 -291798 -880600 -960461 -503624
5336 -503624 -279429 -527093 -589401 -563904 -395587 -73072 198169 -78066 -370589 -195627
5326 -195627 -226872 672 156937 188796 280503 94612 42425 380051 407597 107351 -276159
5315 -276159 -313856 -306771 -289322 -146836 -400060 -367762 -61390 -219757 -84826 -176029 -392367
5304 -392367 -320832 -160811 -301700 -364874 -401031 -217762 -14418 88881 128074 65504 -189481
5293 -189481 191894 518951 431865 297970 4530 -153165 -536499 -938969 -656195 -416950
5283 -416950 -271857 26729 132796 191907 167674 236152 322217 214257 163928 123693 229481
5272 229481 -34327 -93904 132391 177270 328513 357920 120822 71735 166378 -125425 -348991
5261 -348991 -380731 -91508 138056 281377 -22315 78283 302961 103139 41809 -91207
5251 -91207 -92632 68989 228702 189109 42121 -158416 -200076 18321 203755 81120 -54598
5240 -54598 -15594 168801 468516 579739 155256 123354 23256 159317 231778 -29167
5230 -29167 16069 -62690 -340317 -434490 -419415 -517281 -435504 124302 432985 434808 716189
5219 716189 763970 571513 43049 -140598 -143132 -133089 205654 199954 82611 -92519 -211987
5208 -211987 -190125 -225882 -35535 -223358 -362976 -582022 -376662 -50244 -161453 -177377
5198 -177377 -86919 125966 392273 257665 -60533 -55132 -603138 -903607 -860073 -784557 -525397
5187 -525397 -135116 -233975 -277893 -55291 -218831 -314754 -37987 28470 271359 471757
5177 471757 647340 641208 583459 391364 251267 17463 -371074 -493798 -443708 -400512 -282535
5166 -282535 -354103 -51824 132598 234782 301017 423239 241954 174714 24444 -25343
5156 -25343 -207259 -146367 -146819 -261327 -67225 -181280 -616369 -674671 -525299 -404799 -164266
5145 -164266 4836 119917 503438 694502 616444 251893 78020 -146490 -269486 -212809
5135 -212809 14883 474107 397693 -179468 -380577 -384648 -286860 -236588 -68487 66185 193312
5124 193312 484120 910359 494825 -94917 -443631 -845277 -483555 -105010 -61942 -203128
5114 -203128 199149 133110 -7068 -54876 -202750 -117570 -242243 -191384 172525 132047 -116053
5103 -116053 -158502 -29577 27508 230408 184440 137092 299323 370039 263258 -69259 -89567
5092 -89567 39826 -177499 -4454 -54287 -444427 -479137 -220126 12599 78791 -287274
5082 -287274 -227210 246493 542806 338877 403436 306466 190431 174148 -114316 -191015 -1906
5071 -1906 231856 27169 -98621 7984 136433 417043 126757 -468732 -674588 -839203
5061 -839203 -221293 108010 -52803 165670 178111 25486 -102477 -108129 -114589 -150467 -318386
5050 -318386 -130183 115915 -245057 -600973 -613529 -517777 -491484 -396976 -466862 -529736 -465986
5039 -465986 130166 409599 191286 -42191 -160265 -316249 -150355 175724 623116 539752
5029 539752 -44000 -240171 -366330 -297405 80611 204640 212939 196785 133557 -98854 -211107
5018 -211107 -133603 -176476 -170228 80688 -78258 -42207 -20027 32034 222093 327602 184959
5007 184959 114258 87949 -95621 -295419 -98620 101494 58167 -404326 -570879 -386757
4997 -386757 -156526 3504 -108866 -290454 257304 408022 -15566 -334119 -451830 -522464
4987 -522464 -295622 -592974 -618668 -660306 -645108 -272958 149748 -100112 133052 135303 443684
4976 443684 704633 526484 34349 -91939 189840 357800 256686 36662 -101920 -150986
4966 -150986 185288 475985 246407 16126 24617 85409 181825 -30922 -107821 -273509 -287256
4955 -287256 -174372 -169852 -366994 -733693 -589621 -238986 177373 387177 302603 225063
4945 225063 359188 270372 34143 241354 721292 563924 445580 238305 120564 463708
4935 463708 501407 325458 264062 -174554 -102847 -21171 102551 85473 283361 355418 -222
4924 -222 -281656 -368702 -250232 -421018 -219663 4621 134065 -66705 -215868 107996
4914 107996 285853 -181751 -222498 -29700 3675 -205664 -141474 170873 -154368 -137746
4904 -137746 61766 189724 335709 99414 267785 551035 402129 298811 87895 -136339
4894 -136339 -10900 159258 222681 73089 -121639 -134000 -149755 -214559 -325752 -515560
4884 -515560 -133129 204363 -304301 -511152 -608323 -367334 -513313 -418656 42866 835401
4874 835401 792115 389836 492022 626674 332712 254422 281132 -103649 -575884 -601103
4864 -601103 -449443 -542956 -593359 -455060 -51013 181835 276943 418230 418163 154856 145828
4853 145828 350266 389051 290935 60772 -282305 -547232 -309343 -27428 -52511 -51960 172388
4842 172388 359729 577921 295214 426961 638948 817740 797675 698654 460398 11691
4832 11691 4922 -229003 -456831 -425746 -385692 -350528 -455963 -113840 247040 22945 -196140
4821 -196140 -321532 -220120 46087 54192 -95230 -109377 -294723 -426934 -517987 -380103
4811 -380103 -187591 -40469 -83209 59643 259647 446070 494219 262785 204720 207810 249541
4800 249541 172087 -342070 -508425 -550204 -402970 -120290 4308 20114 18447 -66789 -282970
4789 -282970 -370304 -131259 -316756 -481640 -346301 -268070 -76456 -219024 -350855 -622703
4779 -622703 -866077 -584817 -573063 -603325 -279965 -266973 -301252 -124923 108046 425072
4769 425072 367993 255075 178764 136020 -124748 -103436 171124 485 -124342 114547
4759 114547 348907 364688 469311 206349 -230391 -164033 -58132 -301662 -383508 -60925
4749 -60925 -62930 -88122 -47792 -307044 -515306 -554636 -456982 108775 257092 178369 250891
4738 250891 328076 342624 262443 176985 298061 448383 522831 476176 476592 256624 186830
4727 186830 474705 443232 123009 50506 34979 -191914 -240729 -217769 1412 64338 -539605
4716 -539605 -949571 -641148 -202050 50233 133876 228249 -1220 -134517 -34427 -363983
4706 -363983 -265245 -80879 204351 59332 98108 398865 435156 92966 71391 -85982
4696 -85982 -473592 -409231 -135659 -15750 -139333 -219278 -350688 -450322 -67487 148051
4686 148051 212410 106886 75149 88391 93087 291396 563023 394328 233688 182635 191908
4675 191908 113089 253526 562803 629945 241392 236660 377960 682507 689625 778561 696865
4664 696865 490851 323639 249155 372183 480663 783703 937016 417407 36744 133920
4654 133920 -207806 -321137 -412 337651 348671 182728 98392 437629 530328 480441
4644 480441 304802 205473 -61257 -532852 -642052 -375900 41705 156321 156675 -195318
4634 -195318 -143797 181023 361892 331441 -77239 -401396 -241950 -119913 -233509 -206653
4624 -206653 -335985 -272870 -178239 -299571 -203903 -19951 -18743 220472 212999 -97192 -210945
4613 -210945 -59689 -138609 5428 -177424 -338619 -257098 -47793 175397 510929 485796
4603 485796 -16590 -82019 253192 163348 -203507 -201965 -48267 86755 -20664 52117 -125942
4592 -125942 -142466 -188644 148594 211 -16043 224756 182661 269405 510868 433603 333138
4581 333138 258495 94138 205664 294846 128209 107748 34520 -184841 -224163 288991 575791
4570 575791 446398 317744 -218826 -247270 -4017 -52705 -294345 -254448 16112 64294
4560 64294 64177 -116716 -330549 -429051 -130120 308273 324446 222030 153190 76540 -54507
4549 -54507 125621 33818 88732 78524 -153009 -464273 -328015 11662 -151442 -102443 125854
4538 125854 394791 567334 572009 208618 -44774 -73373 213902 242236 335852 176063 30799
4527 30799 -218103 -347760 -465456 -619471 -391082 -241306 -295492 -635182 -921145 -687768
4517 -687768 -252200 -283469 -456283 -429605 -525820 -747341 -421515 160204 196713 71313
4507 71313 120621 114759 26653 91397 139112 183605 260398 318966 303572 -24670 -158778 -193766
4495 -193766 -100899 -42964 112523 91280 -120889 -118941 -208415 -241781 28554 70444 -161105
4484 -161105 -187588 -89553 -214432 -477297 -224538 61929 -67882 59245 72462 -91333
4474 -91333 130252 171260 230362 319483 727590 720177 440562 338315 404067 156805 -16371
4463 -16371 -212965 -337444 -588022 -422186 -69940 36454 -15934 -406105 -401933 -147450
4453 -147450 -172672 -276580 -272561 207858 133184 -94781 -110295 164987 211624 -15789 -145516
4442 -145516 -75222 -211729 17889 2085 -278713 41191 218625 64271 50002 18218
4432 18218 -155129 -284228 -439115 -517860 -610348 -522906 -306265 -372395 -336051 -74919 -2125
4421 -2125 -24141 -319416 -230458 198050 418216 474047 532418 330552 344402 483553 132200
4410 132200 -249371 -265435 -176205 -220527 -59778 -255452 -169352 -459544 -446889 -184641 -361892
4399 -361892 -451319 -584620 -453330 -593998 -547157 -340870 -164495 -52698 35853 151280
4389 151280 156658 32719 182865 346409 199958 122602 50694 281599 416311 400420 133175
4378 133175 61060 -117657 258687 207784 -115205 -241908 -305042 -337076 -326535 -101211 36888
4367 36888 -155798 -167331 -189030 203517 496280 233005 71667 -53590 22603 312249
4357 312249 357364 520299 346606 243085 70193 80353 296264 434667 124613 -28899
4347 -28899 -517054 -562395 -143718 96459 324854 563205 571467 423973 166685 203905 469765
4336 469765 545386 273253 83104 175148 137000 131132 215586 191890 234314 528022 816280
4325 816280 523224 -89076 -377427 -274128 -33271 -222976 -137236 90049 186887 51718
4315 51718 -172016 -154613 -200921 -119510 210961 361398 -64133 -147669 -29845 -33389 286587
4304 286587 288591 273401 403490 658437 517054 393104 327219 187063 294006 -91630
4294 -91630 -343723 -365590 -289853 -254212 -373770 -644370 -546634 -196393 127212 177208 113577
4283 113577 158047 118572 -29690 146397 138370 -30652 -226 304021 554653 345340 278154
4272 278154 110011 -67937 -462943 -384005 -187068 -284868 -448701 -287939 -308058 -171829
4262 -171829 -195869 -220456 -222458 -74245 42160 201296 290582 96114 -181429 -99529 165065
4251 165065 190459 86017 -132294 -118188 156227 171441 -280628 -351026 298532 622701
4241 622701 403251 289574 227362 194730 449324 554410 598851 486225 320902 214482
4231 214482 105643 86457 145782 45404 -158969 -182301 152772 -94320 -149283 212837
4221 212837 215720 85708 225537 415152 292853 78547 -171128 -387540 -90770 -163640
4211 -163640 -300105 -232226 -158586 -141700 377979 544116 309531 139985 94022 199868
4201 199868 212830 185740 206854 -19018 -87350 1222 127600 8702 52488 249394 274324
4190 274324 30704 124512 293834 91930 -40573 -196735 -53611 20125 -302305 -222417
4180 -222417 -213643 -195071 -260551 127270 201303 364252 625261 615466 283571 -30198 247682
4169 247682 357334 298355 194695 172863 266462 450531 467239 491816 469510 -50469 -595615
4158 -595615 -432651 -46357 173392 37283 -25550 75814 109046 372716 572043 88135
4148 88135 -296131 -67235 281542 565033 620069 762571 143925 -97902 196083 89985
4138 89985 47309 -109407 -121448 -45131 -23048 -180321 -301316 -483862 -589808 -282119 -23060
4127 -23060 -265080 -331114 -188775 -207138 206992 384800 179906 -159762 -286874 -192824
4117 -192824 -236856 101463 356584 114057 -70193 296478 689626 225318 133658 18942
4107 18942 -83346 91388 -247300 -477555 -359338 -127204 123376 181657 95345 -177926
4097 -177926 149919 79336 71242 431131 106441 -30264 -164141 -420317 -435046 -267075
4087 -267075 -367907 -345204 -383201 -143699 -84079 15341 -123536 -232711 -47847 -2406 99200
4076 99200 -49706 -185148 -49901 281342 53142 -66575 35552 177965 129787 -207553
4066 -207553 -583086 -580317 -184367 202067 85717 144142 328572 238634 -311229 28955
4056 28955 663466 544899 413519 763335 705406 308642 275273 85822 -29894 -138024
4046 -138024 -343159 -463128 -135891 -186899 -265447 -438448 -280007 199626 432904 236652
4036 236652 412570 281182 194555 223480 -249719 -701181 -355794 -1629 64578 33096
4026 33096 -131477 -88088 187589 219012 -118639 -441083 -97810 200662 309256 322365
4016 322365 417978 407954 147828 172800 227273 101151 183409 223231 305157 568740 487362
4005 487362 -63990 -483107 -302655 -146862 56205 178356 162931 -4324 108947 -183258
3995 -183258 -595994 -526319 -282727 -98840 -69896 22962 -101284 -343930 -320450 -37597
3985 -37597 107609 -55258 -173689 -209532 -222707 -241271 296372 389306 390638 511802 479653
3974 479653 296804 82392 164812 367892 339270 32142 167812 540646 215834 -217734
3964 -217734 -422401 -477047 -217713 -281924 -313997 -362818 -473687 -135130 42215 -101540
3954 -101540 -359458 -410779 -98333 562805 646436 763938 872195 650993 717660 491026
3944 491026 -146124 -116130 -109325 32103 255355 85787 112214 44205 -64639 -213502 138982
3933 138982 237705 70691 146425 100260 -156443 -142855 -360632 -292665 409589 488668 316675
3922 316675 225052 294362 562856 542471 432973 347128 -224262 -94990 247259 241533 -16721
3911 -16721 -193574 -142156 -42586 -161100 17868 -69874 -256983 -231628 66736 557362 691498
3900 691498 356916 -10366 135691 275709 248501 139330 336596 145286 -405811 -445417
3890 -445417 -276553 -62483 -201133 -261856 -169991 415337 749740 551678 318151 -42480
3880 -42480 -207771 -327327 -338722 128887 339675 97138 -46204 -79110 150710 111027
3870 111027 -244615 -198090 122583 128475 214326 164386 162108 307445 295376 269235 419588
3859 419588 416853 381951 19715 -15626 468151 937856 836114 522096 570800 286507 59574
3848 59574 -50801 -265536 -127081 37252 258053 201229 -188850 -7905 231186 172443
3838 172443 335429 302139 142008 69108 71395 60967 -217393 -222975 -82712 200320 140253
3827 140253 -287189 -530572 -146508 -144473 -57443 215424 33810 85877 63321 2439 -9528
3816 -9528 236522 411150 422378 596598 453998 91632 -10656 -100438 69543 98878 -5637
3805 -5637 -56145 40222 -78607 -498092 -509874 -436352 -275692 -135201 -14430 59966 55153
3794 55153 245303 633092 452571 206701 200354 343513 239075 17409 -239179 -467795
3784 -467795 -464464 -282159 -501452 -611912 -640049 -565189 -567906 -561874 -402749 52907 178326
3773 178326 71284 -19009 -104285 -509769 -408713 -82678 76530 54023 -52883 -240407
3763 -240407 -117098 -20825 -130066 -249148 -124845 -133901 149347 608165 569468 455451
3753 455451 670616 548181 303229 412481 545301 704133 607424 326445 3163 -87827
3743 -87827 183137 354487 488068 568264 96900 48233 337392 414534 404935 580917 595089
3732 595089 220646 -49396 -147893 -110204 278056 649447 779288 585845 497868 480212
3722 480212 402276 228044 237343 448728 387424 383199 175146 67613 220981 122433 -4091
3711 -4091 -35789 151698 125960 -40318 -139339 46752 216468 494663 525351 -15512 -303694
3700 -303694 -513973 -560926 -629858 -441992 43575 224604 71385 -40875 160550 39285
3690 39285 317939 690981 686884 795744 555280 36819 -106332 -290446 -235167 271323
3680 271323 466574 312200 201514 58933 31238 -16895 74351 192428 220326 107657
3670 107657 23646 94194 272576 403783 482759 241417 13621 101131 21192 -67593 -200579
3659 -200579 -121358 -129207 -27360 80009 93091 -126596 -19906 129888 38313 -75147 -28046
3648 -28046 -199990 -55265 251222 22638 259030 250102 324235 339893 182633 247831 332932
3637 332932 196923 44048 -15004 336287 209780 117504 145312 215298 -138990 38369
3627 38369 193045 182621 -96111 -434069 -341674 33689 81506 -58424 39969 210478 257852
3616 257852 122386 11066 -220205 -111039 298863 498548 885928 1059957 533732 -114711
3606 -114711 32158 -40802 -74090 -53118 -134458 -97223 -186998 -213005 -216729 -249472 -7591
3595 -7591 27509 293735 449446 441414 90648 -358193 -275400 235420 436926 399911 154209
3584 154209 -399347 -315676 -5651 78642 -207295 -309373 -438007 -496442 -245289 12523
3574 12523 250586 121696 196232 318059 179871 -143980 -92359 25511 -46322 -29866 -286713
3563 -286713 -115230 -77233 8961 393357 543957 729874 615890 259654 133056 170312
3553 170312 398535 539559 604621 573637 186730 -179840 -29093 293713 137996 133076
3543 133076 42148 -122303 -635622 -580103 -403569 -411428 -190186 -130356 40004 241667 92189
3532 92189 -229482 -202092 -374934 -592543 -273325 14289 162330 206984 -96026 -718783
3522 -718783 -854566 -852536 -571778 -714087 -757703 -354140 -84026 118197 107293 318711
3512 318711 97278 -24357 358386 463427 184297 281483 559261 437454 256572 -10302
3502 -10302 -235409 -474937 -100712 448944 461514 288333 220620 90732 165154 196690 35504
3491 35504 25030 38217 125901 -256463 28884 -6047 -502352 -776825 -659446 -169403 -225856
3480 -225856 -553753 -213321 -140667 -364415 -578076 -687783 -846075 -689453 -371735 -226553
3470 -226553 -127475 142415 63740 -132986 165449 246791 189353 199512 -193534 -199548 -199798
3459 -199798 75033 253518 0 -154335 36466 -104114 -394160 -551405 -335302 -69770
3449 -69770 16256 -145383 -615246 -446942 -245410 -95214 170261 307921 119757 124885
3439 124885 307740 79052 -579872 -423257 -64166 206134 231878 141770 42499 30377
3429 30377 -315694 -449240 -49268 136037 981 -28717 -52552 -94782 2707 -76685 50096
3418 50096 -24029 3196 -78268 69315 136608 68967 -162715 -117407 70261 -15424 -16890
3407 -16890 268051 638967 121657 24434 -205122 -726779 -963327 -551375 -26146 339484
3397 339484 564024 213314 -111773 -106320 -168932 -204739 126299 230665 407060 532875
3387 532875 96114 -219743 -203699 -414428 -413942 56135 206137 -60370 299587 584156
3377 584156 869281 474518 137501 40867 61514 -144017 -253448 -366598 -480601 35969
3367 35969 237589 171678 112817 12318 225582 343670 79693 73617 -243652 -457154 -388402
3356 -388402 -48136 21123 -200576 -59501 -154795 146319 -12042 -523873 -789368 -492307
3346 -492307 -350398 -353955 16956 311517 525736 404742 63871 -255316 -144204 -175175
3336 -175175 -291847 -275554 -175607 -325770 -367494 -296721 -87177 108017 341301 519836
3326 519836 377570 446617 692940 365958 254981 29136 219899 282984 310571 326569
3316 326569 154213 331043 506628 332362 319485 275028 -6497 -73697 -102551 -45295 -42144
3305 -42144 -372271 -487213 -163835 -133353 -280411 -91551 130918 374374 344842 374205
3295 374205 413316 275684 -21532 -136826 -20135 16365 105715 209538 66576 350365
3285 350365 386556 157858 237893 429429 836730 828111 436792 175920 -128858 -39830 -219182
3274 -219182 -322327 -334117 -235849 -61326 -103792 238090 692323 535839 465211 400778 266055
3263 266055 93968 -234872 -91308 105014 51790 261999 332184 67929 92293 140824
3253 140824 182178 91473 -11253 -123930 -17531 230222 279005 390158 187670 -311450
3243 -311450 -686026 -668551 -462267 -429714 -386782 -132322 70396 142335 -101327 15315
3233 15315 154071 342314 258188 231625 -170757 -192316 313773 156959 378066 349083 -111180
3222 -111180 -19255 -8125 -273632 -233393 -513291 -567706 -327631 22166 -178982 -456127
3212 -456127 -515750 -383894 -477636 -302043 -269232 -326333 -468238 -306631 -169109 -241030 -398504
3201 -398504 -69803 300954 521852 520806 96195 -410910 -240032 113115 77330 112556
3191 112556 -159353 -116748 146709 164382 105109 67790 81849 140478 221952 288349 109944
3180 109944 32916 -75505 -193460 -242443 -517911 -395179 -477216 -381757 -163206 97362
3170 97362 210820 171966 -32578 50273 190030 21290 153452 361094 412415 250136
3160 250136 386861 621589 598366 302962 361003 273241 38506 -44044 -145133 44322
3150 44322 214092 73011 203229 474646 31486 -98188 -146986 -198304 -35476 24655
3140 24655 53537 -317868 -438734 -95214 -114511 174713 193920 24340 103252 322725 513564
3129 513564 414549 288171 207857 187993 392809 374024 -39223 -74156 -57511 63967 115400
3118 115400 175915 166389 -23790 -178030 12167 265539 257064 139156 -473067 -169579 225583
3107 225583 252211 232469 71419 -275886 -625939 -617353 -563521 -269327 -127292 -318918 -378833
3096 -378833 -165062 -142539 -183046 21546 38685 -93365 -276913 -172020 -125754 182545
3086 182545 69292 213507 394759 251786 -27613 -367968 -328107 -194294 -69444 146723
3076 146723 -38061 -133641 -422660 -266381 18541 195558 147731 139318 -196316 -124541 -64163
3065 -64163 70481 305428 518521 198787 22450 210843 192133 -177996 -589925 -474463
3055 -474463 -341754 -99554 -140571 -222393 66168 167674 112789 -240208 -246934 -222646 -261152
3044 -261152 -6153 -86435 -7775 -30908 -169859 -33620 238927 274025 310992 -4801 -132621
3033 -132621 -197202 -179486 -50715 -148923 -43728 28483 208074 235715 176571 141563 237953
3022 237953 451784 199001 225538 380294 665901 861486 560511 45818 82222 153639
3012 153639 272455 80729 -420638 -561472 4044 179989 219139 96590 -162245 -146979
3002 -146979 -92326 -514758 -208115 38744 -95185 -115477 -386472 -768421 -797655 -662740
2992 -662740 -773966 -444369 -141126 -127278 -195045 -164232 -515259 -759319 -548767 -544372 -755012
2981 -755012 -933368 -486607 -71875 232813 65467 -8175 389774 523536 54242 -265085
2971 -265085 -231551 55567 -73508 -173676 -111136 -137160 -135664 174216 390668 68761 -97648
2960 -97648 -181076 -181925 -123096 -136322 -114097 9048 -86088 -258489 -326226 -244427 -193673 20278
2948 20278 -258504 -138273 81653 -27838 -116792 -197151 -284530 -287397 -265747 -25445 435084
2937 435084 300238 -120163 -189134 -13500 79981 129764 -152527 -329075 -182350 -260029
2927 -260029 -198697 30457 309938 -73892 -143756 -171849 -140005 165826 434731 257038
2917 257038 89960 342442 128668 -147708 -100861 4447 -253429 -333924 -367331 -137846
2907 -137846 -22476 -138395 -136428 -167107 15566 20798 -274425 -270934 -176719 -21486 -248855
2896 -248855 -228577 1304 166488 260607 -147093 -191589 73314 439331 258836 335444
2886 335444 49366 -22596 211021 602333 735044 527728 365558 511977 521435 276641
2876 276641 -54971 84292 184464 127008 131680 219209 106042 -167378 109205 195552 -191172
2865 -191172 -577455 -523299 -233803 -10559 -155868 -243761 228012 35188 -282944 -325848
2855 -325848 -155478 -248893 -154218 -59112 384991 104170 141189 308674 348862 106924 84588
2844 84588 194451 457503 626895 581102 34058 76535 375253 262428 -88956 -249930
2834 -249930 -214736 -329851 3592 164847 197173 304244 283913 161070 2008 -135685
2824 -135685 -492137 -414064 -322880 -429808 -367263 -378146 -339213 -218334 -515379 -484463 -158931
2813 -158931 -91461 -202267 -147245 148917 280652 396031 553978 398281 343095 221865
2803 221865 94066 179512 624638 748238 734206 530606 147728 -75255 -145289 143084
2793 143084 231486 353961 607005 168697 61389 161269 238704 -6668 107578 192842
2783 192842 336677 344888 -84032 -125372 -129710 -73088 -143218 -227990 -247880 -53143 228494
2772 228494 294458 -293905 -466802 -428412 298661 698373 540971 173992 278114 111896
2762 111896 38350 -33729 14785 -73736 349355 693629 294724 -190290 -285313 -291740 -167899
2751 -167899 -65866 -83965 135496 32643 -50440 -57379 -114818 -16500 -45631 -78304 -429139
2740 -429139 -304194 88363 231072 409860 342566 120375 -44869 -286187 -548702 -246298
2730 -246298 48688 -3387 -149968 130782 63792 -247594 -43982 27595 20946 115216 88516
2719 88516 299533 34161 -243938 -161648 128207 343080 158913 73074 81657 -4092 22455
2708 22455 -279031 -271394 -215620 238401 320173 387570 409402 349837 125637 -205194 -173407
2697 -173407 95552 459551 308295 -300868 -477311 -105446 -163284 -134824 -86327 77805
2687 77805 -114939 -278478 5652 214510 260459 100150 -144285 -266467 -23591 -27182
2677 -27182 -86846 -162194 125570 311082 269215 253740 45679 -42082 96957 -37101 -132327
2666 -132327 -115448 -29418 100541 235659 87240 295966 447337 360987 317185 230013 28703
2655 28703 270814 156074 22035 75322 77979 -61744 -438305 -115026 -182793 254714 326847
2644 326847 132833 78789 -5418 -55300 -35307 165041 319589 316916 -57955 43878 214506
2633 214506 -47369 -80777 -80048 -128071 11247 257687 154120 -45665 75574 38769 -138757
2622 -138757 41155 227241 434826 433604 392338 177509 53935 193308 407145 223570
2612 223570 -6324 -125034 -36744 -107672 -319727 -141503 -51945 252410 -89644 -336942
2602 -336942 -230305 -36813 226602 16016 -150573 -158878 606949 575611 318593 116558
2592 116558 142747 28308 15021 35894 56103 119941 145872 -148918 46952 602374 1013143
2581 1013143 780064 747308 766832 644252 614028 810404 619485 278397 -81794 -293092
2571 -293092 124660 382222 449838 509916 243157 -46708 66065 71192 -286432 -253991 134524
2560 134524 -43083 138179 190000 214371 377477 368433 116977 35023 -75090 -120569 -115056
2549 -115056 -186700 -613503 -294135 -44561 -143141 -98831 -132573 266182 324242 263778 204361
2538 204361 -44124 41325 -273290 -361991 -423418 -581045 -378482 -208689 -1742 -46245
2528 -46245 -434176 -466331 -45547 25842 36950 128901 211316 -103868 94709 407294 520582
2517 520582 411586 592017 559799 41836 -391175 -178628 41370 209073 380783 534623
2507 534623 171423 -166801 -369731 -314127 -374591 -600620 -443483 -491599 -578388 -535651 -283057
2496 -283057 -312033 -649073 -428494 -169203 -123038 -400096 77777 370515 281171 184847
2486 184847 -77073 -165635 165853 377503 167610 -196816 -107713 -39635 -282646 -366384
2476 -366384 -372158 -567380 -423621 -411855 -407000 -283672 -16404 516900 127849 -288699 -243799
2465 -243799 -135187 -115444 -321782 -563254 -671587 -461895 -117926 31974 -28903 -175803
2455 -175803 -631996 -598285 -504233 -469099 -174820 -180529 -68146 74874 -30206 -115924 -377427
2444 -377427 -469806 -311723 126511 475342 292680 427390 218347 132613 -843 152112
2434 152112 374864 460288 462103 586115 593284 440839 -50667 -338584 -332703 -533336 -986353
2423 -986353 -1014403 -789105 -419825 -431497 -435881 -471722 -642224 -625418 -181207 55662 212614
2412 212614 421198 323115 231872 210870 -156628 -495082 -296556 166847 296013 309693
2402 309693 334531 31470 108416 237110 280993 101970 -126330 -226690 -336554 -308915
2392 -308915 -390765 -288487 -30091 -47408 -179644 190104 -202476 -488177 -458559 -561505
2382 -561505 -379483 -156826 -55447 -180184 -309175 -300913 -165019 -290201 -309671 -296519
2372 -296519 -302060 -86548 -71228 -181837 -371804 -222202 133032 172071 -1925 21152 204818
2361 204818 423173 639337 622836 272755 90380 291519 655437 371463 166270 -123568
2351 -123568 -451361 -498996 -356586 -481504 -438183 -163526 -136245 -273649 -508218 -467809
2341 -467809 -356335 -282659 -335825 -381386 -375499 -139655 -193854 -515781 -576056 -247340 -11981
2330 -11981 422075 310019 -201569 -411861 -199238 -49501 -114372 469 -117995 -436528
2320 -436528 -157230 13127 90583 246155 -31872 -219857 -367461 -201096 -161526 -212462
2310 -212462 -226771 -230797 -208607 -71755 -51559 82137 -185926 -132114 -183884 -197447 -89691
2299 -89691 92282 104719 -303555 -352709 -483572 -589788 -404158 -674846 -808393 -475211
2289 -475211 -314156 -425400 -115737 -236167 -36559 -156860 -186330 -11872 -18766 -191993
2279 -191993 -316648 -390304 -500325 -126632 170663 39111 -35332 297319 492117 551843
2269 551843 315144 224044 127664 43321 204091 -163691 -261372 -264161 -228933 -53073 212937
2258 212937 249768 486084 566806 303014 -57724 48551 241149 -100918 36173 179971
2248 179971 220914 32594 -66072 -232848 -235531 -355006 -415404 -116762 80602 117704 -95635
2237 -95635 301554 283751 123225 -161238 -123959 57730 -106283 -61610 -3225 -280865 -430001
2226 -430001 -279163 345253 424284 193716 540165 537017 314822 24007 -161535 -429319
2216 -429319 -190973 -192295 -136272 91420 182062 -171818 -203221 73128 190340 -16957 28345
2205 28345 -1070 -165449 -90355 -211554 -199073 -130296 200048 353918 350034 462148 328059
2194 328059 192278 137275 288232 543966 560610 298633 -16944 201883 323929 422631
2184 422631 95604 509868 441468 -29003 27708 171777 -70960 -39249 18665 -6795 -95128
2173 -95128 122128 358758 489702 248464 -102186 -454867 59912 303453 46572 -197189
2163 -197189 -215498 -28727 78881 -143976 -56312 158285 5604 109163 92070 231416
2153 231416 274254 335162 457902 461756 158736 155385 -71554 137559 250409 42490 -162527
2142 -162527 51385 299761 355511 13321 -93547 77804 347793 350347 201108 5080
2132 5080 -225675 12429 182307 -70535 -39776 8436 1522 57723 443404 727509 571418
$$ [...]
##END NTUPLES=NMR SPECTRUM
##END=
