##TITLE=Analysis number 322180
Compound Code cc 61914
Project Code adrs
Chemist Name endeavour
##JCAMPDX= 6.0         $$ Bruker NMR JCAMP-DX V2.0
##DATA TYPE= NMR SPECTRUM
##DATA CLASS= NTUPLES
##ORIGIN= Bruker BioSpin GmbH
##OWNER= nmr
$$ XWIN-NMR		Version 3.5
$$ Fri Sep 15 12:09:17 2006 GMT Daylight Time (UT+1h)  MAYBRIDGE\nmr@NMR_250MHZ
##.OBSERVE FREQUENCY= 250.131544655141
##.OBSERVE NUCLEUS= ^1H
##.ACQUISITION MODE= SIMULTANEOUS (DQD)
##.ACQUISITION SCHEME= undefined
##.AVERAGES= 16
##.DIGITISER RES= 18
##SPECTROMETER/DATA SYSTEM= dpx250
##.PULSE SEQUENCE= zg30
##.SOLVENT NAME= CDCl3
##.SHIFT REFERENCE= (INTERNAL, CDCl3, 0, 16.522)
##AUDIT TRAIL= $$ (NUMBER, WHEN, WHO, WHERE, WHAT)
$$ ##TITLE= Audit trail, XWIN-NMR		Version 3.5
$$ ##JCAMPDX= 5.01
$$ ##ORIGIN= Bruker BioSpin GmbH
$$ ##OWNER= nmr
$$ C:\u/data/dgb/nmr/ADRS/820/pdata/1/auditp.txt
$$ ##AUDIT TRAIL=  $$ (NUMBER, WHEN, WHO, WHERE, WHAT)
(   1,<2006-09-15 12:08:52.66 +100>,<MAYBRIDGE\nmr>,<NMR_250MHZ>,
      <created by zg, POWCHK disabled, PULCHK disabled
       configuration hash MD5:
       E2 DF 36 D8 04 B2 41 60 5A D7 A3 38 5A 4B D0 FE
       data hash MD5: 64K
       A8 EF 97 EC 85 95 F3 B1 19 F3 C2 7E 83 C8 EA E2>)
(   2,<2006-09-15 12:09:07.18 +100>,<MAYBRIDGE\nmr>,<NMR_250MHZ>,
      <Start of raw data processing
       ef LB = 0.3 FT_mod = 6 PKNL = 1 SI = 32K 
       data hash MD5: 32K
       39 E9 BF BD 97 05 20 92 77 D5 FE CE 31 2E FF 1C>)
(   3,<2006-09-15 12:09:09.89 +100>,<MAYBRIDGE\nmr>,<NMR_250MHZ>,
      <apk 
       data hash MD5: 32K
       27 34 1F 49 D7 3E F4 7D BE 63 3D 7F D9 B7 0E 02>)
(   4,<2006-09-15 12:09:10.75 +100>,<MAYBRIDGE\nmr>,<NMR_250MHZ>,
      <abs ABSG = 5 
       data hash MD5: 32K
       FB 9E 63 BB 61 2C 28 4F 06 47 14 85 89 E1 40 00>)
$$ ##END=
$$ 
$$ hash MD5
$$ 11 CC 23 51 FE 17 9A 27 EC C7 8D E7 1C 29 A8 DB
##$RELAX= 
##$RELAX= 
##$RELAX= 
##$RELAX= 
##$RELAX= 
##$RELAX= 
##$RELAX= 
$$ Bruker specific parameters
$$ --------------------------
##$DU= <C:\u>
##$EXPNO= 820
##$NAME= <ADRS>
##$PROCNO= 1
##$TYPE= <nmr>
##$USER= <dgb>
##$AMP= (0..31)
100 100 100 100 100 100 100 100 100 100 100 100 100 100 100 100 100 100 
100 100 100 100 100 100 100 100 100 100 100 100 100 100 
##$AQSEQ= 0
##$AQ_mod= 3
##$AUNM= <au_zg>
##$AUTOPOS= <50 >
##$BF1= 250.13
##$BF2= 250.13
##$BF3= 250.13
##$BF4= 250.13
##$BF5= 500.13
##$BF6= 500.13
##$BF7= 500.13
##$BF8= 500.13
##$BYTORDA= 1
##$CFDGTYP= 0
##$CFRGTYP= 5
##$CHEMSTR= <none>
##$CNST= (0..31)
1 1 145 1 1 1 1 1 1 1 1 1 1 1 1 1 1 1 1 1 1 1 1 1 1 1 1 1 1 1 1 1 
##$CPDPRG= <>
##$CPDPRG1= <>
##$CPDPRG2= <>
##$CPDPRG3= <>
##$CPDPRG4= <mlev>
##$CPDPRG5= <mlev>
##$CPDPRG6= <mlev>
##$CPDPRG7= <mlev>
##$CPDPRG8= <mlev>
##$CPDPRGB= <>
##$CPDPRGT= <>
##$D= (0..31)
0 1 0 0 0 0 0 0 0 0.06 0 0 0 0 0 0 0.0002 0 0 0 0 0 0 0 0 0 0 0 0 0 0 
0 
##$DATE= 1158318531
##$DBL= (0..7)
120 120 120 120 120 120 120 120 
##$DBP= (0..7)
150 150 150 150 150 150 150 150 
##$DBP07= 0
##$DBPNAM0= <>
##$DBPNAM1= <>
##$DBPNAM2= <>
$$ [...]
##$SUBNAM7= <"">
##$SUBNAM8= <"">
##$SUBNAM9= <"">
##$SW= 20.6930455092707
##$SWIBOX= (0..15)
0 0 3 0 0 0 0 0 0 0 0 0 0 0 0 0 
##$SW_h= 5175.983436853
##$TD= 65536
##$TD0= 1
##$TE= 296.16
##$TE2= 300
##$TE3= 300
##$TEG= 300
##$TL= (0..7)
0 120 120 120 120 120 120 120 
##$TP= (0..7)
150 150 150 150 150 150 150 150 
##$TP07= 0
##$TPNAME0= <>
##$TPNAME1= <>
##$TPNAME2= <>
##$TPNAME3= <>
##$TPNAME4= <>
##$TPNAME5= <>
##$TPNAME6= <>
##$TPNAME7= <>
##$TPOAL= (0..7)
0.5 0.5 0.5 0.5 0.5 0.5 0.5 0.5 
##$TPOFFS= (0..7)
0 0 0 0 0 0 0 0 
##$TUNHIN= 0
##$TUNHOUT= 0
##$TUNXOUT= 0
##$USERA1= <user>
##$USERA2= <user>
##$USERA3= <user>
##$USERA4= <user>
##$USERA5= <user>
##$V9= 5
##$VALIST= <valist>
##$VCLIST= <CCCCCCCCCCCCCCC>
##$VD= 0
##$VDLIST= <DDDDDDDDDDDDDDD>
##$VPLIST= <PPPPPPPPPPPPPPP>
##$VTLIST= <TTTTTTTTTTTTTTT>
##$WBST= 1024
##$WBSW= 4
##$XGAIN= (0..3)
0 0 0 0 
##$XL= 0
##$YL= 0
##$YMAX_a= 553345
##$YMIN_a= -587361
##$ZGOPTNS= <>
##$ZL1= 120
##$ZL2= 120
##$ZL3= 120
##$ZL4= 120
##$ABSF1= 16.522
##$ABSF2= -4.171173
##$ABSG= 5
##$ABSL= 3
##$ALPHA= 0
##$AQORDER= 0
##$ASSFAC= 0
##$ASSFACI= 0
##$ASSFACX= 0
##$ASSWID= 0
##$AUNMP= <proc_1d>
##$AZFE= 0.1
##$AZFW= 0.1
##$BCFW= 0
##$BC_mod= 0
##$BYTORDP= 0
##$COROFFS= 0
##$CY= 12.5
##$DATMOD= 1
##$DC= 0
##$DFILT= <>
##$DTYPP= 0
##$F1P= 14.0000005364418
##$F2P= -0.99999901652339
##$FCOR= 0.5
##$FTSIZE= 32768
##$FT_mod= 6
##$GAMMA= 0
##$GB= 0
##$INTBC= 1
##$INTSCL= 1
##$ISEN= 128
##$LB= 0.3
##$LEV0= 0
##$LPBIN= 0
##$MAXI= 10000
##$MC2= 0
##$MEAN= 0
##$ME_mod= 0
##$MI= 0
##$NCOEF= 0
##$NC_proc= -5
##$NLEV= 6
##$NOISF1= 0
##$NOISF2= 0
##$NSP= 0
##$NTH_PI= 0
##$NZP= 0
##$OFFSET= 16.522
##$PC= 1
##$PHC0= -23.20026
##$PHC1= 31.08697
##$PH_mod= 1
##$PKNL= yes
##$PPARMOD= 0
##$PSCAL= 4
##$PSIGN= 0
##$REVERSE= no
##$SF= 250.13
##$SI= 32768
##$SIGF1= 0
##$SIGF2= 0
##$SINO= 400
##$SIOLD= 32768
##$SREGLST= <1H.CDCl3>
##$SSB= 0
##$STSI= 32768
##$STSR= 0
##$SW_p= 5175.98343685301
##$SYMM= 0
##$S_DEV= 0
##$TDeff= 65536
##$TDoff= 0
##$TI= <Analysis number 999999
Compound Code 99
Book Reference 9
Project Code 9>
##$TILT= no
##$TM1= 0
##$TM2= 0
##$TOPLEV= 0
##$USERP1= <user>
##$USERP2= <user>
##$USERP3= <user>
##$USERP4= <user>
##$USERP5= <user>
##$WDW= 1
##$XDIM= 32768
##$YMAX_p= 417044062
##$YMIN_p= -80076
$$ End of Bruker specific parameters
$$ ---------------------------------
##NTUPLES= NMR SPECTRUM
##VAR_NAME=  FREQUENCY,     SPECTRUM/REAL,   SPECTRUM/IMAG
##SYMBOL=    X,             R,               I
##VAR_TYPE=  INDEPENDENT,   DEPENDENT,       DEPENDENT
##VAR_FORM=  AFFN,          ASDF,            ASDF
##VAR_DIM=   32768,         32768,           32768
##UNITS=     HZ,            ARBITRARY UNITS, ARBITRARY UNITS
##FACTOR=    0.157963299565203, 1,           1
##FIRST=     4132.6476996994, 0,             0
##LAST=      -1043.33573715361, 0,           0
##MIN=       -1043.33573715361, -80076,      0
##MAX=       4132.6476996994, 417044062,     0
$$ Real data points
##PAGE= N=1
##DATA TABLE= (X++(R..R)), XYDATA
$$ [...]
16420a2961N677k175J6957J307P29l541M359K341j692j0242o009L73J6207J4196
16406B5526l680m698n88l679k8340j0271M454N768l400o582p21j6178Q014K5258
16392i117K1189J188K0126J16k5637j73j3630J5431R898j2539j4635R871Q281
16379A0369n896r957j543L138K291k1965J507J1057P778J2744p442p494N671j4668
16365a4410l246J0120J0033N514L272j2282J61J9423J7107J8289p995j9439N347
16352C1894J9032k299l0008l8997j1538Q015O905R918J6695j350J404k3936J199
16339a3066P698J7733J4016l651j4335k677J7925L088j5979J6141J4832J1362
16327E3087m498q357j7972o992o700J5937N215R287J0195r667j2873j5350r113
$$ plain form
16420 -12961 -7284 -9459 7498 8805 9534 5993 10352 12693 11001 759 -5250 -4877 11330 25526
16406 25526 21846 17148 16560 12881 -15459 -25730 -21276 -15508 -18908 -25490 -26211 -42389 -34375 -9117
16392 -9117 12072 13260 33386 33502 7865 7692 -5938 9493 19391 6852 -7783 2088 10369
16379 10369 4473 -5484 -7027 -3889 -1598 -23563 -22056 -10999 -3221 9523 2081 -5413 258 -14410
16365 -14410 -17656 -7536 2497 8011 11283 -999 -838 18585 35692 53981 45986 26547 31894
16352 31894 50926 48627 18619 -20378 -31916 -23901 -16996 -7078 9617 8267 9671 -14265 -13066
16339 -13066 -5368 12365 26381 22730 8395 5718 23643 26731 10752 26893 41725 53087
16327 53087 48589 40232 22260 15268 8568 24505 29720 39007 49202 39535 26662 11312 2199
16314B199R84K986j38J4521J3714L314n563J4088J540j512j2481j6117j1444O829
16300A2920R056O908K0163O050k4158k5447j536r182J5773L533K222L552j7817
16287B037q676J1434L360J2813n32j1869k3808k743j860L174J733o873K3426O214
16273G830p903M325J0815j1204q052J938j287K478J19J9619J5605j496o007m867
16259B1913j1248K001j1716p73m866k4947L437R523M444J0520K7861M741O823
16246C7713J57k4178q326l306k3504j3163J8628J1625P624K936l30J4722J4743
16233C5341k1032j5315J346J6127r010j1781p49J3792k66j7252K3578K7001J8856
16220F0636n616j0701j3415M510j2389r785j497J7207J2692M314p229k4520K683
$$ plain form
16314 2199 3183 6169 6031 20552 34266 37580 32017 46105 47645 46133 33652 17535 6091 12920
16300 12920 21976 28884 49047 55097 30939 5492 3956 -5226 10547 14080 16302 19854 2037
16287 2037 -6639 4795 8155 20968 20436 8567 -15241 -17984 -19844 -16670 -14937 -21810 1616 7830
16273 7830 -73 4252 15067 3863 -4189 -2251 -3538 -1060 -941 18678 34283 32787 26780 21913
16259 21913 10665 12666 950 177 -4689 -29636 -26199 -16676 -12232 -1712 26149 30890 37713
16246 37713 37870 13692 5366 2060 -21444 -34607 -15979 -4354 3270 6206 5876 20598 35341
16233 35341 14309 -1006 340 16467 7457 -4324 -5073 8719 8453 -8799 14779 41780 60636
16220 60636 55020 44319 30904 35414 23025 13240 11743 28950 41642 45956 38727 14207 16890
16207A6890M697k969p764N840J1794J3969j2086j3813j2739j1582k895L5105N712
16194C0159n396j1968j3789k994R683P487J2051J421n768j9199L243M436p212
16181B154p184o787J9142j152N533K3891N033j3037k8718J6919K440n737J0475
16168B2972j1006o925l09j5005m041P345J0139Q386J1212L237p560o21j2870j633
16154C321J5752j9239j3289M78J4219J4578Q011n123o658j1349r561O459K1020
16141A8619J40J4342j875k1509k3355Q101J2944J7949R266R737J2256p708q985
16128C9922q643j3516n932k0213J1140P620K631K5116P689k2938k2Q453j0297
16115B1010J5173J3192n295P85j3324k238P099J1210p343l1827j1303k999q855
$$ plain form
16207 16890 21587 18618 10854 16694 28488 42457 30371 16558 3819 -7763 -10658 24447 30159
16194 30159 24763 12795 -994 -3988 5695 13182 25233 26654 20886 1687 4930 9366 2154
16181 2154 -5030 -11817 7325 6173 11706 35597 40630 27593 -1125 15794 18234 12497 22972
16168 22972 11966 5041 4732 -10273 -14314 -6969 3170 11556 22768 26005 18445 17824 4954 3321
16154 3321 19073 -166 -13455 -12977 1242 15820 23831 18708 12050 701 -8860 -2401 18619
16141 18619 18759 33101 31226 9717 -13638 -5537 7407 25356 34622 44359 56615 48907 39922
16128 39922 31279 17763 11831 -8382 2758 10378 13009 38125 45814 22876 22854 31307 21010
16115 21010 36183 49375 44080 44865 31541 29303 36402 47612 40269 8442 -2861 -5860 -14715
16102a4715L953K1445Q390n905k781j428j906j4859J2055J3042j188j9518J372
16089b043J2399O546O110r06k412n501l034j2727R989N622j5117j0590n607q91
16075a8162M128n589j38J1587J0643o59n156J6331N358l793j2438L067J3873N450
16061B4502j131j6194m265p69l729k220K0160M321q200p372n589L555P329Q216
16047A8614J710J2449J247n964k0752M528M998k1761l102J0865k64j8182K6330
16034A0716J0235j0633p622n947M229N297j676p750R653R527r515j4838P324N401
16020D401M473M584M004K1321J2801k6930j173m496k0384k6j915P877O165j033
16006I669j1090k856K3282J2175j2526j7849k3678J629Q852l846M99J4598J0416
$$ plain form
16102 -14715 -10762 10683 19073 13168 10387 8959 7053 -7806 4249 17291 16103 -3415 -2043
16089 -2043 10356 16902 23012 22106 19694 14193 11159 -1568 8421 14043 -1074 -11664 -17271 -18162
16075 -18162 -14034 -19623 -19761 -8174 2469 1810 -3346 12985 18343 14550 2112 5179 19052 24502
16061 24502 23371 7177 2912 2143 -1586 -3806 16354 20675 12475 5103 -486 3069 10398 18614
16047 18614 20324 32773 34020 28056 7304 11832 16830 -4931 -8033 2832 2568 -15614 10716
16034 10716 20951 10318 2696 -3251 978 6275 4599 -3151 6502 16029 6514 -8324 -1000 4401
16020 4401 8874 13458 17462 38783 51584 24654 23481 18985 -1399 -1425 -3340 4537 10702 9669
16006 9669 -1421 -4277 19005 31180 18654 805 -22873 -21244 -12392 -16238 -15739 -1141 9275
15993I275p339K99R841o568j6317o485P837P511l923j2770m17n958o25R710L688
15978a2241K0735J5523J5298M638p239n614j4654k0520J90m468Q41J2023J2862
15965A7374J6747j1923p487n13j518J0291p798j5047m947p64L540n30r602J4293
15951B116K1587M897l638k2628j6810J8108J1321n02J0321J917K3659L261j3206
15938D0403j8143J4541j742Q463o297j5071K5693R673q073k290j1469k2349k2182
15925h843r153K1134K4693J2857k0320p077J8539J2358J0394m575j2412l6090
15913A505j952L0484m891O057J3147j2099M834q602j0005K705p228j6936N222
15900B241J3344Q455k680J2278L882q433k356J696R813J6124j1367j6116j4947
$$ plain form
15993 9275 1936 2235 12076 5508 -10809 -17294 -9457 -1946 -5869 -18639 -19056 -25014 -25639 -15929 -12241
15978 -12241 8494 24017 39315 43953 36714 31100 16446 -4074 -3884 -8352 -7511 4512 17374
15965 17374 34121 22198 14711 14198 12680 22971 15173 126 -4821 -5585 -2045 -2575 -12177 2116
15951 2116 23703 28600 24962 2334 -14476 3632 14953 14451 24772 26689 50348 53609 40403
15938 40403 22260 36801 35059 43522 37225 22154 47847 57520 49447 47157 35688 13339 -8843
15925 -8843 -17996 3138 27831 40688 20368 13291 31830 44188 54582 50007 37595 1505
15913 1505 -447 30037 25146 31203 44350 32251 37085 28483 18478 21183 13955 -2981 2241
15900 2241 15585 24040 21360 33638 37520 29087 26731 28427 38240 54364 42997 26881 11934
15887A1934J3445J0019q35q845j3435l197m412n962L727j177M725J9617j6136
15874I468l2820r447L553P304K0285J0930n313O262k377r493O974J4248J168J3077
15860C3819O151O025j4979K702R431k0206k7423j3924L844m475L744N233J0045
15847a3j065J2731J3727N064m312J0394J4367j638k4193j8313J0085p72j528k0733
15833f199k073m212j656J2577O931J5791K0898Q615j89j8747r962n141n90j8208
15819b165n002J4122N181M263j2876l157J5469J754J1865J4029L718j3765R995
15806D3431k464k1510K9856K7068j4770k1198p170R68J3673n317j4169j645l918
15793B2835j0421J1218J2084O918k487n436j1362j2712J3792J8262o649j0389
$$ plain form
15887 11934 25379 35398 34563 25718 12283 9086 4674 -1288 2439 1262 5987 25604 9468
15874 9468 -23352 -32799 -29246 -21942 -1657 9273 3960 10222 7845 -1648 5326 19574 20742 33819
15860 33819 39970 45995 31016 33718 43149 22943 -4480 -18404 -14560 -19035 -15291 -10058 -13
15847 -13 -1078 11653 25380 30444 26132 36526 50893 49255 25062 6749 16834 16062 14534 -6199
15833 -6199 -8272 -12484 -14140 -1563 5368 21159 42057 50672 50483 31736 21774 16633 16043 -2165
15819 -2165 -7167 6955 12136 16399 3523 366 15835 17589 29454 43483 47201 33436 43431
15806 43431 40967 19457 49313 76381 61611 40413 33243 34211 47884 42567 28398 26753 22835
15793 22835 12414 23632 35716 42634 40147 34711 23349 10637 24429 42691 36042 25653
15781B5653J918J276k1168J8754K696L47j455m857J1831J0926n010K313k281k0490
15767B0453j7349j1189q989K1223J0184P0j9276K1959J8644p032k1181J5954J873
15754B5344l956k467j8422p692O44J272J3020P779K573L117m739R413K4620j3514
15740C6992q114j2966m570o856Q075J3630n546j8289q922K701J3190K3905J857
15727C5087m216n651p902J2997n226r638P972O435N830j346o475J0126M076k8154
15713A3915m611J4542J3428J0302M224q610j4197K472P361Q573O428k275L363
15700E4915j3571j0720J9504r417j3229j6467k067q911P091k244l475J3271R160
15687B3840j0909j1212K2951K0076J2398j2196K913j1904j0995l203J6475O45
$$ plain form
15781 25653 27571 28847 7679 26433 29129 29476 28021 23164 34995 45921 40911 43224 40943 20453
15767 20453 3104 -8085 -17074 4149 14333 14403 -4873 17086 35730 28698 7517 23471 25344
15754 25344 21388 18921 499 -7193 -6549 -5277 7743 15522 18095 21212 16473 25886 50506 36992
15740 36992 28878 15912 11342 4486 12561 26191 20645 2356 -6566 -3865 9325 33230 35087
15727 35087 30871 25220 17318 30315 25089 15451 23423 29858 35688 34342 27867 37993 42069 13915
15713 13915 9304 23846 37274 47576 51800 43190 28993 31465 38826 47399 53827 51552 54915
15700 54915 41344 30624 50128 40711 27482 11015 8948 37 7128 4884 1409 14680 23840
15687 23840 12931 1719 24670 44746 57144 44948 47861 35957 24962 21759 38234 38879
15675C8879j3356O675J1275n011j2798j4112Q04N820J401j2382J2411K2620p913
15662C4313k2884J953J4964J4525N60J7202r826j8323j9513j3423L945K5012K1443
15649D9948j3147j9869j352O997M063r936J48K4029j2017k8237n442O489K1214
15636B2888P478O000j633L1317Q159l1371j7511J3827Q255Q499p818j2899k4826
15623A0365j8563J8203J6615j143k138J1440O908j2214q785L607J2026O531P160
15610E0012j461Q040O241K328l561r899M359k8434l759J4657k4119J63K2522J5177
15596E2266K0266J7543J1017m683j1713j3766j4772r035j0403j9m842N272R169
15583D6300p991J5341j863O444n911j226O169q956k1479J1325J4544k648M644
$$ plain form
15675 38879 25523 32198 43473 38462 25664 11552 12356 18176 19577 7195 19606 42226 34313
15662 34313 11429 13382 28346 42871 43431 60633 50807 32484 12971 -452 3493 28505 49948
15649 49948 36801 16932 15580 22577 26640 16704 16852 40881 28864 627 -4815 1674 22888
15636 22888 30366 36366 34733 66050 74209 42838 25327 39154 47409 55908 48090 35191 10365
15623 10365 -8198 10005 26620 25477 23339 34779 41687 29473 20688 24295 36321 42852 50012
15610 50012 48551 56591 62832 65160 61599 51700 56059 27625 23866 38523 14404 14567 37089 52266
15596 52266 72532 90075 101092 96409 84696 70930 56158 47123 36720 36701 31859 37131 46300
15583 46300 38309 53650 51787 58231 52320 51094 57263 48307 26828 38153 52697 50049 54693
15570E4693j0585j3322k6868O194K8980j942N587J8503j0307k1116q903j4757
15558F157O865J979J1426q586K910K3798Q832j3076O380p539j1905j3582K1936
15545C5595M832j2752p5M762P781K4296p250k5618m85J2737J7357J352q643o327
15531D7562j6147J5410p766k0113M305J200n781m765O854R506J0212J0386O417
15518E7280k3061o776n08R09O131r381M477J6240N298m137j1597K531J1481k0992
15504B7895o246J8061j812j7427J2922J0040M28r54M864n005l204j7105j5165
15491G292K67J8589J7411j5024n263k381M592j379q667K4386L78k3171n772p907
15477C351l817N79n301q589M1538K7435J1273k316j7283O749j2934j6083K3549
$$ plain form
15570 54693 44108 30786 3918 10112 39092 37150 42737 61240 50933 29817 20914 6157
15558 6157 13022 15001 26427 17841 20751 44549 53381 40305 46685 39146 27241 13659 35595
15545 35595 40427 27675 27600 32362 40143 64439 57189 31571 31086 43823 61180 62532 53889 47562
15531 47562 31415 46825 39059 18946 23251 24451 18670 13905 20759 30265 40477 50863 57280
15518 57280 34219 27443 26935 27844 33975 24594 29071 45311 50609 46472 34875 37406 48887 27895
15504 27895 21649 39710 37898 20471 33393 43433 43861 42907 47771 42766 39562 22457 7292
15491 7292 7559 26148 43559 28535 23272 20891 25483 24104 15437 39823 40201 17030 11258 3351
15477 3351 -466 113 -5188 -13777 27761 55196 66469 64153 46870 53619 40685 24602 48151
15464D8151M109J090q716o882j0977j0010N299K2882P462K740m24l6l1481l459
15450A9748P540N050J5620K1387l073j3168O084j0871j7541k1282o892J2677j426
15437A3853M996J1362r548k07j6553J2138J5021J1679J5858J2023l781r910N544
15424F2475o718q314K619K529M85j5776r601k790L800k1685J4351o999M236J4761
15410C3373j125J271J1181J2881j6261j0008J4726L043M577J5365K431j8184r105
15397D4165N593n266L23m552m308l482P371l656O406K0839K480Q851j2169m733
15383E7862j1175J223j4705O683J520o609j011q044J4655K5400j9949q960M330
15370D1220p149j487N112R505p354n958Q195P183O168l992j2057q354K3827J9871
$$ plain form
15464 48151 52260 53350 44634 37752 26775 16765 22064 44946 52408 55148 54724 54688 23207 19748
15450 19748 27288 32338 47958 69345 66272 53104 59188 48317 30776 9494 2602 15279 13853
15437 13853 18849 30211 20663 20456 3903 16041 31062 42741 58599 70622 66841 56931 62475
15424 62475 55757 47443 50062 52591 53076 37300 27699 24909 28709 7024 21375 14376 18612 33373
15410 33373 32248 33519 44700 57581 41320 31312 46038 49081 53658 69023 71454 53270 44165
15397 44165 49758 44492 44815 40263 35955 32473 39844 36188 42594 63433 65913 74764 62595 57862
15383 57862 46687 47910 33205 39888 41408 34799 33788 25744 40399 65799 45850 36890 41220
15370 41220 34071 32584 37696 47201 39847 33889 42084 49267 55435 51443 39386 31032 54859 74730
15356G4730m759r210o774j916k877k2129J0971q203o567N914J0278J374j487J868
15342D1213O380L584o311k626p765J1427K503j5861R287K2982j1487j5204J5688
15329E3810O744k3789J185K0920P168r480l186M945J1382o86M554P063K392j2046
15315G0976j5553n84L584J317M58j7290n081P820J3126L938j7212j0670J833P456
15301D4118k443J4149r874j1467j3610r6K889N416N826J7632P715P404J3301j157
15287G9803J3739j7716j5936K361n51J3512k784p780k7722o963J0977J9303J9976
15274H0219p60j3533j0533j2348r105j5688J9986j2667p6J2190L156j801N13M650
15260D4203J400p134K5783l975q791J462J8380K352j608k8417r569j1464K0268
$$ plain form
15356 74730 69971 60761 53987 52071 49194 27065 38036 29833 23266 29180 39458 40832 39345 41213
15342 41213 47593 51177 44866 42240 34475 45902 48405 32544 41831 64813 53326 38122 53810
15329 53810 60554 36765 37950 58870 66038 56558 53372 58317 69699 69013 73567 80630 83022 70976
15315 70976 55423 54839 58423 59740 60198 42908 37827 45647 58773 62711 45499 34829 36662 44118
15301 44118 41675 55824 45950 34483 20873 20777 23666 29082 34908 52540 60255 67659 80960 79803
15287 79803 93542 75826 59890 62251 61700 75212 72428 64648 36926 29963 40940 60243 80219
15274 80219 79459 65926 55393 43045 33940 18252 38238 25571 25495 37685 40841 39040 39553 44203
15260 44203 45603 38469 64252 60277 51486 52948 71328 73680 72072 43655 34086 22622 42890
15247D2890J0911j5215k976K3730L475L179j0211j6571k024j0479O970J3841j954
15234D5566j8536J0919L1057J1196j4912P43j3364k7261M952O676L683p901J1028
15221D3846n547J1373J4405O926r424J5801j964k1705r404m597R874P381J2164
15208F9129n406L233j1436m894J0396O532J1274j1224q298j9919J952K3261l975
15195F0625k0925j1846M295k719P194J4940n687j3197k0378J9948K1038q293j8068
15182B6927J5851K4455L233k6214j3251J0608K7157K2789J2647k2268r530j7489
15170E4915j5656O265J4818p081l734J341N342J216J2819M699o859l2021n661
15157C0403q71l79K259J0724K742J3882j576j1573Q588J7238K72n772K4241n413
$$ plain form
15247 42890 53801 38586 35610 59340 62815 65994 55783 39212 37188 26709 33679 47520 45566
15234 45566 27030 37949 69006 80202 65290 66033 52669 25408 30360 37036 40719 32818 43846
15221 43846 38299 49672 64077 71003 61579 77380 75416 53711 44307 39710 49584 56965 69129
15208 69129 63723 66956 55520 50626 61022 67554 78828 67604 59306 39387 41339 64600 60625
15195 60625 39700 27854 32149 29430 36624 51564 45877 32680 12302 32250 53288 44995 26927
15182 26927 42778 67233 70466 44252 31001 41609 68766 91555 104202 81934 72404 54915
15170 54915 39259 45524 60342 53261 49527 50868 56210 57426 70245 74944 68085 36064 30403
15157 30403 29532 29153 31412 42136 44878 58760 57184 45611 54199 71437 71709 65937 90178 84765
15143H4765k3910o893L761n377k451o712j4749P354O714J7384Q021J507L71J7693
15129H7478p783k9132j5271J1385q067k877J2725J9311m99o455M7M070j3703k896
15115D8333J1508L52l713k398N484J297L720R753J4204n583j4463j8470L915j8820
15101C5119N613K9383N399L178J140j4231j6301j7629R513K7344p229j0243j4335
15088C6721K6821J9433J544j0965j541j5854J2863K324l779p254N970l570j9692
15075D3021O033M063m636J426P576O010M267j2330N58M213L81J0242J4359J039
15061H6222M257J582j1352r345o719j9426O559K699J8673J8368r815K4744n837
15048A00610j649j1467n237O813j1448k0346p833J4707L718q370j8192L358P404
$$ plain form
15143 84765 60855 53962 57723 52346 49895 43183 28434 35788 42502 59886 67907 69414 69785 87478
15129 87478 79695 50563 35292 46677 38610 35733 48458 67769 67270 60815 60862 64932 51229 48333
15115 48333 59841 60193 56480 54082 59566 60863 64583 74336 88540 82957 68494 50024 53939 35119
15101 35119 40732 70115 75514 78692 79832 65601 49300 31671 41184 68528 61299 51056 36721
15088 36721 63542 82975 84519 73554 72013 56159 69022 71346 67567 60313 66283 62713 43021
15075 43021 49054 53117 48481 49907 57483 63493 67760 55430 55988 60201 60582 70824 85183 86222
15061 86222 90479 92061 80709 71364 64645 45219 51778 54477 73150 91518 81703 106447 100610
15048 100610 98961 87494 82257 89070 77622 57276 49443 64150 67868 59498 41306 44664 52068
15035E2068j0545R997J2838N617o201j132n980R12j4799o2P931P034j1695M971
15021E0954J4809N33l606J2531Q009J506j7702M575J9327p141n150l385j3771
15008F1489j5064R133J7567k610o510O099j3505P706J3581o38R254m643j9840
14995F2019q128L0272n396k1496K094K3553K5208j549j1629p379n270Q880k3609
14982F7570j5501L591J8785L925p356N831L7210J2312j837k4720k3163j5909j0450
14969E0288L9405K0216P3L243K058q132j7902o104J5349n134k912j2954O132J2359
14955I5985J0736k812j5410M957j561q868J553q225J315K025j8586L958o241o300
14941E2526J0627p248k5663J8601L8677J025Q282R423k705j0081R27J4959J4583
$$ plain form
15035 52068 41523 51520 64358 69975 63774 62642 56662 57574 42775 42713 50644 57678 45983 50954
15021 50954 65763 66296 62690 75221 83230 84736 67034 71609 90936 83795 78645 75260 61489
15008 61489 46425 55558 73125 70515 64005 70104 56599 64305 77886 77248 86502 81859 62019
14995 62019 53891 84163 78767 57271 59365 82918 108126 106577 94948 87569 82299 91179 67570
14982 67570 52069 55660 74445 78370 71014 76845 114055 126367 124530 99810 76647 60738 50288
14969 50288 89693 109909 109982 113225 115283 107151 89249 83145 98494 93360 90448 77494 83626 95985
14955 95985 106721 103909 88499 93456 91895 83027 84580 76355 77670 79695 61109 65067 58826 52526
14941 52526 63153 55905 30242 48843 87520 88545 96827 106250 103545 93464 94391 109350 123933
14928A23933P948j7170j0788R164M392k3779o752L0973K4630j0564k1168r636
14916A01183q867N557k854k877o583Q981J0333n601k809R767j0380j3162j1733
14903G0955j8816J9872K5914n92N54k358J0148J7529j9174j1298N384M303k0062
14890H2359J8331J1098j4318J3075K1839R147k3715k3692p858p613J1409Q282
14878I8344n348P384j213J1807R07L613j6744N823J0663J1730Q976l5981j6314
14865H3647N902J1234J4220O355j3692j437J4651Q471j2219j4859J119K305j2787
14852I2910M076J4735R737j3948j6158p376R133J3003J1060o220r765R97R952
14839A12136l593k239J9972L656j7116j0635J1797J8534j9650L001p077j444k813
$$ plain form
14928 123933 131881 114711 103923 113087 117479 93700 86948 117921 142551 131987 110819 101183
14916 101183 92316 97873 95019 92142 85559 94540 104873 99272 96463 106230 95850 82688 70955
14903 70955 52139 72011 97925 97333 97887 95529 105677 123206 104032 92734 98118 102421 82359
14890 82359 100690 111788 97470 110545 132384 141531 117816 94124 86266 78653 90062 98344
14878 98344 92996 100380 99167 110974 111881 115494 98750 104573 115236 126966 135942 99961 83647
14865 83647 89549 100783 115003 121358 107666 106229 120880 129351 117132 102273 103392 105697 92910
14852 92910 96986 111721 121458 107510 91352 83976 93109 106112 117172 110952 101187 102184 112136
14839 112136 108543 106304 126276 129932 112816 102181 113978 132512 112862 115863 108786 107342 104529
14826A04529M40Q081K709K667k144K4538J0193k5628k8467j4851p392K2224K6830
14813A23729J8954K748j580O034M320K985j2487m790j7425j317J314r354K1075
14800A34206q394R258J4506M278J2065J815j9449l2093q712J9687j4535k2060
14788I0572p970J1411J2629N518O357J3272l731r510l090r278p61J1964m776l16
14774A12291K446l133P385M452P565N796P616p201M972J0070j852j285J278j0687
14760A39713j0218j5647j8827J113Q762K7442J3741m461j6834m67J7372L378k4140
14747A20927k3968M127q028J5228J3449K0421k479k733J7442J3903j76j8937j1841
14734A37335J505J014Q102n816l507R333J3285J5085m253j6924n495n736r160
$$ plain form
14826 104529 104969 113050 115759 118426 116282 140820 151013 125385 96918 82067 74675 96899 123729
14813 123729 142683 145431 143851 149885 154205 157190 144703 139913 122488 121171 122485 113131 134206
14800 134206 125812 135070 149576 153854 165919 167734 148285 116192 107480 127167 112632 90572
14788 90572 82602 94013 106642 112160 118517 131789 128058 118548 115458 106180 105419 117383 112607 112291
14774 112291 114737 111604 118989 123441 131006 136802 144418 137217 142189 152259 150407 149122 150400 139713
14760 139713 129495 113848 95021 96134 104896 132338 146079 141618 124784 124317 141689 145067 120927
14747 120927 96959 101086 93058 108286 121735 142156 139677 136944 154386 168289 168113 149176 137335
14734 137335 138840 139854 147956 142140 138633 147966 161251 176336 172083 155159 149664 143928 134768
14721A34768o354J9509J0106j1534j3449O633l889m718K05r942P596J4045j1417
14708A31559j1718J3133N397Q07L053J0459l950o620O812n26J2163J9895k249
14695A78215j1517k0969O60K2385J4363r840j9019K098K64J9029K2360J0756k750
14682B06035k1258j5850R860l781j7428j2201K180j525J2340k825r038q098m061
14669A34350j4027j1283N225L5665J9919M605R145L084n912k0781q306l617o716
14656A41351j2720J3339J6522L51k864p20k712L1632J6801P743j8758j1137J9624
14643A98452J6396l555j4423O045j958j6161J0952N913j7985j3177j2893J5648
14631A73254J7561j5939r929K176K1718R476Q049n417k7497J932M006r414O330
$$ plain form
14721 134768 128414 147923 158029 146495 133046 139679 135790 131072 131277 121335 128931 142976 131559
14708 131559 119841 132974 138371 139178 142231 152690 148740 142120 148932 148406 160569 180464 178215
14695 178215 166698 145729 146389 168774 183137 173297 154278 156376 156640 175669 198029 208785 206035
14682 206035 184777 168927 178787 175006 157578 145377 147557 146032 158372 155547 146509 138411 134350
14669 134350 120323 109040 114265 149930 169849 174454 183599 186683 180771 159990 151684 148067 141351
14656 141351 128631 141970 158492 158843 155979 155259 152547 184179 200980 208723 189965 178828 198452
14643 198452 214848 211293 196870 202915 200957 184796 195748 201661 183676 170499 157606 173254
14631 173254 190815 174876 164947 167123 188841 198317 206366 200949 173452 175384 179390 169976 176306
14618A76306p592J932K968n751J247P745m792M244r319j6857M206O600N286J0754
14604A76977j1848j0130J107J7579M038j2351M182K0280r285j4933J7130J4048
14592A96794Q296M248N437m358k0130J1773j0329Q579J5823M266J4730N270R672
14579B50071l095m377J6594M816l0197o285k996k32K395P123N574l073J452m577
14565B33193j4982j3260o655l287J5828L871j4847J1840J6482R066k1401j1794
14553B04054l839n152N41M773r395K7007L3511J145j4163k6003k5757j5390J3111
14540A84443K7469K5055k3647k8754j975J6203J8549K1899N051K164j2479o942
14528B27036J9666M291k5548j8712J992K1401N780k3255o064J7582K2309j796
$$ plain form
14618 176306 168714 170646 173614 167863 169110 176855 172063 176307 166988 150131 154337 160937 166223 176977
14604 176977 165129 154999 156106 173685 177723 165372 169554 189834 180549 165616 182746 196794
14592 196794 205090 209338 214775 210417 190287 202060 191731 200310 216133 220399 235129 240399 250071
14579 250071 246976 242599 259193 264009 233812 227527 224531 224299 226694 233817 239391 236318 237770 233193
14565 233193 218211 204951 198296 195009 210837 214708 199861 211701 228183 237249 215848 204054
14553 204054 200215 195063 195604 200377 190982 217989 251500 252645 238482 212479 186722 171332 184443
14540 184443 211912 236967 213320 184566 182591 198794 217343 239242 244293 246457 233978 227036
14528 227036 246702 250993 225445 206733 208725 230126 235906 212651 206587 224169 246478 244682
14516B44682P028j4068M137J3570J1465j5872k093o105j5383j0430J0465J0644
14504B38040j4975k3170O751k31M693J3470J1306k387m503J2206R480k7343j0890
14491B12447k099J5888N269J3086p733j7039J900Q598O934L041j5124J4902k698
14478B37372P623J510k742L362l085p916o631J4329m280j7759J0714J3107K062
14465B47666J4169J0970J4762R359j251k1809j5769O880l631J839k767k495O472
14452B64395J5664O290O921r958k754q673J5969L2194R861j9985j550J4714l197
14439C19891l1298k1461J0131P538J7570M805j7030M181J6117O9R799k6449n747
14426B88116L792J0955L194l198M441n778j2645J2525L307j9175K553K5086K1348
$$ plain form
14516 244682 251710 237642 241779 255349 266814 250942 248849 242744 227361 216931 227396 238040
14504 238040 223065 199895 206646 206415 211108 224578 235884 233497 228994 241200 250680 223337 212447
14491 212447 210348 226236 231505 244591 236858 219819 221719 230317 237251 240292 225168 240070 237372
14478 237372 244995 246505 243763 247125 244040 236124 229493 243822 239542 221783 232497 245604 247666
14465 247666 261835 272805 287567 296926 295675 273866 258097 264977 261346 263185 260418 257923 264395
14452 264395 280059 286349 293270 283312 280558 271885 287854 320048 329909 309924 308374 323088 319891
14439 319891 288593 267132 277263 284801 302371 307176 290146 294327 310444 310513 320312 293863 288116
14426 288116 291908 302863 306057 302859 307300 301522 288877 301402 304709 285534 288087 313173 334521
14413C34521O108M784p793j2036l356K676j4547q413K4075K8089J1489p424k4393
14400C33780L56R537k190n749q225M770J0290P475N500m712O557L776n913m690
14386C50562J8353k140j6270K8104J6310J4468J3409o108r375r383J7480J3222
14374D28632L828J0321r869J513R564j546j1990j0651M573o193K509J4609L1765
14361D67065K1871j203j3168j0122j099j7258J0439J4413Q380l162O947K495P216
14348D92814j5400j2808j925L839J6921j6873j4717J1786J1215K195j0437k157
14336D64453J1556N07q865k3287K662K1539N035k8743j9021R734M006O715O684
14323D52975o827R931K1636j072Q768k345r839p099l119K9008K5014r556k3622
$$ plain form
14413 334521 340629 345413 337620 325584 322228 324904 310357 301944 326019 354108 365597 358173 333780
14400 333780 334136 343673 341483 335734 327509 332279 342569 350044 355544 350832 357389 361165 355252 350562
14386 350562 368915 366775 350505 378609 394919 409387 422796 416688 407313 397930 415410 428632
14374 428632 432460 442781 432912 434425 443989 442443 430453 419802 424375 418182 420691 435300 467065
14361 467065 488936 487733 474565 464443 463344 446086 456525 470938 479318 476156 483103 485598 492814
14348 492814 477414 464606 462681 466520 483441 466568 451851 463637 474852 477047 466610 464453
14336 464453 476009 476516 467651 444364 447026 468565 473600 444857 425836 435570 439576 446291 452975
14323 452975 446148 456079 477715 476643 485411 483066 473227 466128 463009 492017 517031 507475 483853
14310D83853l0982R993K6232M763l101r227m303P436K098K9480L252O986L6216
14297E62696o118l0359r131j5578n52K615P34J2547Q084r517J3940R699r972N113
14283E34201J0675K4272J8029j4146j0652m405m654M109J5120R907J0304K886
14271E95646K022K0856o25j5299l946K0059Q022J5729J3760r874M919K443j8521
14258F35191l496J4171K1058J9188J1094r916P330R916L1358m007r706N885r89
14245G27077K628P235J1174K0970K4956K3707J3556J6363O047j2176J4822K8807
14233H85166J9559J4995L9305J841l739o534J8165M3098j932m753J0975K4220
14221A040366K6953J2113L2724K8623K6036K0879L6253L1712N140R328N065P821
$$ plain form
14310 483853 452871 462864 489096 493859 490758 481531 477228 484664 486762 516242 519494 526480 562696
14297 562696 556578 526219 517088 501510 500958 503573 504307 516854 524938 515421 529361 539060 529088 534201
14283 534201 544876 569148 587177 573031 562379 557974 553320 557429 572549 582456 592760 595646
14271 595646 597668 618524 617899 602600 598654 618713 626735 642464 656224 646350 651269 653712 635191
14258 635191 631695 645866 666924 686112 697206 687290 694620 704536 735894 731887 722181 728066 727077
14245 727077 729705 736940 748114 769084 794040 817747 831303 847666 853713 841537 856359 885166
14233 885166 904725 919720 959025 960866 957127 950593 968758 1011856 1009924 1005171 1016146 1040366
14221 1040366 1067319 1079432 1112156 1140779 1166815 1187694 1223947 1255659 1260799 1270127 1275192 1283013
14209A283013K9419K4347L1349J6820K1343K3532K0188K4416L1755L6305K9651
14198A572138J8703K9432J3723J7574K8822L7360L2822L1327L1953L4964M6549
14187A895367L4287m071L2848O5006N3091J3661K7266N3891O5239M4687K9222
14176B310494K0834M6662O4842N9753O8154O4397L9340L7189O1708O3382P3239
14165B909994N9710P8433P8971O8071R2831J18048Q6868P8670R7381R8252J09512
14154C876741J04033J26448J06765J14705J33954J35044J54937J51333J31521
14145E035481J65205J61346J86966J91625J75858J93565K11503K18136K14350
14136F754035K18191K28733K41542K60763K72229K81078K59198K66944K55800
$$ plain form
14209 1283013 1312432 1336779 1368128 1384948 1406291 1429823 1450011 1474427 1506182 1542487 1572138
14198 1572138 1590841 1620273 1633996 1651570 1680392 1717752 1750574 1781901 1813854 1848818 1895367
14187 1895367 1929654 1925583 1958431 2023437 2076528 2090189 2117455 2171346 2236585 2281272 2310494
14176 2310494 2331328 2377990 2442832 2502585 2570739 2635136 2674476 2711665 2773373 2836755 2909994
14165 2909994 2969704 3048137 3127108 3195179 3288010 3406058 3492926 3571596 3668977 3767229 3876741
14154 3876741 3980774 4107222 4213987 4328692 4462646 4597690 4752627 4903960 5035481
14145 5035481 5200686 5362032 5548998 5740623 5916481 6110046 6321549 6539685 6754035
14136 6754035 6972226 7200959 7442501 7703264 7975493 8256571 8515769 8782713 9038513
14127I038513K85774K79697K77041K98201K72583K52001K65777K59500K48587
14118A1477674K68957K59649K19964K18085K01896J79690J82586J46015J02646
14109A3257162J05430J01878P9388M9705M9428K4313k3790m0876n1386n5808q5644
14098A3409800j12087j38362j39350j57416j88624k00179k17884k18991k36329
14089A1800578k58512k65367k72885k84607k93154k93067l17470l28271k91899
14080I195346k97221l07801k86287k81508k92012k84788k72183k70326k71873
14071F631347k79225k58712k44970k51375k27860k12120j80101j66216j69275
14062D641493j70111j75058j42653j02902j07273j36562j27028j09467j04306
$$ plain form
14127 9038513 9324287 9603984 9881025 10179226 10451809 10703810 10969587 11229087 11477674
14118 11477674 11746631 12006280 12226244 12444329 12646225 12825915 13008501 13154516 13257162
14109 13257162 13362592 13464470 13543858 13593563 13642991 13667304 13643514 13602638 13551252 13495444 13409800
14098 13409800 13297713 13159351 13020001 12862585 12673961 12473782 12255898 12036907 11800578
14089 11800578 11542066 11276699 11003814 10719207 10426053 10132986 9815516 9487245 9195346
14080 9195346 8898125 8590324 8304037 8022529 7730517 7445729 7173546 6903220 6631347
14071 6631347 6352122 6093410 5848440 5597065 5369205 5157085 4976984 4810768 4641493
14062 4641493 4471382 4296324 4153671 4050769 3943496 3806934 3679906 3570439 3466133
14053C466133j03175r7165j06804j07548n6450p4977r2259o7300o8811o3331n3950
14042B574363n3435n8516n7965l9563m8154n1128n3928n4832l6468m8042m9161
14031B023171m8585o5647o2181m2836l0140n2294m2107k6337k9582k0990m2452
14020A560020k8250j0614m1529l1995j9339j3971j159q950m1582l8179k6691k2297
14008A275464k8303l3050j5300j6757k2109N076j0542o932j1857k866k5930k2057
13996A084837k0243q291o372j5372j2543o930j7476j3116Q059l008L259j2007
13984I80797j8987J484N561r006K596j9231J1210j4401o01N705P704m123n817
13971I42891k1221j1373l368N016O718j2970k0307k892q916L996J8579p613k1837
$$ plain form
14053 3466133 3362958 3265793 3158989 3051441 2994991 2920014 2827755 2760455 2691644 2628313 2574363
14042 2574363 2520928 2462412 2404447 2364884 2316730 2265602 2211674 2156842 2120374 2072332 2023171
14031 2023171 1974586 1908939 1846758 1803922 1773782 1721488 1679381 1653044 1623462 1602472 1560020
14020 1560020 1531770 1521156 1479627 1447632 1428293 1414322 1413163 1404213 1362631 1324452 1297761 1275464
14008 1275464 1247161 1214111 1198811 1182054 1159945 1165021 1154479 1147547 1135690 1132824 1106894 1084837
13996 1084837 1064594 1056303 1049931 1034559 1022016 1015086 997610 984494 992553 989545 992804 980797
13984 980797 961810 963294 968855 959849 962445 943214 954424 940023 939422 945127 952831 948708 942891
13971 942891 921670 910297 906929 911945 918663 905693 885386 882494 873578 877574 896153 888540 866703
13958H66703p875j2055p219k0928j9817j8112J2991q300q693n808k7286M337j0833
13945G37105j8572m731j5166O812r101j8901k6587j902M765j201k0124j7938l699
13932F10760N418j057j0752j2169p473j1986k4641L449o465P037K7423R725j0224
13919E79045l2273k4282m632R799O58q789j7458k484p601q037J850O614o882m054
13905D81474K893l895j1796l388J1616q210p562q152j4958k454j6091J745J5647
13892D36869M143L2239O47k2437k6853o766P84k2463q735q735k64o563q287Q328
13878C71907J8857j951j2784N037l176L385n49k552L0776K497j6076r099j3061
13865C73211k48J2336O78j0972k0750j9217j2163P456N475J1605Q689j8355J424
$$ plain form
13958 866703 858828 846773 839554 818626 798809 780697 793688 785388 776695 770887 743601 747938 737105
13945 737105 718533 713802 698636 705448 696347 677446 650859 648957 653722 652521 632397 614459 610760
13932 610760 616178 615121 604369 592200 584727 572741 548100 551549 545084 552121 579544 589269 579045
13919 579045 546772 522490 517858 527657 528315 519526 502068 499584 491983 483946 485796 492410 485528 481474
13905 481474 484367 480472 468676 465288 476904 468694 461132 452980 438022 435568 419477 421222 436869
13892 436869 441012 473251 473898 451461 424608 417842 418626 396163 387428 378693 378429 371866 363579 371907
13878 371907 390764 388813 376029 381066 377890 381275 380726 378174 408950 411447 395371 386272 373211
13865 373211 372963 385299 385977 375005 354255 335038 322875 330331 335806 347411 356100 337745 339169
13852C39169j5238m80k5387o106j707J3756K6641J5706N40j1328j4170p626j1735
13839C02035M437J2089j2535j705p343K998Q148N266m077m399m484P256j471Q324
13825C14539P507l2049j8270J0254k1983j6806J2476J504o449O651r184j3598
13813B34592Q695N538J0054k1473j1700L105M103K96n891K9227J1600m013j0197
13800B53936J3864P66k3400j4875L187L126j7628k8620J4089K1840p353R47J6554
13787B36433J0215n830K980j404K652K0280J547j0571j747r128r711J384j0827
13774B26273j7871m864q215j3551J2107J3068J1138J354P31m403m46J255M478
13761B21054j6679j6121J1807J2780k2424j9046Q438J3636J5540P962j9351j6991
$$ plain form
13852 339169 323931 323451 298064 291958 290251 304007 330648 346354 346894 335566 321396 313770 302035
13839 302035 306472 318561 306026 304321 296978 299976 308124 313390 309313 304914 300430 307686 306215 314539
13825 314539 322046 289997 271727 281981 259998 243192 255668 257172 250723 257374 248190 234592
13813 234592 243287 248825 258879 237406 225706 228811 232914 233210 227319 256546 268146 264133 253936
13800 253936 267800 268566 245166 230291 233478 236604 218976 190356 204445 226285 218932 219879 236433
13787 236433 246648 240818 243798 242394 245046 265326 266873 256302 254555 245427 235716 237100 226273
13774 226273 208402 203538 195323 181772 193879 206947 218085 219439 220170 215767 215321 216576 221054
13761 221054 204375 188254 200061 212841 190417 171371 179809 193445 208985 216947 197596 180605
13749A80605r709j7286n469R638J6941J4287p138q955j6525P647L5204M135j7214
13736A86161r570o619L934O427M230n786l209K5598J4418l5414k2750l604J1867
13723A65683l61k631L577R962L308N96K462j3520j1380j3669J1766M4233J8248
13710B18274j3896p678o225k7071k978J4438o450j0004j281K033N478q758K393
13697A58275J5143P211n351j920j6270j8486K040j4790M529K2158O549L769O068
13684A68925Q86j8300m689J3224O870J1154o833p286j3887r097n987J7988J7981
13671A70949J5457n881j6867k4096J636K827P472K871l281o455j0816N840k977
13658A36679j6229j417q09J0247J462m340J4320n565N903P433o812k3497r194
$$ plain form
13749 180605 170896 153610 148141 157779 174720 189007 181869 172914 156389 164036 199240 203375 186161
13736 186161 176591 169972 173906 180333 184563 178777 175568 201166 215584 180170 157420 153816 165683
13723 165683 165322 162691 166268 176230 179538 180134 182596 169076 157696 144027 155793 200026 218274
13710 218274 204378 196700 190475 163404 160426 174864 168414 158410 157129 159162 164640 155882 158275
13697 158275 173418 180629 175278 173358 157088 138602 140642 125852 130381 152539 159088 162857 168925
13684 168925 169811 151511 146822 160046 166916 178070 171237 163951 150064 140967 134980 152968 170949
13671 170949 186406 180525 163658 139562 141198 144025 151497 154368 151087 144632 133816 139656 136679
13658 136679 120450 119033 118224 128471 129933 125593 139913 134348 140251 147684 140872 117375 108181
13645A08181K7008K5444R455j0687j9768j1336J265k998N541K506j2049P179J5533
13632A45274J758O237k835o944r093K072N041M460J1773Q525N469k964j9236k6062
13618A23475k233L248k6029j5096J3037K491O231R907J6191J6829o576j4122q247
13605A19106L40R75J271j1496l015n478J8358J7144K95n709M190q250l0937j6950
13591G9844J5138N23O745J0882M082J2485P080k715j7251M847n533p788N473j3287
13577A00525r984K9690R477j6075J5552J7800K387m992o975r625r370K284o196
13564A14498q202J7127M121j67r891r138K9472O815j2929J136r729k6769j5029
13551H1315J5743K2692Q514j8448k6365n80L967L766R108R163m819j6316P214
$$ plain form
13645 108181 135189 160633 170088 159401 139633 128297 129562 126564 132105 134611 122562 129741 145274
13632 145274 147032 153269 150434 143490 134397 136469 141510 145970 157743 166268 171737 168773 149537 123475
13618 123475 121242 124490 98461 83365 96402 98893 105124 115031 131222 148051 141475 127353 119106
13605 119106 119446 120421 121692 110196 107181 101703 120061 137205 137500 131791 135981 127731 96794 79844
13591 79844 94982 95505 102250 113132 117214 129699 136779 134064 116813 121660 116127 108339 113812 100525
13577 100525 90541 120231 129708 113633 129185 146985 149372 144380 137405 127780 118410 120694 114498
13564 114498 106296 123423 127544 127377 117486 108348 137820 144635 131706 132842 123113 96344 81315
13551 81315 97058 119750 128264 109816 83451 82871 86838 90604 99712 108875 104056 87740 94954
13538I4954J9556p333j0924J0834j619j3805j2347l250m091J2067K2725m632P167
13525A09302j2118j0095k5823L713K3471J5096J3178k391k964J64j7762k4159
13513F9612j0631J5426M674K1243q14j6831n725O593l219J2404J4966j6046p573
13500H4079J3934J3539n103q375j7290k1965J1579R57N229o912o09l199j7902
13487D7962J8764J7725N657R918j6651j1719J1909J1533n923N511Q545M464O369
13474A14064j0881j6821J4980J2602j2424k4792n571K1909k0999j7886j473N720
13462E8428J9646K6913R27N72J135n167r073m342O318R713K3009m742j2407k3897
13448H7033l608r233j1113L629L835p394N16O860l418M003K0821J8427K2869q961
$$ plain form
13538 94954 114510 107177 96253 107087 105468 91663 79316 76066 71975 84042 106767 102135 109302
13525 109302 97184 87089 61266 64979 88450 103546 116724 114333 111369 111533 93771 69612
13513 69612 58981 74407 79081 100324 99510 82679 76954 83547 80328 92732 107698 91652 84079
13500 84079 98013 111552 106449 98074 80784 58819 70398 71355 76584 69672 69063 65864 47962
13487 47962 66726 84451 90108 100026 83375 71656 83565 95098 89175 94686 103231 107695 114064
13474 114064 103183 86362 101342 113944 101520 76728 71157 93066 72067 54181 52708 58428
13462 58428 78074 104987 105914 106486 107621 102454 93381 89039 95357 105070 128079 123337 110930 87033
13448 87033 83425 74192 63079 66708 70543 63149 63665 70525 67107 71110 91931 110358 133227 124266
13434A24266k0217l584R281J0994O434o911k2587K146Q26j8922J5584j0693o637
13421G9980J5206m751j4755j3303J878R698J5190K158L111k147j1456k5488o146
13408D9175J5030L917r723R595r49q668M936M665J8600R48N423J4275K797j0409
13394I9612j6492j0886m998K0622J7930m783l292n28M755O299N060p303j2500
13381I3496o440l599p520J8653K443p849m985j5814J2553J6515o062J2108J9215
13368A22714q697j2567j697R016N115Q719k960j4682j2179j9327k0537J3781K3295
13355H9994q51k1611m513J0793j5354J2707J9638n922J6387J6531k926k528k857
13342A09488n440r44r2k3438n777R449P23K627R197j960K273Q656j4101q961M91
$$ plain form
13434 124266 104049 100465 109746 120740 127174 120263 97676 99822 100648 81726 97310 86617 79980
13421 79980 95186 90435 75680 62377 64255 73953 89143 91301 94412 92265 80809 55321 49175
13408 49175 64205 68122 58399 67994 67045 58377 63313 67978 86578 87526 92949 107224 110021 99612
13394 99612 83120 72234 67236 87858 105788 101005 97713 97185 101940 108239 113299 105996 93496
13381 93496 87056 83457 75937 94590 97033 89184 84199 68385 80938 97453 91391 103499 122714
13368 122714 114017 101450 99753 108769 113884 122603 119643 104961 92782 73455 52918 66699 89994
13355 89994 89143 67532 63019 73812 58458 71165 90803 84881 101268 117799 114873 112345 109488
13342 109488 104048 103104 103012 79574 73797 83246 83969 86596 95793 93833 96106 104762 90661 81700 82191
13327H2191j0393j233J6975Q68k2071Q330J8899r548j0390J2388K2338j4008j9525
13314G4821l072Q646j8232M166K539q416J1980J7390K3787N393j0309r280j8092
13301H1321K438Q726J1870J2224k532n559o365J940q860j312J4133q408J0619
13288A10235J316l933j1935P729J2645j1304Q721L496L11J0747n700l0549m950
13275H6829Q010o160k0179K14P755j2290j3364K843J0687r074O711k538M286o143
13261E7587J1455J1802l638k050L394J1423J5965O043j2372o07N436p220j5059
13248H2159j5428O075J9842K148k7770j7700j9914K0032J3861r362j2150M962
13236D6755J4340L3417n116j1850j0937J2571K0388r705p492j4434l257J490N924
$$ plain form
13327 82191 71798 70565 87540 88408 66337 74667 93566 84018 73628 86016 108354 94346 74821
13314 74821 71749 80395 62163 66329 68868 60452 72432 89822 113609 119002 108693 99413 81321
13301 81321 83759 92485 104355 116579 114047 108488 102123 104063 95203 93891 108024 99616 110235
13288 110235 111551 107618 95683 103412 116057 104753 113474 116970 117281 128028 122328 91779 86829
13275 86829 94839 88679 68500 68714 76469 64179 50815 53658 64345 55271 61982 59444 63730 57587
13261 57587 69042 80844 77206 75156 78550 89973 105938 111981 99609 99002 104438 97218 82159
13248 82159 66731 72806 92648 94796 67026 49326 29412 49444 63305 53943 41793 46755
13236 46755 61095 94512 89396 77546 66609 79180 99568 89863 82371 67937 64680 66170 72094
13223G2094J8022J8966O441j0330r03O207P91L693M711p207N743j7603j1119J311
13209I0817J4307J0440j9112n309K5322K5601k4771k6500k139k316j5690J4840
13197H5490J0813P350n660j2976r76K439L0992J130j2690j736J0725J025k7288
13184H8638j7347L296K4021j2827k8265J004J6021K5005J7955k3146o916Q580
13172I6019Q9j5976l1016J7779J7518j2400N063l25k133P072J271j7031R501K3718
13158I9149r276L840j2347k4862P124O410J9439K0681Q579j9690p571o327J2279
13145I7428p490n695j815J7529O850k4595m221j0747p738N5K2664J4768l486K2874
13131A16381k0896n4071R39J4229R335J9786K89L577j7172K443J1749J0811P505
$$ plain form
13223 72094 90116 109082 115523 105193 104290 110497 111288 114981 119692 112485 118228 100625 89506 90817
13209 90817 105124 115564 96452 91143 116465 142066 117295 90795 88656 86340 70650 85490
13197 85490 96303 103653 97993 85017 84041 86480 117472 118602 105912 104176 114901 115926 88638
13184 88638 71291 74587 98608 85781 57516 58520 74541 99546 117501 94355 87439 96019
13172 96019 96108 80132 49116 66895 84413 72013 77076 76751 74618 81690 82961 65930 75431 99149
13158 99149 89873 93713 81366 56504 63628 70038 89477 110158 118737 99047 91476 85149 97428
13145 97428 89938 84243 82428 99957 106807 82212 77991 67244 59506 59561 82225 96993 93507 116381
13131 116381 95485 41414 42353 56582 65917 85703 85992 89569 72397 74840 86589 97400 104905
13118A04905k9k927L970J6744j904l617j078j5920L463M386J342l856j1438r491
13104H4550n295L097J9952p518j7517j0757Q03L8R201J5085q109r776K8931P430
13090A10115j2651j0866R92l269j0180M665P671k5393m993O439r715Q812J5976
13077G7603J3248J1588K351m617n584J690J511P095r249l70j317o750N910O291
13063I9400J0595p156j8792K412J1012l018J1561j3009j336j6750j5254K706J6863
13050G9234k429j2804N42O815O21p943K686K1017P954j1849r110l838k3171j1558
13036C6167J3469J5050j7337k691J7760K953j1019O600J1907j3601q547l94Q222
13023E8539J1481K52j2370M36K442m274J0190P754N959n632j653R343r78l535
$$ plain form
13118 104905 104876 101949 105919 122663 120759 117142 116064 100144 103607 107993 109335 105479 94041 84550
13104 84550 79255 82352 102304 94786 77269 66512 67315 67353 76554 91639 83530 73754 102685 110115
13090 110115 97464 86598 87590 84321 74141 78806 86477 61084 56091 62530 52815 61627 77603
13077 77603 90851 102439 104790 100173 94589 96279 97790 104885 95636 95266 93949 87199 93109 99400
13063 99400 109995 102839 84047 86459 97471 94453 106014 93005 91669 74919 59665 62371 79234
13050 79234 76805 64001 64543 71358 71979 64036 66722 87739 95693 83844 74734 70896 47725 36167
13036 36167 49636 64686 47349 44658 62418 65371 54352 60952 72859 59258 50711 50317 58539
13023 58539 70020 70272 57902 58338 60780 56506 66696 74450 80409 74777 73124 82467 81489 77954
13009G7954J1333l005p577j1063J3947m002j2388K7538J8903p305o238j842m813
12996I1442o711P212l546n79p671J7927J3852j0519N98L425k7244q4O47p864Q703
12981G9588J1022R663J7909O184K628j3163j6290K890p202l0403m449M171J4934
12968G7482q691J636M888K4954J5318k1783k636R01j401J7200k600j8036k8090
12955E9142r218J126J9256P041N11k42J1089J2013K990j3803p555Q030J6265n847
12941A00798j9732m520q340J707l762O257J0162j619K6128n995k0836j8826j1839
12928D9583K1651R214l044J738J4759R28l183m36k0077o620M624J6356Q436j1344
12914H2585j576j1132M800M733L093L663o161j4966p599p273k7915o528M961J4896
$$ plain form
13009 77954 89287 86282 78705 67642 81589 77587 65199 92737 111640 104335 98097 96255 91442
12996 91442 84731 91943 88397 87818 80147 98074 111926 101407 102005 105430 78186 78102 78749 70885 79588
12981 79588 90610 100273 118182 124366 126994 113831 97541 100431 93229 62826 58377 62548 77482
12968 77482 68791 70427 75315 100269 115587 93804 91168 92069 90668 107868 105268 87232 59142
12955 59142 49924 51050 70306 77347 77858 77616 88705 100718 103708 89905 82350 90380 106645 100798
12941 100798 81066 76546 68206 69913 66151 72408 82570 80951 107079 101084 80248 61422 49583
12928 49583 71234 80448 77404 79142 93901 94829 91646 91210 71133 64513 69137 85493 93929 82585
12914 82585 81009 69877 74677 79410 82503 86166 80005 65039 57440 50167 22252 15724 20685 35581
12900C5581O183O254m516j333K0218K2555m09J3292M881n428N024K0246J7872
12887A40420k880k5129k5597j0319J2790j54l588J0327k768J156N685r758q312
12874H1873m171J395J8408K8787j2646k3779j3786J3611P880l77j2949J528J5364
12861A01138J3504k189j1887r623K937J6025j0638q769J022m564j1602k2985J3182
12848F5551J2192k162j3085K1675J6248M961o081j2965K0063M051r410M868J89
12835A06095j0582l776J3822K2285N331L201j499Q854n528k4793j17j4441j30
12822I8722K4947Q368L454N727L183j1386j273R844J7087j7990J4432L5254K966
12809A93335k631j4513j9707M432J947J85j4175r588o829L203l663r962j5296
$$ plain form
12900 35581 41764 48018 43502 42169 62387 84942 84533 97825 102706 97278 102302 122548 140420
12887 140420 137540 112411 86814 76495 89285 89131 85543 95870 93102 94258 99943 90185 81873
12874 81873 77702 79097 97505 126292 113646 89867 76081 89692 97572 97195 84246 85774 101138
12861 101138 114642 112453 100566 90943 93880 109905 99267 90498 91520 86956 75354 52369 65551
12848 65551 77743 75581 62496 84171 100419 105380 99299 86334 106397 110448 101038 105906 106095
12835 106095 95513 91737 105559 127844 133175 136376 134877 143731 138203 113410 113293 98852 98722
12822 98722 123669 132037 135491 141218 144401 133015 131742 141586 158673 140683 155115 190369 193335
12809 193335 190704 176191 156484 160916 162863 163048 148873 139285 132456 135659 131996 122034 106738
12796A06738L259J8548J1333q814m091k308j7364j2470k314r903Q793j1970j3942
12783F5495J0865K963M931J0906k422J2711J4690n405q839P726p459M316M996
12770A15474q285O777q507k1063j752K1103J1286j3006l116Q276O209j3137L891
12757A04150J2463j1081j6214j4067J0808q96k5251R212N343m957J7617q066o674
12744G2387K5509J3305k1432J79P828M058J6844o806J2738j0015j991K226j270
12731A13560O7p788l834K938M473J3557j7024k1033J22m667O136J5284J3739Q093
12717A23623J483j2270K980k3542N546M4039L278l091O017j8636o968J589j0422
12704A13626j8461M032J1170j7676j6538m701J3468K6789J217k6249Q228J5583
$$ plain form
12796 106738 109997 128545 139878 131064 126973 124665 107301 94831 92517 82614 91407 79437 65495
12783 65495 76360 79323 84254 95160 92738 105449 120139 114734 105895 113621 106162 110478 115474
12770 115474 107189 113966 105459 84396 82644 103747 115033 102027 98911 107187 113396 100259 104150
12757 104150 116613 105532 89318 75251 86059 85163 59912 69124 74467 69510 87127 79061 72387
12744 72387 97896 111201 89769 89948 97776 101834 118678 111872 124610 114595 112604 114830 113560
12731 113560 113627 105839 102005 104943 109416 122973 105949 84916 85038 80371 86507 101791 115530 123623
12717 123623 125106 112836 115816 92274 97820 141859 145137 142046 148063 129427 122459 124048 113626
12704 113626 95165 99197 110367 92691 76153 71452 84920 111709 112926 86677 94905 110488
12692A10488J906k2633l0044r556K5796O251J0185j71j4864P442J150N966K119
12679I4035P073J4630K012K117L740J6690q85m040j0366R391P21j654j4344k9392
12665H9728k3718L909J9439M610p432K155j470k283j851j0643n872J1957k218
12652G6311j3709O878J3244m041L429n69J2785q684l789K0700N551j1247j5807
12639H1052N704j899k6373n14J6816K4156P967q266N456j0464J8219K4690P627
12626A44171k0668j1158O135O559j6297o468j0937k997n73O541R78K446O720P857
12612A12309K5510J4365n473q385k1360j4568K8511J1807l922m407p148N574P015
12599A39828K362j9030k2448l264J4149J5771P78l454O033j257n385r614q921
$$ plain form
12692 110488 112394 89761 59717 50161 75957 82208 92393 92222 77358 84800 85950 91916 94035
12679 94035 101108 115738 117750 119867 123607 140297 139412 135372 125006 134397 135118 133464 119120 89728
12665 89728 66010 69919 89358 93968 86536 88691 87221 84938 83087 72444 66572 78529 76311
12652 76311 62602 69480 82724 78683 82112 81543 94328 85644 81855 102555 108106 96859 81052
12639 81052 86756 84857 58484 57970 74786 98942 106909 98643 104099 93635 111854 136544 144171
12626 144171 123503 112345 118480 125039 108742 102274 91337 88340 87767 94308 95286 97732 104452 112309
12612 112309 137819 152184 146711 138326 116966 102398 130909 142716 138794 134387 127239 132813 139828
12599 139828 142190 123160 100712 97448 111597 127368 128146 124692 130725 129468 124083 114469 105548
12586A05548M289L681M824K308J1819m860j0374p916J4037J8791J483j6673k0778
12573A06179l380J1887R820j1486r668J6988j2160K075l886k5183J0011J9442
12561A10639J5212Q14p548L557K0742q529j8431o357P376O47Q83J234J36o898
12547A13477J612n564o723k0235P831J1772Q96j1491r828K125O099J1963R792
12534A11726p484K0573K918n834J8396J2179o668j8255J0534J0878K446p539k47
12521A43623o368k0696j349J9195J0006K463j7893j4762J1202M409m405o282j4277
12508A04866J793J0234L284M49j7365j142J9504J699J702j6023M74N814J1073
12495A26362l993J150j3080k176J5801J6554J5946j7827j4579j1477J0973J4636
$$ plain form
12586 105548 109837 113518 118342 120650 132469 127609 117235 109319 123356 142147 143630 126957 106179
12573 106179 102799 114686 124506 113020 103352 120340 108180 110255 106369 81186 91197 110639
12561 110639 125851 126665 119117 122674 143416 134887 116456 110099 117475 118122 119005 120239 120375 113477
12547 113477 115089 109525 102802 82567 90398 102170 103066 91575 81747 83872 89971 101934 111726
12534 111726 104242 124815 127733 121899 140295 152474 145806 127551 138085 148963 151409 143870 143623
12521 143623 137255 116559 115210 134405 144411 146874 128981 114219 125421 129830 125425 119143 104866
12508 104866 106659 116893 120177 120626 103261 102119 121623 123322 125024 109001 109475 115289 126362
12495 126362 122369 123519 110439 108263 124064 140618 156564 138737 124158 112681 123654 138290
12483A38290n784R552P25k4641k6131k0215K3615K6852r234k1184l0549J1961
12471G3257K2548K1411K1470p303l752j076J1274k590j0349J1025K558P684j884
12458A44273J8398P142n765j4818P94N610j6288j6911J6620M101j8353J022j2117
12445A13708p352p722J5647J5249o927q864m667N778J8254O453J0235l425M417
12432A50784l438J3955K3418J5519j6083j7473k5614j9514j942R217r571q149
12420A11109o278j1378N511j2636j827J6774J2902j1812j882M023M39k791R789
12407A11943P961j458k0538l700J3488k190j5697J5562J4045l829N672M722j1523
12394A14458j5705J3931k111K347K4330L18J0462l901j5660j0009j0841k0040
$$ plain form
12483 138290 132506 142058 142783 118142 92011 71796 95411 122263 113029 91845 61296 73257
12471 73257 95805 117216 138686 131383 127631 126555 137829 135239 124890 135915 138473 146157 144273
12458 144273 162671 169813 164048 149230 150024 155634 139346 122435 139055 143156 124803 125825 113708
12445 113708 106356 98634 114281 129530 122603 113739 109072 114850 133104 139557 149792 146367 150784
12432 150784 147346 161301 184719 200238 184155 166682 141068 121554 119612 128829 119258 111109
12420 111109 104831 93453 98964 86328 84501 101275 114177 102365 100483 104506 104945 102154 111943
12407 111943 119904 118446 97908 94208 107696 105506 89809 105371 119416 115587 121259 125981 114458
12394 114458 98753 112684 110573 112920 137250 137568 148030 144129 128469 118460 107619 87579
12382H7579K0142J5243L364j3351J8388K5258N711j4130k4953r144J0300K9356
12370A53763n706r718J3758N778k5171o463K7753J4607k921O281n084j9608R411
12357A56680R592j7518j3943j0635O806M329j777n001q383J2094o123j03o462
12344A19556R40J0563J7950L0088l287P586K910L298q915j0463k3356N168R668
12331A61706R898L602o386j0869o453j177j73R698K513K177K211j0006r268j9844
12317A27629P467K0412J1804j482n850o557j2302j1952N778R776M952P847M972
12304A62494J6351j3197k2865O342j375q579J2822K1982q049n743M408l603r569
12291A51419J9096l344k2322k1294J1160N888J863Q531j1774o194k247j4188J0042
$$ plain form
12382 87579 107721 122964 126328 112977 131365 156623 162334 148204 123251 114107 124407 153763
12370 153763 148057 138339 152097 157875 132704 126241 153994 168601 165680 171961 166877 147269 156680
12357 156680 166272 148754 134811 124176 130982 135311 133534 128533 120150 132244 126121 126018 119556
12344 119556 120496 131059 149009 179097 175810 183396 186306 189604 180689 170226 146870 152038 161706
12331 161706 171604 175206 168820 157951 151498 150321 150148 159846 162359 164536 166747 156741 147473 127629
12317 127629 135096 155508 167312 165830 159980 153423 141121 129169 134947 144723 149675 157522 162494
12304 162494 178845 165648 142783 149125 147750 139171 151993 173975 165926 160183 164591 160988 151419
12291 151419 170515 167171 144849 123555 134715 140603 142466 150997 139223 133029 130782 116594 126636
12278A26636K4784M397M240N179K4642K662k436M433j319J3487J1358N686J031
12265B24780O116J4799N686j6871O144J7657j701l594o659l9141m4415j219J0663
12252A72245j6j1253J1579l481Q148O161R841J2836J424n118k299M445k468m193
12238A97851O022k460j1006K8670r873m569J032K2194L1809O641J3645L7605N964
12225C23525J3584N706P119j2396j6428l8243k3679k2884n550P067j073n109l358
12212B28281O063K8286J965j0091j809m308j3834Q181M040j4280N302q409l9141
12199A90246j2331P159j2482l095j2744J9416K0407J5837J7961K9808J8191J7418
12187B95791Q604L3167K5072L868J1455N883J3119m4810m5083k4117l4517m0825
$$ plain form
12278 126636 151420 155817 160057 165236 189878 192540 190104 194537 193218 206705 218063 223749 224780
12265 224780 230896 245695 251381 234510 240654 258311 256610 253016 246357 207216 162801 161582 172245
12252 172245 172229 160976 172555 169074 177222 183383 193224 206060 207484 202366 200067 204512 202044 197851
12238 197851 203873 201413 190407 219077 209204 204635 205667 227861 259670 266311 279956 317561 323525
12225 323525 337109 342815 349934 337538 321110 282867 259188 236304 230754 237821 236748 231639 228281
12212 228281 234344 262630 264595 254504 252695 248387 234553 242734 246774 232494 237796 229387 190246
12199 190246 177915 185074 172592 169497 156753 176169 196576 212413 230374 260182 278373 295791
12187 295791 304395 337562 362634 366502 377957 383840 396959 352149 307066 282949 248432 207607
12175B07607j275K8700n579k6437M977O950n197L572j6248q277p387K0033Q068
12162B09507j1132j521Q659Q222M124J716k87q899k402j6731j9001j7305J871
12149A56821J4413K3612L1471N384N645K2656L9925L522j1229r485q230K921k2074
12136B55352q354o579p445p43j2181k9326q292N336r059J4121J2293q021j0173
12123A86929p61J516J2380R555r675j4461K2K5785L1571J4579p3J2724J0253p672
12109B72672J5573K5976j477k1580l0432j7884m817j3352j7295k3353K430K2536
12097B08997K8146Q852O102n821m672K4492o611k0433k1707J1476R38K595O859
12084B39213j6612o142N483L207j747J544r536M352M824J672j0629M940J2996
$$ plain form
12175 207607 206332 235032 229453 203016 207993 214943 209746 213318 197070 188793 181406 201439 209507
12162 209507 198375 196854 205513 213735 217859 219575 219288 210389 207987 191256 172255 154950 156821
12149 156821 171234 194846 226317 231701 237346 260002 299927 303449 292220 282735 274505 277426 255352
12136 255352 246998 240419 232974 232231 220050 190724 182432 187768 178709 192830 205123 197102 186929
12123 186929 186168 187684 200064 209619 199944 185483 185505 211290 242861 257440 257367 270091 280344 272672
12109 272672 288245 314221 312744 291164 260732 242848 238031 224679 207384 184031 186461 208997
12097 208997 237143 245995 252097 246276 241604 266096 259485 239052 217345 228821 229759 232354 239213
12084 239213 222601 216459 221942 225149 223402 224946 215410 219762 224586 226258 215629 220569 233565
12071B33565J3491L9930L1220J7104K2637M1672K2165L3263L1850J8691r465l391
12059D92732k5495m1083n760R110j2970m9096m6943j0623j3312l1172k281r279
12047B53828n340P733m858j497j67M742m254J8643o009j9583l1171n621K503j67
12033B08782j4753K4959J3599P471K7097k227P658K0925L563J5018R429K7641
12021C49162N2584K7167L9422K4299J9683K2989J2586M173k7211m0886N65k266
12009D82267m514j5852j6421l5696n8235l1485k2569k3409R537N077k3466K745
11997B67979P043p125l645j8530j7165O379L5561J2452o279k243K419j0562k0536
11984B45748k7564j4591O060K7441M0262L0234k1772m528J1938Q786K0147R671
$$ plain form
12071 233565 247056 286986 318206 335310 357947 399619 421784 455047 486897 505588 496123 492732
12059 492732 467237 426154 420394 429504 416534 367438 320495 309872 296560 265388 263107 253828
12047 253828 248488 256221 251363 249866 249699 254441 250187 268830 262821 243238 212067 206446 208949 208782
12033 208782 194029 218988 232587 240058 267155 264928 272586 293511 297074 312092 321521 349162
12021 349162 401746 428913 468335 492634 512317 535306 547892 552065 524854 483968 484533 482267
12009 482267 477753 461901 445480 409784 351549 320064 297495 274086 283623 288700 265234 267979
11997 267979 275022 267897 264252 245722 228557 234936 270497 282949 276670 274427 276846 266284 245748
11984 245748 218184 203593 209653 237094 277356 307590 285818 281290 293228 302014 322161 331832
11972C31832J1718K7295N9595N0959J7807J1889j0175j9701k8241k6006j1098
11961D15874j2630l2968l0346O672j0503j9351n895J286p351j8433k979K35K495
11948B86106K0371O026j7826n341j8996M445J0564N254k938j7481m260J206J6339
11935B83469J5824J1218J0585J2661j5791J0770j2266P800K5269J37K872J5866
11923C68414J3486P293K5826M0351L0878J5247k939j4176l858l8569q886Q351
11911D41418l7322l6308m019j8739j5998j2293J277m625j0152K1073k60l427K2677
11898C43302n866r490N350R291p671R711J073Q985J1370J2110j5860j6240q462
11885C37603Q331j1809j3576q920O509J5969j5566j0936l151J8464J3354J7253
$$ plain form
11972 331832 343550 370845 430440 481399 499206 511095 500920 481219 452978 426972 415874
11961 415874 403244 370276 339930 346602 336099 316748 310853 312139 304788 286355 283376 283611 286106
11948 286106 306477 312503 294677 289336 270340 274785 285349 290603 287665 270184 265924 267130 283469
11935 283469 299293 310511 321096 333757 317966 328736 316470 324270 349539 349676 352548 368414
11923 368414 381900 389193 415019 455370 486248 501495 498556 484380 480522 441953 433067 441418
11911 441418 404096 367788 363769 345030 329032 316739 318016 313391 303239 324312 324052 320625 343302
11898 343302 337436 327946 333296 342587 334916 344627 345700 354685 366055 378165 362305 346065 337603
11885 337603 345934 334125 320549 311629 318138 334107 318541 307605 304454 322918 336272 353525
11873C53525K550k4668j1377m074J905J0168j2872j6388J2954j2564k2893M212
11861B80478P848r921k8305K393J6188J1538R357k631r162O852r05j1595k3934
11848B48201l1247q713j15J1672J3025J2043K6455P937j2994j2665j1676M068
11836B45991O594R043M173Q846j6832k0492J7913J7909n470l0506L434J2628q678
11823B44553L984J320O60l485m147k327J0180L083k109j4705L860j3548n299j2979
11809B09041j1344J9026m99O178p584j9127j0559M947l268Q982J7340J7178j9669
11796B10642j6298K5158K6778J2336q750k7831j4252J595m392k855K6356K1352
11784B49839k037j3292j312O931j0336j0838l07J5214P572n346J0005J8303j5591
$$ plain form
11873 353525 356075 331407 320030 315956 317861 328029 315157 298769 311723 299159 276266 280478
11861 280478 288326 278405 250100 252493 268681 280219 289576 286945 277783 284635 283730 272135 248201
11848 248201 216954 208241 208126 219798 232823 244866 271321 279258 266264 253599 241923 245991
11836 245991 252585 261628 265801 274647 257815 237323 255236 273145 267675 237169 240603 253231 244553
11823 244553 248537 249857 250517 247032 242885 240558 250738 253821 251712 237007 240867 227319 222020 209041
11809 209041 197697 216723 216224 222402 214818 195691 185132 190079 186811 195793 213133 230311 210642
11796 210642 194344 219502 246280 258616 249866 222035 207783 209378 204986 202131 228487 249839
11784 249839 247802 234510 233198 240129 229793 218955 218648 233862 241434 236088 246093 264396 248805
11771B48805k0527J273J31M68j8279j0429J865J4977N171R450J3551l652r568
11758B33236k161k983q647p949L1514J9946j1466l585K3409k8988j0513o052k1199
11745B04562K3555K9971k3329j5488R552J19m122J8663K9497Q469O624j2540j2963
11732B62570P474K551J2610q902p123N050P277j526j1571p179J6512j0836o146
11719B60761L859L516J6431p259j1206q216J3536o494j7355L928l475j5357o399
11706B26270L740K2354K4184R490l5854k1529r63k032O162L777R701q281J2060
11693B49079J0785l226j1523J611J3802P784j4293O758J7488j5115j2870j0078
11681B40202j100P107q8j1601j0340J5981K8406J2049m176k3207j2418J872K216
$$ plain form
11771 248805 228278 229551 229682 230150 211871 201442 203307 218284 223455 232905 246456 242804 233236
11758 233236 231075 228092 219445 211496 243010 262956 251490 247905 271314 242326 231813 225761 204562
11745 204562 228117 258088 234759 219271 228823 228942 224820 243483 272980 281449 288073 275533 262570
11732 262570 270044 272595 285205 276303 269180 274230 281507 279981 268410 261231 277743 266907 260761
11719 260761 264620 268136 284567 277308 266102 257886 271422 264928 247573 251501 248026 232669 226270
11706 226270 230010 252364 276548 286038 250184 228655 227692 225660 231822 235599 245300 237019 249079
11693 249079 259864 256638 245115 246726 260528 268312 254019 260777 278265 263150 250280 240202
11681 240202 239102 246209 246121 234520 224180 240161 268567 280616 276440 253233 240815 242687 244903
11668B44903l389J4150J8233L850k4888J0951K0945j7626n011j9245j8074q106
11656B16693J0321J1935K1220N897J469j658j0548J169J7680j4519n54k59J256
11643B60102O949j0316O791N159M876P830J1994K302j261J2603J3790p79J671
11630C21711R780P644L235j5169k8601Q955j2017R368K4398o207N066j9961p385
11617C00817P170N622r534j396P447J8479J5414j4371o89J2395J6840j595p311
11604C49288j0193j1398j1129J3589P182q369J727j0554j8137J0638K3665j0874
11592C25435o914j4176J5984J0129k7346r721j0807M274J3692M950M635o583N203
11579C08755K170P999K93p973J2590q872j1080Q162K74j3685j3653P735m90j9260
$$ plain form
11668 244903 241514 255664 273897 277747 252859 263810 284755 267129 262118 242873 224799 216693
11656 216693 227014 238949 260169 266066 267535 265877 255329 256498 274178 259659 259105 258846 260102
11643 260102 267051 256735 263526 268685 273561 281391 293385 295687 294426 307029 320819 320040 321711
11630 321711 331491 339135 342370 327201 298600 307555 295538 304906 329304 323097 328163 308202 300817
11617 300817 307987 313609 304075 302679 310126 328605 344019 329648 328959 341354 358194 356599 349288
11604 349288 339095 327697 316568 330157 337339 328970 330697 320143 302006 312644 336309 325435
11592 325435 318521 304345 320329 330458 303112 293391 282584 286858 300550 305500 310135 303552 308755
11579 308755 310925 318924 319217 311244 323834 314962 303882 312044 312318 298633 284980 292715 292225 272965
11565B72965p237K9667O215K099O861Q901m051J575J9788K5949j3667j1518k877
11552C34670L0564K5674J8281J3864j7926K095J5092k955J6591n144r1K4105K6919
11539D81739k0377m108j812j415j2558l0933j5329n823l109r665L843J4418r69
11526C93902k7446j969O800K8318Q930j1710J5918J902n661M739J0388J5067K565
11513D41743j1576j3135j5556m219R446K688q655J7247K0580K0878l497M22L948
11500D60314Q013l9451j6300K8159J260m205O196R289J0241K5403K2543L4530
11488E45992K1388K9932J4826J9997K9470L3823O473n9668r2463n4931m7672k0846
11476D26321n437Q096K623j7871K039J6305Q411l527Q757L691j9958j7757l1911
$$ plain form
11565 272965 265728 295395 301610 303709 310570 319471 315420 316995 336783 362732 349065 337547 334670
11552 334670 365234 390908 409189 423053 405127 407222 422314 419359 435950 430806 430715 454820 481739
11539 481739 461362 457254 455442 454027 441469 410536 395207 389384 386275 376610 380453 394871 393902
11526 393902 366456 364487 371287 399605 408535 396825 412743 414645 408984 413723 424111 439178 441743
11513 441743 430167 417032 401476 397257 406703 409391 400736 417983 438563 459441 455944 456366 460314
11500 460314 468327 428876 412576 440735 441995 437790 443986 453275 463516 488919 511462 545992
11488 545992 567380 597312 612138 632135 661605 695428 701901 642233 549770 494839 447167 426321
11476 426321 420884 428980 431603 413732 415771 432076 440487 436960 445717 449408 429450 411693 379782
11463C79782n751K2573M0868J0647k855j3258n992r558N358J3200m118q493K2238
11450D44641N792o508L1871K3054M906M4316N3698M6903O0314O9222M4894K0166
11438H43269L6756J5187m7293p4372n9905m7678j7415J4434J1564R154Q486J4724
11426G06911j2694m6572n6565n6214k531K0895j4388n152M388P595K4322O050
11414E76045j0751K6111K2822J7883J2301K2706M0790J104K5670J5646j3935l284
11402G33108q92J3580k8108l7856n542m209J664j7245P428J9325M959j0520j8586
11389F57106m784j5435j8650J1197k368n065K3178K0139K7580L4636M7215M5779
11377H20528L8056M8924M6596J9248K0163k730m7428m0397j2249r312j7100l3539
$$ plain form
11463 379782 374031 396604 437472 448119 445264 432006 426014 416456 421814 435014 430896 422403 444641
11450 444641 450433 443925 475796 498850 503756 548072 601770 648673 708987 778209 823103 843269
11438 843269 880025 895212 847919 773547 713642 665964 648549 662983 674547 683701 692187 706911
11426 706911 694217 647645 591080 534866 532335 553230 538842 533690 538078 545673 569995 576045
11414 576045 565294 591405 614227 632110 644411 667117 707907 709011 734681 750327 736392 733108
11402 733108 732216 745796 717688 679832 674290 670081 671745 654500 661928 681253 686212 675692 657106
11389 657106 652322 636887 618237 629434 627066 622001 645179 665318 692898 727534 774749 820528
11377 820528 858584 907508 954104 973352 993515 990785 943357 902960 890711 881399 864299 830760
11365H30760o729K5966L358j5687J5856J3046J2037L1143q674r171j0439m4603
11353H36863j0111j1057P147o615j2867j3133k3437M081q991k2943m539J0313
11341G44711N784R803J6928L4500L5239M8776M4402K9623K9760K2244P629n032
11329A024367P831P453k1k0715l4810m4031k7922l4468q188j4572l1846k6651
11317G96427K88J1414P334j3983j0506R948p526j5999o716m08K283J4393R199
11304G96148r164k673Q593K9302K831K8874M0480J9327M4051N3033K0859L8282
11292A069943N941j5700J4051L2339J4262M822N920k2420k9276k7743k4348l2821
11280I94970k6534j5180m3149k1108R751j5812l7776l4054k2322j4708j6306p9
$$ plain form
11365 830760 824031 849997 853355 837668 853524 866570 878607 909750 901076 891905 881466 836863
11353 836863 826752 815695 822842 816227 803360 790227 766790 770871 761880 738937 734398 744711
11341 744711 750495 760298 777226 811726 846965 895741 940143 969766 999526 1021770 1029399 1024367
11329 1024367 1032198 1039651 1039630 1018915 984105 940074 912152 877684 869496 854924 823078 796427
11317 796427 796715 808129 815463 801480 790974 800922 793396 777397 770681 770273 772556 786949 796148
11304 796148 786984 784311 792904 822206 825037 853911 894391 913718 957769 1010802 1031661 1069943
11292 1069943 1075884 1060184 1074235 1106574 1120836 1125658 1131578 1109158 1079882 1052139 1027791 994970
11280 994970 968436 953256 910107 888999 898750 882938 845162 811108 788786 774078 757772 757693
11268G57693J6192K6249J4326j949r319j8481j1038j1561J6552K5311K6788P098
11256H37861M6884M0217M4605P5391O1043O0920O9674N1573L0963M233N247j7226
11244A311385l1267l2726o0953q2509n6599m4343n6772n2923m9332k6964k2098
11233G94899L559j62m550R205L6104J9175j267Q683L168K3803R247l026k6603
11220H72235k8522j6930K6568M756j1351J9854K6135J3133K8622M4986N1301L8538
11208A069325M1078N8969J3702K170K627n274m667p272j7285j1575J1728L1685
11196A185211L2525O982q030J9220J4950K4615j905j8735R904N0792Q3099Q6658
11184A485286Q5141J04155J11819J08544J06957Q4059N2194P131l7749n6977k6789
$$ plain form
11268 757693 773885 800134 814460 812511 803192 784711 773673 762112 778664 803975 830763 837861
11256 837861 884745 924962 969567 1044958 1106001 1166921 1236595 1288168 1319131 1323364 1328611 1311385
11244 1311385 1280118 1247392 1186439 1103930 1047331 1002988 946216 893293 843961 816997 794899
11233 794899 798458 798296 793746 802951 839055 858230 856963 865646 868814 892617 901864 898838 872235
11220 872235 843713 826783 853351 858107 846756 866610 892745 905878 934500 979486 1030787 1069325
11208 1069325 1110403 1169372 1183074 1185244 1187871 1182597 1177930 1170658 1153373 1141798 1153526 1185211
11196 1185211 1217736 1224718 1216688 1235908 1250858 1275473 1273568 1254833 1264737 1315529 1398628 1485286
11184 1485286 1570427 1674582 1786401 1894945 2001902 2085961 2138155 2145286 2107537 2050560 2023771
11173B023771n508J6704M9548R8519J01417Q9808R5806R5326O9897N8416J2986
11162B706690o320j2009o803l3512p8767j08752j29850j38040j21618r0331n0742
11151A929946j0257J1034L0731L8336K7125L4516Q1783O6321N8361N4160N9900
11140B381956N0864K4821K8503P1608Q2457P1708O7247P0412O1630P9803Q0958
11129C071967J00730R2790O7528N2759M9787K869m9399r6660j14146j58265k00663
11118B819297j77548j72288j46457q5187k4088r722K4119K5170O4561J12665J44591
11107B575113J86240K03168J86427J85169J57235J02072N0823l4761q9046j13679
11097C408761j39735j93206k22301k48725k14687j58124j20709n3924K1265N2789
$$ plain form
11173 2023771 2018263 2034967 2084515 2183034 2284451 2374259 2470065 2565391 2635288 2693704 2706690
11162 2706690 2700370 2688361 2681558 2648046 2569279 2460527 2330677 2192637 2071019 1980688 1929946
11151 1929946 1919689 1930723 1961454 1999790 2026915 2061431 2143214 2209535 2267896 2322056 2381956
11140 2381956 2432820 2457641 2486144 2557752 2640209 2711917 2779164 2849576 2911206 2991009 3071967
11129 3071967 3172697 3265487 3333015 3385774 3435561 3438430 3389031 3292371 3178225 3019960 2819297
11118 2819297 2641749 2469461 2323004 2237817 2213729 2204007 2228126 2253296 2317857 2430522 2575113
11107 2575113 2761353 2964521 3150948 3336117 3493352 3595424 3646247 3611486 3522440 3408761
11097 3408761 3269026 3075820 2853519 2604794 2390107 2231983 2111274 2057350 2078615 2131404
11087B131404M6153N5139O5162R5500Q9670M1749l4396j01958q8531n6635m7343
11076B195914l2639l6052l1042k9743k5161n8440o0006n9975n4817m6097j7641
11065A744301j6623k2589o009J1987K5670K7927J7164L3271N1104O1071J01516
11054B028790R1199M5582K7358O570k616K5554N7935L6767k882j9352k7957J660
11042B268608J948M322J9873j7202n659L7011J0951j6753k2221j7312k6196l4195
11030B203175r398p1L775J953N805P396O509J5474J3427J9570J6953k3581j4174
11017B246813l287j7711o799J0881K0936N641k0791J762l0054r480L1501L1406
11005B260818O4459R7929O9532N2415P2048N2346J9405P109j8908r905J770L4895
$$ plain form
11087 2131404 2177557 2232696 2297858 2393358 2483028 2524777 2490381 2388423 2299892 2243257 2195914
11076 2195914 2163275 2127223 2096181 2066438 2041277 1982837 1922831 1862856 1808039 1761942 1744301
11065 1744301 1727678 1705089 1699080 1711067 1736737 1764664 1781828 1815099 1866203 1927274 2028790
11054 2028790 2119989 2165571 2192929 2199499 2196883 2222437 2280372 2317139 2314257 2294905 2266948 2268608
11042 2268608 2270556 2274878 2294751 2277549 2271890 2308901 2319852 2303099 2280878 2263566 2237370 2203175
11030 2203175 2193777 2193706 2197481 2199434 2205239 2212635 2219144 2234618 2248045 2267615 2284568 2260987 2246813
11017 2246813 2243526 2225815 2219016 2229897 2250833 2256474 2235683 2237445 2207391 2197911 2229412 2260818
11005 2260818 2325277 2423206 2492738 2545153 2617201 2669547 2688952 2696061 2677153 2667248 2669018 2703913
10993B703913N0619N0073Q5479J02555P4548O0002L5398K1791N7321R0226N6603
10982C388528J1819o859J4045k6833o8436j27832j86726k00712j74037j32215
10972B490742r0220o3765n3980l8737o608N316q728j832J6263K5833J8162P387
10960B299833l473k5341k2445j7988l670j0665j1246L2787M3699P8540R0705Q6669
10948B537405Q8916Q4525J02989J38213Q5581O0807N1936M2730N7118L4145k3652
10937C260713p3836o2019p2373q6578m8851k2507K90l892j9343K916J7886O0014
10925B952420N4583M8091M5757N3902M1546J8481k6522m2517m1415l7069n3486
10914C013771o5093o8674p3399p3634p3127n5556p2887m8080m3983m2695k0597
$$ plain form
10993 2703913 2754532 2804605 2890084 2992639 3067187 3127189 3162587 3184378 3241699 3331925 3388528
10982 3388528 3400347 3393488 3407533 3380700 3312264 3184432 2997706 2796994 2622957 2490742
10972 2490742 2400522 2336757 2282777 2244040 2237432 2242748 2234020 2232188 2248451 2274284 2292446 2299833
10960 2299833 2296360 2271019 2248574 2230586 2226916 2216251 2205005 2237792 2281491 2360031 2450736 2537405
10948 2537405 2626321 2710846 2813835 2952048 3037629 3098436 3150372 3193102 3250220 3284365 3260713
10937 3260713 3186877 3124858 3052485 2965907 2917056 2894549 2894839 2890947 2871604 2874520 2892406 2952420
10925 2952420 3007003 3055094 3100851 3154753 3196299 3214780 3188258 3145741 3104326 3067257 3013771
10914 3013771 2948678 2880004 2806605 2732971 2659844 2604288 2531401 2483321 2439338 2396643 2376046
10903B376046J8936M2890O9638O7053M4979Q1575J17681J15633J19971J14913
10893C169315J11423P6373N9301O1318M2143N1948M6059K1312K9097m803R058
10882C672544M2685M8629K4634o809m0268m2869n1518j3055j4145O806L2132N6790
10870C715556K9905M8558O2485N5865P3882P3226P6333N6683O5536O7512O1863
10859D387404M1310O2947P0855Q2049P0826M1076M8618O6273P9638R1934Q7189
10848E130119J10654J40011J68557K23085K51101K82336L75791M87936O20168
10839G789758P90774R23398J005539J040311J051527J074214R38403N93390J34756
10830A5342070l22535o31120p75745q29233p47702n87681l64258j24395J36503
$$ plain form
10903 2376046 2394982 2437872 2507510 2574563 2619542 2701117 2818798 2934431 3054402 3169315
10893 3169315 3280738 3357111 3416412 3477730 3519873 3571821 3617880 3639192 3668289 3663486 3672544
10882 3672544 3715229 3763858 3788492 3781683 3741415 3698546 3647028 3633973 3619828 3626634 3658766 3715556
10870 3715556 3745461 3794019 3856504 3912369 3986251 4059477 4135810 4192493 4258029 4325541 4387404
10859 4387404 4428714 4491661 4562516 4644565 4715391 4756467 4805085 4871358 4950996 5042930 5130119
10848 5130119 5240773 5380784 5549341 5772426 6023527 6305863 6681654 7169590 7789758
10839 7789758 8580532 9503930 10509469 11549780 12601307 13675521 14613924 15207314 15342070
10830 15342070 15019535 14388415 13612670 12783437 12035735 11448054 11083796 10959401 11095904
10821A1095904L77240P00902J064423J297535J379088J358110J236107J148026
10813A9657335J039598O34010n891p60548j508274j887203j790485j434632j046102
10804A2897808q28456o69967n02380l51625k16560j10246p4176n0853m5498k3508
10794A0024539n027m551l9843m3039n7418m2764k4402j1719N179J1059L4592L5189
10782I881795Q7790J54690K27367K75095L33371L57623L82252L86581M24726M60485
10772A2971775M44886M31980M49046M80293N82317P16878Q52254J015302J203889
10763A9148620J435353J707831K061602K541949L117455L801331M704689N964774
10755D4483604P684148R911464J2499518J5293617J7730882J9130552J9700443
$$ plain form
10821 11095904 11473144 12174046 13238469 14536004 15915092 17273202 18509309 19657335
10813 19657335 20696933 21330943 21325052 20564504 19056230 17169027 15378542 13943910 12897808
10804 12897808 12069352 11399385 10897005 10545380 10328820 10218574 10144398 10093545 10048047 10024539
10794 10024539 10019512 10014961 9975118 9932079 9874661 9831897 9807495 9795776 9800955 9812014 9846606 9881795
10782 9881795 9969585 10124275 10351642 10626737 10960108 11317731 11699983 12086564 12511290 12971775
10772 12971775 13416661 13848641 14297687 14777980 15360297 16077175 16929429 17944731 19148620
10763 19148620 20583973 22291804 24353406 26895355 30012810 33814141 38518830 44483604
10755 44483604 52167752 62079216 74578734 89872351 107603233 126733785 146434228
10748A46434228J9885746J9282049J7270707J2818533N910818j87718m013039
10741B17401324o124884o221675m566550k008066J035951M869820Q996872J2458342
10733B25841134J5114486J6032102J5135656J3604792J1617346R078578N929604
10726C12353698J355498m158988j0069633j6795577k2813063k5468405k4231458
10719B10172072k0328012j5100188r625166m420403Q9651L690668O121671P193831
10711A77794124P778669Q868255R521470Q875758O911182M417885K925698K426314
10703B29519355J275289j353150l452798k911248J471420R028849J6704814K2512940
10695B72795471K5815068K7762801K8276572K6314434K0766009Q325586p434011
$$ plain form
10748 146434228 166319974 185602023 202872730 215691263 221602081 221414363 217401324
10741 217401324 211276440 205054765 200488215 198480149 199516100 204385920 213382792 225841134
10733 225841134 240955620 256987722 272123378 285728170 297345516 306424094 312353698
10726 312353698 313709196 309550208 299480575 282684998 259871935 234403530 210172072
10719 210172072 189844060 174743872 165118706 160698303 160787954 164478622 170600293 177794124
10711 177794124 185572793 194441048 203962518 212838276 219749458 224167343 227093041 229519355
10703 229519355 230794644 229441494 225988696 223077448 224548868 233577717 250282531 272795471
10695 272795471 298610539 326373340 354649912 380964346 401730355 410055941 402621930
10688D02621930j9520457k7091296k7265433k4975425k3478482k1049890j7731166
10681B41509781j4106793j0123993n377103N507N418341J0616891J5823247K1372663
10673B65138541K6650812L0547404L0911498K6758035J9904939J1957646N175187
10666D17044062j791051j2196532k1749906k8596239l2089989k9803352k4912630
10659B65904363j9806450j5821500j4249899j4379325j5709843j6536498j6366760
10652A53034088j5204478j3021236j0624192q331089o540704n310357m174220
10645H9827812l082153k027649r33840J89774J094642J683840K084313K315083
10637I1151822K290467J753651J92798j812565l345302m684362n879356o478433
$$ plain form
10688 402621930 383101473 356010177 328744744 303769319 280290837 259240947 241509781
10681 241509781 227402988 217278995 211901892 211907399 217325740 227942631 243765878 265138541
10673 265138541 291789353 322336757 353248255 380006290 399911229 411868875 417044062
10666 417044062 415253011 403056479 381306573 352710334 320620345 290816993 265904363
10659 265904363 246097913 230276413 216026514 201647189 185937346 169400848 153034088
10652 153034088 137829610 124808374 114184182 105853093 99312389 94002032 89827812
10645 89827812 86745659 84718010 83784170 83973944 85068586 86752426 88836739 91151822
10637 91151822 93442289 95195940 95388738 93576173 90230871 85546509 79667153 73188720
10629G3188720o035674m682564l354788k424940j737433j106370n11108R245L22384
10620E3667472N81693P87121Q62784Q63575O62326K25349l82283j244253k186468
10611E3837316l156553l813790l938285l722166l128362k430711j821360j271867
10603C0554222o99406j73526M51675J192510K009709K848780L659279M240669
10595D4083912M582753M677981M319708L598270K324439L51968j752508l955362
10587E8231161n572084o277315o186597n302143m164949l088292k232859j593137
10579B3813785j004805m52424P6684O12285J152650J642759J964776K122926K144471
10570C2073107J919741J533042Q06042k35982j338655k474178l157107l421500
$$ plain form
10629 73188720 67153046 62470482 59115694 56690754 54953321 53846951 53335843 53345088 53667472
10620 53667472 54249165 55036286 55899070 56762645 57424971 57650320 57268037 56023784 53837316
10611 53837316 50680763 46866973 42928688 39206522 36078160 33647449 31826089 30554222
10603 30554222 29854816 29681290 30132965 31325475 33335184 36183964 39843243 44083912
10595 44083912 48666665 53344646 57664354 61262624 63587063 63939031 62186523 58231161
10587 58231161 52659077 46381762 40195165 34893022 30728073 27639781 25406922 23813785
10579 23813785 22808980 22356556 22433240 23045525 24198175 25840934 27805710 29928636 32073107
10570 32073107 33992848 35525890 36331932 36095950 34757295 32283117 29126010 25704510
10562B5704510l312780k842214k285289j768548j341027j056797q68746p22703
10554A1506406o52278o22520n72441n75540n61708m95292m14413l49471l16819
10545F945924k51429k18845k21092j77015j62208j52698j47084j44400j27188
10536E343965j33335j33729j18026j11803q4049r0756r9344j05531r6588p0524
10526D300280q9448n8983l6906m770J3971l625o72O315j3106k3169k3456o3922
10514D002509o9586n6847p4661p0105p8575p8758o8688o5970r0249j21155j19751
10503C108164j28445j32376j28191j32299q9366m7680k9606m5594p5341n3530
10493B245736j3244Q466n189j7113J2367P346L2238M0110L1208K2038L797p310
$$ plain form
10562 25704510 22391730 19549516 17264227 15495679 14154652 13097855 12229109 11506406
10554 11506406 10854128 10231608 9659167 9083627 8521919 8026627 7612214 7262743 6945924
10545 6945924 6694495 6475650 6254558 6077543 5915335 5762637 5615553 5471153 5343965
10536 5343965 5210630 5076901 4958875 4847072 4763023 4672267 4572923 4467392 4370804 4300280
10526 4300280 4210832 4151849 4114943 4110173 4124144 4120519 4119847 4126162 4113056 4089887 4066431 4002509
10514 4002509 3932923 3876076 3801415 3731310 3652735 3573977 3505289 3439319 3349070 3227915 3108164
10503 3108164 2979719 2847343 2719152 2586853 2497487 2449807 2420201 2374607 2299266 2245736
10493 2245736 2232492 2240958 2235769 2218656 2231023 2238369 2270607 2310717 2341925 2363963 2367760 2360450
10481B360450l9203p0974j15066j05684j00858j29265j26223j20941q6357m2751
10471A423128m1340k5119j1498k2808l8561k4237j494j270N155J1190j2288j3803
10459A247055m777l1705l4578M584m703j4109j9068k4585l9789l8500m963k4924
10447A009938l1659k0969o619O556j9791k7540j2027k0911J430K115l679j7335
10435H59509p788q97k1813k2299J3676J1139n430l4497l8960r078N397J1112j8086
10422G41985P160j0862j9671k2853j3037q089j4144n703L720j016k0569n157K2489
10409F54253j1796k3259M511Q13k3103j2384q354J5102J110j7570j8246j8970
10397E42107L455K5157K0026J7558R165k077P713J3060q202L13L578k5219j2810
$$ plain form
10481 2360450 2321247 2250273 2135207 2029523 1928665 1799400 1673177 1552236 1465879 1423128
10471 1423128 1381788 1356669 1345171 1322363 1283802 1259565 1258071 1256801 1261956 1273146 1260858 1247055
10459 1247055 1242278 1210573 1175995 1180579 1175876 1161767 1142699 1118114 1078325 1039825 1034862 1009938
10447 1009938 978279 957310 950691 957247 937456 909916 897889 876978 878408 880523 876844 859509
10435 859509 851721 850824 829011 806712 820388 831527 826097 791600 752640 743562 748959 760071 741985
10422 741985 749145 738283 718612 695759 682722 674633 660489 654786 658506 657490 636921 631764 654253
10409 654253 642457 619198 623709 624522 601419 589035 580681 595783 596893 579323 561077 542107
10397 542107 545562 570719 590745 608303 617468 615391 623104 636164 627962 628275 631853 606634 593824
10384E93824J6267J699q755p761L978j7644j6105Q767M078K753K0152P292m850
10371F03695J728J190p33p547j9978k9527k3421k575K7788K1907K42o183j1669
10358E54917k3745k369J469K1127R256o395q153j1684j1938J1185j6043l37j455
10345E15835N952j2088r758k4215J578J8335o523q886m255j9750J9377R391J6438
10332E01431L9599Q150o100J7376J6399Q122J9256J3532N604J8419L5955L4604
10320G12347J4647J8195K5363K4725J3274J8039M7673O7408Q3912R0785Q2033
10309A198401J15888J26902J16872J08599R4165N6367K9205K3724j6359l7750
10299A816014P000M9276O0351O8035L5962M8351L7124L7344M9919P0746O9403
$$ plain form
10384 593824 610091 611790 603035 595274 599252 581608 565503 574270 578348 581101 601253 608545 603695
10371 603695 605423 606613 605880 598333 578355 548828 525407 522832 550620 572527 572769 566586 554917
10358 554917 531172 528803 530272 551399 560655 554260 546107 534423 522485 533670 517627 517290 515835
10345 515835 521787 509699 499941 475726 477304 495639 489116 480230 475975 456225 475602 484993 501431
10332 501431 541030 549180 543080 560456 576855 584977 604233 617765 623369 641788 677743 712347
10320 712347 726994 745189 770552 795277 808551 826590 874263 941671 1025583 1116368 1198401
10309 1198401 1314289 1441191 1558063 1666662 1760827 1817194 1846399 1870123 1853764 1816014
10299 1816014 1823014 1872290 1932641 2000676 2036638 2084989 2122113 2159457 2209376 2280122 2349525
10288B349525J7861J1254J5942L4585k834n0968j14696j66328j82731j44487q6795
10277A680328m1590n948k087M0280O3557N2883M2632N9731N0357K0278J2428K3179
10265A996028r036k4177M927K3737M4707L9572N5026N1507P0094R7651J13065
10254B463101J17535J04254P7303M5512r393n2567p5679j03547j58784j54797
10244B252938j62133j38753q8698n0071j5367K6969O6699J02973J44089J65225
10234B303871J89443J93651J89359J63901J14853P2209J9685n4318j26071j47855
10224B918728j71189k26666k27953k24891k12453j52633q2438n2719j1039k151
10214A554596K4398M0331L3546O2162K6855n443j4182n1754n5444p2635n8204
$$ plain form
10288 2349525 2367386 2378640 2394582 2429167 2426333 2375365 2260669 2094341 1911610 1767123 1680328
10277 1680328 1638738 1632790 1630703 1670983 1734540 1787423 1830055 1889786 1940143 1960421 1972849 1996028
10265 1996028 1986992 1962815 1967742 1991479 2036186 2075758 2130784 2182291 2252385 2350036 2463101
10254 2463101 2580636 2684890 2762193 2807705 2798312 2745745 2670066 2566519 2407735 2252938
10244 2252938 2090805 1952052 1863354 1813283 1797916 1824885 1891584 1994557 2138646 2303871
10234 2303871 2493314 2686965 2876324 3040225 3155078 3227287 3246972 3192654 3066583 2918728
10224 2918728 2747539 2520873 2292920 2068029 1855576 1702943 1620505 1567786 1556747 1554596
10214 1554596 1578994 1619325 1652871 1715033 1741888 1736445 1722263 1670509 1615065 1542430 1484226
10203A484226o4279l7533l6686n2396l3845k2671j8626R97R954J1263K5498L7013
10191A302915K7857L4565N1721J8921J4563J3667O149j9892m3532m8163k3184
10180A335587k7100n770j1123l3355m1899l7135l6311o113P355N840J8479K0878
10168A189333J6608J7302Q188M712j1463k2487n1542n5938n1357l9259m5634k9550
10156I28913j7815j7196j1126j1639m913P135k724P774K0581K4198k809J4273
10144I34652J335q91k529m184j1980l5072l4927j4097j2211k9347k5171l3252
10132G32326m1582k7215r039O536N484K2220K3023J4434K3339R636J23k8321j1310
10119G19654J6245P850J4470N636m858p362j5641l43N435J3827O573J434K203
$$ plain form
10203 1484226 1419947 1382414 1345728 1293332 1259487 1236816 1218190 1219187 1229141 1240404 1265902 1302915
10191 1302915 1330772 1365337 1417058 1435979 1450542 1464209 1470358 1450466 1406934 1358771 1335587
10180 1335587 1308487 1302717 1291594 1258239 1216340 1179205 1142894 1136781 1144136 1149976 1168455 1189333
10168 1189333 1205941 1223243 1231431 1236143 1224680 1202193 1150651 1094713 1043356 1004097 958463 928913
10156 928913 911098 893902 882776 871137 866224 873359 870635 878409 898990 923188 920379 934652
10144 934652 935987 935096 932567 928383 916403 881331 846404 832307 820096 790749 765578 732326
10132 732326 690744 663529 654490 661026 666510 688730 711753 726187 749526 759162 759285 730964 719654
10119 719654 735899 743749 758219 763855 758997 751635 735994 735651 741086 754913 761486 762920 765123
10106G65123j5599o249l34J5210L1799J0636N991L5649M8821J4108K0353N3324
10094I78832L2202N3561Q4840J20547J51193K01489K32225K52634L00644L64698
10084B772865L89192L21345J81067J02972J20183P3171j11131l25276l48781k74751
10074B900856k65828l21526k96448k24108j92088j19465p3654n5784k4498l301
10064A324156j4621j0429n252k6409k4618o874O611l3875p417l1074m3413p987
10052A118798r647r353N209J4928K7436K2821J2319L9924K9396K6420J9325j781
10040A295795J8352Q217J3947K1423J3412j1444K885M466n822J4092Q747J5208
10028A399278N970K5851L3864J4634K7561P510l669K2549K4434K6467K5772J1357
$$ plain form
10106 765123 749524 743275 742941 758151 789950 800586 806577 842226 891047 905155 925508 978832
10094 978832 1011034 1064595 1149435 1269982 1421175 1622664 1854889 2107523 2408167 2772865
10084 2772865 3162057 3483402 3664469 3767441 3887624 3960795 3849664 3524388 3175607 2900856
10074 2900856 2635028 2313502 2017054 1792946 1600858 1481393 1407739 1351955 1327457 1324156
10064 1324156 1309535 1299106 1293854 1267445 1242827 1235953 1242564 1208689 1201272 1170198 1126785 1118798
10052 1118798 1109151 1099798 1105007 1119935 1147371 1170192 1182511 1222435 1251831 1278251 1297576 1295795
10040 1295795 1314147 1322364 1336311 1357734 1371146 1359702 1362587 1367053 1361231 1375323 1384070 1399278
10028 1399278 1405248 1431099 1464963 1479597 1507158 1514668 1510999 1533548 1557982 1584449 1610221 1621578
10016A621578J0300M407K0739M864m036J2965K3742J7024L830K0162K1730L9211
10004A796516M8312M7589P6932P0531O4210M6714K1265J0005J5472M639j3589
9993B188596j4011l8587m0300j9408j7898j8592j0693k1325J1485K1711N5981
9982B096959M2786L2086M5219M9264M8987M1400Q821K0736J7523L6694L1342L8453
9970B510270R886J4183K0926J9723J7666J8086K4179Q134j546P270J1289k141
9958B657925L7739M8440K428J4520J7256M9662M3091M6177K4003M6345N2379M8015
9946C087980N5985O4624Q8856O5663J01579J53504J89203K06102K33926K98656
9936D546078L87862M80085O25204P13314O48772N69619O97400Q88096J002065
$$ plain form
10016 1621578 1631878 1636285 1657024 1661888 1657852 1670817 1694559 1711583 1715413 1735575 1757305 1796516
10004 1796516 1844828 1892417 1969349 2039880 2104090 2150804 2172069 2182074 2197546 2202185 2188596
9993 2188596 2174585 2135998 2095698 2076290 2058392 2039800 2029107 2007782 2019267 2040978 2096959
9982 2096959 2139745 2171831 2217050 2266314 2315301 2356701 2365522 2386258 2403781 2440475 2471817 2510270
9970 2510270 2520156 2534339 2555265 2574988 2592654 2610740 2634919 2643053 2641507 2648777 2660066 2657925
9958 2657925 2695664 2744104 2746532 2761052 2778308 2827970 2871061 2917238 2941241 2987586 3039965 3087980
9946 3087980 3143965 3208589 3297445 3363108 3464687 3618191 3807394 4013496 4247422 4546078
9936 4546078 4933940 5414025 6039229 6752543 7401315 7970934 8668334 9556430 10558495
9927A0558495Q01360K94812N11792J169664J873216K469742K879987L174320L338618
9918B7072006L368026L452629L348697K830417J912125L54676q67484r25055l16328
9909D0229709K35907L06811k58147q50770p71864l99372J43249J218283K702747
9900D2556553M371905O039128P546295Q548059Q796093Q342603P623171P136803
9892A00960610O225912M185516O12676l248590m828181m038135l186853k975804
9884I3707151l447655m430905n286482o057619n655312l437736p36203J552036
9876F6207275L470293N152332O529043P187413O671549N426694M438137L725875
9868A08808611K753458L14505l238053n037113n040437m819241m859121n273612
$$ plain form
9927 10558495 11359855 11654667 12166459 13336123 15209339 17679081 20559068 23733388 27072006
9918 27072006 30440032 33892661 37241358 40071775 41983900 42338576 41471092 40546037 40229709
9909 40229709 40465616 40772427 40514280 39663510 38891646 38492274 38635523 39853806 42556553
9900 42556553 46928458 52967586 60513881 69061940 77858033 86200636 93823807 100960610
9892 100960610 107186522 111372038 111984714 108736124 103907943 99869808 96682955 93707151
9884 93707151 90259496 85828591 80542109 74484490 68829178 65391442 64655239 66207275
9876 66207275 69677568 74829900 81358943 88546356 95217905 100644599 105082736 108808611
9868 108808611 111562069 111876574 108638521 103601408 98560971 93741730 88882609 83608997
9860H3608997n651424o162287o952759o849249n239534l312031j862748q11677
9852D6767288K3976P91071J285830J368653J086244O64249N97972P07186O75556
9843E3968025O70653O13854M44075O88696R18227Q53442J083265J356133J178185
9834F1774555P29369J6933n37074m68375l06725o27925p40179l07055n3446n32586
9824E8947492j384244j586182q56637N73394K121611L592618N050033O408731
9816G2866816P457638Q103906Q281078P887691O983960N297839L237625J991514
9808A22108067J235471K72758j303400l112553l812538l605957l830797m614901
9800A03336150n468708n430288m160027k348677l27316J837380L555491M737562
$$ plain form
9860 83608997 77957573 71795286 64842527 57993278 52753744 49441713 47578965 46767288
9852 46767288 46791264 47582335 48868165 50236818 51323062 51987311 52585283 53292469 53968025
9843 53968025 54638678 55252532 55696607 56385303 57303530 58156972 59240237 60596370 61774555
9834 61774555 62503924 62520857 61983783 61515408 61208683 60580758 59840579 59533524 59480078 58947492
9824 58947492 57563248 55977066 55120429 55693823 57815434 61408052 66458085 72866816
9816 72866816 80324454 88428360 96709438 104597129 111581089 116878928 120116553 122108067
9808 122108067 123343538 123616296 122312896 119200343 115387805 111781848 107951051 103336150
9800 103336150 97867442 92437154 88277127 85928450 85601134 87438514 90994005 95731567
9792I5731567N617919O030508N480277L864634J984020J152006J112141Q46773
9784A21819845m93237k682360m040223m325377m758283n908493p688696r206480
9776H2716696q838044o902440m963353l304284k061431j316173o27121R4371O33638
9767E5431859P05128K67841l66781r10870j216988j365906j193980p72426o37880
9758D9939997j413211l088558m585305m716937l985376l221695k608223k096823
9750B4223869j691545j385707j171108j041500r93802r55762q85038p90011o73171
9741A4636225n86999n38597n22210m82766m33556m06498l30107l19596l25618
9732A0690278l13309l10449k84139k76964k37250k34920k26448k34508k24872
$$ plain form
9792 95731567 101349486 107379994 112860271 116724905 118708925 119860931 120973072 121819845
9784 121819845 121326608 118644248 114604025 110278648 105520365 99611872 91923176 82716696
9776 82716696 73878652 66976212 62012859 58708575 56647144 55330971 54703850 54798221 55431859
9767 55431859 56136987 56404828 56038047 55127177 53910189 52544283 51350303 50577877 49939997
9758 49939997 48526786 45438228 40852923 36135986 32150610 28928915 26320692 24223869
9750 24223869 22532324 21146617 19975509 18934009 17940207 16984445 16099407 15309396 14636225
9741 14636225 14049226 13510629 12988419 12505653 12072097 11665599 11335492 11015896 10690278
9732 10690278 10376969 10066520 9782381 9505417 9268167 9033247 8806799 8572291 8347419
9723H347419k02164j85933j69246j84253j81579j70394j49777j26230j37049j48709
9713F692085j43347j20705j15054j12988j18472j41923j39280j46850j35240j32080
9703E386146j24093r2659r0429r1898q5874j01342q8505q3445p7177p3073o3703
9692D413948n4452l4445k9330p0198p2043n0061n4152p2829p1267n7229n6936
9681C791006r0656q8560q0251o4083o4831o6097n6420m6836m3172k6968k5664
9670C137468j8115k1587j6577l0311j739P281j1258j5723m4508k4707j9283k7115
9658B913826o479N814j376m499j8444N80K398m695J244j6773N706J490l852J2001
9644B886941L4449J6323k943o201q39k596k1773l1108j6504j4799J8563P028P898
$$ plain form
9723 8347419 8145255 7959322 7790076 7605823 7424244 7253850 7104073 6977843 6840794 6692085
9713 6692085 6548738 6428033 6312979 6199991 6081519 5939596 5800316 5653466 5518226 5386146
9703 5386146 5262053 5169394 5078965 4987067 4901193 4799851 4711346 4627901 4550724 4477651 4413948
9692 4413948 4359496 4325051 4295721 4225523 4153480 4103419 4049267 3976438 3905171 3847942 3791006
9681 3791006 3700350 3611790 3531539 3467456 3402625 3336528 3280108 3233272 3190100 3163132 3137468
9670 3137468 3119353 3097766 3081189 3050878 3049139 3056420 3045162 3029439 2984931 2960224 2940941 2913826
9658 2913826 2907347 2913161 2911785 2907286 2888842 2889422 2891820 2887125 2888369 2871596 2877302 2878792 2874940 2886941
9644 2886941 2921390 2937713 2934770 2928569 2927730 2925134 2903361 2872253 2855749 2840950 2859513 2866541 2874439
9631B874439l526j4701J1420m290j8589m304l844M133o668n524k757J008N082
9618B831879J4871Q315m239j3614M712K6533J6738p476J4095k014J0947R858L174
9605B913779j9382m129L745j3475j1679J0593o557k3122n674O849K249O951J9462
9592B879610j0348j0018K1818R40J2340J6783J8959R209P146j784k429O965M167
9579B953358O345K6327J4480p740o422J6955q386j293J1405Q235P728j3243q493
9566B999256K2914K3722J2590J425l980p251L0372K2440J415q813K6803N321r297
9553C116917K2139K2167J4585L8283L0106k316j1706Q982K5845K1013o491q342
9541C271182J7511J9770J5988J4309K652m349P164J4098O400J1638p669N984Q250
$$ plain form
9631 2874439 2870913 2856212 2867632 2863342 2844753 2840449 2836605 2840738 2834070 2828546 2825789 2826797 2831879
9618 2831879 2846750 2855065 2850826 2837212 2841924 2868457 2885195 2877719 2891814 2889800 2900747 2910605 2913779
9605 2913779 2894397 2890268 2894013 2880538 2868859 2879452 2872895 2849773 2844099 2850948 2853197 2860148 2879610
9592 2879610 2869262 2859244 2881062 2882002 2894342 2911125 2930084 2939293 2946439 2944655 2942226 2949191 2953358
9579 2953358 2959703 2986030 3000510 2992770 2986348 3003303 2994917 2993624 3005029 3013264 3020992 3007749 2999256
9566 2999256 3022170 3045892 3058482 3059907 3055927 3048676 3079048 3101488 3102903 3094090 3120893 3126214 3116917
9553 3116917 3139056 3161223 3175808 3214091 3244197 3241881 3230175 3239157 3265002 3286015 3279524 3271182
9541 3271182 3288693 3308463 3324451 3338760 3341412 3337063 3344227 3358325 3364725 3376363 3368694 3374678 3382928
9528C382928J7873K4954K6291L2645K1649Q952K1958K1911M3850L7366K2079K4934
9516C687390L0700K7528M2150N1102M2221K1042J1988J9053L0659J5409K2528
9505D001770L2013J5668K7279K4896J9940N1775J4701k284J3305K1673L4322L5550
9493D290608L6118Q4731Q1283M8816K9076L6294L5293K5130L2367L9890N1188
9482D790794L7621K6634K3855j2898l3801l2641k5573k0741o966L5728K7600M1618
9470D851230L8036K8466M1486M4978O2198N7086K1775L8511K7497J6592L2770
9459E260625O6894O1061K8347N582J2321K6960J2297k677k4038k9445l2293j592
9447E384042J4811J3822K4066K7548K6762N7052M9515L0355M950M3114M7581N1823
$$ plain form
9528 3382928 3400801 3425755 3452046 3484691 3506340 3515292 3537250 3559161 3603011 3640377 3662456 3687390
9516 3687390 3718090 3745618 3787768 3838870 3881091 3902133 3914121 3933174 3963833 3979242 4001770
9505 4001770 4033783 4049451 4076730 4101626 4121566 4173341 4188042 4185758 4199063 4220736 4255058 4290608
9493 4290608 4326726 4411457 4492740 4541556 4570632 4606926 4642219 4667349 4699716 4739606 4790794
9482 4790794 4828415 4855049 4878904 4866006 4832205 4799564 4773991 4753250 4746284 4782012 4809612 4851230
9470 4851230 4889266 4917732 4959218 5004196 5066394 5123480 5145255 5183766 5211263 5227855 5260625
9459 5260625 5327519 5388580 5416927 5422509 5434830 5461790 5474087 5471410 5447372 5417927 5385634 5384042
9447 5384042 5398853 5412675 5436741 5464289 5491051 5548103 5597618 5627973 5632923 5676037 5723618 5775441
9435E775441M4113J9870p601L951K7576K4475K5015R187K3366K5298K2236L1704
9423F024631L7809M1868L9372N0902N1008M1636L0167M0791M9471O4440J03790
9412F575885J18807J00864Q2634Q9363R4147P7781N6394L7208K7489K5158M2580
9401G328310L0906N0580N1787K4762M9316M8931M5576K8583J8530K4356M4955
9390G746592N1618O8687N4439M1665M5679N1495L7712L0117N4438O5473Q4009
9379H331924N8287K8843M6406N7129J9932J5781J7774K1972P250J7057J2310J6642
9367H651307L3605O0285L8569P8689P4499Q1273Q9441N1040O0259M8100O7555
9356I334622Q5604O8475P9461J00573P8363O7114P8091N1918P8264R2165Q1272
$$ plain form
9435 5775441 5819554 5839424 5831823 5835774 5863350 5887825 5912840 5922027 5945393 5970691 5992927 6024631
9423 6024631 6062440 6104308 6143680 6194582 6245590 6287226 6317393 6358184 6407655 6472095 6575885
9412 6575885 6694692 6795556 6878190 6967553 7061700 7139481 7195875 7233083 7260572 7285730 7328310
9401 7328310 7359216 7409796 7461583 7486345 7535661 7584592 7630168 7658751 7677281 7701637 7746592
9390 7746592 7798210 7866897 7921336 7963001 8008680 8060175 8097887 8128004 8182442 8247915 8331924
9379 8331924 8390211 8419054 8465460 8522589 8542521 8558302 8576076 8598048 8605298 8622355 8634665 8651307
9367 8651307 8684912 8745197 8783766 8862455 8936954 9018227 9107668 9158708 9218967 9267067 9334622
9356 9334622 9420226 9488701 9568162 9668735 9747098 9814212 9892303 9944221 10022485 10114650 10195922
9345A0195922Q3886N0493K5753L7686M5173N9105R0975Q8734O5333O8592Q8555
9334A0900207J03533R4399Q4571Q5360M8990M0636M9827P5089N9346M0165L7569
9323A1619692L2126O5794J04818J20861R7063R5041J03383J06183R2169J21859
9313A2558989J35521J28976J40309J45630J40266J55058J66798J49697J21668
9304A3842912J40596J38369J39875J54126J41548J27793J15844R8432R5808Q5247
9294A5080550O1171O0517O0028N8256O5542O0525R9200Q7572R4711J09828J39975
9283A5977875J62810J78841J39475J34595J38281J52211J52466J49182J68517
9274A7354253J75547J70070J58162J77026J79553J95112J83555J90595K14382
$$ plain form
9345 10195922 10279808 10330301 10356054 10393740 10438913 10498018 10588993 10677727 10743060 10811652 10900207
9334 10900207 11003740 11098139 11182710 11268070 11317060 11357696 11407523 11482612 11541958 11582123 11619692
9323 11619692 11651818 11717612 11822430 11943291 12040354 12135395 12238778 12344961 12437130 12558989
9313 12558989 12694510 12823486 12963795 13109425 13249691 13404749 13571547 13721244 13842912
9304 13842912 13983508 14121877 14261752 14415878 14557426 14685219 14801063 14899495 14995303 15080550
9294 15080550 15141721 15202238 15262266 15320522 15386064 15446589 15545789 15633361 15728072 15837900 15977875
9283 15977875 16140685 16319526 16459001 16593596 16731877 16884088 17036554 17185736 17354253
9274 17354253 17529800 17699870 17858032 18035058 18214611 18409723 18593278 18783873 18998255
9265A8998255J81241J71743J96465K04951J90360J72637J84464J94997K17858
9256B0712971K22863K03460K10620K16814K29057K08007J69892J55163J62309
9247B2491156J58363J61407J63404J69486J78400J98918K34217K47121K20087
9238B4222559K22641K42146K37097K54057K20306K04601K00681K39417K75911
9229B6319416K32963K16125K37231K40208K48157K46119K57650K69792K52187
9220B8519848K58590K93380L44156L40558L14414L31650L65595L46828L55404
9211C1470423L25187K93902L11662K83022K70717K68676K67967L01097K91974
9202C4084627K98374L26135L29699L37637L25549L13705L11717L45049L35211
$$ plain form
9265 18998255 19179496 19351239 19547704 19752655 19943015 20115652 20300116 20495113 20712971
9256 20712971 20935834 21139294 21349914 21566728 21795785 22003792 22173684 22328847 22491156
9247 22491156 22649519 22810926 22974330 23143816 23322216 23521134 23755351 24002472 24222559
9238 24222559 24445200 24687346 24924443 25178500 25398806 25603407 25804088 26043505 26319416
9229 26319416 26552379 26768504 27005735 27245943 27494100 27740219 27997869 28267661 28519848
9220 28519848 28778438 29071818 29415974 29756532 30070946 30402596 30768191 31115019 31470423
9211 31470423 31795610 32089512 32401174 32684196 32954913 33223589 33491556 33792653 34084627
9202 34084627 34383001 34709136 35038835 35376472 35702021 36015726 36327443 36672492 37007703
9193C7007703L49604L51507L47275L65274L54998L55313L58473L78759L67913
9184D0236819L47983L33792L19941L35169L42230L53908L55757L61221L90190
9175D3377010L87224L81785L76160L77801L80177L91292L57450L38306L43717
9166D6710922L28146L23936L25664L40812L30643L44735L63462L63627L47444
9157D9779391L41551L34524L39282L15634L02444L17428K76363K62199K67145
9148E2535961K91577L09337K76524K57929K25451K14239J90305J85525J79314
9139E4666162J95253J90138J91293J84907J52153J54548J62484J62890J63181
9130E6223009J21700Q5821O4245P3667O8128O0922M7330J7528k130K785j811o241
$$ plain form
9193 37007703 37357307 37708814 38056089 38421363 38776361 39131674 39490147 39868906 40236819
9184 40236819 40584802 40918594 41238535 41573704 41915934 42269842 42625599 42986820 43377010
9175 43377010 43764234 44146019 44522179 44899980 45280157 45671449 46028899 46367205 46710922
9166 46710922 47039068 47363004 47688668 48029480 48360123 48704858 49068320 49431947 49779391
9157 49779391 50120942 50455466 50794748 51110382 51412826 51730254 52006617 52268816 52535961
9148 52535961 52827538 53136875 53413399 53671328 53896779 54111018 54301323 54486848 54666162
9139 54666162 54861415 55051553 55242846 55427753 55579906 55734454 55896938 56059828 56223009
9130 56223009 56344709 56430530 56494775 56568442 56636570 56697492 56744822 56762350 56760220 56763005 56761194 56754953
9118E6754953k5824m1249l8163n4746n4615p2329r5581j03382r9153j10087j24341
9107E5935483j55341j60038j51502j38298j54124j77722k10445k16032k22925
9098E4349056k14948j98577k15882k17290k05229k08928k32839k33634k44515
9089E2377214k85168k96261k95276k93505l11700l35249l30459l23132l20795
9080D9585669l56890l60464l27192l38611l43515l47769l65350l34988l36366
9071D6474524l40799l38261l42777l25497l35627l49770l34037l32562l29799
9062D3445395l15654l40486l32662l52646l51452l62119l35605l66868l90836
9053D0297067l88000l63685l51255l75988l79635l66760l40271l34327l26871
$$ plain form
9118 56754953 56729129 56687880 56649717 56594971 56540356 56468027 56372446 56269064 56169911 56059824 55935483
9107 55935483 55780142 55620104 55468602 55330304 55176180 54998458 54788013 54571981 54349056
9098 54349056 54134108 53935531 53719649 53502359 53297130 53088202 52855363 52621729 52377214
9089 52377214 52092046 51795785 51500509 51207004 50895304 50560055 50229596 49906464 49585669
9080 49585669 49228779 48868315 48541123 48202512 47858997 47511228 47145878 46810890 46474524
9071 46474524 46133725 45795464 45452687 45127190 44791563 44441793 44107756 43775194 43445395
9062 43445395 43129741 42789255 42456593 42103947 41752495 41390376 41054771 40687903 40297067
9053 40297067 39909067 39545382 39194127 38818139 38438504 38071744 37731473 37397146 37070275
9044C7070275l03262l26921l55597l22319l21693l26825l22110l10487l01924
9035C4179137l22434l30798l13044l14855l04054l06738k94799k78747k61479
9026C1452189k66273l01416l02718l01146k69794k73355k98552k89983l10756
9017B8838196k78105k62979k61749k42405k26185k53537k68642k36950k23754
9008B6583890k32503k27686k07512k06554k23625k18312k14155k11387k09618
8999B4632538k22132k25149k10004j93701j70459j77453j74465j34013r6980r8616
8989B2929566p0373o2385l6606K5355M3434M2433L9867M5406N3721P8807O7122
8978B3156347k3797j22913k27179k46964k47297k97345l59100l93204m14267l65574
$$ plain form
9044 37070275 36767013 36440092 36084495 35762176 35440483 35113658 34791548 34481061 34179137
9035 34179137 33856703 33525905 33212861 32898006 32593952 32287214 31992415 31713668 31452189
9026 31452189 31185916 30884500 30581782 30280636 30010842 29737487 29438935 29148952 28838196
9017 28838196 28560091 28297112 28035363 27792958 27566773 27313236 27044594 26807644 26583890
9008 26583890 26351387 26123701 25916189 25709635 25486010 25267698 25053543 24842156 24632538
8999 24632538 24410406 24185257 23975253 23781552 23611093 23433640 23259175 23125162 23028182 22929566
8989 22929566 22859193 22796808 22760202 22785557 22828991 22871424 22911291 22956697 23010418 23089225 23156347
8978 23156347 23132550 23009637 22782458 22535494 22288197 21990852 21631752 21238548 20824281 20458707
8968B0458707l59898l08278k50893k35664j95834j56691j00477j18453j37077
8959A8595442j10256p9180p6048o7237r4093n5330k1449J5333P6994J06606J61539
8948A8452321K28345L38749M58706O13118P79358R99566J235009J554572K060209
8939B6719953K703764L362210L889735M156831M183912M074620L867789L582659
8931E6541473K943327J563591n83357k609750l620031l888724m093532m034937
8923D2218060l745031l557180l215615k557243j784061j188840q07265n14793
8915B4848032k78467r9358L8990Q7788P8657J4790L0532J43106L18898M97393
8905B5680361O87987R49916J268149J714553K211061K637264L004752L103688
$$ plain form
8968 20458707 20098809 19790531 19539638 19303974 19108140 18951449 18850972 18732519 18595442
8959 18595442 18485186 18406006 18329958 18262721 18168628 18113298 18091849 18107182 18184176 18290782 18452321
8948 18452321 18680666 19019415 19478121 20091239 20870597 21870163 23105172 24659744 26719953
8939 26719953 29423717 32785927 36675662 40832493 45016405 49091025 52958814 56541473
8931 56541473 59484800 61048391 60465034 57855284 54235253 50346529 46252997 42218060
8923 42218060 38473029 34915849 31700234 29142991 27358930 26170090 25362825 24848032
8915 24848032 24569565 24470207 24509197 24596985 24675642 24690432 24720964 24864070 25182968 25680361
8905 25680361 26368348 27318264 28586413 30300966 32512027 35149291 38154043 41257731
8897D1257731K895340K704341K534214K319010J882418Q82389l11466p84345o06418
8888E2773214l70401o20902j407513j923876j834404j191701j98414O24241J295707
8879D7145951K025715K762818L141256K992908K613519K598019K876308K848576
8871F9005070K212140J512627J234966J298516J433654J191554O98714l655j110643
8862G7472943k554590l820082m152112l439830k465948j947987j551939p31151
8854E6809304M72901J535762K013669J905439J735555J756374J487209O28194
8846F8344407k94249j270573k108551k166441j481971l79773R20399K142216K819366
8837F6524830K967961L025306K957141K864705K401437J322212K60573n85296
$$ plain form
8897 41257731 44153071 46857412 49391626 51710636 53593054 54475443 54163977 53379632 52773214
8888 52773214 52402813 51781911 50374398 48450522 46616118 45424417 45226003 45850244 47145951
8879 47145951 49171666 51934484 55075740 58068648 60682167 63280186 66156494 69005070
8871 69005070 71217210 72729837 73964803 75263319 76696973 77888527 78587241 78583586 77472943
8862 77472943 74918353 71098271 66946159 63506329 61040381 59092394 57540455 56809304
8854 56809304 57282205 58817967 60831636 62737075 64472630 66229004 67716213 68344407
8846 68344407 68050158 66779585 64671034 62504593 61022622 60642849 61563248 63705464 66524830
8837 66524830 69492791 72518097 75475238 78339943 80741380 82063592 82324165 81738869
8829H1738869j192786j495842j723359j902109k093667k125913k021127j792060
8821F7392006j533967j508722j438974j201457p36084M7490J173674K235752L066625
8812F7496343L759437M382789M482104L923094K895530J636320O54494K84681
8804H9514792R7810l55421j263961j887173j951598k111326k255783k136092j977556
8795G5673692j828320j542540j168204q56347p19493o27379n45572l84976r8712
8786F7902149J57978K21714K45855M48503P03262K94584q15803j732746k297378
8777F5128118k625608k445752j803815j015214J9522J108854J738417J906878
8769F2011400J945387J782466J402158N00097j021013k266114k697391k545317
$$ plain form
8829 81738869 80546083 79050241 77326882 75424773 73331106 71205193 69184066 67392006
8821 67392006 65858039 64349317 62910343 61708886 60972802 61020292 62193966 64429718 67496343
8812 67496343 71255780 75638569 80120673 84043767 86939297 88575617 89230111 89514792
8804 89514792 89612602 89257181 87993220 86106047 84154449 82043123 79787340 77651248 75673692
8795 75673692 73845372 72302832 71134628 70278281 69558788 68931409 68385837 68000861 67902149
8786 67902149 68060127 68281841 68527696 68976199 69679461 69974045 69158242 67425496 65128118
8777 65128118 62502510 60056758 58252943 57237729 57257251 58366105 60104522 62011400
8769 62011400 63956787 65739253 67141411 67641508 66620495 64354381 61656990 59111673
8761E9111673k036116j532562r12168J45959J558092K935318M009923M464891
8753F7745010M219147L352897K321776J975501J866050N92634k192528m821695
8745G5058792m880857l493881k413823j851538j273953q01601n79136k26938J82241
8736E9719306J76240q3222l21260j21885L10774J68592n29329j317509j740624
8727E6261083j728096j502217j566536k139692k844822l190191l100265k860751
8719C7328513k634098k352833k160759j944448j655037j386988j176891r94790
8711B3022669q17916o98978o09600n86194n48053m90874m07499l64014l66855
8702A8132686m05692m09047k65583j18109K785K11792M93807Q33897J303804J786103
$$ plain form
8761 59111673 57075557 55542995 54630827 54776786 56334878 59270196 63280119 67745010
8753 67745010 71964157 75317054 77638830 79614331 81480381 82073015 79880487 75058792
8745 75058792 70177935 66684054 64270231 62418693 61144740 60343139 59764003 59537065 59719306
8736 59719306 59895546 59812324 59491064 59369179 59679953 59848545 59319216 58001707 56261083
8727 56261083 54532987 53030770 51464234 49324542 46479720 43289529 40189264 37328513
8719 37328513 34694415 32341582 30180823 28236375 26581338 25194350 24017459 23022669
8711 23022669 22204753 21505775 20896175 20309981 19761928 19271054 18863555 18499541 18132686
8702 18132686 17726994 17317947 17052364 16934255 16937040 17148832 17642639 18476536 19780340 21566443
8692B1566443K215693K622454K960398L157215L185357K851960K173556J316760
8684D2049836J01603r81976j586984k266829l026812l420727l405279l044074
8676B4418758k693389k455480k057074j590232j208312r41354p69926o12931n01690
8667A1588370m32279l97628l26452l14714l13927k82981k39664k22476k35632
8658H822617k06758k05821j89497j35474j14040j02040o4600m1843l357o488p659
8647G745040L080O1818J08224P3526l80m3390q4203q6038q7633j00461j76183
8636G413400k33931k72335k63308k32140k06851k02644k23352k11840j94650j58386
8626E213963j17204r1182r9657q9823j00507r8741r1295r4459p7764o3418n2590
$$ plain form
8692 21566443 23782136 26404590 29364988 32522203 35707560 38559520 40733076 42049836
8684 42049836 42151439 41169463 39582479 37315650 34288838 30868111 27462832 24418758
8676 24418758 21725369 19269889 17212815 15622583 14414271 13472917 12702991 12090060 11588370
8667 11588370 11156091 10758463 10432011 10117297 9803370 9520389 9280725 9058249 8822617
8658 8822617 8615859 8410038 8220541 8085067 7971027 7868987 7804387 7762544 7759187 7752699 7745040
8647 7745040 7748120 7809938 7918162 7991688 7991308 7947918 7863715 7777677 7690044 7589583 7413400
8636 7413400 7179469 6907134 6643826 6411686 6204835 6002191 5778839 5566999 5372349 5213963
8626 5213963 5096759 5005577 4905920 4816097 4715590 4616849 4525554 4431095 4353331 4289913 4237323
8615D237323n4307o4302m9777l3735m3160m3040m2640m9187m1077k3002k0281
8604C772815k8586m8981m3790m1082m1767l5441j8202j5712j6967m367j1273k7914
8592C438733l4982l3352l0177j8137j2975l5527l8853j1581m2476m6252k6072
8581C108349l6935k2644J8768K402k6416j1579j2619j2620K624K2355J9254j3435
8569C037504K0592P9772J37294J80633K22269K18890K14014J89786J91836J99515
8559D692105J40099j8684k51293l92134l70930l01083k12852j57661r7009q3202
8549B947356p9216o0069l0209l1250l2573m0472j5328j0622k3380j1411m881j4645
8537B593300j1490q245J0991L374K098K1596J0311K2304M5761Q0935J15363J34268
$$ plain form
8615 4237323 4183016 4118714 4068937 4035202 3992042 3949002 3906362 3857175 3816098 3793096 3772815
8604 3772815 3744229 3695248 3651458 3610376 3568609 3533168 3514966 3499254 3482287 3477920 3466647 3438733
8592 3438733 3403751 3370399 3340222 3322085 3309110 3273583 3234730 3223149 3180673 3134421 3108349
8581 3108349 3071414 3048770 3067538 3069940 3043524 3031945 3019326 3006706 3009330 3031685 3050939 3037504
8569 3037504 3058096 3137868 3275162 3455795 3678064 3896954 4110968 4300754 4492590 4692105
8559 4692105 4832204 4813520 4562227 4170093 3799163 3498080 3285228 3127567 3030558 2947356
8549 2947356 2868140 2808071 2777862 2746612 2714039 2673567 2658239 2647617 2624237 2612826 2607945 2593300
8537 2593300 2581810 2573565 2584556 2587930 2590028 2611624 2621935 2644239 2690000 2770935 2886298 3020566
8525C020566J97637K84405L08204L08061K61193K07503J78778J06392l5510k34084
8515D603145l97983m57477l77316k76549j92046j39513q7070q0871o4178m4728
8505B485414n1228k8627l7031l2341j5287j2492p343j3765k1808k0134J492J872
8493B248722m131j622k0841l694L0973J2697L5059N3978O4496K4364M9593K1287
8481B510881J140J5472J6852j1675k6359l9913l6902m3565m7474l8480J1423K7029
8469B338429K59j5026m069M152R043P871r520K2393J2856n254L3740M5962M2773
8456B483609K9696L4985K1002j511k1990n0404p5545r1119p3751m1156l3683k6415
8444B153718j2582j537J4185R390r510P226m406k3777l9577k5202l0709k834K1977
$$ plain form
8525 3020566 3218203 3502608 3810812 4118873 4380066 4587569 4766347 4872739 4837229 4603145
8515 4603145 4205162 3747685 3370369 3093820 2901774 2762261 2675191 2594320 2530142 2485414
8505 2485414 2434186 2405559 2368528 2336187 2320900 2308408 2301065 2287300 2265492 2245358 2246850 2248722
8493 2248722 2244591 2242969 2222128 2218434 2249407 2262104 2297163 2351141 2415637 2440001 2489594 2510881
8481 2510881 2512021 2527493 2544345 2532670 2506311 2466398 2429496 2385931 2338457 2299977 2311400 2338429
8469 2338429 2338688 2323662 2319593 2323745 2332788 2340659 2331139 2353532 2366388 2361134 2394874 2440836 2483609
8456 2483609 2513305 2548290 2569292 2567781 2545791 2495387 2419842 2328723 2254972 2213816 2180133 2153718
8444 2153718 2141136 2139599 2153784 2163174 2153664 2160890 2156484 2132707 2093130 2067928 2037219 2034385 2056362
8431B056362Q730K0153J6566L4142M4578M3925N1090M4558L5040Q708O162j1178
8419B358836j4567l8062n6938n9385l2579l4675n6383m0366k2242j2357j5365
8408A975917j7070j8525j9679J0483J3732J4255J5487K1332K0766L6374L5420
8397B088492R048k6995j4775J5538Q629n97j5400n6487n8496k5198k7501j4500
8385A881758l0199k1354N057J835j0395j90K1046o99j9790j039K5231K490N971
8372A859722J3615j1927j1121l1312k9054k1875k8901r863J5751J3255K5452M6604
8360A830346M4057K9394N0665L9962L8441O4866P4854R1009R7190J65433K61631
8349B787848L71600M25947M27493M10991L75968L62548L10604K37464Q2361j69451
$$ plain form
8431 2056362 2065092 2085245 2101811 2135953 2180531 2224456 2275546 2320104 2355144 2363852 2370014 2358836
8419 2358836 2344269 2306207 2249269 2189884 2157305 2122630 2066247 2025881 2003639 1991282 1975917
8408 1975917 1958847 1940322 1920643 1931126 1944858 1959113 1974600 1995932 2016698 2053072 2088492
8397 2088492 2097540 2070545 2055770 2071308 2079937 2079340 2063940 2007453 1948957 1923759 1896258 1881758
8385 1881758 1851559 1830205 1835262 1837097 1826702 1826512 1847558 1846859 1827069 1826030 1851261 1853751 1859722
8372 1859722 1873337 1861410 1850289 1818977 1789923 1768048 1739147 1729284 1745035 1758290 1783742 1830346
8360 1830346 1874403 1903797 1954462 1994424 2032865 2097731 2172585 2263594 2360784 2526217 2787848
8349 2787848 3159448 3585395 4012888 4423879 4799847 5162395 5472999 5710463 5792824 5623373
8339E623373l93884n11312m75769l74185k94307k43670j99324j55669r4811p5140
8329B805302o8996l5322m2834k3916k4933j4503p031l2934j0585L7099N5813P6949
8317B714109R2953J20552J73160K43696L06106L69475L61717L14109K90830K46134
8307E232841J48055K3200j79268l71828m97756n24224m70656l83239k85293k16969
8297B474863j57593j29298j02510n6590k2805m0325o6229l9394l3647n9055l3016
8286A734401l0660k3568k1741k8278j9385j802m247J2077P12r331M354l57k5742
8273A586433m8222l5652k7538k4714l4677k9673j9275k6121k0272l3885l6679
8262A249725k1975k3039K777O920N155k7020k7779j6983M046k827j1414k4219
$$ plain form
8339 5623373 5229489 4718177 4242408 3868223 3573916 3330246 3130922 2975253 2880442 2805302
8329 2805302 2736306 2700984 2658150 2634234 2609301 2594798 2587767 2554833 2544248 2581347 2637160 2714109
8317 2714109 2807062 2927614 3100774 3344470 3650576 4020051 4381768 4695877 4986707 5232841
8307 5232841 5380896 5404096 5224828 4853000 4355244 3831020 3360364 2977125 2691832 2474863
8297 2474863 2317270 2187972 2085462 2028872 2006067 1965742 1899513 1860119 1826472 1767417 1734401
8286 1734401 1703741 1680173 1658432 1630154 1610769 1608967 1604720 1616797 1617509 1608178 1612532 1612175 1586433
8273 1586433 1538211 1502559 1475021 1450307 1415630 1385957 1366682 1340561 1320289 1286404 1249725
8262 1249725 1227750 1204711 1207488 1214408 1219563 1192543 1164764 1147781 1151827 1149000 1137586 1113367
8250A113367j919J1243j4792j8187J2063R799k5502q046J503P183O78j8619j6129
8237A052642k2686P282q82J0103j107j4157n378j5763Q827l385m465j6171j9343
8224I75517J078j4909Q029J7637o836k5403n140Q231q816r133j0536j7630k1731
8211H90358J3362K896j2569r26M975N070j0359j0245O24j031K964K4245p206j2563
8197H89595j3324l577k2669j2274N285Q345K9013J7575k4215k1217r18K733K662
8184H57014o55M478J8549j164o105o317q328J369N143L006K3030K947j4341j7535
8170H61091j1664j1502Q498p417j7480k928J4539j557L133J2227j3137j9471o253
8157H08079O878J7499k13k028J2064K0591O580q864j090k9593j5482n632J2290
$$ plain form
8250 1113367 1111448 1122691 1107899 1089712 1101775 1111574 1086072 1078026 1079529 1086712 1087390 1068771 1052642
8237 1052642 1029956 1037238 1036356 1046459 1045352 1031195 1025817 1010054 1018881 1015496 1011031 994860 975517
8224 975517 976595 961686 969715 987352 980516 955113 949973 958204 949388 940255 929719 912089 890358
8211 890358 903720 906616 894047 893121 898096 903166 892807 882562 883186 882155 885119 909364 902158 889595
8197 889595 876271 872694 850025 837751 843036 851381 880394 897969 873754 852537 851619 854352 857014
8184 857014 856359 860837 879386 878222 872117 865800 857472 858841 863984 866990 890020 892967 878626 861091
8170 861091 849427 837925 846423 839006 821526 818598 833137 831580 834713 846940 833803 814332 808079
8157 808079 814957 832456 832243 830215 842279 862870 869450 860586 859496 829903 814421 808789 821079
8144H21079J5612p073j5335j8675k5219q150K3658J0512k4637l575k171P900M151
8131G78077k6464j4153q408R255j859m666J8244J3001R095K3303P284p795K0577
8118H15491M2917L4519R552K1764L5898J5136n931p122j3055m1564n8547k9872
8106H19186r214j346K994n817j5783k2790j9782J0145K0158j802r033J5916k582
8093G80250j5699P075J977K336K3188J2219M917L3905M0017P1276J19036J58503
8081A239000K18534K42913K19623J84943J85921J95114J97161N2902j99192l61034
8071B175885l27323k51119j87844j43758j09310p4232m8928j6076j4359l6160
8061I66776l9940j1811n560l8712j4839k6273Q368K2817o745l242l578K849J495
$$ plain form
8144 821079 836691 829618 814283 795608 770389 762239 785897 796409 771772 768197 766026 773926 778077
8131 778077 751613 737460 729052 738307 736448 731782 750026 763027 772122 795425 802709 794914 815491
8118 815491 858408 892927 902479 924243 960141 975277 969346 962224 949169 907605 849058 819186
8106 819186 809972 808626 811620 805803 790020 767230 747448 757593 777751 775949 766916 782832 780250
8093 780250 764551 771626 773603 775939 799127 811346 816263 850168 890185 961461 1080497 1239000
8081 1239000 1457534 1700447 1920070 2105013 2290934 2486048 2683209 2736111 2536919 2175885
8071 2175885 1848562 1597443 1409599 1265841 1156531 1082299 1033371 1017295 1002936 966776
8061 966776 926836 915025 909465 870753 855914 829641 838009 860826 854081 850839 847261 850110 851605
8048H51605M748M2273J9079K6199L3781N7176J26314J88215K28348K05561J48671
8037A931970J63035J60534J86964J30099j36762l46190l40056k25034j55563j13138
8027A255859r6623o5077m5610l9070m0699k5693j2977M03J6433Q214R255J8271
8015I82686K9824M6707O998J5339l54j2639l624j232r888k5457l8681j5449p333
8002I66897j8830k904l0367l9752l8095l4212l4790p715p584l3102J094j2184
7990G08456j074J4650J2219L0546K3488J7730K500M924j644l0922p434j506j2049
7977G59884j181l085J5251J1935J1063L2923N4692P6326O2830M9820M9474N4024
7965A173956L7210M6360j2290m0461q2560m3498j8143k915P566j6884m1259n3093
$$ plain form
8048 851605 856353 898626 917705 943904 977685 1034861 1161175 1349390 1577738 1783299 1931970
8037 1931970 2095005 2255539 2442503 2572602 2435840 2089650 1749594 1524560 1368997 1255859
8027 1255859 1159236 1094159 1048549 1009479 968780 943087 930110 930513 946946 955160 964415 982686
8015 982686 1012510 1059217 1066215 1081554 1081200 1068561 1064937 1063705 1053817 1028360 989679 974230 966897
8002 966897 948067 945163 914796 875044 836949 802737 767947 760232 752648 719546 720640 708456
7990 708456 707382 722032 734251 764797 788285 806015 808515 813439 811795 780873 773439 771933 759884
7977 759884 758703 755618 770869 782804 793867 826790 881482 957808 1020638 1070458 1119932 1173956
7965 1173956 1211166 1257526 1245236 1204775 1122215 1078717 1060574 1057659 1065225 1048341 1007082 953989
7953I53989n9983m1970l5452l1640j4531j8751Q303J450p409r025J3632M266n345
7940G57534j2693M057j6190j8353k6028K574J9152m552j0483J272l300k0359j0366
7927F62265J6609K8152J6446J3250J5129M324J4231P750J0026K2523J5900j826
7915H24779j8939j7018L4j6382k2826N52j9843k7137l6086j5601J1022O243k7224
7902F41574j2175j3759k3921j0394j1500k354P229q174r796j6225M870Q186n86
7889E52975P386j6346Q371k5814k5902M378J7801K2080N038j3025P800n994q082
7876E30666J452r735m221m354J722j120n335k1539j8373j7583j1860k89J2216
7863D51647J1241k081O78J4546P180n628K561L753q774o753K8172l283L574k641
$$ plain form
7953 953989 894006 852036 816584 784944 770413 751662 759965 761415 754006 744981 758613 762879 757534
7940 757534 744841 748898 732708 714355 688327 690901 710053 705501 695018 696290 692990 672631 662265
7927 662265 678874 707026 723472 736722 751851 756175 770406 778156 788182 810705 826605 824779
7915 824779 805840 788822 788856 772474 749648 750200 730357 703220 667134 651533 662555 668798 641574
7902 641574 629399 615640 591719 581325 569825 567471 574700 566526 556730 540505 545375 553561 552975
7889 552975 560361 544015 552386 526572 500670 505048 522849 544929 549967 536942 544742 538748 530666
7876 530666 532118 522383 518162 513808 515530 514410 509075 487536 469163 451580 439720 439431 451647
7863 451647 462888 460807 461485 476031 483211 477583 480144 483897 475123 468370 496542 493259 496833 494192
7849D94192O938K338j8178k5126j5650l328j628q274Q423J2780J261K9343j120
7836D81971k1624N957l975m921q088N696O028J3216j861P122j7199p686M197k7258
7822D31575j879J2483k0680p107J3313J1172J2700j7767j1034j789o388Q986K045
7809D25630o412k6130j2569K1690L5708J9260j6137k0862k842P829J3740Q172
7797D47077j5452K584j0949M38J4651P355l2711k6628m439K0600K3503R172j2148
7784D23053N50N049j0081K568r492J0370Q937J4531o188m082Q401k216j8689k57
7770D22454q120k3119j5789R99J126K1891M99j5312j5291O056R530O816j4415
7757C77325n442r967J8852j3399J004M832P178R474m131J2204R833p190l095j1979
$$ plain form
7849 494192 501130 503468 485290 460164 444514 441186 439558 431284 439707 452487 453748 483091 481971
7836 481971 460347 466304 462329 457408 449320 455016 461044 474260 472399 479521 462322 454636 458833 431575
7822 431575 429696 442179 421499 414392 427705 438877 451577 433810 422776 420987 414599 423585 425630
7809 425630 419218 393088 380519 402209 437917 457177 441040 420178 417336 425165 438905 447077
7797 447077 431625 434209 423260 423698 438349 445704 412993 386365 381926 402526 426029 435201 423053
7784 423053 423603 428652 418571 421139 411647 422017 430954 445485 439297 435215 443616 441400 422711 422454
7770 422454 414334 391215 375426 376425 377551 399442 399941 384629 369338 375394 384924 391740 377325
7757 377325 371883 361916 380768 367369 368373 373205 380383 389857 385726 397930 407763 400573 397478 385499
7743C85499o222j0524M645q17K0848K2207p627k4292p193J0418M907o897m478
7730C80474k0250k636J2051Q145p549j0172J2797P463p632q788p757o071r522
7717C40553J1622J1024R897K304q762n581j0564j4720J3499J8060k069r471J118
7704C56910P886K572r34K662p362N962k2210m1303K712J8719o144k040j232j817
7690C14381o905K5922P194q828q474l7605J0278K2387l059N212J43m639J7379
7677C33386J8079r543o757J3181j8469j3625J3671K6169J338p212m449j2771J6590
7664C49588L206j4587p95j0383r327m856O941o210k2623j2613L267J5851N190
7651C02649O075K392j0483l659N398K4948n015P49O848J4371L307k7993r813k3637
$$ plain form
7743 385499 379277 368753 373398 372581 393429 415636 408009 383717 376524 386942 391849 384952 380474
7730 380474 360224 357588 369639 377784 370235 360063 372860 380323 372691 363903 356146 350075 340553
7717 340553 352175 363199 373096 375400 366638 361057 350493 335773 349272 367332 365263 355792 356910
7704 356910 364796 367368 366434 369096 361734 367696 345486 304183 306895 325614 319470 317430 316198 314381
7690 314381 307476 333398 340592 331764 323290 285685 295963 318350 315291 320503 320646 316007 333386
7677 333386 351465 341922 335165 348346 329877 316252 329923 356092 357430 350218 345769 332998 349588
7664 349588 352794 338207 337412 327029 317702 312846 319787 313577 290954 278341 281608 297459 302649
7651 302649 308724 311116 300633 296974 302372 327320 322305 323054 329902 344273 347580 319587 309774 286137
7637B86137p261K492r827K568J5989J5138m42O83j7554j1261R721P289r891j968
7623B81813j4013k255J5728J0152L656J1940J5089J4135l145j2098M737q22j0082
7610C14835j3396J154n687L608R397P166j1011k315k081l664L388j2134k494L264
7596B90030P753k74N218q927j2989K981J6675k972j0422j0336O664R934J0198
7583C03533k138o058j9650O363J6490J0346m28r64o820j0953j9831j8251N712
7570B57351m955j0910J173J7520K5518K82j1268l265J4731R347p379j0350N944
7557B83739J1717j5491J6977M51k976j7358K797p97m84O498k526q479r017J4699
7543B79750J08J0919L592j1590j2105k0092J3613K6293k363j0836J0257J11j6253
$$ plain form
7637 286137 278876 281368 271541 274109 290098 305236 304794 305477 287923 276662 286383 293672 283781 281813
7623 281813 267800 265545 281273 291425 295081 307021 322110 336245 333100 321002 325739 324917 314835
7610 314835 301439 302593 296906 300514 309911 317077 306066 303751 301670 298006 301394 289260 286766 290030
7596 290030 297783 297509 302727 293800 280811 283792 300467 297495 287073 276737 283401 293335 303533
7583 303533 301395 295337 275687 282050 298540 308886 308458 307494 300674 289721 269890 251639 257351
7570 257351 252396 241486 242659 260179 285697 285979 274711 271446 286177 295524 288145 277795 283739
7557 283739 295456 279965 296942 297393 294417 277059 279856 279059 278575 285073 282547 274068 265051 279750
7543 279750 279858 290777 294369 282779 270674 250582 264195 290488 288125 277289 287546 287657 271404
7530B71404o901q233j0089j426K5026L174r183n67J5018J2573j0257j2756j6040
7517B51743Q518P73J0301k0257k76K4995J5479j5887J840n152j8197J0524K4177
7504B88581N031K172j1654o546j403j9732o853J8797J4799j344j5798l0899j4197
7491B20954j67J5754J5253J299o032r797N869k2522Q873o535K204J6817k285K451
7477B42136o080J286K348j445R68R310J0764j6179j210J8098j4156r745k267K68
7463B34096j53N5j5633R045K1527j6162j2877Q513J2766J6700p304N441m211m890
7449B46913j5963r682R691K0668Q067j5367l944K247j2014j4945P191J4707K1692
7436B59261j528j1724j6233j6738j706J1555j7200k3937J3122J8207j0493j9364
$$ plain form
7530 271404 264503 256270 246181 244755 269781 272955 263772 263205 278223 290796 280539 267783 251743
7517 251743 260261 261034 271335 251078 250802 275797 291276 275389 277229 272077 253880 264404 288581
7504 288581 293612 295784 284130 277584 276181 256449 249596 268393 283192 281848 266050 235151 220954
7491 220954 220787 236541 251794 253093 247061 237264 243133 220611 229484 222949 225153 241970 239685 242136
7477 242136 236056 237342 239690 238245 239213 248523 259287 243108 241898 259996 245840 236095 233828 234096
7463 234096 233943 233998 218365 227410 248937 232775 219898 228411 241177 257877 250573 256014 251803 246913
7449 246913 230950 221268 230959 251627 259694 244327 240383 242630 230616 215671 222862 237569 259261
7436 259261 257733 246009 229776 213038 211332 222887 205687 181750 194872 213079 202586 183222
7424A83222m785K563K1293K3435P032n412q689Q19R54j0507j800J9665J3317J9893
7410B61000O609q150P518L299q324n85J786O660M142j1192p739j3484j2841o308
7396B22391q054j3371N278J3594j885j1042L972j0724J464J3720n160M735j268
7383B13650J0426K583m298O969j1547k3357l0131o167N951R726J8210K1321J0199
7370B23535k2711k4905r693J5305N576L312N305r184j1466O528K5722J3251J6465
7357B37040o188P583j7069j4326R60J6522O739j4520M034n594j565j665o576k1094
7343A84281K1700J4792J3692l8j7105o573P833L40j358J065L972r206k299q03
7329B10293j938j4047J961M720J2489N829k4177r998K0367J9654J2461j6522j2660
$$ plain form
7424 183222 178437 181000 202293 225728 232760 227348 218659 219478 220432 209925 208125 227790 241107 261000
7410 261000 267609 259459 266977 270276 261952 261367 263153 269813 273955 262763 255024 241540 228699 222391
7396 222391 214337 200966 206244 219838 217953 206911 210883 200159 201623 215343 210183 214918 213650
7383 213650 224076 226659 222361 229330 217783 194426 164295 158128 164079 173805 192015 213336 223535
7370 223535 200824 175919 166226 181531 187107 190419 195724 186540 175074 181602 207324 220575 237040
7357 237040 230852 238435 221366 207040 208000 224522 231261 216741 220775 215181 213616 211951 205375 184281
7343 184281 205981 220773 234465 234427 217322 210749 218582 218922 217564 218629 222601 213395 211096 210293
7329 210293 208355 194308 196269 200989 213478 219307 195130 185132 205499 225153 237614 221092 208432
7316B08432R272R064O421l31o052k1006o084J3704j463N892j0965J9015j3617
7303B12282q57L610J0534J2238n384j3970q938l98p083o846J1561k40j8709P23
7289A88523M667r829J6292P623J4093O912m067k3573j2956M344j2423M023J8165
7276B01794J1727l948R369k457j8325q357J2931n176O90J2723Q53O885j3268j2909
7262A92532r707J4869o035j8575K0905M385o152j5842K968j77R06K396k768L766
7248A83471j7313M982l38j2855j2729l622J8845Q558N053M123j959J497K703N701
7234A86117o10N229k855p210J6271j6930k5397j5910m043J6766K833K0422Q055
7221A82738L425J8461r974n190p914o723P124J0357O327J891J2498j3706k8337
$$ plain form
7316 208432 217704 226768 233189 232858 226806 205800 199716 213420 211957 217849 206884 225899 212282
7303 212282 211425 215035 225569 237807 232423 218453 209515 209117 202034 195188 206749 206509 187800 188523
7289 188523 193190 183361 199653 207276 221369 228281 224214 200641 187685 192029 179606 183629 201794
7276 201794 213521 209573 218942 216485 198160 189803 202734 197558 198248 210971 211824 218709 205441 192532
7262 192532 182825 197694 191659 173084 193989 198374 192222 176380 179348 179171 180077 182473 179705 183471
7248 183471 166158 171140 170802 157947 145218 141596 160441 168999 174052 178175 176216 177713 180416 186117
7234 186117 185507 190736 187881 180671 196942 180012 154615 138705 134662 151428 154261 174683 182738
7221 182738 186163 204624 194650 189460 181546 174823 181947 192304 198631 200522 213020 199314 170977
7208A70977k1851o440J8945J6247J9845j557q77Q748o694o376q678r647J3373
7195A86015J7561L286j6288l537J876m666P357q112N884m208N805n221j7199J5210
7181A83763Q307n40n619n108N233J8100L341l970p087j6416k2001J826O881n816
7167A60894j8838m415K2029P297q973r208Q76N88J3201J7107J1167j860J1438
7154B01303j9141j5832k871p048K889J9623K296l84j9142m996J2247Q248N155
7141A82347j2460j8619J8693o341N1j7924j7889J1262N343K7282Q632m579j1625
7128A64173k1389j0769n956j059J516N715Q097P959J0606k313L948p663n743n625
7114A41497n439J0676J496l833k081r697J7940J0940k209j3673r186R966J4442
$$ plain form
7208 170977 149126 142686 161631 177878 197723 196166 195289 204037 197343 190967 182289 172642 186015
7195 186015 203576 206862 190574 187037 188913 184247 191604 183492 189376 185168 190973 185752 168553 183763
7181 183763 192070 191530 185911 180803 186036 204136 207477 203507 196420 180004 158003 159829 166710 160894
7167 160894 142056 137641 159670 166967 157994 148786 149662 150250 163451 180558 191725 189865 201303
7154 201303 182162 166330 163459 156411 159300 178923 181219 180835 161693 156697 168944 177192 182347
7141 182347 169887 151268 169961 163620 163671 145747 127858 139120 144463 171745 180377 175798 164173
7128 164173 142784 132015 126059 125000 126516 132231 140328 148287 158893 156580 160528 152865 147122 141497
7114 141497 136058 146734 148230 144397 142316 132619 150559 161499 159290 145617 136431 146397 160839
7101A60839J4185Q951J118j2956j6883O31J6101J4675P969J2916o741l8355j4226
7088A48224J2192J2190R190q221j6615p521K344m112N5j4352o409j236L561q384
7074A20906K129J4258O998K982k0786J171k567K992J2801K2170K418N705r016
7061A62161j2309J7669j088l0769k453R884O592P556J2524L072J199k1732r694
7048A42612j416J3031o396o767O267p665o117J2600P24M48k523L350J0488M994
7034A63630J4351k688j5774j7323j3690K634j1857n146J5070Q719m798M749J032
7021A38909O896k195J2244k548J132r807P684m517J8469j0317k0603l482l302
7008A28563j4585L373K4738J7648j5598n895j197n07J0240p880L48p76J0775J4752
$$ plain form
7101 160839 175024 183975 185093 172137 155254 155885 171986 186661 194630 207546 200805 162450 148224
7088 148224 160416 172606 181796 173575 156960 149439 151783 147671 147726 133374 126965 125729 129290 120906
7074 120906 123035 137293 144291 147273 126487 127658 125091 128083 140884 163054 165472 171177 162161
7061 162161 149852 167521 166433 135664 133211 143095 149687 157243 169767 172839 174038 152306 142612
7048 142612 141196 154227 147831 141064 147331 139666 133549 146149 146873 147321 144798 148148 158636 163630
7034 163630 177981 175293 159519 142196 128506 131140 119283 114137 129207 137926 133128 137877 138909
7021 138909 145805 143610 155854 153306 154438 144631 152315 147798 166267 155950 135347 131865 128563
7008 128563 113978 117351 142089 159737 144139 138244 137047 136540 146780 138900 139248 138472 149247 163999
6994A63999P505p212J656l294n629M898m512J3845q338k8132k59j88l006J8667
6980A50000J6246j2009l10q935j65M859j6124m881p746N309j412J1008P175j0764
6966A32251O828L052j1360L035M858j2470O234o47O316k187k1684j8803J2298
6953A07721J2971j224N462J5129L637N173J776J039j6229o831J1170j0846M140
6940A33088J3767L465K381o489k5211p222J9902J8211L773K352J129M764j9741
6927A44169k2480R779J9949J271p099L164J0560j0718m876M453j0375m334n267
6914A28196l752J8606k868j1045r412J643J6589J2120j8016j5217n752P113l154
6901A15051n495j3890J1130m608n317P607P608J1747J5193l089j2325J655J0837
$$ plain form
6994 163999 171504 164292 165948 162654 157025 161923 157411 171256 162918 134786 134527 134339 131333 150000
6980 150000 166246 154237 153927 144992 144827 149686 133562 128681 120935 126244 124832 135840 143015 132251
6966 132251 139079 142131 130771 133806 138664 126194 132428 131781 138097 135910 114226 95423 107721
6953 107721 120692 119468 124930 140059 143696 148869 150645 151684 135455 128624 139794 128948 133088
6940 133088 146855 150320 152701 146212 121001 113779 133681 151892 155665 158017 159146 163910 144169
6927 144169 121689 131468 151417 152688 145589 148753 159313 148595 143719 148172 137797 133463 128196
6914 128196 124444 143050 140182 129137 119725 121368 137957 150077 132061 116844 111092 118205 115051
6901 115051 109556 95666 106796 102188 96871 104478 112086 123833 139026 135937 123612 125267 136104
6888A36104P22l062P459K4321l780j1860p466k5651l723O839p954j3679N077M568
6874A07915J4442l984O631M105J3383j3989k0770k977J7265j565j796l42j3925
6861A04393n200q747J1300O560J3807p266R052J2919j5943m440J1936k27j4744
6848A13400j4216j868K4896J7483k573L559r864J2097L7n444Q022m499p577j3253
6834A20200Q432l946K144k122l343k3625m079J82P724K580p077n490j3687q312
6820F9581j954J5480J6301J1776j774L518q784l458K3291M826j3415o152j0341
6807I8895j527j9115L637J0789J9755R996J1114J4960J0552j6118k1199p962J0240
6794A24017J0805j065M911r014k5041K1827M023r237J475p034K512J0340P935
$$ plain form
6888 136104 136826 133764 141223 165544 161764 149904 142438 116787 113064 119903 111949 98270 103347 107915
6874 107915 122357 118373 125004 129109 142492 128503 107733 104756 122021 120456 118660 118318 104393
6861 104393 99193 90446 101746 108306 122113 114847 123899 136818 120875 116435 128371 128144 113400
6848 113400 99184 97316 122212 139695 137122 140681 130817 142914 142951 137507 145529 141030 133453 120200
6834 120200 128632 124686 126830 124708 121365 97740 93661 93843 101567 104147 97070 91580 77893 69581
6820 69581 67627 83107 99408 111184 109410 112928 104144 100686 123977 128803 115388 109236 98895
6807 98895 97368 78253 81890 92679 112434 122430 133544 148504 159056 142938 121739 113777 124017
6794 124017 134822 133757 138668 129654 104613 126440 130463 121226 122701 115667 118179 128519 136454
6781A36454L250N298r512j776k411o906Q283N916k4486k5468j3413j0675J4914
6768G9468J1630K1095J2182N027j4423j3216n122j5308j427O538m818J8954K1748
6755A22328J5209N690j7639K131K734j169J3602j0114q014J0206O177j7171p833
6742A16137j991J2324P122m713o315j3931P868J1693j0350k8112n314J3983J4460
6729A12861L445O879K943K266J4191m796j1604L75M658j0181k17J1880j2290k0892
6715I9518J3441J0479j2774q375N075J8248J0075r024j3681j0924j5427q360K3883
6702A02154N844m368J9671k049k4836p847l930J2078J5637J1327l836N916Q990
6689A34751n76l290j560J562k2507L4n757M2K9768J3944P872K0349o935j2722
$$ plain form
6781 136454 139704 145002 135490 133714 131303 124397 132680 138596 114110 88642 75229 64554 79468
6768 79468 91098 112193 124375 129402 114979 101763 96641 81333 79906 86444 81626 100580 122328
6755 122328 137537 143227 125588 127719 130453 129284 142886 132772 124758 134964 141141 123970 116137
6742 116137 114146 126470 133592 128879 122564 108633 116501 128194 117844 89732 84418 98401 112861
6729 112861 116306 123185 126128 128394 142585 137789 126185 126560 131218 121037 120820 132700 120410 99518
6715 99518 112959 123438 110664 102289 107364 125612 135687 126663 112982 102058 86631 78271 102154
6702 102154 107998 103630 123301 121252 96416 88569 84639 96717 112354 123681 119845 125761 134751
6689 134751 134175 130885 129325 130887 108380 108414 102657 102699 132467 146411 154283 174632 167697 154975
6675A54975j281J4494J0842R573j3025k9166k2812K337l300q943K1402j1058j6837
6662A07201J3470J3277q735r030j0717r436j9693R867J4768j251o320J2445L095
6649A08941J1808j2662n563l1021j2046j485K9249K2722K7603R4j5799j6622p539
6636I7680P799P789K729J0j3835k18j7755K4277K1125J2244j9305k14J9778L254
6622A45358m839k1559j3859q111L0733K9378l600j7257j0529j1512r032j0151
6610I5020j39m018m281n164k658o514J2290L6824K7711l771o735j3207j826k737
6596A20795J4449o287L01J2889R686r110r671j1139n816o461K0193j3422j0023
6583A06384j3953l416O392L851q047l85k698J7579j6776k2102N816J8895Q301
$$ plain form
6675 154975 153694 168188 179030 188603 175578 146412 123600 125937 122637 113694 135096 124038 107201
6662 107201 120671 133948 125213 116183 105466 96030 76337 86204 100972 99721 93401 105846 108941
6649 108941 120749 108087 102524 71503 59457 57972 87221 109943 137546 137640 121841 105219 97680
6636 97680 105479 113268 115997 116007 102172 101954 84199 108476 129601 141845 122540 122326 142104 145358
6622 145358 140519 118960 105101 96990 127723 157101 153501 136244 125715 114203 105171 95020
6610 95020 94881 90863 86582 81418 78760 72246 84536 121360 149071 145300 138565 125358 123532 120795
6596 120795 135244 128957 129258 142147 151833 142723 133052 121913 116097 109636 129829 116407 106384
6583 106384 92431 89015 95407 99258 91211 90826 88128 105707 88931 66829 72645 91540 99841
6570I9841j2137J2370Q070K543q274o800N496j928p440O734M636J0667q926j0514
6556I4338j8817l3800P212L2569K5197j705j3518M019J4888p773k0022J1334J0666
6543A04588m930j6039n446J2156J98j362l536J8516J6270j6937j2757j046l920
6530H5755q927l735K687o812J7756J6609k1465j7345j137J8230K4558J7144P681
6517A30999o113j5448n196R287R338J2721q627l0738k4962J1000M334J4478L623
6504A04696J039m065m035J7148J2493L319r547j7513p481l843j6254L751J8607
6491I8315J5073O97k7673j1104K558K937M175j0934n556N113K264J9727K3927
6478A19519J112j0565n392k971J3370m673j5278J4381J889r712j0435j4177M504
$$ plain form
6570 99841 87704 100074 108144 110687 102413 95613 101109 99181 91741 98475 103111 113778 104852 94338
6556 94338 75521 41721 48933 81502 106699 104994 91476 95495 110383 102610 82588 93922 104588
6543 104588 99658 83619 78173 90329 90527 89165 85629 104145 120415 103478 90721 89675 85755
6530 85755 76828 73093 75780 68968 86724 103333 81868 64523 63386 81616 106174 123318 130999
6517 130999 124886 109438 104242 113529 122867 135588 126961 96223 71261 82261 86595 101073 104696
6504 104696 105735 101670 97635 114783 127276 130595 121048 103535 96054 92211 75957 79708 98315
6491 98315 113388 114085 86412 75308 77866 80803 84978 74044 68488 73601 75865 95592 119519
6478 119519 120631 110066 104674 101703 115073 110400 95122 109503 111392 101680 91245 77068 81572
6465H1572r456r859J173N073J4910O433q182K3972L616r501j5285k553K0439K063
6451A04415j6864k2319J566J6702J4628o097k552J4392j6551l068J2161j439j395
6438I3579j9844j4802J1798J2051l65k0582L549J3185m301p892r997R471q147
6425E7703P061K663n705k0351K4288m255r830J2198L2317J0556K181j9958k0170
6412F8698Q315m04j3268q773O61K4726J3521Rn09k316j0836j3056Q885J7905j3156
6397H0402o262p519K926J1262L423k208J0695j1257k7464J6790J2377o158l334
6384G3673o42o812L387K1931m200j5276R92P554l024o508Q135j1181j9282q114
6370D0633Q660K013J2094L661J6559N18R473R636L862l403j3093J2925k5072j1292
$$ plain form
6465 81572 72116 62257 63430 68503 83413 89846 81664 105636 109252 99751 84466 81913 102352 104415
6451 104415 87551 65232 66798 83500 98128 92031 89479 103871 87320 84252 96413 94974 93579
6438 93579 73735 58933 70731 82782 82417 61835 65384 78569 74268 66376 56379 65850 57703
6425 57703 64764 67427 61722 41371 65659 61404 51574 63772 96089 106645 108826 88868 68698
6412 68698 77013 76609 63341 54568 55229 79955 93476 93485 92976 90660 79824 66768 75653 93558 80402
6397 80402 74140 66621 69547 80809 84232 82024 92719 81462 53998 70788 83165 77007 73673
6384 73673 73031 66219 69606 91537 87337 72061 73053 80607 77583 71075 79210 68029 48747 40633
6370 40633 49293 51306 63400 67061 83620 84138 93611 103247 107109 103706 90613 103538 78466 67174
6356F7174j583l019j6509j222J3577O850R450J4704P533m399k229l268r282r731
6342F8046L51l93p104m665M322p71R284J2058R408J662O735K421M428j9728j4574
6327G1480M098J7255J3973j9479k2994K2937J6476p911j3719l1846J2329K7386
6315H9985j3414j096Q974k2308l594Q180j5397r811J1424M521l458o266L088M581
6301E5409K3360K576j6869o067p04o929Q560J1237J843K396J1213J1496m635L156
6287I6042N222l371k1380j2372j3790N999R116R593q014k6041o799M293K90R600
6273D8388K4718j714O197l886J0839J3442J1079j0278J712K038J0434n750j6829
6260I0390j7788o455p710n743J246J8123J7847R372O363o148j0973j3034J216
$$ plain form
6356 67174 65591 62572 46063 44841 58418 65268 74718 89422 96955 92556 90327 87059 77777 68046
6342 68046 68397 68004 60900 56235 60557 59786 69070 81128 90536 92198 98933 101354 105782 86054 71480
6327 71480 75578 92833 106806 87327 64333 87270 103746 95835 82116 50270 62599 89985
6315 89985 76571 75475 84449 62141 58547 66727 51330 41519 52943 57464 54006 47740 50828 55409
6301 55409 78769 81345 64476 58409 57705 50776 59336 70573 72416 74812 86025 97521 92886 96042
6287 96042 101264 97893 76513 64141 50351 56350 65466 75059 67045 41004 34205 38498 38788 48388
6273 48388 73106 71392 77589 73703 84542 97984 109063 98785 100497 102535 112969 107219 90390
6260 90390 72602 66147 58437 52694 53940 72063 89910 99282 105645 99497 88524 75490 76706
6247G6706k0470j4974Q384n686P272J9863N132N032j022m104J861j4633j089q349
6233E3923k134K2996p424j0185m044L187q488O135L412r665J4903K9736J7139
6220A09491N908j8564k7687j2408J2659J7945n732k0241j771M364j3321R547J0016
6207G0206j677Q154J3721j5042m218j0483j151K0463M060m236J4861K375j297
6194I5736k3505N789m547k192P445o703J0326Q874R95p395k5694n520J4114L565
6180G1288o430K890j6668o896j1053R033K2811J8648J0639j2739L364j0252K401
6167G7036N067n602j216j4006N599J3385r120l0315j2585K8482J9237j0453q740
6154E6769r293M136J9511J5302l991k2626P410j2178j215J3083J530J1298k967
$$ plain form
6247 76706 56236 41262 49646 43960 51232 71095 76227 81259 80237 76133 77994 63361 62272 53923
6233 53923 51789 74785 67361 57176 53132 56319 47831 53966 57378 47713 62616 92352 109491
6220 109491 115399 96835 69148 56740 69399 87344 81612 61371 59600 63964 50643 60190 70206
6207 70206 68529 76683 90404 75362 71144 60661 59510 79973 84033 79797 94658 97033 95736
6194 95736 72231 78020 73473 71281 78726 72023 82349 91223 92218 84823 59129 53609 67723 71288
6180 71288 64858 67748 51080 44184 33131 42164 64975 83623 94262 81523 84887 74635 77036
6167 77036 82103 76501 75285 61279 66878 80263 71143 40828 28243 56725 75962 65509 56769
6154 56769 47476 51612 71123 86425 82434 59808 67218 55040 53825 66908 68438 79736 76769
6141G6769j7809m310q720j1992R622J7584n173q427j3614J765K63J0458K163J0181
6127E8760r979j1921J7526Q905j8009o472J8501r58J933P774R465k186m749M935
6113G3525M323p050j144o53j7540Q271M14p379K5543J5775j1574p35l1856r439
6099D0481M813J929j285q14j0584L311M713q794L850K0046Q059q893j1739o490
6085C8603O427R517J609r432k0598M882R542rR946Q488P602P000R157J832j1251
6070G3315j0451n459j1420n974m724P77j1213O364L576J2782J1470M942J4229
6057G8214j6101N496J567L969j8856o898J5778o871K64M769J0113r106J1488l088
6043G0738j3344j2348J0141J2447K263N039K639J443j4621N64j0282n999J3209
$$ plain form
6141 76769 58960 54650 45930 33938 43560 61144 55971 47544 33930 35695 35958 46416 48579 58760
6127 58760 48781 36860 54386 63291 45282 38810 57311 56353 58286 66060 75525 73339 68590 73525
6113 73525 77848 70798 69654 69001 51461 59732 60146 52767 78310 94085 82511 81776 49920 40481
6099 40481 45294 47223 45938 45124 34540 37851 42564 33770 37620 57666 65725 56832 45093 38603
6085 38603 45030 54547 56156 46724 26126 31008 40550 40541 50487 58975 66577 73577 82734 84566 73315
6070 73315 62864 57405 45985 40011 35287 36064 24851 31215 34791 47573 59043 63985 78214
6057 78214 62113 67609 69176 73145 54289 47391 63169 56298 56562 61331 71444 62338 73826 70738
6043 70738 57394 45046 55187 67634 69897 74936 77575 79018 64397 64961 54679 48680 61889
6030F1889n804q21k667q049n055P922K763P52P018J1911l737R74O867l458O651
6015G7156p687k007j3140n593L15p647J649l942m942J9993l791l661Q642J1827
6001F7172J3326j0435k407l705m073o124j6922P404j1669M787Q875k521j7381
5988B6327k069R095j6479M120R185M886R289J1348N001J94r268J9052O294j4204
5974F2771Q140J6768l3879o540J4879N86m955j3156k4654J6836K5827K9P42j030
5960F2364n654j3218k757J5384J980J0682N603O101K50j9886k4896p288J1583
5947D0248J7380k457j0794K2258J9341O27r624k8298p864J5007J0140j6394O959
5934E6529O045n306M900R868j4489m617j512j567R765j10R937l828m963k735r358
$$ plain form
6030 61889 56085 55264 52597 44548 39493 47415 50178 50930 57948 69859 66122 67096 73963 70505 77156
6015 77156 69469 67462 54322 48729 49044 41397 43046 39104 34162 54155 50364 46703 55345 67172
6001 67172 80498 70063 67656 63951 59878 53754 36832 44236 32567 37354 46229 43708 26327
5988 26327 24258 33353 16874 20994 30179 35065 44354 55702 60703 60897 51629 70681 76975 62771
5974 62771 70911 87679 53800 47260 62139 62725 57770 44614 19960 36796 62623 62652 63394 62364
5960 62364 56710 43492 40735 56119 58099 68781 74384 80485 80735 60849 35953 28665 40248
5947 40248 57628 55171 44377 66635 85976 86603 76979 48681 40817 55824 65964 49570 56529
5934 56529 62574 57268 62168 72036 57547 52930 51418 49851 59616 59506 69443 65615 60652 57917 48559
5919D8559j302p45n198l472J5525q023j2526J349J3691K2429J0209k2367L156
5906F1285j3178j2384K0321J4170j9675q7N918j3191j6071J4904j5683J777K3627
5893E1733j0276j5636j7096L419L3874K0705j3815j1973J633j230k272J7890k771
5880E4185j5203Q8Q805R818k1286j389J8893Q922N89j7866P921k78O208M697J2392
5865G6496N099J016l965j4906j2929j832M479M774R274J464j2611j411J7566j678
5851G0836k5512k9974J94J5951J6933J9415n553k445j8849K141N922Q223N437
5838F2719k989r305L383q639r992R593N127J9647J1583k4009k3915K0482N681
5825E9366P240O449J1020j8277k0175L15Q17N494L359k6520p42R567l521J3909
$$ plain form
5919 48559 47257 46512 41314 37842 53367 45344 32818 34167 47858 70287 80496 58129 61285
5906 61285 48107 35723 56044 70214 50539 50452 56370 43179 27108 42012 26329 28106 51733
5893 51733 41457 25821 8725 12144 46018 66723 52908 40935 42568 41338 39066 56956 54185
5880 54185 38982 39070 47875 57693 36407 35018 53911 62833 63422 45556 53477 53199 59407 64104 76496
5865 76496 81595 82611 78646 63740 50811 48979 53458 58232 67506 68970 56359 54948 72514 70836
5851 70836 45324 15350 15544 31495 48428 67843 62290 59845 40996 43137 49059 57282 62719
5838 62719 59730 50425 53808 45169 35177 44770 49897 69544 81127 57118 33203 53685 59366
5825 59366 66606 73055 84075 65798 45623 45938 46755 52249 55608 29088 28346 37913 34392 48301
5811D8301J5541j3863j4634j6123j1766m766K3999K0194J9270n027N030L359j3505
5798E6010l4930j5394J852J0091K1462n773n254k0712O032J9960J5652j4380K345
5785C6961k36J272j1039P283J262j465K0295J1287q774j9003L03J6066J7748J731
5771G3691j3183r046l4565l925J4677J7006R643P222q452q477J2780M451O432
5758F8254k277k04R896M838l1954l0353n107r125J8543J2678J1058J3897q8m477
5744E5579k837o03j9881j9744j1814Q845k514J4274K6445j5056o735J1842p289
5731C0512N387K501k9520N387L3621Q779l181K137j6414O077J6632K319L247j3745
5717E3739j030j056l273L110K237Q744N653k2130j6693L617p9K988J9048N041
$$ plain form
5811 48301 63842 49979 35345 19222 7456 2690 26689 46883 66153 61126 66156 69515 56010
5798 56010 21080 5686 7538 17629 39091 33318 28064 7352 13384 33344 48996 34616 36961
5785 36961 36725 37997 26958 34241 35503 34038 54333 65620 56846 37843 38146 54212 71960 73691
5771 73691 60508 51462 16897 12972 27649 44655 54298 61520 53068 44591 57371 61822 68254
5758 68254 65977 65773 75669 80507 48553 18200 13093 3968 22511 35189 46247 60144 60056 55579
5744 55579 52742 52139 32258 12514 700 9545 7031 21305 47750 32694 25959 37801 30512
5731 30512 35899 38400 8880 14267 47888 56667 53486 55623 39209 45286 61918 64237 67484 53739
5717 53739 52709 51653 48380 51490 53727 62471 68124 45994 29301 32918 32839 35827 54875 59916
5703E9916R027J1634k9680n969P135P594J115l290m521j8337q2J526N130j9481
5689B1717k9643J567K0986J2499P727J3353P583J0218k3458j5741q52p23J2738
5676C7971l842j0299r466J6052L0650J3583k6635j0880n949J9752K11J4988n54
5663F5582K42r782k1546j9091J3581J6511N388o288L08J2228N566r532j1015j6026
5649B6126k0886K2467R415j2495M852K3777J9976j0879P607J8618O368k5449k5194
5636D4303j5616m568N156L181J6298P935j7932r116m951O554P131n9M282j8184
5622B4414j4090L610J384N143K70M596K2464Q431k984r325J412J3843R865J1012
5608H0045j7157k4773k615J3946K3806o525j9415J4841J0646j1791k624j391K174
$$ plain form
5703 59916 68943 80577 50897 44928 52063 59657 60772 57482 52961 34624 34542 36068 41198 21717
5689 21717 -7926 -6359 14627 27126 34853 48206 55789 66007 42549 26808 25956 25233 37971
5676 37971 34129 23830 14364 30416 61066 74649 48014 37134 31185 50937 51148 66136 65582
5663 65582 65824 56042 34496 15405 28986 45497 50885 44597 44905 57133 62699 53167 42152 26126
5649 26126 5240 27707 37122 24627 29479 53256 73232 62353 69960 88578 94946 69497 44303
5636 44303 28687 24119 29275 32456 48754 56689 38757 29641 24690 31244 38375 38316 42598 24414
5622 24414 10324 13934 15318 20461 20731 25327 47791 56222 53238 43913 45325 59168 69033 80045
5608 80045 62888 38115 35500 49446 73252 66727 47312 62153 72799 61008 58384 56993 59167
5595E9167q380M964K346l017m123J5250k807k8149L63j877J247N074k417k2573
5581A5068R581J7626J2080K757j8748n525J8499J1734r952j8375O182p890j3721
5568A9316L6148Q06j0051j8308j1326k70R979J3622M508J2210n706o104M223q764
5554D0283L743m658m253j0359j1672l413Q86P333K589p876J4928R591O875n873
5540C8124o829j8749J595N982M069j604L125J6909j18k071k283L420K198j2094
5526C1674r025j791r612P230k590N611J1950P637n910O110J48m150k6166j9714
5512h598n510J2435Q555J9076j9855j2066J3942J224J1499K753L2248k330j2820
5499D0553K006K572j0059j3034r496M435J5919l647j1387O710J1828J5341j4643
$$ plain form
5595 59167 50787 55751 58097 55080 50957 66207 63400 35251 35614 33737 34984 40058 37641 15068
5581 15068 24649 42275 54355 57112 38364 32839 51338 63072 53120 34745 40927 33037 19316
5568 19316 55464 56270 46219 27911 16585 16315 26294 39916 44424 56634 50928 44824 49047 40283
5554 40283 44026 39368 35115 24756 13084 9671 10557 17890 20479 12603 27531 37122 43997 38124
5540 38124 31295 12546 14141 20123 24192 22588 25713 42622 42504 40433 38150 41570 43768 31674
5526 31674 22649 20858 11246 18476 15886 21497 33447 41084 35174 41284 41432 37282 11116 -8598
5512 -8598 -14108 -1673 6882 25958 6103 -5963 7979 9203 20702 23455 55703 53373 40553
5499 40553 42559 45131 35072 22038 12542 16977 32896 29249 17862 24572 36400 51741 37098
5486C7098j0415k1926l379J1062J193q006K425K652q63K827Q457M016J124J7940
5472D4205P423j0144r466j2817m598j1139R220J1263L736M963j3568j9545J1148
5459A0681K1412j3749k1893k7043K4183J0419M916p006k233J0489J1199M019k3319
5446B075J7653m004n587K0551N620J7388K361p715P459P507j925j3153r173j1086
5432B7971p399k596j4050r427P419J3574j320J7076K1073m383n660k5390O82J9097
5418C6667K551k1358j5094o38l32j7148J2655J9686K2280p228n301J941n335J8633
5404D1979N408j3466k2852n334M808q23J4278J6502R269k6417j4861J133J5879
5391B5503m803j6214O935l218j143k489L3595P287k6168p559J2623q147j4557
$$ plain form
5486 37098 26683 4757 1378 12440 13633 5627 8052 10704 9841 12668 21125 25141 26265 44205
5472 44205 51628 41484 32018 19201 14603 3464 12684 23947 27683 32646 19078 -467 10681
5459 10681 32093 18344 -3549 -30592 -6409 4010 8926 1920 -313 10176 21375 25394 2075
5446 2075 19728 15724 10137 30688 36308 53696 56057 48342 55801 63308 61383 48230 39057 27971
5432 27971 20572 17976 3926 -5501 1918 15492 14172 31248 52321 47938 42278 16888 17570 36667
5418 36667 39218 17860 2766 2128 1796 -15352 -2697 16989 39269 32041 26740 28681 23346 41979
5404 41979 47387 33921 11069 5735 10543 9720 23998 40500 49769 23352 8491 9624 25503
5391 25503 20700 4486 11421 8203 7060 4571 38166 45453 19285 11726 24349 16202 1645
5378A645q393j988J5636K4450k815N584l563J265M455k351k7076q73J9438r198
5364A6216J6590O118q894q130p210k902Q784J5l563q821l375J738N431p366l102
5349A529K1742K3903n118l4179n699j7788j1481N493J7876O294J8070J5776p485
5336B8933j2568M705j755J1422n81m592k799p165K610K0643L340k0389q333J864
5322A5335j155J891J2177m931j0373P945j582J1421O472N049J837o681L727n739
5308C5393q030J3942L904m468o795O48K920m873j2640r979l02P058O068M559L678
5293C1083N160J6447K2124o350j0242o792q180J032J492o715j8390j3673L832
5280A0828K0504L728j151j4644k2420j909K0079R679J1503K174K5783J7658k1555
$$ plain form
5378 1645 -6748 -8736 6900 31350 28535 34119 30556 31821 36276 33925 6849 5976 25414 16216
5364 16216 32806 38924 30030 21900 14690 11788 20572 20587 17024 8203 4828 6566 11997 4631 1529
5349 1529 23271 47174 42056 7877 2178 -15610 -27091 -21598 -3722 2572 20642 36418 28933
5336 28933 16365 21070 19315 30737 30156 25564 22765 15600 18210 38853 42193 21804 13471 15335
5322 15335 14180 16071 28248 23317 12944 20889 19307 30728 37200 42249 44086 37405 41132 35393
5308 35393 27363 41305 45209 40741 33946 34594 37514 32641 20001 10022 9720 16778 22846 27405 31083
5293 31083 36243 52690 74814 68464 58222 51430 43250 44282 45774 39059 20669 6996 10828
5280 10828 31332 35060 33909 19265 -3155 -5064 15015 24694 36197 38371 64154 81812 60257
$$ [...]
##END NTUPLES=NMR SPECTRUM
##END=
