##TITLE=Analysis number 321507
Compound Code cc 61915
Project Code adrs
Chemist Name endeavour
##JCAMPDX= 6.0         $$ Bruker NMR JCAMP-DX V2.0
##DATA TYPE= NMR SPECTRUM
##DATA CLASS= NTUPLES
##ORIGIN= Bruker BioSpin GmbH
##OWNER= nmr
$$ XWIN-NMR		Version 3.5
$$ Mon Aug 14 11:19:20 2006 GMT Daylight Time (UT+1h)  MAYBRIDGE\nmr@NMR_250MHZ
##.OBSERVE FREQUENCY= 250.131544655141
##.OBSERVE NUCLEUS= ^1H
##.ACQUISITION MODE= SIMULTANEOUS (DQD)
##.ACQUISITION SCHEME= undefined
##.AVERAGES= 16
##.DIGITISER RES= 18
##SPECTROMETER/DATA SYSTEM= dpx250
##.PULSE SEQUENCE= zg30
##.SOLVENT NAME= CDCl3
##.SHIFT REFERENCE= (INTERNAL, CDCl3, 0, 16.522)
##AUDIT TRAIL= $$ (NUMBER, WHEN, WHO, WHERE, WHAT)
$$ ##TITLE= Audit trail, XWIN-NMR		Version 3.5
$$ ##JCAMPDX= 5.01
$$ ##ORIGIN= Bruker BioSpin GmbH
$$ ##OWNER= nmr
$$ C:\u/data/dgb/nmr/ADRS/790/pdata/1/auditp.txt
$$ ##AUDIT TRAIL=  $$ (NUMBER, WHEN, WHO, WHERE, WHAT)
(   1,<2006-08-14 11:18:59.02 +100>,<MAYBRIDGE\nmr>,<NMR_250MHZ>,
      <created by zg, POWCHK disabled, PULCHK disabled
       configuration hash MD5:
       E2 DF 36 D8 04 B2 41 60 5A D7 A3 38 5A 4B D0 FE
       data hash MD5: 64K
       DE E2 41 15 2F CF C6 70 7E 8D C1 CE 40 63 47 EB>)
(   2,<2006-08-14 11:19:11.49 +100>,<MAYBRIDGE\nmr>,<NMR_250MHZ>,
      <Start of raw data processing
       ef LB = 0.3 FT_mod = 6 PKNL = 1 SI = 32K 
       data hash MD5: 32K
       67 E6 79 86 36 F2 A8 1C 1E D6 3E 2E F0 C0 89 68>)
(   3,<2006-08-14 11:19:13.10 +100>,<MAYBRIDGE\nmr>,<NMR_250MHZ>,
      <apk 
       data hash MD5: 32K
       7B FA 0A 14 F7 C0 CA 27 8A B9 FA EA CF 8D 90 F0>)
(   4,<2006-08-14 11:19:13.85 +100>,<MAYBRIDGE\nmr>,<NMR_250MHZ>,
      <abs ABSG = 5 
       data hash MD5: 32K
       A7 62 21 20 FE F2 71 62 40 A4 A2 E8 4E 62 0C 29>)
$$ ##END=
$$ 
$$ hash MD5
$$ 06 1B D3 1D CB FB 87 97 9A 98 53 41 AE 4D 75 57
##$RELAX= 
##$RELAX= 
##$RELAX= 
##$RELAX= 
##$RELAX= 
##$RELAX= 
##$RELAX= 
$$ Bruker specific parameters
$$ --------------------------
##$DU= <C:\u>
##$EXPNO= 790
##$NAME= <ADRS>
##$PROCNO= 1
##$TYPE= <nmr>
##$USER= <dgb>
##$AMP= (0..31)
100 100 100 100 100 100 100 100 100 100 100 100 100 100 100 100 100 100 
100 100 100 100 100 100 100 100 100 100 100 100 100 100 
##$AQSEQ= 0
##$AQ_mod= 3
##$AUNM= <au_zg>
##$AUTOPOS= <11 >
##$BF1= 250.13
##$BF2= 250.13
##$BF3= 250.13
##$BF4= 250.13
##$BF5= 500.13
##$BF6= 500.13
##$BF7= 500.13
##$BF8= 500.13
##$BYTORDA= 1
##$CFDGTYP= 0
##$CFRGTYP= 5
##$CHEMSTR= <none>
##$CNST= (0..31)
1 1 145 1 1 1 1 1 1 1 1 1 1 1 1 1 1 1 1 1 1 1 1 1 1 1 1 1 1 1 1 1 
##$CPDPRG= <>
##$CPDPRG1= <>
##$CPDPRG2= <>
##$CPDPRG3= <>
##$CPDPRG4= <mlev>
##$CPDPRG5= <mlev>
##$CPDPRG6= <mlev>
##$CPDPRG7= <mlev>
##$CPDPRG8= <mlev>
##$CPDPRGB= <>
##$CPDPRGT= <>
##$D= (0..31)
0 1 0 0 0 0 0 0 0 0.06 0 0 0 0 0 0 0.0002 0 0 0 0 0 0 0 0 0 0 0 0 0 0 
0 
##$DATE= 1155550738
##$DBL= (0..7)
120 120 120 120 120 120 120 120 
##$DBP= (0..7)
150 150 150 150 150 150 150 150 
##$DBP07= 0
##$DBPNAM0= <>
##$DBPNAM1= <>
##$DBPNAM2= <>
$$ [...]
##$SUBNAM7= <"">
##$SUBNAM8= <"">
##$SUBNAM9= <"">
##$SW= 20.6930455092707
##$SWIBOX= (0..15)
0 0 3 0 0 0 0 0 0 0 0 0 0 0 0 0 
##$SW_h= 5175.983436853
##$TD= 65536
##$TD0= 1
##$TE= 295.16
##$TE2= 300
##$TE3= 300
##$TEG= 300
##$TL= (0..7)
0 120 120 120 120 120 120 120 
##$TP= (0..7)
150 150 150 150 150 150 150 150 
##$TP07= 0
##$TPNAME0= <>
##$TPNAME1= <>
##$TPNAME2= <>
##$TPNAME3= <>
##$TPNAME4= <>
##$TPNAME5= <>
##$TPNAME6= <>
##$TPNAME7= <>
##$TPOAL= (0..7)
0.5 0.5 0.5 0.5 0.5 0.5 0.5 0.5 
##$TPOFFS= (0..7)
0 0 0 0 0 0 0 0 
##$TUNHIN= 0
##$TUNHOUT= 0
##$TUNXOUT= 0
##$USERA1= <user>
##$USERA2= <user>
##$USERA3= <user>
##$USERA4= <user>
##$USERA5= <user>
##$V9= 5
##$VALIST= <valist>
##$VCLIST= <CCCCCCCCCCCCCCC>
##$VD= 0
##$VDLIST= <DDDDDDDDDDDDDDD>
##$VPLIST= <PPPPPPPPPPPPPPP>
##$VTLIST= <TTTTTTTTTTTTTTT>
##$WBST= 1024
##$WBSW= 4
##$XGAIN= (0..3)
0 0 0 0 
##$XL= 0
##$YL= 0
##$YMAX_a= 491617
##$YMIN_a= -446703
##$ZGOPTNS= <>
##$ZL1= 120
##$ZL2= 120
##$ZL3= 120
##$ZL4= 120
##$ABSF1= 16.522
##$ABSF2= -4.171173
##$ABSG= 5
##$ABSL= 3
##$ALPHA= 0
##$AQORDER= 0
##$ASSFAC= 0
##$ASSFACI= 0
##$ASSFACX= 0
##$ASSWID= 0
##$AUNMP= <proc_1d>
##$AZFE= 0.1
##$AZFW= 0.1
##$BCFW= 0
##$BC_mod= 0
##$BYTORDP= 0
##$COROFFS= 0
##$CY= 12.5
##$DATMOD= 1
##$DC= 0
##$DFILT= <>
##$DTYPP= 0
##$F1P= 14.0000005364418
##$F2P= -0.99999901652339
##$FCOR= 0.5
##$FTSIZE= 32768
##$FT_mod= 6
##$GAMMA= 0
##$GB= 0
##$INTBC= 1
##$INTSCL= 1
##$ISEN= 128
##$LB= 0.3
##$LEV0= 0
##$LPBIN= 0
##$MAXI= 10000
##$MC2= 0
##$MEAN= 0
##$ME_mod= 0
##$MI= 0
##$NCOEF= 0
##$NC_proc= -6
##$NLEV= 6
##$NOISF1= 0
##$NOISF2= 0
##$NSP= 0
##$NTH_PI= 0
##$NZP= 0
##$OFFSET= 16.522
##$PC= 1
##$PHC0= 152.5077
##$PHC1= 0.5556656
##$PH_mod= 1
##$PKNL= yes
##$PPARMOD= 0
##$PSCAL= 4
##$PSIGN= 0
##$REVERSE= no
##$SF= 250.13
##$SI= 32768
##$SIGF1= 0
##$SIGF2= 0
##$SINO= 400
##$SIOLD= 32768
##$SREGLST= <1H.CDCl3>
##$SSB= 0
##$STSI= 32768
##$STSR= 0
##$SW_p= 5175.98343685301
##$SYMM= 0
##$S_DEV= 0
##$TDeff= 65536
##$TDoff= 0
##$TI= <Analysis number 999999
Compound Code 99
Book Reference 9
Project Code 9>
##$TILT= no
##$TM1= 0
##$TM2= 0
##$TOPLEV= 0
##$USERP1= <user>
##$USERP2= <user>
##$USERP3= <user>
##$USERP4= <user>
##$USERP5= <user>
##$WDW= 1
##$XDIM= 32768
##$YMAX_p= 418000933
##$YMIN_p= -865241
$$ End of Bruker specific parameters
$$ ---------------------------------
##NTUPLES= NMR SPECTRUM
##VAR_NAME=  FREQUENCY,     SPECTRUM/REAL,   SPECTRUM/IMAG
##SYMBOL=    X,             R,               I
##VAR_TYPE=  INDEPENDENT,   DEPENDENT,       DEPENDENT
##VAR_FORM=  AFFN,          ASDF,            ASDF
##VAR_DIM=   32768,         32768,           32768
##UNITS=     HZ,            ARBITRARY UNITS, ARBITRARY UNITS
##FACTOR=    0.157963299565203, 1,           1
##FIRST=     4132.6476996994, 0,             0
##LAST=      -1043.33573715361, 0,           0
##MIN=       -1043.33573715361, -865241,     0
##MAX=       4132.6476996994, 418000933,     0
$$ Real data points
##PAGE= N=1
##DATA TABLE= (X++(R..R)), XYDATA
$$ [...]
15627g7869N1830l0980P7434l3397J51301q1325J21810j13148m14080L1134K71545
$$ -77869 -26039 -57019 20415 -12982 138319 56994 178804 65656 -348424 -317290 -45745
15616d5745J21117m6826r5462k33145N2467J58682l250j77169K2759J72317P8854
$$ -45745 75372 28546 -66916 -300061 -247594 -88912 -92162 -269331 -246572 -74255 4599
15605D599k64448o6841K12783K05474Q9606j77995K4683K12883n3121j43487n1464
$$ 4599 -259849 -326690 -113907 91567 181173 3178 27861 240744 187623 44136 -7328
15594g328K66080N0143j81990k22488R4536R3169j30401j44492L7201p0182Q5643
$$ -7328 258752 308895 126905 -95583 -1047 92122 -38279 -182771 -145570 -215752 -130109
15583a30109o1203j04053J49005K60569M4154J05712J51005J7551j70018j43941
$$ -130109 -191312 -295365 -146360 114209 158363 264075 415080 432631 262613 118672
15573A18672j64468j33910O1834M5720Q7415J90618O8779j64492j50640O1021
$$ 118672 -45796 -179706 -117872 -72152 15263 205881 274660 110168 -40472 20549
15563B0549J5745K37541J31550j70904k9433j08993l546J26145j3258j37547j60012
$$ 20549 36294 273835 405385 234481 205048 96055 92509 218654 205396 67849 -92163
15552i2163o1077O2578m6009j67260L5818J13278J68183n7917J54663K1525R129
$$ -92163 -153240 -90662 -136671 -303931 -268113 -154835 13348 -44569 110094 131619 140748
15541A40748j0170N4539M1970j52542j03768j05686q4050K0976q4494O544J80135
$$ 140748 130578 185117 227087 74545 -29223 -134909 -218959 -197983 -282477 -275933 -95798
15530i5798Q3343j73671k71232L3046L00972R9242j74755K8675L8206L9343J08357
$$ -95798 -12455 -186126 -457358 -424312 -123340 -24098 -198853 -170178 -131972 -92629 15728
15519A5728j03138j99491l1911j28985j7089j22400K17253K86179M5225N2586
$$ 15728 -87410 -286901 -318812 -447797 -464886 -587286 -370033 -83854 -38629 13957
15509A3957k02563o7197M885J37064m5179p3682j04393L25585K26464p1299j16906
$$ 13957 -188606 -255803 -250918 -113854 -159033 -232715 -337108 -11523 214941 143642 26736
15498B6736k19445J74598J06322p7502K32814L0441o1922J9729N9880k38402J55049
$$ 26736 -192709 -18111 88211 10709 243523 273964 212042 231771 291651 53249 208298
15487B08298J52969k73097k87185O7097r4576j11164J13131J62064p1541o2552
$$ 208298 361267 88170 -199015 -131918 -226494 -337658 -224527 -62463 -134004 -196556
15477a96556O6574K16015j93009j41754r7639j74571K95297p9907r2973J60671
$$ -196556 -129982 86033 -106976 -248730 -346369 -520940 -225643 -305550 -398523 -237852
15467b37852K96899j3278j04925k89157q4075K80220J49217p4675j16104q5076
$$ -237852 59047 45769 -59156 -348313 -432388 -152168 -2951 -77626 -193730 -278806
15457b78806k5518J69648J00917k9868j9881J0155k12189l6940K02251J31539
$$ -278806 -304324 -134676 -33759 -63627 -83508 -73353 -285542 -322482 -120231 11308
15447A1308j52762j03305j52646j68594Q4349K08677O9575J38409j09658o3615
$$ 11308 -141454 -244759 -397405 -565999 -481650 -272973 -203398 -64989 -174647 -238262
15437b38262J67240m6069j960Q2600J02436o2142o7041j19700J7114j16621J08006
$$ -238262 -71022 -117091 -119051 -36451 65985 3843 -63198 -182898 -165784 -282405 -174399
15426a74399K0523p85L7034n142M8670J47802N813j24267K010R9450q4915j10948
$$ -174399 -153876 -154661 -117627 -122769 -74099 73703 79516 -44751 -42741 56709 -28206 -139154
15414a39154L4133K98134j5721O1581J93809q8579k43066M1729m7764j566Q4819
$$ -139154 -105021 193113 177392 238973 432782 344203 101137 142866 95102 93536 178355
15403A78355n1261j5062O9294j18250M2357J6607k25348r2304P2426J18127p2029
$$ 178355 127094 112032 181326 63076 105433 122040 -103308 -195612 -123186 -5059 -77088
15392g7088k41338O4545J43459K41651K8670Q948J24496k26279k97314K14429
$$ -77088 -318426 -253881 -110422 131229 159899 168847 293343 67064 -230250 -15821
15382a5821J38940j1789j29265n8254J92313J15037J08327K7788j11181l152j17553
$$ -15821 123119 111330 -17935 -76189 116124 231161 339488 367276 256095 252943 135390
15371A35390l84298j09187R6862K40321m3954J902K90196J69989m8088j24730
$$ 135390 -248908 -358095 -261233 -20912 -64866 -62964 227232 397221 349133 224403
15361B24403n8495o4162K4445J99330L3417K39516j35712k50821j44457m5445
$$ 224403 165908 101746 126191 325521 358938 598454 462742 211921 67464 22019
15351B2019j81147n9479J72845M9632p8953q4212k3469L33333M1661j51284N5910
$$ 22019 -159128 -218607 -45762 3870 -75083 -159295 -182764 150569 192230 40946 96856
15340I6856J1825k3097J12027O3783j5785k55455m525J0725P9827L5926j17216
$$ 96856 108681 85584 197611 261394 245609 -9846 -14371 -3646 76181 112107 -5109
15329e109p3765O819O3374Q7823j71924j28928j6444p2806J47772N9123J02608
$$ -5109 -78874 -72055 -8681 79142 -92782 -221710 -238154 -310960 -163188 -104065 -1457
15318a457J59977J69951q7732q9507P3522j53055j28283j82717R6719K40045K48786
$$ -1457 158520 328471 240739 151232 224754 71699 -56584 -239301 -142582 97463 346249
15307C46249k09600j60019J25125j39295N1529J41871O646j63033k35004L54294
$$ 346249 136649 -23370 101755 -37540 13989 155860 162506 -527 -235531 118763
15297A18763l9323l7356K18340K6537N603l9441k2832N9594j78103j35355P3392
$$ 118763 79440 42084 260424 286961 292564 253123 230291 289885 111782 -23573 49819
15286D9819l45p0009P9051k9121n0843K1772k7641j23064N4249j01801K81807
$$ 49819 49474 -20535 58516 29395 -21448 324 -27317 -150381 -96132 -197933 83874
15275H3874J59520k09907P287J31305j14728k17439j3063J91529M70780l2244
$$ 83874 243394 33487 40774 172079 57351 -160088 -173151 18378 489158 456914
15265D56914k30301m1016k46137j85735N1946m7500j916l801q3072j45948M2135
$$ 456914 226613 185597 -60540 -246275 -194329 -241829 -243745 -247546 -330618 -476566 -434431
15254d34431K92408K63101Q1579n0344j50138j73088o55L04723J8269o0533j33681
$$ -434431 -142023 121078 202657 152313 2175 -170913 -171568 133155 151424 90891 -42790
15243d2790k31096p9299J67248J68454J87549N8466K7044O8336l0401j90542n6281
$$ -42790 -273886 -353185 -185937 -17483 170066 228532 255576 323912 293511 102969 46688
15232D6688L5671k3901k98894n710P6814L9848J88167r7648k28932j45194L9753
$$ 46688 82359 58458 -240436 -246146 -169332 -129484 58683 -38965 -267897 -413091 -373338
15221c73338Q6055Q5869M6088P9730j36189Q4689J38460l5580J7519j69138P8745
$$ -373338 -287283 -201414 -155326 -75596 -211785 -127096 11364 -24216 -6697 -175835 -97090
15210i7090k8323K74589K58629j06606j94269j00841P6145N2927j12619j8094
$$ -97090 -125413 149176 407805 301199 106930 6089 82234 135161 22542 4448
15200D448J55764N496l41737j78757O7479O0358P2079K5164j3446K8741L5098
$$ 4448 160212 165708 -176029 -354786 -287307 -226949 -154870 -129706 -143152 -114411 -79313
15189g9313Q6245J51471j24344j48445k69737n6349J86908J6942K76744J11894
$$ -79313 6932 158403 34059 -114386 -384123 -440472 -253564 -236622 40122 152016
15179A52016R4835p8560k16156k5362J88406m3224j12187m2991L41J56077J46066
$$ 152016 246851 168291 -47865 -73227 115179 71955 -40232 -83223 -82882 73195 219261
15168B19261K3725j02076q0992n085m9753j00499r4596r2677J22926K01122j57166
$$ 219261 242986 140910 59918 54833 5080 -95419 -190015 -282692 -159766 41356 -115810
15157a15810j27377J22683j60377j19403J71146R7638L2857k46114K73509J51173
$$ -115810 -243187 -120504 -280881 -400284 -229138 -131500 -98643 -344757 -71248 79925
15147G9925j570j26526J4850j68097O5959p1584J11178P0358R5417N3025R3014
$$ 79925 78355 -48171 -33321 -201418 -135459 -207043 -95865 -25507 69910 122935 215949
15136B15949L6195j15215J36442n2535M2122J33093j18144j57207l26879J10135
$$ 215949 252144 136929 273371 220836 262958 396051 277907 120700 -206179 -96044
15126i6044J19039n4854p5737k0151L7217J07968p2418J48056q340J39377j20887
$$ -96044 22995 -31859 -107596 -127747 -90530 17438 -54980 93076 84736 224113 103226
15115A03226j9693j52679j55415O2654o0166R8308J16113j01822q3555J0134N0862
$$ 103226 83533 -69146 -224561 -161907 -222073 -123765 -7652 -109474 -193029 -182895 -132033
15104a32033O318P4782Q7227n1442j92730J1503J62598K92671K8978k32183n9621
$$ -132033 -125715 -50933 36294 -15148 -207878 -196375 -33777 258894 287872 55689 -3932
15093c932J1378R6917m8438J06930L7862j73131k06717P5530J73921k90996k69841
$$ -3932 7446 104363 55925 162855 200717 27586 -179131 -103601 70320 -220676 -490517
15082d90517N648L04956J31876J03151Q356J87886R232k00145k8573k7191l6558
$$ -490517 -484869 -179913 -48037 55114 63470 251356 260588 60443 31870 4679 -31879
15071c1879p0244J74451P1784J73194l7375k7534r2045J09542J22821j12994j11071
$$ -31879 -102123 72328 144112 317306 279931 252397 160352 269894 392715 279721 168650
15060A68650J11931j96007j62211N0681j21561q4345L6190m5499J20182J85687
$$ 168650 280581 84574 -77637 -26956 -148517 -232862 -196672 -242171 -121989 63698
15050F3698j44110l9628K229J89699K3852O3290k26086j26870p1222j4855Q1671
$$ 63698 -80412 -120040 -117811 71888 95740 159030 -67056 -193926 -265148 -280003 -198332
15039a98332K09125o7385j1530k7239J99025N0194K07992R4512k45392j67438
$$ -198332 10793 -56592 -68122 -95361 103664 153858 361850 456362 210970 43532
15029D3532k4202j9956n1999q3253l5864O4216j36409K31439q550Q5436O6879
$$ 43532 19330 -626 -52625 -135878 -171742 -107526 -243935 -12496 -21046 64390 131269
15018A31269M3293j94847j8527j36660L6834L05810j02929k25581K57869J33218
$$ 131269 174562 -20285 -38812 -175472 -138638 167172 64243 -161338 96531 229749
15008B29749P4910p9824j80454K3922j34779J55155J0107j45195J19180J7633
$$ 229749 304659 224835 44381 68303 -66476 88679 98786 -46409 72771 90404
14998I0404j15084j75860J24078J87829j00542j2477L5443j6839M5334k9977j82682
$$ 90404 -24680 -200540 -76462 111367 10825 -1652 33791 16952 62286 32309 -150373
14987a50373R5029J26202j05983j9005J06425l363r6253j34802J85785K30094
$$ -150373 -55344 70858 -35125 -54130 52295 48932 -47321 -182123 3662 233756
14977B33756k17309k25284K8464J32784J42326Q7650M9011K3937j74795j9712
$$ 233756 16447 -208837 -180373 -47589 94737 182387 231398 255335 80540 60828
14967F0828J55129J45914K1520r7977j09933K8009j233Q4507j20967j79207n1095
$$ 60828 215957 361871 383391 285414 175481 203490 202257 286764 165797 -13410 -64505
14956f4505k21211j64350J6327J60191J66091J06441K1321j35901q6024J19601
$$ -64505 -285716 -450066 -433739 -273548 -107457 -1016 20305 -115596 -201620 -82019
14946h2019K9993q2308n0739K13337J12052q3282q7566J04357J62235l3445m3545
$$ -82019 -52026 -134334 -185073 28264 140316 57034 -30532 73825 236060 202615 159070
14935A59070j98039l17516Q2893J13172Q8439K31388j1649k15627k6657Q4220
$$ 159070 -38969 -356485 -273592 -160420 -71981 159407 147758 -67869 -94526 -10306
14925a0306n1559j28421P7231K87975j22647R8901j02209O6317k67312k08116
$$ -10306 -61865 -190286 -113055 174920 52273 151174 48965 115282 -152030 -360146
14915c60146L09280K51653Q661L5653O4757N3451m7966p5873r9595J63723o3711
$$ -360146 -50866 200787 209448 245101 309858 363309 315343 239470 139875 303598 239887
14904B39887N9720j82660J05134L3919j39413p8522m0201n867R6244j5978O0795
$$ 239887 299607 116947 222081 256000 116587 38065 -2136 -8003 88241 72263 133058
14893A33058K0856j23168p3098l1140L4078j12838N3274j15827Q5898n1478j36179
$$ 133058 153914 30746 -42352 -73492 -39414 -152252 -98978 -214805 -128907 -180385 -316564
14882c16564o8252J28778R8728N3551j2477k05899R3859J99303J88072j00898
$$ -316564 -384816 -256038 -157310 -103759 -116236 -322135 -228276 -28973 159099 58201
14872E8201L9106p313n8460j25359j2675J42006L02265m8275k32836j22064j05018
$$ 58201 97307 89994 31534 -93825 -106500 35506 337771 289496 56660 -65404 -170422
14861a70422k3268N6501n9154o4479j12131Q2166o1671J08507J15443j42595l81731
$$ -170422 -193690 -137189 -196343 -260822 -372953 -290787 -352458 -243951 -128508 -271103 -652834
14850f52834j18608J78914J25770m3214K10548L16376j62939O8870J19280N6961
$$ -652834 -771442 -592528 -466758 -509972 -299424 16952 -145987 -77117 42163 99124
14840I9124j0328J30495M3674j52243j12081K2034n7375k8652Q0404N4118J65675
$$ 99124 88796 219291 262965 110722 -1359 20675 -36700 -65352 15052 69170 234845
14829B34845k90479j25684r9849J5300N2127J53705n5012J20545k1988j54187
$$ 234845 -55634 -181318 -281167 -265867 -213740 -60035 -115047 5498 -16490 -170677
14819a70677j8506M1781J87517K0886k12774J47456P8293j0869M8563l792Q3816
$$ -170677 -189183 -147402 40115 61001 -151773 -4317 73976 63107 111670 107878 191694
14808A91694j48495J22879j92587k10386Q0939l4248j23340J6440J78384J75268
$$ 191694 43199 166078 -26509 -236895 -155956 -190204 -313544 -297104 -118720 56548
14798E6548P3464O325o6688m365P0389K5382j38015r0643n1548j91247O1833M03396
$$ 56548 130012 136337 69649 65284 135673 161055 23040 -67603 -119151 -310398 -248565 154831
14786A54831J32966k3424j97936M8733j92874j91386j9899M4504J79272K60732
$$ 154831 287797 264373 66437 115170 -77704 -269090 -288989 -244485 -65213 195519
14776A95519j33934k06106O6521O7246j6003L768P2368k365j35693k2633J48840
$$ 195519 61585 -144521 -78000 -10754 -26757 -22989 49379 47014 -88679 -111312 37528
14765C7528M2586k11648k74549k61895J03063K18990p2497R8161J74463J39211
$$ 37528 80114 -131534 -406083 -667978 -564915 -345925 -418422 -320261 -145798 -6587
14755f587J34605j36783K8505J1670j79093L5530J25977J00657J44989j53114
$$ -6587 128018 -8765 19740 31410 -147683 -112153 13824 114481 259470 106356
14745A06356n8636q3938N4558J94987k297j33065N1215o3271P6259J20018L9053
$$ 106356 47720 -36218 18340 213327 211030 77965 129180 65909 142168 262186 301239
14734C01239r827m7075r3837o3418j00629j44441j41025P3603K23713J04893q6106
$$ 301239 291412 244337 150500 87082 -13547 -157988 -299013 -225410 -1697 103196 17090
14723A7090m2933l5144J6840M5618l7610J6750k11299l1680J54302J93129J50254
$$ 17090 -25843 -60987 -44147 1471 -36139 -19389 -230688 -262368 -108066 85063 235317
14712B35317Q8068m0082k48318j93737P9296K01257m3752k86140j64580K3297
$$ 235317 323385 283303 34985 -158752 -79456 121801 78049 -208091 -372671 -349374
14702c49374J55597Q8756m8706R726N3253o0932p2156K22108K62600K9553j66154
$$ -349374 -193777 -105021 -153727 -144001 -90748 -151680 -223836 -1728 260872 290425 124271
14691A24271k40630n0918L1228n2985j45293Q1850J42609J55771m9737j36405
$$ 124271 -116359 -167277 -136049 -189034 -334327 -252477 -109868 45903 -3834 -140239
14681a40239J4334K22936J16350j43691J51437K3561m6508k59753M7778P8751
$$ -140239 -125905 97031 213381 69690 221127 244688 198180 -61573 -13795 64956
14671F4956l6417r386P2223O0028p0453m1022L7933j17514q4844j93064m1279
$$ 64956 28539 19153 91376 151404 80951 39929 77862 -39652 -124496 -317560 -358839
14660c58839J15316o5627l6530R7733K12747K83133r1408P156q8093J27812k6100
$$ -358839 -243523 -309150 -345680 -247947 -35200 247933 156525 163681 75588 203400 177300
14649A77300o0433J33260J90283j56895j48483Q0519j84720j01646k8213k8501
$$ 177300 116867 250127 440410 283515 135032 215551 30831 -70815 -99028 -127529
14639a27529j657j66442n6655l7017J23233J35625J64918P5770j26236o4808J46156
$$ -127529 -129186 -295628 -352283 -389300 -266067 -130442 34476 110246 -15990 -80798 65358
14628F5358J74164j75046r5437Q9207r7109J43225J83504r0249k14321O416P5492
$$ 65358 239522 64476 -30961 58246 -38863 104362 287866 197617 -16704 -10288 65204
14617F5204n4713n4074M2980J89813l8246j0274N635k0253j42120J2723J85286
$$ 65204 10491 -43583 -603 189210 150964 140690 146325 126072 -16048 -3325 181961
14606A81961q0763l11208j26964l4058O3364J04328L6688o7487J70954J00297
$$ 181961 101198 -210010 -336974 -371032 -307668 -203340 -166652 -234139 -63185 37112
14596C7112j76854o2235K8958N9878K85531P996j64764j76489Q7149J69000P0952
$$ 37112 -139742 -201977 -173019 -113141 172390 180386 15622 -160867 -73718 95282 166234
14585A66234j4079o3501j47191k25125j74873J22647J67458K931k8795j08239
$$ 166234 152155 88654 -58537 -283662 -458535 -335888 -168430 -165499 -194294 -302533
14575c02533J470k2388J8160J2540J68696J12589J09550o2605j71310j09051j16773
$$ -302533 -301063 -323451 -305291 -292751 -124055 -11466 98084 35479 -135831 -244882 -361655
14564c61655n3731K6628M8948O2462J63599q1846n6299P2552J77863J16270m0200
$$ -361655 -415386 -388758 -339810 -277348 -113749 -195595 -251894 -179342 -1479 114791 74591
14553G4591N9879j74723q0074o5731J06252R5802M8014J36465j19434j36241R2209
$$ 74591 134470 -40253 -120327 -186058 -79806 15996 64010 200475 81041 -55200 37009
14542C7009j22K93006J43210K3362k93648j86692k53333J25794K19335R108k1027
$$ 37009 36887 329893 473103 496465 202817 16125 -237208 -111414 107921 117029 96002
14531I6002j55348j13785Q05J61134J67871j20569l5603O374P4440O7285k56599
$$ 96002 -59346 -173131 -172326 -11192 156679 36110 507 6881 81321 148606 -107993
14520a07993j22277l820k4843O3975J17129j18006j16482k02254M564K08765K51038
$$ -107993 -230270 -234090 -258933 -194958 -77829 -195835 -312317 -514571 -510007 -301242 -50204
14509e0204K6840k28278k8672q4150J72436K21663l8394N4808R5912j54521j88532
$$ -50204 -23364 -251642 -280314 -364464 -192028 29635 -8759 46049 141961 -12560 -201092
14498b01092J11983N3553M3121j61680j36842R6881n7846k47344n53J20825O5818
$$ -201092 -89109 -35556 7565 -154115 -290957 -194076 -251922 -499266 -499819 -378994 -313176
14487c13176p6789K3941J61830K0397J85993k4851M8715O4618o0376r9991J76133
$$ -313176 -389965 -366024 -204194 -183797 2196 -22655 26060 90678 30302 -69689 106444
14476A06444J39179K0081j18188l08138r7072K27535K10493k42243j78873j40491
$$ 106444 245623 265704 147516 -160622 -257694 -30159 180334 -61909 -240782 -381273
14466c81273j91301J79390p549o9092K68452J42935L4971J08125j13222l857q1263
$$ -381273 -572574 -393184 -400733 -469825 -201373 -58438 -23467 84658 -28564 -32421 -113684
14455a13684n8500K2653N3850j7842N0283j60733q6675o0525L6542m3208j90279
$$ -113684 -172184 -149531 -95681 -113523 -63240 -223973 -310648 -371173 -334631 -377839 -568118
14444e68118K18272K5936j68729K0649K51690N3197k8676J28436Q0713n5675L4131
$$ -568118 -349846 -323910 -492639 -471990 -220300 -167103 -195779 -67343 13370 -42305 -8174
14433h174K0635j83647J16878J53609J63794j63304p1061k61171j58416K69529
$$ -8174 12461 -171186 -54308 99301 263095 99791 28730 -232441 -390857 -121328
14423a21328J67294l5980n8960p1264j21118J56355J51890j44487j28052Q2214
$$ -121328 45966 9986 -48974 -120238 -241356 -85001 66889 -77598 -205650 -123436
14413a23436Q0301J45384Q823K32726l5935k00585n2052k53605j63121j18905
$$ -123436 -43135 102249 111072 343798 307863 107278 55226 -198379 -361500 -480405
14403d80405K40832K41807P9022j93779K8921J29296m7837p2533l6191k4404K9988
$$ -480405 -239573 2234 81256 -112523 -83602 45694 -2143 -74676 -110867 -135271 -105283
14392a05283l531j20923R5943n0810K4167J93036J04306l4713j40224j46575K35860
$$ -105283 -108814 -229737 -133794 -184604 -160437 32599 136905 102192 -38032 -184607 51253
14381E1253O2107o9867J2480K7296p7315J5443j40316K8177k4513J77756j71566
$$ 51253 113360 43493 55973 83269 5954 21397 -118919 -90742 -115255 62501 -109065
14370a09065Q4806J38399k9043j40526J1004M4391M8475j49092j61614M954J1945
$$ -109065 -24259 114140 85097 -55429 -44425 -34 48441 -100651 -262265 -257311 -245366
14359b45366j48289k7322J24798N1194j31605M5011K16773p9119L4651L31J63882
$$ -245366 -393655 -420977 -296179 -244985 -376590 -331579 -114806 -193925 -159274 -158943 4939
14348D939J52q1126j12853J95118J3873p9019n4985R9026n7426j21279n7707O3766
$$ 4939 5091 -76035 -188888 6230 20103 -58916 -113901 -14875 -72301 -193580 -251287 -187521
14336a87521O5341N5695j77806K2481K79766J5092K4277P459K3662L7883j2642
$$ -187521 -122180 -66485 -244291 -221810 57956 73048 97325 104784 128446 166329 153687
14325A53687R785m5497O0535O1743J63043J33785l04202l04886J38645k6247j45891
$$ 153687 163472 117975 178510 240253 403296 537081 232879 -72007 66638 40391 -105500
14314a05500k6109k6064j27349l2920k11088r5535J04509M15206L61728J37213
$$ -105500 -131609 -157673 -285022 -317942 -529030 -624565 -520056 -104850 256878 394091
14304C94091j65254k47503j53343j28116K0341m615j7479J54092j3315J21727
$$ 394091 228837 -18666 -172009 -300125 -279784 -284399 -301878 -147786 -161101 -39374
14294c9374o0573k60731n4577O5722J6195Q8367J51952J49192M7525j81918l6683
$$ -39374 -99947 -360678 -415255 -349533 -333338 -244971 -93019 56173 103698 -78220 -114903
14283a14903m3077M6693p4809q3325K04175J80970Q2913l34933j10010K00127
$$ -114903 -157980 -111287 -186096 -269421 -65246 115724 198637 -136296 -246306 -46179
14273d6179M1428q7626l05438J03944J68856j07238p8621J83892m10j19310J56951
$$ -46179 -4751 -92377 -397815 -293871 -125015 -232253 -310874 -126982 -127392 -246702 -89751
14262h9751m4271m7526m6951N8945l9444R8145K816J04688m4756o2634O3107K51548
$$ -89751 -134022 -181548 -228499 -169554 -208998 -110853 -108037 -3349 -48105 -110739 -47632 203916
14250B03916J41514j05844k04354p2801J11054K388O0797K2860j59725k2658L5657
$$ 203916 345430 239586 35232 -37569 73485 75873 136670 159530 -195 -22853 12804
14239A2804O879n940K5071r1389K36461K73010o8221j90004j07614l7454q5438
$$ 12804 19683 13743 38814 -52575 183886 456896 388675 198671 91057 53603 -31835
14228c1835p2748K1245Q7894L0224k82983J1569Q2083J01828K16373J84476l63568
$$ -31835 -104583 -83338 4556 34780 -248203 -236634 -154551 -52723 163650 348126 -15442
14217a5442k12906M1809o2990N7356J65518L1639J81381J7927k19900J05422n5862
$$ -15442 -228348 -186539 -249529 -192173 -26655 4984 186365 204292 -15608 89814 33952
14206C3952J68302J45503N3541o0085l68242m08911j03540K73188L55259K5978
$$ 33952 202254 347757 401298 341213 -27029 -435940 -539480 -266292 88967 114945
14196A14945r9306J69171j14273j93643j3796Q0607K20747j98532r5745j59565
$$ 114945 15639 184810 70537 -123106 -136902 -56295 164452 -34080 -129825 -289390
14186b89390j0952K1164N8349Q5582J02718j07260j36874R8507K1801J57634k94884
$$ -289390 -300342 -279178 -220829 -135247 -32529 -139789 -276663 -178156 -156355 1279 -293605
14175b93605j02454r4485R4554O8009K51828J59061j49502k28646K4452K34214
$$ -293605 -396059 -490544 -395990 -327981 -76153 82908 -66594 -295240 -270788 -36574
14165c6574L18419N4054j42902j01917n4659n9455N2809n1457j05507J31701P0301
$$ -36574 281845 335899 192997 91080 36421 -23034 29775 -21682 -127189 4512 74813
14154G4813r9126J8150q9539J27278J57933M736l06130k05612J98952Q4624m824
$$ 74813 -24313 -6163 -95702 31576 189509 194245 -111885 -317497 -118545 -33921 -38745
14143c8745K21694k272j39679J00494J39692J21390j30575j990l1549k9590l6450
$$ -38745 182949 180677 40998 141492 281184 402574 271999 270009 238460 208870 172420
14132A72420j21679q3625j14550K65553J65943K5641o4811K3318j33170N3797
$$ 172420 50741 -32884 -147434 118119 284062 309703 244892 268210 135040 188837
14122A88837L3650j24966j13862K24048N0119j62378j09221J77997K18372q4769
$$ 188837 222487 97521 -16341 207707 257826 95448 -13773 164224 382596 297827
14112B97827j08322j06114R5250M2667p7051j7020L8580J9197k6103K4570l0674
$$ 297827 189505 83391 178641 221308 144257 127237 165817 185014 158911 183481 152807
14101A52807k46846j40896K0802k3819O3130J84031J26767K69539k71375n5783
$$ 152807 -94039 -234935 -214133 -237952 -174822 9209 135976 405515 134140 78357
14091G8357k5244j1207j2794j10183k66109j3065K86404O0424j26559K8821J1415
$$ 78357 53113 41906 29112 -81071 -347180 -360245 -73841 -13417 -139976 -111155 -99740
14080i9740M0940K50067L13492k91529l34429M1854J28242l8731j02656n0683
$$ -99740 -58800 191267 504759 213230 -121199 -79345 48897 10166 -92490 -143173
14070a43173J11428J86062O622k06115j38857N3019o5641k1341o1622l3202j32759
$$ -143173 -31745 154317 160939 -45176 -184033 -131014 -196655 -217996 -279618 -312820 -445579
14059d45579M605J74824J43995O8432R4860p2144j48434j11570k981P6176P1251
$$ -445579 -440974 -266150 -122155 -53723 41137 -31007 -179441 -291011 -293992 -217816 -146565
14048a46565J95930J08563k35306j42437l0265k038K8141K4801n6903P8184J76649
$$ -146565 49365 157928 -77378 -219815 -250080 -252118 -223977 -199176 -256079 -177895 -1246
14037a246J44397m3533p3025J34946N1493O0772J91111j42854j64670p1058L864
$$ -1246 143151 99618 26593 161539 213032 273804 464915 322061 157391 86333 90197
14026I0197J21664K03602j37305k88134k59181j22474o0103K6637J00665L64567
$$ 90197 211861 415463 278158 -9976 -269157 -391631 -451734 -425097 -324432 40135
14016D0135j9144k7323k1029J04966M7612j65758j68182K21791M3734l05040j85138
$$ 40135 20991 -6332 -27361 77605 125217 -40541 -208723 13068 56802 -248238 -433376
14005d33376Q5606L30860P2448J54344p2782k01186j28834k09872M5659n2153
$$ -433376 -347770 -16910 55538 209882 137100 -64086 -192920 -402792 -357133 -409286
13995d09286M4914J54583l0451Q0352k4526L5340j0797K4055j53151l5876J18217
$$ -409286 -364372 -209789 -240240 -159888 -184414 -149074 -159871 -135816 -288967 -324843 -206626
13984b06626K43450J03958j15335P9007P2752p5157k9081J31939o9881k24151
$$ -206626 36824 140782 25447 104454 177206 102049 72968 204907 135026 -89125
13974h9125j53899L0322J19166L02840K95992n8628m05609q0469J28514J3608
$$ -89125 -243024 -212702 -93536 209304 505296 446668 41059 -39410 89104 102712
13964A02712J1546P8967N9730L2820j34425k32196j66576J58814K02784j34030
$$ 102712 114258 193225 252955 285775 151350 -80846 -247422 -88608 114176 -19854
13954a9854j23811j18396J43438R4907J58044J0377O8653L05743n9306k03307
$$ -19854 -143665 -262061 -118623 -23716 134328 144705 213358 519101 459795 256488
13944B56488l78224k47146K1126R6291j1041r938J65642n6079j04338J70972P5675
$$ 256488 -121736 -368882 -347756 -251465 -262506 -272444 -106802 -162881 -267219 -96247 -20572
13933b0572r5287k17211n7887k6215J26436J89688j2525k9000j98194j51346J98537
$$ -20572 -115859 -333070 -390957 -417172 -290736 -101048 -113573 -142573 -340767 -492113 -293576
13922b93576J6035j18255j0710K47534N9431k4243J88379K0778r3127q6971j37872
$$ -293576 -277541 -395796 -406506 -158972 -99541 -123784 64595 85373 -7754 -94725 -232597
13911b32597q5655J13825J32842p8508J34602j47302r8290n5908n8615N6382K4248
$$ -232597 -318252 -204427 -71585 -150093 -15491 -162793 -261083 -316991 -375606 -319224 -294976
13900b94976J62890Q3750r4725j23981J42841J58588K54578j8697k03413j39752
$$ -294976 -132086 -48336 -143061 -267042 -124201 34387 288965 270268 66855 -72897
13890g2897R4197j9063j25111K5445N5225k2915Q7726o0336P5905J66285Q904
$$ -72897 21300 2237 -122874 -97429 -42204 -65119 22607 -37729 38176 204461 213365
13879B13365J9617p6258k24950R3321q047Q5011r9110j30458l9503J89942M3777
$$ 213365 232982 156724 -68226 25095 17048 102059 2949 -127509 -167012 22930 66707
13868F6707j19288j66532k15890K70030J44419j24302j14953R4957R268j22468
$$ 66707 -52581 -219113 -435003 -164973 -20554 -144856 -259809 -164852 -155584 -278052
13858b78052j8491o6357k3601O6687n225J57916k21366q0068K48390P0006J21528
$$ -278052 -296543 -362900 -386501 -319814 -325039 -167123 -388489 -468557 -220167 -150161 -28633
13847b8633j52015m5623K6174K93838J48114k35744j72470m7309P9310J39779
$$ -28633 -180648 -226271 -200097 93741 241855 6111 -166359 -213668 -134358 5421
13837E421Q4113n845O0283K854j67946j05295L0717P5513M2293J48576j60148
$$ 5421 89534 83689 143972 146826 -21120 -126415 -95698 -20185 22108 170684 10536
13826A0536j40845O0763J50582r9449j41871j4174k53740K2199J12022J91236
$$ 10536 -130309 -69546 81036 -18413 -160284 -174458 -428198 -405999 -293977 -102741
13816a02741n5948M7341n9090l7291j4980J21956J01620k3939M6425L6411n8359
$$ -102741 -158689 -111348 -170438 -207729 -222709 -100753 867 -23072 23353 59764 1405
13805A405L4995N1378q5798q3776K3600J77794j68152j61608l4928J56363J70056
$$ 1405 36400 87778 1980 -81796 -58196 119598 -48554 -210162 -245090 -88727 81329
13794H1329J34490L4141p7311j20704j22999J99669k7704J9959p8243j70247O0193
$$ 81329 215819 249960 172649 51945 -71054 128615 100911 120870 42627 -127620 -67427
13783f7427j36529P5111O1757L3244J4157j11909p8176l1817P3686Q1138K5032
$$ -67427 -203956 -128845 -67088 -33844 -19687 -131596 -209772 -241589 -167903 -86765 -61733
13772f1733j7942j70435k5160J66263J80948o1649j54033K9514J2978j34343j48039
$$ -61733 -79675 -250110 -275270 -109007 71941 10292 -143741 -114227 -101249 -235592 -383631
13761c83631N0514J01892j037J1314o359J01950n887l288K21800N3189J52107
$$ -383631 -333117 -231225 -232262 -220948 -227307 -125357 -131244 -134532 87268 140457 292564
13750B92564j4418k17752r0169o020k1078O2387M3884j10879r5219k4686p047
$$ 292564 278146 60394 -29775 -35795 -56873 5514 49398 -61481 -156700 -181386 -188433
13739a88433Q3152L57087J74628k66032j14053p9529j4671o5618m428l0026J75084
$$ -188433 -105281 251806 426434 160402 46349 -33180 -47851 -113469 -117897 -147923 27161
13728B7161J59369J30216j28350j3910J10786L4265k3552k39580l57544J09952
$$ 27161 186530 316746 188396 174486 285272 319537 295985 56405 -301139 -191187
13718a91187L13246J30435p6882l02055j01768J23914J70797J50317j2174J08648
$$ -191187 122059 252494 175612 -126443 -228211 -104297 66500 216817 204643 313291
13708C13291R7775J02745o9335k32677q2355j1561j27943j20022j27105j27793
$$ 313291 411066 513811 444476 211799 129444 117883 -10060 -130082 -257187 -384980
13698c84980k1600J46590n9101m1307J0100K60118K26386k23843r6869j18377
$$ -384980 -406580 -259990 -319091 -360398 -350298 -90180 136206 -87637 -184506 -302883
13688c02883P8620N8996l2525l4675k2753J38898O3592k19810N3009K46976j32804
$$ -302883 -224263 -165267 -197792 -232467 -255220 -116322 -52730 -272540 -219531 27445 -105359
13677a05359j57325K5079L7012J85846J92498J9389j23457j33817n4929o8674
$$ -105359 -262684 -237605 -200593 -14747 177751 197140 73683 -60134 -115063 -183737
13667a83737J68707R5915J06904R7324j56496k15687k34257k92018J39171k5476
$$ -183737 -15030 80885 187789 285113 128617 -87070 -321327 -613345 -474174 -499650
13657d99650M5290Q1691N2508N5224J0295M9658m1692j22999j00387j08380O3720
$$ -499650 -454360 -372669 -320161 -264937 -254642 -204984 -246676 -369675 -470062 -578442 -514722
13646e14722J11187K14842o8862M1979J7296j14920m6612K5155J54959R1289R6224
$$ -514722 -403535 -188693 -257555 -215576 -198280 -313200 -359812 -334657 -179698 -88409 7815
13635G815J97462m9177l4319m8174J52082q8921n3429k1119l9858N9177r0608
$$ 7815 205277 156100 121781 73607 225689 136768 83339 62220 22362 81539 -9069
13624i069K76594j42314j71093K77338J54936j80180j2870J62158j50626j06821
$$ -9069 267525 125211 -45882 231456 386392 206212 193342 355500 204874 98053
13614I8053N722J53221l27784k22476P0196J94540j51777j92928q6714J66837
$$ 98053 103775 256996 -70788 -293264 -223068 -28528 -180305 -373233 -459947 -293110
13604b93110j32275J24058J70911k1660J9530J06553Q606j734o6696R7711O2922
$$ -293110 -425385 -301327 -130416 -152076 -132546 -25993 -17387 -19121 -85817 11894 74816
13593G4816j33963j93309M7776j13196J17408J35787j05116J37006J85001J19489
$$ 74816 -59147 -252456 -204680 -317876 -200468 -64681 -169797 -32791 152210 271699
13583B71699j47796j72566m0633n1253j72427K23012J2570q7326J49129J91782
$$ 271699 123903 -48663 -89296 -140549 -312976 -89964 -77394 -164720 -15591 176191
13573A76191N1733j23647j21798L9177J76296j21184m5525j87L04276M4579k49054
$$ 176191 227924 104277 -17521 21656 197952 76768 31243 31056 335332 379911 130857
13562A30857j99623k24662l9368K05669O4755l30507j20841L35543R6991j08728
$$ 130857 -68766 -293428 -332796 -127127 -62372 -392879 -513720 -178177 -81186 -189914
13552a89914j76938J5219L45751R5280j58505l44535p2141L06474J62462L8445
$$ -189914 -366852 -351633 -5882 89398 -69107 -413642 -485783 -179309 -16847 21598
13542B1598l1497L6788j06549J36468K09009o058k6384j58249l8521j9224k8019
$$ 21598 -9899 26889 -79660 56808 265817 259759 233375 75126 36605 17381 -10638
13531a0638J9978J086K0521N820j15959l8871J96295K34863o6779K0217n5612
$$ -10638 9340 10426 30947 36767 -79192 -118063 78232 313095 246316 266533 210921
13520B10921r7364j78261j71880J18042l8701L9557K399k232j17831j76880j91467
$$ 210921 113557 -64704 -236584 -118542 -157243 -117686 -115287 -117519 -235350 -412230 -603697
13509f03697L976J72869K16777K06641J11021P5743o0132p6215k23919q9093K6874
$$ -603697 -599721 -426852 -210075 -3434 107587 183330 123198 46983 -176936 -266029 -239155
13498b39155j28615L22791J98083l4042j36470J0915J29632q584K553j66511j48420
$$ -239155 -367770 -44979 153104 119062 -17408 -6493 123139 114555 117108 -49403 -197823
13487a97823j34594J54211J01694r7167J06385J56856r0185J60366j28285j12955
$$ -197823 -332417 -178206 -76512 -173679 -67294 89562 -623 159743 31458 -81497
13477h1497j03578M1255K76081j03581k34539o6915J15274j6693N6204n1905k37884
$$ -81497 -185075 -143820 132261 28680 -205859 -272774 -157500 -174193 -117989 -169894 -407778
13466d07778J20572R8048l0906O2885P9314J68333q450k48363j46980o3370k5702
$$ -407778 -287206 -189158 -220064 -157179 -77865 90468 82018 -166345 -313325 -376695 -402397
13455d02397k6629j704j256J86051q882J01488J58444R3236K41019m8767j41003
$$ -402397 -429026 -430730 -431986 -245935 -254817 -153329 5115 98351 339370 290603 149600
13444A49600K510j0697n4508m8018J39058N1526M1836k18966k06903k15193L0254
$$ 149600 152110 141413 86905 38887 177945 229471 271307 52341 -154562 -369755 -339501
13433c39501l3237O0352J88778K28421K3275j51309j85627J51293j934N7893j11418
$$ -339501 -372738 -312386 -123608 104813 128088 -23221 -208848 -57555 -59489 -1596 -113014
13422a13014k43854K23483L32846R2396r8482j63924j5168k36733K9229J14692
$$ -113014 -356868 -133385 199461 291857 193375 29451 14283 -222450 -193221 -78529
13412g8529L5358N8665k7341j07090j4065L9598J16929J09090Q1567K276j64924
$$ -78529 -43171 15494 -11847 -118937 -133002 -93404 23525 132615 214182 216458 51534
13401E1534j15495p6616p8257Q4032J05691K44681R2464n1551M3039R6422r8545
$$ 51534 -63961 -140577 -218834 -134802 -29111 215570 308034 256483 299522 395944 297399
13390B97399j32306r6453j09273K9938J68025k9706j2353j5303j68270j48645
$$ 297399 165093 68640 -40633 -10695 157330 127624 115271 99968 -68302 -216947
13380b16947J01287K23476k4139j06905J06587J7919J57518j24442j66525J75709
$$ -216947 -115660 107816 83677 -23228 83359 101278 258796 134354 -32171 143538
13370A43538M4015p7748j60195n0998M6245j79330J91533P4145k23149o6933J64199
$$ 143538 187553 109805 -50390 -101388 -55143 -234473 -42940 31205 -191944 -258877 -94678
13359i4678Q5543n1061L4699o1601O9969J67265P430K6949m0158J3901j87159
$$ -94678 -9135 -60196 -25497 -87098 -17129 150136 157566 184515 144357 158258 -28901
13348b8901M6568K69238o0773M7372Q2286q3507J55Q6544J02352j09549r6309
$$ -28901 17667 286905 226132 273504 355790 272283 272438 358982 461334 351785 255476
13337B55476r3646j94878j14753j8821L7478K57992p7656j26881l3237l6328J7356
$$ 255476 161830 -33048 -147801 -166622 -129144 128848 51192 -75689 -108926 -145254 -127898
13326a27898K72232N8060j01230n2534j05697j59263o737J53276m8112M5741K522
$$ -127898 144334 202394 101164 48630 -57067 -216330 -223067 -69791 -117903 -72162 -69640
13315f9640K53599K3076j32244J75716K50l82346j45255J48031J41677p9394j10803
$$ -69640 183959 207035 74791 250507 250757 -131589 -276844 -128813 12864 -66530 -177333
13304a77333n3085J39316K32586L4539j73929j60303P3168l2047o0349K0070J34741
$$ -177333 -230418 -91102 141484 176023 2094 -158209 -85041 -117088 -177437 -157367 -22626
13293b2626n7008q0201N0738o4437j11551N5662K70322J13216q5328j67560n8586
$$ -22626 -79634 -159835 -109097 -173534 -285085 -229423 40899 154115 68787 -98773 -157359
13282a57359j98744K1236J43608J27830O7842k21049m5817K53697J07302R6734
$$ -157359 -356103 -334867 -191259 -63429 4413 -216636 -262453 -8756 98546 195280
13272A95280r434m6327j77084n6344L19203m1591j93971j33128m1327N657K3760
$$ 195280 185846 139519 -37565 -93909 225294 183703 -10268 -143396 -184723 -179066 -155306
13261a55306K2999K26599J61229j16944N8583j01300k25474j57005k9107j0810
$$ -155306 -132307 94292 255521 138577 197160 95860 -129614 -286619 -315726 -326536
13251c26536K21435N5111M5349L1775j10314K04416N5590q325m4924k41521n8949
$$ -326536 -105101 -49990 -4641 27134 -83180 121236 176826 168501 123577 -117944 -176893
13240a76893J1103K14736j16458J39227o2631l17161p7314J15189k21138p8671
$$ -176893 -165790 48946 -67512 71715 9084 -308077 -385391 -270202 -491340 -570011
13230e70011J41032R4378J6403J7478O528J39778L60491J02059J33582l819j07076
$$ -570011 -428979 -334601 -318198 -300720 -294192 -154414 206077 308136 441718 437899 330823
13219C30823P7511K1631l07990k60376r9280o4201j57284O1362J721j10454J58503
$$ 330823 408334 429965 121975 -138401 -237681 -301882 -459166 -397804 -396083 -506537 -348034
13208c48034L13023J60410L3418j48020m4124J0497j17604R3706O8777j0676M0933
$$ -348034 -35011 125399 158817 10797 -33327 -22830 -140434 -46728 22049 11373 52306
13197E2306m9093K53902M9273j58095j36654j42000m8910j6455j47585J03733
$$ 52306 3213 257115 306388 148293 11639 -130361 -179271 -195726 -343311 -239578
13187b39578K53565Q3386j04397L2864J30770m596k994k73038N5966K39589j10625
$$ -239578 13987 97373 -7024 25840 156610 152014 149020 -124018 -68052 171537 60912
13176F0912r6900n8010j84012Q2189J85926n4737J1074j17304o345O5335n6779
$$ 60912 -35988 -93998 -278010 -195821 -9895 -64632 -53558 -170862 -177207 -111872 -168651
13165a68651O9916n8025j25661j72873n3093O2750K56226K95115J97866O0236
$$ -168651 -98735 -156760 -282421 -455294 -508387 -445637 -189411 105704 303570 363806
13155C63806j75208j15898l1696L4225K29018N7318l31948p7329k21063K4211
$$ 363806 188598 72700 41004 75229 304247 361565 29617 -47712 -268775 -244564
13145b44564j1276n6303J93261K17622n4196j85939L3604J32948J66532k09403
$$ -244564 -255840 -312143 -118882 98740 44544 -141395 -107791 25157 191689 -17714
13135a7714k99235L0020J66085j9865p1424N9916o1670J3236l4681k01j11573
$$ -17714 -316949 -286929 -120844 -140709 -212133 -152217 -213887 -200651 -235332 -235533 -347106
13124c47106J40906Q4347Q464J28454J24471M1804n8472k64921k80212K55219
$$ -347106 -206200 -121853 -113389 15065 139536 181340 122868 -142053 -422265 -167046
13114a67046L05159j78115k23125J4826K55559J07638r1102j16920O3679O7473
$$ -167046 138113 -40002 -263127 -248301 7258 114896 23794 -93126 -29447 38026
13104C8026q5308O8444J90519J16193K6042M742q9449j60089j19087J22805J74331
$$ 38026 -47282 21162 211681 327874 353916 358658 269209 109120 -9967 112838 287169
13093B87169N876k22501j99368J28351K20494O615j15202l55896N8380R3477o4853
$$ 287169 293045 70544 -128824 -473 220021 226636 111434 -244462 -186082 -92605 -157458
13082a57458N55r9164n4009P9673J68595R3548j70089j09540o7453l2569N9671
$$ -157458 -156903 -256067 -310076 -230403 -61808 31740 -138349 -247889 -315342 -347911 -288240
13071b88240p5323j3793K20279K13184M3376K06160k17712k87567R7769J36649
$$ -288240 -363563 -377356 -157077 56107 99483 305643 87931 -199636 -101867 34782
13061C4782n8402N3264J55463J18202j98609m2894m3487j06362L4558J27616k02416
$$ 34782 -23620 29644 185107 303309 104700 61806 18319 -88043 -53485 74131 -128285
13050a28285j05501L3993J15328J01843K9814J33754k31380l15969j32611L32026
$$ -128285 -233786 -199793 -84465 17378 47192 180946 -50434 -366403 -499014 -166988
13040a66988K0103k8244K728o4102P0459r0707K7770K31272M6432K4118J40572
$$ -166988 -146885 -175129 -172401 -236503 -166044 -256751 -228981 2291 48723 72841 213413
13029B13413K8303j80314j97832n0005L1670L6422K33786J10101j07687k03085
$$ 213413 241716 61402 -136430 -186435 -154765 -118343 115443 225544 117857 -85228
13019h5228j92287K925J55796j24801O6939K05021j37861j14592k20312J1779
$$ -85228 -277515 -274590 -118794 -243595 -176656 28365 -109496 -224088 -444400 -432621
13009d32621N5382J95391R0419l4040j00286J17669N5677k55905J32450m5310
$$ -432621 -377239 -181848 -91429 -125469 -225755 -108086 -52409 -308314 -175864 -221174
12999b21174L5696n8184K48027m0897N258j5995J72560K5959o9465O3552q0281
$$ -221174 -185478 -243662 4365 -36532 -31274 -47269 125291 151250 81785 145337 65056
12988F5056k19300L6673J94043J95365n0157N0134J3542j05136j47134n824M7801
$$ 65056 -154244 -117571 76472 271837 221680 271814 285356 180220 33086 27262 75063
12977G5063j93939J13211J17169l13029p9310k6272j8176L10963O862j16320L8614
$$ 75063 -118876 -5665 111504 -201525 -280835 -307107 -325283 -14320 -7458 -123778 -85164
12966h5164J66608P9827j79964L4597O3754m0234M5746L258k706j05921j05336
$$ -85164 81444 161271 -18693 15904 79658 39424 85170 88428 85722 -20199 -125535
12955a25535R7589o1742J43010J13494q7479L2177k1388j47469J2052N6499j03529
$$ -125535 -27946 -89688 53322 166816 79337 111514 90126 -57343 -45291 11208 -92321
12944i2321L8183J20780L06063O5457j38209j14305k829O9397l271R359l49714
$$ -92321 -54138 66642 372705 438162 299953 185648 182819 252216 248945 258304 -91410
12933i1410J10360Q9293p6893m1395r6832l5106J88144j790k0735n7092q2929
$$ -91410 18950 108243 31350 -10045 -106877 -141983 46161 44371 23636 -33456 -116385
12922a16385r7272n3200J78890J74435Q2597k5526l0740k303N3192q501J19691
$$ -116385 -213657 -266857 -87967 86468 169065 143539 112799 110496 163688 155187 274878
12911B74878N6611r8260R2450K4811j59335k02327n307L3850q7837J49303J71420
$$ 274878 331489 233229 325679 350490 191155 -11172 -16479 17371 -70466 78837 250257
12900B50257m8078J12724K64808j4634j97240l73961j5624J58501Q4512k1443
$$ 250257 202179 314903 579711 565077 367837 -6124 -21748 136753 221265 199822
12890A99822J11440l8415J01249J15336j48760j0757m8480n4704o7786J08465
$$ 199822 311262 272847 374096 489432 340672 329915 281435 226731 158945 267410
12880B67410O7225j3494j7219j65057O5747R5693J63561o5373j89170J43932J11340
$$ 267410 334635 321141 303922 138865 204612 300305 463866 398493 209323 353255 464595
12869D64595J1151r4683L9631N4952j09370r6680j02682K49902l711j10271j37802
$$ 464595 475746 381063 420694 475646 366276 269596 166914 416816 413105 302834 165032
12858A65032m5970J61860l857j08043N7642J64137j1937m9733K73338Q5018j31037
$$ 165032 119062 280922 277065 169022 226664 390801 378864 329131 602469 687487 556450
12847E56450J12668J13744N0123J2347J47610j44626k49599N8508j35621j93835
$$ 556450 669118 782862 832985 845332 992942 848316 598717 657225 521604 327769
12837C27769j92629L5772K14072R0776P0793j47979J16921J83707k7012J09142
$$ 327769 135140 170912 384984 475760 546553 398574 515495 699202 672190 781332
12827G81332r5652r8194J3429J42059j3979m7565o1947l6477j94004o4408N5924
$$ 781332 685680 587486 600915 742974 728995 681430 619483 583006 389002 324594 380518
12816C80518M5250J77417L801m2636r0866L1779K9091J5645o7635k4580O7440
$$ 380518 425768 603185 606986 564350 473484 505263 534354 549999 482364 457784 525224
12805E25224J05781k61547m0714J8680q9094j35272k6869J11748R0840j65146
$$ 525224 631005 369458 328744 347424 258330 123058 96189 207937 298777 133631
12795A33631n0493J59067K26310J06929j41238Q1912k6716o3299J19992L8852
$$ 133631 83138 242205 468515 575444 434206 516118 489402 426103 546095 584947
12785E84947o0685O5954K05100r4254j78221j08783m2485J58273j26485l4012
$$ 584947 524262 590216 795316 701062 522841 414058 371573 529846 403361 369349
12775C69349l2281J48294j18101k86156j8278k2849J89795K10008m6595n2250
$$ 369349 337068 485362 367261 81105 62827 39978 229773 439781 393186 340936
12765C40936r3562q7415J35341K80721Q3551P994k14013r8790j69755Q8783Q5113
$$ 340936 247374 159959 295300 576021 659572 667566 453553 354763 185008 273791 358904
12754C58904L2741j79858j22260J78393M0776k14134Q0760o0883L5787J84322
$$ 358904 391645 211787 89527 267920 308696 94562 175322 114439 150226 334548
12744C34548N3754L5728J3626l3312P256j31199j82428j33479J26221J22062j6210
$$ 334548 388302 424030 437656 404344 411600 280401 97973 -35506 90715 212777 196567
12733A96567M7373p7682k37295j71252j00218P1450J24146K09623J25397J71776
$$ 196567 243940 166258 -71037 -242289 -342507 -271057 -146911 62712 188109 359885
12723C59885K32665j01451J057j24565q664r4576M1079M460N1415q6425k73911
$$ 359885 592550 491099 492156 367591 358927 264351 305430 309890 361305 274880 969
12712I69J11595L736r4060k31868j550L2072R4515K89518J26175r1721j38361
$$ 969 112564 116300 22240 -209628 -211178 -179106 -84591 204927 331102 239381 101020
12701A01020q8214l3758R3548J80358J58525p0600j23101k92942j29957L6876
$$ 101020 12806 -20952 72596 252954 411479 340879 217778 -75164 -205121 -168245
12691a68245j21719m4195o4064j17962K26945M7728Q4241L26632J14189p1218
$$ -168245 -289964 -334159 -398223 -516185 -289240 -241512 -157271 169361 283550 212332
12681B12332j08187j99343Q1965J66273R1087j11701j95771J06034K26752K55464
$$ 212332 104145 -95198 -13233 153040 244127 132426 -63345 42689 269441 524905
12671E24905m3442j34070N1431N193j39094j18260p0170M052L9823K1683J0639
$$ 524905 481463 347393 398824 404017 264923 146663 76493 80545 120368 142051 152690
12660A52690k84928R6325J3031J69525M7931L7813J40294l8131k7687j16141J95174
$$ 152690 -132238 -35913 -22882 146643 194574 232387 372681 334550 306863 190722 385896
12649C85896R4831o9785p3650m1645k10275k37886P1741N290j88489o8259O1130
$$ 385896 480727 410942 337292 295647 85372 -152514 -80773 -75483 -263972 -332231 -271101
12638b71101J53222K41140J10654o6800j16735l1490J00894O8839j7916R2917
$$ -271101 -117879 123261 233915 167115 50380 18890 119784 188623 170707 263624
12628B63624P4642N1723n1160o2923j05725Q1761O8620J01156J08337N3087M4515
$$ 263624 338266 389989 338829 275906 170181 251942 320562 421718 530055 583142 627657
12617F27657l27641j77675q8539R1404q3440O4947L05394L99609q072l27158l86240
$$ 627657 300016 122341 33802 125206 41766 106713 412107 811716 803644 476486 90246
12606I0246q1611j6594J17376J20238j3493j76496k46929J6705K02560R1492P1880
$$ 90246 8635 -7959 109417 229655 216162 39666 -207263 -190558 12002 103494 175374
12595A75374n05l6437K3823M5513J54599K21133R7498q137j43378J75331j82983
$$ 175374 174869 138432 162255 207768 362367 583500 680998 672861 529483 704814 521831
12584E21831j88289Q0824K00877K3607k41285J9112J30636J01225k58118L9646
$$ 521831 333542 414366 615243 638850 397565 416677 547313 648538 390420 430066
12574D30066J40640j38986j95041K3025q0310p4197K22543K01607j0041R9699
$$ 430066 570706 431720 236679 259704 179394 105197 327740 529347 519306 619005
12564F19005l3514J4743J87320l2073m6820j32741k27004O6069L1926J72530J10810
$$ 619005 585491 600234 787554 755481 708661 575920 348916 414985 446911 619441 730251
12553G30251j3428J8532N9866K09444n8058j15134J3245K65852k254l24797k06530
$$ 730251 716823 735355 795221 1004665 946607 831473 844718 1110570 1108316 783519 576989
12542E76989o2054j46868j603K50626N9715M5684o4542O8336Q8040J44275L5384
$$ 576989 514935 368067 366464 617090 676805 722489 657947 726283 814323 958598 993982
12531I93982K2401j59694j78568K41649K09540J1081k66710p0858N8111J15443
$$ 993982 1016383 856689 678121 919770 1129310 1140391 873681 802823 860934 976377
12521I76377Q4208R5634M0030q8933r2155j44703n3724K09016J86077k574N3672
$$ 976377 1060585 1156219 1196249 1107316 1015161 870458 816734 1025750 1211827 1209253 1262925
12510A262925L11437K49330J70475R3913j08092j1095J02214L65992J41576K34677
$$ 1262925 1574362 1823692 1994167 2088080 1979988 1968893 2071107 2437099 2578675 2813352
12500B813352L65961M00790L72768M28800Q59448J046553Q59824J150363J371614
$$ 2813352 3179313 3580103 3952871 4381671 5241119 6287672 7147496 8297859 9669473
12491I669473J811265K086292K155103K202996K081834J414089J027983O33244
$$ 9669473 11480738 13567030 15722133 17925129 20006963 21421052 22449035 23082279
12483B3082279k67515o10191r24206j165385r80286p35065m07785j27744J23931
$$ 23082279 22814764 22204573 21280367 20114982 19134696 18399631 17991846 17864102 17988033
12474A7988033M56694J162398J704778J905031K694661L672025M479421M853705
$$ 17988033 18444727 19607125 21311903 23216934 25911595 29583620 34063041 38916746
12466C8916746N254455N141558M878117M131726K872097J781133L06794j160658
$$ 38916746 44171201 49312759 54190876 58322602 61194699 62975832 63282626 62121968
12458F2121968k324222k909303l470669l511813l301846k942052k287995j791868
$$ 62121968 59797746 56888443 53417774 49905961 46604115 43662063 41374068 39582200
12450C9582200j144446j69540M59707R24300J775600K851497L315965M065772
$$ 39582200 38437754 38268214 38727921 39652221 41427821 44279318 47595283 51661055
12442E1661055M702865M871381M578336M561427L869332K976368J785753Q75329
$$ 51661055 56363920 61235301 65813637 70375064 74244396 77220764 79006517 79881846
12434G9881846l6997m92339o94328o13505p9279J21918O8038k44459p26716j458604
$$ 79881846 79844849 79352510 78658182 78044677 77965398 78087316 78155354 77910895 77184179 75725575
12424G5725575k193733k645643k835036k311218j979065j082753j6227J048867
$$ 75725575 73531842 70886199 68051163 65739945 63760880 62678127 62661900 63710767
12416F3710767K036092K642133L400626L660393M144846N188514O102977O860564
$$ 63710767 65746859 68388992 71789618 75450011 79594857 84783371 90886348 97746912
12408I7746912P921239Q630242Q605037P713625O247374L939283J227941j450782
$$ 97746912 105668151 114298393 122903430 130617055 136864429 140803712 142031653 140580871
12400A40580871l790716n580763o958959p737089q137078p806374o625648n245113
$$ 140580871 136790155 131209392 124250433 116513344 108376266 100569892 93944244 88699131
12392H8699131l921274k280932j012963P30259K399048L929333N297798O832738
$$ 88699131 84777857 82496925 81483962 82214221 84613269 88542602 93840400 100673138
12384A00673138P986705Q548091Q824709Q192930O749346N049301K789723R7420
$$ 100673138 108659843 117207934 126032643 134225573 140974919 146024220 148813943 148911363
12376A48911363k584977m965579o734504p877364p795909p442059o770816n792886
$$ 148911363 146326386 141360807 134626303 126748939 118953030 111510971 104740155 98947269
12368I8947269n171163m572958l987118l328582k715525j915190j121611m00209
$$ 98947269 93776106 89203148 85216030 81887448 79171923 77256733 76135122 75734913
12360G5734913R45622J642011K087694K792533K772661K409959J767483J063845
$$ 75734913 76680535 78322546 80410240 83202773 85975434 88385393 90152876 91216721
12352I1216721P03755L22223J69105N69893J132718J393469R42795K01660m54585
$$ 91216721 91920476 92242699 92411804 92981697 94114415 95507884 96450679 96652339 96197754
12343I6197754j362665k662886l557220m614622n016472m961098m892072m212776
$$ 96197754 94835089 92172203 88614983 84000361 78983889 74022791 69130719 64917943
12335F4917943l769797l145574k359908j748373p79468R0927J228670J794438
$$ 64917943 61148146 58002572 55642664 53894291 53114823 53205750 54434420 56228858
12327E6228858K689368L435198L809212M144135L992845L587971K747583J411583
$$ 56228858 58918226 62353424 66162636 70306771 74299616 77887587 80635170 82046753
12319H2046753r9677j302624k673808l958878m684172n319223n439306n321868
$$ 82046753 81947076 80644452 77970644 74011766 69327594 64008371 58569065 53247197
12311E3247197m709414l926481l426589k564229j838296j587214j066513o52781
$$ 53247197 48537783 44611302 41184713 38620484 36782188 35194974 34128461 33475680
12303C3475680j97110K58084P09357J136347J251069R48311M12451K84275m11602
$$ 33475680 33278570 33536654 34246011 35382358 36633427 37581738 37994189 38278464 37866862
12294C7866862q15937j674171k076180k620958k814373k411900k036302j937091
$$ 37866862 37050925 35376754 33300574 30679616 27865243 25453343 23417041 21479950
12286B1479950j560315j345680j421680j222757p98420p39368o97325q71309p41792
$$ 21479950 19919635 18573955 17152275 15929518 15131098 14391730 13694405 12823096 12081304
12277A2081304k25908l56972p40333n50565l17562l30715j68891m42633l48188
$$ 12081304 11855396 11498424 10758091 10207526 9889964 9559249 9390358 8947725 8599537
12268H599537j67086l46768m04023l08793k65573k19430J15639k70310j96702
$$ 8599537 8432451 8085683 7681660 7372867 7107294 6887864 7003503 6733193 6536491
12259F536491N9062k40053l59210k18443k84694j72343j73963j82962j35249o3404
$$ 6536491 6595553 6355500 5996290 5777847 5493153 5320810 5146847 4963885 4828636 4765232
12249D765232j52580k11181N3332l7017M4506n8348l22673k48419l38580j63023
$$ 4765232 4612652 4401471 4454803 4417786 4462292 4403944 4081271 3832852 3494272 3331249
12239C331249R341L8384p4374j9143q9195r0211j38973j05322j82510q7383J00378
$$ 3331249 3340590 3378974 3304600 3285457 3196262 3106051 2967078 2861756 2679246 2591863 2692241
12228B692241r2000k80055o1281k6267k3847K51571Q376j71J00831k77103j44501
$$ 2692241 2600241 2320186 2258905 2232638 2208791 2460362 2468738 2468567 2569398 2292295 2147794
12217B147794K7765J34209n3099k39681m55382q4803M0700q381K7745M9846N0160
$$ 2147794 2175559 2309768 2256669 2016988 1561606 1476803 1517503 1509122 1536867 1586713 1636873
12206A636873J0715j43599j40717J00194J45949N139j51618L1596k35081k69312
$$ 1636873 1647588 1503989 1363272 1463466 1609415 1614554 1462936 1494532 1259451 990139
12196I90139j61490P6322l8183l8689J3959J1004j6557l5373j084n9210P103O3397
$$ 990139 828649 904971 866788 828099 842058 853062 836505 801132 800048 740838 747941 811338
12184H11338q435q9336j40451J8365L83771k5785l5079n371l8122L6003j77067
$$ 811338 802903 713567 573116 591481 975252 949467 914388 909017 870895 906898 729831
12173G29831j27547J32074J29146j82321m5667R1758m3096J35790Q643R661J32480
$$ 729831 602284 734358 863504 681183 635516 727274 684178 819968 828611 838272 970752
12162I70752m1969j82659j22439O1528J07722j35391o244L8028J31600J09759
$$ 970752 928783 746124 623685 685213 792935 657544 651300 689328 820928 930687
12152I30687J40285J48453R614j38995k80642o2849K21720J82781N705j82287
$$ 930687 1070972 1219425 1229039 1090044 809402 746553 968273 1151054 1156759 974472
12142I74472m63396r8704J06907P3038j05066j77380l7206K3818K00640r6341
$$ 974472 511076 412372 519279 592317 487251 309871 272665 296483 497123 400782
12132D00782Q8932K67809J04049k15800k31512n4764p7006j08373l159J50501
$$ 400782 489714 757523 861572 645772 414260 359496 282490 174117 170958 321459
12122C21459K76915M0513J07368n86m8921M5853r6516p7792o8854J417j59030
$$ 321459 598374 638887 746255 745669 696748 742601 646085 568293 499439 500856 341826
12111C41826r5088J61234J90051P2129q6459Q7487p1432K7112j34853J46711K06914
$$ 341826 246738 407972 598023 670152 583693 671180 599748 626860 492007 638718 845632
12100H45632k24705k8682j27671k09336J05819j20215k4991J79958R3776P7078
$$ 845632 620927 592245 464574 255238 361057 240842 215851 395809 489585 566663
12090E66663m774l1295q0584j3705M5729L0853O544j68827k0579Q4386j2241M2267
$$ 566663 561889 530594 450010 436305 482034 512887 519431 350604 330025 414411 402170 444437
12078D44437j56190J51525J2373q5965J18592K09393R4410j76765k95821j65932
$$ 444437 288247 439772 452145 366180 484772 694165 788575 611810 315989 150057
12068A50057P2653L47602J81063J0757l50685k68036n8049j92478J39121J16289
$$ 150057 222710 570312 751375 762132 411447 143411 85362 -107116 32005 148294
12058A48294J1749K0624j46295K21563J07630K82814J6894m32916k35321j23001
$$ 148294 160043 180667 34372 255935 363565 646379 663273 230357 -4964 -127965
12048a27965K35764R3805P8482q7569r6888k9902K6196R856J20446Q6258J6044
$$ -127965 107799 201604 280086 192517 95629 65727 91923 101779 222225 308483 324527
12037C24527j14509R0669o4459K325J38635J8797Q2503R8072j57742p8926j86709
$$ 324527 210018 300687 236228 238553 377188 395985 478488 576560 418818 339892 153183
12026A53183k97258R1969K95567J19565j22388o1670r8261p3840K68666J34151
$$ 153183 -144075 -52106 243461 363026 240638 178968 80707 6867 275533 409684
12016D09684k1013l3334r5990m6517J54914R4100J27490j95813J29147k42474
$$ 409684 388671 355337 259347 212830 367744 461844 589334 393521 522668 280194
12006B80194j38948r4370j16831J65353m131J90501J65813j27403p2010L2701
$$ 280194 141246 46876 -69955 95398 91267 281768 447581 320178 248168 280869
11996B80869N9244J17085R7018L1362j32917q392J25391J8637o1645J07567J4448
$$ 280869 340113 457198 554216 585578 452661 444269 569660 588297 526652 634219 648667
11985F48667j28044l4350J87905l3456k03209K8701R2096M8113l7935N5439j11341
$$ 648667 520623 486273 674178 640722 437513 466214 558310 606423 568488 623927 512586
11974E12586n5545q0151P1344j48320Q7384J24603M9922R2122J97106j27084m58335
$$ 512586 457041 376890 448234 299914 387298 511901 561823 653945 851051 723967 265632
11963B65632L1676K53425k5395j8642k19428M9692O1064J13705J81817J53173
$$ 265632 297308 550733 525338 506696 287268 336960 398024 511729 693546 846719
11953H46719j71950K130K03067J97611Q0857j24837k13546j77248J1768q8443
$$ 846719 674769 676899 879966 1077577 1158434 1033597 820051 642803 654571 566128
11943E66128J685n460j19143q5934J00604K66801J22238m4409j87179k01503O3582
$$ 566128 567813 562353 443210 357276 457880 724681 846919 802510 615331 413828 477410
11932D77410K24607M2841J3663L23829p285j94583Q0970O128p0526J05189j78505
$$ 477410 702017 744858 758521 1082350 1075065 880482 961452 967580 897054 1002243 823738
11921H23738k19083j17917L18043M1953k89504o8789j75658J62147J95287N6345
$$ 823738 604655 486738 804781 846734 557230 488441 312783 474930 670217 726562
11911G26562k01314j93559J07186p4684o1231J12599j28265L6335J7597J23269
$$ 726562 525248 331689 438875 364191 302960 415559 287294 323629 341226 464495
11901D64495J58829O6579r9781j53285J1482O4583o2051J02597o257N0800j7398
$$ 464495 623324 689903 590122 436837 448319 512902 450851 553448 547191 597991 580593
11890E80593j36446j9133J62960j68001k5607K70135r4590r2608j92807m1850
$$ 580593 444147 425014 587974 419973 394366 664501 569911 477303 284496 242646
11880B42646K85060o6824o0456j00871P0238L7532j2239P7903j26895k9861q9645
$$ 242646 527706 460882 400426 299555 369793 407325 395086 472989 346094 316233 226588
11869B26588K1510J08023J23494m754J1978K01758J9416j19750k2561r8952K8622
$$ 226588 248098 356121 479615 474861 486839 688597 708013 588263 565702 466750 495372
11858D95372J8042k0730j8264L3343m7945l8799l7551j45151p5209j60701K00535
$$ 495372 513414 492684 474420 507763 459818 421019 383468 238317 163108 2407 202942
11847B02942J47894L788p9383n5419J29910J03011L7529P4976j78763M1811K5667
$$ 202942 350836 354624 275241 219822 349732 452743 490272 565248 386485 428296 453963
11836D53963k02079j37797o4019M0725m7040J45660k8280J03780j03829j67825
$$ 453963 251884 114087 50068 90793 43753 189413 161133 264913 161084 -6741
11826f741K65266J05264r5572l1081K61825L8377j865n3946l61695l75733j48802
$$ -6741 258525 363789 268217 237136 498961 537338 535473 481527 119832 -255901 -404703
11815d04703K22393J96381K54782J1219j76758j83303j25224J29922M3810j35863
$$ -404703 -182310 14071 268853 280072 103314 -79989 -205213 -75291 -31481 -167344
11805a67344J22208J51043J37293K94284J3608j1543j1166k82830j11896m8230
$$ -167344 -45136 105907 243200 537484 551092 539549 528383 245553 133657 85427
11795H5427j53029l1133Q4064O8156Q3224k22627K07476J70066N8055j41723l3480
$$ 85427 -67602 -98735 -14671 53485 136709 -85918 121558 291624 349679 207956 174476
11784A74476Q8139L42970O1517l61101k88912n72J06244P6615j94939L1564j67624
$$ 174476 262615 605585 667102 306001 17089 16517 122761 199376 4437 36001 -131623
11773a31623O0302K1210J09242k7550K7739R3338M634n2307n4215p503Q1374Q3869
$$ -131623 -71321 -50111 59131 31581 59320 152658 157292 104985 50770 43267 124641 208510
11761B08510m9687J4995n4603O425J26351O3899l5983j47563M0582n4174l3617
$$ 208510 158823 173818 119215 125640 251991 315890 279907 132344 172926 118752 85135
11750H5135J06540J51561j99635j45453L40332J80946j93658q9609k5278j56261
$$ 85135 191675 343236 143601 -1852 338480 519426 325768 236159 210881 54620
11740E4620J00146j2839o9631O5613K57020l3450j96117j08722K1425j0920J08598
$$ 54620 154766 141927 72296 137909 394929 361479 165362 56640 78065 67145 175743
11729A75743J96194j40496j84630R5323O8189J21145N7056J23170J37022k93389
$$ 175743 371937 231441 46811 142134 210323 331468 388524 511694 648716 355327
11719C55327l48516Q0446K23621j44973j26569M1231j669O0751J16105J22505
$$ 355327 6811 87257 310878 165905 39336 80567 78898 139649 255754 378259
11709C78259J10230j81882l1062O6843k29282m5399J80842R2143o9707j0883j3661
$$ 378259 488489 306607 275545 342388 113106 67707 248549 340692 270985 260102 246441
11698B46441j414m7688J04924O0953p5769m5026J08292J0803J79717o2155k49167
$$ 246441 245027 197339 302263 363216 287447 242421 350713 361516 541233 479078 229911
11687B29911O8153P9877k86356j52130J19794J14796k1077j73495k9573j49640
$$ 229911 298064 377941 91585 -60545 59249 174045 152968 -20527 -50100 -199740
11677a99740N5013K10973k01365j04152O1122o4315M5085L00367O3404k8911O811
$$ -199740 -144727 66246 -135119 -239271 -178149 -242464 -197379 102988 166392 137481 144292
11666A44292j67909j11484M04984J07405p9651k24710p6543J73578o5189k645
$$ 144292 -23617 -135101 269883 377288 297637 72927 -3616 169962 104773 102128
11656A02128J43515N9753j18822l706J4009J45275Q6610j02584j75855j93643
$$ 102128 245643 305396 186574 182868 196877 342152 428762 326178 150323 -43320
11646d3320j59503J1137j15228J29094K36693J9934l519O7674j7090J21678M7429
$$ -43320 -202823 -191686 -306914 -177820 58873 78807 75288 142962 125872 247550 294979
11635B94979k75229J5709J28818J67435P0232j81356l35029l9114K30919Q988
$$ 294979 19750 35459 164277 331712 401944 220588 -114441 -153555 77364 86352
11625H6352J07039J2203K0909J99596M8383k59949j17478q8564J44841K93750
$$ 86352 193391 205594 226503 426099 474482 214533 97055 8491 153332 447082
11615D47082P1342K641j83157p206q4012p7589k9147J1645J49997L7002J4135
$$ 447082 518424 521065 337908 330702 246690 169101 139954 151599 301596 338598 352733
11604C52733r158M4332J18655m7287o2942j22245Q2905r3446k9050k83446k15208
$$ 352733 343575 387907 506562 459275 396333 274088 356993 263547 234497 -48949 -264157
11593b64157K93384R4012k7932J94793n0346Q0646K12821n3286j9342k70113r7901
$$ -264157 29227 123239 95307 290100 239754 320400 533221 479935 460593 190480 92579
11582I2579L8206J46172O1136k49260n8398j3547j6078J1013K6477M1213O2872
$$ 92579 130785 276957 338093 88833 30435 16888 810 11823 38300 79513 142385
11571A42385m8480P5327N0232K5071j30550j54797n1615N2539J54533j461J53498
$$ 142385 93905 169232 219464 244535 113985 -40812 -92427 -39888 114645 113184 266682
11560B66682r2284k2179k6751J14932k47709k06082J25553L2263L6031P4105K87444
$$ 266682 174398 152219 125468 240400 -7309 -213391 -87838 -55575 -19544 54561 342005
11549C42005j63670K09565P8574N4245m7964k20410o6871j9147k8472j56396j18043
$$ 342005 178335 387900 466474 520719 472755 252345 185474 166327 137855 -18541 -136584
11538a36584P0999K83027N189n0530L5564J19878J15661m2825j60540R4980o3672
$$ -136584 -65585 217442 222631 172101 207665 327543 443204 400379 239839 334819 271147
11527B71147j00621j00252O7680j611m0264Q3297K5806K34913M63021j8828L0308
$$ 271147 170526 70274 137954 136343 96079 179376 205182 440095 903116 884288 914596
11516I14596l1392R3914j1992k50106j06340K584j28777o7573k2428L4177R3988
$$ 914596 883204 977118 965126 715020 608680 611264 482487 414914 392486 426663 520651
11505E20651J59498J79004M5119L7068J83764P6987k21971p6218j6809K5726r7065
$$ 520651 680149 859153 904272 941340 1125104 1202091 980120 903902 887093 912819 815754
11494H15754j28543p6267J87604J42373q9161L57L3290K42922N472m1866p528
$$ 815754 687211 610944 798548 940921 851760 852117 885407 1128329 1133801 1091935 1084407
11483A084407j1083r7172j28865l4807J77092J27636R046o0273m5269o3738Q1535
$$ 1084407 1073324 976152 847287 812480 989572 1117208 1126254 1065981 1020712 956974 1038509
11472A038509p0766k2975K1121K45245j9204j60910J23037L9463k26205p4448
$$ 1038509 967743 944768 965889 1211134 1191930 1031020 1154057 1193520 967315 892867
11462H92867j78829n6801L0787M9327r7836k2949p3325M9736N7973k4240J07717
$$ 892867 714038 657237 688024 737351 639515 616566 543241 592977 650950 626710 734427
11451G34427L97845N7753q6373j05730j32330M2295K20448Q5103J04384J23802
$$ 734427 1132272 1190025 1103652 997922 865592 907887 1128335 1213438 1317822 1441624
11441A441624K4407l15046n50395j88270K71293J70676N710n9943N2574J14357
$$ 1441624 1466031 1150985 600590 412320 683613 854289 859999 800056 852630 966987
11431I66987K71288O6319p2840p2828k58039O896J13245p5632k4258J41441K71212
$$ 966987 1238275 1304594 1231754 1158926 900887 907783 1021028 945396 921138 1062579 1333791
11420A333791l260n3374P1094J54399K39480n6538k89006L5497Q1109n6231k90084
$$ 1333791 1330531 1277157 1348251 1502650 1742130 1685592 1396586 1432083 1513192 1456961 1166877
11409A166877j22493Q3563R9357J94848N4472M7742N3665K8654k10408j05494
$$ 1166877 1044384 1127947 1227304 1422152 1476624 1524366 1578031 1606685 1396277 1290783
11399A290783j18602r6772J72716K41601J85431J70824M8669j08021N0573L2769
$$ 1290783 1172181 1075409 1248125 1489726 1675157 1845981 1894650 1786629 1837202 1869971
11389A869971m1802q3465m3500j89943J1183P9472N9962j77769Q0503n5620L30660
$$ 1869971 1828169 1744704 1701204 1511261 1522444 1601916 1661878 1484109 1564612 1508992 1839652
11378A839652J05693Q9441m7602j25232j87801k8286j21283l20323j11905K78705
$$ 1839652 1945345 2034786 1987184 1861952 1674151 1645865 1524582 1204259 1092354 1371059
11368A371059R1160j99813j02109Q4105J45249M0584k10876k0942K79924J82205
$$ 1371059 1462219 1262406 1160297 1244402 1389651 1430235 1219359 1198417 1478341 1660546
11358A660546m4657j54821K8114J102j07013J1719J07240l18644k02510l4278
$$ 1660546 1615889 1461068 1489182 1490284 1383271 1394990 1502230 1183586 981076 946798
11348I46798r0411j56544r8076L40702R4228n8727k25961n9078r1185j16570K409
$$ 946798 856387 699843 601767 942469 1036697 977970 752009 692931 601746 485176 487585
11337D87585K20196N2767O5323M141O062J50398j38362q0065j52665o0190O5079
$$ 487585 707781 760548 825871 830012 836074 986472 848110 768045 615380 555190 620269
11326F20269q8698n0488K01332J80183j06229K0923j6314j01200o5589P1259j32185
$$ 620269 531571 481083 682415 862598 756369 777292 760978 659778 594189 665448 533263
11315E33263k15815P8992j13419J9115R3615P146J23456J49275J82391k40268
$$ 533263 317448 396440 283021 302136 395751 402897 526353 675628 858019 617751
11305F17751j35410K86701O8708k14005k01685M3812M7353j67354J4777J29903
$$ 617751 482341 769042 837750 623745 422060 465872 513225 345871 360648 490551
11295D90551J92592P6950k04908k52472k9813J89125J27757j00287J83999N1584
$$ 490551 683143 760093 555185 302713 272900 462025 589782 489495 673494 725078
11285G25078k25867j39033J52226K31348n5620j49326k16171j37023J80928J52720
$$ 725078 499211 360178 512404 743752 688132 538806 322635 185612 366540 519260
11275E19260P8984R6804p7271j12948J40012K16104m4385m9424K09580N9444j04479
$$ 519260 598244 695048 617777 504829 644841 860945 816560 767136 976716 1036160 931681
11264I31681j56249j11446M5909J2780l2206l4312R8257R4851j17352o8449J2925
$$ 931681 775432 663986 709895 722675 690469 656157 754414 849265 731913 663464 676389
11253F76389J2445J93251K9344J5629Q116L7845J24861M7612l5352j71063J45264
$$ 676389 688834 882085 911429 927058 935174 973019 1097880 1145492 1110140 939077 1084341
11242A084341N0224j22611K8604J26880j64479k7811K63028K28619J57567M26261
$$ 1084341 1134565 1011954 1040558 1167438 1002959 975148 1238176 1466795 1624362 2050623
11232B050623K91009L23509J02541k26533j50943l42804k02783P6274J8399p8293
$$ 2050623 2341632 2665141 2767682 2541149 2390206 2047402 1844619 1920893 1939292 1860999
11222A860999j78821M1002J30671j08773j93193P1095J55490J26175j01824L80186
$$ 1860999 1682178 1723180 1853851 1745078 1551885 1622980 1778470 1904645 1802821 2183007
11212B183007L55672L09647J03993N471q9510q4848j28163k72071j72373p2308
$$ 2183007 2538679 2848326 2952319 2957790 2868280 2783432 2655269 2383198 2210825 2138517
11202B138517K6151k32371j36724q2191K8382P3113O3041k61586J83469k7586
$$ 2138517 2164668 1932297 1795573 1713382 1741764 1814877 1877918 1616332 1799801 1772215
11192A772215l72521k79807O0064M5962O9935R6108J08372j82739L8497J08130
$$ 1772215 1399694 1119887 1179951 1225913 1295848 1391956 1500328 1317589 1356086 1464216
11182A464216j45812K3332K61474K06804J98327q6595k42238J6170J64636r6508
$$ 1464216 1318404 1341736 1603210 1810014 2008341 1921746 1679508 1695678 1860314 1763806
11172A763806m6854J36457J15289K00577M22738L55208J75824j40665n4488L142
$$ 1763806 1716952 1853409 1968698 2169275 2592013 2947221 3123045 2982380 2927892 2931034
11162B931034L4110k56159k39831n5278p7775n3656l1661K0441M00933J72938
$$ 2931034 2965144 2708985 2469154 2413876 2336101 2282445 2250784 2271225 2672158 2845096
11152B845096l2472l2988K61764N70343K54847K59963K87786q1416P3696o7763
$$ 2845096 2812624 2779636 3041400 3611743 3866590 4126553 4414339 4332923 4406619 4338856
11142D338856k33321j08387j72238k84250k68979p2980J01865k01909k13411j56848
$$ 4338856 4105535 3997148 3824910 3540660 3271681 3198701 3300566 3098657 2885246 2728398
11132B728398M1564R7806J9494j07382j80483L00518M93461J18904O635M7418
$$ 2728398 2769962 2867768 2887262 2779880 2599397 2899915 3393376 3512280 3518915 3566333
11122C566333O5931R3062k18022q7160O9302J56522K43560M9425j49994j24254
$$ 3566333 3632264 3725326 3507304 3420144 3489446 3645968 3889528 3938953 3788959 3664705
11112C664705m9065R6219L5448K54772K45608J70759J35536K50969L63362R6748
$$ 3664705 3615640 3711859 3747307 4002079 4247687 4418446 4553982 4804951 5168313 5265061
11102E265061K06643K32143K72401J57910M02945L70425M04270N74406N30300
$$ 5265061 5471704 5703847 5976248 6134158 6537103 6907528 7311798 7886204 8416504
11093H416504Q23251J103623J369996J580796K120076K753074L365983L600947
$$ 8416504 9239755 10343378 11713374 13294170 15414246 18167320 21533303 25134250
11085B5134250M411565N287082O165590P016415Q225727Q567477P628421O324719
$$ 25134250 29545815 34832897 40998487 48014902 56240629 64808106 72436527 78761246
11077G8761246N064461K880911P19770L70370J305657K595404L729470M027180
$$ 78761246 83825707 86706618 87426388 87796758 89102415 91697819 95427289 99454469
11069I9454469L881064K765707m03111l696569n026379m549629l736470j553686
$$ 99454469 103335533 106101240 105698129 102001560 96975181 92425552 88689082 87135396
11061H7135396Q75687L268727M755758M742927M024142L172977K111437J155875
$$ 87135396 88011083 91279810 96035568 100778495 104802637 107975614 110087051 111242926
11053A11242926N50839K83963K016779M060659N171099O722894P483410O609818
$$ 111242926 111793765 112077728 114094507 118155166 123326265 130049159 137532569 144142387
11045A44142387M642232K216440o93602l047827l476443m012816n061646m678926
$$ 144142387 148784619 151001059 150307457 147259630 143783187 139770371 134708725 130029799
11037A30029799m209941m017008l452684k371619o66445J293815K921400L640896
$$ 130029799 125819858 121802850 118350166 115978547 115312102 116605917 119527317 123168213
11029A23168213L616852K178863L26648j399843k834252l144277k137933n78810
$$ 123168213 126785065 128963928 129290576 127890733 125056481 121912204 119774271 119195461
11021A19195461J233849K119105J606206J227903R91993m97993k074082j490263
$$ 119195461 120429310 122548415 124154621 125382524 126374517 125876524 123802442 122312179
11013A22312179m53577N2078K01372Q83016K299703L027584J452830L8556m24404
$$ 122312179 121858602 121910680 122112052 122995068 125294771 128322355 129775185 129813741 129389337
11004A29389337k464632m687724m750886l794600j994670J354731N516603Q464314
$$ 129389337 126924705 122236981 117486095 113691495 111696825 113051556 118568159 127032473
10996A27032473J0201139J1045123J0276175P619870N081158L288398P78666p32244
$$ 127032473 137233612 148278735 158554910 166174780 171255938 174544336 175323002 174590758
10988A74590758J77105J445840J304534K840812M943856N901984O019565M252143
$$ 174590758 174767863 176213703 177518237 180359049 185302905 191204889 197224454 201476597
10980B01476597J768013M20497j388017l185790k396578O06795L108070L695949
$$ 201476597 203244610 203665107 202277090 199091300 196694722 197301517 200409587 204105536
10972B04105536L376728K816916Q53732l855839n518151l919489k707042J92491
$$ 204105536 207482264 210299180 211152912 207297073 201778922 197859433 195152391 195344882
10964A95344882M034046O458396R420338J1390494J1389450J1734098J1251971
$$ 195344882 199378928 205837324 215257662 226648156 238037606 249771704 261023675
10957B61023675Q988569Q066356O550154J138175k698520m572127q518727j1626068
$$ 261023675 270012244 278078600 284628754 285766929 283068409 278496282 269977555 258351487
10949B58351487j0258038p618808m492729q49635J465304J630761R61078j223303
$$ 258351487 248093449 240474641 235981912 235132277 236597581 238228342 239189420 237966117
10941B37966117m649391o561634q562914r022041o070497k176453J618404N621532
$$ 237966117 233316726 226755092 218192178 209170137 203099640 200923187 202541591 208163123
10933B08163123R438273J0280442O823873K253081j574291m643148o369126n306430
$$ 208163123 217601396 227881838 234705711 236958792 235384501 230741353 224372227 219065797
10925B19065797j775973J245425K883443K112716j386505n399553r795728j4866139
$$ 219065797 217289824 218535249 221418692 223531408 222144903 216745350 206949622 192083483
10917A92083483j7712419j7530926j6800080j5505306j2630185j0624617r281943
$$ 192083483 174371064 156840138 140040058 124534752 111904567 101279950 91998007
10910I1998007p735655o542730n566840m630314m020005l527487k903435k377970
$$ 91998007 84262352 77719622 72152782 67522468 63502463 59974976 57071541 54693571
10902E4693571k317720k110486k013491j698775j667420j532843j650180j465828
$$ 54693571 52375851 50265365 48251874 46553099 44885679 43352836 41702656 40236828
10894D0236828j436962j493856j374212j130191j190503j170018j096721j205385
$$ 40236828 38799866 37306010 35931798 34801607 33611104 32441086 31344365 30138980
10886C0138980q87102j091018p60917n03271o64118j003846p59213n70856p21243
$$ 30138980 29251878 28160860 27399943 26896672 26232554 25228708 24469495 23898639 23177396
10877B3177396p02207m63183n53729o27780m86325m45512o04538o48576m03863
$$ 23177396 22475189 22012006 21458277 20830497 20344172 19898660 19294122 18645546 18241683
10868A8241683j92342o49029l93644l12397l37352q1322j56518l22553m24699
$$ 18241683 18049341 17400312 17006668 16694271 16356919 16275597 16119079 15796526 15371827
10859A5371827k42468n91704o84090m71270l23119N422j97628j87455o9292k86599
$$ 15371827 15129359 14537655 13853565 13382295 13059176 13064598 12866970 12679515 12610223 12323624
10849A2323624j90074k15739j73528r2392L6730R8890j41985l23330k43243k25773
$$ 12323624 12133550 11917811 11744283 11651891 11688621 11787511 11645526 11322196 11078953 10853180
10839A0853180k12514n0371j00203k1735L1539k19511j11496R1618J6659j43361
$$ 10853180 10640666 10590295 10490092 10468357 10499896 10280385 10168889 10260507 10277166 10133805
10829A0133805J02398J93211n933j5148K64355L53622P7188K35138M80249N30403
$$ 10133805 10236203 10429414 10423481 10408333 10672688 11026310 11103498 11338636 11818885 12349288
10819A2349288O63086O11623M86560O48549R42011J021169R46047J366183J835181
$$ 12349288 13012374 13623997 14110557 14759106 15701117 16722286 17668333 19034516 20869697
10810B0869697K091723K708434L528686M640376N698187O942215Q444100J0536728
$$ 20869697 22961420 25669854 29198540 33838916 39537103 46479318 54923418 65460146
10802F5460146J3435855J8000422K3776203L0060837L5296480L7562427L4274459
$$ 65460146 78896001 96896423 120672626 150733463 186029943 223592370 257866829
10795B57866829K2278409O196957q528867k1143976l1630903l3574127k6520503
$$ 257866829 280145238 286342195 277813328 256669352 225038449 191464322 164943819
10788A64943819j7249512r562776l432908J717588O484759J1957676J9005043
$$ 164943819 147694307 138131531 134698623 136416211 142900970 154858646 173863689
10781A73863689K5133883K7401890K5662698K1403043J3664245Q54129j0707003
$$ 173863689 198997572 226399462 252062160 273465203 287129448 287983577 277276574
10774B77276574j5236923j7526032k2098319k3497780k0319422j7873827j7122397
$$ 277276574 262039651 244513619 222415300 198917520 178598098 160724271 143601874
10767A43601874j6698084j4887492j2676914j0430424p909923n969076m850437
$$ 143601874 126903790 112016298 99339384 88908960 80999037 75029961 70179524
10760G0179524l883680l047896k419740k443743k016275j453466j148437m35718
$$ 70179524 66295844 63247948 60828208 58384465 56368190 54914724 53766287 53330569
10752E3330569J79817K54664j8270l8251l2478j36037L41230J061043J678663
$$ 53330569 53510386 53765050 53746780 53708529 53676051 53540014 53881244 54942287 56620950
10743E6620950K793543M382439O238447Q303554J0323186J3932761J9152866K4671275
$$ 56620950 59414493 63796932 70035379 78338933 88662119 102594880 121747746 146419021
10735A46419021K8364677L1426520L4179393L0485105J8940076P019285k096868
$$ 146419021 174783698 206210218 240389611 270874716 289814792 296834077 294737209
10728B94737209j3752447k4658441k6711484k1674962j6843599j2858552p361316
$$ 294737209 280984762 256326321 229614837 207939875 191096276 178237724 170876408
10721A70876408m19196P696243J6015637K3790720K9693778L2390361L3017219
$$ 170876408 170457212 178153455 194169092 217959812 247653590 280043951 313061170
10714C13061170L0673182K2301584J3008727Q041911K851584n396264j3794959
$$ 313061170 343734352 366035936 379044663 387086574 389938158 384541894 370746935
10707C70746935j9737786k3764331k6838055k8521960k8169483k6244117k4081885
$$ 370746935 351009149 327244818 300406763 271884803 243715320 217471203 193389318
10700A93389318k0278635j4790805r777595n334779j216919K564092O061943R442241
$$ 193389318 173110683 158319878 148542283 143207504 141990585 144554677 150616620 160058861
10692A60058861J1950571J1792559Q536148L646911j992789r072240j4673596
$$ 160058861 172009432 183801991 192338139 195985050 193992261 184920021 170246425
10685A70246425j6058669j5228850j4933621j4035178j1765997q980857o875745
$$ 170246425 154187756 138958906 124025285 109990107 98224110 89243253 82367508
10678H2367508n658735n066049m395488l445381l027188k556059j988538j743044
$$ 82367508 76708773 71642724 67247236 63801855 60774667 58218608 56230070 54487026
10670E4487026j595221j308669j203097j440726j641242j282536q70440m23217
$$ 54487026 52891805 51583136 50380039 48939313 47298071 46015535 45145095 44721878
10662D4721878k52856q9416J12710L10143M65422N72983J405578K493250L819763
$$ 44721878 44469022 44379606 44492316 44802459 45267881 45840864 47246442 49739692 53559455
10653E3559455N645027P242442R111109J0366566J0960039J1901030J3132750
$$ 53559455 59204482 66446924 75558033 85924599 96884638 108785668 121918418
10646A21918418J2592934J1107634J0474318Q482967K676089k823690n583286
$$ 121918418 134511352 145618986 156093304 164576271 167252360 164428670 158845384
10639A58845384q599763j3242925j5231534j2872314q453557m485351j086723
$$ 158845384 150245621 137002696 121771162 108898848 100445291 95959940 94873217
10632I4873217K181147N435348R562202J5353654J9969098K0289401J7430727
$$ 94873217 97054364 102489712 112051914 127405568 147374666 167664067 185094794
10625A85094794J2326770K669988j0502817j8487011k0173230k0307918j9881638
$$ 185094794 197421564 200091552 189588735 171101724 150928494 130620576 110738938
10618A10738938j6870001j2226688q659554o450025n224897n112627m903195m217919
$$ 110738938 93868937 81642249 72982695 66532670 61307773 56195146 51291951 47074032
10610D7074032l595498k864935k505466k344855j972954j488525j269683j163047
$$ 47074032 43478534 40613599 38108133 35763278 33790324 32301799 31032116 29869069
10602B9869069j164959j112733r41543q88318r43091r83351q37729r12193r57906
$$ 29869069 28704110 27591377 26649834 25761516 24818425 23835074 22997345 22085152 21127246
10593B1127246o96882n36563n72177q00939n91698o36100l91750l65288n37194
$$ 21127246 20430364 19893801 19321624 18520685 17928987 17292887 16901137 16535849 15998655
10584A5998655o00695n80697l04405k28403m52190m33021m77049l50343j43430
$$ 15998655 15397960 14817263 14512858 14284455 13832265 13399244 12922195 12571852 12428422
10575A2428422m69183m35791j51431k64860k69389m14268m42252k63025k72797
$$ 12428422 11959239 11523448 11372017 11107157 10837768 10423500 9981248 9718223 9445426
10566I445426j37481j20469r3572k27545n37887l48470L3536j52410k52431k75486
$$ 9445426 9307945 9187476 9093904 8866359 8328472 7980002 8013538 7861128 7608697 7333211
10556G333211p4471r383L8578J54949q9175m06539l19940j76276M4609m8203j76853
$$ 7333211 7258740 7249357 7287935 7442884 7353709 6947170 6627230 6450954 6495563 6447360 6270507
10545F270507q8895p5270k79605k62411O3753O5331K9904k51982J7407j9902p8884
$$ 6270507 6181612 6106342 5826737 5564326 5628079 5693410 5723314 5471332 5488739 5468837 5389953
10534E389953j91280k75576r4528J9337j27613K52715R4593J26249r1386o347
$$ 5389953 5198673 4923097 4828569 4847906 4720293 4973008 5067601 5193850 5102464 5096117
10524E096117j35321p2846j02301j97781n2345Q5767J44281J69742R8951j62611
$$ 5096117 4960796 4887950 4785649 4587868 4535523 4621290 4765571 4935313 5034264 4871653
10514D871653j48151R0378r2624j38474j02075m980k874j29250l48169N9915K02811
$$ 4871653 4723502 4813880 4721256 4582782 4480707 4475727 4472853 4343603 3995434 4055349 4258160
10503D258160K673J38399K1819r2801K0916j1118p7100k06886k48815J14172O0454
$$ 4258160 4260833 4399232 4421051 4328250 4349166 4338048 4260948 4054062 3805247 3919419 3979873
10492C979873p0670k05957q1918J84764l5573K5852N2553k196l7639l2465m0454
$$ 3979873 3909203 3703246 3621328 3806092 3770519 3796371 3848924 3846728 3809089 3776624 3736170
10481C736170p4520l1718j5175J05451Q2734K30081M559k39866l0792j04556k68452
$$ 3736170 3661650 3629932 3614757 3720208 3802942 4033023 4037582 3797716 3766924 3662368 3393916
10470C393916p6687k52963k59691l0696J55207q8945o5123j29016J27765q2225
$$ 3393916 3317229 3064266 2804575 2773879 2929086 2840141 2775018 2646002 2773767 2691542
10460B691542k71709n075J20638k36500j93043n0597Q4293o5738r8563k4777Q6035
$$ 2691542 2419833 2414758 2535396 2298896 2105853 2055256 2139549 2073811 1975248 1950471 2036506
10449B036506M6065j2738o1330o4638r0975r3539q154J70897J3931M6106m0458
$$ 2036506 2082571 2069833 2008503 1943865 1852890 1759351 1751197 1922094 1936025 1982131 1941673
10438A941673M3638L4816p9718R7716J85242J04503J27456O6598O0672q3433n5539
$$ 1941673 1985311 2020127 1940409 2038125 2223367 2327870 2455326 2521924 2582596 2499163 2443624
10427B443624M7025J05662L2892p4076m9472o1116J9369J73595J5206Q3432J96955
$$ 2443624 2490649 2596311 2629203 2555127 2505655 2444539 2463908 2637503 2652709 2736141 2933096
10416B933096p8024j48775j23664m3887J4746k46407j57778N1622L1438j31868
$$ 2933096 2855072 2706297 2582633 2538746 2553492 2307085 2149307 2200929 2232367 2100499
10406B100499m3135R5096Q3277J2739Q8145J97656j14617j7359M218j26312k74388
$$ 2100499 2057364 2152460 2235737 2248476 2336621 2534277 2419660 2402301 2406519 2280207 2005819
10395B005819J00466K59152O8551o4768j94724j20183j05943k89315Q9512K06246
$$ 2005819 2106285 2365437 2433988 2369220 2174496 2054313 1948370 1659055 1748567 1954813
10385A954813m1299R2281J93682J78655l3596O2397j71399k49925o6358k22283
$$ 1954813 1913514 2005795 2199477 2378132 2344536 2406933 2235534 1985609 1919251 1696968
10375A696968K0627K42983l1393o9712o1252O3971K38900j25747l04376j80019
$$ 1696968 1717595 1960578 1929185 1859473 1798221 1862192 2101092 1975345 1670969 1490950
10365A490950l2788J26118J75824J85589L4706n863K12127J41688K50699K55687
$$ 1490950 1458162 1584280 1760104 1945693 1980399 1974536 2186663 2328351 2579050 2834737
10355B834737M59039q566k598Q0271k26744j86359k67806j64024n0494k19125
$$ 2834737 3293776 3285210 3282612 3362883 3136139 2949780 2681974 2517950 2467456 2248331
10345B248331k42487n4127L8056l0380J48342K62123J19439J14443L43657O88
$$ 2248331 2005844 1951717 1989773 1959393 2107735 2369858 2489297 2603740 2947397 2948085
10335B948085J14665p9398k88480k24762j57726K226k03415l06151K4740j29747
$$ 2948085 3062750 2983352 2694872 2470110 2312384 2314610 2111195 1805044 1829784 1700037
10325A700037j92577M6880o6741k00370l8425o3818j0377N5780K02773J54594
$$ 1700037 1507460 1554340 1487599 1287229 1248804 1184986 1174609 1230389 1433162 1587756
10315A587756O5830n0456j57997j46265J3387l5403m2112L5563n6148p3730q9025
$$ 1587756 1653586 1603130 1445133 1298868 1312255 1276852 1234740 1270303 1214155 1140425 1051400
10304A051400j07760p8196J70539J16775k37520J10620K93421K62305Q9877J59042
$$ 1051400 943640 865444 1035983 1152758 915238 1025858 1319279 1581584 1671461 1830503
10294A830503K00194L1854J23491K13576R7667Q1501K03925j76942k22735k30535
$$ 1830503 2030697 2062551 2186042 2399618 2497285 2578786 2782711 2605769 2383034 2152499
10284B152499j19584O704j87354r4056J57461j6714o1911J69969K07029J58391
$$ 2152499 2032915 2039619 1852265 1758209 1915670 1898956 1837045 2007014 2214043 2372434
10274B372434K54303J77998L62482K40782K9134J59770p0538j97038j50969J22548
$$ 2372434 2626737 2804735 3167217 3407999 3437133 3596903 3526365 3329327 3178358 3300906
10264C300906j61309m03479l28161j86788q1081q3158o9153L7833m3408k2816
$$ 3300906 3139597 2736118 2407957 2221169 2140088 2056930 1987777 2025610 1982202 1959386
10254A959386L1080K90763K36152K396L3432j00945j5126N4410j90p4049k21166
$$ 1959386 1990466 2281229 2517381 2519777 2553209 2452264 2437138 2491548 2491358 2417309 2196143
10243B196143m9863l7516k1395J4402P268j15611l50627r3172l0470k1282J05442
$$ 2196143 2146280 2108764 2087369 2101771 2109039 1993428 1642801 1549629 1519159 1497877 1603319
10232A603319K32516K05869J15095K73803R2312k73261j80559j17685j5047p1244
$$ 1603319 1835835 2041704 2156799 2430602 2522914 2249653 2069094 1951409 1936362 1865118
10222A865118J35559R2863k4213l60339j43873P6997J48877n4341k50709O2629
$$ 1865118 2000677 2093540 2069327 1708988 1565115 1642112 1790989 1736648 1485939 1548568
10212A548568J56790k3265J04075O10362L29501j17350P5356k2240J92286K91323
$$ 1548568 1705358 1682093 1786168 2396530 2726031 2608681 2684037 2661797 2854083 3145406
10202C145406N7628l54865j73520K41292R5217k07353j64317j3479J03699J26975
$$ 3145406 3203034 2848169 2674649 2915941 3011158 2803805 2639488 2626009 2729708 2856683
10192B856683N1162j30418L5497J10782J68775J12314J10846M4792J31560J27557
$$ 2856683 2907845 2777427 2812924 2923706 3092481 3204795 3315641 3360433 3491993 3619550
10182C619550m1983j54312j92656j49755j66256j00607k04285M714P36J5306l4304
$$ 3619550 3577567 3423255 3230599 3080844 2914588 2813981 2609696 2614410 2615146 2630452 2596148
10171B596148J58071J49250R3173P1279J89283J53363p2458k05788j3467R1587
$$ 2596148 2754219 2903469 2996642 3067921 3257204 3410567 3338109 3132321 3118854 3210441
10161C210441l9093N034J13278K69650K00091Q6301j48634P4740J22480J14861
$$ 3210441 3171348 3176382 3289660 3559310 3759401 3845702 3697068 3771808 3894288 4009149
10151D009149J98688K15958P8329o9315L19392K29776L31972M57918L23285L93165
$$ 4009149 4207837 4423795 4502124 4432809 4752201 4981977 5313949 5771867 6095152 6488317
10141F488317J13590L38296N14014M77188N89770P83688J003148J104777J599452
$$ 6488317 6601907 6940203 7454217 7931405 8521175 9304863 10308011 11412788 13012240
10132A3012240J923581K143898K248235K597354L060579M272822O475381R058629
$$ 13012240 14935821 17079719 19327954 21925308 24985887 29258709 35734090 44792719
10124D4792719J0636174J1487487J0746905P808039M391637K095920K57433l93935
$$ 44792719 55428893 66916380 77663285 85471324 89862961 91958881 92216314 91822379
10116I1822379J75418j47697j954083m517263o168686n272487l269198p4732L178077
$$ 91822379 91997797 91850100 89896017 85378754 79210068 73937581 70668383 70593651 73771728
10107G3771728N787367Q687967J1106255J3070744J4050944J3519840J2596564
$$ 73771728 79559095 88247062 99353317 112424061 126475005 139994845 152591409
10100A52591409J1146962Q062562M346841J334271j067987m247629p071450p294879
$$ 152591409 163738371 171800933 176147774 177482045 176414058 172166429 165094979 157800100
10092A57800100o813213p663375r040130q524974n112309j036493K903422O734237
$$ 157800100 150986887 143323512 134283382 125758408 120646099 119609606 122513028 129247265
10084A29247265R989633J2048257J2042287J0331900P082083L616154J887002
$$ 129247265 139236898 151285155 163327442 173659342 180741425 184357579 186244581
10077A86244581j79931k125944k884213l146475m757984p871965j0921514j0566171
$$ 186244581 186064650 183938706 181054493 177908018 173150034 165278069 154356555 143790384
10069A43790384o813306l042948l90406K059556M677959N828316O020514O080035
$$ 143790384 136977078 133934130 133543724 135603280 140281239 146109555 152130069 158210104
10061A58210104O183317N195856K482348J94971j179792k499067l598104m191503
$$ 158210104 164393421 169589277 172071625 172266596 171086804 168587737 164989633 160798130
10053A60798130m725992n704972o571704o173565n286773m173063j001970L631869
$$ 160798130 156072138 150367166 143795462 137621897 132335124 128162061 127160091 130791960
10045A30791960P240482R462601J0343136J0543670R326515O845321N994513N718765
$$ 130791960 138032442 147495043 157838179 168381849 177708364 184553685 190548198 196266963
10037A96266963L782472J046412j815844l940453n621355o853302p499533q300370
$$ 196266963 200049435 201095847 199280003 195339550 189718195 182864893 175365360 167064990
10029A67064990r012086p754013m501006N48018M767084P123975R428375J1080228
$$ 167064990 158052904 150298891 145797885 146345903 151112987 158236962 167665337 178745565
10021A78745565J0248847Q783919Q352768P333902N079100L323879J619601m95501
$$ 178745565 188994412 197778331 206131099 213465001 218544101 221867980 223487581 222992080
10013B22992080k996675n507292p194585q291374q561201o874821l979092j925708
$$ 222992080 219995405 214488113 207293528 199002154 190440953 183566132 179587040 177661332
10005A77661332L61156N125884J0447338J2236671J0683883Q870605O780879L532445
$$ 177661332 178022488 183148372 193595710 205832381 216516264 225386869 232167748 235700193
9997B35700193J204488J010441R81560j828883p416707j1984504j3347719j3371533
$$ 235700193 236904681 237915122 238896682 237067799 229651092 217666588 204318869 190947336
9989A90947336j1727349r319236o165065j732285K927388O986393R102859R802328
$$ 190947336 179219987 169900751 163735686 162003401 164930789 171917182 181020041 190822369
9981A90822369J0538729J0878324Q806099N872161L750034J554776l009301q158894
$$ 190822369 201361098 212239422 221045521 226917682 230667716 232222492 229213191 221054297
9973B21054297j0759539j1827490j4186636j6044173j5513516j3683998j1405126
$$ 221054297 210294758 198467268 184280632 168236459 152722943 139038945 127633819
9966A27633819q520683m973802j495086J532153L683298M875513M187425L122553
$$ 127633819 119113136 114139334 112644248 114176401 117859699 122735212 126922637 130045190
9958A30045190J989622N73190m31861q87686r78350k585978n604894r261819j1719283
$$ 130045190 132034812 132608002 132176141 131288455 130310105 127724127 122119233 112857414 101138131
9949A01138131j2388378j1133121q628416o455547m661586l818058l209442k626250
$$ 101138131 88749753 77616632 68988216 62532669 57871083 54053025 50843583 48217333
9941D8217333k668250k773686k505744j994062j667271j734061j579242j278527
$$ 48217333 45549083 42775397 40269653 38275591 36608320 34874259 33295017 32016490
9933C2016490j120052j259660j159470r17524p86097r60710q36367r22420p96505
$$ 32016490 30896438 29636778 28477308 27559784 26773687 25812977 24976610 24054190 23257685
9924B3257685q85022p33989n23540q40192r00418m70657m19713o17909n53357
$$ 23257685 22372663 21638674 21115134 20274942 19374524 18903867 18484154 17866245 17312888
9915A7312888n60580l71637l37978k66908m69324o68523m87729m37602m92631
$$ 17312888 16752308 16380671 16042693 15775785 15306461 14637938 14150209 13712607 13219976
9906A3219976m61028j62308l07206l57906l50433l77893n16767l85504m63111
$$ 13219976 12758948 12596640 12289434 11931528 11581095 11203202 10686435 10300931 9837820
9897I837820j60910k50392l64642j17219Q3640k43523n2157j84314l12065k09213
$$ 9837820 9676910 9426518 9061876 8944657 9028297 8784774 8732617 8548303 8236238 8027025
9887H027025k94266k06531n4872o9971k30727l17741m17711k17386j17259j86002
$$ 8027025 7732759 7526228 7471356 7401385 7170658 6852917 6435206 6217820 6100561 5914559
9877E914559j64565r0731p714N8080Q2172k07813j76239k03227l19860m59231
$$ 5914559 5749994 5659263 5651549 5709629 5791801 5583988 5407749 5204522 4884662 4425431
9867D425431k22874j00866m2605k3027n4420J25722k00556j78284j29609k52196
$$ 4425431 4202557 4101691 4059086 4036059 3981639 4107361 3906805 3728521 3598912 3346716
9857C346716K03324j9825j16286n5912j8131j66008j49918J7102j86076k0603
$$ 3346716 3550040 3530215 3413929 3358017 3339886 3173878 3023960 3041062 2854986 2834383
9847B834383k1343J25038n3380P6977N1816k2068k46484k03554p9336J10972r4818
$$ 2834383 2813040 2938078 2884698 2961675 3013491 2991423 2744939 2541385 2462049 2573021 2478203
9836B478203k6414j7509j16554k08499j97875J98332J23348K6950o0980j59708
$$ 2478203 2451789 2434280 2317726 2109227 1911352 2109684 2233032 2259982 2199002 2039294
9826B039294k66995J14758K53027n903j03635K48883M13641K18637J46564K0623
$$ 2039294 1772299 1887057 2140084 2134181 2030546 2279429 2693070 2911707 3058271 3078894
9816C078894j91289j98563k1690j08206k24072j696q580q9864j48142q6098r6376
$$ 3078894 2887605 2689042 2667352 2559146 2335074 2333378 2324798 2234934 2086792 2000694 1904318
9805A904318j58121K9488q5971L0476k0426L0539K30357J71177M1839k9844L10801
$$ 1904318 1746197 1775685 1689714 1720190 1699764 1730303 1960660 2131837 2173676 2143832 2454633
9794B454633J06989r7188k63694k64854k72193n7278J65949j32338k44935n9278
$$ 2454633 2561622 2464434 2200740 1935886 1663693 1606415 1772364 1640026 1395091 1335813
9784A335813L08842J16657K118Q8853K7082n3795l3633n5830K1833j36221o8729
$$ 1335813 1644655 1761312 1763430 1852283 1879365 1825570 1791937 1736107 1757940 1621719 1552990
9773A552990j0485J33409J40162K4856J41133j18207j50301j81415q7454J49489
$$ 1552990 1542505 1675914 1816076 1840932 1982065 1863858 1713557 1532142 1444688 1594177
9763A594177K42208K39725M3346Q8447J11686k5378O8679J36561j6403j25286
$$ 1594177 1836385 2076110 2119456 2207903 2319589 2294211 2362890 2499451 2483048 2357762
9753B357762L4993K6335j55311Q783j12921k99964l105K31227O6856j44304j89144
$$ 2357762 2392755 2419090 2263779 2272562 2159641 1859677 1856572 2087799 2154655 2010351 1821207
9742A821207O9247p184J2150J74010J99128N89908K88495j17n3745Q2522j77824
$$ 1821207 1890454 1883270 1895420 2069430 2268558 2858466 3146961 3146844 3093099 3175621 2997797
9731B997797j31217r3799l15290l73842j22847j10758O7636R8104L6607N0045
$$ 2997797 2866580 2772781 2457491 2083649 1960802 1850044 1917680 2015784 2052391 2102436
9721B102436j94322m855M7745L5551J55963m963k17713m7735K14551N3499p9595
$$ 2102436 1908114 1903259 1951004 1986555 2142518 2137555 1919842 1872107 2086658 2140157 2060562
9710B060562k1953L6399k8030r9579j8854q5524N282J21591K783O67J18716l017
$$ 2060562 2038609 2075008 2046978 1947399 1928545 1843021 1848303 1969894 1972677 1973344 2092060 2089043
9698B089043P9600J60033P8998J98980R9747k7688R2168R2539j27697k93670r2740
$$ 2089043 2168643 2328676 2407674 2606654 2706401 2678713 2770881 2863420 2735723 2442053 2349313
9687B349313m7692j54259R4239j30951k74004K31281L17713Q454k1831J33757
$$ 2349313 2301621 2147362 2241601 2110650 1836646 2067927 2385640 2394094 2372263 2506020
9677B506020K52367L72451K42653Q1685M7126M2241K5604l3406k54242j02957
$$ 2506020 2758387 3130838 3373491 3455176 3502302 3544543 3570147 3536741 3282499 3179542
9667C179542p3872J23692k6699j79782l39767k83602M3826M4549K9300q1871K9621
$$ 3179542 3105670 3229362 3202663 3022881 2683114 2399512 2443338 2487887 2517187 2435316 2464937
9656B464937L98863K08185r8483j85110p2897n9606j48120J22650j72655j55300
$$ 2464937 2863800 3071985 2973502 2788392 2715495 2655889 2507769 2630419 2457764 2302464
9646B302464J15842q2280k9567p281k18264j62461m2918j36213J23486M32654
$$ 2302464 2418306 2336026 2306459 2299178 2080914 1918453 1875535 1739322 1862808 2295462
9636B295462J99832k01759k98011j00727k43248N6639K64928L889k598r6668J40486
$$ 2295462 2495294 2293535 1995524 1894797 1651549 1708188 1973116 1977005 1974407 1877739 2018225
9625B018225J07385L4376K7647j97318k32728J0201J6475J34955K26900M5341
$$ 2018225 2125610 2159986 2187633 1990315 1757587 1767788 1784263 1919218 2146118 2191459
9615B191459p3490J23712P9282N4117O9420n9709K1907J50074J58530N0757r4577
$$ 2191459 2117969 2241681 2320963 2375080 2444500 2384791 2406698 2556772 2715302 2766059 2671482
9604B671482j32738o2646r6852Q0460j7557j08458k04469J52325J29539K25855
$$ 2671482 2538744 2476098 2379246 2459706 2442149 2333691 2129222 2281547 2411086 2636941
9594B636941J88444r6618r3410O5732N5153K3501O9752r267n0607k16384j68974
$$ 2636941 2825385 2728767 2635357 2701089 2756242 2779743 2849495 2840228 2789621 2573237 2404263
9583B404263K0074P6481k27186n4826J7176j25448o9540O657r4056Q6402j10082
$$ 2404263 2424337 2500818 2273632 2218806 2235982 2110534 2040994 2047651 1953595 2039997 1929915
9572A929915j9552M9455p3798O1104K54499k690l8963j9753l5729R4248r957L239
$$ 1929915 1910363 1959818 1886020 1947124 2201623 2198933 2159970 2140217 2104488 2198736 2188779 2192018
9560B192018k02701j06216P7471J27642Q0521j15786o8245j78428k14372m9515
$$ 2192018 1989317 1883101 1960572 2088214 2168735 2052949 1984704 1806276 1591904 1542389
9550A542389k38414J87652Q019K7175j26910J21675N9563J21873K76676N4328
$$ 1542389 1303975 1491627 1499646 1526821 1399911 1521586 1581149 1703022 1979698 2034026
9540B034026j11993l6009j22779l4070N3353k13152k55714k59224J10716J34411
$$ 2034026 1922033 1886024 1763245 1729175 1782528 1569376 1313662 1054438 1165154 1299565
9530A299565N4509K61490K98872j58889j87208q121j1975j09982J21672J49519
$$ 1299565 1354074 1615564 1914436 1755547 1568339 1560218 1548243 1438261 1559933 1709452
9520A709452O0928K4421J90405R2736l37321m4408J37798m3998j75769Q3451j25100
$$ 1709452 1770380 1794801 1985206 2077942 1740621 1696213 1834011 1790013 1614244 1697695 1572595
9509A572595j36062J66643q1553j6871K09073P2315r6571N0361P8537k46384l60078
$$ 1572595 1436533 1603176 1521623 1504752 1713825 1786140 1689569 1739930 1818467 1572083 1212005
9498A212005k0297J38350K96985K20798r4397n3013J22331j9287J6425P6753J52077
$$ 1212005 1191708 1330058 1627043 1847841 1753444 1700431 1822762 1803475 1819900 1896653 2048730
9487B048730O5864k96133q5294l5384P0172J32852r1652K5752J90928Q4136j07256
$$ 2048730 2114594 1818461 1733167 1697783 1767955 1900807 1809155 1834907 2025835 2109971 2002715
9476B002715M6818L0300R1612R2064K5667k8600m8705j20432j00898L4790O4809
$$ 2002715 2049533 2079833 2171445 2263509 2289176 2260576 2211871 2091439 1990541 2025331 2090140
9465B090140N1434J48870K7500r1481J20885J69480J73792j54987K34604L67866
$$ 2090140 2141574 2290444 2317944 2226463 2347348 2516828 2690620 2535633 2770237 3138103
9455C138103M00118J39714R171l9495j23386j86188O399M6053J03455Q0105K3060
$$ 3138103 3538221 3677935 3687106 3647611 3524225 3338037 3344436 3390489 3493944 3574049 3597109
9444C597109O7752L44039K01796K62947J91351J36183K35470L74978R4405L75178
$$ 3597109 3664861 4008900 4210696 4473643 4664994 4801177 5036647 5411625 5506030 5881208
9434E881208O26044O79415N65194M26256M96419O51731R07258R91410J213552
$$ 5881208 6507252 7186667 7751861 8178117 8674536 9326267 10233525 11224935 12438487
9425A2438487J447275J719625K223007K867290L333915M341197N693484P409362
$$ 12438487 13885762 15605387 17828394 20695684 24029599 28370796 34064280 41473642
9417D1473642R368633J1850954J4451807J6262851J6718830J5284375J0870991
$$ 41473642 50842275 62693229 77145036 93407887 110126717 125411092 136282083
9410A36282083M003563l561050j1089696j6433674j7539039j5194966j1727593
$$ 136282083 140285646 136724596 125634900 109201226 91662187 76467221 64739628
9403F4739628p949529m545218k327072o70413J152765L033032M944147O875367
$$ 64739628 56790099 52244881 49917809 49247396 50400161 53433193 58377340 65252707
9395F5252707R304524J1793021J3969429J4576193J3899997J0899241M911009
$$ 65252707 74557231 86350252 100319681 114895874 128795871 139695112 144606121
9388A44606121k995135j0125339j4158058j5583673j4846819j2119620j0028188
$$ 144606121 141610986 131485647 117327589 101743916 86897097 74777477 64749289
9381F4749289q118696o220939m603235l216954k383744j578376j283535r47624
$$ 64749289 56630593 50409654 45806419 42589465 40205721 38627345 37343810 36396186
9373C6396186n21751l793J52641L28980L15435P02309J012635J020932J110845
$$ 36396186 35874435 35870642 36023283 36352263 36667698 37370007 38382642 39403574 40514419
9364D0514419J962920K763922L774146N295831O780888R085551J1567283J4485697
$$ 40514419 42477339 45241261 49015407 54311238 61092126 70177677 81744960 96230657
9356I6230657J7777997K0358756K2061698K1611141J8803633J4691442R537403
$$ 96230657 114008654 134367410 156429108 178040249 196843882 211535324 221072727
9349B21072727K494237m364487q325585j0443164j2087072j3691197j3756482
$$ 221072727 223566964 219202477 210876892 200433728 188346656 174655459 160898977
9342A60898977j2242133r616856p054110l526977K116280P828490J3533453J8996379
$$ 160898977 148656844 139039988 131985878 128458901 130575181 138403671 151937124 170933503
9334A70933503K3892972K8052796L0129553K9528228K5947835J8684093Q215517
$$ 170933503 194826475 222879271 253008824 282537052 308484887 327168980 335384497
9327C35384497k820264j2515357k2345553l0383529l2878204l1309903k7395805
$$ 335384497 332564233 320048876 297703323 267319794 234441590 203131687 175735882
9320A75735882k1602952j5683006j1267206q175403n504798k058357J415818M172353
$$ 175735882 154132930 138449924 127182718 119007315 113502517 111444160 112859978 117032331
9312A17032331P088680R124347J0085932Q565182N347494J448317l127078q378656
$$ 117032331 124121011 133245358 143331290 151896472 157243966 158692283 155565205 147186549
9304A47186549j2288614j3400699j2097943r823476p055743m418010k581816q72426
$$ 147186549 134897935 121497236 109399293 99575817 92520074 88102064 85520248 84647822
9296H4647822Q96834L123710N801429Q847997J1614001J3641170J3172933J0192388
$$ 84647822 85544656 88668366 94469795 103317792 114931793 128572963 141745896 151938284
9288A51938284N780708J051384m077884q810938j1014869j0617777r309200q088927
$$ 151938284 157718992 158770376 154692492 145881554 134866685 124248908 114939708 106850781
9280A06850781o014521j940456K031828N191107Q897472J2800110J6935383K0874463
$$ 106850781 100836260 98895804 100927632 106118739 115016211 127816321 144751704 165626167
9272A65626167K5447886K9472560K9947975K5892368J9402421J0700204j157006
$$ 165626167 191074053 220546613 250494588 276386956 295789377 306489581 305332575
9265C05332575j2356295k0187232k4722592k6384487k4717557k1191707j7418791
$$ 305332575 292976280 272789048 248066456 221681969 196964412 175772705 158353914
9258A58353914j3513069r006293n082776j259879K725221O395437R766726J1904451
$$ 158353914 144840845 135834552 130751776 129491897 132217118 138612555 148379281 160283732
9250A60283732J1590308J0734086R578993P205883L517943r56708n308659q855341
$$ 160283732 171874040 182608126 192187119 199393002 202910945 201954237 196645578 187790237
9242A87790237j2232573j5851910j7707950j7209777j5478711j3023000j0144287
$$ 187790237 175557664 159705754 141997804 124788027 109309316 96286316 86142029
9235H6142029p774585n717968m381472l779501l108489k998841k545541k070931
$$ 86142029 78367444 72649476 68268004 64488503 61380014 58381173 55835632 53764701
9227E3764701j607349j403287j456939j484760j167347r82373n96912j43742L67861
$$ 53764701 52157352 50754065 49297126 47812366 46645019 45662646 45065734 44921992 45289853
9218D5289853O24597J255051J853970K650866L799107N615644P504447R382991
$$ 45289853 45914450 47169501 49023471 51674337 55473444 61089088 68593535 77976526
9210G7976526J1597485J3286537J4042593J3655113J2159527R152699O349535
$$ 77976526 89574011 102860548 116903141 130558254 142717781 151870480 158220015
9203A58220015L366329K25326k435166n245312q555192j1907905j4141325j3844864
$$ 158220015 161586344 161811670 159376504 154131192 145576000 133668095 119526770 105681906
9195A05681906j1004229q027067n269871k662256O61937M211040P257569R601857
$$ 105681906 94677677 86650610 81380739 78718483 79380420 83591460 90849029 100450886
9187A00450886J0796144R210996N394176M23712n106348j0218040j2835415j2638247
$$ 100450886 111247030 120458026 125852202 126275914 121169566 110951526 98116111 85477864
9179H5477864j1467295r489830p276763n607606m215252l527600k706113k276361
$$ 85477864 74010569 64520739 57243976 51636370 47421118 43893518 41187405 38911044
9171C8911044k325850k251272j993337j825778j417762j206890j135422j163860
$$ 38911044 36585194 34333922 32340585 30514807 29097045 27890155 26754733 25590873
9163B5590873j004968q44245q74938q04512q17238r93297o71181o30253n02748
$$ 25590873 24585905 23741660 22866722 22062210 21244972 20251675 19580494 18950241 18447493
9154A8447493o14182n51365l61304m29862k00462l94043m82817l44897l73841
$$ 18447493 17833311 17281946 16920642 16490780 16290318 15896275 15413458 15068561 14694720
9145A4694720m39069m97723m57919m08734m94199k23672l04069l7029k16223k76193
$$ 14694720 14255651 13757928 13300009 12891275 12397076 12173404 11869335 11832306 11616083 11339890
9135A1339890j99263j15767o0665j36865k43592n26336k52528J8973k183j3423
$$ 11339890 11140627 11024860 10964195 10827330 10583738 10057402 9804874 9823847 9821664 9808241
9125I808241j41706l04228l68417m01716l44794o75k63660p6104j25724K3125
$$ 9808241 9666535 9362307 8993890 8592174 8247380 8246705 7983045 7906941 7781217 7804342
9115G804342j7103n6417K4516p4812k66921j87881J68590j6760o9397L6726j74460
$$ 7804342 7787239 7730822 7755338 7680526 7413605 7225724 7394314 7377554 7308157 7344883 7170423
9104G170423K6197k8079o4638J19523R0809J8498k69120j31585L8085j09663J8198
$$ 7170423 7196620 7168541 7103903 7223426 7314235 7332733 7063613 6932028 6970113 6860450 6878648
9093F878648k301J19011J92166P5161j07384p647K36428L02825K59734M01614
$$ 6878648 6876347 6995358 7187524 7262685 7155301 7147654 7384082 7686907 7946641 8348255
9083H348255K69387L29960L86396K65867J52002K73580N27115L71044N22835N96593
$$ 8348255 8617642 8947602 9333998 9599865 9751867 10025447 10552562 10923606 11446441 12043034
9073A2043034M98066O61192O39082Q31344J064637J352468J450699J436482J775190
$$ 12043034 12541100 13202292 13841374 14672718 15737355 17089823 18540522 19977004 21752194
9064B1752194K123426K488684K799811L528736M104932N087074O460655Q022983
$$ 21752194 23875620 26364304 29164115 32692851 36797783 41884857 48345512 56368495
9056E6368495J0060063J2807752J6550799K1177305K7412602L5569335M4187291
$$ 56368495 66428558 79236310 95787109 116964414 144377016 179946351 224133642
9049B24133642N0246599N0471192M2936902K8230128Q446588j3174098l0857186
$$ 224133642 274380241 324851433 367788335 396018463 404465051 391290953 360433767
9042C60433767l8882215l7933831l2433744k6030132k0536276j6057733j2169097
$$ 360433767 321551552 283617721 251183977 225153845 204617569 188559836 176390739
9035A76390739r093410o606576l890728j747549J67189K431871M932432P745733
$$ 176390739 167297329 160690753 156800025 155052476 155219665 157651536 162583968 170329701
9027A70329701J1033969J5141608K0415223K6538138L3246742L8929710M0379671
$$ 170329701 181363670 196505278 216920501 243458639 276705381 315635091 356014762
9020C56014762L5091882K2385427M508862j5540693l4300678m5885137m7563893
$$ 356014762 391106644 413492071 418000933 402460240 368159562 322274425 274710532
9013B74710532m1978198l4416322k6804787k0963772j6847851j3635390j1106551
$$ 274710532 232732334 198316012 171511225 150547453 133699602 120064212 108957661
9006A08957661r189960p746831o781359n720731n028819m479961l747880l354324
$$ 108957661 99767701 92020870 85239511 79518780 74489961 70010000 66262120 62907796
8998F2907796l188045k844684k801108k881335k526160j972118j707960j788205
$$ 62907796 59719751 56875067 54073959 51192624 48666464 46694346 44986386 43198181
8990D3198181j802683j550518j354802j235992j278338j282319j352201j173094
$$ 43198181 41395498 39844980 38490178 37254186 35975848 34693529 33341328 32168234
8982C2168234q52937o61595p64369o81112r11743j007300r36343r24093j159921
$$ 32168234 31315297 30653702 29889333 29208221 28296478 27289178 26352835 25428742 24268821
8973B4268821r26339p43896q22784n14277n10217n76988p89411o42011o51820
$$ 24268821 23342482 22598586 21775802 21261525 20751308 20174320 19384909 18742898 18091078
8964A8091078l86209k54523l65293n54206o35029o80025m94498l66935l64932
$$ 18091078 17704869 17450346 17085053 16530847 15895818 15215793 14721295 14354360 13989428
8955A3989428n35485j57125k53820k29562l89177m34217j86486p6954k57900k10096
$$ 13989428 13453943 13296818 13042998 12813436 12424259 11990042 11803556 11726602 11468702 11258606
8945A1258606m37282j8784R6559j84036k17206q5386j33697k99429l56203k02218
$$ 11258606 10821324 10802540 10899099 10715063 10497857 10412471 10278774 9979345 9623142 9420924
8935I420924k20903k47455m03176k49548k82904k48796l85549k18184o5072l17475
$$ 9420924 9200021 8952566 8549390 8299842 8016938 7768142 7382593 7164409 7099337 6781862
8925F781862l12020k14553r8450j21039L4321j4065j54606R1876Q4525k53379
$$ 6781862 6469842 6255289 6156839 6035800 6070121 6056056 5901450 5993326 6077851 5824472
8915E824472l05635j81581k44563l15913k34763k71679k65331p6100r5466j61299
$$ 5824472 5518837 5337256 5092693 4776780 4542017 4270338 4005007 3928907 3833441 3672142
8905C672142p2742q9787k16052j61924J39217M2035J20877L2113k41197j05102
$$ 3672142 3599400 3509613 3293561 3131637 3270854 3312889 3433766 3465879 3224682 3119580
8895C119580J0626k90682l33603k42409l60267j23186P9888M4224P7157j24042
$$ 3119580 3130206 2839524 2505921 2263512 1903245 1780059 1859947 1904171 1981328 1857286
8885A857286o324J20220j9453J37516K76530O2676r0014j6831M7312P1375l932
$$ 1857286 1850962 1971182 1951729 2089245 2365775 2428451 2338437 2321606 2368918 2440293 2436361
8874B436361k47604k15684o7772j44272l29375r485R0941P7268K10503j14414
$$ 2436361 2188757 1973073 1905301 1761029 1431654 1422169 1513110 1590378 1800881 1686467
8864A686467p534K06024J19241K51936J24145J07626J13047L72753N2222j8965
$$ 1686467 1678933 1884957 2004198 2256134 2380279 2487905 2600952 2973705 3025927 3006962
8854C006962j08901l62414j71133K133M4852n9891m31609k63791m3312j59646
$$ 3006962 2898061 2535647 2364514 2366647 2411499 2351608 1919999 1656208 1612896 1453250
8844A453250j27707K39397N5910R817J19453K7685K22324J15262J0972k4953Q2599
$$ 1453250 1325543 1564940 1620850 1630667 1750120 1777805 2000129 2115391 2126363 2101410 2184009
8833B184009j65227j67821P8779l2466l0770k9081k30788l62268Q4096K0787q7341
$$ 2184009 2018782 1850961 1929740 1897274 1866504 1837423 1606635 1244367 1328463 1349250 1261909
8822A261909k28583n0045k62494j32269N3658J55837J73723K36672j34568k2969
$$ 1261909 1033326 983281 720787 588518 642176 798013 971736 1208408 1073840 1050871
8812A050871L0786L4064L8851j33329J29511J36932j71794j50900j13771J10253
$$ 1050871 1081657 1115721 1154572 1021243 1150754 1287686 1115892 964992 851221 961474
8802I61474J56244J26381m8603j51910K31115L31007J35968M2331j00217n2159
$$ 961474 1117718 1244099 1195496 1043586 1274701 1605708 1741676 1784007 1683790 1631631
8792A631631p6209j79863l9993k38264k06790L9259R0783N7441M2444Q4121K51660
$$ 1631631 1555422 1375559 1335566 1097302 890512 929771 1020554 1077995 1120439 1204560 1456220
8781A456220J3459j95591k6235j89786j31685L51385l7526O4702m1733k91682
$$ 1456220 1469679 1274088 1247853 1058067 926382 1277767 1240241 1304943 1263210 971528
8771I71528j30404M2146n8594K37970q5297j12719p8187m4377N6835j48976j70676
$$ 971528 841124 883270 824676 1062646 977349 864630 786443 742066 798901 649925 479249
8760D79249M1161o2161j80675J38208J35263j65849j94843J06184L44608K7305
$$ 479249 520410 458249 277574 415782 551045 385196 190353 296537 641145 668450
8750F68450p8103m0592J6176J31854j31234p4412M3815m5546M0492k62r0980j12231
$$ 668450 590347 549755 565931 697785 566551 492139 535954 490408 530900 530638 439658 327427
8738C27427R1173J53450Q8186k25213j89313r6203k20172j2303j74681J8766K83639
$$ 327427 418600 572050 660236 435023 245710 149507 -70665 -82968 -257649 -238883 44756
8727D4756J51368M3533p5811Q8091k925J60283q2254J8420R2876k00608j3011
$$ 44756 196124 239657 163846 251937 249012 409295 327041 345461 438337 237729 224718
8716B24718P1945M4389N9176J48991n5358k5366q8628M0484K633j96378O0688
$$ 224718 296663 341052 400228 549219 493861 468495 379867 420351 422984 226606 287294
8705B87294J76378L8465j07432j50632L1720J23114k95967k17825K0559J771J98862
$$ 287294 463672 502137 394705 244073 275793 398907 102940 -114885 -94326 -92555 106307
8694A06307K1046j11678J70117j12212j54541N3475K1929K21841J40919J49695
$$ 106307 127353 15675 185792 73580 -80961 -27486 -5557 216284 357203 506898
8684E06898J04969m6885l827j56304o5120o476j08232R9584n7065m7170J86820
$$ 506898 611867 564982 561155 404851 339731 333255 225023 324607 267542 220372 407192
8673D07192N4548o3744j76478J2860N5399L6374P4538J34444L1945k74711j89546
$$ 407192 461740 397996 221518 234378 289777 326151 400689 535133 567078 292367 102821
8662A02821q825O9060K51229M9636l9388j16065k98660r0274J63030R6707j38466
$$ 102821 93996 163056 414285 463921 424533 308468 9808 -80466 82564 179271 40805
8651D0805j19604p1447K05423k0733l32m3575P6268j05639O3634N199j3284K66743
$$ 40805 -78799 -150246 55177 34444 34112 -9463 66805 -38834 24800 29999 16715 283458
8639B83458j02134m5230K18356N642k4304o3635J2007J0742j22128k12701j14726
$$ 283458 181324 136094 354450 360092 335788 272153 284160 294902 172774 -39927 -154653
8628a54653M9582J99299N4584M1442k9554m9430K9904r39o003q0283k8610L3447
$$ -154653 -105071 94228 148812 190254 160700 111270 141174 140235 134232 53949 25339 58786
8616E8786L4640P6105K09144r3986k11152q9510r2730J47972K66434J05769J0500
$$ 58786 93426 169531 378675 284689 73537 -15973 -108703 39269 305703 411472 421972
8605D21972j0535P3089j87656K957P1143n9043l6173N7601j7630o9110M6228J89792
$$ 421972 411437 484526 296870 299827 370970 311927 275754 333355 315725 246615 292843 482635
8593D82635J31895j28841l6535k4729J31755J485k201j46710O9961N9182k6039
$$ 482635 614530 485689 449154 424425 556180 557665 555464 408754 478715 537897 511858
8582E11858j96425k25250P1496J92538J15991j39830p1699K5635l9390R5490p2349
$$ 511858 315433 90183 161679 354217 470208 330378 258679 284314 244924 340414 268065
8571B68065j22345r9781K8396p07L6676n8018O5000M8927K8914J79232j72664
$$ 268065 145720 45939 74335 73628 110304 52286 117286 166213 195127 374359 201695
8560B01695O4275J55105j61722j83746M6689J46305m1392R6436q0287O0433R945
$$ 201695 265970 421075 259353 75607 122296 268601 227209 323645 243358 303791 313736
8549C13736L2250J15967O1385k79611N8689K25978K50783k8246k70101j87841
$$ 313736 345986 461953 523338 243727 302416 528394 779177 750931 480830 292989
8539B92989j15473K692j03546j03408O0620j35602j14976K53189J52661R7957
$$ 292989 177516 180208 76662 -26746 33874 -101728 -216704 36485 189146 287103
8529B87103O5943K50704K76691j5880n01376l74945l5511P2499j46906j7462J31400
$$ 287103 353046 603750 880441 864561 363185 -11760 -47271 25228 -121678 -139140 -7740
8518g740M5942P4163O1364N0585Q3507J61958J01809l67653n2712o9573J17396
$$ -7740 38202 112365 173729 224314 307821 469779 571588 203935 151223 81650 199046
8507A99046L11617J28812K5571J2848k54229j42896j07467J27756J18864r9650
$$ 199046 510663 639475 665046 677894 423665 280769 173302 301058 419922 320272
8497C20272J26341J08236l12157j16777K48243J22018j05272l47815m6299L37719
$$ 320272 446613 554849 242692 125915 374158 496176 390904 43089 -3210 334509
8487C34509N2316k44080j26744k4680j20920J8080K4802N0666q5399j0515n1525
$$ 334509 386825 142745 16001 -8679 -129599 -111519 -86717 -36051 -121450 -131965 -183490
8476a83490o0284n7667P2643J20900M0469k95475k4990K60651m3936n420J33541
$$ -183490 -243774 -301441 -228798 -107898 -67429 -362904 -387894 -127243 -171179 -176599 -43058
8465d3058o9680M0242J39079j25083K9791K22247K00404K6601j13719j07873J17560
$$ -43058 -112738 -72496 66583 -58500 -28709 193538 393942 420543 306824 198951 316511
8454C16511J24831K2947m0888j51206J2240j80701J24466n0460j46318j9414N9894
$$ 316511 441342 464289 423401 272195 284435 103734 228200 177740 31422 12008 71902
8443G1902L24254K10865m048j45582l29743j42455r1163J7738J52454K35998K2202
$$ 71902 396156 607021 602973 457391 127648 -14807 -105970 -88232 64222 300220 322422
8432C22422p8141l23690P0189n181K9820J35530J85358j31472N8809O6794m803
$$ 322422 244281 -79409 -9220 -14401 15419 150949 336307 204835 263644 330438 325635
8421C25635m5366j48634K7900k7744j20477k511N3005r9257m6827P2558j30028
$$ 325635 280269 131635 159535 131791 11314 8803 61808 -37449 -84276 -11718 -141746
8410a41746Q0858r9342j07556M0862J81591L2461J91945K14631j81503p598o1419
$$ -141746 -60888 -160230 -267786 -226924 -45333 -12872 179073 393704 212201 204603 143184
8399A43184m16O8951M8853J46693J53410q7231j14240j14141r3526j57100J62074
$$ 143184 142768 211719 260572 407265 560675 473444 359204 245063 151537 -5563 156511
8388A56511R4070M4424p2617p2140k13326J46358m9621j35707q515L5227j2856
$$ 156511 250581 295005 222388 150248 -63078 83280 33659 -102048 -110563 -75336 -88192
8377h8192N6393j1154j2446J4056j80770M5689J39120l4042J4614J89794j73636
$$ -88192 -31799 -42953 -55399 -41343 -222113 -176424 -37304 -71346 -56732 133062 -40574
8366d0574j63634P4239P5930J0545K10213k68361j55613K09305j55332q4121K37566
$$ -40574 -204208 -129969 -54039 -43494 166719 -101642 -257255 -47950 -203282 -287403 -49837
8355d9837J56494R9417J0165O2584k27196M9687Q7489k9043k4016J42012O8104
$$ -49837 106657 206074 216239 278823 51627 101314 188803 159760 135744 277756 345860
8344C45860N0880j26759j27173j1204k4562m7596R1483o216j15779j05829Q2348
$$ 345860 396740 269981 142808 131604 107042 59446 150929 144713 28934 -76895 5453
8333E453l2639J12849J02160o2232J30611m9049l25487k9632O9789j07057j93583
$$ 5453 -27186 85663 187823 125591 256202 207153 -118334 -147966 -78177 -185234 -378817
8322c78817o3152J22142L89562J42261j15412k3774r8483J68714n2021M9321o3954
$$ -378817 -441969 -319827 69735 211996 96584 72810 -25673 143041 91020 140341 76387
8311G6387l423p3121j50566P6297K64961J3179k31325j14662K7856J97357k2545
$$ 76387 72964 -157 -150723 -74426 190535 203714 -27611 -142273 -114417 82940 60395
8300F0395O8952K798n4527j26558O7615M0225j65880n2979J36472J88699o312
$$ 60395 129347 132145 77618 -48940 18675 58900 -106980 -159959 -23487 165212 158900
8289A58900j50482k45830l1433M4887J76707j7005Q1476M7956j5893R1960j4128
$$ 158900 8418 -237412 -268845 -223958 -47251 -64256 17220 65176 49283 141243 127115
8278A27115j71858j40481L3372Q0393m8734m369K2362J14787q6680K6338j30572
$$ 127115 -44743 -185224 -151852 -71459 -120193 -124562 -102200 12587 -74093 -47755 -178327
8267a78327l5288N6816L4954k13402P9686l7499j43990j00175R7488L57481P3995
$$ -178327 -213615 -156799 -121845 -335247 -255561 -293060 -437050 -537225 -439737 -82256 -8261
8256h261j09425J28635J91167k1293j99653k16602j35295J49579M1740K19462
$$ -8261 -117686 10949 202116 180823 -18830 -235432 -370727 -221148 -179408 40054
8246D0054J06923K02679R0714n5894l4539J48419j78694m42717j03312J64622
$$ 40054 146977 349656 440370 384476 349937 498356 319662 -123055 -226367 -61745
8236f1745J08081j22298k30686l8004J87377K76939J47078R0929J07829n8224
$$ -61745 46336 -75962 -306648 -344652 -157275 119664 266742 357671 465500 407276
8226D07276l5644M3537o0404p1030j11237J17456J50001J1056k89640k15882O9050
$$ 407276 371632 415169 354765 283735 172498 289954 439955 451011 161371 -54511 14539
8215A4539j17630P1382J3219k00049J42479J86999o9839j3436J26509O8589j97101
$$ 14539 -103091 -31709 -18490 -218539 -76060 110939 41100 27664 154173 222762 25661
8204B5661R0258J5050l1259Q7067L6193k07667k80173j00217J10348O1214k3597
$$ 25661 115919 130969 99710 186777 222970 15303 -264870 -365087 -254739 -193525 -217122
8193b17122n9955l2867J20752j2879k07206L7671J81311L58390J78040J46403
$$ -217122 -277077 -309944 -189192 -202071 -409277 -371606 -190295 168095 346135 492538
8183D92538N1770j98770k89233j37572q3484j8227J06644J22699j06445l77373
$$ 492538 544308 345538 56305 -81267 -164751 -182978 -76334 46365 -60080 -437453
8173d37453Q6273J97742J72461r7088k09489j75426K47514K2105K9711L88365
$$ -437453 -351180 -153438 19023 -78065 -287554 -462980 -215466 -193361 -163650 224715
8163B24715N9193l29608r6867K02418N4658J21817q4565j50136l8340p1514j86395
$$ 224715 283908 -45700 -142567 59851 114509 236326 151761 1625 -36715 -108229 -294624
8152b94624M9030Q229n4248q8424K51729J26884k4457K0421P1780Q3016P1588
$$ -294624 -245594 -237365 -291613 -380037 -128308 -1424 -25881 -5460 66320 149336 220924
8141B20924m9369j0807k55959l0344K49229P136j24709N1605m1602j05611j03269
$$ 220924 171555 160748 -95211 -125555 123674 130810 6101 57706 16104 -89507 -192776
8130a92776Q4013j20103J86550o145j39932L43090K70648m4054j14028j1062j24343
$$ -192776 -108763 -228866 -42316 -48461 -188393 154697 425345 381291 267263 256201 131858
8119A31858j95256r2169N3841r0313k24861n3025J53808J60434L37986K15444
$$ 131858 -63398 -155567 -101726 -192039 -416900 -469925 -316117 -155683 182303 397747
8109C97747N5810p0973j71125j17177j61464j79190J38938L12354J65377J93372
$$ 397747 453557 382584 211459 94282 -67182 -246372 -107434 204920 370297 563669
8099E63669j41151R1066n5252k79793j39471J63333J85749p2989l0260l0967K78299
$$ 563669 422518 513584 458332 178539 39068 202401 388150 315161 284901 253934 532233
8088E32233l531k69756k36236J1203K8509n9592k31434j2902R3740J05112R1660
$$ 532233 528702 258946 22710 33913 62422 2830 -228604 -241506 -147766 -42654 49006
8077D9006j70628j92860K56625L01244J09369j09424k25821o5413J056j49018
$$ 49006 -121622 -314482 -57857 243387 352756 243332 17511 -47902 -46846 -195864
8067a95864j27499M6906K23294j47525r6950J91741K51891M6754j2008O7940r491
$$ -195864 -323363 -276457 -53163 -200688 -297638 -105897 145994 192748 180740 248680 239189
8056B39189k81436l1650J5734N3185L26828J5575p9796m6526j27730L91q898K26957
$$ 239189 -42247 -73897 -58163 -4978 321850 337425 257629 211103 83373 83764 74866 301823
8044C01823M1038r0472j046m8729O8906q1195l3654j87611k37038j12673L1044
$$ 301823 342861 252389 251343 202614 271520 190325 156671 -30940 -267978 -380651 -349607
8033c49607L14496J78315k06557J0746K3046k7407m0967n326K5155J56446r8594
$$ -349607 -35111 143204 -63353 -52607 -29561 -56968 -97935 -103261 -78106 78340 -20254
8022b0254j52920j21142J34683M0504J16196j20340n4440R9487L9497p029l4884
$$ -20254 -173174 -294316 -159633 -119129 -2933 -123273 -177713 -78226 -38729 -45758 -80642
8011h0642M3298J18720K3278O4127J4117r982n2801j20500k4422j76254O0448
$$ -80642 -37344 81376 104654 168781 182898 172916 120115 -385 -24807 -201061 -140613
8000a40613R4301J68795m5979M1335N2012L2465K6035r0840l2229k2591r7800
$$ -140613 -46312 122483 76504 117839 169851 202316 228351 137511 105282 82691 -15109
7989a5109l375r6800j55987P0730K48443M1352J79091j78533l64128n184J1104
$$ -15109 -18484 -115284 -271271 -200541 47902 89254 268345 89812 -274316 -279500 -268396
7978b68396K73805K21837L6357r8847j08162j8868r0022k5658K7545R5401l8677
$$ -268396 5409 227246 263603 164756 56594 37726 -52296 -77954 -50409 44992 6315
7967F315n4588l02349K47520K83311q2405k2826K7758p069k17362P5608Q0866
$$ 6315 -48273 -350622 -103102 180209 97804 74978 102736 95667 -121695 -46087 34779
7956C4779J74483K54647L0881j91006k10370O9799n7478L1788J86366k12527j56275
$$ 34779 209262 463909 494790 303784 93414 163213 105735 137523 323889 111362 -44913
7945d4913o6460m3786P9723N6111K11513j69812j97733Q3137n7435J88115R8376
$$ -44913 -111373 -155159 -75436 -19325 192188 22376 -175357 -92220 -149655 38460 136836
7934A36836p294q1546n9457J81961L963j91294j38719Q2041L5825n2428j7005
$$ 136836 129542 47996 -11461 170500 174463 -16831 -155550 -73509 -37684 -90112 -107117
7923a07117L70063J8025J4065K5078j94550k33274k3528K69900J45247N4673o561
$$ -107117 262946 280971 295036 320114 125564 -107710 -131238 138662 283909 338582 332021
7912C32021j62987k2378J4136J8956L6826J12330k36879j99690j08324l0695K64591
$$ 332021 169034 146656 160792 179748 216574 328904 92025 -107665 -215989 -246684 17907
7901A7907P3227p2840j8869M2833j312J27857J67744r2198j71733q0868K03472
$$ 17907 91134 18294 -575 42258 40946 168803 336547 244349 72616 -8252 195220
7890A95220j46205n4310m5502J20470Q3936k9685k5713Q1745Q6525j10858k31566
$$ 195220 49015 -5295 -50797 69673 153609 123924 98211 179956 266481 155623 -75943
7879g5943j3555L9656M8282K31054l7628Q2948j06996J25981K92742j10126k12280
$$ -75943 -89498 -49842 -1560 229494 191866 274814 167818 293799 586541 476415 264135
7868B64135O3940j01757j04839j25500q0916J81384j7846R909J57635r2969j22605
$$ 264135 328075 226318 121479 -4021 -84937 96447 78601 88510 246145 153176 30571
7857C0571J53022N9149j92598j67692r6322J0738j2303M8315P8158R7565r3154
$$ 30571 183593 242742 50144 -117548 -213870 -203132 -215435 -167120 -88962 8603 -84551
7846h4551Q5133N0428Q2278J73376N1110l80877j18022l1412r9410K9617K59209
$$ -84551 582 51010 133288 306664 357774 -23103 -141125 -172537 -271947 -242330 16879
7835A6879p8463j9207J62205J1692M021k33152k11504Q6867o5864l24J8484J87214
$$ 16879 -61584 -80791 81414 93106 97127 -136025 -347529 -260662 -326526 -326850 -308366 -121152
7823a21152J55673j3844O393K7559K32702O0691j86685n0742k6978Q1675K4849
$$ -121152 34521 20677 27070 54629 287331 348022 161337 110595 83617 165292 190141
7812A90141k0093l20614m4644O1927k76004P2631Q1288j5916j1724K01231J15252
$$ 190141 170048 -150566 -195210 -133283 -409287 -336656 -255368 -271284 -283008 -81777 33475
7801C3475K96120J2875j15647J71127j17272l4448k4044j08133q9700N2438J27480
$$ 33475 329595 342470 226823 397950 280678 246230 222186 114053 24353 76791 204271
7790B04271p405n9384l78837p6452K12067J26211l3741J27642J14930N7368j86810
$$ 204271 196866 137482 -241355 -317807 -105740 20471 -13270 114372 229302 286670 99860
7779I9860j20938o2148k0582k19546K33350K88010J07105M5960k07719j36129
$$ 99860 -21078 -83226 -103808 -323354 -90004 198006 305111 351071 143352 7223
7769G223L1280J46119m9124j83020n3716J89812j6379j19689J16589j57537K781
$$ 7223 38503 184622 135498 -47522 -101238 88574 72195 -47494 69095 -88442 -85661
7758h5661J42123K24887J48750j94577k28898l4463J59023J84847P8366j64301
$$ -85661 56462 281349 430099 235522 6624 -27839 131184 316031 394397 230096
7748B30096O153J43830n0322j76574j62932q2750J12620o2650J12225j6886Q3654
$$ 230096 236249 380079 329757 153183 -9749 -92499 20121 -42529 69696 52810 136464
7737A36464J37954P3137k43518j13568J11118m349J662O756L66284k7606j76983
$$ 136464 274418 347555 104037 -9531 101587 97238 98900 105656 471940 444334 267351
7726B67351l7903k0720r4337K6698P5601P0535j52913K1450l9227k9001N1425
$$ 267351 229448 208728 114391 141089 216690 287225 134312 155762 116535 87534 138959
7715A38959l9867O7153K7163j18492j4260p112K5752o0444n3996Q9161l7531k90096
$$ 138959 99092 166245 193408 74916 60656 53544 79296 18852 -35144 54017 16486 -273610
7703b73610m4506q9904J42404M5949n914K08233J56428J27771p757o0925o4646
$$ -273610 -318116 -408020 -265616 -219667 -225581 -17348 139080 266851 259094 198169 133523
7692A33523K3197k09313l31463L1430k7721j21729L52379L65072j27738j1341
$$ 133523 156720 -52593 -384056 -352626 -380347 -502076 -149697 215375 87637 76296
7682G6296J9389j01576j53819j06453r3008n0694L12418J56168j83688j13833
$$ 76296 95685 -5891 -159710 -266163 -359171 -409865 -97447 58721 -124967 -238800
7672b38800j96556J2048Q3097l1106l5191O3547J6943J29720M4442L3984J47469
$$ -238800 -435356 -423308 -340211 -371317 -406508 -342961 -326018 -196298 -151856 -117872 29597
7661B9597K3426k4909k5890l3855M2303j87137j57016J56037J88004J19223k61093
$$ 29597 53023 28114 2224 -31631 10672 -176465 -333481 -177444 10560 129783 -131310
7650a31310j34305J53907P7708N8872o162j58662J38163K68794R2984j61139k21081
$$ -131310 -265615 -111708 -34000 24872 18710 -139952 -1789 267005 359989 198850 -22231
7639b2231N7016O7016n2523K63940K2038j03429J89082o7950j44799l05102k12554
$$ -22231 34785 101801 49278 313218 335256 231827 420909 352959 208160 -96942 -309496
7628c09496K37974L07658K83926j12781k32931p3806K15415m8604l5296J04151
$$ -309496 -71522 236136 520062 407281 174350 100544 315959 267355 232059 336210
7618C36210p1621M2979N1765N0494j47259j29308j42760m8492P025J70893J28707
$$ 336210 264589 307568 359333 409827 262568 133260 -9500 -57992 -50967 119926 248633
7607B48633j4082j10804j48436J09425J7167k27193o4639J12268Q7078N6256o0003
$$ 248633 234551 123747 -24689 84736 101903 -125290 -189929 -77661 9417 65673 5670
7596E670j65975P4359J95132R8032N9110K26182M5920j79392j59582j45476r4182
$$ 5670 -160305 -85946 109186 207218 266328 492510 538430 359038 199456 53980 -40202
7585d0202K13900P7531k52328n2029L3102n3973J2941N9855m2749m988J05675
$$ -40202 173698 251229 -1099 -53128 -20026 -73999 -61058 -1203 -43952 -48940 56735
7574E6735J64117m5382p6607j01239p8742R4558p5958p4268L1396J02697r4797
$$ 56735 220852 175470 98863 -2376 -81118 13440 -62518 -136786 -105390 -2693 -97490
7563i7490j23100K89862L9064N9843q4787k03466J58552J55325r8660j59850J46802
$$ -97490 -220590 69272 108336 168179 83392 -120074 38478 193803 95143 -64707 82095
7552H2095J14730j66608j91535R0193J48617R5330r4404m0514j18006J59370q6505
$$ 82095 196825 30217 -161318 -71125 77492 172822 78418 37904 -80102 79268 -7237
7541g237n2782P4437k47776j79711K90250K52823N1264j73328j43691p6977J22364
$$ -7237 -60019 14418 -233358 -413069 -122819 130004 181268 7940 -135751 -212728 -90364
7530i0364J6102O0839N9754j8357L3583L7113k6530N7230R5087j74842l05656
$$ -90364 -74262 -13423 46331 27974 61557 98670 72140 129370 224457 49615 -256041
7519b56041J86169J65500k6246M6519K27577p7458j77928j40259K5798M6159p2461
$$ -256041 -69872 95628 69382 115901 343478 266020 88092 -52167 -26369 19790 -52671
7508e2671j38599J04109N8720p9642R4660J97765q2686k05814l00787q6179J02292
$$ -52671 -191270 -87161 -28441 -108083 -13423 184342 101656 -104158 -404945 -491124 -388832
7497c88832J10993j03089n584K27921J93842j3846N5378j05948N6200M5952l6758
$$ -388832 -277839 -380928 -386512 -158591 35251 21405 76783 -29165 27035 72987 36229
7486C6229j58353K6060K72777j07736l29432p4915O6350o6666P8310J68734j2977
$$ 36229 -122124 -96064 176713 68977 -260455 -335370 -269020 -335686 -257376 -88642 -101619
7475a01619J26906J17126K28021M1168q7408j44570j33800j03922J08522O8254
$$ -101619 25287 142413 370434 411602 324194 179624 45824 -58098 50424 118678
7465A18678J72727q8948j59739J66680P9085o4159J890j33658k95375R5360J85207
$$ 118678 291405 202457 42718 209398 288483 224324 226214 92556 -202819 -107459 77748
7454G7748J23115j63280j41762L0549J79010m7539J50439K6440o9123J91879n4588
$$ 77748 200863 37583 -104179 -73630 105380 57841 208280 234720 165597 357476 302888
7443C02888l8955l1349O9445m2219j79608R145o0307j84777K919j3112Q4795J45535
$$ 302888 263933 232584 302029 259810 80202 89347 29040 -155737 -152818 -165930 -81135 64400
7431F4400K0943p5436J4800k23639j46022J83755K72238M3455j25120Q0504l3365
$$ 64400 85343 9907 24707 -198932 -344954 -161199 111039 154494 29374 109878 76513
7420G6513q2882P215K0796m0463j11276j17284k47820p4245J48306M6640j1314
$$ 76513 -6369 846 21642 -18821 -130097 -247381 -495201 -569446 -421140 -374500 -385814
7409c85814J79451J73252J93730m5669p4076j99780p2510l2132k2823P1418J37540
$$ -385814 -206363 -33111 160619 114950 40874 -158906 -231416 -263548 -286371 -214953 -77413
7398g7413q9381k3011Q2909J30804O0833R0975o8911j41026j34600O7974J1510
$$ -77413 -166794 -189805 -106896 23908 84741 175716 106805 -34221 -168821 -100847 -89337
7387h9337k94527J18555K09622J84591J64431J2641l3477l28918l37790P2900
$$ -89337 -383864 -265309 -55687 128904 293335 305976 272499 -56419 -394209 -321309
7377c21309L24219Q189j95964q9975j8589K9299O3863j21461M7555R0355o6425
$$ -321309 2910 11099 -184865 -274840 -293429 -264130 -200267 -321728 -274173 -183818 -250243
7366b50243K0684p3722J76664j9119j88695J27086K81913p9532j88501J80543
$$ -250243 -229559 -303281 -126617 -145736 -334431 -207345 74568 -4964 -193465 -12922
7356a2922o5251L5431J24244j76256J60815L3691l4482J78329r2447j48139j48240
$$ -12922 -78173 -42742 81502 -94754 66061 99752 65270 243599 151152 3013 -145227
7345a45227R04K38903n5753j31414r784o7959Q2185l3106p3563L7794m5095R7354
$$ -145227 -144323 94580 38827 -92587 -102371 -170330 -88145 -121251 -194814 -157020 -202115 -104761
7333a04761O0413J6192N7367J05281j00270l37328j351n5065j31242J47786J57037
$$ -104761 -44348 -28156 29211 134492 34222 -303106 -304457 -359522 -490764 -342978 -185941
7322a85941L8990n6076l6771o8358K10054Q2976J7788o9346J37659j37880q2553
$$ -185941 -146951 -203027 -239798 -308156 -98102 -15126 2662 -66684 70975 -66905 -149458
7311a49458M5207K91287j11367k37492P5018J30802o9097p7417j40732m5799Q8466
$$ -149458 -104251 187036 75669 -161823 -86805 43997 -25100 -102517 -243249 -289048 -200582
7300b00582M032r9002L109L30860J88520N7791k13005j92533M8030O5632l75593
$$ -200582 -196550 -295552 -292443 38417 226937 284728 71723 -120810 -72780 -7148 -382741
7289c82741M6239J23769J03115K54754N5982m0522j4362L6371K20781n7969n5476
$$ -382741 -336502 -212733 -109618 145136 201118 160596 146234 182605 403386 345417 289941
7278B89941j62282k15749l2129J59601L9435o6108k4575L179j5629K30364J08656
$$ 289941 127659 -88090 -120219 39382 78817 12709 -11866 -8687 -24316 206048 314704
7267C14704n7073k35167k28127L9826J55860J58695j54929l4078P959J25556k1238
$$ 314704 257631 22464 -205663 -165837 -9977 148718 -6211 -40289 -32330 93226 71988
7256G1988j5764j2990J29744L6276J19516M1675j26322k62898j59716K9693j16612
$$ 71988 56224 43234 172978 209254 328770 370445 244123 -18775 -178491 -148798 -265410
7245b65410P7632J17581J2463J48927l9570j5374j37437o0172L1555J5300J38273
$$ -265410 -187778 -70197 -57734 91193 51623 36249 -101188 -161360 -129805 -114505 23768
7234B3768r006r8665N5091o3717o21p4818J44421J98460j29145K16203j18186
$$ 23768 14762 -83903 -28812 -92529 -93150 -167968 -23547 174913 45768 261971 143785
7223A43785j05063j09029j22225j22576l011L14275J54428k31405j77097j0246
$$ 143785 38722 -70307 -192532 -315108 -318119 -3844 150584 -80821 -257918 -268164
7213b68164j2331j96949J36728K02685K08863L32133M5433M567m04006l76711
$$ -268164 -280495 -477444 -340716 -138031 70832 402965 448398 452965 48959 -327752
7203c27752l807J86931J07112J46749Q915l8791j3696J95267m6782k59962M6187
$$ -327752 -331559 -144628 -37516 109233 118148 79357 65661 260928 214146 -45816 371
7192C71K64403R1384o1080j04354j71334j97489K05358j4361K6646J00439m5444
$$ 371 264774 356158 295078 190724 19390 -178099 27259 12898 39544 139983 94539
7181I4539m6737j79068j93822j1940O2623o5842K7028K67767J7750o5111o5514
$$ 94539 47802 -131266 -325088 -337028 -274405 -340247 -313219 -45452 -27702 -92813 -158327
7170a58327O9724J73083Q8023K7821k13596j08818P9743K807j99587k4998J39337
$$ -158327 -88603 84480 172503 200324 -13272 -122090 -42347 -39540 -239127 -264125 -124788
7159a24788P4914N9653m6782o6510l6953M2516J39439J01339o246j08582l4793
$$ -124788 -49874 9779 -37003 -103513 -140466 -97950 41489 142828 136582 28000 -6793
7148f793J72475j6664r9398K8774K54726L6499k74125j85779K19745j51548j56410
$$ -6793 165682 149018 49620 78394 333120 369619 95494 -90285 129460 -22088 -178498
7137a78498M9778J83743J14735P2827R6065j67743J70351R6397k63141j65599
$$ -178498 -128720 55023 169758 242585 338650 170907 341258 437655 174514 8915
7127H915J9689n8592j7850J48040j97682J04336K28755m5107j28430p7666R1969
$$ 8915 28604 -29988 -47838 100202 -97480 6856 235611 190504 62074 -15592 76377
7116G6377J17420J52431j59688n5303r5949p7423k3087j65282o2271k0232J90518
$$ 76377 193797 346228 186540 131237 35288 -42135 -65222 -230504 -292775 -313007 -122489
7105a22489J56578k6957p3330j33169n6935J72011j05531l23278N1327J43216
$$ -122489 34089 7132 -66198 -199367 -256302 -84291 -189822 -513100 -461773 -318557
7095c18557P0931Q2362j44999Q8509J67201P4475J841K62977K97415m2174k09838
$$ -318557 -247626 -165264 -310263 -221754 -54553 19922 21763 284740 582155 539981 330143
7084C30143k72527p9649L7883r8855q6202K85645j75897q8489P0072q0638m8506
$$ 330143 57616 -22033 15850 -83005 -169207 116438 -59459 -147948 -77876 -158514 -207020
7073b07020J01082N0217J60700o1998r8247k6647j37247J61168o0595j56923J72675
$$ -207020 -105938 -55721 104979 42981 -55266 -81913 -219160 -57992 -118587 -275510 -102835
7062a02835j4703M2913r5581j80260j25449N9624J3974J73215K30706J29680j48414
$$ -102835 -117538 -74625 -170206 -350466 -475915 -416291 -402317 -229102 1604 131284 -17130
7051a7130k4374J60998J39625J26896k21938k08679P3069J08312J33683l1324
$$ -17130 -41504 119494 259119 386015 164077 -44602 28467 136779 270462 239138
7041B39138J51778K3573j75662j75055k88969J57720R6996q3070p9805P4742r176
$$ 239138 390916 414489 238827 63772 -225197 -67477 29519 -53551 -133356 -58614 -67790
7030f7790O5848J84447J30384j85292j51695l365J27787p2529K6593j27419J86761
$$ -67790 -1942 182505 312889 127597 -24098 -27463 100324 27795 54388 -73031 113730
7019A13730J59326j21367j38149l8640k73482l8679J20814P2456J79761j13974
$$ 113730 273056 151689 13540 -25100 -298582 -337261 -216447 -143991 35770 -78204
7009g8204k70969k9923J88426J09627J369J286l1546q3509J47034J73736j21639
$$ -78204 -349173 -379096 -190670 -81043 -79674 -78388 -109934 -193443 -46409 127327 5688
6998E688j39400j84819L6077J0297k8124O7532L54512J7524j18740o9593o486
$$ 5688 -133712 -318531 -282454 -272157 -300281 -232749 121763 139287 20547 -49046 -55532
6987e5532k4733Q7228L5832K02798J84936P575k69069j54359M1506J8221j29788
$$ -55532 -80265 6963 42795 245593 430529 438104 169035 14676 56182 74403 -55385
6976e5385j58892l3509J00878J05114o076j13606k3602J51871J43470o9411J91365
$$ -55385 -214277 -247786 -146908 -41794 -47870 -161476 -185078 -33207 110263 40852 232217
6965B32217J40516l18526q0568K16553l34j47745k10168j17940p9890J63428L7462
$$ 232217 372733 54207 -26361 190192 189858 42113 -168055 -285995 -365885 -202457 -164995
6954a64995l2640O9446J65315L9879k09615j2959K31805J54385m0642k19871l2201
$$ -164995 -197635 -128189 37126 77005 -132610 -145569 86236 240621 199979 -19892 -52093
6943e2093J55619r8725J54289j57565k15983O97L9379o762K15112O2131k49269
$$ -52093 103526 4801 159090 1525 -214458 -213761 -174382 -181144 33968 96099 -153170
6932a53170n922J63968J34997J2066K7707j82297r9081r6787n6249R1617J32132
$$ -153170 -159092 4876 139873 151939 179646 -2651 -101732 -198519 -254768 -163151 -31019
6921c1019J66122p2822p9190J8456j90234o5416P6891O770K0640j1966k78549
$$ -31019 135103 62281 -16909 1547 -188687 -254103 -177212 -170442 -149802 -161768 -440317
6910d40317J08716J70419N8117j6608m7349K33565K19897l1694j37416j32095
$$ -440317 -331601 -161182 -103065 -119673 -167022 66543 286440 254746 117330 -14765
6900a4765L0056j32372m9713J60046J79700k15408j35237L5656L4946O689p3594
$$ -14765 15291 -117081 -166794 -6748 172952 -42456 -177693 -142037 -107091 -100402 -173996
6889a73996K69366R6230j57601j42020K35607N8025O3074m1818k70176o8509j14399
$$ -173996 95370 191600 33999 -108021 127586 185611 248685 206867 -63309 -131818 -246217
6878b46217j8907J23611q7880o4656J62096L826p349K41221J27273j8966J27417
$$ -246217 -265124 -141513 -229393 -294049 -131953 -128127 -135476 105745 233018 214052 341469
6867C41469n8851m33532j5238J24741N1385Q0141K0230k8690m9061l6149n8184
$$ 341469 282618 -150914 -166152 -41411 9974 90115 110345 81655 32594 -3555 -61739
6856f1739M4987M3430l60338k35350r5759J66935K83699K15266j78269m1294J13440
$$ -61739 -16752 26678 -333660 -569010 -664769 -497834 -214135 1131 -177138 -218432 -104992
6845a04992j4147P4020J18068j23006j51894P4563o8737J12178J246l7235K3739
$$ -104992 -119139 -45119 72949 -50057 -201951 -127388 -196125 -83947 -82701 -119936 -96197
6834i6197o2838J09711J33713J35905L7164j98834k12944k045K5980Q6558q1183
$$ -96197 -159035 -49324 84389 220294 257458 58624 -154320 -156365 -130385 -43827 -125010
6823a25010J5306J8809J37601K42230m3689o5577q3132j57099j49710J5832J13043
$$ -125010 -109704 -90895 46706 288936 245247 179670 96538 -60561 -210271 -194439 -81396
6812h1396J36069L4612K24543j21337k26874k64476l1275J39791K25124o2938
$$ -81396 54673 89285 313828 192491 -34383 -298859 -330134 -190343 34781 -28157
6802b8157K9374k2832J31486m0353j38806j86383N6144P2047J48185M1360O2186
$$ -28157 1217 -21615 109871 69518 -69288 -255671 -199527 -127480 20705 62065 124251
6791A24251q9031q0370J29448K3657N2697m6317Q5976J56735k1332j93105o2168
$$ 124251 35220 -45150 84298 107955 160652 114335 200311 357046 335714 142609 80441
6780H0441j9776J7023r0063q7305j4656J4824J35625j26386p1288K02873N6533
$$ 80441 60665 77688 -12375 -99680 -114336 -99512 36113 -90273 -161561 41312 97845
6769I7845o0107q1257K1539q1746n5053j10069P6467K14351O2900j58700j70944
$$ 97845 37738 -43519 -21980 -103726 -158779 -268848 -192381 21970 84870 -73830 -244774
6758b44774n1904J47580L6591O0672L2678j30699k48208K6493J35773r3353n5783
$$ -244774 -296678 -149098 -112507 -51835 -19157 -149856 -398064 -371571 -235798 -329151 -384934
6747c84934n7930m0724K8853K25949J51312J05612J72812n4469p8726K90463j27567
$$ -384934 -442864 -483588 -454735 -228786 -77474 28138 200950 146481 67755 358218 230651
6736B30651m9302l7198o5919m9089p7204m7484J21123O8486j1532k2739j7177
$$ 230651 181349 144151 78232 29143 -48061 -95545 25578 94064 82532 59793 42616
6725D2616J29070n359j93373j45202n4966R1809J89792o146k8079J64805n2656
$$ 42616 171686 166327 -27046 -172248 -227214 -135405 54387 48241 20162 184967 132311
6714A32311j1634J11769K08332k14068l7520O2168j07459J83346K5552j07421
$$ 132311 120677 232446 440778 226710 189190 251358 143899 327245 352797 245376
6704B45376m4161J00795J26840l4071j42258j93075j13807r7080K5992J24391
$$ 245376 201215 302010 428850 394779 252521 59446 -54361 -151441 -125449 -1058
6694a058K9555J03401m6736l0812p6444o3746j08589j60245k3728K66883J85209
$$ -1058 28497 131898 85162 54350 -22094 -85840 -194429 -354674 -378402 -111519 73690
6683G3690m835q0736k1451j00062l9409J25915J15002K5697j1949P8792j49787
$$ 73690 68855 -11881 -33332 -133394 -172803 -46888 68114 93811 81862 160654 10867
6672A0867k10163k190K27256J070J79561J12713p5351o1390k41513k94519M1948
$$ 10867 -199296 -201486 25770 26840 206401 319114 243763 182373 -59140 -353659 -311711
6661c11711K00868j26497J7922J09092J28730J83341p0710r9577J02122j9107
$$ -311711 -110843 -237340 -219418 -110326 18404 201745 131035 31458 133580 114473
6651A14473j52970q4445j0175J01996m6740J57902Q1611J5098o6193J48634M9609
$$ 114473 -38497 -122942 -133117 -31121 -77861 80041 161652 176750 110557 259191 308800
6640C08800j38123j41636P6243M0612o8455l7893o2630m8443P1390l19401r7308
$$ 308800 170677 29041 105284 145896 77441 39548 -23082 -71525 -135 -319536 -416844
6629d16844K12942K45676O361o9670Q793J12579n445j33581j5394j4569O6064
$$ -416844 -203902 41774 48135 -21535 -12742 99837 94392 -39189 -54583 -69152 -3088
6618c088P9258k3439q5875j58750l7360L3023M7862J51884p2581J23866Q636j04283
$$ -3088 76170 52731 -33144 -191894 -229254 -196231 -148369 3515 -69066 54800 63436 -40847
6606d0847n3131J28493l7582n7855o3322o6549J25046J88002J01648k05043j3429
$$ -40847 -93978 34515 -3067 -60922 -124244 -190793 -65747 122255 223903 18860 5431
6595E431J32783J32224q3205J0740J94500k9900p2027n1681o3850r0102J6264
$$ 5431 138214 270438 187233 197973 392473 362573 290546 238865 175015 84913 101177
6584A01177l8566J20895P6995j35559o7027Q769Q7299J15785J2078k5593j44003
$$ 101177 62611 183506 260501 124942 57915 66684 153983 269768 281846 256253 112250
6573A12250k84407R3486k14155N6186K49956K876p2939r9349l31275j56050L08166
$$ 112250 -172157 -78671 -292826 -236640 13316 16192 -56747 -156096 -487371 -643421 -335255
6562c35255M12109o6041k14155O0710j15666Q6761J24750r5720o9405m2133R1161
$$ -335255 76854 10813 -203342 -142632 -258298 -171537 -46787 -142507 -211912 -254045 -162884
6551a62884R0747r9201o8423J77382M3527j66151J24047J31450N7562p4760j64268
$$ -162884 -72137 -171338 -239761 -62379 -18852 -185003 -60956 70494 128056 53296 -110972
6540a10972m7843j32766m1653M2430K01328J12628R5879m2434J76551j10535j73473
$$ -110972 -158815 -291581 -333234 -290804 -89476 23152 119031 76597 253148 142613 -30860
6529c0860o6006m7074K3846J69987r9063K2299J49411r2652n012K12412n0625
$$ -30860 -96866 -143940 -120094 49893 -49170 -26871 122540 29888 24876 237288 186663
6518A86663j73584j65515J35309j23355j22802N881J64405j78462j38334R6942
$$ 186663 13079 -152436 -17127 -140482 -263284 -257403 -92998 -271460 -409794 -312852
6508c12852l0020J84469K62949k55905j4599P1792J12444K2152j20684p3061k83687
$$ -312852 -342872 -158403 104546 -151359 -165958 -94166 18278 40430 -80254 -153315 -437002
6497d37002J8083j6448Q8915K75200P2241K86795J51960j09463m042r6426k02318
$$ -437002 -418919 -435367 -346452 -71252 989 287784 439744 330281 326239 229813 27495
6486B7495j21595L8074J27647J45445k55117n8465L40976J43375j52366p0447
$$ 27495 -94100 -56026 71621 217066 -38051 -96516 244460 387835 235469 165022
6476A65022n8759l08064j02588l7015K37878K96196j7043q8380p8755q768J66806
$$ 165022 106263 -201801 -304389 -341404 -103526 192670 175627 87247 8492 -276 166530
6465A66530P4450r4251k03042m9742k58089j15376J94066K46891j8396J0428r4090
$$ 166530 240980 146729 -56313 -106055 -364144 -479520 -285454 -38563 -56959 -46531 -140621
6454a40621M3132J22396J40926q9271j75279j73075J29076p3714l9446J17258
$$ -140621 -97489 24907 165833 76562 -98717 -271792 -142716 -216430 -255876 -138618
6444a38618K29820J06519J52365L8936j73164k31771M2838k1657M5419q8797K43157
$$ -138618 91202 197721 350086 389022 215858 -15913 26925 5268 50687 -38110 205047
6433B05047K24734m9528k34765K90928J01881l5202j5128j49633j32179r4491
$$ 205047 429781 380253 145488 436416 538297 503095 487967 338334 206155 111664
6423A11664Q179o9066l9504J13456P1772n6957J0078P6822k11829J1196L3887
$$ 111664 119843 50777 11273 124729 196501 139544 149622 226444 14615 25811 59698
6412E9698J77226j54457k1011J69360m1711l2512j00612r3966J05775k38634k38827
$$ 59698 236924 82467 61456 230816 189105 156593 55981 -37985 67790 -170844 -409671
6401d09671J47510N5945J2013Q646J69336N8882k86353j97821L9479K19794P9554
$$ -409671 -262161 -206216 -194203 -185557 -16221 42661 -243692 -441513 -402034 -182240 -102686
6390a02686K31482J89005j17676J50244m5000j49736k10064l2449O9932J19932
$$ -102686 128796 317801 200125 350369 305369 155633 -54431 -86880 -16948 102984
6380A02984J37400l568j11959r5330J51065J22098k04995k94258j39305J69795
$$ 102984 240384 236816 124857 29527 180592 302690 97695 -196563 -335868 -166073
6370a66073K53721P2171J53702p4392j91138j44095n2836o5156r7378p4577L1201
$$ -166073 87648 159819 313521 239129 47991 -96104 -148940 -214096 -311474 -386051 -354850
6359c54850R4072J12983L1403O7927K69451J41997j21224j02605q2491j07991
$$ -354850 -260778 -147795 -116392 -48465 220986 362983 241759 139154 56663 -51328
6349e1328l829l057j2777M3369n499n686r3300p7628O2699R7979j00162j47366
$$ -51328 -55157 -58214 -70991 -27622 -33121 -38807 -132107 -209735 -147036 -49057 -149219 -296585
6337b96585J3289Q280n3419J17599P7130P2166J40945k3119j54375k24328P5093
$$ -296585 -283296 -275016 -328435 -210836 -133706 -61540 79405 56286 -98089 -322417 -247324
6326b47324R7374J6908p4907k8868j55481K29263K19897R9931l3748m5201K4529
$$ -247324 -149950 -133042 -207949 -236817 -392298 -163035 56862 156793 123045 77844 102373
6315A02373J87464M639k40475j919K05075j18516k23213R7547J67532J30591j57389
$$ 102373 289837 294476 54001 52082 257157 138641 -84572 12975 180507 311098 153709
6304A53709r5176K86523k11956l45934O8051J03583J29938m7851j67829j7712
$$ 153709 58533 345056 133100 -212834 -144783 -41200 88738 40887 -126942 -144654
6294a44654p504R004O9963q7285j73715R4972J79188J65337O2719q8617k55571
$$ -144654 -152158 -143154 -73191 -160476 -334191 -239219 -60031 105306 168025 79408 -176163
6283a76163r9220r2869J49651J82107r3179M2862O3034m9796N9923P1581k63723
$$ -176163 -275383 -368252 -218601 -36494 -129673 -86811 -23777 -73573 -13650 57931 -205792
6272b05792j09808J10456P214k0501M8327J83706m7899r789K6619l8671K64972
$$ -205792 -315600 -205144 -197930 -218431 -170104 13602 -34297 -44086 -17467 -56138 208834
6261B08834J06536j44222K04822m9224k45747k972k123l6261M7152J03232n8101
$$ 208834 315370 171148 375970 326746 80999 78027 75904 39643 86795 190027 131926
6250A31926o2637j3252o7909j01258J23651J3353j14348J23309K2847j00440K34479
$$ 131926 69289 56037 -11872 -113130 10521 23874 -90474 32835 55682 -44758 189721
6239A89721J9812j62912j68991j30481K21773j07578j36576j5056J10259N2511
$$ 189721 209533 46621 -122370 -252851 -31078 -138656 -275232 -290288 -180029 -127518
6229a27518j22106r9686O805K62739R7794J82643n1061j99053j5132Q951J91343
$$ -127518 -249624 -349310 -342505 -79766 18028 200671 149610 -49443 -64575 -55624 135719
6218A35719N2267r7151K8589J29075J30483O0732k53117l10758q2961K84315O5238
$$ 135719 187986 90835 119424 248499 378982 439714 186597 -124161 -207122 77193 142431
6207A42431j06089m8228J26004M2655M8484J01361j52990M678o2560m6187p5463
$$ 142431 36342 -11886 114118 156773 205257 306618 153628 158306 95746 49559 -25904
6196b5904P5914J02466Q8273R2193K3540k61500j77309k12444J39842R4970l0663
$$ -25904 50010 152476 240749 332942 356482 94982 -82327 -294771 -154929 -59959 -90622
6185i0622J9260K04744p2589L8215l8311k17922n9384N7801L66803J05422k55049
$$ -90622 -71362 133382 60793 99008 60697 -157225 -216609 -158808 207995 313417 58368
6174E8368j29489l5432j35069Q7201O4019K0006m7813l5702J04138Q7077p9570
$$ 58368 -71121 -106553 -241622 -154421 -90402 -70396 -118209 -153911 -49773 37304 -42266
6163d2266p5568k32594L1199J42667j71667n1382M8233N2415J20629J00001n47
$$ -42266 -117834 -350428 -319229 -176562 -348229 -399611 -351378 -298963 -178334 -78333 -78880
6152g8880P6872Q4420P8281R0384m2089n8789m867J3612k33571j11738K9254J20560
$$ -78880 -2008 82412 160693 251077 208988 150199 145332 158944 -74627 -186365 -157111 -36551
6140c6551m7971o5245J04587J89059M7675O7078J65017j02913p6186J40338O9547
$$ -36551 -84522 -149767 -45180 143879 191554 258632 423649 320736 244550 384888 454435
6129D54435M467m507m542j63956k08600j60852r4823J59512J28283J52988M8555
$$ 454435 458902 454395 449853 285897 77297 -83555 -178378 -18866 109417 262405 310960
6118C10960k09327j40237Q7975m3936j48616J33299p9794j45433q8452N8209K219
$$ 310960 101633 -38604 49371 5435 -143181 -9882 -89676 -235109 -323561 -265352 -263133
6107b63133J16315j63258j38940J72400K61521K31818k3111q5987p3717J94610
$$ -263133 -146818 -310076 -449016 -276616 -15095 216723 193612 107625 33908 228518
6097B28518q6991k2689j06500Q3810K30450k0224Q7911k06412m80536j11665J10632
$$ 228518 141527 118838 12338 96148 326598 306374 394285 187873 -292663 -404328 -293696
6086b93696K6436p4979j22015K40240M09741J65576l51446k3506J47314j48624
$$ -293696 -267260 -342239 -464254 -224014 185727 351303 -143 -23649 123665 -24959
6076b4959j83564k34277M6007K44821L55587m3000j13555l5621Q404J7513M3978
$$ -24959 -208523 -442800 -396793 -151972 203615 160615 47060 11439 19843 37356 81334
6065H1334q5732O0889J35648j49500P9023J2021k90615k18941K83753J80792r4149
$$ 81334 -4398 56491 192139 42639 121662 133683 -156932 -375873 -92120 88672 -5477
6054e477o4338P1402m7456m3006M2244k35364J80280P7145M7127J88591L8663
$$ -5477 -69815 1587 -45869 -88875 -46631 -281995 -101715 -24570 22557 211148 249811
6043B49811p9754j20851j05514j44353J4949Q8088J41728N4086k3937Q925j58638
$$ 249811 170057 49206 -56308 -200661 -185712 -97624 44104 98190 74253 83178 -75460
6032g5460K1867M7305M3119K3630j49943q096j23768m1502j7980J05967k5965
$$ -75460 -53593 -6288 36831 60461 -89482 -97578 -221346 -262848 -280828 -174861 -200826
6021b00826q0083k49944p889J78321K87385K21849K4382j80690j40330M4824P9222
$$ -200826 -280909 -530853 -538742 -360421 -73036 148813 173195 -7495 -147825 -103001 -23779
6010b3779l1353q1341J9442j63008J16596j02676q8218n0218J12666M4349k6081
$$ -23779 -55132 -136473 -117031 -280039 -163443 -266119 -354337 -404555 -291889 -247540 -273621
5999b73621K1847n2489k7780J34894J46123j98004j47685l3640M2717N7928J92646
$$ -273621 -251774 -304263 -332043 -197149 -51026 -249030 -396715 -430355 -387638 -329710 -137064
5988a37064j18511K2952J5793j24963r1905J98291K76927j57883j72644J38266
$$ -137064 -255575 -232623 -216830 -341793 -433698 -235407 41520 -116363 -289007 -150741
5978a50741K66948L7323K3891J75696q7171j8072o6543j4361j75607k95125m2843
$$ -150741 116207 153530 177421 353117 265946 247874 181331 166970 -8637 -303762 -346605
5967c46605M9889j50997K0013P9769Q6304J47999K90369J03567j16520j47570
$$ -346605 -296716 -447713 -427700 -347931 -261627 -113628 176741 280308 163788 16218
5957A6218r1607N2053r6934J27642Q8689k08423R784m9635O0059O5145p4865j16481
$$ 16218 -75389 -23336 -120270 7372 96061 -112362 -102578 -152213 -92154 -27009 -101874 -218355
5945b18355l3482l3620j5927J66972N6684l40809J33506K92741L7777j45063o9690
$$ -218355 -251837 -285457 -301384 -134412 -77728 -418537 -285031 7710 45487 -99576 -169266
5934a69266p6807J62165N6341O5492J08827L03066q2334l86149q3461K11082o176
$$ -169266 -246073 -83908 -27567 37925 146752 449818 367484 -18665 -102126 108956 102780
5923A02780K1706j05487o4317M745L5236J87991M5986j50695k67519M4150m0174
$$ 102780 124486 18999 -45318 -40573 -5337 182654 228640 77945 -189574 -145424 -185598
5912a85598j90441j7583K50215K18839o4794R4420j44889j34453o3731p4690R3267
$$ -185598 -376039 -393622 -143407 75432 10638 105058 -39831 -174284 -238015 -312705 -219438
5901b19438K06386j7693n3848j4421j17735k79330j46291J06434J25892J45887
$$ -219438 -13052 -30745 -84593 -99014 -216749 -496079 -642370 -535936 -410044 -264157
5891b64157J89240N2790j80094k68893K63601L64524j21300o9955m4843N0463
$$ -264157 -74917 -22127 -202221 -471114 -207513 157011 35711 -34244 -79087 -28624
5881b8624l38348j91864J43882J32438Q2349J28458M3960M0457k12646k26192
$$ -28624 -366972 -558836 -414954 -282516 -200167 -71709 -27749 12708 -199938 -426130
5871d26130O4211L35156L3411k16960K12359K11309o0397j79315l5794J9721K13144
$$ -426130 -361919 -26763 6648 -210312 2047 213356 152959 -26356 -62150 -42429 170715
5860A70715J55288k5831r0335k04501l04675m8353J39861m7501j11339J52346
$$ 170715 326003 300172 209837 5336 -299339 -347692 -207831 -255332 -366671 -214325
5850b14325K34003J25564j22626J00191K04376O1379l39480o0473J10807N2835
$$ -214325 19678 145242 22616 122807 327183 388562 49082 -11391 99416 152251
5840A52251k2799j61234k08110o2098j730K27444l8849n4622J84737P2802N5417
$$ 152251 129452 -31782 -239892 -301990 -303720 -76276 -115125 -169747 14990 87792 143209
5829A43209j15110P6350J06472J6657l09659p1856L2942Q2629j59442J16863J51884
$$ 143209 28099 104449 210921 227578 -82081 -153937 -120995 -38366 -197808 -80945 70939
5818G0939m0978K6007j37388l6699l28849o7332k21679j7629K17567Q168L7210
$$ 70939 29961 55968 -81420 -118119 -446968 -514300 -735979 -753608 -536041 -527873 -490663
5807d90663L02577K20452J38036K6483k1806P4455j93506j28407J25406o7683
$$ -490663 -188086 32366 170402 196885 175079 249534 56028 -72379 53027 -14656
$$ [...]
##END NTUPLES=NMR SPECTRUM
##END=
