##TITLE=Analysis number 322494
Compound Code cc 63610
Book Reference 470/103
Project Code adrs
Chemist Name mikem
##JCAMPDX= 6.0         $$ Bruker NMR JCAMP-DX V2.0
##DATA TYPE= NMR SPECTRUM
##DATA CLASS= NTUPLES
##ORIGIN= Bruker BioSpin GmbH
##OWNER= nmr
$$ XWIN-NMR		Version 3.5
$$ Thu Sep 28 10:06:09 2006 GMT Daylight Time (UT+1h)  MAYBRIDGE\nmr@NMR_250MHZ
##.OBSERVE FREQUENCY= 250.131544655141
##.OBSERVE NUCLEUS= ^1H
##.ACQUISITION MODE= SIMULTANEOUS (DQD)
##.ACQUISITION SCHEME= undefined
##.AVERAGES= 16
##.DIGITISER RES= 18
##SPECTROMETER/DATA SYSTEM= dpx250
##.PULSE SEQUENCE= zg30
##.SOLVENT NAME= CDCl3
##.SHIFT REFERENCE= (INTERNAL, CDCl3, 0, 16.522)
##AUDIT TRAIL= $$ (NUMBER, WHEN, WHO, WHERE, WHAT)
$$ ##TITLE= Audit trail, XWIN-NMR		Version 3.5
$$ ##JCAMPDX= 5.01
$$ ##ORIGIN= Bruker BioSpin GmbH
$$ ##OWNER= nmr
$$ C:\u/data/dgb/nmr/ADRS/1570/pdata/1/auditp.txt
$$ ##AUDIT TRAIL=  $$ (NUMBER, WHEN, WHO, WHERE, WHAT)
(   1,<2006-09-28 10:05:41.84 +100>,<MAYBRIDGE\nmr>,<NMR_250MHZ>,
      <created by zg, POWCHK disabled, PULCHK disabled
       configuration hash MD5:
       E2 DF 36 D8 04 B2 41 60 5A D7 A3 38 5A 4B D0 FE
       data hash MD5: 64K
       91 63 D0 54 F6 92 E9 33 7E 3A 62 2C 3E FB 50 68>)
(   2,<2006-09-28 10:05:57.50 +100>,<MAYBRIDGE\nmr>,<NMR_250MHZ>,
      <Start of raw data processing
       ef LB = 0.3 FT_mod = 6 PKNL = 1 SI = 32K 
       data hash MD5: 32K
       39 EC 55 77 CA 58 48 3D 20 7F 01 40 BF 6F 1A A8>)
(   3,<2006-09-28 10:05:59.27 +100>,<MAYBRIDGE\nmr>,<NMR_250MHZ>,
      <apk 
       data hash MD5: 32K
       3E EA B7 F6 4A A8 7C 3B 53 2B 77 24 6A B1 63 2C>)
(   4,<2006-09-28 10:06:00.03 +100>,<MAYBRIDGE\nmr>,<NMR_250MHZ>,
      <abs ABSG = 5 
       data hash MD5: 32K
       B1 4B 2F 3E 23 C9 C5 80 90 75 23 49 74 60 5E 1E>)
$$ ##END=
$$ 
$$ hash MD5
$$ ED 29 30 9D 6C 52 62 B3 56 C8 F6 CA 5E 8B AD 76
##$RELAX= 
##$RELAX= 
##$RELAX= 
##$RELAX= 
##$RELAX= 
##$RELAX= 
##$RELAX= 
$$ Bruker specific parameters
$$ --------------------------
##$DU= <C:\u>
##$EXPNO= 1570
##$NAME= <ADRS>
##$PROCNO= 1
##$TYPE= <nmr>
##$USER= <dgb>
##$AMP= (0..31)
100 100 100 100 100 100 100 100 100 100 100 100 100 100 100 100 100 100 
100 100 100 100 100 100 100 100 100 100 100 100 100 100 
##$AQSEQ= 0
##$AQ_mod= 3
##$AUNM= <au_zg>
##$AUTOPOS= <25 >
##$BF1= 250.13
##$BF2= 250.13
##$BF3= 250.13
##$BF4= 250.13
##$BF5= 500.13
##$BF6= 500.13
##$BF7= 500.13
##$BF8= 500.13
##$BYTORDA= 1
##$CFDGTYP= 0
##$CFRGTYP= 5
##$CHEMSTR= <none>
##$CNST= (0..31)
1 1 145 1 1 1 1 1 1 1 1 1 1 1 1 1 1 1 1 1 1 1 1 1 1 1 1 1 1 1 1 1 
##$CPDPRG= <>
##$CPDPRG1= <>
##$CPDPRG2= <>
##$CPDPRG3= <>
##$CPDPRG4= <mlev>
##$CPDPRG5= <mlev>
##$CPDPRG6= <mlev>
##$CPDPRG7= <mlev>
##$CPDPRG8= <mlev>
##$CPDPRGB= <>
##$CPDPRGT= <>
##$D= (0..31)
0 1 0 0 0 0 0 0 0 0.06 0 0 0 0 0 0 0.0002 0 0 0 0 0 0 0 0 0 0 0 0 0 0 
0 
##$DATE= 1159434340
##$DBL= (0..7)
120 120 120 120 120 120 120 120 
##$DBP= (0..7)
150 150 150 150 150 150 150 150 
##$DBP07= 0
##$DBPNAM0= <>
##$DBPNAM1= <>
$$ [...]
##$SUBNAM7= <"">
##$SUBNAM8= <"">
##$SUBNAM9= <"">
##$SW= 20.6930455092707
##$SWIBOX= (0..15)
0 0 3 0 0 0 0 0 0 0 0 0 0 0 0 0 
##$SW_h= 5175.983436853
##$TD= 65536
##$TD0= 1
##$TE= 295.16
##$TE2= 300
##$TE3= 300
##$TEG= 300
##$TL= (0..7)
0 120 120 120 120 120 120 120 
##$TP= (0..7)
150 150 150 150 150 150 150 150 
##$TP07= 0
##$TPNAME0= <>
##$TPNAME1= <>
##$TPNAME2= <>
##$TPNAME3= <>
##$TPNAME4= <>
##$TPNAME5= <>
##$TPNAME6= <>
##$TPNAME7= <>
##$TPOAL= (0..7)
0.5 0.5 0.5 0.5 0.5 0.5 0.5 0.5 
##$TPOFFS= (0..7)
0 0 0 0 0 0 0 0 
##$TUNHIN= 0
##$TUNHOUT= 0
##$TUNXOUT= 0
##$USERA1= <user>
##$USERA2= <user>
##$USERA3= <user>
##$USERA4= <user>
##$USERA5= <user>
##$V9= 5
##$VALIST= <valist>
##$VCLIST= <CCCCCCCCCCCCCCC>
##$VD= 0
##$VDLIST= <DDDDDDDDDDDDDDD>
##$VPLIST= <PPPPPPPPPPPPPPP>
##$VTLIST= <TTTTTTTTTTTTTTT>
##$WBST= 1024
##$WBSW= 4
##$XGAIN= (0..3)
0 0 0 0 
##$XL= 0
##$YL= 0
##$YMAX_a= 794016
##$YMIN_a= -965689
##$ZGOPTNS= <>
##$ZL1= 120
##$ZL2= 120
##$ZL3= 120
##$ZL4= 120
##$ABSF1= 16.522
##$ABSF2= -4.171173
##$ABSG= 5
##$ABSL= 3
##$ALPHA= 0
##$AQORDER= 0
##$ASSFAC= 0
##$ASSFACI= 0
##$ASSFACX= 0
##$ASSWID= 0
##$AUNMP= <proc_1d>
##$AZFE= 0.1
##$AZFW= 0.1
##$BCFW= 0
##$BC_mod= 0
##$BYTORDP= 0
##$COROFFS= 0
##$CY= 12.5
##$DATMOD= 1
##$DC= 0
##$DFILT= <>
##$DTYPP= 0
##$F1P= 14.0000005364418
##$F2P= -0.99999901652339
##$FCOR= 0.5
##$FTSIZE= 32768
##$FT_mod= 6
##$GAMMA= 0
##$GB= 0
##$INTBC= 1
##$INTSCL= 1
##$ISEN= 128
##$LB= 0.3
##$LEV0= 0
##$LPBIN= 0
##$MAXI= 10000
##$MC2= 0
##$MEAN= 0
##$ME_mod= 0
##$MI= 0
##$NCOEF= 0
##$NC_proc= -4
##$NLEV= 6
##$NOISF1= 0
##$NOISF2= 0
##$NSP= 0
##$NTH_PI= 0
##$NZP= 0
##$OFFSET= 16.522
##$PC= 1
##$PHC0= 150.3482
##$PHC1= 6.56641
##$PH_mod= 1
##$PKNL= yes
##$PPARMOD= 0
##$PSCAL= 4
##$PSIGN= 0
##$REVERSE= no
##$SF= 250.13
##$SI= 32768
##$SIGF1= 0
##$SIGF2= 0
##$SINO= 400
##$SIOLD= 32768
##$SREGLST= <1H.CDCl3>
##$SSB= 0
##$STSI= 32768
##$STSR= 0
##$SW_p= 5175.98343685301
##$SYMM= 0
##$S_DEV= 0
##$TDeff= 65536
##$TDoff= 0
##$TI= <Analysis number 999999
Compound Code 99
Book Reference 9
Project Code 9>
##$TILT= no
##$TM1= 0
##$TM2= 0
##$TOPLEV= 0
##$USERP1= <user>
##$USERP2= <user>
##$USERP3= <user>
##$USERP4= <user>
##$USERP5= <user>
##$WDW= 1
##$XDIM= 32768
##$YMAX_p= 551710737
##$YMIN_p= -283853
$$ End of Bruker specific parameters
$$ ---------------------------------
##NTUPLES= NMR SPECTRUM
##VAR_NAME=  FREQUENCY,     SPECTRUM/REAL,   SPECTRUM/IMAG
##SYMBOL=    X,             R,               I
##VAR_TYPE=  INDEPENDENT,   DEPENDENT,       DEPENDENT
##VAR_FORM=  AFFN,          ASDF,            ASDF
##VAR_DIM=   32768,         32768,           32768
##UNITS=     HZ,            ARBITRARY UNITS, ARBITRARY UNITS
##FACTOR=    0.157963299565203, 1,           1
##FIRST=     4132.6476996994, 0,             0
##LAST=      -1043.33573715361, 0,           0
##MIN=       -1043.33573715361, -283853,     0
##MAX=       4132.6476996994, 551710737,     0
$$ Real data points
##PAGE= N=1
##DATA TABLE= (X++(R..R)), XYDATA
$$ [...]
$$ plain form
20036 30690 27853 40356 50482 43735 38533 48055 49723 43366 25618 4462 1205 -11689 -26207
20023 -26207 -18734 9629 14287 10490 9387 -429 708 2452 28237 39553 11338 -7679 -3569
20010 -3569 3242 3135 -13041 3611 21834 41609 29012 24703 33883 32929 -9575 -13895 5295
19997 5295 18388 -1073 1457 -10510 9447 22295 -4208 -6731 13116 -5069 4270 23558
19985 23558 29715 36240 14684 3515 5098 34188 30224 49375 66484 87159 59743 16943
19973 16943 14633 16637 18304 51864 47750 11288 20873 37962 37223 28118 24050 991 -7983 9462
19959 9462 3379 -4424 -2470 -2893 5613 30394 55995 64615 47210 40317 51041 40186 40106 55266
19945 55266 53896 29944 23967 12289 -1305 4302 -3705 -17120 -27860 5373 46267 71261
$$ packed form
20036C0690k837J2503J0126o747n202R522J668o357j7748k1156l257j2894j4518
20023b6207P473K8363M658l797j103r816J137J744K5785J1316k8215j9017M110
20010c569O811j07j6176J6652J8223J9775j2597m309R180r54m2504m320J9190
19997E295J3093j9461K530j1967J9957J2848k6503k523J9847j8185R339J9288
19985B3558O157O525k1556j1169J583K9090l964J9151J7109K0675k7416m2800
19973A6943k310K004J667L3560m114l6462R585J7089p39r105m068k3059q974J7445
19959I462o083p803J954m23Q506K4781K5601Q620j7405o893J0724j0855q0J5160
19945E5266j370k3952n977j1678j3594N607q007j3415j0740L3233M0894K4994
$$ plain form
19933 71261 66882 73766 54332 59844 67473 46344 51258 63974 68096 59189 69847 48043 11045
19920 11045 9928 39647 63323 75874 48587 33153 37292 41815 20776 20726 25069 18177 -4854
19907 -4854 9921 35877 36783 22438 7217 16475 24432 30368 32133 23567 9696 -14432 -16564
19894 -16564 10751 14163 15469 4153 -8586 -14597 399 24018 7853 -10689 12028 41472
19882 41472 16703 -10108 -1328 -2582 626 -19884 -32249 -29603 -33566 -19398 -21747 -17025 -4709
19869 -4709 4405 13043 -1254 -1161 39620 67398 64724 40830 42995 49358 30101 2174 11653 28211
19855 28211 48778 56227 48186 89508 103691 112558 140715 128730 99167 92985 95924 112238 105521
19842 105521 113809 142815 137788 143203 145974 153529 161944 166068 171200 163761 147636 130476 137291
$$ packed form
19933G1261m379O884j9434N512P629k1129M914J2716M122q907J0658k1804l6998
19920A1045j117K9719K3676J2551k7287j5434M139M523k1039n0M343o892k3031
19907d854J4775K5956R06j4345j5221R258P957N936J765q566j3871k4128k132
19894a6564K7315L412J306j1316j2739o011J4996K3619j6165j8542K2717K9444
19882D1472k4769k6811Q780j254L208k0510j2365K646l963J4168k349M722J2316
19869d709R114Q638j4297R3M0781K7778k674k3894K165O363j9257k7927R479J6558
19855B8211K0567P449q041M1322J4183Q867K8157j1985k9563o182K939J6314o717
19842A05521Q288K9006n027N415K771P555Q415M124N132p439j6125j7160O815
$$ plain form
19829 137291 117954 113127 126194 109148 104440 134338 166555 157668 116469 106044 143218 148415
19817 148415 120005 96365 94901 69578 46301 48347 37059 43950 65123 76298 80130 72403
19805 72403 78316 105726 115630 95256 72739 76849 84574 92486 115816 110802 108171 82158 77865
19792 77865 73110 87247 90789 58241 46532 30868 32662 66307 54583 55325 43823 42623 51253
19779 51253 44927 25715 4837 13991 34907 5821 16785 51689 76776 62738 34328 36896
19767 36896 69606 84112 66867 36234 34196 35825 12284 18972 19863 20920 -4473 -19113 -25512
19754 -25512 -14636 3186 5585 10432 8811 28642 55535 49919 59928 53743 51633 25020 19531
19741 19531 36910 29004 -1885 -15434 -1094 29533 30612 18851 -5483 -12911 16900 29054
$$ packed form
19829A37291j9337m827J3067j7046m708K9898L2217q887m1199j0425L7174N197
19817A48415k8410k3640j464k5323k3277K046j1288O891K1173J1175L832p727
19805G2403N913K7410R904k0374k2517M110P725P912K3330n014k631k6013m293
19792G7865m755J4137L542l2548j1709j5664J794L3645j1724P42j1502j200Q630
19779E1253o326j9212k0878R154K0916k9086J0964L4904K5087j4038k8410K568
19767C6896L2710J4506j7245l0633k038J629k3541O688Q91J057k5393j4640o399
19754b5512J0876J7822K399M847j621J9831K6893n616J0009o185k110k6613n489
19741A9531J7379p906l0889j3549J4340L0627J079j1761k4334p428K9811J2154
$$ plain form
19729 29054 51850 62972 62398 47631 9614 30667 45663 49962 57721 51408 42844 71956 110174
19716 110174 101806 108043 105203 66119 49969 38331 38065 25861 46099 82066 108018 91757
19704 91757 79513 51906 54604 50786 54943 53884 51747 49710 64736 66094 39405 22232 13510
19691 13510 22877 30184 29610 -3274 1952 -4378 -15405 -38060 -41195 -17008 32693 50783 40689
19678 40689 47393 74418 81341 49886 53741 81600 98806 67157 40871 37374 45349 42554 23478
19665 23478 24236 50946 66719 92027 85213 70837 83588 86087 65641 109489 142752 128585
19653 128585 99880 90321 74756 83985 99841 115621 96996 105524 157343 197606 213887 213388
19641 213388 181933 191954 188470 191086 223726 260253 288878 267678 273494 275204 232506 210395
$$ packed form
19729B9054K2796J1122n74j4767l8017K1053J4996M299P759o313q564K9112L8218
19716A10174q368O237k840l9084j6150j1638k66j2204K0238L5967K5952j6261
19704I1757j2244k7607K698l818M157j059k137k037J5026J358k6689j7173q722
19691A3510R367P307n74l2884N226o330j1027k2655l135K4187M9701J8090j0094
19678D0689O704K7025O923l1455L855K7859J7206l1649k6286l497P975k795j9076
19665B3478P58K6710J5773K5308o814j4376J2751K499k0446M3848L3263j4167
19653A28585k8705r559j5565R229J5856J5780j8625Q528N1819M0263J6281m99
19641B13388l1455J0021l484K616L2640L6527K8625k1200N816J710m2698k2111
$$ plain form
19629 210395 194247 200880 210179 209054 210389 236361 243691 244127 222353 208670 199770 185582 156005
19616 156005 151103 142609 106738 122508 125157 122292 142953 153304 157075 94941 69829 81586
19604 81586 93382 101001 102485 100164 113634 94291 82870 85943 65420 49063 79450 102935
19592 102935 126226 103657 119074 158359 174490 178847 187195 181557 179803 169019 150744 143391
19580 143391 152760 154625 152316 142753 130142 111757 118248 122369 111721 120674 140409 138092 107857
19567 107857 69692 80841 92823 86023 90515 105580 103229 95395 86448 93276 117048 101401 104642
19554 104642 87393 80753 99332 99630 71857 72875 102379 95223 99789 112369 81257 73263 88643
19541 88643 93294 66519 71224 105511 122988 88168 67378 62198 86896 98745 83781 81561
$$ packed form
19629B10395j6148O633R299j125J335K5972P330M36k1774j3683q900j4188k9577
19616A56005m902q494l5871J5770K649k865K0661J0351L771o2134k5112J1757
19604H1586J1796P619J484k321J3470j9343j1421L073k0523j6357L0387K3485
19592A02935K3291k2569J5417L9285J6131M357Q348n638j754j0784j8275p353
19580A43391R369J865k309r563j2611j8385O491M121j0648Q953J9735k317l0235
19567A07857l8165J1149J1982o800M492J5065k351p834q947O828K3772j5647L241
19554A04642j7249o640J8579K98k7773J018K9504p156M566J2580l1112p994J5380
19541H8643M651k6775M705L4287J7477l4820k0790n180K4698J1849j4964k220
$$ plain form
19529 81561 86835 56311 61258 84051 94343 106082 114409 93199 56937 26044 61090 82069
19517 82069 69084 60137 56011 44722 37649 38799 30091 16298 28037 36994 49781 65496 87033
19504 87033 81123 77874 76364 79638 103731 105163 123592 116617 111370 82587 62951 52793 44983
19491 44983 43199 56695 77666 57152 53751 53843 70379 77034 42961 21167 49264 87149 106860
19478 106860 93589 93872 59719 54385 78112 54685 19774 55546 80880 74438 78894 88469 112693
19465 112693 131711 140200 114908 91260 94509 80012 56397 35701 22473 31915 34870 39758
19453 39758 57328 71742 84086 82858 77039 55921 47331 45726 58660 101011 107644 90202 85799
19440 85799 91359 113022 94697 65187 85267 69468 59700 76975 73316 81890 111040 131106
$$ packed form
19529H1561N274l0524M947K2793J0292J1739Q327k1210l6262l0893L5046K0979
19517H2069j2985q947m126j1289p073J150q708j3793J1739Q957J2787J5715K1537
19504H7033n910l249j510L274K4093J432J8429o975n247k8783j9636j0158p810
19491D4983j784J3496K0971k0514l401R2J6536O655l4073k1794K8097L7885J9711
19478A06860j3271K83l4153n334K3727k3427l4911L5772K5334o442M456R575K4224
19465A12693J9018Q489k5292k3648L249j4497k3615k0696j3228R442K955M888
19453C9758J7570J4414J2344j228n819k1118q590j605J2934M2351O633j7442m403
19440H5799N560K1663j8325k9510K0080j5799r768J7275l659Q574K9150K0066
$$ plain form
19428 131106 136773 110122 91678 109463 88008 75328 81829 85634 80403 69807 57734 68842
19416 68842 60236 72501 85345 94324 86481 75245 70755 76161 78848 84901 117199 117482 100151
19403 100151 111611 100773 99490 98665 85536 99647 112771 100687 83751 56481 48861 61767
19391 61767 63089 66233 63672 66822 87737 99617 107317 149813 157829 151058 139862 124308 117637
19378 117637 120669 118340 120973 116335 115726 123983 122436 99179 119835 136830 129254 113332 103153
19365 103153 108031 134310 130024 115729 104813 133911 120363 130925 169427 200143 219867 275802
19353 275802 300028 318929 358025 355324 340250 317287 307557 303316 328569 384893 441783 453839
19341 453839 450509 461656 491510 503897 448212 384405 349020 329946 322179 338322 353070 372501
$$ packed form
19428A31106N667k6651j8444J7785k1455j2680O501L805n231j0596j2073J1108
19416F8842q606J2265J2844Q979p843j1236m490N406K687O053L2298K83j7331
19403A00151J1460j0838j283q25j3129J4111J3124j2084j6936k7270p620J2906
19391F1767J322L144k561L150K0915J1880P700M2496Q016o771j1196j5554o671
19378A17637L032k329K633m638o09Q257j547k3257K0656J6995p576j5922j0179
19365A03153M878K6279m286j4295j0916K9098j3548J0562L8502L0716J9724N5935
19353B75802K4226J8901L9096k701j5074k2963r730m241K5253N6324N6890J2056
19341D53839l330J1147K9854J2387n5685o3807l5385j9074p767J6143J4748J9431
$$ plain form
19329 372501 375723 373415 341518 343929 310030 243850 192920 186827 196893 211728 210157 217855 245431
19316 245431 265366 264907 243994 219482 232924 257539 225487 203455 213386 202699 188236 181800
19304 181800 199012 219378 197417 177952 170050 176117 181886 196950 205425 192616 179859 162325
19292 162325 149525 138624 127272 135254 135735 144729 180016 202530 193149 158691 130140 130251 138183
19279 138183 154615 151745 162698 167860 167873 186628 180335 180899 190993 201812 196842 197042 211676 217289
19265 217289 206149 241143 235952 227513 237316 236411 255952 234317 195508 182906 183250 199044 226294
19252 226294 227579 198325 195551 187858 158044 144538 159240 170253 186832 197294 231965 286245
19240 286245 345016 402359 452284 490746 516953 553878 597457 660062 686957 697625 718964
$$ packed form
19329C72501L222k308l1897K411l3899o6180n0930o093J0066J4835j571P698K7576
19316B45431J9935m59k0913k4512J3442K4615l2052k2032R931j0687j4463o436
19304A81800J7212K0366k1961j9465p902O067N769J5064Q475j2809j2757j7534
19292A62325j2800j0901j1352P982M81Q994L5287K2514r381l4458k8551J11P932
19279A38183J6432k870J0953N162J3J8755o293N64J0094J0819m970K00J4634N613
19265B17289j1140L4994n191q439R803r05J9541k1635l8809j2602L44J5794K7250
19252B26294J285k9254k774p693k9814j3506J4702J1013J6579J0462L4671N4280
19240B86245N8771N7343M9925L8462K6207L6925M3579O2605K6895J0668K1339
$$ plain form
19229 718964 761412 800011 867039 927254 956588 955702 970947 1005069 1010943 997528 964205 946384
19217 946384 940151 881464 835852 794301 777841 745834 723809 653080 623354 631636 604722 562294
19205 562294 510960 451907 374609 333529 321636 297895 277338 286573 280995 259915 267137 272455
19193 272455 287060 268776 262315 234716 219480 253143 215024 192686 204338 192938 173443 167376
19181 167376 164406 139088 134231 178398 198357 209878 211612 232297 225956 216614 213968 225210 221656
19168 221656 214712 210107 227955 224661 213021 202279 196550 196612 197667 223189 222004 205577 207760
19155 207760 207355 189595 168647 187319 211034 207025 220534 232002 227931 203756 203015 185901 165781
19142 165781 170136 151050 154857 145580 133525 151641 184559 218408 210772 224538 247251 245871
$$ packed form
19229G18964M2448L8599O7028O0215K9334q86J5245L4122N874j3415l3323j7821
19217I46384o233n8687m5612m1551j6460l2007k2025p0729k9726Q282k6914m2428
19205E62294n1334n9053p7298m1080j1893k3741k0557R235n578k1080P222N318
19193B72455J4605j8284o461k7599j5236L3663l8119k2338J1652j1400j9495o067
19181A67376k970k5318m857M4167J9959J1521J734K0685o341r342k646J1242l554
19168B21656o944m605J7848l294j1640j0742n729O2J055K5522j185j6427K183
19155B07760m05j7760k0948J8672K3715m009J3509J1468m071k4175p41j7114k0120
19142A65781M355j9086L807r277j2055J8116L2918L3849p636J3766K2713j380
$$ plain form
19130 245871 249953 224073 179521 172356 187520 197421 172580 164208 178636 217460 224268 221160 231852
19117 231852 230789 187018 176170 204285 211449 213921 204954 190439 187627 168616 176339 199934 197730
19104 197730 205793 225229 199518 175502 185789 179849 198990 224477 227321 206199 173369 151699
19092 151699 156230 175444 188112 196718 202424 189585 167014 162070 178685 196813 195589 233347
19080 233347 230470 202926 178449 160461 162697 138281 162854 219484 210487 227366 222753 224753
19068 224753 222519 209588 200462 189210 161454 152414 176667 181466 190521 196510 167211 157317 152388
19055 152388 121716 140363 158491 167692 173504 171396 181180 176125 164103 174158 193776 204580
19043 204580 221889 261725 285952 272994 265721 286404 292225 320168 323534 336120 354387 338777
$$ packed form
19130B45871M082k5880m4552p165J5164R901k4841q372J4428L8824O808l108J0692
19117B31852j063m3771j0848K8115P164K472q967j4515k812j9011P723K3595k204
19104A97730Q063J9436k5711k4016J0287n940J9141K5487K844k1122l2830k1670
19092A51699M531J9214J2668Q606N706j2839k2571m944J6615J8128j224L7758
19080B33347k877k7544k4477j7988K236k4416K4573N6630q997J6879m613K000
19068B24753k234j2931r126j1252k7756r040K4253M799R055N989k9299r894m929
19055A52388l0672J8647J8128R201N812k108R784n055j2022J0055J9618J0804
19043B04580J7309L9836K4227j2958p273K0683N821K7943L366J2586J8267j5610
$$ plain form
19031 338777 332257 355097 368582 406504 421217 432282 452720 492585 503306 528450 576017 630475
19019 630475 669489 676746 641902 656669 685108 687940 721596 725964 698691 700662 727211 740580
19007 740580 741428 745204 739091 743404 757227 759741 769459 751764 738220 726287 688116 657010 640863
18994 640863 590490 552959 546078 544100 531236 532093 549993 559465 554291 548811 552093 581640 640138
18981 640138 670937 686032 704547 701840 721454 720331 737449 752896 804753 858319 880238 908229
18969 908229 939269 948227 946205 918309 904035 935035 960147 983288 990260 1014537 1033197 1033388
18957 1033388 1048619 1036165 1038194 1021534 1021915 1012754 1013937 1017763 990923 952488 910628 855688
18945 855688 814788 771285 736124 700720 657632 682778 669746 650442 651232 648429 634817 645388
$$ packed form
19031C38777o520K2840J3485L7922J4713J1065K0438L9865J0721K5144M7567N4458
19019F30475L9014P257l4844J4767K8439K832L3656M368k7273J971K6549J3369
19007G40580Q48L776o113M313J3823K514R718j7695j3544j1933l8171l1106j6147
18994F40863n0373l7531o881j978j2864Q57J7900R472n174n480L282K9547N8498
18981F40138L0799J5095J8515k707J9614j123J7118J5447N1857N3566K1919K7991
18969I08229L1040Q958k022k7896j4274L1000K5112K3141O972K4277J8660J91
18957A033388J5231j2454K029j6660L81r161J183L826k6840l8435m1860n4940
18945H55688m0900m3503l5161l5404m3088K5146j3032j9304P90k803j3612J0571
$$ plain form
18933 645388 631535 598779 604797 591266 585602 611457 659351 669445 645242 642458 666799 665530
18921 665530 645360 645846 653328 646531 628024 593490 599595 625779 616268 607977 628237 640200 667602
18908 667602 700745 714818 703837 707442 708931 707243 703127 692539 691060 704254 704544 703426 715023
18895 715023 756344 789212 773103 726681 714163 748493 757019 739822 706718 679513 671026 654448
18883 654448 646491 660492 633760 586168 575884 591206 610901 598450 585997 587144 583461 595536
18871 595536 600887 593850 598352 606558 586871 597808 610081 616944 645265 646130 604622 595958 604174
18858 604174 632669 641076 639463 652936 667177 673439 689930 711463 724609 746969 751538 775401
18846 775401 807517 803748 824295 852614 887508 914149 952463 1013428 1033620 1052235 1094519 1130285
$$ packed form
18933F45388j3853l2756O018j3531n664K5855M7894J0094k4203k784K4341j269
18921F65530k0170M86P482o797j8507l4534O105K6184r511q291K0260J1963K7402
18908F67602L3143J4073j0981L605J489j688m116j0588j479J3194K90j118J1597
18895G15023M1321L2868j6109m6422j2518L4330Q526j7197l3104k7205q487j6578
18883F54448p957J4001k6732m7592j0284J5322J9695j2451j2453J147l683J2075
18871E95536N351p037M502Q206j9687J0937J2273O863K8321Q65m1508q664Q216
18858F04174K8495Q407j613J3473J4241O262J6491K1533J3146K2360M569K3863
18846G75401L2116l769K0547K8319L4894K6641L8314O0965K0192J8615M2284L5766
$$ plain form
18834 1130285 1163042 1181938 1211276 1222744 1207082 1169905 1159644 1129944 1107529 1087093 1067422
18823 1067422 1057512 1004916 976974 962741 948523 920066 914019 899328 907998 894448 867557 868063
18811 868063 871059 867307 866097 859684 873385 915613 952081 984297 988286 1003878 1035165 1031371 1074568
18798 1074568 1136290 1155932 1220236 1258054 1318297 1394169 1451654 1509322 1548545 1612355 1684959
18787 1684959 1757514 1813554 1852444 1889218 1932878 1966066 1955972 1917727 1920920 1926410 1893680 1897280
18775 1897280 1914416 1910798 1943574 1974444 1958100 1922143 1857521 1802652 1767643 1733281 1703144
18764 1703144 1670763 1649408 1670698 1683704 1673251 1657503 1664403 1698843 1743665 1773959 1789863
18753 1789863 1812818 1843608 1910726 2006950 2117088 2213562 2306263 2418903 2591365 2804212
$$ packed form
18834A130285L2757J8896K9338J1468j5662l7177j0261k9700k2415k0436j9671
18823A067422r910n2596k7942j4233j4218k8457o047j4691Q670j3550k6891N06
18811H68063K996l752j210o413J3701M2228L6468L2216L989J5592L1287l794M3197
18798A074568O1722J9642O4304L7818O0243P5872N7485N7668L9223O3810P2604
18787A684959P2555N6040L8890L6774M3660L3188j0094l8245L193N490l2730L600
18775A897280J7136l618L2776L0870j6344l5957o4622n4869l5009l4362l0137
18764A703144l2381k1355K1290J3006j0453j5748O900L4440M4822L0294J5904
18753A789863K2955L0790O7118R6224J10138R6474R2701J12640J72462K12847
$$ plain form
18743 2804212 3041772 3235086 3450647 3709109 3960068 4227627 4555083 4937183 5343820
18734 5343820 5785218 6313040 6951964 7681116 8474550 9389313 10548894 12119568 14306667
18725 14306667 17377670 21332774 26140868 32223570 39812574 48263927 56748793 64895351
18717 64895351 72878620 80588854 87084906 92537392 96805680 101616971 107941285 114046019
18709 114046019 121153814 130001035 139807003 148860328 155416575 160329005 162668583 161968926
18701 161968926 159250609 152417228 145298165 139474449 133860478 128878307 124476445 121622900
18693 121622900 119114890 115352348 110626363 103690159 95828216 87468971 77216318 67215514
18685 67215514 58480024 51206188 44626663 38870334 34640464 31692242 29476647 27636084
$$ packed form
18743B804212K37560J93314K15561K58462K50959K67559L27456L82100M06637
18734E343820M41398N27822O38924P29152P93434R14763J159581J570674K187099
18725A4306667L071003L955104M808094O082702P589004Q451353Q484866Q146558
18717F4895351P983269P710234O496052N452486M268288M811291O324314O104734
18709A14046019P107795Q847221R805968R053325O556247M912430K339578o99657
18701A61968926k718317o833381p119063n823716n613971m982171m401862k853545
18693A21622900k508010l762542m725985o936204p861943q359245j0252653j0000804
18685F7215514q735490p273836o579525n756329m229870k948222k215595j840563
$$ plain form
18677 27636084 26100512 24812466 23633410 22545675 21560953 20674325 19872325 19095330 18317213
18668 18317213 17598096 16921335 16264778 15655682 15131979 14647663 14175427 13737730 13350131
18659 13350131 12993496 12632028 12308544 11977500 11679170 11425837 11172608 10895399 10665658
18650 10665658 10481761 10288791 10115636 9987069 9839045 9688276 9508025 9267917 9016648
18641 9016648 8753095 8457359 8184762 7895992 7604396 7365616 7169238 6984101 6816654
18632 6816654 6631865 6456900 6291870 6124546 5991415 5881516 5756354 5613702 5481048
18623 5481048 5371767 5280164 5183032 5078598 4977635 4866777 4761324 4700925 4632828 4544187
18613 4544187 4446060 4352579 4259487 4198865 4138907 4060908 3967481 3916185 3862182 3834354 3821659
$$ packed form
18677B7636084j535572j288046j179056j087735r84722q86628q02000p76995p78117
18668A8317213p19117o76761o56557o09096n23703m84316m72236m37697l87599
18659A3350131l56635l61468l23484l31044k98330k53333k53229k77209k29741
18650A0665658j83897j92970j73155j28567j48024j50769j80251k40108k51269
18641I016648k63553k95736k72597k88770k91596k38780j96378j85137j67447
18632F816654j84789j74965j65030j67324j33131j09899j25162j42652j32654
18623E481048j09281r1603r7132j04434j00963j10858j05453o0399o8097q8641
18613D544187r8127r3481r3092o0622n9958p7999r3427n1296n4003k7828j2695
$$ plain form
18602 3821659 3819633 3808112 3813463 3833088 3841365 3842955 3844696 3817984 3770325 3687938 3552396 3433868
18590 3433868 3287267 3161313 3076179 3023160 2979564 2969614 2938972 2870240 2824458 2807592 2786371
18579 2786371 2772528 2754445 2725078 2714426 2699659 2644972 2600654 2552920 2509404 2472831 2423390
18568 2423390 2361884 2296036 2252699 2218187 2185869 2149071 2116396 2075047 2044999 2036991 2026130
18557 2026130 2000444 1975263 1922822 1875155 1854026 1870300 1854825 1828358 1818906 1833528 1850514
18546 1850514 1826718 1789281 1775851 1778635 1780285 1808026 1824985 1839823 1829680 1829092 1836716 1860004
18534 1860004 1880653 1907422 1920891 1946104 1966048 2031186 2075503 2079250 2113177 2158758 2237470
18523 2237470 2321007 2410225 2483240 2566657 2663458 2833724 2983058 3128058 3274367 3458504
$$ packed form
18602C821659k026j1521N351J9625Q277J590J741k6712m7659q2387j35542j18528
18590C433868j46601j25954q5134n3019m3596r950l0642o8732m5782j6866k1221
18579B786371j3843j8083k9367j0652j4767n4687m4318m7734m3516l6573m9441
18568B423390o1506o5848m3337l4512l2318l6798l2675m1349l0048q008j0861
18557B026130k5686k5181n2441m7667k1129J6274j5475k6467r452J4622J6986
18546A850514k3796l7437j3430K784J650K7741J6959J4838j0143n88P624K3288
18534A860004K0649K6769J3469K5213J9944O5138M4317L747L3927M5581P8712
18523B237470Q3537Q9218P3015Q3417R6801J70266J49334J45000J46309J84137
$$ plain form
18513 3458504 3696508 3937074 4215433 4541100 4929845 5431490 6077777 6964397 8268541
18504 8268541 10215948 12963742 16457600 20653457 25908586 31913346 37526585 42712533
18496 42712533 47709609 51647865 54647582 56819295 58266733 60763475 63664392 66266978
18488 66266978 68887901 71482048 73672768 73565748 71290997 69485134 67495970 64732250
18480 64732250 61818472 59500807 58517042 57519785 56080434 54342269 51904359 48811677
18472 48811677 44056399 38099644 33163461 28866581 24798362 21752867 19831783 18578018
18464 18578018 17740126 17140110 16755967 16524500 16448620 16559161 16821004 17348620 18308986
18455 18308986 19917078 22460483 26074816 30641673 36382796 43517568 51004266 57794397
$$ packed form
18513C458504K38004K40566K78359L25667L88745N01645O46287Q86620J304144
18504H268541J947407K747794L493858M195857N255129O004760N613239N185948
18496D2712533M997076L938256K999717K171713J447438K496742K900917K602586
18488F6266978K620923K594147K190720j07020k274751j805863j989164k763720
18480F4732250k913778k317665r83765r97257j439351j738165k437910l092682
18472D8811677m755278n956755m936183m296880m068219l045495j921084j253765
18464A8578018q37892o00016l84143k31467p5880J10541K61843N27616R60366
18455A8308986J608092K543405L614333M566857N741123P134772P486698O790131
$$ plain form
18447 57794397 64439908 70384628 74873281 78481289 80815452 83172834 86936466 90622817
18439 90622817 94197275 97878645 101208354 102994332 101247521 98464840 96006020 92712619
18431 92712619 88979087 85196271 82982593 81771524 79904045 77745939 74754451 70676387
18423 70676387 65143079 57020841 48972750 42305082 36044579 30708724 27011522 24472788
18415 24472788 22671390 21244264 20047141 19030986 18136661 17340568 16654030 16042385 15451042
18406 15451042 14918520 14373417 13838278 13365583 12942254 12544861 12137909 11763976 11443024
18397 11443024 11135374 10842324 10551388 10275023 10028040 9802145 9608385 9442253 9271053
18388 9271053 9105806 8963376 8833269 8701167 8572965 8484003 8392576 8248297 8098960 7923909
$$ packed form
18447E7794397O645511N944720M488653L608008K334163K357382L763632L686351
18439I0622817L574458L681370L329709J785978j746811k782681k458820l293401
18431I2712619l733532l782816k213678j211069j867479k158106k991488m078064
18423G0676387n533308q122238q048091o667668o260503n335855l697202k538734
18415B4472788j801398j427126j197123j016155q94325p96093o86538o11645n91343
18406A5451042n32522n45103n35139m72695m23329l97393m06952l73933l20952
18397A1443024l07650k93050k90936k76365k46983k25895j93760j66132j71200
18388I271053j65247j42430j30107j32102j28202q8962r1427j44279j49337j75051
$$ plain form
18378 7923909 7790250 7657619 7492026 7334392 7211983 7089477 6970038 6915602 6863650 6836494
18368 6836494 6785237 6773947 6758240 6756997 6743934 6742821 6764887 6796138 6895520 6991942 7082579 7191138
18356 7191138 7335753 7513466 7727897 7958337 8213810 8605516 9174686 9955917 11097020
18347 11097020 12800494 14995175 17433478 20325272 24160367 28762068 33149069 36871081
18339 36871081 40578981 44956216 49419064 53444349 56558280 59648473 63451978 66945441
18331 66945441 69313311 70832694 71872101 72192527 70244275 67608661 65235600 62954660
18323 62954660 60495797 57142405 53662977 50885682 48609595 45905473 41511361 36791080
18315 36791080 33408358 30746504 27970248 25117800 23072628 21844944 21112595 20662539
$$ packed form
18378G923909j33659j32631j65593j57634j22409j22506j19439n4436n1952k7156
18368F836494n1257j1290j5707j243j3063j113K2066L1251R9382R6422R0637J08559
18356G191138J44615J77713K14431K30440K55473L91706N69170P81231J141103
18347A1097020J703474K194681K438303K891794L835095M601701M387001L722012
18339C6871081L707900M377235M462848M025285L113931L090193L803505L493463
18331F6945441K367870J519383J039407L20426j948252k635614k373061k280940
18323F2954660k458863l353392l479428k777295k276087k704122m394112m720281
18315C6791080l382722k661854k776256k852448k045172j227684p32349m50056
$$ plain form
18307 20662539 20449189 20437652 20628339 21032556 21800003 23097944 25129922 28086859 32007351
18298 32007351 36756499 42180602 48214142 55176824 63445070 71458434 77798773 83575425
18290 83575425 90711850 99501202 108626939 117490790 126794365 140987936 160314013 180368955
18282 180368955 197868326 213141694 225464963 231911537 229511676 216342174 195866864
18275 195866864 175017009 155508087 140654419 130464271 124544406 121171204 117317989
18268 117317989 110493546 102344325 95629836 90614384 84888104 77916435 69530726 60201294
18260 60201294 52853411 48073085 44929607 42795369 41345743 40481539 40215818 40664564
18252 40664564 41884638 43589984 45365517 47349421 49674053 51766007 53520638 55124948
$$ packed form
18307B0662539k13350j1537J90687M04217P67447J297941K031978K956937L920492
18298C2007351M749148N424103O033540O962682Q268246Q013364O340339N776652
18290H3575425P136425Q789352R125737Q863851R303575J4193571J9326077K0054942
18282A80368955J7499371J5273368J2323269O446574k399861j3169502k0475310
18275A95866864k0849855j9508922j4853668j0190148n919865l373202l853215
18268A17317989o824443q149221o714489n015452n726280o971669q385709r329432
18260F0201294p347883m780326l143478k134238j449626q64204k65721M48746
18252D0664564J220074J705346J775533J983904K324632K091954J754631J604310
$$ plain form
18244 55124948 57224295 61613943 68067736 75457356 84704108 96808457 109563496 120385735
18236 120385735 129607423 137591689 145616108 153337882 157838602 160800094 166706963 173577960
18228 173577960 182061484 190194343 194490696 197935617 203548104 208236524 207471797 195928082
18220 195928082 170356895 144006342 124812735 109223125 93281473 78313991 68006322
18213 68006322 62021102 58841678 57349191 56490209 55806522 55437478 54981963 53874898 51786257
18204 51786257 48564305 45475951 43515981 42624428 42600116 43371654 45111344 48376053 53346067
18195 53346067 59102484 64102116 68502524 73003624 76446852 77663206 76060304 72768658
18187 72768658 73077650 78343839 87241602 100492445 119079424 141232181 164731085 187408102
$$ packed form
18244E5124948K099347M389648O453793P389620R246752J2104349J2755039J0822239
18236A20385735R221688P984266Q024419P721774M500720K961492N906869O870997
18228A73577960Q483524Q132859M296353L444921N612487M688420p64727j1543715
18220A95928082k5571187k6350553j9193607j5589610j5941652j4967482j0307669
18213F8006322n985220l179424j492487q58982o83687l69044m55515j107065k088641
18204E1786257l221952l088354j959970q91553k4312P71538J739690L264709M970014
18195E3346067N756417M999632M400408M501100L443228J216354j602902l291646
18187G2768658L08992N266189Q897763J3250843J8586979K2152757K3498904K2677017
$$ plain form
18179 187408102 207785327 227105702 243694038 254989731 256326174 249423420 233886409
18172 233886409 213073260 190785067 167297682 142743401 118460133 98261172 83957123
18165 83957123 74668360 68774598 64931060 61674009 58207513 53864461 49091122 45448329
18157 45448329 42869312 40975397 39488322 38148240 36781216 35333339 33954665 32853745
18149 32853745 31976134 31148832 30344995 29552117 28776457 28069692 27444262 26991929 26731691
18140 26731691 26653379 26771346 27106309 27763593 28831685 30503271 33247759 37666565 44806886
18131 44806886 55842292 71284469 90609499 112515048 135309526 156738642 173564397
18124 173564397 182391457 181265408 169731172 149923970 125547592 100263426 78654254
$$ packed form
18179A87408102K0377225J9320375J6588336J1295693J336443o902754j5537011
18172B33886409k0813149k2288193k3487385k4554281k4283268k0198961j4304049
18165H3957123r288763n893762l843538l257051l466496m343052m773339l642793
18157D5448329k579017j893915j487075j340082j367024j447877j378674j100920
18149C2853745q77611q27302q03837p92878p75660p06765o25430m52333k60238
18140B6731691p8312J17967L34963O57284J068092J671586K744488M418806P140321
18131D4806886J1035406J5442177J9325030K1905549K2794478K1429116J6825755
18124A73564397Q827060j126049j1534236j9807202k4376378k5284166k1609172
$$ plain form
18117 78654254 63196192 54135377 50387556 49870537 49731454 49260698 49785324 50213681 49028654
18108 49028654 45693189 38198199 31740866 28137142 25987000 24531044 23477033 22639643
18100 22639643 21917812 21252018 20582708 19948957 19371043 18844826 18391050 18002203 17704201
18091 17704201 17475487 17356379 17290994 17288507 17392062 17661744 18304465 19504057 21673036
18082 21673036 25281724 30509499 37170496 44720822 52585642 60086049 65956109 68876066
18074 68876066 68320628 63732188 56286741 47290142 37874322 29960855 24173871 20400667
18066 20400667 17969891 16280078 15048156 14055819 13191809 12481900 11874686 11371344 10923679
18057 10923679 10547190 10217335 9927854 9681859 9471186 9265257 9038034 8825550 8601795
$$ packed form
18117G8654254j5458062r060815l747821n17019j39083m70756N24626M28357j185027
18108D9028654l335465p494990o457333l603724k150142j455956j054011q37390
18100B2639643p21831o65794o69310o33751n77914n26217m53776l88847k98002
18091A7704201k28714j19108o5385k487J03555K69682O42721J199592K168979
18082B1673036L608688N227775O660997P550326P864820P500407N870060K919957
18074F8876066n55438m588440p445447q996599r415820p913467n786984l773204
18066B0400667k430776j689813j231922r92337q64010p09909o07214n03342m47665
18057A0923679l76489l29855k89481k45995k10673k05929k27223k12484k23755
$$ plain form
18048 8601795 8355496 8090517 7819466 7600896 7418459 7260614 7090575 6920257 6767514
18039 6767514 6590125 6381829 6147946 5924219 5736888 5575705 5465238 5319863 5182859
18030 5182859 5094538 4997988 4897926 4765964 4609887 4470431 4358793 4283985 4193377 4098743
18020 4098743 3983802 3841635 3731518 3637541 3528325 3431716 3362485 3298674 3189355 3076942
18010 3076942 2987358 2915459 2877394 2819267 2742013 2690242 2621199 2568240 2521555 2453593 2400167
17999 2400167 2352998 2280413 2197066 2161438 2128641 2101483 2083458 2044024 1996284 1956909 1933720
17988 1933720 1895139 1866415 1839534 1826365 1816514 1821118 1841236 1856011 1847486 1812529 1787229 1796461
17976 1796461 1801271 1796515 1778051 1752550 1756571 1728558 1705512 1700199 1653638 1614477 1638022 1647380
$$ packed form
18048H601795k46299k64979k71051k18570j82437j57845j70039j70318j52743
18039F767514j77389k08296k33883k23727j87331j61183j10467j45375j37004
18030E182859q8321r6550j00062j31962j56077j39456j11638p4808r0608r4634
18020D098743j14941j42167j10117r3977j09216r6609o9231o3811j09319j12413
18010C076942q9584p1899l8065n8127p7254n1771o9043n2959m6685o7962n3426
17999B400167m7169p2585q3347l5628l2797k7158j8025l9434m7740l9375k3189
17988A933720l8581k8724k6881j3169r851M604K0118J4775q525l4957k5300R232
17976A796461M810m756j8464k5501M021k8013k3046n313m6561l9161K3545R358
$$ plain form
17964 1647380 1667331 1695122 1713619 1733054 1725131 1666162 1650166 1642242 1623112 1668304 1725093 1761929
17952 1761929 1786749 1783934 1770067 1754351 1766545 1746286 1730540 1718533 1706102 1668456 1624248
17941 1624248 1589473 1563719 1534595 1496317 1475222 1461420 1415433 1336446 1309249 1288857 1233863
17930 1233863 1202114 1178500 1160028 1144558 1138926 1143464 1152142 1145783 1143736 1168422 1186884 1189415
17918 1189415 1209444 1237436 1242695 1260588 1289132 1348182 1426160 1475764 1482130 1490005 1465092 1436685
17906 1436685 1399417 1389833 1388995 1419187 1413827 1405256 1395758 1380205 1347056 1353843 1367807 1354231 1359192
17893 1359192 1363460 1333207 1318723 1334573 1336757 1264073 1183303 1122217 1073825 1040907 1007115 975853
17881 975853 965659 971754 976442 991970 1012123 1026779 1025560 1011076 977773 958972 944119 939992
$$ packed form
17964A647380J9951K7791J8497J9435p923n8969j5996p924j9130M5192N6789L6836
17952A761929K4820k815j3867j5716J2194k0259j5746j2007j2431l7646m4208
17941A624248l4775k5754k9124l8278k1095j3802m5987p8987k7197k0392n4994
17930A233863l1749k3614j8472j5470n632M538Q678o359k047K4686J8462K531
17918A189415K0029K7992N259J7893K8544N9050P7978M9604O366P875k4913k8407
17906A436685l7268r584q38L0192n360q571r498j5553l3149O787J3964j3576M961
17893A359192M268l0253j4484J5850K184p2684q0770o1086m8392l2918l3792l1262
17881I75853j0194O095M688J5528K0153J4656j219j4484l3303j8801j4853m127
$$ plain form
17869 939992 961508 998391 1009680 1025101 1062955 1110739 1128676 1126074 1178180 1221434 1260078 1282654
17857 1282654 1275227 1285380 1283548 1276164 1259185 1291904 1316491 1317968 1333363 1336630 1351935 1370429
17845 1370429 1348634 1321606 1303074 1324102 1347961 1343645 1330201 1315899 1321398 1330189 1308307 1274860
17833 1274860 1285512 1324294 1355024 1371726 1405096 1486147 1567644 1612224 1664987 1718753 1790184
17822 1790184 1829278 1866805 1898258 1944456 2006882 2064486 2113196 2168002 2255281 2335597 2399194
17811 2399194 2427736 2462509 2467331 2471764 2465372 2454957 2465562 2497924 2541930 2579497 2623205 2698107
17799 2698107 2747768 2808941 2878613 2977900 3061505 3111467 3216298 3388758 3550398 3717183
17789 3717183 3892898 4043242 4219591 4485194 4844281 5298095 5867830 6582835 7544208
$$ packed form
17869I39992K1516L6883J1289J5421L7854M7784J7937k602N2106M3254L8644K2576
17857A282654p427J0153j832p384j6979L2719K4587J477J5395L267J5305J8494
17845A370429k1795k7028j8532K1028K3859m316j3444j4302N499Q791k1882l3447
17833A274860J0652L8782L0730J6702L3370Q1051Q1497M4580N2763N3766P1431
17822A790184L9094L7527L1453M6198O2426N7604M8710N4806Q7279Q0316O3597
17811B399194K8542L4773M822M433o392j0415J0605L2362M4006L7567M3708P4902
17799B698107M9661O1173O9672R9287Q3605M9962J04831J72460J61640J66785
17789C717183J75715J50344J76349K65603L59087M53814N69735P15005R61373
$$ plain form
17780 7544208 8883588 10871224 13869815 17806368 21838166 25601559 29935150 35243071
17772 35243071 41177467 47410023 52459704 56711210 61495532 66561690 71616261 75501263
17764 75501263 76309311 74137478 68835901 63931991 62323188 61803958 59437058 53574582
17756 53574582 43260044 33613787 27647977 24244198 22249397 21074418 20374389 19908676
17748 19908676 19686978 19737677 20056092 20615939 21447237 22736007 24649846 27137039 30146846
17739 30146846 33978865 38720628 43804608 48462000 52528935 56379935 60297935 64244509
17731 64244509 68243985 73988877 85724126 107620550 141120770 182144604 222758388
17724 222758388 260288265 297877237 333146003 356391289 358989216 341290183 319520920
$$ packed form
17780G544208J339380J987636K998591L936553M031798L763393M333591N307921
17772C5243071N934396O232556N049681M251506M784322N066158N054571L885002
17764G5501263Q08048k171833n301577m903910j608803n19230k366900n862476
17756E3574582j0314538r646257n965810l403779j994801j174979p00029m65713
17748A9908676k21698N0699L18415N59847Q31298J288770J913839K487193L009807
17739C0146846L832019M741763N083980M657392M066935L851000L918000L946574
17731F4244509L999476N744892J1735249K1896424L3500220M1023834M0613784
17724B22758388L7529877L7588972L5268766K3245286K597927j7699033k1769263
$$ plain form
17717 319520920 309562885 308151286 304512562 294090920 279850269 263382229 244577671
17710 244577671 222191185 197371151 174241610 155315270 137948762 120077061 104129414
17703 104129414 92601587 84893996 79726435 76080047 73138694 70126958 66544537 62662353
17695 62662353 59288428 56810428 55011386 53624665 52457459 51550269 51161122 51554230
17687 51554230 53141487 56600340 62539386 70700416 79999274 89713660 100184295 111158561
17679 111158561 121333817 129153009 133037331 134780388 137560084 142977934 153743882 171764229
17671 171764229 195583193 220027406 239623327 259027461 280632396 295782941 294759693
17664 294759693 269404014 228313134 193045942 168907870 150671441 133248118 115204723
$$ packed form
17717C19520920r958035j411599l638724j0421642j4240651j6468040j8804558
17710B44577671k2386486k4820034k3129541j8926340j7366508j7871701j5947647
17703A04129414j1527827p707591n167561l646388k941353l011736l582421l882184
17695F2662353l373925k478000j799042j386721j167206r07190l89147L93108
17687E1554230J587257L458853N939046Q161030R298858R714386J0470635J0974266
17679A11158561J0175256P819192L884322J743057K779696N417850J0765948J8020347
17671A71764229K3818964K4444213J9595921J9404134K1604935J5150545j023248
17664B94759693k5355679m1090880l5267192k4138072j8236429j7423323j8043395
$$ plain form
17657 115204723 98736663 85266090 75210832 68385274 63674934 60257853 57722531
17650 57722531 55710302 53988414 52242176 50397701 48729357 47403190 46297265 45070505
17642 45070505 43258949 40629154 37497709 34606806 32341397 30614730 29221434 28040056
17634 28040056 26915987 25862818 24900445 24010159 23182504 22395948 21664868 21000802 20393167
17625 20393167 19831823 19287363 18752034 18232630 17735408 17269924 16843850 16477994 16135490
17616 16135490 15807074 15504540 15235116 14965734 14646301 14295265 13917229 13498191 13044051
17607 13044051 12583001 12124208 11722494 11344246 11005639 10720824 10459557 10210408 9967451
17598 9967451 9732637 9513309 9325696 9100798 8869388 8667442 8417888 8199195 8000667
$$ packed form
17657A15204723j6468060j3470573j0055258o825558m710340l417081k535322
17650E7722531k012229j721888j746238j844475j668344j326167j105925j226760
17642D5070505j811556k629795l131445k890903k265409j726667j393296j181378
17634B8040056j124069j053169r62373q90286q27655p86556p31080o64066o07635
17625B0393167n61344n44460n35329n19404m97222m65484m26074l65856l42504
17616A6135490l28416l02534k69424k69382l19433l51036l78036m19038m54140
17607A3044051m61050m58793m01714l78248l38607k84815k61267k49149k42957
17598I967451k34814k19328j87613k24898k31410k01946k49554k18693j98528
$$ plain form
17589 8000667 7784974 7559754 7375948 7200834 7055537 6894767 6745379 6539920 6354504
17580 6354504 6190004 6022728 5822520 5658807 5502792 5345123 5173806 5028857 4905138
17571 4905138 4774805 4638171 4502653 4379803 4288182 4205147 4183005 4154595 4092269 3962384
17561 3962384 3829536 3695407 3546986 3424838 3308559 3216695 3107142 2984273 2891188 2817115
17551 2817115 2735890 2642422 2575901 2527757 2483110 2432780 2419536 2341826 2260447 2170782 2085091
17540 2085091 2006647 1977868 1917760 1868978 1832720 1796019 1738100 1700261 1663585 1620159 1548974
17529 1548974 1491899 1441371 1434860 1429176 1399763 1356496 1336287 1298574 1267370 1246039 1200114 1124519
17517 1124519 1055390 1029083 1001920 952645 898111 864556 827968 813140 795433 755717 717274
$$ packed form
17589H000667k15693k25220j83806j75114j45297j60770j49388k05459j85416
17580F354504j64500j67276k00208j63713j56015j57669j71317j44949j23719
17571D905138j30333j36634j35518j22850r1621q3035k2142k8410o2326j29885
17561C962384j32848j34129j48421j22148j16279r1864j09553j22869r3085p4073
17551B817115q1225r3468o6521m8144m4647n0330j3244p7710q1379q9665q5691
17540B085091p8444k8779o0108m8782l6258l6701n7919l7839l6676m3426p1185
17529A548974n7075n0528o511n684k9413m3267k0209l7713l1204k1331m5925p5595
17517A124519o9129k6307k7163m9275n4534l3555l6588j4828j7707l9716l8443
$$ plain form
17506 717274 681083 662761 631310 592214 579985 558333 539296 515764 483850 475651 467046 457514
17494 457514 443270 409405 410370 416081 399920 388671 376331 374943 389138 395152 354218 339905
17482 339905 350212 325943 286379 272697 273866 291948 325160 325518 312779 328149 348596 365462
17470 365462 404363 402710 405155 417192 422021 400611 401135 377291 386058 389171 375490 342257 306087
17457 306087 278175 262164 264091 255297 255840 274664 296463 275620 260495 270769 292519 296794
17445 296794 310386 335309 337379 288321 266336 268006 268207 260499 280877 294126 290198 294698 301974
17432 301974 277274 238730 187473 183829 160531 137773 125218 134172 116611 96768 95263 83314
17420 83314 67568 53078 13895 -25994 -64655 -53401 -54710 -44917 12574 69587 97776 85412
$$ packed form
17506G17274l6191j8322l1451l9096j2229k1652j9037k3532l1914q199q605r532
17494D57514j4244l3865R65N711j6161j1249j2340j388J4195O014m0934j4313
17482C39905J0307k4269l9564j3682J169J8082L3212L58j2739J5370K0447J6866
17470C65462L8901j653K445J2037M829k1410N24k3844Q767L113j3681l3233l6170
17457C06087k7912j6011J927q794N43J8824K1799k0843j5125J0274K1750M275
17445B96794J3592K4923K070m9058k1985J670K01p708K0378J3249l928M500P276
17432C01974k4700l8544n1257l644k3298k2758j2555Q954j7561j9843j505j1949
17420H3314j5746j4490l9183l9889l8661J1254j309R793N7491N7013K8189j2364
$$ plain form
17408 85412 80167 83289 97117 90493 82884 101394 125527 134074 135401 124251 99032 98387 108997
17395 108997 136688 115207 112554 82020 104713 125944 112111 89511 113704 110510 86421 81819
17383 81819 69769 48066 56156 71092 54422 43194 42880 14143 -15403 -8960 -24021 -34481
17371 -34481 -41450 -45701 -29125 -43788 -65953 -56293 -62530 -83296 -88854 -70954 -65218 -96134 -108779
17358 -108779 -98059 -89422 -50509 -20678 -17640 6764 3423 -4549 3581 31272 47831 41118 39953
17345 39953 31208 48146 79032 68576 73879 89007 63914 43852 36372 4582 -15557 -2100
17333 -2100 -12629 -7408 24239 18209 20283 7026 4594 28024 12084 36961 21609 -16106 -31109
17320 -31109 -1311 38904 42117 38985 31566 19867 5266 10193 37177 47338 71507 47893
$$ packed form
17408H5412n245L122J3828o624p609J8510K4133Q547J327j1150k5219o45J0610
17395A08997K7691k1481k653l0534K2693K1231j3833k2600K4193l194k4089m602
17383H1819j2050k1703Q090J4936j6670j1228l14k8737k9546O443j5061j0460
17371c4481o969m251J6576j4663k2165R660o237k0766n558J7900N736l0916j2645
17358a08779J0720Q637L8913K9831L038K4404l341p972Q130K7691J6559o713j165
17345C9953q745J6938L0886j0456N303J5128k5093k0062p480l1790k0139J3457
17333b100j0529N221L1647o030K074j3257k432K3430j5940K4877j5352l7715j5003
17320c1109K9798M0215L213l132p419j1699j4601M927K6984J0161K4169k3614
$$ plain form
17308 47893 24827 6450 3430 -12266 -22563 -30233 -39396 -28365 -22304 -17023 -15380 -19947 -32408
17295 -32408 -21380 6189 38954 27273 5260 -19248 -55022 -52051 -40781 -37321 -35438 -19995
17283 -19995 -22886 -22040 -30396 -38489 -27574 -2080 -18761 -32813 -24616 -19592 -21691 -48476 -44772
17270 -44772 -24540 -4150 -24621 -3070 -1646 10278 56693 91690 91229 137883 155634 207295
17258 207295 267061 295363 287052 288870 335415 366728 325885 308788 277898 268663 248493 212786
17246 212786 219017 236569 265559 266766 258965 228978 204292 202013 166714 157166 171765 172580 174190
17233 174190 202056 227522 255717 312091 367126 437822 541087 624228 711918 748167 764116
17222 764116 802986 842335 864983 874146 905569 905486 896858 948706 1031109 1121847 1215772 1273735
$$ packed form
17308D7893k3066j8377l020j5696j0297p670r163J1031O061N281J643m567j2461
17295c2408J1028K7569L2765j1681k2013k4508l5774K971J1270L460J883J5443
17283a9995k891Q46q356q093J0915K5494j6681j4052Q197N024k099k6785L704
17270d4772K0232K0390k0471K1551J424J1924M6415L4997m61M6654J7751N1661
17258B07295N9766K8302q311J818M6545L1313m0843j7097l0890r235k0170l5707
17246B12786O231J7552K8990J207p801k9987k4686k279l5299r548J4599Q15J610
17233A74190K7866K5466K8195N6374N5035P0696J03265Q3141Q7690L6249J5949
17222G64116L8870L9349K2648R163L1423q3q628N1848Q2403R0738R3925N7963
$$ plain form
17210 1273735 1322834 1386286 1436563 1486925 1500069 1441777 1368774 1250230 1163436 1100601 1021428
17199 1021428 937426 833597 722223 612043 499332 456809 455665 444436 404488 415730 424851
17188 424851 413069 411386 420553 408426 387823 360827 360230 362627 403172 471200 526726 579611
17176 579611 620633 672238 735373 797625 839911 875987 904193 917505 930482 966148 970119 953239
17164 953239 943661 946798 966205 961703 954787 955821 961651 925422 861517 846247 844052 823137 802293
17151 802293 807423 792667 776111 765740 729037 694373 652283 602371 564671 476935 411994 364120
17139 364120 315360 270080 255524 242188 200608 202000 196533 195504 196338 180454 151769 133844
17127 133844 134223 139341 148223 130860 132666 129497 120303 132526 125137 106004 99529 68134 62698
$$ packed form
17210A273735M9099O3452N0277N0362J3144n8292p3003j18544q6794o2835p9173
17199A021428q4002j03829j11374j10180j12711m2523j144j1229l9948J1242R121
17188D24851j1782j683R167j2127k0603k6996n97K397M0545O8028N5526N2885
17176E79611M1022N1605O3135O2252M2286L6076K8206J3312J2977L5666L971j6880
17164I53239r578L137J9407m502o916J034N830l6229o3905j5270k195k0915k0844
17151H02293N130j4756j6556j0371l6703l4664m2090m9912l7700q7736o4941m7874
17139C64120m8760m5280j4556j3336m1580J392n467j029Q34j5884k8685j7925
17127A33844L79N118Q882j7363J806l169r194J2223p389j9133o475l1395n436
$$ plain form
17114 62698 61642 67792 64915 86853 91908 81394 70575 71320 76074 38090 -1671 -12433 -18713
17101 -18713 -18066 24026 66758 73266 78625 58435 17537 9665 2100 -9497 11328 37858 54084
17088 54084 57062 55748 57605 45663 21557 25060 17781 25346 22234 12612 42398 47967 47969 65235
17074 65235 62579 23979 6555 12356 28177 29255 34602 24718 30215 63414 44510 10990 -106
17061 -106 -13266 1986 31623 28605 23053 37025 25237 1311 -24592 -32809 -13142 5923 -18746
17048 -18746 -15271 24947 14417 -3762 -2257 -4162 -2224 33552 26081 -12414 -14627 -3061 -8871
17035 -8871 4318 27088 14758 20766 16551 -2146 -24991 -25283 1460 41192 30230 23365 25001
17022 25001 37353 45822 71287 68930 46313 19688 2416 -23858 -12618 11157 -6129 -20643
$$ packed form
17114F2698j056O150k877K1938N055j0514j0819P45M754l7984l9761j0762o280
17101a8713O47M2092M2732O508N359k0190m0898p872p565j1597K0825K6530J6226
17088E4084K978j314J857j1942k4106L503p279P565l112r622K9786N569KJ7266
17074F5235k656l8600j7424N801J5821J078N347r884N497L3199j8904l3520j1096
17061a06j3160J5252K9637l018n552J3972j1788k3926k5903q217J9667J9065k4669
17048a8746L475M0218j0530j8179J505j905J938L5776p471l8495k213J1566n810
17035h871J3189K2770j2330O008m215j8697k2845k92K6743L9732j0962o865J636
17022B5001J2352Q469K5465k357k2617k6625j7272k6274J1240K3775j7286j4514
$$ plain form
17010 -20643 -25642 -30825 -48700 -44624 -50036 -43740 -8152 7075 22278 3444 4083 24676 44911
16997 44911 15316 -5739 6920 12161 25498 31922 5119 -21267 -49418 -53551 -42809 -25530
16985 -25530 -4780 -28830 -33031 -19647 7123 -2528 -13285 -40668 -56502 -38610 -28588 -15668
16973 -15668 -59285 -59824 -23381 -20228 -19605 -10802 2902 -2234 -44905 -46610 -25493 -15492 -27650
16960 -27650 -56696 -48403 -36943 -31781 -34120 -44757 -58779 -42589 -19404 -19494 -49479 -52396 -41051
16947 -41051 -41295 -33147 -8767 12948 32995 29791 -7103 -14448 398 15387 1907 -44914 -24439
16934 -24439 -30213 -29900 -2298 21261 1764 -637 13286 10528 15675 33124 9316 -7773 -13495
16921 -13495 2461 3713 15330 17287 -17863 -44090 -39713 -30300 -22013 -25071 -10750 -7667 12137
$$ packed form
17010b0643m999n183j7875M076n412O296L5588J5227J5203j8834O39K0593K0235
16997D4911k9595k1055J2659N241J3337O424k6803k6386k8151m133J0742J7279
16985b5530K0750k4050m201J3384K6770r651j0757k7383j5834J7892J0022J2920
16973a5668m3617n39L6443L153O23Q803J3704n136m2671j705K1117J0001j2158
16960b7650k9046Q293J1460N162k339j0637j4022J6190K3185r0k9985k917J1345
16947d1051k44Q148K4380K1715K0047l204l6894p345J4846J4989j3480m6821K0475
16934b4439n774L13K7602K3559j9497k401J3923k758N147J7449k3808j7089n722
16921a3495J5956J252J1617J957l5150k6227M377R413Q287l058J4321L083J9804
$$ plain form
16908 12137 29592 23543 20669 37174 29742 -3604 -9301 -7322 -16400 -26464 12877 19412 -25955
16895 -25955 -55646 -37478 -25763 -27579 -28365 -17058 -16215 -20040 -18139 -8730 -42130 -35880 -8292
16882 -8292 26867 31240 923 -5576 5270 -6474 6720 40335 57170 40712 22078 8470
16870 8470 15209 28680 39849 29743 14016 14605 14851 3710 9570 11208 4746 -23307 -29030 8058
16856 8058 3911 -8731 1547 -4496 -25955 -40014 -27985 -12229 -19668 -29052 -65908 -75149 -73258
16843 -73258 -66197 -42471 -39065 -54639 -40453 -31384 -32296 -35284 -46081 -33308 -3240 815 9456
16830 9456 8228 -21688 -230 2072 8497 15923 -28787 -48875 -36407 -37414 -16832 -27914 -34605
16817 -34605 -19784 -10955 -9181 -15524 -25888 -41213 -32120 -30175 -28240 -49675 -33188 -32218 -36950
$$ packed form
16908A2137J7455o049k874J6505p432l3346n697J979r078j0064L9341O535m5367
16895b5955k9691J8168J1715j816p86J1307Q43l825J901R409l3400O250K7588
16882h292L5159M373l0317o499J0846j1744J3194L3615J6835j6458j8634j3608
16870H470O739J3471J1169j0106j5727N89K46j1141N860J638o462k8053n723L7088
16856H058m147j2642J0278o043k1459j4059J2029J5756p439r384l6856r241J891
16843g3258P061K3726L406j5574J4186R069r12k988j0797J2773L0068M055Q641
16830I456j228k9916K1458K302O425P426m4710k0088J2468j007K0582j1082o691
16817c4605J4821Q829J774o343j0364j5325R093J945J935k1435J6487R70m732
$$ plain form
16804 -36950 -46160 -73200 -88606 -58521 -23542 -1822 -7373 -6437 -1396 -25481 -14109 -6941 -22480
16791 -22480 -26633 -21551 -24013 -11932 3220 -25889 -29869 -36816 -24783 -15354 -20714 -38249 -34080
16778 -34080 -32604 -40723 -30032 -22160 -15948 -26752 -8952 6872 1085 -7724 -4765 -12235 -36771
16765 -36771 -29167 -18209 -22645 -42925 -65677 -78997 -87956 -89967 -68704 -22654 -12811 -19380 -22525
16752 -22525 -12274 -2160 -16865 -29861 -42298 -36217 -30128 149 863 -13383 -29213 -26172 -24141
16739 -24141 -5384 2324 -19198 -44831 -37026 -32758 -27104 -35025 -36578 -61027 -90081 -70101 -71325
16726 -71325 -87278 -100796 -54454 -31706 -30513 -8307 -6346 -34116 -23348 -18813 -16607 3710
16714 3710 4636 9582 -24247 -45446 -30912 -35793 -46407 -42505 -28833 -22993 -35989 -58612 -52876
$$ packed form
16804c6950r210k7040j5406L0085L4979K1720n551R36N041k4085J1372P168j5539
16791b2480m153N082k462J2081J5152k9109l980o947J2033R429n360j7535M169
16778c4080J476q119J0691P872O212j0804J7800J5824n787q809K959p470k4536
16765c6771P604J0958m436k0280k2752j3320q959k011K1263M6050R843o569l145
16752b2525J0251J0114j4705j2996j2437O081O089L0277P14j4246j5830L041K031
16739b4141J8757P708k1522k5633P805M268N654p921j553k4449k9054J9980j224
16726g1325j5953j3518M6342K2748J193K2206J961k7770J0768M535K206K0317
16714C710R26M946l3829k1199J4534m881j0614L902J3672N840j2996k2623N736
$$ plain form
16701 -52876 -26231 -10954 12252 19450 36944 26239 29250 22495 13892 -15744 -29995 -36186 -42067
16688 -42067 -37425 -31527 -41003 -61708 -66095 -71058 -59686 -57850 -37010 -25668 -28145 -12138 -12636
16675 -12636 -35369 -35662 -30918 -35767 -29015 -16103 -8245 -34720 -38719 -29089 -23246 -14633 -6789 -32728
16661 -32728 -47006 -47186 -26594 -22562 11025 -12971 -59413 -64281 -43501 -38477 -33446 -4279 -11327
16648 -11327 -24681 -31895 -29760 -37299 -44683 -52765 -59575 -43770 -10996 -8719 -41984 -46696 -38220
16635 -38220 -42741 -45588 -47357 -73311 -56871 -40098 -20095 -31384 -38084 -32507 -22038 17703 15735
16622 15735 -9857 -2597 10005 14147 -8416 -11126 -47540 -82997 -78722 -81192 -49536 -25320 -33020
16609 -33020 -14032 -10771 -25250 -16216 -42352 -63236 -55089 -14906 -19057 -39172 -23151 -10739
$$ packed form
16701e2876K6645J5277K3206P198J7494j0705L011o755q603k9636j4251o191n881
16688d2067M642N898r476k0705m387m963J1372J836K0840J1342k477J6007m98
16675a2636k2733k93M744m849O752J2912P858k6475l999R630N843Q613P844k5939
16661c2728j4278j80K0592M032L3587k3996m6442m868K0780N024N031K9167p048
16648a1327j3354p214K135p539p384q082o810J5805L2774K277l3265m712Q476
16635c8220m521k847j769k5954J6440J6773K0003j1289o700N577J0469L9741j968
16622A5735k5592P260J2602M142k2563k710l6414l5457M275k470L1656K4216p700
16609c3020J8988L261j4479R034k6136k0884Q147M0183m151k0115J6021J2412
$$ plain form
16597 -10739 -2022 -13955 -18074 -21076 -48014 -40526 -32220 -28696 -20631 -37530 -42352 -44877 -42693 -31084
16583 -31084 -14606 -19752 -9647 -18006 -26065 -25481 -38236 -40407 -61087 -72498 -49590 -16213 -2611
16570 -2611 -17613 -10338 -8448 5963 21943 43967 43638 24273 -8556 -17992 -3326 -16291 -33974
16557 -33974 -18658 -12531 16238 27713 34263 15073 -19704 -45092 -48275 -37477 -36595 -30962 -31432
16544 -31432 -5031 2012 -7834 -27182 -29972 -4522 8804 9116 7348 -23763 -55699 -56009 -45697
16531 -45697 -27083 -18237 -18780 -23741 -34220 -45562 -27083 -22758 -16709 -28899 -23316 -12634 -50774
16518 -50774 -69205 -59330 -31029 -27452 -27377 -12235 -22915 -43526 -33613 -8489 -490 -36667 -45351
16505 -45351 -47243 -43219 -26514 -533 2869 10420 -6575 2103 -1298 -851 14085 35204 1829
$$ packed form
16597a0739Q717j1933m119l002k6938P488Q306L524Q065j6899m822k525K184J1609
16583c1084J6478n146J0105q359q059N84j2755k171k0680j1411K2908L3377J3602
16570b611j5002P275J890J4411J5980K2024l29j9365l2829r436J4666j2965j7683
16557c3974J5316O127K8769J1475O550j9190l4777k5388l183J0798Q82N633m70
16544c1432K6401P043r846j9348k790K5450J3326L12j768l1111l1936l10J0312
16531d5697J8614Q846n43m961j0479j1342J8479M325O049j2190N583J0682l8140
16518e0774j8431R875K8301L577P5J5142j0680k0611R913K5124P999l6177q684
16505d5351j892M024J6705K5981L402P551j6995Q678l401M47J4936K1119l3375
$$ plain form
16492 1829 -30946 -36289 -29301 -2162 25459 10768 18939 294 12783 38691 12878 -12051
16480 -12051 -11132 -5983 -24247 -28108 -17554 -17557 -25415 -11199 -23709 -17407 -47271 -60368 -42051 -25009
16466 -25009 -22572 -71321 -87249 -41250 -26451 -37502 -49398 -45355 -21830 -12024 -32467 -34747
16454 -34747 -42790 -45735 -48889 -51143 -19354 -12269 -21976 -28835 -32258 -72738 -94289 -62316 -42072
16441 -42072 -18226 11169 8516 -15915 -46292 -38122 -67711 -73402 -48734 -14503 -1372 -16789
16429 -16789 -6205 -24788 -19008 -17085 -40042 -37245 -34640 -45504 -42527 -32436 -27875 -24569 -11712
16416 -11712 4532 29374 23996 7402 5229 13925 -2324 -19540 -16117 6981 36458 37081 -4314
16403 -4314 -21509 -11867 2126 -996 16832 9308 -18466 -40151 -40203 -25656 -14614 -11168 -14534
$$ packed form
16492A829l2775n343O988K7139K7621j4691Q171j8645J2489K5908k5813k4929
16480a2051R19N149j8264l861J0554lp858J4216j2510O302k9864j3097J8317J7042
16466b5009K437m8749j5928M5999J4799j1051j1896M043K3525R806k0443k280
16454c4747q043k945l154k254L1789P085r707o859l423m0480k1551L1973K0244
16441d2072K3846K9395k653k4431l0377Q170k9589n691K4668L4231J3131j5417
16429a6789J0584j8583N780J923k2957K797K605j0864K977J0091M561L306J2857
16416a1712J6244K4842n378j6594k173Q696j6249j7216L423K3098K9477O23m1395
16403d314j7195R642J3993l122J7828p524k7774k1685n2J4547J1042L446l366
$$ plain form
16390 -14534 123 28966 5765 -22484 -16455 -14637 -29055 -20679 -35197 -43907 -43268 -40705 -25656
16377 -25656 -37351 -57040 -57269 -34460 -3877 7238 -36350 -29023 -8383 14172 3962 5186
16365 5186 8677 -808 -41508 -52824 -39656 -43224 -32042 -30453 -30505 -24357 2749 12347 -7664 -31173
16351 -31173 -21447 -7693 -17228 -36982 -46728 -32310 -48334 -62957 -71115 -57444 -53691 -75662 -58652
16338 -58652 -42375 -44884 -27936 -38586 -49352 -55909 -33463 -18507 -26314 -15459 -22448 -39200
16326 -39200 -38009 -62462 -68648 -76813 -68206 -59957 -40117 -22236 -27111 -48409 -34619 -15511 -509
16313 -509 20656 39732 30575 -7912 -7250 -8362 -23943 -38105 -58083 -19808 18711 5765 -23797
16300 -23797 -61408 -66846 -45280 -16584 -9993 13674 20473 16173 12339 8364 22355 31085 29324
$$ packed form
16390a4534J4657K8843k3201k8249O029J818j4418Q376j4518q710O39K563J5049
16377b5656j1695j9689k29K2809L0583J1115m3588P327K0640K2555j0210J224
16365E186L491r485m0700j1316J3168l568J1182J589n2O148K7106R598k0011k3509
16351c1173R726J3754r535j9754r746J4418j6024j4623q158J3671L753k1971J7010
16338e8652J6277k509J6948j0650j0766o557K2446J4956p807J0855o989j6752
16326c9200J191k4453o186q165Q607Q249J9840J7881m875k1298J3790J9108J5002
16313e09K1165J9076r157l8487O62j112j5581j4162j9978L8275L8519j2946k9562
16300b3797l7611n438K1566K8696O591K3667O799m300l834l975J3991Q730j761
$$ plain form
16287 29324 48159 26287 -24367 -27639 -2362 -14854 -44066 -44392 -33334 -20786 -17931 -29729
16275 -29729 -40449 -33198 -39426 -31805 -7355 -17408 -25834 -1269 13383 11261 321 17989 4537
16262 4537 -10688 -23745 -11798 1789 -817 5172 12304 12779 10962 -24495 -62108 -29824 -7106
16249 -7106 -9000 -20823 -29480 -20033 8122 18465 14830 -327 -21918 -15263 -1076 -8914 -33860
16236 -33860 -25122 -25316 -26332 -18143 -24912 -12801 7783 5280 -15266 -19724 -47104 -52890 -36104
16223 -36104 -33561 -27119 -23400 -38892 -21742 -2164 -4374 9527 9036 -4691 -28547 -46347 -38545
16210 -38545 -51266 -29550 -25568 -16840 -7766 -4173 -14184 -9048 -20024 -24658 -37013 -55210 -58294
16197 -58294 -45492 4856 16534 8017 89 -25419 -51664 -43283 -9466 -7272 4998 -18826
$$ packed form
16287B9324J8835k1872n0654l272K5277j2492k9212l26J1058J2548K855j1798
16275b9729j0720P251o228P621K4450j0053q426K4565J4652k122j0940J7668j3452
16262D537j5225j3057J1947J3587k606N989P132M75j817l5457l7613L2284K2718
16249g106j894j1823q657R447K8155J0343l635j5157k1591O655J4187p838k4946
16236c3860Q738j94j016Q189o769J2111K0584k503k0546m458k7380n786J6786
16223c6104K543O442L719j5492J7150J9578k210J3901m91j3727k3856j7800P802
16210c8545j2721K1716L982Q728R074L593j0011N136j0976m634j2355j8197l084
16197e8294J2802N0348J1678q517p928k5508k6245Q381L3817K194J2270k3824
$$ plain form
16185 -18826 -40617 -35011 -6214 19987 9554 -20219 -73517 -87243 -97425 -87630 -54407 -26984
16173 -26984 -22475 -39723 -28224 -22312 -23675 -42693 -54535 -51607 -33380 -12210 -12586 -10195 -13832
16160 -13832 -50541 -66057 -36725 -15343 -23787 -27255 -19397 -8047 -7580 -30361 -36559 -19271 -10510
16147 -10510 7177 38241 46309 4768 -19857 7424 40200 64077 86767 70020 40335 1369
16135 1369 17963 13875 14018 17890 16020 5308 -3000 14936 29699 10335 -17673 -7799 -14707
16122 -14707 -10372 -7500 -9399 -32141 -44874 -16372 -9136 -6485 -42373 -37703 -26645 -31120 14644
16109 14644 32768 37588 13484 -19203 -32627 -13843 -13589 -22020 -36512 -21963 -7344 -9677 -5018
16096 -5018 -3077 4568 20788 34846 52315 46482 24225 16510 -386 -23791 -25804 -20246 5657
$$ packed form
16185a8826k1791N606K8797K6201j0433k9773n3298j3726j0182R795L3223K7423
16173b6984M509j7248J1499N912j363j9018j1842K928J8227K1170l76K391l637
16160a3832l6709j5516K9332K1382q444l468P858J1350M67k2781o198J7288Q761
16147a0510J7687L1064Q068m1541k4625K7281L2776K3877K2690j6747k9685l8966
16135A369J6594m088J43L872j870j0712q308J7936J4763j9364k8008R874o908
16122a4707M335K872j899k2742j2733K8502P236K651l5888M670J1058m475M5764
16109A4644J8124M820k4104l2687j3424J8784K54q431j4492J4549J4619k333M659
16096e018J941P645J6220J4058J7469n833k2257p715j6896k3405k013N558K5903
$$ plain form
16083 5657 18108 5912 -15614 351 18738 30868 22092 38161 24936 19164 20368 22523 30336
16070 30336 15336 6464 9585 44441 40197 6299 -8019 -19900 -25028 708 11390 6106 -3870
16057 -3870 -48899 -48780 -21077 -7220 -6461 -95 -16485 -26733 -49217 -53469 -44338 -26073 -55455
16044 -55455 -82907 -66888 -34872 -30203 -41569 -41858 -35361 -31004 -34065 -26005 -57552 -45744 -24654
16031 -24654 -20221 -25285 5940 10170 -18807 -40613 -42149 -38118 -37504 -38302 -19253 -9190 -12825 -27404
16017 -27404 -30165 28350 49183 18796 -1078 -12210 -17544 -30018 -45010 -43176 -11813 10839
16005 10839 -10861 -25197 -26102 -58610 -64136 -26605 -26802 -58873 -72754 -48524 2917 14466 6784
15992 6784 13501 17119 13598 3105 -17988 -38596 -35965 -19802 11378 -4400 -25110 -18216 -13526
$$ packed form
16083E657J2451j2196k1526J5965J8387J2130q776J6069j3225n772J204K155P813
16070C0336j5000q872L121L4856m244l3898j4318j1881n128K5736J0682n284r976
16057c870m5029J19K7703J3857P59O366j6390j0248k2484m252R131J8265k9382
16044e5455k7452J6019L2016M669j1366k89O497M357l061Q060l1547J1808K1090
16031b4654M433n064L1225M230k8977k1806j536M031O14p98J9049J0063l635j4579
16017b7404k761N8515K0833l0387j9874j1132n334j2474j4992J834L1363K2652
16005A0839k1700j4336r05l2508n526L7531j97l2071j3881K4230N1441J1549p682
15992F784O717L618l521j0493k1093k0608K631J6163L1180j5778k0710O894M690
$$ plain form
15979 -13526 -13324 2730 17841 33196 2710 -30279 -49048 -39349 -11714 15187 31700 59628
15967 59628 35918 5203 -15469 -35344 -30888 -12496 -14365 -26751 -3219 16762 18538 20579
15955 20579 15589 17514 27260 10811 7744 29478 25887 4109 -15419 -16556 -22554 -11223 -12867
15942 -12867 -45048 -85755 -82245 -56080 -34100 -34537 -25021 -37108 -42959 -63642 -55485 -30675 -45236
15929 -45236 -49039 -5540 3258 -13733 -38952 -44907 -62801 -38228 -16023 4939 25845 30152
15917 30152 9803 -29099 -39070 -20123 2498 11951 -3077 -34131 -16086 16237 48905 56203
15905 56203 37993 35727 36254 19498 12537 27435 32037 38455 49446 34104 30457 31493 49704
15892 49704 39253 22494 -15361 -16691 -16598 -16098 8209 -8414 -33075 -30808 -23307 -23595 -35662 -31339
$$ packed form
15979a3526K02J6054J5111J5355l0486l2989j8769R699K7635K6901J6513K7928
15967E9628k3710l0715k0672j9875M456J8392j869j2386K3532J9981J776K041
15955B0579m990J925R746j6449l067K1734l591k1778j9528j137n998J1331j644
15942a2867l2181m0707L510K6165K1980m37R516j2087n851k0683Q157K4810j4561
15929d5236l803M3499Q798j6991k5219n955j7894K4573K2205K0962K0906M307
15917C0152k0349l8902r971J8947K2621R453j5028l1054J8045L2323L2668P298
15905E6203j8210k266N27j6756o961J4898M602O418J0991j5342l647J036J8211
15892D9704j0451j6759l7855j330R3N00K4307j6623k4661K267P501k88j2067M323
$$ plain form
15878 -31339 10365 1477 -4703 3328 21350 46444 50345 38585 50256 40712 34391 10021 4682
15865 4682 2459 6335 1865 19373 29771 26636 25031 -13725 -41931 -27731 -44318 -50970 -46532
15852 -46532 -12916 16258 34893 22510 20380 20739 4554 -35690 -32965 17831 28410 -17241
15840 -17241 -10057 -8815 -19374 -17933 -30473 -4000 -6368 5316 -691 -26202 -33788 -22747 -9137
15827 -9137 5334 3006 4331 14687 2242 -18400 -31318 -24544 -9179 -29795 -43122 -36692 -37393
15814 -37393 -39848 -26426 -9592 3375 -3623 7564 28732 9522 -21271 -22234 -8896 28592
15802 28592 30766 10632 10860 22025 9528 6545 8225 17307 26646 -3033 -23635 -19674 -17398
15789 -17398 -11924 -5925 19375 14111 -15661 -31739 -22400 -11196 -15744 -45728 -63841 -53866 -33512
$$ packed form
15878c1339M1704q888o180Q031J8022K5094L901j1760J1671r544o321k4370n339
15865D682k223L876m470J7508J0398l135j605l8756k8206J4200j6587o652M438
15852d6532L3616K9174J8635j2383k130L59j6185m0244K725N0796J0579m5651
15840a7241P184J242j0559J441j2540K6473k368J1684o007k5511p586J1041J3610
15827i137J4471k328J325J0356j2445k0642j2918O774J5365k0616j3327O430p01
15814c7393k455J3422J6834J2967o998J1187K1168j9210l0793r63J3338L7488
15802B8592K174k0134K28J1165j2497k983J680R082R339k9679k0602L961K276
15789a7398N474N999K5300n264k9772j6078R339J1204m548k9984j8113R975K0354
$$ plain form
15776 -33512 -20165 -1230 5007 -506 6647 10695 7934 -5688 -20518 -35166 -39881 -38559 -31550
15763 -31550 -43117 -65151 -68199 -50233 -58219 -50362 -38258 -23653 -3547 12116 9149 -4780
15751 -4780 -18456 -25393 -28316 -13951 -8330 3131 31839 10414 18541 44171 34024 18853 -728
15738 -728 -5469 3764 -2334 11224 23867 40536 47858 57752 14879 -12028 -5100 -6157 16218
15725 16218 8395 -6134 7820 25743 28485 38305 28006 21619 14728 -118 6025 -9941 -37339
15712 -37339 -42334 -43246 -34951 -26518 -6365 -10159 -17115 4140 19100 7069 -3338 -15851 -3211
15699 -3211 -31992 -44777 -23209 -29688 -15493 378 4296 -9783 -2191 -14687 -56571 -56876 -45340
15686 -45340 -12160 -15130 -29583 -24854 -18985 -11885 32645 49877 58183 26349 -6526 -18669 -415
$$ packed form
15776c3512J3347J8935O237n513P153M048k761j3622j4830j4648m715J322P009
15763c1550j1567k2034l048J7966p986P857J2104J4605K0106J5663k967j3929
15751d780j3676o937k923J4365N621J1461K8708k1425Q127K5630j0147j5171j9581
15738g28m741R233o098J3558J2643J6669P322R894m2873k6907O928j057K2375
15725A6218p823j4529J3954J7923K742R820j0299o387o891j4846O143j5966k7398
15712c7339m995r12Q295Q433K0153l794o956K1255J4960j2031j0407j2513J2640
15699c211k8781j2785K1568o479J4195J5871L918j4079P592j2496m1884l05J1536
15686d5340L3180k970j4453M729N869P100M4530J7232Q306l1834l2875j2143J8254
$$ plain form
15673 -415 -1554 12496 25521 20732 -7652 5682 41731 48759 29356 13916 -12126 -14185 12544
15660 12544 17960 5080 -2624 -451 -37064 -49631 -37160 6790 42416 36143 16907 -19354
15648 -19354 -55327 -64558 -46513 -42425 -2657 31036 25280 6276 12521 6979 -3748 -6939 -2305
15635 -2305 -13275 7743 -2562 20238 1891 -16342 -11165 -998 -9635 -28286 -27071 -29639 -53481
15622 -53481 -39158 -12892 3543 9316 28069 21447 19339 20718 20783 43866 36437 8420 -29881
15609 -29881 -15148 7825 2974 4391 -6427 -22001 -37437 -14430 -2342 29582 26528 30558
15597 30558 17184 19247 50924 79195 67739 63499 59822 63789 68219 31207 1273 11284 8523
15584 8523 12679 38258 48352 44339 16345 463 14179 23005 19147 24314 34439 31449 2139
$$ packed form
15673d15j139J4050J3025m789k8384J3334L6049P028j9403j5440k6042k059K6729
15660A2544N416j2880p704K173l6613j2567J2471M3950L5626o273j9236l6261
15648a9354l5973r231J8045M088L9768L3693n756j9004O245n542j0727l191M634
15635b305j0970K1018j0305K2800j8347j8233N177J0167q637j8651J215k568k3842
15622e3481J4323K6266J6435N773J8753o622k108J379O5K3083p429k8017l8301
15609b9881J4733K2973m851J417j0818j5574j5436K3007J2088L1924l054M030
15597C0558j3374K063L1677K8271j1456m240l677L967M430l7012k9934J0011k761
15584H523M156K5579J0094m013k7994j5882J3716Q826l858N167J0125k990k9310
$$ plain form
15571 2139 -5410 -23555 2106 21686 16977 519 15304 41081 58409 63556 23236 -439
15559 -439 -1001 -16727 -17753 13204 20809 21599 20825 16030 8847 24340 14084 -24966 351 28956
15545 28956 32530 -2376 -16609 -7567 5586 5699 14070 32696 -9553 -22373 -5495 7872 -1995
15532 -1995 -7160 -31571 -36925 -33787 -1821 3860 -12887 -17210 14991 48734 52663 30852 13379
15519 13379 42963 59110 56689 49469 38312 24540 7687 12760 -10031 -35170 -16181 12093
15507 12093 15248 -590 4495 9188 954 -19291 -26689 -10883 39774 44338 20163 31875 46608
15494 46608 53489 34854 27420 40482 38047 41540 46237 25785 262 -34385 -32098 -14502 -40466
15481 -40466 -12495 508 1095 2895 -5129 1945 19850 8547 9505 -3581 14502 10982 17539
$$ packed form
15571B139p549j8145K5661J9580m709j6458J4785K5777J7328N147m0320k3675
15559d39n62j5726j026L0957P605P90p74m795p183J5493j0256l9050K5317K8605
15545B8956L574l4906j4233R042J3153J13Q371J8626m2249j2820J6878J3367r867
15532a995n165k4411n354L138L1966N681j6747m323L2201L3743L929k1811j7473
15519A3379K9584J6147k421p220j1157j3772j6853N073k2791k5139J8989K8274
15507A2093L155j5838N085M693q234k0245p398J5806N0657M564k4175J1712J4733
15494D6608O881j8635p434J3062k435L493M697k0452k5523l4647K287J7596k5964
15481d0466K7971J3003N87J800q024P074J7905j1303R58j3086J8083l520O557
$$ plain form
15468 17539 67 -14468 -24102 -3827 -3343 -9187 -19445 -22654 -20173 -21149 -14151 22205 36715
15455 36715 40940 46522 27159 44065 41199 8644 -27376 -16200 20680 48598 38076 26228
15443 26228 36064 5455 -18114 -9693 10525 22790 11872 10707 9520 9739 1236 -8363 1854
15430 1854 4987 2999 5063 4330 18926 44048 24834 12674 35009 30282 -3465 9286 10081
15417 10081 16046 31777 13643 16403 5659 -32604 -5470 -26025 -47823 -42418 -15695 14871
15405 14871 35231 34599 40458 52304 76420 65362 38754 8066 6521 22530 39250 61141
15393 61141 48434 21315 -12447 -54394 -49568 -37249 -5313 -11118 -12979 15658 31519 72454
15381 72454 59966 48503 57625 40246 46487 23626 -16610 2379 27242 16975 -3106 -10956
$$ packed form
15468A7539j7472j4535r634K0275M84n844j0258l209K481r76O998L6356J4510
15455C6715M225N582j9363J6906k866l2555l6020J1176L6880K7918j0522j1848
15443B6228R836l0609k3569Q421K0218J2265j0918j165j187K19q503r599J0217
15430A854L133j988K064p33J4596K5122j9214j2160K2335m727l3747J2751P95
15417A0081N965J5731j8134K760j0744l8263K7134k0555k1798N405K6723L0566
15405A4871K0360o32N859J1846K4116j1058k6608l0688j545J6009J6720K1891
15393F1141j2707k7119l3762m1947M826J2319L1936n805j861K8637J5861M0935
15381G2454j2488j1463R122j7379O241k2861m0236J8989K4863j0267k0081p850
$$ plain form
15369 -10956 -5973 -8762 12330 -10419 11172 2586 2238 1396 -26176 -116 -15152 -29703 9896
15356 9896 33857 34125 32698 38070 43564 39366 56273 25633 14519 31045 34716 11997 -13004
15343 -13004 -5611 -8561 -18983 -18227 -5684 20719 17813 -1814 2329 12454 40861 79054 82856
15330 82856 80715 56360 47048 60628 56246 48839 35366 46722 72923 79583 64473 68444 68033
15317 68033 45328 40509 45790 25583 28816 54877 34859 8748 15537 24544 58333 91486 84515
15304 84515 60635 63444 38874 33387 53405 65973 51050 48069 50740 43640 43219 61268 40150
15291 40150 44426 60389 63628 55425 52824 61492 55018 57978 68739 46956 42283 47643 41420 60740
15277 60740 47033 35099 27352 42854 34338 51496 69552 90546 107678 96607 69551 54628
$$ packed form
15369a0956M983k789K1092k2749K1591q586l48q42k7572K6060j5036j4551L9599
15356I896K3961K68j427N372N494m198J6907l0640j1114J6526L671k2719k5001
15343a3004P393k950j0422P56J2543K6403k906j9627M143J0125K8407L8193L802
15330H2856k141k4355r312J3580m382p407j3473J1356K6201O660j5110L971m11
15317F8033k2705m819N281k0207L233K6061k0018k6111O789R007L3789L3153o971
15304H4515k3880K809k4570n487K0018J2568j4923k981K671p100m21J8049k1118
15291D0150M276J5963L239q203k601Q668o474K960J0761k1783m673N360o223J9320
15277F0740j3707j1934p747J5502q516J7158J8056K0994J7132j1071k7056j4923
$$ plain form
15265 54628 62265 59118 59809 35893 51860 78789 79132 65723 55500 56831 57533 67935 74023 72287
15251 72287 62891 65885 70675 89860 100215 106222 84531 66543 75577 71041 42056 41650 28746
15238 28746 54380 85261 87133 63187 51455 42176 46101 50892 69228 78969 88303 80502 67278
15225 67278 47857 64875 76623 66565 36903 55325 63812 40555 35573 23156 21085 29072
15213 29072 35466 15617 28631 19784 -19796 -418 34673 57484 69197 50048 51366 48096
15201 48096 51068 76544 97728 72627 52485 63620 64039 28228 -3026 24253 56912 64362
15189 64362 73335 67529 68291 73471 56668 56490 44858 26643 55913 75263 61802 47032 61706
15176 61706 61254 56643 60102 71662 57633 54980 57416 79201 112171 109710 91878 110169 118504
$$ packed form
15265E4628P637l147O91k3916J5967K6929L43j3409j0223J331P02J0402O088j736
15251G2287r396K994M790J9185J0355O007k1691j7988R034m536k8985m06j2904
15238B8746K5634L0881J872k3946j1732r279L925M791J8336R741R334p801j3224
15225F7278j9421J7018J1748j0058k9662J8422Q487k3257m982j2417k071P987
15213B9072O394j9849J3014q847l9580J9378L5091K2811J1713j9149J318l270
15201D8096K972K5476K1184k5101k0142J1135M19l5811l1254K7279L2659P450
15189F4362Q973n806P62N180j6803j78j1632j8215K9270J9350j3461j4770J4674
15176F1706m52m611L459J1560j4029k653K436K1785L2970k461j7832J8291Q335
$$ plain form
15163 118504 115431 106111 104863 55149 27994 43311 48302 52898 57229 67223 81754 109470 106091
15150 106091 74452 74165 45523 40933 43695 58110 52090 49017 43363 47004 80523 78550 57112
15137 57112 39486 -856 25990 46540 52276 45989 43488 25457 -14622 -28186 2425 16361
15125 16361 37745 73640 83362 98902 111698 118252 135764 117355 101796 51459 37879 53424
15113 53424 68453 62250 53540 50704 34524 36119 50167 63849 32429 20475 20189 13914 13245
15100 13245 10450 4205 31011 35212 48621 48744 41610 39414 62207 62828 64727 39901 14394 -6942
15086 -6942 39322 57307 48600 38790 45983 76154 127102 174833 200311 214801 309731 403818
15074 403818 538413 683576 825979 1029127 1249258 1507322 1825003 2143647 2441915 2708984
$$ packed form
15163A18504l073r320j248m9714k7155J5317M991M596M331R994J4531K7716l379
15150A06091l1639k87k8642m590K762J4415o020l073n654L641L3519j973k1438
15137E7112j7626m0342K6846K0550N736o287k501j8031m0079j3564L0611J3936
15125A6361K1384L5895R722J5540J2796O554J7512j8409j5559n0337j3580J5545
15113E3424J5029o203q710k836j6180J595J4048J3682l1420j1954k86o275o69
15100A3245k795o245K6806M201J3409J23p134k196K2793O21J899k4826k5507k1336
15086f942M6264J7985q707r810P193L0171N0948M7731K5478J4490R4930R4087
15074D03818J34595J45163J42403K03148K20131K58064L17681L18644K98268K67069
$$ plain form
15064 2708984 2939355 3074018 3160650 3147274 3024124 2853683 2618988 2326757 2040641 1746902
15054 1746902 1501035 1297238 1102256 957027 855729 786480 711290 649540 585657 565182
15044 565182 571349 562577 530085 504079 473441 450896 463244 459021 433007 420778 424548 440315
15032 440315 445515 467214 453540 417607 392337 375463 359423 344718 334689 348407 392169 422586
15020 422586 445526 479604 504094 568995 676730 801372 1007330 1417629 2142725 3148016
15010 3148016 4037165 4558917 5159090 5753260 5904161 5533744 4055810 2531916 1727663
15001 1727663 1318699 1085275 924981 834581 785902 746944 713325 683452 661686 641960 602608
14990 602608 587848 571834 551270 485703 444711 430220 423406 411645 391580 389087 392287 378516
$$ packed form
15064B708984K30371J34663Q6632j3376j23150j70441k34695k92231k86116k93739
15054A746902k45867k03797j94982j45229j01298o9249p5190o1750o3883k0475
15044E65182O167q772l2492k6006l0638k2545J2348m223k6014j2229L770J5767
15032D40315N200K1699j3674l5933k5270j6874j6040j4705j0029J3718M3762L0417
15020D22586K2940L4078K4490O4901J07735J24642K05958M10299P25096J005291
15010C148016Q89149N21752O00173N94170J50901l70417j477934j523894q04253
15001A727663m08964k33424j60294r0400m8679l8958l3619k9873k1766j9726l9352
14990F02608j4760j6014k0564o5567m0992j4491o814j1761k0065k493L200j3771
$$ plain form
14978 378516 362876 345316 359402 372685 336535 314472 286740 274285 247282 244997 248308 232944
14966 232944 197020 176116 182991 213516 225781 204744 214926 226295 212894 221635 190208 192143
14954 192143 189196 178557 170861 154699 163608 146155 125403 142702 128254 109131 101621 135090
14942 135090 158902 171166 159813 140975 131915 138182 154414 177934 129977 73266 90500 111478
14930 111478 114416 127269 125459 129535 146384 159970 149570 166697 203506 244937 266790 323062
14918 323062 381972 456729 482458 496124 498082 480137 483580 471020 480645 475076 470224 434420
14906 434420 411881 381757 379175 343578 343198 343350 319542 314585 303168 279889 284700 279586 250119
14893 250119 232064 225326 224160 245152 263314 256251 263511 246083 226417 233013 220279 243433
$$ packed form
14978C78516j5640j7560J4086J3283l6150k2063k7732j2455k7003k285L311j5364
14966B32944l5924k0904O875L0525J2265k1037J0182J1369j3401Q741l1427J935
14954A92143k947j0639p696j6162Q909j7453k0752J7299j4448j9123p510L3469
14942A35090K3812J2264j1353j8838r060O267J6232K3520m7957n6711J7234K0978
14930A11478K938J2853j810M076J6849J3586j0400J7127L6809M1431K1853N6272
14918C23062N8910P4757K5729J3666J958j7945L443j2560R625n569m852l5804
14906D34420k2539l0124k582l5597l80J52k3808m957j1417k3279M811n114k9467
14893B50119j8055o738j166K0992J8162p063P260j7428j9666O596j2734K3154
$$ plain form
14881 243433 267611 253064 289456 317692 315598 310702 317738 322866 328378 344036 373223 403676
14869 403676 406082 417777 420375 435007 441697 490228 490142 460015 465798 469660 455543 453065 459247
14856 459247 430045 413517 406869 420724 403661 372689 353657 308194 298681 312122 324202 329372
14844 329372 336472 351177 343157 339076 344858 351170 364600 401666 420021 421983 467347 514930 564932
14831 564932 580966 562633 543806 530852 542111 548013 550157 508406 481316 480981 477600 459822
14819 459822 459977 475106 467713 457822 439625 404843 376231 386590 411643 452597 491254 520806
14807 520806 552798 623920 736674 847837 957605 1089275 1195219 1291320 1401218 1484118
14797 1484118 1529998 1557759 1604177 1607721 1565659 1483105 1406450 1353859 1284633 1186939 1067051
$$ packed form
14881B43433K4178j4547L6392K8236k094m896P036N128N512J5658K9187L0453
14869D03676K406J1695K598J4632O690M8531q6l0127N783L862j4117k478O182
14856D59247k9202j6528o648J3855j7063l0972j9032m5463r513J3441J2080N170
14844C29372P100J4705q020m081N782O312J3430L7066J8355J962M5364M7583N0002
14831E64932J6034j8333j8827j2954J1259N902K144m1751k7090l35l381j7778
14819D59822J55J5129p393r891j8197l4782k8612J0359K5053M0954L8657K9552
14807E20806L1992P1122J12754J11163J09768J31670J05944R6101J09898Q2900
14797A484118M5880K7761M6418L544m2062q2554p6655n2591o9226r7694j19888
$$ plain form
14786 1067051 941937 858809 804813 743124 670463 611924 585869 581228 572697 561832 544830
14775 544830 521782 517236 530000 545370 575064 613051 630694 688246 741266 763243 771205 773926
14763 773926 783061 771877 751983 733710 720064 690042 666928 644471 624700 631881 624327 618185
14751 618185 636869 656204 668388 682623 703811 736612 769091 794265 842898 896058 927015
14740 927015 966279 979799 1000114 1029765 1005751 972404 942840 936983 928128 914120 900336 893020
14728 893020 890856 908053 887082 866340 889710 887258 908673 925482 953748 959780 971251 974237
14716 974237 1016419 1056197 1065165 1070819 1111107 1118368 1161526 1197084 1177131 1190587 1216636 1233623
14704 1233623 1255073 1266039 1298744 1288476 1259934 1264757 1246112 1239700 1242345 1256264 1265252 1266845
$$ packed form
14786A067051j25114q3128n3996o1689p2661n8539k6055m641q531j0865j7002
14775E44830k3048m546J2764J5370K9694L7987J7643N7552N3020K1977P962K721
14763G73926R135j1184j9894j8273j3646l0022k3114k2457j9771P181p554o142
14751F18185J8684J9335J2184J4235K1188L2801L2479K5174M8633N3160L0957
14740I27015L9264J3520K0315K9651k4014l3347k9564n857q855j4008j3784p316
14728H93020k164J7197k0971k0742K3370k452K1415J6809K8266O032J1471K986
14716I74237M2182L9778Q968N654M0288P261M3158L5558j9953J3456K6049J6987
14704A233623K1450J0966L2705j0268k8542M823j8645o412K645J3919Q988J593
$$ plain form
14692 1266845 1256287 1256967 1226459 1252178 1281814 1292679 1296926 1295979 1316488 1331718 1392512 1429680
14680 1429680 1483577 1558097 1596412 1641110 1702419 1749081 1804334 1856674 1881663 1909518 1945930
14669 1945930 2007131 2063992 2098957 2155670 2221420 2278810 2327719 2401531 2476802 2565385 2651372
14658 2651372 2732403 2809280 2885627 2975274 3101195 3208751 3301140 3397283 3512254 3649064
14648 3649064 3771938 3937188 4128974 4318406 4540051 4823723 5127537 5494273 5969775
14639 5969775 6496318 7098681 7788882 8520637 9403773 10436490 11608531 12949874 14564103
14630 14564103 16467524 18779762 21486635 24700232 28499684 33003779 38506631 45432641
14622 45432641 54590923 67171179 84531053 107748213 137389083 174496264 220215345
$$ packed form
14692A266845j0558O80l0508K5719K9636J0865M247r47K0509J5230O0794L7168
14680A429680N3897P4520L8315M4698O1309M6662N5253N2340K4989K7855L6412
14669A945930O1201N6861L4965N6713O5750N7390M8909P3812P5271Q8583Q5987
14658B651372Q1031P6877P6347Q9647J25921J07556R2389R6143J14971J36810
14648C649064J22874J65250J91786J89432K21645K83672L03814L66736M75502
14639E969775N26543O02363O90201P31755Q83136J032717J172041J341343J614229
14630A4564103J903421K312238K706873L213597L799452M504095N502852O926010
14622D5432641R158282J2580256J7359874K3217160K9640870L7107181M5719081
$$ plain form
14615 220215345 273574412 330859917 387473440 440427144 487740298 525466419 547905333
14608 547905333 551710737 538652504 512430419 474775645 426632664 371736518 316782186
14601 316782186 266766218 222954006 185207496 154220441 130826183 114214357 102184677
14594 102184677 92960669 85460346 79065261 73403813 68343036 63844106 59836773 56320667
14586 56320667 53224473 50472003 48026353 45881420 43956549 42224063 40600016 39103799
14578 39103799 37703362 36385102 35130622 33940123 32794405 31726812 30709676 29727332
14570 29727332 28806341 27913427 27081301 26316698 25605834 24916673 24292733 23710556 23129243
14561 23129243 22543699 21995803 21451284 20884870 20314107 19760437 19234575 18726756 18215981
$$ packed form
14615B20215345N3359067N7285505N6613523N2953704M7313154L7726121K2438914
14608E47905333L805404j3058233k6222085l7654774m8142981n4896146n4954332
14601C16782186n0015968m3812212l7746510l0987055k3394258j6611826j2029680
14594A02184677r224008p500323o395085n661448n060777m498930m007333l516106
14586E6320667l096194k752470k445650k144933j924871j732486j624047j496217
14578C9103799j400437j318260j254480j190499j145718j067593j017136r82344
14570B9727332r20991q92914q32126p64603p10864o89161o23940n82177n81313
14561B3129243n85544n47896n44519n66414n70763n53670n25862n07819n10775
$$ plain form
14552 18215981 17679920 17179482 16687164 16153097 15625577 15137978 14704969 14306798 13932460
14543 13932460 13574259 13238299 12934502 12685891 12427318 12142214 11854915 11565933 11298337
14534 11298337 11008313 10757712 10480799 10213720 9956594 9677489 9374211 9114203 8882287
14525 8882287 8635873 8336414 8096253 7879466 7642127 7396094 7132009 6935930 6748658
14516 6748658 6558757 6395527 6228900 6063157 5895103 5734394 5575074 5443740 5311573
14507 5311573 5183875 5056670 4930587 4794589 4689116 4571319 4446149 4330609 4227585
14498 4227585 4126754 4028079 3901252 3814720 3749802 3693544 3642263 3576229 3508929 3484184 3440508
14487 3440508 3410997 3378099 3330494 3278864 3214673 3176123 3114141 3017638 2949961 2884412 2795834
$$ packed form
14552A8215981n36061n00438m92318n34067n27520m87599m33009l98171l74338
14543A3932460l58201l35960l03797k48611k58573k85104k87299k88982k67596
14534A1298337k90024k50601k76913k67079k57126k79105l03278k60008k31916
14525H882287k46414k99459k40161k16787k37339k46033k64085j96079j87272
14516F748658j89901j63230j66627j65743j68054j60709j59320j31334j32167
14507E311573j27698j27205j26083j35998j05473j17797j25170j15540j03024
14498D227585j00831r8675j26827q6532o4918n6258n1281o6034o7300k4745m3676
14487C440508k9511l2898m7605n1630o4191l8550o1982r6503o7677o5549q8578
$$ plain form
14476 2795834 2701268 2640670 2614941 2561302 2499721 2435870 2376432 2337262 2287372 2251326 2163071
14465 2163071 2079147 2019613 1950572 1854476 1746931 1665455 1566530 1414678 1318914 1231030 1156622
14454 1156622 1091354 1040316 955150 897718 841407 808025 805063 796263 797285 797373 767033 743903
14442 743903 721391 722482 733659 724905 660105 598789 548157 518731 503352 471667 421144 406194
14430 406194 381716 321424 281693 259076 273100 275855 254654 237266 216410 204755 194224 181671
14418 181671 204375 183374 156664 192911 240784 254358 274688 303531 365905 422550 436864
14407 436864 444754 447057 419750 397743 405240 372862 317634 266146 230707 212614 224840 235595
14395 235595 214835 166122 117412 102425 115992 109195 118758 106668 93115 76784 77737 88903
$$ packed form
14476B795834r4566o0598k5729n3639o1581o3851n9438l9170m9890l6046q8255
14465B163071q3924n9534o9041r6096j07545q1476r8925j51852r5764q7884p4408
14454A156622o5268n1038q5166n7432n6311l3382k962q800J022Q8l0340k3130
14442G43903k2512J091J1177q754o4800o1316n0632k9426j5379l1685n0523j4950
14430D06194k4478o0292l9731k2617J4024K755k1201j7388k0856j1655j0531j2553
14418A81671K2704k1001k6710L6247M7873J3574K0330K8843O2374N6645J4314
14407D36864P890K303k7307k2007P497l2378n5228n1488l5439j8093J2226J0755
14395B35595k0760m8713m8710j4987J3567o797R563j2090j3553j6331R53J1166
$$ plain form
14383 88903 97090 123265 131206 157985 188688 220106 259679 271683 272582 258980 270253 259411
14371 259411 246720 236230 252245 285347 281533 268302 250177 261727 261192 240331 229273 236562
14359 236562 260719 264875 267212 273180 290370 277517 254498 253332 255853 247392 275779 239268 238723
14346 238723 268263 265270 257416 242546 233159 229567 235745 243321 278027 273730 270645 291452 269178
14333 269178 232527 218788 186640 182639 172141 171902 163414 157490 157525 157465 165167 136969 92196 75234
14319 75234 70719 71934 53230 28095 14377 -184 -34344 -64889 -77582 -108261 -142887 -161296
14307 -161296 -171742 -201994 -226360 -247591 -269472 -283853 -257182 -210630 -186100 -133320 -70824
14296 -70824 -45939 -40692 -3867 27088 70232 99857 108091 94765 48652 39526 54151 52983
$$ packed form
14383H8903Q187K6175P941K6779L0703L1418L9573J2004Q99j3602J1273j0842
14371B59411j2691j0490J6015L3102l814j3231j8125J1550n35k0861j1058P289
14359B36562K4157M156K337N968J7190j2853k3019j166K521q461K8387l6511n45
14346B38723K9540k993p854j4870r387l592O178P576L4706m297l085K0807k2274
14333B69178l6651j3739l2148m001j0498k39q488n924L5o0P702k8198m4773j6962
14319G5234m515J215j8704k5135j3718j4561l4160l0545j2693l0679l4626j8409
14307a61296j0446l0252k4366k1231k1881j4381K6671M6552K4530N2780O2496
14296g0824K4885N247L6825L0955M3144K9625Q234j3326m6113r126J4625j168
$$ plain form
14284 52983 50807 58927 83065 102239 86615 68250 62258 68413 83119 61479 59985 69778 68181
14271 68181 52356 50393 66437 49029 39528 47478 53025 52090 69497 71667 87305 75383 54689
14258 54689 75629 65887 69494 92599 62597 62537 93104 99669 106652 93511 77407 83969 89007
14245 89007 63454 75173 107368 112047 103046 92495 89922 85311 68033 86697 95251 85101 38403
14232 38403 21588 15557 24939 41212 52036 49236 31945 17718 16865 4259 -34910 -40061 -33438
14219 -33438 -2574 37030 63138 40236 532 -738 1733 3604 14064 13490 36391 58055 78974
14206 78974 89481 66226 26824 18932 19280 4707 -25317 -58722 -20334 15328 17323 36042
14194 36042 41791 36205 28697 37405 22995 9219 8 4973 5207 5538 -35601 -33980 -14545 -3466
$$ packed form
14284E2983k176Q120K4138J9174j5624j8365n992O155J4706k1640j494R793j597
14271F8181j5825j963J6044j7408r501P950N547r35J7407K170J5638j1922k0694
14258E4689K0940r742L607K3105l0002o0L0567O565O983j3141j6104O562N038
14245H9007k5553J1719L2195M679r001j0551k573m611j7278J8664Q554j0150m6698
14232C8403j6815o031R382J6273J0824k800j7291j4227q53j2606l9169n151O623
14219c3438L0864L9604K6108k2902l9704j270K471J871J0460n74K2901K1664K0919
14206G8974J0507k3255l9402p892L48j4573l0024l3405L8388L5662J995J8719
14194C6042N749n586p508Q708j4410j3776r211M965K34L31m1139J621J9435J1079
$$ plain form
14180 -3466 5208 9362 -12296 -18362 12356 41926 43733 75594 51482 45099 56062 86967 98377
14167 98377 126858 127667 135848 174587 204031 256576 333435 364487 446351 574977 747898 979200
14155 979200 1279407 1572784 1863920 2144995 2421900 2690670 2846343 2890399 2866907 2751238
14145 2751238 2579124 2363226 2110987 1837602 1556532 1309691 1101671 925826 820577
14136 820577 759329 688015 614419 582459 563352 539960 529238 543841 513047 440744 405365
14125 405365 346819 336181 310459 285756 273071 246888 248602 227989 228778 222405 231176 230801 241856
14112 241856 230151 213828 216457 217122 206895 187123 174763 172484 172200 148913 133319 145117 147003
14099 147003 156201 162204 179761 163189 126792 106352 105466 126000 127486 111374 96704 82849
$$ packed form
14180c466Q674M154k1658o066L0718K9570J807L1861k4112o383J0963L0905J1410
14167I8377K8481Q09Q181L8739K9444N2545P6859L1052Q1864J28626J72921K31302
14155I79200L00207K93377K91136K81075K76905K68770J55673M4056k3492j15669
14145B751238j72114k15898k52239k73385k81070k46841k08020j75845j05249
14136H20577o1248p1314p3596l1960j9107k3392j0722J4603l0794p2303l5379
14125D05365n8546j0638k5722k4703j2685k6183J714k0613P89o373Q771l75J1055
14112B41856j1705j6323K629O65j0227j9772j2360k279k84k3287j5594J1798J886
14099A47003R198O003J7557j6572l6397k0440q86K0534J486j6112j4670j3855
$$ plain form
14087 82849 61194 73634 96287 137729 158318 132778 129199 115179 90982 68324 76172 95499
14075 95499 104177 74345 73118 95349 114509 120004 127964 143526 143182 125995 73766 61911 56873
14062 56873 79232 83233 52425 75577 98413 75181 86371 143698 231970 259285 275032 306840
14050 306840 313515 296156 308191 316740 303091 286620 214607 158690 117678 88456 101520 118630
14038 118630 85067 84371 87025 57088 68565 66237 60975 80951 84207 69336 78240 94706 97331
14025 97331 117519 121567 121910 88299 88369 81046 104304 151573 199935 240094 244095 242282 257009
14012 257009 258298 245158 241369 242051 222618 174270 135207 101613 100812 85915 55450 81021 102043
13999 102043 101342 70820 66612 55464 55137 71561 92900 127463 130154 111085 63914 29536 3748
$$ packed form
14087H2849k1655J2440K2653M1442K0589k5540l579j4020k4197k2658P848J9327
14075I5499Q678k9832j227K2231J9160N495P960J5562l44j7187n2229j1855n038
14062E6873K2359M001l0808K3152K2836k3232J1190N7327Q8272K7315J5747L1808
14050C06840O675j7359J2035Q549j3649j6471p2013n5917m1012k9222J3064J7110
14038A18630l3563o96K654k9937J1477k328n262J9976L256j4871Q904J6466K625
14025I7331K0188M048L43l3611P0p323K3258M7269M8362M0159M001j813J4727
14012B57009J289j3140l789O82j9433m8348l9063l3594q01j4897l0465K5571K1022
13999A02043p01l0522m208j1148l27J6424K1339L4563K691j9069m7171l4378k5788
$$ plain form
13986 3748 4593 16391 11423 58771 94330 86638 66089 43991 67669 55181 48969 72592 72724
13973 72724 71243 98731 107522 57565 38458 64465 45922 11138 4934 23938 27948 20681 31297
13960 31297 39185 30278 10637 -4118 -23046 -22416 -15476 -8261 -12695 -12710 29146 60341 40660 54711
13946 54711 41643 28737 30141 36292 57752 57085 36080 -12694 18579 27825 -4435 -114 1501
13933 1501 955 12322 29746 19711 14675 41592 49034 27702 30857 36216 24882 49417 70772
13920 70772 62102 67959 80598 73003 59943 30442 15953 10515 25113 69590 46311 -37065
13908 -37065 -60509 -39940 -33901 -16180 -7777 28104 12797 5 9579 11248 20775 25811 24617
13895 24617 60406 44858 4495 -15722 -9455 24114 29751 24169 31005 22608 14217 1165 -20842
$$ packed form
13986C748Q45J1798m968M7348L5559p692k0549k2098K3678j2488o212K3623J32
13973G2724j481K7488Q791m9957j9107K6007j8543l4784o204J9004M010p267J0616
13960C1297P888q907j9641j4755j8928O30O940P215m434j5M1856L1195j9681J4051
13946E4711j3068j2906J404O151K1460o67k1005m8774L1273R246l2260M321J615
13933A501n46J1367J7424j0035n036K6917P442k1332L155N359j1334K4535K1355
13920G0772q670N857J2639p595j3060k9501j4489n438J4598M4477k3279q3376
13908c7065k3444K0569O039J7721Q403L5881j5307j2792R574J669R527N036j194
13895B4617L5789j5548m0363k0217O267L3569N637n582O836q397q391j3052k2007
$$ plain form
13882 -20842 -37395 -10891 22686 17982 5287 -9101 -20386 -15770 -36579 -44070 -12021 -7878
13870 -7878 1810 37100 43866 44001 37437 19519 7703 -37947 -39202 -36563 -40384 -38861 -10293 -2645
13856 -2645 18293 11997 -14210 -31787 -17496 22937 54133 56010 56133 59623 64942 71748 51210
13843 51210 9367 7123 4497 5727 -6466 -2467 3305 -12479 24037 37239 42219 34105 17311
13830 17311 26612 9212 18683 7628 5616 -4214 -6037 18922 54704 65801 71838 141025 204436
13817 204436 279921 340705 412956 504421 556752 581127 586557 584956 518863 444419 393345 337668
13805 337668 259238 188120 144592 113885 118238 95286 60972 34688 56255 49921 65257 87243
13793 87243 98965 100278 78809 42708 10169 6227 34320 35768 10488 20787 22401 46098
$$ packed form
13882b0842j6553K6504L3577m704j2695j4388j1285M616k0809p491L2049M143
13870g878R688L5290O766J35o564j7918j1816m5650j255K639l821J523K8568P648
13856b645K0938o296k6207j7577J4291M0433L1196J877J23L490N319O806k0538
13843E1210m1843k244k626J230j2193L999N772j5784L6516J3202M980q114j6794
13830A7311R301j7400R471j1055k012r830j823K4959L5782J1097O037O9187O3411
13817B04436P5485O0784P2251R1465N2331K4375N430j601o6093p4444n1074n5677
13805C37668p8430p1118m3528l0707M353k2952l4314k6284K1567o334J5336K1986
13793H7243J1722J313k1469l6101l2539l942K8093J448k5280J0299J614K3697
$$ plain form
13781 46098 47655 22770 15866 16092 26014 3208 -5366 7683 18250 20134 38802 49085 60535
13768 60535 61490 71286 73467 75794 71495 49835 29792 29847 42514 36081 32721 7014 12919 29795
13754 29795 31132 11421 -2204 -20964 -30051 -41117 -45300 -37941 -25314 -17276 -28611 -40823 -39214
13741 -39214 -4144 1250 -7288 -11099 -9909 -16237 15524 -8749 -49793 -48922 -42188 -40787 -47431 -44526
13727 -44526 -37300 -34363 -23244 -8827 -1847 -7291 -15720 -36881 -59554 -51232 -42353 -16508 -15185
13714 -15185 -6640 -11486 -4332 -4610 8458 4735 -14922 -42641 -63274 -46377 -38125 -16490 -16530 -38571
13700 -38571 -36913 -20386 -19324 -39542 -44053 -45444 -61924 -56938 -47334 -39870 -25380 10328 31710
13687 31710 -4476 -5614 -291 -4075 3383 25823 49830 31675 9027 150 -12165 -13836 -25078
$$ packed form
13781D6098J557k4885o904K26R922k2806q574J3049J0567J884J8668J0283J1450
13768F0535R55R796K181K327m299k1660k0043N5J2667o433l360k5707N905J6876
13754B9795J337j9711j3625j8760r087j1066m183P359J2627Q038j1335j2212J609
13741c9214L5070N394q538l811J190o328L1761k4273m1044Q71O734J401o644K905
13727d4526P226K937J1119J4417O980n444q429k1161k2673Q322Q879K5845J323
13714a5185Q545m846P154k78J3068l723j9657k7719k0633J6897Q252K1635m0k2041
13700c8571J658J6527J062k0218m511j391j6480M986R604P464J4490L5708K1382
13687C1710l6186j138N323l784P458K2440K4007j8155k2648q877j2315j671j1242
$$ plain form
13674 -25078 -20795 -13839 15325 45284 15678 4217 -13519 -26595 -49567 -47080 -40141 -10329
13662 -10329 -17238 -23718 -36562 -44461 -24171 19606 44391 16010 -6701 -17978 -14113 14626
13650 14626 27361 -9098 -19096 -30596 -48287 -19388 -7047 944 -4030 -31725 -21255 -42471
13638 -42471 -46061 -19906 8527 29423 36444 11155 -5244 14201 55832 69198 41771 19597
13626 19597 24732 27906 9068 -13122 -21513 -47514 -28870 -24640 -25084 3006 33171 31110 20051
13613 20051 10551 24514 21959 15562 18235 44341 24755 29740 33072 19643 2391 -4673 -7130
13600 -7130 3572 1562 -12202 -14210 -487 -22810 -24187 -25127 -26287 -10757 -5644 1247 -2813 -4977
13586 -4977 13002 25210 22410 44694 56056 43413 2905 -37702 -53514 -66223 -40935 -21374
$$ packed form
13674b5078M283O956K9164K9959k9606j1461j7736j3076k2972K487O939K9812
13662a0329o909o480j2844p899K0290M3777K4785k8381k2711j1277L865K8739
13650A4626J2735l6459r998j1500j7691K8899J2341P991m974k7695J0470k1216
13638d2471l590K6155K8433K0896P021k5289j6399J9445M1631J3366k7427k2174
13626A9597N135L174j8838k2190q391k6001J8644M230m44K8090L0165k061j1059
13613B0051r500J3963k555o397K673K6106j9586M985L332j3429j7252p064k457
13600g130J0702k010j3764k008J3723k2323j377r40j160J5530N113O891m060k164
13586d977J7979J2208k800K2284J1362j2643m0508m0607j5812j2709K5288J9561
$$ plain form
13574 -21374 -58487 -79715 -55843 -36118 -36115 -23402 2433 23068 10109 -11538 12656 22895
13562 22895 11787 29444 27408 12620 37008 15583 3603 -16693 -26626 -32370 -37460 -15254
13550 -15254 -24175 -50041 -57175 -37563 -50868 -59468 -52043 -38007 -24263 -26468 -49439 -62470 -50198
13537 -50198 -33372 -29740 -29383 -15319 -9189 -4894 -41665 -41329 -33299 -3201 18949 20391 23242 35130
13523 35130 -7374 -31512 -29914 -32327 -45045 -42506 -56281 -77203 -48809 -10336 4738 -548
13511 -548 -6658 1979 8350 2865 17713 17178 -5785 -5139 10636 23167 9499 -17612 -5812 2292
13497 2292 -15158 -296 2602 12464 14488 17378 3315 -29154 -39154 -27598 3469 -23164 -21130
13484 -21130 -16822 -33522 -33205 -50419 -59298 -39816 -19663 -295 -12476 -18464 -35581 -56977 -64063
$$ packed form
13574b1374l7113k1228K3872J9725LJ2713K5835K0635j2959k1647K4194J0239
13562B2895j1108J7657k036j4788K4388k1425j1980k0296r933n744n090K2206
13550a5254q921k5866p134J9612j3305q600P425J4036J3744k205k2971j3031J2272
13537e0198J6826L632L57J4064O130M295l6771L36Q030L0098K2150J442K851J1888
13523C5130m2504k4138J598k413j2718K539j3775k0922K8394L8473J5074n286
13511e48o110Q637O371n485J4848n35k2963O46J5775J2531j3668k7111J1800Q104
13497B292j7450J4862K898R862K024K890j4063l2469j0000J1556L1067k6633K034
13484b1130M308j6700L17j7214q879J9482K0153J9368j2181n988j7117k1396p086
$$ plain form
13471 -64063 -56727 -42625 -29684 -27712 -17702 -17770 -29763 -55551 -49464 -40821 -51930 -79340 -49985
13458 -49985 -5237 1885 11970 15325 4170 -3372 -16766 -36544 -48651 -38581 -20332 -21268 -26750
13445 -26750 -12114 -558 -11451 -5033 -12547 -50802 -46036 -42842 -40136 -40054 -29118 -20871 -2763
13432 -2763 6769 6675 9616 7414 24685 -8233 -11101 22705 33407 11136 14002 25001 39831
13419 39831 33954 25853 20024 21065 11785 -7353 -15493 -1573 15640 6728 2213 -8719 -11914
13406 -11914 13311 43530 4468 -4049 1250 -3899 2 -582 3550 -213 12191 4113 -2608 -18940
13392 -18940 -3631 -7120 491 19979 11428 13799 -6019 -4788 8986 -7796 -19828 -26650 -46002
13379 -46002 -43806 -31622 -7076 21965 37107 45231 27712 16033 16844 20945 13350 5190 -6258
$$ packed form
13471f4063P336J4102J2941J972J0010o8j1993k5788O087Q643j1109k7410K9355
13458d9985M4748P122J0085L355j1155p542j3394j9778j2107J0070J8249r36n482
13445b6750J4636J1556j0893O418p514l8255M766L194K706Q2J0936Q247J8108
13432b763R532r4K941k202J7271l2918k868L3806J0702k2271K866J0999J4830
13419C9831n877q101n829J041r280j9138q140J3920J7213q912m515j0932l195
13406a1914K5225L0219l9062q517N299n149L901n84M132l763J2404q078o721j6332
13392a8940J5309l489P611J9488q551K371j9818J231J3774j6782j2032o822j9352
13379d6002K196J2184K4546K9041J5142Q124j7519j1679Q11M101p595q160j1448
$$ plain form
13366 -6258 1756 15347 31017 49343 25632 -5795 -8518 17718 -6029 -12729 -532 786 14760
13353 14760 16269 32471 38166 23222 20140 186 -25397 -42906 -39583 -29813 -52582 -47326 -20641
13340 -20641 -18525 -39298 -27984 -17593 -7483 9385 34453 49427 48116 27566 12527 -5474
13328 -5474 7343 11943 12605 24867 21121 21758 46726 53220 48800 32851 -1849 -18514 2971
13315 2971 5662 -3221 9339 24315 22982 20652 5026 -6861 -2254 -20305 -15560 -25549 -49992
13302 -49992 -26131 -1857 48264 64009 37618 36927 35136 31411 26654 8723 10730 5146 11833
13289 11833 18263 11308 -16651 -50063 -64230 -45790 -30072 -31873 -32230 -11459 -9628 -33180 -50922
13276 -50922 -39732 -23551 -21660 15191 28809 1568 -4394 21127 31409 20815 -2328 -28889
$$ packed form
13366f258Q014J3591J5670J8326k3711l1427k723K6236k3747o700J2197J318J3974
13353A4760J509J6202N695j4944l082j9954k5583j7509L323R770k2769N256K6685
13340b0641K116k0773J1314J0391J0110J6868K5068J4974j311k0550j5039j8001
13328e474J2817M600O62J2262l746O37K4968O494m420j5949l4700j6665K1485
13315B971K691q883J2560J4976j333k330j5626j1887M607j8051M745r989k4443
13302d9992K3861K4274N0121J5745k6391o91j791l725m757j7931K007n584O687
13289A1833O430o955k7959l3412j4167J8440J5718j801l57K0771J831k3552j7742
13276e0922J1190J6181J891L6851J3618k7241n962K5521J0282j0594k3143k6561
$$ plain form
13264 -28889 -12806 10008 2960 -12225 -7678 2522 5379 37136 61419 56951 34349 21694
13252 21694 16988 31591 49864 35659 20304 23534 19180 8757 -38 -317 -12493 17583 -2334
13239 -2334 -36621 -32611 -44853 -25361 -36199 -45435 -23959 9670 37471 39039 27864 30766 16766
13226 16766 16894 33762 33713 31912 82193 108664 124422 138160 122280 119461 127355 117688 76984
13213 76984 42829 44263 41410 33800 49485 54196 70291 54319 14979 26254 46071 50894 37437
13200 37437 6492 -40985 -35095 -10354 -6691 -8020 -17799 -17532 -13854 -467 -8332 -5247 5999
13187 5999 -34371 -37560 -36961 -25972 -36135 -47031 -35400 -2093 33147 66477 85749 84645 77848
13174 77848 63412 70741 48143 13781 24446 38357 37589 34782 34268 5722 7501 25655 40962
$$ packed form
13264b8889J6083K2814p048j5185M547J0200K857L1757K4283m468k2602j2655
13252B1694m706J4603J8273j4205j5355L230m354j0423q795k79j2176L0076j9917
13239b334l4287M010j2242J9492j0838r236K1476L3629K7801J568j1175K902j4000
13226A6766J28J6868m9j801N0281K6471J5758J3738j5880k819P894r667m0704
13213G6984l4155J434k853p610J5685M711J6095j5972l9340J1275J9817M823j3457
13200C7437l0945m7477N890K4741L663j329r779K67L678J3387p865L085J1246
13187E999m0370l189N99J0989j0163j0896J1631L3307L5240L3330J9272j104o797
13174G7848j4436P329k2598l4362J0665J3911p68k807n14k8546J779J8154J5307
$$ plain form
13161 40962 46123 52691 26268 -4008 -19984 -32015 -23322 -38293 -31594 -37692 -44903 -26855 -1086
13148 -1086 -1311 -63 6138 1330 313 -15257 -13416 -16714 16118 18336 13929 34714 51343 18823
13134 18823 -5591 -25447 -31740 -7579 26245 29999 17730 30200 27000 -5699 -19938 -16598
13122 -16598 5194 26798 43882 53800 49178 43003 51823 45455 28069 39767 26203 9303 -18542
13109 -18542 -53446 -55702 -57084 -16737 6388 21524 13921 -41270 -67427 -54606 -42277 -32160
13097 -32160 -7585 -8113 -32934 -78370 -63463 -5840 29714 29030 -4741 -13181 -15284 1189 24967
13084 24967 1573 -23940 -23793 -15231 -5999 1869 -18651 -19953 -25613 -17040 -7426 3889 75 2454
13070 2454 26782 13506 -4803 -15057 -14191 -11679 -14561 -25188 -16564 -24666 -14588 -23568 -44548
$$ packed form
13161D0962N161O568k6423l0276j5976j2031Q693j4971O699o098p211J8048K5769
13148a086k25J248O201m808j017j5570J841l298L2832K218m407K0785J6629l2520
13134A8823k4414j9856o293K4161L3824L754j2269J2470l200l2699j4239L340
13122a6598K1792K1604J7084R918m622o175Q820o368j7386J1698j3564j6900k7845
13109a8542l4904k256j382M0347K3125J5136p603n5191k6157J2821J2329J0117
13097c2160K4575n28k4821m5436J4907N7623L5554o84l3771q440k103J6473K3778
13084B4967k3394k5513J47Q562R232P868k0520j302n660Q573R614J1315l814K379
13070B454K4328j3276j8309j0254Q66K512k882j0627Q624q102J0078q980k0980
$$ plain form
13057 -44548 -46032 -18225 -26508 -38448 -8619 6970 -8482 -22717 -31347 -24531 -23406 -34542 -20610
13044 -20610 -9513 18291 44989 26925 9109 -9295 -30712 -40924 -18808 -23292 -21076 -29787
13032 -29787 -42211 -30581 -4268 -647 -9571 -17589 -12731 11958 6225 2519 -1042 -25931 -26149
13019 -26149 10757 40756 66164 54633 53606 51282 53004 44064 41605 40649 34188 11659 25550
13006 25550 9191 -9755 -20422 -37852 -60499 -35946 15700 15680 -37100 -53370 -33232 1092
12994 1092 30727 32937 26708 21973 -2793 -10649 -10895 2583 16440 1962 7449 -7703 -10071
12981 -10071 -7394 -29309 -9632 -802 6933 -340 8115 32510 40071 37717 32709 47894 68815
12968 68815 48475 61887 85933 82114 63607 44875 67519 88277 96301 122724 141178 143514
$$ packed form
13057d4548j484K7807q283j1940K9829J5589j5452j4235q630O816J125j1136J3932
13044b0610J1097K7804K6698j8064j7816j8404k1417j0212K2116m484K216q711
13032b9787j2424J1630K6313L621q924q018M858K4689n733l706l561k4889k18
13019b6149L6906K9999K5408j1531j027k324J722q940k459r56o461k2529J3891
13006B5550j6359j8946j0667j7430k2647K4553N1646k0n2780j6270K0138L4324
12994A092K9635K210o229m735k4766p856k46J3478J3857j4478N487j5152k368
12981a0071K677k1915J9677Q830P735p273Q455K4395P561k354n008J5185K0921
12968F8815k0340J3412K4046l819j8507j8732K2644K0758Q024K6423J8454K336
$$ plain form
12956 143514 137614 166970 207107 221894 242634 236660 211456 187560 181423 205433 218784 208196
12944 208196 197440 202173 183003 150364 122552 81075 62126 35627 27031 36794 14403 3369
12932 3369 13845 22157 -2083 9145 23357 26492 49727 42001 8776 -11452 -8904 4783 22473
12919 22473 36093 38644 11070 11258 5004 -1026 -18099 -24522 -17293 -21165 -32423 -28281 -14013
12906 -14013 1318 -10874 -14750 -12478 32061 42515 6354 15219 24562 35702 49673 58673 43698
12893 43698 24645 24781 18690 60383 52892 19115 22690 39446 18969 17086 16200 24491 38047
12880 38047 42972 39230 73924 94140 77781 104658 158260 224023 350181 518741 667387
12869 667387 746824 824910 899211 923321 879871 655457 410439 295394 205610 169813 163937
$$ packed form
12956A43514n900K9356M0137J4787K0740n974k5204k3896o137K4010J3351j0588
12944B08196j0756M733j9170l2639k7812m1477j8949k6499q596R763k2391j1034
12932C369J0476Q312k4240J1228J4212L135K3235p726l3225k0228K548J3687J7690
12919B2473J3620K551k7574J88o254o030j7073o423P229l872j1258M142J4268
12906a4013J5331j2192l876K272M4539J0454l6161Q865R343J1140J3971R000j4975
12893D3698j9053J36o091M1693p491l3777L575J6756k0477j883q86Q291J3556
12880C8047M925l742L4694K0216j6359K6877N3602O5763J26158J68560J48646
12869F67387P9437P8086P4301K4110m3450k24414k45018j15045q9784l5797n876
$$ plain form
12858 163937 148130 125617 117438 108369 114607 99129 84012 60841 56629 22969 -6250 -3397
12846 -3397 -2892 24568 26415 25449 42908 51792 45366 30108 28787 34404 39580 55020 68750 57149
12832 57149 53659 19167 -17979 -25076 -18596 2869 21678 18021 28619 45079 42527 64371 40874
12819 40874 24032 3034 13703 61293 73362 69768 79981 107697 105759 126720 154204 173788
12807 173788 181707 197919 175969 153993 136608 133810 128787 96927 78627 85922 73718 80702
12795 80702 87427 81186 71846 81497 65423 31519 37393 46526 38235 38918 50846 57037 46506 22370
12781 22370 17365 16063 28377 40938 22728 14072 23831 30016 42153 39757 17417 -4526 603
12768 603 18308 7286 8999 13183 19863 13389 6055 29827 46520 32244 17892 27135 21829
$$ packed form
12858A63937j5807k2513q179r069O238j5478j5117k3171m212l3660k9219K853
12846c397N05K7460J847r66J7459Q884o426j5258j321N617N176J5440J3730j1601
12832E7149l490l4492l7146p097O480K1465J8809l657J0598J6460k552K1844k3497
12819D0874j6842k0998J0669M7590J2069l594J0213K7716j938K0961K7484J9584
12807A73788P919J6212k1950k1976j7385k798n023l1860j8300P295j2204O984
12795H0702O725o241r340R651j6074l3904N874R133q291O83J1928O191j0531k4136
12781B2370n005j302J2314J2561j8210q656R759O185J2137k396k2340k1943N129
12768F03J7705j1022J713M184O680o474p334K3772J6693j4276j4352R243n306
$$ plain form
12755 21829 31785 25936 26957 8669 7838 -11357 -3611 -11317 -27616 -3318 -10368 -14534 -22030 -15929
12741 -15929 6366 -69 25935 31571 28769 34196 30560 38769 58370 41083 34848 17371 7487
12728 7487 10824 -4806 -10619 17683 21783 -3170 -20967 -37178 -14018 5437 2615 3495 21347
12715 21347 11072 391 -6127 34883 35228 3836 -13362 -25205 -21553 -2328 -8291 -13416 513
12702 513 5405 5704 -1133 14298 -6222 -23251 -14610 -15068 -11548 -3851 -15125 -18813 -40285 -66198
12688 -66198 -65578 -52569 -41152 -50082 -38659 -3259 -10693 -40737 -44054 1253 25472 45050 42516
12675 42516 24795 -20133 -2885 -6966 -38756 -63596 -53292 -44810 -49361 -36588 -23484 -27076
12663 -27076 -42493 -44080 -36985 -33147 -22861 -30582 -38374 -31186 -14529 -21797 -17807 -16219 -3375
$$ packed form
12755B1829R956n849J021j8288q31j9195P746p706j6299K4298p050m166p496O101
12741a5929K2295o435K6004N636k802N427l636Q209J9601j7287o235j7477r884
12728G487L337j5630n813K8302M100k4953j7797j6211K3160J9455k822Q80J7852
12715B1347j0275j0681o518M1010L45l1392j7198j1843L652J9225n963n125J3929
12702E13M892K99o837J5431k0520j7029Q641m58L520P697j1274l688k1472k5913
12688f6198O20J3009J1417q930J1423L5400p434l0044l317M5307K4219J9578k534
12675D2516j7721m4928J7248m081l1790k4840J0304Q482m551J2773J3104l592
12663b7076j5417j587P095L838J0286p721p792P188J6657p268L990J588J2844
$$ plain form
12650 -3375 23368 26477 36758 44440 13578 988 8224 30864 54287 40708 30996 27158 24827
12637 24827 35049 15982 35149 558 -50844 -60845 -65370 -55260 -27188 -12876 -14673 -26647
12625 -26647 -23055 -33760 -12037 17078 31672 2721 -15089 -16461 -31577 -31274 -50135 -58954 -64409
12612 -64409 -73828 -51166 -37939 -35019 -23748 -10794 5609 36340 6541 -34441 -45204 -25265
12600 -25265 -20634 -25883 -26536 -7352 12289 19524 28052 40197 23443 -7194 -7293 17534 22365 4876
12586 4876 24375 14038 -26164 -23514 -14446 -6041 25213 67254 44719 -2135 -4993 -19737 -9034
12573 -9034 6100 20400 32655 25439 679 -13753 40475 85076 88480 121273 146161 123819
12561 123819 115503 103903 86096 57305 18928 -14458 -7026 3927 43853 42171 24703 12227
$$ packed form
12650c375K6743L109J0281P682l0862j2590P236K2640K3423j3579r712l838k331
12637B4827J0222j9067J9167l4591n1402j0001m525J0110K8072J4312j797j1974
12625b6647L592j0705K1723K9115J4594k8951j7810j372j5116L03j8861q819n455
12612f4409r419K2662J3227K920J1271J2954J6403L0731k9799m0982j0763J9939
12600b5265M631n249o53J9184J9641P235Q528J2145j6754l0637r9K4827M831j7489
12586D876J9499j0337m0202K650R068Q405L1254M2041k2535m6854k858j4744J0703
12573i034J5134J4300J2255p216k4760j4432N4228M4601L404L2793K4888k2342
12561A23819q316j1600j7807k8791l8377l3386P432J0953L9926j682j7468j2476
$$ plain form
12549 12227 1925 9263 -13649 -29607 -14926 13836 12206 -2361 -10223 -8573 764 -6904 -11421
12536 -11421 6260 10142 8658 34395 32890 26634 -9931 -21043 -8404 14391 -788 -34402
12524 -34402 -21940 -549 9604 6347 -24825 -6197 -1836 -20265 -26454 -22841 2080 100 -12858
12511 -12858 -33889 -29745 -28365 18581 50506 53285 48513 31147 7430 -23600 -13069 25650
12499 25650 1031 -29657 -21562 -33749 -32537 -7940 -14740 -24585 -9555 -18907 -41426 -20201 -30329
12486 -30329 -32549 -6482 -45268 -49319 -14972 1167 18429 15732 19439 6537 -2859 -14117 -14299
12473 -14299 -14336 -6728 17286 22301 19046 13445 17517 1653 -7768 -19881 6098 17794 4394
12460 4394 16095 29612 14589 -5349 10601 27301 -7070 -15048 41676 51593 45834 20491
$$ packed form
12549A2227j0302P338k2912j5958J4681K8762j630j4567p862J650R337p668m517
12536a1421J7681L882j484K5737j505o256l6565j1112J2639K2795j5179l3614
12524c4402J2462K1391J0153l257l1172J8628M361j8429o189L613K4921j980j2958
12511a2858k1031M144J380M6946L1925K779m772j7366k3717l1030J0531L8719
12499B5650k4619l0688Q095j2187J212K4597o800r845J5030r352k2519K1225j0128
12486c0329k220K6067l8786m051L4347J6139J7262k697L707j2902r396j1258j82
12473a4299l7P608K4014N015l255n601M072j5864r421j2113K5979J1696j3400
12460D394J1701J3517j5023j9938J5950J6700l4371p978N6724R917n759k5343
$$ plain form
12448 20491 -3201 -14410 -8230 -27938 -22025 18504 37668 32374 37206 34358 21307 18274 -233
12435 -233 4952 -5045 -14605 -12411 -467 -11524 -14908 -12096 -18039 7363 14146 5566 4381 12852
12421 12852 13841 6983 13971 1341 -29818 -44480 -51817 -45099 -34950 -17432 -12726 17712 16554
12408 16554 1270 1871 13975 -3605 -41935 -46088 -10029 1524 -8393 -42894 -42535 -15112 -26118
12395 -26118 -23410 -13968 -9023 3468 2816 7035 -5532 -19104 -8929 -7756 1279 -19404 -41951
12382 -41951 -23218 1212 -13330 16751 20004 11964 -17260 -49931 -36529 -4280 229 -8927
12370 -8927 -34215 -56258 -48159 -28245 4925 9355 12236 -2770 -13567 17675 15831 17299 -9284
12357 -9284 -25964 -14140 12102 9132 -7793 -16286 -19531 -36880 -11397 27227 41925 32773 -6787
$$ packed form
12448B0491k3692j1209O180j9708N913M0529J9164n294M832k848j3051l033j8507
12435b33N185r997r560K194J1944j1057l384K812n943K5402O783q580j185Q471
12421A2852R89o858O988j2630l1159j4662p337O718J0149J7518M706L0438j158
12408A6554j5284O01J2104j7580l8330m153L6059J1553r917l4501L59K7423j1006
12395b6118K708R442M945J2491o52M219j2567j3572J0175J173R035k0683k2547
12382d1951J8733K4430j4542L0081L253q040k9224l2671J3402L2249M509r156
12370h927k5288k2043Q099J9914L3170M430K881j5006j0797L1242j844J468k6583
12357i284j6680J1824K6242k970j6925q493l245j7349K5483L8624J4698r152l9560
$$ plain form
12344 -6787 15554 14529 -27436 -48024 -31231 -19974 -28557 -35751 -3848 -4075 -16141 -25437 -22929
12331 -22929 -29560 -41272 -48266 -54523 -48805 -30807 -32445 -20641 -6509 4964 -3542 16467 28531
12318 28531 26355 12759 23846 13571 -3647 -10671 -28166 -29113 -18278 -25349 -45273 -33586 -27643
12305 -27643 -8531 6717 9602 15201 37844 30958 38575 35699 18630 2737 -18514 -46130 -52738
12292 -52738 -32048 13094 20042 10396 -16169 -8425 7743 21846 21364 1061 -12182 7163 1538
12279 1538 25525 35310 41558 30367 34271 39705 20697 10473 24229 35806 47055 46008 47794
12266 47794 49255 33157 8691 11134 7768 4140 1076 2063 6288 14913 31391 13458 3531 -4114
12252 -4114 -9715 -13455 -5504 -1183 4599 53358 65406 36404 13199 14902 3072 12563 27145
$$ packed form
12344f787K2341j025m1965k0588J6793J1257q583p194L1903k27j2066r296K508
12331b2929o631j1712o994o257N718J7998j638J1804J4132J1473q506K0009J2064
12318B8531k176j3596J1087j0275j7218p024j7495r47J0835p071j9924J1687N943
12305b7643J9112J5248K885N599K2643o886P617k876j7069j5893k1251k7616o608
12292e2738K0690M5142O948r646k6565P744J6168J4103m82k0303j3243J9345n625
12279A538K3987R785O248j1191L904N434j9008j0224J3756J1577J1249j047J786
12266D7794J461j6098k4466K443l366l628l064R87M225Q625J6478j7933r927p645
12252d114n601l740P951M321N782M8759J2048k9002k3205J703j1830R491J4582
$$ plain form
12239 27145 23793 5508 -3599 -10257 10968 57958 67517 80819 104277 96185 74685 43129 52774
12226 52774 79091 90757 77901 77019 46243 55004 46349 43969 37869 51571 62250 61975 36913
12213 36913 30723 30257 15590 26666 31561 3033 -271 31665 29986 -16572 -33362 -65024 -31251
12200 -31251 6573 7107 -22904 -35819 -18153 -19108 4431 13472 4975 17863 4269 -13082 -17755
12187 -17755 -5902 -832 -5815 3181 -13116 -6463 3789 -27037 -32564 -20097 -6998 -3697 -26091
12174 -26091 -38439 -31958 -24708 3609 489 -13044 8047 -9108 -29660 -8846 12233 30151
12162 30151 703 -23509 -21773 -2792 12500 32446 28230 6221 -26621 -44410 -35943 -45121
12150 -45121 -43808 -57051 -59994 -36935 -18053 -15259 -3189 -8141 12494 26609 54 -4421 4381
$$ packed form
12239B7145l352j8285r107o658K1225M6990R559J3302K3458q092k1500l1556R645
12226E2774K6317J1666j2856q82l0776Q761q655k380o100J3702J0679k75k5062
12213C6913o190m66j4667J1076M895k8528l304L1936j679m6558j6790l1662L3773
12200c1251L7824N34l0011j2915J7666r55K3539R041q497J2888j3594j7351m673
12187a7755J1853N070m983Q996j6297O653J0252l0826n527J2467J3099L301k2394
12174b6091j2348O481P250K8317l120j3533K1091j7155k0552K0814K1079J7918
12162C0151k9448k4212J736J8981J5292J9946m216k2009l2842j7789Q467r178
12150d5121J313j3243k943K3059J8882K794J2070m952K0635J4115k6555m475Q802
$$ plain form
12137 4381 -7483 -19775 -38002 -34328 -45832 -37526 -23842 -20271 -28176 -29589 -13777 -5800 6779
12124 6779 14296 10137 1107 -12322 -25986 -36761 -33593 -12672 9615 -20505 -37191 -40746 -19056
12111 -19056 4455 14055 -89 -16788 -41178 -34613 -29366 -35059 -11310 20270 35064 14870
12099 14870 -8491 -19027 -27834 -40196 -62360 -67317 -68519 -35014 -17169 -21174 -21865 -16098 -22140
12086 -22140 -12012 -10275 3046 -16614 -16513 -24433 -33263 -58017 -57829 -54235 -38235 -51256 -69491
12073 -69491 -82194 -65692 -35680 -13544 455 15120 17955 1384 1275 31172 30168 8859
12061 8859 -373 4797 21750 52366 18089 -34229 -45854 -31559 -22786 -16412 -13224 -21570 -14401
12048 -14401 -11905 -21518 -20102 -15869 -10178 2397 4213 -20796 -35667 -36920 -37058 -8153 -17062 -929
$$ packed form
12137D381j1864j2292j8227L674j1504Q306J3684L571p905j413J5812P977J2579
12124F779P517m159r030j3429j3664j0775L168K0921K2287l0120j6686l555K1690
12111a9056K3511R600j4144j6699k4390O565N247n693K3749L1580J4794k0194
12099A4870k3361j0536q807j2362k2164m957j202L3505J7845m005o91N767o042
12086b2140J0128J737J3321j9660J01p920q830k4754J88L594J6000j3021j8235
12073f9491j2703J6502L0012K2136J3999J4665K835j6571j09K9897j004k1309
12061H859r232N170J6953L0616l4277n2318j1625J4295Q773O374L188q346P169
12048a4401K496r613J416M233N691J2575J816k5009j4871j253j38K8905q909J6133
$$ plain form
12034 -929 39865 71085 47456 30109 13244 -3726 -2202 12712 -947 9269 3964 15462
12022 15462 -3359 -16423 -14011 -6316 -4668 5729 -21987 -30520 -24783 -49136 -54653 -44063 -45123
12009 -45123 -51645 -34333 -2042 8009 22519 30100 -8548 -31495 -19980 -8416 18617 44298
11997 44298 52131 56650 44027 51535 51563 13936 4322 8949 13791 18366 17516 2902 -16538 -22461
11983 -22461 -17024 -9703 6254 18610 -7705 -7577 -18747 -21542 -7059 -24375 -33883 -28773 -43369
11970 -43369 -45090 -44604 -32331 -13075 8949 -10022 5054 21962 32060 16826 1456 -13274
11958 -13274 -48227 -44648 -36771 -34581 -36058 -39246 -25750 -27458 -27536 -37641 -45321 -57555 -45998 -13218
11944 -13218 -3923 273 11401 -2483 -16803 7217 17334 27957 31818 31695 29108 23437 25439
$$ packed form
12034i29M0794L1220k3629j7347j6865j6970J524J4914j3659J0216n305J1498
12022A5462j8821j3064K412P695J648J0397k7716q533N737k4353n517J0590j060
12009d5123o522J7312L2291J0051J4510P581l8648k2947J1515J1564K7033K5681
11997D4298P833M519j2623P508K8l7627r614M627M842M575q50j4614j9440n923
11983b2461N437P321J5957J2356k6315J28j1170k795J4483j7316r508N110j4596
11970d3369j721M86J2273J9256K2024j8971J5076J6908J0098j5234j5370j4730
11958a3274l4953L579P877K190j477l188J3496j708p8j0105p680j2234J1557L2780
11944a3218R295M196J1128j3884j4320K4020J0117J0623L861j23k587n671K002
$$ plain form
11931 25439 21936 -16427 -33071 -23682 -38625 -9683 15277 15977 11431 17599 20203 -4580 -43624
11918 -43624 -42381 12066 37546 -4890 -31024 -38549 -49731 -35066 -2829 15576 9044 -14919
11906 -14919 -37148 -51034 -38562 -37413 -16210 -3703 -19490 -18519 -15986 -22248 7284 29976 7580
11893 7580 -7726 -5232 -5528 -8034 8798 3213 3178 9417 9978 2459 -5863 11391 13995 -13740 -41026
11878 -41026 -25014 -19818 -25164 -23765 -17709 -15840 -16880 -33937 -15587 -32404 -52565 -47704 -7056
11865 -7056 -12374 -23314 -27716 -5614 -4608 -9748 -32775 -67031 -59339 -37729 -31251 -24485 -6775
11852 -6775 31984 59566 44856 6730 -20807 -2484 21689 12479 -18884 -32575 -30378 -38922
11840 -38922 -31837 -36686 -39250 -26056 -12496 -7429 -19119 -30020 -62274 -64875 -54814 -74841 -78919
$$ packed form
11931B5439l503l8363j6644R389j4943K8942K4960P00m546O168K604k4783l9044
11918d3624J243N4447K5480m2436k6134p525j1182J4665L2237J8405o532k3963
11906a4919k2229j3886J2472J149K1203J2507j5787R71K533o262K9532K2692k2396
11893G580j5306K494k96k506J6832n585l5O239N61p519q322J7254K604k7735k7286
11878d1026J6012N196n346J399O056J869j040j7057J8350j6817k0161M861M0648
11865g056n318j0940m402K2102J006n140k3027l4256P692K1610O478O766J7710
11852f775L8759K7582j4710l8126k7537J8323K4173r210l1363j3691K197q544
11840c8922P085m849k564J3194J3560N067j1690j0901l2254k601J0061k0027m078
$$ plain form
11827 -78919 -77762 -78616 -59752 -26339 -13293 -26671 -13014 -13203 -38689 -43812 -31593 -14759 -21077
11814 -21077 -504 1708 -14513 4403 20357 28041 34937 14483 10211 12815 22289 32098 23045
11801 23045 26210 14074 -5484 -28453 -19670 -18394 -24659 -31137 -26441 -46864 -39081 13303 8588
11788 8588 -13721 -32306 -35494 -30380 -49646 -40295 -30128 -17973 -11022 -27708 -53339 -34120 -16967
11775 -16967 -26214 -29701 -5987 10128 -7351 -16908 -20248 -19578 -46599 -55608 -35374 -35686 -45254 -48640
11761 -48640 -39329 -44293 -47868 -20826 -7059 -8987 -7415 -17455 -32524 -6775 9312 9954 -2692
11748 -2692 -10898 -13397 -19448 -42838 -58155 -44467 -36061 -34004 -15061 16783 25557 11776 3416
11735 3416 31689 26667 -6830 -26282 -39600 -15519 -2604 -6755 -10247 -14666 -12785 -35725 -60213
$$ packed form
11827g8919J157q54J8864L3413J3046j3378J3657j89k5486n123J2219J6834o318
11814b1077K0573K212j6221J8916J5954P684O896k0454m272K604R474R809r053
11801B3045L165j2136j9558k2969Q783J276o265o478M696k0423P783N2384m715
11788H588k2309j8585l188N114j9266R351J0167J2155O951j6686k5631J9219J7153
11775a6967r247l487K3714J6115j7479r557l340O70k7021r009K0234l12r568l386
11761d8640R311m964l575K7042J3767j928J572j0040j5069K5749J6087O42j2646
11748b692q206k499o051k3390j5317J3688Q406K057J8943L1844Q774j3781q360
11735C416K8273n022l3497j9452j3318K4081J2915m151l492m419J881k2940k4488
$$ plain form
11722 -60213 -43759 -18476 -27969 -36839 -36282 -23013 -21668 -24473 -43882 -49232 -62559 -59493 -42878
11709 -42878 -42335 -43952 -35443 -30067 -24544 -23978 -28432 -27785 -50554 -87287 -101901 -74208 -78669 -60099
11695 -60099 -33004 -33147 -10720 -11525 -22259 -18075 -4083 -7761 -34565 -29659 -33467 -21156 -11210
11682 -11210 -16481 -12733 -5489 2008 26738 17986 15013 26025 20528 5856 -30750 -31211 -45495
11669 -45495 -49554 -39377 -10381 5999 -19015 -6891 -6475 -7889 -15774 -29323 -25653 -8579 -13307
11656 -13307 -49921 -38757 -43128 -36234 -15393 -24637 -26667 -17522 -24412 -20280 -34192 -33798 -44404
11643 -44404 -32166 -49493 -67526 -76179 -81155 -47313 -31568 -31813 -18352 -15923 7322 32766 35226
11630 35226 12723 -2309 -8357 -19549 -23610 -12022 -1655 -589 13732 22575 12471 18256 23928
$$ packed form
11722f0213J6454K5283r493q870N57J3269J345k805j9409n350j3327L066J6615
11709d2878N43j617Q509N376N523N66m454O47k2769l6733j4614K7693m461J8570
11695f0099K7095j43K2427q05j0734M184J3992l678k6804M906l808J2311R946
11682a1210n271L748P244P497K4730q752k973J1012n497j4672l6606m61j4284
11669d5495m059J0177K8996J6380k5014J2124M16j414p885j3549L670J7074m728
11656a3307l6614J1164m371O894K0841r244k030R145o890M132j3912L94j0606
11643d4404J2238j7327j8033q653m976L3842J5745k45J3461K429K3245K5444K460
11630C5226k2503j5032o048j1192m061J1588J0367J066J4321Q843j0104N785N672
$$ plain form
11617 23928 13667 -8421 -29871 -27288 7246 -3416 -42726 -74211 -62593 -44013 -71999 -98575
11605 -98575 -90328 -58533 -35806 -28154 -40453 -53057 -41182 -43570 -53094 -40454 -18953 -30947
11593 -30947 -34962 -44280 -22626 -30163 -36464 -29222 -26976 -30641 -23714 -9224 -26941 -46138 -41434
11580 -41434 -534 -7608 -9270 20921 11994 -10686 -9379 -26820 -21568 7119 22518 30988 14497
11567 14497 -4089 -4944 -9493 -9142 3714 -26665 -72700 -59377 -42037 -13050 -5060 -8201 12081
11554 12081 46149 20012 -400 16430 24838 21497 27432 22640 11843 -456 -10147 -23670 -41924
11541 -41924 -35170 -27592 -22041 -27372 -46921 -28809 -9698 -22351 -42023 -42240 -23193 -26867 -31426
11528 -31426 -12971 -39399 -57482 -55668 -17688 691 -724 1662 -25 -2094 -7279 -5583 13129
$$ packed form
11617B3928j0261k2088k1450K583L4534j0662l9310l1485J1618J8580k7986k6576
11605i8575Q247L1795K2727P652j2299j2604J1875k388r524J2640K1501j1994
11593c0947m015r318K1654p537o301P242K246l665O927J4490j7717j9197M704
11580d1434M0900p074j662L0191q927k2680J307j7441N252K8687J5399Q470j6491
11567A4497j8586q55m549L51J2856l0379m6035J3323J7340K8987P990l141K0282
11554A2081L4068k6137k0412J6830Q408l341N935m792j0797j2299r691j3523j8254
11541d1924O754P578N551n331j9549J8112J9111j2653j9672k17J9047l674m559
11528c1426J8455k6428j8083J814L7980J8379j415K386j687k069n185J696J8712
$$ plain form
11515 13129 6035 4415 -1908 -6146 -20146 -30546 -17134 -13346 -10458 -11990 9867 5473 18150
11502 18150 53400 80638 91186 69971 56687 25680 8307 19441 25635 6577 1359 -5295
11490 -5295 -20398 -52976 -49313 -66651 -76171 -67425 -41413 -41807 -46599 -41445 -1384 21894 23901
11477 23901 3910 -17209 -10598 12875 28986 24981 4122 -2538 1567 7779 2914 11558 3343
11464 3343 -5372 -33813 -25852 2922 3703 -9501 -17960 -19626 -22374 -12450 -3292 -230 -24441 -14878
11450 -14878 -9277 -36219 -41870 -19649 -21757 -44466 -51735 -13120 -22380 -33234 -9426 9456 -6304
11437 -6304 -23758 -14280 -14850 -39824 -63968 -41300 -38394 -31278 -10252 -1695 -10572 -31904 -56366
11424 -56366 -35639 -12559 -15715 -30263 -30600 -7668 -25587 -29349 1352 19088 -41791 -53270
$$ packed form
11515A3129p094j620o323m238j4000j0400J3412L788K888j532K1857m394J2677
11502A8150L5250K7238J0548k1215j3284l1007j7373J1134O194j9058n218o654
11490e295j5103l2578L663j7338r520Q746K6012l94m792N154M0061K3278K007
11477B3901j9991k1119O611K3473J6111m005k0859o660M105O212m865Q644q215
11464C343q715k8441P961K8774P81j3204q459j666k748R924R158L062k4211R563
11450a4878N601k6942n651K2221k108k2709p269L8615r260j0854K3808J8882j5760
11437f304j7454R478n70k4974k4144K2668K906P116K1026Q557q877k1332k4462
11424e6366K0727K3080l156j4548l37K2932j7919l762L0701J7736o0879j1479
$$ plain form
11412 -53270 -34643 -36018 -17510 -15700 -16533 6099 -7916 -58800 -38040 -2215 25392 -9046
11400 -9046 -42460 -39899 -27033 -34225 -52862 -55571 -32736 -9654 21723 27458 -6591 -5425 13349
11387 13349 2802 -30030 -46488 -59864 -48692 -38455 -11197 -139 141 -14017 -47417 -17563
11375 -17563 -26773 -22594 -30439 -59914 -50209 -47660 -51735 -46114 -53430 -41608 -49019 -35892 -10487
11362 -10487 -20087 -18585 -30225 -26984 -22714 -35042 -17099 6518 -14318 -20552 1132 11082 -10738
11349 -10738 -17745 -22040 4018 12574 -8218 -5630 2008 -7421 -24269 -42866 -30109 -7768 10841
11336 10841 24741 28460 24654 -5480 -9493 18506 6751 -12243 -9675 -8232 -6045 521 -9703
11323 -9703 -6128 -22733 -47106 -31869 -19487 -3759 16748 15366 3212 -7527 -15540 -20170 -439
$$ packed form
11412e3270J8627j375J8508J810q33K2632j4015n0884K0760L5825K7607l4438
11400i046l3414K561J2866p192j8637k709K2835K3082L1377N735l4049J166J8774
11387A3349j0547l2832j6458j3376J1172J0237K7258J1058K80j4158l3400K9854
11375a7563r210M179p845k9475R705K549m075N621p316J1822p411J3127K5405
11362a0487r600J502j1640L241M270j2328J7943K3617k0836o234K1684R950k1820
11349a0738p007m295K6058Q556k0792K588P638r429j6848j8597J2757K2341J8609
11336A0841J3900L719l806l0134m013K7999j1755j8994K568J443K187O566j0224
11323i703L575j6605k4373J5237J2382J5728K0507j382j2154j0739q013m630J9731
$$ plain form
11310 -439 25379 23320 16899 20544 21614 12110 -1198 13484 -15183 -7721 22238 46806 20424
11297 20424 -8253 -20200 -36592 -29676 -2043 32484 41123 17146 -10820 -10156 -20352 -28208 -24904
11284 -24904 -2655 -4237 -14829 -17338 -2121 7321 -1835 -14965 -11120 14592 -1240 -19760 -23603
11271 -23603 -22631 -33771 -16044 -15433 -14566 -9403 -28716 -16907 -29219 -25641 -28995 -29461 -46011 -16542
11257 -16542 -5560 -2081 -14983 -34298 -1726 -16434 -38019 -27461 -36818 -12136 1243 -3732
11245 -3732 -20956 -51320 -43220 -44367 -54482 -70312 -71805 -52912 -18886 -6776 9746 12883 -17847
11232 -17847 -25586 -28242 -34968 -39639 -40079 -15274 -10150 -9691 -2630 11414 34196 30651 21231 22442
11218 22442 16846 8143 -5250 -16153 3009 -2411 4802 10746 -4236 -1853 -9757 21770 -377
$$ packed form
11310d39K5818k059o421L645J070r504j3308J4682k8667P462K9959K4568k6382
11297B0424k8677j1947j6392O916K7633L4527Q639k3977k7966O64j0196p856L304
11284b4904K2249j582j0592k509J5217R442r156j3130L845K5712j5832j8520l843
11271b3603R72j1140J7727O11Q67N163j9313J1809j2312L578l354m66j6550K9469
11257a6542J0982L479j2902j9315L2572j4708k1585J0558r357K4682J3379m975
11245c732j7224l0364Q100j147j0115j5830j493J8893L4026J2110J6522L137l0730
11232a7847p739k656o726m671m40K4805N124M59P061J4044K2782l545r420J211
11218B2442n596q703j3393j0903J9162n420P213N944j4982K383p904L1527k2147
$$ plain form
11205 -377 -23389 -15251 -24862 -53147 -52790 -18287 -2542 27730 32899 26510 26228 23629 16517 1342
11191 1342 -12339 -28528 -31025 -16140 -10148 -17323 -23299 -30328 -18698 -15547 -35201 -46071 -41620
11178 -41620 -50107 -55236 -43206 -40721 -45932 -46350 -31636 -41985 -36521 -33676 -18243 -1338 -13985
11165 -13985 -28839 -36430 -54345 -55582 -27712 4278 25388 17694 18771 24401 29363 -4203 -27968
11152 -27968 -16493 -6512 -3681 -1872 -36043 -41960 -45392 -65030 -58780 -55163 -50409 -22800 3343
11139 3343 8753 33056 27043 32144 24499 15821 26497 16411 18959 9090 11142 43928 45263 30425
11125 30425 18905 -15066 -3817 -7144 -22056 -14671 -7833 -11940 -9433 -9290 12626 35320 51974
11112 51974 56415 41783 8478 -10899 -11225 -7454 -7140 -4581 -15063 -33417 -36652 -21315 -26011
$$ packed form
11205c77k3012Q138r611k8285L57L4503J5745L0272N169o389k82k599p112j5175
11191A342j3681j6189k497J4885N992p175n976p029J1630L151j9654j0870M451
11178d1620q487n129J2030K485n211m18J4714j0349N464K845J5433J6905j2647
11165a3985j4854p591j7915j237K7870L1990K1110p694J077N630M962l3566k3765
11152b7968J1475R981K831J809l4171n917l432j9638O250L617M754K7609K6143
11139C343N410K4303o013N101p645q678J0676j0086K548r869K052L2786J335j4838
11125C0425j1520l3971J1249l327j4912P385O838m107K507J43K1916K2694J6654
11112E1974M441j4632l3305j9377l26L771L14K559j0482j8354l235J5337m696
$$ plain form
11099 -26011 -26788 -32158 -25874 -16428 -16433 -2534 7340 -2505 -23232 -13281 -23136 -46671 -60559 -50841
11085 -50841 -7189 19319 9096 2123 -605 14718 18718 13562 9313 -13679 -22050 -5901 -29245
11072 -29245 -28880 -36626 -42830 -31194 -31628 -6947 10511 -815 -22894 -16137 -22582 -34846 -38198
11059 -38198 -49327 -58966 -45919 -28935 -19850 -23933 -923 -7079 -36572 -31704 -42530 -46429 -15942
11046 -15942 -8454 -17501 -12317 -20069 -16952 2635 -20759 -46732 -57384 -58967 -68490 -56245 -38401
11033 -38401 -41815 -31812 -2592 6574 4518 -8329 12081 6141 11822 -10427 -46448 -38297 -34055
11020 -34055 -7636 1906 -13356 -30593 -13502 -24701 -43377 -56154 -55612 -62829 -51447 -27369
11008 -27369 -9795 -20955 -26240 -38087 -35457 -5208 5945 -38788 -38962 -27219 -21671 -23445 -7869
$$ packed form
11099b6011p77n370O284R446nJ3899R874r845k0727R951r855k3535j3888R718
11085e0841M3652K6508j0223o973k728J5323M000n156m249k2992q371J6149k3344
11072b9245L65p746o204J1636m34K4681J7458j1326k2079O757o445j2264l352
11059c8198j1129r639J3047J6984R085m083K3010o156k9493M868j0826l899L0487
11046a5942P488r047N184p752L117J9587k3394k5973j0652j583r523J2245J7844
11033c8401l414J0003K9220R166k056j2847K0410n940N681k2249l6021Q151M242
11020c4055K6419R542j5262j7237J7091j1199j8676j2777N42p217J1382K4078
11008b7369J7574j1160n285j1847K630L0249J1153m4733j74J1743N548j774J5576
$$ plain form
10995 -7869 -11753 -20096 -8581 1683 23995 37414 26261 3177 -6140 5693 -4067 -15614 -16140
10982 -16140 -31821 -33736 -19399 -33131 -40570 -36808 -51914 -52083 -46508 -42731 -38182 -25368 -18616
10969 -18616 -16187 -17062 -30295 -46533 -26229 -2094 -4531 -19862 -13516 -9565 3431 -181 -7493
10956 -7493 13267 30952 29715 14002 18789 40259 28250 -6436 3809 9434 -1828 -3980 -2728
10943 -2728 1932 6450 30975 28151 14865 867 -11894 -24673 -20692 -16457 -17192 -23560 -52628
10930 -52628 -27710 963 -11237 -21718 -51357 -64039 -42008 -12733 6326 -17320 -9848 -27436
10918 -27436 -44549 -30938 -23796 -36548 -39391 -23580 -24066 -24549 -44512 -67946 -43499 -28868 -38140
10905 -38140 -29191 -10640 -26359 6752 7345 -1695 -1589 -17198 -36028 -14139 -4176 -15287 -17660
$$ packed form
10995g869l884q343J1515J0264K2312J3419j1153k3084r317J1833r760j1547n26
10982a6140j5681j915J4337j3732p439L762j5106j69N575L777M549J2814O752
10969a8616K429q75j3233j6238K0304K4135k437j5331O346L951J2996l612p312
10956g493K0760J7685j237j5713M787K1470j2009l4686J0245N625j1262k152J252
10943b728M660M518K4525k824j3286j3998j2761j2779L981M235p35o368k9068
10930e2628K4918K8673j2200j0481k9639j2682K2031K9275J9059k3646P472j7588
10918b7436j7113J3611P142j2752k843J5811m86m83j9963k3434K4447J4631r272
10905c8140Q949J8551j5719L3111N93r040J06j5609j8830K1889R963j1111k373
$$ plain form
10892 -17660 -19895 -11738 -389 -21993 -15872 8655 1186 -17641 -16069 -25470 -29884 -6731 -6455
10879 -6455 21088 13158 -1173 -23533 -38700 -35715 -32451 -1089 11070 7614 -16551 -29868 -19618
10866 -19618 -4534 -20126 -11700 -23739 -22725 -5304 -901 4150 13755 -3663 -25421 -4757 15096
10853 15096 790 -16440 -7877 -1610 16779 -12221 -28076 -27474 -39970 -56191 -55396 -49673 -19712
10840 -19712 434 -12002 -17887 -9501 -8255 762 5766 -9216 -43238 -37242 -6813 12473 3364
10827 3364 15818 11529 -5360 -7229 -28751 -42166 -21489 6374 7210 -12109 -15841 -14857 1546
10814 1546 -173 8196 16803 1878 -11385 -26993 -16698 -12256 2130 4455 12668 4426 23148
10801 23148 11925 19531 4368 10925 32767 18022 -9735 -7514 -30 -19160 -25096 -5223 5160
$$ packed form
10892a7660k235Q157J1349k1604O121K4527p469j8827J572r401m414K3153K76
10879f455K7543p930j4331k2360j5167K985L264L1362J2159l456k4165j3317J0250
10866a9618J5084j5592Q426j2039J014J7421M403N051R605j7418k1758K0664J9853
10853A5096j4306j7230Q563O267J8389k9000j5855O02j2496j6221P95N723K9961
10840a9712K0146j2436n885Q386J246R017N004j4982l4022N996L0429J9286r109
10827C364J2454m289j6889j869k1522j3415K0677K7863Q36j9319l732R84J6403
10814A546j719Q369Q607j4925j3263j5608J0295M442J4386K325Q213q242J8722
10801B3148j1223P606j5163O557K1842j4745k7757K221P484j9130n936J9873J0383
$$ plain form
10788 5160 11697 13623 16139 28241 16582 5496 -14098 -12847 23091 31679 12991 8522 -3166
10775 -3166 -20969 -24530 -10175 20356 26447 -5785 -38418 -14152 22905 28836 40945 41445 107989
10762 107989 185485 187430 206450 245633 243266 208389 130996 62841 38849 33029 36158 30880
10750 30880 28643 17065 -26402 -30141 -13630 15204 43616 48627 31519 30944 27623 48437 51895
10737 51895 28815 19993 40039 45020 22483 4210 -1059 -11990 -2902 -6470 -15315 7463 3206
10724 3206 -2575 -3580 -1399 -17985 -19121 -25026 -10709 -1398 2249 9956 -8463 -6017 8990 13566
10710 13566 5461 7218 4572 -3165 1421 7101 14396 14273 22613 9712 -16599 -2110 6525 20300
10696 20300 6255 -5837 5105 -5401 -8637 -14002 -20618 -29750 -42609 -45752 -44223 -33845 -19566
$$ packed form
10788E160O537J926K516J2102j1659j1086j9594J251L5938Q588j8688m469j1688
10775c166j7803l561J4355L0531O091l2232l2633K4266L7057N931J2109N00O6544
10762A07989P7496J945J9020L9183k367l4877p7393o8155k3992n820L129n278
10750C0880k237j1578m3467l739J6511K8834K8412N011j7108n75l321K0814L458
10737E1895k3080q822K0046M981k2537j8273n269j0931R088l568q845K2778m257
10724C206n781j005K181j6586j136n905J4317R311L647P707j8419K446J5007M576
10710A3566q105J757k646p737M586N680P295j23Q340j2901k6311J4489Q635J3775
10696B0300j4045j2092J0942j0506l236n365o616r132j2859l143J529J0378J4279
$$ plain form
10683 -19566 -3479 -19514 -9762 8694 6958 -15941 -4429 24092 39710 1766 -32388 -33821
10671 -33821 -35420 -27323 -23736 -9614 -19429 -51265 -33691 -26212 -20717 -21051 -23762 -17636 10392 4138
10657 4138 5765 -4870 -30576 -22976 5666 1858 -5889 -4731 1575 -3431 -7489 -4419 20557 27508
10643 27508 -6979 -27947 -23325 -40304 -37675 -52629 -57231 -55732 -57497 -51866 -51797 -29049 17123
10630 17123 27154 6824 -12436 -19545 32995 28324 17957 39420 40322 25227 -28 -22467
10618 -22467 -22798 -35211 -22955 -8235 -4566 -13804 -46212 -15810 12241 9647 4502 7816 3834
10605 3834 -19303 -23823 -11685 3318 -1120 17224 12433 12706 37502 6782 -47 9191 -16579
10592 -16579 -32831 -17711 -8856 10466 512 -864 -19140 -52072 -35647 -31171 -27153 22696 45997
$$ packed form
10683a9566J6087j6035R752J8456j736k2899J1512K8521J5618l7944l4154j433
10671c3821j599Q097L587J4122r815l1836J7574P479N495l34k711O126K8028o254
10657D138J627j0635k5706P600K8642l808p747J158O306n006m058L070K4976O951
10643B7508l4487k0968M622j6979K629j4954m602J499j765N631O9K2748M6172
10630A7123J0031k0330j9260p109N2540m671j0367K1463R02j5095k5255k2439
10618b2467l31j2413J2256J4720L669r238l2408L0402K8051k594n145L314l982
10605C834k3137m520J2138J5003m438J8344m791K73K4796l0720o829R238k5770
10592a6579j6252J5120Q855J9322r954j376j8276l2932J6425M476M018M9849K3301
$$ plain form
10579 45997 48485 25429 5311 -11557 -25287 -16920 13363 27119 17898 -1246 -17798 2304
10567 2304 6540 12937 -24966 -49834 -56063 -58674 -32315 -11770 -34600 -30204 -31850 -39466 -41111
10554 -41111 -29970 -17225 1169 22634 5303 -21927 -12858 -20354 -15593 11861 31270 24651
10542 24651 10175 -23344 -55495 -45940 -28168 -53609 -93851 -119929 -90361 -58848 -60252 -50587
10530 -50587 -35204 -45816 -34457 -9693 8686 7340 16864 25896 49240 55455 37015 1910
10518 1910 -17012 -61387 -71391 -24591 -20509 -25363 -48401 -50434 -8189 5215 5049 -27383 -12024
10505 -12024 8297 -7432 -38751 -12203 10489 15725 -39178 -41567 -50383 -64886 -43129 -17764
10493 -17764 13600 21303 18730 -7547 -23331 -25816 -52808 -65653 -53706 -38552 -10278 11126
$$ packed form
10579D5997K488k3056k0118j6868j3730Q367L0283J3756r221j9144j6552K0102
10567B304M236O397l7903k4868o229k611K6359K0545k2830M396j646p616j645
10554d1111J1141J2745J8394K1465j7331k7230R069p496M761K7454J9409o619
10542B4651j4476l3519l2151R555J7772k5441m0242k6078K9568L1513j404R665
10530e0587J5383j0612J1359K4764J8379j346R524R032K3344O215j8440l5105
10518A910j8922m4375j0004M6800M082m854k3038k033M2245J3404j66l2432J5359
10505a2024K0321j5729l1319K6548K2692N236n4903k389q816j4503K1757K5365
10493a7764L1364P703k573k6277j5784k485k6992j2845J1947J5154K8274K1404
$$ plain form
10481 11126 743 -4187 -6193 4546 3490 -21138 -52517 -70510 -60335 -48372 -34375 -40505
10469 -40505 -18852 -3821 26535 42178 48135 48093 69491 69661 54523 79565 101743 84575 75854
10456 75854 70280 57201 23594 2108 4220 -6314 -7172 18160 42929 37178 14503 -12444 -4270
10443 -4270 18486 20853 18960 25710 23824 26370 11360 8806 9460 32473 34621 12898 8555 11955
10429 11955 -12597 -13661 -16341 -6112 -8495 14879 22545 26139 18394 13818 29635 -7110 -41679
10416 -41679 -46443 -13118 -6109 -24999 -9757 17799 29478 53002 37363 52883 82210 105810
10404 105810 130745 102011 126707 136921 157101 152454 138357 138363 137546 117201 123144 115538 83876
10391 83876 46196 29140 40868 55680 31094 1765 -25861 -29053 -1539 35283 38572 15341
$$ packed form
10481A1126j0383m930k006J0739j056k4628l1379j7993J0175J1963J3997o130
10469d0505K1653J5031L0356J5643N957m2K1398J70j5138K5042K2178j7168q721
10456G5854n574j3079l3607k1486K112j0534q58K5332K4769n751k2675k6947Q174
10443d270K2756K367j893O750j886K546j5010k554O54K3013K148k1723m343L400
10429A1955k4552j064k680J0229k383K3374P666L594p745m576J5817l6745l4569
10416d1679m764L3325P009j8890J5242K7556J1679K3524j5639J5520K9327K3600
10404A05810K4935k8734K4696J0214K0180m647j4097Oq17k0345N943p606l1662
10391H3876l7680j7056J1728J4812k4586k9329k7626l192K7514L6822L289k3231
$$ plain form
10379 15341 -19620 -15243 -18180 -19802 -16790 -29381 -14234 -2449 -6159 -5442 -6320 -41903 -48406 -7303
10365 -7303 41675 25457 4744 -9243 -19663 8902 7840 3259 -29885 -27901 -15573 -3233
10353 -3233 19895 20520 -3015 -31270 -13604 -2950 9120 20074 35731 50420 32831 17114
10341 17114 -12746 -7558 5392 -7593 -15060 -9206 -6135 67 -2111 -24743 -23137 -5201 10931
10328 10931 22744 25887 13526 28826 10410 7980 1414 -26987 -30425 -37944 -39515 -18811 20342
10315 20342 24534 42738 38921 9697 14048 12873 3322 18774 12314 11267 6552 17689 12331
10302 12331 3418 -4174 -15994 -7661 -3123 22229 42469 25040 -1987 -8238 -26272 7933 13006
10289 13006 9101 1423 -30037 -47489 -33667 -5892 -19692 -19853 -14931 -815 -9214 4626 28161
$$ packed form
10379A5341l4961M377k937j622L012j2591J5147J1785l710P17q78l5583o503M1103
10365g303M8978j6218k0713j3987j0420K8565j062m581l3144J984J2328J2340
10353c233K3128O25k3535k8255J7666J0654J2070J0954J5657J4689j7589j5717
10341A7114k9860N188J2950j2985p467N854L071O202k178k2632J606J7936J6132
10328A0931J1813L143j2361J5300j8416k430o566k8401l438p519j571K0704L9153
10315B0342M192J8204l817k9224M351j175r551J5452o460j047m715J1137n358
10302A2331q913p592j1820Q333M538K5352K0240j7429k7027o251j8034L4205N073
10289A3006l905p678l1460j7452J3822K7775j3800j61M922J4116q399J3840K3535
$$ plain form
10276 28161 2737 -3722 14014 29736 5554 -12603 -3685 -13145 -30082 -27211 -50532 -50004 -23591
10263 -23591 5530 28096 20962 -19870 -9224 30805 27464 29050 31875 23132 15921 18504 2698
10250 2698 14359 11502 -10781 25667 26660 13971 21716 12562 15391 20698 28363 5308 -17812
10237 -17812 -16419 -14713 -5854 18539 15586 24066 -5114 -18588 -4757 -11531 -6505 10444 33445
10224 33445 44436 35059 45518 56018 58263 42612 30836 38496 44385 3480 -381 6026 9572
10211 9572 -7515 -31644 -35922 -34494 -20666 -4782 -1937 2825 15416 -18537 -59839 -52122 -31813
10198 -31813 -63310 -68750 -58383 -66155 -57133 -34213 -30469 -49448 -47422 -16131 -8814 -13688 -13672 -18541
10184 -18541 -23568 -33678 -30425 -14702 17107 11605 507 -21526 -29480 -30355 -14842 -16467 -21010
$$ packed form
10276B8161k5424o459J7736J5722k4182j8157Q918r460j6937K871k3321N28K6413
10263b3591K9121K2566p134m0832J0646M0029l341J586K825q743p211K583j5806
10250B698J1661k857k2283L6448R93j2689P745r154K829N307P665k3055k3120
10237a7812J393J706Q859K4393k953Q480k9180j3474J3831o774N026J6949K3001
10224C3445J0991r377J0459J0500K245j5651j1776P660N889m0905l861O407L546
10211I572j7087k4129m278J428J3828J5884K845M762J2591l3953m1302P717K0309
10198c1813l1497n440J0367p772R022K2920L744j8979K026L1291P317m874J6m869
10184a8541n027j0110L253J5723L1809n502j1098k2033p954q75J5513j625m543
$$ plain form
10171 -21010 -17468 -6457 6280 5417 -33884 -27128 11005 14301 -1583 -7916 -398 6156 -7176
10158 -7176 -3163 -21243 -1146 -6612 -21836 -2679 11049 15162 23250 36736 45700 40178 23064
10145 23064 27666 28766 5959 -15199 -11644 -13959 -29824 -26135 -14410 -8494 -28872 -40967 -54909
10132 -54909 -85412 -60346 -35523 -8354 10706 -1769 1148 43876 38788 21072 34094 42158
10120 42158 44446 34443 -9656 -21097 8657 37650 15678 1981 8293 21285 16938 19443
10108 19443 33993 41648 55074 27116 23800 34781 16232 12948 5385 2333 5824 8828 -2257
10095 -2257 -5608 -14 26080 60123 98287 136302 151239 151797 174944 211305 224995 199823 136630
10082 136630 83053 90186 86247 64145 15027 5483 27116 41539 56039 20936 -15876 -36976
$$ packed form
10171b1010L542J1011J2737q63l9301O756L8133L296j5884o333P518O554j3332
10158g176M013j8080K0097n466j5224J9157J3728M113Q088J3486Q964n522j7114
10145B3064M602J100k2807k1158L555k315j5865L689J1725N916k0378j2095j3942
10132e4909l0503K5066K4823K7169J9060j2475K917M2728n088j7716J3022Q064
10120D2158K288j0003m4099j1441K9754K8993k1972j3697O312J2992m347K505
10108A9443J4550P655J3426k7958l316J0981j8549l284p563l052L491L004j1085
10095b257l351N594K6094L4043L8164L8015J4937N58K3147L6361J3690k5172o3193
10082A36630n3577P133l939k2102m9118r544K1633J4423J4500l5103l6812k1100
$$ plain form
10070 -36976 -55917 -27892 -5142 11377 5655 -10653 7679 11927 8092 -1110 -7014 -30208 -16858
10057 -16858 4277 -12987 -25531 -33499 -7995 4550 -21889 -2830 227 5320 -12387 -5034
10045 -5034 -16125 -7513 -2100 -4953 -10575 1168 -12389 -31345 -18034 -14709 -9098 9511 -7479
10032 -7479 -16042 -24138 -22402 107 30470 10039 -18126 -10781 -28987 -42443 -24932 -29364 -30102
10019 -30102 -11679 7709 -1779 -9855 -7460 -1113 -354 32199 36561 31818 28547 41898 69629
10006 69629 58735 59725 41283 18720 21414 27197 7081 -12951 -2850 -12451 -15592 -10619 10031
9993 10031 -3137 -16163 -19285 -25241 -27564 -25837 -23653 -11863 -16431 -462 -9160 -15166 2241
9980 2241 -2867 -6562 -32106 -21633 -41352 -25073 -8784 6287 3591 -26529 -27916 -15854 3476
$$ packed form
10070c6976j8941K8025K2750J6519n722j6308J8332M248l835r202n904k3194J3350
10057a6858K1135j7264j2544p968K5504J2545k6439J9059L057N093j7707P353
10045e034j1091Q612N413k853n622J1743j3557j8956J3311L325N611J8609j6990
10032g479q563q096J736K2509L0363k0431k8165P345j8206j3456J7511m432p38
10019c0102J8423J9388r488q076K395O347P59L2553M362m743l271J3351K7731
10006F9629j0894R90j8442k2563K694N783k0116k0032J0101r601l141M973K0650
9993A0031j3168j3026l122n956k323J727K184J1790m568J5969q698o006J7407
9980B241n108l695k5544J0473j9719J6279J6289J5071k696l0120j387J2062J9330
$$ plain form
9967 3476 -24771 -23461 -46196 -24271 -32272 -38851 -53987 -74082 -38695 -5760 -13320 -24001 -22089
9954 -22089 725 15369 29015 27709 20243 10714 1570 -2912 -19481 -49063 -47960 -4199 22633
9941 22633 1344 -21556 -40004 -33837 -16937 -764 -14978 -25536 -26608 -29553 -62090 -62282 -21915
9928 -21915 25463 29762 14567 7666 8425 16759 35792 8485 -19824 -9604 -27396 -16755 -7345
9915 -7345 -10182 -10098 -13245 -14022 13556 64726 142947 243676 345066 398590 470363 490945 471279
9902 471279 422963 331789 220504 145269 116856 107708 86330 47703 61175 63399 58600 44074
9890 44074 29020 -11623 -10514 -7265 141 -6857 -11738 -8612 16514 -3036 -21253 13542 1037
9877 1037 -27952 -18016 -10670 -8331 6928 35349 35935 14125 26853 3257 -3818 9747 44514
$$ packed form
9967C476k8247J310k2735K1925q001o579j5136k0095L5387L2935p560j0681J912
9954b2089K2814J4644J3646j306p466r529r144m482j6569k9582J103M3761K6832
9941B2633k1289k2900j8448O167J6900J6173j4214j0558j072k945l2537j92M0367
9928b1915M7378M299j5195o901P59Q334J9033k7307k8309J0220j7792J0641R410
9915g345k837Q4l147p77K7578N1170P8221J00729J01390N3524P1773K0582j9666
9902D71279m8316r1174j11285p5235k8413r148k1378l8627J3472K224m799j4526
9890D4074j5054m0643J109L249P406o998m881L126K5126j9550j8217L4795j2505
9877A037k8989R936P346K339J5259K8421N86k1810J2728k3596p075J3565L4767
$$ plain form
9864 44514 51599 38524 40117 38186 55251 62076 46620 1543 -21693 -24402 -28231 -13945 -4539
9851 -4539 -3532 4512 -5008 -21239 -17705 -11121 8488 7926 2614 -292 17132 15038 -9461 -998
9837 -998 44878 64022 32932 29608 -5286 -16392 8513 10817 11751 -841 -6455 -11524 -727
9824 -727 8336 38766 47120 49436 17666 18612 26645 13454 25043 28026 5823 890 23586 41995
9810 41995 45573 15271 -30101 -40683 -17545 -34078 -39774 -22104 -5066 -27012 -24139 -8446
9798 -8446 -14022 -21860 -13181 -23337 -10268 9579 2365 14793 -5415 -14777 -4687 12221 47309
9785 47309 63458 47025 32647 26061 35037 24537 15815 34449 62679 61792 66847 116928 183729
9772 183729 280637 373224 429354 462858 480522 479036 452710 338176 198696 109160 84310
$$ packed form
9864D4514P085j3075J593j931J7065O825j5456m5077k3236k709l829J4286R406
9851d539J007Q044r520j6231L534O584J9609n62n312k906J7424k094k4499Q463
9837i98M5876J9144l1090l324l4894j1106K4905K304R34j2592n614n069J0797
9824g27R063L0430Q354K316l1770R46Q033j3191J1589K983k2203m933K2696J8409
9810D1995L578l0302m5372j0582K3138j6533n696J7670J7038k1946K873J5693
9798h446n576p838Q679j0156J3069J9847p214J2428k0208r362J0090J6908L5088
9785D7309J6149j6433j4378o586Q976j0500q722J8634K8230q87N055N0081O6801
9772A83729R6908R2587N6130L3504J7664j486k6326j14534j39480q9536k4850
$$ plain form
9761 84310 64812 36111 21305 7938 10553 4160 7790 -6987 -34032 -35764 -29995 -13582 -14283
9748 -14283 10744 -1365 -6200 3168 5654 25992 32315 37216 31474 18987 -11158 19444 28496
9735 28496 868 1993 26043 18989 41094 55938 61840 56607 49193 33003 20096 13886 20342
9722 20342 36572 25453 18426 2785 -2197 342 5135 13122 48769 27067 40528 65292 77440
9709 77440 74057 68967 41525 12660 -19445 -25647 -25671 14032 59345 56065 31313 15634 -9332
9696 -9332 -12977 17057 46568 48055 21626 -6591 20596 22956 13941 15506 15766 23808 12972 34151
9682 34151 39441 30262 6231 7057 4577 -22485 -9307 7141 -10989 -23518 -20132 -12002 -1068
9669 -1068 27174 36777 50429 31537 37064 10934 -6632 6556 6053 -34345 -21954 -19857 -15596
$$ packed form
9761H4310j9498k8701j4806j3367K615o393L630j4777k7045j732N769J6413p01
9748a4283K5027j2109m835R368K486K0338O323M901n742j2487l0145L0602R052
9735B8496k7628J125K4050p054K2105J4844N902n233p414j6190j2907o210O456
9722B0342J6230j1119p027j5641m982K539M793P987L5647k1702J3461K4764J2148
9709G7440l383n090k7442k8865l2105o202k4L9703M5313l280k4752j5679k4966
9696i332l645L0034K9511J487k6429k8217K7187K360r015J565K60Q042j0836K1179
9682C4151N290r179k4031Q26k480k7062J3178J6448j8130j2529L386Q130J0934
9669a068K8242R603J3652j8892N527k6130j7566J3188n03m0398J2391K097M261
$$ plain form
9656 -15596 -3618 4756 17497 3754 8813 -16878 -12970 -2078 19717 18585 6148 16802 28103
9643 28103 11586 29803 25634 23703 2307 4782 -12784 -32313 -30835 -18699 1105 12076 993
9630 993 -18842 -11463 -7996 -21717 -15643 -2634 -10706 -12851 1700 19653 4480 -15602 -24228
9617 -24228 -25841 -25555 -40602 -30576 -10876 -10463 21604 19903 -2578 -15521 -2058 9221 8035
9604 8035 22041 -2169 6637 8866 3298 5859 -4008 -22336 -41613 -47070 -28966 -31878 -44325
9591 -44325 -74658 -65589 -20284 -28446 -45184 -12368 -10007 -39335 -36267 -7316 -2909 -29352 -10608
9578 -10608 -769 -14869 -37950 -34795 -22937 -17773 -27248 -27459 -18596 -42362 -54472 -37638 -11298
9565 -11298 21213 -1196 -5316 -1208 -17893 7940 28736 14830 9699 6082 -11263 -17927 -2138
$$ packed form
9656a5596J1978Q374J2741j3743N059k5691L908J0892K1795j132j2437J0654J1301
9643B8103j6517J8217m169j931k1396K475j7566j9529J478J2136J9804J0971j1083
9630I93j9835P379L467j3721O074J3009q072k145J4551J7953j5173k0082q626
9617b4228j613K86j5047J0026J9700M13L2067j701k2481j2943J3463J1279j186
9604H035J4006k4210Q806K229n568K561r867j8328j9277n457J8104k912j2447
9591d4325l0333R069M5305q162j6738L2816K361k9328L068K8951M407k6443J8744
9578a0608R839j4100k3081L155J1858N164r475k11Q863k3766j2110J6834K6340
9565a1298L2511k2409m120M108j6685K5833K0796j3906n131l617j7345o664J5789
$$ plain form
9552 -2138 -7071 18712 29511 26192 21658 54233 53970 29488 -6349 3848 6684 13290 -10080
9539 -10080 -35510 -26667 -9577 4848 -23527 -22989 8784 17573 -4729 2530 28802 26275 -8436
9526 -8436 -15007 -16013 -20134 -32481 -32224 13940 30169 29174 25685 13720 -16416 -12654 7343 6445
9512 6445 -578 11168 38205 42206 42558 11711 -22097 -15188 2815 -2189 -39997 -36197 -23800
9499 -23800 -6168 33280 22705 -2205 -12365 -4532 2401 -2853 1628 -18484 -49175 -43997 -48364
9486 -48364 -25284 -5677 -15729 -12535 -16040 -784 -1567 -4717 9000 25375 -6398 -32330 -45980
9473 -45980 -33630 -33645 -47180 -30370 -30901 -34931 -20923 -9042 -35139 -73607 -67291 -33301 -15698
9460 -15698 18140 33361 40921 38692 36507 21251 17079 18589 -6289 -34252 -53414 -32743 -25546
$$ packed form
9552b138m933K5783J0799l319m534L2575k63k4482l5837J0197K836O606k3370
9539a0080k5430Q843J7090J4425k8375N38L1773Q789k2302P259K6272k527l4711
9526h436o571j006m121j2347K57M6164J6229r95l489j1965l0136L762J9997q98
9512F445p023J1746K7037M001L52l0847l3808O909J8003n004l7808L800J2397
9499b3800J7632L9448j0575k4910j0160P833O933n254M481k0112l0691N178m367
9486d8364K3080J9607j0052L194l505J5256p83l150J3717J6375l1773k5932j3650
9473d5980J2350j5j3535J6810n31m030J4008J1881k6097l8468O316L3990J7603
9460a5698L3838J5221P560k229k185j5256m172J510k4878k7963j9162K0671P197
$$ plain form
9447 -25546 -26760 -37107 -38508 -12475 8146 -11897 -10902 4277 8433 -8577 -6599 -16634 -9365
9434 -9365 -2992 -21232 -15032 4112 14780 17456 22955 35637 31366 26515 44004 41883 11022
9421 11022 3933 -8569 -24158 -22747 -1802 6330 12130 18894 38998 43277 26864 37538 51734
9408 51734 21990 1520 -13134 -28834 -7233 -14878 -35868 -48782 -26496 -22776 -7795 4964
9396 4964 -15083 -43165 -24592 2645 -11939 5531 24969 20317 3719 -5376 9560 20161
9384 20161 26251 18880 23785 43475 67771 72798 46335 21776 11457 27765 57851 66406 84472
9371 84472 91894 74063 73906 83239 77576 69206 25025 -4096 -32821 -45007 -3917 18518 5820
9358 5820 -36295 -25229 -15917 -31133 -38514 -29009 -7296 14804 16891 4801 -1780 -11846 -17573
$$ packed form
9447b5546j214j0347j401K6033K0621k0043R95J5179M156j7010J978j0035P269
9434i365O373j8240O200J9144J0668K676N499J2682m271m851J7489k121l0861
9421A1022p089j2502j5589J411K0945Q132N800O764K0104M279j6413J0674J4196
9408E1734k9744k0470j4654j5700K1601p645k0990j2914K2286L720J4981J2759
9396D964k0047k8082J8573K7237j4584J7470J9438m652j6598r095J4936J0601
9384B0161O090p371M905J9690K4296N027k6463k4559j0319J6308L0086Q555J8066
9371H4472P422j7831j57R333n663q370m4181k9121k8725j2186M1090K2435j2698
9358E820m2115J1066R312j5216p381R505K1713K2100K087j2090o581j0066n727
$$ plain form
9345 -17573 -11891 -12381 5066 37674 41786 20446 15381 48629 81582 115328 117752 102241 134930
9332 134930 147916 139867 149087 155807 132474 103618 80113 56882 26663 24533 20493 28792 62870
9319 62870 52467 30162 28121 48992 39500 64048 69486 58024 50327 36170 53827 45566 27818
9306 27818 11784 17667 1590 7794 34489 52154 62823 72935 90529 94929 73516 56506
9294 56506 77909 124462 179810 159818 89879 62039 56309 37465 10599 23657 13019 24265
9282 24265 46871 32258 15664 8709 -6850 -16637 -11279 21617 16143 29154 39614 38538 19392
9269 19392 37384 58269 53385 53346 44551 19343 19674 27194 41984 75518 85596 78002 92528 116385
9255 116385 151003 151406 116932 117685 113559 88400 99336 80788 54613 48674 82429 92017 67759
$$ packed form
9345a7573N682m90J7447L2608M112k1340n065L3248L2953L3746K424j5511L2689
9332A34930J2986q049R220O720k3333k8856k3505k3231l0219k130m040Q299L4078
9319F2870j0403k2305k041K0871r492K4548N438j1462p697j4157J7657q261j7748
9306B7818j6034N883j6077O204K6695J7665J0669J0112J7594M400k1413j7010
9294E6506K1403M6553N5348j9992o9939k7840n730j8844k6866J3058j0638J1246
9282B4265K2606j4613j6594o955j5559r787N358L2896n474J3011J0460j076j9146
9269A9392J7992K0885m884l9q795k5208L31P520J4790L3534J0078p594J4526K3857
9255A16385L4618M03l4474P53m126k5159J0936j8548k6175n939L3755R588k4258
$$ plain form
9242 67759 52889 49622 69261 101190 118623 111741 128701 102293 83683 91786 109675 86791
9230 86791 61967 74143 71623 79390 61101 42963 19806 1999 10825 31112 27437 13909 28965
9217 28965 18226 33035 40735 36165 7137 -21759 -6718 -1194 -8353 10207 44683 56519 49855
9204 49855 40995 37571 13681 -476 17240 29377 23856 14154 -11284 -20301 450 27855 19956
9191 19956 -23325 -2885 22840 12013 41550 44936 12924 -391 -2198 7287 35483 34710 12277
9178 12277 7044 -780 -2368 17155 -4224 -7249 7190 11052 8517 -4424 -11669 -8438 17538
9165 17538 35759 52750 39373 18592 1797 1119 -4607 -6373 4176 13875 4385 18870 17084
9152 17084 543 3315 32862 33845 36076 33047 37129 38798 21528 37764 41236 17928 16736 16693
$$ packed form
9242F7759j4870l267J9639L1929J7433o882J6960k6408j8610Q103J7889k2884
9230H6791k4824J2176k520P767j8289j8138k3157j7807Q826K0287l675j3528J5056
9217B8965j0739J4809P700m570k9028k8896J5041N524p159J8560L4476J1836o664
9204D9855q860l424k3890j4157J7716J2137n521r702k5438r017K0751K7405p899
9191A9956m3281K0440K5725j0827K9537L386l2012j3315j807R485K8196p73k2433
9178A2277n233p824j588J9523k1379l025J4439L862k535j2941p245L231K5976
9165A7538J8221J6991j3377k0781j6795o78n726j766J0549R699r490J4485j786
9152A7084j6541K772K9547R83K231l029M082J669j7270J6236L472k3308j192m3
$$ plain form
9138 16693 31916 16926 32737 37827 39498 39026 47566 56253 76727 99716 87422 46215 25002
9125 25002 8058 5431 20435 45110 61484 60842 61134 43572 64864 66345 71234 64370 52773
9112 52773 100277 103796 65084 45684 42734 46761 67220 71965 83669 87269 75763 90382 104718
9099 104718 94882 96778 135974 171531 201092 230074 263163 294059 308641 300902 340528 401762
9087 401762 444863 481926 564341 644199 744780 890273 1086948 1356616 1767226 2405919
9077 2405919 3378264 4866423 6717816 8400508 9715498 10881011 11732450 11858554 10916721
9068 10916721 8740971 6311886 4594832 3498806 2843768 2407806 2095018 1847095 1651744
9059 1651744 1501575 1379000 1260622 1167343 1130558 1071620 997185 923335 865009 821535 790939
$$ packed form
9138A6693J5223j4990J5811N090J671m72Q540Q687K0474K2989j2294m1207k1213
9125B5002j6944k627J5004K4675J6374o42K92j7562K1292J481M889o864j1597
9112E2773M7504L519l8712j9400k950M027K0459M745J1704L600j1506J4619J4336
9099A04718r836J896L9196L5557K9561K8982L3089L0896J4582p739L9626O1234
9087D01762M3101L7063Q2415P9858J00581J45493J96675K69668M10610O38693
9077B405919R72345J488159J851393J682692J314990J165513Q51439J26104r41833
9068A0916721k175750k429085j717054j096026o55038m35962l12788k47923j95351
9059A651744j50169j22575j18378r3279l6785n8938p4435p3850n8326m3474l0596
$$ plain form
9048 790939 772662 751664 708337 654732 614269 620910 623309 591338 568651 558370 531469 502305
9036 502305 464032 427176 415677 425984 420521 429640 419914 406847 386354 381762 374645 373632 358599
9023 358599 332902 346211 344318 327328 314333 272924 261293 264276 271888 282735 243679 234377
9011 234377 233450 230298 231202 215463 213545 228337 216207 218708 204586 192139 206378 225928 193153
8998 193153 152692 143084 157842 181438 166416 166478 155543 165045 168462 169903 167706 152931 184914
8985 184914 185082 138127 93895 69170 46574 29504 40196 52012 56218 65757 84114 84668 80183
8972 80183 94779 80814 97686 103473 89831 85136 113234 125829 100543 85006 56054 60239
8960 60239 67465 86159 82373 75035 72609 98788 99048 81520 68538 63865 46884 51879 80251
$$ packed form
9048G90939j8277k0998m3327n3605m0463O641K399l1971k2687j0281k6901k9164
9036E02305l8273l6856j1499J0307n463R119r726j3067k0493m592p117j013j5033
9023C58599k5697J3309j893j6990j2995m1409j1631K983P612J0847l9056r302
9011B34377r27l152R04j5739j918J4792j2130K501j4122j2447J4239J9550l2775
8998A93153m0461r608J4758K3596j5022O2j0935R502L417J441k197j4775L1983
8985A84914J68m6955m4232k4725k2596j7070J0692J1816M206R539J8357N54m485
8972H0183J4596j3965J6872N787j3642m695K8098J2595k5286j5537k8952M185
8960F0239P226J8694l786p338k426K6179K60j7528j2982m673j6981M995K8372
$$ plain form
8947 80251 85664 79830 81010 108286 89109 62260 52629 60204 55316 49734 50152 48672 45344 45701
8933 45701 37043 42507 51243 52653 72298 58154 41095 40226 52631 33805 32170 54903 62348
8920 62348 37295 9905 -506 -17259 -23193 12199 26545 7655 -26441 -40665 -8573 10825
8908 10825 15510 15702 11605 14997 32528 36444 57432 84048 86347 44929 44047 36669 4048 -16996
8894 -16996 2918 10949 3192 -6972 -12355 3066 -6858 -12588 -4842 6736 22754 23206 14079 27804
8880 27804 39732 38960 28988 -17309 -23616 3555 9239 -6425 -4555 14081 36299 44416 61643
8867 61643 66638 39837 1670 -742 -1900 -26625 -39007 -17877 -5364 35291 54699 36627
8855 36627 10011 13575 3562 27039 45468 39809 16485 6842 18276 29231 28200 21361 -1568
$$ packed form
8947H0251N413n834J180K7276j9177k6849r631P575m888n582M18j480l328L57
8933D5701q658N464Q736J410J9645j4144j7059q69J2405j8826j635K2733P445
8920F2348k5053k7390j0411j6753n934L5392J4346j8890l4096j4224L2092J9398
8908A0825M685J92m097L392J7531L916K0988K6616K299m1418q82p378l2621k1044
8894a6996J9914Q031p757j0164n383J5421r924n730P746J1578J6018M52r127J3725
8880B7804J1928p72r972m6297o307K7171N684j5664J870J8636K2218Q117J7227
8867F1643M995k6801l8167k412j158k4725j2382K1130J2513M0655J9408j8072
8855C6627k6616L564j0013K3477J8429n659k3324r643J1434J0955j031o839k2929
$$ plain form
8842 -1568 -25805 -27159 -24251 -1055 22470 3386 -9798 8420 25651 15599 5552 37337
8830 37337 44505 18734 -10718 -48222 -46789 -27766 -13470 8524 2019 -25497 -44638 -66322
8818 -66322 -54821 -24980 -12254 2654 11729 10812 630 -10504 3905 11236 17835 59512 96782
8805 96782 94718 53747 27899 8103 45220 45889 41051 58596 42680 22363 -4392 19314 38886
8792 38886 19225 39362 81279 54991 34297 27982 29380 31538 31273 21977 20412 11986 38154
8779 38154 44186 51509 65465 79232 51072 43572 29925 31358 34677 45100 54452 51967 16080
8766 16080 5900 42760 70018 84309 70874 65134 76596 92231 93454 108840 118346 119386 126585
8753 126585 150118 182218 219063 279047 321891 341106 375964 361924 306849 222470 192219 180324
$$ packed form
8842a568k4237j354K908K3196K3525j9084j3184J8218J7231j0052j0047L1785
8830C7337P168k5771k9452l7504J433J9023J4296K1994o505k7516j9141k1684
8818f6322J1501K9841J2726J4908R075r17j0182j1134J4409P331O599M1677L7270
8805I6782k064m0971k5848j9796L7117O69m838J7545j5916k0317k6755K3706J9572
8792C8886j9661K0137M1917k6288k0694o315J398K158k65r296j565q426K6168
8779C8154O032P323J3956J3767k8160p500j3647J433L319J0423R352k485l5887
8766A6080j0180L6860K7258J4291j3435n740J1462J5635J223J5386R506J040P199
8753A26585K3533L2100L6845N9984M2844J9215L4858j4040n5075q4379l0251j1895
$$ plain form
8741 180324 193936 179811 147792 151972 141048 133319 109964 70317 70567 97665 89031 63842 58537
8728 58537 40444 52862 55957 49820 46449 46229 26379 32340 45436 36313 22125 17424 42347
8715 42347 66403 60783 68609 99751 120252 153693 194059 190846 179235 167219 137141 112021
8703 112021 116442 100001 89596 89232 97325 107441 103243 88777 78025 105574 138986 144329 127730
8690 127730 88738 99783 118269 115227 115715 135687 137078 140451 181363 213932 197799 190841 206477
8677 206477 180478 175822 159030 156803 167352 166704 149718 154607 169934 188568 218808 243750 289629
8664 289629 299793 303473 317972 287084 258913 229252 179529 164089 146018 116985 105956 82215
8652 82215 50723 32085 40711 52170 82291 86650 90374 85770 84707 87225 47048 57368 79213
$$ packed form
8741A80324J3612j4125l2019M180j0924p729k3355l9647K50K7098q634k5189n305
8728E8537j8093J2418L095o137l371k20j9850N961J3096r123j4188m701K4923
8715D2347K4056n620P826L1142K0501L3441M0366l213j1611j2016l0078k5120
8703A12021M421j6441j0405l64Q093J0116m198j4466j0752K7549L3412N343j6599
8690A27730l8992J1045J8486l042M88J9972J391L373M0912L2569j6133o958J5636
8677B06477k5999m656j6792k227J0549o48j6986M889J5327J8634L0240K4942M5879
8664B89629J0164L680J4499l0888k8171k9661m9723j5440j8071k9033j1029k3741
8652H2215l1492j8638Q626J1459L0121M359L724m604j063K518m0177J0320K1845
$$ plain form
8639 79213 99674 86233 66268 72712 87794 93608 103047 104767 99832 81153 69003 56970 65178
8626 65178 39314 29214 23236 43641 76406 108780 101815 108951 122903 127193 146958 140887 132662
8613 132662 127600 121172 54112 39921 23515 -16674 -37953 -25039 3811 16885 27957 58662
$$ packed form
8639G9213K0461j3441j9965O444J5082N814R439J720m935j8679j2150j2033Q208
8626F5178k5864j0100n978K0405L2765L2374o965P136J3952M290J9765o071q225
8613A32662n062o428o7060j4191j6406m0189k1279J2914K8850J3074J1072L0705
$$ [...]
##END NTUPLES=NMR SPECTRUM
##END=
