##TITLE=Analysis number 322478
Compound Code cc 63614
Book Reference 470/107
Project Code adrs
Chemist Name mikem
##JCAMPDX= 6.0         $$ Bruker NMR JCAMP-DX V2.0
##DATA TYPE= NMR SPECTRUM
##DATA CLASS= NTUPLES
##ORIGIN= Bruker BioSpin GmbH
##OWNER= nmr
$$ XWIN-NMR		Version 3.5
$$ Wed Sep 27 13:49:34 2006 GMT Daylight Time (UT+1h)  MAYBRIDGE\nmr@NMR_250MHZ
##.OBSERVE FREQUENCY= 250.131544655141
##.OBSERVE NUCLEUS= ^1H
##.ACQUISITION MODE= SIMULTANEOUS (DQD)
##.ACQUISITION SCHEME= undefined
##.AVERAGES= 16
##.DIGITISER RES= 18
##SPECTROMETER/DATA SYSTEM= dpx250
##.PULSE SEQUENCE= zg30
##.SOLVENT NAME= CDCl3
##.SHIFT REFERENCE= (INTERNAL, CDCl3, 0, 16.522)
##AUDIT TRAIL= $$ (NUMBER, WHEN, WHO, WHERE, WHAT)
$$ ##TITLE= Audit trail, XWIN-NMR		Version 3.5
$$ ##JCAMPDX= 5.01
$$ ##ORIGIN= Bruker BioSpin GmbH
$$ ##OWNER= nmr
$$ C:\u/data/dgb/nmr/ADRS/1500/pdata/1/auditp.txt
$$ ##AUDIT TRAIL=  $$ (NUMBER, WHEN, WHO, WHERE, WHAT)
(   1,<2006-09-27 13:49:09.79 +100>,<MAYBRIDGE\nmr>,<NMR_250MHZ>,
      <created by zg, POWCHK disabled, PULCHK disabled
       configuration hash MD5:
       E2 DF 36 D8 04 B2 41 60 5A D7 A3 38 5A 4B D0 FE
       data hash MD5: 64K
       D8 AC 62 E2 FD 4F F9 FB 28 39 57 5D 24 13 C2 AF>)
(   2,<2006-09-27 13:49:24.21 +100>,<MAYBRIDGE\nmr>,<NMR_250MHZ>,
      <Start of raw data processing
       ef LB = 0.3 FT_mod = 6 PKNL = 1 SI = 32K 
       data hash MD5: 32K
       F9 E7 25 AE B4 94 A4 1C 22 D4 A0 59 6A 73 1A 34>)
(   3,<2006-09-27 13:49:26.09 +100>,<MAYBRIDGE\nmr>,<NMR_250MHZ>,
      <apk 
       data hash MD5: 32K
       39 5D AB 3B 79 64 19 4A 0D D0 D8 8A 53 1A E9 D4>)
(   4,<2006-09-27 13:49:27.09 +100>,<MAYBRIDGE\nmr>,<NMR_250MHZ>,
      <abs ABSG = 5 
       data hash MD5: 32K
       57 D1 36 E4 47 15 30 F7 87 C0 A9 20 40 D4 EB 86>)
$$ ##END=
$$ 
$$ hash MD5
$$ 8D 28 8C 1E 4C 77 0D DC 0B 72 FB 0F A3 BC 54 BB
##$RELAX= 
##$RELAX= 
##$RELAX= 
##$RELAX= 
##$RELAX= 
##$RELAX= 
##$RELAX= 
$$ Bruker specific parameters
$$ --------------------------
##$DU= <C:\u>
##$EXPNO= 1500
##$NAME= <ADRS>
##$PROCNO= 1
##$TYPE= <nmr>
##$USER= <dgb>
##$AMP= (0..31)
100 100 100 100 100 100 100 100 100 100 100 100 100 100 100 100 100 100 
100 100 100 100 100 100 100 100 100 100 100 100 100 100 
##$AQSEQ= 0
##$AQ_mod= 3
##$AUNM= <au_zg>
##$AUTOPOS= <27 >
##$BF1= 250.13
##$BF2= 250.13
##$BF3= 250.13
##$BF4= 250.13
##$BF5= 500.13
##$BF6= 500.13
##$BF7= 500.13
##$BF8= 500.13
##$BYTORDA= 1
##$CFDGTYP= 0
##$CFRGTYP= 5
##$CHEMSTR= <none>
##$CNST= (0..31)
1 1 145 1 1 1 1 1 1 1 1 1 1 1 1 1 1 1 1 1 1 1 1 1 1 1 1 1 1 1 1 1 
##$CPDPRG= <>
##$CPDPRG1= <>
##$CPDPRG2= <>
##$CPDPRG3= <>
##$CPDPRG4= <mlev>
##$CPDPRG5= <mlev>
##$CPDPRG6= <mlev>
##$CPDPRG7= <mlev>
##$CPDPRG8= <mlev>
##$CPDPRGB= <>
##$CPDPRGT= <>
##$D= (0..31)
0 1 0 0 0 0 0 0 0 0.06 0 0 0 0 0 0 0.0002 0 0 0 0 0 0 0 0 0 0 0 0 0 0 
0 
##$DATE= 1159361348
##$DBL= (0..7)
120 120 120 120 120 120 120 120 
##$DBP= (0..7)
150 150 150 150 150 150 150 150 
##$DBP07= 0
##$DBPNAM0= <>
##$DBPNAM1= <>
$$ [...]
##$SUBNAM7= <"">
##$SUBNAM8= <"">
##$SUBNAM9= <"">
##$SW= 20.6930455092707
##$SWIBOX= (0..15)
0 0 3 0 0 0 0 0 0 0 0 0 0 0 0 0 
##$SW_h= 5175.983436853
##$TD= 65536
##$TD0= 1
##$TE= 295.16
##$TE2= 300
##$TE3= 300
##$TEG= 300
##$TL= (0..7)
0 120 120 120 120 120 120 120 
##$TP= (0..7)
150 150 150 150 150 150 150 150 
##$TP07= 0
##$TPNAME0= <>
##$TPNAME1= <>
##$TPNAME2= <>
##$TPNAME3= <>
##$TPNAME4= <>
##$TPNAME5= <>
##$TPNAME6= <>
##$TPNAME7= <>
##$TPOAL= (0..7)
0.5 0.5 0.5 0.5 0.5 0.5 0.5 0.5 
##$TPOFFS= (0..7)
0 0 0 0 0 0 0 0 
##$TUNHIN= 0
##$TUNHOUT= 0
##$TUNXOUT= 0
##$USERA1= <user>
##$USERA2= <user>
##$USERA3= <user>
##$USERA4= <user>
##$USERA5= <user>
##$V9= 5
##$VALIST= <valist>
##$VCLIST= <CCCCCCCCCCCCCCC>
##$VD= 0
##$VDLIST= <DDDDDDDDDDDDDDD>
##$VPLIST= <PPPPPPPPPPPPPPP>
##$VTLIST= <TTTTTTTTTTTTTTT>
##$WBST= 1024
##$WBSW= 4
##$XGAIN= (0..3)
0 0 0 0 
##$XL= 0
##$YL= 0
##$YMAX_a= 444487
##$YMIN_a= -682999
##$ZGOPTNS= <>
##$ZL1= 120
##$ZL2= 120
##$ZL3= 120
##$ZL4= 120
##$ABSF1= 16.522
##$ABSF2= -4.171173
##$ABSG= 5
##$ABSL= 3
##$ALPHA= 0
##$AQORDER= 0
##$ASSFAC= 0
##$ASSFACI= 0
##$ASSFACX= 0
##$ASSWID= 0
##$AUNMP= <proc_1d>
##$AZFE= 0.1
##$AZFW= 0.1
##$BCFW= 0
##$BC_mod= 0
##$BYTORDP= 0
##$COROFFS= 0
##$CY= 12.5
##$DATMOD= 1
##$DC= 0
##$DFILT= <>
##$DTYPP= 0
##$F1P= 14.0000005364418
##$F2P= -0.99999901652339
##$FCOR= 0.5
##$FTSIZE= 32768
##$FT_mod= 6
##$GAMMA= 0
##$GB= 0
##$INTBC= 1
##$INTSCL= 1
##$ISEN= 128
##$LB= 0.3
##$LEV0= 0
##$LPBIN= 0
##$MAXI= 10000
##$MC2= 0
##$MEAN= 0
##$ME_mod= 0
##$MI= 0
##$NCOEF= 0
##$NC_proc= -4
##$NLEV= 6
##$NOISF1= 0
##$NOISF2= 0
##$NSP= 0
##$NTH_PI= 0
##$NZP= 0
##$OFFSET= 16.522
##$PC= 1
##$PHC0= 155.2061
##$PHC1= -9.015818
##$PH_mod= 1
##$PKNL= yes
##$PPARMOD= 0
##$PSCAL= 4
##$PSIGN= 0
##$REVERSE= no
##$SF= 250.13
##$SI= 32768
##$SIGF1= 0
##$SIGF2= 0
##$SINO= 400
##$SIOLD= 32768
##$SREGLST= <1H.CDCl3>
##$SSB= 0
##$STSI= 32768
##$STSR= 0
##$SW_p= 5175.98343685301
##$SYMM= 0
##$S_DEV= 0
##$TDeff= 65536
##$TDoff= 0
##$TI= <Analysis number 999999
Compound Code 99
Book Reference 9
Project Code 9>
##$TILT= no
##$TM1= 0
##$TM2= 0
##$TOPLEV= 0
##$USERP1= <user>
##$USERP2= <user>
##$USERP3= <user>
##$USERP4= <user>
##$USERP5= <user>
##$WDW= 1
##$XDIM= 32768
##$YMAX_p= 319942045
##$YMIN_p= -384656
$$ End of Bruker specific parameters
$$ ---------------------------------
##NTUPLES= NMR SPECTRUM
##VAR_NAME=  FREQUENCY,     SPECTRUM/REAL,   SPECTRUM/IMAG
##SYMBOL=    X,             R,               I
##VAR_TYPE=  INDEPENDENT,   DEPENDENT,       DEPENDENT
##VAR_FORM=  AFFN,          ASDF,            ASDF
##VAR_DIM=   32768,         32768,           32768
##UNITS=     HZ,            ARBITRARY UNITS, ARBITRARY UNITS
##FACTOR=    0.157963299565203, 1,           1
##FIRST=     4132.6476996994, 0,             0
##LAST=      -1043.33573715361, 0,           0
##MIN=       -1043.33573715361, -384656,     0
##MAX=       4132.6476996994, 319942045,     0
$$ Real data points
##PAGE= N=1
##DATA TABLE= (X++(R..R)), XYDATA
$$ [...]
19744f1952P3062O9511m4465o163J8840K3363k6760k6414j0743o408J2088L9814
$$ -61952 11110 80621 36156 29993 48833 72196 45436 19022 8279 1871 13959 53773
19732E3773J9627r794k8913k3258L4411K2987o847r366K2959l5082k1659o478
$$ 53773 73400 63606 34693 11435 45846 68833 61986 52620 75579 40497 18838 12360
19720A2360K4075P185m0438k5036p237k8728R755M397P4250K0203J1162j0658
$$ 12360 36435 43620 3182 -21854 -29091 -57819 -48064 -43667 30583 50786 61948 51290
19708E1290q767J4203J0016r716j0745J9394J7135j9001l0272M953n302k4008
$$ 51290 42523 56726 66742 57026 46281 65675 82810 63809 33537 38490 33188 9180
19696I180n077j7834j8547K5644J5917j2785J1912J8654l2542j2795K7332J3094
$$ 9180 4103 -13731 -32278 -6634 9283 -3502 8410 27064 -5478 -18273 9059 22153
19684B2153j1469M638L8813J585m5330j2960j8343j3855j778K3681M6726l839
$$ 22153 10684 15322 54135 55720 10390 -2570 -20913 -34768 -36546 -12865 33861 30022
19672C0022l8711m4652J9629L5882L3063N5802J0058k7748J884Q4r179L266K0984
$$ 30022 -8689 -53341 -33712 2170 35233 91035 101093 73345 75229 75313 66134 69400 90384
19659I0384m8317j7675R859p17O579k8901j0855l2092J4697K5556J0673K6477
$$ 90384 42067 24392 34251 33534 40113 11212 357 -31735 -17038 8518 19191 45668
19647D5668J8304R683n0875j1374O5068N768o996k036l7416n0301L8358J8818
$$ 45668 63972 73655 22780 11406 76474 82242 75246 73210 35794 -14507 23851 42669
19635D2669n2510M6653M4765J7050k902l0715l8402j2491k6866j9964k1090J28497
$$ 42669 -9841 36812 81577 98627 95725 65010 26608 14117 -12749 -32713 -53803 74694
19623G4694K5065j7212j3959N915K5066K6782n9520p320N844j0904l0626j1872
$$ 74694 99759 82547 68588 74503 99569 126351 66831 59511 65355 54451 23825 11953
19611A1953M9641Q095m3565l0087L4546J4293M0530P287O926k1319o029O740l5381
$$ 11953 61594 69689 26124 -3963 30583 44876 85406 92693 99619 78300 72271 79011 43630
19598D3630N470J8343K7316M6212o047n7843j1964j9255j0355k9017K086Q399
$$ 43630 49100 67443 94759 140971 134924 77081 65117 45862 35507 6490 8576 16975
19586A6975N174J052J8884M0289M3024J0782P193n6480m947J0002l0698K272K2054
$$ 16975 22149 23201 42085 82374 125398 136180 143373 86893 81946 91948 61250 63522 85576
19573H5576K718Q633N187M7558j3325l8443k9102k0955n749L0273L7738L553k1869
$$ 85576 88294 96927 102114 149672 136347 97904 68802 47847 42098 72371 110109 113662 91793
19560I1793l016m6848K7370K6927J2790n1401Q846n180L579J1623k0615J2611
$$ 91793 88777 41929 69299 96226 109016 57615 66461 61281 64860 76483 55868 68479
19548F8479j7047K3728J4514K7761k6598r077J2959J0243k079q477P968n2444
$$ 68479 51432 75160 89674 117435 90837 81760 94719 104962 102883 94406 102374 49930
19536D9930j0720k5326R385l2659l0806K8990J7330K5809r682m1969J25L093j196
$$ 49930 39210 13884 23269 -9390 -40196 -11206 6124 31933 22251 -19718 -19593 -16500 -17696
19523a7696L8682L2982K7930M6300j5513l9080j1494K8658K03j3829L9493N9197
$$ -17696 20986 53968 81898 128198 112685 73605 62111 90769 90972 77143 116636 175833
19511A75833l2590n0782j7764l4546K517J6398M28K6113J258k9770R468J7716
$$ 175833 143243 92461 74697 40151 42668 59066 59494 85607 86865 57095 66563 84279
19499H4279k25K5673L7133j0658l5816J5056J9739l4665N242R072k4539o5093
$$ 84279 84054 109727 146860 136202 100386 115442 135181 100516 105758 114830 90291 25198
19487B5198j1052k5410L2024l9137M230L9897L8064J8589n399q313l2587M197
$$ 25198 14146 -11264 20760 -18377 -14147 25750 63814 82403 77004 68691 36104 40301
19475D0301n0625j6735j0735J8015L6465J3094Q614K8570p86k9090n010j4684
$$ 40301 -10324 -27059 -37794 -19779 16686 29780 38394 66964 66178 37088 32078 17394
19463A7394o654L8726K0348k0848K9580J318L0410o5259j6149L2189k408k0460
$$ 17394 10740 49466 69814 48966 78546 79864 110274 45015 28866 61055 58647 38187
19451C8187K0343N781K5130m348l4081J2455J6772K2293M4781N9046k0554m0390
$$ 38187 58530 64311 89441 85093 51012 63467 80239 102532 147313 206359 185805 145415
19439A45415k1690L959n447p593J2857P284j8553j4534q51j1377j3587L9194M4873
$$ 145415 123725 127684 122237 114644 127501 134785 116232 101698 100847 89470 75883 115077 159950
19426A59950j6107j0944m9500j0461j6669j7856J2962o761K2723J6149j5196K910
$$ 159950 143843 132899 83399 72938 56269 38413 51375 44614 67337 83486 68290 71200
19414G1200K5650k9005m0806K5303J0924L9350K2196n3965l2080j324m5855N6714
$$ 71200 96850 67845 27039 52342 63266 102616 124812 70847 38767 37443 -8412 48302
19402D8302M5829R736M1669l2008l7069k3824l1794j5436p210K0834M558k1466
$$ 48302 94131 103867 145536 113528 76459 52635 20841 5405 -1805 19029 23587 2121
19390B121k0306K5712J9493R6286K9576n2599j3820M2103l9524p4804m9241j7764
$$ 2121 -18185 7527 27020 123306 152882 100283 86463 128566 89042 14238 -35003 -52767
19378e2767J0182J7308J0886L6380j0463J9439P7680O5010l663m2048n1399L2511
$$ -52767 -42585 -25277 -14391 21989 11526 30965 108645 173655 169992 127944 76545 109056
19366A09056l4845k5203K7485m1566L1031N3737Q167j9628k2941K7889Q040k2280
$$ 109056 74211 49008 76493 34927 65958 119695 127862 108234 85293 113182 121222 98942
19354I8942O142j6226j0439l8657J3915J4305O377J4121K1051L1763K5230J7126
$$ 98942 105084 88858 78419 39762 53677 67982 74359 88480 109531 141294 166524 183650
19342A83650P487l6205p199q942m3238m2498k680N3905J5182R895L8517J5743
$$ 183650 191137 154932 147733 138791 95553 53055 50375 104280 119462 129357 167874 183617
19330A83617l4010k6482j6671k1020J5558n9151l2516O3957J6441J2449J9354
$$ 183617 149607 123125 106454 85434 100992 41841 9325 73282 89723 102172 121526
19319A21526m8357m391J9079p046N3831M2911m8942j6726l8981j5120j164K178
$$ 121526 73169 68778 87857 80811 134642 177553 128611 111885 72904 57784 56620 58798
19307E8798L0699L9661j696n6912j7368K6410n26q889m2743N986L9969L5840k3227
$$ 58798 89497 129158 127462 70550 53182 79592 79066 70177 27434 33420 73389 109229 86002
19294H6002j9476n540n853k7270L094M5809N8394J8937k0852J0146R966j7745
$$ 86002 66526 60986 55133 27863 30957 76766 135160 154097 133245 143391 153357 135612
19282A35612j3907j1190k617K555P559N456P077J7588k9034l1030j9299L0780
$$ 135612 121705 110515 107898 110453 118012 123468 130545 148133 119099 88069 68770 99550
19270I9550K0499k1409l100K7527R352p593n1197J4501N4956K2156p9645n090
$$ 99550 120049 98640 95540 123067 132419 124826 73629 88130 143086 165242 85597 80507
19258H0507R303j1725k4924K0831L8410k7601j4511J1304K3683j1218m873j6071
$$ 80507 89810 78085 53161 73992 112402 84801 70290 81594 105277 94059 89186 73115
19246G3115L1654K1887k974r328J9014P560J1100k9004k3910J7293j600k2286
$$ 73115 104769 126656 123682 114354 133368 140928 152028 123024 99114 116407 114807 92521
19234I2521j6267j7703Q783J8577J3316L51K1690j1486Q339L5643L1433k2413
$$ 92521 76254 58551 67334 85911 99227 99578 121268 109782 118121 153764 185197 162784
19222A62784m0834n6641J708R155J5524M3197p655p4100k8980L2862M3010j7247
$$ 162784 121950 65309 67017 76172 91696 134893 127238 53138 24158 57020 100030 82783
19210H2783m621l9490k3321n7378L8969P0987O0995N2051q61N071K0782j1633
$$ 82783 78162 38672 15351 -42027 -3058 67929 128924 180975 180114 185185 205967 194334
19198A94334m2984M30J5858j5513J6169L3506l5814n9933n341M3709j859l3696
$$ 194334 151350 151780 167638 152125 168294 201800 165986 106053 100712 144421 142562 108866
19186A08866K7949K1449M4913l55P159n1694m066k8105K1474n344k5842L3241
$$ 108866 136815 158264 203177 202822 209981 158287 154221 126116 147590 142246 116404 149645
19174A49645L5058p361k9364j5054l686K2049K3795j1324k8536j5511j5550O170
$$ 149645 184703 177342 147978 132924 129238 151287 175082 163758 135222 119711 104161 110331
19162A10331o75m4503M143j9731L7554L4752k3995k7250M091M7025K1705n1881
$$ 110331 109656 65153 69296 49565 87119 121871 97876 70626 74717 121742 143447 91566
19150I1566j2936M3654N3422Q389n2695J1541L0782k3495j6751k5382M4548j9762
$$ 91566 78630 122284 175706 184095 131400 142941 173723 150228 133477 108095 152643 132881
19138A32881J6293j645k4841K0326Q159j8476p872J5780L7990k350p69l316n934
$$ 132881 149174 147529 122688 143014 151173 132697 124825 140605 178595 176245 175476 172160 166226
19125A66226k3447l627m264m535O092p845l7791O795j227P319K3190K2708K7793
$$ 166226 142779 139152 134888 130353 136445 128600 90809 97604 96377 103696 126886 149594 177387
19112A77387K3109p3429Q797J9207j5813j8457l683M8995J2370l1538K6074j7481
$$ 177387 200496 127067 135864 155071 139258 120801 117118 166113 178483 146945 173019 155538
19100A55538J259O857j591J2860M1383O368k6711j2020n0242j7811J6660L9292
$$ 155538 156797 163654 162063 174923 216306 222674 195963 183943 133701 115890 132550 171842
19088A71842j7836m8046K4441J5358K4905m9102m4911n105P526M18K0778O2256
$$ 171842 154006 105960 130401 145759 170664 121562 76651 71546 79072 79490 100268 162524
19076A62524M8790l0802j2007K5607M271J633Q911q8344m3470K5421J6570j4175
$$ 162524 211314 180512 168505 194112 198383 200016 208927 120583 77113 102534 119104 104929
19064A04929K5332L1640j8132k2310J0833j6366o5680K898J0504l752j1718N857
$$ 104929 130261 161901 143769 121459 132292 115926 50246 53144 63648 59896 48178 54035
19052E4035K3172J0860M2727K9824l123n006k0210m2724o308L0742K3537M8132
$$ 54035 77207 88067 130794 160618 157495 152489 132279 89555 83247 113989 137526 185658
19040A85658J8933p5165n1923o881L1832J771K4380O994J011L028R09p534k073
$$ 185658 204591 129426 77503 70622 102454 104225 128605 135599 136610 139638 140547 133013 130940
19027A30940k3087J3103L1575p3478j6845M562K8313K0606q390L0727M6673M2403
$$ 130940 107853 120956 152531 79053 62208 66770 95083 115689 107299 138026 184699 227102
19015B27102j6085m6457J3991L7995L3657l3093q2862m9890N2958L5388J0301
$$ 227102 211017 164560 178551 216546 250203 217110 134248 84358 137316 172704 183005
19004A83005J7434o4490j2556k184q509P3222K4951q877j3730R933M029J8289
$$ 183005 200439 135949 123393 121209 112700 185922 210873 201996 188266 198199 202228 220517
18992B20517j0808R327J2640k2970p4118N579L0019k5879j5277J9687j1348J6633
$$ 220517 209709 219036 231676 208706 134588 140167 170186 144307 129030 148717 137369 154002
18980A54002n805k736l305k410j6169J6566N9573l2589p3977J3452K9369P072
$$ 154002 148197 145461 142156 139746 123577 140143 199716 167127 93150 106602 135971 143043
18968A43043L0189J4357J3221j8646k8503P518j837l770L3938n5552q78k2034
$$ 143043 173232 187589 200810 182164 153661 161179 159342 155572 189510 133958 133080 111046
18956A11046r778N285L9221Q525N0949M4248L9061p889k0066j6916l3797k8109
$$ 111046 101268 106553 145774 154299 205248 249496 288557 280668 260602 243686 209889 181780
18944A81780o0394l6002J1522O2048J673k7950J573K6434M4811J3613j8831n0242
$$ 181780 121386 85384 96906 158954 160627 132677 134250 160684 205495 219108 200277 150035
18932A50035o7159l4612M6288N7687K5408J3999k3305J4530j6957l38k1535R544
$$ 150035 82876 48264 94552 152239 177647 191646 168341 182871 165914 165576 144041 153585
18920A53585N8935N5571K470n2785j098K1183j0565k0652L194k7011k4501j5304
$$ 153585 212520 268091 270561 217776 216678 237861 227296 206644 209838 182827 158326 143022
18908A43022M1088M7060m1677k8800J8717K4720j6943l3047l6458K5287J6635
$$ 143022 184110 231170 189493 160693 179410 204130 187187 154140 117682 142969 159604
18897A59604n2113K8835j9561j7749M611K9609J0418k4828j5804n351O2232J4124
$$ 159604 107491 136326 116765 99016 103627 133236 143654 118826 103022 97671 159903 174027
18885A74027j3906R912k1542l4668m1417Q472K1809J9102k1227K0025J4983K5194
$$ 174027 160121 170033 148491 113823 72406 80878 102687 121789 100562 120587 135570 160764
18873A60764N7681J7053J5273o740L044k0503j4242o295J5821j2122o0285k7072
$$ 160764 218445 235498 250771 244031 247075 226572 212330 206035 221856 209734 149449 122377
18861A22377P1562N9472L3247K7530r956l3119J5810n624l6050K4654n4305k543
$$ 122377 193939 253411 286658 314188 304232 271113 286923 281299 245249 269903 215598 213055
18849B13055l8104k9037K9786R230J2098l1875L3608L3635j2598m0050n861k0428
$$ 213055 174951 145914 175700 184930 197028 165153 198761 232396 219798 179748 173887 153459
18837A53459l0487M0059K6927K1406q58l7746j0830L4828M5137j7383l0505k6082
$$ 153459 122972 163031 189958 211364 210506 172760 161930 196758 241895 224512 194007 167925
18825A67925k6651K9728N4340K3762M924k860O559m7645K190N3649o231M326k8255
$$ 167925 141274 171002 225342 249104 254028 251168 257727 210082 212272 265921 259690 264016 235761
18812B35761j4887L9013L1625l389m1452Q581P0228J9099n6490m1262k9563k0708
$$ 235761 220874 259887 291512 288123 246671 255252 325480 344579 288089 246827 217264 196556
18800A96556J4532l4280K697R636R725M8356N199m720n1164k1524J6278P0591
$$ 196556 211088 176808 179505 189141 198866 247222 252421 247701 196537 175013 191291 261882
18788B61882O959l2891J5104R736l1553M3875k3161r982N006k6058K9807K7590
$$ 261882 268841 235950 251054 260790 229237 273112 249951 239969 244975 218917 248724 276314
18776B76314L2563o308J8894N9366N0016L6184O226K3270K4431o233o5737o6285
$$ 276314 308877 302569 321463 380829 430845 467029 473255 496525 520956 514723 448986 382701
18764C82701M928q140k059n8517o8638L0911j755J063j0158k6072j5492k8423
$$ 382701 387629 379489 377430 318913 250275 281186 279431 280494 270336 244264 228772 200349
18752B00349L0790K4953N7877K8892j3038m7045O164J6347j6142k9882j5005k924
$$ 200349 231139 256092 313969 342861 329823 282778 288942 305289 289147 259265 244260 241336
18740B41336p218j1257J6049L2947N2212n924j7072J2902M1194Q1696Q6964P579
$$ 241336 234118 222861 238910 271857 324069 318145 301073 313975 355169 436865 523829 531408
18728E31408m9041J4543n3899o8499l8294M0896L0990N1012L0747j8637P1766
$$ 531408 482367 496910 443011 374512 336218 377114 408104 459116 489863 471226 542992
18717E42992L4245n4234o4437l0466k3806j6892n368k442j9965j5712p275M1262
$$ 542992 577237 523003 458566 428100 404294 387402 382034 379592 359627 343915 336640 377902
18705C77902L9098o486K387m5562m7143k5754M671L146O0615n830K0566L2414
$$ 377902 417000 410514 412901 367339 320196 294442 299113 302259 362874 357044 377610 410024
18693D10024j4166k0757l0646J0198N7796M5345N2504K9406L6619Q344K5833M9948
$$ 410024 395858 375101 344455 354653 412449 457794 510298 539704 576323 584667 610500 660448
18681F60448P8057l5548k7373L4352m618o6179K5839O7585M2765L6377k7440m4999
$$ 660448 738505 702957 675584 709936 705318 639139 664978 732563 775328 811705 784265 739266
18669G39266m6261k3716j250j0302j8246M2654J9671K4121j9362k9606m1725n3494
$$ 739266 693005 669289 668039 657737 639491 682145 701816 725937 706575 676969 635244 581750
18657E81750n6344k9891j8781K6878L4780j6890J9401J6507m6914l1681J513K9530
$$ 581750 525406 495515 476734 503612 538392 521502 540903 557410 510496 478815 480328 509858
18645E09858k9605k1817l0773J9533k6006j818J3640K4913m0276j5477K2288L683
$$ 509858 480253 458436 427663 447196 421190 419372 433012 457925 417649 402172 424460 428143
18633D28143K85L8512L6680K6058O4955N8562K6430l2271l7441N654J9201l3533
$$ 428143 428428 466940 503620 529678 594633 653195 679625 647354 609913 615567 634768 601235
18621F01235j5869K5905M5598M2771K30L709J953q5469p0468m7347l1417Q72K3586
$$ 601235 585366 611271 656869 699640 699870 703579 705532 620063 549595 502248 470831 471703 495289
18608D95289r194M61r7518J6436L096J7054L3878L0467o0080k6888K5181j1735
$$ 495289 486095 486556 389038 405474 408570 425624 459502 489969 429889 403001 428182 416447
18596D16447k2869k8850l9798J3249N2268M1598L0475k7343k806o001J8517L7533
$$ 416447 393578 364728 324930 338179 390447 432045 462520 435177 432371 426370 444887 482420
18584D82420k3652j4125r0632k4622K1025j1289j684j2948L224n9145Q3L9951
$$ 482420 458768 444643 354011 329389 350414 339125 337441 324493 327717 268572 268655 308606
18572C08606L3913l8003m13L7372J7390O712M631J7789n031K2387j3769m890j934
$$ 308606 342519 304516 304103 341475 358865 365577 370208 387997 382966 405353 391584 386694 384760
18559C84760l7808P930k1596N6902L7389O358r985o4778q825m879j983j1896r279
$$ 384760 346952 354882 333286 390188 427577 433935 423950 359172 350347 345468 343485 331589 322310
18546C22310K5966L2832K2390R549L447K5553j7736l1513J253l5107l5948M968
$$ 322310 348276 381108 403498 413047 416494 442047 424311 392798 394051 358944 322996 327964
18534C27964O39M0066K3397l2159j2036M0628P1603L7488M7395P654R902j726
$$ 327964 328603 368669 392066 359907 347871 388499 460102 497590 544985 552639 562541 560815
18522E60815o714j4785j8736J2869J8513l0537k1816l5128P118R142k6877j4952
$$ 560815 554101 539316 520580 533449 551962 521425 499609 464481 471599 480741 453864 438912
18510D38912q833l1086J5106K2625J2917l5961n3230l8068N4032L0083K676j1090
$$ 438912 430079 398993 414099 436724 449641 413680 360450 322382 376414 406497 409173 398083
18498C98083K7528O4268j0998j5665K4003j0681j9294k4338l0667k5951j4482
$$ 398083 425611 489879 478881 463216 487219 476538 457244 432906 402239 376288 361806
18487C61806J0317O6077Q491l9279J8468P0321N7827J5932P5351o105N6073R4633
$$ 361806 372123 438200 446691 407412 425880 496201 554028 569960 645311 639206 695279 789912
18475G89912L6083m508N720P3258J6078o5592q2708p0386k3251o5883n4062j7148
$$ 789912 825995 821487 827207 900465 916543 850951 768243 697857 674606 608723 554661 537513
18463E37513k7148j1217j4622L320L14M6258l925l4593R713q363p077K722K9110
$$ 537513 510365 499148 484526 487846 488160 534418 530493 495900 505613 497250 490173 492895 522005
18450E22005J3059j7848j4791l1873Q357j4332L7321K7324j0193J0496k5203j6981
$$ 522005 535064 517216 502425 470552 478909 464577 501898 529222 519029 529525 504322 487341
18438D87341J4729j4579j3768M4934O693O3435K4632K550K1920L2218N7933J7759
$$ 487341 502070 487491 473723 518657 525350 588785 613417 615967 637887 670105 728038 745797
18426G45797K8831L4757J7329m5414p7282J051m5835k78K5374m5453j5400o408
$$ 745797 774628 809385 826714 781300 704018 705069 659234 658956 684330 638877 623477 617069
18414F17069j1224K0559L8230N479k4914o302l8522m0875L6933L0401l5550l0408
$$ 617069 605845 626404 664634 670113 645199 638897 600375 559500 596433 626834 591284 560876
18402E60876o324K5674m6J580j7984J8225N5157j90k2519n267Q088l8556j3270
$$ 560876 554552 580226 580180 581760 563776 582001 637158 636968 614449 609182 617270 578714 565444
18389E65444J3349l486m6658n1163J2651P8836P1790j6808P241O3979k7998n0589
$$ 565444 578793 575307 528649 477486 490137 568973 640763 623955 631196 695175 667177 616588
18377F16588j5058P118K3900L923j934k6999m259k065j4586K2782L2890M0846
$$ 616588 601530 608648 632548 636471 634537 607538 603279 601214 586628 609410 642300 683146
18365F83146m499k5822m4593J0127P26J9494K619l0684K8656Q0749K8892j5573
$$ 683146 678647 652825 608232 618359 619085 638579 641198 610514 639170 719919 748811 733238
18353G33238q826n5985L6798M8641L0025N146l0531J0864K7853o1752k7071J2724
$$ 733238 724412 668427 705225 753866 783891 789037 758506 769370 797223 735471 708400 721124
18341G21124L31J7342r378K4545N6485M6816L6481M0541o4136o5553k0856m4802
$$ 721124 721455 738797 729419 753964 810449 857265 893746 934287 870151 804598 783742 738940
18329G38940j947M5969j7029l7152Q418Q7605L6980m2484k6447L4426M4703P920
$$ 738940 736993 782962 765933 728781 737199 824804 861784 819300 792853 827279 871982 879902
18317H79902n308l6644O190M4964M6017J7548O5139K5459K7362O0266K6071J0161
$$ 879902 874594 837950 844140 889104 935121 952669 1017808 1043267 1070629 1130895 1156966 1167127
18305A167127m2038l0626K4816K0331M248L3060K3833j1411J3922J3273L8495
$$ 1167127 1125089 1094463 1119279 1139610 1143858 1176918 1200751 1189340 1203262 1216535 1255030
18294A255030K3856M0161L2992n563j6532P657J7416L6630J3896j4173L8233O2202
$$ 1255030 1278886 1319047 1352039 1346476 1329944 1337601 1355017 1391647 1405543 1391370 1429603 1491805
18282A491805M7761O9159m334n9467j0769L0974M1543M2011K2803j5354j1522
$$ 1491805 1539566 1608725 1604391 1544924 1534155 1565129 1606672 1648683 1671486 1656132 1644610
18271A644610l17k6202n881M9916J24535P5365J15838N8315L565Q0338J22482
$$ 1644610 1644293 1618091 1612210 1662126 1786661 1862026 1977864 2036179 2039744 2120082 2242564
18260B242564J23986J76217J75909J31324K13983K04562J83801K67394J94857
$$ 2242564 2366550 2542767 2718676 2850000 3063983 3268545 3452346 3719740 3914597
18251C914597K22535J68173J02846j9512k7997o131K3837J81075L69965N77479
$$ 3914597 4137132 4305305 4408151 4388639 4360642 4354511 4378348 4559423 4929388 5506867
18241E506867P69070R26625R54411R85025J212528J471053J442553J494996J733263
$$ 5506867 6275937 7202562 8156973 9141998 10354526 11825579 13268132 14763128 16496391
18232A6496391K623710M193078N748038O503667O889200O875830N913367N091442
$$ 16496391 19120101 23313179 29061217 35564884 42454084 49329914 55243281 60334723
18224F0334723L082984j600069n030368p379336p310634n132273l776950l635916
$$ 60334723 63417707 61817638 56787270 49407934 42097300 36965027 33188077 29552161
18216B9552161k689333j020643l1045K55414O71276Q80533K19888j110106k800982
$$ 29552161 26862828 25842185 25811140 26066554 26737830 27618363 27838251 26728145 23927163
18207B3927163l523047k722765j535993p31457p2650K42934M79907O04130P14129
$$ 23927163 20404116 17681351 16145358 15413901 15341251 15584185 16064092 16668222 17382351
18198A7382351Q64088P41162M42766N3909j87491N4285N31960R88896J527411
$$ 17382351 18246439 18987601 19430367 19484276 19296785 19351070 19883030 20871926 22399337
18189B2399337K300592L704448N691457P996124R927424J0259948R254590R383378
$$ 22399337 24699929 28404377 34095834 42091958 52019382 62279330 71533920 80917298
18181H0917298J0545269R277670M529451k727237q480623p315067j668749L061586
$$ 80917298 91462567 100740237 105269688 102542451 94061828 86746761 85078012 88139598
18173H8139598N842543O024645L850153L127993L016327J14461l770253r152037
$$ 88139598 93982141 100006786 103856939 106984932 110001259 110115720 106345467 97193430
18165I7193430j4996087j4693046j2020211r056331n963154l533596k116128j442085
$$ 97193430 82197343 67504297 55484086 46427755 40464601 36931005 34814877 33372792
18157C3372792j071738n92718m09643p53192j396681k170919k200659j539383
$$ 33372792 32301054 31708336 31298693 30545501 29148820 26977901 24777242 23237859
18149B3237859r34876l78700J13944N84208J107244J654937K122456K271933K074918
$$ 23237859 22302983 21924283 22038227 22622435 23729679 25384616 27507072 29779005 31853923
18140C1853923K139783K370278J864591O01526q66110j502464m86511R24120K280890
$$ 31853923 33993706 36363984 38228575 38830101 37963991 36461527 35975016 36899136 39180026
18131C9180026M285277O695131Q231153Q630168P413734O295946O434367O096845
$$ 39180026 43465303 50160434 58391587 67021755 74435489 80731435 87165802 93262647
18123I3262647M464656o03662q063275j3005150j4990338j1481742n498396m34199
$$ 93262647 97727303 97123641 89060366 76055216 61064878 49583136 44084740 43650541
18115D3650541K999759L955643K690521L416763O119582L934316m81304p064814
$$ 43650541 46650300 50605943 53296464 56713227 62832809 66767125 66285821 59221007
18107E9221007j2972459r761838o210361m721933l461754k377897j738357j267550
$$ 59221007 46248548 36486710 30276349 25554416 22092662 19714765 17976408 16708858
18099A6708858j021178p94327o58556o28378n75165n13132m76051m41453m60017
$$ 16708858 15687680 14893353 14234797 13606419 13031254 12518122 12042071 11600618 11140601
18090A1140601m55849m18746l41482k77763l11878k83019k56295l22978k32029
$$ 11140601 10684752 10266006 9924524 9646761 9334883 9051864 8795569 8472591 8240562
18081H240562k02872k34841k47589k58642k32561k26940j50420j44492k16328
$$ 8240562 8037690 7802849 7555260 7296618 7064057 6837117 6686697 6542205 6325877
18072F325877j34297j59894r6548j67585j25937l0298m7390j18790q2772o2116
$$ 6325877 6191580 6031686 5935138 5767553 5641616 5611318 5563928 5445138 5362366 5300250
18062E300250j01168n3708j7850r4952q1987l0318L1532K6839l703k0424j4115
$$ 5300250 5199082 5145374 5127524 5032572 4950585 4920267 4951799 4978638 4974935 4954511 4940396
18051D940396o254q7735j76020p5947n9766m5873J3849J6032J06589J80600J43676
$$ 4940396 4934142 4846407 4670387 4594440 4534674 4488801 4502650 4518682 4625271 4805871 4949547
18040D949547K21377L31078M10537N23254P50554J060394J568162K143842K839121
$$ 4949547 5170924 5502002 5912539 6435793 7186347 8246741 9814903 11958745 14797866
18031A4797866L606837M213925M591784M733265M454340L516149J980305K4643
$$ 14797866 18404703 22618628 27210412 31943677 36398017 39914166 41894471 41919114
18023D1919114k159312l860175m980156n354423m860737l898756k825021j967695
$$ 41919114 39759802 35899627 30919471 25565048 20704311 16805555 13980534 12012839
18015A2012839j373378r19896o98292n65745m23430l11916j98571j45298n8262
$$ 12012839 10639461 9719565 9021273 8455528 8032098 7720182 7521611 7376313 7318051
18006G318051r690K1429K1843J2375q735L788j7197N844K3867k2111M7932J66406
$$ 7318051 7308361 7329790 7351633 7364008 7355273 7359061 7341864 7347708 7371575 7349464 7397396 7563802
17994G563802K47966L00792M65971O26535Q19762J134197J566891K207989L079013
$$ 7563802 7811768 8112560 8578531 9205066 10024828 11159025 12725916 14933905 18012918
17985A8012918M211044N550038O880178Q248533R378815R979192R731755Q364201
$$ 18012918 22223962 27774000 34654178 42902711 52281526 62260718 71992473 80356674
17977H0356674N937281K642658j147345m913010q121661j0193337j0673512r972230
$$ 80356674 86293955 88936613 87789268 82876258 74754597 64561260 53887748 43915518
17969D3915518q443970o600834m891804l449234k450534j743682j338673j026308
$$ 43915518 35471548 28870714 23978910 20529676 18079142 16335460 14996787 13970479
17961A3970479p82302o32939n68811l86775k61629k32944j73971j57391j58444
$$ 13970479 13188177 12555238 11986427 11599652 11338023 11105079 10931108 10773717 10615273
17952A0615273j50250j52806j03977j14732j24746j26081j16339j7783L7964M5513
$$ 10615273 10465023 10312217 10208240 10093508 9968762 9842681 9726342 9708559 9746523 9792036
17942I792036J86899L65250M10576O19985R62357J537873K186416L064749L971897
$$ 9792036 9978935 10344185 10754761 11374746 12337103 13874976 16061392 19126141 23098038
17933B3098038M946867N673120O011085O039623N504841M051031J776005r52339
$$ 23098038 28044905 33718025 39729110 45768733 51273574 55324605 57100610 56148271
17925E6148271l712445n901550p161802p345460o407560m941575l541046k457903
$$ 56148271 52435826 46534276 39372474 32027014 25619454 20677879 17136833 14678930
17917A4678930j751118j301910j012796q08305o46254n06605m83053m48639l58447
$$ 14678930 12927812 11625902 10613106 9804801 9158547 8651942 8168889 7720250 7361803
17908G361803k49174k02186k03825j75377j25056r4067j11285j66325j71087k02490
$$ 7361803 7112629 6910443 6706618 6531241 6406185 6312118 6200833 6034508 5863421 5660931
17898E660931k13820k05103k27894k61362k17597j70585j15926j34132j46896
$$ 5660931 5447111 5242008 5014114 4752752 4535155 4364570 4248644 4114512 3967616
17889C967616j33747p8336n3470l17m9480q1743j42029r0458q7096j22273p1114
$$ 3967616 3833869 3755533 3702063 3701746 3652266 3570523 3428494 3338036 3250940 3128667 3057553
17878C057553o8302n3776r2318p4148r4851j2003l7892p3674o2482k8097l9243
$$ 3057553 2989251 2935475 2843157 2769009 2674158 2662155 2624263 2550589 2488107 2460010 2420767
17867B420767m2839m5277o9316l8709j8165P304q491l982j2718k4859j3673n561
$$ 2420767 2377928 2332651 2263335 2224626 2206461 2213765 2205274 2201292 2188574 2163715 2150042 2144481
17855B144481k0203j9318O187j6274k5555o8185k2440P5o6K3420k1919l9484j1984
$$ 2144481 2124278 2104960 2111147 2094873 2069318 2001133 1978693 1978768 1978702 2002122 1980203 1940719 1928735
17842A928735K3669l6447j2935n9197q8590o1128n9045K2042J7290Q401j1962
$$ 1928735 1952404 1915957 1903022 1843825 1755235 1694107 1635062 1657104 1674394 1682795 1670833
17831A670833M0649M7591n556p8500n9536j6517J2404O412O956R313l3449l1758
$$ 1670833 1711482 1759073 1753517 1675017 1615481 1598964 1611368 1617780 1624736 1634049 1600600 1568842
17819A568842n271j3879K842k4948K4654O0903K0183k1276p3398k1479L301k4855
$$ 1568842 1563571 1549692 1552534 1527586 1552240 1613143 1633326 1612050 1538652 1517173 1520474 1495619
17807A495619l0082J9375j943J4216j7538k2313Q706J9376L9333O339p25m9790
$$ 1495619 1465537 1484912 1482969 1497185 1479647 1457334 1466040 1485416 1524749 1531088 1530363 1480573
17795A480573k6221j751J4094M3698M8148N2265K1409j8371K2551K7985K2415
$$ 1480573 1454352 1452601 1466695 1510393 1558541 1610806 1632215 1613844 1636395 1664380 1686795
17784A686795J4841L2056N7843k1373J7191O6599O4506M1899k038R711M4496N0695
$$ 1686795 1701636 1733692 1791535 1770162 1787353 1853952 1918458 1960357 1958319 1968030 2012526 2063221
17772B063221N8335K7521L4628o350J7429N4601N7323N7485n312l6514K7649P9931
$$ 2063221 2121556 2149077 2183705 2177355 2194784 2249385 2306708 2364193 2358881 2322367 2350016 2429947
17760B429947N4585L4670k497K8315R2648O1805L0483K6763O2088O1732M1934
$$ 2429947 2484532 2519202 2516705 2545020 2637668 2699473 2729956 2756719 2818807 2880539 2922473
17749B922473R0792J10808M3303J8821O4157M1149O5776P4806O7567J03499J98065
$$ 2922473 3013265 3124073 3167376 3186197 3250354 3291503 3357279 3432085 3499652 3603151 3801216
17738C801216J53314K20542L14504K62085K58360K72197L24415L73382M65563
$$ 3801216 3954530 4175072 4489576 4751661 5010021 5282218 5606633 5980015 6445578
17729F445578N29681N82793P24972R06178J192674J516920J816063K003299K188069
$$ 6445578 6975259 7558052 8283024 9189202 10381876 11898796 13714859 15718158 17906227
17720A7906227K452923K275559J844560J489469J169939J184260J483336J892849
$$ 17906227 20359150 22634709 24479269 25968738 27138677 28322937 29806273 31699122
17712C1699122K735099M156484N816225P650318R601579J1547054J3660694J5547321
$$ 31699122 34434221 38590705 44406930 52057248 61658827 73205881 86866575 102413896
17704A02413896J6250261J6043109J5945776J5697842J3476227O917370l013771
$$ 102413896 118664157 134707266 150653042 166350884 179827111 186744481 183730710
17697A83730710j0840746j2722679j0924214r147456r507399j2306472j3388580
$$ 183730710 172889964 160167285 149243071 140095615 130588216 118281744 104893164
17690A04893164j2472144j0863640p820477m648737k445900j682909k394615m199186
$$ 104893164 92421020 81557380 73736903 69088166 66642266 64959357 62564742 58365556
17682E8365556n911995o202022n290114l908754k573975j681973j096666p10814
$$ 58365556 52453561 46251539 40961425 37052671 34478696 32796723 31700057 30989243
17674C0989243m35935k99782j74809Q6720M55476R50355J454125J926382K237105
$$ 30989243 30553308 30253526 30078717 30165437 30620913 31571268 33025393 34951775 37188880
17665C7188880K832692L654971M226985M517879M399124M750570O503464R346940
$$ 37188880 40021572 43676543 47903528 52421407 56820531 61571101 68074565 77421505
17657G7421505J1805434J3062862J3408119J3535767J3061555J2807387J3622927
$$ 77421505 89226939 102289801 115697920 129233687 142295242 155102629 168725556
17650A68725556J1896815O851675r3142q268934j0591203o349715l652514n719919
$$ 168725556 180622371 187474046 187380904 179111970 168520767 162171052 158518538 152798619
17642A52798619j1731094j8105349k0088795j6903860j1443772p055282n075353
$$ 152798619 141067525 122962176 102873381 85969521 74525749 67470467 62395114
17635F2395114n002496n756531o215321n004126l401349k262179j620354j259436
$$ 62395114 57392618 51636087 45420766 40416640 37015291 34753112 33132758 31873322
17627C1873322r56526q93512j015932j389343j647026j580280j279773r70480
$$ 31873322 30916796 30023284 29007352 27618009 25970983 24390703 23110930 22140450
17619B2140450p92781p00631n85915m05872k63190J04916N84806J177521J658648
$$ 22140450 21347669 20647038 20061123 19655251 19392061 19496977 20081783 21259304 22917952
17610B2917952J748175J562509J658815K345965K570856K201613J125511l83942
$$ 22917952 24666127 26228636 27887451 30233416 32804272 35005885 36131396 35747454
17602C5747454p03814K62265J569610J373164j24684k452765m505031l956605
$$ 35747454 35043640 35305905 36875515 38248679 38123995 35671230 31166199 27209594
17594B7209594k317561j075659q22520j302958k239418k833088k264856j540671
$$ 27209594 24892033 23816374 22993854 21690896 19451478 16618390 14353534 12812863
17586A2812863j053217p48149o03674m95266m20401l86233k83506k57241l11051
$$ 12812863 11759646 11011497 10407823 9912557 9492156 9105923 8822417 8565176 8254125
17577H254125l50770l34099k69893k55472k73539k72165k06934j85670j51700
$$ 8254125 7903355 7569256 7299363 7043891 6770352 6498187 6291253 6105583 5953883
17568E953883j83806j38481j40103j90102j98634r1476j06981k19019j63861j38172
$$ 5953883 5770077 5631596 5491493 5301391 5102757 5011281 4904300 4685281 4521420 4383248
17558D383248j32129q2855r2069j58469j27871j46641j15249q1519m9995m4146
$$ 4383248 4251119 4168264 4076195 3917726 3789855 3643214 3527965 3446446 3396451 3352305
17548C352305j45631r7591r968l5801p0760j05307p7534l2411m1607q9335l5106
$$ 3352305 3206674 3109083 3099115 3063314 2992554 2887247 2809713 2777302 2735695 2646360 2611254
17537B611254m4186o1765K5065p5694o6504r4919K3201N045l1077l6060J3221
$$ 2611254 2567068 2505303 2530368 2454674 2388170 2293251 2316452 2321497 2290420 2254360 2267581
17526B267581j2706n4411m930o1568p5110k9114o8019o8004j17n379l4869o3640
$$ 2267581 2254875 2200464 2195534 2133966 2058856 2029742 1961723 1893719 1893602 1888223 1853354 1789714
17514A789714m5093K4089l652J5488N981k5088n9146m9280K068M7162N8283Q759
$$ 1789714 1744621 1768710 1765058 1780546 1786527 1761439 1702293 1653013 1655081 1702243 1760526 1769285
17502A769285p8585m2158n271R755j6329J3189l303N4461P2284M5458o858m86
$$ 1769285 1690700 1648542 1643271 1653026 1636697 1649886 1646583 1701044 1773328 1818786 1811928 1811442
17490A811442P876O1019M6969N2305O3358P0435M1187P7166N6958O0941Q3070
$$ 1811442 1819318 1880337 1927306 1979611 2042969 2113404 2154591 2231757 2288715 2349656 2432726
17479B432726J29769P5043J9021J0112N2105J1491O8312Q0269R1772J39992J22657
$$ 2432726 2562495 2637538 2656559 2666671 2718776 2730267 2798579 2878848 2970620 3110612 3233269
17468C233269J60233J81129J85614K13639K36066L13243M02853M05455N14806
$$ 3233269 3393502 3574631 3760245 3973884 4209950 4523193 4926046 5331501 5846307
17459E846307O44130P76724J040244J418552J727141K014980K430078K936266
$$ 5846307 6490437 7267161 8307405 9725957 11453098 13468078 15898156 18834422
17451A8834422L400989L517911L539378L705857L851030L953519L634830L064938
$$ 18834422 22235411 25753322 29292700 32998557 36849587 40803106 44437936 47502874
17443D7502874K813692K788533K644916K027792J233325N45448J03728k63529
$$ 47502874 50316566 53105099 55750015 57777807 59011132 59556580 59660308 59396779
17435E9396779q83209j872426k673026k881365k918889l285278l802727m213214
$$ 59396779 58513570 56641144 53968118 51086753 48167864 44882586 41079859 36866645
17427C6866645m164123l723255l229495k945246k572037k073853j546500j165295
$$ 36866645 32702522 28979267 25749772 22804526 20232489 18158636 16612136 15446841
17419A5446841q05645n91838n53190l21456k12879j30568m2863P8814K42552L79933
$$ 15446841 14641196 14049358 13496168 13174712 12961833 12831265 12788402 12867216 13109768 13489701
17409A3489701O37299R03926J116808J414369J770198K175408K398250K428890
$$ 13489701 14127000 15030926 16147734 17562103 19332301 21507709 23905959 26334849
17401B6334849K643490K829249L030052L038387K815538K649747K779692K960054
$$ 26334849 28978339 31807588 34837640 37876027 40691565 43341312 46121004 49081058
17393D9081058K693230K014545J393988R38671N73790R4179p78752j701060k099774
$$ 49081058 51774288 53788833 55182821 56121492 56695282 56789461 56010709 54309649 52209875
17384E2209875k195787k419926k773171l144429l212415k825838k108241j415949
$$ 52209875 50014088 47594162 44820991 41676562 38464147 35638309 33530068 32114119
17376C2114119p17071J38384J118023K164869L078875L764352L980721M100209
$$ 32114119 31397048 31535432 32653455 34818324 37897199 41661551 45642272 49742481
17368D9742481M124299L799721L188421K376392J792292J548111J309272J063125
$$ 49742481 53866780 57666501 60854922 63231314 65023606 66571717 67880989 68944114
17360F8944114J154267J611926K266884K746029K771844K514576K092320J674281
$$ 68944114 70098381 71710307 73977191 76723220 79495064 82009640 84101960 85776241
17352H5776241R25851j77525j302766k047336k504042k768432l028636l199593
$$ 85776241 86702092 86524567 85221801 83174465 80670423 77901991 74873355 71673762
17344G1673762k973162k613995k584745k840546l106377l496702l758079l975478
$$ 71673762 68700600 66086605 63501860 60661314 57554937 54058235 50300156 46324678
17336D6324678m181096m312427m035847l576858l192036k754736k285446j901405
$$ 46324678 42143582 37831155 33795308 30218450 27026414 24271678 21986232 20084827
17328B0084827j501370j258526j079772q64893p42159o76998o67175o14721n54203
$$ 20084827 18583457 17324931 16245159 15380266 14638107 13961109 13293934 12679213 12125010
17319A2125010n26277m79678m87554m53720m36131l63717l77848l41897k92250
$$ 12125010 11598733 11119055 10631501 10177781 9741650 9377933 9000085 8658188 8365938
17310H365938k92549k61050k87733k45145k31147k17793k32211k10353j69939
$$ 8365938 8073389 7812339 7524606 7279461 7048314 6830521 6598310 6387957 6218018
17301F218018j71433j48989j65832j76390j34109j58265j48381j61023j52788
$$ 6218018 6046585 5897596 5731764 5555374 5421265 5263000 5114619 4953596 4800808
17292D800808j25532j37478j14944j22518j40440p0492p3290p0886j06790r3334
$$ 4800808 4675276 4537798 4422854 4300336 4159896 4089404 4016114 3945228 3838438 3745104
17282C745104j10032j11392q9658r9949n1277p0612r2983k5671n0073q7022r1753
$$ 3745104 3635072 3523680 3434022 3334073 3282796 3212184 3119201 3093530 3043457 2956435 2864682
17271B864682r4489p9230j20255r5648n0783n3223m2924k8976k0415q8525j04165
$$ 2864682 2770193 2690963 2570708 2475060 2424277 2371054 2328130 2299154 2278739 2190214 2086049
17260B086049m7763n0611o8007l5193m1202p299j5778n1090k1339l7270q5676
$$ 2086049 2038286 1987675 1919668 1884475 1843273 1835974 1820196 1769106 1747767 1710497 1624821
17249A624821j940K3342J0255k647j5029j9795l1429l0355n1722m2908R381L1781
$$ 1624821 1622881 1646223 1656478 1653831 1638802 1619007 1587578 1557223 1505501 1462593 1471974 1503755
17237A503755o637l3850k5876O181l2806j6909L423n514r567O457j5314o3620
$$ 1503755 1497118 1463268 1437392 1443573 1410767 1393858 1397281 1391767 1382200 1388657 1373343 1309723
17225A309723l3522j8479J7738M2081J7638M9219j4423j204k401M7688R591O717
$$ 1309723 1276201 1257722 1275460 1317541 1335179 1384398 1369975 1368771 1366370 1414058 1423649 1430366
17213A430366P4924P5889M3543L0175K7380J10270J04383J4622J02552Q1085P0861
$$ 1430366 1505290 1581179 1624722 1654897 1682277 1792547 1896930 1911552 2014104 2095189 2166050
17202B166050R5589Q1442N4085L2451J07549J47006J50951J61230J35372J49263
$$ 2166050 2261639 2343081 2397166 2429617 2537166 2684172 2835123 2996353 3131725 3280988
17192C280988K03544K73758K82347L23817L35085M25483N72299O79401Q16028
$$ 3280988 3484532 3758290 4040637 4364454 4699539 5125022 5697321 6376722 7192750
17183G192750J105558J437319J877385K337703K755609L244650L684921L859767
$$ 7192750 8298308 9735627 11613012 13950715 16706324 19950974 23635895 27495662
17175B7495662L902780L729782L264637K530807J750532R36188L22232k9702k21948
$$ 27495662 31398442 35128224 38392861 40923668 42674200 43610388 43932620 43902918 43680970
17166D3680970m43804o23034q36770p90009m09480R117L80066P64299Q45239N40004
$$ 43680970 43237166 42614132 41777362 40987353 40577873 40586990 40967056 41731355 42576594 43116598
17156D3116598P5253n74748j133837j451328j828935k228341k676242l088297
$$ 43116598 43191851 42617103 41483266 40031938 38203003 35974662 33298420 30210123
17148C0210123l310976l247288k878050k437424j914876j382858j028713p34907
$$ 30210123 26899147 23651859 20773809 18336385 16421509 15038651 14009938 13275031
17140A3275031m88559l87854k11079r0924M0200K03704L56130N72906Q28900J208834
$$ 13275031 12786472 12398618 12187539 12096615 12136815 12340519 12696649 13269555 14098455 15307289
17130A5307289J661101K114440K561190K945624L135789L085685K995856K680181
$$ 15307289 16968390 19082830 21644020 24589644 27725433 30811118 33806974 36487155
17122C6487155K165264J513167Q41550K84078j9072j17034k75596m56665o43672
$$ 36487155 38652419 40165586 41007136 41291214 41272142 41155108 40879512 40422847 39779175
17113C9779175p35372n69983j85424O1108L57388M38593K43560p6032n57310j028732
$$ 39779175 39043803 38473820 38288396 38349504 38706892 39145485 39389045 39313013 38755703 37726971
17103C7726971j373582j640828j976108k309413k672019l011541l112594k860796
$$ 37726971 36353389 34712561 32736453 30427040 27755021 24743480 21630886 18770090
17095A8770090k486473k007988j567637j206780r73661p60748o43433n72190m59121
$$ 18770090 16283617 14275629 12707992 11501212 10527551 9766803 9123370 8551180 8092059
17086H092059l61615l66634l36196k99915k92545k72524k65553k49753k35474
$$ 8092059 7730444 7363810 7027614 6727699 6435154 6162630 5897077 5647324 5411850
17077E411850k62779j92613j95691k14698k06447j91766j24371j29218j20590
$$ 5411850 5149071 4956458 4760767 4546069 4339622 4147856 4023485 3894267 3773677
17068C773677j04094j38224j49753j79936j01678n1293j00286j32249r5849q1595
$$ 3773677 3669583 3531359 3381606 3201670 3099992 3048699 2948413 2816164 2720315 2638720
17058B638720o5421o3049p7886j01765j17425m0885l0436j24666n4096o9839o0006
$$ 2638720 2573299 2510250 2432364 2330599 2213174 2172289 2141853 2017187 1963091 1893252 1833246
17047A833246m4241p9117m5201n3657k0496j9293m9481p7659j03135r0059p1047
$$ 1833246 1789005 1709888 1664687 1611030 1590534 1571241 1521760 1444101 1340966 1250907 1179860
17036A179860n3094l0095q6080n1869M583j6873j8574k0519k0675o7697m4416
$$ 1179860 1126766 1096671 1010591 958722 963305 946432 927858 907339 886664 818967 774551
17025G74551l047j3721m7025n7087n9415l7695m0422j7406l4119m0999q46k8792
$$ 774551 771504 757783 710758 653671 594256 556561 516139 498733 464614 423615 422769 393977
17013C93977o7417m1017m8879j8957N6148p934O150K2588m1562m7510j0020o0268
$$ 393977 326560 285543 236664 217707 273855 265921 272071 294659 253097 205587 195567 135299
17001A35299J19J063K8251k2829J2963R810l4611J5714L7825l6436k212k8039
$$ 135299 135418 136481 164732 141903 154866 164676 130065 145779 183604 147168 144956 116917
16989A16917m2918L157j406R087l3369l8415j5407j0506J0299l1101m4438L3042
$$ 116917 73999 77156 75750 84837 51468 13053 -2354 -12860 -2561 -33662 -78100 -45058
16977d5058K0162J0000o1826K1968N3714l5641q011j5906l6635K8642p82o2691
$$ -45058 -24896 -14896 -76722 -54754 -1040 -36681 -44692 -60598 -97233 -68591 -69373 -132064
16965a32064j4554n299m7898O367j1418j0976j008M100Q8356k837k6086R049J057
$$ -132064 -146618 -151917 -199815 -193448 -204866 -215842 -216850 -212750 -124394 -127231 -153317 -144268 -143211
16952a43211k0338L404k1427o383J8590Q199J7385O7415J4840l2415K1997L6458
$$ -143211 -163549 -160145 -181572 -187955 -169365 -161166 -143781 -76366 -61526 -93941 -71944 -35486
16940c5486K5066R008K5566K9335M4583q536J1289P0885M1290m1517m6070k9508
$$ -35486 -10420 -1412 24154 53489 98072 89536 100825 171710 213000 171483 125413 95905
16928I5905j4305m7112J6444P3363j3912l0873j9218n4328n2581j5998J5220r550
$$ 95905 81600 34488 50932 124295 110383 79510 60292 5964 -46617 -62615 -47395 -56945
16916e6945k1097k8443m1603k6079L1602O2884J6813o133k2250k2689K6191K2466
$$ -56945 -78042 -106485 -148088 -174167 -142565 -79681 -62868 -69001 -91251 -113940 -87749 -65283
16904f5283J3362K6058n320j3581m4270K6653K9243l1145J5813L4609J5462M129
$$ -65283 -51921 -25863 -31183 -44764 -89034 -62381 -33138 -64283 -48470 -13861 1601 5730
16892E730P18L3579N5912L0839p546J455M902j9013L5844j4686J267L2995Q0791
$$ 5730 6448 40027 95939 126778 119232 120687 125589 106576 142420 127734 129001 161996 242787
16879B42787K1875j1618j4731j6870l9409O664O0221L0605k4992Q91J305m755
$$ 242787 264662 253044 238313 221443 182034 188698 248919 279524 254532 255423 256728 251973
16867B51973o051L9238M6035J7345k0018J2016j0987o8413q0476j2981j9252o370
$$ 251973 245922 285160 331195 348540 328522 340538 329551 261138 180662 167681 148429 142059
16855A42059j4671n3574j5002L985K0252J9355J5243p25l777n6328k279l671l7433
$$ 142059 127388 73814 58812 62797 83049 102404 117647 116922 113145 56817 54538 50867 13434
16842A3434j2384J5444l3814l1387j2983o7175l7410m0902L63L5179K478k3144
$$ 13434 1050 16494 -17320 -48707 -61690 -128865 -166275 -207177 -206814 -171635 -169157 -192301
16830a92301J9245m2481j3737M024M2513M5139j7790k3902m812n5113k8807j7375
$$ -192301 -173056 -215537 -229274 -225250 -182737 -137598 -155388 -179290 -184102 -239215 -268022 -285397
16818b85397j3689J341q835j6539L0142K5806N882L2800J6357J0795m0570j7510
$$ -285397 -299086 -297745 -306580 -323119 -292977 -267171 -261289 -228489 -212132 -201337 -241907 -259417
16806b59417J8681J9109j7783O54k2717k6844M4816L4675j426J374r856l2028
$$ -259417 -240736 -221627 -239410 -238756 -261473 -288317 -243501 -208826 -210252 -208878 -218734 -250762
16794b50762q706J6701J381m5054J4851J5189J1938R802J3797j3491j611m452
$$ -250762 -259468 -242767 -241386 -286440 -271589 -256400 -244462 -234660 -220863 -234354 -235965 -240417
16782b40417m9014N86j4951p823j6611n4683j743P3671K8288j4530k823j8293
$$ -240417 -289431 -288845 -303796 -311619 -328230 -382913 -384656 -310985 -282697 -297227 -300050 -318343
16770c18343k1300M2177Q1589o039o755J0546n2949k2843J9280K0447L1836j8898
$$ -318343 -339643 -297466 -215877 -221916 -228671 -218125 -271074 -293917 -274637 -254190 -222354 -241252
16758b41252m8136k3259r293j3347L2229P8456K9297N3657P794R695n7373p9560
$$ -241252 -289388 -312647 -321940 -335287 -303058 -224602 -195305 -141648 -133854 -124159 -181532 -261092
16746b61092J3781J540J8025n1501k7089O0302J6103k0289P686K953N052j5895
$$ -261092 -247311 -245771 -227746 -279247 -306336 -246034 -229931 -250220 -242534 -239581 -234529 -250424
16734b50424L7132O3417L0461k3825j2391l807l2495l634K1142k0009L2351J9679
$$ -250424 -213292 -149875 -119414 -143239 -155630 -159437 -191932 -195566 -174424 -194433 -162082 -142403
16722a42403K5839J6933L5638k4427l7925n6728j0201J6419Q16K7255q812j2757
$$ -142403 -116564 -99631 -63993 -88420 -126345 -183073 -193274 -176855 -176039 -148784 -157596 -170353
16710a70353k1369m946P615p598J522J2318j8531n006J3980j4295k3191K9518
$$ -170353 -191722 -196668 -189053 -196651 -195129 -182811 -201342 -206348 -192368 -206663 -229854 -200336
16698b00336M4423p869n9183n1465j581J5546N5536m1658n753M6202K2693M7185
$$ -200336 -155913 -163782 -222965 -274430 -276011 -260465 -204929 -246587 -252340 -206138 -183445 -136260
16686a36260r630l7807L8163Q0735M4163j8091o2004n7593P9083L2831K2914l108
$$ -136260 -145890 -183697 -145534 -64799 -20636 -38727 -100731 -158324 -79241 -46410 -23496 -26604
16674b6604N327k7453k3508J0978j7379q182m940l6009K7065J3236q589L522J5522
$$ -26604 -21277 -48730 -72238 -61260 -78639 -86821 -91761 -127770 -100705 -87469 -96058 -92536 -77014
16661g7014M7388N2009k7518k6616k5171p199j5116o851J5171J170r271r610j1530
$$ -77014 -29626 22383 -5135 -31751 -56922 -64121 -79237 -86088 -70917 -69747 -79018 -88628 -100158
16648a00158m219k7593K6546J1088j3025m2608j0922L1493m751k0020l2422k9144
$$ -100158 -104377 -131970 -105424 -94336 -107361 -149969 -160891 -129398 -134149 -154169 -186591 -215735
16636b15735L0455l3223K1415J8909N4777o222K0184P4607M6836O367N264L800
$$ -215735 -185280 -218503 -197088 -178179 -123402 -129624 -109440 -34833 12003 18370 23634 27434
16624B7434N342j9515j2515J2918j1302n7289J0467M3223L852q030N836m5461
$$ 27434 32776 13261 746 13664 2362 -54927 -44460 -1237 2615 -5415 421 -45040
16612d5040n138K3494k0821M309K6999J3305l2078M984j1246J6671j3367k9211
$$ -45040 -50178 -26684 -47505 -43196 -16197 -2892 -34970 -29986 -41232 -24561 -37928 -67139
16600f7139j2794J213k9278n1413k131K2883k367J4626P956k18K6209j9376K7715
$$ -67139 -79933 -78720 -107998 -159411 -161542 -138659 -141026 -126400 -118444 -118662 -92453 -111829 -84114
16587h4114N680J1835k0095n6085Q770j4764J6939L821l7910M7182L2116o628
$$ -84114 -78434 -66599 -86694 -142779 -134009 -148773 -131834 -128013 -165923 -118741 -86625 -93253
16575i3253O209o8839l5989K8246k3115j587q280K095M6479R225j1990l9759p130
$$ -93253 -87044 -155883 -191872 -163626 -186741 -188328 -196608 -194513 -148034 -138809 -150799 -190558 -197688
16562a97688k1419l5178l8689R021O6706J4814o472J5856K3639k1609P959k5424
$$ -197688 -219107 -254285 -292974 -283953 -217247 -202433 -208905 -193049 -169410 -191019 -183060 -208484
16550b08484N8414K7395q389j5501l4005m0136j3569k6233m540J7686j3046l9589
$$ -208484 -150070 -122675 -131064 -146565 -180570 -220706 -234275 -260508 -265048 -247362 -260408 -299997
16538b99997L7334K5972J8465K5161P0633L982J6873L2419K499l9008m0779k1129
$$ -299997 -262663 -236691 -218226 -193065 -122432 -118450 -101577 -69158 -66659 -105667 -146446 -167575
16526a67575j4561J5183j8748L445j7967l5724J3403J5526M2856J8897m4558k2286
$$ -167575 -182136 -166953 -185701 -182256 -200223 -235947 -222544 -207018 -164162 -145265 -189823 -212109
16514b12109j2854L4758M2259r718l1351l1659l0571L8379K1867K9046l0151l6734
$$ -212109 -224963 -190205 -147946 -157664 -189015 -220674 -251245 -212866 -190999 -161953 -192104 -228838
16502b28838j4744L1042L0020q17k4797J3332N1717j5215K3268j7699o4540J0185
$$ -228838 -243582 -212540 -182520 -183337 -208134 -194802 -143085 -158300 -135032 -152731 -217271 -207086
16490b07086K0565K1066m069l6034K1966M8054K8143j1817j253R90l728p923j4326
$$ -207086 -186521 -165455 -169524 -205558 -183592 -135538 -107395 -119212 -120465 -119475 -123203 -131126 -145452
16477a45452j0361j0212J153k4045k1114K640p714P5186K8410l0239l2575k2516
$$ -145452 -155813 -166025 -164872 -188917 -210031 -207391 -215105 -139919 -111509 -141748 -174323 -196839
16465a96839J2227L84M4180J577K392J6729K2525n8607o233K6154j3628J4702
$$ -196839 -184612 -184228 -140048 -138471 -136079 -119350 -96825 -155432 -161665 -135511 -149139 -134437
16453a34437j9521K2516J9949l088l243k543l1162l2430r890L2477J2433l3321
$$ -134437 -153958 -131442 -111493 -114581 -117824 -120367 -151529 -183959 -193849 -161372 -148939 -182260
16441a82260K4862J3729k030J0750L7427O225r310k3929J3636K8647K9297m90
$$ -182260 -157398 -143669 -145699 -134949 -97522 -91297 -100607 -124536 -110900 -82253 -52956 -53446
16429e3446m4858l3360L1435k8559l2873j5491j339k3181K2345J9126M778l107
$$ -53446 -98304 -131664 -100229 -128788 -161661 -177152 -178491 -201672 -179327 -160201 -155423 -158530
16417a58530K71J8701l170j2634j2m7145K944K5287j8040K5513n147K7370J5450
$$ -158530 -158259 -139558 -142728 -155362 -155374 -202519 -199575 -174288 -192328 -166815 -171962 -144592 -129142
16404a29142k0686j4455j2286j578K3053K6640n420l702j6369p275L9035m565
$$ -129142 -149828 -164283 -176569 -178147 -155094 -128454 -133874 -137576 -153945 -161220 -122185 -126750
16392a26750n7322o762J0394R73o550j3213m1041K6968N5246m4471k8275M5131
$$ -126750 -184072 -190834 -180440 -179467 -186017 -199230 -240271 -213303 -158057 -202528 -230803 -185672
16380a85672L1808o697J5467K6970m875M021J4767m3291m5758l9518K8285J4098
$$ -185672 -153864 -160561 -145094 -118124 -122999 -118978 -104211 -147502 -193260 -232778 -204493 -190395
16368a90395n747L1636R730K2848M544J0250J623k9082j8200j6439J157P817L2965
$$ -190395 -196142 -164506 -154776 -131928 -127384 -117134 -115511 -144593 -162793 -179232 -178075 -170258 -137293
16355a37293m4620m3523P845J4269M1981N553L0666k1148j5325K691L1169l9214
$$ -137293 -181913 -225436 -217591 -203322 -161341 -155788 -125122 -146270 -161595 -158904 -127735 -166949
16343a66949J11J2807o622j7992j3553L1129M271j4495J5047K6741o316k2295
$$ -166949 -166838 -154031 -160653 -178645 -192198 -161069 -156798 -171293 -156246 -129505 -135821 -158116
16331a58116k615L1142k456m577k1268Q388J927l4701l0260k010j982M7645M5028
$$ -158116 -160731 -129589 -132045 -136622 -157890 -149502 -147575 -182276 -212536 -214546 -216528 -168883 -123855
16318a23855K6740k4265j0279l1452l817Q3212M6201j3479n0324l643Q43n1531
$$ -123855 -97115 -121380 -131659 -163111 -166928 -83716 -37515 -50994 -101318 -104961 -104118 -155649
16306a55649K0985J4003n3121k6360j8062N428j0728J0769k1149Q78L7204M0098
$$ -155649 -134664 -120661 -173782 -200142 -218204 -212776 -223504 -212735 -233884 -233006 -195802 -155704
16294a55704N473j7707L4846L068l5612L0769m795n4999J2323Q1010M6463j6199
$$ -155704 -150231 -167938 -133092 -130024 -165636 -134867 -139662 -194661 -182338 -101328 -54865 -71064
16282g1064l1126k1329L531J558o1660j639N6018K8722j953j2685J6625J7231
$$ -71064 -102190 -123519 -119988 -118430 -180090 -181729 -125711 -96989 -98942 -111627 -95002 -77771
16270g7771n5297m9841j235j1352K0030O4807K1158q026m815L1469k9296p2224
$$ -77771 -133068 -182909 -184144 -195496 -175466 -110659 -89501 -97527 -102342 -70873 -100169 -172393
16258a72393K3535J5965j1804J6324J4593j1251J6567p1454Q660j3165j932J5930
$$ -172393 -148858 -132893 -144697 -128373 -113780 -125031 -108464 -179918 -171258 -184423 -186355 -170425
16246a70425k6639r451M7038N7833J5030l2976n4788n0810K5319L1251L7680O6407
$$ -170425 -197064 -206515 -159477 -101644 -86614 -119590 -174378 -225188 -199869 -168618 -130938 -64531
16234f4531L3760k2730k9834k8017N499k630k2806k2033l041R290K1360p333J6489
$$ -64531 -30771 -53501 -83335 -111352 -105853 -108483 -131289 -153322 -156363 -147073 -125713 -133046 -116557
16221a16557j3584j341j9781j4636J4224J2054J9075K1955j9431J1102o6268K887
$$ -116557 -130141 -131482 -151263 -165899 -151675 -139621 -120546 -98591 -118022 -106920 -173188 -170301
16209a70301K1082L7787l095j9792k5680l0762L924L7006N4957O99m587q572J6573
$$ -170301 -149219 -111432 -114527 -134319 -159999 -190761 -186837 -149831 -94874 -94175 -98762 -107334 -90761
16196i0761k8124j3905K9416L7491l9698k0478p693M3226N3175l2839O667j4870
$$ -90761 -118885 -132790 -103374 -65883 -105581 -126059 -133752 -90526 -37351 -70190 -63523 -78393
16184g8393K630l9651j1495j6328j6416L1648K3755J6914K1549k292k3901p2251
$$ -78393 -75763 -115414 -126909 -143237 -159653 -128005 -104250 -87336 -65787 -68079 -91980 -164231
16172a64231K3873j1054J3782l3519L1108M1881J1784j1350k6979k381l1491L3406
$$ -164231 -140358 -151412 -137630 -171149 -140041 -98160 -86376 -97726 -124705 -127086 -158577 -125171
16160a25171J0895o658M919j6329l115m0270K817J9011K2107j8455L3721k6206
$$ -125171 -114276 -120934 -116015 -132344 -135459 -175729 -172912 -153901 -131794 -150249 -116528 -142734
16148a42734j5883O752l8084O319k7154n0314J065L1423K3842R8376R048j9255
$$ -142734 -158617 -151865 -189949 -183630 -210784 -261098 -260033 -228610 -204768 -106392 -97344 -116599
16136a16599N08J4371O1063j5587m7111m3144j7953J1368J508J4785J1527K7112
$$ -116599 -116091 -101720 -40657 -56244 -103355 -146499 -164452 -153084 -151576 -136791 -125264 -98152
16124i8152j6639m3498q373K5127K772O8100j7957k7466O180j1651L5187K7918
$$ -98152 -114791 -158289 -166662 -141535 -138763 -70663 -88620 -116086 -109906 -121557 -86370 -58452
16112e8452l6935o5094n210K5210j9677k1342O8015L3562N3320j607l4383k917
$$ -58452 -95387 -160481 -165691 -140481 -160158 -181500 -113485 -79923 -26603 -28210 -62593 -65510
16100f5510N8255j4769n5991N54n2715o4496J3637M5165N3111j343j9454L0983
$$ -65510 -7255 -22024 -78015 -77461 -130176 -194672 -181035 -135870 -82759 -84102 -103556 -72573
16088g2573j0756j6440m9295j0633L4376J881j2955K5439k0589J3634k9988o95
$$ -72573 -83329 -99769 -149064 -159697 -125321 -123440 -136395 -110956 -131545 -117911 -147899 -148594
16076a48594L3562J5196n833P2343J9904n0471j8622j6221L7717K2555n4901j0756
$$ -148594 -115032 -99836 -105669 -33326 -13422 -63893 -82515 -98736 -61019 -38464 -93365 -104121
16064a04121Q811n568l952n7414l4008q771o743l228Q047M0858J137K003P8214
$$ -104121 -95310 -100878 -104830 -162244 -196252 -205023 -211766 -214994 -206947 -166089 -164952 -162949 -84735
16051h4735O5376m8826p9686J4010M6450j2981k8953Q455q352j0471J9327K7778
$$ -84735 -19359 -68185 -147871 -133861 -87411 -100392 -129345 -120890 -129242 -139713 -120386 -92608
16039i2608k4000j2997l4479Q570K9079J3033j2203k7919j6986L5878j0859l6424
$$ -92608 -116608 -129605 -164084 -155514 -126435 -113402 -125605 -153524 -170510 -134632 -145491 -181915
16027a81915Q0901J3883m1725l1701O6J4941L534J2136K6393J4391L8811M3121
$$ -181915 -101014 -87131 -128856 -160557 -160491 -145550 -142016 -129880 -103487 -89096 -50285 -7164
16015g164j3432q0732o2746R745o072O3100J9961k5342l2508k6242o3644M766
$$ -7164 -20596 -101328 -164074 -154329 -160401 -97301 -77340 -102682 -135190 -161432 -225076 -220310
16003b20310Q3294Q0448N0633R843l608o4416l3838J6208K1481J4346O8j244j9557
$$ -220310 -137016 -56568 -5935 3908 300 -64116 -97954 -81746 -60265 -45919 -45851 -47095 -66652
15990f6652j3012k1754N073M9880L430m4699n562q903j7289M2663M2078j8222
$$ -66652 -79664 -101418 -96345 -46465 -43035 -87734 -93296 -102199 -119488 -76825 -34747 -52969
15978e2969J7914K9684R827l0071j0703J4298k7285k7000l1389m1550k6808K0186
$$ -52969 -35055 -5371 4456 -25615 -36318 -22020 -49305 -76305 -107694 -149244 -176052 -155866
15966a55866M5857L1972j1260N748K8855o4496j0260R4766M8129j406n4313j6290
$$ -155866 -110009 -78037 -89297 -83549 -54694 -119190 -129450 -34684 13445 12039 -42274 -58564
15954e8564k6418m4012K4248N6571k4567k7816O222J1550l4990k2108J3327J2552
$$ -58564 -84982 -128994 -104746 -48175 -72742 -100558 -94336 -82786 -117776 -139884 -126557 -114005
15942a14005O283K8781L9925K3344l5495l701k274k6442J33O1530L724n9029K992
$$ -114005 -107722 -78941 -39016 -15672 -51167 -54868 -57142 -83584 -83451 -21921 -18197 -77226 -74234
15929g4234j3561j7658P0653o182j1077K9882r447J6131l4575k1952j574J5776
$$ -74234 -87795 -105453 -34800 -40982 -52059 -22177 -31624 -15493 -50068 -72020 -73594 -57818
15917e7818K6910J1136m0075k530M4115M3533l910l7013l3073l4231k804k4580
$$ -57818 -30908 -19772 -59847 -62377 -18262 25271 21361 -15652 -48725 -82956 -85760 -110340
15905a10340J1934O5903j4083l922j4046l708m8645M2385N4249m846J4918O898
$$ -110340 -98406 -32503 -46586 -50508 -64554 -68262 -116907 -74522 -20273 -25119 -10201 -3303
15893c303l8822o268n054N1353m7128o8776n5938l542O7602O5724R947l6745p563
$$ -3303 -42125 -48393 -53447 -2094 -49222 -117998 -173936 -177478 -109876 -44152 -34205 -70950 -78513
15880g8513J3855n2974l9711L1947L9400K0518r034k7294L5828J6843o2281R121
$$ -78513 -64658 -117632 -157343 -125396 -85996 -65478 -74512 -101806 -65978 -49135 -111416 -102295
15868a02295M8149J1313O532k6775l7369q67j0859j0193J1953J9506l6273M0301
$$ -102295 -54146 -42833 -36301 -63076 -100445 -101312 -112171 -122364 -110411 -90905 -127178 -86877
15856h6877L2071j699m5076K6924L828k6028J2455n9093J652L926J421J2390k2781
$$ -86877 -54806 -56505 -101581 -74657 -70829 -96857 -84402 -143495 -141843 -137917 -136496 -124106 -146887
15843a46887j3437l480L4089K0044K2691Q594j2417j9204L6144l5003m5435l175
$$ -146887 -160324 -163804 -129715 -109671 -86980 -78386 -90803 -110007 -73863 -108866 -154301 -157476
15831a57476P964J6J7820J8805N2184J6765o9017l9809M096L6056K065l4497k4709
$$ -157476 -149512 -149496 -131676 -112871 -60687 -43922 -112939 -152748 -148652 -112596 -110531 -145028 -169737
15818a69737J7507O6427O687J5592l395k2726N67o528M6657J4664L3585j7927
$$ -169737 -152230 -85803 -79116 -63524 -66919 -89645 -89078 -95606 -48949 -34285 -700 -18627
15806a8627m113j743m3579o868k8893O892Q069m0013M2303M6850O684R73m159
$$ -18627 -22740 -24483 -68062 -74930 -103823 -96931 -88862 -128875 -86572 -39722 -33038 -32065 -36224
15793c6224K7418n6823l9840n2279p862O1636P2499J3832k0866m8410M075K650
$$ -36224 -8806 -65629 -105469 -157748 -165610 -103974 -31475 -17643 -38509 -86919 -82844 -80194
15781h0194J3415k9349j2191J8941J3420J0620L8103K4578k9910K192k5414l6357
$$ -80194 -66779 -96128 -108319 -89378 -75958 -65338 -27235 -2657 -32567 -30375 -55789 -92146
15769i2146j4162M2315l5075m1521Q120J405P3354L0315j9414R721p906m6488
$$ -92146 -106308 -63993 -99068 -140589 -132469 -131064 -57710 -27395 -46809 -37088 -44994 -91482
15757i1482n5525j962J9797J8533M5445P5917N897q717n0623O60r19K7576l9661
$$ -91482 -147007 -148969 -129172 -110639 -65194 10723 16620 7903 -42720 -42060 -42979 -15403 -55064
15744e5064k1901k8719l284K1380K2609L0948J4850m6164k3073K0362k4536K1425
$$ -55064 -76965 -105684 -108968 -87588 -64979 -34031 -19181 -65345 -88418 -68056 -92592 -71167
15732g1167Q360j0803k3683n901k9557K885L4899P8574N0499k7592l7079j2923
$$ -71167 -62807 -73610 -97293 -103194 -132751 -129866 -94967 -16393 34106 6514 -30565 -43488
15720d3488J0843r896L5970K8583o704j358K5022l0122k0257k03N7964j7155k8208
$$ -43488 -32645 -42541 -6571 22012 15308 13950 38972 8850 -11407 -11610 46354 29199 991
15707I91r53J022K380q396m5078j9587k654J2351N6256L0779j4267n3602m1080
$$ 991 38 1060 3440 -4956 -50034 -69621 -72275 -59924 -3668 27111 12844 -40758 -81838
15694h1838K704M4656M6208p879k7685J0854J2407L0923j4214k4285k3333k3325
$$ -81838 -79134 -34478 11730 3851 -23834 -12980 -573 30350 16136 -8149 -31482 -54807
15682e4807n7503M2102L6945L1389j7227l0554J205l0719Q438j9931M4985Q2324
$$ -54807 -112310 -70208 -33263 -1874 -19101 -49655 -48450 -79169 -70731 -90662 -45677 36647
15670C6647K7515j3587o4373m4171j4502k2788J8403L7353O3347o669L814L1641
$$ 36647 64162 50575 -13798 -57969 -72471 -95259 -76856 -39503 23844 17175 20989 52630
15658E2630K7412m3376j8877k8247m6732l4023l2308j0995M7973o698J9150K3191
$$ 52630 80042 36666 17789 -10458 -57190 -91213 -123521 -134516 -86543 -93241 -74091 -50900
15646e0900K4737K282m4021o969K9883L1620q416J069L0022j2436n2638L0363
$$ -50900 -26163 -23881 -67902 -74871 -44988 -13368 -21784 -20715 9307 -3129 -55767 -25404
15634b5404o358l1213j4100r342P904k3454K2901O9394K9191q884K2068j5715
$$ -25404 -31762 -62975 -77075 -86417 -78513 -101967 -79066 -9672 19519 10635 32703 16988
15622A6988L939L0347j8559J637j8674j6590j2330J0335R539K9450Q539k4n5939
$$ 16988 20927 51274 32715 34352 15678 -912 -13242 -2907 6632 36082 44621 44597 -11342
15609a1342n8834k272J1927Q718N0601M1867j9207j5808L8279k4778K6444m1313
$$ -11342 -70176 -72448 -60521 -51803 -1202 40665 21458 5650 43929 19151 45595 4282
15597D282o3953J7256K9211J1373j426l670k3647K4568J0083k0067Q21k0027j7512
$$ 4282 -59671 -42415 -13204 -1831 -3257 -6927 -30574 -6006 4077 -15990 -15169 -35196 -52708
15584e2708L0221J1259k5325m864K790L2319P5052j8917o1314k1047K6855L5599
$$ -52708 -22487 -11228 -36553 -41417 -38627 -6308 68744 49827 -11487 -32534 -5679 29920
15572B9920q645M651J3449j7486j3239J7277Q197m7774k1068M561j9843N8417
$$ 29920 21275 25926 39375 21889 8650 25927 34124 -13650 -34718 -30157 -50000 8417
15560H417L5804O897m8070J25K3269n250m726R203n4095p850q44L8975J1329n776
$$ 8417 44221 51118 3048 3173 26442 21192 16466 25669 -28426 -36276 -37120 1855 13184 7408
15546G408O619j4016M935M057K586M3365N1059n624j6437k2238l5392j7832j7463
$$ 7408 14027 11 4946 9003 11589 54954 106013 100389 83952 61714 26322 8490 -8973
15533h973k5937M6979o489l0554J6227P2570k7046k8788o3957n5489N6263L8089
$$ -8973 -34910 12069 5580 -24974 -8747 63823 36777 7989 -55968 -111457 -55194 -17105
15521a7105k5339k1251P6521J2563k3273J565O226m722N512Q806J787J0356M0372
$$ -17105 -42444 -63695 12826 25389 2116 3681 9907 5185 10697 19503 21290 31646 72018
15508G2018K7730m4137Q930j3639k6753k3985l2691k4481J6797L6192K0229j6574
$$ 72018 99748 55611 64541 50902 24149 164 -32527 -57008 -40211 -4019 16210 -364
15496c64l4869L4088P632j7482n1320k465K9841L0542Q418n261m869R668Q879
$$ -364 -35233 -1145 6487 -10995 -62315 -64780 -34939 -4397 4021 -1240 -6109 3559 12438
15483A2438J9945Q574j4217m479k4267l4427M732j7635K250N0128N7488J5280
$$ 12438 32383 40957 26740 22261 -2006 -36433 -31701 -49336 -47086 3042 60530 75810
15471G5810j6033R591k0810l0851p4296k3308J3730P5783N4093M8232j0463l984
$$ 75810 59777 69368 48558 17707 -56589 -79897 -66167 9616 63709 111941 101478 97494
15459I7494j9597m4110J828K7725q5065m4607q713J3218P3183M0187n9860J8555
$$ 97494 77897 33787 35615 63340 -21725 -66332 -75045 -61827 11356 51543 -8317 10238
15447A0238L6270N230N840p1547j0595K9110k6297l332N7263L9627k9905L3025
$$ 10238 46508 51738 57578 -13969 -24564 4546 -21751 -25083 32180 71807 41902 74927
15435G4927L2587l1115n0821l9664M2492P814j7799J3386K58k4110j3134K2638
$$ 74927 107514 76399 25578 -14086 28406 36220 18421 31807 32065 7955 -5179 17459
15423A7459Q7011k7157k8143k7339L7996L101k7241o277j2263L921K5232j182
$$ 17459 104470 77313 49170 21831 59827 62928 35687 29410 17147 21068 46300 45118
15411D5118P254K9180k8084l1428J0737K7441j762l6687n1816j3779J1269O3534
$$ 45118 52372 81552 53468 22040 32777 60218 58456 21769 -30047 -43826 -32557 30977
15399C0977j5040K9451M2269M8063K9951j9830J370j7990m7951n8079J925K4715
$$ 30977 15937 45388 87657 135720 165671 145841 147211 129221 81270 23191 25116 49831
15387D9831N7039k1683k5265k7979j2337j715J6690L7354L3309j3501j1543K3020
$$ 49831 106870 85187 59922 31943 19606 17891 34581 71935 105244 91743 80200 103220
15375A03220k9792P478L0136J2301k5647k916K852j7321l701j2194n95j1955k6933
$$ 103220 73428 80906 111042 123343 97696 94780 97632 80311 76610 64416 63821 51866 24933
15362B4933j692M713J5841L894O659j0361o904m4777P62Q3952L0221r656l9944
$$ 24933 23241 27954 43795 47689 54348 43987 37083 -7694 -6932 77020 107241 97585 57641
15349E7641m6076k3919j2137r988L4464M4105J4513m438L935R034m1910l6228
$$ 57641 11565 -12354 -24491 -34479 -15 44090 58603 54165 58100 67134 25224 -11004
15337a1004n3134M6728N2744K8803j8979l4374J4219j0365l38L7679J8025k5600
$$ -11004 -64138 -17410 35334 64137 45158 10784 25003 14638 14300 51979 70004 44404
15325D4404k2091l0644J8503J0089q971N0236N1866N1310J6976k0560n0485j4468
$$ 44404 22313 -8331 10172 20261 11290 61526 113392 164702 181678 161118 110633 96165
15313I6165m6408r639K369Q8336J4088n3376k2453K1854n6957j1623N5706j9360
$$ 96165 49757 40118 42487 130823 144911 91535 69082 90936 33979 22356 78062 58702
15301E8702k3126L7953L8566Q920m4185j9217l1170n404k5099P678O3866L1809
$$ 58702 35576 73529 112095 121015 76830 57613 26443 21039 -4060 3618 67484 99293
15289I9293K420M285k2177k9866l7207m9276L9650L6514l889J4362l221L330K7126
$$ 99293 101713 105998 83821 53955 16748 -32528 7122 43636 39747 54109 50888 54218 81344
15276H1344J1226r30n0478p19M273j7310L9120J7269o978Q066O982J3008L5314
$$ 81344 92570 91640 41162 40443 44716 27406 66526 83795 76817 84883 91865 104873 140187
15263A40187J4304k8798m7045l1663j0045j7505J6779J5268M363K2075j8698O847
$$ 140187 154491 125693 78648 46985 36940 19435 36214 51482 55845 77920 59222 66069
15251F6069N4572K0782l2686J7568O171l476j2323m0571N5036M848m9136k0309
$$ 66069 120641 141423 108737 126305 132476 129000 116677 76106 131142 135990 86854 66545
15239F6545j763J7255K7294J1199j2419o464k3601K261J3715k6743l6541O60K0110
$$ 66545 64782 82037 109331 120530 108111 101647 78046 80307 94022 67279 30738 31398 51508
15226E1508R152R594l004q49j9542K050R050P242J4497l0837J5651J3917j2378
$$ 51508 60660 70254 67250 66401 46859 48909 57959 65201 79698 48861 64512 78429 66051
15213F6051J0704k4197K6645O250j8402m190j8437j546P296k7403J3200P2850
$$ 66051 76755 52558 79203 85453 67051 62861 44424 42878 50174 22771 35971 108821
15201A08821K2874J5602j172l1642l7355j933L9880L3096K5492L0849j1833p399
$$ 108821 131695 147297 146125 114483 77128 75195 115075 148171 173663 204512 192679 185280
15189A85280M7779k6420r2210n085M4811J628L2796m0350k0542L5296k711o4432
$$ 185280 233059 206639 114429 109344 154155 155783 188579 148229 127687 162983 160272 95840
15177I5840j1483j628O561K4959K2605j4698O431K0738k8962m3081L4697k2299
$$ 95840 84357 82729 89290 114249 136854 122156 128587 149325 120363 77282 111979 89680
15165H9680J1862O4176J9324p326l1196K1900j2588Q921n710k192Q162r900n273
$$ 89680 101542 165718 185042 177716 146520 168420 155832 164753 159043 156851 165013 155113 149840
15152A49840k2594j8809l8467k8839R654j4688M3536K2424K8033q340K6187j7614
$$ 149840 127246 108437 69970 41131 50785 36097 79633 102057 130090 121750 147937 130323
15140A30323j0770M0147L8615k8981j8849M932q91L4916o071m4l4868k8267J9247
$$ 130323 119553 159700 198315 169334 150485 155417 154526 189442 183371 183327 148459 120192 139439
15127A39439M1653k3220q64N930K9961q649J221k1624L8019O621k3976m2492n070
$$ 139439 181092 157872 157008 162938 192899 184250 185471 163847 201866 208487 184511 142019 136949
15114A36949j7063l4910n0827J8387M7480J2878o322O031J9188k0519j167J1996
$$ 136949 119886 84976 34149 52536 100016 112894 106572 112603 131791 111272 110105 122101
15102A22101N6808M4251j6751j0705K438J6708j7527J6373L3179j1458o3647k7409
$$ 122101 178909 223160 206409 195704 198142 214850 197323 213696 246875 235417 171770 144361
15090A44361j8175L8996M8551k3520p5576j5179N7447L2604K9656q653r850P476
$$ 144361 126186 165182 213733 190213 114637 99458 156905 189509 219165 210512 200662 208138
15078B08138n3424Q005P631L50J5608L5380L6146j9032J4861n0308l7785j7718
$$ 208138 154714 162719 170350 170700 186308 221688 257834 238802 253663 203355 165570 147852
15066A47852j681M176P341L412J2043J5043N458l0189J6775O0161N0334l6643
$$ 147852 146171 150347 157688 161100 173143 188186 193644 163455 180230 240391 290725 254082
15054B54082k2918L2877j3407j9444K617q935L7657j596o620j9871j7660K6459
$$ 254082 231164 264041 250634 231190 233807 224872 262529 260933 254313 234442 216782 243241
15042B43241K1917J2459o3287j9798j861l7370K7858q600K7356M394n4630l5517
$$ 243241 265158 277617 214330 194532 192671 155301 183159 174559 201915 206309 151679 116162
15030A16162O8214K0936l5495j6434N5021M1172m1719j2910m051K532K3325L7105
$$ 116162 184376 205312 169817 153383 208404 249576 207857 194947 190896 193428 216753 253858
15018B53858l6988m2411J9301J42K8206J2043k917k2704L3865L1813j680J2797
$$ 253858 216870 174459 193760 193902 222108 234151 231234 208530 242395 274208 272528 285325
15006B85325J550m438j1560K8995N553M6781l7114p0620K4269P6694L493j139
$$ 285325 286875 282437 270877 299872 305425 352206 315092 244472 268741 345435 348928 347789
14994C47789J7588j1227n859N4397K4362K0062j7685J5503N7382O0983P6273O4230
$$ 347789 365377 354150 348291 402688 427050 447112 429427 444930 502312 563295 639568 703798
14982G03798J21275J26896J03329J27125J76391J51357J81720J25982J22193P0228
$$ 703798 825073 951969 1055298 1182423 1358814 1510171 1691891 1817873 1940066 2010294
14972B010294k9646q5197j43479j76641j69519j96958k17402j17920p1253m2542
$$ 2010294 1980648 1895451 1751972 1575331 1405812 1208854 991452 873532 802279 759737
14962G59737q7142n7919q9415m4335K1429l160m6189k7476M2634P278Q616p908
$$ 759737 672595 614676 525261 480926 502355 499195 453006 425530 468164 475442 484058 476150
14950D76150n4808j6492r865k931k5040L5572K4812l1970j2127M656K844M091
$$ 476150 421342 404850 394985 392054 367014 402586 427398 395428 383301 387957 390801 394892
14938C94892N2014q980O880j1892n167L6093L2233l9848l6302O857k3142l5415
$$ 394892 446906 437926 444806 432914 427747 463840 496073 456225 419923 426780 403638 368223
14926C68223k3278K5033K5862q180q0514m309N1677j8586m6124L2463L6824k247
$$ 368223 344945 369978 395840 387660 307146 302837 354514 335928 289804 322267 359091 356844
14914C56844l512m1263Q890J7618O849r716j3049K3643J5663j5253m0936k951
$$ 356844 353332 312069 320959 338577 345426 335710 322661 346304 361967 346714 305778 302827
14902C02827K1699M1893k6496j2434k7729P89L0903l538K3781j2704q356M3703
$$ 302827 324526 366419 339923 327489 299760 300549 331452 327914 351695 338991 330635 374338
14890C74338J1500J360L4308K129M0952j1131J1115m4271k516l0410l646N305
$$ 374338 385838 387198 421506 423635 464587 453456 464571 420300 417784 387374 383728 389033
14878C89033R018o400j1686P298j8136m1230j0908L8607m4653J6229J6343J2464
$$ 389033 398051 391651 379965 387263 369127 327897 316989 355596 310943 327172 343515 355979
14866C55979j3616k9093O264J0214M5466O3266n10l6434J7330J5997K7541L9922
$$ 355979 342363 313270 319534 329748 375214 438480 437970 401536 418866 434863 462404 502326
14854E02326m749K1089P808p438l4735o8732m9968j9185J0951K6019p526j4531
$$ 502326 497577 518666 526474 519036 484301 415569 365601 346416 357367 383386 375860 361329
14842C61329O805N79j7850R036n6772J6080K6943O0k8279M0058L8373R822L5366
$$ 361329 368134 368713 350863 359899 303127 319207 346150 346210 317931 357989 396362 406184 441550
14829D41550j3459K009K2309j292K4390L6700M1019K6450k7123k0086K2866L3736
$$ 441550 428091 430100 452409 451117 475507 512207 553226 579676 552553 532467 555333 589069
14817E89069J5302j1313o836l7293l8355Q879k2813j8389J7848J9742n2674p2470
$$ 589069 604371 593058 586222 548929 510574 519453 496640 478251 496099 515841 463167 390697
14805C90697q200L3329N0218N7668O2532J7673J3701p756L3572N811m712j0518
$$ 390697 382497 415826 466044 523712 586244 603917 617618 609862 643434 649245 644533 634015
14793F34015m5728j9738L3020K8593K8364k0235J0009k1274j6492J3075j1095
$$ 634015 588287 568549 601569 630162 658526 638291 648300 627026 610534 623609 612514
14782F12514K6799N0717N6356O1317K0220m626l0108l379P1454J9885l9219O00
$$ 612514 639313 690030 746386 807703 827923 823297 793189 789810 861264 881149 841930 842530
14770H42530K6570k8907m5755k7937l629J7502J5053J0508j2538l3797p832n9022
$$ 842530 869100 840193 794438 766501 762872 780374 795427 805935 793397 759600 751768 692746
14758F92746m80K1252K3073K9223m405l3137q7734k1486J0156L465L2005J7875
$$ 692746 692266 713518 736591 765814 761409 728272 640538 619052 629208 632673 664678 682553
14746F82553j5535L1276K3398l1995m3509M3437J3436K150n770o70K3759M5087
$$ 682553 667018 698294 721692 689697 646188 689625 703061 705211 699441 698771 722530 767617
14734G67617L4508l7960l9734L925j3007j137J2773L6047l3375m5292N884k3073
$$ 767617 802125 764165 724431 728356 715349 714212 726985 763032 729657 684365 690249 667176
14722F67176m5316L4211L953n1338o813L6279K1632O4070N6657l949l0701N3460
$$ 667176 621860 656071 660024 608686 601873 638152 659784 723854 780511 776562 745861 799321
14710G99321j4426q649r766P8863N5192M0206l0485q320j2203J216q056q977k235
$$ 799321 784895 776246 766480 845343 900535 940741 910256 901936 889733 890949 882893 873916 871681
14697H71681N9658K8236j380j8660Q374N0905M1453L5297m8480m6659M0150k2485
$$ 871681 931339 959575 958195 939535 947909 998814 1040267 1075564 1027084 980425 1020575 998090
14685I98090k1526l00m2316k067L0363P0299M6089J8281l6980J5832j3094N8243
$$ 998090 976564 976264 933948 931881 962244 1032543 1078632 1096913 1059933 1075765 1062671 1120914
14673A120914N0076p968n3519j4901L1181l513J2617J4359L7357l8078l9671Q0500
$$ 1120914 1170990 1163022 1109503 1094602 1125783 1122270 1134887 1149246 1186603 1148525 1108854 1189354
14661A189354L9100j6431l6949j3013k6097N764L1118O9047O9284P5259N4318
$$ 1189354 1228454 1212023 1175074 1162061 1135964 1141728 1172846 1241893 1311177 1386436 1440754
14650A440754O3955Q1995N6947N5192P732N3391L4143K3712n3684m5137O4260
$$ 1440754 1504709 1586704 1643651 1698843 1706575 1759966 1794109 1817821 1764137 1719000 1783260
14639A783260n231j9901p885L6740L1364k8911k5639K114P612l102j2282L5410
$$ 1783260 1778029 1758128 1750243 1786983 1818347 1789436 1763797 1765911 1773523 1770421 1758139 1793549
14627A793549L6516q498j8679M6824J0121L806N8071L1949l510K9799Q0357J9227
$$ 1793549 1830065 1821567 1802888 1849712 1859833 1863639 1921710 1953659 1950149 1979948 2060305 2079532
14615B079532j3555J7035L6712P2695m398j0172O5481K4235K795L6062L3658M4202
$$ 2079532 2065977 2083012 2119724 2192419 2188021 2177849 2243330 2267565 2270360 2306422 2340080 2384282
14603B384282L7821j5227M0130m040M8327K3215j3727J5643r364l089Q6373O6932
$$ 2384282 2422103 2406876 2447006 2442966 2491293 2514508 2500781 2516424 2507060 2503971 2590344 2657276
14591B657276R518L6715M5877R941L2100Q2920L5887M5679O5979Q6419O1280P3304
$$ 2657276 2666794 2703509 2749386 2759327 2791427 2874347 2910234 2955913 3021892 3108311 3169591 3242895
14579C242895Q8474J00522J22396P9885J08080J22472R9053P0015N3446R3304
$$ 3242895 3331369 3431891 3554287 3634172 3742252 3864724 3963777 4033792 4087238 4180542
14569D180542J02102J68722J27696J79439R8890R8889J66694J83086J80234K26248
$$ 4180542 4282644 4451366 4579062 4758501 4857391 4956280 5122974 5306060 5486294 5712542
14559E712542K14342K16339K49267J85483K01947K84039L34049L02628L59628
$$ 5712542 5926884 6143223 6392490 6577973 6779920 7063959 7398008 7700636 8060264
14550H060264M04132M19542N14243N70154P27513Q67982J046402J257005J492408
$$ 8060264 8464396 8883938 9398181 9968335 10695848 11563830 12610232 13867237 15359645
14541A5359645J811249K110335K579452L060652L654053M407075N575918P301928
$$ 15359645 17170894 19281229 21860681 24921333 28575386 32982461 38558379 45860307
14533D5860307R537318J2506588J6085292K0126515K4500662K8688184L1848960
$$ 45860307 55397625 67904213 83989505 104116020 128616682 157304866 189153826
14526A89153826L3097069L1864623K8063544K1761290J3083611K918082p666875
$$ 189153826 222250895 254115518 282179062 303940352 317023963 319942045 312275170
14519C12275170j7495455k5552629l0916890l3104505l2567611k9782908k5625493
$$ 312275170 294779715 269227086 238310196 205205691 172638080 142855172 117229679
14512A17229679k0888088j6037258j1698997q520689o344754m917418m027986
$$ 117229679 96341591 80304333 68605336 60084647 53739893 48822475 44794489
14505D4794489l518460l120247k745913k413578k180311j957843j719050j484912
$$ 44794489 41276029 38155782 35409869 32996291 30815980 28858137 27139087 25654175
14497B5654175j305524j193937j138410j009699r24422q48990q24370p71157p16976
$$ 25654175 24348651 23154714 22016304 21006605 20082183 19233193 18408823 17637666 16920690
14488A6920690o48132m98310m46559m42542l97996l58325l84245m04917l27279
$$ 16920690 16272558 15774248 15327689 14885147 14487151 14128826 13744581 13339664 13012385
14479A3012385l41377l72456l60700l46319l75111l54795l52293l32924l33826
$$ 13012385 12671008 12298552 11937852 11591533 11216422 10861627 10509334 10176410 9842584
14470I842584l17177k99545l26327l26654k90245k39245j99591k57939k42370
$$ 9842584 9525407 9225862 8899535 8572881 8282636 8043391 7843800 7585861 7343491
14461G343491k34757k38860k06597j84511j41357j80438j94402j90826k15416
$$ 7343491 7108734 6869874 6663277 6478766 6337409 6156971 5962569 5771743 5556327
14452E556327j55894j50486j67867j29107j13163j46828j59478k03399j86807
$$ 5556327 5400433 5249947 5082080 4952973 4839810 4692982 4533504 4330105 4143298
14443D143298j61552q1554r2519j17106r2956j39919j33976j01376r8312p7405
$$ 4143298 3981746 3900192 3807673 3690567 3597611 3457692 3323716 3222340 3124028 3046623
14433C046623p0306o8174j12903j00814o4108r2429q0801q3851p4030n9255k9190
$$ 3046623 2976317 2908143 2795240 2694426 2630318 2537889 2457088 2373237 2299207 2239952 2210762
14422B210762n9929q4926l8451m2345p9489n3053p4925j07118m5731n3296M427
$$ 2210762 2150833 2065907 2027456 1985111 1905622 1852569 1777644 1670526 1624795 1571499 1575926
14411A575926k7204n4842l6509q832l0082l1799j3143l7069j4954q2401m4656
$$ 1575926 1548722 1493880 1457371 1448539 1418457 1386658 1373515 1336446 1321492 1239091 1194435
14400A194435r7307p9732M2869K7605m0995m3110J276o433J7748m6126j17731
$$ 1194435 1097128 1017396 1060265 1087870 1046875 1003765 1005041 998608 1016356 970230 852499
14389H52499q0615k8587m5847k8184l3262j7070p8779k6818L3521K2885m4395
$$ 852499 771884 743297 697450 669266 636004 618934 540155 513337 546858 569743 525348
14378E25348j1789l91M1540J7712n6094l0452l658k8155k9993J4819j4795k1878
$$ 525348 513559 513168 554708 572420 516326 485874 482216 454061 424068 438887 424092 402214
14366D02214L2921K0598J8493J4770Q967L4661K705J6763J3762l41K8182O377
$$ 402214 435135 455733 474226 488996 497963 532624 535329 552092 565854 565513 593695 600072
14354F00072M2411k512P055k3680k992Q914L1767N2276n22M3423j1494K6936m8982
$$ 600072 642483 639971 647026 623346 620354 629268 661035 713311 712789 756212 744718 771654 722672
14341G22672M939J1467L1100j3036m9274K6986K9289K4430P3958N0572M6233N0378
$$ 722672 727611 739078 770178 757142 707868 734854 764143 788573 862531 913103 959336 1009714
14329A009714J3910N4578J5017N08l703P07L0125j5626q611J947J5949q217m6060
$$ 1009714 1023624 1078202 1093219 1093727 1090024 1090731 1120856 1105230 1096619 1098566 1114515 1106298 1060238
14316A060238o2149K625K4894L7283K5317L3863J4288j747j0079m7619L1639k1322
$$ 1060238 998089 1000714 1025608 1062891 1088208 1122071 1136359 1134612 1124533 1076914 1108553 1087231
14304A087231j6077k5868Q951N3221J7o396o991k4805L9577J775l4331J0266o504
$$ 1087231 1071154 1045286 1054237 1107458 1107475 1101079 1094088 1069283 1108860 1110635 1076304 1086570 1080066
14291A080066k9406j3625L1468K6836n236k7112k056l3486M5240O4140J1271j5905
$$ 1080066 1050660 1037035 1068503 1095339 1090103 1062991 1060935 1027449 1072689 1136829 1148100 1132195
14279A132195n7931o417R528R664l2727J5640O240J628J1706o974p9749l8296
$$ 1132195 1074264 1067847 1077375 1087039 1054312 1069952 1076192 1077820 1089526 1082552 1002803 964507
14267I64507J6562L7981P772k7606j4496l4098l2556J9091J2505M706o6336l1383
$$ 964507 981069 1019050 1026822 999216 984720 950622 918066 937157 949662 954368 888032 856649
14255H56649J7044K8416J684l6383j9927J7182k0994j4529J2693j4335K259J0621
$$ 856649 873693 902109 903793 867410 847483 864665 843671 829142 841835 827500 829759 840380
14243H40380J8429N209q062K7024m0907l5216K8111L1300n297l4657J8215J8748
$$ 840380 858809 864018 855956 882980 842073 806857 834968 866268 860971 826314 844529 863277
14231H63277K5838o6051N508q902j4405k2047O090L1259j99J109k922J2297L6604
$$ 863277 889115 823064 828572 819670 805265 783218 789308 820567 820368 821477 818555 830852 867456
14218H67456J5493j9320J4948L2297J5916K7600M247M8295O9488j3097o0318n8631
$$ 867456 882949 863629 878577 910874 926790 954390 958637 1006932 1076420 1063323 1003005 944374
14206I44374l3481l3591l185m8478j3350j4729K4798M6227K0515k9521p367N706
$$ 944374 910893 877302 874117 825639 812289 797560 822358 868585 889100 859579 852212 857918
14194H57918L4503J3188l1383n222J2260k1880o4705p4835N0755J8603n0348r007
$$ 857918 892421 905609 874226 869004 881264 859384 794679 719844 770599 789202 738854 729847
14182G29847p828J9859N1198j8820J7249M5446k1377j4535K271J6194j7190J1432
$$ 729847 722019 741878 793076 774256 791505 836951 815574 801039 803310 819504 802314 813746
14170H13746P048k6176n3400m4258k277L9158J0763L9666p21K2245K5929j0806
$$ 813746 820794 794618 741218 696960 694683 733841 744604 784270 783549 805794 831723 820917
14158H20917M0382L8520l8978m8530l056J3979k928N987K716l8818p6631J754
$$ 820917 861299 899819 860841 812311 809255 823234 820306 826293 829009 790191 713560 715314
14146G15314K8269j6651j7686q03K923K9301K9804m348K2923j3135p648j5944
$$ 715314 743583 726932 709246 708443 711366 740667 770471 766123 789046 775911 768263 752319
14134G52319l3296j2591J7762j0237j2360j9059Q738L7715o85R678J8298k5698
$$ 752319 719023 706432 724194 713957 701597 682538 691276 728991 728306 737984 756282 730584
14122G30584J8474J3744L9808k549l3783j2031J0041O331K1872k4952J0164p1276
$$ 730584 749058 762802 802610 800061 766278 754247 764288 770619 792491 767539 777703 706427
14110G06427k8007l2616l3914L8677O2182R183j7532k544J7754m6637R080M7541
$$ 706427 678420 645804 611890 650567 712749 721932 704400 701856 719610 672973 682053 729594
14098G29594J4709M9252j0609k8464l1639K276L3739J4026l9979k5177n145O6150
$$ 729594 744303 793555 782946 754482 722843 725119 758858 772884 732905 707728 702583 768733
14086G68733K8445k037k0029L8944L0977J9868J9531K905J8157K5162L8053L4096
$$ 768733 797178 795141 775112 814056 845033 864901 884432 887337 905494 930656 968709 1002805
14074A002805M683M9497J04628J15289J23499J29044J70014K14883J97586R2537
$$ 1002805 1007488 1056985 1161613 1276902 1400401 1529445 1699459 1914342 2111928 2204465
14064B204465P8175Q3393m103q8208r2784j14612j90685j71717j92217j36848
$$ 2204465 2282640 2366033 2361930 2273722 2180938 2066326 1875641 1703924 1511707 1374859
14054A374859j19331q2446o4905n5462q8726o8003j0052j7771m0774L877l2150
$$ 1374859 1255528 1173082 1108177 1052715 963989 895986 885934 868163 827389 831266 799116
14043G99116o748O739n0256N907K3206P346m7266J4370l0399l4536j0004l4356
$$ 799116 792368 799107 748851 754758 777964 785310 738044 752414 722015 687479 677475 643119
14031F43119j4597q121K2189k573J9526k5688J7131n308k6535M2404l1580m4015
$$ 643119 628522 620401 642590 640017 659543 633855 650986 645678 619143 661547 629967 585952
14019E85952J6977L558p9200n5430L7028O7184l6003l3637N613J8208M3982L2156
$$ 585952 602929 606487 527287 471857 508885 576069 540066 506429 512042 530250 574232 606388
14007F06388J3526m8061p6197k3473M0929r763l8220k105j7774N464P1493l3866
$$ 606388 619914 571853 495656 472183 513112 503349 465129 463024 445250 450714 522207 488341
13995D88341J023O516M3914Q445j3468r573m6807j0138M4141K8052P955o2447
$$ 488341 489364 495880 539794 548239 534771 525198 478391 468253 512394 540446 548401 485954
13983D85954k3571K7250k0868m0628M5926n152k5713M7986J6679l352n0607j3008
$$ 485954 462383 489633 468765 428137 474063 468911 443198 491184 507863 504511 453904 440896
13971D40896j7585j3608j1619K6218j3251m1481k1337J9497R470N9539J3707o9781
$$ 440896 423311 409703 398084 424302 411051 369570 348233 367730 377200 436739 450446 380665
13959C80665l0835j5586L492K0496K4006N582l2372K1231K2588n2191P171p083
$$ 380665 349830 334244 337736 358232 382238 387820 355448 376679 399267 347076 354247 347164
13947C47164P787L6800k8903J1953M740L7397M8179j7914k8760m4811n5684P154
$$ 347164 354951 391751 362848 374801 379541 416938 465117 447203 418443 373632 317948 325102
13935C25102K7857N0361k4487l0761K308L2378k1525O0337M6371J2738O7663M5823
$$ 325102 352959 403320 378833 348072 350380 382758 361233 421570 467941 480679 548342 594165
13923E94165J3412K0063M1173J4005k935l1040m849n0682l8777K6344m0595l1074
$$ 594165 607577 627640 668813 682818 679883 648843 643994 593312 554535 580879 540284 509210
13911E09210m9661k6229M1297K5624n2537p4217j2080k7527r928j4470k6374J4417
$$ 509210 459549 433320 474617 500241 447704 373487 361407 333880 323952 309482 283108 297525
13899B97525o213K3341o612J6965l671Q151j7375K4107J262j9591o3657m9419
$$ 297525 291312 314653 308041 325006 321335 329486 312111 336218 337480 317889 254232 204813
13887B04813J7988M8043K7053o8940L0636M0091M3061k9103n5181K9681j615m2027
$$ 204813 222801 270844 297897 228957 259593 299684 342745 313642 258461 288142 286527 244500
13875B44500P291q735K714j8788k3039m3165p0331J7802O1587K4887N9637M989
$$ 244500 251791 243056 245770 226982 203943 160778 90447 108249 169836 194723 254360 259349
13863B59349k9218K6559M2114k3204o965J2985M3782j1035m0119l3353L5516k0756
$$ 259349 230131 256690 298804 275600 268635 281620 325402 314367 274248 240895 276411 255655
13851B55655k1809J7489q837J9411k2453o6627q066N4134L3698J939M7417k905
$$ 255655 233846 251335 242498 261909 239456 172829 164763 218897 252595 254534 301951 299046
13839B99046k2228k4899L4178K3887L022j4719l1922m55L5205r875o1360l090
$$ 299046 276818 251919 286097 309984 313006 298287 266365 265910 301115 291240 229880 226790
13827B26790k1226l5754p265k181J6798j0599j3725r760M1607N552J5580K7883
$$ 226790 205564 169810 162545 160364 177162 166563 152838 143078 184685 190237 205817 233700
13815B33700k6917j8692j370Q439k8566R491N3615l3860k9870k4693p341k823
$$ 233700 206783 188091 186721 195160 166594 176085 229700 195840 165970 141277 133936 131113
13803A31113K2795q533j2099J2778o0436j4094P318J1584N976J3666k9291J6279
$$ 131113 153908 145375 133276 146054 85618 71524 78842 90426 96402 110068 80777 97056
13791I7056l3306O478L6761k4462j4267N4633M9376N1338k9752n9785o2889J5125
$$ 97056 63750 70228 106989 82527 68260 122893 172269 223607 193855 134070 71181 86306
13779H6306L781m28l3447R218J6857P051K6822R509K7331m7394j9861L1623L7116
$$ 86306 90087 89659 56212 65430 82287 89338 116160 125669 153000 105606 85745 117368 154484
13766A54484o904n7836l4838j2848N3771K5063m4780p972j3283J0800M6932j1961
$$ 154484 147580 89744 54906 42058 95829 120892 76112 68140 54857 65657 112589 100628
13754A00628j6954j1044J7451N368K7814J8468k3681K3842k7802L6463P709l1059
$$ 100628 83674 72630 90081 95449 123263 141731 118050 141892 114090 150553 158262 127203
13742A27203N194l062l4078m5422p026J591K5434j6885J6175K1232J1302K8837
$$ 127203 132397 129335 95257 49835 42809 44400 69834 52949 69124 90356 101658 130495
13730A30495k9702N335J5586o44N365k5710n8949k0131j6402J7777K7308M4706
$$ 130495 100793 106128 121714 121070 126435 100725 41776 21645 5243 23020 50328 95034
13718I5034j5302n6822l3606O9029M918m455K8596o665k5963K8670J7654j2649
$$ 95034 79732 22910 -10696 58333 63251 58796 87392 80727 54764 83434 101088 88439
13706H8439M1420J7446l075m3542k5029k9350L4699j8744l03J9129J8138L0303
$$ 88439 129859 147305 144230 100688 75659 46309 81008 62264 61961 81090 99228 129531
13694A29531l0918K376k9082K613J0129o445o181k2037j5079M9131K2173q261
$$ 129531 98613 100989 71907 74520 84649 78204 72023 49986 34907 84038 106211 97950
13682I7950k7869R099J9261L0918l3895j7527L7603k4858j109l0067l723R475
$$ 97950 70081 79180 98441 129359 95464 77937 115540 90682 89573 59506 55783 65258
13670F5258M864K9508J0113l5325l593L6507O66o416K5693J0576j678j5005j7486
$$ 65258 70122 99630 109743 74418 70825 107332 107998 101582 127275 137851 136173 121168 103682
13657A03682n3070k392L3953L5417j6082K6649k8832n3693J4471J794K5563K3809
$$ 103682 50612 48220 82173 117590 101508 128157 99325 45632 60103 61897 87460 111269
13645A11269J74J2688l6071m9936K3947r506k095N1160M8145n25o239m048Q99
$$ 111269 111443 124131 88060 38124 62071 52565 50470 101630 149775 149250 143011 138963 139862
13632A39862L0968M597k7462m2576j9196o5839m581L7048L2538n4771k7654K864
$$ 139862 170830 175427 147965 105389 86193 20354 15773 52821 85359 30588 2934 5798
13620E798M7364K4323J860N1691R96n2069k1943L1142N6129m632m6871j2506N8418
$$ 5798 53162 77485 79345 131036 132032 79963 58020 89162 145291 140659 93788 81282 139700
13607A39700N9001r714M7m7450m2281O637L1767O2428j0210m852m511k7687o2136
$$ 139700 198701 188987 189034 141584 99303 105940 137707 200135 189925 185073 180562 152875 90739
13594I0739j2424N942l5007k1353j7106j1966O728R5678J0546k0842K1272L2902
$$ 90739 78315 84257 49250 27897 10791 -1175 5553 101231 111777 90935 112207 145109
13582A45109J6996q604l7094k8018m3272m8972K2279J6318K1470L5890M2138j3155
$$ 145109 162105 153501 116407 88389 45117 -3855 18424 34742 56212 92102 134240 121085
13570A21085j5520K2859l8312k4792K2891M2069L3933M2505l9871j6595K3916
$$ 121085 105565 128424 90112 65320 88211 130280 164213 206718 166847 150252 174168
13559A74168J5326j1475m0202q809j1687K887k0679p163j0452p485J1421k8907
$$ 174168 189494 178019 137817 129008 117321 120208 99529 92366 81914 74429 85850 56943
13547E6943j3540K8465J5508L0942J1897l5876J1526K7776l7114l3169J1738M8349
$$ 56943 43403 71868 87376 118318 130215 94339 105865 133641 96527 63358 75096 123445
13535A23445k0822l1585M490K8055k3910m9534j7552N4884M0570M567J2685j9271
$$ 123445 102623 71038 75528 103583 79673 30139 12587 67471 108041 112608 125293 106022
13523A06022j2172O094K1203M8103j8496m3487r758k4457J5835P1256j9431j9684
$$ 106022 93850 99944 121147 169250 150754 107267 97509 73052 88887 160143 140712 121028
13511A21028M404q958K8400N9198k8356K316j4329J7602j184l4932K677J2745
$$ 121028 125432 116474 144874 204072 175716 178032 163703 181305 180121 145189 147866 160611
13499A60611l0736k5209N19J0313k81J7291O79J1354j7251m7989j4649L9636O8598
$$ 160611 129875 104666 105185 115498 115217 132508 133187 144541 127290 79301 64652 104288 172886
13486A72886L2132j5921K223j0253j8465q221l358k1872j2145J2397L9034K267
$$ 172886 205018 189097 191320 181067 162602 154381 151023 129151 117006 129403 168437 170704
13474A70704J6207R739k0313k5063j7905k3724j5853p674M0989L0023K0865p646
$$ 170704 186911 196650 176337 151274 133369 109645 93792 86118 127107 157130 177995 170349
13462A70349m9515L9368O413l0164K6844M9026L3073j8718m3175M936l4042j5460
$$ 170349 120834 160202 166615 136451 163295 212321 245394 226676 183501 188437 154395 138935
13450A38935K7432j5918k2241j9372q662K9983n654m5326l5837P84K8295L3668
$$ 138935 166367 150449 128208 108836 100174 130157 124503 79177 43340 44124 72419 106087
13438A06087N3342J8569j8527k0998N128K5238q178j5203j0655M0219L2147O607
$$ 106087 159429 177998 159471 138473 143601 168839 160661 145458 134803 175022 207169 213776
13426B13776J7901j7468K875P074L002l8649k7006K4974k8410k6027l8646J0645
$$ 213776 231677 214209 217084 224158 227160 188511 161505 186479 158069 132042 93396 104041
13414A04041M3121J4662l9686m464m0659m4558J9219K3522N9511M9196L1422j6265
$$ 104041 147162 161824 122138 117674 77015 32457 51676 75198 134709 183905 215327 199062
13402A99062L0872O506J2414k6836n8836n905L3808M8246K4374N305o1368j9508
$$ 199062 229934 236440 248854 222018 163182 157277 191085 239331 263705 269010 207642 188134
13390A88134L909k4154l3078m0933p775K5994P5129L5211J1024j1677l1425R675
$$ 188134 192043 167889 134811 93878 86103 112097 187226 222437 233461 221784 190359 200034
13378B00034K7586L1632J5454J1822N4637n237l7826m9398K1488n127q811j3884
$$ 200034 227620 259252 274706 286528 341165 335928 298102 248704 270192 265065 256254 242370
13366B42370j3220J0080j5667R865m9627q883M9693K1067J5353N6596m9002m7873
$$ 242370 229150 239230 223563 233428 183801 174918 224611 245678 261031 317627 268625 220752
13354B20752K0660N1830m1332K073L4060O1657r846m0921N874K9580Q439J6807
$$ 220752 241412 293242 251910 253983 288043 349700 339854 298933 304807 334387 342826 359633
13342C59633p662n908m9009k9969N4974K1477j1016j7037r635K9308j2162j634
$$ 359633 351971 346063 297054 267085 322059 343536 332520 315483 305848 335156 322994 321360
13330C21360K8325L5546m0105k6532j8267N251k8693m7636m442L1065N57J0531
$$ 321360 349685 385231 345126 318594 300327 305578 276885 229249 224807 255872 256429 266960
13318B66960l0478n0072K9235P280l5480J6748K787L2330P1587L7995r864j4262
$$ 266960 236482 186410 215645 222925 187445 204193 206980 239310 310897 348892 339028 324766
13306C24766m7372k9233M0956l2420m4199k4025J0709K4915R458o1124q67M2160
$$ 324766 277394 248161 289117 256697 212498 188473 199182 224097 233555 172431 171564 213724
13294B13724L3668L1492K8044K5991K4944k3752j6291j302j3630k2526l0988J4639
$$ 213724 247392 278884 306928 332919 357863 334111 317820 316518 302888 280362 249374 264013
13282B64013R024q301L561J685O791L6460K4867L4034P899L896J5402q618j2489
$$ 264013 273037 264736 268297 269982 276773 313233 338100 372134 380033 383929 399331 390713 378224
13269C78224j2223J2952M9002J637l7558p4519K8732Q484m8388L979M3375L7409
$$ 378224 366001 378953 427955 429592 392034 317515 346247 354731 306343 310322 353697 391106
13257C91106L4197o3125n0645l4720J4458j5194M0348L956L9077K6592k6110o5706
$$ 391106 425303 362178 311533 276813 291271 276077 316425 320381 359458 386050 359940 294234
13245B94234J6076J7618M4509Q5974K3607Q883L8937K1371M1305P8483O6206P3196
$$ 294234 310310 327928 372437 458411 482018 490901 529838 551209 592514 670997 737203 810399
13233H10399O5185R1589J09112J7354n2062o5737j30208j06731j10384p0945l6609
$$ 810399 875584 967173 1076285 1093639 1041577 975840 845632 738901 628517 557572 520963
13222E20963n2283j3095j5801q544l7025k6379K6880J2523J5798k454j6811M114
$$ 520963 468680 455585 439784 431240 394215 367836 394716 407239 423037 420583 403772 407886
13210D07886M322n1881J2800M1463K9196K5232K4232j4091M5083M3183p120j1380
$$ 407886 412208 360327 373127 414590 443786 469018 493250 479159 524242 567425 560305 548925
13198E48925K0478L3965K2418L6905J03401J35055J63685K55453K94265K44741
$$ 548925 569403 603368 625786 662691 766092 901147 1064832 1320285 1614550 1859291
13188A859291K43474J97566K14200J35820m9833k61488m26538m12973k88878j97411
$$ 1859291 2102765 2300331 2514531 2650351 2600518 2339030 1912492 1499519 1210641 1013230
13178A013230j11198o7565j2645n8206m6481j8089k0386m7864l0763M586K831
$$ 1013230 902032 834467 821822 763616 717135 699046 678660 630796 600033 604619 607450
13167F07450J1545k8095K3819o980r342m575m675J7610j6295k8347J6211N2687
$$ 607450 618995 590900 614719 607739 598397 593822 589147 606757 590462 562115 578326 631013
13155F31013m343L9662M1765j6512j4200N6665Q5362J30197J31129K10188K77159
$$ 631013 626670 666332 708097 691585 677385 734050 819412 949609 1080738 1290926 1568085
13144A568085L04930K23957K09153K22370J92515R67k30768l70761m35424l63874
$$ 1568085 1873015 2096972 2306125 2528495 2721010 2721977 2491209 2120448 1685024 1321150
13134A321150k08395j26963q3159o5530m0471p3445m5829l8306k8363J1059j7395
$$ 1321150 1112755 985792 902633 837103 796632 723187 677358 639052 610689 621748 604353
13123F04353o468j4758n0211K4340L4908k33O214m379m3143j4967K9160K5066
$$ 604353 597885 583127 532916 557256 592164 591931 598145 593766 550623 535656 564816 589882
13111E89882l3737j4642K0601M0701l4184J1315N916n834J03840Q0101O0135J02198
$$ 589882 556145 541503 562104 602805 568621 579936 585852 580018 683858 763959 824094 926292
13099I26292R5121Q2901J05206N8370L5990j4885o7597j31566j21585p0286r6638
$$ 926292 1021413 1104314 1209520 1267890 1303880 1288995 1221398 1089832 968247 897961 801323
13088H01323n8510l4163Q192L5963m4947r839k0977k5757l4379K7039M166k4149
$$ 801323 742813 708650 716842 752805 707858 698019 677042 651285 616906 643945 648111 623962
13076F23962o1550l1434k9302j1503Q678l1389r970M7188N2088L5712K9031m1553
$$ 623962 562412 530978 501676 490173 498851 467462 457492 504680 556768 592480 621511 579958
13064E79958k2685J2296l6821p800L7922L4295k9005j8219K1725j896J499L31
$$ 579958 557273 569569 532748 524948 562870 597165 568160 549941 571666 569770 571269 571600
13052E71600k1800k7296j5503O5178K219Q620m0114J4347J9267L1528m3793Q737
$$ 571600 549800 522504 507001 572179 574398 583018 542904 557251 576518 608046 564253 572990
13040E72990K4059j6274J2569J2655k6776m0613K3154K9375L7976L5138J3320
$$ 572990 597049 580775 593344 605999 579223 538610 561764 591139 629115 664253 677573
13029F77573o1533k9326N234q940j5887m29J4861K847L2392K5547L982P124m804
$$ 677573 616040 586714 591948 583008 567121 566692 581553 584400 616792 642339 646321 653445 648641
13016F48641p020J080q538K2949L4825o0373n8587m8857J1155M5359L0840J5805
$$ 648641 641621 642701 634163 657112 691937 631564 572977 524120 535275 580634 611474 627279
13004F27279k8821k0362L7547N239L8480P589m3820j9053J741o7215j8033M0100
$$ 627279 598458 578096 615643 620882 659362 666951 623131 604078 605819 538604 520571 560671
12992E60671Q1012M2412P7773q161m7482o1352l3019k9073O206L9893P2466J0166
$$ 560671 641683 684095 761868 753707 706225 644873 611854 582781 588987 628880 701346 711512
12980G11512o3288l8458R505j6005K3749N1918P909k1821j5834r329J4798l2664
$$ 711512 648224 609766 619271 603266 627015 678933 686842 665021 649187 639858 654656 621992
12968F21992J4088J5400o090K0574O5314k1633n1272j6863K8357L9451n524l4366
$$ 621992 636080 651480 645390 665964 731278 709645 658373 641510 669867 709318 703794 669428
12956F69428L800L6328M5469K9926n9665L652k8297l5095K7531P1952M0731k6941
$$ 669428 673228 709556 755025 784951 725286 728938 700641 665546 693077 765029 805760 778819
12944G78819m911k1672J8783Q678J0484j8428k3424L1710j4117J0718L0363l7689
$$ 778819 773908 752236 771019 779697 790181 771753 748329 780039 765922 776640 807003 769314
12932G69314n677L1582J1335k2657j0036J3558K7915j0739R029P1437J0930j4982
$$ 769314 763637 795219 806554 783897 773861 787419 815334 804595 813624 885061 895991 881009
12920H81009P307l6895o3648m881k8512N4306R336j027K6563O3777k1046j5968
$$ 881009 888316 851421 787773 782892 754380 808686 818022 816995 843558 907335 886289 870321
12908H70321j7607p005N660M1567p042Q331J3171r642l1171n2884K0117J0859
$$ 870321 852714 845709 851369 892936 885894 894225 907396 897754 866583 813699 833816 844675
12896H44675j6083J16L9672M5558m2272K5086j0555o9323J567K9802J3884L2308
$$ 844675 828592 828708 868380 913938 871666 896752 886197 816874 818441 848243 862127 894435
12884H94435j9593o9448L0507M7719K9834M0358K8380N115j9895M6313J0575l0840
$$ 894435 874842 805394 835901 883620 913454 953812 982192 987307 967412 1013725 1024300 993460
12872I93460O852q097J0005N299j3705l5980J273J3020j5204o154m3286M4588
$$ 993460 1000312 992215 1002220 1007519 993814 957834 959107 972127 956923 950769 907483 952071
12860I52071N2723K2145o605l5767L296N3129N3111M1434L195l9662l5969k4724
$$ 952071 1004794 1026939 1020334 984567 987863 1040992 1094103 1135537 1138732 1099070 1063101 1038377
12848A038377j343J1522M609L2531l2711k0798K2592L3239K1159l6450J3568M7761
$$ 1038377 1037034 1048556 1053165 1085696 1052985 1032187 1054779 1088018 1109177 1072727 1086295 1134056
12836A134056m3290o2373j5813Q9737N1050J0457j6071N0902K3189l730k3456
$$ 1134056 1090766 1028393 1012580 1102317 1153367 1163824 1147753 1198655 1221844 1218114 1194658
12825A194658k877J6696J7113J207K832K2022k043k5131j1932N28R084l0016L8708
$$ 1194658 1191781 1208477 1225590 1226797 1229629 1251651 1249608 1224477 1212545 1213073 1222157 1192141 1230849
12812A230849L6395m808l8963j2237P4935M2786k2592n2422k7837O388K1540K14
$$ 1230849 1267244 1262436 1223473 1211236 1286171 1328957 1306365 1253943 1226106 1232494 1254034 1254248
12800A254248P9111K1750k3972k9224l3911L5297J6627j588N030j2746m6652j1384
$$ 1254248 1333359 1355109 1331137 1301913 1268002 1303299 1319926 1318338 1323368 1310622 1263970 1252586
12788A252586l8447j3982L7720N8452K9458Q135M2378K4684L4489J7928j5742
$$ 1252586 1214139 1200157 1237877 1296329 1325787 1333922 1376300 1400984 1435473 1453401 1437659
12777A437659r405R237j7603J8955N668J0406J2450k5489K6344L2827Q59k1521
$$ 1437659 1428254 1437491 1419888 1438843 1444511 1454917 1467367 1441878 1468222 1501049 1501908 1480387
12765A480387p636p717j0048l273L22M3128K4572R657q165j4787j7068O6968N7607
$$ 1480387 1472751 1465034 1454986 1451713 1452035 1495163 1519735 1529392 1521227 1506440 1489372 1556340 1613947
12752A613947K5564m593j4680J7980M4622O941K9619L9113o3683m4567K8305O5842
$$ 1613947 1639511 1634918 1620238 1638218 1682840 1689781 1719400 1758513 1694830 1650263 1678568 1744410
12740A744410M9803j6746k8489j3841J4042j2117O6565j7782m4374k2360l659
$$ 1744410 1794213 1777467 1748978 1735137 1749179 1737062 1803627 1785845 1741471 1719111 1715452
12729A715452J1458q579n5160P1392N0534M4434J2092M4939J5372j111k6526n8466
$$ 1715452 1726910 1718331 1663171 1734563 1785097 1829531 1841623 1886562 1901934 1900823 1874297 1815831
12717A815831l9352N2388K8762j4582r242J6789L4835p779R661R767k0016L6444
$$ 1815831 1776479 1828867 1857629 1843047 1833805 1850594 1885429 1877650 1887311 1897078 1877062 1913506
12705A913506M3504L601M9068R018M029J2826K383j7695K53O590L7856L3810k628
$$ 1913506 1957010 1960611 2009679 2018697 2022726 2035552 2037935 2020240 2020493 2027083 2064939 2098749 2096121
12692B096121K2942r575L5335J00111j6015m9462J7071O5288K479R014q60m4049
$$ 2096121 2119063 2109488 2144823 2244934 2228919 2179457 2196528 2261816 2264295 2273309 2272449 2228400
12680B228400j3247O9541K1213K1870l2524m596J5280L6044P374L2652N848j1049
$$ 2228400 2215153 2284694 2305907 2327777 2295253 2290657 2305937 2341981 2349355 2382007 2387855 2376806
12668B376806j14P7966M1398o338L692n6891j8130L5772N6080M7513l9228P635
$$ 2376806 2376692 2454658 2496056 2489718 2493410 2436519 2418389 2454161 2510241 2557754 2518526 2526161
12656B526161o008L6381K4253J3138j8128K6369J0278K3114K4069N5343l835l0852
$$ 2526161 2520153 2556534 2580787 2593925 2575797 2602166 2612444 2635558 2659627 2714970 2711135 2680283
12644B680283K5810L7268L8045L6l3444N0006J9959l965M2724L6271K9907o693
$$ 2680283 2706093 2743361 2781406 2781442 2747998 2798004 2817963 2813998 2856722 2892993 2922900 2916207
12632B916207J5397l9115K0261N5720K9494p923M5070J03051L6536L4609j6742
$$ 2916207 2931604 2892489 2912750 2968470 2997964 2990041 3035111 3138162 3174698 3209307 3192565
12621C192565m4334l4883K8753L5871K8329N9377O168Q097j2659J1761L303K2436
$$ 3192565 3148231 3113348 3142101 3177972 3206301 3265678 3271846 3279943 3267284 3279045 3282348 3304784
12609C304784Q7421m5921q225M5353L8543K4761K4393M3578M1313L6001K3081
$$ 3304784 3392205 3346284 3338059 3383412 3421955 3446716 3471109 3514687 3556000 3592001 3615082
12598C615082N9790r791n581p003J6026j5950k431N4862j846L5175O5200J4908
$$ 3615082 3674872 3665081 3659500 3652497 3668523 3652573 3650142 3705004 3703158 3738333 3803533 3818441
12586C818441J1502O3979J3706K8815L6554P2450K3607J7397N2112J1567P6767
$$ 3818441 3829943 3893922 3907628 3936443 3972997 4045447 4069054 4086451 4138563 4150130 4226897
12575D226897N5189m36k7991L9531O6420M9165K8414K8090O39K5378L9741k7818
$$ 4226897 4282086 4281650 4253659 4293190 4359610 4408775 4437189 4465279 4465918 4491296 4531037 4503219
12563D503219K6904P0286M3056O2600O5341L9005M2784k4536J9457K5041l362
$$ 4503219 4530123 4600409 4643465 4706065 4771406 4810411 4853195 4828659 4848116 4873157 4869795
12552D869795j648P1819J11516N3384n557O5657l6416K526L5726O4311N5638M3261
$$ 4869795 4868147 4939966 5051482 5104866 5099309 5164966 5128550 5131076 5166802 5231113 5286751 5330012
12540E330012M8021M9220L0041J8912M6967Q6747R2924J3249J0373L3276O9619
$$ 5330012 5378033 5427253 5457294 5476206 5523173 5609920 5702844 5716093 5726466 5759742 5829361
12529E829361L6223J2169L5380K9670N3519K9568J1548P3188O2055O4881N5212
$$ 5829361 5865584 5877753 5913133 5942803 5996322 6025890 6037438 6110626 6172681 6237562 6292774
12518F292774j2064k0273M8206Q1449P9436J18042P7870N2868k1620M5799J12171
$$ 6292774 6280710 6260437 6308643 6390092 6469528 6587570 6665440 6718308 6696688 6742487 6854658
12507F854658J01240L8307K3380K9497J04208O6760N7510P6726K3708K0732P7492
$$ 6854658 6955898 6994205 7017585 7047082 7151290 7218050 7275560 7352286 7375994 7396726 7474218
12496G474218J39977L5699J7966K0797N9962J30373J01527Q5129J3812M3810M5957
$$ 7474218 7614195 7649894 7667860 7688657 7748619 7878992 7980519 8065648 8079460 8123270 8169227
12485H169227P9992Q5962P7253L2738P3932J01545R0571P2261J3554O4765Q8534
$$ 8169227 8249219 8335181 8412434 8445172 8519104 8620649 8711220 8783481 8797035 8861800 8950334
12474H950334J01927J28590P9299P0083J16728K6657J2124O7552O1056J35477
$$ 8950334 9052261 9180851 9260150 9330233 9446961 9473618 9485742 9553294 9614350 9749827
12464I749827J28148O1089L3934O9838J08977J20732J34799J08602P6365Q8575
$$ 9749827 9877975 9939064 9972998 10042836 10151813 10272545 10407344 10515946 10592311 10680886
12454A0680886L4302J0000R5719J44776J15677J12177P9856J03799J08994O6003
$$ 10680886 10715188 10725188 10820907 10965683 11081360 11193537 11273393 11377192 11486186 11552189
12444A1552189Q4776M4928O4550Q1597N8332Q9818J46292J09456J08415J00762
$$ 11552189 11636965 11681893 11746443 11828040 11886372 11976190 12122482 12231938 12340353 12441115
12434A2441115P2178Q6079J11485J48478J09557P8444N7960N1575M0036J05069
$$ 12441115 12513293 12599372 12710857 12859335 12968892 13047336 13105296 13156871 13196907 13301976
12424A3301976J33159J33612Q6812O6119O1085J16084J71250J61536R0686O8957
$$ 13301976 13435135 13568747 13655559 13721678 13782763 13898847 14070097 14231633 14322319 14391276
12414A4391276J05403J32707Q7286L4007J19748J18269J15389J20591J34347N5220
$$ 14391276 14496679 14629386 14716672 14750679 14870427 14988696 15104085 15224676 15359023 15414243
12404A5414243M5983P1717M4202P1601J17878Q8825J04439Q9061Q6764P7657J15181
$$ 15414243 15460226 15531943 15576145 15647746 15765624 15854449 15958888 16047949 16134713 16212370 16327551
12393A6327551P5797J01313R6562M4347Q5576Q2114J14536J06622L6909L1878
$$ 16327551 16403348 16504661 16601223 16645570 16731146 16813260 16927796 17034418 17071327 17103205
12383A7103205O7680P3017O0690J5577L7724P6394O9581Q1083J04225N7336Q3556
$$ 17103205 17170885 17243902 17304592 17320169 17357893 17434287 17503868 17584951 17689176 17746512 17830068
12372A7830068L7527l4323q766O5589M5636K4049L2993Q7103K0304K7003O5721
$$ 17830068 17867595 17833272 17824506 17890095 17935731 17959780 17992773 18079876 18100180 18127183 18192904
12361A8192904n327J3515Q8968K2683m8189j998J285l5641j2176l631J4160k2027
$$ 18192904 18187577 18201092 18290060 18312743 18264554 18262556 18263841 18228200 18216024 18212393 18226553 18204526
12349A8204526J2442J8631J5625J0775j0844j6147o8021J3595m6829n6210r366
$$ 18204526 18216968 18235599 18251224 18261999 18251155 18235008 18166987 18180582 18133753 18077543 18068177
12338A8068177k9906o0789n2190l4609o953o1267q7970o9235n0613l4744k3547
$$ 18068177 18038271 17977482 17925292 17890683 17883730 17822463 17734493 17665258 17614645 17579901 17556354
12327A7556354n1554o0007m9322m3612m8494m6818j16026r6042p6005j11131r1143
$$ 17556354 17504800 17444793 17395471 17351859 17303365 17256547 17140521 17044479 16968474 16857343 16766200
12316A6766200n9983m0522o3598q5415m4780r7735p2296p4419o6425q5736r6264
$$ 16766200 16706217 16665695 16602097 16516682 16471902 16374167 16301871 16227452 16161027 16075291 15979027
12305A5979027r0316q0949j14372j30623j15988o5114j06346j50552q0644k9947
$$ 15979027 15888711 15807762 15693390 15562767 15446779 15381665 15275319 15124767 15044123 15014176
12295A5014176r8791r7707j11136j18189q0429o4195p0460j29920j39021j19530
$$ 15014176 14915385 14817678 14706542 14588353 14507924 14443729 14373269 14243349 14104328 13984798
12285A3984798j03244j55914j63575j14782r1820r1272l8278j06739j32936r4363
$$ 13984798 13881554 13725640 13562065 13447283 13355463 13264191 13225913 13119174 12986238 12891875
12275A2891875p2078k0401n6337j07218j20954p7434j32179j20702j15337j11383
$$ 12891875 12819797 12799396 12743059 12635841 12514887 12437453 12305274 12184572 12069235 11957852
12265A1957852r1894q0916j18733j13468q2576j14185j08699o9388j9060m8410
$$ 11957852 11865958 11785042 11666309 11552841 11470265 11356080 11247381 11177993 11158933 11110523
12255A1110523r1607j01452j02718j24429j06779j02463j14078n3676m3139n8026
$$ 11110523 11018916 10917464 10814746 10690317 10583538 10481075 10366997 10313321 10270182 10212156
12245A0212156p2042r6586r7494n0040o4603q6062r8197j33968o2359n1586j14321
$$ 10212156 10140114 10043528 9946034 9895994 9831391 9745329 9647132 9513164 9450805 9399219 9284898
12234I284898r5495q7398q1847n1351o8787o6231j09001j30331n4623l0974j01366
$$ 9284898 9189403 9102005 9020158 8968807 8900020 8833789 8724788 8594457 8539834 8508860 8407494
12223H407494r7607p9545l6381q3408r4427n0191n5473j31012o7558k1318m4347
$$ 8407494 8309887 8230342 8193961 8110553 8016126 7965935 7910462 7779450 7711892 7690574 7646227
12212G646227p7870r4765r3179n5191n6785o7025l8194j7226p800n3511j10304
$$ 7646227 7568357 7473592 7380413 7325222 7268437 7201412 7163218 7145992 7138192 7084681 6974377
12201F974377l5250o3781n9258q4779m8149o5672q9427p3528n0495k7129l0653
$$ 6974377 6939127 6875346 6816088 6731309 6683160 6617488 6528061 6454533 6404038 6376909 6346256
12190F346256p2124o0285r160l1178m6192n6879o9446m7956j22017q2736l0574
$$ 6346256 6274132 6213847 6204687 6173509 6127317 6070438 6000992 5953036 5831019 5748283 5717709
12179E717709k3407k4738n3603m4172n0071n4570m0532r2507n2387Q256n1604
$$ 5717709 5694302 5669564 5615961 5571789 5521718 5467148 5426616 5334109 5281722 5289978 5238374
12168E238374m5037m257k1278q3600r0525j0285r36m6487n5403n3840m0973l4126
$$ 5238374 5193337 5189080 5167802 5084202 4993677 4983392 4982456 4935969 4880566 4826726 4785753 4751627
12156D751627n2367m5522n4566J3325m1220n7897r582j7023p5624m6887K2053
$$ 4751627 4699260 4653738 4599172 4612497 4571277 4513380 4503798 4486775 4411151 4364264 4386317
12145D386317j4101l5722l0601o0676n9794n466k0037l6326k3305K4928j7934
$$ 4386317 4372216 4336494 4305893 4245217 4185423 4179957 4159920 4123594 4100289 4125217 4107283
12134D107283l7719k9613n9378l6363j2543q4529J1831p178j8583m6341o5082
$$ 4107283 4069564 4039951 3980573 3944210 3931667 3847138 3858969 3851791 3833208 3786867 3721785
12123C721785p3377m8684J2188q979q4679l4182j1423q424K0814j8347m4276l4898
$$ 3721785 3648408 3599724 3611912 3602933 3518254 3484072 3472649 3464225 3485039 3466692 3422416 3387518
12111C387518l2755j8053r474l5541P598m9629k9469M2727j9823n6382k1359l0410
$$ 3387518 3354763 3336710 3327236 3291695 3299293 3249664 3220195 3262922 3243099 3186717 3165358 3134948
12099C134948M339n851n0729n5385J1009n964j4977j00959k5006k4838l3890l9355
$$ 3134948 3139287 3133436 3082707 3027322 3038331 3032367 3017390 2916431 2891425 2866587 2832697 2793342
12087B793342K1383K8652l8095m0750r115M0487k0882p1602n5411L0815m3495
$$ 2793342 2814725 2843377 2805282 2764532 2755417 2795904 2775022 2703420 2648009 2678824 2635329
12076B635329J414k0047l6141k3054l8566R396m3267k9608l613L6929m5559l0188
$$ 2635329 2636743 2616696 2580555 2557501 2518935 2528331 2485064 2455456 2451843 2488772 2443213 2413025
12064B413025k835R115k5546J0761J5195k2733j9571k7579j9696p613n4819n9557
$$ 2413025 2410190 2419305 2393759 2404520 2419715 2396982 2377411 2349832 2330136 2322523 2267704 2208147
12052B208147o8963l992j3275k2631m5062J394Q208J9528K7197r948K1022m5256
$$ 2208147 2139184 2135192 2121917 2099286 2054224 2055618 2063826 2083354 2110551 2100603 2121625 2076369
12040B076369j13k3729p9877m8220j457m6477j3440M5618M6676J5447k2779k7772
$$ 2076369 2076256 2052527 1972650 1924430 1922973 1876496 1863056 1908674 1955350 1970797 1948018 1920246
12028A920246j1152m8660l278N473l3298n8872J4230N7484J5151p4893k1408j2592
$$ 1920246 1909094 1860434 1857156 1862629 1829331 1770459 1784689 1842173 1857324 1782431 1761023 1748431
12016A748431q094j6299K8168N4792k7846k1959M3600N76q2079m1034j8243q500
$$ 1748431 1740337 1724038 1752206 1806998 1779152 1757193 1800793 1801369 1719290 1678256 1660013 1651513
12004A651513j2861L499R488j8848q8197K8569K0940K6562j3215j1354k6857m5266
$$ 1651513 1638652 1642151 1651639 1632791 1544594 1573163 1594103 1620665 1607450 1596096 1569239 1523973
11992A523973k850m060k7124J6614N5316K8209l9638k2815p2861m6571J8488m089
$$ 1523973 1521123 1517063 1489939 1506553 1561869 1590078 1550440 1527625 1454764 1408193 1426681 1422592
11980A422592o4581r19k8877j0817N624J9382K9194j9780l966M4093O853k3479
$$ 1422592 1358011 1357092 1328215 1317398 1323022 1342404 1371598 1351818 1347852 1391945 1398798 1375319
11968A375319k8967n4384J3061k0481k3495K136m4717r829O3034k7381k1713n179
$$ 1375319 1346352 1291968 1305029 1284548 1261053 1263189 1218472 1208643 1271677 1244296 1222583 1217404
11956A217404m6092k9885m7614K9153M3982k6351J4181M1237J4259P89l711J4347
$$ 1217404 1171312 1141427 1093813 1122966 1166948 1140597 1154778 1196015 1210274 1211063 1207352 1221699
11944A221699j5941J5159j578R082k2203n6389q166o344m8421J0652L93L1771
$$ 1221699 1205758 1220917 1219339 1228421 1206218 1149829 1141663 1135319 1086898 1097550 1097943 1129714
11932A129714j8427l9620k3224k0942j6992j4499K6520K4195k5594m0435L6588
$$ 1129714 1111287 1071667 1048443 1027501 1010509 996010 1022530 1046725 1021131 980696 1017284
11921A017284P3515L5617m2529m2829m1470N273o552j4184K1757j8230m485L6839
$$ 1017284 1090799 1126416 1083887 1041058 999588 1004861 998309 984125 1005882 987652 983167 1020006
11909A020006j2988L037l7929k9923m441k3061j8535k7241K8452J0100k5845K6219
$$ 1020006 1007018 1010055 972126 942203 937762 914701 896166 868925 897377 907477 881632 907851
11897I07851P4716P662n3747k3022P852p845m1244n1429k7847k820Q820k8570
$$ 907851 982567 990229 936482 913460 921312 913467 872223 820794 792947 790127 798947 770377
11885G70377P486L0667M3797m1285k5484J985L718J2601j9050m9206L7910N5384
$$ 770377 777863 808530 852327 811042 785558 787543 791261 803862 784812 735606 773516 828900
11873H28900L0298M7203P535o797o543p5856m7818J640k6057m0029K0424j73j1088
$$ 828900 859198 906401 913936 907139 900596 824740 776922 778562 752505 712476 732900 732727 721639
11860G21639N1338L8978k1293q1872k1235j7369k6066k0264L7366M0452J6187
$$ 721639 772977 811955 790662 708790 687555 670186 644120 623856 661222 701674 717861
11849G17861j7413m0420K4023N4994K591k1939O166o8775N613K8816M573L7396
$$ 717861 700448 660028 684051 739045 741636 719697 725863 657088 662701 691517 696090 733486
11837G33486n524q4033m1218k2901J4030K6566j610k581j9203l3002j5621J4731
$$ 733486 727962 643929 602711 579810 593840 620406 618796 616215 597012 564010 548389 563120
11825E63120P1465J7026O57k5289L0482j4756n0299m02J33n362k0353j0331L2532
$$ 563120 634585 651611 652268 626979 657461 642705 592406 592004 592137 586775 566422 556091 588623
11812E88623K5001q907p182l0637M151j5204L3702K1059Q987p4813n1007o623
$$ 588623 613624 604717 597535 566898 571049 555845 589547 610606 619593 544780 493773 487150
11800D87150O5725K2316K878M329R583l9738N481K8413o1113m7117M0171J5422
$$ 487150 552875 575191 578069 582398 591981 552243 557724 586137 525024 477907 518078 533500
11788E33500m2382O705M0745p197m2977L1734N487J3901K2188k7549k2357P152
$$ 533500 491118 497823 538568 531371 488394 520128 525615 539516 561704 534155 511798 518950
11776E18950J5865m339k4742j5537L3478L4810l1726k4632j0634J1858j0812n6280
$$ 518950 534815 530476 505734 490197 523675 558485 526759 502127 491493 503351 492539 436259
11764D36259N1089N7454n6805q018L1849Rj4274l0720J4358J3984m396l3169k2455
$$ 436259 487348 544802 487997 479979 511828 511837 497563 466843 481201 495185 490789 457620 435165
11751D35165r681N5428K8495k427k1056j2595k9620Q102J6575l6519q741L346
$$ 435165 425484 480912 509407 506980 485924 473329 443709 451811 468386 431867 423126 426472
11739D26472m1339J6803L658j4689j3365l9590J5781M2964j2996r669n070k3165
$$ 426472 385133 401936 405594 390905 377540 337950 353731 396695 383699 374030 368960 345795
11727C45795j4104j3373l2848k3889J9145M7277k978M7287K7732L010j4655k42
$$ 345795 331691 318318 285470 261581 280726 328003 325025 372312 400044 403054 388399 388157
11715C88157m2758n2572J4891L3236J9392n4215j1416K6040N595J4037j1582M174
$$ 388157 345399 292827 307718 340954 360346 306131 294715 320755 326350 340387 328805 332979
11703C32979K0943Q995L688K0910j822l7467j8599P3625L0147J0043m6686n1271
$$ 332979 353922 362917 366605 387515 385693 348226 329627 403252 433399 443442 396756 345485
11691C45485Q193M0155K6621m4811j7091l210k1932p121J6516j8177k3182q848
$$ 345485 353678 393833 420454 375643 358552 355342 333410 326289 342805 324628 301446 292598
11679B92598J7813J1736N9805j3678m8449P785m2167k9627L5016L9054n695j7258
$$ 292598 310411 322147 381952 368274 319825 327610 285443 255816 290832 329886 324191 306933
11667C06933k3860K5273r744R767J5579K7864K3839k3099n283m580j0931j435
$$ 306933 283073 308346 298602 308369 323948 351812 375651 352552 347269 342689 331758 330323
11655C30323J5005m12m3148k7208J9114J6463J7365l1369n8368R334J2614J0921
$$ 330323 345328 344916 301768 274560 293674 310137 327502 296133 237765 247099 259713 270634
11643B70634M9357J0248j0582K6526k6627k9939n6450M363L8735j3983L2339k1748
$$ 270634 319991 330239 319657 346183 319556 289617 233167 237530 276265 262282 294621 272873
11631B72873k0607L3956j9913j4049J6353l1748l1107K1996L8178M5288L6549
$$ 272873 252266 286222 266309 252260 268613 236865 205758 227754 265932 311220 347769
11620C47769N2065q5059p1971j5238M9177l9476p5516N04N4778M71Q056J9687
$$ 347769 399834 314775 242804 227566 276743 237267 161751 162255 217033 217504 225560 245247
11608B45247r254j734j4159R65J8453N445j8612l2800M6594P37P984K7625P740
$$ 245247 235993 234259 220100 221065 239518 244963 226351 193551 240145 240882 248866 276491 284231
11595B84231l3601l6060j8874J3988J3702l128l5736j9113L5868M1196K0051n2284
$$ 284231 250630 214570 195696 209684 223386 220258 184522 165409 201277 242473 262524 210240
11583B10240J918r537l2145J0534K1096l0787M17N7265K5059l8687K402r142n3417
$$ 210240 212158 202621 170476 181010 202106 171319 171736 229001 254060 215373 217775 208633 155216
11570A55216J5095L1751J7343K9780J608J025l5311k3309O775J3083j7732m3324
$$ 155216 170311 202062 219405 249185 250793 251818 216507 193198 199973 213056 195324 152000
11558A52000J9660j687L1036R743k1530j1615K2659k953J2382n18J1027l0803
$$ 152000 171660 169973 201009 210752 189222 177607 200266 197313 209695 209177 220204 189401
11546A89401k4469N298L786l1756J0863J847J4139J7008j4385N0682M4290l8021
$$ 189401 164932 170230 174016 142260 153123 154970 169109 186117 171732 222414 266704 228683
11534B28683j0582j9716k0339J6756J7743R847p3524l0282M9823R6652j728j7029
$$ 228683 218101 198385 178046 194802 212545 222392 148868 118586 168409 265061 263333 246304
11522B46304J0664l0304n0883l3209J7693L683j8625j6751o502l070L0691J8685
$$ 246304 256968 226664 175781 142572 160265 163948 145323 128572 122070 119000 149691 168376
11510A68376o68L0067j6742n8728R716L7118j5110K2193M8684J4043j4243k1154
$$ 168376 167708 197775 181033 122305 132021 169139 154029 176222 224906 238949 224706 203552
11498B03552o9907K2267J1111J6765R566j4112k4715j2225M078n949m8305l6444
$$ 203552 133645 155912 167023 183788 193354 179242 154527 142302 146380 140431 92126 55682
11486E5682L2254O8807J2522N934K6247j800k9072J2363j8155L5824L929m9987
$$ 55682 87936 156743 169265 175199 201446 199646 170574 182937 164782 200606 204535 154548
11474A54548l5524K553O775j3862L5757j0932j5937J7497Q7J0565q64j5697m876
$$ 154548 119024 121577 128352 114490 150247 139315 123378 140875 140962 151527 150663 134966 130090
11461A30090k2260k6274J4669K1819J4294N523L1645j5590j7349J563j9568N1393
$$ 130090 107830 81556 96225 118044 132338 137861 169506 153916 136567 138130 118562 169955
11449A69955K6206p333J0992m5364k2964r457m8285K4234L0009j848o943j2772
$$ 169955 196161 188828 199820 154456 131492 122035 73750 97984 127993 126145 119202 106430
11437A06430j6409J2611K2714j7688N0878M6967J8771k4846k7559k0684m963n348
$$ 106430 90021 102632 125346 107658 158536 205503 224274 199428 171869 151185 146222 140874
11425A40874l6793l3246n8403O0332O4512o55l6023O923K8658P420j6936j6699
$$ 140874 104081 70835 12432 72764 137276 136621 100598 107521 136179 143599 126663 109964
11413A09964N5242J5829n802k9238l3520J9167o301o7825J9964N641M434K2477
$$ 109964 165206 181035 175233 145995 112475 131642 125341 57516 77480 83121 87555 110032
11401A10032L3647L7157n934j6897K9207l151k6192m8255l7319K8432P29N238
$$ 110032 143679 180836 174902 158005 187212 184061 157869 109614 72295 100727 101456 106694
11389A06694N6566k085J0475l8945m2302l0214j3763J5017l455j6592J2019J4704
$$ 106694 163260 161175 171650 132705 90403 60189 46426 61443 57988 41396 53415 68119
11377F8119J2081k766k4952J8467J8951O294M688n211k4407J0895j427j8953M0574
$$ 68119 80200 77434 52482 70949 89900 96194 100882 95671 71264 82159 80732 61779 102353
11364A02353K5630k7753m9207o104o346m1191L593N6895M4312K6867M977k8840
$$ 102353 127983 100230 51023 44919 38573 -2618 975 57870 102182 129049 134026 105186
11352A05186q658o223j9933m1673N5107L4971J119M658J7418n2229k8210L3272
$$ 105186 96528 90305 70372 28699 83806 118777 119896 124554 141972 89743 61533 94805
11340I4805l706K485O886j1485m5056m0656J9617L309N9164J9593k1433K3061
$$ 94805 91099 93584 100470 88985 43929 3273 22890 26199 85363 104956 83523 106584
11328A06584J5415k710n4115m5224K6928L7502m9387O579j874K7187M4189r2218
$$ 106584 121999 119289 65174 19950 46878 84380 34993 41572 39698 66885 111074 18856
11316A8856n0175j0397K3963L2847J07555L7846j3663o5854m4378R55j1327N721
$$ 18856 -31319 -41716 -17753 15094 122649 160495 146832 80978 36600 37555 26228 31949
11304C1949M7086J3453N83n6928l6005j0696J10M6120K4344J8589k6139p80j4807
$$ 31949 79035 92488 93071 36143 138 -10558 -10448 35672 60016 78605 52466 51686 36879
11291C6879J0006K6304L2572J0404l2599l1434O689l1159J6127J2725K5578L146
$$ 36879 46885 73189 105761 116165 83566 52132 58821 27662 43789 56514 82092 85238
11279H5238l8364m6522k2894L3868K4954m4920J966k1782P633K2689L221m8100
$$ 85238 46874 352 -22542 11326 36280 -8640 -6674 -28456 -20823 1866 5087 -43013
11267d3013j7144J1036R670N4437Q253j8687k6039r874K8994O580j7492J6357
$$ -43013 -60157 -49121 -39451 14986 23239 4552 -21487 -31361 -2367 4213 -13279 3078
11255C078J5598k924J9072j3023j90l1501j122k4966j0029N0875J7614K7456M8596
$$ 3078 18676 15752 34824 21801 21611 -9890 -11012 -35978 -46007 4868 22482 49938 98534
11242I8534r056M3906N878m6642o1630J0393J2336P704q974k4993L485M3533j484
$$ 98534 89478 133384 139262 92620 30990 41383 53719 61423 52449 27456 30941 74474 72990
11229G2990o0616k4538o966l1853K676N0427M193J1342l2138O676J5703K643K0792
$$ 72990 12374 -12164 -19130 -50983 -48307 2120 6313 17655 -14483 -7807 7896 10539 31331
11216C1331N4164K1950j2232q0600K6701k0596M4996J7441j8131M359k3440o466
$$ 31331 85495 107445 95213 14613 41314 20718 65714 83155 65024 69383 45943 39477
11204C9477M6811j9472m1849k2306m1081L6667L7086J7896r028J2937L934L626
$$ 39477 86288 66816 24967 2661 -38420 -1753 35333 53229 44201 57138 61072 64698
11192F4698j1622n992j2588k2439O4614Q563o1562o0691K5829n282j7899N7638
$$ 64698 53076 47084 34496 12057 76671 85234 23672 -37019 -11190 -16472 -34371 23267
11180B3267L3147l9126p7148L2483L6830j7815K4362K4733K3232k6421K4318n3312
$$ 23267 56414 17288 -59860 -27377 9453 -8362 16000 40733 63965 37544 61862 8550
11168H550m0252n7345K2947J8602j4775K9549L1508K2450j975j5733L9302j7485
$$ 8550 -31702 -89047 -66100 -47498 -62273 -32724 -1216 21234 19259 3526 42828 25343
11156B5343m4111j1287P108m57N459k223J0780Q076K3483m855k0793J7925Q0161
$$ 25343 -18768 -30055 -22947 -23404 -17945 -20168 -9388 -1312 22171 17316 -3477 14448 94609
11143I4609j3875j7680J6038o1689k3829l798j7188j7984j5336O764M1259J4103
$$ 94609 80734 63054 79092 17403 -6426 -10224 -27412 -45396 -60732 -53968 -12709 1394
11131A394M0265j1597m9393R116J5415N0732J2112p032n3814k576k2432n1873
$$ 1394 41659 30062 -19331 -10215 5200 55932 68044 61012 7198 4622 -17810 -69683
11119f9683r0K5286L3063K5921m775j0577M7374K9080l2051l1777j3483k0241
$$ -69683 -69773 -44487 -11424 14497 9722 -855 46519 75599 43548 11771 -1712 -21953
11107b1953p022k1132J1581M7988Q247n4669l6076K5922M7425k532j74n6402k7552
$$ -21953 -28975 -50107 -38526 9462 17709 -36960 -73036 -47114 311 -2221 -2395 -58797 -86349
11094h6349J7581K8434M9090L5209k3111R67j3358q153K2477l2134l0347k4884
$$ -86349 -68768 -40334 8756 43965 20854 21821 8463 310 22787 -9347 -39694 -64578
11082f4578k4450K9110M5348n777l1310j0349L6485J6578o414K3723L0468R691
$$ -64578 -89028 -59918 -14570 -20347 -51657 -62006 -25521 -8943 -15357 8366 38834 48525
11070D8525J283j0422m7008k944M8374K2J36k3044n032K6252M0691l81o706K7830
$$ 48525 49808 39386 -7622 -10566 37808 37830 37966 14922 9890 36142 76833 76452 69746 97576
11056I7576j5201l4442m8287l3763K1803L5729K8569k7219k8311N590m259m6548
$$ 97576 82375 47933 -354 -34117 -12314 23415 51984 24765 -3546 2044 -2215 -48763
11044d8763j1048K3656L3090j6562q896M59N9864L2420K490K2091Q375j9401j7493
$$ -48763 -59811 -36155 -3065 -19627 -28523 -28064 31800 64220 66710 88801 97176 77775 60282
11031F0282m3974k5192L750J4874K561k9070l158k9389l2342L4002L9273o382
$$ 60282 16308 -8884 -5134 9740 12301 -16769 -19927 -49316 -81658 -47656 -8383 -14765
11019a4765q169j3025N2099N2690L813L07k4686m3076K2895P626l3027l9263J1586
$$ -14765 -22934 -35959 16140 68830 72643 72950 48264 5188 28083 35709 2682 -36581 -24995
11006b4995j8767J6244j9596m022J4466j3519k2974N003R675o728L643N629N4137
$$ -24995 -43762 -27518 -47114 -51136 -36670 -50189 -73163 -68160 -58485 -65213 -61570 -55941 -1804
10993a804L940r546j0425J0342N5340L3374l7157q630r263j0123m7389N146Q203
$$ -1804 2136 -7410 -17835 -7493 47847 81221 44064 35434 26171 16048 -31341 -26195 -17992
10980a7992Q405L776M280L343k062K6892K0878l4288k8895O197Q29P247o591P398
$$ -17992 -9587 -5811 -1531 1812 -250 26642 47520 13232 -15663 -9466 -8637 -1390 -7981 -583
10966e83j9318N547K2584k6659k7453K1048L4474L17j2462k2317K1132o162M4610
$$ -583 -19901 -14354 8230 -18429 -45882 -24834 9640 9957 -2505 -24822 -3690 -9852 34758
10953C4758L9777J6490m6993m3344m3619K702J1087N010m3572k1895J4211O0615
$$ 34758 74535 91025 44032 688 -42931 -40229 -29142 -24132 -67704 -89599 -75388 -14773
10941a4773L032l0598j7437O120K4314K1255j7821m0435l2183M3473J4289m5953
$$ -14773 -11741 -42339 -59776 -53656 -29342 -8087 -25908 -66343 -98526 -55053 -40764 -86717
10929h6717q469J0699J5744j985K570j4720J1979L3171K1953M6671M3751L7736
$$ -86717 -95186 -84487 -68743 -70728 -68158 -82878 -70899 -37728 -15775 30896 74647 112383
10917A12383Q191J0689l5218q178J917l1953j8522P946P061j6061p1624r470J7671
$$ 112383 120574 131263 96045 87867 89784 57831 39309 47255 54316 38255 -33369 -42839 -25168
10904b5168l6199L4391J2376J7984N7000k4436m4389K7113k26J0378l7513o5391
$$ -25168 -61367 -26976 -14600 3384 60384 35948 -8441 18672 18446 28824 -8689 -74080
10892g4080L4304N0739j6527J1849K2995k1490k1975N5024J7958M4099R047r2100
$$ -74080 -39776 10963 -5564 6285 29280 7790 -14185 40839 58797 102896 111943 19843
10880A9843o6104O5654J9571l9175j2760k7403j3156N1962J6496K0038o0049K4744
$$ 19843 -46261 19393 38964 -211 -12971 -40374 -53530 -1568 14928 34966 -25083 -339
10868c39N5155j3888N623m0722j0405m894q319L2123M001m444J9381l3471j6380
$$ -339 54816 40928 46551 5829 -4576 -9470 -17789 14334 18335 13891 33272 -199 -16579
10855a6579J708K3681o01l5060L9985L7271j7215J4202n1295m1285J4851k2482
$$ -16579 -14871 8810 8209 -26851 13134 50405 33190 47392 -3903 -45188 -30337 -52819
10843e2819Q720L0900J8061l553N185k9516J3350n432m4241J072K8833Q553J494
$$ -52819 -44099 -13199 4862 1309 6494 -23022 -9672 -15104 -59345 -58273 -29440 -20887 -19393
10830a9393j5209l0277o416J9832j2684N3595L0683k828j9301j6760m4558o966
$$ -19393 -34602 -64879 -71295 -51463 -64147 -10552 20131 17303 -1998 -18758 -63316 -70282
10818g0282L6329M7039M3599J4497k3494P620J6633k2967K4768m0123o6725j3619
$$ -70282 -33953 13086 56685 71182 47688 55308 71941 48974 73742 33619 -33106 -46725
10806d6725K9545K4265j9091K1324r489m78K273J6687L7298O3385L8216p1433
$$ -46725 -17180 7085 -12006 9318 -171 -649 1624 18311 55609 118994 157210 85777
10794H5777m5462k5718J4438Q497n288q313j2922L0863k0222k3460q660M5736
$$ 85777 40315 14597 29035 37532 32244 23931 11009 41872 21650 -1810 -10470 35266
10782C5266L775o0728P322r749K2759L5609j2333j6455K8251k1332p4201M599
$$ 35266 39041 -21687 -14365 -24114 -1355 34254 21921 5466 33717 12385 -61816 -57217
10770e7217Q165K6611J7981j9969L0126k8516J0991o285j0563j0406l6298J8272
$$ -57217 -49052 -22441 -4460 -24429 5697 -22819 -11828 -18113 -28676 -39082 -75380 -57108
10758e7108n206J2824P604m130M4372P8021m2541p218m4431j4519o471j7693j7038
$$ -57108 -62314 -49490 -41886 -46016 -1644 76377 33836 26618 -17813 -32332 -38803 -56496 -73534
10745g3534k6669j8109L793N0113K5981j778M7539P595K9147R423q946j3392l2373
$$ -73534 -100203 -118312 -114519 -64406 -38425 -40203 7336 14931 44078 53501 44555 31163 -1210
10732a210p349K466j5001M934o051N115J3516j4845L5028K9272K4722N841n88
$$ -1210 -8559 -6093 -21094 -16160 -22211 -17096 -3580 -18425 16603 45875 70597 76438 75850
10719G5850n1016j1875N6242n434l8934m2660N623J4130m9303k260j435M1511
$$ 75850 24834 12959 69201 63767 24833 -17827 -12204 1926 -47377 -49637 -51072 -9561
10707i561m0497k8600L436J8256O432J1725k3919q731l3436m259J8559j3993J6716
$$ -9561 -50058 -78658 -75222 -56966 -50534 -38809 -62728 -71459 -104895 -109154 -90595 -104588 -87872
10694h7872n982K6599N0893L7617k1994m952Q387j5967k2634k1520L4172K7731
$$ -87872 -93854 -67255 -16362 21255 -739 -5691 2696 -13271 -35905 -57425 -23253 4478
10682D478j271n2260P979N1306K2371m60l0929q077k3176j0453l0570o393J3143
$$ 4478 3207 -49053 -41074 10232 32603 32143 1214 -6863 -30039 -40492 -71062 -77455 -64312
10669f4312K3967R679R293K2074L6949o176r1429k9067K1534J1180o174k8813
$$ -64312 -40345 -30666 -21373 701 37650 31474 -59955 -89022 -67488 -56308 -62482 -91295
10657i1295j1133K066J1487j3484K3338j334L183L5511K6306k7487m4845n3406
$$ -91295 -102428 -100362 -88875 -102359 -79021 -80355 -77172 -41661 -15355 -42842 -87687 -141093
10645a41093L8738L1369K8563J3807l0414j7965K6354M8597J8215q228M4875M9831
$$ -141093 -102355 -70986 -42423 -28616 -59030 -76995 -50641 -2044 16171 7943 52818 102649
10633A02649o5826o4790n2369N0117J1400k1419L578k4065j0855J809K5572n209
$$ 102649 36823 -27967 -80336 -30219 -18819 -40238 -36660 -60725 -71580 -69771 -44199 -49408
10621d9408K8908R615L1712N181N735l852n137j3157p18j2354j1701K5719J1511
$$ -49408 -20500 -10885 20827 26008 31743 27891 22754 9597 8879 -3475 -15176 10543 22054
10608B2054P377L8543k926k1540p6702j8598M7885m146n0945K065N0878k2281
$$ 22054 29431 67974 65048 43508 -33194 -51792 -3907 -8053 -58998 -56933 -6055 -28336
10596b8336j456L2231J6749l1169k8789k6427j9334l3559J5394N7009J6412O381
$$ -28336 -29792 2439 19188 -11981 -40770 -67197 -86531 -120090 -104696 -47687 -31275 -24894
10584b4894j629J0956L249K56o194L534k3017M282j4630j6896R828j7525K7341
$$ -24894 -26523 -15567 -12318 -12062 -18256 -14722 -37739 -33457 -48087 -64983 -55155 -72680 -45339
10571d5339L7431k5218J0641K4326P646j1174j5764K3567N7667n447j0727k7931
$$ -45339 -7908 -33126 -22485 1841 9487 -1687 -17451 6116 63783 58336 47609 19678
10559A9678j4001k0583J8472L7942p664K2522L4984m6076m6545N3389M6907P562
$$ 19678 5677 -14906 3566 41508 33844 56366 91350 45274 -1271 52118 99025 106587
10547A06587j1777m2134m6574j5179k1031N2418M379j5319k0168l157j7033M1946
$$ 106587 94810 52676 6102 -9077 -30108 22310 26689 11370 -8798 -11955 -28988 12958
10535A2958L3445K481j3922J4598k1630j4353j6722k3198o174P669k313j8430
$$ 12958 46403 48884 34962 49560 27930 13577 -3145 -26343 -32517 -24848 -27161 -45591
10523d5591j1368K5036k735j3389M878M5290J9667n3818n170K2365k5575n5855
$$ -45591 -56959 -31923 -34658 -48047 -43169 2121 21788 -32030 -37200 -14835 -40410 -96265
10511i6265p4520M5741M6350N3584L4925p399L203J4568M674j5795q308l7024
$$ -96265 -170785 -125044 -78694 -25110 9815 2416 5619 20187 24861 9066 758 -36266
10499c6266m979k9002k6274K9098N0846J5409K5579j8854k7537K8228o174L4646
$$ -36266 -41245 -70247 -96521 -67423 -16577 -1168 24411 5557 -21980 6248 74 34720
10487C4720Q946j9898l4685n3700N421L3181Q90l1986j4707m810J8707p089k4619
$$ 34720 43666 23768 -10917 -64617 -59196 -26015 -25125 -57111 -71818 -76628 -57921 -65010 -89629
10474h9629M8735L5224M1513K5845N839m077n1142j6072J0429o9480k2480M0613
$$ -89629 -40894 -5670 35843 61688 67527 63450 12308 -3764 6665 -62815 -85295 -44682
10462d4682R172m8801j3627M971L8712K6348L272k5325L4958J2567k5395j3088
$$ -44682 -35510 -84311 -97938 -92967 -54255 -27907 -24635 -49960 -15002 -2435 -27830 -40918
10450d0918K0948k3250j7441M2118O430j1450L7294m4775l2651l292J7271J9603
$$ -40918 -19970 -43220 -60661 -18543 -12113 -23563 13731 -31044 -63695 -66987 -49716 -30113
10438c0113p213j3858N8485K4432k1882l2470L0594M3117k5760k5654j1701j7343
$$ -30113 -37326 -51184 7301 31733 9851 -22619 7975 51092 25332 -322 -12023 -29366
10426b9366m6416l3510P4456N2113o2885K598M4300K5242K1985l6989K0827r841
$$ -29366 -75782 -109292 -34836 17277 -45608 -43010 1290 26532 48517 11528 32355 22514
10414B2514k8018J212o303m3453l1296k2475l603K4757N4701O0151L3926k8781
$$ 22514 -5504 -4292 -10595 -54048 -85344 -107819 -111422 -86665 -31964 28187 62113 33332
10402C3332k8514J4337K5497K4168P251J6671j6596M431q7501j3347j6666k3467
$$ 33332 4818 19155 44652 68820 76071 92742 76146 80577 -6924 -20271 -36937 -60404
10390f0404N41K6104L9276K2304K7475l3087l8989M4942k7443K3121K1839l4887
$$ -60404 -59863 -33759 5517 27821 55296 22209 -16780 28162 719 23840 45679 10792
10378A0792J8125J4231J1145L979P9M7900J1527k2698J643j9456k1234j7291l9918
$$ 10792 28917 43148 54293 58272 58351 106251 117778 95080 96723 77267 56033 38742 -1176
10365a176l038k4663m3433L2216j14JJ579K4318M4012L979M014q988j3060j983
$$ -1176 -4214 -28877 -72310 -40094 -40208 -40207 -38628 -14310 29702 33681 37695 28707 15647 13664
10351A3664o0487J0900K5537o0806j1926P141J4474J6651M211J9624L1715m1719
$$ 13664 -46823 -35923 -10386 -71192 -83118 -75977 -61503 -44852 -40641 -21017 10698 -31021
10339c1021l9875J3062L2639J6513m6195m3070P1045K9739j9964j0664K0481K8547
$$ -31021 -70896 -57834 -25195 -8682 -54877 -97947 -26902 2837 -17127 -27791 -7310 21237
10327B1237o8605k1037M0627K2233m0181L3746Q832L287M471M783J7846o1480
$$ 21237 -47368 -68405 -27778 -5545 -45726 -11980 -3148 139 4610 9393 27239 -34241
10315c4241L2223M7147K5999Q658j8305n1275n7682m4154L2889K7981k0351p013
$$ -34241 -2018 45129 71128 79786 61481 10206 -47476 -91630 -58741 -30760 -51111 -58124
10303e8124L3367K2824l0417r828J6960J8752R651n3475L7090R5609m7256n5050
$$ -58124 -24757 -1933 -32350 -42178 -25218 -6466 3185 -50290 -13200 82409 35153 -19897
10291a9897L6552J2749J7499m4878J9248k7126k4117L6277q748m2148M3132m394
$$ -19897 16655 29404 46903 2025 21273 -5853 -29970 6307 -2441 -44589 -1457 -5851
10279e851k4166L3214j830K5j367n325m059J0028l095K2237j9831l2837j8441
$$ -5851 -30017 3197 1367 1392 25 -5300 -9359 669 -2426 19811 -20 -32857 -51298
10266e1298J6349k3992O291p418M3390J815k5777J5316N221j3517M6417J2586
$$ -51298 -34949 -58941 -52650 -60068 -16678 -14863 -40640 -25324 -20103 -33620 12797 25383
10254B5383l1036m8209L096L3466J8818j8399k3514m3497j7067J4134m562K3247
$$ 25383 -5653 -53862 -50766 -17300 1518 -16881 -40395 -83892 -100959 -86825 -91387 -68140
10242f8140m733r519N760m2374l8969M6269P1203l1215l3467M0790O1024J7555
$$ -68140 -72873 -82392 -76632 -119006 -157975 -111706 -40503 -71718 -105185 -64395 -3371 14184
10230A4184Q068J6197o7095k0855J3324Q443J7706j0163l1935K4168j2500j3479
$$ 14184 22252 38449 -28646 -49501 -36177 -27734 -10028 -20191 -52126 -27958 -40458 -53937
10218e3937j5439m390k574j7281L7617k039l738j6084K160K3917j1643j5668O543
$$ -53937 -69376 -73766 -76340 -93621 -56004 -58043 -61781 -77865 -75705 -51788 -63431 -79099 -72556
10205g2556L742N0040M1143L0232j6476n7059l740L5234m1271k5147J0302L5280
$$ -72556 -68814 -18774 22369 52601 36125 -20934 -24674 10560 -30711 -55858 -45556 -10276
10193a0276k4679m2675K5J4048m50N4347j2366j0379L4423j0535O124L3544n729
$$ -10276 -34955 -77630 -77605 -63557 -64007 -9660 -22026 -32405 2018 -8517 -2393 31151 25422
10180B5422k7208K8339l022j8430K725m4687J0667L7757m4599J4584O5285K6935
$$ 25422 -1786 26553 23531 5101 7826 -36861 -26194 11563 -33036 -18452 46833 73768
10168G3768j7827l2795k0693K1992L4028J3572l9873p4273j151M8093m1011K9869
$$ 73768 55941 23146 2453 24445 58473 72045 32172 -42101 -43252 4841 -36170 -6301
10156f301K9581l0564l3415O062J1505M2351k322n9549l1267J0393M9793k2451
$$ -6301 23280 -7284 -40699 -34637 -23132 19219 16897 -42652 -73919 -63526 -13733 -36184
10144c6184L069r085j0901k2460M0458l9636j4182N0860L1496K9179n8887k8432
$$ -36184 -33115 -42200 -53101 -75561 -35103 -74739 -88921 -38061 -6565 22614 -36273 -64705
10132f4705j0885J9326j4687l6934K1717L4665L5859o887M601J8572j2170J792
$$ -64705 -75590 -56264 -70951 -107885 -86168 -51503 -15644 -22531 -17930 642 -11528 -9736
10120i736j104k2883l486J5422j0959l0702R093O7389M8020k0146l6188k953l3684
$$ -9736 -10840 -33723 -37209 -21787 -32746 -63448 -54355 13034 61054 40908 4720 1767 -31917
10107c1917L5035N6284J2320k6215M1629l5197L123J0480j9600l2823n9154l0925
$$ -31917 3118 59402 71722 45507 87136 51939 55062 65542 45942 13119 -46035 -76960
10095g6960j9642j4889L0099J8909L5331J6324l957J2095q877N4690K2827P139
$$ -76960 -96602 -111491 -81392 -62483 -27152 -10828 -14785 -2690 -11567 43123 65950 73089
10083G3089l7997l0854M304M313K0590K6583K8760l3627J206J09l6413J8009M2695
$$ 73089 35092 4238 8542 12855 33445 60028 88788 55161 56367 56476 20063 38072 80767
10070H0767L5892R596K5417m333n9057n9956n6516J7159o49J009J741m762j3813
$$ 80767 116659 126255 151672 147339 88282 28326 -28190 -11031 -11680 -10671 -8930 -13692 -27505
10057b7505k2858m1K9882r616j0064n746M8255J3417K698O382o542O8770O2446
$$ -27505 -50363 -50404 -20522 -30138 -40202 -45948 2307 15724 18422 24804 18262 87032 149478
10044A49478j2734p2233j7868l0367l5403K485O772M492O24j2125l9502n498L1906
$$ 149478 136744 64511 46643 16276 -19127 -16642 -9870 -5378 -4754 -16879 -56381 -61879 -29973
10031b9973P721n161J3565L57J1704m337J6811P3114J6322M8422j7684n5647m5899
$$ -29973 -22252 -27413 -13848 -13491 -1787 -6124 10687 83801 100123 148545 130861 75214 29315
10018B9315n219l529l7367K7651Q3975N963j3611k1873j7389J4286j3511l2393
$$ 29315 24096 20567 -16800 10851 94826 100789 87178 65305 47916 62202 48691 16298
10006A6298m3165P775K4445L2818l4401j8134J2597K4233L3145L3251j1614k0669
$$ 16298 -26867 -19092 5353 38171 3770 -14364 -1767 22466 55611 88862 77248 56579
9994E6579k585p321j9963q1992K2407M8283k85k013Q534l4918Q040p195N027j022
$$ 56579 53994 46673 26710 -55282 -32875 15408 15123 13110 21644 -13274 -5234 -12429 -7402 -8424
9980h424R315L0561N820J5341j5613m5409L565J2946k6950K8892l600k2776k9431
$$ -8424 891 31452 37272 52613 37000 -8409 -4844 8102 -18848 10044 6444 -16332 -45763
9967d5763J9844M1302O009k8996j8195K6657J5883J6505K9123j1805n9789J1494
$$ -45763 -25919 15383 21392 -7604 -25799 858 16741 33246 62369 50564 -9225 2269
9955B269L106L9528J9287k727o4805q019j7823J3256J8708l3047j06J8576K2204
$$ 2269 5375 44903 64190 61463 -3342 -11361 -29184 -15928 2780 -30267 -30373 -11797 10407
9942A0407N0582j6803o8758Q705M7057L7357J0931l0650k4808j0193l9255p197
$$ 10407 60989 44186 -24572 -15867 31190 68547 79478 48828 24020 13827 -25428 -32625
9930c2625M6186L9612J87j9616j4634M497L936L7935K2830J0187k8517L8590J5817
$$ -32625 13561 53173 53360 33744 19110 23607 27543 65478 88308 98495 69978 108568 124385
9917A24385J6635j5255R583k9122k1409M1517L4533R407J8933K3730o15O202n573
$$ 124385 141020 125765 135348 106226 84817 126334 160867 170274 189207 212937 212322 218524 212951
9904B12951l4964K5109M4287m061L3117K3812m455k5499K6383L6246k0974O37
$$ 212951 177987 203096 247383 243322 276439 300251 295796 270297 296680 332926 311952 312589
9892C12589P758O1521O1818K9673K0456R0815J37864J67072K31104L38904N21058
$$ 312589 320347 381868 443686 473359 493815 584630 722494 889566 1120670 1459574 1980632
9881A980632Q27686J122942J311968J219598J068454J082196J019120N77364n05389
$$ 1980632 2808318 3931260 5243228 6462826 7531280 8613476 9632596 10209960 9704571
9872I704571j759461k324585j908694j176589o36339l57859k47675j51490j69469
$$ 9704571 7945110 5620525 3711831 2535242 1898903 1541044 1293369 1141879 972410
9863I72410j16934p9940r9062p3877l3924J7239l8887p1939k7598j6898o753m9812
$$ 972410 855476 775536 676474 602597 568673 585912 547025 475086 447488 430590 423837 374025
9851C74025m7204J4384L2192j5666n1192k0827k9847j1861k3215k1943j9411k1684
$$ 374025 326821 341205 373397 357731 306539 285712 255865 244004 220789 198846 179435 157751
9839A57751J7337k6243J4573J9115j6288j1259P473J6373J890k0598l7875j8250
$$ 157751 175088 148845 163418 182533 166245 154986 162459 178832 180722 160124 122249 103999
9827A03999p704j2513P882M551j3277l035k6824J8951K0159n8206N170J9845J3627
$$ 103999 96295 83782 91664 96215 82938 79903 53079 72030 92189 33983 39153 58998 72625
9814G2625L8406L1985k4994n509n8542K4155k6223l8742M1873n8937q593N06m1584
$$ 72625 111031 143016 118022 112513 53971 78126 51903 13161 55034 -3903 -12496 -11990 -53574
9801e3574j9500M5376J3125N8075N0636j7511l4113k1716m1041L7077j8036j8473
$$ -53574 -73074 -27698 -14573 43502 94138 76627 42514 20798 -20243 16834 -1202 -19675
9789a9675k8338K6790L2842j5016Q727l0778K459J368J769n026k0327M8k3656
$$ -19675 -48013 -21223 11619 -3397 5330 -25448 -22989 -21621 -19852 -24878 -45205 -45157 -68813
9776f8813M0560L2813Q87m0794j9265j7149K7421L0203K7588L836k7652m5318
$$ -68813 -28253 4560 5447 -35347 -54612 -71761 -44340 -14137 13451 17287 -10365 -55683
9764e5683q580P6521J7039J0650o2562j7390j7610k4966K0344J7726J5699j9326
$$ -55683 -64263 12258 29297 39947 -22615 -40005 -57615 -82581 -62237 -44511 -28812 -48138
9752d8138q333r336J4700n070k1367L0244j6081n061J828j2419j3746K9545L0047
$$ -48138 -56471 -65807 -51107 -56177 -77544 -47300 -63381 -68442 -66614 -79033 -92779 -63234 -33187
9739c3187j8043K5310L1434l4720j2399J4871Q903m9566R398K5120k073R64n361
$$ -33187 -51230 -25920 5514 -29206 -41605 -26734 -17831 -67397 -57999 -32879 -34952 -33988 -39349
9726c9349j1670j9608L290K0287j7958k7007l2818P095M810p773j2029M0525L4540
$$ -39349 -51019 -70627 -67337 -47050 -65008 -92015 -124833 -117738 -112928 -120701 -132730 -92205 -57665
9713e7665J6812l4967J995j7729L810m8846L5794N3773K0829K0622pj3947k2261
$$ -57665 -40853 -75820 -73825 -91554 -87744 -136590 -100796 -47023 -26194 -5572 -5579 -19526 -41787
9700d1787p762R651n4607L012L8148J5079j4311m7082j2491j9431m2440k8130
$$ -41787 -49549 -39898 -94505 -91493 -53345 -38266 -52577 -99659 -112150 -131581 -174021 -202151
9688b02151L2920O5707M3103k441K3830N003j7652n7372K1524r017l44l4945M0275
$$ -202151 -169231 -103524 -60421 -62862 -39032 -34029 -51681 -109053 -87529 -96546 -96890 -131835 -91560
9675i1560N8405Q40m251L559N4519m0687j1855K7610K7330k5876l3673m980J3320
$$ -91560 -33155 -32315 -36566 -33007 21512 -19175 -31030 -3420 23910 -1966 -35639 -40619 -27299
9662b7299L2387M7889j8990n7696M617k7756n862j2288K5987K3036p295l0848
$$ -27299 5088 52977 33987 -23709 -19092 -46848 -52710 -64998 -39011 -15975 -23270 -54118
9650e4118j1667P338K4121J7983l6345J715l6374L5847P3117n372j9278M500L3958
$$ -54118 -65785 -58447 -34326 -16343 -52688 -50973 -87347 -51500 21617 16245 -3033 1467 35425
9637C5425J0091k1872K7687q714l6830J4725J1923L3110L9165j4352o5866m2786
$$ 35425 45516 23644 51331 42617 5787 20512 32435 65545 104710 90358 24492 -18294
9625a8294K860K6756J2071O199J9945m7239o4562l5412p286L568J272K3389J0343
$$ -18294 -15434 11322 23393 29592 49537 2298 -62264 -97676 -104962 -101394 -100122 -76733 -66390
9612f6390M8028O3515k4006K137R50K2943l7268k0182Q361k4184o298p3047j7441
$$ -66390 -18362 45153 21147 23284 24234 47177 9909 -10273 -1912 -26096 -32394 -105441 -122882
9599a22882N6700q932J8150K1130n694l3822J0540k9818k755N5676j9152J9867
$$ -122882 -66182 -75114 -56964 -35834 -41528 -75350 -64810 -94628 -97383 -41707 -60859 -40992
9587d0992J6762K8265L4101k1296K7141j3205j967K375n60m1036o0793J1713m590
$$ -40992 -24230 4035 38136 16840 43981 30776 28809 31184 30624 -10412 -71205 -59492 -64082
9574f4082n0427J5433N7780J3102M2918K9506n2921m924k6514k5298O074J1410
$$ -64082 -114509 -99076 -41296 -28194 14724 44230 -8691 -13615 -40129 -65427 -59353 -47943
9562d7943J1908J1084K225N043k27m0743j7707K0331K6105k3604k3593K4389K4129
$$ -47943 -36035 -24951 -22726 -17683 -17910 -58653 -76360 -56029 -29924 -53528 -77121 -52732 -28603
9549b8603k186l2398n698m815J2981J4675L2485k1014j7314p5698L4021M3829
$$ -28603 -30789 -63187 -68885 -73700 -60719 -46044 -13559 -34573 -51887 -127585 -93564 -49735
9537d9735m639l4198K5821K9355j2930r236j4184O281L4470J0303m126q5604n4557
$$ -49735 -54374 -88572 -62751 -33396 -46326 -55562 -69746 -63465 -28995 -18692 -22818 -108422 -162979
9524a62979N4638M4921j9669K8001K9230k9522K2459L0960k8962j8358J9799J0287
$$ -162979 -108341 -63420 -83089 -55088 -25858 -55380 -32921 -1961 -30923 -49281 -29482 -19195
9512a9195R15k403q81L0266K4733q8331j4913J5263j0263M3474K669p314j9873
$$ -19195 -18280 -20683 -21564 8702 33435 -54896 -69809 -54546 -64809 -21335 -18666 -25980 -45853
9499d5853l834l6694j8394O787K4323L9388k4871K7628K2607J181J7850k024k3333
$$ -45853 -49687 -86381 -104775 -97988 -73665 -34277 -59148 -31520 -8913 -7732 10118 8094 -15239
9486a5239j6740m124Q673L7482L0533K5811m9722l5012k8264j7914m3613l2633
$$ -15239 -31979 -36103 -27430 10052 40585 66396 16674 -18338 -46602 -64516 -108129 -140762
9474a40762N1351O1131J5734j4128k5701k5001J8066K5302L2768N6201J2179l0844
$$ -140762 -89411 -28280 -12546 -26674 -52375 -77376 -59310 -34008 -1240 54961 67140 36296
9462C6296l929N286J607L8281l9653n3176p899j8206k5928K0790O612l703K8511
$$ 36296 32367 37653 39260 77541 37888 -15288 -23187 -41393 -67321 -46531 -39919 -43622 -15111
9449a5111K4851l26J6248j1552k3363j0596L028j155k8452p684j7795k8850J4139
$$ -15111 9740 9414 25662 14110 -9253 -19849 -16821 -17976 -46428 -54112 -71907 -100757 -86618
9436h6618J2437l6628J1255K2309L5533M5972K2913j3417l4101n3835k0940N1308
$$ -86618 -74181 -110809 -99554 -77245 -41712 4260 27173 13756 -20345 -74180 -95120 -43812
9424d3812M4403L6607P652n2016j5613J7569L3539l3641j5374k9742m9960J16
$$ -43812 591 37198 44850 -7166 -22779 -5210 28329 -5312 -20686 -50428 -100388 -100272
9412a00272N9378J7886K5197O207m6798n2156p438J9502N356J3359R908p510K0396
$$ -100272 -40894 -23008 2189 8396 -38402 -90558 -97996 -78494 -73138 -59779 -49871 -57381 -36985
9399c6985O3639j7743l8073L3093N242l1544p0130Q42M8191k3331j0899q632O2430
$$ -36985 26654 8911 -29162 3931 9173 -22371 -92501 -91659 -43468 -66799 -77698 -86330 -23900
9386b3900J8532N658K6370J969j7686m2668o0092N0727P7882k5565m1920M023
$$ -23900 -5368 290 26660 28629 10943 -31725 -91817 -41090 36792 11227 -30693 -26670
9374b6670J2303K0397J2863m4782n86m305l852l4488k6009M8673L8473r666l1361
$$ -26670 -14367 6030 18893 -25889 -26475 -30780 -34632 -69120 -95129 -46456 -7983 -17649 -49010
9361d9010L2482M4649P210k9782m5635n046M695P230J6686j8378P369K650n437
$$ -49010 -16528 28121 35331 5549 -40086 -45132 -40437 -33207 -16521 -34899 -27530 -24880 -30317
9348c0317j6715J5528k9982q343J6863M7622j1693m1320k857L1485r470k6532
$$ -30317 -47032 -31504 -61486 -69829 -52966 -5344 -17037 -58357 -61214 -29729 -39199 -65731
9336f5731J3530k1244k2908R148K8992K8482k4160k3329K2570M0080r80l4795
$$ -65731 -52201 -73445 -96353 -87205 -58213 -29731 -53891 -77220 -54650 -14570 -15550 -50345
9324e0345k176J3982R568L685N049k4974q129J9965K6342L3573k844k4370m8217
$$ -50345 -52521 -38539 -28971 -25286 -20237 -45211 -53340 -33375 -7033 26540 23696 -674 -48891
9311d8891k9360N4095l698j9526N5205J8825l844J1614n658q381k7211n5002n325
$$ -48891 -78251 -24156 -27854 -47380 7825 26650 22806 34420 28762 20381 -6830 -61832 -67157
9298f7157L683L8793K3750J1146k917m2698j744Q71L7083K1193L0551k322P841
$$ -67157 -63474 -24681 -931 10215 7298 -35400 -37144 -36273 810 22003 52554 50232 58073
9285E8073K924l5857l6025R858K2083J1249K4300K2309q593j4909j1300L0998
$$ 58073 60997 25140 -10885 -1027 21056 32305 56605 78914 70321 55412 44112 75110
9273G5110K9325L392n7378K0203j558l3702k7932j8782k1110j356q703L7317M7046
$$ 75110 104435 107827 50449 70652 69094 35392 7460 -11322 -32432 -33788 -42491 -5174 41872
9260D1872P404J9914m9303k6024M7785l155l2683J7621L9022n2019m576K5543
$$ 41872 49276 69190 19887 -6137 41648 38493 5810 23431 62453 10434 5858 31401
9248C1401P189J0446l5638m4096l4592J763J0597l6056j8796J1863K3888J5376
$$ 31401 38590 49036 13398 -30698 -65290 -63527 -52930 -88986 -107782 -95919 -72031 -56655
9236e6655Q2251J7183p6741n4950R073M5319N0910N4557L2319J3430j5563m4409
$$ -56655 25596 42779 -33962 -88912 -79839 -34520 16390 70947 103266 116696 101133 56724
9224E6724l852K4659l7940L2576k1249m3486n3032J4182J6770M5199n9547j8025
$$ 56724 52872 77531 39591 72167 50918 7432 -45600 -31418 -14648 30551 -28996 -47021
9212d7021L1054j0707n046M7997M7646m20J1670j6815m0563L2579j4651j4758
$$ -47021 -15967 -26674 -31720 16277 63923 63503 75173 58358 17795 50374 35723 20965
9200B0965j5845P3186m883l2120K8934k479P009j9588j9019j1965j0646m675J4703
$$ 20965 5120 78306 73423 41303 70237 67758 74767 55179 36160 24195 13549 8874 23577
9187B3577m8939m755M9644O3747R805l2708k2835l2414k9160j0734J7223K8116
$$ 23577 -25362 -30117 19527 83274 93079 60371 37536 5122 -24038 -34772 -17549 10567
9175A0567l9497m684m891J9339O110l3294M9975L9512l1886j6789K2515k062K6680
$$ 10567 -28930 -33614 -38505 -19166 -13056 -46350 3625 43137 11251 -5538 16977 14915 41595
9162D1595m1357K5247k7108K83P0871j6374r323J0161l071n1361P48J668k6626
$$ 41595 238 25485 -1623 -1340 69531 53157 43834 53995 50924 -437 311 1979 -24647
9149b4647K4368K3064K9144L845l8195k1554j5278L693m0016k1638M5824M0729
$$ -24647 -279 22785 51929 55774 17579 -3975 -19253 -15560 -55576 -77214 -31390 9339
9137I339l2538m3559q836m016K4024N3270k7032k3286N2401k3063j4740P429J9718
$$ 9339 -23199 -66758 -75594 -79610 -55586 -2316 -29348 -52634 -233 -23296 -38036 -30607 -10889
9124a0889K7836k1429K6357j101m0128p5483j5377O2709K1446J9314J6828j7087
$$ -10889 16947 -4482 21875 20774 -19354 -94837 -110214 -47505 -26059 -6745 10083 -7004
9112g004j8212L529J5615P594l2491o238L2328N0775o708o513R538p815k4776
$$ -7004 -25216 -21687 -6072 1522 -30969 -37207 -4879 45896 39188 32675 42213 34398 9622
9099I622L082K1330l1177j5466l728n026N6369L876k8588o7609K456M7154m1452
$$ 9622 12704 34034 2857 -12609 -16337 -21363 35006 38882 10294 -57315 -54859 -7705 -49157
9086d9157q943Q569q530K809K6428K3939K3020K1807m6989p103P1139j412K0935
$$ -49157 -58100 -49531 -58061 -55252 -28824 -4885 18135 39942 -7047 -14150 56989 55577 76512
9073G6512L8578k0606k8307k3160p748j2217M1817N2098k9029j05254m8721L0521
$$ 76512 115090 94484 66177 43017 35269 23052 64869 116967 87938 -17316 -66037 -35516
9061c5516P3815L2504O1170n527o7299Q384J5709k385J7835m137J153k3807l871
$$ -35516 38299 70803 131973 126446 59147 67531 83240 80855 98690 94553 95706 71899 68028
9048F8028l2616o373J1400n0095M4043j2309j1030j1958p361q406l5913n625K4799
$$ 68028 35412 29039 40439 -9656 34387 22078 11048 -910 -8271 -16677 -52590 -58215 -33416
9035c3416J6725K7422J3855K3632q197N503l5660l6198M3465M3461L1481K3965
$$ -33416 -16691 10731 24586 48218 40021 45524 9864 -26334 17131 60592 92073 116038
9023A16038l95n0548n1618K1585K9958k3234m639K7679k2337o4735q987K1967
$$ 116038 115643 65095 13477 35062 65020 41786 37147 64826 42489 -22246 -31233 -9266
9011i266N9717L0606n1245k0829J3135k5782r286N3896L0589k4258K4679j4415
$$ -9266 50451 81057 29812 8983 22118 -3664 -12950 40946 71535 47277 71956 57541
8999E7541r468l2914n0305L0868M829Q247O1294L3404J663m172p0881m8496L0323
$$ 57541 48073 15159 -35146 -4278 551 8798 70092 103496 105159 100987 30106 -18390 11933
8986A1933L5080k9869N68K3450J6803o717J196j5959p1834l4090J3761J337J9328
$$ 11933 47013 17144 17712 41162 57965 51248 52444 36485 -35349 -69439 -55678 -54341 -35013
8973c5013K2296J296l5499l824K8410K9494O535r4203k230P081r651j4170R0842
$$ -35013 -12717 -11421 -46920 -50744 -22334 7160 13695 -80508 -82738 -75657 -85308 -99478 -8636
8960h636J5687k0033n7851k9090L7933j1284M9505L8603L2436n0870m9308l5512
$$ -8636 7051 -12982 -70833 -99923 -61990 -73274 -23769 14834 47270 -3600 -52908 -88420
$$ [...]
##END NTUPLES=NMR SPECTRUM
##END=
