##TITLE=Analysis number 322497
Compound Code cc 63616
Book Reference 470/105
Project Code adrs
Chemist Name mikem
##JCAMPDX= 6.0         $$ Bruker NMR JCAMP-DX V2.0
##DATA TYPE= NMR SPECTRUM
##DATA CLASS= NTUPLES
##ORIGIN= Bruker BioSpin GmbH
##OWNER= nmr
$$ XWIN-NMR		Version 3.5
$$ Thu Sep 28 11:56:14 2006 GMT Daylight Time (UT+1h)  MAYBRIDGE\nmr@NMR_250MHZ
##.OBSERVE FREQUENCY= 250.131544655141
##.OBSERVE NUCLEUS= ^1H
##.ACQUISITION MODE= SIMULTANEOUS (DQD)
##.ACQUISITION SCHEME= undefined
##.AVERAGES= 16
##.DIGITISER RES= 18
##SPECTROMETER/DATA SYSTEM= dpx250
##.PULSE SEQUENCE= zg30
##.SOLVENT NAME= CDCl3
##.SHIFT REFERENCE= (INTERNAL, CDCl3, 0, 16.522)
##AUDIT TRAIL= $$ (NUMBER, WHEN, WHO, WHERE, WHAT)
$$ ##TITLE= Audit trail, XWIN-NMR		Version 3.5
$$ ##JCAMPDX= 5.01
$$ ##ORIGIN= Bruker BioSpin GmbH
$$ ##OWNER= nmr
$$ C:\u/data/dgb/nmr/ADRS/1600/pdata/1/auditp.txt
$$ ##AUDIT TRAIL=  $$ (NUMBER, WHEN, WHO, WHERE, WHAT)
(   1,<2006-09-28 11:55:44.81 +100>,<MAYBRIDGE\nmr>,<NMR_250MHZ>,
      <created by zg, POWCHK disabled, PULCHK disabled
       configuration hash MD5:
       E2 DF 36 D8 04 B2 41 60 5A D7 A3 38 5A 4B D0 FE
       data hash MD5: 64K
       E6 16 A5 A9 C1 FE 9D 9F D9 85 E5 4C A6 03 41 96>)
(   2,<2006-09-28 11:56:00.70 +100>,<MAYBRIDGE\nmr>,<NMR_250MHZ>,
      <Start of raw data processing
       ef LB = 0.3 FT_mod = 6 PKNL = 1 SI = 32K 
       data hash MD5: 32K
       44 92 42 1D 66 32 F2 84 A6 00 B6 1C 23 F8 C7 20>)
(   3,<2006-09-28 11:56:02.95 +100>,<MAYBRIDGE\nmr>,<NMR_250MHZ>,
      <apk 
       data hash MD5: 32K
       E9 56 F2 B4 58 CB 5C D2 19 F9 24 07 F9 6E AB 0D>)
(   4,<2006-09-28 11:56:04.16 +100>,<MAYBRIDGE\nmr>,<NMR_250MHZ>,
      <abs ABSG = 5 
       data hash MD5: 32K
       07 8E D6 A7 F5 55 C2 1B 53 64 D7 78 C0 A1 FC F1>)
$$ ##END=
$$ 
$$ hash MD5
$$ 46 B7 C6 CF A2 57 C2 6B 65 6D F1 A8 77 0E 70 A4
##$RELAX= 
##$RELAX= 
##$RELAX= 
##$RELAX= 
##$RELAX= 
##$RELAX= 
##$RELAX= 
$$ Bruker specific parameters
$$ --------------------------
##$DU= <C:\u>
##$EXPNO= 1600
##$NAME= <ADRS>
##$PROCNO= 1
##$TYPE= <nmr>
##$USER= <dgb>
##$AMP= (0..31)
100 100 100 100 100 100 100 100 100 100 100 100 100 100 100 100 100 100 
100 100 100 100 100 100 100 100 100 100 100 100 100 100 
##$AQSEQ= 0
##$AQ_mod= 3
##$AUNM= <au_zg>
##$AUTOPOS= <39 >
##$BF1= 250.13
##$BF2= 250.13
##$BF3= 250.13
##$BF4= 250.13
##$BF5= 500.13
##$BF6= 500.13
##$BF7= 500.13
##$BF8= 500.13
##$BYTORDA= 1
##$CFDGTYP= 0
##$CFRGTYP= 5
##$CHEMSTR= <none>
##$CNST= (0..31)
1 1 145 1 1 1 1 1 1 1 1 1 1 1 1 1 1 1 1 1 1 1 1 1 1 1 1 1 1 1 1 1 
##$CPDPRG= <>
##$CPDPRG1= <>
##$CPDPRG2= <>
##$CPDPRG3= <>
##$CPDPRG4= <mlev>
##$CPDPRG5= <mlev>
##$CPDPRG6= <mlev>
##$CPDPRG7= <mlev>
##$CPDPRG8= <mlev>
##$CPDPRGB= <>
##$CPDPRGT= <>
##$D= (0..31)
0 1 0 0 0 0 0 0 0 0.06 0 0 0 0 0 0 0.0002 0 0 0 0 0 0 0 0 0 0 0 0 0 0 
0 
##$DATE= 1159440943
##$DBL= (0..7)
120 120 120 120 120 120 120 120 
##$DBP= (0..7)
150 150 150 150 150 150 150 150 
##$DBP07= 0
##$DBPNAM0= <>
##$DBPNAM1= <>
$$ [...]
##$SUBNAM6= <"">
##$SUBNAM7= <"">
##$SUBNAM8= <"">
##$SUBNAM9= <"">
##$SW= 20.6930455092707
##$SWIBOX= (0..15)
0 0 3 0 0 0 0 0 0 0 0 0 0 0 0 0 
##$SW_h= 5175.983436853
##$TD= 65536
##$TD0= 1
##$TE= 296.16
##$TE2= 300
##$TE3= 300
##$TEG= 300
##$TL= (0..7)
0 120 120 120 120 120 120 120 
##$TP= (0..7)
150 150 150 150 150 150 150 150 
##$TP07= 0
##$TPNAME0= <>
##$TPNAME1= <>
##$TPNAME2= <>
##$TPNAME3= <>
##$TPNAME4= <>
##$TPNAME5= <>
##$TPNAME6= <>
##$TPNAME7= <>
##$TPOAL= (0..7)
0.5 0.5 0.5 0.5 0.5 0.5 0.5 0.5 
##$TPOFFS= (0..7)
0 0 0 0 0 0 0 0 
##$TUNHIN= 0
##$TUNHOUT= 0
##$TUNXOUT= 0
##$USERA1= <user>
##$USERA2= <user>
##$USERA3= <user>
##$USERA4= <user>
##$USERA5= <user>
##$V9= 5
##$VALIST= <valist>
##$VCLIST= <CCCCCCCCCCCCCCC>
##$VD= 0
##$VDLIST= <DDDDDDDDDDDDDDD>
##$VPLIST= <PPPPPPPPPPPPPPP>
##$VTLIST= <TTTTTTTTTTTTTTT>
##$WBST= 1024
##$WBSW= 4
##$XGAIN= (0..3)
0 0 0 0 
##$XL= 0
##$YL= 0
##$YMAX_a= 416203
##$YMIN_a= -562714
##$ZGOPTNS= <>
##$ZL1= 120
##$ZL2= 120
##$ZL3= 120
##$ZL4= 120
##$ABSF1= 16.522
##$ABSF2= -4.171173
##$ABSG= 5
##$ABSL= 3
##$ALPHA= 0
##$AQORDER= 0
##$ASSFAC= 0
##$ASSFACI= 0
##$ASSFACX= 0
##$ASSWID= 0
##$AUNMP= <proc_1d>
##$AZFE= 0.1
##$AZFW= 0.1
##$BCFW= 0
##$BC_mod= 0
##$BYTORDP= 0
##$COROFFS= 0
##$CY= 12.5
##$DATMOD= 1
##$DC= 0
##$DFILT= <>
##$DTYPP= 0
##$F1P= 14.0000005364418
##$F2P= -0.99999901652339
##$FCOR= 0.5
##$FTSIZE= 32768
##$FT_mod= 6
##$GAMMA= 0
##$GB= 0
##$INTBC= 1
##$INTSCL= 1
##$ISEN= 128
##$LB= 0.3
##$LEV0= 0
##$LPBIN= 0
##$MAXI= 10000
##$MC2= 0
##$MEAN= 0
##$ME_mod= 0
##$MI= 0
##$NCOEF= 0
##$NC_proc= -4
##$NLEV= 6
##$NOISF1= 0
##$NOISF2= 0
##$NSP= 0
##$NTH_PI= 0
##$NZP= 0
##$OFFSET= 16.522
##$PC= 1
##$PHC0= 151.7208
##$PHC1= 2.8737
##$PH_mod= 1
##$PKNL= yes
##$PPARMOD= 0
##$PSCAL= 4
##$PSIGN= 0
##$REVERSE= no
##$SF= 250.13
##$SI= 32768
##$SIGF1= 0
##$SIGF2= 0
##$SINO= 400
##$SIOLD= 32768
##$SREGLST= <1H.CDCl3>
##$SSB= 0
##$STSI= 32768
##$STSR= 0
##$SW_p= 5175.98343685301
##$SYMM= 0
##$S_DEV= 0
##$TDeff= 65536
##$TDoff= 0
##$TI= <Analysis number 999999
Compound Code 99
Book Reference 9
Project Code 9>
##$TILT= no
##$TM1= 0
##$TM2= 0
##$TOPLEV= 0
##$USERP1= <user>
##$USERP2= <user>
##$USERP3= <user>
##$USERP4= <user>
##$USERP5= <user>
##$WDW= 1
##$XDIM= 32768
##$YMAX_p= 304182581
##$YMIN_p= -390739
$$ End of Bruker specific parameters
$$ ---------------------------------
##NTUPLES= NMR SPECTRUM
##VAR_NAME=  FREQUENCY,     SPECTRUM/REAL,   SPECTRUM/IMAG
##SYMBOL=    X,             R,               I
##VAR_TYPE=  INDEPENDENT,   DEPENDENT,       DEPENDENT
##VAR_FORM=  AFFN,          ASDF,            ASDF
##VAR_DIM=   32768,         32768,           32768
##UNITS=     HZ,            ARBITRARY UNITS, ARBITRARY UNITS
##FACTOR=    0.157963299565203, 1,           1
##FIRST=     4132.6476996994, 0,             0
##LAST=      -1043.33573715361, 0,           0
##MIN=       -1043.33573715361, -390739,     0
##MAX=       4132.6476996994, 304182581,     0
$$ Real data points
##PAGE= N=1
##DATA TABLE= (X++(R..R)), XYDATA
$$ [...]
20157d122j9269K9050r194j2573J8936j6162j4903N698K9661k91m6016M992M5516
$$ -4122 -23391 5659 -3535 -16108 2828 -13334 -28237 -22539 7122 6831 -39185 -34193 11323
20144A1323k733J436j9767J4173L7402j1833j2835l3097k1113k1760Q981K9788
$$ 11323 8590 10026 -9741 4432 41834 30001 17166 -15931 -37044 -58804 -49823 -20035
20132b0035R536K8748M996k6565O623O697o989j1211j1046l446L7770L4401N828
$$ -20035 -10499 18249 23245 -3320 3303 10000 3011 -8200 -19246 -22692 15078 49479 55307
20119E5307k6300l8803j4200K3672K147P817J0313j7068j5134l036J1816K4751
$$ 55307 29007 -9796 -23996 -324 1823 9640 19953 2885 -12249 -15285 -3469 21282
20107B1282j9241l962P961M205n120K009Q540J3375l598m537k6725k6919l4485
$$ 21282 2041 -1921 6040 10245 5125 7134 15674 29049 25451 20914 -5811 -32730 -67215
20094f7215m867J1237L3596j2626J1664j42P313J1979k285P979m541M2426M993
$$ -67215 -72082 -60845 -27249 -39875 -28211 -28353 -21040 -9061 -11346 -3367 -7908 34518 39511
20081C9511m814r753l3145r672L3444J9239j3250j8547J5856P158J1060k3925
$$ 39511 34697 24944 -8201 -17873 15571 34810 21560 3013 18869 26027 37087 13162
20069A3162l1931k3513L0973M1287J8212n489k2156j1627J8932k371n865j5971
$$ 13162 -18769 -42282 -11309 29978 48190 42701 20545 8918 27850 25479 19614 3643
20057C643q737L2746J6938j2594j7544Nj2906m452j0658M189j7320l916K3610
$$ 3643 -5094 27652 44590 31996 14452 14457 1551 -2901 -13559 -9370 -26690 -30606 -6996
20044f996Q684k0773J1992k184k3876L733j698M482J3914o130J2897K4445j5069
$$ -6996 1688 -19085 -7093 -9277 -33153 -29420 -31118 -26636 -12722 -18852 -5955 18490 3421
20031C421l1899J7593k59N672O945m641K605k0675k0249K9160K5008M160J3729
$$ 3421 -28478 -10885 -11144 -5472 1473 -3168 -563 -21238 -41487 -12327 12681 16841 30570
20018C0570k7976J9359J2738N868k4708j2386m870J5486K1934q643j5410J8029
$$ 30570 2594 21953 34691 40559 15851 3465 -1405 14081 36015 27372 11962 29991
20006B9991j515J5170k73l5411j9104J9204J6053j2239J6554J6606j8720k4265
$$ 29991 28476 43646 43373 7962 -11142 8062 24115 11876 28430 45036 26316 2051
19994B051k0896Q175J5757j7080N943M12L921L5070K0984L988L103k0131l7200
$$ 2051 -18845 -10670 5087 -11993 -6050 -5638 -1717 33353 54337 58325 61428 41297 4097
19981D097m440J4117o359J3340J8756J3461K3048j7734j0773J0317k0430j5004
$$ 4097 -343 13774 7415 20755 39511 52972 76020 58286 47513 57830 37400 22396
19969B2396N266J6824J9029j0135j5255K64K6766M173j3379l1733j7971L5467
$$ 22396 27662 44486 63515 53380 38125 38389 65155 69328 55949 24216 6245 41712
19957D1712M765k1739j9011K15M0926M109o492p817j7729J827n467J8136K1369
$$ 41712 46477 24738 5727 5942 46868 50977 44485 36668 18939 20766 15299 33435 54804
19944E4804j1834n327l1951R068L238J488n728M008J397k6332m99J6605n988j1608
$$ 54804 42970 37643 5692 14760 17998 19486 13758 17766 19163 -7169 -7668 8937 2949 -8659
19930h659K573J899K6572m792j7136N268L2275J9035J6012J4441k9586n6195j4204
$$ -8659 -6086 -4187 22385 17593 457 5725 38000 57035 73047 87488 57902 1707 -12497
19917a2497J4348J5681l456J129J1891Q350k3084n80P407p380J15k5483j806J5020
$$ -12497 1851 17532 14076 15205 27096 35446 12362 11782 19189 11809 11924 -13559 -15365 -345
19903c45J2728L2382J8759P686l6377j0200l61n031r672r168K8618J8793J3191
$$ -345 12383 44765 63524 71210 34833 24633 24272 19241 9569 401 29019 47812 61003
19890F1003l449j3037m085J309l9065k6938R494K4682r816P539J9027q164k488
$$ 61003 57554 44517 40432 41741 2676 -24262 -14768 9914 98 7637 26664 18500 16012
19877A6012P141p342J0635L350m120J3686J1386J484j020l4171k3564M707j0870
$$ 16012 23153 15811 26446 29796 25676 39362 50748 52232 51212 17041 -6523 -1816 -12686
19864a2686O388K5020R839j1382K0819J3682k2372r608j0922k49j8814j236R609
$$ -12686 -6298 18722 28561 17179 37998 51680 29308 19700 8778 8529 -10285 -11521 -1912
19851a912k934J1755J3486l948J0460n542k6372J0546L1365K2798k2548l4476
$$ -1912 -4846 6909 20395 16447 26907 21365 -5007 5539 36904 59702 37154 2678
19839B678j0915j3195O270M833j3351L706L1945j5446k3436p618M362J2488J3857
$$ 2678 -8237 -21432 -15162 -10329 -23680 -19974 11971 -3475 -26911 -34529 -30167 -17679 -3822
19826c822q578j0473L0061j2r026K7818J2489l1483m672K8222J3078J1659J2505
$$ -3822 -12400 -22873 7188 7176 -1850 25968 38457 6974 2302 30524 43602 55261 67766
19813F7766k0287k9745r769j6804J010J5882J9721R241j014k8437P718J9670Q130
$$ 67766 47479 17734 7965 -8839 -7829 8053 27774 37015 36001 7564 15282 34952 43082
19800D3082O251Q498J6845J208j7988j043n665l0964k3783N634J5273K5961J020
$$ 43082 49333 57831 74676 75884 57896 56853 51188 20224 -3559 2075 17348 43309 44329
19787D4329m407p42k1093J45J4303l883j1727k862k47P207o506l244l357j633
$$ 44329 39922 39180 18087 18232 32535 28652 16925 14063 13816 21023 14517 11273 7916 6283
19773F283j1813j669J1681j5692P003J4899k7112l435K8882J0340M1490p265k5541
$$ 6283 -5530 -7199 4482 -11210 -4207 10692 -16420 -19855 9027 19367 60857 53592 28051
19760B8051K142j6221j4510J5364Q490n912K6661J3594j4036k1209j2736P124
$$ 28051 30193 13972 -538 14826 23316 17404 44065 57659 43623 22414 9678 16802
19748A6802j7200J7988O452j4540j7720j4225K4698L9042J8527J7421n214P8l886
$$ 16802 -398 17590 24042 9502 -8218 -22443 2255 41297 59824 77245 72031 72109 68223
19735F8223j3262j5158o828j1467J251R947Q716k172L7645J2974k5517j5245M905
$$ 68223 54961 39803 32975 21508 22759 32706 41422 39250 76895 89869 64352 49107 54012
19722E4012l2425J1992j7743K793K1423j7329k3260J2997L38j4915K3134J0732
$$ 54012 21587 33579 15836 18629 40052 22723 -537 12460 12798 -2117 21017 31749
19710C1749J2167k4432j3177N375k211l1089J647K4724j0153o570Q502j3709O758
$$ 31749 43916 19484 6307 11682 9471 -21618 -19971 4753 -5400 -11970 -3468 -17177 -10419
19697a0419O444k7148J5750K8656J7488R214J5220N714k4653p868o836J0410O291
$$ -10419 -3975 -31123 -15373 13283 30771 39985 55205 60919 36266 28398 21562 31972 38263
19684C8263N732M499k6j9322m2832o74o76J781K0552J6930J9500P466j1526M173
$$ 38263 43995 48494 48468 29146 -13686 -14360 -15036 -13255 7297 24227 43727 51193 39667 43840
19670D3840K7049O472l8721n959J3548j3947o712m330p504J5136K2758J6011k93
$$ 43840 70889 77361 38640 32681 46229 32282 25570 21240 13736 28872 51630 67641 67348
19657F7348j637o941j4503r380k5700j0802m413J3617J416K510o29J0582J3963
$$ 67348 65711 58770 44267 34887 9187 -1615 -6028 7589 9005 11515 10886 21468 35431
19644C5431q473k567O685P530k6583n510m083L477O920K1890K0464O865j7147
$$ 35431 26958 24391 31076 38606 12023 6513 2430 5907 12827 34717 55181 62046 44899
19631D4899n442j9404l9415O123p675J0815L579M3438J5467J178r657p797o178
$$ 44899 39457 20053 -19362 -13239 -20914 -10099 -6520 36918 52385 53563 43906 36109 29931
19618B9931K7306l5784j7805J7788j394L61J2090K1982J2314n780k1349L17M811
$$ 29931 57237 21453 3648 21436 20042 20403 32493 54475 66789 61009 39660 39977 44788
19605D4788j6840N749O977Q271M197m9472q253j393J0686L3623j291m3574k2523
$$ 44788 27948 33697 40674 48945 53142 3670 -4583 -5976 4710 38333 37042 -6532 -29055
19592b9055J7734J5379k0057J9095L5031K7485q417M834O015N458R797J9280j9041
$$ -29055 -11321 4058 -15999 3096 38127 65612 57195 62029 68044 73502 83299 102579 83538
19579H3538k0202j3878L486m077j7746p666J9819J4172j7710j3059j139O62L1376
$$ 83538 63336 49458 52944 48867 31121 23455 43274 57446 39736 26677 25538 26200 57576
19566E7576j3020j5034j053m024R564J4649j490l5981M741L9767N426k375j3497
$$ 57576 44556 29522 28469 24445 34009 48658 47168 11187 15928 55695 61121 58746 45249
19553D5249j3183J68R958K5035n926J6029L4741l213P634p883L1795o401p621
$$ 45249 32066 32234 42192 67227 61301 77330 112071 108858 116492 108609 140404 134003 126382
19540A26382m0157k1906K9805j0753j6818o230J7304O276j811j1572j2390j7090
$$ 126382 86225 64319 94124 83371 66553 60323 77627 83903 82092 70520 58130 41040
19528D1040J8185K560j469L2450J52J009j6680l7750j6782K5457N2583K5875p970
$$ 41040 59225 61785 60316 92766 92918 93927 77247 39497 22715 48172 100755 126630 118660
19515A18660J812l7755j2541k0239j1912J5770P469J2337K9476L41j917O350k22
$$ 118660 120472 82717 70176 49937 38025 53795 61264 73601 103077 103418 101501 107851 107629
19502A07629m480j149m267Q379r070l1113n377m222K423J9752J7422k591K860
$$ 107629 103149 102000 97733 106112 97042 65929 60552 56330 58753 78505 95927 93336 96196
19489I6196J7982n702j2965j5711p071L770K3348J8307n8578k6996Q182Nj100
$$ 96196 114178 108476 95511 79800 72729 76499 99847 118154 59576 32580 40762 40767 39667
19476C9667P888J7972J295q343K995k3296p996R389J2713J8216J9337J3304k14
$$ 39667 47555 65527 66822 58479 61474 38178 30182 39571 52284 70500 89837 103141 102927
19463A02927k475J6293K55k1267J7781J9510k7198j1534n72j0785K4020k1034
$$ 102927 100452 116745 117000 95733 113514 133024 105826 94292 93720 82935 106955 85921
19451H5921l0980M3537J4199m940m572p398k5982j7947J5548K1057J3577n090
$$ 85921 54941 98478 112677 107737 103165 95767 69785 51838 67386 88443 102020 96930
19439I6930Q58J2078r48j1618q915Q725K1388o646J7404Q644J8415J4559L6578
$$ 96930 97788 109866 108918 97300 88385 97110 118498 111852 129256 137900 156315 170874 207452
19426B07452J8454K4503L2170J9138K9971J6938L2421K7729K9732M7596J4003
$$ 207452 225906 250409 282579 301717 331688 348626 381047 408776 438508 486104 500107
19415E00107k2591J9156N3612K9619o086k6352N358P497j0063m3960k7519N009
$$ 500107 477516 496672 550284 579903 573817 547465 552823 560320 550257 506297 478778 483787
19403D83787j8432l281q015j661k5182k3515j6575j6485k4263o3405m0055k4992
$$ 483787 465355 462074 454059 452398 427216 403701 387126 370641 346378 282973 242918 217926
19391B17926j4141L0880P477m4381l6247k2331K205J7782q174K301L200j4551
$$ 217926 203785 234665 242142 197761 161514 139183 141388 159170 150996 153297 156497 141946
19379A41946j5126O025J0638k2005j2195o754o766m365Q804R127J8534P048k1698
$$ 141946 126820 132845 143483 121478 109283 102529 95763 91398 100202 109329 127863 134911 113213
19366A13213j2535j6468j0059n08K7328J7599k531j9666k7398j296J984J8661
$$ 113213 100678 84210 74151 73643 100971 118570 116039 96373 68975 67679 69663 88324
19354H8324K0686J7439O219q656Q78k2617J893N7920L0231j0024l4598p609M589
$$ 88324 109010 126449 132668 124012 124890 102273 104166 162086 192317 182293 147695 140086 144675
19341A44675J7643k1026m266N635j4150K106K035j3871j4456Q209k79P622l218
$$ 144675 162318 141292 137026 142661 128511 130617 132652 118781 104325 112534 112255 119877 116659
19328A16659L1937L3970L312J109j5775j8624L785j045o112N669L9675J1533J2151
$$ 116659 148596 182566 185878 186987 171212 152588 156373 155328 149216 154885 194560 206093 218244
19315B18244K5997j123j5795j4762j894P771L6698M3151Q924O679J7058J1527
$$ 218244 244241 243118 227323 212561 210667 218438 255136 298287 307211 313890 330948 342475
19303C42475L8845O986k124J2500k3430k0084Q738L616n440q907k0501m1128p404
$$ 342475 381320 388306 386182 398682 375252 355168 363906 367522 362082 353175 332674 291546 284142
19290B84142k5470n326O591P483J3818l1275l5251k4509k7604j6684n299K8532
$$ 284142 258672 253346 259937 267420 281238 249963 214712 190203 162599 145915 140616 169148
19278A69148Q538L852K456r337O032q232n066K1083P621J7945N925L1523K4882
$$ 169148 177686 181538 183994 174657 180689 172457 167391 188474 196095 214040 219965 251488 276370
19265B76370k3670J1237J7842K1784Q411M3519K0366O679N046j2159m482J9584
$$ 276370 252700 263937 281779 303563 311974 355493 375859 382538 387584 375425 370943 390527
19253C90527M1210q351j8719p63P572J2073P549j6720l2546L546q421q684j5012
$$ 390527 431737 423386 404667 403904 411476 423549 431098 414378 381832 385378 376957 368273 353261
19240C53261n1438l1328L0637N5287n520l0600r871K7381l307K6899O732K700
$$ 353261 301823 270495 301132 356419 350899 320299 310428 337809 334502 361401 368133 370833
19228C70833q438J6913J9593N641J4708K4900J7399j7121l0904r175m0299j6762
$$ 370833 362395 379308 398901 404542 419250 444150 461549 444428 413524 404349 364050 347288
19216C47288j0842j5983L577O823r316M353j9230j8153k4398J629J341n378j9212
$$ 347288 336446 320463 324040 330863 321547 325900 306670 288517 264119 265748 267089 261711 242499
19203B42499n92J2653r541j1371k3833l916m753k2153n656j50K1677K2907N515
$$ 242499 241907 254560 245019 233648 209815 205899 201146 178993 173337 173187 194864 217771 223286
19190B23286L0192K3575L2881L4191P920J3119K8372o203M47O391J9641J280L3813
$$ 223286 253478 277053 309934 344125 352045 365164 393536 387333 387780 394171 413812 415092 448905
19177D48905K2481l722Q763j6813N30L42n178o090k0093j2113j3240J24k4839
$$ 448905 471386 467664 476427 459614 460144 460486 455308 449218 429125 417012 403772 403896 379057
19164C79057l9431j5236J6152j1686j3283K757k778J3725j721j0983m2205k6328
$$ 379057 339626 324390 340542 328856 315573 318330 315552 329277 327556 316573 274368 248040
19152B48040l1791k0123O999J6329J1767j9326j2048O850K0693o282Q665J2322
$$ 248040 216249 196126 203125 219454 231221 211895 199847 206697 227390 221108 229773 242095
19140B42095j5858p880K0567K0172J9210j7573K2253q54l862r402l2871k2451
$$ 242095 226237 218357 238924 259096 278306 260733 282986 282132 278270 268868 235997 213546
19128B13546j0258p757J1467Q39K3946Q278k0628j2025N145Q889k318r326j7707
$$ 213546 203288 195531 206998 207837 231783 240061 219433 207408 212553 221442 219124 209798 192091
19115A92091j1015n895J5155P69L697K2406J0429m108L2561J8003m557m455m622
$$ 192091 181076 175181 190336 191105 194802 217208 227637 223529 256090 274093 269536 265081 260459
19102B60459k9325m526P872L2707j266o075j6174j3926l579L0317J3917J9041
$$ 260459 231134 226608 234480 267187 265921 259846 243672 229746 226167 256484 270401 289442
19090B89442k3471j392m080j2849l396K6785K5199k0005J1601L0038L0806L4847
$$ 289442 265971 264579 260499 247650 244254 271039 296238 276233 287834 317872 348678 383525
19078C83525K137K520P176J4967J5186J3536N1269O9267N6891K8699J3750J3469
$$ 383525 385662 388182 395358 410325 425511 439047 490316 559583 616474 645173 658923 672392
19066F72392l297k5009P097M668k1830K823J6306j1016j7679j3116l0878n0580
$$ 672392 669095 644086 651183 655851 634021 636844 653150 642134 624455 611339 580461 529881
19054E29881k3718l8921n6886o8432r241J5368j0736l405Q195k2385k1035m762
$$ 529881 506163 467242 410356 341924 332683 348051 337315 333910 342105 319720 298685 293923
19042B93923K193K1575J2778j7033R619L0552J5662M438j991J0716k419J6072
$$ 293923 296116 317691 330469 313436 323055 353607 369269 373707 371716 382432 380013 396085
19030C96085l171j2673L1100K682J4587M8900N3738K7070J9841N9846K1542N0214
$$ 396085 392914 380241 411341 414023 428610 477510 531248 558318 578159 638005 659547 709761
19018G09761P3955N6993Q0478P6803M6652N4904M9634L030m5464l5880o9748n7495
$$ 709761 783716 840709 921187 997990 1044642 1099546 1149180 1152210 1106746 1070866 1001118 943623
19006I43623q3543r3784m2928m0552l3265j6397Q808K3465j3786M188J9419j2498
$$ 943623 860080 766296 723368 682816 649551 633154 641962 665427 651641 655829 675248 662750
18994F62750j8524l2108j4761j6313K752J3843J9159k380l6169K170j4132l111
$$ 662750 644226 612118 597357 581044 583796 597639 616798 614418 578249 580419 566287 563176
18982E63176Q859n663k5369l0339L194K932J1994L9959K5710M7974N6927O1436
$$ 563176 572035 566372 541003 510664 513858 516790 528784 568743 594453 642427 699354 760790
18970G60790M5521Q3822P6180N1135N3913J6552J9126J0380J4944M281n074l3780
$$ 760790 806311 890133 966313 1017448 1071361 1087913 1107039 1117419 1132363 1136644 1131570 1097790
18958A097790l4517k6590l6500l3132j8632k4727k0988k0412L2646L8246r91K833
$$ 1097790 1063273 1036683 1000183 967051 948419 923692 902704 882292 914938 953184 952193 955026
18946I55026K1698j203j9422k7701j9648J5329K8132p888K3960M8862L5985N3157
$$ 955026 976724 975521 956099 928398 908750 924079 952211 944323 968283 1017145 1053130 1106287
18934A106287N6322M5343Q7668J15902J12680J09966J75542J54166J81123K09353
$$ 1106287 1162609 1207952 1295620 1411522 1524202 1634168 1809710 1963876 2144999 2354352
18924B354352J97651K36521K72975L40353L80976N05983O46351R15850J328572
$$ 2354352 2552003 2788524 3061499 3401852 3782828 4288811 4935162 5851012 7179584
18915G179584J755207K112231K451012L130901L912300M208626L808101L723958
$$ 7179584 8934791 11047022 13498034 16628935 20541235 24749861 28557962 32281920
18907C2281920M515233M935801M290599L133006L214078M578896N619799N393189
$$ 32281920 36797153 41732954 46023553 49156559 52370637 56949533 62569332 67962521
18899F7962521M319030L858109M569856N547312M554773J377442j511493j452899
$$ 67962521 72281551 76139660 80709516 86256828 90811601 92189043 90677550 89224651
18891H9224651j99459p94469l233468m653512l883573k065635j160682k234638
$$ 89224651 89025192 88230723 84997255 80343743 76460170 74394535 73233853 70999215
18883G0999215m233676n210078m005016l185775m232381o047293o004533m508012
$$ 70999215 66765539 61555461 57550445 54364670 50132289 44084996 38080463 33572451
18875C3572451l565710l437723l301786k572193j815633j339862j099190r12454
$$ 33572451 30006741 26569018 23267232 20695039 18879406 17539544 16440354 15527900
18867A5527900p70747o87043o28728n58104n26422n10967m73034m29995m49721
$$ 15527900 14757153 14070110 13441382 12883278 12356856 11845889 11372855 10942860 10493139
18858A0493139m41682l80557l28103l12949l02347k76988k51476k30712k33202
$$ 10493139 10051457 9670900 9342797 9029848 8727501 8450513 8199037 7968325 7735123
18849G735123k06195k07530k33950j65689j88559j84500j49061j61116j41663
$$ 7735123 7528928 7321398 7087448 6921759 6733200 6548700 6399639 6238523 6096860
18840F096860j46975j19098j11771j02714j07104o3303n4918l7336n3126o0051
$$ 6096860 5949885 5830787 5719016 5616302 5509198 5445895 5390977 5353641 5300515 5240464
18830E240464p0674l6583m4091j6847Q373Q542K7463L9966N5621J15685J43431
$$ 5240464 5169790 5133207 5089116 5072269 5080642 5089184 5116647 5156613 5212234 5327919 5471350
18819E471350K12134L12602M21305O70053J072902J462929J688848J917887K416885
$$ 5471350 5683484 5996086 6417391 7087444 8160346 9623275 11312123 13230010 15646895
18810A5646895K836686K743497K090396J986761K539935K646460J822850J040071
$$ 15646895 18483581 21227078 23317474 25304235 27844170 30490630 32313480 33353551
18802C3353551J671836K628050K487313J568293J290972J283525P12848k56637
$$ 33353551 35025387 37653437 40140750 41709043 43000015 44283540 44996388 44739751
18794D4739751j296561j414743j703936j665957j347876j391629j725254j581488
$$ 44739751 43443190 42028447 40324511 38658554 37310678 35919049 34193795 32612307
18786C2612307q87355o44878j320611k297442k041740j456019j409445j732443
$$ 32612307 31724952 31080074 29759463 27462021 25420281 23964262 22554817 20822374
18778B0822374j881564j454773j060170p49277m97823l07307j15355J788J13461
$$ 20822374 18940810 17486037 16425867 15676590 15178767 14871460 14756105 14757893 14871354
18769A4871354K23989L60224O92013J128612J477473J741658K252096L000213
$$ 14871354 15095343 15455567 16147580 17276192 18753665 20495323 22747419 25747632
18761B5747632L353492K889477K394600K883966L514045L186208K081651J968466
$$ 25747632 29101124 31990601 34385201 37269167 40783212 43969420 46051071 48019537
18753D8019537L307853L847615K945255J958385J829444J304288K24183j284353
$$ 48019537 51327390 55175005 58120260 60078645 61908089 63212377 63436560 62152207
18745F2152207j992753k284743k626803k042991j691375k063211k521638j946681
$$ 62152207 60159454 57874711 55247908 53204917 51513542 49450331 46928693 44982012
18737D4982012j285815j889181l518596m213080l305280k652231k675045k864322
$$ 44982012 43696197 41807016 38288420 34075340 30770060 28117829 25442784 22578462
18729B2578462k429725j639334j089484q11832o05302m93711l36842j46641R9582
$$ 22578462 20148737 18509403 17419919 16608087 16002785 15509074 15172232 15025591 15125173
18720A5125173M91899R66122J439541J865155K416902K741981K487007K064148
$$ 15125173 15617072 16583194 18022735 19887890 22304792 25046773 27533780 29597928
18712B9597928J698614J407998J129979O67014J082859K257474K823663K684464
$$ 29597928 31296542 32704540 33834519 34501533 35584392 37841866 40665529 43349993
18704D3349993K321770J589799N41643q57619k314878k970492k829547j975927
$$ 43349993 45671763 47261562 47803205 46945586 44630708 41660216 38830669 36854742
18696C6854742j235070r61506p54806o87382r64038j653616k685133k949957k497818
$$ 36854742 35619672 34658166 33903360 33215978 32251940 30598324 27913191 24963234 22465416
18687B2465416k242748k040652j499154r65970n90416l90235k46244j48455j30437
$$ 22465416 20222668 18182016 16682862 15716892 15126476 14736241 14489997 14341542 14211105
18678A4211105j01161p6503j8343J18272K82858N60081J023344J676507K524743
$$ 14211105 14109944 14033441 14015098 14133370 14416228 14976309 15999653 17676160 20200903
18669B0200903L339444M218022N345631N828472N253900M334325L397378K487332
$$ 20200903 23540347 27758369 33104000 38932472 44186372 48520697 51918075 54405407
18661E4405407J460160K76480P89168K715363L846697M139533L817062K738157
$$ 54405407 55865567 56142047 56931215 59646578 63493275 67632808 71449870 74188027
18653G4188027J065134j240477l719872n382634n626350m341909l281881k829166
$$ 74188027 75253161 74012684 70292812 64910178 59283828 54941919 51660038 48830872
18645D8830872k208024j841514k003910k799532m037581m271652l634613l355706
$$ 48830872 46622848 44781334 42777424 39977892 35940311 31668659 28034046 24678340
18637B4678340l052129k306851j644755j208696r21182o89785n98286m81067m30211
$$ 24678340 21626211 19319360 17674605 16465909 15544727 14854942 14256656 13775589 13345378
18628A3345378l78421l20221k64372k40038k06042j91760k48990k78927k96458
$$ 13345378 12966957 12646736 12382364 12142326 11936284 11744524 11495534 11216607 10920149
18619A0920149l06035l05215j99338o2140n270M570n7457j85926l26284m50480
$$ 10920149 10614114 10308899 10109561 10047421 10042151 10046721 9989264 9803338 9477054 9026574
18609I026574m67230m02515k79661j46372j15105o4628n8791j02561j55091j97901
$$ 9026574 8559344 8156829 7877168 7730796 7615691 7551063 7492272 7389711 7234620 7036719
18599G036719j83948j71820k00738k07604j33275m9837J1871M6109O9681M6645
$$ 7036719 6852771 6680951 6480213 6272609 6139334 6089497 6101368 6147477 6217158 6263803
18589F263803j3254j03377j67525j76168k20394j42229r1570o1777r8778j13343
$$ 6263803 6250549 6147172 5979647 5803479 5583085 5440856 5349286 5287509 5188731 5075388
18579E075388j32378j63127k48588k57054k38612k00006j16798q0111k4677J2696
$$ 5075388 4943010 4779883 4531295 4274241 4035629 3835623 3718825 3638714 3614037 3626733
18569C626733O880l696L6889O0195N6910L5648N8447N3904K4241L4958R172k9632
$$ 3626733 3633613 3629917 3666806 3727001 3783911 3819559 3878006 3931910 3956151 3991109 4000281 3970649
18557C970649j7173K5016M4484P7131J28076J86844K70317L92215N86296Q30699
$$ 3970649 3953476 3978492 4022976 4100107 4228183 4415027 4685344 5077559 5663855 6494554
18547F494554J176713J824321K784088M172758N923234P660306Q876893R464440
$$ 6494554 7671267 9495588 12279676 16452434 22375668 30035974 38912867 48377307
18539D8377307R543553Q384330N429631J288970k727649n205766p044291q628611
$$ 48377307 57920860 66305190 71734821 73023791 70296142 65090376 58046085 49417474
18531D9417474r755237q975954o954140m713830k997285j986513j375830r97464
$$ 49417474 39662237 30686283 23732143 19018313 16021028 14034515 12658685 11661221
18523A1661221p47886o05732m92980l56171l05913k04687j33080q3515m2553l3030
$$ 11661221 10913335 10307603 9814623 9458452 9152539 8947852 8814772 8731257 8688704 8655674
18513H655674l1429k6412p6627j00540r6481j29850j36415j09051p1579J2930
$$ 8655674 8624245 8597833 8521206 8420666 8324185 8194335 8057920 7948869 7877290 7890220
18503G890220J08643K40641M24927P10104J106424J652437K506761L880710N815278
$$ 7890220 7998863 8239504 8664431 9374535 10480959 12133396 14640157 18520867 24336145
18494B4336145Q040268J0141153J1499886J2181716J1963020R799702N512736
$$ 24336145 32376413 42517566 54017452 66199168 78162188 87961890 93474626
18487I3474626J77911m434677p336810r680452j1558382j2338304j0772393q154187
$$ 93474626 93652537 89217860 81881050 72200598 60642216 48303912 37531519 29377332
18479B9377332n464781l536259k378344j702704j300640j008162q29187p23515
$$ 29377332 23912551 20376292 17997948 16295244 14994604 13986442 13157255 12433740
18471A2433740n73619m77987l92266l02805k02221j70187j69250j55199j54338
$$ 12433740 11860121 11382134 10989868 10687063 10484842 10314655 10145405 9990206 9835868
18462I835868j82804k09512j95607k74765k84397k52434k37675k05804j69313
$$ 9835868 9653064 9443552 9247945 8973180 8688783 8436349 8198674 7992870 7823557
18453G823557r8138K129J00411K17656M85228Q50297J419866K145765K984447
$$ 7823557 7725419 7727548 7827959 8045615 8530843 9381140 10801006 12946771 15931218
18444A5931218L711938M194279M415407M281454L357571J698721j92279j670609
$$ 15931218 19643156 23837435 28252842 32534296 35891867 37590588 37398309 35727700
18436C5727700k686932l521177m218472m295522l604945k723836j925724j343628
$$ 35727700 33040768 29519591 25301119 21005597 17400652 14676816 12751092 11407464
18428A1407464j029221q40845o77565o46276o03772n05763l82638k97437k65420
$$ 11407464 10378243 9537398 8859833 8213557 7609785 7104022 6721384 6423947 6158527
18419F158527j75934j44780j43180j59133j63003j29668j13738p7241j08138j39405
$$ 6158527 5982593 5837813 5694633 5535500 5372497 5242829 5129091 5051850 4943712 4804307
18409D804307j20058j21782j80233j48142j28887j16642j17440j21111j22953
$$ 4804307 4684249 4562467 4382234 4234092 4105205 3988563 3871123 3750012 3627059
18400C627059j12312r4598n0193m8976j5169n084M9843P2491P6882J44783J63248
$$ 3627059 3514747 3420149 3369956 3320980 3305811 3300727 3350570 3423061 3499943 3644726 3807974
18389C807974J71957J59736J64082J73930J52987J12868J41728O1831o9831j85159
$$ 3807974 3979931 4139667 4303749 4477679 4630666 4743534 4885262 4947093 4877262 4692103
18379D692103k25283k08680k38540k92612l06208k74750k15299r8635o3710n0485
$$ 4692103 4466820 4258140 4019600 3726988 3420780 3146030 2930731 2832096 2768386 2717901
18369B717901l5740m958k4026o016l9321p6450o5954o5748j17065j08109j15309
$$ 2717901 2682161 2677203 2653177 2647161 2607840 2531390 2465436 2399688 2282623 2174514 2059205
18358B059205p4483m1536l2715l4962m4077k2616k023j7057n1608j6774m1737
$$ 2059205 1984722 1943186 1910471 1875509 1831432 1808816 1806793 1789736 1738128 1721354 1679617
18347A679617l1633j4469k6381k9762R108P213J3964K7775J6652P6085P1590Q6725
$$ 1679617 1647984 1633515 1607134 1577372 1586480 1593693 1607657 1635432 1652084 1728169 1799759 1886484
18335A886484J18344J14141Q8816L2280n6231o0680p7595q9342j15287j45007
$$ 1886484 2004828 2118969 2207785 2240065 2183834 2123154 2045559 1956217 1840930 1695923
18325A695923j20989j08176n4881l2151J6915M3287J0616J7016K4816M8278M5516
$$ 1695923 1574934 1466758 1411877 1379726 1396641 1439928 1450544 1467560 1492376 1540654 1586170
18314A586170k2141l6639m3825m5953o7806m4893l6638Q887M1287K1028K3319
$$ 1586170 1564029 1527390 1483565 1437612 1369806 1324913 1288275 1297162 1338449 1359477 1382796
18303A382796P5370N3238O2075M2212j8587P030q451k4188K8163N7465Q4740R2438
$$ 1382796 1458166 1511404 1573479 1615691 1597104 1604134 1595683 1571495 1599658 1657123 1741863 1834301
18291A834301O3431O7846R4553R5918R5249P0360L1656P1296J16054J59833J93287
$$ 1834301 1897732 1965578 2060131 2156049 2251298 2321658 2353314 2424610 2540664 2700497 2893784
18280B893784K47007L84174N73159Q19454J069389J047492R63967Q35982N14427
$$ 2893784 3140791 3524965 4098124 4917578 5986967 7034459 7998426 8834408 9348835
18271I348835q670n73077o34349l2920O42680J445352K616040M394794O585460
$$ 9348835 9340165 8767088 8132739 8099819 8742499 10187851 12803891 17198685 23784145
18262B3784145Q173674Q862296Q875240P397289M505586M78123m076825o464117
$$ 23784145 31957819 40820115 49695355 57092644 61598230 62076353 57999528 51535411
18254E1535411p464921o334973l528827k087321k052757k349578j317991K78961
$$ 51535411 44070490 37735517 34206690 32119369 30066612 27717034 26399043 26678004
18246B6678004Q84708R28561M70555p05779k526454m093505l822585k479826j455518
$$ 26678004 27562712 28491273 28961828 28256049 25729595 21636090 17813505 15333679 13878161
18237A3878161q42411m12294j10424J37891L25937O36777R70405J102220R80567
$$ 13878161 13035750 12623456 12513032 12650923 12976860 13613637 14584042 15686262 16666829
18228A6666829P99584P18723M52075Q0432j64898N44722K022394L426256M279302
$$ 16666829 17466413 18185136 18637211 18717643 18552745 19097467 21119861 24546117 28825419
18219B8825419M690996N496259O985078R114990J0855114J0274399R688822J0717995
$$ 28825419 33516415 39012674 45997752 55112742 65967856 76242255 85931077 96649072
18211I6649072R693517N276418j479329o710414l385081J515382L376794L537409
$$ 96649072 106342589 111619007 110139678 103429264 100044183 101559565 104936359 108473768
18203A08473768J860220j064968n784994j0536818j3071449j1919957r082283
$$ 108473768 110333988 109269020 103484026 92947208 79875759 67955802 58873519
18196E8873519q108429p670455n609825l110448j519334q87875p60616o38350
$$ 58873519 50765090 43094635 37484810 34374362 32855028 31967153 31206537 30568187
18188C0568187q19431j328709k099066k421507j847476j167670o98825m35402
$$ 30568187 29748756 28420047 26320981 23899474 22051998 20884328 20185503 19750101
18180A9750101l21922j83351l2133K83827Q10193J629741K767555L869155M248296
$$ 19750101 19428179 19244828 19212695 19496522 20306715 21936456 24704011 28573166 32821462
18171C2821462L846320L411229K612494J034265q69041j793560k93685K018699
$$ 32821462 36667782 40079011 42691505 43725770 42856729 41063169 40769484 42788183
18163D2788183M360269P278834R867991J0724652R300684P511875N940814K678609
$$ 42788183 47148452 54427286 64295277 75019929 84320613 91832488 97773302 100451911
18155A00451911l543124j1450325j5978385j6292464j2553971p691442m573971
$$ 100451911 96908787 85458462 69480077 53187613 40633642 32942200 28368229
18148B8368229k844591j773800r44695k30367K65623L05526J88700L9638l76938
$$ 28368229 25523638 23749838 22805143 22574776 22840399 23145925 23334625 23374263 22997325
18139B2997325j162107k153292k537889j904483j217209p95584n47755m04107
$$ 22997325 21835218 19681926 17144037 15239554 14022345 13226761 12679006 12274899
18131A2274899l37711k79219k09670k15320k30580k34469k57729k74961k01814
$$ 12274899 11937188 11657969 11448299 11232979 11002399 10767930 10510201 10235240 10033426
18122A0033426j89903j93151j10160O0968L15623O79333J493333K940552M392842
$$ 10033426 9843523 9650372 9540212 9601180 9916803 10596136 12089469 15030021 19422863
18113A9422863M189507L198144K931284J823574p36895m626764p417300n048714
$$ 19422863 23612370 26810514 29741798 31565372 30828477 26201713 18784413 13735699
18105A3735699k539456j412577r21384o53625m97353l87735l63999l33642k76455
$$ 13735699 11196243 9783666 8862282 8208657 7711304 7323569 6959570 6625928 6349473
18096F349473k53237k56929k26741k22550j97278j60378j79388j61583j31976
$$ 6349473 6096236 5839307 5612566 5390016 5192738 5032360 4852972 4691389 4559413
18087D559413j27915j25299j36788p4002q5287q8753r4825j06078j17254q8709
$$ 4559413 4431498 4306199 4169411 4095409 4010122 3921369 3826544 3720466 3603212 3514503
18077C514503p0029j03752j07354o8193n3938p5164p1017p9026q4126r0905o9927
$$ 3514503 3444474 3340722 3233368 3165175 3111237 3036073 2965056 2886030 2801904 2710999 2641072
18066B641072p2409n2010o6346o4267l2069l9623n2857n3816o4704p2116o6787
$$ 2641072 2568663 2516653 2450307 2386040 2353971 2314348 2261491 2207675 2142971 2070855 2004068
18055B004068n6988n7081n7181m5001n7665j6588m2674p7756l4145m6968m8056
$$ 2004068 1947080 1889999 1832818 1787817 1730152 1713564 1670890 1593134 1558989 1512021 1463965
18044A463965p018n340m3519m2757o0341M658m711j1796l8169k4877k2822l2497
$$ 1463965 1456947 1451607 1408088 1365331 1304990 1309648 1304937 1293141 1254972 1230095 1207273 1174776
18032A174776j0673l0514l6526n577K9324N66n394K4296K5355K862o981J0110
$$ 1174776 1164103 1133589 1097063 1091486 1120810 1121376 1115982 1140278 1165633 1168495 1161514 1171624
18020A171624M065j313O95l0526m2725p1302p2222n0877l6310m9708j6079l7328
$$ 1171624 1175689 1174376 1175071 1144545 1101820 1030518 958296 907419 871109 821401 805322 767994
18008G67994k5718k745j3836k1503l4651m7626k776j6111l1173m200M417J3224
$$ 767994 742276 739531 725695 704192 669541 621915 619139 603028 571855 567655 572072 585296
17996E85296q073l1894m5228r420K5109k8277l0386J4921J3280r069o2K7605L2966
$$ 585296 577223 545329 500101 490681 515790 487513 457127 472048 485328 476259 476197 503802 536768
17983E36768l366l5732j2404J7039R670M5691L6814L2533N2830N3135M4303P2122
$$ 536768 533402 497670 485266 502305 511975 557666 594480 627013 679843 732978 777281 849403
17971H49403M0078M648p844k6655k5592m5266q5056p4523r0921m0995k6093k5591
$$ 849403 889481 894129 886285 859630 834038 788772 703716 629193 538272 497277 471184 445593
17959D45593m091k0403p18j3791p612J2978R837K239m806l1272k1310J2934K2892
$$ 445593 441502 421099 420381 406590 398978 411956 421793 424032 419226 387954 366644 379578 402470
17946D02470L463k2877k9304k6329j6658k4371J6512R267l163j3704r327J3839
$$ 402470 405933 383056 353752 327423 310765 286394 302906 312173 309010 295306 285979 299818
17934B99818J5010O46J6966M4606L961J3933L0174J3170M2946K4534J7239K9996
$$ 299818 314828 315474 332440 377046 381007 394940 425114 438284 481230 505764 523003 552999
17922E52999j2116P834J6641J3973k2418p455l8045n0961o7388m4410J042R911
$$ 552999 540883 548717 565358 579331 556913 549458 511413 460452 393064 348654 349696 359607
17910C59607j5121M811j0598K0401l87k4679L631o569k9835l788J8969K4261K444
$$ 359607 344486 349297 338699 359100 358713 334034 337665 331096 301261 297473 316442 340703 343147
17897C43147j5075k2654L484L7624K6153p886j3306N54j3008L5865J8701n816
$$ 343147 328072 305418 308902 346526 372679 364793 351487 352041 339033 374898 393599 387783
17885C87783J3932K3530J1084J0730j4626M022R527l7183Q716K1927j0709l3977
$$ 387783 401715 425245 436329 447059 432433 436455 445982 408799 417515 439442 428733 394756
17873C94756l2273r365J4812K215m558j497J22l0535l2565j0639p678j3940j1806
$$ 394756 362483 353118 367930 370145 365587 364090 364212 333677 301112 290473 282795 268855 257049
17860B57049M159K4385P414M922R663J0512J4342n502J1407R539k789j5663j4690
$$ 257049 261208 285593 293007 297929 307592 318104 332446 326944 338351 347890 345101 329438 314748
17847C14748o665n875j605K3562O602K4897r919p849P418k645K3069L7308J1257
$$ 314748 308083 302208 300603 324165 330767 355664 345745 337896 345314 342669 365738 403046 414303
17834D14303N019N8504M0681n435o112k4616j4527L704J1084P365k029M976J8032
$$ 414303 419322 477826 518507 513072 506960 482344 467817 471521 482605 489970 487941 492917 510949
17821E10949k0726j0179k1765j78M0381n278l1529Q91L0836M5519L473J524r171
$$ 510949 490223 480044 458279 458101 498482 493204 461675 462566 493402 538921 542394 543918 534747
17808E34747K731K2651M4657J3657N681J3241J7867o175K7598N0279L1260J2782
$$ 534747 537478 560129 604786 618443 624124 637365 655232 649057 676655 726934 758194 770976
17796G70976p709j3567J6620n499o014L0917L8056P1179N3665M2277K5399N4368
$$ 770976 763267 749700 766320 760821 754807 785724 823780 894959 948624 990901 1016300 1070668
17784A070668N3288K7429N7050M8026P2292Q0429O8429R0159O8701Q5833J13405
$$ 1070668 1123956 1151385 1208435 1256461 1328753 1409182 1477611 1567770 1636471 1722304 1835709
17773A835709J77411K32881K59574L34500M48777O86796J022605J575775K340967
$$ 1835709 2013120 2246001 2505575 2840075 3288852 3975648 4998253 6574028 8914995
17764H914995K804372K778537K769580K905126K866198K759669K579889K952785
$$ 8914995 11719367 14497904 17267484 20172610 23038808 25798477 28378366 31331151
17756C1331151L428970L474740L033881J447703j073988l331397l587687k030494
$$ 31331151 34760121 38234861 41268742 42716445 41642457 38311060 34723373 32692879
17748C2692879n13713k73070j481113l604386n508572m895311l063849j823253
$$ 32692879 32179166 31906096 30424983 26820597 21312025 16416714 13352865 11529612
17740A1529612j109138p08488m83118m04331l33324l05631k72042k39148j66580
$$ 11529612 10420474 9711986 9228868 8824537 8491213 8185582 7913540 7674392 7507812
17731G507812o5136K913P4738J10190J68523J83215K68985L87723O21163J065258
$$ 7507812 7442676 7445589 7520327 7630517 7799040 7982255 8251240 8638963 9260126 10325384
17721A0325384J717173K366795K635305K849777L354404L620145L418014L292806
$$ 10325384 12042557 14409352 17044657 19894434 23248838 26868983 30286997 33579803
17713C3579803M439377O881442Q270368P705430O671197O003192M001008p09896
$$ 33579803 38019180 44900622 53170990 60876420 67547617 73550809 77551817 76841921
17705G6841921n855209p589944n283568k598439k127526k906725j904282k65005
$$ 76841921 70986712 63396768 58113200 55514761 53387235 50480510 48576228 48311223
17697D8311223k80990j568538k658378k324217j837017j923279j570358k42004
$$ 48311223 48030233 46461695 43803317 41479100 39642083 37718804 36148446 35906442
17689C5906442J668305M165401P629901J1517983J4096424J4337324J2939676
$$ 35906442 37574747 41740148 49370049 60888032 74984456 89321780 102261456
17682A02261456J0537408O555284J618001j824845j690341J480438M877973O441752
$$ 102261456 112798864 119354148 120972149 119147304 117456963 118937401 123815374 130257126
17674A30257126M522831j293583q834911j2591098j0274710o394966m673211n336214
$$ 130257126 134779957 133486374 124651463 112060365 101785655 95390689 90717478 85381264
17666H5381264o234351n379450k846537k48934J115932J497326M04307k256109
$$ 85381264 79146913 73767463 70920926 70671992 71787924 73285250 73689557 71433448
17658G1433448n711834p499594n936108l541759k010695j846538k718017m100654
$$ 71433448 65721614 58222020 52285912 48744153 46733458 44886920 42168903 38068249
17650C8068249m336621l055181j802777r05692r7147P36756J755266K819937L498613
$$ 38068249 33731628 30676447 28873670 27967978 27870831 28607587 30362853 33182790 36681403
17641C6681403L757417L912882M107050M149180L623698K702286K351956L041161
$$ 36681403 40438820 44351702 48458752 52607932 56231630 58933916 61285872 64327033
17633F4327033L850119M154200M385626N131276O678497Q322858R123157Q055848
$$ 64327033 68177152 72331352 76716978 81848254 88526751 96849609 105972766 114028614
17625A14028614M596575p36843n706258p170113n693266l684435l783531o919954
$$ 114028614 118625189 117888346 112182088 105011975 99318709 95634274 91850743 84930789
17617H4930789j1154959j2767612j0338426o683651m206418l149998k885197k817314
$$ 84930789 73775830 61008218 50669792 43986141 39779723 36629725 33744528 30927214
17609C0927214k458388j782544j064615n57358l13887k72421l10279n48640r71955
$$ 30927214 28468826 26686282 25621667 25064309 24750422 24478001 24167722 23619082 22647127
17600B2647127j486450j751532j558598j170659q79985o94234o33525o06450n71258
$$ 22647127 21160677 19409145 17850547 16679888 15799903 15105669 14472144 13865694 13294436
17591A3294436n26520m70298m26002l75936m01285l82812l53380k97879k71760
$$ 13294436 12767916 12297618 11871616 11495680 11094395 10711583 10358203 10060324 9788564
17582I788564k55947k54999k66279k69108k47036k26190k18149k04210j77726
$$ 9788564 9532617 9277618 9011339 8742231 8495195 8269005 8050856 7846646 7668920
17573G668920k19491k45891j89399j74770j64912j82302j89445j56416j71861
$$ 7668920 7449429 7203538 7014139 6839369 6674457 6492155 6302710 6146294 5974433
17564E974433k06615j80483j81994j62779j48776j21759j23414j21241j39033
$$ 5974433 5767818 5587335 5405341 5242562 5093786 4972027 4848613 4727372 4588339
17555D588339j40352j19657p1726r4460j07060q5170p3628r0151j35938p6361
$$ 4588339 4447987 4328330 4256604 4162144 4055084 3969914 3896286 3806135 3670197 3593836
17545C593836p5785q2934q3152q3769o7193m5498n9700n8102o9332n9687m5150
$$ 3593836 3518051 3435117 3351965 3268196 3201003 3155505 3095805 3037703 2968371 2908684 2863534
17534B863534q6872j01955o5031r9479o4144n3217o1061n7281p2548m8494k1127
$$ 2863534 2776662 2674707 2609676 2510197 2446053 2392836 2331775 2274494 2201946 2153452 2132325
17523B132325m8906n2011o3848r9179p4090r7861n0775n0917m3073l5327k3182
$$ 2132325 2083419 2031408 1967560 1868381 1794291 1696430 1645655 1594738 1551665 1516338 1493156
17512A493156n8866m1256n2651l9269k7150j5581k1763k9590k8997m9672m2950
$$ 1493156 1434290 1393034 1340383 1301114 1273964 1258383 1236620 1207030 1178033 1128361 1085411
17501A085411j8642J6029J1909o192l5238M518J0030k3950k5965j6019l0477k5257
$$ 1085411 1066769 1082798 1094707 1088515 1053277 1057795 1067825 1043875 1017910 1001891 971414 946157
17489I46157k6012O078l6326m3690l1928K164L120J9538n159j2695k7768k3193
$$ 946157 920145 926223 889897 846207 814279 816443 819563 839101 833942 821247 793479 770286
17477G70286r083n3796j5382l879K0952k6879l0640m9617l6701p470k2877l4091
$$ 770286 761203 707407 692025 688146 709098 682219 651579 601962 565261 557791 534914 500823
17465E00823k9131m2773j0067n026j6282j5600j5098O27j071j2542Q487n55L259
$$ 500823 471692 428919 418852 413826 397544 381944 366846 367473 366402 353860 362347 361792 365051
17452C65051n968K511O310r938J6336Q538K9086K5271M7485M3345j3266l8221
$$ 365051 359083 361594 367904 357966 374302 382840 411926 437197 484682 528027 514761 476540
17440D76540p5073j8610m075j9031l3711J9472J782k2525k388L79m249k5580j4080
$$ 476540 401467 382857 378782 359751 326040 345512 347294 324769 322381 322760 318511 292931 278851
17427B78851j7229q874J4853L220J14k0191P05m550l0154j5252K3314p004k2702
$$ 278851 261622 252748 267601 270821 270935 250744 251449 246899 216745 201493 224807 217803 195101
17414A95101l288k4040j0290J6784J1751m842l3662j0791J2965N702J0808J3377
$$ 195101 191813 167773 157483 174267 186018 181176 147514 136723 149688 155390 166198 179575
17402A79575J990N976j4371N344j963j4042p679J2217K0739j6393l3006j0959
$$ 179575 181565 187541 173170 178514 176551 162509 154830 167047 187786 171393 138387 127428
17390A27428n646m525L553K500J999M918k2178Q513L1811j981k9161p06O662j5739
$$ 127428 121782 117257 120810 123310 125309 130227 108049 116562 148373 146392 117231 116525 123187 107448
17376A07448p956J2700m2390l826L853Q496L2765J963N906J2544K633N468j5576
$$ 107448 99492 112192 69802 65976 69829 78325 111090 113053 118959 131503 134136 139604 124028
17363A24028j6897M205j9911j3059J15r250L459K3540j2580k1489K3142J5318
$$ 124028 107131 111336 91425 78366 78481 69231 72690 96230 83650 62161 85303 100621
17351A00621k0646j8346o447j0786J9363N7152J7153k1704k0411l4571l7982L407
$$ 100621 79975 61629 55182 44396 63759 120911 138064 116360 95949 61378 23396 26803
17339B6803L5696K1531J8186j2427k7288m5700k5430o863r959q601R048L1568
$$ 26803 62499 84030 102216 89789 62501 16801 -8629 -15492 -25451 -34052 -25004 6564
17327F564m165j9863N597K4667j1178R76J0989N464k1087m993Q078k1073J6436
$$ 6564 2399 -17464 -11867 12800 1622 2598 13587 19051 -2036 -7029 1049 -20024 -3588
17314c588L2890J4270J2915j5613k5983J0816J852j7022p774L312J3790R560k814
$$ -3588 29302 43572 56487 40874 14891 25707 27559 10537 2763 6075 19865 29425 26611
17301B6611O448N636k0954k4268J3575L6505K4087l0503j6998j0784o363M610
$$ 26611 33059 38695 17741 -6527 7048 43553 67640 37137 20139 9355 2992 7602
17289G602J787k3373k2492o903R709L6135J1813j1321j1697j4079J2778L8636
$$ 7602 9389 -13984 -36476 -43379 -33670 2465 14278 2957 -8740 -22819 -10041 28595
17277B8595Q462j7271j4563o678k535r844J8860K6712N219k0366j114l196k5723
$$ 28595 37057 19786 5223 -1455 -3990 -13834 5026 31738 36957 16591 15477 12281 -13442
17264a3442O275K6002R107K200j669p93J3604P10l3926K523K7228K2428K4612
$$ -13442 -7167 18835 27942 30142 28473 27680 41284 41994 8068 10591 37819 60247 84859
17251H4859M208k6931J8884K0416M620j365j3723j0552K7882M9610K8358Q566
$$ 84859 89067 62136 81020 101436 106056 104691 90968 80416 108298 157908 186266 194832
17239A94832l562l7343p690J3373r156l0782k5562l1862k3900p704L357m323J5957
$$ 194832 191270 153927 146237 159610 150454 119672 94110 62248 38348 30644 34001 29678 45635
17226D5635k5719l8010j0865K0049K3431K2857j5261j6419j5901J722K7908P476
$$ 45635 19916 -18094 -28959 -8910 14521 37378 22117 5698 -10203 -8481 19427 26903
17214B6903J4241J8390P608l322p2N746K1464l210K2023R244K3611N4516M9189
$$ 26903 41144 59534 67142 63820 63748 69494 90958 87748 109771 119015 142626 197142 246331
17201B46331K5608j5845R586M5843M8464N0169K5318L2517K8288n1159l4880j0272
$$ 246331 271939 256094 265680 311523 359987 410156 435474 467991 496279 445120 410240 399968
17189C99968l294J4675K1658M559J3874J9259J1318j412J742p310l1416l216j6976
$$ 399968 396674 411349 433007 437566 451440 470699 482017 480605 482347 475037 443621 440405 423429
17176D23429l5580l85J4812j0912j1241r382K5782N3551O0207J4124j253j6529
$$ 423429 387849 387464 402276 391364 380123 370741 396523 450074 510281 524405 523152 506623
17164E06623m2961k3287L313j451p292j9894k8217o9816o716j7417k8472L943
$$ 506623 463662 440375 443688 442237 434945 415051 386834 317018 310302 292885 264413 268356
17152B68356K5398P240j8417K0741m859k6356J0032L3525m7451j2404L5091j0115
$$ 268356 293754 300994 282577 303318 298459 272103 282135 315660 268209 255805 290896 280781
17140B80781j5770l1990j9447J9300K6550M8167N5510M3489K967M602N3463N6953
$$ 280781 265011 233021 213574 232874 259424 307591 363101 406590 409557 414159 467622 524575
17128E24575o692l0619l1955j0889j2507m5872M130N907k4032j0528j1433N21
$$ 524575 517883 487264 455309 444420 431913 386041 390171 396078 372046 361518 350085 350606
17116C50606R744P506M2832L2626j3175k5109j5061o225j4821L846J9084j839
$$ 350606 360350 367856 410688 443314 430139 405030 389969 383744 368923 372769 391853 390014
17104C90014j5866k5723j0797m0365k3967p298L5806L2833K8754P2496J26245
$$ 390014 374148 348425 337628 297263 273296 265998 301804 334637 363391 435887 562132
17093E62132J56554J62423J49734O8035m0821r4744j33674j47353j35144j39527
$$ 562132 718686 881109 1030843 1098878 1058057 963313 829639 682286 547142 407615
17083D07615r7558p9424l2945R871j7272M010k9685l5644p796J3710j7369k0532
$$ 407615 310057 230633 197688 207559 190287 194297 164612 128968 121172 134882 117513 96981
17071I6981k6318n1769j2695J5548R707K313R487O704m207p772J1387o343j5893
$$ 96981 70663 18894 6199 21747 31454 33767 43254 49958 45751 37979 49366 43023 27130
17058B7130K4412K0155j1075m506K666K8998j7204l0545l153J8826m234R929J7317
$$ 27130 51542 71697 60622 56116 58782 87780 70576 40031 36878 55704 51470 61399 78716
17045G8716L3686j9812l7004r137l421k6809j94J5803K7857o410l4495j4689P420
$$ 78716 112402 92590 55586 46449 43028 16219 16025 31828 59685 53275 18780 4091 11511
17032A1511J2609o631q892j5417k1213J1684q07N723K2738k244K130j5153N548
$$ 11511 24120 17489 8597 -6820 -28033 -16349 -17156 -11433 11305 9061 11191 -3962 1586
17019A586N717j4648k6478O532J0781K3276J3521K351j4359J34j0669p918R258
$$ 1586 7303 -7345 -33823 -27291 -16510 6766 20287 22638 8279 8413 -2256 -10174 -916
17006i16M826m585n699K2781J6196j6527o883r835J1356M899n083K0841q248j8930
$$ -916 3910 -675 -6374 16407 32603 16076 9193 -642 10714 15613 10530 31371 23123 4193
16992D193J064M826k5672K8611Q656k2899N856J4748k8851j8057L0605Q548K3725
$$ 4193 5257 10083 -15589 13022 21678 -1221 4635 19383 -9468 -27525 3080 11628 35353
16979C5353J705l1238m362j7666M205k2837J3019K0354L1539j3372k2301j8935
$$ 35353 37058 5820 1458 -16208 -12003 -34840 -21821 -1467 30072 16700 -5601 -24536
16967b4536k9385j4491L9834M2489L179j8167j6287j2360r598m434j3518P473
$$ -24536 -53921 -68412 -28578 13911 17090 -1077 -17364 -29724 -39322 -43756 -57274 -49801
16955d9801N158J4535K0809J642k2269j2266J8526J2324J5133K1632K110k338
$$ -49801 -44643 -30108 -9299 -7657 -29926 -42192 -23666 -11342 3791 25423 27533 25195
16943B5195k5717o985j983q761K252N877K212j6077r700J4827R128P386L569J0690
$$ 25195 -522 -7507 -9490 -18251 -15999 -10122 -7910 -23987 -33687 -18860 -9732 -2346 1223 11913
16929A1913N115r678l2521J6299J9060k0187j9826p552J0247K8313j6844k8962
$$ 11913 17028 7350 -25171 -8872 10188 -9999 -29825 -37377 -27130 1183 -15661 -44623
16917d4623J471k9276j2165L2981K2043Q345P727J4988j6436q169M293N254M015
$$ -44623 -43152 -72428 -84593 -51612 -29569 -21224 -13497 1491 -14945 -23114 -18821 -13567 -9552
16904i552J9960j481M548n450Q19R813J5693j644k3177q779j1682N865J4182K6047
$$ -9552 10408 8927 13475 8025 8844 18657 34350 32706 9529 750 -10932 -5067 9115 35162
16890C5162o286o158j6287r624O505j5226n226J475j5827k2937j7045O850P329
$$ 35162 28876 22718 6431 -3193 3312 -11914 -17140 -15665 -31492 -54429 -71474 -64624 -57295
16877e7295L1086M6894o921n3116J162M3220J1950N353l4123j2868J8483N520
$$ -57295 -26209 20685 13764 -39352 -38190 5030 16980 22333 -11790 -24658 -6175 -655
16865f55J191r418L0906K3313n591J2220K852J5583j8509l0400l3803r236R019
$$ -655 536 -8882 22024 45337 39746 51966 54818 70401 51892 21492 -12311 -21547 -12528
16852a2528K444J0764J7663O116k0747j7649K746l177j7574J1231N197J255J3812
$$ -12528 -10084 680 18343 24459 3712 -13937 -11191 -14368 -31942 -20711 -15514 -14259 -447
16839d47q117J376p982J1294J1297l3389k4731l4999K2048J1844j0791j4488J2046
$$ -447 -8564 -7188 -15170 -3876 7421 -25968 -50699 -85698 -63650 -51806 -62597 -77085 -65039
16826f5039K1439j7939O405n457j968l353n360J7982J1525N234K3368K817R22
$$ -65039 -43600 -61539 -55134 -60591 -62559 -65912 -71272 -53290 -41765 -36531 -13163 -10346 -9424
16813i424L292r701Q908J2651N33j4660P522J1241J0283j9456j6269J3172N715
$$ -9424 -6132 -15833 -6925 5726 6259 -8401 -879 10362 20645 1189 -15080 -1908 3807
16800C807j1592P770K194m123j5506J0525q57k7649M123P968O882L4149L0691
$$ 3807 -7785 -15 2179 -1944 -17450 -6925 -7782 -35431 -31308 -23340 -16458 17691 48382
16787D8382k8614o012J676n02m0705j649k808K9265K0454j101L156r918R164j7077
$$ 48382 19768 13756 15432 14930 -25775 -27424 -30232 -967 19487 18386 21542 11624 20788 3711
16773C711j6202k5809l184J1299J8524j819j321M3597j4355n257j0883l0479k7528
$$ 3711 -12491 -38300 -41484 -30185 -11661 -13480 -14801 28796 14441 9184 -1699 -32178 -59706
16760e9706J9525L547o929n485J1638J2039l7106O979J101L0388K2203k0466j6386
$$ -59706 -40181 -36634 -43563 -49048 -37410 -25371 -62477 -55498 -54397 -24009 -1806 -22272 -38658
16747c8658j4503R222J9171k449J2502O967r57k0855M850K382k2599P339L5114
$$ -38658 -53161 -43939 -24768 -27217 -14715 -7748 -8705 -29560 -24710 -22328 -44927 -37588 -2474
16734b474r815k6013J4269J5060K0601J1518j9720l4196k2281k4335J3510J8101
$$ -2474 -12289 -38302 -24033 -8973 11628 23146 3426 -30770 -53051 -77386 -63876 -45775
16722d5775N526K0066p768j2138J3121J946j0559L387J0910J4388j5496n351J951
$$ -45775 -40249 -20183 -27951 -40089 -26968 -25022 -35581 -32194 -21284 -6896 -22392 -27743 -25792
16709b5792K4205M3172p017k6397k1367l5619j4918J9836L414k9075L4745L3272
$$ -25792 -1587 41585 34568 8171 -13196 -48815 -63733 -43897 -40483 -69558 -34813 -1541
16697a541j2012j0647J1557L877j8095O638K3891j5656j8919j5657O463p727J3792
$$ -1541 -13553 -24200 -12643 -8766 -26861 -20223 3668 -11988 -30907 -46564 -40101 -47828 -34036
16684c4036J6281J3634O025j575j9186j3433J2850K7885r418k3390l7810j4087
$$ -34036 -17755 -4121 1904 329 -18857 -32290 -19440 8445 -973 -24363 -62173 -76260
16672g6260K6985L9468K8759l957L748k0746m417l3019k1972m617K4193J0001
$$ -76260 -49275 -9807 18952 14995 18743 -2003 -6420 -39439 -61411 -66028 -41835 -31834
16660c1834n694k580J5497P569j0950N465K3141p974k1297p394r794m017J6707
$$ -31834 -37528 -40108 -24611 -17042 -27992 -22527 614 -7360 -28657 -36051 -45845 -49862 -33155
16647c3155J8665K168j588o794n672j3959K8767J5687j4993j2417m826j1057k4688
$$ -33155 -14490 -12322 -13910 -20704 -26376 -40335 -11568 4119 -10874 -23291 -28117 -39174 -63862
16634f3862J347K918K70J9667L393L350m351q719P501J1218Q982J470n871K2161
$$ -63862 -62515 -59597 -59327 -39660 -36267 -32917 -37268 -45987 -38486 -27268 -18286 -16816 -22687 -526
16620e26j3359k5825J1999m016j2289p075j5109J3772K9142j048L893j9681j1855
$$ -526 -13885 -39710 -27711 -31727 -44016 -51091 -66200 -52428 -23286 -24334 -20441 -40122 -51977
16607e1977J3677K3354K2575p186R751K6919k2027r150r5j4555k103N794J3414
$$ -51977 -38300 -14946 7629 443 10194 37113 15086 5936 5841 -8714 -10817 -5023 8391
16594H391m574j1104q734k3447J9380K9258N2116J6258j9025k9721J0242k7726
$$ 8391 3817 -7287 -16021 -39468 -20088 9170 61286 77544 58519 28798 39040 11314
16582A1314k3952N379P776j3944m208J1302j0869p365L591n691j2709K9496r584
$$ 11314 -12638 -7259 517 -13427 -17635 -6333 -17202 -24567 -20976 -26667 -39376 -9880 -19464
16569a9464k2372K8788q310j7590P267J3133k697k7865P821K6826M1650N631k9509
$$ -19464 -41836 -13048 -21358 -38948 -31681 -18548 -21245 -49110 -41289 -14463 27187 32818 3309
16556C309l2909L997K788J0655N89k0638N641M653K2555q166J0025j5863j1828
$$ 3309 -29600 -25603 -22815 -12160 -11571 -32209 -26568 -21915 640 -7526 2499 -13364 -25192
16543b5192K6241L2728r256j4042M315k2406J2291l879Q405J2590l70k629l1459
$$ -25192 1049 33777 24521 10479 14794 -7612 4679 800 9205 21795 21425 18796 -12663
16530a2663j8539q305R240K4095K1975m275j3190n143J850j972Q629p722q460
$$ -12663 -31202 -39507 -30267 -6172 15803 11528 -1662 -6805 -4955 -6927 1702 -6020 -14480
16517a4480l636J9825J7251q936n302k0786Q738J2985j946K480p461n088j3825
$$ -14480 -18116 1709 18960 10024 4722 -16064 -7326 5659 3713 6193 -1268 -6356 -20181
16504b0181Q675P958j6383R458q69p940L0874m149j5822k252P044M138n579J0740
$$ -20181 -11506 -3548 -19931 -10473 -11342 -19282 11592 7443 -8379 -10631 -3587 551 -5028 5712
16490E712j7121j4731l1272R822j2526R064K4520j0614J0075K7153N017j0058
$$ 5712 -11409 -26140 -57412 -47590 -60116 -51052 -26532 -37146 -27071 82 5099 -4959
16478d959j2349Q287K320M964k0227K3086P515O688j468k9867r401p345R456O052
$$ -4959 -17308 -9021 -6701 -1737 -21964 1122 8637 15325 13857 -16010 -25411 -32756 -23300 -17248
16464a7248K3479J5674k0598k4825k2668M440L7526J1409J2691r96L34J4681k584
$$ -17248 6231 21905 1307 -23518 -46186 -41746 -4220 7189 19880 18884 19218 33899 31315
16451C1315l9548J917l581p543l1935J2338L959k813K3677K2647J0697n766r263
$$ 31315 -8233 -6316 -9897 -17440 -49375 -37037 -33078 -35891 -12214 10433 21130 15364 6101
16438F101k456m6145k7407k1665J4112J1093L1679J1577J6824L2187J2289k0487
$$ 6101 3645 -42500 -69907 -91572 -77460 -66367 -34688 -23111 -6287 25900 38189 17702
16426A7702l5702k3781l080j3601J0194K2006j8043j3299O830m376k350J7437
$$ 17702 -18000 -41781 -44861 -58462 -48268 -26262 -44305 -57604 -50774 -55150 -57500 -40063
16414d0063l596K5653K6032j5528l4790J0200K0298j440L237m252j2527n23L361
$$ -40063 -43659 -18006 8026 -7502 -42292 -32092 -11794 -13234 -9997 -14249 -26776 -27299 -23938
16401b3938J3061J6955k3051J9286k705k9053K290j5378j2719R331J380j1247
$$ -23938 -10877 6078 -16973 2313 -392 -29445 -27155 -42533 -55252 -45921 -44541 -55788
16389e5788k846P381p935q895r213K7732K0559P47J5823J1152L815R275k6481
$$ -55788 -58634 -51253 -59188 -68083 -77296 -49564 -29005 -28258 -12435 -1283 2532 11807 -14674
16376a4674k8187K3615M8148Ql1721r300L7702J1103k0195j3629j5567R300j409
$$ -14674 -42861 -19246 28902 28910 -2811 -12111 25591 36694 16499 2870 -12697 -3397 -4806
16363d806l965j0533R382J6312j2529Q762J0473k3400J0480K0403j5819l0896
$$ -4806 -8771 -19304 -9922 6390 -6139 2623 13096 -10304 176 20579 4760 -26136
16351b6136K81J4874l228j304k3954k4719L423J7714N473m472K3827J3108K1111
$$ -26136 -25855 -10981 -14209 -15513 -39467 -64186 -60763 -43049 -37576 -42048 -18221 -5113 15998
16338A5998K460q874q929j61J2865p552L289J5467j0235p467j003r180j0053l829
$$ 15998 18458 9584 655 494 13359 5807 9096 24563 14328 6861 5858 -3322 -13375 -17204
16324a7204N138m188K2652P818K9l0954m563k0421k4756K1326J6923l371K5935
$$ -17204 -12066 -16254 6398 14216 14245 -16709 -21272 -41693 -66449 -45123 -28200 -31571 -5636
16311e636J191M604k2900K1890K0995q079k7810m30P342j1181m81o000O749J768
$$ -5636 -4445 159 -22741 -851 20144 12065 -15745 -16175 -8833 -20014 -20495 -26495 -19746 -17978
16297a7978n001J0382K9686j4775k9222j9739L980K3249L0727L2373l0901k3539
$$ -17978 -22979 -12597 17089 2314 -26908 -46647 -42667 -19418 11309 43682 12781 -10758
16285a0758j1955p38K1736k586j4076m0684J955j1850K6648K2768J4062j3829
$$ -10758 -22713 -23451 -1715 -4301 -18377 -59061 -57106 -68956 -42308 -19540 -5478 -19307
16273a9307j4019M123l0201o458K9933P393j0925n027J6418L1652J2697j052o904
$$ -19307 -33326 -29203 -59404 -65862 -35929 -28536 -39461 -44488 -28070 3582 16279 15227 8323
16260H323j5680j8759Q560n801k596J021j864J4952P353j3067j8659M029R176
$$ 8323 -7357 -26116 -17556 -23357 -25953 -24932 -26796 -11844 -4491 -17558 -36217 -32188 -23012
16247b3012K363j9415j6988K0973j2046k6255L5093J7401k0421o457K0181m710
$$ -23012 -20649 -40064 -57052 -36079 -48125 -74380 -39287 -21886 -42307 -48764 -28583 -33293
16235c3293k1563P642L0484N418j1490j8110J1787k897r775K0947J7043l754J5207
$$ -33293 -54856 -47214 -16730 -11312 -22802 -40912 -29125 -32022 -41797 -20850 -3807 -7561 7646
16222G646l3748k0674j3505l836J5815J0061N880J1155J472K6397j669k556k0670
$$ 7646 -26102 -46776 -60281 -64117 -48302 -38241 -32361 -21206 -19734 6663 4994 2438 -18232
16209a8232j4463M564J1988O137K3563L798O549J271P442k6098j2577l8813O589
$$ -18232 -32695 -28131 -16143 -10006 13557 17355 23904 25175 32617 6519 -6058 -44871 -38282
16196c8282J6603K7788p587J5527k100L291k3027o900n491k7188J3150J1127p174
$$ -38282 -21679 6109 -1478 14049 11949 15240 -7787 -14687 -20178 -47366 -34216 -23089 -30263
16183c0263J7923R88J8558L932r123l337k85q677k4653k3021J8006R493O486P77
$$ -30263 -12340 -11352 7206 11138 2015 -1322 -1607 -10284 -34937 -57958 -39952 -30459 -23973 -23196
16169b3196L506j4473k792Q804K3860J0342l410K4474j0500m1878N974K2556K666
$$ -23196 -19690 -34163 -36955 -28151 -4291 6051 2641 27115 16615 -25263 -19289 3267 5933
16156E933p403P388J921n429j9375K266p788p519J4873q313j8229m396J7552r880
$$ 5933 -1470 5918 7839 2410 -16965 -14699 -22487 -30006 -15133 -23446 -41675 -46071 -28519 -38399
16142c8399j0795N751M296J9327l305J6670J8784q608r04j3673j600m945l968
$$ -38399 -49194 -43443 -39147 -19820 -23125 -6455 12329 3721 2817 -10856 -12456 -17401 -21369
16129b1369O209r320J612o495M564L1946M098j823J5048k6576j4856K249l578
$$ -21369 -15160 -24480 -22868 -29363 -24799 7147 11245 9422 24470 -2106 -16962 -14713 -18291
16116a8291k577L841j4088J3442J4178n361j141j6131L473M822J02J2650J7940
$$ -18291 -20868 -17027 -31115 -17673 -3495 -8856 -9997 -26128 -22655 -17833 -17731 -5081 12859
16103A2859J0433j9515l2289o132j2327L8883N405j4362n714j9962o365o560L3695
$$ 12859 23292 3777 -28512 -34644 -46971 -8088 -2683 -17045 -22759 -42721 -49086 -55646 -21951
16090b1951K7631M115n10k8155J2098j6574k2567m843O290r845K1496J5170m196
$$ -21951 5680 9795 9285 -18870 -6772 -23346 -45913 -50756 -44466 -54311 -32815 -17645 -21841
16077b1841j2980O720J2234n953M570j2996j3148J211L014R224p773k2068J2586
$$ -21841 -34821 -28101 -15867 -21820 -17250 -30246 -43394 -42183 -39169 -29945 -37718 -59786 -47200
16064d7200J5392R217J1074j069k4868K2480j3767j2729J9543M0475m145P56K4886
$$ -47200 -31808 -22591 -11517 -12586 -37454 -14974 -28741 -41470 -21927 18548 14403 15159 40045
16051D0045r238j3292Q768m198M9k5413o866J7676j8920k9763R970L3642O88m814
$$ 40045 30807 17515 26283 22085 22134 -3279 -10145 7531 -11389 -41152 -31182 2460 3148 -1666
16037a666K9435k274k7712j4829j4304M135J3560l990j2195o069J5643J0137J9858
$$ -1666 27769 25495 -2217 -17046 -31350 -27215 -13655 -17645 -29840 -35909 -20266 -10129 9729
16024I729J7270q234r167j1602J6945J1814j9523r568k869J9895Q682l0724J609
$$ 9729 26999 18765 9598 -2004 14941 26755 7232 -2336 -5205 14690 23372 -7352 -5743
16011e743Q43R514J1065P269k9841k8978K7618P660q797l5972j8109M0210K7357
$$ -5743 -4900 4614 15679 22948 -6893 -35871 -8253 -593 -9390 -45362 -63471 -23261 4096
15998D096O62q304Q2Q131J0686m203j8297k471J4381j7197k1454N561J2268P392
$$ 4096 4758 -3546 -3464 4667 15353 11150 -7147 -9618 4763 -12434 -33888 -28327 -16059 -8667
15984h667r767k2462j6815J8047L3664K8648L1143j0231R49l9908q811K2785K3491
$$ -8667 -18434 -40896 -57711 -39664 -6000 22648 53791 43560 44509 4601 -4210 18575 42066
15971D2066k4125j3579J0599J1903j0810Q373j862n157K0599j5689j9404L0663
$$ 42066 17941 4362 14961 26864 16054 24427 22565 17408 38007 22318 2914 33577
15959C3577J0242o639l3353l400N903N330l9038J8880K3378j1940l0815L569K7261
$$ 33577 43819 37180 3827 427 6330 11660 -27378 -8498 14880 2940 -27875 -24306 2955
15946B955K0694l791n395N058m370k2793J3421J8163j9263P785R47K643j35J1851
$$ 2955 23649 19858 14463 19521 15151 -7642 5779 23942 4679 12464 13411 16054 15919 27770
15932B7770P140R154j7769j0841o341L195k547j5376j845K5326J9745j0006M843
$$ 27770 34910 44064 26295 15454 9113 12308 9761 -5615 -7460 17866 37611 27605 32448
15919C2448j2382j8703J804k176k421j7489J3228K6689M557P311j8451J4379O128
$$ 32448 20066 1363 3167 991 -1430 -18919 -5691 20998 25555 32866 14415 28794 34922
15906C4922J6619J5327n788k4793l1105r287K259K9845L3355j2547k2763j0364
$$ 34922 51541 66868 61080 36287 5182 -4105 -1846 27999 61354 48807 26044 15680
15894A5680k1642K2267j566j4233l4177r755L2291K5762P859j9206p224J1514
$$ 15680 -5962 16305 14739 506 -33671 -43426 -11135 14627 22486 3280 -3944 7570
15882G570l703J511J7009J519k9288k9269n79J5806M384P202K130J7352J359L380
$$ 7570 3867 5378 22387 23906 -5382 -34651 -35230 -19424 -15040 -7838 -5708 11644 13003 16383
15868A6383j234j501j2403l0146q022L7968O152j9758J0872q37J6977j7127n273
$$ 16383 15149 13648 1245 -28901 -36923 1045 7197 -12561 -1689 -2526 14451 -2676 -7949
15855g949j2208k976K805N911P655J8583K845j3777k267j253L164j918N927l985
$$ -7949 -20157 -23133 -20328 -14417 -6762 11821 14666 889 -1378 -2631 533 -1385 4542 557
15841E57r195K118J8174K5984K2208n544k6110j5263J974j4438p425R8j7173m833
$$ 557 -8638 -6520 11654 37638 59846 54302 28192 12929 14903 465 -6960 -6862 -24035 -28868
15827b8868O282j4213K3953J2929j6066l1193J2311J3093K4160K7287J0430Q751
$$ -28868 -22586 -36799 -12846 83 -15983 -47176 -34865 -21772 2388 29675 40105 48856
15815D8856J405j0489j9848m615j178l5250k4732M11j767J8338L4806o062m6k556
$$ 48856 50261 39772 19924 15309 14131 -21119 -45851 -45440 -47207 -28869 5937 -125 -171 -2727
15801b727J9557q427j7353K7652p352r432K0199j2981j7667L1423l042j6334L2231
$$ -2727 16830 8403 -8950 18702 11350 1918 22117 9136 -8531 22892 19850 3516 35747
15788C5747m154l8681l124k831k4307J8462k366O738J5767n486L5844R328j1956
$$ 35747 31593 -7088 -10212 -13043 -37350 -18888 -21254 -14516 1251 -4235 31609 40937 28981
15775B8981j0745j2792r746j4052o715J6151Q376J2365n279k2441J9855Q953j3969
$$ 28981 18236 5444 -4302 -18354 -25069 -8918 -542 11823 6544 -15897 3958 12911 -1058
15762a058r810m2086O940M8448J3816k9277j3984K7031L6119n377j3229n477J3010
$$ -1058 -10868 -52954 -46014 2434 16250 -13027 -27011 20 36139 30762 17533 12056 25066
15749B5066r322j9915j5174k7487J8143J4189N776P471J8047J554J0608K782k645
$$ 25066 15744 -4171 -19345 -46832 -28689 -14500 -8724 -1253 16794 18348 28956 31738 29093
15736B9093j9249j5300p337L3235J6471o795j7594J2082k342k6776J4214q457
$$ 29093 9844 -5456 -12793 20442 36913 30118 12524 24606 22264 -4512 9702 1245
15724A245j5156k041J408K4601j3863J5108K8958J6097l395j34k5133m1961p913
$$ 1245 -13911 -15952 -14544 10057 -3806 11302 40260 56357 52962 52828 27695 -14266 -22179
15711b2179J0160L7869k369r024p927K2768n73J8595k2713k6564k6887J6899j1955
$$ -22179 -12019 25850 23481 14457 6530 29298 28725 47320 24607 -1957 -28844 -11945 -23900
15698b3900J0187J181J3358K046J0386j2414j4331m431Q783Q172j449K6780M828
$$ -23900 -13713 -12532 826 2872 13258 844 -13487 -17918 -9135 -963 -2412 24368 29196
15685B9196j5140J7338Q771l1000J5434M326j2975k6242J2613j002o021N362J2413
$$ 29196 14056 31394 40165 9165 24599 28925 15950 -10292 2321 1319 -4702 660 13073
15672A3073L2179j2872m8446m3121K6856L1059Q154N009K0181l690O340R802K2706
$$ 13073 45252 32380 -16066 -59187 -32331 -1272 6882 11891 32072 28382 34722 44524 67230
15659F7230k489m4634k584j2120K1017P612Q30k0762R129N419K1427j2603l0115
$$ 67230 64741 20107 17523 5403 26420 34032 34862 14100 23229 28648 50075 37472 7357
15646G357k6685q504L7684K6808r85k2706k3175L563M2242J2272Q963M540P46
$$ 7357 -19328 -27832 9852 36660 35675 12969 -10206 -6643 35599 47871 56834 61374 62120
15633F2120k8088k7220r742J6935J87k3937j9878K220K3221l515j6637N47o294
$$ 62120 34032 6812 -2930 14005 14192 -9745 -29623 -27403 -4182 -7697 -24334 -23787 -30081
15620c0081o977Q220R930R667M1117J9010M271j8929j1367q570k1458j9959Q862
$$ -30081 -37058 -28838 -18908 -9241 31876 50886 55157 36228 24861 16291 -5167 -25126 -16264
15607a6264J1939N811j2011K7840J3213n859r782j4051n197J799m828J2381J3274
$$ -16264 -4325 1486 -10525 17315 30528 24669 14887 836 -4361 -2562 -7390 4991 18265
15594A8265j448j3191k0856J1919L4758L81j1662n502O239K4733M382j4510k247
$$ 18265 16817 3626 -17230 -5311 29447 29828 18166 12664 18903 43636 48018 33508 31261
15581C1261K881m246n0407k112J7203l729j09p386R778J5869J8217k4380k4899
$$ 31261 34142 29896 -20511 -22623 -5420 -9149 -9258 -16644 -6866 9003 27220 2840 -22059
15568b2059p320K3957M009j1132J2223n643j8323n363K5017O622K6219L6499p905
$$ -22059 -29379 -5422 -1413 -12545 -322 -5965 -24288 -29651 -4634 1988 28207 64706 56801
15555E6801M723k3079k0004N446J1553J0205j9044n054R943K219M765J2013M400
$$ 56801 61524 38445 18441 23887 35440 45645 26601 21547 31490 33709 38474 50487 54887
15542E4887k3698J7842q734j131K1974j2434R136J1824l5279k4550O121R735R671
$$ 54887 31189 49031 40297 39166 61140 48706 57842 69666 34387 9837 15958 25693 35364
15529C5364O85J0910j5881m3758m883K7155l546l065J828l736q172M930J3634
$$ 35364 36049 46959 31078 -12680 -17563 9592 6046 2981 4809 1073 -7099 -2169 11465
15516A1465j41n858k999p523r022M863j477J7183J7572m703k2286J1952J3242
$$ 11465 11324 5466 2467 -5056 -14078 -9215 -10692 6491 24063 19360 -2926 9026 22268
15503B2268p984o298j5392l0169J259O297J200K1015L2018L3340K6733k008k0246
$$ 22268 14284 7986 -7406 -37575 -36316 -30019 -28819 -7804 24214 57554 84287 82279 62033
15490F2033k2494j3666O817k661j3598j9723M956J2404j8353l394r933j924j5642
$$ 62033 39539 25873 32690 30029 16431 -3292 1664 14068 -4285 -7679 -17612 -19536 -35178
15477c5178p846K9741J6425K8187N210J3595k362k0703k1348k8682m912J4531
$$ -35178 -43024 -13283 3142 31329 36539 50134 47772 27069 5721 -22961 -27873 -13342
15465a3342R334k2681J3237K8295L0641K370j6493k2849j0434q947O674p656K0901
$$ -13342 -4008 -26689 -13452 14843 45484 47854 31361 8512 -1922 -10869 -4195 -11851 9050
15452I050p14J283j0614k039L84j5712M313J9107p592l3287J6879J5212q628L028
$$ 9050 8336 9619 -995 -3034 -2650 -18362 -14049 5058 -2534 -35821 -18942 -3730 -12358 -9330
15438i330K9981P678N771n851j0925n004k3549K0164K2972N259r336j6546p738
$$ -9330 20651 28329 34100 28249 17324 12320 -11229 8935 31907 37166 27830 11284 3546
15425C546J7868J8765j3219j1303J1139l5373j4389J8769J2864J161K901r166
$$ 3546 21414 40179 26960 15657 26796 -8577 -22966 -4197 8667 9828 12729 3563
15413C563j711J9130q250n798J571r318l5326l4807n992L2731J9033J9585J3584
$$ 3563 1852 20982 12732 6934 8505 -813 -36139 -70946 -76938 -44207 -25174 -5589 7995
15400G995P908J7794J4703j8121N088l283q001p966j0994k2612J62N750K0953
$$ 7995 15903 33697 48400 30279 35367 32084 24083 16117 5123 -17489 -17327 -11577 9376
15387I376K508m538J2178J0127j4209j6315r673N347K1072q118k2806l783K3854
$$ 9376 11884 7346 19524 29651 15442 -873 -10546 -5199 15873 7755 -15051 -18834 5020
15374E020L0321J3149l0025K4069K5416J7904J1579j3682l9244l1658l1371J4514
$$ 5020 35341 48490 18465 42534 67950 85854 97433 83751 44507 12849 -18522 -4008
15362d008K1938P94K48O892o103K0879N530N394M599j2341j7090j5014P952J936
$$ -4008 17930 18724 18972 25864 19761 40640 46170 51564 56163 43822 26732 11718 19670 21606
15348B1606J6722K4885P387M542J5747j0220k8023j0392r995k0159J626J9392
$$ 21606 38328 63213 70600 75142 90889 80669 52646 42254 32259 12100 13726 33118
15336C3118J3015q553J89M6643K4584o605l8670k4030j0453l30k0767J2937L2439
$$ 33118 46133 37580 37769 84412 108996 102391 63721 39691 29238 28908 8141 21078 53517
15323E3517j7554R276o597n454Q028J1802l817l451k0022R542J2466k720p224
$$ 53517 35963 45239 38642 33188 41216 53018 49201 45750 25728 35270 47736 45016 37792
15310C7792k7573J3236K4789J5205j0347L811o017q443L466L478n668O595k1842
$$ 37792 10219 23455 48244 63449 53102 56913 50896 42453 45919 49397 43729 50324 28482
15297B8482K1806J5175K408k690r015K929l741k026P432o914r230j136q056n295
$$ 28482 50288 65463 67871 65181 56166 59095 55354 53328 60760 53846 44616 43480 35424 30129
15283C0129o277m568j5475M460K1733J8745R174p783N275N428j6559J089N084
$$ 30129 23852 19284 3809 8269 30002 48747 57921 50138 55413 60841 44282 45371 50455
15270E0455O112k0226m468j0204Q219j121J7344Q413J0580l338J4830L9131O169
$$ 50455 56567 36341 31873 21669 29888 28767 46111 54524 65104 61766 76596 115727 121896
15257A21896k4942j269j860l1610j4158j4677j2585R001J1305j8879J9450p669
$$ 121896 96954 95685 93825 62215 48057 33380 20795 29796 41101 22222 41672 34003
15245C4003j5348K4296K5233K4537j3106j8768l960k2469L177l0228q776P639
$$ 34003 18655 42951 68184 92721 79615 60847 56887 34418 37595 7367 -1409 6230
15233F230K6082M616L6474L0206O610k8125j4186l7076j0209Q380l722J3555L5773
$$ 6230 32312 36928 73402 103608 110218 82093 67907 30831 20622 29002 25280 38835 74608
15220G4608M840J2535J8612R403j5173M69r699j4752R699o725k0564K4910J576
$$ 74608 79448 91983 110595 119998 104825 105294 95595 80843 90542 83817 63253 88163 89739
15207H9739o646O772j9976j0436P136l60O407k5232j9629J489j042l568J9561
$$ 89739 83093 89865 69889 59453 66589 66229 72636 47404 27775 29264 28222 24654 44215
15194D4215K7791J5412j967L9713K6904k6175j3904j8588k3758j120j2672L852
$$ 44215 72006 87418 85451 125164 152068 125893 111989 93401 69643 68523 55851 59703
15182E9703M4458K7774j2262k0993k6682l33k294k8491P055J145J2101K0825K8092
$$ 59703 104161 131935 119673 98680 71998 71665 69371 40880 47935 49080 61181 82006 110098
15169A10098K8901L2490k906l7756j2168j7986J2755j3679P253L3663j8401j8642
$$ 110098 138999 171489 168583 130827 118659 100673 113428 99749 107002 140665 122264 103622
15157A03622Q711K7624K4973j6839j2462o51l065L6318O7012M5319K4520P6017
$$ 103622 112333 139957 164930 148091 135629 134978 131913 168231 235243 280562 305082 381099
15145C81099J28180J20096J14627J92442J95873J52671J29577J63630J04044N3466
$$ 381099 509279 629375 744002 936444 1132317 1284988 1414565 1578195 1682239 1735705
15135A735705K0789n5263r2364j15809j26806j58104j80947j64765j16078j13550
$$ 1735705 1756494 1701231 1608867 1493058 1366252 1208148 1027201 862436 746358 632808
15125F32808p9461p6769m3536q322o7279j5047j5906k6536k7150L033k0449j8401
$$ 632808 553347 476578 433042 424720 357441 342394 326488 299952 272802 275835 255386 236985
15113B36985j5672m045K2469j8649j1766L709K0941J8749k3462k3955n324J2737
$$ 236985 221313 217268 239737 221088 209322 213031 233972 252721 229259 205304 199980 212717
15101B12717q726l7357j2602J0833J571J836k0689k7554j1314j5779J2271K5748
$$ 212717 203991 166634 154032 164865 166436 168272 147583 120029 108715 92936 105207 130955
15089A30955j168M667l8169j4679J3656K6860m623K805K3842K1247l2306J2924
$$ 130955 129787 134454 96285 81606 95262 122122 117499 120304 144146 165393 133087 146011
15077A46011J5010j5011k2119m5729O543K2994J7305j7021j8264Q072K5803J6289
$$ 146011 161021 146010 123891 78162 84705 107699 125004 107983 89719 97791 123594 139883
15065A39883j7275j6347j5231j0939j9550J2392K0888N012K945k8162Q864M1256
$$ 139883 122608 106261 91030 80091 60541 72933 93821 98833 101778 73616 82480 123736
15053A23736p210o44N301J4208J1487j3200q369K147j8718n982J2355R05j8232
$$ 123736 116526 115882 121183 135391 146878 133678 125309 127456 108738 102756 115111 116016 97784
15040I7784K8527k705j1954l973n120m227J4213N2937O419k2058o395j3610L131
$$ 97784 126311 123606 111652 107679 102559 98332 112545 165482 171901 149843 143448 129838 132969
15027A32969L524l1875k2297P662N745O100r217K3510L9800j091J1409q051k3275
$$ 132969 136493 104618 82321 89983 95728 101828 92611 116121 155921 154830 166239 158188 134913
15014A34913K689N574L1809L5357J8591O999M0456Q1130J45349K69196L72521
$$ 134913 137602 143176 174985 210342 228933 235932 276388 357518 502867 772063 1144584
15003A144584M05837L06152K50962K02259q909l56391o86001m74775j90801j07406
$$ 1144584 1550421 1856573 2107535 2309794 2300885 1944494 1258493 783718 592917 485511
14993D85511o6498j7797n5375q0770k4975J4121j0697j7539q922J0326J0180k5000
$$ 485511 419013 401216 345841 265071 240096 254217 243520 225981 217059 227385 237565 212565
14981B12565l2783J504L335k390o541O664L105J0568J1441P372J6520o271k4079
$$ 212565 179782 181286 184621 182231 175690 182354 185459 196027 207468 214840 231360 225089 201010
14968B01010j378Q894L1334O686k67k9794l9571K344J7273p58q939j0683j7883
$$ 201010 199632 208526 239860 246546 246279 216485 176914 179258 196531 195773 186834 176151 158268
14955A58268j8667k9806Q725L7091P629j6552m103J0304P802J9875J4928J1227
$$ 158268 139601 109795 118520 155611 163240 146688 142585 152889 160691 180566 195494 206721
14943B06721K2692j4412k1793L834K5926N7829K8004n456l074K4266k9618j5588
$$ 206721 229413 215001 193208 197042 222968 280797 308801 303345 300271 324537 294919 279331
14931B79331j0078J791M1498j726l7979k4043J0310J3362k3146q03K248R240j2610
$$ 279331 269253 271044 312542 310816 272837 248794 259104 272466 249320 248517 250765 260005 247395
14918B47395j4119j041k1583L15J2204P403L726r490J2888l98O61J7236n181k1525
$$ 247395 233276 232235 210652 210967 223171 230574 234300 224810 237698 237300 237961 255197 250016 228491
14904B28491q144j1115P590J204q704o425J6711k3700k164M9018K3653K990Q330
$$ 228491 220347 209232 216822 218026 209322 202897 219608 195908 193744 242762 266415 269405 277735
14891B77735k73k2318j2941J5838J0291p09J3136k8781J6146J681K8926j7342
$$ 277735 277462 255144 242203 258041 268332 267623 280759 251978 268124 269805 298731 281389
14879B81389J1023j2635k3658l8480j8382J4104j9437m3311j9058j5690j3386
$$ 281389 292412 279777 256119 217639 199257 213361 193924 150613 131555 115865 102479
14868A02479n853N474J1938k5293L150L909j9753J1779o927O537L5454J0926R713
$$ 102479 96626 102100 114038 88745 91895 95804 76051 87830 80903 87440 122894 133820 143533
14855A43533M932m057J9360K5860R080j3968l496J9260k169P266j5983j3356O236
$$ 143533 148465 144408 163768 189628 198708 184740 181244 200504 198335 205601 189618 176262 182498
14842A82498k695k2338K0030J0031J9569L326p942n552j3193k3721R35O8585K7768
$$ 182498 179803 157465 177495 187526 207095 210421 202479 196927 183734 160013 160948 229533 257301
14829B57301N549J3450j4028J4205K706K83n722j552J4076p568L408L2416K3440
$$ 257301 262850 276300 262272 276477 279183 279466 273744 272192 286268 278700 282108 314524 337964
14816C37964J508J7500M7946M0775M1740N5160N9014M2728L4747M2033N6598J6279
$$ 337964 339472 356972 404918 445693 487433 542593 601607 644335 679082 721115 777713 793992
14804G93992j3863k3672j863j6980r725j9792l2904O49n326k8580j9295q487j8540
$$ 793992 780129 756457 754594 737614 727889 708097 675193 675842 670516 641936 622641 614154 595614
14791E95614J577K1381L5038L942k2557k2987L1436J5399q75N123j5073J974J7317
$$ 595614 597191 618572 653610 657552 634995 612008 643444 658843 657968 663091 648018 649992 667309
14778F67309J2061p362K979J3026J7219j2051K231L0731p210M511m254j4859k620
$$ 667309 679370 672008 674987 688013 705232 693181 695412 726143 718933 723444 719190 704331 701711
14765G01711M0530M1515J2279r501j5334K2168K7208k906k1109J4463O0271M4913
$$ 701711 742241 783756 796035 786534 771200 793368 820576 817670 796561 811024 871295 916208
14753I16208O1060L3352J3797L5423N6739K5496K6296J6589L9984K0389J9507
$$ 916208 977268 1010620 1024417 1059840 1116579 1142075 1168371 1184960 1224944 1245333 1264840
14742A264840K1975J8064N9693O4314L0436M0230J3583k2723N763J5578N1531
$$ 1264840 1286815 1304879 1364572 1428886 1459322 1499552 1513135 1490412 1496175 1511753 1563284
14731A563284K5048m955J2644m29o472N1152Q1406N0059O1300N3202L9377R0426
$$ 1563284 1588332 1583377 1596021 1595592 1589120 1640272 1721678 1771737 1833037 1886239 1925616 2016042
14719B016042R6093R2157R6873J20497J75408J60587K01744K16462K31953K66807
$$ 2016042 2112135 2204292 2301165 2421662 2597070 2757657 2959401 3175863 3407816 3674623
14709C674623L20559L81368M31227N46441O74736Q25308J007001J229025J495423
$$ 3674623 3995182 4376550 4807777 5354218 6028954 6854262 7861263 9090288 10585711
14700A0585711J802903K134936K557383L165811L995942N311718P307531J0103930
$$ 10585711 12388614 14523550 17080933 20246744 24242686 29554404 36861935 46965865
14692D6965865J3506069J7354489K1603912K6089782K9742956L1408410L0864714
$$ 46965865 60471934 77826423 99430335 125520117 155263073 186671483 217536197
14685B17536197K8925192K5578926J9749278J1121089J271899p427711j4453919
$$ 217536197 246461389 272040315 291789593 302910682 304182581 296754870 282300951
14678B82300951k0800012k6311565k9535184k9480851k7045827k3979578k0781951
$$ 282300951 261500939 235189374 205654190 176173339 149127512 125147934 104365983
14671A04365983j7126895j3123357r505633o869385n261544m294061l661064l203855
$$ 104365983 87239088 74115731 64610098 57740713 52479169 48185108 44524044 41320189
14663D1320189k858571k529410k213949j956485j691340j445240j280214j177488
$$ 41320189 38461618 35932208 33718259 31761774 30070434 28625194 27344980 26167492
14655B6167492j067617r56258q98994q55716q05363p82552p13403p14799p02361
$$ 26167492 25099875 24143617 23244623 22388907 21583544 20800992 20087589 19372790 18670429
14646A8670429o44747o20917n86818n47915n34854n05752m59877m20463m36587
$$ 18670429 18025682 17404765 16817947 16270032 15735178 15229426 14769549 14349086 13912499
14637A3912499m21544l69381l43279l30850l14069l38084l19580k81857l19628
$$ 13912499 13490955 13121574 12778295 12447445 12133376 11795292 11475712 11193855 10874227
14628A0874227l20270k92032k94822k86682k77121k56616k24531k42544k41660
$$ 10874227 10553957 10261925 9967103 9680421 9403300 9146684 8922153 8679609 8437949
14619H437949k41212k36283k54743k27709k16073k26139j87662j64013j47109
$$ 8437949 8196737 7960454 7705711 7478002 7261929 7035790 6848128 6684115 6537006
14610F537006j73676j50883j34401j35071j73096j37608j41525j16415j19450
$$ 6537006 6363330 6212447 6078046 5942975 5769879 5632271 5490746 5374331 5254881
14601E254881j33369j39932j72023j61233j16380j23780j34096j00792q5093r9093
$$ 5254881 5121512 4981580 4809557 4648324 4531944 4408164 4274068 4173276 4088183 3989090
14591C989090r9568j05405q8600o2658q0234q1319n1758q3015j08779r0820q8686
$$ 3989090 3889522 3784117 3695517 3632859 3552625 3471306 3419548 3336533 3227754 3136934 3048248
14580C048248j06764q8529p2209p5723r6033j14831p8148o0167q0458p7928n5547
$$ 3048248 2941484 2852955 2780746 2705023 2608990 2494159 2416011 2355844 2275386 2197458 2141911
14569B141911n4443o4548m0378o8316p1558q9000p7139o3350n9108j9621l439
$$ 2141911 2087468 2022920 1982542 1914226 1842668 1753668 1676529 1613179 1554071 1534450 1531011
14558A531011k2951m3412l2338k2089j3435J3238k0379M697o658j7802k5420k2339
$$ 1531011 1508060 1464648 1432310 1410221 1396786 1410024 1389645 1394342 1387684 1369882 1344462 1322123
14546A322123l7954m0280j4608j5487l2003j8013j5658l7997J195j9233l8290
$$ 1322123 1284169 1243889 1229281 1213794 1181791 1163778 1148120 1110123 1111318 1092085 1053795
14535A053795m5627l3037l7570q953k6921m4220n4633n0563m0244n1847k7672
$$ 1053795 1008168 975131 937561 928608 901687 857467 802834 752271 712027 660180 632508
14524F32508j2472Q347l4457l4450l2058q341k6026k1589k89j0300j704k5894
$$ 632508 620036 628383 593926 559476 527418 519077 493051 471462 471173 460873 459169 433275
14512D33275m3262j1840j6388k1270K9880j7485m055O785K1071J6353k3545o034
$$ 433275 390013 378173 361785 340515 370395 352910 348855 355640 376711 393064 369519 363485
14500C63485L125K1728K3925J7131k985k9345l0450p077l7397n1916m2531k7743
$$ 363485 366610 388338 412263 429394 426409 397064 366614 359537 322140 270224 227693 199950
14488A99950k8606l7669k9998l3510j3046j6174J3939J8730J2882J7994K885j7781
$$ 199950 171344 133675 103677 70167 57121 40947 54886 73616 86498 104492 107377 89596
14476H9596j4615j1231K246J0368K1991L7055Q740J0401O551l892k1403P829P035
$$ 89596 74981 63750 65996 76364 98355 135410 144150 154551 161102 157210 135807 143636 150671
14463A50671j2378J8736K0122j3478k2104k4357J6855L397J9751K3677l0266l3338
$$ 150671 138293 157029 177151 163673 141569 117212 134067 137464 157215 180892 150626 117288
14451A17288j0569K2393J8707j6541J7176m523k7737j1852L767J122N11q741J699
$$ 117288 106719 129112 147819 131278 148454 143931 116194 104342 108109 109231 109742 101001 102700
14438A02700m378m187j9558K4711J0628M913j1742k348J9383J7614r929N770J0037
$$ 102700 98322 94135 74577 99288 109916 114829 103087 100739 120122 137736 127807 133577 143614
14425A43614j3104J829J403K855k0333r838k5543P956J1580J6629K2513q258o108
$$ 143614 130510 132339 133742 136597 116264 106426 80883 88839 100419 117048 139561 131303 125195
14412A25195M539k817R515q962l266j2861r921n718L3349K5534k7855j8310k4265
$$ 125195 129734 126917 136432 127470 124204 111343 101422 95704 129053 154587 126732 108422 84157
14399H4157j0382n752N374j5786j3435j853p219q943j4161J1820M018j2153J1237
$$ 84157 73775 68023 73397 57611 44176 42323 35104 26161 12000 23820 27838 15685 26922
14386B6922J5308p530K381j2636j7648k397K519n906J3645k2586k5274K393J4768
$$ 26922 42230 34700 37081 24445 6797 4400 6919 1013 14658 -7928 -33202 -30809 -16041
14373a6041j0040p432J1949J0690K6556q588P990J9564k007J8286O383j4081p190
$$ -16041 -26081 -33513 -21564 -10874 15682 7094 15084 34648 32641 50927 57310 43229 36039
14360C6039k545J2373j0340P583m862j5772K492j134j5548l3472k238K9086J015
$$ 36039 33494 45867 35527 43110 38248 22476 24968 23834 8286 -25186 -27424 1662 2677
14347B677k8364k9902N682J6680K3770R800j9150r745J3928K8623l2386j4792
$$ 2677 -25687 -55589 -49907 -33227 -9457 343 -18807 -28552 -14624 13999 -18387 -33179
14335c3179J4624N300k4869m2872k5834J0765J3314k0761l4154Q544M2977K0085
$$ -33179 -18555 -13255 -38124 -80996 -106830 -96065 -82751 -103512 -137666 -129122 -86145 -66060
14323f6060L3050K0126M859j5914j0737k3201J0604J8177J0698p844m173K3424
$$ -66060 -33010 -12884 -8025 -23939 -34676 -57877 -47273 -29096 -18398 -26242 -30415 -6991
14311f991J3407o674l3009j6734M02j0636M8378q83k9166r15L1864m653k8099
$$ -6991 6416 -258 -33267 -50001 -49599 -60235 -11857 -12740 -41906 -42821 -10957 -15610 -43709
14298d3709j4119J9407J0717k6266M729J5557k655n059K4877K2443j5851j8760
$$ -43709 -57828 -38421 -27704 -53970 -49241 -33684 -36339 -41398 -16521 5922 -9929 -28689
14286b8689R206L3035k1549j9199q680l620K8K2384L9215L2044j4310r970n217
$$ -28689 -19483 13552 -7997 -27196 -35876 -39496 -39468 -17084 22131 54175 39865 29895 24678
14273B4678j3807j6598k7307l197j5162J9852J1744R251L755j3511j4436j5745
$$ 24678 10871 -5727 -33034 -36231 -51393 -31541 -19797 -10546 -6791 -20302 -34738 -50483
14261e0483M796Q321j867J0860J1690K1424R149J4236m092j4071k6101j2347j998
$$ -50483 -45687 -37366 -39233 -28373 -16683 4741 13890 28126 24034 9963 -16138 -28485 -30483
14248c0483k0248p474L2241J1448J287K2029K9967O535j4941j0832J9300J5514
$$ -30483 -50731 -58205 -25964 -14516 -13229 8800 38767 45302 30361 19529 38829 54343
14236E4343L1186K2470J5781M5990M8388N8437R3164R6319J18684J55560J63830
$$ 54343 85529 107999 123780 169770 218158 276595 369759 466078 584762 740322 904152
14225I04152J44263J59100J52124J04826P6043k2922l7172n7625j24610j00048
$$ 904152 1048415 1207515 1359639 1464465 1540508 1517586 1480414 1422789 1298179 1198131
14215A198131j14914j00092j25649j33497j64036j23993n6304o4065l2314o640
$$ 1198131 1083217 983125 857476 723979 559943 435950 379646 315581 283267 276627
14205B76627l0043l5861k7550j9077o103j8119k9556L977K824j9370J7184j1211
$$ 276627 246584 210723 183173 164096 157993 139874 110318 114295 117119 97749 114933 103722
14193A03722m6512P002N95O643k574J9591R445k7195j0830k913K917J5050N774
$$ 103722 57210 64212 64807 71450 68876 88467 97912 70717 59887 56974 59891 74941 80715
14180H0715l3846j5002j8991R867n512J3766M6712K2186q629M650L8795K1088
$$ 80715 46869 31867 12876 22743 17231 30997 77709 99895 91266 95916 134711 155799
14168A55799L8218j838P26J8444K802J9022M0955M1822J2520k472K9979k0768
$$ 155799 194017 192179 192905 211349 214151 233173 274128 315950 328470 325998 355977 335209
14156C35209k0991m526j1715j1963m078k5588m0006l1210j0108l9638k3494p128
$$ 335209 314218 309692 297977 286014 281936 256348 216342 185132 175024 135386 111892 104764
14144A04764o816j1300N365n816j2133r309j9569j562M0636q564k2078J1474J4763
$$ 104764 97948 86648 92013 86197 74064 64755 45186 43624 84260 75696 53618 65092 79855
14131G9855k2923l6267L1131J2321O1969O0553P272L0813L8655K0150j597j871
$$ 79855 56932 20665 51796 64117 126086 186639 193911 224724 263379 283529 281932 280061
14119B80061o744l52l9433K185j5107o5198o9751j3798J0916J1173j9078n84J8052
$$ 280061 273317 272965 233532 235717 220610 155412 85661 71863 82779 93952 74874 74290 92342
14106I2342j6495l8386P925O22J6915j3005R28P401k232n889M492M487m5844l3495
$$ 92342 75847 37461 45386 46008 62923 49918 50846 58247 56015 50126 54618 59105 13261 -20234
14092b0234J3563j2934J2734K2063o361J6267j9108N335J8073k128n465K0499
$$ -20234 -6671 -19605 -6871 15192 8831 25098 5990 11325 29398 27270 21805 42304
14080D2304L6972Q375l760j1474j8169p176M513K29j457k2509J0371J1196K6729
$$ 42304 79276 87651 83891 72417 54248 47072 51585 51814 50357 27848 38219 49415 76144
14067G6144L451l2593n325j9498j4644K7590M5573K505l7473k2565R326J9537
$$ 76144 79595 47002 41677 22179 7535 35125 80698 83203 45730 23165 32491 52028
14055E2028K6634R178J0270R08L721N140L8216J0387l2296k8121K6341L7864L2530
$$ 52028 78662 87840 98110 99018 102739 107879 146095 156482 124186 96065 122406 160270 192800
14042A92800L3289K0377M0205L7391J7217Q3661Q0332O4437Q2470R8300J71487
$$ 192800 226089 246466 286671 324062 341279 424940 505272 569709 652179 750479 921966
14031I21966K56181L24618M41475N69757P11883Q46395R45219R00361P66842N67482
$$ 921966 1178147 1502765 1944240 2513997 3225880 4072275 5017494 5917855 6684697 7252179
14021G252179L13590L165l06931n67866p56808q34751q38094p49787o65545n07027
$$ 7252179 7565769 7568934 7262003 6694137 5937329 5102578 4264484 3514697 2849152 2342125
14011B342125l65670k60123j82474j36851j08949r8047j00904o0003p1251r9734
$$ 2342125 1976455 1716332 1533858 1397007 1288058 1190011 1089107 1029104 957853 858119
14001H58119n8380m0887m5255j7651R60j0005k3357m0364k6638n4811l9196L978
$$ 858119 799739 758852 713597 695946 696906 686901 663544 623180 596542 541731 502535 506513
13989E06513j1338j9407Q629k4764o3198l3465n822j2787m409J6031r243j3316
$$ 506513 495175 475768 484397 459633 396435 362970 357148 344361 339952 355983 346740 333424
13977C33424l8372k64K2779L484k1052k8164j1185J3415k2910m4350r064k1835
$$ 333424 295052 294788 317567 321051 299999 271835 260650 274065 251155 206805 197741 175906
13965A75906K3933J0537J882l7395L26L5467q715j078L17j8055N418K468k3132
$$ 175906 199839 210376 212258 174863 175189 210656 201941 200863 201180 183125 188543 191011 167879
13952A67879l9147j6848R663K6198K6638K383j3760j2551j5284J570L217m9327
$$ 167879 128732 111884 121547 147745 174383 176766 163006 150455 135171 136741 139958 90631
13940I0631q217M7735k2122k4724j484q726k0965j0464J0634Q508L189J7141K6062
$$ 90631 82414 130149 108027 83303 81819 73093 52128 41664 52298 60806 63995 81136 107198
13927A07198N045l7902k5273Q300r670k1106p997J431n166N902L288j4984q812
$$ 107198 112243 74341 49068 57368 47698 26592 18595 20026 14860 20762 24050 9066 254
13914B54J8916J4003N329k159n085l0472r692P732j8158j5673J3677r16J3563
$$ 254 19170 33173 38502 36343 31258 786 -8906 -1174 -19332 -35005 -21328 -22244 -8681
13901h681J1733J7779J5819l245k0612j9702J5358L5523k202J8551K2859j2638
$$ -8681 3052 20831 36650 33405 12793 -6909 8449 43972 41770 60321 83180 70542
13889G0542J7707N4048N9958K6804M3315O076J5430l166k4652r295m814k3096
$$ 70542 88249 142297 202255 229059 272374 278450 293880 290714 266062 256767 251953 228857
13877B28857k9734k7777n454k8029l8526l1688q691K157r520j5351M303o882M818
$$ 228857 199123 171346 165892 137863 99337 67649 58958 61115 51595 36244 40547 33665 38483
13864C8483q497k0944j6768J7631o011j6282J6097j692j3951j9746Q405K2803
$$ 38483 29986 9042 -7726 9905 3894 -12388 3709 2017 -11934 -31680 -23275 -472
13852d72j3256M769p261K778o170k0545l2742J4143J7785J7613R425J1428n822
$$ -472 -13728 -8959 -16220 -13442 -19612 -40157 -72899 -58756 -40971 -23358 -13933 -2505 -8327
13839h327Q253J4828L2113j1677p4J3625O16k6044j4282k6520j7081p886q960
$$ -8327 -74 14754 46867 35190 35116 48741 49357 23313 9031 -17489 -34570 -42456 -51416
13826e1416J9286K5626K0776J4245n053j812n234r906j0537l855j300L659j536
$$ -51416 -32130 -6504 14272 28517 23464 21652 16418 6512 -4025 -7880 -9180 -5521 -7057
13813g057j4600K2445L6936j0465l0671j0403K282O849j0971l1363J487K0251
$$ -7057 -21657 788 37724 27259 -3412 -13815 -11533 -4684 -15655 -47018 -45531 -25280
13801b5280J5473L0985K7732k634j6132k7616k0854K0047J7489P204j3928n825
$$ -25280 -9807 21178 48910 46276 30144 2528 -18326 1721 19210 26414 12486 6661
13789F661L871J5204J692j0461K7820m49r754l3996q876l589Q668l617p634j895
$$ 6661 10532 25736 27428 16967 44787 44338 34584 588 -8288 -11877 -3209 -6826 -14460 -16355
13775a6355K3870L646j3868j695j0964K4752K5559L718k3660l1110Q553N383j6329
$$ -16355 7515 11161 -2707 -4402 -15366 9386 34945 38663 15003 -16107 -7554 -2171 -18500
13762a8500J0147L7166L9848j5619j9826k418M013l7920j4210J564J4759K8509
$$ -18500 -8353 28813 68661 53042 33216 30798 34811 -3109 -17319 -15755 -996 27513
13750B7513k9661J9164L4068J3519l9050l1745l185J791J9454K5356L12R774K990
$$ 27513 -2148 17016 51084 64603 25553 -6192 -9377 -7586 11868 37224 37536 47310 50300
13737E0300l183k2835j0742k460k6318k570J748J8674J4925K17j6596N665J8797
$$ 50300 47117 24282 13540 11080 -15238 -17808 -16060 2614 17539 17756 1160 6825 25622
13724B5622J7420R025M412p568L6912P235j2012o874l050L033L1617P729J554
$$ 25622 43042 52067 56479 48911 85823 93058 81046 74172 71122 74155 105772 113501 115055
13711A15055j2913J5268M9010M0687L8063K6997L2925N8587N0571Q2160J02218
$$ 115055 102142 117410 166420 207107 245170 272167 305092 363679 414250 496410 598628
13700E98628O6013P6512J56511K07385M21022N98693Q13672J198624J493168J706241
$$ 598628 664641 741153 897664 1105049 1526071 2124764 2938436 4137060 5630228 7336469
13690G336469J813280J666602J239659O43640j54886q94612j454471j722004j729758
$$ 7336469 9149749 10816351 12056010 12699650 12544764 11650152 10195681 8473677 6743919
13681F743919j563622j263718q94101n34185l24329k19377j68359j41444j09880
$$ 6743919 5180297 3916579 3022478 2488293 2163964 1944587 1776228 1634784 1524904
13672A524904p2623r5819p0199p0457n7642p5428p2582q4463p3687k8577j0442
$$ 1524904 1452281 1356462 1286263 1215806 1158164 1082736 1010154 925691 852004 823427 812985
13661H12985m2899l0285J32k9226k952k8071m5339m1436j3652k3639l5961m6224
$$ 812985 770086 739801 739933 710707 707755 679684 634345 592909 579257 555618 519657 473433
13649D73433k1726l173J0505k7981k8964o725L627k1126j9358k5739j1048J368
$$ 473433 451707 448534 459039 431058 402094 395369 398996 377870 358512 332773 321725 323093
13637C23093j2772k970P864J749j6942l5448P25R256j6505n845j39J2185P001
$$ 323093 310321 307351 315215 316964 300022 264574 265299 274555 258050 252205 252066 264251 271252
13624B71252O90l5357j9181O087L950o054j1628k6185q476L5634L5045j0269k053
$$ 271252 271942 236585 217404 223491 227441 221387 209759 183574 175098 210732 245777 235508 233455
13611B33455M177j0559k5799J2782J1866j5884l4923k4964J5261J93j1805n580
$$ 233455 237632 227073 201274 214056 225922 210038 175115 150151 165412 165605 153800 148220
13599A48220m0388k7905l0853J153R395M846j1261j039r810J0408K4915N520J1922
$$ 148220 107832 79927 49074 50227 59622 64468 53207 52168 42358 52766 77681 83201 95123
13586I5123K462j6976k1562k0906k3804j799L0489J9502J1271J5944K689o492
$$ 95123 97585 80609 59047 38141 14337 12538 43027 62529 73800 89744 92433 85941
13574H5941k20m706P006k9672j8267P704m413J6737J0609n222n668m636m750m416
$$ 85941 85721 81015 88021 58349 40082 47786 43373 60110 70719 65497 59829 55193 50443 46027
13560D6027L239Q451m361o128k3239J180J1958N429K0121M40m0773k2333l852
$$ 46027 49266 57717 53356 47228 23989 25169 37127 42556 62677 63117 22344 11 -3841
13547c841J6352L1794J4852k5036k0554K3666J1647j5944M378r475j0893k7234
$$ -3841 12511 44305 59157 34121 13567 37233 48880 32936 37314 27839 16946 -10288
13535a0288j3405R690L5028p548k7447j9050N113J2825J3106j1420M480J3034
$$ -10288 -23693 -14003 21025 13477 -13970 -33020 -27907 -15082 -1976 -13396 -8916 4118
13523D118j5519l0034j6780q12r355j4024l994J0516N072K1801J8463n910O519
$$ 4118 -11401 -41435 -58215 -59027 -68382 -82406 -86400 -75884 -70812 -49011 -30548 -36458 -29939
13510b9939J8429K1198N166J2539o19l2853k6611j0379J5793K0559J5263j910
$$ -29939 -11510 9688 14854 27393 26774 -6079 -32690 -43069 -27276 -6717 8546 6636
13498F636k1132k9570k5103q146M1931K2854j0001o626N164o382P906q538O014
$$ 6636 -14496 -44066 -69169 -77315 -35384 -12530 -22531 -29157 -23993 -30375 -22469 -31007 -24993
13485b4993K430K3417j5036k591r784Q695J9524k804l0013k203N317K0548P803
$$ -24993 -22563 854 -14182 -16773 -26557 -17862 1662 -1142 -31155 -33358 -28041 -7493 310
13472C10m1726q561M641J1460M1926K2343J5692j9561k3022Q678O476l0088k3121
$$ 310 -41416 -49977 -45336 -33876 8050 30393 46085 26524 3502 12180 18656 -11432 -34553
13459c4553K7858J8575L734r36j3676j7101j276K1380k51P657j8368k9714j3325
$$ -34553 -6695 11880 15614 14678 1002 -16099 -17375 4005 3754 11411 -6957 -36671 -49996
13446d9996J2991j2263K8591K3774j7845j5499K8591P742k2174j1205J6828K2376
$$ -49996 -37005 -49268 -20677 3097 -14748 -30247 -1656 6086 -16088 -27293 -10465 11911
13434A1911L294j0529J5613j4095j7061j3270p636R495K7779N469K562l099j3844
$$ 11911 15205 4676 20289 6194 -10867 -24137 -31773 -22278 5501 10970 13532 10433 -3411
13421c411k2367m001J4968J2795L4493J3703r980Q633Q957k9732J5874J6456L292
$$ -3411 -25778 -29779 -14811 -2016 32477 46180 36200 44833 53790 24058 39932 56388 59680
13408E9680k5314m3187k6305j8624J4293p018p024K2915L9807j6900j1836J5727
$$ 59680 34366 -8821 -35126 -53750 -39457 -46475 -53499 -30584 9223 -7677 -19513 -3786
13396c786n330p283J5901k1724L287l719k7156K0553M0411O698l2898l37o59j2675
$$ -3786 -9116 -16399 -498 -22222 -18935 -22654 -49810 -29257 11154 17852 -15046 -15383 -16042 -28717
13382b8717j0114j1781j882K2100M492j1220j588L90m496J6628O56m20P901j1700
$$ -28717 -38831 -50612 -52494 -30394 -25902 -37122 -38710 -38320 -42816 -26188 -25532 -25952 -18051 -29751
13368b9751J8961l370l9596j9673r547K4043L1174K5788J0381J8126j747k1498
$$ -29751 -10790 -14160 -53756 -73429 -82976 -58933 -27759 -1971 8410 26536 24789 3291
13356C291k1771m752J2418j246J1432J8270q768j7461J574O403m0859l3290M305
$$ 3291 -18480 -23232 -10814 -12060 -628 17642 8874 -8587 -7013 -610 -41469 -74759 -70454
13343g0454M4184K1725j4943K602j5249k184K4628J2801l5439j9501R687K6767
$$ -70454 -26270 -4545 -19488 -16886 -32135 -34319 -9691 3110 -32329 -51830 -42143 -15376
13331a5376L5250K1837k3832k1219r66j822l0052j642R252m712J8966K0977R936
$$ -15376 19874 41711 17879 -3340 -4306 -6128 -36180 -37822 -28570 -33282 -14316 6661 16597
13318A6597q332k6000n416J8047j2618j3240J9266J1441l8145k4559q393O514
$$ 16597 8265 -17735 -23151 -5104 -17722 -30962 -11696 -255 -38400 -62959 -71352 -64838
13306f4838J0783K6554J8362J4917L082L819L000j1055k8841j5270j8897m175
$$ -64838 -54055 -27501 -9139 5778 8860 12679 15679 4624 -24217 -39487 -58384 -62559
13294f2559K3737J0785j6326L892O502j3909K7726j5759k6960J6021M318L328
$$ -62559 -38822 -28037 -44363 -40471 -33969 -47878 -20152 -35911 -62871 -46850 -42532 -39204
13282c9204j981k191Q903o784m984J9644L629q183o949j2297k0434j7220J8162
$$ -39204 -41185 -43376 -34473 -41257 -46241 -26597 -22968 -31151 -38100 -50397 -70831 -88051 -69889
13269f9889J0464n986K2892M864p147N62J9651M332k1071j8612k0848M676J2800
$$ -69889 -59425 -65411 -42519 -37655 -44802 -44240 -24589 -20257 -41328 -59940 -80788 -76112 -63312
13256f3312N89Q105k927j7345J8320l610L436j762N749J7007J7920q961Q942K4171
$$ -63312 -62723 -54618 -57545 -74890 -56570 -60180 -56744 -58506 -52757 -35750 -17830 -26791 -17849 6322
13242F322J874K3330r843l4499l1516J9390K1423J9286J0608k2047j5316r136
$$ 6322 8196 31526 21683 -12816 -44332 -24942 -3519 15767 26375 4328 -10988 -20124
13230b0124J3354k1271k2717K3665K1418j9421j2374J6466J0113k247k391J0234
$$ -20124 -6770 -28041 -50758 -27093 -5675 -25096 -37470 -21004 -10891 -13138 -15529 -5295
13218e295r506K1363q328J2596J4966j2193j0812K7252K2730r097l532k4223l2546
$$ -5295 -14801 6562 -1766 10830 25796 13603 2791 30043 52773 43676 40144 15921 -16625
13205a6625J2193J8978K8982K0262M955J0785J8287p515l891m662m423j9480R851
$$ -16625 -4432 14546 43528 63790 68745 79530 97817 90302 86411 81749 77326 57846 67697
13192F7697j8191m0090l1876N757N878j1070N611K0520r606j6763j1801K2293
$$ 67697 49506 9416 -22460 -16703 -10825 -21895 -16284 4236 -5370 -22133 -33934 -11641
13180a1641Q45K323R000l10K7412J7402j3786p913J2488n672k541r002j7875l0927
$$ -11641 -10796 -8473 527 217 27629 45031 31245 23332 35820 30148 27607 18605 730 -30197
13166c0197K223J8133P996k0771k0769j7393K4637J7088L071M087K0880j1098
$$ -30197 -27974 -9841 -1845 -22616 -43385 -60778 -36141 -19053 -15982 -11895 8985 -2113
13154b113m913K4540J6380p245j8820j3627l1570j9783K1274P938N940j1937N088
$$ -2113 -7026 17514 33894 26649 7829 -5798 -37368 -57151 -35877 -27939 -21999 -33936 -28848
13141b8848K6659J5133m285J142J9204j9440k3213j6779J7725K7033j4742j4262
$$ -28848 -2189 12944 8659 9801 29005 9565 -13648 -30427 -12702 14331 -411 -14673
13129a4673r533q779n064J1460J4938J1529k7813k5301J512j093o00L4853J6758
$$ -14673 -24206 -32985 -38049 -26589 -11651 -122 -27935 -53236 -51724 -52817 -53417 -18564 -1806
13116a806r411J5957J8130m233j2960k9865K1794j8046l8076l0574K0565N2408
$$ -1806 -11217 4740 22870 18637 5677 -24188 -2394 -20440 -58516 -89090 -68525 -16117
13104a6117J3872m968k561j831k093r402k1825R694J4477K494k0559l244J966
$$ -16117 -2245 -7213 -9774 -11605 -13698 -23100 -44925 -35231 -20754 -18260 -38819 -42063 -40097
13091d0097J7372o645l885k0137K6679J3427J4928l0790O89K595j9896K340j5936
$$ -40097 -22725 -29370 -33255 -53392 -26713 -13286 1642 -29148 -28459 -25864 -45760 -43420 -59356
13078e9356J2096K4119J33r371j964j497j976o28L0870J9858l5940j2159j2569
$$ -59356 -47260 -23141 -23008 -32379 -34343 -35840 -37816 -38444 -7574 12284 -23656 -35815 -48384
13065d8384j969L1872J5863k6955k7380P908R739J3179J305J809J4871j1802j0954
$$ -48384 -50353 -18481 -2618 -29573 -56953 -49045 -39306 -26127 -24822 -23013 -8142 -19944 -30898
13052c0898j2834J8886m591o063J9920J998N719j840j9317k1985j1733M614K6659
$$ -30898 -43732 -24846 -29437 -35500 -15580 -13582 -7863 -9703 -29020 -51005 -62738 -58124 -31465
13039c1465L825k6270n564K894K3518k0932o537J1308L4161M637J7505m423K408
$$ -31465 -27640 -53910 -59474 -56580 -33062 -53994 -60531 -49223 -15062 -10425 7080 2657 5065
13026E065N807n769j3227k7628k1240j5089J9302J8839L4852M458j5001m553J229
$$ 5065 10872 5103 -8124 -35752 -56992 -72081 -52779 -33940 912 5370 -9631 -14184 -12955
13013a2955K0392o862l3462j0074K0077N605n160Q519K6658J6941M917R847N733
$$ -12955 7437 575 -32887 -42961 -22884 -17279 -22439 -13920 12738 29679 34596 44443 50176
13000E0176J4581K1602N31j387j0697l0745l6482K873N733J1115k1103K137J5644
$$ 50176 64757 86359 86890 85503 74806 44061 7579 10452 16185 27300 6197 8334 23978
12987B3978O734j8918k8479j6962J42k0285R191j986M466L160L5023K1445j404
$$ 23978 30712 11794 -16685 -33647 -33505 -53790 -44599 -46585 -42119 -38959 -3936 17509 16105
12974A6105j0047k0722M467q645j4019k8827Q263J3985J9661J2970R668M278l0500
$$ 16105 6058 -14664 -10197 -18842 -32861 -61688 -53425 -39440 -19779 -6809 2859 7137 -23363
12961b3363j0531j165j5863L107j0147J6295M0442P863J076j6462l932l313O643
$$ -23363 -33894 -35059 -50922 -47815 -57962 -41667 -1225 6638 7714 -8748 -12680 -15993 -9350
12948i350l725m670j8704L5454o810J215k427k208m404j1366J4221J2508P945
$$ -9350 -13075 -17745 -36449 -995 -7805 -6590 -9017 -11225 -15629 -26995 -12774 -266 7679
12935G679j457k1603m005K3624N531O868J84j382k1090r695M426K5443J5481J3732
$$ 7679 6222 -15381 -19386 4238 9769 16637 16821 15439 -5651 -15346 -10920 14523 30004 43736
12921D3736m19j8170o39j426k8415l0640q011J3459m37J7666o840Q54n290J2856
$$ 43736 43317 25147 24508 23082 -5333 -35973 -43984 -30525 -30962 -13296 -20136 -19282 -24572 -11716
12907a1716n801K0261r045M206J2951j1806L85q133j1581r634R602K4892M601
$$ -11716 -17517 2744 -6301 -2095 10856 -950 -565 -8698 -20279 -29913 -20311 4581 9182
12894I182N687j5646J7060N30j1022K4729K349n43J3319p246m2085k870k719K2517
$$ 9182 14869 -777 16283 16813 5791 30520 32869 32326 45645 38399 -3686 -6556 -9275 13242
12880A3242J8044p862M789m668q892j4111r219n310K1879l455j2794J4313R588
$$ 13242 31286 23424 28213 23545 14653 542 -8677 -13987 7892 4437 -8357 5956 15544
12867A5544J2344j9740r81o280j9367K7208J413j6888q752M04L737j5086q33J5227
$$ 15544 27888 8148 7167 887 -18480 8728 10141 -6747 -15499 -15095 -11358 -26444 -27277 -12050
12853a2050l840J8291l548k275j048j7086o85k6889J2966j3158k737j507R018
$$ -12050 -15890 2401 -1147 -3422 -4470 -21556 -22241 -49130 -36164 -49322 -52059 -53566 -44548
12840d4548O598K9787O198o391J3296L049m9j7928o197J9673J2522k2744J2314
$$ -44548 -37950 -8163 -1965 -8356 4940 7989 7940 -9988 -16185 3488 16010 -6734 5580
12827E580j2876K278k701m1128k4167P402J1964k8169J0490M5838J751J0623J8083
$$ 5580 -7296 -5018 -7719 -48847 -73014 -65612 -53648 -81817 -71327 -25489 -23738 -13115 4968
12814D968r933k8244j4078K9807k783J4321r117k0568j40J1515k889l326Q431
$$ 4968 -4965 -33209 -47287 -17480 -20263 -5942 -15059 -35627 -35767 -24252 -27141 -30467 -22036
12801b2036k7725J2553O678J6093m037j6325k348Q466k5072o80J3119q074J9034
$$ -22036 -49761 -37208 -30530 -14437 -18474 -34799 -37147 -28681 -53753 -54433 -41314 -49388 -30354
12788c0354J5769l2162m548J9403J5042Q526K3195J3319M189R060m1055m7371
$$ -30354 -14585 -46747 -51295 -31892 -16850 -8324 14871 28190 32379 41439 384 -46987
12776d6987Q769J8080o31j1479j0468p678l2314j8912l846J8995k504J2911L1252
$$ -46987 -38218 -20138 -20769 -32248 -42716 -50394 -82708 -101620 -105466 -86471 -88975 -76064 -44812
12763d4812J1615o912J755j4685n884J2779J3700J1929Q338K6553m824p839K7474
$$ -44812 -33197 -40109 -38354 -53039 -58923 -46144 -32444 -20515 -12177 14376 9552 1713 29187
12750B9187q736l5892k7929J5899p549j3830k2688j909K9928K9508R520j4467
$$ 29187 20451 -15441 -43370 -27471 -35020 -48850 -71538 -73447 -43519 -14011 -4491 -18958
12738a8958J9349j0031j4038M826N561l5710j3962Q315K3610K9098L236j810P835
$$ -18958 391 -9640 -23678 -18852 -13291 -49001 -62963 -54648 -31038 -1940 1296 -514 7321
12725G321j5105o511m116J9238K4351o403j4585p630J6020N457l0193j5469q635
$$ 7321 -7784 -14295 -18411 827 25178 18775 4190 -3440 12580 18037 -12156 -27625 -36260
12712c6260J4324J2345J8128j8431j1150J280j03K0554L0338M794k6641j1253
$$ -36260 -21936 -9591 8537 -9894 -21044 -19764 -19867 687 31025 35819 9178 -2075
12700b075r241r867j5487o446N695L382p83K3714k384j6786j2807j4891J8172
$$ -2075 -11316 -21183 -36670 -43116 -37421 -34039 -34822 -11108 -13492 -30278 -43085 -57976 -39804
12687c9804J090J0130L537k287n008J1213j7418j0070L4668J8719P031J871l5258
$$ -39804 -38714 -28584 -25047 -27334 -32342 -21129 -38547 -48617 -13949 4770 11801 13672 -21586
12674b1586J7904m643k1808j6076p973j5948J6405L6417L0326j8518l9735k3232
$$ -21586 -3682 -8325 -30133 -46209 -54182 -70130 -53725 -17308 13018 -5500 -45235 -68467
12662f8467K2160J3723n844j0565r948K1295K6924q635j698K878J6514J518j8186
$$ -68467 -46307 -32584 -38428 -48993 -58941 -37646 -10722 -19357 -21055 -18177 -1663 -145 -18331
12649a8331m018J3971J2459j5979m168q255J9817q076k2204N550P576J4016O328
$$ -18331 -22349 -8378 4081 -11898 -16066 -24321 -4504 -12580 -34784 -29234 -21658 -7642 -1314
12636a314J0570m798p284j5039j0335j2261J4723J2500J6593j3044J6144L9015
$$ -1314 9256 4458 -2826 -17865 -28200 -40461 -25738 -13238 3355 -9689 6455 45470
12624D5470j8937m0417k6459R611q684j297J1073K0372o039J097R801k4471l9294
$$ 45470 26533 -13884 -40343 -30732 -39416 -40713 -29640 -9268 -15307 -14210 -4409 -28880 -68174
12611f8174J0565J5605J5532K4355J2774j3824L232J3390k7727n635r752J0629
$$ -68174 -57609 -42004 -26472 -2117 10657 -3167 65 13455 -14272 -19907 -29659 -19030
12599a9030J9856J2470P924j9875j8268R833l323j749K664K408l122r475J0073
$$ -19030 826 13296 21220 1345 -16923 -7090 -10413 -12162 -9498 -7090 -10212 -19687 -9614
12586i614K4001q245j2622Q175k4702K155j1223J2788M149k777j4841K4736K872
$$ -9614 14387 6142 -6480 1695 -23007 -20852 -32075 -19287 -15138 -17915 -32756 -8020 -5148
12573e148k4695p909J7205J7286j0892M332j5382j6689K1759P046l959n177j3355
$$ -5148 -29843 -37752 -20547 -3261 -14153 -9821 -25203 -41892 -20133 -13087 -17046 -22223 -35578
12560c5578J7744M867r353j4743K4632N517j1370N625K6096j1714m2021j0010
$$ -35578 -17834 -12967 -22320 -37063 -12431 -6914 -18284 -12659 13437 1723 -40298 -50308
12548e0308L211k2425K58K1455J2942L2328n939o395K1600k117P898o981j0590
$$ -50308 -47097 -69522 -69264 -47809 -34867 -2539 -8478 -14873 6727 4610 12508 5527 -5063
12535e063J1528J161j441l3244M137K1071J0665R189r68P819j1504j4818j2065
$$ -5063 6465 7626 6185 -27059 -22922 -1851 8814 18003 17035 24854 13350 -1468 -13533
12522a3533k7492j2948J821l7020j538J6543J8096K1627K2835q748J0346K8516
$$ -13533 -41025 -53973 -52152 -89172 -90710 -74167 -56071 -34444 -11609 -20357 -10011 18505
12510A8505q31J0826j440j4865p992n614l566p818K6357L6876k0065m6783j5040
$$ 18505 17674 28500 27060 12195 4203 -1411 -4977 -12795 13562 50438 30373 -16410 -31450
12497c1450J2153J9384P574j1559k6265o336J0641R959j2322J4078j7571l773
$$ -31450 -19297 87 7661 -3898 -30163 -36499 -25858 -15899 -28221 -14143 -31714 -35487
12485c5487M794Q217J9698J7522J2554n279j0478k1635j8615N619J6783N525j3985
$$ -35487 -30693 -22476 -2778 14744 27298 22019 11541 -10094 -28709 -23090 -6307 -782 -14767
12472a4767j6095J0982K2132K295J619k1379j4206L4284J650k6776k2179K955
$$ -14767 -30862 -19880 2252 4547 6166 -15213 -29419 4865 6515 -20261 -42440 -39485
12460c9485J0433J4683j8818r276K321N1642J0227q673K4377J0821P109j1187
$$ -39485 -29052 -14369 -33187 -42463 -40142 11500 21727 13054 37431 48252 55361 44174
12448D4174j5996l0378k651m538K4214N499j7711K724L0405j0664k3825k0393
$$ 44174 28178 -2200 -4851 -9389 14825 20324 2613 5337 35742 25078 1253 -19140
12436a9140N016P420J2877k2406k1381R36Q238M4P604L2907j475k4792k7683j4323
$$ -19140 -14124 -6704 6173 -16233 -37614 -36678 -28440 -28396 -20792 12115 10640 -14152 -41835 -56158
12422e6158J4408k680j6755K2778K4661L1147Q463K1383J2675O991K3791m1238
$$ -56158 -41750 -44430 -61185 -38407 -13746 17401 25864 47247 59922 66913 90704 49466
12410D9466j282Q2L835M6095M3763J2858O279K7587N8375L5228M8904N1122J03365
$$ 49466 48184 48266 52101 98196 141959 154817 161096 188683 247058 282286 331190 382312 485677
12397D85677R4225R1504J17418J38456J56258J17625J03146R1110M1793Q835k9018
$$ 485677 579902 671406 788824 927280 1083538 1201163 1304309 1395419 1437212 1446047 1417029
12386A417029o9876j07168j32319j23532j35093j13806j01238j05232m8258n4183
$$ 1417029 1347153 1239985 1107666 984134 849041 735235 633997 528765 480507 426324
12376D26324o9983n3764m226r167k0478j2203l7567k224q599j5390J437k3386
$$ 426324 356341 302577 298351 289184 268706 256503 218936 216712 208113 192723 194160 170774
12364A70774k3250k3021P469K0521J3566k5492k8630J3520n0698r695K582J4661
$$ 170774 147524 124503 131972 152493 166059 140567 111937 125457 74759 65064 67646 82307
12352H2307K0604J1692J1771k4851q967M266q952j9083K3202J2457k1760j3680
$$ 82307 102911 114603 126374 101523 92556 96822 87870 68787 91989 104446 82686 69006
12340F9006j886j60n604R630j7390k1173k592j2963J0865K8070J2835k9667M686
$$ 69006 67120 66960 61356 70986 53596 32423 29831 16868 27733 55803 68638 38971 43657
12327D3657Q216k6164j8746j5885j569m997P151P323K5600J1143p018k0630M796
$$ 43657 51873 25709 6963 -8922 -10491 -15488 -8337 -1014 24586 35729 28711 8081 12877
12314A2877K8626k5615j3178L0580r18p0J2902L0175j1144j8896l8633K892k6365
$$ 12877 41503 15888 2710 33290 32372 32302 45204 75379 64235 45339 6706 9598 -16767
12301a6767k0565J0244K3154N535j0797P901M164l272K2881L650k4459k729J5311
$$ -16767 -37332 -27088 -3934 1601 -9196 -1295 2869 -403 22478 26128 1669 -1060 14251
12288A4251K7443M218P103J3225L8582k77n1125o543J8139J1324R933J5054m029
$$ 14251 41694 45912 53015 66240 104822 104545 53420 46877 65016 76340 86273 101327 97298
12275I7298k7346k2832P123J6624n066n915K369k0320k7562j6044P899q994q474
$$ 97298 69952 47120 54243 70867 65801 59886 62255 41935 14373 -1671 6228 -2766 -11240
12262a1240J4968K1313n675l1963k0707J6250J3266r347j7802J1090K5547N886
$$ -11240 3728 25041 19366 -12597 -33304 -17054 -3788 -13135 -30937 -19847 5700 11586
12250A1586j052q724m233J3732J8212j2653K4575j1408k7247k7552J5468J0654
$$ 11586 10534 1810 -2423 11309 29521 16868 41443 30035 2788 -24764 -9296 1358
12238A358j5815k571L57K9499N533k0766J0679L2073k8123j2515M604O199k0517
$$ 1358 -14457 -17028 -16671 12828 18361 -2405 8274 40347 12224 -291 4313 10512 -10005
12225a0005k698j3525J5930j2365l7151j3171J3679j809L2354J7442n577J5663
$$ -10005 -12703 -26228 -10298 -22663 -59814 -72985 -59306 -61115 -28761 -11319 -16896 -1233
12213a233J2979p674l4392j721L344J0639M2K1948L881L28k1194j4976j1135p731
$$ -1233 11746 4072 -30320 -32041 -28697 -18058 -18016 3932 7813 8141 -13053 -28029 -39164 -46895
12199d6895k884k5691j0004Q724Q492J850L9838J0033j3504r035r346j5047J7074
$$ -46895 -49779 -75470 -85474 -76750 -68258 -66408 -26570 -16537 -30041 -39076 -48422 -63469 -46395
12186d6395J7022K5640m479N815j037l566j0707P937K5293k127R29j6333R629
$$ -46395 -29373 -3733 -8212 -2397 -3434 -7000 -17707 -9770 15523 13396 14325 -2008 7621
12173G621N966r354r752j9754J7993o684j2076K590K787k0964K4464j408R02Q15
$$ 7621 13587 4233 -5519 -25273 -7280 -13964 -26040 -23450 -20663 -41627 -17163 -18571 -17669 -16854
12159a6854M898Q112j8950j2250L2568N803J6583L863l6096k0708K8191K071l6105
$$ -16854 -11956 -3844 -22794 -35044 -2476 3327 19910 23773 -12323 -33031 -4840 -2769 -38874
12146c8874j9931R093K5028j2763J7238j2113k3400J6620K3526P682Q001N141
$$ -38874 -58805 -49712 -24684 -37447 -20209 -32322 -55722 -39102 -15576 -7894 107 5248
12134E248o970K2987J9078r514j9099j0407K1022l8914m2570j6717R383K1142
$$ 5248 -1722 21265 40343 30829 11730 1323 22345 -16569 -59139 -75856 -66473 -45331
12122d5331O033O307J3485j0743j5036j5318K0601L5482J4866j666k1914J1351
$$ -45331 -39298 -32991 -19506 -30249 -45285 -60603 -40002 -4520 10346 8680 -13234 -1883
12110a883k943L425k8453q385J5866K7776J9726r877l421j4658P413J2833O41
$$ -1883 -4826 -1401 -29854 -38239 -22373 5403 25129 15252 11831 -2827 4586 17419 18060
12097A8060k8029k0938P853j4430j1650K394L233L717J1655j3077k283j0740j8012
$$ 18060 -9969 -30907 -23054 -37484 -49134 -46740 -43507 -39790 -28135 -41212 -43495 -54235 -72247
12084g2247J568J1366J2234M864J8782J0474r51J3367K36K1508L536o218j6994
$$ -72247 -70679 -59313 -47079 -42215 -23433 -12959 -13910 -543 -307 21201 24737 18519 1525
12071A525l5978j5728R652k197J6901J847J0810k0026m085O756l097r741L5380
$$ 1525 -34453 -50181 -40529 -42726 -25825 -23978 -13168 -33194 -37279 -30523 -33620 -43361 -7981
12058g981j4557j5609k0302J1900L1488K4694J634j3636q035Q783J3848K378k9069
$$ -7981 -22538 -38147 -58449 -46549 -15061 9633 11267 -2369 -10404 -1621 12227 14605 -14464
12045a4464k0391N282K352l773m262n776J7388L2756J568l4690o016R916Q741
$$ -14464 -34855 -29573 -27221 -30994 -35256 -41032 -23644 9112 10680 -24010 -30026 -20110 -11369
12032a1369j1979o816J2738J7334J716k5713k6216J7115L7772K6598l2903l1709
$$ -11369 -23348 -30164 -17426 -92 1624 -24089 -50305 -33190 4582 31180 -1723 -33432
12020c3432k2837n010K0319L1984K0109j8850J1451J6008j516j6771K361j7756
$$ -33432 -56269 -61279 -40960 -8976 11133 -7717 3734 19742 18226 1455 3816 -13940
12008a3940P343L368K1419J0530j2990J6330k6234k3086p618J1198j153k1145
$$ -13940 -6597 -3229 18190 28720 15730 32060 5826 -17260 -24878 -13680 -14833 -35978
11996c5978k1162l973j8112Q725M8536K9033j4938m130P096J1053n215j3360J9796
$$ -35978 -57140 -61113 -79225 -70500 -21964 7069 -7869 -11999 -4903 6150 935 -12425 7371
11983G371M815k3688o682K1924j5324j8667N538M019j0824m619q561j271K4056
$$ 7371 12186 -11502 -18184 3740 -11584 -30251 -24713 -20694 -31518 -36137 -44698 -45969 -21913
11970b1913K6764J2462l8935l4984k6200n317J8535N0275j1865l8117K9121K7065
$$ -21913 4851 17313 -21622 -56606 -82806 -88123 -69588 -19313 -31178 -69295 -40174 -13109
11958a3109J8059K507k5891j2732j480L526m32J8415O984j0108q118J2829r272
$$ -13109 4950 7457 -18434 -31166 -32646 -29120 -29552 -11137 -4153 -14261 -22379 -9550 -18822
11945a8822r010r861n408n568p033K0193o572P829J9870K7987j8528l0394J0316
$$ -18822 -27832 -37693 -43101 -48669 -55702 -35509 -42081 -34252 -14382 13605 -4923 -35317 -25001
11932b5001P718k3176m341J2637N107m2777J56J1773L1118K8662J4397k251k8262
$$ -25001 -17283 -40459 -44800 -32163 -27056 -69833 -69677 -57904 -26786 1876 16273 14022 -14240
11919a4240k892R528n458k9452j4752K404Q698n783j1509L61K8165o26J9163o07
$$ -14240 -17132 -7604 -13062 -42514 -57266 -54862 -46164 -51947 -63456 -63095 -34930 -35556 -16393 -17000
11905a7000p841J7256J8780q2q186k4060j0842O879j5767l452R412j694K2062
$$ -17000 -24841 -7585 11195 11113 2927 -21133 -31975 -25096 -40863 -44315 -34903 -36597 -14535
11892a4535L394n916P007j4602k2611J233J2736K0413j129k3361K5446J5763n372
$$ -14535 -11141 -17057 -10050 -24652 -47263 -46030 -33294 -12881 -14010 -37371 -11925 3838 -1534
11879a534j7955j9414o109K0290P886j0746j3301j0005J2357p090J0988N200J3803
$$ -1534 -19489 -38903 -45012 -24722 -16836 -27582 -40883 -50888 -38531 -45621 -34633 -29433 -15630
11866a5630p480n667j8221l861K0314K7239j2101k6517J4712L4947k3215l8817
$$ -15630 -23110 -28777 -46998 -50859 -30545 -3306 -15407 -41924 -27212 7735 -15480 -54297
11854e4297q037M6229K833k519R109k0451p340l3719L845j607O614K3214J5170
$$ -54297 -62334 -16105 -13272 -15791 -6682 -27133 -34473 -68192 -64347 -65954 -59340 -36126 -20956
11841b0956j3800n650j966j0099R05K0191L171L354K1303M0891k2090J1021J1357
$$ -20956 -34756 -40406 -42372 -52471 -51566 -31375 -28204 -24850 -3547 37344 15254 26275 37632
11828C7632k1657Q456J0326j6246l0447L987O647m721k1906j684j6396J3674M2834
$$ 37632 15975 24431 34757 18511 -11936 -7949 -1302 -6023 -27929 -29613 -46009 -32335 10499
11815A0499p228j7870m247j0016R711J6557j9803k1661N525K7970P185K646o097
$$ 10499 3271 -14599 -18846 -28862 -19151 -2594 -22397 -44058 -38533 -10563 -3378 -732 -6829
11802f829n751j4655k4444K0844L0566L115J0553p916k5618j1200l146l3791m407
$$ -6829 -12580 -27235 -51679 -30835 -269 2846 13399 5483 -20135 -31335 -34481 -68272 -72679
11789g2679J9770J7061J4524l130J613L8364N108k6480p044j5018j3034n587J1055
$$ -72679 -52909 -35848 -21324 -24454 -22841 15523 20631 -5849 -12893 -27911 -40945 -46532 -35477
11776c5477P108L086j912J098j467j3145L253R903J383K2272J248j4641o505p765
$$ -35477 -28369 -25283 -27195 -26097 -27564 -40709 -37456 -27553 -26170 -3898 -2650 -17291 -23796 -31561
11762c1561l0577J0590J2817j7262o836J0949j269j8024J683K8238O221j8415
$$ -31561 -62138 -51548 -38731 -55993 -62829 -51880 -53149 -71173 -69490 -41252 -35031 -53446
11750e3446J3929J6867n00n192L1964J2323m183n120q788k672J4856R569K0671
$$ -53446 -39517 -22650 -23150 -28342 3622 15945 11762 6642 -2146 -4818 10038 19607 40278
11737D0278k3774K871K6802p70j8898j2289O035j4756o032j6756j0461O58j5521
$$ 40278 16504 19375 46177 45407 26509 14220 20255 5499 -533 -17289 -27750 -27092 -42613
11724d2613K1859J2817j9546J0491k1976j3561J074P088K9712K0945r082l2620
$$ -42613 -20754 -7937 -27483 -16992 -38968 -52529 -51455 -44367 -14655 6290 -2792 -35412
11712c5412l16J3743r304M600M450L854j3996k6210n034O432J8333J2234Q593
$$ -35412 -35728 -21985 -31289 -26689 -22239 -18385 -32381 -58591 -63625 -57193 -38860 -26626 -18033
11699a8033L093J1104j3878Q087N190P360K1430L2693l796Q720j9607k3986J0021
$$ -18033 -14940 -3836 -17714 -9627 -4437 2923 24353 57046 53250 61970 42363 18377 28398
11686B8398K126n771K059o121j3998j16k3695j0517K4975n676j5674k368J2479
$$ 28398 30524 24753 26812 20691 6693 6577 -17118 -27635 -2660 -8336 -24010 -26378 -13899
11673a3899J7114L8283j872j3215j4465j5134K473Q005L23j0472L729j2419j5171
$$ -13899 3215 41498 39626 26411 11946 -3188 -715 7290 7613 -2859 870 -11549 -26720
11660b6720J0275J6071J1867J5557J3302l5848j1013k4975m199J1133j5067l9500
$$ -26720 -16445 -374 11493 27050 40352 4504 -6509 -31484 -35683 -24550 -39617 -79117
11648g9117J0000M3654L917J75m179p292J2612j2481k9714k504k860L3128K8631
$$ -79117 -69117 -25463 -21546 -21371 -25550 -32842 -20230 -32711 -62425 -64929 -67789 -34661 -6030
11635f030m3617n216j9558l725J2707J37n634J2435O50p956K8469M7153Q717j8893
$$ -6030 -49647 -54863 -74421 -78146 -65439 -65302 -70936 -58501 -57851 -65807 -37338 9815 18532 -361
11621c61k1372j7935J9872P54K5986p871l274j0091n27K2487j8045j7994k4117
$$ -361 -21733 -39668 -19796 -19042 6944 -927 -4201 -14292 -14819 7668 -10377 -28371 -52488
11608e2488L512K3116m06j7293J0599L046o618J559K4268NJ522o08l095R345P567
$$ -52488 -48976 -25860 -26266 -43559 -32960 -29914 -36532 -34973 -10705 -10700 -9178 -9786 -12881 -3536 4031
11593D031J5623k1538j1581k821o649l1109j9392J9514J8997j819J3242J4608
$$ 4031 19654 -1884 -13465 -16286 -22935 -54044 -73436 -53922 -34925 -36744 -23502 -8894
11581h894M931R967j0452j9387l3497k487J4170J8706j9947N514O67j866N592
$$ -8894 -3963 6004 -4448 -23835 -57332 -59819 -45649 -26943 -46890 -41376 -40709 -42575 -36983
11568c6983J4161J6110O31k8498k5965l130Q651K4583k2580Q349K9624J4059r35
$$ -36983 -22822 -6712 -6081 -34579 -60544 -63674 -55023 -30440 -53020 -44671 -15047 -988 -1923
11555a923m645k4832l395J4396J9043P399Q981j5304l713p286J2424k547J1433
$$ -1923 -6568 -31400 -34795 -20399 -1356 6043 15024 -280 -3993 -11279 1145 -1402 10031
11542A0031j969q455j3386j1699r773J5404K897J6836j602J42k138l7781o403
$$ 10031 8062 -393 -13779 -25478 -35251 -19847 -16950 -114 -1716 -1574 -3712 -41493 -47896
11529d7896N1801J6274k8410r134M554n016K3738K8458l1833k8497m266P328J6985
$$ -47896 3905 20179 -8231 -17365 -12811 -17827 5911 34369 2536 -25961 -30227 -22899 -5914
11516e914o631k9793m827k334K993M889Q764n590J7713J320K1795l100j5641j1540
$$ -5914 -12545 -42338 -47165 -49499 -46506 -41617 -32853 -38443 -20730 -19410 2385 -715 -16356 -27896
11502b7896Q219J3711R868P862J5788j484j5475l940J0472k8358k72L140P885
$$ -27896 -19677 -5966 3902 11764 27552 26068 10593 6653 17125 -11233 -11505 -8365 -480
11489d80J684j1560J4033q26m773M405j1296l3885k0469j8455j333L3175L8700
$$ -480 1204 -10356 3677 2851 -1922 2483 -8813 -42698 -63167 -81622 -82955 -49780 -11080
11476a1080J6361n125J8786J1902k811k3752l7630k596L148K1580P967k7774j4096
$$ -11080 5281 156 18942 30844 28033 4281 -33349 -35945 -32797 -11217 -3250 -31024 -45120
11463d5120L0323Q002j4586L6092K2303l099l8052j8879M788R670p068K6683O17
$$ -45120 -14797 -6795 -21381 14711 37014 33915 -4137 -23016 -18228 -8558 -15626 11057 11674
11450A1674p246J1483j3184o100N516q66K573k4065J2965J0933K8863R296k9721
$$ 11674 4428 15911 2727 -3373 2143 1277 3850 -20215 -7250 3683 32546 41842 12121
11437A2121l4778J0489K0306K1732P096k6408j1655J980r76K929l2633l2871J5102
$$ 12121 -22657 -12168 8138 29870 36966 10558 -1097 883 -93 2836 -29797 -62668 -47566
11424d7566J5740K2457J8461K091k420j8537P080N014m421Q559j4858k0592j5126
$$ -47566 -31826 -9369 9092 11183 8763 -9774 -2694 2320 -2101 6458 -8400 -28992 -44118
11411d4118K612P880J6789k0468k7493J9853N820J3711K8960L804J564J7918J5472
$$ -44118 -41506 -33626 -16837 -37305 -64798 -44945 -39125 -25414 3546 7350 8914 26832 42304
11398D2304m3798k8282J8082J4229L431q844J2737q988j9268j7226K2670K8141
$$ 42304 -1494 -29776 -11694 2535 5966 -2878 9859 871 -18397 -35623 -12953 15188
11386A5188l544k02J2310p240J2807j4728P812j3687J938J7904j35j5646k2453
$$ 15188 11644 11442 23752 16512 29319 14591 22403 8716 10654 28558 28423 12777 -9676
11373i676O19J1760j6452J1538p259k44l475r239N254J5860J5921m406j811k6601
$$ -9676 -9057 2703 -13749 -2211 -9470 -9714 -13189 -22428 -17174 -1314 14607 10201 8390 -18211
11359a8211J6725L8415j3566l0212K565J924L0685M228k67j8633k9952M521J359
$$ -18211 -1486 36929 23363 -6849 -4284 -2360 28325 32553 32286 13653 -16299 -11778 -10419
11346a0419p37j4456j5172R637L5096L152N429l4443k0563N759Q941m904j4182
$$ -10419 -11156 -25612 -40784 -31147 3949 7101 12530 -21913 -42476 -36717 -27776 -32680 -46862
11333d6862J6178q183J0207J6307j446J7464Q194N434q981K646p434o735p763
$$ -46862 -30684 -38867 -28660 -12353 -13799 3665 11859 17293 8312 10958 3524 -3211 -10974
11320a0974J4342K0843L850j6185n074j5915o81j914J2669j2723j6311J7835q720
$$ -10974 3368 24211 28061 11876 6802 -9113 -9794 -11708 961 -11762 -28073 -10238 -18958
11307a8958j5895Q926J9251j1180j946J9107j4492k9443K0928Q031J375K3271
$$ -18958 -34853 -25927 -6676 -17856 -19802 -695 -15187 -44630 -23702 -15671 -14296 8975
11295H975k4385l5055l29L1780K2312O759M787j2016Q751j378J1769N259J168
$$ 8975 -15410 -50465 -50794 -19014 3298 10057 14844 2828 11579 10201 21970 27229 28397
11282B8397j1477K750j8642J537m692J0219P156j3515k9274J6374K1653k7457
$$ 28397 16920 19670 1028 2565 -2127 8092 15248 1733 -27541 -11167 10486 -16971
11270a6971k8917j8610j2194K1789K3502j2475O509j470k373K7726J9667L2592
$$ -16971 -45888 -64498 -76692 -54903 -31401 -43876 -37367 -38837 -41210 -13484 6183 38775
11258C8775j6369p589Q06k2826l1236m988K5019L5142Q770K942J724n0653j5712
$$ 38775 22406 14817 15623 -7203 -38439 -43427 -18408 16734 25504 28446 30170 -20483 -36195
11245c6195o719J1392J5112k1268M289j233j2927P306R460K0850j414l0338l249
$$ -36195 -42914 -31522 -16410 -37678 -33389 -34622 -47549 -40243 -30783 -9933 -11347 -41685 -44934
11232d4934P300L127r864L1208J4478j480k94M606K135j1519k4468l551j5235
$$ -44934 -37634 -34507 -44371 -13163 1315 -165 -459 4147 6282 -5237 -29705 -33256 -48491
11219d8491K7624J5114p081M690Q38J3900J5315o34j7271k1993q831J8217J2645
$$ -48491 -20867 -5753 -12834 -8144 -7306 6594 21909 21275 4004 -17989 -26820 -8603 4042
11206D042j9693K336J1613j3211l801k4369n320J8474K1362J4817J0087m668j1550
$$ 4042 -15651 -13315 -1702 -14913 -18714 -43083 -48403 -29929 -8567 6250 16337 11669 119
11193A19J8109L491k0204O062K5735N099k0004P432J796k8735j3683l314r837
$$ 119 18228 21719 1515 7577 33312 38411 18407 25839 27635 -1100 -14783 -18097 -27934
11180b7934r572P450J1140K4321J7086m264m801n760l2849j9327M5133J1633j7364
$$ -27934 -37506 -30056 -18916 5405 22491 18227 13426 7666 -25183 -44510 623 12256 -5108
11167e108k475k628K5826K247j1101J2221K9040p789k1826P561k42J3119j1851
$$ -5108 -7583 -10211 15615 17862 6761 18982 48022 40233 18407 25968 25726 38845 26994
11154B6994j2104m636o692K933r691j7650k0851N456J4452R516r102k187j661
$$ 26994 14890 10254 3562 6495 -3196 -20846 -41697 -36241 -21789 -12273 -21375 -23562 -25223
11141b5223j4373j0363M920K0260Q390k8569l28L1432J0124j8616K5226J6345
$$ -25223 -39596 -49959 -45039 -24779 -16389 -44958 -45286 -13854 -3730 -22346 2880 19225
11129A9225j2026k1151Q082j1118n917O75m423J6135N360P54O474L2923p724l9455
$$ 19225 7199 -13952 -5870 -16988 -22905 -22230 -26653 -10518 -5158 -4404 2070 34993 27269 -12186
11115a2186j8610K9446L5857k4996m911j2724J5069J2783N098j4840j7749j8469
$$ -12186 -30796 -1350 34507 9511 4600 -8124 6945 19728 24826 9986 -7763 -26232
11103b6232N659L8670Q175l7873P153j090N644K0576Q018j809l91J9776M251l1700
$$ -26232 -20573 18097 26272 -11601 -4448 -5538 106 20682 28700 26891 26500 46276 50527 18827
11089A8827J1497Q352L5063J5760l1048k6075o251m4407N119L6944o38l0258k5783
$$ 18827 30324 38676 73739 89499 58451 32376 26125 -18282 -13163 23781 23143 -7115 -32898
11076c2898K611M603l828r616j3047J045L8797K1639K4343N274j0664K2688l307
$$ -32898 -30287 -25684 -29512 -39128 -52175 -51130 -12333 9306 33649 38923 28259 50947 47640
11063D7640j8194p454K52l024j3358J5503J7422j0899l1079k4783L8310R906n637
$$ 47640 29446 21992 22244 19220 5862 21365 38787 27888 -3191 -27974 10336 20242 14605
11050A4605j1554R686j6069J0186K007q774l456K890k237M4629P227R452k1063
$$ 14605 3051 12737 -3332 6854 8861 87 -3369 -479 -2716 41913 49140 58592 37529
11037C7529j7134q644l72L5585N917N134j6152J4772J5552J591J8406L3260J4543
$$ 37529 20395 11751 11379 46964 52881 58015 41863 56635 72187 73778 92184 125444 139987
11024A39987J6600L664j3137p850j4317j4124m5509J1032j3628j2991n688N944
$$ 139987 156587 160251 147114 139264 124947 110823 65314 76346 62718 49727 44039 49983
11012D9983P819J0705J5239p07J528O715j854K0639m427j348K3514L1802j0803
$$ 49983 57802 68507 83746 83039 84567 91282 89428 110067 105640 104292 127806 159608 148805
10999A48805K022J9736K0976M148J3026K6015J6235j0565j2048N4978N9113M3327
$$ 148805 150827 170563 191539 195687 208713 234728 250963 240398 228350 283328 342441 385768
10987C85768O9879N6351P9678J11228P1078O5025J44328J75121K32521L14988
$$ 385768 455647 511998 591676 702904 773982 839007 983335 1158456 1390977 1705965
10977A705965M35802O72187J029411J510511K204992K890153L150761K894823
$$ 1705965 2141767 2813954 3843365 5353876 7558868 10449021 13599782 16494605
10969A6494605K321767J333105j85953j997939l470121l663249k903025j933647
$$ 16494605 18816372 20149477 19963524 17965585 14495464 10832215 7929190 5995543
10961E995543j200857p87085n21763l68451l08107k67561k23234j50905j36391
$$ 5995543 4794686 4007601 3485838 3117387 2809280 2541719 2318485 2167580 2031189
10952B031189j82575j37008j10909j08944r1049m2153j3323l6904n2396o9985
$$ 2031189 1848614 1711606 1600697 1491753 1400704 1358551 1345228 1308324 1255928 1185943
10942A185943m4618n7520o1943k9332j4077q208k7913l5731m1511l4162n7784
$$ 1185943 1141325 1083805 1021862 992530 978453 970245 942332 906601 865090 830928 773144
10931G73144n1258m591j5160j8771k5643k4954n247j6323j2499L246l1918l0729
$$ 773144 721886 717295 702135 683364 657721 632767 627520 611197 598698 601944 570026 539297
10919E39297l24l5148o5448O537M7055K0808j9858l8449J2541k2556k8576k0586
$$ 539297 538973 503825 438377 444914 491969 512777 492919 454470 467011 444455 415879 395293
10907C95293l5636R10Q402l6791n692j7669o601o730q82L92k512n543j1806j2113
$$ 395293 359657 360567 368969 332178 326486 308817 302216 295486 294604 294996 292484 286941 275135 263022
10893B63022K679J4495j5243j5301l993l578l3136k1480k013M904J2844K5972
$$ 263022 265701 280196 264953 249652 245659 242081 208945 187465 185452 190356 203200 229172
10881B29172K5656j0200j9160k8660k7706j9662J5864j5193J231M095l2431J847
$$ 229172 254828 244628 225468 196808 169102 149440 165304 150111 151342 155437 123006 124853
10869A24853Q183k0720j244q93j1521r228N153k6283k7334J1888K240n578L472
$$ 124853 133036 112316 111072 110179 98658 89430 94583 68300 40966 52854 55094 49516 52988
10856E2988N37q13K6645J4644j268K972p338n618L312r384p512r053j3176Q237
$$ 52988 53525 52712 79357 94001 92733 95705 88367 82749 86061 76677 69165 60112 46936 55173
10842E5173j54l4809l249J6520K0302O614N84j5312l0912R211n951n662M0404
$$ 55173 55019 20210 16961 33481 53783 60397 60981 45669 14757 23968 18017 12355 52759
10829E2759L4698o240l7067o973L9390r117j6685k3758m357J5882L089k563j8513
$$ 52759 87457 81217 44150 37177 76567 67450 50765 27007 22650 38532 41621 39058 20545
10816B0545k1943L628J6640j9238K748L818K5157R359k2526O64n298L482J4479
$$ 20545 -1398 2230 18870 -368 2380 6198 31355 40714 18188 18852 13554 17036 31515
10803C1515O067k2664q095Q298N808q52R220k390j4766j923K6590j8726R592K5324
$$ 31515 37582 14918 6823 15121 20929 20077 29297 26907 12141 10218 36808 18082 27674 52998
10789E2998j4500k7970r747K3292L790k1149m0688L472K8120M576J1885q392j9599
$$ 52998 38498 10528 781 24073 27863 6714 -33974 -30502 -2382 2194 14079 5687 -13912
10776a3912R585k136l785M735j7186M284J7016J0563Q687j786j2235r658J3635
$$ -13912 -4327 -6463 -10248 -5513 -22699 -18415 -1399 9164 17851 16065 3830 -5828 7807
10763G807O040j0354j2174K4662J6127k4149r105k35k269k734j2765L28j3087
$$ 7807 13847 3493 -8681 15981 32108 7959 -1146 -1381 -3650 -6384 -19149 -18821 -31908
10750c1908n572K4853L1357j2634k8828J0799L2768K9959m716l7480j9749k3324
$$ -31908 -37480 -12627 18730 6096 -22732 -11933 20835 50794 46078 8598 -11151 -34475
10738c4475K4244J6697N663M59k8261k4201K4067N551L2596j0605n2429j3450
$$ -34475 -10231 6466 12129 12588 -15673 -39874 -15807 -10256 22340 11735 -40694 -54144
10726e4144L4960K1115J4913O681n2844r487M5974J0075n593r265j1439N948J5416
$$ -54144 -19184 1931 16844 23525 -29319 -38806 7168 17243 11650 2385 -9054 -3106 12310
10713A2310m7n505K104k9015k4508K94n811N530J2013m398J3011K3698l605j4162
$$ 12310 12263 6758 8862 -20153 -44661 -44367 -50178 -44648 -32635 -37033 -24022 -324 -3929 -18091
10699a8091j2372P13J3572l739j2447N036O824Q315l259K213j343K2502K1764
$$ -18091 -30463 -29750 -16178 -19917 -32364 -27328 -20504 -12189 -15448 -13235 -14578 7924 29688
10686B9688j1627k6155j6286J9592O446K0529J5814L792k6394l4219m635J9024
$$ 29688 18061 -8094 -24380 -4788 1658 22187 38001 41793 15399 -18820 -23455 -4431
10674d431J8057k5723J2270J7806m008k6002p929p438n966J7694J1862Q440P96
$$ -4431 13626 -12097 173 17979 13971 -12031 -19960 -27398 -33364 -15670 -3808 4632 5428
10661E428p70j6073J6682J5261j545j0850m729N228J6983K3028J2394N69j2243
$$ 5428 4658 -11415 5267 20528 18983 8133 3404 8632 25615 48643 61037 61606 49363
10648D9363j3558l180J5165j9727j7045k8133P054O565J8384k4312j7982j1213
$$ 49363 35805 32625 47790 28063 11018 -17115 -10061 -3496 14888 -9424 -27406 -38619
10636c8619j0913L944j666o296J556J5363J2625j9630l1136L5239J6916M239J5344
$$ -38619 -49532 -45588 -47254 -53550 -51994 -36631 -24006 -43636 -74772 -39533 -22617 -18378 -3034
10623c034l828q162J3469M656J9344K836j4563l5354p431K0721K3325L805o068
$$ -3034 -6862 -15024 -1555 3101 22445 25281 10718 -24636 -32067 -11346 11979 15784 9716
10610I716k4861p084o757O353Q083P261j4923k4532r840K1226R622j3941r666
$$ 9716 -15145 -22229 -28986 -22633 -14550 -7289 -22212 -46744 -56584 -35358 -25736 -39677 -49343
10597d9343J2801p341K2258J3188K3854Q695P005Q475j1459q119j6711k6704j15
$$ -49343 -36542 -43883 -21625 -8437 15417 24112 31117 39592 28133 20014 3303 -23401 -23516
10584b3516K9304L0444N224O662n063m1469j2151L0226J0094j5767N662O66j7442
$$ -23516 5788 36232 41456 48118 43055 1586 -10565 19661 29755 13988 19650 20316 2874
10571B874k3278J085j4633j1663K2788K0215J192J7883K0282k2258l6143l1774
$$ 2874 -20404 -19319 -33952 -45615 -22827 -2612 -1420 16463 36745 14487 -21656 -53430
10559e3430O366l367J2567K2153J2285K9953L775r158l7420j4032j886J2029k1377
$$ -53430 -47064 -50431 -37864 -15711 -3426 26527 30302 21144 -16276 -30308 -32194 -20165 -41542
10546d1542j1070L5320K4020O231j8376j779N529k4390J997M53N832Q129K632
$$ -41542 -52612 -17292 6728 12959 -5417 -7196 -1667 -26057 -24060 -23607 -17775 -9646 -7014
10533g014j4677r644p63M9505K2583J7370k5187Q000k3715m6091J3192K4636R813
$$ -7014 -21691 -31335 -32098 17407 39990 57360 32173 40173 16458 -29633 -16441 8195 18008
10520A8008k722l0230J83K2208K0399J8197O67r818k0k0886l5353j0073K1715
$$ 18008 15286 -14944 -14761 7447 27846 46043 46710 36892 36872 15986 -19367 -29440 -7725
10507g725J099j0147J6827n6K1320R532J0841R756q973m508j0750j7947k7626
$$ -7725 -6626 -16773 54 -2 21318 30850 41691 51447 42474 37966 27216 9269 -18357
10494a8357J2438J8384K7020K4009j5538j8783J0173j985j538j832r456j8622
$$ -18357 -5919 12465 39485 63494 47956 29173 39346 37361 35823 33991 24535 5913
10482E913K5604J8181n263k5132o809j901M3080J2534k5820j5622P749K3532j8463
$$ 5913 31517 49698 44435 19303 12494 10593 53673 66207 40387 24765 32514 56046 37583
10469C7583j2030J3052J0108J1286k7003k3155J6766J5676J5311j8733k2448O692
$$ 37583 25553 38605 48713 59999 32996 9841 26607 42283 57594 38861 16413 23105
10457B3105P168j6904j4287k243L0619K2183j8219J187O521J5281j3027k1356
$$ 23105 30273 13369 -918 -3161 27458 49641 31422 32609 39130 54411 41384 20028
10445B0028j7366K0057R510J1540K2806K4708p948j7654p751J0483l066M363j5226
$$ 20028 2662 22719 32229 43769 66575 91283 83335 65681 57930 68413 65347 69710 54484
10432E4484j3006M467K7521L7459K9520J3891k2724k123M296J6217J1616L7460
$$ 54484 41478 45945 73466 110925 140445 154336 131612 129489 133785 150002 161618 199078
10420A99078K8015N5254N7016N3926J04273J65135J71414J70101J56762J38202
$$ 199078 227093 282347 339363 393289 497562 662697 834111 1004212 1160974 1299176
10410A299176J37846O8337J3742l2564q0808q9665j60914j89282j48111j37893
$$ 1299176 1437022 1505359 1519101 1486537 1405729 1316064 1155150 965868 817757 679864
10400F79864q7014p7034j16343r5371m7726j4382q317l1264j8687j4017J9093
$$ 679864 592850 515816 399473 304102 256376 241994 233677 202413 183726 169709 188802
10389A88802j773l4017j6126j2933K1679J4472j6685j2588j7440J7j1735l8212
$$ 188802 187029 153012 136886 123953 145632 160104 143419 130831 113391 113408 101673 63461
10377F3461P482K2597J0242J7158L3533M849l1848m2357k187n238j9693o7J0443
$$ 63461 70943 93540 103782 120940 154473 159322 127474 85117 82930 77692 57999 57932 68375
10364F8375j2772j6832j144K9928L0593q525J1518K7336k4254j4369K1118K7098
$$ 68375 55603 38771 37627 67555 98148 89623 101141 128477 104223 89854 110972 138070
10352A38070O835k8543l9117j2417k9908q617n272N482L1881J1352J5871m953
$$ 138070 144905 116362 77245 64828 34920 26303 21031 26513 58394 69746 85617 80664
10340H0664j6918l4415r935j1955J3480J1495j2126J4074O229j8672L424K5820
$$ 80664 63746 29331 19396 7441 20921 32416 20290 34364 40593 21921 25345 51165
10328E1165J8890j3125j7356K3666J0514k6897j9347R30J86K9807Q464j9744k1702
$$ 51165 70055 56930 39574 63240 73754 46857 27510 28440 28626 58433 66897 47153 25451
10315B5451j7496k0277j5529j4368J8262J8479K1938J489l420K0265Q636k1862
$$ 25451 7955 -12322 -27851 -42219 -23957 -5478 16460 17949 14529 34794 43430 21568
10303B1568K6369J0810o275l1546k6209j8316l787N872K180n260p527J6356q208
$$ 21568 47937 58747 52472 20926 -5283 -23599 -27386 -21514 -19334 -24594 -32121 -15765 -23973
10290b3973j5147J4582J7941j0013k6732J9107K476J4944j3104j6559j5961J4653
$$ -23973 -39120 -24538 -6597 -16610 -43342 -24235 -21759 -6815 -19919 -36478 -52439 -37786
10278c7786J4490K5934K6269L542J8102n699Q782K493j5981n149n055j6131J031
$$ -37786 -23296 2638 28907 32449 50551 44852 53634 56127 40146 34997 29942 13811 14842
10265A4842J8324j3894j399k5276j1132J2064R125J5734L5900r528M715j0849
$$ 14842 33166 19272 17873 -7403 -18535 -6471 2654 18388 54288 44760 49475 38626
10253C8626k1304j7566m0292j5298J6122K1322J6907k7185J3723L3551k329k4207
$$ 38626 17322 -244 -40536 -55834 -39712 -18390 -1483 -28668 -14945 18606 16277 -7930
10241g930k0278q343K626r677J249K1695J550P394j1732P061J518J4653K5891
$$ -7930 -28208 -36551 -33925 -43602 -42353 -20658 -19108 -11714 -23446 -16385 -14867 -214 25677
10228B5677j9493l06O32P502l670j0871l021j1919j2548M551K1981L9759J6385
$$ 25677 6184 5878 6510 14012 10342 -529 -3550 -15469 -28017 -23466 -1485 38274 54659
10215E4659K682j17l7745j4249J8286L1000J0031j8686r094p930k0705j0345k1672
$$ 54659 57341 57224 19479 5230 23516 54516 64547 45861 36767 28837 8132 -2213 -23885
10202b3885N365K5773N743K8050n816k3293k3404k952J5526r2J4397k21R601N208
$$ -23885 -18520 7253 12996 41046 35230 11937 -11467 -14419 1107 1015 15412 15191 24792 30000
10188C0000K379j979J4221J9557J993j8043j5303j0527j0106l2238j0478J1828
$$ 30000 32379 30400 44621 64178 66171 48128 32825 22298 12192 -20046 -30524 -18696
10176a8696J2944R407M129N290k4746q267l917p409J1794j00j6871J6672m304
$$ -18696 -5752 3655 7784 13074 -11672 -19939 -23856 -31265 -19471 -19571 -36442 -19770 -24074
10163b4074K3037l8682p63j1091j0986M931J0774j19J9282l123l441K8564k424
$$ -24074 -1037 -39719 -40482 -51573 -62559 -57628 -46854 -46973 -27691 -30814 -34255 -5691 -8115
10150h115j1680k7506j940L8771N1917J2769o571m4638j4539Q307k0508p512K4769
$$ -8115 -19795 -47301 -49241 -10470 41447 54216 47645 3007 -11532 -3225 -23733 -31245 -6476
10137f476J3350l2815k4137o344J8282n144J1942M5848P879n941l239k2517j7509
$$ -6476 6874 -25941 -50078 -56422 -38140 -43284 -31342 14506 22385 16444 13205 -9312 -26821
10124b6821R142j6745J603J4107R31m940m374j5756J268j173K767L8374J6375
$$ -26821 -17679 -34424 -32821 -18714 -17783 -22723 -27097 -42853 -41585 -42758 -39991 -1617 14758
10111A4758j7008j6580r67n117j1532O124M1614J923k6592j6487J6669J9160k720
$$ 14758 -2250 -18830 -19797 -24914 -36446 -30322 11292 13215 -13377 -29864 -13195 5965 3245
10098C245j1388o041m100O839k722l6k053K520K8011L6322l4010k8612l4901J9415
$$ 3245 -8143 -14184 -18284 -11445 -14167 -14203 -16256 -13736 14275 50597 16587 -12025 -46926 -27511
10084b7511O6017M406r133k2585K5461L938q44M023q887k043J7786L1635J2113
$$ -27511 38506 42912 33779 11194 36655 40593 39749 43772 34885 32842 50628 82263 94376
10071I4376o30K1935L267L6579M0902J08017J57084K78372L96981L95668K92243
$$ 94376 93746 115681 118948 155527 196429 304446 461530 739902 1136883 1532551 1824794
10060A824794K54810J25744q3248m32094o45647m04507j67847j06040p1129l0932
$$ 1824794 2079604 2205348 2122100 1690006 1044359 639852 472005 365965 294836 263904
10050B63904k9801m1407k9332L103m274k4002j1772j0724m882M401L394r167l2267
$$ 263904 234103 192696 163364 166467 162193 138191 126419 115695 110813 115214 118608 109441 77174
10037G7174j5116J5006K0338l978l5877q582M719m000l6643k7988j7954j107J8067
$$ 77174 62058 77064 97402 93424 57547 48965 53684 49684 13041 -14947 -32901 -34008 -15941
10024a5941N3523L0923j6002k8850k673j7504p572L488K9407L1678J3822p667
$$ -15941 37582 68505 52503 23653 20980 3476 -4096 -608 28799 60477 74299 66632
10012F6632l4774k9162K1694R16K0765J6584l409K076k5946r626J8581N754m6564
$$ 66632 31858 2696 24390 25306 46071 62655 59246 61322 35376 25750 44331 50085 3521
9999C521R722L6379K2260l449k1774j1063J5367j3114N031j5126j0260q754K1390
$$ 3521 13243 49622 71882 68433 46659 35596 50963 37849 42880 27754 17494 8740 30130
9986C0130l340k055j4496p853K4811R655l6576j8291R554K5552j1086k6539l8141
$$ 30130 26790 24735 10239 2386 27197 36852 276 -18015 -8461 17091 6005 -20534 -58675
9973e8675q795K1009K0346N846K8063L7088p676k4280j1742K0760J939k5687r083
$$ -58675 -67470 -46461 -26115 -20269 7794 44882 37206 12926 1184 21944 23883 -1804 -10887
9960a0887J0096L5606j5877k4383P054J4407j5346k9396m21j7248L714K1278M441
$$ -10887 -791 34815 18938 -5445 1609 16016 670 -28726 -29147 -46395 -42681 -21403 -16962
9947a6962J3762J7259j4998j4784K8551J7906j5549n2236j0876K0535N2097r242
$$ -16962 -3200 14059 -939 -15723 12828 30734 15185 -37051 -47927 -27392 24705 15463
9935A5463m2332k0556O658J2715J4148K3395O152O65j7031j990N345K93m713k327
$$ 15463 -26869 -47425 -40767 -28052 -13904 9491 15643 16308 -723 -2713 2632 2925 -1788 -4115
9921d115j117K551k581K0110j5262n913j2263j4187L492l190k0663p27M1731L3977
$$ -4115 -5232 -2681 -5262 14848 -414 -6327 -18590 -32777 -29285 -32475 -53138 -53865 -12134 21843
9907B1843l8201m0112o280J1084J5190N244J0225J892J1321J0088J8819k6815
$$ 21843 -16358 -56470 -62750 -51666 -36476 -31232 -21007 -19115 -7794 2294 21113 -5702
9895e702j3941J992k991J2097J2324N127K902o787J415l328K9340p205j1157j0549
$$ -5702 -19643 -17651 -20642 -8545 3779 8906 11808 5021 6436 3108 32448 25243 14086 3537
9881C537r804m2545j5947K2237L1690O191r325J4868k292l6203j2724J0195O232
$$ 3537 -6267 -48812 -64759 -42522 -10832 -4641 -13966 902 -1390 -37593 -50317 -40122 -33890
9868c3890J9909J5259p803j338k1076k0556J1063J0996M081L6585K6531p01L361
$$ -33890 -13981 1278 -6525 -7863 -28939 -49495 -38432 -27436 -23355 13230 39761 39060 42421
9855D2421J8831J9304K9880R361o296j1092p794R97o373k448R781j2409l0358
$$ 42421 61252 80556 110436 119797 113501 102409 94615 95612 89239 86791 96572 84163 53805
9842E3805j9161k7616O717K5170K7785J0716j5458l2319m338j9057j3636J0031
$$ 53805 34644 7028 13745 38915 66700 77416 61958 29639 25301 6244 -7392 2639
9830B639K9448K0269M206R809j2378j586J3185K1182P977M578R100K4115M6542
$$ 2639 32087 52356 56562 66371 53993 52407 65592 86774 94751 99329 108429 132544 179086
9817A79086K8702J2134K4824K0545j0043n4959m3899r387l3369m6176j9271K84
$$ 179086 207788 219922 244746 265291 255248 200289 156390 147003 113634 67458 48187 48471
9805D8471J4752J2024J9716K633j4837j4552R528O129J7135K4571K3278L5551
$$ 48471 63223 75247 94963 97596 82759 68207 77735 83864 100999 125570 148848 184399
9793A84399M1824M3490O3741P1347J12429K10598M08453O91778R49005Q50291
$$ 184399 226223 269713 333454 404801 517230 727828 1136281 1828059 2777064 3627355
9783C627355O31552O01009L22501k38789j034026j401612q63632m41914k56967
$$ 3627355 4258907 4859916 5182417 4943628 3909602 2507990 1644358 1202444 945477
9774I45477j49064j28737r7135n9063l6250j4217o647j8492n7495n4750r759q544
$$ 945477 796413 667676 570541 511478 475228 461011 454364 435872 378377 323627 313868 305324
9762C05324j9768j5145K85p074k343j7997j1135j5720k2555K4700L6296J3778
$$ 305324 285556 270411 270696 263622 261279 243282 232147 216427 193872 218572 254868 268646
9750B68646m3678m9779K532R608l616N931Q184n070q182R50J205m4819k3690Q89
$$ 268646 224968 175189 177721 187329 183713 189644 197828 192758 184576 185526 186731 141912 118222 119111
9736A19111k7992j6737J7873K66O062m328k742O786K779Q782q919o522j0624r599
$$ 119111 91119 74382 92255 92521 98583 94255 91513 98299 101078 109860 100941 94419 83795 74196
9722G4196J3188N96J133j935l323l7427j8005J3439j7365k438n38J2157L3634
$$ 74196 87384 87980 89113 87178 83855 46428 28423 41862 24497 22059 21521 33678 67312
9709F7312L9472j33k0992l2726m3142j3489J7879J4399R195l1179j3291L0749
$$ 67312 106784 106651 85659 52933 9791 -3698 14181 28580 37775 6596 -6695 24054
9697B4054J7057K22J194J9123J3743J394k7384j0619j6340K0981K5390K1036l3560
$$ 24054 41111 41333 42527 61650 75393 76787 49403 38784 22444 43425 68815 89851 56291
9684E6291L514n937O798K1324j9649m756J1965L263J2024J334K0624M428k253
$$ 56291 59805 53868 60666 81990 62341 57585 69550 72813 84837 86171 106795 111223 108970
9671A08970l906O378k3299k301J6144R353k007j8456P422L0444M364m124P389
$$ 108970 105064 111442 88143 85842 101986 111339 109332 90876 98298 128742 133106 128982 136371
9658A36371K802O26j2608k592O246K1596J9429L1415k0157l2744j0723K86n196
$$ 136371 139173 139799 127191 124599 130845 152441 171870 203285 183128 150384 139661 139947 134751
9645A34751j3765n751k942m4016k3222J5389K2416J2119K0629P906k7109O446
$$ 134751 120986 115235 112293 68277 45055 60444 82860 94979 115608 123514 96405 102851
9633A02851j8804M425k979o721k7798j9038P52R749K3958m2113j4756J9574N08
$$ 102851 84047 88472 85493 78772 50974 31936 32688 42437 66395 24282 9526 29100 29608
9620B9608J6203N543p720J4052K1274K2148M156J8629J469k9175j5587p439k135
$$ 29608 45811 51354 43634 57686 78960 101108 105264 123893 125362 96187 80600 73161 71026
9607G1026o353n036J3045J0832O186j1645O311M6380K2314m878l296n41P371j3492
$$ 71026 64673 59637 72682 83514 89700 78055 84366 130746 153060 148182 144886 144345 151716 138224
9593A38224K540j1325P649K6747q303j7988l0196R265j4521P353K4424j7258j1355
$$ 138224 140764 129439 137088 163835 155532 137544 107348 116613 102092 109445 133869 116611 105256
9580A05256J0726L0459J5031K053k356M764n186o118J2339k8850l3088r920O095
$$ 105256 115982 146441 161472 163525 161169 165933 160747 154629 166968 138118 105030 95110 101205
9567A01205J5239K632l0175j7968K3611J8943K598j1684j6740J209J111k1318
$$ 101205 116444 119076 88901 70933 94544 113487 116085 104401 87661 88870 89981 68663
9555F8663j0457j9423J0768R608K0538m806J1328l3255j9817J7078J3987J1694
$$ 68663 58206 38783 49551 59159 79697 74891 86219 52964 33147 50225 64212 75906
9543G5906J6471j4187J0534o202o982J1432R187J0026j1666J5894J4273j7336
$$ 75906 92377 78190 88724 82522 75540 86972 96159 106185 94519 110413 124686 107350
9531A07350k2068j1878j1033j0419K6340N2779J1978k5992O22J1343M414J8585
$$ 107350 85282 73404 62371 51952 78292 131071 143049 117057 117679 129022 133436 152021
9519A52021J4647m478j5000l1816o278J3010j0282o580K846J8148k0897k1426
$$ 152021 166668 162190 147190 115374 109096 122106 111824 105244 108090 126238 105341 83915
9507H3915L0889L896k4187m866J2180k6534m952k179O532P313L533M593j5770
$$ 83915 114804 118700 94513 89647 101827 75293 70341 68162 74694 82007 85540 90133 74363
9494G4363q921l53j9370J6680J2644J7563J0113Q919K0281Q84L0832j2194j9272
$$ 74363 65442 65089 45719 62399 75043 92606 102719 111638 131919 132803 163635 151441 132169
9481A32169l338N776j132l108j2015o302K8168J0832k2995q768L198Q085L0549
$$ 132169 128831 134607 133475 130367 118352 112050 140218 151050 128055 119287 122485 130570 161119
9468A61119o100l3865m476K8428J2815J917J2001q212j2886o897P451l4384k4392
$$ 161119 155019 121154 116678 145106 157921 159838 171839 163627 150741 143844 151295 116911 92519
9455I2519J1518J5146N927P81N304O944L4395O120K04K8024Q632j4269j3815j6363
$$ 92519 104037 119183 125110 125891 131195 138139 172534 178654 178858 206882 215514 201245 187430 171067
9441A71067l2757R37k2482k0260R760j7409r296J8991M63l2412l5895L0649J3967
$$ 171067 138310 139247 116765 96505 106265 88856 79560 98551 99014 66602 30707 61356 75323
9428G5323n2101R468K3142N738J8544M42k2421j0646k0233K2063o013L173K2759
$$ 75323 23222 32690 55832 61570 80114 80556 58135 47489 27256 49319 43306 46479 69238
9415F9238m701j7347J0232J785K973k5308j275J317K0377Q076K429l0811m2840
$$ 69238 64537 47190 57422 59207 62180 36872 35597 36914 57291 65367 67796 36985 -5855
9402e855j8072p695K7053J8690k4059l282K6038Q616l3698L2106J2755R036O727
$$ -5855 -23927 -31622 -4569 14121 -9938 -13220 12818 21434 -12264 19842 32597 41633 48360
9389D8360m972k532j2690q414j9773m0689q41L2956K8317o110n456Q895k268N603
$$ 48360 43388 40856 28166 19752 -21 -40710 -41551 -8595 19722 13612 8156 17051 14783 20386
9375B0386k1500M826j2122n889K3799M1123n90m2336j5091L673K8040n592O922
$$ 20386 -1114 3712 -8410 -14299 9500 50623 50033 7697 -7394 -3721 24319 18727 25649
9362B5649j4151K28J0185J1473m918l483J0384K0332n072N947j0803j0460j831
$$ 25649 11498 11726 21911 33384 28466 24983 35367 55699 50627 56574 45771 35311 33480
9349C3480j12J5846J3891k172l7256l685L339L802n839Q914J5572Q553o572o948
$$ 33480 33368 49214 63105 60933 23677 19992 23331 27133 21294 30208 45780 54333 47761 40813
9335D0813k3011k1715j4782K4053J9181J838P516J0385K2782j1530l1200m6532
$$ 40813 17802 -3913 -18695 5358 24539 26377 33893 44278 67060 55530 24330 -22202
9323b2202K1653M1376J594k3864o922J1200k7594k1360j057j8404J6819K3427
$$ -22202 -549 40827 42421 18557 11635 22835 -4759 -26119 -27176 -45580 -28761 -5334
9311e334Q281j1970m014o560l163K2032J5732P930q72L728j2539J6964O855J6455
$$ -5334 2947 -9023 -13037 -19597 -22760 -728 15004 22934 22062 25790 13251 30215 37070 53525
9297E3525R932L461k4216j4608J4994p921l2298P664p410j5454P478J158J8918
$$ 53525 63457 66918 42702 28094 43088 35167 2869 10533 3123 -12331 -4853 -3695 15223
9284A5223P273J0666J6115o457P019R005j7293q960L0863P029k8489j809j7584
$$ 15223 22496 33162 49277 42820 49839 58844 41551 32591 63454 70483 41994 40185 22601
9271B2601j0903m253P01J1536J1429q783l967k873J0094j3777n704P225Q228J5978
$$ 22601 11698 7445 8146 19682 31111 22328 18361 15488 25582 11805 6101 13326 21554 37532
9257C7532K5783q824M072R600k0842o900M4111J3206L581R958r207j6242l0908
$$ 37532 63315 54491 58563 68163 47321 40421 84532 97738 101319 111277 102070 85828 54920
9244E4920J4665J3637k0915j4905l875P247J5792K2763K0395J1760J2932k5161
$$ 54920 69585 83222 62307 47402 43527 50774 66566 89329 109724 121484 134416 109255
9232A09255l0193j3223k4370J3428L8735L224j481K3555J4571k2322l4010K1404
$$ 109255 79062 65839 41469 54897 93632 96856 95375 118930 133501 111179 77169 98573
9220I8573N4170k3914k2215J2376O50Q886J3232l7877j5512O833o562j3961K0567
$$ 98573 152743 128829 106614 118990 119640 128526 141758 103881 88369 95202 88640 74679 95246
9207I5246P481K636r342k761J4188J0275j1613n834Q40l1091J0627n80j103K9089
$$ 95246 102727 105363 96021 93260 107448 117723 106110 100276 101116 70025 80652 80072 78969 108058
9193A08058K9171J2257j955k3328l1241J5408L9951K5028J3180q489k6066l37
$$ 108058 137229 149486 147531 124203 92962 108370 148321 173349 186529 178040 151974 151637
9181A51637P441K4376L97k1214K9143K8203L4062L555M101J789J2851M9474L7545
$$ 151637 159078 183454 183851 162637 191780 219983 254045 257600 261701 263490 276341 325815 363360
9168C63360K6653K1410P0217O9512P8957J23437J73061K15793K81193M34743O86339
$$ 363360 390013 411423 481640 551152 630109 753546 926607 1142400 1423593 1858336 2544675
9157B544675J232150K180447L017452K842478K187374J919997J089225o10430
$$ 2544675 3776825 5957272 8974724 11817202 14004576 15924573 17013798 16403368
9149A6403368l139047m614019l030918j533936q47840n46179l71798k49779k04306
$$ 16403368 13264321 8650302 5619384 4085448 3237608 2691429 2319631 2069852 1865546
9140A865546j27977q1494j28368j33395r2228o1393n5005o9102n5294n3741n6708
$$ 1865546 1737569 1656075 1527707 1394312 1302084 1240691 1185686 1116584 1061290 1007549 950841
9129I50841l8284k1458k6894l0374l6460n4012n1222j4554q464k3391l3866k0339
$$ 950841 912557 891099 864205 833831 797371 743359 692137 677583 669119 645728 611862 591523
9117E91523j5270k0380o561k6919j011o524l877j994j4306j3320o012k7656L1
$$ 591523 576253 555873 549312 522393 521382 514858 510981 508987 494681 481361 475349 447693 447724
9104D47724j1234l8164o288K881j1065j643r430j4095j2999j0552J805J9561j2490
$$ 447724 436490 398326 392038 394919 383854 382211 372781 358686 345687 335135 336940 356501 344011
9091C44011j4035l3688m0851m675L480J7865j1828o943n711L0161J5005R208L154
$$ 344011 329976 296288 255437 250762 254242 272107 260279 253336 247625 277786 292791 301999 305153
9078C05153n479k2425n1619m6953j0893L288L0723K5867P789j8551P455P73j6442
$$ 305153 299674 277249 225630 178677 167784 171072 201795 227662 235451 216900 224355 225128 208686
9065B08686k0770M39m21m3647j4162J868J8327J148j8328P23O891j6721k2994
$$ 208686 187916 188355 187934 144287 130125 131993 150320 151468 133140 133863 140754 124033 101039
9052A01039O105K284p200n909r37l4021m3113J0648L6150O891j1733P855P361
$$ 101039 107144 109428 102228 96319 95382 61361 18248 28896 65046 71937 60204 68059 75420
9039G5420p803J4553o130j3601N37k2011O863R054k0534j9099m195r936q484K1771
$$ 75420 67617 82170 76040 62439 62976 40965 47828 56882 36348 17249 13054 3118 -5366 16405
9025A6405K7750p393K3008J5501j2849J5636K1297m6182l0835p229J0641M2566
$$ 16405 44155 36762 59770 75271 62422 78058 99355 53173 22338 15109 25750 68316
9013F8316L618m0867l801j0827K7264K1563L82k5558k5336j0574j2467j4188J0963
$$ 68316 71934 31067 27266 16439 43703 65266 65648 40090 14754 4180 -8287 -22475 -11512
9000a1512M2972L7025J480k353K236l0858m07J0636M121M604l2749R412N666k2709
$$ -11512 31460 68485 69965 67612 69848 38990 38583 49219 53340 57944 25195 34607 40273 17564
8986A7564O828M832J1409n312j3810m922P417L454k0372K808J2450Q778n654j1940
$$ 17564 24392 29224 40633 35321 21511 16589 24006 27460 7088 9896 22346 31124 25470 13530
8972A3530k7094O072K2906K9766q91k0329k6136k341K477Q330J4915K0412k2509
$$ 13530 -13564 -7492 15414 45180 44289 23960 -2176 -4517 -2040 6290 21205 41617 19108
8959A9108j4618j1187j5044O211K0410K942m851l665m499J4379R751L343J926
$$ 19108 4490 -6697 -21741 -15530 4880 7822 2971 -694 -5193 9186 18937 22280 24206
8946B4206j26j0983K5443J0584j5584k4507k4465q419N325K1930j3494j988k5356
$$ 24206 24080 13097 38540 49124 33540 9033 -15432 -23851 -18526 3404 -10090 -12078 -37434
8933c7434k0583K2852J3376j4858K345m257m728J7735j1202k616J6191J0630j9498
$$ -37434 -58017 -35165 -21789 -36647 -34302 -38559 -43287 -25552 -36754 -39370 -23179 -12549 -32047
8920c2047N774K796p272l1251k986K8751L6214p916L0346K119k7689j092m533
$$ -32047 -26273 -23477 -30749 -62000 -64986 -36235 -21 -7937 22409 24528 -3161 -4253 -8786
8907h786q106J1234K6643l742m189J3122j3935j5587k5114J0114K1183J8151O73
$$ -8786 -16892 -5658 20985 17243 13054 26176 12241 -3346 -28460 -18346 2837 20988 21661
8894B1661p000m847o727k2337J1417J075P411L3762J7957p707o326m3075j589
$$ 21661 14661 9814 3087 -19250 -7833 -6758 653 34415 52372 44665 38339 -4736 -6325
8881f325j2696J4649j2254k4662J0083J9835R821L4922o093N580J1899n457l759
$$ -6325 -19021 -4372 -16626 -41288 -31205 -11370 -1549 33373 27280 32860 44759 39302 35543
8868C5543N799k437k0476j554q540n610K2336J840r065l6316k8964Q893J3701
$$ 35543 41342 38905 18429 16875 8335 2725 25061 26901 17836 -18480 -47444 -38551 -24850
8855b4850q955p961J6693L0232J5756J1475k2520J0817r453j2988Q091M099J0067
$$ -24850 -33805 -41766 -25073 5159 20915 32390 9870 20687 11234 -1754 6337 10436 20503
8842B0503j6566J1475j0543l143J4645M544k2134k493j294L730K2140P28J1868
$$ 20503 3937 15412 4869 1726 16371 20915 -1219 -3712 -5006 -1276 20864 21592 33460
8829C3460j0191k4152r470j0456P954L4646R832J0018R646j3322l216J2334R840
$$ 33460 23269 -883 -10353 -20809 -12855 21791 31623 41641 51287 37965 34749 47083 56923
8816E6923l3543j9766P290L445K5512J3220J6839k7689j0277K9051J4554o600
$$ 56923 23380 3614 10904 14349 39861 53081 69920 42231 31954 61005 75559 68959
8804F8959m815O509l1067m0296m601j6474P151K5082J4793l890l275r971j1200
$$ 68959 64144 70653 39586 -710 -5311 -21785 -14634 10448 25241 21351 18076 8105 -3095
8791c095k401Q427k1261k683L233J3876N5731J476j0002k143m492l820O953P92
$$ -3095 -5496 2931 -18330 -21013 -17780 -3904 51827 53303 43301 41158 36666 32846 39799 40591
8777D0591q779m514K4000J2903n785P442J1040r7j8596p498j1995j4027j0119
$$ 40591 31812 27298 51298 64201 58416 65858 76898 76801 58205 50707 38712 24685 14566
8764A4566j0397J9554L1994j5893k7699J7942K7636o845L689p243k3757P234K4221
$$ 14566 4169 23723 55717 39824 12125 30067 57703 50858 54547 47304 23547 30781 55002
8751E5002M2602J3399k9371j7501O043O285k3738J0330Q588P584j414M727K4697
$$ 55002 97604 111003 81632 64131 70174 76459 52721 63051 71639 79223 77809 82536 107233
$$ [...]
##END NTUPLES=NMR SPECTRUM
##END=
