##TITLE=Analysis number 309857
Compound Code gk 00498
Project Code adrs
Chemist Name stores
##JCAMPDX= 6.0         $$ Bruker NMR JCAMP-DX V2.0
##DATA TYPE= NMR SPECTRUM
##DATA CLASS= NTUPLES
##ORIGIN= Bruker BioSpin GmbH
##OWNER= NMR
$$ XWIN-NMR		Version 3.5
$$ Mon Jun  6 10:38:40 2005 GMT Daylight Time (UT+1h)  MAYBRIDGE\NMR@NMR_250MHZ
##.OBSERVE FREQUENCY= 250.131544655141
##.OBSERVE NUCLEUS= ^1H
##.ACQUISITION MODE= SIMULTANEOUS (DQD)
##.ACQUISITION SCHEME= undefined
##.AVERAGES= 16
##.DIGITISER RES= 18
##SPECTROMETER/DATA SYSTEM= dpx250
##.PULSE SEQUENCE= zg30
##.SOLVENT NAME= CDCl3
##.SHIFT REFERENCE= (INTERNAL, CDCl3, 0, 16.522)
##AUDIT TRAIL= $$ (NUMBER, WHEN, WHO, WHERE, WHAT)
$$ ##TITLE= Audit trail, XWIN-NMR		Version 3.5
$$ ##JCAMPDX= 5.01
$$ ##ORIGIN= Bruker BioSpin GmbH
$$ ##OWNER= NMR
$$ C:\u/data/dgb/nmr/ADRS/3850/pdata/1/auditp.txt
$$ ##AUDIT TRAIL=  $$ (NUMBER, WHEN, WHO, WHERE, WHAT)
(   1,<2005-06-06 10:38:01.40 +100>,<MAYBRIDGE\NMR>,<NMR_250MHZ>,
      <created by zg, POWCHK disabled, PULCHK disabled
       configuration hash MD5:
       62 19 C7 07 E1 42 D1 B7 37 6C 3D D0 77 39 F9 E6
       data hash MD5: 64K
       32 19 09 81 CD 07 8E 3A 56 D3 75 45 61 20 3A 28>)
(   2,<2005-06-06 10:38:18.79 +100>,<MAYBRIDGE\NMR>,<NMR_250MHZ>,
      <Start of raw data processing
       ef LB = 0.3 FT_mod = 6 PKNL = 1 SI = 32K 
       data hash MD5: 32K
       27 A1 90 D4 E9 27 A4 E4 E0 32 AF 11 05 73 62 D6>)
(   3,<2005-06-06 10:38:24.95 +100>,<MAYBRIDGE\NMR>,<NMR_250MHZ>,
      <apk 
       data hash MD5: 32K
       FD 1B DB DA 5D FD 9B 17 DA 64 D3 D6 82 73 E2 BA>)
(   4,<2005-06-06 10:38:26.84 +100>,<MAYBRIDGE\NMR>,<NMR_250MHZ>,
      <abs ABSG = 5 
       data hash MD5: 32K
       EB E0 28 91 8E 3A 61 1F 2F 4F 44 54 09 24 68 17>)
$$ ##END=
$$ 
$$ hash MD5
$$ 29 28 19 9E C4 E9 49 95 FD 4B 3B 96 B6 7C 1C 98
##$RELAX= 
##$RELAX= 
##$RELAX= 
##$RELAX= 
##$RELAX= 
##$RELAX= 
##$RELAX= 
$$ Bruker specific parameters
$$ --------------------------
##$DU= <C:\u>
##$EXPNO= 3850
##$NAME= <ADRS>
##$PROCNO= 1
##$TYPE= <nmr>
##$USER= <dgb>
##$AMP= (0..31)
100 100 100 100 100 100 100 100 100 100 100 100 100 100 100 100 100 100 
100 100 100 100 100 100 100 100 100 100 100 100 100 100 
##$AQSEQ= 0
##$AQ_mod= 3
##$AUNM= <au_zg>
##$AUTOPOS= <13 >
##$BF1= 250.13
##$BF2= 250.13
##$BF3= 250.13
##$BF4= 250.13
##$BF5= 500.13
##$BF6= 500.13
##$BF7= 500.13
##$BF8= 500.13
##$BYTORDA= 1
##$CFDGTYP= 0
##$CFRGTYP= 5
##$CHEMSTR= <none>
##$CNST= (0..31)
1 1 145 1 1 1 1 1 1 1 1 1 1 1 1 1 1 1 1 1 1 1 1 1 1 1 1 1 1 1 1 1 
##$CPDPRG= <>
##$CPDPRG1= <>
##$CPDPRG2= <>
##$CPDPRG3= <>
##$CPDPRG4= <mlev>
##$CPDPRG5= <mlev>
##$CPDPRG6= <mlev>
##$CPDPRG7= <mlev>
##$CPDPRG8= <mlev>
##$CPDPRGB= <>
##$CPDPRGT= <>
##$D= (0..31)
0 1 0 0 0 0 0 0 0 0.06 0 0 0 0 0 0 0.0002 0 0 0 0 0 0 0 0 0 0 0 0 0 0 
0 
##$DATE= 1118050680
##$DBL= (0..7)
120 120 120 120 120 120 120 120 
##$DBP= (0..7)
150 150 150 150 150 150 150 150 
##$DBP07= 0
##$DBPNAM0= <>
##$DBPNAM1= <>
##$DBPNAM2= <>
$$ [...]
##$SUBNAM7= <"">
##$SUBNAM8= <"">
##$SUBNAM9= <"">
##$SW= 20.6930455092707
##$SWIBOX= (0..15)
0 0 3 0 0 0 0 0 0 0 0 0 0 0 0 0 
##$SW_h= 5175.983436853
##$TD= 65536
##$TD0= 1
##$TE= 294.16
##$TE2= 300
##$TE3= 300
##$TEG= 300
##$TL= (0..7)
0 120 120 120 120 120 120 120 
##$TP= (0..7)
150 150 150 150 150 150 150 150 
##$TP07= 0
##$TPNAME0= <>
##$TPNAME1= <>
##$TPNAME2= <>
##$TPNAME3= <>
##$TPNAME4= <>
##$TPNAME5= <>
##$TPNAME6= <>
##$TPNAME7= <>
##$TPOAL= (0..7)
0.5 0.5 0.5 0.5 0.5 0.5 0.5 0.5 
##$TPOFFS= (0..7)
0 0 0 0 0 0 0 0 
##$TUNHIN= 0
##$TUNHOUT= 0
##$TUNXOUT= 0
##$USERA1= <user>
##$USERA2= <user>
##$USERA3= <user>
##$USERA4= <user>
##$USERA5= <user>
##$V9= 5
##$VALIST= <valist>
##$VCLIST= <CCCCCCCCCCCCCCC>
##$VD= 0
##$VDLIST= <DDDDDDDDDDDDDDD>
##$VPLIST= <PPPPPPPPPPPPPPP>
##$VTLIST= <TTTTTTTTTTTTTTT>
##$WBST= 1024
##$WBSW= 4
##$XGAIN= (0..3)
0 0 0 0 
##$XL= 0
##$YL= 0
##$YMAX_a= 325729
##$YMIN_a= -275687
##$ZGOPTNS= <>
##$ZL1= 120
##$ZL2= 120
##$ZL3= 120
##$ZL4= 120
##$ABSF1= 16.522
##$ABSF2= -4.171173
##$ABSG= 5
##$ABSL= 3
##$ALPHA= 0
##$AQORDER= 0
##$ASSFAC= 0
##$ASSFACI= 0
##$ASSFACX= 0
##$ASSWID= 0
##$AUNMP= <proc_1d>
##$AZFE= 0.1
##$AZFW= 0.1
##$BCFW= 0
##$BC_mod= 0
##$BYTORDP= 0
##$COROFFS= 0
##$CY= 12.5
##$DATMOD= 1
##$DC= 0
##$DFILT= <>
##$DTYPP= 0
##$F1P= 14.0000005364418
##$F2P= -0.99999901652339
##$FCOR= 0.5
##$FTSIZE= 32768
##$FT_mod= 6
##$GAMMA= 0
##$GB= 0
##$INTBC= 1
##$INTSCL= 1
##$ISEN= 128
##$LB= 0.3
##$LEV0= 0
##$LPBIN= 0
##$MAXI= 10000
##$MC2= 0
##$MEAN= 0
##$ME_mod= 0
##$MI= 0
##$NCOEF= 0
##$NC_proc= -4
##$NLEV= 6
##$NOISF1= 0
##$NOISF2= 0
##$NSP= 0
##$NTH_PI= 0
##$NZP= 0
##$OFFSET= 16.522
##$PC= 1
##$PHC0= -74.5705
##$PHC1= 12.15928
##$PH_mod= 1
##$PKNL= yes
##$PPARMOD= 0
##$PSCAL= 4
##$PSIGN= 0
##$REVERSE= no
##$SF= 250.13
##$SI= 32768
##$SIGF1= 0
##$SIGF2= 0
##$SINO= 400
##$SIOLD= 32768
##$SREGLST= <1H.CDCl3>
##$SSB= 0
##$STSI= 32768
##$STSR= 0
##$SW_p= 5175.98343685301
##$SYMM= 0
##$S_DEV= 0
##$TDeff= 65536
##$TDoff= 0
##$TI= <Analysis number 999999
Compound Code 99
Book Reference 9
Project Code 9>
##$TILT= no
##$TM1= 0
##$TM2= 0
##$TOPLEV= 0
##$USERP1= <user>
##$USERP2= <user>
##$USERP3= <user>
##$USERP4= <user>
##$USERP5= <user>
##$WDW= 1
##$XDIM= 32768
##$YMAX_p= 518339083
##$YMIN_p= -348264
$$ End of Bruker specific parameters
$$ ---------------------------------
##NTUPLES= NMR SPECTRUM
##VAR_NAME=  FREQUENCY,     SPECTRUM/REAL,   SPECTRUM/IMAG
##SYMBOL=    X,             R,               I
##VAR_TYPE=  INDEPENDENT,   DEPENDENT,       DEPENDENT
##VAR_FORM=  AFFN,          ASDF,            ASDF
##VAR_DIM=   32768,         32768,           32768
##UNITS=     HZ,            ARBITRARY UNITS, ARBITRARY UNITS
##FACTOR=    0.157963299565203, 1,           1
##FIRST=     4132.6476996994, 0,             0
##LAST=      -1043.33573715361, 0,           0
##MIN=       -1043.33573715361, -348264,     0
##MAX=       4132.6476996994, 518339083,     0
$$ Real data points
##PAGE= N=1
##DATA TABLE= (X++(R..R)), XYDATA
$$ [...]
22127 6582 23072 65512 26707 -82212 -101960 -190935 -185710 -184041 -176661 -242282 -201289 -85190
22115 -85190 18992 -23748 41050 44032 -69512 -163540 -143431 -129354 -136230 -165519 -113026 -72516
22103 -72516 -71727 -79785 12227 25087 -46664 -144071 -134128 -103810 -50788 -81763 -62544 -29307
22091 -29307 52491 33016 66216 64668 158777 72115 -9876 -19004 2576 -20659 -18196 19663
22079 19663 64163 -24185 -94602 -122865 -83962 -93261 -145413 -110170 -72846 -56442 30222 57934
22067 57934 -1970 35239 102344 -22075 -149904 -120857 -76363 -8337 -54034 -74861 -22276
22056 -22276 56269 67852 68820 3043 -60682 -86050 -19550 -75605 -143476 -149832 -53482 69369
22044 69369 27520 -27103 -6801 -41845 -134846 -126694 35917 99916 56186 98841 216755
22033 216755 101067 -31716 -23984 15626 53619 54090 128897 213792 100647 750 53153
22022 53153 28256 85635 42568 20435 106169 197053 154539 106105 39330 23268 -19428 -131598
22010 -131598 -112518 1797 13236 -8182 -41795 -145633 -180427 -134298 -100126 -108411 -99388
21999 -99388 -111855 -154475 -95218 -86846 -117908 30684 119705 219985 223656 237107 257353 241993
21987 241993 191408 193100 118060 9713 65431 57797 9382 22816 35172 73368 47951 59010
21975 59010 40201 68392 72529 -57573 -11431 20321 -75761 -79130 -111188 -120269 -139643 36794
21963 36794 61424 -59542 -122232 -149145 -164877 -163752 -73214 54327 -31375 -153605 -169660
21952 -169660 -130701 -41095 -4120 59844 167253 138070 106927 138716 154430 179741 238064
21941 238064 163783 103367 -19455 -105011 38932 20 -74116 -26351 42201 -42089 -75053
21930 -75053 -112704 -25882 38732 112916 98087 20282 -32406 -35598 -10882 -20104 -108100 -73242
21918 -73242 -27252 37960 -19620 -6116 43948 35248 12224 38258 60303 117257 130573 78665
21906 78665 10655 -42667 -64172 -81301 -53147 -3857 -51246 -13905 40821 35257 28099 -34621
21894 -34621 -62321 -71001 -35192 99240 127459 94985 43673 61204 78879 94881 117726 77114
21882 77114 88825 -5841 -25076 -6355 11269 -4122 33217 42567 101276 60520 65838 141215
21870 141215 213112 157633 61721 54461 91859 115565 90867 87959 136021 142435 69280 11264
21858 11264 -71918 -77180 -161499 -201781 -144337 -125370 -23608 -15545 -14771 -102823 -58874 -28297
21846 -28297 -7206 160212 211441 23270 83397 116095 -22696 -79638 -33780 -22739 -70724
21835 -70724 -40948 -79688 -126762 -93087 -70706 -25762 28730 16968 -89439 -137016 -117344
21824 -117344 -156055 -56170 -10936 -30613 -87574 -120453 -154915 -108688 -79286 -35141 51219
21813 51219 121945 46567 68608 181166 165598 95059 19556 -67171 -15635 22259 -22202
21802 -22202 -73400 -51919 -84992 -187847 -182475 -80341 -56887 -93711 -82628 -109956 -170334
21791 -170334 -134764 -66791 -77919 -98566 -188678 -186922 -220239 -216821 -234731 -322916 -343186 -254028
21779 -254028 -139225 -108704 -131191 -55390 -57964 -127346 -44813 61496 61107 45305 54010 37407
21767 37407 19691 88609 201843 219884 53004 -89299 -112969 -111691 -139787 -55414 -1008
21756 -1008 -61925 -79932 -118738 -154664 -67943 -32535 -53612 -100183 -111389 -102126 -89966 -128313
21744 -128313 -55157 -49522 -60751 -98647 -136754 -223361 -106071 29934 112061 106407 77380
21733 77380 57779 7838 -47146 -69562 33175 133774 -1350 30912 134674 146079 37043
21722 37043 -47124 45885 57725 -38713 -181454 -231726 -150667 -113312 -91941 -105048 -169055
21711 -169055 -96511 65964 -4194 77605 159356 132226 60655 35786 13990 -6088 18632
21700 18632 -78519 -39108 95850 110279 75091 37710 -12663 97651 80926 -43431 -111513
21689 -111513 -70240 946 1711 -87996 -52085 -34669 404 -52228 -16660 -23047 538 108322
21677 108322 67617 20331 27540 48949 60286 46453 98796 90064 135942 108385 13188 -13709
21665 -13709 -15765 -57211 -110965 -179674 -122055 -134 -53413 -159778 -177189 -145581 -43337
21654 -43337 -6126 -117981 -41837 -8658 5542 9540 -31981 26476 86117 -7171 -54199 -22888
21642 -22888 -24305 31390 59292 -1062 -76811 -220197 -140167 7063 51997 -15662 -32550
21631 -32550 -28217 -55551 -74873 -136592 -154359 -110533 -122073 -90456 -51143 -28537 496 -36032
21619 -36032 -60027 -771 54511 168 83900 50992 5696 12742 41724 84042 20806 85230
21607 85230 43651 72256 24390 -42949 -30048 -28038 4636 31016 5215 47970 21528 16525
21595 16525 -39621 -100004 -66964 -28851 -36313 -112102 -51465 -15986 -11434 -6660 -9104 -54529
21583 -54529 -119339 -140277 -60441 -12593 -77481 -26108 -773 39813 -11675 -130287 -80613
21572 -80613 -30771 -18650 -84166 -104235 -75167 40526 170703 114678 73372 858 -62616
21561 -62616 -98096 4464 38371 56786 95629 66752 44962 60332 35185 39689 41218 34074
21549 34074 116308 176237 99812 136378 154504 126197 66370 78608 149894 131220 115718 93184
21537 93184 162291 110854 -83724 -219907 -248712 -163711 -111080 -60994 -113697 -82614 -40438
21526 -40438 50177 79862 -4920 -3610 -45404 -48308 136064 208738 148390 109283 136672 139957
21514 139957 155630 83416 27853 34785 14750 50685 19242 -129684 -200122 -158716 -122033
21503 -122033 -20134 98813 157971 132175 65610 -62481 -48615 -29734 6122 -56626 -109105
21492 -109105 -103943 6109 23606 -15876 -70252 -75369 -72635 4515 23286 -14189 50242 156815
21480 156815 103755 38314 -22147 -44266 8781 87548 156701 133052 54930 159291 108451
21469 108451 -11010 -116106 -42899 16200 -34647 -84050 -61269 64560 121612 154672 162217
21458 162217 115991 95865 103220 138895 203270 248589 215000 189162 195350 120996 79784 -553
21446 -553 -24767 -75524 -134697 -147802 -104874 -68730 -32729 23625 29093 4237 33934 91302
21434 91302 163924 6000 -82707 -36451 64831 27434 -21099 42646 72512 3924 -25604
21423 -25604 -1879 -6862 28555 23302 -106157 -98150 -61983 11004 4985 -24220 43098 41266
21411 41266 72299 108062 104422 105217 158282 126471 -9570 -10508 -6534 -17949 -898 -39999 -50346
21398 -50346 -41033 -4305 -84824 -57976 5922 -29978 -57495 8003 32613 -37361 9533 -18233
21386 -18233 -105680 -31578 34382 51057 5933 -99480 -192804 -272054 -224227 -87183 -111017
21375 -111017 -57928 -47367 -112301 -43388 -34220 -79695 -37100 -43541 -66610 -74054 94 -4777
21363 -4777 -79644 -108016 21598 -39133 -101478 -85429 -42062 -73512 -135896 -130305 2945 22848
21351 22848 69478 49286 12611 3277 32511 111846 74450 1517 -38637 -29187 -15959 74871
21339 74871 142572 62271 52836 135945 178711 103761 54597 30509 13271 2600 -6438 -41523
21327 -41523 -99530 -116032 -62458 -37771 4924 -83558 -162291 -39753 -45270 -38884 67021 48665
21315 48665 22343 70403 -439 26819 62543 129989 152848 112173 38158 -15583 -10439 -74300
21303 -74300 -90931 -105239 -85621 -67907 -24160 18527 73831 133133 134119 176035 57739 -10051
21291 -10051 25354 -111607 -125524 81541 160874 104643 183915 233022 189818 121707 157271
21280 157271 228980 145017 10652 -89638 -126463 -121206 -153966 -153414 -128159 -81924 -53242 951
21268 951 -21264 -80040 -208355 -168779 -66019 120302 183730 81572 37421 -24301 -79903
21257 -79903 -43561 12336 20709 26963 44904 -37648 -90638 -152940 -91790 -24814 -45642 -82845
21245 -82845 -129287 -27969 13057 -58540 -101515 -116519 -61560 -74692 -64731 -128778 -169756 -75443
21233 -75443 78746 93102 52211 -48426 -10437 33577 -409 -23143 -63672 -20350 -1358
21222 -1358 -74503 -140085 -82914 -70467 -94137 -65899 -91155 -48516 12168 66541 4100 -6688
21210 -6688 -37939 -23296 32134 36269 -8860 6126 -24785 -66392 -199891 -109405 8107 -23269
21198 -23269 -102187 -27349 -48866 21956 -4485 27024 161765 169346 139447 35799 135614
21187 135614 116657 188947 141980 148669 72261 101880 112061 65953 16258 -33657 57742 220860
21175 220860 147900 115663 -16323 -84675 -89558 -118191 -64530 -83008 -7469 40925 12654
21164 12654 -17589 6207 67191 89510 47249 -7077 -1025 53395 140170 107759 35260 13855
21152 13855 98603 56740 18395 -18514 49306 134170 70955 18275 19 42846 50211 -43094
21140 -43094 7006 -183 47862 77699 47216 70146 63001 89305 117017 149493 73369 -40327
21128 -40327 -115201 -20390 30216 -48182 -62328 -150043 -147316 -118128 -75712 -35055 4399 72319
21116 72319 91126 127949 187513 251605 247957 55037 -4332 84892 133760 103184 76920 14028
21104 14028 4893 21436 119348 97539 21749 77823 51257 -47156 2835 61593 2875 -14928
21092 -14928 42150 -30358 -86219 -5917 6705 13905 -58585 -146814 -80313 -12211 30263 -67617
21080 -67617 -110888 -116730 -85751 -83335 16230 4291 -32138 63475 97270 104489 8052 13393
21068 13393 46289 72528 109091 158288 122673 177484 190886 117702 86871 84181 89123 49052
21056 49052 -65304 -117626 -119834 -141708 -150942 -51351 50702 13176 -5575 -17810 35752 -30825
21044 -30825 -102666 -77497 -82983 5911 132283 53711 -50082 -100103 23159 120746 155170
21033 155170 111171 122017 110271 40607 109931 27711 -30088 -88369 -74208 -43841 -75380
21022 -75380 -118943 -43884 -22650 -48863 -78981 -92299 -26715 53191 -4380 14145 46942 158497
21010 158497 194824 198757 244212 206039 154965 127123 102643 116160 100116 58062 8285 58027
20998 58027 89418 127653 146997 148419 155644 67527 77789 56436 -61 37259 54737 104479
20986 104479 181051 198090 163716 146242 161727 174280 134919 165593 138109 147442 179936 164475
20974 164475 61944 66153 35741 10103 -34053 -1779 19606 -32131 -11665 9117 94409
20963 94409 -6514 11453 83866 -12227 2937 58264 67744 24087 -69929 -47716 -70070 -56115
20951 -56115 26188 2480 -49486 -7908 79771 -24038 -112114 -74951 -14370 -76057 -69747 -42527
20939 -42527 84291 86265 82051 88995 72419 44207 -34879 -26048 -144462 -92087 -27530 -9149
20927 -9149 -52438 -49045 -87875 -219816 -239202 -268694 -330442 -222524 -34428 -65057 -97071
20916 -97071 -104370 1001 6173 -26597 -2144 -26921 -4736 22672 -64673 -5910 4503 -58983
20904 -58983 -130406 -123927 -78557 -53140 -61012 -85595 59587 145123 143076 79998 101572 70991
20892 70991 52325 -38857 10157 65515 90542 95246 121774 46390 8551 -49122 51854 68692
20880 68692 54500 75354 106920 19824 5131 77142 -21646 -24143 -25371 -6252 38863 -5479
20868 -5479 -15149 752 7979 -422 4835 10750 -4367 39250 106633 139738 160662 225039 203505
20855 203505 18671 -4897 23034 -73717 -87961 -56712 81072 118048 79952 65162 47923
20844 47923 50 -30802 -13202 17691 115467 171244 258808 193318 219092 211450 108827 122254
20832 122254 142283 80491 73419 154168 114851 156297 184824 161912 109658 49853 -3240 13527
20820 13527 -49449 -88556 9998 122930 -2934 5299 -16498 -42163 -59396 -1369 86667
20809 86667 140468 58414 47922 105116 189984 108050 17698 46739 114933 62482 -108204
20798 -108204 -149093 -146747 -104968 -41834 -158872 -123572 -19246 -15482 -40079 -56918 71971
20787 71971 181517 233234 154893 99562 72316 70078 -36415 -125712 -275670 -246072 -76119
20776 -76119 -41226 -89802 -133341 -39815 83612 79753 75395 41763 -25228 -95372 -122042 -196740
20764 -196740 -135222 -55702 -42214 -103842 -150896 -59528 9198 -68284 28367 93604 -7672
20753 -7672 -11027 -9736 3905 39292 88037 89349 -18098 -141792 -186308 -167914 -182642 -146514
20741 -146514 -133163 -114959 -22706 41070 136790 168677 107029 87814 54314 93995 25702
20730 25702 -24008 -69367 -110358 -32716 46084 54771 60994 -5088 -5003 -62122 -50904 16107 23631
20717 23631 -47555 -63732 -95853 -107966 -153871 -45627 30101 34179 -23611 -73623 -95231 -144449
20705 -144449 -215504 -190480 -128308 45705 117017 76211 61986 -76 -46222 -75214 -86669
20694 -86669 -37879 8462 -28997 21829 83539 150698 262103 227471 212891 217074 179792 114540
20682 114540 10770 19881 -63 -27647 -2456 -2965 -1410 -19565 -93093 -140064 -178150 -35405
20670 -35405 46415 -42116 -62956 -114960 -168104 -108358 -85900 11229 -59661 -98673 -100367 -207145
20658 -207145 -134895 -93111 36188 99625 79317 102122 97892 64419 -68037 -69579 -30804
20647 -30804 -19311 -41377 -104891 -39477 70312 43710 33296 -9166 4430 61259 105948
20636 105948 60103 85451 70813 -1193 -114001 -95512 -85516 -53906 10313 66595 130912
20625 130912 259161 157610 39673 -115902 -87669 -23908 69219 68537 -14645 -681 80900
20614 80900 53382 -7747 17095 64062 39396 3666 31139 -26694 -65465 6487 -1103 40192
20602 40192 44445 1892 -19263 -53716 -57517 -3702 -8075 -53883 -158198 -20775 -24796 16172
20590 16172 78756 133561 124390 87421 93045 89058 -5624 -17848 24524 46236 12361 -49285
20578 -49285 -84862 11666 100227 83971 79416 106511 21351 10575 -39071 -896 59609 98080
20566 98080 135083 105297 18127 15108 135175 16537 -137598 -120655 -33413 -36306 -33961 -28614
20554 -28614 -23222 50336 65676 -46927 -105039 -30861 -32856 -80267 -168622 -152232 -75881 -51857
20542 -51857 -17405 79689 109625 36478 -18152 10231 27132 -93719 -143359 -27401 11299
20531 11299 -69009 -117332 -184408 -162602 -90611 2686 6880 61317 54021 5167 -37581 -10892
20519 -10892 -73807 -15672 15939 -79587 -93304 12854 3343 -10373 -15132 83657 103639 58292
20507 58292 39404 -59654 -51692 24838 47504 37392 78377 37051 73079 131277 199160 114836
20495 114836 59421 -76530 -37132 98507 161249 147055 95879 31497 -2334 -26883 27874
20484 27874 -41741 -65617 15408 34061 -7833 -96683 -90622 -34104 -100687 -91752 10995 34727
20472 34727 44135 94699 49963 62194 18593 87620 93308 18844 21113 116681 122654 134375
20460 134375 161714 154827 107305 54655 56380 139426 201602 248053 201627 177582 135309 75344
20448 75344 59465 -11444 -9540 -20676 -47022 -84997 -87948 -65106 -26538 -30492 -79428 -83345
20436 -83345 -91906 -57645 48019 20321 34801 69713 50316 87349 -1268 -60328 -117487 -145956
20424 -145956 -152745 -148935 -113727 -82071 -102664 -36031 156050 286806 250633 218282 269219
20413 269219 235547 119162 10681 -31271 -23467 55608 33756 -18345 -51791 29706 44313
20402 44313 4953 -62509 -25428 56597 50492 30349 40284 53678 110225 102387 22575 -13240
20390 -13240 -10494 -65780 -28706 18896 -73784 -80986 10820 40307 118129 122322 168641 140447
20378 140447 131549 128223 67663 -9037 11085 53796 111965 99551 181414 177124 147023 200611
20366 200611 195451 174842 125461 122697 -31717 -78823 -53764 63405 118825 109513 -21958
20355 -21958 -8445 40923 79618 91643 124701 120933 136507 102803 -14796 59768 36161 5326
20343 5326 -43371 -94425 -51146 73187 122540 -26430 -86488 -97261 -140271 -106005 -3312
20332 -3312 -37974 -83907 -78956 14107 64383 89832 44131 124088 139645 37652 -59705 -85429
20320 -85429 -138805 -51243 134243 165092 147222 31953 -17624 -58626 -55452 -75474 17070
20309 17070 77959 73266 91464 34834 -101580 -106255 -187543 -141704 -81735 -41511 -73297 -78532
20297 -78532 -16374 23148 -26761 2130 -19824 -25849 22518 99731 21959 -101177 -115560 -119641
20285 -119641 -105594 -78002 -76950 -198936 -88537 -81496 -73332 23001 103968 69954 127576 172143
20273 172143 49186 50311 114919 150175 217992 128560 108694 167909 127960 15269 41881
20262 41881 113329 137161 157030 106538 2397 -30284 -38841 -17803 13737 -8590 -24116 19988
20250 19988 -19955 45599 138402 68294 72646 59905 17571 40557 -45622 -119524 -50448 37202
20238 37202 55365 -11099 -20996 -15054 -3361 -29443 29244 -14821 -66703 19281 -13904 -102191
20226 -102191 -13061 119249 83149 51577 153958 267040 208105 49300 -4199 -59204 -51377
20215 -51377 -10620 32736 30509 -29268 -55152 41060 82713 109138 161318 108928 13434 -1868
20203 -1868 -144 -12672 12842 31393 79589 207877 176920 80342 68717 45024 130215 121721
20191 121721 35119 -24563 -9564 69796 113474 105929 -6664 -24873 -43893 -16600 40501
20180 40501 87315 -17227 -31814 -50306 -69230 -62954 -37986 -130518 -115219 -68690 -5707 97852
20168 97852 250591 237117 176737 64289 -27386 -28866 -5007 22850 11031 -38676 -9618
20157 -9618 55319 110099 90836 18788 7667 -33502 -1414 -32677 -3724 101877 43775 32884
20145 32884 50526 -33050 -16182 -9212 -8421 30355 -5829 -76978 -71573 -45676 38247 76481
20133 76481 61782 79983 152837 204975 169547 112777 187903 159764 34755 -62127 -138991
20122 -138991 -113123 -45301 -26328 65696 2884 89211 148492 206208 184656 60484 36768
20111 36768 133981 192132 122160 98318 150589 134717 -2056 -56292 -25428 38362 77526
20100 77526 122224 168229 75836 48727 -2062 36860 61670 108284 199712 145203 -18340
20089 -18340 -57196 -11224 -47258 52307 228883 254790 212593 187274 126050 73108 162851
20078 162851 51986 -35317 -33188 -35672 -39434 -3547 4942 14722 -19506 -37149 -22687 -78737
20066 -78737 -89003 -67914 -16734 396 -45770 38951 65866 7723 26489 116610 196130 219879
20054 219879 195328 131026 82806 105329 193681 259651 337445 391985 431989 640114 786767
20043 786767 835864 885223 982897 980934 875194 664518 435430 343325 349887 320297 222969
20032 222969 125791 42888 77101 142265 145458 164151 149401 158518 130092 154729 174576 157732
20020 157732 205877 202071 235884 259874 302671 279905 230109 134184 65934 16664 145554
20009 145554 301760 306634 269288 192526 42664 56333 109707 168935 199170 126317 149420
19998 149420 168048 247131 307526 252995 228172 244785 232897 197153 184247 108333 113149 128910
19986 128910 66079 57740 99805 224027 200851 81464 -3739 -25619 51250 69220 103838
19975 103838 49765 -102391 -205163 -117258 21639 77938 92467 93401 59591 97902 121314
19964 121314 143881 121684 130926 99545 -31999 35417 62515 142226 220020 298186 224114
19953 224114 168883 107491 36506 71875 88481 83014 90054 74569 96051 83748 65566 53479
19941 53479 51786 56869 71380 163709 148147 116953 87043 42079 15649 131760 157749 172985
19929 172985 176164 133306 99168 160204 164601 204606 215516 168424 111554 134011 173970 264218
19917 264218 436702 610649 760327 791685 615364 477189 412445 378481 329396 276574
19907 276574 251849 222755 110523 132595 232237 186120 107516 110216 269867 133025 -84937
19896 -84937 -82023 -65681 -5006 64449 54060 70988 30115 46158 99513 139162 72435 68156
19884 68156 80578 71152 56508 101945 166333 208874 129397 -35812 -136833 -137498 -120582 -44493
19872 -44493 -16891 49302 49325 132246 116094 10559 26415 84670 146238 192949 264648 343763
19860 343763 306460 234856 161200 114146 136398 197517 291218 199035 143127 170300 158207
19849 158207 12276 23557 -13524 22975 118820 193603 333626 350552 274361 204353 236446
19838 236446 236587 292815 217077 209131 202543 237882 314004 247714 120004 139350 133234 94945
19826 94945 80303 7015 93194 162624 212979 177758 98096 121873 79042 49109 59555 124658
19814 124658 191573 190747 202310 195753 245231 131985 147742 105511 73611 102994 187659 115381
19802 115381 13273 -16324 12018 48189 81601 62400 149445 262072 172129 112284 -1158
19791 -1158 45802 105401 168915 254316 333577 276339 291212 389216 351351 284144 294646 322690
19779 322690 337345 399151 293716 282962 242673 176970 147494 12885 -50845 10368 41621
19768 41621 26081 35394 130401 112334 -963 -10546 39376 30547 -5822 16947 4057 21530
19756 21530 -14676 -15143 -2899 38235 128216 129723 87491 81897 38276 29119 86499 126658 111141
19743 111141 93254 28073 56299 38992 88438 165593 229295 281610 202775 183100 184289 172990
19731 172990 209083 240093 309441 231193 136609 134451 240145 224406 167191 161599 87973 33177
19719 33177 -87660 -73201 12904 142023 217453 244619 205392 157100 106298 -12055 22142
19708 22142 -63980 -60291 -38154 21558 124857 136628 170756 262671 265448 232810 198556 126166
19696 126166 83388 -20949 82298 183940 64707 -112237 -65980 44777 110994 149525
19686 149525 209638 182380 118192 37158 2621 103254 143840 126620 183164 171190 130692
19675 130692 121175 69784 52643 178414 96108 7495 57473 96311 206436 283584 293005
19664 293005 188226 149206 275352 305861 224338 152700 134936 3984 -9763 66945 76422
19653 76422 47479 120176 255086 289637 150933 75397 41837 31291 96929 122456 116307
19642 116307 212586 243484 98205 -37834 -33561 -58482 -85516 -53187 86669 182773 129368
19631 129368 73085 76801 150927 158513 73444 90134 95483 171184 299129 269702 160638 200601
19619 200601 217558 115572 137736 135945 101773 155624 124501 139754 159477 175892 268524
19608 268524 249631 244315 176043 137073 133680 206089 304209 237282 162086 218898 272271 283437
19596 283437 215502 92981 82333 110269 132527 140445 60925 34144 83149 111003 125678
19585 125678 170852 198284 186742 195125 154193 158962 206187 131697 109774 111229 232934 300419
19573 300419 257319 223462 229752 189042 123606 76839 47910 25048 24323 52737 133163 114353
19561 114353 95657 94803 95748 174516 160194 112528 38564 51409 2192 87267 195477 282145
19549 282145 342762 310436 280725 285545 288434 182557 158946 209345 277393 236887 158186 112491
19537 112491 110614 167873 250370 267924 78919 -18697 -21437 78835 108197 89045 110516
19526 110516 173736 185276 157541 99610 97068 106532 96453 63274 66983 88240 36710 1892
19514 1892 65618 168545 175084 111729 78415 60221 68896 87426 170310 216212 104692 79300
19502 79300 201297 248037 196994 190906 144030 174390 229362 210117 116229 89775 66422 -8459
19490 -8459 -44109 63266 116398 129666 87275 177052 159380 177239 216541 160060 119228 46354
19478 46354 116694 197530 192592 233227 256523 201341 151111 100498 115208 310777 313416 321886
19466 321886 318148 275454 289514 317412 227675 220779 257251 284091 231140 244589 331746 352053
19454 352053 283634 267478 220173 301422 291533 284423 186028 270604 310132 244154 222933 225993
19442 225993 247475 221716 237700 241732 302153 215215 178231 80241 95328 106391 94972 151894
19430 151894 171763 139923 149144 260111 286268 248755 334638 473367 520311 386622 361769
19419 361769 348772 354659 253387 176575 180998 177021 206562 240444 264705 327679 367401 372358
19407 372358 417861 481415 401832 445011 440141 347938 361798 385750 362130 282327 256146 209186
19395 209186 227995 194652 118797 130502 134191 241903 313520 269223 228728 227442 245942 281295
19383 281295 216083 237706 221465 210135 178065 171456 251959 307183 329806 330191 276986 156090
19371 156090 158498 178512 235608 330092 356191 360588 358608 414836 431840 402445 339411 301892
19359 301892 278576 181988 217257 274847 242862 250735 302871 311822 218510 263961 250057 229397
19347 229397 250293 339555 380285 411973 374589 372406 335037 363273 385233 364967 306954 266193
19335 266193 226972 272201 338861 418781 386605 445665 435756 334134 305520 296669 315241 374208
19323 374208 328501 253560 239327 236312 206273 194110 256910 290622 214497 222938 222464 236730
19311 236730 263484 273245 263099 323288 273130 300503 295782 252689 301390 415018 487674 384272
19299 384272 393220 414756 483878 288006 120004 160700 221927 225879 218226 132620 100458 220035
19287 220035 348622 413531 409596 393216 337061 376548 433074 437575 347766 285871 352380 401700
19275 401700 308579 232288 257011 273055 243577 177078 212749 188508 206142 233900 252391
19264 252391 324283 331911 387919 438992 434598 476032 521060 433493 326064 267123 305454 271525
19252 271525 299482 231466 215902 231726 186930 219910 308760 292094 260010 278663 227619
19241 227619 265682 334446 343259 314545 387828 383995 321913 362418 291463 195859 164346 271523
19229 271523 242129 206700 134580 49923 22483 220203 370512 287928 231922 202727 309682
19218 309682 302194 291020 354286 254156 304687 334221 212970 226234 229693 179937 199474
19207 199474 196587 292280 393316 393628 318428 192819 275369 384551 400782 355068 342877
19196 342877 243322 210053 277702 258858 169522 129115 209249 239400 214557 288877 374434
19185 374434 424229 389856 360388 298017 290792 331259 351936 300593 289827 384609 347427 345716
19173 345716 389845 430062 375406 350275 329071 245213 196792 236315 299318 361405 358202 330445
19161 330445 302750 397360 451595 336236 296157 381400 456189 476302 410520 427280 498785
19150 498785 588227 605488 509205 513129 515625 471923 530165 553857 651748 690850 639481 593094
19138 593094 455387 387350 485023 642317 720676 797003 792755 840356 890041 806296 687139
19127 687139 641181 589228 610626 684793 693761 653347 558648 546706 592357 598998 707563 746691
19115 746691 764977 703538 668464 597539 654667 675453 646880 687434 753859 632027 572265
19104 572265 526752 525280 571509 624344 678531 833041 845830 861438 896942 905201 772734
19093 772734 617857 599275 641752 628929 681566 643179 668066 747731 698665 624420 639522
19082 639522 659536 680638 615938 573885 561002 494273 645588 758899 851797 904137 946442
19071 946442 899313 825875 733358 722985 749228 767659 726480 685942 608256 607446 652999 649923
19059 649923 753038 732392 702363 644119 559152 581290 734211 688492 699167 734201 729160
19048 729160 607840 462277 478775 621649 646077 660931 687473 641260 679095 654816 657990
19037 657990 729964 734790 715158 611003 677840 745421 778806 765627 748497 718405 703304
19026 703304 688760 705348 777087 765891 711032 661646 694125 703961 767645 771146 836148 727937
19014 727937 725452 752053 775655 806444 650487 483053 517309 576853 506403 531500 501312
19003 501312 554368 673169 637535 535571 515785 410582 378560 420322 487264 507509 535799
18992 535799 548996 571360 545017 557179 610319 515243 331695 290953 281853 406246 479536
18981 479536 498788 530430 511398 569398 546667 372308 373239 438707 421876 469394 444791 382898
18969 382898 417263 468269 558089 665632 650206 684953 715258 645855 583585 585458 641931
18958 641931 617531 678472 701937 764769 670916 459415 434676 521849 559830 647456 632306
18947 632306 611833 562021 558082 585913 596768 556266 564910 622847 619742 691120 665025 644956
18935 644956 668763 598925 536559 521288 704428 679308 744079 744379 683913 725333 719380 744307
18923 744307 801139 711780 673509 648445 758327 679911 695958 676371 596141 591370 623669
18912 623669 622425 661676 679201 698264 654740 594580 642421 709903 763156 885441 949439
18901 949439 971494 915037 845949 798217 751660 787562 761679 758746 727626 743757 766965 827150
18889 827150 883535 912875 906990 872489 843996 862919 924121 924696 836607 748649 735253 759225
18877 759225 792036 715724 720045 703710 783737 892177 854718 814329 811294 966825 1094738
18866 1094738 1048701 1096852 1118731 1099056 1179058 1234956 1187250 1173772 1217160 1062468 997191
18855 997191 989416 964510 970572 924231 941033 1007591 1036363 986431 936020 988910 1156063 1217885
18843 1217885 1180056 1148094 1068625 1013280 1001861 1079286 1118841 1084319 953627 981541 1066448
18832 1066448 1065483 959613 1032702 1029579 1083720 1138997 1249783 1304088 1361965 1487300 1418757
18821 1418757 1273214 1170991 1177670 1214447 1108389 1124900 1153907 1292608 1446092 1444093 1466174
18810 1466174 1419004 1418336 1329954 1390380 1408337 1376086 1392465 1361326 1366717 1347837 1301136 1318373
18798 1318373 1428864 1481127 1281270 1143548 1176755 1111794 1070027 1064948 1081775 1161778 1281315
18787 1281315 1370622 1406918 1475237 1421407 1358119 1373736 1347466 1334124 1419412 1458920 1437671
18776 1437671 1493902 1553416 1553038 1473328 1493678 1635964 1796470 2004046 2164828 2330086 2532814
18765 2532814 2629237 2423188 2177416 1974412 1912483 1923828 1913501 1926835 1925361 1776478 1540747
18754 1540747 1472388 1528624 1560661 1554827 1646302 1692617 1723320 1731546 1716098 1732937 1722363 1688436
18742 1688436 1657323 1661280 1681111 1681628 1750881 1718214 1568643 1581199 1660880 1655963 1624785 1672280
18730 1672280 1643784 1653276 1801876 1911276 1989588 2052727 2029786 2030215 2006764 1979988 1966589
18719 1966589 2042656 2149142 2197610 2133190 2135352 2128870 2110870 2134117 2230154 2288876 2433185
18708 2433185 2524282 2609701 2595677 2622303 2616100 2635149 2728917 2772509 2778019 2795156 2865890 2804969
18696 2804969 2764456 2653605 2580702 2564376 2574913 2510198 2520175 2568106 2590710 2648733 2909314
18685 2909314 3203370 3412984 3658561 3891530 4151904 4251980 4278379 4363734 4375593 4472516
18675 4472516 4658356 4895975 5256890 5742728 6287558 6856051 7677319 8742835 10176918
18666 10176918 11964010 13880805 15553822 16775888 17992270 19763582 22647675 27435647
18658 27435647 34467469 43277537 51635691 56096872 55400338 50690461 44327109 38526167
18650 38526167 34855590 33666782 34595130 37015043 40405229 44466056 48609924 51581919
18642 51581919 52033876 50554810 48594091 47064072 45625774 43133160 39306160 34973096
18634 34973096 31456559 29547453 29153745 29751405 30189239 29680574 28081424 25954409 24126448
18625 24126448 23333638 23647626 25108434 27768040 30980167 33542963 34960152 35761690
18617 35761690 37203710 39734500 42219323 43331221 42944463 42407620 43317464 45812436
18609 45812436 49410233 53552424 58993300 66964929 76252816 81972169 80019010 71895557
18601 71895557 62116778 54804090 51807875 53111252 58590493 67386069 76038164 79043350
18593 79043350 74076681 63313208 50972727 40331971 32405830 26681398 22716922 19938547
18585 19938547 17984099 16575514 15529310 14925450 14718613 14802666 15147832 15819402 16640524
18576 16640524 17091806 16862266 15862251 14307874 12858444 11652560 10723531 10096321 9664794
18567 9664794 9261857 8825511 8324022 7924392 7763336 7570769 7417832 7375217 7271041 7087999
18557 7087999 6981091 6893091 6773645 6429921 6111649 5877465 5733764 5728081 5753260 5840742
18547 5840742 5896607 5757273 5597249 5526235 5404971 5209372 4902193 4769388 4626987 4403805
18537 4403805 4183762 4119872 3957755 3750463 3623766 3532709 3540722 3536421 3476037 3339988 3267986
18526 3267986 3255552 3258580 3181410 3015061 2972377 2925240 2830788 2747898 2676704 2668890 2627482
18515 2627482 2578031 2568309 2522489 2437690 2247650 2110833 2056853 2014802 2042905 1970835 1979980
18504 1979980 1915025 1871594 1900013 1897307 1768369 1768493 1873944 1885579 1936888 1913949 1864143
18493 1864143 1925638 1926580 1964222 2000886 1879806 1930084 1957114 1893922 1813441 1843738 1774327
18482 1774327 1661011 1620211 1688236 1718551 1711616 1804860 1746170 1642140 1579737 1488628 1456592
18471 1456592 1522164 1669803 1655151 1502076 1428581 1370819 1391161 1426555 1483821 1556716 1606210
18460 1606210 1614044 1557906 1610857 1589435 1598097 1602942 1532652 1531784 1532833 1573165 1561454 1531818
18448 1531818 1661283 1750527 1876502 1932208 1943059 1948290 2048740 2118657 2071362 1987729 1988542
18437 1988542 2036741 2029330 1957728 1905124 1988830 2101851 2219249 2314280 2344902 2391833 2532717
18426 2532717 2510300 2301632 2268552 2221861 2175879 2204619 2154088 2161583 2305714 2363342 2354298
18415 2354298 2510743 2575638 2727336 2827797 2873517 3008908 3065667 3199787 3292732 3331720
18405 3331720 3343013 3414934 3314432 3201873 3140240 3135178 3219669 3234637 3354313 3486448 3536437
18394 3536437 3612538 3807007 4012966 4181155 4317570 4557761 4803680 5132947 5759791 6578009
18384 6578009 7604411 9094584 11270740 13818096 16184727 17468413 17117115 15609241
18376 15609241 13623599 12004178 10940029 10525956 10639718 11346241 12380567 13083899 13228259
18367 13228259 12911051 12452010 12504321 13374102 14798766 16545122 18302662 20202618 22439640
18358 22439640 24426987 24974637 23571893 20833115 18118781 16154628 15103893 14880409
18350 14880409 15210533 16264838 17971694 19748854 20840098 21063989 20597923 19739985 18547328
18341 18547328 17257299 16265307 15784981 15790542 16144372 16704056 17633623 19125274 21289192
18332 21289192 24549956 29428521 36259168 45451396 56338384 66249329 72405685 75022786
18324 75022786 76413646 78193876 79089744 77381780 72582699 65651104 58660962 52406906
18316 52406906 47457020 44366288 43248463 43684174 44147040 43065383 40259289 36667494
18308 36667494 33144795 30165537 27767223 25909183 24779023 24516292 25291143 27095824
18300 27095824 29914959 33987779 39133874 44603118 49617032 53655074 55742557 55796451
18292 55796451 55390152 56346523 59005461 61896074 63774724 65101653 67551072 72848900
18284 72848900 81466473 92078233 102330392 110110378 113511095 113274563 112459111 112625457
18276 112625457 111608040 106241949 95828864 83505036 73042326 66396607 62973292
18269 62973292 59991142 55600093 50172433 45155217 41378444 38295305 35233801 32018148
18261 32018148 29084704 27043602 25799807 24957387 24050549 22992165 21841226 21176450
18253 21176450 21053859 21566890 22914483 24896731 27221185 29069936 29703051 28857756 26860654
18244 26860654 24491813 22429538 21046122 20711684 21163407 22361495 23189822 22759115 21001932
18235 21001932 18582641 16180675 14391368 13173751 12185666 11250709 10359957 9569615 8830472
18226 8830472 8213015 7791544 7397414 7077831 6869163 6519903 6260963 5998269 5837485
18217 5837485 5728632 5602774 5413493 5343679 5415320 5560851 5911702 6282458 6844197 7554814
18207 7554814 8111966 8249764 7804366 7123958 6463665 5911491 5691432 5833229 6073362
18198 6073362 6564035 7086560 7317449 7008097 6378046 5636124 4962992 4474839 4356692
18189 4356692 4237132 4136404 4100513 3948513 3614477 3278117 2940610 2679504 2520313 2381791
18179 2381791 2248466 2069276 2069709 2049521 2127416 2069489 1922519 2074793 2160078 1999618 1921349
18168 1921349 1893425 1842535 1793726 1743423 1806327 1876552 1837531 1845572 1869488 1856593 1890194
18157 1890194 1886186 1948443 2041005 2073201 2074037 2081070 2099816 2103844 2125913 2137329 2035660 1986270
18145 1986270 1892658 1830755 1897228 1947723 2055923 2081732 2088423 2282084 2389479 2447008 2556754
18134 2556754 2581059 2693030 2752464 2796299 2867325 3002095 3105465 3345925 3642368 3791755
18124 3791755 4048872 4591334 5189596 5785039 6609267 7786037 9255590 11358237 14048922
18115 14048922 17885639 23294082 31156380 42591747 59520447 84578361 118455815
18108 118455815 148993044 154699625 133924962 100529460 69974513 49060888 35750765
18101 35750765 27224171 21506657 17502565 14660893 12726800 11154678 10023829 9175613
18093 9175613 8509779 8027642 7439400 6967879 6677712 6374065 6043877 5777870 5665878
18084 5665878 5565433 5541295 5281636 5024646 4963823 4858812 4870058 4860623 4944627 4947357 4982054
18073 4982054 4960624 4978853 5069563 5056267 4971505 4779475 4491360 4219599 3908879 3602495
18063 3602495 3358993 3222199 3172991 3007559 2832740 2706223 2572586 2472393 2326765 2153581
18053 2153581 1972533 1860066 1882344 1797756 1731431 1696688 1592668 1574491 1500335 1346407
18043 1346407 1279426 1293720 1210173 1046467 954077 961075 1002824 1054592 1080987 986332 918946
18032 918946 853064 784882 850770 765208 761000 779844 808753 717526 660495 688033 699066 675538
18020 675538 615632 540742 473213 440075 421416 368951 359683 393912 414861 363220 269869 316284
18008 316284 395979 398405 327128 270029 184617 289208 349787 384722 293119 366788 267317
17997 267317 153888 169681 207062 173229 134483 224740 285194 328851 328527 360557 388795 374423
17985 374423 468285 594173 584738 590752 613750 554810 450308 231748 75930 81396 63001
17974 63001 4167 122141 171745 209022 330488 291593 248346 240081 176478 66791 8094
17963 8094 55594 157940 240637 385539 402611 316670 247794 66378 98597 126435 50151
17952 50151 67495 152998 121973 120299 96526 130618 161254 167913 227868 187162 182314 207057
17940 207057 171278 183921 202350 119073 86929 48011 45699 124556 173092 133686 196065 235932
17928 235932 189022 204944 184177 77025 22432 113089 119324 209113 226431 207960 234396
17917 234396 257147 298604 380571 443066 308098 209643 278083 170944 140748 127069 159186
17906 159186 262163 263820 237952 236654 206605 173313 168051 297922 395841 355765 266256 324964
17894 324964 300613 209263 210624 219474 183511 169536 158004 153369 325346 434909 346506 273495
17882 273495 346970 385077 325366 278087 215781 301191 379787 313930 282333 212824 200475
17871 200475 128292 185541 237287 302622 367208 391546 509079 585572 602075 736040 968813
17860 968813 1051209 1073955 947150 772085 624812 558980 625464 632294 496644 366202 292863
17849 292863 263773 284406 371602 396655 358887 230552 201604 268899 285339 286897 243999
17838 243999 147281 -25816 -42347 170550 339430 401150 378898 345046 353665 405633 366809
17827 366809 409870 407547 368295 284012 327853 278765 242040 301065 235077 270053 327410 357783
17815 357783 407615 397810 362714 464894 427021 432099 420631 411139 353924 290002 295372 430445
17803 430445 486272 457408 449240 456457 508863 515434 464167 390241 319057 226354 164204 234769
17791 234769 381429 421519 434247 537176 552755 486107 488969 461683 489574 354836 245005
17780 245005 221011 295620 257029 299752 306999 314096 423021 428318 332915 232705 160046 90697
17768 90697 175080 157247 210982 269980 292169 300910 327399 329780 305380 229499 142709 130536
17756 130536 159194 272950 330459 376960 345145 303651 317581 346251 435404 621700 657179
17745 657179 615221 493819 417225 418019 534899 576701 570087 477989 378522 361559 404864 369913
17733 369913 126306 -34540 -99015 8359 101179 152974 176410 243853 319315 226776 198909
17722 198909 224510 327666 311988 258838 155617 164813 176820 158162 209750 251745 177145
17711 177145 152541 146078 150241 124487 215785 206020 161520 144059 103190 100378 85002 68812
17699 68812 139444 195338 200544 193068 153873 129624 140678 70849 30009 89624 176850 172059
17687 172059 55047 76682 208015 101844 124021 216353 232763 136722 66767 141164 105115
17676 105115 61266 98854 75882 98940 138241 179761 210613 150240 103548 68210 33682
17665 33682 108488 100165 53516 72480 146224 143985 164487 158687 109566 170545 103396 50418
17653 50418 -56572 -21629 47128 133625 109600 33954 86285 184845 230284 229780 194615 214123
17641 214123 184615 188519 168566 163065 128029 230562 308842 317871 142982 104858 104836 39837
17629 39837 37032 83918 105823 94842 136173 83073 28800 74955 87884 142116 207630 25194
17617 25194 -90930 -36256 44162 99339 105677 129350 156045 173695 235212 281849 287051 361150
17605 361150 322630 266696 237257 285751 347974 409182 386657 363902 171157 96048 76600
17594 76600 51433 21694 65872 84010 191941 211970 217204 215419 143057 138181 107436 81532
17582 81532 86172 106929 137597 48666 -39243 -11358 -62208 -68953 28901 135533 21081 -19247
17570 -19247 50018 40999 46735 84622 57029 23566 54020 31946 69840 91276 -2193 -6327
17558 -6327 1722 23946 15510 27255 563 123875 224397 177272 76652 115743 170669 151610
17546 151610 96793 55620 97954 105248 113837 130925 173714 169017 216578 30485 -5102 55362
17534 55362 76176 94949 166980 198685 179894 123890 103492 28290 98825 102132 134708 148767
17522 148767 166443 190531 148618 116340 106127 80895 64679 127816 181395 231143 257015
17511 257015 267387 163809 128505 270816 256254 286707 275534 267633 263721 284966 253822
17500 253822 151196 86130 181991 182917 138485 142572 184307 256958 250148 157283 125366 145728
17488 145728 134974 232703 289638 240403 244703 181268 157396 255472 350752 290186 327512 333279
17476 333279 362833 381475 503272 554177 428015 338741 344015 346494 307695 275043 271999 189014
17464 189014 274971 222283 162532 149741 206716 153497 71469 163371 296906 371822 451019
17453 451019 415408 472084 521586 582596 589339 506520 568626 720024 810880 876557 1118906
17442 1118906 1416367 1556077 1601427 1537960 1510934 1619097 1448622 1216902 1053964 944055
17432 944055 892469 773417 735322 702944 637587 558324 587563 577038 632084 493502 447715
17421 447715 599356 593570 560339 517330 543080 410954 363807 410610 422412 474500 579263
17410 579263 679745 721024 741516 764014 701299 673296 645818 651723 701678 715466 667564
17399 667564 657527 762450 874084 890734 870916 885587 908892 982629 1034715 1016130 979014
17388 979014 958771 896391 984978 1047415 1082323 1168906 1253590 1250103 1306639 1363040 1437377 1491916
17376 1491916 1583170 1610970 1688637 1774851 1700961 1607050 1736343 1924893 2185933 2409078
17366 2409078 2693095 2979259 3260005 3443555 3545862 3552010 3587093 3752024 3967203 4273671
17356 4273671 4705050 5301251 6103838 7127041 8365610 9854174 11697425 14023919 17053604
17347 17053604 20959763 26272871 33590883 43928269 58730386 79812951 108023741
17340 108023741 139996585 164256080 167578937 148784385 118188481 87941989 64447589
17333 64447589 48177155 37228713 29751750 24670651 21013574 18253822 16126644 14456597
17325 14456597 13150431 12186299 11326554 10462751 9806723 9129962 8528687 8142386 7984366
17316 7984366 7778241 7695663 7557670 7386678 7179699 6796785 6419071 6241044 6237335 6044841
17306 6044841 5909696 5973678 5955711 5976563 5931627 5944687 5820493 5551072 5331511 5045588
17296 5045588 4710255 4443787 4203889 3959469 3698468 3517786 3335187 3081484 2823600
17287 2823600 2644505 2582986 2460460 2431772 2455939 2344658 2149923 2044689 1833141 1785941
17277 1785941 1765969 1575845 1512985 1440044 1344138 1310842 1284108 1226894 1187732 1051094 914872
17266 914872 913392 920348 940013 915354 865069 869177 747557 630421 540373 547698 556076 502921
17254 502921 506967 479211 412434 400889 359625 290984 306104 214267 160303 120200 126909 172100
17242 172100 195005 232925 182315 992 16954 135593 160183 178526 126660 42107 -85288
17231 -85288 -46175 51330 139225 221350 246622 306646 292813 202631 185543 141791 142474 286503
17219 286503 342842 373997 284151 241293 205065 357994 466679 424677 416166 229064 18113
17208 18113 -89446 -137315 -180004 -275520 -240303 -225269 -280846 -244799 -253268 -91971 -43533
17197 -43533 -126457 -184722 -145206 -129998 -148847 -136743 -46333 -29492 -34402 -17336 43214 -10264
17185 -10264 -54509 -86698 -125001 -110900 -28360 -32504 -96908 -47479 -138022 -208036 -174556 -135791
17173 -135791 -49176 13093 -10336 48515 33838 100299 175445 214631 205123 235307 195031 24122
17161 24122 -37505 -72399 -37006 9051 -40032 -19282 15934 -53992 -147416 -132944 -150366 -18698
17149 -18698 153182 226073 153396 151999 157444 63291 958 88820 78900 14332 11776 12818
17137 12818 -76280 25847 156819 88792 52346 49006 29388 35872 112758 135141 194795 143171
17125 143171 148743 152531 86220 18865 115377 163415 204121 181377 131848 1294 66807 77320
17113 77320 59629 84056 140546 188167 126831 129091 203998 155930 151172 92346 115786 7919
17101 7919 -168561 -203828 -96146 -21721 -35336 -9053 8906 50129 -9016 -94508 -115824
17090 -115824 -71260 2357 120194 105767 105642 65405 -18980 -82830 19309 -55845 -186069
17079 -186069 -178370 -18489 7477 16366 74994 91439 64922 -54377 -173415 -246882 -185754
17068 -185754 -104636 -144800 -143597 -127593 -111168 -69182 -151099 -89677 -2659 17117 23976 14227
17056 14227 1351 -57533 -3710 -43854 -91320 10138 110538 140174 51737 -98397 -125978
17045 -125978 -158188 -143041 -82187 -8914 -21959 5604 62823 11129 -45055 -56612 -14457
17034 -14457 -11498 -67987 -43113 -50662 -157086 -147422 -85609 -48342 -20201 52775 39323 -33135
17022 -33135 -62571 52348 36133 15963 -43676 -76844 -34119 -54994 -119712 -185948 -99042
17011 -99042 49811 122264 28321 60488 36341 -14608 21853 13235 -135620 -243295 -181621
17000 -181621 -93809 -31946 -54949 -197825 -164145 -102793 -55505 -30368 -8365 48383 47688 -49310
16988 -49310 43063 103317 21902 1896 -37592 -77064 10166 59779 -48816 -49827 7354 -46125
16976 -46125 -63206 -82276 -65995 -29510 48170 37627 -4955 -18748 -108986 -162110 -243847 -229776
16964 -229776 -139605 -3091 32509 34708 34529 -69287 -88821 15024 56457 -58702 -29091
16953 -29091 -4391 -97960 -180526 -242039 -309488 -257338 -149965 -105547 27759 -26000 -42
16942 -42 26975 10662 20906 7263 53851 8276 63329 212319 99513 17787 55849 -2345
16930 -2345 -10140 24725 61955 149543 145532 85419 -53777 -138105 -80572 -29532 -36463 -111963
16918 -111963 -187005 -147801 -96164 -145066 -113411 -80688 -86821 -40726 -10862 -79572 -41938 -11500
16906 -11500 60815 59895 -43309 -111356 -31164 -20561 9879 36094 -9455 -49616 -54688 -6120
16894 -6120 -57186 -117911 -149416 -193828 -194625 -19454 37289 -46338 -70250 -61676 8538 92533
16882 92533 134473 163773 33075 -90289 -74646 -20086 21400 -21809 -64731 -126343 -119195
16871 -119195 -209869 -86527 94741 42387 -73670 -75345 -125307 -68350 -41086 -17517 -35804
16860 -35804 -180194 -189102 -158972 -220916 -296846 -107649 51508 51078 611 -47710 -31295 -66097
16848 -66097 -41929 21168 -59386 -96487 -92623 -85749 -59000 -21844 -42160 34855 38329 68079
16836 68079 75563 6964 -48101 -27693 -12625 -8603 -2040 -22800 -4748 71600 46696 -59927
16824 -59927 -51480 -54488 -5425 61371 69852 90242 90792 180535 286649 386569 413277 578548
16812 578548 752312 794932 723948 651628 579834 423655 416210 375012 292412 166105 40512
16801 40512 -22746 -81245 -42960 107615 150940 80393 33683 70720 -32725 -58565 -74463
16790 -74463 -26265 -12700 -66884 37277 113016 54007 -96572 -138333 -24656 33258 10530
16779 10530 -34047 -46222 44047 63218 -50604 -199535 -128316 -89251 -50805 21094 -77929
16768 -77929 -118572 51242 128636 155698 46598 -56802 -75357 -71091 -114957 -77340 -90458
16757 -90458 -101069 -28548 72715 35884 -6049 73990 9618 -96325 -43370 55790 26030
16746 26030 68038 202656 233246 154656 74697 51226 -44622 -82681 -25855 71790 53849
16735 53849 17709 37134 12383 -114800 -91192 -34768 -8704 -24723 -19334 -77358 -109386 -54444
16723 -54444 -33446 2472 15596 9688 2760 -40847 -53413 -24324 -63482 15491 -35630 -232165
16711 -232165 -202646 -121805 -79233 -24564 -7282 -6043 -44030 -106135 -123922 40238 137067
16700 137067 24088 -784 60318 35185 -81187 -115455 -43037 31995 24571 -6578 -73854
16689 -73854 -104122 -99477 -124728 -258854 -343860 -284566 -187426 -42528 28057 40270 66134
16678 66134 -33844 -133159 -126288 -107627 -101622 -58329 34330 15264 -13290 10450 -35941 -34651
16666 -34651 -81425 -149885 -96306 -69420 -115781 -100214 -49003 -38823 4182 64561 -9974 -59861
16654 -59861 -10455 71160 -12489 -112280 -103184 -30078 1600 -101237 -79885 -78847 -37193 -108720
16642 -108720 -173553 -123576 -97194 -88789 -112216 -89345 -170586 -80357 24654 41603 81836
16631 81836 -14797 -107253 -52755 -68033 -96339 -141060 -163419 -109014 9294 -76250 -51196
16620 -51196 -50781 -92475 -76160 -91740 -128865 -17564 -49200 -75203 -97237 -126691 -110155 -87767
16608 -87767 -38769 -25496 -76439 -121185 -31555 -68046 -162171 -193859 -125474 -90147 -136803 -110963
16596 -110963 -65041 45922 -41643 -196962 -134376 -61408 -29524 -74768 -29051 -113121 -155729
16585 -155729 -175845 -101955 -15136 -57765 -52250 19845 61160 74702 19694 -43750 -88698 -20479
16573 -20479 72500 6693 -20226 -16692 28415 -2936 -148910 -241756 -308814 -319000 -208910
16562 -208910 -153645 -117943 -110387 -24751 -54222 -58110 -78708 -142158 -130498 -48892 48558 84338
16550 84338 87196 78833 75373 -2461 43039 -21623 -39392 -105979 -130099 -97374 -167973 -200109
16538 -200109 -169137 -44672 -42977 -42247 -70849 -80847 -100273 -122619 -15039 57749 20791 52503
16526 52503 39033 -8035 -31102 -68985 54073 117582 134849 82256 -39974 -98958 -38070
16515 -38070 16781 15068 -53628 -86710 -91339 -118299 -51438 21049 -74414 -105160 -37354 -82905
16503 -82905 -128362 -161490 -181009 -149666 -158102 -216525 -217807 -77455 -24651 -115323 -126999 -63499
16491 -63499 -14809 -8451 -35749 -145721 -87582 33728 25459 -62145 -52447 -10883 6756 -29082
16479 -29082 -2225 -49917 -121799 -149142 -121734 -157914 -129482 -117513 -10619 127582 86162
16468 86162 44535 54729 27153 -35311 -51423 -31529 -5511 36824 -41563 -74637 -308 28839
16456 28839 44176 127435 152633 47380 -192377 -280974 -314826 -187962 -144702 -173984 -143830
16445 -143830 -40374 -76454 -813 1406 47594 79066 -31402 -75792 -66967 14373 -90073
16434 -90073 -183092 -225224 -147163 -25885 -12859 -62306 -120741 -127925 -13451 41312 36416 18642
16422 18642 75631 131069 139705 50432 52636 83132 55630 77437 78283 8757 -79 -85157 -52633
16409 -52633 -14093 -67673 -54967 36931 154856 160636 68658 45013 64017 58015 38524 11327
16397 11327 55249 27282 -95955 -101989 -117 33286 -87719 -169112 -201306 -289839 -160382
16386 -160382 -51499 -56496 -60702 -43364 7160 109828 226344 161887 21451 -47423 -95297
16375 -95297 -23366 -39739 -75193 -105925 -56273 48628 -1154 -67526 -48524 -23334 -50666
16364 -50666 -67051 -45494 -58869 -16459 -2081 -66255 -177337 -237159 -171876 -102269 -26653
16353 -26653 -23001 -27553 -30114 -68083 -84384 14876 151483 113801 71258 126020 157130 137018
16341 137018 25502 -9218 -16798 -4224 73177 86806 -24438 -110463 -119933 -57910 -67232 -30601
16329 -30601 -14336 -80300 -83932 -47739 -71703 -78557 -30382 -13760 -55166 -11506 -6857 31928
16317 31928 9671 -11921 -36197 -133973 -204577 -221367 -234814 -143334 -47530 -69625 -41537 36298
16305 36298 -73993 -80716 -129274 -186160 -163772 -113712 -59916 -106535 -34986 14910 -37995 -90465
16293 -90465 -182946 -211340 -177171 -126935 -76434 -9536 4838 -57080 -133561 -73442 65372
16282 65372 98123 76816 -3559 -17406 31742 99090 91203 101151 125506 100234 90857 99960
16270 99960 130995 140475 95860 177449 133288 4403 22383 57422 89512 50999 102293 128666
16258 128666 62983 85278 104709 23111 46259 152738 198188 59630 53562 67976 39251
16247 39251 -42967 -37902 16358 94532 185789 130634 43846 -3208 94901 154290 129871 143042
16235 143042 156342 191234 64427 -20278 -14501 72467 30837 -38257 -11225 -57557 -127705
16224 -127705 -6258 55860 70350 86587 221297 271206 278763 249632 157168 85400 38001
16213 38001 17742 107884 161055 122992 135989 181620 160132 82531 43436 49107 -21675 -15184
16201 -15184 31852 62288 12213 32923 99221 164201 146333 84351 5197 -51531 -17928 -115204
16189 -115204 -149426 -54096 -16361 -31146 -6430 -59998 -61490 -5496 -46217 -62029 -70586 -33654
16177 -33654 80297 100196 -9568 -68835 -102715 -76124 -37128 69697 65831 -5612 61115
16166 61115 52930 -70474 -101882 -40061 -13422 19383 77296 104730 5942 -48961 31206 -4392
16154 -4392 -82907 -139073 -110319 -91533 -67285 -31454 -39826 -116164 -129351 -139607 -75612 -59398
16142 -59398 -63375 70178 88534 84794 27138 -58149 28265 53296 -54680 6070 53637 11275
16130 11275 -49935 -42339 -1032 17131 -10672 16311 91739 188389 160702 123539 104643 146666
16118 146666 148924 203840 157425 127847 -71240 -92151 42610 182950 147123 34097 25446
16107 25446 77078 61494 84943 81161 16429 56885 29052 -47697 -93282 732 72269 73164
16095 73164 182701 198847 1287 -16004 66362 74869 5145 1702 88997 48049 -36926 20045
16083 20045 193870 263106 199292 150037 107857 62797 681 -81078 -46096 -28555 -80196
16072 -80196 572 -44367 -48478 13660 -959 -38627 -53607 -142398 -54695 -2419 20206 110526
16060 110526 137856 145395 116013 137049 85379 107531 33987 -95044 -43762 -70389 1361
16049 1361 31534 39786 37338 3914 -7503 23762 33403 56341 4075 1389 -94705 -44358 -35122
16036 -35122 -20560 18398 17336 43437 148938 97427 -18013 -123328 -139823 -102523 -137216
16025 -137216 -197482 -217611 -114095 -140940 -111503 9807 97659 102166 44551 25184 71555
16014 71555 186392 233828 169616 121094 -48926 -72262 29170 25356 -76116 -139908 -122619
16003 -122619 -72260 -95385 -181257 -214574 -151698 -16753 71860 122720 125858 44701 9799
15992 9799 67866 59646 10990 70576 -550 58221 21250 9154 41101 -95335 -184206 -99957
15980 -99957 -149397 -165197 -125841 -12794 62650 124576 101840 -47177 -177389 -205740 -211647
15969 -211647 -174595 -163583 -78472 -6692 42545 100938 140138 163974 152296 153084 51726 75753
15957 75753 151039 256325 239829 210547 176994 237151 203710 146769 89105 82989 50798 37981
15945 37981 41832 69047 37547 -37827 -51918 26618 109376 58388 55082 169734 227650 90521
15933 90521 -8641 20354 39506 49155 24072 -8021 42597 117023 79729 99325 15153 57199
15921 57199 131064 180545 148840 85561 49472 62320 71762 122940 113965 30426 -20505 59215
15909 59215 183328 152027 173256 175070 141338 136943 146323 91371 7278 -10299 -24359 22936
15897 22936 130603 117393 162273 143786 176070 157794 184054 126511 232884 258489 138086
15886 138086 -35364 3632 94809 140612 180866 239992 163802 230240 224623 122997 168636
15875 168636 220802 325673 339136 315149 261966 220214 262780 229165 182929 271135 344114
15864 344114 326821 320820 358876 355635 270994 273659 292301 277887 331328 440273 322075 354291
15852 354291 411588 479056 464752 470999 486309 492059 555175 553008 504273 552276 444149 472517
15840 472517 616288 667702 633207 550595 470251 486837 495555 483215 459728 419207 502003
15829 502003 567087 469530 397478 403761 445574 412560 399052 280664 178845 170835 208026
15818 208026 281304 306112 293482 312755 327641 226424 225802 229578 282501 232569 195726 141405
15806 141405 127682 119429 170359 117758 136540 86666 129954 237470 260171 336197 382217
15795 382217 261884 155880 223439 261925 138312 85987 155227 138845 43154 -57672 42657
15784 42657 104978 193834 190415 251635 294778 357551 384564 291190 251260 243754 256269 219290
15772 219290 212293 176120 178842 185992 199030 208154 198398 232449 276064 301340 212579 219284 208821
15759 208821 268307 237349 146944 109546 70655 168206 173962 167978 174730 163886 241136 246511
15747 246511 156733 142242 127595 132277 153188 233125 312885 295916 198391 146551 89076 131822
15735 131822 228779 211465 133027 232515 234750 129262 137470 90413 149441 150743 152826 176985
15723 176985 56334 173 14859 70510 158560 289135 351776 320277 203889 172542 157092
15712 157092 170932 228536 243509 304393 337202 245516 215182 241183 173112 141865 194996
15701 194996 80634 -22103 79176 104716 262557 373934 280644 269481 296157 315346
15691 315346 230182 239765 165607 117956 130589 71758 48767 98001 118029 117889 106534 305041
15679 305041 384420 238051 225066 326818 343470 268180 223619 241540 311760 363324 347354
15668 347354 430191 330309 323104 399228 417487 286253 220665 289281 386571 433320 405766
15657 405766 349846 320642 408656 356282 399244 424454 422617 450338 316087 235006 209891
15646 209891 245505 223284 197046 219214 278663 320837 347564 409977 400964 310133 248791 270934
15634 270934 310566 336674 348293 343949 325243 357373 391671 325289 304314 430114 359423
15623 359423 326312 368054 389796 502377 422884 432027 398461 277484 349966 496106 524152
15612 524152 489125 470681 480613 484420 531481 605334 660003 617030 664008 627585 452461 369923
15600 369923 380305 361800 405402 451090 513669 590371 567245 555509 583456 579679 634509 725744
15588 725744 730869 639894 581640 466660 493535 629832 627450 692687 722990 633940 568861
15577 568861 632015 703820 744362 666020 618986 697414 730556 779156 902294 837084 784753
15566 784753 807392 807698 821147 853395 913664 972371 1009787 924970 839061 774466 729970 718775
15554 718775 716103 729045 847536 875095 768148 648437 561079 569717 680835 700940 722762
15543 722762 709564 720493 763609 678876 704227 726600 737136 791854 862802 828723 819369 893717
15531 893717 867757 871946 878368 880353 963336 895490 817513 708718 674254 790169 772058 703788
15519 703788 792027 833365 855840 927712 898655 954429 954429 945446 892149 881049 849753 884903
15507 884903 824783 897880 909579 873102 844931 817295 778856 843251 1013612 1094101 1104980
15496 1104980 1085159 1037984 937476 881259 858644 900156 930710 933834 973232 1017658 954298
15485 954298 913207 915796 938274 938038 1051298 1209961 1322778 1300021 1250720 1201823 1228275
15474 1228275 1272981 1286417 1233282 1236291 1320859 1378988 1302326 1259364 1292818 1281476 1318220
15463 1318220 1349969 1351530 1333315 1244462 1263905 1369657 1370789 1415451 1401076 1301911 1254167
15452 1254167 1269238 1314748 1415694 1433542 1467066 1477217 1482426 1614833 1715971 1754259 1672990
15441 1672990 1693816 1669538 1760469 1846220 1919103 1991894 1893088 1819020 1786640 1763225 1805468
15430 1805468 1818211 1820844 1906460 1981906 2060400 2096517 2141312 2161544 2180498 2272010 2358118
15419 2358118 2343618 2317052 2369580 2419739 2276029 2276433 2233099 2149683 2259817 2395161 2497904
15408 2497904 2485389 2537465 2564174 2607167 2678018 2672284 2625234 2682535 2782770 2842675 2938688
15397 2938688 2997328 3110687 3127478 3208561 3247047 3209259 3312536 3340061 3405793 3495986 3606323
15386 3606323 3626365 3640533 3670976 3637453 3692773 3827543 4019409 4128074 4283364 4312728
15376 4312728 4338993 4471667 4691689 4778525 4808978 4876391 5024191 5108579 5206428 5430336
15366 5430336 5564600 5555503 5597711 5680347 5784574 5951092 6098414 6132544 6244616 6404849
15356 6404849 6542387 6734928 6913575 7171970 7349241 7483547 7732487 7868315 8078554
15347 8078554 8361594 8506821 8782876 9074538 9330248 9580522 9752001 9948929 10218795
15338 10218795 10519150 10858386 11248355 11571586 11718064 11940585 12305808 12797004 13252151
15329 13252151 13678168 14125122 14481421 14993767 15498622 15824415 16271733 16863414 17465401
15320 17465401 18061413 18671181 19248818 19852900 20554873 21183080 21779570 22431645 23184419
15311 23184419 23888568 24666242 25425481 26172064 27046520 27959645 28765598 29586225 30273446
15302 30273446 31062375 31918333 32716083 33464495 34192404 34847549 35426172 35966929 36617867
15293 36617867 37312783 37847333 38282414 38588075 38803005 39005745 39225347 39285911 39207689 39059348
15283 39059348 38883983 38663706 38347697 37921844 37542200 37124267 36560716 36032223 35414563
15274 35414563 34692380 34042534 33301716 32618867 31946359 31265453 30543128 29902933 29194896
15265 29194896 28452695 27773611 27052015 26339623 25690180 25011136 24293428 23703370 23174314
15256 23174314 22560314 21842192 21155615 20635127 20088176 19637933 19258428 18772545 18199910
15247 18199910 17601702 17142826 16637696 16158924 15721018 15356995 14929304 14587824 14274289
15238 14274289 13934722 13606635 13251305 12906887 12723993 12449133 12136329 11872874 11535106
15229 11535106 11231079 10926540 10660335 10373270 10090563 9784340 9551133 9352809 9182636
15220 9182636 8939229 8632191 8416075 8298081 8118859 7845018 7667517 7503234 7292290
15211 7292290 7078332 6920368 6790072 6649778 6580717 6389338 6157821 5944498 5853528 5688196
15201 5688196 5523104 5460834 5422309 5249251 5118752 5061667 5020244 4897754 4758798 4645235
15191 4645235 4588581 4498153 4422019 4258345 4195088 4208854 4106063 3961276 3903627 3774516
15181 3774516 3717573 3690079 3573814 3472383 3401796 3345777 3341020 3270437 3212711 3118127 3085595
15170 3085595 2994138 2961238 2940262 2929556 2894931 2819486 2664677 2576042 2512139 2441406 2492785
15159 2492785 2461949 2450590 2433536 2391097 2385142 2387646 2352741 2255860 2160015 2183601 2171296 2079983
15147 2079983 2016031 1904225 1784125 1750264 1735716 1768014 1747908 1834939 1736612 1642184 1545150
15136 1545150 1437191 1518348 1595353 1565466 1594937 1625699 1617830 1572484 1548709 1521472 1549123
15125 1549123 1437706 1395051 1419639 1454332 1355874 1310210 1273186 1323080 1266100 1167947 1183530
15114 1183530 1185595 1257188 1321612 1234200 1150504 1143329 1197121 1183502 1124044 1105111 1149649 1099008
15102 1099008 1082937 1079650 1136773 1107870 1102943 1157234 1179633 1073961 1079099 1071047 1083133 1075699
15090 1075699 1062858 1035867 1014582 896117 813700 907725 916136 1021809 1028678 977774 999041
15079 999041 1076229 1085365 1061693 981940 972499 975381 952641 859134 778314 713980 791991 818698
15067 818698 805772 820905 851952 866672 831757 847625 759070 669538 621454 613137 569880 569351
15055 569351 504208 528663 481252 409010 440136 463224 528880 592342 651896 693753 584793
15044 584793 583905 629540 619699 660396 746399 803884 728563 631617 571494 519025 441918 482878
15032 482878 593264 584872 570225 594604 528970 602606 646197 619704 647733 622919 602446
15021 602446 590217 625252 781588 827932 768446 762949 875103 887436 834574 785569 783356
15010 783356 798753 855625 767586 620223 548422 486049 448932 362685 394532 403996 329134
14999 329134 315991 336370 430600 488869 539547 547817 553843 506120 380861 395881 441778 535339
14987 535339 498109 369157 283194 312957 404631 410413 464930 441454 399149 385599 352453
14976 352453 333792 322861 189153 213769 243790 233816 302795 445350 458838 397279 307130
14965 307130 336222 350316 359262 354291 312915 212377 127350 170398 213770 260159 312436 336620
14953 336620 398931 332610 266484 262242 309241 290367 292610 301027 240237 198803 82953 99125
14941 99125 70420 122191 149135 220537 186931 144831 101779 28072 33535 40201 95959 81535
14929 81535 110868 131371 211291 183472 51443 52008 64201 116673 129165 187554 232102 236977
14917 236977 142118 15285 76016 101786 246975 290159 279875 175976 81609 120308 206816
14906 206816 207305 187730 192031 205239 224577 199940 93168 94538 141453 117338 14622 -80485
14894 -80485 -84745 -20260 59699 93943 119811 185233 220821 232145 183629 153444 159375 109250
14882 109250 116667 77593 76088 111818 76894 91843 147456 229457 207988 188983 101310 -886
14870 -886 -62837 -91488 -75112 -71978 20915 65192 -35986 1323 25132 13663 64788 13121
14858 13121 61030 66027 -17038 15662 179004 227639 204922 190979 214871 170304 245412 260532
14846 260532 234103 220666 183625 216454 238095 207947 139454 143133 109763 91449 116145 113639
14834 113639 107811 179958 220266 244916 253150 191129 59076 -16408 -78677 -97482 -126093 -134663
14822 -134663 35429 63427 127671 116132 55959 26553 -35107 -17243 60672 119983 61167
14811 61167 22367 4083 -9415 -43843 -41526 -384 82037 154985 172964 123772 80128 42442
14799 42442 -4591 21318 39393 -38990 60466 223605 187836 214446 203558 172607 117612
14788 117612 128887 90861 -19697 -23439 -79207 -93345 -76262 -107878 -67137 61687 115534
14777 115534 113065 68269 57875 73998 136661 142591 161851 156977 148119 185519 219036 103452
14765 103452 -20118 -74624 10162 86817 78099 112710 122845 68589 100287 83702 103546
14754 103546 181066 122213 57429 31103 -11523 14570 -59741 -92942 -154459 -155645 3242
14743 3242 116076 198948 168330 52675 -81294 -103756 -21838 18698 126812 75925 43691
14732 43691 124253 191076 183072 175991 93589 59957 15504 -52449 -72663 -138985 -155189 -78453
14720 -78453 -50535 26792 34976 34901 -46949 -76783 -32713 -36405 -42341 -61256 -144741 -273577 -225269
14707 -225269 -92530 -25513 52020 -38934 -85838 -60410 28772 67548 17100 16309 -73904 -95328
14695 -95328 -108141 -118287 -154193 -95972 -61569 -8363 7634 -10123 -14130 -18133 54196 76395
14683 76395 115479 118696 81306 38968 -46037 -125857 -107887 -62374 -140189 -202588 -41148 25102
14671 25102 -41288 -58680 -106666 -116806 -2929 154810 134478 190722 141093 94324 62129
14660 62129 -32659 -87352 -42159 -48114 -107057 -41467 -83438 -119794 -88533 -10207 13754 -37177
14648 -37177 -48312 -32953 -45666 -99228 -158759 -27255 91108 108640 109343 17444 -51104 29977
14636 29977 58853 90072 100588 27112 10206 -23483 7478 -77646 -69922 -96413 -171386 -147077
14624 -147077 -46180 -54479 31371 152322 154147 57228 -76103 -116085 -72683 624 -11672
14613 -11672 -27918 -15565 55405 -24398 -101999 -20577 40136 49549 119199 136571 147043 127285
14601 127285 39918 34717 -41067 -100386 -65918 4104 -25522 54592 111454 -12386 -63682
14590 -63682 -22145 119461 174202 116312 -17139 -52731 -46514 13997 -44327 -67302 -46952
14579 -46952 -50466 -106933 -180995 -181715 -138939 -102938 -146154 -204179 -136647 -55181 86137 80673
14567 80673 19950 -33029 53773 -13189 -107771 -118152 -142801 -136964 -50109 3267 -18786 20577
14555 20577 49117 38888 111152 154316 103538 12710 -87315 -139603 -186917 -219510 -162223
14544 -162223 -137033 -75473 -13749 -34999 -90902 -67136 90527 134305 128810 84223 16391
14533 16391 14584 -41241 -41665 17928 55094 104988 110977 91679 232109 200671 103939 30649
14521 30649 1627 -32248 -66233 -50326 -16509 -53349 -40085 29353 56156 10668 27180 56837
14509 56837 -34173 -41379 -2472 5222 18646 -34672 -113293 -149075 -147286 -62249 -43650 -101871
14497 -101871 -158831 -65434 -80698 -163803 -138968 -27829 51258 -54930 -96632 -17208 -58086
14486 -58086 -93851 -77993 -133595 -233918 -296724 -211759 -108246 -99052 -59042 -19722 -79739
14475 -79739 -192783 -214482 -134768 -93569 -110112 -31853 -45105 28736 9350 72180 136263
14464 136263 150297 224821 232578 245121 257501 241015 229806 192823 166522 138029 129943 232329
14452 232329 221770 120335 42895 -110751 -192900 -195158 -132738 -9320 -21752 -89546 -70148
14441 -70148 -86823 -106303 -107262 -111564 -48805 -135357 -198961 -64406 -30329 -68981 -35735 -7173
14429 -7173 -29406 216 53629 -45446 -37584 77753 73522 19734 13253 1070 35850 -38248
14417 -38248 -30048 29196 -1513 -6941 -63821 21354 87959 147841 128892 57912 -20305 -30436
14405 -30436 -112061 -211712 -177869 -33547 93008 69915 24216 43170 -48909 -71994 -84456
14394 -84456 -54694 -40503 -87779 -151201 -124706 -110903 -70155 -3692 65692 102811 36061 13998
14382 13998 18540 31131 80914 123880 188530 85037 -50479 26424 72667 57367 -64463
14371 -64463 -109618 -142285 -113932 -24062 -29705 25185 100574 133465 50856 26496 -61634 -98770
14359 -98770 -120506 -56105 48272 64017 88883 27989 -10477 -105067 -66534 40114 28352
14348 28352 46858 75819 80266 25755 37624 51391 -100784 -105482 -43404 -18601 -84684 -97861
14336 -97861 -132911 -123808 -73746 8344 -17989 2257 7313 62185 93979 73291 77001 110989
14324 110989 134122 103264 90351 170043 82264 61825 134875 199874 690 -141032 -108774
14313 -108774 -72731 -88415 -72494 -89438 -65142 -87229 -104803 3936 -5993 -37698 -93539
14302 -93539 -65794 -22080 -121117 -165997 -216606 -117968 -4740 59829 14625 -100292 -207779
14291 -207779 -249662 -314026 -300594 -253460 -165281 -112772 -149083 -57856 71072 69800 69618 44431
14279 44431 -62323 -57594 713 -1213 -94715 -178400 -203818 -185571 -224084 -233332 -216784 -174781
14267 -174781 -87029 -93942 -90259 -188680 -201652 -167552 45451 140998 118047 139853 27128
14256 27128 7435 7538 -51668 -87217 -104395 -12871 46089 141984 97827 30703 13438 36590
14244 36590 128489 110509 6722 76013 108561 85589 -20185 -29409 18260 19057 30777 58745
14232 58745 39509 4727 -96611 -83998 -57260 -102800 -86699 -51434 -50856 24201 -50286 -122522
14220 -122522 -141448 -112308 -102979 -161430 -114614 -41490 -44017 1326 64972 11235 -57560 -161476
14208 -161476 -159020 -26849 42388 -17517 -31929 -34341 -79046 -16875 3620 50325 65286 27250
14196 27250 20583 22443 22805 -23344 -83186 -93150 -70875 -24895 39899 110383 204314 6178
14184 6178 -125310 -148095 -64868 13502 -30347 -73583 -64854 -17826 -58067 -189278 -173717 -119646
14172 -119646 -179758 -154948 -3298 -19611 -34350 -8366 -41117 -49826 -107307 -107331 -202601 -221398
14160 -221398 -187975 -173642 -91310 -85117 -90234 -37528 -60076 -13733 -44685 -110373 -158649 -64782
14148 -64782 16059 -62383 -37970 12988 35189 -23640 -16769 -22905 -104678 -151852 -169340 -131545
14136 -131545 -71891 -27770 20977 68652 -97059 -112501 -70322 -167972 -245109 -216918 -115449
14125 -115449 30372 25062 1600 -311 63181 16991 -101614 -171249 -210276 -231985 -197358
14114 -197358 -102307 -56255 -49660 -46306 -2746 129206 125875 95535 -23645 -87008 -70090 -119353
14102 -119353 -176434 -32700 26217 -48771 -86803 -156247 -162835 -177089 -111148 -69947 -44551
14091 -44551 -78936 -42144 -42527 -146301 -117557 -107765 -91824 -122020 2200 15029 -25390 -12550
14079 -12550 10536 67932 190903 138530 48918 46090 63373 32046 -19121 -17414 82398 118546
14067 118546 127704 88403 26484 31676 -13659 -26803 -75473 -140915 -138189 -139878 -54058 -43785
14055 -43785 -128787 -107160 -77776 -57175 -118117 -65545 14827 -7323 -83097 -156851 -79362 24187
14043 24187 -61879 -200210 -139685 -81709 47260 84166 -12780 -59522 -137947 -149240 -42673
14032 -42673 12932 65895 36404 -807 19714 56420 43843 126730 160747 72360 -51859
14021 -51859 -82919 -10214 57040 158714 177976 224886 208827 113574 63395 57991 -1140 -64729
14009 -64729 -112094 -129619 -149058 -140806 -44946 -51769 -94590 -53092 -65706 -93688 -89381 -75731
13997 -75731 -59610 -105890 -97995 -19019 35948 57346 39479 75861 25769 30007 50843 52612
13985 52612 90393 105022 38378 -15277 42878 77224 85323 158017 161209 152966 149431 166678
13973 166678 182017 180825 231536 255874 240240 286506 352131 339737 458358 569557 548287
13962 548287 436740 288594 225670 122378 40299 -2741 72799 72006 10373 -76170 21927
13951 21927 4896 65354 125429 113187 57639 -48557 -56771 -132906 -185811 -109025 -49955 -87590
13939 -87590 -113090 -101708 -97860 -51666 -19446 -45933 -40533 -60873 -84200 -49494 -68786 60799
13927 60799 30200 -42972 26573 152450 91357 37669 13675 -14846 -80496 -92761 -33413
13916 -33413 -39605 1659 18775 -59396 -67077 -91655 -34737 4960 51887 -62409 -57503 -270
13904 -270 -107192 -147187 -120557 -52436 -20331 4249 14748 -9985 23474 24371 23793 -8468 -5078
13891 -5078 27639 -20980 402 16814 -50925 -38540 -110799 -133011 -146284 -53192 -23713 -158845
13879 -158845 -222445 -137156 -137373 -89939 9406 38120 1799 18239 21112 -9613 -93619 -104387
13867 -104387 -65393 -22942 -37465 -58254 -73083 -133935 -139378 -130190 -120724 -82481 -80676 -103791
13855 -103791 -51008 -120969 -123061 -131524 -80909 -101754 -69903 -68221 -98836 -158210 -80900 -39221
13843 -39221 -75637 -80539 -54159 -97400 -111842 -74986 21594 72354 1721 -72247 -105620 -198794
13831 -198794 -287310 -223950 -129522 -61787 -32404 -24722 -32792 -63444 -39868 -142638 -133868 -52277
13819 -52277 -18670 -24591 -49491 -118494 -113825 -72703 -66118 -38787 -40786 -16250 -32441 -74016
13807 -74016 -84194 -196149 -141048 -117126 -181796 -199744 -161875 -79677 -34208 -22395 -3986
13796 -3986 -60911 -96297 -142328 -68097 -50789 -4360 3654 -41194 -63392 -58257 -62505 -72158 62486
13783 62486 204060 200690 131586 120383 92049 199682 162604 56972 -36949 -141272 -99843
13772 -99843 -120906 -142162 -99432 -76246 -90794 -61937 -13739 21825 18128 46423 40578 -4246
13760 -4246 -72526 -104497 -73427 -100688 -65511 -79219 -24521 -1483 21269 -88791 -132710 -40695
13748 -40695 97937 66493 8790 18116 -75304 -43013 19960 -60745 -170107 -227979 -225904 -146509
13736 -146509 -49043 -81339 -197834 -185009 -171424 -152556 -55371 -45123 -71042 26037 61727
13725 61727 62281 9304 -27410 -34115 43185 42796 92263 150174 118412 -585 -20192 48847
13713 48847 109245 89155 41913 21555 -44091 -68788 -111715 -151921 -156029 -170171 -131269 -76412
13701 -76412 -68604 -116064 -80413 -10530 -30671 -72240 -50881 -22165 -114929 -193848 -234805 -304419
13689 -304419 -250663 -160541 -140788 -112213 -39859 36088 26447 40264 97269 25796 -51125 -57889
13677 -57889 20060 10666 8220 -30737 -58231 2638 58080 26181 -4845 -6823 -43121 -109379
13665 -109379 -143056 -70077 -16132 -41162 -109168 -59360 -1479 -61033 -15759 16390 -2770
13654 -2770 -67359 -115701 -166240 -97218 -118294 -82301 -43630 45062 93593 129772 125577 127815
13642 127815 96145 38323 49469 1156 -31901 -39552 -160653 -226285 -114268 -57009 -44767
13631 -44767 -109902 -172144 -131717 -62910 -48037 -96153 -143412 -155297 -158783 -100947 414 19467
13619 19467 54356 -57998 -34558 -3337 29759 95150 80809 -45234 -40553 92219 151809
13608 151809 212678 166749 69066 -11273 -67038 -63759 -92429 -91919 -54420 -73961 19295 87562
13596 87562 54312 -62162 -102280 -56378 -49641 -161247 -134680 19048 90070 143194 83195
13585 83195 -17974 51310 -13347 -73995 -119417 -132599 -90169 -24976 30025 3978 32364
13574 32364 58246 153219 130514 9144 -90561 -117173 -99275 -20485 39105 56488 -51498
13563 -51498 -63182 -1629 49736 7731 2181 19878 21272 40251 6482 -91846 -139708 -112680
13551 -112680 -144976 -105372 -149508 -176853 -165721 -232160 -173139 -124796 -187206 -129019 21618
13540 21618 25072 88228 49537 -100570 -70848 -115067 -183771 -120782 -144435 -151845 -101265 -159407
13528 -159407 -119727 -87419 -92408 -35765 -17952 -63091 -72826 -52984 60716 134892 92412 -440
13516 -440 -104400 -84645 -16415 39789 -18939 -16401 37562 46695 -26928 -48527 -85335 -17109
13504 -17109 123932 85773 90738 -7266 -49607 2493 -11443 42186 -3063 -19273 50935 108359
13492 108359 91378 105051 171578 217643 158021 140250 41060 19809 12692 -54563 -43061 -131680
13480 -131680 -111481 -104143 -94130 -24990 -27429 -86205 -79896 -118676 -177828 -135241 -108130 -136123
13468 -136123 -213220 -236525 -115383 546 125462 142059 104964 51158 -30067 -44130 -15636
13457 -15636 -83904 -199664 -212934 -140894 -136975 -153109 -65655 -58641 -74172 -71756 -54297 -52305
13445 -52305 -68585 -72440 -47972 849 -14701 967 26753 -101250 -136487 -106479 -73299 -27042
13433 -27042 36475 6407 -71095 -56392 12838 30917 -40477 -95887 -50835 71805 96749
13422 96749 11325 36580 83810 91223 144912 140610 82852 52671 101324 138653 192670 247335
13410 247335 289886 145095 55692 -9792 -44620 -75414 -94062 -540 13360 -5348 31582
13399 31582 42069 148162 152499 100928 -20166 -72421 -50752 30132 140001 164465 82719
13388 82719 -18819 -7337 34063 -13889 -114190 -166588 -180706 -207584 -111041 -45885 24814
13377 24814 66043 -1649 36313 -29061 -133137 567 40879 -13215 -44231 -10771 20455
13366 20455 26515 67072 63445 28559 106140 236069 350160 522024 640657 723599 740688
13355 740688 697958 562084 430004 379028 220668 22676 -129161 -119163 -85602 -15615 -39472
13344 -39472 -21603 10544 41944 67712 -3445 3418 -15121 -151705 -228870 -214674 -173659 -51146
13332 -51146 67217 71018 98831 157134 99474 65521 17836 -52700 -42035 110895 110392 170992
13320 170992 95223 52397 68628 97290 153703 173579 76293 110127 57200 -115332 -134200
13309 -134200 -140635 -226009 -181234 -94057 -166662 -156927 -108816 -29551 -70205 -33162 -11203 -8261
13297 -8261 -63587 -24052 49952 76426 60803 -83911 -152138 -78297 -3739 -5198 -69839 -86360
13285 -86360 -32550 8413 23775 84681 127982 174224 98324 54801 -11690 -69103 9419 73053
13273 73053 49191 9302 23150 129005 165758 173043 145660 168150 99496 64226 148086 67229
13261 67229 -30541 -74888 -168551 -240752 -187911 -48679 31690 43501 4989 -19800 10255
13250 10255 133747 70688 3783 135428 111237 110317 76451 81905 103176 98528 79249 -14795
13238 -14795 35591 54446 49976 67152 90905 131396 94116 66957 85059 163257 143074 121883
13226 121883 78918 33056 16990 100767 191326 189213 129746 124171 100511 5223 -58943 -30037
13214 -30037 -19474 69733 168258 144891 109089 6839 44380 -35771 -127920 -168304 -46076
13203 -46076 43007 71986 124693 140896 89924 62120 9159 -100605 -159964 -66434 76435
13192 76435 162718 65309 19744 53013 34117 2056 -47091 -111325 -58842 99985 135923
13181 135923 149428 185518 238199 280141 405044 466761 437646 412681 520288 854911 1258438
13170 1258438 1737318 2218020 2678796 2740600 2504144 2073436 1532617 1167545 1013184 809870
13160 809870 648921 479609 406677 248490 261649 242400 257799 326713 266137 210895 250610
13149 250610 330194 361170 311302 217982 151203 37802 50990 108897 115690 102551 84226
13138 84226 96752 171823 204751 244928 284735 337241 281818 234472 214429 225848 214980 157189
13126 157189 102422 104862 124690 88907 71190 203359 343339 378306 409022 641163 963060
13115 963060 1194620 1189793 1000418 736902 463331 405116 283655 356932 371486 297946 358792
13104 358792 264660 178103 106944 15439 -39760 -3884 68218 199313 288319 259809 202317
13093 202317 151438 100019 125251 230577 149647 62899 88651 86528 78073 77225 169689 210052
13081 210052 240922 147317 57901 65077 27475 3165 -9763 -39749 -50053 25516 158218
13070 158218 112577 115740 138785 77344 10515 62817 80186 -28518 -104948 -66912 70939
13059 70939 180824 235452 229487 254529 232008 151169 124411 162026 255619 179811 153322 202752
13047 202752 169097 194060 206259 105698 156922 216451 283877 255922 117627 44700 63586
13036 63586 53560 20039 -29089 91338 136635 171520 169381 90127 2061 1706 -61414 -66318
13024 -66318 27014 39396 68457 56434 109992 173398 186074 233716 130666 134775 250315
13013 250315 314225 296552 251440 185883 143343 179343 188227 272377 193817 114083 167078 222046
13001 222046 184097 285390 322481 283553 186918 155798 129333 252044 282155 272534 186302
12990 186302 132024 101677 30734 5629 -16931 28584 76607 54263 91830 59199 49373 88685
12978 88685 83449 198933 283597 331167 382059 375333 412622 428080 340989 286135 299496 295860
12966 295860 405451 468212 532731 520954 495479 421731 480076 647125 608331 630663 624291
12955 624291 650773 648469 654371 593989 481742 351930 295564 306844 220108 177333 226766
12944 226766 301540 258871 200454 134267 55678 105529 143098 193270 173830 204774 266898
12933 266898 277464 308689 315877 278380 352030 332794 377306 376208 398730 390835 414257 367069
12921 367069 336865 258239 275717 239874 162876 195639 281442 415006 478348 459162 379240
12910 379240 356722 335572 365604 455831 438988 404914 417104 449445 559476 692513 705050
12899 705050 619085 537106 575400 682043 813614 984320 1141632 1207784 1292259 1577192
12889 1577192 1900169 2369085 2749649 3016705 2937097 2546283 2037422 1617810 1215810 1053420
12879 1053420 951281 728347 642804 580048 585309 675150 748684 668363 636293 565943 448344
12868 448344 554067 540268 523569 468487 428668 446024 476304 586103 682216 713865 745794
12857 745794 718676 736342 797312 803309 799683 866881 822019 755575 680477 657202 616429 620127
12845 620127 630622 739604 845780 882767 901722 950588 1026990 1041836 986774 905220 796811
12834 796811 757143 693587 671564 733452 860651 971090 1060440 1145223 1182533 1286418 1420188
12823 1420188 1395476 1347241 1169758 1075734 933979 866878 875038 898447 907802 847003 789801
12812 789801 852069 966677 1101413 1151152 1049702 973043 890305 949162 951568 939378 950405
12801 950405 942886 993855 1103995 1144932 1185853 1188599 1186717 1227474 1292517 1274456 1296637 1313767
12789 1313767 1219236 1223354 1321584 1356404 1254136 1315042 1364773 1350806 1407801 1373943 1407809
12778 1407809 1389209 1388824 1387373 1398407 1594621 1734512 1747001 1849530 1932906 2035841 2053346
12767 2053346 2023967 2034694 2107734 2160979 2079511 2197485 2274559 2163856 2243212 2323048 2454770
12756 2454770 2455493 2482505 2530981 2631164 2755708 2885142 3020374 3134034 3231280 3284662 3381309
12745 3381309 3492591 3663389 3853362 4043307 4223626 4365073 4483233 4695443 5113625
12736 5113625 5451550 5727744 6294891 6896772 7423872 8001446 8426229 8789944 9304798
12727 9304798 10064390 10990123 12022727 13316040 15086810 17263584 19951865 23330540
12719 23330540 27406549 32251212 38161212 45736414 56126424 70690221 91154202 119829797
12711 119829797 160536999 218066725 297452684 397001256 487627534 518339083 473976504
12704 473976504 383481512 287755839 212220789 159297725 123143350 98152845 80446051
12697 80446051 67589927 58318614 51695954 46653339 42511259 38870438 35680180 32876880
12689 32876880 30538576 28550050 26822041 25391571 24156073 23201140 22455044 21666432
12681 21666432 21032569 20492570 20115143 19801972 19479190 19149066 19027426 18959010 18902639 18890709
12671 18890709 19054851 19166239 19057508 18634015 18051092 17188565 16282291 15405759 14557453
12662 14557453 13749162 13043988 12306564 11545362 10955852 10374486 9928867 9558146 9001793
12653 9001793 8513671 8108715 7692974 7365379 7046974 6634720 6253797 5954085 5692222
12644 5692222 5444119 5224511 5079591 4845319 4522439 4211608 4035811 3944917 3749125 3504293
12634 3504293 3465473 3423167 3187844 3013694 2939888 2852306 2763521 2683307 2521869 2335934
12624 2335934 2252460 2189285 2040740 1938923 1916996 1882990 1800937 1708305 1520499 1298949
12614 1298949 1153716 1116835 1105548 1126496 1117191 1067718 1025131 901321 930554 1002733 962457
12603 962457 940245 977827 989971 915745 921956 882597 884241 931873 941859 892047 874469 836909
12591 836909 845487 879447 853597 892565 908448 1002446 1191339 1184369 1238636 1303692 1181203
12580 1181203 1178230 1145588 941575 649069 376457 146824 -64738 -70251 -5857 35517 101363
12569 101363 96617 -18022 -66536 -114390 17083 149922 104010 51104 5419 -52779 8312
12558 8312 61793 72201 149670 111150 6697 -28690 101163 194281 182438 271761 304496
12547 304496 245773 261107 180105 215340 256796 323301 319863 291536 292755 359646 346739 272806
12535 272806 311011 342525 352206 386883 371703 357868 354202 296197 286779 299450 265816 306114
12523 306114 373245 408719 453570 463774 381759 265950 159823 147040 246054 220693 240657
12512 240657 258259 193940 98500 130038 248700 305140 325123 360105 333590 325159 300584
12501 300584 272036 241127 299293 248522 233255 161638 165454 241638 286862 266502 247478 34155
12489 34155 -29195 -112824 -109011 -70600 21561 132088 151150 187962 140791 39190 111773
12478 111773 172478 48421 -16303 39921 66899 120749 193490 58700 -7796 19933 113227
12467 113227 82846 109960 142428 174439 123337 53706 62572 73389 41982 -17488 -76932 -35756
12455 -35756 -35401 -62898 63595 120803 102226 48655 -42352 17033 27772 6860 -3361 50538
12443 50538 128483 150329 198338 108889 -64288 -105010 -49301 30975 -26657 -77165 10763
12432 10763 226 -43591 16218 -23580 -54667 -72555 -18521 6666 46335 11649 -7382 4484
12420 4484 31249 87756 105216 70734 -17787 -85800 -38228 85147 232574 175278 52631
12409 52631 -78018 -36159 -27245 15233 32855 21260 -37739 -78682 -91276 -98742 -127540 -122471
12397 -122471 -53924 -66660 -47416 51032 42534 -50426 -11965 127741 177340 116632 65103
12386 65103 147740 211418 189272 130844 126913 157950 249421 246348 259929 231687 183008 155839
12374 155839 168262 222705 200446 146425 93167 148633 245788 266078 194908 16965 -126124
12363 -126124 -167683 -84629 -36997 53511 60702 -10162 6327 54006 99300 111510 41409 -22108
12351 -22108 -25366 -10003 -28748 73113 116674 108022 126161 80592 -5847 1812 9028 -142933
12339 -142933 -161045 -77013 -104484 -21312 9714 40478 100539 89950 61576 36703 77952
12328 77952 75203 7594 -21034 -113304 -219525 -223462 -137834 -72315 -90189 -47663 -4217 -125798
12316 -125798 -193711 -160260 -134503 -134968 -84423 -103102 -247062 -202083 -78232 -69985 -18680 74171
12304 74171 64104 -30918 -53713 -3436 -55259 -79369 -22180 -40264 22654 5127 41196 74746
12292 74746 78593 78283 116438 121622 104007 86103 49106 72917 82654 -55293 -152308 -132440
12280 -132440 -121048 -69790 -15747 46411 28467 54900 95830 125063 4605 -45793 -67822
12269 -67822 -58985 11589 39679 46717 53587 23110 -36019 -72406 -19605 -52641 23723 95892
12257 95892 164410 228122 265340 154249 79303 63347 188430 173608 144272 196429 240170
12246 240170 268598 437668 601350 718225 974162 1359217 1781049 2213933 2617016 2670907
12236 2670907 2443706 1912442 1456227 1190087 841076 577017 362917 299745 306367 162921
12226 162921 145596 147542 177509 258229 292439 212843 342415 304835 208161 169006 154865
12215 154865 189019 182090 176136 144457 55797 152977 184952 154559 91863 133331 234899 245013
12203 245013 133639 153576 194229 183250 158646 148717 117200 30947 27224 55944 -23695 -125008
12191 -125008 -91320 -31391 -36799 -4243 -61732 -188334 -191018 -21194 76318 148273 87715
12180 87715 86936 147836 122784 149004 94037 130432 91662 17060 -100185 -68681 31690 50100
12168 50100 -71308 -191665 -176978 6263 83116 9681 57917 36434 -20970 66923 76363
12157 76363 -1816 -40562 -103347 -62420 6357 56940 19334 -3296 5371 -19838 54348 143482
12145 143482 25952 -23521 57785 25394 -41720 55210 104500 109912 -7132 -65871 -9536
12134 -9536 40742 52503 -16817 -60998 -10824 29132 -10593 -11765 65067 29566 -28450 -45541
12122 -45541 -170323 -254625 -154611 -92546 -178165 -121353 -50483 -48203 -69886 -116342 -22069
12111 -22069 52515 -15192 -24939 -56226 -36736 -153023 -122117 -25431 -56253 19080 61674 28084
12099 28084 52421 -84232 -116420 10387 114857 39750 -24583 -58551 -57242 -946 5284
12088 5284 -3755 30405 -44397 -14028 -39137 50827 57949 8813 11366 -20317 -9350 51147
12076 51147 79841 25085 4418 28251 65268 16443 10370 -8108 -127045 -186373 -225019 -182562
12064 -182562 -6720 27975 88767 104280 45058 28138 -20779 2792 -24413 -24350 -19994 -20396
12052 -20396 30151 32492 65185 -207 -96006 -154483 -86739 -30793 -2343 -37872 -69510 -34571
12040 -34571 -625 -60591 -119577 -229910 -233933 -175425 -150208 -109071 -116936 -113747 -105454 6269
12028 6269 19725 -83573 -109882 51993 86469 9506 -3338 -51837 5013 108190 108090 79151
12016 79151 160720 88337 50565 11025 -99964 -79040 -42326 -20720 20317 126869 10924
12005 10924 -8887 -31845 -43139 9969 -1664 -74843 -101195 -139204 -152714 -97200 -14928 -3202
11993 -3202 73651 55569 -14264 35592 36232 23190 43417 -22513 -33525 -26091 -27424 21925 81177
11980 81177 70271 39350 42578 6993 -78511 -125582 -134086 -63046 -10720 19553 -20267 -11054
11968 -11054 50705 64639 59577 115694 121876 86684 68866 24378 -103913 -72851 22098 68857
11956 68857 23386 95351 30638 45850 179948 223261 280033 311389 341873 342897 258808 166775
11944 166775 186455 238483 260811 227717 152995 6418 40200 91480 131117 106489 174385
11933 174385 133974 135235 105945 135488 137463 147579 171401 127591 -22339 -120977 -108346 -29315
11921 -29315 -1189 -521 66867 86309 -11235 -115146 -190092 -173754 -74924 7897 75204 190299
11909 190299 250241 195487 80936 118678 122470 140707 176844 154787 147877 119933 59291 111719
11897 111719 220490 240547 250105 212517 187572 204469 214746 130410 110891 150778 87785
11886 87785 -3589 16180 2247 -119297 -158707 -190307 -109245 -48687 -62467 -113781 -75726
11875 -75726 -6900 89649 81215 -64237 -84764 -31443 -55316 5463 16100 74656 46973 -2238
11863 -2238 27703 -51722 -156565 -125696 -78662 -57327 -36880 -165022 -198449 -138883 18244
11852 18244 70016 107698 84392 -20434 -85485 -66843 -97112 -110233 -90893 -104647 -128889
11841 -128889 -101301 -27469 44930 89440 21129 -31831 8627 -30902 -62718 -67051 66213
11830 66213 -5383 -94597 -88786 40560 -5361 9470 -50399 -20093 -22576 -107752 -41211 -4819
11818 -4819 -29583 102304 197125 140545 3070 -41108 -33854 68964 121507 124888 -28248
11807 -28248 -17800 -50082 23308 164830 156934 123208 95899 81590 282763 563215 932901
11796 932901 1179190 1619803 2296347 2980786 3162818 2835825 2244404 1608766 1182435 914607
11786 914607 773465 538786 421751 290471 249674 222783 230111 207799 274323 244499 165846
11775 165846 198034 153851 64599 89031 169930 171582 74106 -30237 -513 -18797 -22289 22825
11763 22825 73582 7160 12246 30413 117503 162590 180660 221940 215215 170204 54958 16598
11751 16598 141620 50085 45223 47861 26078 4747 78645 46581 17308 30722 10741 -34343
11739 -34343 -14639 10696 -29894 87623 112962 132227 100939 101527 121392 108331 86805 17719
11727 17719 -20948 -6019 61898 33179 -18627 1498 41490 33336 114755 187392 272396 272104
11715 272104 310218 267776 358081 587802 808902 785974 631599 569327 533847 480235 378557
11704 378557 300311 246981 175137 175266 251262 259146 182197 62143 -18559 12234 92461 47476
11692 47476 -38191 -71137 12136 43560 77893 103587 227460 216283 131378 58395 16962
11681 16962 1803 6318 -71 -82087 14849 93198 -39483 -176237 -73787 5607 61132
11670 61132 62229 59693 11315 -74580 -122952 -89573 -130322 -72125 -9845 -101842 -127686 -89741
11658 -89741 -50353 22491 17539 -8969 14140 71523 11643 -31503 -14694 5549 21606 47226
11646 47226 -52088 -22076 -28079 -14662 17440 28320 11467 39142 40258 39571 -59653 -99525
11634 -99525 -82496 -90384 -38690 -27497 -13578 34392 18308 -72807 -21961 15646 -2377 -172965
11622 -172965 -190718 -157726 -138848 -136781 -81552 30815 34999 -62196 -81458 -16428 -56375 -188206
11610 -188206 -224914 -169702 -108703 -117180 -153300 -211027 -236136 -133992 29282 87791 49267
11599 49267 30401 -9913 -26020 -9073 34805 -95698 -182540 -166665 -122450 -116625 -103241 -73059
11587 -73059 -113336 -89267 -126041 -58805 -74867 -134087 -116763 -108074 -98124 -45622 -60960 -59542
11575 -59542 -43712 52593 93001 30350 68444 73476 127928 190336 197251 101710 50623 100883
11563 100883 90539 92631 73189 70593 97552 57268 76990 39059 15610 -5857 52681 30746
11551 30746 -19497 41358 44940 -66556 -111006 -87515 -24952 81231 133926 110501 102254 59110
11539 59110 3338 -21421 100035 66679 7268 -97753 -204785 -102868 -6917 51421 81128
11528 81128 84657 1785 -34385 23155 41301 30745 -52937 -117138 -111611 -6775 75281 149947
11516 149947 127307 13349 -92387 -145000 -52560 -33107 -33755 -28304 -86458 -151580 -168022 -115444
11504 -115444 -54834 28485 107419 26759 -55431 -128685 -181367 -144541 -72754 33222 17292
11493 17292 -146233 -195650 -145776 -49887 -15709 46148 113743 104612 109233 39395 -34879 34049
11481 34049 6562 5990 -20138 37557 -9223 -102295 -151929 -137137 -70849 -83807 -59295 -109828
11469 -109828 -36763 33002 117482 81378 -10035 -1673 99689 68604 65188 -32092 -65310 -21773
11457 -21773 28693 -77383 -24309 83424 137502 125004 184421 189226 162036 108347 31660
11446 31660 -3640 121196 77338 -17563 -133534 -113595 -156104 -166017 -76923 -40347 44671
11435 44671 49282 29280 64779 84443 119011 111451 47280 40663 -40852 -79255 -58938 -19139
11423 -19139 30689 173843 199522 97633 63177 95545 75650 64184 -21512 -161583 -145064
11412 -145064 -146330 -42762 -29674 12897 60319 195631 120474 1410 -26179 32377 98841
11401 98841 94743 100337 -57037 -48163 82877 121118 59668 2962 -13919 -103208 -146370 -107483
11389 -107483 -114006 -134404 -136883 -71426 29367 735 -63080 -17249 21576 38657 89880 26518
11377 26518 39859 -51537 -114556 -103943 -101146 -87288 -14199 -67926 -84000 40898 78285 959
11365 959 -15800 -19137 -15794 -99337 -147124 -47230 -41027 -83786 -252046 -238496 -107041 -19813
11353 -19813 -36036 -7199 -58175 -150935 -204668 -112423 -15756 61912 44749 3063 -9633 -43311
11341 -43311 -132559 -52739 34820 -2509 -54316 83666 117664 60431 5553 35924 67442
11330 67442 11839 21411 91404 75312 80734 80044 42681 127228 171843 129003 107234 171284
11318 171284 125106 38910 55847 60887 67591 -30274 -787 17802 37397 -10234 -16605 65387
11306 65387 105352 112811 75152 51496 -4902 -128531 -87424 -113357 -132460 -122808 6815 88543
11294 88543 64366 23586 53041 62593 27067 -5697 -21421 3851 103755 83400 -15284 -105632
11282 -105632 -107622 -123792 -151607 -27943 26189 37322 36997 -88303 -150555 -137199 -87122 -51460
11270 -51460 2874 16876 7392 151023 84400 37790 185787 276847 413729 512559 692806
11259 692806 902580 1027952 1044207 895916 627123 313257 193261 220454 205672 138895
11249 138895 130036 177928 132148 52187 -23432 69503 95026 2979 32327 121087 129162 78906
11237 78906 662 -129331 -170035 -51577 6639 -14440 -7318 -55288 -90513 -143878 -94501
11226 -94501 -58209 -18234 -23962 76034 96704 140923 135235 123650 73971 48488 117579 163648
11214 163648 83890 48063 82869 32388 6339 76726 58346 60153 139531 189846 42123
11203 42123 -40303 -72410 -68366 -21886 -14798 96230 145250 92476 3825 -36897 -70361 -88242
11191 -88242 -25240 6546 76087 30613 72751 29864 107089 132884 22600 -69152 -52050
11180 -52050 -81499 -124606 -174130 -294906 -281517 -168486 -144983 -144640 -97974 -57453 -51891 -96933
11168 -96933 -62042 -19311 16103 -34455 -66326 14401 -63147 -120282 -72761 -27176 -28246 -129420
11156 -129420 -166644 -156472 -151588 -125751 -30203 -65466 -131477 -153018 -124147 -217712 -236365 -139349
11144 -139349 -79077 -80085 -105476 -106460 -106375 -219460 -272137 -134451 -173218 -167279 -16629 -101081
11132 -101081 -196824 -240494 -205642 -219566 -129908 -60992 -101169 -60423 15071 -54036 3478
11121 3478 -57654 -42157 16282 16515 -61885 -129480 -126845 -48189 -10348 -15373 -11464 -59495 7688
11108 7688 109697 -17395 -49109 -50207 -63004 -147659 -236216 -128042 33358 59743 -11029
11097 -11029 -122606 -132114 -127063 -157927 -174302 -99392 -112814 -139468 -128285 -79377 -77032 -134985
11085 -134985 -164978 -69169 9689 22202 118947 83186 -34089 -39969 45813 13794 -81697
11074 -81697 -67078 -83161 50483 115157 127633 68750 215450 257597 193839 154283 78751
11063 78751 -28234 -109268 -163629 -113153 -95757 -50071 -13892 -28696 -52639 -139449 -81967
11052 -81967 -41248 -26324 -78733 -32550 39357 80187 62431 -114243 -271379 -226178 -139937
11041 -139937 -49611 34846 24234 -37393 -22769 -73344 -62688 -138655 -125553 -84950 27773
11030 27773 -7020 -88340 -65409 -26397 -25364 -67923 -45955 17146 85439 62170 5643 58272
11018 58272 83065 7970 1391 28777 61356 71713 46614 140436 -41717 -72970 -1377 -23182
11006 -23182 -41157 -50069 -40779 -78337 -71092 -16046 -48713 -24639 -54913 -82420 -96455 -117930
10994 -117930 -98710 -101701 -99525 -39536 9269 -61923 -116073 -88413 -80001 71378 48601 -92842
10982 -92842 -134505 -69894 10236 -72033 -85507 -45480 -60569 -39738 -19475 -43285 -16133 34340
10970 34340 108082 153125 119750 121362 21754 -56729 -85166 -54998 17017 -52772 -83160 -164647
10958 -164647 -160691 -115032 -67897 -61762 -79406 -89370 -85280 -98378 -87529 -83833 -77760 -116940 -85969
10945 -85969 -103490 -96499 -194318 -192060 -146238 -69654 -60450 -90284 5061 8528 -99219 -169850
10933 -169850 -228723 -264897 -195503 -72459 -118191 -79535 -76345 42323 64494 44506 10920
10922 10920 -19650 -23236 -53952 27096 54987 27281 101011 137594 166629 150699 103938 92685
10910 92685 49401 39628 34761 -110094 -127037 -82124 -58788 -60713 -42091 -40783 -65200 -99835
10898 -99835 3203 -33910 -79421 -68819 -46552 -79910 -10627 27048 71555 14028 -13268
10887 -13268 -87112 -214826 -192055 -161575 -202436 -141580 -148090 -152412 -62080 16294 100319 85953
10875 85953 42906 21275 -82423 -144490 -74458 -92078 -105223 -178555 -202675 -188602 -290121
10864 -290121 -228943 -159222 -123947 -100610 -17148 23023 12807 46167 143361 89698 94717 119461
10852 119461 93928 193652 289492 199875 64883 -126380 -140268 -60431 -77440 16827 138645
10841 138645 150586 30657 -20128 -27265 -39613 -28507 -10813 86160 -5294 -1533 -9482 4776
10829 4776 -19927 -110619 -172348 -148890 -62611 28759 18032 4049 -93540 -167202 -82956 -60157
10817 -60157 -136381 -171991 -101736 -74206 -63629 -7392 65354 68300 36901 63937 -8712 -60736
10805 -60736 -97341 -161130 -66664 3574 -21587 -35136 70076 108402 33646 -127452 -234719
10794 -234719 -212780 -63529 73914 110580 -71617 -200083 -179299 -58930 65121 121126
10784 121126 172696 164343 215371 131223 117298 170979 138236 116425 -19976 -5519 80269
10773 80269 56741 19712 42278 96321 76146 60618 90206 43688 61902 93753 68556 -52619
10761 -52619 -38452 3543 63636 115044 177454 171257 117393 41318 8428 22401 47323 79298
10749 79298 -13313 -20962 -62267 -100797 -79574 -132336 -105278 -50732 -47577 -62632 -71244 -122750
10737 -122750 -183605 -173049 -216012 -196319 -73400 -58807 -82315 -20180 89537 51458 8285
10726 8285 -15388 -5842 19683 55347 102325 37928 -40781 -55795 -34162 38074 111634 104082
10714 104082 79780 -29482 -93617 -120665 -36731 -23387 -3108 -71768 -91425 -100122 -106836 -117918
10702 -117918 -146991 -169699 -153783 -112923 -123968 -21297 25877 12740 13865 -41003 38742
10691 38742 60456 17558 55550 120423 60504 21560 26407 58643 29984 66194 26575 -80251
10679 -80251 -143685 -138957 -122878 -121150 -91241 -59986 -66934 46538 58332 10177 19108 30983
10667 30983 49360 32574 -2220 -7472 -123697 -188292 -211603 -252522 -205384 -189076 -91566 -154498
10655 -154498 -219090 -291047 -225184 -148407 -111734 -104833 -49530 12598 -2630 32973 82199 68416
10643 68416 264892 264247 164884 72504 -47939 -42960 -21867 -14054 -63570 -113943 -58215 51392
10631 51392 111514 100057 93579 56220 -15369 -19739 41693 -73352 -205250 -232941 -199941 -106209
10619 -106209 -56605 -12305 -37201 -55087 -26160 6478 -115811 -140950 -93803 -13791 -66370
10608 -66370 -98190 -61340 21542 -18529 -86057 -83331 -187455 -216042 -191425 -159837 -107272 -95888
10596 -95888 -142499 -163364 -24085 -25606 -86407 -66114 -75661 -5040 33642 29812 43288 -34106
10584 -34106 -120666 -150239 -153055 -149574 -106084 -55258 -43073 -5342 86929 138699 72147 9444
10572 9444 82901 193958 119770 -23202 -47084 -7711 25172 -10298 -64968 -52906 -28199
10561 -28199 -36000 -28911 -57232 -59273 -33058 23197 10556 47426 49579 129457 103036 48291
10549 48291 114905 14226 -38114 -112490 -191337 -95026 -57894 25201 55855 2909 66382
10538 66382 63931 34098 44801 87454 31034 -42039 -96770 -42301 50586 39479 -67473 -144596
10526 -144596 -137587 -215443 -254182 -181761 -102715 -71514 -36685 -43983 51745 54204 -30798 2602
10514 2602 29256 81432 78688 55380 46457 -13516 -90496 -42365 -96629 -150612 -179113 -114492
10502 -114492 -88404 -118596 -132007 -193902 -181279 -158078 -99825 -62944 -19589 64824 -5044
10491 -5044 -28491 42180 72944 -48728 -118876 -86813 4446 83142 34604 -25697 4888 -13677
10479 -13677 -93620 -73732 -16290 145860 14487 -47399 2208 68478 57569 766 -127981
10468 -127981 -176364 -91164 -52279 -108754 -108541 -63508 -21861 -64689 -89608 -26057 3272 136677
10456 136677 144290 -23477 14971 43607 -17088 -128294 -126203 -47293 -40579 -33508 15028 -156256
10444 -156256 -136554 -47616 -40385 -85347 -52275 -11650 40190 86715 39474 20862 58724 -2728
10432 -2728 -88193 -44219 34023 42659 58742 14925 17954 -58633 -114800 -125325 -117634 -31125
10420 -31125 -40675 -77967 49497 -17894 -101398 -86716 -51927 -59760 -90497 -85189 -19973 -49506
10408 -49506 -218165 -227255 -196020 -238029 -143213 -143005 -107000 -59520 -241162 -310826 -243360 -154867
10396 -154867 -158294 -101172 -135056 -114862 -17350 -18401 46431 93487 54911 56035 -17638 -45880
10384 -45880 -113287 -172886 -180278 -74881 29191 32501 18625 -22452 -68913 -167793 -217045 -154516
10372 -154516 -62177 -23714 -68282 -79045 -74832 -31372 -89728 -127858 -134437 -27835 -39671 -146900
10360 -146900 -123126 -15607 1859 -44278 -82394 -85948 -45636 -104791 -118306 -75360 21464
10349 21464 17454 -31210 -104317 -126054 -40883 -106207 -31189 70809 76467 34424 -19319 38898
10337 38898 -10831 -12898 -84888 -129775 -138659 -107444 -59384 65220 97718 1766 -31023 -72450
10325 -72450 -44082 -23329 -52692 -53342 41329 51576 -3941 -53094 -46434 -58812 -131328 -28167
10313 -28167 -17318 -25997 -88781 -123309 -128346 -87620 -92338 -19159 -32539 -34870 24522 -13817
10301 -13817 -30007 26409 43265 96633 123577 58429 79635 58165 63262 29028 23625 -18770
10289 -18770 -154001 -150112 22395 66725 -26821 -114595 -101655 18186 57495 14366 -10677
10278 -10677 11001 -98918 -163745 -132452 -36895 -14431 26576 84486 -7018 -98968 -101653 -44070
10266 -44070 -41540 -84886 -100664 -41333 44753 40732 -1429 -31341 -44561 -68944 69217 90153
10254 90153 97536 40645 -17670 32740 67065 107611 177812 167354 112064 22797 -33391 -1561
10242 -1561 -5262 -32553 -50540 64682 159382 127453 84387 86990 106441 52018 -3524 -83489
10230 -83489 -39911 13637 -71344 -76128 -30481 67721 79487 -44670 -58415 71656 179036
10219 179036 140194 65833 -8115 47637 17294 -4670 -41384 -52753 -145034 -91090 -8376
10208 -8376 38953 10603 -96525 -107910 -132659 -61971 11939 15484 -9777 27866 20881 -13535
10196 -13535 13368 80309 50549 51127 -28688 -105365 -184506 -226053 -210670 -156807 -27858 111118
10184 111118 214480 237415 208202 218585 190893 94194 108604 121847 130502 177272 157877
10173 157877 129940 46192 -979 -144561 -191484 -165538 -117790 -24555 59314 123285 144075
10162 144075 31781 -31419 -11560 -23685 -88025 -46242 50393 83931 29095 34258 57460
10151 57460 -95761 -143539 -105768 629 53911 93043 44892 -83032 -49788 60663 770
10140 770 -171450 -148797 -36077 33280 2495 -37189 -31862 87987 174271 99568 4318 -19022
10128 -19022 26510 75692 91193 97631 109833 126647 109208 118964 128470 132442 106735 117494
10116 117494 115595 109087 152801 120017 58173 125636 132957 101714 -27640 -9083 -1974 13806
10104 13806 17862 101423 241461 248125 181175 149469 158586 140453 194330 208160 180935 144354
10092 144354 134971 74625 52561 44872 16272 11600 36099 2183 102465 103875 58646 64595
10080 64595 99162 233175 416666 553221 557714 494437 462254 498259 555887 647160 721694
10069 721694 741159 765386 840598 907139 1165158 1429700 1666477 2008799 2529119 3048887
10059 3048887 3835982 5081248 6979244 9659598 13627628 19517286 26628859 30809979
10051 30809979 29253829 23598100 16974382 11843869 8493622 6379558 4896865 4000460
10043 4000460 3384648 2851671 2510796 2296547 2150373 1955001 1806760 1728629 1659851 1548177
10033 1548177 1417315 1321847 1200858 1141130 1172790 1212708 1170083 1052449 1006059 941143 860219
10022 860219 882801 883565 805003 820974 908181 927977 951602 896998 861013 834710 755939 743760
10010 743760 727063 694303 602089 517091 560486 679480 747527 699636 657730 604159 493101
9999 493101 396208 328415 327215 341640 392864 226308 199859 238849 207373 135840 89761 46586
9987 46586 76682 154802 265694 293149 304672 377152 326132 201699 31838 31906 102967 170042
9975 170042 198496 113002 22541 -58536 -41212 85464 170935 103774 120210 120245 77402 79989
9963 79989 49457 93688 159080 26706 -86643 -106946 -78637 -33897 13466 173489 144654
9952 144654 16663 -71772 16742 123669 105606 26184 -84804 -120885 -56523 -77020 -121398
9941 -121398 -117292 -123107 -145034 -153007 -89416 -13389 54486 86503 29113 -1748 -83318 -117580
9929 -117580 -101954 4205 16094 88785 158199 172728 141142 23106 -3583 -32799 -17066
9918 -17066 -2656 -66262 32128 60869 72485 136422 181469 222368 177831 31752 -58886 -61814
9906 -61814 -67873 13803 90137 59805 -61402 -133760 -124516 -61819 4892 66259 103742 85551
9894 85551 11347 -51232 -60686 -76270 -119987 -107371 -68401 -54478 -127863 -110509 -84145 -43100
9882 -43100 -337 2416 7352 82543 12577 -25096 -77995 -56879 -15338 -4707 39400 -2437
9870 -2437 -50388 -132272 -211851 -203227 -129862 -2904 63321 -25228 -102472 -68533 -147 72907
9858 72907 96346 72554 -11237 -42281 -90307 -4207 55313 43348 86110 132275 -470 -110147
9846 -110147 -92351 -134146 -84142 -152183 -192322 -160162 -78189 -39736 -4248 -74357 -214020
9835 -214020 -141665 -73345 -101961 -12801 -39538 -69793 -97351 -205496 -265337 -262042 -183210 -61902
9823 -61902 -58021 -66016 -69488 -59735 15599 80 70698 3688 -99113 -128658 -121636 -147839 -171126
9810 -171126 -90781 3979 -756 -44684 -104655 -42435 -64043 -69229 -8443 71138 30698 -99471
9798 -99471 -216344 -200942 -224355 -151766 51274 35125 -47693 -59326 -49239 65530 60367
9787 60367 12096 29758 30594 13164 -25227 -123886 -205000 -142888 -63580 -16715 -13335 -24718
9775 -24718 3336 70202 32321 -19870 -88547 -98697 -4922 63440 -29244 -117533 -179417 -139996
9763 -139996 -99399 -55736 -193024 -274418 -254673 -187611 -83646 -101418 -33521 -26274 65052
9752 65052 71229 -55266 -178901 -104590 -113778 -57967 24645 37123 73988 95378 55957 46832
9740 46832 85978 50872 18785 64227 64853 51488 83308 15801 23155 -7833 -107017 -132666
9728 -132666 -82724 -2284 -27067 58038 100190 61611 6767 -20976 5422 -30395 -23207 99861
9716 99861 171835 140121 50866 -12487 16323 24796 47113 84916 167564 168507 107307 99811 75976
9703 75976 -7594 -49187 60769 151921 189174 152710 123301 79299 36418 61280 -16151 -90679
9691 -90679 -118640 -192145 -144706 -123787 -140018 -115148 -88806 15398 16821 32422 -30130 -106774
9679 -106774 -94639 -91 113071 152226 65581 7848 73031 38941 -1537 -821 7961 22688
9667 22688 42863 54970 77033 44943 -71662 -76389 -23157 -51251 -65911 -131024 -222751 -144260
9655 -144260 -6811 44496 -659 -18800 23660 88756 111053 115108 32997 126478 113161 33771
9643 33771 118229 82392 64119 64178 80278 2484 -69262 -86524 -185133 -198828 -187307 -120015
9631 -120015 -109354 -107526 -74237 -41298 -25693 -59474 -71263 -174712 -165949 -81675 -105309 -121033
9619 -121033 -20520 59489 49564 9621 -13070 -22714 -39051 -99242 -6520 41718 -35142 -129789
9607 -129789 -38021 83110 49940 -1824 -67946 -135038 -165233 -157657 -75744 -83169 -204174 -169664
9595 -169664 -92057 -149589 -205009 -219755 -177983 -53267 29264 18403 -20214 -17719 -57640 36097
9583 36097 86082 28612 -29901 73213 75016 18676 -64832 -5684 50611 79958 57527 19465
9571 19465 26901 28161 77014 153171 193460 141436 2161 -65110 -84905 -111636 -82446 21974
9559 21974 117228 122405 -46464 -68681 48926 179505 235536 142706 2830 -59158 -18927
9548 -18927 15556 -16802 -84894 -105932 -87143 -59702 -71317 -111561 -80585 -28531 -49502 19487
9536 19487 41567 -54014 -52382 -43063 -9463 -6401 143281 173364 65989 -52609 -157239 -166626
9524 -166626 -119213 -104919 -51463 -87070 -102127 -119815 6750 -47925 -83257 11446 33099
9513 33099 60365 123882 92675 87127 4582 -21345 39992 134359 112377 62199 44626 54388
9501 54388 10170 7248 85383 70150 -28346 7588 35746 -10912 -33891 -49321 -48546 -56770 20797
9488 20797 166684 196599 207089 220384 122754 63651 56267 49184 63424 95114 67085 -73341
9476 -73341 -107172 -92741 -94953 -18021 1695 -10162 -32720 41680 88338 57637 -1092 -37803
9464 -37803 12999 17114 53309 67689 20221 -44039 -87057 -105448 -109753 -75123 24330 105389
9452 105389 103255 40776 -70881 8741 -62400 -102744 -150126 -215037 -87694 -1403 1855 30266
9440 30266 155877 46125 -62724 -11883 1893 60735 50674 1255 -54527 -25286 -75715
9429 -75715 -82503 -86851 -72034 -1908 12931 53900 149923 138373 94703 14902 70325 47475
9417 47475 -24462 66058 197884 277581 98610 -95765 -49980 45413 12108 1708 96776
9406 96776 103884 133603 163324 124172 123977 92718 144640 169187 155607 125670 74826 95449
9394 95449 212650 171831 198717 231113 271561 256445 230163 287517 179217 103499 38830
9383 38830 -18736 79535 77422 59181 -5406 -26649 33466 195070 245388 232719 196780 198077
9371 198077 218982 128087 96135 49737 -76477 -19882 130468 138174 136297 169890 211152 172384
9359 172384 144197 100000 41799 -143338 -83231 16328 105574 114339 176674 115880 11108
9348 11108 39961 92094 126524 167224 180632 198126 319877 332332 275516 265018 246833 131011
9336 131011 79724 163542 290504 299369 316066 322771 186267 115949 112675 111947 121799 119490 155008
9323 155008 180663 207018 188213 160301 309242 359647 225203 114772 88453 120890 77258
9312 77258 161550 230646 198408 133928 177407 162011 185614 98558 111870 155935 112491 235188
9300 235188 325680 384490 394752 351429 220245 136722 177134 178486 154848 182385 208107 292975
9288 292975 363400 345255 279092 294214 268633 274681 273746 393648 424161 365487 307893 284736
9276 284736 204381 143458 120579 103378 131296 150058 163816 309232 412323 272796 263575
9265 263575 384066 293327 315319 379163 308682 250453 302763 404372 532384 577079 434225
9254 434225 427215 377597 380476 428067 459603 403839 450657 561418 553889 505965 558740 562288
9242 562288 494677 528399 588862 623483 636503 745828 803485 864208 874628 873117 811514 845017
9230 845017 855372 893216 867654 931242 990751 935654 826584 744654 759501 806441 904810
9219 904810 924079 980413 1063924 1107710 1060913 1033900 1019554 1142472 1168339 1173166 1143728 1185987
9207 1185987 1213140 1231612 1231007 1313735 1380813 1510519 1513668 1505415 1497550 1585225 1640559 1687303
9195 1687303 1687014 1719403 1860405 1852681 1842311 1964035 2136818 2157843 2154312 2244570 2397825
9184 2397825 2494191 2625555 2759824 2743753 2764603 2888818 3030993 3139930 3331126 3467026
9174 3467026 3614950 3819437 3938839 4031369 4109820 4184273 4343218 4416057 4732192 4957085
9164 4957085 5170566 5205577 5359402 5470419 5694505 5969610 6218945 6425846 6724497 6961546
9154 6961546 7161850 7312275 7464651 7570102 7714250 7811473 7881237 7925981 7979469 8033921
9144 8033921 8002372 7987609 7986103 7967555 7922925 7902399 7905672 7760707 7571072 7397311 7242019
9133 7242019 7160508 6953899 6844689 6848782 6722372 6515607 6319963 6218550 5997354 5777939
9123 5777939 5526589 5342179 5288740 5235532 5045455 4836288 4680228 4669791 4590973 4438977
9113 4438977 4368770 4285745 4133807 3933362 3757902 3669068 3479742 3312194 3310527 3380046 3245800
9102 3245800 3186285 3127372 2889005 2804997 2691505 2625400 2621232 2650228 2583326 2459070 2348716
9091 2348716 2223300 2160479 2203720 2112662 1963413 1908038 1901590 1818538 1697967 1607766 1628888
9080 1628888 1603960 1613520 1620924 1690412 1616102 1557812 1570560 1558673 1565306 1613342 1576460 1415142
9068 1415142 1204039 1161358 1207156 1270678 1260004 1200341 1223965 1231206 1122426 1062658 1055653
9057 1055653 1087758 1088840 1016394 953815 904066 845967 772817 626827 660759 688071 629745
9046 629745 588619 737024 741091 749014 710978 662365 640196 649849 577248 568391 614149 624244
9034 624244 697868 682355 596244 498752 593363 568002 499193 498760 460409 411535 331729 337954
9022 337954 411836 468342 405644 337861 293618 323732 482644 563594 600915 600508 557732 473037
9010 473037 438091 398848 326659 334840 442281 424749 393314 332584 418207 467067 479231 480411
8998 480411 411607 290992 289000 281207 337053 312989 314771 300060 474411 503213 351276 254921
8986 254921 229233 268925 322656 344339 340222 339345 343788 277663 275986 295577 369951 307104 263539
8973 263539 280064 258053 215595 266446 278972 250376 235833 160030 132122 145512 179342 144607
8961 144607 156234 162603 210592 255659 378436 354137 287937 230260 175223 156498 230848 293938
8949 293938 314709 325373 226022 161422 131757 86597 101070 128840 113811 72769 78062 24539
8937 24539 7379 -5844 -9123 79122 245288 320896 206765 184635 151641 130775 136987 212433
8925 212433 176971 172514 141666 154527 103258 60932 61840 12462 87556 107317 30995 4604
8913 4604 20973 56145 138026 241431 263557 254076 162928 103187 82178 129830 195479 258722
8901 258722 271965 204086 163837 72006 52165 102874 166484 136212 61149 56613 -30161 -69313
8889 -69313 66883 20919 13958 159557 144911 149874 127571 117139 75840 22512 68844 71334
8877 71334 113132 153818 128073 96835 169107 286334 206364 153607 45794 -86614 -118615
8866 -118615 -99948 -127218 -13327 54593 68037 14371 -809 45141 45351 99218 174096 184619
8854 184619 129678 181003 175055 211602 139774 93544 127126 131242 153412 219324 193538 160714
8842 160714 133987 107662 46260 55785 107797 158169 113399 123986 45443 -106453 -76413 16472
8830 16472 113895 203476 110675 54022 110052 34282 45183 93745 78951 153803 165599 91473
8818 91473 114274 70240 63865 46111 111470 59899 132723 140499 89531 10434 -32738 -1154
8806 -1154 -8909 35865 100948 89539 97435 114732 70941 16553 59340 156131 148865 61475 -8528
8793 -8528 -35739 -7194 5756 61909 101926 25242 -13702 83739 98996 84914 -34766 -62250
8781 -62250 22442 -30063 -160832 -136953 -130737 -65684 -83602 -17262 8569 10364 85596 131765
8769 131765 139837 121099 134709 91899 5534 38616 11927 55791 129524 24718 30554 78995
8757 78995 101890 114689 200954 209422 253500 161790 102324 164619 198864 212692 184110 206992
8745 206992 217423 183217 144384 91300 36697 -59963 -45987 -63784 -66183 2518 -26978 7189
8733 7189 61157 64947 -38198 -54130 107412 148473 77625 83696 111100 220419 313453 227277
8721 227277 130144 167829 253162 257515 118447 114920 173825 82821 80275 47372 34346 136673
8709 136673 176002 186457 133454 134257 155831 135276 165368 184064 172724 133172 98969 137806
8697 137806 106603 128838 170387 81334 63488 96640 85372 96719 65978 77635 72135 58534
8685 58534 121385 161367 233924 229018 125715 18542 -29764 15782 25941 -9779 37297 109180
8673 109180 111182 50477 40839 51842 92880 116237 93871 54842 66728 104690 131929 164415
8661 164415 203279 232803 225921 179932 196096 117195 90522 72347 -46480 -68253 150259
8650 150259 249730 169998 104111 124935 117980 186594 181343 100316 106374 143290 220901 212063
8638 212063 203554 140998 41765 15161 -63950 -29568 6006 56754 39625 67554 26406 100295
8626 100295 190667 221221 322927 369832 330806 206162 239889 169285 129521 127577 132661 162956
8614 162956 212998 272613 215014 91228 76049 191661 310578 374820 341406 369592 457852
8603 457852 474703 574462 784129 958844 993529 1069652 960201 767563 628375 543023 455172
8592 455172 340625 273196 245387 217838 242570 272126 251213 202204 94503 107425 129217
8581 129217 105142 129272 46696 34310 146456 84457 45798 47126 70831 133643 127773 72896
8569 72896 25 54696 180148 189326 169485 75916 79700 62440 44425 62930 -2092 41942
8557 41942 67329 20230 -33379 3983 49675 58704 100933 135686 57068 138305 191416 141917
8545 141917 66755 80103 115671 22140 71738 70624 -37589 -66747 -1094 9711 39378 69851
8533 69851 128614 52124 24987 131430 47174 -61148 -82120 -73039 -8218 -75534 -23501 26017
8521 26017 83304 167510 227449 252570 169159 99560 96819 146843 202165 267586 163729 28162
8509 28162 -5233 -68915 -245940 -262169 -147790 -59602 -12078 -9652 130323 122995 73206 56274
8497 56274 24355 97145 96469 47151 -6549 17307 127611 81153 121123 55936 77147 69171
8485 69171 -34189 -83939 -79076 -11552 8615 -19077 -6632 66774 20391 21694 77068 54389
8473 54389 -53912 -39926 -60965 -10375 27454 19721 -10806 50981 40638 19215 -43163 -103033
8461 -103033 -89573 -64231 -115256 -123927 -74794 -70306 8015 98004 100115 39930 27359 58370
8449 58370 75650 69398 142651 77828 57826 49499 -11404 -9270 11001 43808 41086 -13314 -68200
8436 -68200 -7655 37914 64788 57286 -76792 -39240 -51143 -138775 -119130 -110516 -154717 -214998
8424 -214998 -161259 -78019 27063 22351 -101246 -138644 -138207 -159584 -158164 -107941 -58019 -17653
8412 -17653 -69608 -112542 -119900 -111220 -136218 -116959 22124 98431 63603 14775 -97005 -156470
8400 -156470 -46062 8227 -5001 -13135 43248 -2852 12013 -43975 -106272 -150000 -87709 -93931
8388 -93931 -41379 -33038 130219 116560 -63427 -43111 78105 66668 70370 54967 153832 228695
8376 228695 78586 86493 102234 194058 168057 70679 46047 114834 164307 33575 -10402
8365 -10402 -87499 -167720 -154832 -80676 -33302 29314 51109 -45613 -20886 -20131 16256 -46951
8353 -46951 -1087 67207 4632 43433 -7464 7937 78726 120542 106167 83428 53411 72556
8341 72556 23126 33277 88253 21760 -2319 -131038 -209414 -153829 -125564 -96005 -56638 -71163
8329 -71163 -29898 47147 58462 53168 21576 47238 72415 135939 228571 248628 155560 95375
8317 95375 66505 -28682 -173216 -199617 -94474 -43768 -107233 -142156 -51612 -25769 -87205
8306 -87205 -188253 -228244 -125787 8970 -13168 -93776 -90839 -88375 -104844 -62208 38927
8295 38927 52489 -40106 -97382 35447 134174 200290 186031 138631 82300 -7682 -23264 -64713
8283 -64713 -57978 45855 31942 -60707 -144901 -142214 -86946 -26526 22498 21840 23239 -16967 -14198
8270 -14198 47502 -15278 -81208 -10646 72372 95340 59607 62195 -12072 20200 30606 34126
8258 34126 -4131 -16238 32787 37796 -59259 -191818 -185227 -170901 -53551 -44144 -109130 -123495
8246 -123495 -93317 -187539 -192786 -103564 17147 -17757 -105878 -95004 -77096 -41367 -85508 -92261
8234 -92261 -69070 -61471 -42667 -112576 -158257 -73062 -33987 30706 12840 10444 -45451 -49135
8222 -49135 -81848 32740 81982 149580 122884 95282 80042 12103 66043 54538 -67777
8211 -67777 -123183 -87358 12892 53050 119523 119034 115441 170377 186042 173018 120238 105189
8199 105189 171332 106415 47744 94039 172772 166043 113803 43843 86519 20077 -35346 -893
8187 -893 60230 130687 132435 137167 99273 -10286 -37633 -73601 -91709 -94638 -4113 89646 107717
8174 107717 72564 46455 41509 86413 46267 20790 27843 63689 -17431 -23206 -91003 8083
8162 8083 -13203 -16324 -18836 -84038 -89773 -66189 -95349 -138086 -149135 -112614 -43029 -920 -33374
8149 -33374 -43454 -92563 -44710 -42728 -96859 -58902 -16862 95617 30390 -20735 -50820 -7519
8137 -7519 -22220 -38279 -49381 622 21635 -29413 541 66446 129300 65325 -17396 14559
8125 14559 118218 88735 45587 38907 21707 33251 19602 40960 -37304 -86618 -100935 -101745
8113 -101745 -90206 -36003 -8023 -28008 -33408 -15955 -98563 -135242 -140873 -113848 5925 -6889
8101 -6889 -60019 -73813 -134963 -112594 -9997 -45999 -20444 -30628 -111462 -143935 -106959 -58440
8089 -58440 33980 63384 37508 53091 -1034 -163094 -180851 -225666 -194471 -116024 -160899 -103213
8077 -103213 -1107 160371 260975 277921 259007 195458 78048 -512 -46074 -85629 -51516
8066 -51516 74350 148143 234650 204488 157846 122524 5103 54336 101140 81708 86958 42169
8054 42169 71331 80450 56690 74142 -30738 -40259 -91251 -293492 -295941 -155820 -93769 -23793
8042 -23793 -724 51402 -50741 -87131 -70056 37307 44959 -16049 -8789 13101 30005 -10777
8030 -10777 -91653 -129889 -7137 121779 161176 91150 21020 -77164 -131214 -67740 49282
8019 49282 116728 53261 136830 127822 79571 95397 182802 71563 13869 -27647 10924 64761
8007 64761 69285 -13567 -27504 -52620 -4599 104229 111796 113240 113937 87367 61634 54064 7396
7994 7396 56925 80216 36867 -23392 -52493 -61904 -60124 -39252 -4695 26586 72522 64287 108187
7981 108187 35775 8860 69789 46622 16529 45326 -31733 -158099 -153198 -68555 54186
7970 54186 -3379 641 -21348 36174 89387 64163 86174 24942 27050 9090 -132566 -108653
7958 -108653 -88899 -118622 -158506 -243049 -292756 -235908 -105068 82186 174733 137503 76440
7947 76440 -13492 -30961 36638 51286 41927 127858 119234 109774 187843 177313 106091 23874
7935 23874 -12375 -69299 -114636 -142494 -104731 -97695 -128316 -113658 -123188 -128742 -154609 -52268
7923 -52268 44758 85500 63328 52618 61924 118518 237815 335119 274439 114130 91633 80269
7911 80269 -3407 -73672 -126505 -123140 35022 13317 21586 82609 44797 53600 6492 -17647
7899 -17647 -85559 -256180 -233627 -241608 -266976 -211431 -55574 37197 22070 68043 166319 170963
7887 170963 110347 95489 44124 71730 81048 -88973 -88788 4443 30263 -77785 -78192 15607
7875 15607 46972 81786 91124 63151 51370 37856 -52833 -162703 -160261 -101124 75137 81391
7863 81391 129166 35016 -43448 31186 56199 -3912 -88066 -133058 -162102 -117818 -42445 -66321
7851 -66321 -98259 -11446 26177 -88042 -74505 36165 94830 -25360 -15897 -2790 4015 -9274
7839 -9274 -3194 -1489 -53708 -109660 -21569 -26158 -111223 -138512 -137534 -158878 -140771 -22030 86108
7826 86108 123056 38798 -20738 -39846 55108 70291 78727 37431 66523 16195 107361 120253
7814 120253 71815 -39488 -95175 -83752 42330 -6303 -79772 -53148 -45564 -94259 -127945
7803 -127945 -105741 -137347 -117387 -107963 -198305 -174896 -128293 -181284 -172626 -210356 -204859 -137409
7791 -137409 -89680 -48338 -67966 -142949 -165322 -215808 -211246 -114414 -66375 -53276 -45924 -147971
7779 -147971 -192042 -134192 -84410 -53575 -111663 -133942 -69894 -46262 -35503 -82953 -107461 -39219
7767 -39219 19769 55469 124538 78234 60814 -28022 28428 34634 71579 -3697 -46532 -59421
7755 -59421 -45768 29757 39632 33412 -14021 -6878 45366 18691 -68199 -50978 -36645 -65320
7743 -65320 -158736 -159767 -56324 -7286 56484 -24955 -52730 -77263 -117948 -187723 -151773 -143470
7731 -143470 -169287 -192677 -201101 -88228 -4979 45379 43002 -1743 23705 62405 61807 77996
7719 77996 100059 7932 40638 -15168 -81864 76498 72669 -137237 -196478 -132986 -122906 -95616
7707 -95616 -19006 20 -85176 -65897 -24906 -20744 -92904 -124511 -139060 -73183 -102437 -92493
7695 -92493 -12660 -38819 -82175 -95561 -79499 -57116 -82348 -100623 -34405 -24352 -5600 -58520
7683 -58520 -179523 -125367 -12703 76516 107757 112539 -46 -74734 -6130 113365 -23263
7672 -23263 -134740 -122631 -65814 -107018 -7793 61798 134712 182435 124670 85313 33646 -9028
7660 -9028 12043 318 78100 93617 67097 46042 -34246 -60207 208 49544 26279 -28086
7648 -28086 -416 -14760 -7388 -51477 -97574 -89275 -110590 -120916 -132528 -98180 -113846 -9075
7636 -9075 55875 50032 34613 91402 178795 218075 167501 78488 -96609 -166748 -151758 -146311
7624 -146311 -166959 -141034 18246 112378 113320 34795 -47632 -171324 -224136 -168770 -166449 -200101
7612 -200101 -116318 -51465 -89618 -177939 -91920 -108418 -147392 -122496 -110324 -73446 19042 19394
7600 19394 16459 79565 125010 66679 7247 35565 6039 -48628 -30395 -74502 -148080 -9563
7588 -9563 80025 57256 69613 84501 5699 40843 39369 -16553 -36323 -18234 15336 50287
7576 50287 54452 1144 84623 114603 -48051 -114514 -90171 42450 28259 -85311 -80533 -46109
7564 -46109 115983 72760 -31948 93733 164903 82156 95231 83823 101125 74213 -15408
7553 -15408 -4400 111643 138469 97963 47116 -22545 -22720 -41813 615 -13941 5201 9638
7541 9638 -98119 -92657 -65998 -107997 -59969 -136137 -95366 -64806 -79266 -115607 -79557 -14194
7529 -14194 -72447 -166104 -71253 -21564 -72177 -46097 -19995 2762 -45981 -65997 -10798 -5811
7517 -5811 -30272 57496 12936 -46898 -15176 61128 119647 157837 175558 208613 51743 -83440
7505 -83440 -154023 -70523 -37439 -54967 -14384 49139 -15893 -31752 -10440 72965 121367 45742
7493 45742 -52643 -62919 -68384 29133 231974 262558 182276 104493 53510 60985 192511 235555
7481 235555 35530 -29813 -39134 17754 37248 3598 -12214 -14777 -194601 -298947 -193086
7470 -193086 -105033 -46596 7479 8245 -35044 -50669 -5181 -38156 64805 -25346 -70008 -70730
7458 -70730 -73988 -105894 -120195 -122167 -91737 -24175 48208 28718 -102154 -156026 -191727 -223483
7446 -223483 -138117 -140367 -120681 -90508 -84942 -18679 -173909 -234384 -205984 -183887 -222526 -217165
7434 -217165 -47290 2550 50281 5316 20620 -44639 -88871 -66726 79905 152538 92758
7423 92758 57785 -20571 -8927 -58965 -148941 -68471 -37435 -123126 -161901 -241206 -243987 -132367
7411 -132367 -108033 -112122 -98520 -37602 44901 62431 3927 46866 151420 165558 148448 56706
7399 56706 91158 135146 43519 12445 -10101 25137 476 -58595 -86765 -25682 -15633 -38374
7387 -38374 14597 93535 52272 48746 98229 139202 33618 -38367 -79035 -15601 -40898 -38251
7375 -38251 10106 43511 124247 167759 97190 29939 -90095 -115902 -29546 -42113 59058
7364 59058 52003 -85833 -106217 -168480 -170681 -119745 -3377 -24731 -68057 -39415 57092 113916
7352 113916 63501 43084 -19828 -76725 -87161 -5626 -60343 60010 116756 100846 26505
7341 26505 835 48041 69476 10621 36979 77237 91388 93243 38284 -77555 -114290 -88523
7329 -88523 -165826 -166872 -229184 -218993 -204959 -199403 -241427 -161801 -16035 54837 1165 -43436
7317 -43436 -4747 42418 11196 6817 94885 7590 -41819 -1297 48765 29214 -42518 -46268
7305 -46268 -3976 28242 -54414 -206760 -192458 -158326 -114144 -134893 -112453 -28931 -61720 -25864
7293 -25864 37416 -44207 -87205 -68575 -31238 -2694 -43605 -23559 89508 111686 20271 -54567
7281 -54567 -51996 -67098 -74408 -62841 -42877 -35322 32669 167842 81976 36414 86126 95787
7269 95787 64474 51296 -23816 16827 -83765 -64010 -17031 -8117 -73316 -3789 -9650 14521
7257 14521 71034 86758 11971 -26412 30934 90315 154959 107962 -587 -28578 16809 149894
7245 149894 207724 175942 157398 38686 21590 -5216 -17223 -39301 -107073 -74590 -80845 -148985
7233 -148985 -141961 -11026 40500 -100702 -93496 -125540 -185054 -111850 8430 48252 8637
7222 8637 -87069 -118411 -198138 -142871 -25366 1263 -11486 -100611 -204927 -153174 -135519 -182177
7210 -182177 -201928 -139359 -89871 19139 60153 -42865 -41828 -50564 -140289 -155579 -107446 -158477
7198 -158477 -167132 -128850 -57228 -36155 -103508 -218929 -208109 -89193 -64203 -40258 -41846 30886
7186 30886 110396 113752 100619 27484 95708 97007 107408 100752 121490 87137 102044 68636
7174 68636 61598 94683 120671 98060 33000 -16637 -69468 -113319 -130945 -251728 -227768 -111439
7162 -111439 -50119 3547 6514 9461 5874 40034 46316 30395 -34462 -83229 -161138 -129177
7150 -129177 -23733 -18177 33007 -37940 -60676 -40489 -51231 34862 93996 89225 103999 120323
7138 120323 132413 174102 127333 101950 86751 16212 -65912 -78091 -91022 -66764 -113971 -203629
7126 -203629 -218679 -77363 79520 97988 96700 122304 103133 39297 54446 -24067 -124796
7115 -124796 -115878 -41291 54276 8151 -43391 -64501 -102861 -92512 -32137 -49321 33641 -11001
7103 -11001 13671 12345 -64321 -70564 -5907 -53564 -42841 -21010 54908 87531 100341 132862
7091 132862 98003 36300 -61078 -224290 -201324 -54671 65803 109617 44028 34180 8526
7080 8526 -5603 86653 146063 156343 20289 -16908 -20367 -5685 22181 -59527 -117513 -64168
7068 -64168 13292 -41199 -56905 -96193 -31387 25634 67855 2444 27617 15128 -20395 -5796
7056 -5796 33072 56994 38949 58531 29621 -119425 -152066 -99002 -70966 -9018 23217 -26275
7044 -26275 21979 -66339 -7165 -29694 -156346 -175369 -139733 -140660 -101099 -31632 78867 195881
7032 195881 127845 38692 -44703 -122245 -126019 -85511 -69503 -4573 -66092 -58849 10704 63268
7020 63268 19930 63380 64236 -26435 -71594 -29404 19570 -8614 -59855 21739 65430 -101310
7008 -101310 -110579 28782 2012 3584 -42108 4563 33869 584 -25614 42241 84489 54134
6996 54134 45278 38404 23074 31795 -47507 74012 160143 217462 334945 357211 301170 203400
6984 203400 140993 156057 84267 56079 55674 10799 111 11059 52225 26737 27983 10977
6972 10977 59296 128385 200248 151536 63546 16505 -24928 -59554 -11716 -36567 41195 87435
6960 87435 92027 81331 67753 21867 3537 -52459 -84237 -65337 -17503 -61816 -183172 -285033
6948 -285033 -275795 -119214 -11536 -32886 -73505 -116804 -158063 -87446 38606 93950 100649
6937 100649 34451 -72641 -74517 -21588 104068 162796 173125 145862 28239 -39192 43822
6926 43822 19248 -100788 -143267 -101294 60126 113349 121518 50806 -61920 -32379 59391
6915 59391 153037 162553 73899 -9113 7767 63778 117262 124241 97947 96759 17642 92975
6903 92975 168556 3185 -119040 -129767 -59293 -81597 -37800 20031 99556 81573 -14677
6892 -14677 -83073 -75260 -55817 18411 36803 -9786 45356 -11430 -45035 -3451 -11123 -92820
6880 -92820 -126717 -114913 -50846 30510 48637 688 -4531 -13611 36841 -5842 -151102 -165991
6868 -165991 -74769 -65837 -85451 -151391 -97837 -140717 -135845 -73786 -31888 -83176 -118486 -79348
6856 -79348 -83779 -81679 -42148 41074 78145 145325 50877 -53940 -65837 -74914 -16376 -62539
6844 -62539 -140068 -208890 -175573 -123857 -36381 -65001 -94172 -113542 -59411 43593 54540 44450
6832 44450 13475 -3112 -20089 -83177 -55898 94932 210406 238575 191390 227514 180626
6821 180626 116740 -4909 -41216 37259 70695 73829 15151 -49296 14313 116487 95631
6810 95631 102526 122468 74919 -12350 -19611 -24996 -98311 -99033 -39194 53119 15894 -75789 -55919
6797 -55919 -95645 -52678 -83044 -203885 -134864 -54211 46576 97066 45154 -54022 -126253
6786 -126253 -79193 -70941 -5472 -9183 -1999 41256 -4485 -61419 -10252 -19913 -91513 -62156
6774 -62156 -100946 -57985 -7137 3888 37286 48000 165268 135399 68294 11512 81347 39615
6762 39615 132916 134402 69543 12648 67610 87411 86853 44945 -59192 -79989 -11811 -42896
6750 -42896 -12037 62032 85085 9770 112967 188374 133789 77637 139800 233523 246854 283471
6738 283471 173217 -14663 -158535 -138051 -64889 -116842 -50994 56566 76171 26220 90714
6727 90714 72211 61072 78456 182973 271514 226504 90603 33314 -47819 -104460 -90952
6716 -90952 -34251 -15222 -71853 -130575 -115850 -8779 61159 94311 144843 191767 109202 -23091
6704 -23091 -32585 54118 13357 32145 38871 15701 -31367 54662 77336 -39799 -78829 -108448
6692 -108448 -77307 -48020 -17548 -28902 -9696 -7111 32803 39928 -56609 -76239 -52693 -39713
6680 -39713 -107265 -33165 11054 24489 49347 88506 156802 96055 87699 59315 19449 23248
6668 23248 47712 49423 44472 42832 -11987 44683 183175 175757 119194 -9606 -55311 3942
6656 3942 -38396 -115047 -141042 -98410 -85359 -63555 -86770 -166420 -117990 10907 100410 143380
6644 143380 105056 54745 32261 24210 -15574 29086 61653 87023 36280 20711 10277 -47798
6632 -47798 -96655 -79372 -74148 -61650 -46536 13173 -7060 -41410 -91563 -141226 -35295 44606
6620 44606 -52994 -76552 -143440 -170788 -205726 -129082 10607 74618 61338 63186 7073 -12590
6608 -12590 -20645 -167855 -157159 -71959 -111344 -43855 26417 -5670 -88861 -76240 -102384 -61250
6596 -61250 -93589 -54247 -92555 -29342 7106 -20493 51698 14405 49106 135054 131374 86544
6584 86544 38428 73579 91217 115199 75000 58428 17707 7222 3948 -44958 -51717 19362
6572 19362 45579 -13819 -29312 -43354 -18805 2269 -25689 -129289 -142591 -45723 63901
6561 63901 -30609 -66937 29965 70301 29365 15074 -17661 -84242 -31031 -47847 -65086 -14674
6549 -14674 43382 -12116 58891 -33247 -118713 -107850 -157563 -87679 -47181 -12542 -95006 47880
6537 47880 113618 76189 142538 57974 -60546 -106221 -28999 44032 22299 -13333 -9189 166984
6525 166984 256042 247833 98436 9581 56417 58724 -127287 -143140 17082 46432 14033
6514 14033 51422 51365 50965 87114 57798 -68791 -171170 -137041 -102402 -223388 -239454 -213706
6502 -213706 -138225 -30270 -146659 -118799 -98831 -143710 -104753 25020 70319 93111 -2523
6491 -2523 9311 39349 -45925 805 75672 4175 -33137 -32675 -20996 -49107 -85695 -35494
6479 -35494 111352 73773 29265 631 27759 11344 1864 -61918 -32334 63028 93665 39193
6467 39193 -33114 38662 19787 -6616 -59394 -18313 -99116 -48087 -12733 43098 49814 18014
6455 18014 23200 56296 139736 162998 118176 -96586 -62526 -11950 -9207 7244 -53720 -79874
6443 -79874 -52603 -97301 -70418 -11341 -32203 -20544 -115823 -177323 -257138 -214222 -10371 60438
6431 60438 52551 38002 68744 105539 98306 -13220 -67569 47654 49339 71702 53132 177916
6419 177916 131560 6083 -23004 10259 80462 99954 8001 -1107 29307 -19216 -41378 -47774
6407 -47774 -112373 -70985 4109 -3089 -63598 -57422 -27870 18159 107266 64090 395 -16214
6395 -16214 -10450 10309 11093 8079 -27779 10504 30538 59860 92906 104966 80295 97369 25076
6382 25076 25489 80413 28397 -134792 -194602 -52090 40829 79169 14677 -39134 -47261 -7737
6370 -7737 34565 -45064 -76857 -61089 -59177 -113561 -150175 -116040 -51552 -34081 -7218 -88109
6358 -88109 -43724 12621 18266 92571 125715 108239 101751 -54016 -183039 -154211 -106540 4993
6346 4993 -4655 -25321 -45171 -57481 44587 8993 -14096 -9851 29363 88053 97857 -30998
6334 -30998 -114473 -96837 4614 -19524 15992 -8197 -9558 34076 -8024 -21088 73870 104552
6322 104552 19745 75905 132774 109279 16771 -2438 -5223 47345 -54406 -134307 -149176 -189780
6310 -189780 -195242 -149808 -191713 -114401 -33731 30319 -13552 -23020 32059 34103 -2859 -67664
6298 -67664 -73296 -77832 -56955 -60343 -38989 53028 76110 38683 5526 1343 -6431 87612 201218
6285 201218 184825 202448 198849 165632 10813 -105213 -164131 -88009 -70677 -49059 -83821
6274 -83821 5461 -2574 -10532 -48195 -125351 -61637 -35028 22644 107648 119030 16079 41366
6262 41366 49756 120070 -3744 -153967 -238022 -193802 -222942 -144889 -104092 -57003 -94316 -68428
6250 -68428 -32026 120671 129189 108007 110598 44829 14684 13761 -6647 -28920 20965 -80014
6238 -80014 -16768 45025 22487 -40979 3876 16445 -44683 70289 126298 131962 112766 63593
6226 63593 84251 6959 -74801 -165395 -203332 -81367 16963 93302 180166 203793 127581 89298
6214 89298 39696 -70902 -52066 12784 114047 150685 74772 6553 21712 -461 50325
6203 50325 72976 11689 -47068 -38504 -47572 -13368 53034 -12079 -19285 39692 52065 19007
6191 19007 -90776 -189277 -93010 -59034 -54657 64716 128256 129644 34926 12679 -15384 19856
6179 19856 -5526 -66561 -62808 -19525 88150 171075 193880 220875 168603 95918 126917 93350
6167 93350 -38250 -15205 -15881 -20595 132406 143318 95211 6199 -65290 -60222 35702 -8542
6155 -8542 -113853 -134086 28981 85080 21769 -8578 57584 92430 86105 91644 -38347 -72488
6143 -72488 -56829 15555 80134 20656 10461 51758 19972 -4511 -47602 -3816 2306 -1563
6131 -1563 -37179 -87742 -50853 -14268 8354 12160 34017 33140 57740 1687 -132694 -157518
6119 -157518 -93257 -26335 -97829 -102193 11039 84731 -3305 44209 77395 130502 28357
6108 28357 -61757 -17396 -105891 -112270 -57313 -124869 -68464 -34395 -23665 -23196 70788 125158
6096 125158 146431 101428 20295 22794 -20287 -57404 5971 -22473 51440 41825 -9947 11135
6084 11135 61083 14382 -25530 14617 16883 -47209 -71970 -82705 -141288 -205418 -158398 -17543
6072 -17543 106312 86475 131964 102332 27356 72733 54607 -16613 -26359 18639 53962 15459
6060 15459 -58237 -98198 -115862 23323 43070 38318 72923 142912 103998 -10132 -13347 26007
6048 26007 45753 115080 106006 132367 156218 49826 8173 43786 143679 180800 75615 62675
6036 62675 12964 -69057 -75905 28207 -116448 -129063 -33569 68756 3916 52505 23057
6025 23057 23602 20079 20445 -19200 -40282 -145696 -190832 -183449 -177737 -151847 -132176 -52723 -6043
6012 -6043 12311 55780 -43620 -113374 -58044 -149235 -193605 -215395 -183246 -192402 -125178 -3480
6000 -3480 86195 110927 35141 39998 25406 -2888 30880 38767 -23676 -79609 -69778 -113365 -90972
5987 -90972 -93166 -125996 -46374 -35794 68944 103716 105883 -13427 -121998 -76976 -36276 -22371
5975 -22371 14516 -37940 -77915 -189175 -170568 -113445 -131322 -129893 -31631 -2887 18553 -14941
5963 -14941 -12319 14523 -3738 -51888 -78087 -41283 29346 22053 39065 1100 -116864 -130660
5951 -130660 -95488 -65474 -96743 -94577 -49642 5237 95354 75726 102324 105100 -29944 -51806
5939 -51806 80110 104076 102634 30264 -43304 -24122 14653 32217 -13499 1638 -22993 -26222
5927 -26222 -29169 -92671 -17543 24735 3388 45342 63159 18122 47360 49020 64226 -19074
5915 -19074 -79028 -58482 -74635 -73983 -68789 9277 91696 139807 112452 1711 11020 -1160
5903 -1160 15672 -30259 13877 15342 -96016 -145691 -104372 -127103 -75155 -47869 -130201 -134281
5891 -134281 -69678 30030 -3472 25007 25995 19835 -56251 -64136 -61463 -11716 16044 24314 -22762
5878 -22762 -10362 40572 110170 183981 162798 127919 60981 -247 -91110 -225749 -218352 -122265
5866 -122265 -28828 30220 -39627 -100718 -123456 -183 -8463 -50944 36437 130827 168314 171310
5854 171310 86723 15729 55304 145422 116821 10974 -8765 -91655 -39243 80063 86216
5843 86216 31349 53919 26450 -50478 -36257 -46091 -26473 -55461 -63856 -63042 -67235 -31080 37515
5830 37515 -17210 -86111 -85469 -86469 -24066 35350 68147 98588 137571 97110 27101 -46685
5818 -46685 52221 165225 163655 187893 129605 -33255 31007 121439 156575 66112 -56996
5807 -56996 -54997 -15147 -23841 -196742 -294234 -210009 -101003 81439 73999 86864 129548 134568
5795 134568 45376 20298 20055 -68789 -151081 -92939 -135018 -219745 -196260 -95516 -95685 -47364
5783 -47364 -55840 -146815 -116096 -100204 -131783 -172533 -149564 -198455 -265293 -302754 -241823 -85128
5771 -85128 -32165 -59821 -102032 -117646 -84598 -48075 -29136 -85491 -119699 -84724 -62642 -49646
5759 -49646 4056 71983 90060 19772 -49037 -30741 -41241 -59246 13599 86196 95586 100629
5747 100629 49167 -59883 -116968 -77592 -11018 -26822 -58912 -18405 45490 28165 -41621
5736 -41621 -77217 -117766 -167330 -98476 13671 58777 38196 -46027 -34523 -96284 -173362 -178539
5724 -178539 -65544 90515 104416 -42028 -59019 11014 6376 81776 4136 -40894 -57867
5713 -57867 -142987 -176974 -88118 -54806 -4734 -106356 -62906 -12575 67607 152578 152219 188113
5701 188113 114699 223998 189446 86417 68054 45467 21958 32124 52349 60105 -20127
5690 -20127 -38805 21379 -1125 -103762 -117725 -87946 -85204 -83709 -70905 -70874 -11124 -3621 10663
5677 10663 5252 29241 111448 52108 -13285 7325 61580 -59259 -87553 14691 136698
5666 136698 50015 36589 89561 204532 164143 57958 75135 6390 6896 9005 -30443 -58826
5654 -58826 -194087 -125801 -15411 98901 158980 150003 94268 67996 38995 -7325 -143132
5643 -143132 -80609 86481 85132 8804 -15734 13062 -30525 -116942 -43628 55702 79911 79783
5631 79783 61111 41397 4358 -49367 -77571 -24177 -43813 -135618 -210912 -139443 -43410 -9377
5619 -9377 -83905 -98412 -36997 -11727 37739 -40509 -138750 -127957 -139242 -118103 -40740 48121
5607 48121 129427 151511 109898 -20573 33335 89158 16400 -79123 -104868 16666 85391
5596 85391 59109 -326 75439 105848 93141 -5941 -5984 45927 65665 -15131 -33010 10784
5584 10784 53533 59288 -25612 -7398 47112 39165 31900 47092 90030 154364 87217 6604
5572 6604 58428 67489 33403 -39373 -94466 -122884 -116450 -26332 30108 66939 96790 149452
5560 149452 108916 32137 58405 38095 -22255 -28854 -143518 -86149 -86780 -182295 -160172 -155967
5548 -155967 -84091 -20783 32343 105314 148016 141904 133295 79275 40307 7350 -4444 72635
5536 72635 52962 94719 46464 35620 -28466 -99212 -106161 -57127 69504 94393 17834 72439
5524 72439 12746 71458 187485 189392 158431 31366 48204 132307 170377 213521 236385 240345
5512 240345 233452 262880 147620 119763 142080 99923 90951 -18926 -154598 -191139 -172619
5501 -172619 -90052 -47565 -46042 51220 79062 -43668 -108452 -58885 21452 57350 103085 179192
5489 179192 157056 20927 -67301 -165415 -244574 -143894 -32058 -71035 -97150 -35310 -26207
5478 -26207 -65311 -110519 -233457 -184780 10653 48104 -19920 -39839 8222 2702 61758 111422
5466 111422 114770 93886 32985 -47350 -7981 84904 91348 96744 88865 128764 150572 205746
5454 205746 129590 74921 41390 4860 -10387 -22253 50466 46019 32687 54366 65226 24704
5442 24704 -25169 -81945 -121133 -104816 -147382 -140647 -133153 -40087 -3449 6983 -90962 -98353
5430 -98353 -61482 -4728 -27233 -63300 -67077 -15642 -49530 -76407 -32093 56565 54061 -34203
5418 -34203 -11109 -16557 -122637 -70355 -35481 15367 12120 17984 -13630 -146596 -133701 -124879
5406 -124879 -76898 4090 -4795 -7709 83862 68092 120307 128604 62635 36109 33261 -32502
5394 -32502 -24746 6684 -95512 -120157 -58650 -63041 -159324 -287025 -255232 -236101 -95672 -60481
5382 -60481 -148718 -15683 227911 213888 143844 86839 30267 -12004 12330 122957 62182
5371 62182 31175 77529 44076 -18103 -120333 -163045 -79855 63161 42583 5932 -50616
5360 -50616 -55691 -3955 -9382 21224 -18727 -25564 40386 150991 241222 256824 124363 57171
5348 57171 102474 104482 102498 71958 45928 34811 77356 107130 13960 -79606 15496 36307
5336 36307 67593 139327 161853 136233 70045 3512 -58396 82681 150399 78487 -9285 -35782
5324 -35782 -116880 -167274 -181269 -192566 -83073 -23105 -16732 -6134 -61790 -37212 54709 115944
5312 115944 118306 33225 34514 72150 19574 -19660 -79330 -50164 34623 54197 28715 -70784
5300 -70784 -136222 -91070 -112298 -52720 112111 175889 129301 95017 127274 92539 31202 -29715
5288 -29715 -59299 -88973 -93601 -78344 -69827 -64570 2236 47428 73674 38315 61377 35467
5276 35467 67288 -74 -83947 3728 -9274 -46946 -94669 -130493 -77563 -56253 -22059 111758
5264 111758 174091 143068 85140 73426 -63251 -24531 19546 10524 -80250 -124036 -128410 -152964
5252 -152964 -205286 -96456 -54397 36652 56262 38597 -113564 -66676 -29075 -65425 -83190
5241 -83190 -11358 24795 42561 77912 54860 19798 -21322 -8545 -24972 -50695 -44869 -44135
5229 -44135 -18766 52199 122394 97309 46981 42867 51342 -44577 -132083 -130268 -141301 -202694
5217 -202694 -120175 -88170 -120650 -173745 -97026 -44160 -23909 -22446 29202 -99548 -342844
5206 -342844 -342904 -245972 -152792 -91605 -36011 -36090 -93803 -96146 -10336 62647 60011 -71586 -181664
5193 -181664 -146456 -117011 -146424 -62904 -70160 3912 -532 44665 96434 54889 -6091 -51837
5181 -51837 35961 61637 -4136 -48173 2570 79369 132598 42786 -26469 -70055 -167915 -196461
5169 -196461 -127597 -32460 -5985 35536 80890 -1821 -107897 -58615 -8992 56223 68688
5158 68688 31913 79245 27443 13778 -9797 10314 98251 48042 21210 -92960 -15137 80884
5146 80884 30920 74777 100235 108502 202046 105503 6659 -4245 -51942 -6865 61747 47597
5134 47597 63539 54084 29009 23678 -10406 1755 -18539 13275 -47526 -19056 -18414 -75508 -125692
5121 -125692 -155918 -156416 -100998 -60455 -21165 33071 7776 -23485 -19464 49178 58315 -21695
5109 -21695 -23335 -44719 -44959 36393 -14895 -26747 -60578 -28098 21667 25979 7892 25420 59100
5096 59100 81053 -3742 -39391 35843 43683 -40102 -34611 -74925 -65687 -33034 -82289 -71553
5084 -71553 52667 66693 70005 -26244 -65601 -45744 12059 140452 147781 13437 22989 -1492
5072 -1492 -43243 -98961 -139757 -130521 -72903 56264 83521 58014 80331 85348 42194 137611
5060 137611 178141 149770 135885 86921 -24557 31605 13105 -23786 -51647 -109115 -169481
5049 -169481 -83159 -56705 -145985 -43327 80927 162064 176561 50156 25954 -56478 -138050
5038 -138050 -182554 -122843 -33185 -64126 -48576 -82083 -168339 -199864 -148481 -22249 3323
5027 3323 -57641 -32533 40211 119903 121604 78302 4396 -86584 -19074 74249 80461 2440
5015 2440 -24517 184 135640 116762 18623 -70311 -46091 52562 130132 97812 57069 41968
5003 41968 82434 88108 111212 119544 63835 143077 165631 111574 116650 97996 141945 133764 17914
4990 17914 -108783 -78722 3350 -56819 -141041 -77556 65 21535 45326 84663 49435 48235
4978 48235 -2153 -120228 -96198 -33392 971 69718 -2225 -74681 -62372 -64997 -169973 -175432
4966 -175432 -76980 -7583 -48164 -70788 -85518 -135364 -92919 32315 -23801 -69114 -19230
4955 -19230 -4684 10467 -60515 -48338 41754 71396 6354 87238 65478 13775 23844 12507
4943 12507 66739 88251 86351 158466 113986 39755 -119028 -54843 -10333 122732 163699 59202
4931 59202 4265 19934 4324 -25798 -52513 -29361 40187 39009 -19609 -87051 -55000 -89134
4919 -89134 -42404 -51650 -50522 -92802 -45608 16225 -51208 -122029 -133344 -167744 -78110 -66505
4907 -66505 -97791 -112010 -29645 -36963 -57279 -101706 -22962 -65106 -60013 -54101 31362 140198
4895 140198 87672 8482 59979 59285 1273 -78445 -42974 9781 30006 107596 98269 -74266
4883 -74266 -82035 -15685 24261 -1900 -54143 -10910 -53282 -105847 -162628 -75970 -44538 -117173
4871 -117173 -95822 -30548 35936 70941 86837 100690 41653 -82173 -144386 -100627 -88670
4860 -88670 -2563 41690 52538 1502 -1121 -20999 -74623 -168793 -187619 -140363 -116105 1996
4848 1996 35136 131318 128078 54841 23181 -132722 -97135 -97577 -179823 -221228 -114180 -52983
4836 -52983 9290 47606 143165 145161 -10121 -39989 -31358 24743 -12208 -41153 -41843 3046
4824 3046 9070 -117574 -167473 -93744 -93795 -9881 71796 49542 -20265 -50722 -60246 -85265 -31080
4811 -31080 -32444 37223 58278 78248 111072 8217 -73582 -165163 -97159 -72258 -82900 -6523
4799 -6523 47577 57929 29329 -53801 -179283 -205918 -123779 -41647 35460 30444 -4893 -13548
4787 -13548 -24998 -37130 -58192 -161114 -153716 -222014 -225209 -143402 -132637 -144754 -120498 -114009
4775 -114009 -119085 -72834 -40396 -40847 -69301 -43630 11135 -10989 -149356 -196651 -171291 -203680
4763 -203680 -269186 -167927 -106092 -43293 14007 -39566 -94293 -73368 -43837 -26269 -131600
4752 -131600 -145028 -117239 -150164 -168670 -169171 -89525 -45621 -126394 -118873 -129096 -114788 -166173
4740 -166173 -156789 -89729 1966 111050 88560 151409 170836 65716 -37446 -36955 -23904 -80222
4728 -80222 -78881 -42775 -133204 -203819 -125205 11790 73189 87477 85869 116963 98658 -19828
4716 -19828 -75906 -140227 -85498 -61815 1902 15530 6960 -31177 -21853 70509 63030 69815 123539
4703 123539 120873 47620 -4949 -68157 -47087 -19902 -46689 -31359 69808 99470 55244 28756
4691 28756 20349 14357 111268 181855 143513 -26213 -105463 -114729 -76242 -9642 -10210 -63074 -93815
4678 -93815 -135022 -148090 -88240 32097 36402 -29657 8204 121737 131234 99836 67268 4435
4666 4435 -74707 -29766 30654 81153 71784 52561 67694 -45758 -111750 -233995 -279275 -208568
4654 -208568 -26919 114574 22000 -71116 -84362 -135725 -175094 -145795 -143805 -154661 12000
4643 12000 103860 132225 90509 35055 15277 42907 37726 -24197 -103492 -122905 -73397 11837
4631 11837 37426 71335 41106 53522 6902 -72257 -55767 57525 92144 57904 -42984
4620 -42984 -107743 -117953 1756 124135 116733 73302 174626 262993 263290 264599 164238 17541
4608 17541 -44899 -18219 -81856 11836 64857 118282 2171 -46253 -26358 -58634 -96506 -144353
4596 -144353 -113804 -78944 -94714 -97868 -9359 -28784 15756 -68270 -171430 -271021 -237734 -129087
4584 -129087 -42855 48535 48637 -35614 -101649 -19557 24981 58001 62957 -12680 49365 75109
4572 75109 76297 7674 13510 -13941 -47446 -69693 -132165 -117339 -208313 -246335 -129782 -66178
4560 -66178 -144990 -103229 -30603 -28157 -62685 35907 33386 -1114 -28517 -30257 -94995 -111993
4548 -111993 -18401 46433 94206 -42558 -115556 -28696 -17248 23802 39179 91497 59546
4537 59546 36537 -9558 -84460 -135800 -84527 -28044 -92570 -32741 22251 28558 124463 117590
4525 117590 30226 -376 34938 70776 62226 53516 22301 15816 -42772 -77503 -120019 -131818
4513 -131818 -113495 -16751 -27552 -30597 -25841 1172 -30809 -53247 -88713 9027 -2750 25523
4501 25523 53956 32560 84541 63212 53857 23384 -34547 -35200 -1020 33562 49746 8487
4489 8487 -10934 -3470 85071 70472 69485 57532 22988 139039 81720 -25453 67852 61297
4477 61297 87905 138573 130183 230554 242953 139623 70376 21844 -20906 82406 138423
4466 138423 50810 9573 -23607 -54905 -94490 -126371 -71943 18119 17506 62322 101334 223673
4454 223673 205279 76939 -118891 -131435 -81707 -64243 -55346 -1261 60327 26819 97212
4443 97212 64109 -8003 118327 220425 206699 163727 143556 60727 -24960 -127702 -129439
4432 -129439 -23338 52772 -2879 -54 8308 3120 43398 -48202 368 129363 159903 101283
4420 101283 140932 128344 150824 87240 84533 38836 23852 -25357 -33898 37696 105027 150030
4408 150030 195206 171003 133804 104805 181921 200194 139722 182398 171934 165627 235998 173762
4396 173762 167630 95571 60299 112866 97627 90410 90559 189561 128182 123667 107895 88213 56318
4383 56318 158839 146832 99767 70219 -20545 -5248 4226 -29631 14773 24099 -65028 -188379
4371 -188379 -94393 11718 -53526 -53933 -4254 19433 -6088 -100016 -108973 -42740 20428 28979
4359 28979 -2995 -26756 30946 9913 -61099 -85784 -45572 15477 25426 10005 60351 -40384
4347 -40384 -75242 -13816 -58316 -109505 -76256 -42421 30790 101079 67824 31652 -4003 -14696
4335 -14696 21261 -44558 -37750 -8112 -83593 -149810 -143031 -151375 -90601 -9129 91925 92954
4323 92954 52057 15005 81278 62533 37159 116461 101858 120078 128052 103785 27646 15743
4311 15743 1880 -60106 -71416 -17201 -30376 -118910 -222185 -179916 -74311 -24818 45832
4300 45832 103389 179987 181493 106878 52388 -47817 -189001 -167576 -81363 44147 17665
4289 17665 59161 111408 113921 174025 240052 292568 186269 139449 80851 97728 83977 132152
4277 132152 141856 124756 -11847 -91998 14320 6453 12885 75307 72592 111563 112228 -17747
4265 -17747 -39972 -32674 -101420 -220616 -197082 -78443 -66587 -110617 -79677 -9594 10988 -47299
4253 -47299 -54725 -7541 5121 -46298 70627 95786 16078 95081 215599 159673 45678
4242 45678 -261 55265 3875 -108256 -81256 -67572 -102685 -61745 -81647 -60666 -57075 25905
4230 25905 100475 84595 72614 74191 -32631 -85516 -42856 37233 84192 68293 73301 53391
4218 53391 34081 -57461 -94605 -75015 -106700 -62038 -6689 -50249 -71780 -13166 44285 65575
4206 65575 62532 51309 39003 -5183 -135017 -180869 -171548 -182781 -184669 -125997 -56935 -63370
4194 -63370 -91010 -50144 -23335 -20046 15863 3548 -42857 -17400 -13361 -59690 -95096 -25703
4182 -25703 22765 -75615 -97616 -78005 -25796 83829 129370 127266 53274 36987 -43050 -37987
4170 -37987 72232 83857 109732 147771 105443 102714 -28991 -166203 -49081 -22590 -103962
4159 -103962 -132116 -90233 -75433 -55681 -30135 3141 38639 91811 92352 106803 133993 103483
4147 103483 -84768 -65731 8554 -7337 21246 -1919 -68162 -81063 7963 586 -36778 -116725
4135 -116725 -42253 1973 23313 42718 14341 -55019 -108702 -67891 -29075 -37790 10951 1
4123 1 -98673 -127306 -76608 56763 103546 79587 57154 -48247 -57767 -29111 -25064 56782 117343
4110 117343 75910 31781 69176 63806 -4884 -84507 -94392 17861 -77800 -81441 -13538 -27508
4098 -27508 -65694 -69401 -57461 -79256 -99247 -44322 -155191 -184589 -187302 -155618 -69250 -113044
4086 -113044 -95322 -82917 -88316 -28498 29318 -91750 -138891 -204250 -155443 -76654 -45845 -99822
4074 -99822 -26259 31927 137509 171066 172377 161992 137000 142006 111074 72997 105799 107021
4062 107021 -5678 -9784 80633 78518 38269 20030 -40257 -33528 99689 213642 120575 -22436
4050 -22436 96868 71592 -78196 -117277 -101121 36617 -8832 -12976 145090 109264 49129
4039 49129 63806 28226 -18774 35257 134603 136367 51837 39672 43016 -17287 -49425 -152239
4027 -152239 -102763 -40496 27310 -38934 -156191 -218404 -216155 -109933 -70516 -28847 -54871
4016 -54871 -96484 -122094 -99002 -179615 -114731 -118942 -14900 -42515 65710 100154 37145 76751
4004 76751 134672 130732 89673 58155 -9578 -78747 27857 162158 219574 204054 228685 286602
3992 286602 261098 154797 27873 53389 129782 213309 95440 21095 5219 -32629 -35153
3981 -35153 -64825 -99065 -95611 37490 95621 143316 92336 23185 114396 88037 -83398 -44441
3969 -44441 2560 -33553 -87997 -140783 -128122 -109219 -58103 -59361 -52261 -24357 96833 79149
3957 79149 42080 -39387 -126897 -152224 -214652 -131499 -24725 41326 15854 15144 -47263 -53910
3945 -53910 -59401 -49480 -78230 -61186 -60174 -38578 41558 -72421 -57653 97095 49520 19913
3933 19913 54515 88157 129875 55541 82069 146319 111064 57451 164749 153884 102130 122284
3921 122284 95470 60929 85588 77262 111853 112413 86171 34104 71363 149631 118060 103779
3909 103779 134055 121925 39815 613 16071 -13202 -18751 -24926 -121541 -136719 -31795 54442
3897 54442 -15785 59063 161080 -20858 -180979 -230736 -206376 -139147 -123700 -24408 20737
3886 20737 -54088 -83197 -116102 -116972 -115899 -129590 -117690 -29204 -42113 22287 -68102 -72106 -21255
3873 -21255 -29533 -96891 -220186 -230305 -149337 -185650 -151805 6659 31640 36784 83910 55561
3861 55561 -681 -59583 -73597 -31423 -78772 -123071 -75779 -129673 -111551 -109715 -107327 -214636
3849 -214636 -272091 -196087 -159073 -180559 -211413 -164055 -99791 -81029 -78015 -179896 -236221 -123595
3837 -123595 14738 12786 -46589 -76838 -163554 -91082 34295 -7760 -74956 -132401 -73162
3826 -73162 -45948 -52441 35667 109200 141435 61760 37946 75438 27784 -23480 -46196 -31912
3814 -31912 -107079 -143663 -99965 -39777 88776 82103 14670 -14272 54864 180943 89863 55147
3802 55147 45546 35874 -20864 -16346 44549 111225 57665 6840 -62651 -81884 -42592 -103731
3790 -103731 -95537 -23453 -40745 -27497 4902 17691 47969 137492 143297 35686 71284 144855
3778 144855 129641 110959 107102 115003 128577 183111 246332 146615 140416 120095 67344 20383
3766 20383 54499 -14724 -80715 595 28731 -33143 1680 56065 -42286 -132278 -121944 -77280
3754 -77280 -20885 43643 47556 7587 16919 66961 89276 104438 -12721 -153693 -91013 -32545
3742 -32545 -73128 -87072 -31537 -4692 15132 45723 -2607 74098 174762 159868 145531 95994
3730 95994 -3166 15074 51606 31506 6345 26705 99393 138767 86835 23608 100890 147805
3718 147805 81015 74742 109214 91749 22771 -103765 -144655 -143614 -39363 -36142 -114114 -8826
3706 -8826 57304 52548 -11872 -27056 -12595 2843 -48124 -99183 -159824 -75008 -7581 50626
3694 50626 12121 -95514 -96921 -56341 -71031 -127506 -225447 -184756 -6501 -19748 -71247 -52688
3682 -52688 -83871 -68757 -71819 -91711 -68924 36335 53822 68738 61082 708 78761 60793
3670 60793 16297 99315 102940 24236 116723 201767 44607 -98780 -49454 -39007 -20151 -235
3658 -235 -3189 26719 -7097 -51968 -21686 3814 62203 31779 40016 16226 -38953 -82455 -49608
3645 -49608 39014 25547 -47271 -77005 -37899 -31313 -53055 -115030 -81660 -87271 -146159 -171224
3633 -171224 -90018 -24539 80884 166634 84742 72585 110189 158833 96953 63106 -14046
3622 -14046 8386 22323 3467 -34687 -63587 -19645 74085 130374 104594 116588 97458 49628
3610 49628 62736 46603 71693 23653 -55258 -47623 -49989 -127902 -100428 -33633 -98366 -179735
3598 -179735 -160214 -74820 -36653 -81744 -118956 -108464 -60084 -12764 -66108 -193203 -217671
3587 -217671 -204675 -108340 -59540 2917 61446 54612 -70209 -225840 -263038 -147576 2899
3576 2899 36671 85244 146348 165838 67194 6854 -87475 -52443 50304 82359 -32933 -67072
3564 -67072 -58129 -82819 -117798 -101662 -86291 -62541 -91612 -86473 -95409 -55599 61734 11475
3552 11475 -51742 -70773 -6459 -26146 -42363 -5062 -29114 -13184 -47812 -65757 -34392 -10600
3540 -10600 27914 112568 65233 28466 -6161 85742 87356 -17506 -90269 -109909 -78448 -110177
3528 -110177 -76076 -58347 23799 -37111 -84165 -80748 14036 18425 -23456 -30617 38000 176431
3516 176431 130804 111274 134524 119855 104276 58141 78909 93135 69862 52669 61063 99728
3504 99728 90071 77678 46322 30608 36264 72684 76194 122555 166310 126692 71307 12786
3492 12786 43688 73132 224365 238927 136881 82079 6136 -48845 -19773 14970 -84679
3481 -84679 -115000 -114629 -100326 -129681 -42064 73472 154130 182630 205625 185651 113999 94876
3469 94876 78568 104505 114681 134673 85774 5195 -4067 107727 93280 91866 70728 54317
3457 54317 33606 -22500 -121605 -175938 -165924 -57860 -86851 -122473 -239371 -193285 -15664
3446 -15664 53073 92185 160416 73154 92263 178275 196145 143731 113333 107106 -39414 -4257
3434 -4257 -32705 11089 -49100 -79268 -36540 45544 33680 -28197 -82824 -87802 -132656 -88287
3422 -88287 22913 -10737 766 -47637 -71162 -29793 24424 67694 57788 -25015 -167844 -179756
3410 -179756 -49229 16335 -56825 -48779 -18449 -97539 -103227 -20885 -65303 -38489 24311 9334
3398 9334 38386 31630 20042 68967 166907 118918 -10025 -63587 58233 127485 107732 83715
3386 83715 16360 25058 27558 -4803 87390 122427 106605 19731 -154425 -137406 -15995 79654
3374 79654 28935 28248 32694 18137 36136 68171 32395 -99849 -158038 -155225 -31707 -25901
3362 -25901 -15019 54006 130579 39380 14497 69576 128506 161171 29998 -18247 62829 56944
3350 56944 13705 17091 -6398 -28133 19238 124696 56695 23732 113714 69778 111184 76198
3338 76198 37136 -40487 41888 23225 68601 -73935 -141189 -209009 -210006 -76738 -8750 46279
3326 46279 94884 94000 30645 35012 91 -48930 -29057 25295 83420 73552 30879 44693 40934
3313 40934 -90279 -74504 -16339 -15184 -17365 -61418 -40289 21022 -80136 -91531 -81647 29279
3301 29279 62099 51912 136760 141240 111304 68380 94068 3795 -109628 -138808 -96572 7052
3289 7052 37321 19713 30654 76290 67058 55501 2881 13441 -16396 -85606 -98661 -65143
3277 -65143 52765 82439 -76653 -110428 -55564 37128 184995 145008 67265 69700 55158
3266 55158 102575 114824 154828 197113 73960 73045 135332 138676 148070 209148 183553 168248
3254 168248 125606 -31192 -107271 -109403 -50885 -52907 -23963 -54799 -16413 -26542 14236 59810
3242 59810 90373 46670 11270 -26821 -32576 105979 242857 210278 107592 103979 59389 -16331
3230 -16331 -7852 32741 64331 43934 36551 64340 37936 -37324 -96811 -64703 26051 8206
3218 8206 -8836 -86549 -130757 -111198 21981 116763 106871 70560 117083 116897 164586 45611
3206 45611 -45555 7469 26717 55718 19906 -145598 -205376 -144577 -118069 -109130 -145296 -187313
3194 -187313 -180080 -124138 -31256 -61151 -86287 -9787 65529 31277 115822 152543 86957 46427
3182 46427 -109678 -128349 -109227 -177825 -67409 -35015 1630 -39385 -29053 56185 82287
3171 82287 82522 8499 -11037 32262 122316 152927 212131 178319 78471 25554 -31592 -53104
3159 -53104 -53997 -297 -5742 -5365 -9365 67952 81021 49699 -3244 19399 43041 -37591 -39711
3146 -39711 67042 84028 65431 185669 242889 159771 75928 15431 -13022 -69484 -26363
3135 -26363 -53157 -8818 34825 -2738 -103034 -25955 76102 -31803 -106154 -133922 -91021
3124 -91021 -36273 38234 142687 97065 13744 10275 -10928 -40606 22614 119352 67868 -35403
3112 -35403 -6612 -31781 31716 18084 18864 48046 40210 -26544 -74968 -18510 46935 51701 1896
3099 1896 21261 7234 -921 74125 150756 129903 61761 -2631 -35235 -71185 -30149 -107656
3087 -107656 -89916 -72910 -54514 -39652 29930 80400 85007 139477 106276 89648 122827 146690
3075 146690 133722 103880 144696 116611 133820 148865 162161 72724 8363 7212 83227 162867
3063 162867 109885 221413 84023 16610 -35398 -40294 106242 189626 173777 101085 37623
3052 37623 133217 97255 104617 134730 99256 3133 -73726 -44576 53815 136537 199650 226476
3040 226476 163496 221268 228515 104676 32107 -25588 -119778 -64019 -87883 -108659 -100248 -53758
3028 -53758 -32887 -17411 70534 98723 15986 -96030 -96948 -38626 14845 99981 113467 17898
3016 17898 29283 46131 19991 -35047 -97662 -40448 22767 17064 40111 44681 112612 110988
3004 110988 95797 116821 79385 27330 22137 44486 75024 102521 117470 22122 -54446 387
2992 387 87284 142567 160052 111063 147696 127588 24605 25290 -7087 -43102 -89036 -131030
2980 -131030 24516 138013 92506 40117 39402 92668 98824 55018 88434 131687 154143 64813
2968 64813 -3193 -29139 1399 11095 1946 -13092 -29660 -40417 -42671 16835 48305 52824 62305
2955 62305 78698 53031 -19021 -1088 -52514 -100171 -87020 -131597 -50322 87739 127612 53112
2943 53112 -2079 49265 -21060 7268 47572 40542 -39858 11411 132207 56323 -71776 -92847
2931 -92847 -34020 -32841 -12051 4153 30243 50407 30217 -37974 -50183 -71043 -88833 -19189
2919 -19189 72820 24065 -24855 -86951 -54686 36908 51153 65174 25603 77874 63541 69769
2907 69769 87935 131690 132048 138206 58780 11439 9465 49887 -7380 -124346 -75028 51029
2895 51029 83119 82592 71900 83413 75178 12498 -35134 -54295 -10538 73723 33847 23438
2883 23438 50677 78660 82722 -23098 -46919 -34958 -143715 -86335 -55932 -62412 -69195 -78912
2871 -78912 -94999 -146921 -9313 22186 -30385 1137 -91350 -157359 -108808 -33783 33058 -28730
$$ [...]
##END NTUPLES=NMR SPECTRUM
##END=
