##TITLE=Analysis number 310929
Compound Code gk 03207
Book Reference 442/22
Project Code adrs
Chemist Name miguelg
##JCAMPDX= 6.0         $$ Bruker NMR JCAMP-DX V2.0
##DATA TYPE= NMR SPECTRUM
##DATA CLASS= NTUPLES
##ORIGIN= Bruker BioSpin GmbH
##OWNER= NMR
$$ XWIN-NMR		Version 3.5
$$ Mon Jun 27 11:12:27 2005 GMT Daylight Time (UT+1h)  MAYBRIDGE\NMR@NMR_250MHZ
##.OBSERVE FREQUENCY= 250.131544655141
##.OBSERVE NUCLEUS= ^1H
##.ACQUISITION MODE= SIMULTANEOUS (DQD)
##.ACQUISITION SCHEME= undefined
##.AVERAGES= 16
##.DIGITISER RES= 18
##SPECTROMETER/DATA SYSTEM= dpx250
##.PULSE SEQUENCE= zg30
##.SOLVENT NAME= CDCl3
##.SHIFT REFERENCE= (INTERNAL, CDCl3, 0, 16.522)
##AUDIT TRAIL= $$ (NUMBER, WHEN, WHO, WHERE, WHAT)
$$ ##TITLE= Audit trail, XWIN-NMR		Version 3.5
$$ ##JCAMPDX= 5.01
$$ ##ORIGIN= Bruker BioSpin GmbH
$$ ##OWNER= NMR
$$ C:\u/data/dgb/nmr/ADRS/4850/pdata/1/auditp.txt
$$ ##AUDIT TRAIL=  $$ (NUMBER, WHEN, WHO, WHERE, WHAT)
(   1,<2005-06-27 11:12:04.94 +100>,<MAYBRIDGE\NMR>,<NMR_250MHZ>,
      <created by zg, POWCHK disabled, PULCHK disabled
       configuration hash MD5:
       62 19 C7 07 E1 42 D1 B7 37 6C 3D D0 77 39 F9 E6
       data hash MD5: 64K
       37 BE E6 A0 68 9F 8A 0B E1 54 6D 1D 60 E3 E3 1D>)
(   2,<2005-06-27 11:12:19.30 +100>,<MAYBRIDGE\NMR>,<NMR_250MHZ>,
      <Start of raw data processing
       ef LB = 0.3 FT_mod = 6 PKNL = 1 SI = 32K 
       data hash MD5: 32K
       40 BF E8 BC 74 4F 85 A7 DA 1B 83 F1 1D 47 42 EE>)
(   3,<2005-06-27 11:12:21.00 +100>,<MAYBRIDGE\NMR>,<NMR_250MHZ>,
      <apk 
       data hash MD5: 32K
       D6 B7 3A 6D 4B 43 B6 BD 09 70 7D 6C 07 08 41 E7>)
(   4,<2005-06-27 11:12:21.69 +100>,<MAYBRIDGE\NMR>,<NMR_250MHZ>,
      <abs ABSG = 5 
       data hash MD5: 32K
       64 16 31 36 C4 59 D2 99 FB 20 C7 AE 7E F7 71 F5>)
$$ ##END=
$$ 
$$ hash MD5
$$ F9 E8 92 95 2B 56 E8 DC C0 9F 2E 36 EF 21 21 3D
##$RELAX= 
##$RELAX= 
##$RELAX= 
##$RELAX= 
##$RELAX= 
##$RELAX= 
##$RELAX= 
$$ Bruker specific parameters
$$ --------------------------
##$DU= <C:\u>
##$EXPNO= 4850
##$NAME= <ADRS>
##$PROCNO= 1
##$TYPE= <nmr>
##$USER= <dgb>
##$AMP= (0..31)
100 100 100 100 100 100 100 100 100 100 100 100 100 100 100 100 100 100 
100 100 100 100 100 100 100 100 100 100 100 100 100 100 
##$AQSEQ= 0
##$AQ_mod= 3
##$AUNM= <au_zg>
##$AUTOPOS= <17 >
##$BF1= 250.13
##$BF2= 250.13
##$BF3= 250.13
##$BF4= 250.13
##$BF5= 500.13
##$BF6= 500.13
##$BF7= 500.13
##$BF8= 500.13
##$BYTORDA= 1
##$CFDGTYP= 0
##$CFRGTYP= 5
##$CHEMSTR= <none>
##$CNST= (0..31)
1 1 145 1 1 1 1 1 1 1 1 1 1 1 1 1 1 1 1 1 1 1 1 1 1 1 1 1 1 1 1 1 
##$CPDPRG= <>
##$CPDPRG1= <>
##$CPDPRG2= <>
##$CPDPRG3= <>
##$CPDPRG4= <mlev>
##$CPDPRG5= <mlev>
##$CPDPRG6= <mlev>
##$CPDPRG7= <mlev>
##$CPDPRG8= <mlev>
##$CPDPRGB= <>
##$CPDPRGT= <>
##$D= (0..31)
0 1 0 0 0 0 0 0 0 0.06 0 0 0 0 0 0 0.0002 0 0 0 0 0 0 0 0 0 0 0 0 0 0 
0 
##$DATE= 1119867123
##$DBL= (0..7)
120 120 120 120 120 120 120 120 
##$DBP= (0..7)
150 150 150 150 150 150 150 150 
##$DBP07= 0
##$DBPNAM0= <>
##$DBPNAM1= <>
$$ [...]
##$SUBNAM7= <"">
##$SUBNAM8= <"">
##$SUBNAM9= <"">
##$SW= 20.6930455092707
##$SWIBOX= (0..15)
0 0 3 0 0 0 0 0 0 0 0 0 0 0 0 0 
##$SW_h= 5175.983436853
##$TD= 65536
##$TD0= 1
##$TE= 295.16
##$TE2= 300
##$TE3= 300
##$TEG= 300
##$TL= (0..7)
0 120 120 120 120 120 120 120 
##$TP= (0..7)
150 150 150 150 150 150 150 150 
##$TP07= 0
##$TPNAME0= <>
##$TPNAME1= <>
##$TPNAME2= <>
##$TPNAME3= <>
##$TPNAME4= <>
##$TPNAME5= <>
##$TPNAME6= <>
##$TPNAME7= <>
##$TPOAL= (0..7)
0.5 0.5 0.5 0.5 0.5 0.5 0.5 0.5 
##$TPOFFS= (0..7)
0 0 0 0 0 0 0 0 
##$TUNHIN= 0
##$TUNHOUT= 0
##$TUNXOUT= 0
##$USERA1= <user>
##$USERA2= <user>
##$USERA3= <user>
##$USERA4= <user>
##$USERA5= <user>
##$V9= 5
##$VALIST= <valist>
##$VCLIST= <CCCCCCCCCCCCCCC>
##$VD= 0
##$VDLIST= <DDDDDDDDDDDDDDD>
##$VPLIST= <PPPPPPPPPPPPPPP>
##$VTLIST= <TTTTTTTTTTTTTTT>
##$WBST= 1024
##$WBSW= 4
##$XGAIN= (0..3)
0 0 0 0 
##$XL= 0
##$YL= 0
##$YMAX_a= 419753
##$YMIN_a= -460803
##$ZGOPTNS= <>
##$ZL1= 120
##$ZL2= 120
##$ZL3= 120
##$ZL4= 120
##$ABSF1= 16.522
##$ABSF2= -4.171173
##$ABSG= 5
##$ABSL= 3
##$ALPHA= 0
##$AQORDER= 0
##$ASSFAC= 0
##$ASSFACI= 0
##$ASSFACX= 0
##$ASSWID= 0
##$AUNMP= <proc_1d>
##$AZFE= 0.1
##$AZFW= 0.1
##$BCFW= 0
##$BC_mod= 0
##$BYTORDP= 0
##$COROFFS= 0
##$CY= 12.5
##$DATMOD= 1
##$DC= 0
##$DFILT= <>
##$DTYPP= 0
##$F1P= 14.0000005364418
##$F2P= -0.99999901652339
##$FCOR= 0.5
##$FTSIZE= 32768
##$FT_mod= 6
##$GAMMA= 0
##$GB= 0
##$INTBC= 1
##$INTSCL= 1
##$ISEN= 128
##$LB= 0.3
##$LEV0= 0
##$LPBIN= 0
##$MAXI= 10000
##$MC2= 0
##$MEAN= 0
##$ME_mod= 0
##$MI= 0
##$NCOEF= 0
##$NC_proc= -3
##$NLEV= 6
##$NOISF1= 0
##$NOISF2= 0
##$NSP= 0
##$NTH_PI= 0
##$NZP= 0
##$OFFSET= 16.522
##$PC= 1
##$PHC0= -74.31826
##$PHC1= 1.958759
##$PH_mod= 1
##$PKNL= yes
##$PPARMOD= 0
##$PSCAL= 4
##$PSIGN= 0
##$REVERSE= no
##$SF= 250.13
##$SI= 32768
##$SIGF1= 0
##$SIGF2= 0
##$SINO= 400
##$SIOLD= 32768
##$SREGLST= <1H.CDCl3>
##$SSB= 0
##$STSI= 32768
##$STSR= 0
##$SW_p= 5175.98343685301
##$SYMM= 0
##$S_DEV= 0
##$TDeff= 65536
##$TDoff= 0
##$TI= <Analysis number 999999
Compound Code 99
Book Reference 9
Project Code 9>
##$TILT= no
##$TM1= 0
##$TM2= 0
##$TOPLEV= 0
##$USERP1= <user>
##$USERP2= <user>
##$USERP3= <user>
##$USERP4= <user>
##$USERP5= <user>
##$WDW= 1
##$XDIM= 32768
##$YMAX_p= 487528535
##$YMIN_p= -109645
$$ End of Bruker specific parameters
$$ ---------------------------------
##NTUPLES= NMR SPECTRUM
##VAR_NAME=  FREQUENCY,     SPECTRUM/REAL,   SPECTRUM/IMAG
##SYMBOL=    X,             R,               I
##VAR_TYPE=  INDEPENDENT,   DEPENDENT,       DEPENDENT
##VAR_FORM=  AFFN,          ASDF,            ASDF
##VAR_DIM=   32768,         32768,           32768
##UNITS=     HZ,            ARBITRARY UNITS, ARBITRARY UNITS
##FACTOR=    0.157963299565203, 1,           1
##FIRST=     4132.6476996994, 0,             0
##LAST=      -1043.33573715361, 0,           0
##MIN=       -1043.33573715361, -109645,     0
##MAX=       4132.6476996994, 487528535,     0
$$ Real data points
##PAGE= N=1
##DATA TABLE= (X++(R..R)), XYDATA
$$ [...]
18384a5685l402P395J842k1223J0814J2097L0853J98q386p518J4013k7792j9982
18371b6776K4179P236j389K5552J8495l937J6251N927J3949k5127k4534j1091
18359A8735l304L0004J9955j1800j0279j729p471r882o337p045N183K1324M473
18346D1827J6530Q113L2776J9628J9535j6492m439L5409N4361K0450p858j2194
18334B07646J0445m3471l4712j5924j8447k2756k6156l4265p743n018J5525O233
18322C1357K274r962N748p448j930Q143k2439j8042j5771j0933L5790L5499Q162
18309D0448m0168l7947J0351m9P63p851J8405n995K2658J1914p19j9889J110k632
18295i601j051j0960k7513l05M480L1892J7467p409k4985J2371K1332l0007J6370
$$ plain form
18384 -15685 -19087 -11692 -9850 -31073 -20259 -8162 22691 22889 14503 6985 20998 -6794 -26776
18371 -26776 -2597 4639 3250 28802 47297 43360 59611 65538 79487 54360 29826 18735
18359 18735 15431 45435 65390 53590 43311 41582 34111 24229 17892 10847 16030 37354 41827
18346 41827 58357 66470 99246 118874 138409 121917 117478 152887 207248 227698 219840 207646
18334 207646 218091 174620 139908 123984 105537 82781 56625 22360 14617 9599 25124 31357
18322 31357 33631 23669 29417 21969 20039 28182 5743 -12299 -28070 -39003 -3213 32286 40448
18309 40448 280 -37667 -27316 -27365 -26602 -34453 -16048 -22043 615 12529 11810 -8079 -6969 -9601
18295 -9601 -10652 -21612 -49125 -49430 -44950 -13058 4409 -3000 -27985 -15614 5718 -24289 -7919
18282g919j3045k2111J1474N330l1705j4345J4419K4204J0777J3315L7568P520
18270C5482q230l8711j1193M412L661k3191J3149K4774j6698q644L47K3575R325
18257H058n127j7931l6j35j7531k4663K0800L7847J8880N932K3764l9564o1930
18244e1636k2582L426L9417N7005J1224k3813j1741J459j0647K3566J6939R775
18232D2392j6717p025l810J125J1553J805M6159R088q195o176K57K3871J4265
18219A08592j5699m385M697r209L633K9573j3051n55K3340K2356J244j7863K5229
18206A57902J9714J2550P518l0410R019J5316q265j0912j1473k390L3401L8578
18194B30548K2287r841k9303J2626K9026j8585l174r740m587L3006L9815J9659
$$ plain form
18282 -7919 -20964 -43075 -31601 -26271 -57976 -72321 -57902 -33698 -22921 -9606 27962 35482
18270 35482 27252 -11459 -22652 -18240 -14579 -37770 -24621 153 -16545 -25189 -24842 -1267 8058
18257 8058 2931 -15000 -15036 -15171 -32702 -57365 -36565 1282 20162 26094 49858 10294 -51636
18244 -51636 -74218 -70792 -31375 25630 36854 13041 1300 2759 -7888 15678 32617 42392
18232 42392 25675 18650 14840 15965 27518 29323 75482 84570 76375 70199 70456 94327 108592
18219 108592 92893 88508 93205 83996 87629 117202 104151 103596 126936 149292 150536 132673 157902
18206 157902 177616 190166 197684 167274 176293 191609 183344 172432 160959 158569 191970 230548
18194 230548 252835 242994 213691 226317 255343 236758 233584 223844 219257 252263 292078 311737
18182C11737J5311L644L0722K5870R602K0235L0750K4771L4125N4073L2484m581
18170E88743J9999Q551K1052M3227L1672K3585K1770J4761j180K9893R409j7472
18158G94010p558R580L7086J1688J1433J3042M8779O5912L7412L3417K4924J8570
18146A098295L9929M7989L8203K1025L7040L2270N4872M2785M6629N5443N6876
18135A571356M3720K8003M0313N5727N4179M3915R2238J16942P4216R1563J38844
18124B351016J51236J77067K29759K52181K71613L30978M32307N83251Q22412
18115E601820J148024J643768K321506L323995M782854O477773P106531L410289
18107C5816560k867805o002645n244023l379239k107240j303939p19694l14460
$$ plain form
18182 311737 327048 330692 361414 387284 396886 417121 447871 472642 506767 560840 593324 588743
18170 588743 608742 617293 638345 681572 713244 736829 758599 773360 772180 802073 811482 794010
18158 794010 786452 796032 833118 844806 856239 869281 918060 983972 1021384 1054801 1079725 1098295
18146 1098295 1138224 1186213 1224416 1245441 1282481 1314751 1369623 1412408 1459037 1514480 1571356
18135 1571356 1615076 1643079 1683392 1739119 1793298 1837213 1929451 2046393 2120609 2212172 2351016
18124 2351016 2502252 2679319 2909078 3161259 3432872 3763850 4196157 4779408 5601820
18115 5601820 6749844 8393612 10715118 14039113 18821967 25299740 32406271 35816560
18107 35816560 32948755 26946110 21702087 18322848 16215608 14911669 14191975 13877515
18099A3877515J1550K94267N70374Q53059J179299J610052K202595K956342L955352
18090B7510405N319190P010061Q928521J0820350J2087910J2058612J0570458
18083I4305507P483101K909333k103246o248877q857287r965653r768080q662985
18075E9091813p172245n767671m589301l619104k918051k418521k072942j784353
18067B8749625j560918j369873j235972j131471r39918q03122o89209n79845m53735
18058A9985562m04799l78435l49449k82742k56132k38839k25455k20530k54934
18049A7374247l05672l58865m05205m06874m45360m66134m96734n53427n54599
18040A3381377n90933o65692o51112o12612n80452n74486n33104m62038m24783
$$ plain form
18099 13877515 13889065 14183332 14753706 15606765 16786064 18396116 20598711 23555053 27510405
18090 27510405 32829595 39839656 48768177 59588527 71676437 83735049 94305507
18083 94305507 101788608 104697941 102594695 96345818 87488531 77522878 67754798 59091813
18075 59091813 51919568 46151897 41562596 37943492 35025441 32606920 30533978 28749625
18067 28749625 27188707 25818834 24582862 23451391 22511473 21708351 21019142 20439297 19985562
18058 19985562 19580763 19202328 18852879 18570137 18314005 18075166 17849711 17629181 17374247
18049 17374247 17068575 16709710 16304505 15897631 15452271 14986137 14489403 13935976 13381377
18040 13381377 12790444 12124752 11473640 10861028 10280576 9706090 9172986 8710948 8286165
18031H286165m26031m42318l63783l49511l39418l05068k91714k96173k74859
18022E197290k64673k37322k14182j95125j78160j72258j86069j57217j66473
18013C425811j40647j28503j41884j26421j03061j02894j25273j11985o8278q0549
18003B296316r6662j27972j21003p4915m6828p9893m1446m1710k2622l1898l4387
17992A576980j2044k5166q043O585J8451K1347J2783L0659N5274K8327m7248j7110
17980A640795j9922j4490n158k9577p6443r1540l8812m7818p6854r9823n9779
17969A080579p7218l7835k7782n0150l3321j8024l2518j4672k964k2391M816K0214
17957G88734n124R097j1139N646M966L578R600L0319k403L838L4973k0385m3371
$$ plain form
18031 8286165 7860134 7417816 7054033 6704522 6365104 6060036 5768322 5472149 5197290
18022 5197290 4932617 4695295 4481113 4285988 4107828 3935570 3749501 3592284 3425811
18013 3425811 3285164 3156661 3014777 2888356 2785295 2682401 2557128 2445143 2376865 2296316
18003 2296316 2199654 2071682 1950679 1875764 1828936 1749043 1707597 1665887 1643265 1611367 1576980
17992 1576980 1564936 1539770 1531727 1538312 1556763 1578110 1590893 1621552 1676826 1705153 1657905 1640795
17980 1640795 1620873 1606383 1601225 1571648 1495205 1403665 1364853 1317035 1240181 1140358 1080579
17969 1080579 1003361 965526 937744 887594 854273 836249 803731 789059 786095 763704 768520 788734
17957 788734 783610 792707 781568 787214 792180 795758 805358 835677 833274 837112 872085 851700 808329
17944H08329m184M742r315M07J7847M0898K8421j4355l056J7137J7727r714k1391
17931H73493J2450K2257J2159L011k7538r949k391l0497n1162k5953k4523n403
17919G45954j5903J2347m141j9871k1403L805K870o906n978L9660L5797l366o1003
17906G01862j9651O180M634M267l2399j9766J0174K5575K311k7792j6188m005
17894F35202k91J3579k2960j669j9375p376j243l1728P816M613K323j6654m242
17881E57995R431k9300l4545o837r293j6233J0901k135j7293M383l3510k3937
17869D09627j6589j8307P008K5854L4733j0231l3667j6129l9328j7404J8044m215
17857C39396l2249l1918J8025L9562l029q296k2711n249J2211K2068j0818k7927
$$ plain form
17944 808329 804145 808887 799572 799979 817826 858724 887145 872790 869734 886871 904598 894884 873493
17931 873493 885943 908200 920359 923370 895832 885883 883492 852995 801833 775880 751357 745954
17919 745954 730051 742398 738257 718386 696983 700788 703658 696752 690774 730434 766231 762865 701862
17906 701862 682211 688391 693025 697292 664893 645127 655301 680876 683187 655395 639207 635202
17894 635202 634911 648490 625530 623861 604486 597110 595867 564139 571955 576568 578891 562237 557995
17881 557995 567426 538126 503581 496744 487451 471218 482119 479984 462691 467074 433564 409627
17869 409627 393038 374731 381739 407593 442326 432095 398428 382299 342971 325567 343611 339396
17857 339396 307147 275229 293254 332816 329787 321491 298780 293531 305742 327810 316992 289065
17845B89065l7407r671j4010P648l1461J6581J5456p78k463J9733M723j7207j0806
17832B29403K2497L2445l155j6774j7997j3690j9449l7173q066k11J1443j8320
17820A60953j1935k8277j1886L3108k033J545P485j1532R404K5060l7588k3389
17808A10915j9241O88Q67P407o291Q447J6840J4150j7560M542l6707J6369M1445
17795A41871K5563K2195j4886O014J585j9848j1506p581q373K1277J1519j7269
17783A50561Q009L4646j8775m0785m908j1371p472J1166J2945K2512J0626k8860
17771A38294j0492L6880k55j8583k0206R150J4788q999K764k850k0610k832L411
17758A20460j1060K5600J9351r570j84J8114L180j8866J1461R331p449k2447o869
$$ plain form
17845 289065 251658 241987 227977 235625 204164 220745 236201 235423 232960 252693 257416 240209 229403
17832 229403 251900 284345 281190 264416 246419 232729 213280 176107 168041 167830 179273 160953
17820 160953 149018 120741 108855 141963 139930 141475 148960 137428 146832 171892 134304 110915
17808 110915 91674 92362 93229 100636 94345 102792 119632 133782 116222 120764 84057 100426 141871
17795 141871 167434 189629 174743 180757 182342 162494 150988 143407 135034 156311 167830 150561
17783 150561 158570 193216 174441 133656 128748 117377 109905 121071 134016 156528 167154 138294
17771 138294 127802 164682 164427 145844 125638 134788 149576 140577 143341 140491 119881 117049 120460
17758 120460 109400 135000 154351 144781 144597 162711 165891 147025 158486 167817 160368 137921 131052
17745A31052J5189J9401m3305j8939J3692P837J8737j1537j8534L9313K645l1070
17733A24481k7450j0179k080m906N978L3401J1686j972Q789m1333j8470l85k1293
17720E6267L0033K7873j5433K4114K6451j5911j4831k9836j396J7939k4015j1078
17708G0177l525l328l3778j98K3432l830j7676n005M3794p200k4791q231j7931
17695A1910K5076K9006J4807J0270Q547J2910l1031l9532M976J379K2318j0525
17683F0111j4550J0009q521l169P767J6770r45j9478j7820K989J416K1552K2808
17670G8939q811j1037K6216K977k6696l4707J6246J6774J029J1305j1230j3884
17658D7121L337m949K5802K7500k3640J0057m074k3075k3612p663J8497K8170
$$ plain form
17745 131052 146241 165642 122337 103398 117090 124927 143664 132127 113593 152906 155551 124481
17733 124481 97031 86852 84772 79866 85844 119245 130931 128959 137748 96415 77945 77560 56267
17720 56267 86300 114173 98740 122854 149305 133394 118563 88727 87331 105270 81255 70177
17708 70177 66652 63324 29546 29348 52780 48950 31274 26269 70063 62863 38072 29841 11910
17695 11910 36986 65992 80799 91069 99616 112526 81495 41963 46939 48318 70636 60111
17683 60111 45561 55570 47049 43880 51647 68417 67472 47994 30174 33163 34579 56131 78939
17670 78939 70128 59091 85307 88284 61588 26881 43127 59901 60930 72235 61005 47121
17658 47121 50458 45509 71311 98811 75171 85228 81154 58079 34467 26804 45301 73471
17646G3471N843l5375l048j7756J4116L3184j7240j2734j2921k933j6330r245
17634i68J6314L5450K0012L145K568j5824l713J6632Q180j7181j8301J1560j2927
17621D4947j3410K5796o939P347J0138J2338j7885k3400M089K496L086l4898O089
17608A9794J8900J6879K2045K1361j2826l6357j6376J5477L173k987q664J1077
17596E1496j0033q35o906j5904J3472J0546K0007J2036j1547o438j2557k139K7943
17583F9141l010L726o388k0381r441K0347r182k0992K1766R299R794L0460J9265
17570A14404j8209l2573j4764J5379J7358R47q168J8381l061n421j7516j7964
17558D8793J9948n934j2184k3154j2470l932K0856M408j0020k554m212m786j1376
$$ plain form
17646 73471 79314 43939 40891 23135 37251 70435 53195 40461 27540 24607 8277 -968
17634 -968 15346 50796 70808 73953 76521 60697 56984 73616 81796 64615 46314 57874 44947
17621 44947 31537 57333 50394 57741 67879 80217 62332 38932 43021 45517 48603 13705 19794
17608 19794 38694 55573 77618 98979 86153 49796 33420 48897 52070 49083 40419 51496
17596 51496 41463 40628 33722 17818 31290 41836 61843 73879 62332 55894 43337 41198 69141
17583 69141 66131 69857 63469 43088 33647 53994 44812 23820 45586 54885 64679 95139 114404
17570 114404 96195 63622 48858 64237 81595 82542 74374 92755 89694 84273 66757 48793
17558 48793 68741 62807 50623 27469 14999 11067 31923 36331 26311 23757 19545 14759 3383
17545C383p325R30J1844P503K4171l2481j4122M802N546m325l364L3279J5342
17532D5183Q647K297L5785m147r681n0642q27k518J396P662J1625j2537j4525
17519A7718k7262j799L9881M2727j8341m3471r715R059P347R671k4627k3897M537
17506a8172J2092K2588m257j8206N922K2940L0712o342k044P654qj1970K6561
17493F7470J5530k7358J5192K2850j1689l7364m131j9738K0126N9014L7197K1237
17481A58336K2388L4083M3159M2081R1514Q4358L3961M8690R535j7104k9725l4753
17469D86523n7192n8676p5820l3826o795j6655J6233P836l6326j0152m984j9259
17457A90907m4573l3979p162J7344K2299J6656K5975J0980o983J2893M566J0963
$$ plain form
17545 3383 -3942 -3012 8832 16335 40506 8025 -6097 -1295 4251 -74 -3438 29841 45183
17532 45183 53830 56127 91912 87765 78084 27442 26615 24097 25493 33155 44780 32243 17718
17519 17718 -9544 -11343 28538 71265 52924 9453 -262 8797 16144 25815 1188 -22709 -18172
17506 -18172 -6080 16508 12251 -5955 -33 22907 53619 47277 45233 52887 52879 40909 67470
17493 67470 83000 55642 70834 93684 81995 44631 40500 20762 40888 99902 137099 158336
17481 158336 180724 214807 257966 300047 391561 475919 509880 558570 568105 551001 521276 486523
17469 486523 429331 370655 294835 261009 254214 237559 253792 261628 225302 215150 210166 190907
17457 190907 146334 112355 105193 122537 144836 161492 187467 198447 191464 204357 208923 219886
17445B19886m152P365J2833J1246q986R223l8093n0722l6997j6480K5552R998
17433A40673l4441L048k141j6920M192l0743j1655P146m671m475j4158r76J9911
17420E4790K0408r886j9239O113J0030l763O631j084J828P693j1938k3574J1533
17407D9542l3905o616Q510J3134r31K2622J4238J7393k6560n934R67N961n959
17394E2462l6803j7632K2533P192k3186J4334j3152J062J7250N207n55K4532o085
17381D7159q600l3036L457M1077J8232j6798j0002k046N70n151j2616K81J7293
17368C9820j5727O85q559N941k863J4498j9249n426j6369n502O601Q904j388Q016
17354I382j5939m400J4959L4869O30J574J2593m2778l6969R023K1419K3449K0032
$$ plain form
17445 219886 215734 223099 235932 247178 238192 247415 209322 158600 121603 105123 130675 140673
17433 140673 106232 109280 107139 90219 94411 63668 52013 59159 54488 50013 35855 34879 54790
17420 54790 75198 65312 46073 52186 62216 58453 65084 64000 65828 73521 61583 38009 49542
17407 49542 15637 9021 17531 30665 29734 52356 66594 83987 57427 51493 52460 58421 52462
17394 52462 15659 -1973 20560 27752 4566 18900 5748 6810 24060 29267 28712 53244 47159
17381 47159 38559 5523 8980 50057 68289 51491 41489 39443 40013 34862 22246 22527 39820
17368 39820 24093 24778 16219 22160 19297 33795 14546 9120 -7249 -12751 -6150 2754 1366 9382
17354 9382 -6557 -10957 4002 38871 39501 41075 53668 10890 -26079 -17056 4363 27812 47844
17341D7844p874j4504Q27j6354k2804J8457j2800L3873K2156j0192L446J012o381
17328C6706n141k1007j0647R59Q150j7664L122L9235J8090k4792k0304p83l158
17315B766j1693q003M4376K4801K498j1454k1317K514K2703O68j6371k6055P95
17302F228Q077p707j5106M948J5487K934R82m011j8828l0394J3274M2507l9928
17289b1537k4552Q870o751P989K1392J2244O525L4281K2558l479k4822l2048j1655
17276a0985Q612Q491M0152M058n1839l4076q587J890k4752J947K6446L5106k8498
17263c2035j454L4721K0051j5285M666k5063j5703n711O400J0867J9600J2220
17251A3274K5737K3319j5944j2112L7467R843j3526m7078l2883p182K3674J2809
$$ plain form
17341 47844 39970 25466 26293 9939 -12865 5592 -7208 26665 48821 38629 42075 43087 36706
17328 36706 31565 10558 -89 870 9020 -8644 -5522 33713 51803 27011 6707 5924 2766
17315 2766 -8927 -16930 27446 52247 54745 43291 21974 24488 47191 47859 31488 5433 6228
17302 6228 14305 6598 -8508 -3560 11927 14861 15843 11832 -6996 -37390 -24116 18391 -21537
17289 -21537 -46089 -37219 -43970 -35981 -14589 -2345 4180 38461 61019 57540 32718 670 -10985
17276 -10985 -2373 6118 46270 50328 -1511 -35587 -44174 -42284 -67036 -65089 -38643 -3537 -32035
17263 -32035 -33489 1232 21283 5998 10664 -14399 -30102 -35813 -29413 -18546 1054 13274
17251 13274 39011 62330 46386 34274 71741 81584 68058 20980 -11903 -19085 4589 17398
17239A7398k2705p033q986J6959J3541p347K2385K6682j4131J0521R845J0595
17227F7724k2927m0885k567J6808q464j5388k1578n345K6497J3756P725K3807
17215C9163p11j3921N306J9840n592j0361p057l3408k8135p606R138K3207L2684
17202B2547L6737l4538j8403m627K4750L662j4496N609k0912Q932J8864l9431
17190a1306q894K8468k154k5033k378r072k397J4136L5388R61j2231l5091J3777
17177a5826K3860p919J522Q534K1309j1600m3762j1701J6348l124K1742K7509
17165B6892l4846j9206r60L4550K23O290M738l139K1241q623l1732j4765R749
17152i588L222M013L500m048j7475J2411k593r108J734K3253k1599j4437j1785
$$ plain form
17239 17398 -5307 -12340 -21326 -4367 9174 1827 24212 50894 36763 47284 57129 67724
17227 67724 44797 3912 1345 18153 9689 -5699 -27277 -32622 -6125 7631 15356 39163
17215 39163 38452 24531 29837 49677 44085 33724 26667 -6741 -34876 -42482 -33344 -10137 22547
17202 22547 59284 24746 6343 1716 26466 30128 15632 21241 329 9261 28125 -11306
17190 -11306 -20200 8268 6114 -18919 -21297 -30369 -32766 -18630 16758 17719 5488 -29603 -15826
17177 -15826 8034 115 1637 10171 31480 19880 -23882 -35583 -19235 -22359 -617 26892
17165 26892 -7954 -27160 -28120 6430 6653 12943 17681 14542 35783 27160 -4572 -19337 -9588
17152 -9588 -6366 -2353 1147 -2901 -20376 -7965 -10558 -19666 -17932 5321 -16278 -30715 -42500
17139d2500N837j0957o508p14J9264L4394J5127J0304J4133j0952l7079Q610J4025
17126A2984L424J4735j040j4162j0661J2812K5828o130k9694l4659Q989L446K2531
17113H403J2315q824j7752L2097J342k0612o918K2975k2j3459J4235J1137j3131
17100B1786l4874J7009J3129L3156j2931J785P319o62k8517r956J8613k1042k4597
17087a9782M487J7930k018L454j368j6241j4505K7866L0530j9585m5221m9J8217
17074a6285K6961J5808j5964k7238j2165K2952R137K2072J9607q18P77k6515m304
17061A4025m711J3181O181l1778j4298N329P829k0806P035J5856K2147j4173J337
17048G154l456j4054J9110j8469j7410j991J6095K3805j2434K7610J5564n5448
$$ plain form
17139 -42500 -36663 -47620 -54128 -54842 -35578 -1184 13943 24247 38380 27428 -9651 -1041 12984
17126 12984 16408 31143 30103 15941 5280 18092 43920 37790 8096 -26563 -17574 -14128 8403
17113 8403 20718 11894 -5858 26239 27581 6969 51 23026 23004 9545 23780 34917 21786
17100 21786 -13088 3921 17050 50206 37275 39060 46379 45717 17200 7244 25857 4815 -19782
17087 -19782 -15295 2635 617 4071 2703 -13538 -28043 -177 30353 10768 -34453 -34502 -16285
17074 -16285 10676 26484 10520 -16718 -28883 -5931 3206 25278 44885 44067 44844 18329 14025
17061 14025 9314 22495 28676 -3102 -17400 -12071 -4242 -25048 -18013 -2157 19990 5817 7154
17048 7154 3698 -10356 8754 -9715 -27125 -29116 -13021 10784 -1650 25960 41524 -13924
17036a3924n0650J0373J4044K1012K7717J3604j1058p200n506j8746m467K3277
17024a524K1491J2240j3082k3670q417q84l216q623q238K8628M4559J814j9060
17011B2018m4313j7612K3153P602K1820l299k5371M577L2163J138k1609K337N326
16998G930j4323n661R145K7003n448n051M53R460j8720M40J2004j2705l2781N258
16984b2996j283K6747K666L1496J1796k6359k2002p539O719P426j8934j458k390
16971a6111L2964J4286j1460o651L494J1283M476k5994k18J6087N054q613j8167
16958D30k958k6098j1671m046L687K3417J0346j392J1754J7862J831J5016K1269
16945E9447j0564k6717j2706Q531K5906P603o402m0833j1060R462N273p33j5210
$$ plain form
17036 -13924 -64574 -54201 -40157 -19145 8572 22176 11118 3918 -1588 -20334 -24801 -1524
17024 -1524 19967 32207 19125 -4545 -12962 -13846 -17062 -25685 -33923 -5295 39264 41078 22018
17011 22018 -22295 -39907 -16754 -9152 12668 9369 -16002 -11425 20738 21876 267 2604 7930
16998 7930 -6393 -12054 -2909 24094 18646 13595 14048 23508 4788 5228 17232 4527 -28254 -22996
16984 -22996 -24279 2468 5134 36630 48426 22067 65 -7474 -755 6671 -12263 -13721 -16111
16971 -16111 16853 31139 19679 13028 16522 27805 32281 6287 6069 22156 27210 18597 430
16958 430 -2528 -28626 -40297 -44343 -40656 -17239 -6893 -8285 3469 21331 23162 38178 59447
16945 59447 48883 22166 9460 17991 43897 51500 45098 4265 -6795 2667 7940 7207 -8003
16932h003l892K9343J3030p477p273K5556K6965k6276j7557j7328P435J0486j4188
16919A0821J951p128J1791l5485J9532q040m3782n599L3254o148l776L705L8813
16906I909K5166j9748k5047K6587q441j2521m641L236l507J4933n133J0560J5977
16893B7330J9543r597n274J3784k2155j6246J2084K5682j0506O520j875m4080
16881d790m446J0610j5180J4693J509P864j9047m336J9298m20R155L082k814j3570
16867A608k7877J4098l534O928k5973k490J5478K3792K46O664L504K5852Q548
16854D6844J4842J2543J901k6501l8297k3273Q61n933r498K9873J6672K502R079
16841C1615o508m6361q541P435K9068K5533m527k4122P454j0179k5692J261J6941
$$ plain form
16932 -8003 -11895 17448 30478 23001 15728 41284 68249 41973 24416 7088 14523 25009 10821
16919 10821 12772 5644 17435 -18050 1482 -6558 -50340 -55939 -22685 -28833 -32609 -28904 9909
16906 9909 35075 15327 -9720 16867 8426 -4095 -8736 -5500 -9007 5926 793 11353 27330
16893 27330 46873 37276 32002 45786 23631 7385 19469 45151 34645 41165 39290 -4790
16881 -4790 -9236 1374 -13806 887 2396 10260 -8787 -13123 6175 5755 14910 17992 15178 1608
16867 1608 -26269 -12171 -15705 -8777 -34750 -37240 -21762 2030 2276 8940 12444 38296 46844
16854 46844 61686 74229 76130 49629 11332 -11941 -11080 -17013 -26511 3362 20034 22536 31615
16841 31615 25107 -21254 -29795 -22360 6708 32241 27714 3592 11046 867 -24825 -23564 -6623
16828f623J0640j966k8652K1267K4128M548k5602P901P583L176k8817J5043R465
16815A2091j229k8048O849j3061K7329j5966k8373L935M4505K8845m0528j0727
16803a4378J8209Q051r07l23L956K003Q177R346R173J2568K0831j5913j9855p238
16789C3700m3195l9339k894Q18j5947L5227N3021O288l0262n991R32k2678j4816
16776d5136K3480J5646M234K884J6462k1207L555J0862J8640N130m3548M282m736
16763i452j2614j232K968N667J868Q484j0034L821J0109k1700l632K0324K1927
16750A6504J5365l2275O688K1339j5312k6395J3460J6645l0509n772M5337Q62
16738B5937j2301k247L1034L1997j0313k6804j5580k971J4529o910j0056L7795
$$ plain form
16828 -6623 4017 2051 -26601 -5334 18794 23342 -2260 5641 13224 16400 -12417 2626 12091
16815 12091 10862 -17186 -10337 -23398 3931 -12035 -40408 -36473 8032 36877 -3651 -14378
16803 -14378 3831 11882 10975 10652 14608 16611 24788 34134 43307 55875 76706 60793 40938 33700
16789 33700 -9495 -48834 -51728 -50910 -66857 -31630 21391 27679 -2583 -8574 -7642 -30320 -45136
16776 -45136 -21656 -6010 -1776 1108 17570 -3637 -82 10780 29420 34550 -8998 -4716 -9452
16763 -9452 -22066 -23298 -20330 -14663 -12795 -4311 -14345 -10524 -415 -22115 -25747 -5423 16504
16750 16504 31869 -406 6282 27621 12309 -14086 -626 16019 -14490 -20262 25075 25937
16738 25937 13636 11389 42423 74420 64107 37303 21723 18752 33281 26371 16315 54110
16726E4110K531k5110k7522J8746L5928o209o605R902j1100j6166k6606N872j566
16713F205J4811P480J0230j2868n031L4044k9565j1784n903J970J7280K5505j6758
16700C5616j9111j3937m825j889M822k1206l9423K2725L531n173j7081k4264J3585
16687f6630M3352P353K5808K3985q212k4205J2831M3949M350j1424j579P900N118
16674F2596j1467j6760Q725P301M51J3719j1354m7699K1074k4202k3675J5839
16662e452n307O350L275k073L168J0126j1907P473M691K857O964j8130k2655j279
16648b1899J1800J6523R915k0416k2495K856J423J9152J5789J6340n598r199N288
16635A9479j2646j2934j4965J3245J3590O234k5223j0379L2060Q506L464J6031
$$ plain form
16726 54110 56641 31531 4009 22755 58683 52474 45869 55771 44671 28505 1899 7771 6205
16713 6205 21016 28496 38726 25858 20827 54871 25306 13522 7619 9589 26869 52374 35616
16700 35616 16505 2568 -2257 -4146 676 -20530 -59953 -37228 -33697 -38870 -55951 -80215 -66630
16687 -66630 -23278 -15925 9883 33868 25656 1451 14282 58231 62581 51157 49578 57478 62596
16674 62596 51129 34369 43094 50395 50846 64565 53211 5512 26586 2384 -21291 -5452
16662 -5452 -10759 -4409 -1134 -3207 -39 10087 -1820 5653 10344 13201 20165 2035 -20620 -21899
16648 -21899 -10099 6424 16339 -4077 -26572 -23716 -22293 -3141 12648 28988 23390 14191 19479
16635 19479 6833 -6101 -21066 -7821 5769 12003 -13220 -23599 8461 16967 20431 36462
16623C6462k01j6084l9894m863J8233O594j5150K0863K0331J3426j1804j0993
16611A6920k4678l5935K2843K2332l930o786J4208k4933j1577n230j2988k1708
16599g1462J7690R440o739r88L6566L0515L233j1360j638J809j2330l1129K6463
16586i930J8754K3129j398K663K262j1251l1523J1030m562N955j6563j5877L998
16573b3313J2620j8580k0340N070J0255J3080J5962K980j6864j4740P54J566J3320
16560a8230J9336M0340p690p521j4364O823K904k2383j6860q406j2648k986J2899
16547b8786L333N802J7663J9174J7439q011j0612j4999j466j7646j5820j6180
16535e0109L7393l536j4299M0490L6156m551j3370l11j7157j9432K86R693J135
$$ plain form
16623 36462 36261 20177 -19717 -24580 -6347 247 -14903 5960 26291 39717 27913 16920
16611 16920 -7758 -43693 -20850 1482 -2448 -9234 4974 -19959 -31536 -36766 -49754 -71462
16599 -71462 -53772 -44332 -51071 -52059 -15493 15022 18255 6895 5257 7066 -5264 -36393 -9930
16586 -9930 8824 31953 30555 33218 35480 24229 -7294 3736 -826 5129 -11434 -27311 -23313
16573 -23313 -10693 -29273 -49613 -44543 -34288 -21208 -5246 -2266 -19130 -33870 -33116 -31550 -18230
16560 -18230 1106 41446 33756 26235 11871 18694 21598 -785 -17645 -26051 -38699 -41685 -28786
16547 -28786 -25453 -19651 -1988 17186 34625 26614 16002 1003 -463 -18109 -33929 -50109
16535 -50109 -12716 -16252 -30551 9939 46095 41544 28174 27863 10706 -8726 -8440 1253 2388
16522B388j117J9958J3914k9326j1231P099j6639k4213k5404L375J9613Q295K1052
16509a2236P01P311R882l913J9603p293j7870k1917J0987K085l731J1416J7087
16496A2112K0857R61j7176k2074l3583J340M3447j8314l9447L7074L0918L2720
16484D8835J739m0353l1973k863L2986q694n42J9602j1893l4527K415K9527M1027
16471D5286j8523k0699J1364K2857J352j0037j8290p080j0454J829K0187q206
16459I586R190J5810l964r707l4397k5066K011N8j3541o212l01L5084K9977L422
16445A1950j1997J6087K5825j9486j9832o403j7300N096K1464Q721j0104J1848
16433A5869j8233k4188O923o083J8120q973J1465K1881J6930j1363J7244n334
$$ plain form
16522 2388 1271 21229 35143 5817 -5414 1685 -14954 -39167 -64571 -61196 -41583 -33288 -12236
16509 -12236 -11535 -4224 5658 1745 21348 14055 -3815 -25732 -14745 -12660 -16391 -4975 12112
16496 12112 32969 33930 16754 -5320 -38903 -37563 5884 -12430 -51877 -14803 16115 48835
16484 48835 50574 10221 -21752 -24615 8371 -323 -865 18737 6844 -27683 -25268 4259 45286
16471 45286 26763 6064 17428 40285 41637 31600 13310 6230 -4224 -2395 17792 9586
16459 9586 18776 34586 30622 20915 -13482 -38548 -36537 -36479 -50020 -56232 -56533 -21449 8528 11950
16445 11950 -47 16040 41865 22379 2547 -3856 -21156 -16060 5404 14125 4021 15869
16433 15869 -2364 -26552 -19629 -25712 -7592 -16565 -5100 16781 33711 22348 39592 34258
16421C4258k6084k1492k1271o060K3579p973o815N655K8229K093p601o840k264
16408a2586j085n849K1120l238j971j8135J4657P738j4472k1715l0985J7301M3882
16395e338m532k3228j8444O72P61J6857J7510p58N295n444k084K9233J3782K2822
16381D7104n411j6895l3597l8222k3541J1887J1766J5541K0668j0474L6892r434
16369F284j1664j8978L2632K9827r356k6916k9644q179J8585J3979r265J944K4089
16356A3338R563N154j23j6318r754j0506N779J893J6480M267k0699m1518m932
16343d7376j1192J3111O548R980m488K1879J0064k745M377j83o977K6035j146
16330A7887q867j2813l0110L669r376K2399N3090J5179J2208J648k1422k2263
$$ plain form
16421 34258 8174 -13318 -34589 -40649 -17070 -25043 -31858 -26203 2026 4119 -3482 -10322 -12586
16408 -12586 -13671 -19520 1600 -1638 -3609 -21744 -7087 651 -13821 -35536 -66521 -49220 -5338
16395 -5338 -9870 -33098 -51542 -50870 -50109 -33252 -15742 -16500 -11205 -16649 -18733 10500 24282 47104
16381 47104 41693 24798 -8799 -47021 -70562 -58675 -46909 -31368 -10700 -21174 15718 6284
16369 6284 -5380 -24358 8274 38101 28745 1829 -27815 -35994 -17409 -3430 -12695 -10751 13338
16356 13338 22901 28055 27932 11614 1860 -8646 -2867 -974 15506 19773 -926 -42444 -47376
16343 -47376 -58568 -45457 -38909 -28929 -33417 -11538 -1474 -4219 158 -25 -7002 19033 17887
16330 17887 9020 -3793 -33903 -30234 -39610 -17211 35879 51058 63266 64914 43492 21229
16318B1229k8403J7144p195k9969l836Q173K2324J0767M957N965k8240j0912J2327
16305e669r416l626p459J465j9157j7303N4073J7992j7256k7154K7180J3643J9999
16292B7312K3501k826j4907l7505n268O609k4999K0046j0334l6316K3045J2168
16280a9474K3245K7425j3548m6082j1309K7719n166m552o318j7168J6083J6210
16268a2935j647J708r806L438N480j7758J8454R090l433k3925j9071K0066J3948
16255a6391P620k0045J8144R876K434p478o001k2587j0288J6311k781Q249K5235
16242B298J9138q289k483k017J6439M030L823n8411O986L4683K7231N714l1604
16229A7538J1439j1850n888j2257P150J2566J6480j1250p072J8275K792k2201
$$ plain form
16318 21229 -7174 9970 2775 -27194 -31030 -22857 -533 10234 15191 21156 -7084 -17996 -5669
16305 -5669 -15085 -18711 -26170 -24705 -43862 -61165 -7092 10900 -6356 -33510 -6330 7313 27312
16292 27312 50813 47987 33080 -4425 -9693 -3084 -28083 -8037 -18371 -54687 -31642 -19474
16280 -19474 3771 31196 17648 -28434 -39743 -12024 -17190 -21742 -28060 -45228 -29145 -12935
16268 -12935 -14582 -12874 -22680 -19242 -13762 -31520 -13066 -3976 -7409 -31334 -50405 -30339 -16391
16255 -16391 -8771 -28816 -10672 -796 1638 -5840 -11841 -34428 -44716 -28405 -31186 -22937 2298
16242 2298 21436 13147 10664 8647 25086 29116 32939 -25472 -18486 16197 43428 49142 17538
16229 17538 28977 17127 11239 -1018 6132 18698 35178 23928 16856 35131 37923 15722
16217A5722j2090j820p564J0017J9923Q251k213J4434K016j4551j8633J2160J0871
16204C6523j6991j995q411J2531l162j7154k315J1778P930K852k0343j1171J7986
16191H058K544k0888J0564j615J735l712R893J92K0927L0458j3372k0804k2492
16178A488j4645j4106m532R86K2471P787j2599L1844K0575l3181p320k9790k5787
16165e6809O447K4142m879n577J6618K3274j5806n279J7674j0200k8197P551L5888
16152D847J305k3532j8508k2594R320L4950N633k5981l9039J6877L2625R607q487
16139b2977K5281M3252J931l5658j8972R681J8007J3597K888r319q444l445J7509
16126C3331J6789k3152k5856j3141m774P076J8631J798o283J826J4982O207j9742
$$ plain form
16217 15722 3632 1812 -5752 4265 24188 32439 30226 44660 46676 32125 13492 25652 36523
16204 36523 19532 17537 9126 21657 18495 1341 -974 10804 18734 21586 1243 -9928 8058
16191 8058 10602 -10286 278 -1337 398 -3314 6579 6771 27698 58156 44784 23980 1488
16178 1488 -13157 -27263 -31795 -30809 -8338 -551 -13150 18694 39269 6088 -1232 -31022 -56809
16165 -56809 -50362 -26220 -31099 -36676 -20058 3216 -12590 -17869 -195 -10395 -38592 -31041 4847
16152 4847 6152 -17380 -35888 -58482 -49162 -14212 -8579 -34560 -73599 -56722 -24097 -14490 -22977
16139 -22977 2304 45556 47487 11829 -7143 2538 20545 34142 37030 27711 19267 15822 33331
16126 33331 50120 26968 1112 -12029 -16803 -9727 8904 10702 4419 6245 21227 27434 7692
16113G692j4920J5371p443K1855j2330q0J6773j212K812N423J0189p701j2769
16100B3660R8k857j1867k6630k097M4497j1897o132k0920k2050J7921L506j320
16087a6088M08P561M447J742M395k0001l8785J2801J2331K2405r932r09K2706
16074C081K0797J5537l6494o0838N024K8673J1618K777O893o752j800j1870k6254
16061d9608O557L1838L170K5399J4330M064j9653J1023k8434J2756N290K81M3172
16048F0185j9708m483J8215j7862m6781m3093L607J8740K8880n710N2k0507n261
16035c3726k215J0118O4N895J4012J4133j0642J9585Q990J3477L899l8448l8102
16022c2960j9388P794J8937J6677L020J6238m335P677l803k9084j9335L1553L0668
$$ plain form
16113 7692 -7228 8143 700 22555 10225 10145 26918 25706 28518 33941 44130 36429 23660
16100 23660 23758 20901 9034 -17596 -19693 24804 12907 6775 -14145 -36195 -18274 -14768 -16088
16087 -16088 -15680 -8119 -3672 -1930 2465 -17536 -56321 -43520 -31189 -8784 -18716 -19625 3081
16074 3081 23878 39415 2921 -57917 -52893 -24220 -12602 -9825 -2932 -9684 -11484 -23354 -49608
16061 -49608 -43051 -11213 -8043 17356 31686 35750 16097 27120 -1314 11442 16732 17013 60185
16048 60185 40477 35994 54209 36347 -10434 -53527 -49920 -31180 -2300 -8010 -7958 -28465 -33726
16035 -33726 -35941 -25823 -25759 -19864 -5852 8281 -2361 17224 26214 39691 43590 5142 -32960
16022 -32960 -52348 -44554 -25617 -8940 -5920 10318 5983 13660 9857 -19227 -38562 -7009 23659
16009B3659j6538o023R23j626L053N843J0415J6379j7518P858k0781l788N586
15996G442m11J4610J2822L4995r260j9799j3968j9430m0835J7282K4233l088m5713
15983d1120l2375L7355L2979j863k4803q904o58j2256j7770J314J9766L7125K8292
15970A7082q516p032j3132j0104J6870L3652o160n3884p690o75j8318p164J9070
15957d6001Q639K8527L6963k8126j9792J5168r124j761j9246k6735l482L8673
15945b6297K7438q612k7605R2L043J2301j7846l71J2055J6312n004M67K0510k120
15931D363j6604j6858M419L7790O608J1212N483j1024o477J7778j5477k8079L444
15918c422K7236j3681j8051L470R738J8414K3019l3582k0780q527J090N237J1038
$$ plain form
16009 23659 7121 1098 2021 395 3448 9291 19706 36085 18567 26425 5644 1856 7442
15996 7442 7031 21641 34463 69458 60198 40399 26431 7001 -33834 -16552 7681 4593 -41120
15983 -41120 -73495 -36140 -3161 -5024 -29827 -38731 -39389 -51645 -69415 -68101 -48335 -11210 17082
15970 17082 8566 1534 -11598 -21702 -4832 28820 22660 -31224 -38914 -39589 -57907 -65071 -46001
15957 -46001 -37362 -8835 28128 2 -19790 -4622 -13746 -15507 -34753 -61488 -64970 -26297
15945 -26297 1141 -7471 -35076 -34984 -31941 -19640 -37486 -37857 -25802 -9490 -14494 -14027 6483 4363
15931 4363 -12241 -29099 -24680 13110 19718 30930 36413 25389 18912 36690 21213 -6866 -3422
15918 -3422 23814 10133 -7918 -4448 5290 23704 46723 13141 -7639 -16166 -15076 -9839 1199
15905A199O215K809j2984O14K2739P632O098j7128l8443L1071J0405J0423r08
15892B9742j5258k4755j2012M7948K1126l4738j1J5088k296j1630m3393K16J406
15879b8567K866J3542J6928k7779Q46m398J4915j2840J0900J2951q354J1328J0714
15866A3052p512Q323j0045m270J5755R900j7109j8795K7375j0387k8317J0682
15854a1348P946j6135l3384J5694K8869p934n844L144L3649J5783l0240j1808
15842a1608R287o667k2893r390J2078P954k144J139o254J4084J2955J3677J7810
15829C0028J1383p87k3992j3943J7054N1261J9180k7726k7062j069L039M637j0405
15816C1598k7012K642L2115m1966j9322j3388J3642M3549M522o048o326Q093m420
$$ plain form
15905 1199 7414 10223 -2761 -2147 20592 28224 34322 17194 -21249 9822 20227 30650 29742
15892 29742 14484 -10271 -22283 25665 46791 12053 12042 27130 24834 13204 -30189 -29973 -28567
15879 -28567 -25701 -12159 4769 -23010 -22164 -26562 -11647 -24487 -13587 -636 -8990 2338 13052
15866 13052 5540 13863 3818 -452 15303 25203 8094 -10701 16674 6287 -22030 -11348
15854 -11348 -3402 -19537 -52921 -37227 -8358 -16292 -22136 -18992 14657 30440 200 -11608
15842 -11608 -2321 -8988 -31881 -41271 -29193 -21239 -23383 -22244 -28498 -14414 -1459 12218 30028
15829 30028 41411 40624 16632 2689 19743 71004 90184 62458 35396 34327 37366 42003 31598
15816 31598 4586 7228 39343 -2623 -21945 -35333 -21691 21858 26380 20332 14006 22099 17679
15803A7679k8794m44n869L838J694K4065M1940R373l0567p183j661j0735L040
15790A6376j0154o146p415k0173j2152P546J3232O558j6614j478J6757L3907M220
15777B4464q703k7737j2614J2493j607n28Q002J7755l199J6209L4725O061n4279
15764A1042l1291r22j865k875L5668k348l0135J0924J4149k545K1724m05k0410
15751G11k500K454O457J7431j766k1417L5205L4253j9982n297k1684j4778k2538
15738a3451k6987J167K5714L2768O551j5109m170k3753J4834J0352J3189P490
15726B8595J130K1417N065j5431j6224j890k3479k449J3279K8772J3329Q702j5399
15713D5417j3691J1476k5213k8978J1189J6066r764J3933J8080k584k3736l0498
$$ plain form
15803 17679 -11115 -11559 -17428 -13590 -11896 12169 54109 63482 32915 25732 24071 13336 16376
15790 16376 6222 76 -7339 -27512 -39664 -32118 -18886 -12328 -28942 -30420 -13663 20244 24464
15777 24464 15761 -11976 -24590 -12097 -13704 -14232 -6230 11525 8326 24535 59260 65321 11042
15764 11042 -20249 -21171 -23036 -25911 9757 7409 -22726 -11802 2347 -198 21526 21121 711
15751 711 -1789 665 7122 24553 22787 1370 36575 70828 50846 45549 23865 9087 -13451
15738 -13451 -40438 -39271 -13557 19211 25762 10653 6483 -17270 -2436 7916 21105 28595
15726 28595 29725 51142 56207 40776 24552 22662 -817 -3266 10013 38785 52114 60816 45417
15713 45417 31726 43202 17989 -10989 200 16266 6502 20435 38515 35931 12195 -18303
15701a8303j1000L8704k0077k2103J3558N172m871q776J4290K7948o194n273p181
15688d106K3233J7997k2126m7175l2676M2748M5025K0951l2331j4356l814J3731
15676G101j925J68J5330J3780k5973j6772J4382l6323l1199L783J9127L9546q306
15663g281j8259j0935O165K2727K0034K2761p594O628l8853n0534K4769K3580
15651f792j2149p20m194J2520L5205l220J2410O34k911l1048R1M634j3579j8223
15637b7342M544j168j5068K4229J1099j9141k119K3194k0977k0762J2964L7876
15625G329j5229L7486J0320l4602j4230j4985j8542J1014O246j744P259J3043
15613f635j3687j0032O69J1008L2495O87k2081J3567k7204j3943K3619J551O306
$$ plain form
15701 -18303 -29303 9401 -10676 -32779 -19221 -14049 -18920 -27696 -13406 14542 8348 3075 -4106
15688 -4106 19127 37124 14998 -32177 -64853 -22105 22920 43871 11540 -2816 -6630 7101
15676 7101 5176 5344 20674 34454 8481 -8291 6091 -30232 -61431 -57648 -38521 1025 -7281
15663 -7281 -25540 -36475 -30310 -7583 12451 35212 27618 34246 -4607 -55141 -30372 -6792
15651 -6792 -18941 -19661 -23855 -11335 23870 20650 33060 33694 30783 -265 -174 4460 -9119 -27342
15637 -27342 -22798 -23966 -39034 -14805 -3706 -22847 -24966 -1772 -22749 -43511 -30547 7329
15625 7329 -7900 29586 39906 5304 -8926 -23911 -42453 -31439 -25193 -26937 -19678 -6635
15613 -6635 -20322 -30354 -29685 -18677 13818 14505 -7576 5991 -21213 -35156 -11537 -9986 -3680
15600c680K3337J12L573L720j7525k0200k80O333k2311K1250J0183j8776j8140
15587c2404J0562K3802Q887M559k3766P331J9682J1734j3366j5511r031p161R42
15574a3740K2476J3939N509k653M990j6392k5418m156K693K0852K7544j2996k6632
15561c984k3088O131j1980l6569J9072M2330l9577j3258J8321J9067J3119K5801
15549A5385j531j3486r842J6736Q981p87R561j9288o730J6756P157j3441O561
15536A6032J3258Q315j2982j9598l0774q567L5787N585J3595K4416l017k3062
15524A8988k2493K1064J8441R293k3735k7476n818L0618J1852m0568j6773M8069
15512B1462P670J2825j8791l0927j2828j7120O05L9215K4231j2297o233l304r021
$$ plain form
15600 -3680 19657 19769 23342 27062 9537 -10663 -10943 -4610 -26921 -5671 4512 -14264 -32404
15587 -32404 -21842 1960 10847 15406 -8360 -1029 18653 30387 17021 1510 -7521 -14682 -13740
15574 -13740 8736 22675 28184 25531 30521 14129 -11289 -15445 -12752 8100 35644 22648 -3984
15561 -3984 -27072 -20941 -32921 -69490 -50418 -8088 -47665 -60923 -42602 -23535 -10416 15385
15549 15385 13854 368 -9474 7262 16243 15456 25017 5729 -1001 15755 22912 9471 16032
15536 16032 29290 37605 24623 5025 -25749 -34316 1471 7056 20651 45067 42050 18988
15524 18988 -3505 17559 36000 45293 21558 -5918 -11736 18882 30734 -9834 -26607 21462
15512 21462 29132 41957 23166 -7761 -20589 -37709 -37104 2111 26342 14045 7812 4508 -4513
15499d513j5211l0018J891J0953o116J8478j220j7205J201Q1J0508P427k849O917
15485a9676J4320j99K4021K3685j220k315L765J7125J0789j5668n742r815k296
15472C6774j4821J4646l629j2785P269j2728l1304n46M4122j2284k5851j2127
15460b3264K4241L1442Q275l335m1530k5688P08K7507m832j6524q953K856j4661
15447d3758L387K4116J8945P401J8574J1987k7930k7627R020J0038k5932O509
15435a5270K3379J9485j5715R349J5982p645k6537j0860m503J8333J8736j7451
15423G283j6170J1074J1529j5549l3619J5647M46K1622K3567Pj1698j7401j0569
15410a3831P556o295K3340O819k1023k0005K587N139J9863L4335m456j4563l717
$$ plain form
15499 -4513 -19724 -49742 -47851 -36898 -43014 -24536 -25756 -42961 -41760 -41679 -31171 -23744 -26593 -19676
15485 -19676 -5356 -5555 18466 42151 40931 38616 42381 59506 70295 54627 48885 39070 36774
15472 36774 21953 36599 32970 20185 27454 14726 -16578 -17124 26998 14714 -11137 -23264
15460 -23264 977 32419 40694 37359 -4171 -29859 -29151 -1644 -6476 -23000 -31953 -29097 -43758
15447 -43758 -40371 -16255 2690 10091 28665 40652 12722 -14905 -5885 4153 -21779 -15270
15435 -15270 8109 27594 11879 21228 37210 29565 3028 -7832 -12335 5998 24734 7283
15423 7283 -8887 2187 13716 -1833 -35452 -19805 -19359 2263 25830 25837 14139 -3262 -13831
15410 -13831 -6275 -12570 10770 17589 -3434 -23439 -20852 -15713 4150 38485 34029 19466 15749
15397A5749k6712j7397Q603R321p485p117r1j7330n602L1426J2703r80k3841J8013
15383a0740K5072Q353m399P970l0900L39N93L8193J4118j6044p940j2910M405
15370A6110k357J5296J3955j8051k7685J7820j1K5812J3354J3895k0893k7543
15358A9702J5125j3873j3058j9302J2429J4926J4204k890r194j2493j8439l784
15346a6647P405J3967O456J6004l789k331L8724K0976l3609l2911r692N72j6301
15333a1176K537o727j1468j7824k0245K0658L8847j875q868Q76k589N779K3371
15320A1296J40k2687J790J3351K5479j4832k1775J1913J4901k2623j6090j2309
15308c1446J1093j0823j0068R211j3251O432J8906R143k4076j4841k1170n313
$$ plain form
15397 15749 -10963 -28360 -19757 -10436 -17921 -25038 -25129 -42459 -48061 -16635 -3932 -4912 -28753 -10740
15383 -10740 14332 22685 18286 26256 -4644 -4305 -3712 34481 48599 32555 24615 11705 16110
15370 16110 13753 29049 43004 24953 -2732 15088 15077 40889 54243 68138 47245 19702
15358 19702 34827 20954 7896 -11406 1023 15949 30153 27263 18069 5576 -12863 -16647
15346 -16647 -9242 4725 11181 27185 23396 21065 59789 80765 47156 14245 4553 5125 -11176
15333 -11176 -8639 -15366 -26834 -44658 -64903 -44245 -5398 -7273 -16141 -15265 -17854 -12075 11296
15320 11296 11436 -11251 -9461 3890 29369 14537 -7238 4675 19576 -3047 -19137 -31446
15308 -31446 -20353 -31176 -41244 -32033 -45284 -38852 -19946 -10803 -34879 -49720 -70890 -76203
15296g6203K0169N2404J6913j8137L7448j6759m9574M107J8403j0668O864L194
15284a1839J1733j0848J1925K2797L99m6801j7066N869j0988O002J2797Q313J2533
15271e174K822O162j5100o006J3507j9535l3871J4762n47K4384L8412J1184M59
15258C1459n122j6746j8333J332J6266K3911l414j3745N2l3792n258j1618L609
15245c1399J4599j817L602n596L2878J5732K2560O918L699K404k7211m6839o259
15232a6729P78o274p427L8842J8853K2633k9556j1931j1367p533l8318J14L1708
15219a6207j3529j5373P806j1155P815L796Q976M3717N2483K933j6167k0361l1918
15206B816m1737j4964M744L4361q772k0058K0131j0971j3278K2635K620J0604
$$ plain form
15296 -76203 -56034 -3630 13283 -4854 32594 15835 -33739 -29632 -11229 -21897 -15033 -11839
15284 -11839 -106 -10954 971 23768 24167 -22634 -39700 -33831 -44819 -38817 -26020 -17707 -5174
15271 -5174 -2352 3810 -11290 -17296 -3789 -23324 -57195 -42433 -42980 -18596 19816 31000 31459
15258 31459 26337 9591 -8742 -7410 8856 32767 29353 15608 15660 -18132 -23390 -35008 -31399
15245 -31399 -16800 -18617 -15015 -20611 12267 27999 50559 57477 61176 63580 36369 -10470 -16729
15232 -16729 -15951 -22225 -29652 9190 28043 50676 21120 9189 -2178 -9711 -48029 -47915 -16207
15219 -16207 -29736 -45109 -37303 -48458 -40643 -36847 -27871 15846 68329 71262 55095 34734 2816
15206 2816 -38921 -53885 -49141 -14780 -23552 -43610 -23479 -34450 -47728 -25093 -22473 -11869
15194a1869r711K382n722K2943l740j8902J8256J2193K76k7534j8171R623K710
15181b7266N758L1741J4944l1850J982K5524L480J059J200l5947p938p500j5916
15168d0729K5441J5766k2346r471j671P901M117K5908L0353j3154O581p715j7426
15155C555q860p108j4159l5284L772J5830R047L7406o517M225l271J3428J7087
15142B9151l2418k6481j0024J6854J551L629p820k2811J3975K1966k5306j5979
15130e3713J3942O076K3718M0709L469O852k0223j4824L619m911J3709j3673o100
15117a350J5302P873k6359p502K498O047N450j937o865j7310L5818p778J633N954
15103A1474k2639o240L316L419j5858K0732L3095r145j0992N527p144j5091p171
$$ plain form
15194 -11869 -21580 -19198 -24920 -1977 -5717 -24619 -6363 5830 6106 -21428 -39599 -29976 -27266
15181 -27266 -21508 10233 25177 -6673 -4691 20833 24313 25372 26572 -9375 -17313 -24813 -40729
15168 -40729 -15288 478 -21868 -31339 -33010 -25109 -20992 4916 35269 22115 28696 20981 3555
15155 3555 -5305 -12413 -26572 -61856 -58084 -42254 -33207 4199 -2318 1907 -1364 12064 29151
15142 29151 -3267 -29748 -39772 -22918 -21367 -17738 -25558 -48369 -34394 -12428 -37734 -53713
15130 -53713 -39771 -33695 -9977 30732 34201 41053 20830 6006 9625 4714 18423 4750 -1350
15117 -1350 13952 21825 -4534 -12036 -9538 -3491 1959 22 -6843 -24153 11665 3887 5520 11474
15103 11474 -11165 -17405 -14089 -10670 -26528 -5796 27299 18154 7162 12689 5545 -9546 -16717
15090a6717j9172n62K3610L0129L0998J9909j1366j5904j5949j5551J2704K4948
15078D7077M776l4410n564o371M546J5641o768p278l2034k0426j5861P111L839
15065d5722J3387p575j8229J1009k570K0448J7605n863P264N4J4047M159j336
15052F678k5387n110M5246J1895k3515j1830q57L691K733J6797o983k0127l174
15039i943j6482J4268k433k9790J5664K6885J2364R85k9971n543L0520M482k0506
15026i500K091k098r935K3278J117j4228k8544J5843J6856J0235o144R389Q718
15013A7078Q412o134k5388j8997J2709Q851l09N937J9006q157j3373j0349j975
15000a2689J3386k371j2309J0487M0066p465l793J8692J264l1013k6307r591J0056
$$ plain form
15090 -16717 -35889 -36451 -12841 17288 48286 68195 56829 40925 24976 9425 22129 47077
15078 47077 51853 17443 11879 5508 10054 25695 18927 11649 -20385 -40811 -56672 -49561 -45722
15065 -45722 -32335 -39910 -58139 -47130 -49700 -29252 -11647 -17510 -10246 -10192 3855 8014 6678
15052 6678 -18709 -23819 21427 33322 9807 -2023 -2880 811 3544 20341 13358 -6769 -9943
15039 -9943 -26425 -12157 -14590 -44380 -28716 -1831 10533 11518 -18453 -23996 6524 11006 -9500
15026 -9500 -7409 -9507 -19442 3836 4953 -9275 -37819 -21976 -5120 5115 -1029 8360 17078
15013 17078 25490 19356 -6032 -25029 -12320 -3469 -3778 2159 21165 13008 -365 -10714 -12689
15000 -12689 697 -1674 -13983 -3496 36570 29105 25312 44004 45268 14255 -12052 -21643 -11587
14987a1587J496J417j1516K3368M6480j4670k9409q358r450K431R077K552j8823
14974a6992J5801K7758k2378l0544J4122J0158o533j6899j3820O277Q342K225
14962b2483k1592R817P065K0436J7577r286l874o486j2291K1219L7507N247J50
14949D3006O831j5509j7150j7013J389L7658J7802j9388m4171k6171q537J9736
14937b1517J568m452p189r477K4916J4384n271L1414k972k0180k3435m0018J4896
14924d7333M2111l328J6527R020j7448j167p6m835p433P394K135n50J5149J7267
14910B7433J3000o660q836j1752l533K1908r510j9789l5556j7029J8089J5415
14898a6820J4414m334j3894K061r469R863K3086K0600j6895j887J1371j9911j6648
$$ plain form
14987 -11587 -10091 -8674 -20190 3178 49658 34988 5579 -2779 -12229 -9798 -721 1831 -16992
14974 -16992 -1191 26567 4189 -26355 -12233 -2075 -8608 -25507 -39327 -33050 -24708 -22483
14962 -22483 -44075 -34258 -27193 -6757 10820 1534 -2340 -8826 -21117 102 37609 42856 43006
14949 43006 49837 34328 17178 165 1554 39212 57014 37626 -6545 -32716 -41253 -21517
14937 -21517 -19949 -24401 -31590 -41067 -16151 -1767 -7038 24376 21404 1224 -22211 -62229 -47333
14924 -47333 -5222 -8550 7977 16997 -451 -1618 -1694 -6529 -13962 -6568 -4433 -4983 10166 27433
14910 27433 40433 33773 24937 13185 9652 31560 22050 2261 -33295 -50324 -32235 -16820
14898 -16820 -2406 -6740 -20634 -18573 -28042 -18179 4907 25507 8612 6725 18096 -1815 -18463
14885a8463K5928J9431J9835j9991k2321j6847j4885P016J0041M115o545K2066
14873I380Q031k0922Q381K6078n199k3887k6132P078J0826L6537q188j516J2912
14860C3379k0222p76l33q761k3910k6881J6043J7000O510r141J2844N123k0815
14847a9940Q382M571K7028J3779j6853n391M847k3292k3087n877j5860p894J7231
14834d2356p277J4422L1594p974j5952m141K0098L9574P391k7015k2282K9432
14822A5514J8453o710l978J0845p770k061R764j3156j0450m026k3455R599j3999
14809b1430n980j4181L4275J5724J7990q630J473K403q168j9429p281m195j553
14796a8982P634K138O303k704k1098n251l438L5359N285L373K5626j3384j0017
$$ plain form
14885 -18463 7465 26896 46731 26740 4419 -12428 -27313 -20297 -10256 -6141 -12686 9380
14873 9380 17411 -3511 4870 30948 25749 1862 -24270 -17192 -6366 30171 21983 20467 33379
14860 33379 13157 12381 12048 3287 -20623 -47504 -31461 -14461 -7951 -17092 -4248 875 -19940
14847 -19940 -11558 -6987 20041 33820 16967 11576 16423 -6869 -29956 -35833 -51693 -59587 -42356
14834 -42356 -49633 -35211 -3617 -11591 -27543 -31684 -11586 27988 35379 8364 -13918 15514
14822 15514 33967 27257 23279 34124 26354 24293 34057 20901 10451 6425 -17030 -7431 -21430
14809 -21430 -27410 -41591 -7316 8408 26398 17768 19241 21644 13476 -5953 -13234 -17429 -18982
14796 -18982 -11348 -9210 -2907 -5611 -26709 -31960 -35398 -39 5246 8619 34245 20861 10844
14783A0844j6395J9551j6403P449J4778l890K773m325l18k2754p671O34j9622
14770c5349P96K4919K79m243L239P724O647l8054k199J1807p825l2809m219K6023
14756d3264L643N635n741K925J9549j4031K0378L8535j830j315k3015J609K7143
14743C0221L773M403o50j8431m478O864o108j1403o66J005K8649j0953J3060q244
14729B7042m6680O541K4106J3942J5768k1464j185j5739K0231M2905o640l9230
14717A9597j7545L0860j1911K494J6163J5473j8130k2765k0532q479l632k144
14705b0551K2200J2224j0075j3710j6007J8218L1274J0412l3918q179L1996r848
14693A4036k4340q968k8286j2819L4490K550K3972K1382n814m1281l5186N581
$$ plain form
14783 10844 -5551 14000 -2403 5046 19824 15934 18707 14382 14064 -8690 -16361 -15727 -35349
14770 -35349 -34553 -9634 -9355 -13598 -10359 -2635 4012 -34042 -36241 -24434 -32259 -65068 -69287 -43264
14756 -43264 -39621 -33986 -39727 -36802 -17253 -31284 -10906 27629 25799 24484 1469 3078 30221
14743 30221 33994 38397 37747 19316 14838 21702 15594 4191 3525 4530 33179 22226 35286 27042
14729 27042 -19638 -13097 11009 24951 40719 19255 18070 2331 22562 65467 58827 19597
14717 19597 2052 32912 21001 23495 39658 55131 37001 14236 -6296 -14775 -18407 -20551
14705 -20551 1649 13873 3798 -9912 -25919 -7701 23573 33985 67 -8112 23884 14036
14693 14036 -10304 -19272 -47558 -60377 -25887 -23337 635 22017 16203 -25078 -60264 -54683
14681e4683J3254J132K3910J2937J2940O70p383j8059l2279K1592K4104J417J3678
14668A3230j731r78k2852j682J9935p98j3459K451N1L423k0028O654J4192K5660
14654B4068L756L679l3001m037J0187m56j1758k7484K5146K5840k1035k2881J645
14641b6331J9346k5142j6546K8088J1544K2844L8695j2857j9604J6280j0410q735
14629A7172j6284p956J219q55M034J4858K0617o392k3490j4015J5506j0531J745
14616d372Q43L3536L432k2596j8044r594J5706K2807o456N1047J5643k6200k7864
14603B7888j6349L723l130o238n413n770r163L026O778J6600R612J037q432j9743
14589e574j9756o340P853J832l527J9568J6684j3529r117o672k0711k0329J7594
$$ plain form
14681 -54683 -41429 -40297 -16387 -3450 9490 10160 2777 -15282 -47561 -25969 -1865 -448 13230
14668 13230 11499 10521 -12331 -14013 5922 5124 -8335 -5884 -5833 -2410 -22438 -15784 -1592 24068
14654 24068 27824 31503 -1498 -5535 4652 4196 -7562 -35046 -9900 15940 -5095 -27976 -26331
14641 -26331 -6985 -32127 -48673 -20585 -9041 13803 52498 39641 20037 36317 25907 17172
14629 17172 888 -7068 -5849 -6704 -2670 12188 32805 26413 2923 -11092 4414 -6117 -4372
14616 -4372 -3529 30007 33439 10843 -7201 -16795 -1089 21718 15262 66309 81952 55752 27888
14603 27888 11539 15262 12132 5894 481 -5289 -14452 -11426 -4648 11952 21564 22601 14169 -5574
14589 -5574 -25330 -31670 -23817 -21985 -25512 -5944 10740 -2789 -11906 -18578 -39289 -59618 -42024
14576d2024p247k9763J3001K3490J7119J9520o125o389q510j9262J2896Q192M675
14563b0427O730Q268J3630q323O511Q236J0428j9850m9k590J1507m663j3611N475
14549A272j8298J0377K7107J269l2421k1480j1380M8965L8229j6336J4377j3160
14537B8521j1224J9041O50k0993P12J4299n043m1824J3296K284n502j6796l86
14524b2965J2240j1057j0139K4390K049l533l058J3723j5886K1013J3767q476
14512A2068L2175K257j0365p365k2593n314j6935O204j6611J3763K8699N863N518
14499B7364p563P956O65k4896J864m476L547k016q985k7089q525J7266K5698j8478
14485a7668K993K3083J9996n996j7198k9762m57j0080k506k018K645R004K820
$$ plain form
14576 -42024 -49271 -79034 -66033 -42543 -25424 -5904 -12029 -18418 -26928 -46190 -33294 -25102 -20427
14563 -20427 -13697 -5429 8201 -122 6389 14625 25053 5203 5154 2564 14071 9408 -4203 1272
14549 1272 -17026 -6649 20458 21727 -10694 -32174 -43554 5411 43640 27304 41681 28521
14537 28521 17297 36338 36988 15995 16707 31006 25963 -15861 -2565 -281 -5783 -22579 -22965
14524 -22965 -10725 -21782 -31921 -7531 -5482 -9015 -12073 1650 -14236 6777 20544 12068
14512 12068 44243 46500 36135 28770 6177 863 -16072 -9868 -26479 -12716 15983 21846 27364
14499 27364 19801 27757 28422 3526 5390 914 4461 2445 -6540 -33629 -42154 -24888 810 -17668
14485 -17668 -14675 8408 28404 22408 5210 -24552 -25009 -35089 -37595 -39613 -36968 -27964 -25144
14472b5144K264m009N646q72K1829K7961J5592q79m963k6624l2384m40K2349K576
14458B902Q232N507J62l4471m93J3851K0077L6404L116j1117l8762L1J1307k2458
14444e712l2084P812p091J865N967J3125L893J7396j3010J445K8536L0197n20
14431E1819j9311J1563J5720k113j3950r110K476k5419j2012K694J20p870J6376
14418A0983L3055r473l8116k9743J0543K623q0n229q326M581J9422l419P151J8156
14404A2128j355j6264K34N038N005P995L0010j4657l039K1779k8247l4358J9682
14391C951j7272k562K8516L378M002O808J0619k8147k3552J5409J9691k1425k786
14378c370j8385J3156j0281j8664J9216J3321K2289Q816Q222J9343j4522k8206
$$ plain form
14472 -25144 -22880 -26889 -21243 -22115 -286 27675 43267 42388 37425 10801 -21583 -22023 326 2902
14458 2902 11134 16641 16803 -17668 -18161 -4310 15767 52171 55287 44170 5408 5439 16746 -5712
14444 -5712 -37796 -29984 -37075 -35210 -29243 -16118 -12225 5171 -7839 -6394 22142 52339 51819
14431 51819 32508 44071 59791 57678 43728 34618 37094 11675 -337 2357 2477 -5393 10983
14418 10983 44038 34565 -3551 -33294 -22751 -20128 -20208 -25437 -33763 -29182 -9760 -13179 -6028 12128
14404 12128 10773 -5491 -5257 -219 4786 12781 42791 28134 25095 46874 18627 -15731 3951
14391 3951 -13321 -15883 12633 16011 20013 26821 37440 9293 -14259 1150 20841 -584 -3370
14378 -3370 -21755 -8599 -18880 -37544 -18328 -5007 17282 26098 34320 53663 39141 10935
14366A0935J4250j0174j4574k631K0440j3626k1389K7915K2407j4114k0423L979
14354B995J3493J241K0732N132j4377k1116r454J7036J5671j4894J1058K8241
14342E5758j5693k4431k1643L5459P591J6j2079k2194j8032j269K3486J9494J2382
14329C8845l589l7768j1098P763M142Q556J1189J0479r510m203K720J0489r163
14316A8852o001k0196n99O254K7813K0408p300m156K079J4589j629j1124k095
14303C6895K0673j0569j4275k0656k9441j8332j951K1591m015Q414J2753L828
14291D915j4038o560L2543J4645P295j313r375j4238j1075K134k075K1767J1922
14278C6547p542j0524Q539l006K509j069P039k1562K1786O501J0437N27j3224
$$ plain form
14366 10935 25185 15011 437 -2194 18246 4620 -16769 11146 33553 19439 -984 2995
14354 2995 16488 17729 38461 43593 29216 8100 -1354 15682 31353 16459 27517 55758
14342 55758 40065 15634 -6009 29450 37041 37057 24978 2784 -15248 -16517 6969 26463 38845
14329 38845 35256 -2512 -13610 -5847 -1705 6851 18040 28519 19009 14806 17526 28015 18852
14316 18852 12851 -7345 -7944 -1690 26123 46531 39231 35075 37154 51743 50114 38990 36895
14303 36895 57568 46999 32724 12068 -17373 -35705 -37656 -16065 -20080 -11666 1087 4915
14291 4915 -9123 -15683 16860 31505 38800 37487 28112 13874 2799 4933 2858 24625 36547
14278 36547 29005 18481 27020 24014 26523 25454 32493 10931 32717 39218 49655 50182 36958
14265C6958j5268l7895j5632K1885j889l136j1755L0875q564J2644J8238o964
14253A9497q495L6034m095k7346l2819K4920K5557j4630j1033r699N210Q543n697
14240E947p292K786n547L176J9062p085k420J0145k6312r387J319R626J3879k5444
14226a7547R704Q322K989j3496N627K9189l364j1903K7389j2756m6585K8841K3545
14213B9955l101l1436j3003J0843j2831L7291R77L003j4346k6892J2634j782J2411
14200C723L4988o429k9773N419K0112o350J1355K3154j1773l3792j2144L661J7394
14187A9545K5129K4097Q191J5860K541k4429m9532m4539j4786l604p062J4940
14175c3649J0924L820k0428j1682P590N408N050N175J0031k181j995k827p516
$$ plain form
14265 36958 21690 -16205 -31837 -9952 -11841 -14977 -26732 4143 -4421 8223 26461 19497
14253 19497 11002 47036 42941 15595 -17224 7696 33253 18623 7590 -2109 3101 11644 5947
14240 5947 -1345 1441 -4106 -930 18132 11047 8627 18772 -7540 -16927 -15608 -5982 7897 -17547
14226 -17547 -7843 479 3468 -10028 -4401 24788 21424 9521 36910 24154 -22431 6410 29955
14213 29955 26854 -4582 -17585 -6742 -19573 17718 18695 21698 7352 -19540 -6906 -8688 3723
14200 3723 38711 32282 2509 7928 28040 21690 33045 56199 44426 10634 -1510 2151 19545
14187 19545 44674 68771 76962 92822 95363 70934 21402 -23137 -37923 -41527 -48589 -33649
14175 -33649 -22725 -18905 -39333 -51015 -43425 -38017 -32967 -27792 -17761 -19942 -21937 -24764 -32280
14162c2280J1575J7698J8838K3442J0287j1504j8368k3759j6911j2998k841L809
14150c3012J0899J7936J3559j6248j1231n922k0564m849o02M722L0832L5905m429
14137A6996m254K1350o790j4929m322K418m6K484L3034J3608l3425j8431l541
14124D152j2787l3660j4266N936J3523J8198J7101O578L2108K945k3746j5534
14112E48O523m686j3085J5065J8467K7869j8788j8852m349k0767M809l811K1955
14099A0898K4007k670L215J6758m437j2521j0953k5535j8679J2658K259J5428
14087A0428N347k7576j6318l3518N578L0282K0099J2311L928k4062o350o752m805
14074c1408J469K8154P501o519j1181J9451J230J5440J8385k8303k2049k765L394
$$ plain form
14162 -32280 -20705 -3007 15831 39273 49560 38056 19688 -4071 -20982 -33980 -36821 -33012
14150 -33012 -22113 -4177 9382 -6866 -18097 -24019 -44583 -49432 -50034 -45312 -14480 21425 16996
14137 16996 12742 34092 27302 12373 8051 10469 10423 12907 45941 59549 26124 7693 4152
14124 4152 -8635 -42295 -56561 -50625 -37102 -18904 -1803 4775 36883 39828 16082 548
14112 548 7071 2385 -10700 4365 22832 50701 31913 13061 8712 -12055 -7246 -11057 10898
14099 10898 34905 32235 35450 52208 47771 35250 24297 -1238 -19917 -7259 -5000 10428
14087 10428 15775 -11801 -28119 -61637 -56059 -25777 -5678 6633 10561 -13501 -19851 -26603 -31408
14074 -31408 -29939 -1785 5716 -803 -11984 7467 8697 24137 42522 14219 -7830 -10595 -7201
14061g201K7283j4572k5857j2261J2038K7134L747m659M070J3827j68j0065O445
14048A9761J0986N696j5236j598n442m0K753K087p213J3163J7702j7165j5903
14035I551k0779K953K1398j0581k33K3561l905j7727j2322K0887o857l617K714
14022E043J0794J5953K369j9381q244K7339K7388m8334j0208j1479k6766j6147
14010e1673K6034M019j4421J3075m7652j3406N331L0674K796K3844l3593p502
13998f2474J5675L5359R806k187o635p458K0633J651j2318j0971k4692n068J0459
13985c8220J4309M3313J2099m180O996N623N260j7681M89p593m830P681k364K267
13971B3169p978k3544n818N102r266K5119J3596j0440J2321R853L3178k4427r612
$$ plain form
14061 -7201 20082 5510 -20347 -32608 -20570 6564 10311 5652 9722 23549 23381 13316 19761
14048 19761 30747 36443 21207 19609 14167 14127 16880 18967 11754 24917 42619 25454 9551
14035 9551 -11228 -8275 13123 2542 2309 25870 21965 4238 -8084 12803 5946 2329 5043
14022 5043 15837 31790 34159 14778 6534 33873 61261 12927 2719 -8760 -35526 -51673
14010 -51673 -25639 -21620 -36041 -22966 -70618 -84024 -78693 -48019 -45223 -21379 -54972 -62474
13998 -62474 -46799 -11440 -1634 -3821 -10456 -17914 2719 4370 -7948 -18919 -43611 -48679 -38220
13985 -38220 -23911 19402 31501 27321 34317 39940 45200 27519 28008 20415 15585 23266 20902 23169
13971 23169 15191 -8353 -14171 -9069 -18335 6784 20380 9940 22261 32114 65292 40865 31253
13958C1253k224j2808K472J4480m571j1961K981K2995k369m444J8619j0022k3769
13945B0632r545k2340R841J6658J2061J4658j8742L02j2632k0131m177O8m729
13932a8076P549k771J0890J2696J4525J5194R814k1469k5546k6109O455M2659
13920B5811J1371j7405j1695N671k5421n481O037j1720j5922Q088M2209J4048
13908B5591j3052J4885J9459m900K3816J1331k8211j5666n926k793j0636n8835
13896d4937R188K3068K7967K7086k9391J5642J6565k3095j1303k16p188R059j5857
13883c412K8255J9304J0176n537m978K5001M246m7557J732J2476k7907j0018J7167
13870A8948J1872K1770K5311l1608j9665o6J1092Q183k6650n732j4046R510M4347
$$ plain form
13958 31253 29029 16221 18693 33173 28602 16641 19622 42617 40248 35804 54423 44401 20632
13945 20632 11087 -11253 -1412 15246 27307 41965 23223 23525 10893 -9238 -13415 -13347 -18076
13932 -18076 -10527 -13298 -2408 10288 24813 40007 49821 28352 2806 -23303 -16848 25811
13920 25811 37182 19777 8082 13753 -11668 -17149 -11112 -22832 -38754 -30666 11543 25591
13908 25591 12539 27424 46883 41983 65799 77130 48919 33253 27327 24534 13898 -44937
13896 -44937 -35749 -12681 15286 42372 12981 28623 45188 22093 10790 10574 3386 12445 -3412
13883 -3412 24843 44147 54323 48786 43808 68809 73055 25498 27230 39706 11799 1781 18948
13870 18948 30820 52590 77901 46293 26628 26562 37654 45837 19187 13455 -591 8919 53266
13857E3266J2372M358J1559q861L275k7243R683K5153m0362n1966O698J3512L4551
13844D5995J1670j4527j0442j8075K7279J2904o123J1804o231j2970k4262l240
13832A3782J8250j6179j395J071P496J4847P186O767J4640k0500J2315j480r203
13819D7597p212j2320k584l2347n67K0446q137k2070J4722L017K060k133P008
13806G480j920J1342J9370j208k0994j3744J1575j058q191p901n31K6665L0653
13793E1538M586m584J2571r348L792o1004k1161K6988J7096k2747K9620K8953
13781E6300l520j4178j7504L998J2357J3148K0324r463k0516j6758M138M87k5952
13768B861L627L4983K0573k8573l9592J7554J5315O211L4165m93l9406k0143J1992
$$ plain form
13857 53266 65638 69996 81555 72694 75969 48726 58409 83562 43200 -8766 -2068 11444 45995
13844 45995 57665 43138 32696 14621 41900 54804 48681 60485 54254 41284 17022 13782
13832 13782 32032 15853 14458 15529 23025 37872 45058 51825 66465 45965 58280 56800 47597
13819 47597 40385 28065 25481 -6866 -7433 13013 4876 -17194 -2472 545 2605 472 7480
13806 7480 5560 16902 36272 35064 14070 326 11901 10843 2652 -5249 -5780 20885 51538
13793 51538 56124 51540 64111 54763 58555 -2449 -23610 3378 20474 -2273 27347 56300
13781 56300 52780 38602 21098 25096 37453 50601 70925 61462 40946 24188 28326 28813 2861
13768 2861 6488 41471 62044 33471 -6121 11433 26748 32959 67124 66631 27225 7082 19074
13755A9074P586l117j294k4860J5582J866m236Q556K9296J0871l3154k894J4089
13742C7365J0446j6181j5801M180j2937j4910K1022j3330j765J1553k7207r123
13730b6688R760R781l266K4231J6047M430K7221J2242l3260K170n176m353l9980
13717f841k5252k2416J32L4803M4306p937j3274k317K772J1433j7567O440O639
13704A0921J3512m136J7462K3030j2867o090M1908j7265q889Q664o557k5210k3979
13691A0504Q124k135K2842J1664m365m180l4273L520M725p919Q081K9907l000
13678D3495j3386j8924j6216O422o804J8631J5577J3942J0285J3933r527j5535
13666D1893k449N445n604J3653n714K306L403k7159k4517K1890K334j7401k3341
$$ plain form
13755 19074 26660 23543 22249 -2611 12971 14837 10601 19157 48453 59324 26170 23276 37365
13742 37365 47811 31630 15829 20009 7072 -7838 13184 -146 -1911 9642 -17565 -26688
13730 -26688 -16928 -7147 -10413 13818 29865 34295 61516 73758 40498 42668 37492 33139 -6841
13717 -6841 -32093 -54509 -54377 -19574 24732 16795 3521 1204 3976 15409 -2158 4282 10921
13704 10921 24433 20297 37759 60789 47922 41832 83740 66475 57586 66250 59693 34483 10504
13691 10504 18628 16493 39335 50999 46634 42454 8181 11701 16426 8507 16588 46495 43495
13678 43495 30109 11185 -5031 1391 -5413 13218 28795 42737 53022 66955 57428 41893
13666 41893 39444 44889 39285 52938 47224 49530 52933 25774 1257 23147 25481 8080 -15261
13653a5261r829K1139K0948j4748k1257k2468L8458O9156n138j2276L0613J2395
13641I1732j5950l4971J485j7119j5486K0642p182L0749J9403k0216k1305j2122
13629A9660n184J711K0241P807P202K2992Q903k1253j0993j1525j69j5864k8273
13616d745j230L5431K6147j8240j4518j983K0435K2231k1180m3507n150Q149J5181
13603A7021J7629j9944k2537N333K1859P55J8464M30j5685o033J1729J165J9152
13590D9338K1828P546j207j7393k4321k0627J294J7333J2028j0861l689j1042
13578B0227K192L313m249o424J4799J6139r300m836j1476j0476J0655N48J8739
13565C9851L3839q581M340k1415k1916R8j451K01J1647j6193k1266J6632M943
$$ plain form
13653 -15261 -25090 -3951 16997 2249 -19008 -41476 -3018 66138 61000 48724 79337 91732
13641 91732 75782 40811 42296 25177 9691 30333 23151 53900 73303 53087 31782 19660
13629 19660 14476 16187 36428 44235 51437 74429 83332 62079 51086 39561 39392 23528 -4745
13616 -4745 -5975 29456 55603 37363 22845 20862 41297 63528 42348 -1159 -6309 1840 17021
13603 17021 34650 14706 -7831 -2498 19361 20116 38580 39010 23325 17292 29021 30186 49338
13590 49338 71166 78712 77505 60112 35791 15164 16458 33791 45819 34958 31269 20227
13578 20227 22419 25732 21483 15059 29858 45997 36697 31861 20385 9909 20564 21112 39851
13565 39851 73690 65109 69449 48034 26118 26216 24765 24966 36613 20420 -846 15786 20729
13552B0729J1901j068p137L1871j696j5288M767j991k1279J5183J5029Q456j2129
13539D7348k1667o071L2118R459j2805n800J279j381J2375j944J3850k1006l5227
13526A0528k869J5635j1583J345L0261M497j4817j992p946r905l863o667J0988
13513A3612L7231M124l4237k1402k004k205p679J3887K8334L8650k0087n0546
13501b322R322M0891j8096j7986K2947P397j9385J3391j2630J4729N588J724J1226
13488E6796m0436m685K2540j333L795r456k2596j8277m935M0898J2771j3910j4825
13475F347M909j4066L7767J2564N029Q825l0696k845n630p361L1591L8117r380
13462G5171l9611N881R441P819j525P01J321j4679Q182J331k7285m182R925J044
$$ plain form
13552 20729 32630 31562 24425 56296 54600 39312 44079 42088 20809 35992 51021 59477 47348
13539 47348 25681 19610 51728 61187 48382 42582 43861 42480 54855 52911 66761 45755 10528
13526 10528 7659 23294 11711 13056 43317 47814 32997 31005 23059 13154 9291 2624 13612
13513 13612 50843 54967 20730 -672 -2676 -4881 -12560 1327 29661 68311 48224 -2322
13501 -2322 7000 47891 29795 11809 34756 42153 22768 36159 23529 38258 43846 45570 56796
13488 56796 16360 11675 34215 32882 36677 27221 4625 -13652 -18587 22311 35082 21172 6347
13475 6347 11256 -2810 34957 47521 52550 61375 30679 27834 22204 14843 46434 84551 75171
13462 75171 35560 41441 50882 58701 57176 57877 59198 44519 52701 54032 26747 22565 32490 33534
13448C3534M4156K8631k2667m2209k1824q044P665J8669J4515j187j1907J6155
13436E5487J9593N540r916j5920k6270j1909K2583M0082L432J8447j2529m2054
13424D6566r558L0788J4640R484j1591L215o648r464r80j5278j6019J2483K9535
13411G7173R292k6137k5203M167M390J750q20m633K1990K899k4413K828J5384
13398E8667K5654J2954l4379l3539o650J0002J8842M2657m056j8832J3534j6508
13386F8346N360o534k939l399j4601J1693J1273j2087O028l660j1905j2048J3657
13373D9184K4218j3789P856J5436J912J5261J7440k8440k7192J086K712J3051
13361G8735P806k2312O167J8397n734j3788O817J7971j0970j3737k5211j873L4556
$$ plain form
13448 33534 77690 106321 83654 41445 19621 11577 19242 37911 52426 51239 39332 55487
13436 55487 75080 80620 70704 54784 28514 16605 39188 79270 82702 101149 88620 46566
13424 46566 37008 67796 82436 91920 80329 83544 76896 67432 66452 51174 35155 47638 77173
13411 77173 86465 60328 35125 39292 43682 45432 44612 39979 61969 64868 40455 43283 58667
13398 58667 84321 97275 62896 29357 22707 32709 51551 94208 90152 71320 84854 68346
13386 68346 73706 67172 64233 60834 46233 57926 69199 57112 63140 59480 47575 35527 49184
13373 49184 73402 59613 67469 82905 84817 100078 117518 89078 61886 62972 65684 78735
13361 78735 86541 64229 70396 88793 83059 69271 76088 94059 83089 69352 44141 42268 76824
13348G6824K3183J0239j3657J701l0617j3346J5121L0703J2624k3015k6498k788
13336F0474L203K482J4119j696p540K897J2513R370K0137q432R884N874j8831
13323A04454j7835l7258j8725o518K554L116m828m071O2000K8886j8699q345k7158
13310E7573k0925O087j8649j4458K7465J3239K9698K077m09J5420J8378k1814
13298I3682m951j5396k941j1241j5016L026J3240J0807K4575q771J2304j883K7738
13285A25173N698o608K712K182k8470k9816N839K185k280o7j2077M923J1835j0006
13271G1223J590J3916j6963J2999K2249j0981m969j9606l3066N846L9567J3185
13259I4990j0316k0653K7024p84k3680J4316K8416K6518j6217m0643r677J984
$$ plain form
13348 76824 100007 110246 96589 98290 67673 54327 69448 100151 112775 89760 63262 60474
13336 60474 63677 66159 80278 78582 71042 73939 86452 95822 115959 107527 117411 123285 104454
13323 104454 86619 49361 30636 24118 26672 29788 24960 20889 82889 111775 93076 84731 57573
13310 57573 36648 42735 24086 9628 37093 50332 80030 82107 81698 97118 115496 93682
13298 93682 88731 73335 70394 59153 44137 47163 60403 71210 95785 87014 99318 97435 125173
13285 125173 130871 124263 126975 129157 100687 70871 76710 78895 76615 76548 64471 69394 81229 71223
13271 71223 72813 86729 69766 82765 105014 94033 89064 69458 36392 42238 81805 94990
13259 94990 84674 64021 91045 90261 66581 80897 109313 135831 119614 78971 69294 71278
13247G1278j3950J4393J8032J4205K6518k6463k0252j3392l762R330L3735M812
13235A14484J9037L96n558l134J1878j1769k9007l0836K5737M28J4127K9115r80
13222A33918K913j4814N158j8506l7217k1102L4654L2382l641J2209J2370k6043
13210A12281L922M441J8058J132j6487m388p252l031j611l050o080j2308P226
13197I2853J3075o328L138k2630K0542J9074o952k8008j494K7076J0822j2116
13185A09052j5531N374J6223K7765j5297p190m661r490K5754J8279o997Q887j4030
13172A38138k8965j7002q482j95J6791J1158j5223k1389O397J3694K830J1527
13160A09279j6417J6141M720P844J5694k3131j0256o506m24K4154q646j7030j3688
$$ plain form
13247 71278 57328 71721 89753 103958 130476 104013 83761 70369 66607 75937 109672 114484
13235 114484 133521 133917 128359 125225 137103 125334 96327 65491 91228 91656 105783 134898 133918
13222 133918 136831 122017 127175 108669 71452 50350 85004 117386 113745 125954 138324 112281
13210 112281 116203 120644 138702 139834 123347 118959 111707 108676 107065 104015 97935 85627 92853
13197 92853 105928 99600 102738 80108 100650 119724 112772 84764 83270 110346 121168 109052
13185 109052 93521 98895 115118 142883 127586 120396 115735 106245 131999 150278 143281 152168 138138
13172 138138 109173 92171 83689 83494 100285 111443 96220 74831 81228 94922 97752 109279
13160 109279 92862 109003 113723 121567 137261 114130 103874 97368 96944 121098 112452 95422 81734
13147H1734K351k253Q946J3684J1229j54n083o465J9085M699O75J9769Q364k5198
13133A31383j9427k3103L771M188j377J8156p261J0989N817k1619o685K691J4735
13120A12258J4830M022q783m849k0949n733m744k1279M2590L1265N191J5051J7001
13107A75871L920k8931l3219N803J3473J1353Q496J3649j4664K0436K5823n695
13095A96315l5312j0109L9777J1078Q156j697q057q815j2510l83K436l156j0766
13082A66957j3371j3818J1234Q615r740j0436J6265p506m7400k692L4798N802
13070A38708L245J8854q446R434R984k0763K8782n361l0989J3416K8110J8611
13058B03585q076P374p824m0055r032n731k3919l791J6798K6283J460L349M2640
$$ plain form
13147 81734 84085 81832 90778 104462 115691 115537 110454 103989 123074 127773 128448 148217 156581 131383
13133 131383 111956 88853 92624 96812 95435 113591 106330 117319 123136 101517 94832 97523 112258
13120 112258 127088 131110 122327 117478 96529 90796 86052 64773 107363 138628 143819 158870 175871
13107 175871 179791 150860 117641 123444 136917 148270 156766 170415 155751 176187 202010 196315
13095 196315 161003 150894 190671 201749 209905 208208 200151 191336 178826 178443 180879 177723 166957
13082 166957 153586 139768 151002 159617 149877 139441 155706 148200 100800 98108 132906 138708
13070 138708 141953 160807 152361 161795 171779 151016 179798 174437 143448 156864 184974 203585
13058 203585 195509 202883 195059 155004 145972 140241 116322 112531 129329 155612 157072 160421 203061
13045B03061p748j3592P645o578J2867J5088j0190k0862J5261Q122j7286o355
13033A79433j4988L3344L4078j6234l0112j2008n756j6082J0670o126J0953L694
13021A70866n025J0271N604J3632L823n247k1527p100p165L5531K3545R330j2783
13008B13755K1487J5592l2332k5186n407m935N021J7429J2038J1861J5856j5853
12996B29326p789R011j2428j7046j5644K6739j10o307P727L7825k988q787L04
12983B39833r550M908j6271O20J7760J2391k5072j9516M582K1313n908P736J830
12970B34656j7745K483K6836J3187L4166k914M16K5206q053q540l364J1080k9853
12957B77561K4812N746k5120j556J2853J0531R40p313l3821k84J4597n803L8960
$$ plain form
13045 203061 195313 181721 189366 182788 195655 210743 200553 179691 194952 203074 185788 179433
13033 179433 164445 197789 231867 215633 185521 173513 167757 151675 162345 156219 167172 170866
13021 170866 165841 176112 181716 195348 199171 193924 172397 165297 158132 193663 217208 226538 213755
13008 213755 235242 250834 218502 193316 187909 182974 187995 205424 217462 229323 245179 229326
12996 229326 221537 230548 218120 201074 185430 212169 212059 205752 213479 251304 248316 239529 239833
12983 239833 230283 235191 218920 219540 237300 249691 224619 205103 209685 230998 225090 232826 234656
12970 234656 216911 219394 246230 259417 293583 290669 291085 316291 308238 299698 296334 307414 277561
12957 277561 302373 308119 282999 281443 294296 304827 305767 298454 264633 264349 278946 273143 312103
12944C12103J7416J6831k6824l3967L0232P888q741n759j8590r55k220j5992k2066
12931B49356L24j327K0219r756M41K7264J8435N338J0088j2873j4548N672r332
12918B89301k0706J7845J1286J5480K686n245L9528M2258n046k8118l6868p880
12906C14521j8578p109Q338L2435J8633j337K160N079J4470L2719K3738M4448
12894D69517N9117J03473J35502J24292J67072K98878M32905N14749M82414J44345
12884B932264k52614m44912m29581l13640j89011j62912j27821p1215n7891n2597
12874H30070k7844k6464k8481m0155m9534j7400K8779J9739k7964m6685j6948
12863E97113K9103L6376j7605k5915j3775L9950K5240l4560k1169K7169L596r423
$$ plain form
12944 312103 329519 346350 319526 285559 315791 323679 314938 309179 290589 289634 287414 271422 249356
12931 249356 249680 248353 268572 258816 259257 286521 304956 310294 320382 307509 292961 298633 289301
12918 289301 268595 286440 297726 313206 315892 310647 350175 392433 387387 359269 322401 314521
12906 314521 295943 288834 297172 329607 348240 346903 349063 354142 368612 401331 425069 469517
12894 469517 528634 632107 767609 891901 1058973 1357851 1790756 2305505 2787919 2932264
12884 2932264 2679650 2234738 1805157 1491517 1302506 1139594 1011773 940558 882667 830070
12874 830070 802226 775762 747281 707126 657592 640192 668971 688710 660746 614061 597113
12863 597113 626216 662592 644987 619072 605297 645247 670487 635927 614758 641927 645523 636100
12851F36100J363r458j7015j0602j3744o354j198j6538O08j6204r730M118J8751
12838E60097J6023J0216j3295j8856l650J1623J2101k2895K356K4041K1970j3023
12826E86708m9534l7936j7228J8954O646k987l8366j1818J6087j9005M329L8486
12814D94336O1584R377l8985k4118P732o687k5783J7310J4177O133J2293j0917
12802E16452j7686j0096J3920l254k3946k2709p879o501J1451K8911J717K71K3156
12789E03807N899N436j2482p246j5734j840K409j0983K3509K3445M8985j2104
12777E53101l4306P37K877J4875K3444l310l610m960J0529n648j0456J5336N1013
12764F09622R65J46K5691N204k42m81K16j975j5973j7512q698J2328p24j9411
$$ plain form
12851 636100 637463 628005 610990 600388 586644 580290 579092 562554 563162 546958 537228 541346 560097
12838 560097 576120 586336 573041 554185 550535 562158 574259 551364 553720 577761 599731 586708
12826 586708 537174 499238 482010 500964 507610 504623 466257 454439 470526 451521 455850 494336
12814 494336 555920 565297 526312 502194 509926 503239 477456 494766 508943 515076 527369 516452
12802 516452 498766 488670 502590 499336 475390 452681 444802 438301 449752 478663 480380 480651 503807
12789 503807 509706 515142 502660 495414 479680 477840 480249 469266 492775 516220 565205 553101
12777 553101 518795 519532 522409 537284 560728 557418 553808 548848 559377 553729 543273 558609 609622
12764 609622 610587 610733 636424 641628 641386 640905 641121 639146 623173 605661 596963 609291 608567 589156
12750E89156j4911m6330m2892k2725J944J2702L8945K0438j8233l783R220J7692
12738E41223L9062J9945R46j8437n278k49N4949K5817l495k6875J5975o396R083
12725F46270r937k165R015K7327L5976l76j7925J6873K0031J6108M184j8119J4655
12712G41917J5660J8192K8672M5315M4018R7421R8881J21011J15412R0362J12899
12701A529760R5800M125p7762j27642j40339j12637q6688k3760l3144o9482l720
12690I54511J4976k9506k1240k9088k2477j4760J502r380k6004m266J6375k5123
12678H05520k8527k631L8386L3782L4712K2770K007j75j103l077l0286r738P150
12665H68790o487R436j8579R51l540J1744K0827J0282r391J2158K0464P35p184
$$ plain form
12750 589156 574245 527915 485023 462298 464242 476944 515889 536327 518094 514311 523531 541223
12738 541223 580285 600230 601176 582739 577461 577212 632161 657978 654483 627608 643583 637187 646270
12725 646270 636333 634168 643183 670510 706486 706110 688185 705058 725089 741197 745381 727262 741917
12712 741917 757577 775769 804441 849756 893774 991195 1090076 1211087 1326499 1416861 1529760
12701 1529760 1625560 1629685 1551923 1424281 1283942 1171305 1084617 1060857 1027713 958231 954511
12690 954511 969487 939981 918741 889653 867176 852416 853918 844538 818534 814268 830643 805520
12678 805520 776993 774362 812748 846530 881242 904012 906019 905844 904741 901664 871378 861640 868790
12665 868790 862303 871739 853160 854111 850571 862315 883142 893424 884033 896191 916655 917390 910206
12652I10206Q73L767m611K6123L9962K2608J1093j2169m5244k9844O894J1262
12640I40920K2171K5050K9966K3186K1960L7937L6907o728o777l909R023k919
12628A126787m2710k5411q666j2930J7008K9980M1572K2536j7798J9231J2113
12617A161712j2396K568L8810J7117Q960J4905k7628m856J2504j1131J3119P119
12605A220803K729K1145M8m056L5917L6837K4109L5762K3477j3430J973J2461
12593A397775J0455M5602Q2417N7993N642j5812j3034N1584K1771n324M3739M2464
12581A725272q5K1071R907k8537L336M9496J25043J52806N9084k4962j3208J1719
12569B090942K5746O6436N2150K3739N1459O8889O5743Q2601O6296M2148Q993
$$ plain form
12652 910206 911079 914846 910235 936358 976320 998928 1010021 997852 952608 922764 929658 940920
12640 940920 963091 988141 1018107 1041293 1063253 1101190 1138097 1131369 1124592 1120683 1129706 1126787
12628 1126787 1084077 1058666 1050000 1037070 1054078 1084058 1125630 1148166 1130368 1149599 1161712
12617 1161712 1149316 1151884 1190694 1207811 1216771 1231676 1204048 1199192 1211696 1200565 1213684 1220803
12605 1220803 1223532 1244677 1244725 1240669 1276586 1313423 1337532 1373294 1396771 1383341 1385314 1397775
12593 1397775 1408230 1453832 1536249 1594242 1599884 1584072 1571038 1622622 1644393 1639069 1682808 1725272
12581 1725272 1725187 1746258 1756165 1727628 1730964 1780460 1905503 2058309 2117393 2092431 2079223 2090942
12569 2090942 2116688 2183124 2235274 2259013 2310472 2379361 2445104 2527705 2594001 2636149 2645142
12558B645142m2921m6711o1052k0642j5240J5696J1898L0982J1185J6613L1579
12547B576529L7812M3818Q0958Q0064N8556P8594O9785P8470J01187O1322Q3201
12536C350296N6755P8770R3040O4059N6210Q5503O9575R1384O7893Q0037O3879
12525D157401Q887L4759Q9531N8914M3946Q6290P7045L7180J2382M8506Q1951
12514D736792Q8854Q5041J11264J23772O2729K3571K0336O2480M5375O8817J00156
12503E529187R8720Q9096O6066O2141Q4545P3876Q8475J07654R3762O0638M9952
12492F404112P5752Q9534P3546L5013M5901J28839J69137J79422J92470J65059
12482G558785J44075J34421K07022K57066K81964L31410L33581L08432K99455
$$ plain form
12558 2645142 2602221 2555510 2494458 2473816 2458576 2474272 2486170 2517152 2528337 2544950 2576529
12547 2576529 2614341 2658159 2739117 2819181 2877737 2956331 3026116 3104586 3205773 3267095 3350296
12536 3350296 3407051 3485821 3578861 3642920 3699130 3784633 3854208 3945592 4013485 4093522 4157401
12525 4157401 4166288 4201047 4290578 4349492 4393438 4479728 4556773 4593953 4606335 4654841 4736792
12514 4736792 4825646 4910687 5021951 5145723 5208452 5232023 5252359 5314839 5360214 5429031 5529187
12503 5529187 5627907 5717003 5783069 5845210 5929755 6003631 6092106 6199760 6293522 6354160 6404112
12492 6404112 6479864 6569398 6642944 6677957 6723858 6852697 7021834 7201256 7393726 7558785
12482 7558785 7702860 7837281 8044303 8301369 8583333 8914743 9248324 9556756 9856211
12473I856211L30269L84747M83196O38904P21870P92407Q73513R73794J099539
12464A6154450J244531J451767J757801K172251K751206L455821M416964N884868
12456C9289659P989274J0876411J4638350J9912476K7945349M0273166N7935653
12449B18860338P9856164R6142111P9243393J3426529n7976211q6266010p4176344
12442B69109970n2144020l5646888k5010400j8497713j4470846j1628849r419416
12435A02291838p646113o356544n276552m463003l819660l286431k872631k484064
12427F6086840k101243j730540j492512j271761j032093q48950p29054n83937
12419E6296750l29155k4093K39720M61669L69875j76333q87645j316786j353560
$$ plain form
12473 9856211 10186480 10571227 11054423 11693327 12415197 13207604 14081117 15054911 16154450
12464 16154450 17398981 18850748 20608549 22780800 25532006 28987827 33404791 39289659
12456 39289659 47278933 58155344 72793694 92706170 120651519 160924685 218860338
12449 218860338 298716502 394858613 474102006 487528535 429552324 343286314 269109970
12442 269109970 216965950 181319062 156308662 137810949 123340103 111711254 102291838
12435 102291838 94645725 88289181 83012629 78549626 74729966 71443535 68570904 66086840
12427 66086840 63985597 62255057 60762545 59490784 58458691 57609741 56880687 56296750
12419 56296750 55967595 55943502 56183222 56644891 57014766 56838433 55950788 54634002 53280442
12410E3280442j151738r37766r24471j222836j699904j977669k011604j916604
12402D1437850j874111j737274j633456j510237j375005j309497j194902j080313
12394B9723055j032021r27186q74680q77736p53414o28960o30054n74725n56122
12385B2868157n08905m33649m47530m23524l50667l01187k30194k13399k08579
12376A9750523k37526k18814j57296j45466j52277j16418j06850r7915m8430k9878
12366A8439653o5545o4294J324J3037q437j6320J8264N9085K9236K8350M5953
12355A8480306J09568R3321R1872J12034J17332J12256J22102J08906J25755J29066
12345A9602518J50697J68619J41276J13028J14147J28087J31600J34352J47329
$$ plain form
12410 53280442 52128704 51190938 50266467 49043631 47343727 45366058 43354454 41437850
12402 41437850 39563739 37826465 36193009 34682772 33307767 31998270 30803368 29723055
12394 29723055 28691034 27763848 26889168 26011432 25258018 24629058 23999004 23424279 22868157
12385 22868157 22359252 21925603 21478073 21054549 20703882 20402695 20172501 19959102 19750523
12376 19750523 19512997 19294183 19136887 18991421 18839144 18722726 18615876 18517961 18469531 18439653
12366 18439653 18374108 18309814 18311138 18324175 18315738 18299418 18317682 18376767 18406003 18434353 18480306
12355 18480306 18589874 18683195 18775067 18887101 19004433 19116689 19238791 19347697 19473452 19602518
12345 19602518 19753215 19921834 20063110 20176138 20290285 20418372 20549972 20684324 20831653
12336B0831653J39585J11451J37169J60315J24686J44202J78926J61810J32712
12327B2122509J47262J66855J47342J22325J38547J43981J69703J88037J76023
12318B3522584J39162M0874l3500j8449K5308p903q396k3874k3802k5185l9152
12307B3547667k0866j9545l1814l2456l9085m4893o5982l7290q127l8678n7646
12296B3151285m7872o3705q6949r2162o9141n8951o8440j27883j41760j05437
12286B2288985j17551j22265r9267j12372j04213j17119j32650j18213j24023
12277B1241312j47456j76327j73218j80993j39574j41861j72765j55659k02558
12268A9750901k14393k12635j92735j91665k08835k04634k23473k40933k16062
$$ plain form
12336 20831653 20971238 21082689 21219858 21380173 21504859 21649061 21827987 21989797 22122509
12327 22122509 22269771 22436626 22583968 22706293 22844840 22988821 23158524 23346561 23522584
12318 23522584 23661746 23702620 23669120 23650671 23675979 23668076 23659680 23635806 23612004 23586819 23547667
12307 23547667 23526801 23507256 23475442 23442986 23403901 23359008 23293026 23255736 23247609 23208931 23151285
12296 23151285 23103413 23039708 22952759 22860597 22791456 22732505 22664065 22536182 22394422 22288985
12286 22288985 22171434 22049169 21949902 21837530 21733317 21616198 21483548 21365335 21241312
12277 21241312 21093856 20917529 20744311 20563318 20423744 20281883 20109118 19953459 19750901
12268 19750901 19536508 19323873 19131138 18939473 18730638 18526004 18302531 18061598 17845536
12259A7845536j88407j88134j68346j26867j54513j89853k07036j99817j85975
12250A6236588j77782k10672k23994k30978k20028k21900k15034j93244j91903
12241A4351053j93841j99385j84492k02925j63209j68145j64602j44398j57834
12232A2772222j66089j77316k30009k01312j74577j74510j79140j37822j47627
12223A1183820j56604j76419j59960j48075j36302j42501j43484j46985r9715
12214I873775j16270j13641j19142j23828j41424j15182j17479j21731j22515
12205H782563j04472j32163j06965j02488p6518p9510q2620p3620q4708j15453
12195G824046j13240j05196r5225q2896j20737j27838j59299r9990j15378j29432
$$ plain form
12259 17845536 17657129 17468995 17300649 17173782 17019269 16829416 16622380 16422563 16236588
12250 16236588 16058806 15848134 15624140 15393162 15173134 14951234 14736200 14542956 14351053
12241 14351053 14157212 13957827 13773335 13570410 13407201 13239056 13074454 12930056 12772222
12232 12772222 12606133 12428817 12198808 11997496 11822919 11648409 11469269 11331447 11183820
12223 11183820 11027216 10850797 10690837 10542762 10406460 10263959 10120475 9973490 9873775
12214 9873775 9757505 9643864 9524722 9400894 9259470 9144288 9026809 8905078 8782563
12205 8782563 8678091 8545928 8438963 8336475 8259957 8180447 8097827 8024207 7939499 7824046
12195 7824046 7710806 7605610 7510385 7427489 7306752 7178914 7019615 6919625 6804247 6674815
12185F674815r8962m3808q5551q9233p3976p9540p1257r6305j24243q3392n0934
12174E777614p6627n6971p4321q1555m2382p6106o7640m0363l9533j9916m4450
12163E157750o3525r7607p5088o2008j5808m7005n6877j4914j0377r913n0006
12152D654622m4177l1895l0426j4656l9422m2199m0904p6321q3289p2348m3554
12141D135431l804j4282m1407n7369n1383l2977l0545r639m0826n1793k1028k4899
12129C755479l3535k653l7010m5886l6437m2150j68l2719l7241K951m259l8985
12117C447387n6463l8616k2353m8821k9853n334P773l4456m8051m7531l8493l7461
12105C047728k2474l316Q251k7911m2542k7068k4338n6590j3848l0468k9788J74
$$ plain form
12185 6674815 6575853 6532045 6446494 6357261 6283285 6203745 6132488 6036183 5911940 5828548 5777614
12174 5777614 5700987 5644016 5569695 5488140 5445758 5369652 5302012 5261649 5222116 5202200 5157750
12163 5157750 5094225 4996618 4921530 4859522 4843714 4796709 4739832 4724918 4714541 4704628 4654622
12152 4654622 4610445 4578550 4548124 4533468 4494046 4451847 4410943 4334622 4251333 4178985 4135431
12141 4135431 4131627 4117345 4075938 4018569 3967186 3934209 3903664 3894025 3853199 3801406 3780378 3755479
12129 3755479 3721944 3719291 3682281 3636395 3599958 3557808 3557640 3524921 3487680 3490631 3486372 3447387
12117 3447387 3390924 3352308 3329955 3281134 3251281 3245947 3253720 3219264 3171213 3123682 3085189 3047728
12105 3047728 3025254 3021938 3030189 3002278 2959736 2932668 2908330 2851740 2837892 2807424 2777636 2777810
12093B777810m6649k6590l2835l648l6459n9600j5594K049j6823o2784l2360j9415
12081B427102N29m197k502n464o958j0072k3131j1462j1632M9803L0164K1661
12069B453841O1667Q9355P1318K9920n4579p5808j01452j26653o6654l7839m8988
12058B194128k4565j3590n0119m3275l2681j0532m5023n2267l0353K9l245k0924
12046A867583j7686J6005m14p528j8476k9206m4420P620l0052l9896j1356K8743
12034A720917K4861l4110m4582k6249o076j3059J608j5509k3509M471P203j0218
12022A585748j8188p661J0568n19j3892j3609J2517L1364o41j8819K1499J1027
12010A599394J5421O0349R0828J04464J75466K15992L14094M46604N00059L47642
$$ plain form
12093 2777810 2731161 2704571 2671736 2668088 2631629 2572029 2556435 2558484 2541661 2478877 2446517 2427102
12081 2427102 2427631 2423434 2420932 2415468 2408510 2398438 2375307 2363845 2352213 2402016 2432180 2453841
12069 2453841 2515508 2604863 2676181 2706101 2651522 2575714 2474262 2347609 2280955 2243116 2194128
12058 2194128 2169563 2155973 2105854 2062579 2029898 2019366 1974343 1922076 1891723 1891752 1888507 1867583
12046 1867583 1849897 1865902 1865488 1857960 1839484 1810278 1765858 1773478 1743426 1703530 1692174 1720917
12034 1720917 1745778 1711668 1667086 1640837 1634761 1621702 1623310 1607801 1584292 1588763 1595966 1585748
12022 1585748 1567560 1559899 1570467 1569948 1556056 1542447 1554964 1586328 1585687 1566868 1588367 1599394
12010 1599394 1614815 1675164 1765992 1870456 2045922 2261914 2576008 3022612 3522671 3870313
12000C870313k5972l94468m31204l58093k47696j57219j40018j12874r3208o9708
11990A839853k3802k9794m0071l8471k4353l7028k5902j8463r649N49J1063k8529
11978A575403k2000j9617j5456o248k6280m381k7161j8069P940n728k6690k7041
11966A384672k6478k1177n2820j7735J9371j1463k7414Q664j1249k5784j612J5925
11954A232900l3333j7739k0660j8356n2430R564R308k3429l0051o5783j5437J1034
11942I85588J2993p122k9945K889K940j3433j0034N507L11P612k1191k1063K0308
11929I35360R247L817k7455k5886k0853R411j2200k8609p706K2355M452k0722
11917H41211m1271p746J2351J1818L731r045j609j9513k8092j3169J2825j435
$$ plain form
12000 3870313 3844341 3449873 3018669 2660576 2412880 2255661 2115643 2002769 1909561 1839853
11990 1839853 1816051 1786257 1746186 1707715 1683362 1646334 1620432 1601969 1592320 1592869 1603932 1575403
11978 1575403 1553403 1533786 1518330 1512082 1485802 1481421 1454260 1436191 1444131 1438403 1411713 1384672
11966 1384672 1358194 1337017 1284197 1266462 1285833 1274370 1246956 1255620 1244371 1218587 1216975 1232900
11954 1232900 1199567 1181828 1161168 1142812 1090382 1099946 1109254 1085825 1055774 989991 974554 985588
11942 985588 998581 991459 961514 964403 967343 953910 943876 949383 949694 957306 936115 915052 935360
11929 935360 944607 948424 920969 895083 874230 883641 871441 842832 835126 857481 861933 841211
11917 841211 799940 792194 804545 816363 820094 811049 809440 789927 761835 748666 761491 760056
11905G60056k5099k4655k1392n288L0859K4675l3908l5195J329L1135O742j958
11893G07301J0322q492j0340o542j1047K396l513N655k0254O542J0097j9402N316
11880F68039j3805j8380q010j1748N876j1832n113L9183L2309l2151r426J0723
11868F45665J264m069p429J3176P343J8931n708k2651j4177J5189J7784k4801
11856F40517n487p354j7699J1803J6311r831o0118l9673J5901L4854J1904J3250
11844F04378o435k1530R169K0611k0573l3249K4406j8684m4241J3814J626j5563
11832E13729K6424M3257R710r258k7811O036J5637J2315k6890k026J72k127k7917
11819E31251J0927M724j5037j7091l6788r98j9463j5345J157K557L5730L9894
$$ plain form
11905 760056 734957 710302 688910 683622 714481 739156 705248 670053 671382 702517 709259 707301
11893 707301 717623 709131 698791 692249 681202 683598 680085 685740 665486 672028 682125 662723 668039
11880 668039 654234 635854 627844 616096 621972 610140 605027 644210 676519 644368 634942 645665
11868 645665 646929 642860 635431 648607 655950 674881 669173 646522 632345 647534 665318 640517
11856 640517 635030 627676 609977 621780 638091 628260 568142 528469 544370 579224 591128 604378
11844 604378 597943 576413 585582 606193 585620 552371 576777 558093 513852 527666 529292 513729
11832 513729 540153 583410 593120 583862 556051 562087 577724 590039 563149 561123 561295 559168 531251
11819 531251 542178 546902 531865 514774 477986 476988 457525 442180 443337 445894 481624 521518
11807E21518j9161k2967K794J327k178j5876P3j4921m222O285J4363J0909k9852
11794D48092j5443n565k1092j4068L8701L6348L1655l9201n1767l1910J6994K6780
11782D19524k237k9700o653M630p322K4332q877j9734K0843n24j2483q587J6546
11769C89758q911J0214m112o80l71N93j2887J6368P159K0986k310j9473k8329
11756C68005j5458O896k069L984o457r950R903L611k633j9615j785Q386J7869
11743C60687l384J392o174j2748J8795K536N318l8155k6448m204R671M2432n987
11730C43731K1608J8894N79j5925J6926M1948J4214J4258k0273j8383m8827k7739
11718C41011j9728l6146M269J8512J7963K1767j5652j4261m0161j1038n933J6840
$$ plain form
11807 521518 502357 479390 482184 483511 481333 465457 465530 450609 446387 452672 467035 477944 448092
11794 448092 432649 427084 405992 391924 430625 466973 498628 459427 407660 375750 392744 419524
11782 419524 417287 387587 380934 385564 378242 402574 393697 373963 394806 394282 381799 373212 389758
11769 389758 380847 391061 386949 386269 385898 386491 373604 389972 397131 418117 415807 396334 368005
11756 368005 352547 359443 357374 361358 354901 344951 354854 358465 355832 336217 334432 342818 360687
11743 360687 357303 358695 352521 339773 358568 361104 366422 328267 301819 297615 307286 349718 343731
11730 343731 365339 384233 384812 368887 385813 427761 441975 456233 435960 417577 368750 341011
11718 341011 321283 285137 289406 307918 325881 347648 331996 317735 277574 266536 260603 277443
11706B77443L2767K2947j5567R602q349l7878j6303N513j5807J9346M2032L752
11694C19498j7535j1314j0443Q891K2743L4488K122k8614n032q951k1714J522
11682B85661p948j3327K798L4275K0109r960j554J8776k1048m2261M714Q093J4351
11669B92679j157L3231j9777j3782j4853o715j2376n308k1512j1482J6834J4049
11657B49831r713K7882J084L0434j8494m3758j6132j197n194J4742k179l485p731
11644B16090L890j5137J109J6670K7245L1592Q947k4082m1276o57m5108n289L6345
11631B10339K6275J4511j0824k279j9224j9317K7895K170j1733J261P22j5008
11619B04788l070K0997K2530k6676k7881L0804K6720n1140k7272M0236K540J0581
$$ plain form
11706 277443 310210 333157 317590 327192 318843 280965 264662 270175 254368 273714 315746 319498
11694 319498 301963 290649 280206 289097 311840 346328 348450 319836 314804 305853 284139 285661
11682 285661 277713 264386 267184 301459 321568 311608 310054 328830 307782 265521 270235 278328 292679
11669 292679 291522 324753 304976 291194 276341 269626 257250 251942 230430 218948 235782 249831
11657 249831 240118 268000 269084 299518 281024 237266 221134 219937 214743 229485 227306 223821 216090
11644 216090 219980 204843 205952 222622 249867 281459 290406 266324 225048 224391 179283 173994 210339
11631 210339 236614 251125 240301 238022 218798 199481 227376 229546 217813 219074 219796 204788
11619 204788 201718 222715 245245 218569 190688 221492 248212 197072 169800 210036 212576 223157
11607B23157m716j3004J379N77k0431k085j1354j9145J6216J2584j1056K7844
11595A99966k508j6537j2684l862k7587j2363K8435N9920k4410j4208J4178J0751
11583A99091j2383j8520K923L2230K2104L0116K0111K7719n3858m0620o903J4178
11571B16188j1230n54l0000j7170J4436m482J1488K6149k0163j7299r278K0059
11559A78144L139j7374k3396R171M0847K8249K418k0904l834J7212L431k109o979
11546B08015k1095R20J1275j3852k6768k039r337Q883L1272K9K621M984J7763
11533B12671N431k2690J5109l170j1623J2848K864j3878k3362j2046m137j3280
11521A44737l264j7157o112R108j0172K7887K3923q381K5058l595J5466O51m5078
$$ plain form
11607 223157 218441 205437 206816 207393 186962 184877 173523 154378 170594 183178 172122 199966
11595 199966 197458 180921 168237 164375 136788 124425 152860 212780 188370 174162 188340 199091
11583 199091 186708 168188 171111 203341 225445 255561 275672 303391 249533 208913 202010 216188
11571 216188 204958 204404 174404 157234 171670 167188 178676 204825 184662 167363 158085 178144
11559 178144 181283 163909 140513 149684 190531 218780 221198 200294 196460 213672 217103 214994 208015
11546 208015 186920 187840 199115 185263 158495 156456 147119 156002 187274 187303 189924 194908 212671
11533 212671 218102 195412 210521 207351 195728 208576 211440 197562 174200 162154 158017 144737
11521 144737 141473 124316 118204 127312 117140 145027 168950 160569 185627 182032 197498 198149 153071
11508A53071j9070J064L1505M364j3919j3231j0291k556j381K2933J4305k0453
11496A46341p958Q830L719j6891K817q038j5824l634r333n755R282j772j6523
11483H5261o919J4503Q506M404K1905j1950j7133L306L6632m881M001j3398j043
11470A23194j8493r051R998K166P697K554j2565r934L2097l3735l9932r993K045
11457D6048J7777J438J4805J1752J9136L2165j753l0100j3525J4605L1861J1933
11445A56142m74l2197k9635j3279K7778N772O851J4418N057k3099q621L2309K02
11432A41224j0061k209q588j9655J0648j213o386j6243J9061L7464o838k8980
11420A08224j4316L356Q429j1695j741p898Q184J0868J0305o745j6443j6775M0130
$$ plain form
11508 153071 134001 135065 166570 170934 157015 143784 133493 130937 129556 152489 166794 146341
11496 146341 138383 147213 150932 134041 136858 128820 112996 109362 100029 94274 103556 101784 85261
11483 85261 78342 92845 101351 105755 127660 115710 98577 101883 138515 133634 137635 124237 123194
11470 123194 104701 95650 105648 107814 115511 118065 105500 95566 127663 93928 53996 44003 46048
11457 46048 63825 65263 80068 91820 110956 143121 141368 111268 97743 112348 144209 156142
11445 156142 155668 123471 93836 80557 108335 114107 120958 135376 140433 117334 108713 141022 141224
11432 141224 131163 128954 120366 100711 111359 110146 103760 87517 106578 144042 137204 108224
11420 108224 93908 97264 105693 93998 92257 84359 92543 103411 113716 106971 90528 73753 113883
11407A13883J3999k4801k1640J7016l6198j8499N1166K7319k3140j1324J7838
11396A05619j0407J6064K3194P632j9266n6630k0931p031J1666K1652j6414m01
11384E4747M2635k2073j6144R931J5146J756k9318O317P633J6588q865J5278q240
11371H5391K8083l977k4464J5975J3170J1657k682j5660l515k704R911j7472j2467
11358H1246k2009j3533K8162L7993k338O199k3670j9279l139j004J438J992K4439
11345I6497j7208Q30j8754n3K9610j0652J1279J6611R643r089k5382L403P097
11332I3832j0720r08K941r793J7880Q678J50J388Q849J2185j0888j3633k3400
11319G6561j0273k0950P15K2219J401J0655L130K4744j6120M599J3587k7514M307
$$ plain form
11407 113883 127882 103081 81441 98457 62259 43760 94926 122245 99105 87781 105619
11396 105619 95212 111276 134470 142102 122836 66206 45275 38244 49910 71562 55148 54747
11384 54747 97382 75309 59165 69096 84242 85998 56680 62997 70630 87218 78353 93631 85391
11371 85391 113474 109497 85033 101008 114178 125835 123153 107493 103978 101274 111185 93713 81246
11358 81246 59237 45704 73866 111859 109521 115720 92050 72771 69632 68628 70066 72058 96497
11345 96497 79289 80119 61365 61312 90922 80270 91549 108160 117803 108714 83332 86735 93832
11332 93832 83112 82204 85145 75352 93232 101910 102060 103448 112297 124482 113594 99961 76561
11319 76561 66288 45338 46053 68272 69673 80328 83458 108202 92082 96681 110268 82754 87061
11306H7061K0518m594K6243Q771J0438k3690l0605l602J4801K767m673o934J0120
11293A06621K4909j2170Q251j1304k9520n981n937j4529j5120R908L51K6484M551
11280H6514j6554K489q02L0101j2317k8939J9080K1581k0819k3505o069J5308
11268F6068J5920P162j3141n665k487k013K9763r429L980l2867l1815L853J1244
11255D0573P103R513N683Q037K3500j073j9211l337j8985j1680J6454L0821L612
11242I1010r740j4108j8429j9242R498r179L04J8193o757j91Q042N416J6151P644
11228G8612k3264k8869j0576K1393j7379n799q28J0657M589P733q615l0292N923
11215C285L0368J7946N702R7J4995J631m5889j4379J7777k0948j6389K2281J5542
$$ plain form
11306 87061 107579 102985 129228 137999 148437 124747 94142 90540 105341 108108 103435 96501 106621
11293 106621 131530 119360 127611 116307 86787 80806 74869 60340 45220 55128 55479 81963 86514
11280 86514 69960 72449 71647 101748 89431 60492 79572 101153 80334 56829 50760 66068
11268 66068 81988 89150 76009 70344 67857 65844 95607 86178 90158 57291 25476 29329 40573
11255 40573 47676 57189 62872 70909 94409 93336 74125 70788 51803 40123 56577 87398 91010
11242 91010 81270 67162 48733 29491 38989 29810 30114 48307 41550 41359 49401 54817 70968 78612
11228 78612 55348 26479 15903 37296 19917 14118 13290 23947 28536 36269 27654 -2638 3285
11215 3285 33653 51599 57301 57398 72393 74024 28135 13756 31533 10585 -5804 16477 32019
11202C2019L1550J7361m2090l3376O508K6610N875L362K945j3358J3789J1574
11190F2769R690L483j4011J005j4803k0588K4066J8028k7309J8905N2988k096
11178A12127l5726n128J3718j4791p438J6195p863l8409k8677J4211L0471J1086
11166E9776j4603n86J5665j0549J5747J2441k8436j2291R264J0727j8759r939
11154B8457P101j2245Q737J3792j8310j0305J9334J6967P753j0384P384J681j5798
11141D4164J0580R359l427k1954m0116k1547O659N9186J3738j4482k0274k1686
11129B00l0260o236L1685L9679r444o962J2078K337l3532J2915Q463J0764L0298
11116F1985J3124k9337j3429k7233m748M9669r052k1433k4336l7339J7631L4157
$$ plain form
11202 32019 63569 80930 38840 5464 11972 38582 44457 47819 50764 37406 51195 62769
11190 62769 72459 75942 61931 62936 48133 27545 51611 69639 42330 61235 114223 112127
11178 112127 76401 71273 84991 70200 62762 78957 71094 32685 4008 18219 48690 59776
11166 59776 45173 44587 60252 49703 65450 77891 49455 37164 46428 57155 38396 28457
11154 28457 35558 23313 32050 45842 27532 17227 36561 53528 61281 50897 58281 59962 44164
11141 44164 54744 64103 60676 38722 -1394 -22941 -16282 42904 56642 42160 21886 200
11129 200 -30060 -36296 -4611 35068 25624 18662 30740 33077 -455 12460 20923 31687 61985
11116 61985 75109 45772 32343 5110 362 50031 40979 19546 -4790 -42129 -24498 9659
11104I659K5234K980j5513J6229J3539p561p32J6462J3948J0916l9554n6988L754
11091g627K7308Q34k7950J9318K7303k0356k3732J3502J1135L3117K315P578J0128
11078G2873k747J2325J4947J0755j1953m2366l5234k570N2151K6777k2969k6217
11066D5772k7993k7017L9733J8479J7113m105J3884o281k6964k0964k119j6559
11054B979k3689j7235J3880J0143K3041K6097k2425j9070l100K2856K2304M684
11042D0465K6801q031r597n3181r984R365J5584r328J0464M0136P569n515j2138
11029D2610J0106j1138j8769m003K2970J2273k5583j9127K1778j0175n704K3616
11017C8854M509J4586J2844J749j0203k730j5646O940j1127k3985j2894J2757
$$ plain form
11104 9659 34893 37873 22360 38589 52128 44567 43835 60297 74245 85161 45607 -11381 -7627
11091 -7627 19681 20515 -7435 11883 39186 18830 -4902 8600 19735 52852 55167 62745 72873
11078 72873 70126 82451 97398 108153 96200 53834 18600 16030 68181 94958 71989 45772
11066 45772 17779 -9238 30495 48974 66087 61982 75866 69585 42621 21657 19538 2979
11054 2979 -20710 -37945 -24065 -13922 9119 35216 12791 -6279 -9379 13477 35781 40465
11042 40465 67266 59235 49638 -3543 -13527 -4162 11422 2094 12558 52694 60263 54748 42610
11029 42610 52716 41578 22809 18806 41776 54049 28466 9339 31117 20942 15238 38854
11017 38854 43363 57949 70793 72542 62339 59609 43963 50903 39776 15791 2897 15654
11005A5654M110J8993L2134J9385L673l1762k8549j5911k4001r992J1382K5979
10993B1095K1497N292r949j3439j1920J2118J534Q928k4327o965k416J4075J8663
10980C4186k2762k7705m51N1602j5238o870J9861P337L7429k6262k337j080p354
10967D0356j2087j8144K0868J972N374J6125j5898N376n343k012J4691j223k386
10954D7669j3027j6001J5058J2586K6135k498j0373j560l4526k0859J508J2728
10942A6840J766J5279m282O469Q153o581Q206P00M668k5152l3542q129J4641K0177
10928A9213J3931j2129j1009J7787J2945j036M913j735k2649L911k4833J3895
10916A3204N093m548M7018L0035l1454l8155l4876m789j597L675N81J9704K7192
$$ plain form
11005 15654 19764 38757 70891 90276 93949 62187 33638 17727 -6274 -16266 -4884 21095
10993 21095 42592 47884 37935 24496 12576 24694 26228 35156 10829 3864 1448 15523 34186
10980 34186 11424 -16281 -16732 34870 19632 12762 32623 39960 77389 51127 48790 47710 40356
10967 40356 28269 10125 30993 32965 38339 54464 38566 43942 38599 36587 51278 50055 47669
10954 47669 34642 18641 33699 46285 72420 69922 59549 57989 23463 2604 4112 16840
10942 16840 18606 33885 29603 36072 44225 37644 45850 46550 51218 26066 -7476 -15605 -964 19213
10928 19213 33144 21015 10006 27793 40738 39702 44615 42880 20231 24142 -691 13204
10916 13204 18297 13749 60767 90802 59348 21193 -13683 -18472 -20069 -16394 -15813 3891 31083
10903C1083O844k352O410Q467j1381m337J5557K7461M966j0674M29j4942m4835
10890A2696r877p808q078J5874j659j4526P688J2136K1614K7405k940k159j258
10877D9108L7897J7118j0777k7958k2791q837k534k1401Q471J9304j3466q695
10865A5439M91L172j4400m5984j3827Q042m4k73J903o715L6925J0495J0790N830
10851A1844M857m337Q216K6157M974r603m712J6206q968Q171O11P163q098k8448
10837B4033j7022k3237j66Q717J5751j0733k9679J2444K1407K337O349j4258m303
10824h360J4769J4596N115J4522j038j480j4963l0907K207J0785p976Q015l878
10811A407k1459K8450J4655m742M098J4255m369r813k0404r352J187r408J0790
$$ plain form
10903 31083 37927 35575 41985 50452 39071 34734 50291 77752 82718 72044 72473 57531 12696
10890 12696 2819 -4989 -13067 2807 1148 -13378 -5690 6446 28060 55465 52525 50366 49108
10877 49108 87005 104123 93346 65388 42597 33760 31226 9825 18296 37600 24134 15439
10865 15439 15930 19102 4702 -41282 -55109 -47067 -47111 -47384 -45481 -52196 -15271 -4776 6014 11844
10851 11844 16701 12364 20580 46737 51711 42108 37396 53602 44634 52805 53416 60579 52481 24033
10837 24033 7011 -16226 -16392 -7675 8076 -2657 -32336 -19892 1515 3852 10201 -4057 -8360
10824 -8360 6409 21005 26120 40642 39604 38124 23161 -7746 -5539 5246 -2730 5285 1407
10811 1407 -20052 8398 23053 18311 22409 36664 32295 22482 2078 -7274 -6087 -15495 -4705
10798d705J826r755J1002J0853K1576l023L962J3104j8651j7639n45l418L70K1966
10784B6923J0679j8490j4732o295j187l984j5678J2527R890K6211l551J9615j6770
10771B5158j2596R271l15n454q330j4000J5076M0731K96j7906j9077J9538M87
10758C2879j3910J0764l0588j5382P267k5032q864K8781j4622N53K1057n860r28
10745a3885Q346p315k796L3737O948j5976J2361j1408K009k4311J8566M8417N510
10732F0203l7602J5336k8970l7958o34L1875K846R47J1830q150j2530j541K4151
10719A9803J79l2328l338j3502j9281l857J4935q931M865K1100j8044L1273L4408
10706B7282Q417R030j4150j5440K6251j0324l5600J2324M398J556M233l1185m0542
$$ plain form
10798 -4705 -2879 -12634 -1632 9221 30797 27774 31736 44840 26189 8550 8005 4587 4957 26923
10784 26923 37602 19112 4380 -1915 -3102 -7086 -22764 -10237 -347 25864 22313 41928 25158
10771 25158 12562 21833 21518 16064 7734 -6266 8810 49541 49837 31931 12854 32392 32879
10758 32879 18969 29733 -855 -16237 -8970 -34002 -42866 -14085 -28707 -28154 -7097 -12957 -13885
10745 -13885 -5539 -12854 -15650 18087 25035 9059 21420 10012 12021 -12290 6276 54693 60203
10732 60203 22601 37937 8967 -28991 -29625 2250 5096 6043 17873 9723 -2807 -4348 19803
10719 19803 19982 -12346 -15684 -29186 -48467 -52324 -37389 -46320 -41455 -20355 -38399 -7126 27282
10706 27282 35699 44729 30579 15139 41390 31066 -4534 7790 12188 13744 17977 -13208 -53750
10693e3750l435K6683L8880K9608m078J1516M799j3106j1309k6183j4153J5130
10681F02J0294K1808N870k6692J0129J838o606r834P555O066k9979J1316K5499
10668B7866j5325q968j5983K2307j3341J6889R338k5015r732L293J990J7525r105
10655A739L499j8723N92J5069M271K53K632j5571J5348J0057o687p117k0755j4852
10641c0245J2841M0672m609K278R566J1327q992k5786j3239J6426J4105j0619
10629A3725j1058q778J1002J211N389L879k2702l3963j5931K3632K184q565o469
10616d6444k448n319m215R727L1300R175j6661k133k15P067O613m088j6860R110
10602b5391K3754o635J1423J3283J0681J8672n229j8471K162l1481q558K6978
$$ plain form
10693 -53750 -57185 -30502 8378 37986 33908 45424 50223 37117 25808 -375 -14528 602
10681 602 10896 32704 38574 11882 22011 23849 17243 7409 14964 21030 -8949 2367 27866
10668 27866 12541 3573 -12410 9897 -3444 13445 22783 -2232 -11964 -8671 -6681 10844 1739
10655 1739 5238 -13485 -12893 2176 6447 6700 9332 -6239 9109 19166 12479 5362 -15393 -30245
10641 -30245 -17404 23268 18659 20937 30503 41830 32838 7052 -6187 10239 24344 13725
10629 13725 2667 -6111 4891 6102 11491 15370 -7332 -41295 -57226 -33594 -31410 -39975 -46444
10616 -46444 -48892 -54211 -58426 -48699 -17399 -8224 -24885 -27018 -27233 -20166 -13553 -17641 -34501 -25391
10602 -25391 -1637 -8272 3151 16434 27115 45787 40558 22087 24249 -7232 -15790 11188
10590A1188J1693n963m2755O170M7530K3937L593m3855j3590k811K393k1257J8291
10577e436K2376O851K2589q027n834j778j0745o745j245j2029J474L434j1469
10564f584n99J4671J7525m974j3198J3030R592Q303q297l041o956Q178J1192J5652
10550E4494P145J0096O880k9388j7433N041j8203k0910M744j4593M806m073r024
10537b0418p816J0618J1777k965j1267p554r77k061j0933K0537J9669o478j7583
10524b5451J2853q916j5890M0653M7675K498k0267l957j2104j0904J4877L257
10512B4324J6319k3019J0362K1553k5246j3006R760j4283l5363l7536O874M5050
10500a4211J0401J6977p003j1835P989j9787j6973K9888M5041p447m667j9568
$$ plain form
10590 11188 22881 16918 -25837 -19667 27863 51800 55393 11538 -2052 -4863 -2470 -23727 -5436
10577 -5436 16940 23791 46380 38353 32519 30741 19996 13251 12006 -23 1451 4885 -6584
10564 -6584 -7183 7488 25013 20039 6841 19871 29463 37766 29469 26428 19472 27650 38842 54494
10550 54494 61639 71735 78615 49227 31794 36835 18632 -2278 2466 -12127 -7321 -11394 -20418
10537 -20418 -28234 -17616 -5839 -8804 -20071 -27625 -28602 -30663 -41596 -21059 -1390 -7868 -25451
10524 -25451 -12598 -21514 -37404 3249 50924 53422 33155 29198 17094 6190 21067 24324
10512 24324 40643 17624 27986 49539 24293 11287 21047 6764 -28599 -66135 -59261 -14211
10500 -14211 -3810 13167 6164 -5671 2318 -17469 -34442 -4554 40487 33040 28373 8805
10488H805j2026L6118J5029k7258m8370L0039Q327k5999P548J6853K9382j111
10476C7337J0941k3699j4443j7260n077J8061j0066j8416p463J4332J7749J0323
10464A2319J8440K0703r150k8755j4495l14M197M376j8433j7906j8765J9228j2283
10451d0838K7389K6380N699R640J0133j930k1736j6115K3563K2839m092l7019
10439C913j9147j333R692j6933P241J0422K5999K1807k871l5604k0193p185P899
10426a6293J6135Q860K3528j8077R835J0921M269n116P886J1296k4143p811j7590
10413C700k0877K753J3770L1084K8429m253j6873j2695M683J941p128L0839m370
10400E1003j0626L1778j2303l6647j2863p788Q223R524j4473O999J3193q337j5837
$$ plain form
10488 8805 -3221 32897 47926 20668 -27702 2337 10664 -15335 -7787 9066 38448 37337
10476 37337 48278 24579 10136 -7124 -12201 5860 -4206 -22622 -30085 -15753 1996 12319
10464 12319 30759 51462 42312 13557 -938 -1252 2945 7321 -11112 -29018 -47783 -28555 -40838
10451 -40838 -13449 12931 18630 28270 38403 36473 14737 -1378 22185 45024 40932 3913
10439 3913 -15234 -16567 -6875 -23808 -16567 -6145 19854 41661 38790 3186 -17007 -24192 -16293
10426 -16293 -158 8702 32230 14153 23988 34909 39178 34062 41948 53244 29101 21290 3700
10413 3700 -17177 -14424 -654 30430 58859 54606 37733 25038 29721 31662 24534 55373 51003
10400 51003 40377 72155 59852 23205 10342 2554 10777 20301 5828 12827 26020 17683 1846
10387A846k5423K3852J6369j3503j6025j0478N3108K3689o105j9468j789q080
10375A7993m495K4884J0543j047Q618l732k8069r521o895j0696K2500J0867l257
10362B7693j7637j1521q178k646N797M45L4544J6635K0302L0147J3205j6368r765
10349H2653J4724J3353K1116N236J5180M6633O375m143K6833P786K9745R5451
10337C60942J11255J37173J73763J93175K15865K34392J96854J55840J17523O4065
10327A960847L459k7733r8960j66262j69664j82910j34232j22350j14898j31436
10317H15861r3642m0911n6383k4077m5944o1762m3827l7935J3249j1596j4015
10306C99018l802j5193Q031j5231l1595N72K1765k080j6300l0063j8605p502M321
$$ plain form
10387 1846 -23577 275 16644 3141 -12884 -23362 29746 53435 47330 27862 26073 17993
10375 17993 13498 38382 48925 47878 56496 52764 24695 15174 8279 -2417 20083 30950 27693
10362 27693 10056 -1465 -9643 -12289 -6492 -6047 28497 45132 65434 95581 108786 92418 82653
10349 82653 97377 110730 131846 137082 152262 198895 205270 201127 227960 235746 265491 360942
10337 360942 472197 609370 783133 976308 1192173 1426565 1623419 1779259 1896782 1960847
10327 1960847 1964306 1936573 1837613 1671351 1501687 1318777 1184545 1062195 947297 815861
10317 815861 722219 681308 624925 600848 554904 493142 449315 411380 424629 413033 399018
10306 399018 395216 380023 388054 372823 341228 341800 363565 361485 345185 315122 296517 289015 293336
10293B93336j2267k0716K4146O057J0058j0803m2175j1767k5753q114k8897j5159
10281A57946M779J5482K2176n756n0996k5485j8509M92J7020j1596r731j5430
10269H0392j646M625q908j5607K0408J4593J750P823j3263k5042l0613N181O96
10256D0389o396j585l937J5766K3166q094R988j0040j7654J413m8388o7175L571
10243f8976J8907J746L8709J9934M581J8957K5589k3281j3353L182K4276J518
10231E1789j0871j0943p763J6806j7124n2699k3368J9206J7770l0364J5034P951
10219b4576j6948J3662J7515j0776j248J1509J0539q360k1465O066J4698L0836
10207B1452k277l8272N08J4204J1151J705k1512O254K7292r675Q940j3922J6225
$$ plain form
10293 293336 281069 260353 284499 290556 300614 289811 247636 235869 210116 202002 173105 157946
10281 157946 162725 178207 200383 194627 143631 118146 99637 100129 117149 105553 95822 80392
10269 80392 78746 83371 74463 58856 79264 93857 95607 103430 90167 65125 34512 39693 40389
10256 40389 33993 32408 28471 44237 67403 59309 69297 59257 41603 43016 -5372 -72547 -68976
10243 -68976 -50069 -48323 -9614 10320 14901 33858 59447 36166 22813 25995 50271 51789
10231 51789 40918 29975 22212 39018 21894 -30805 -54173 -34967 -17197 -47561 -32527 -24576
10219 -24576 -41524 -27862 -10347 -21123 -22371 -10862 -323 -8683 -30148 -24082 -9384 21452
10207 21452 19175 -19097 -18589 -4385 6766 8471 -13041 -6787 20505 10830 19770 5848 22073
10194B2073r39o021p743M345k1241J4995m035l0692J7799l817j1947J7707K9304
10181A9788J877p19j7254L0726O406j9r083j7242J300l853r126j1156Q941J7057
10167A7643J3449r896k136J2244r438j725L2643J1696l5291l7045j4005n377M606
10154b2632k6503O928J8045K9619J8754N923L93J196r155k3633K0847L9387j8468
10141D0701k6463N019m020q280J1063J85j3807K6428K0841m339O300k8253k4188
10128A187o587J3133Q127j2453J6320l5n519J4665O465k4608j1609k2365j5218
10115c8497J502J6987J5884j0318K43r38l5503Q63M4253J7699R372M100o250k9135
10101i738k9336M546J1735N314P679R643J2568r406j5564k3834k0342J6136N2394
$$ plain form
10194 22073 21134 15113 7370 11715 -9526 5469 1434 -29258 -11459 -15276 -27223 -9516 19788
10181 19788 21665 20946 3692 34418 40824 40805 31722 14480 15780 11927 2801 -8355 586 17643
10167 17643 31092 21196 19060 31304 21866 20141 52784 64480 29189 -7856 -21861 -27238 -22632
10154 -22632 -49135 -42207 -24162 5457 24211 30134 30527 31723 22568 -1065 19782 59169 40701
10141 40701 14238 19257 15237 6957 18020 18205 4398 30826 51667 47328 53628 25375 1187
10128 1187 -5400 7733 15860 3407 19727 19692 14173 28838 35303 10695 -914 -23279 -38497
10115 -38497 -36995 -20008 -4124 -14442 -14199 -15137 -50640 -49777 -5524 12175 21547 25647 19397 -9738
10101 -9738 -39074 -34528 -22793 -17479 -9800 -157 12411 3005 -12559 -36393 -56735 -40599 11795
10088A1795N105k5560P127J5012m881k7632o132J6890K8717J5738k7794k3288
10076a4903p542p320J3007j1577K1081J0106k5196J3729K0415N981j234L427j5774
10063D200L642j3102L9418J7382k0116K455q028k104j1012J144J0148J0296R421
10050D3744p059j8759J1240J636k9629r420L6047m841r578O978o686j3873J7487
10037A7287j3743k7323K4573l902j7945k598N6033P267l1540j9698j3046Q732
10025a5903J3164J7778L0764l2390j9275O424Q341O48L103M589j5055l2677q748
10012c9237K9329j4712J3410L3425M499J3016k2054l6164O536m902L391K993K6630
9999A6160K2581l3181l8947r708O020L1303L1650q267q259j1787J0470K5719p984
$$ plain form
10088 11795 16900 -8660 -1533 13479 8598 -19034 -25166 -8276 20441 36179 8385 -14903
10076 -14903 -22445 -29765 -16758 -28335 -7254 2852 -22344 -8615 11800 17781 16547 19974 4200
10063 4200 7842 -5260 34158 51540 31424 33879 25851 23747 12735 13879 24027 34323 43744
10050 43744 36685 17926 29166 30802 1173 -8247 27800 22959 13381 20359 13673 -200 17287
10037 17287 3544 -23779 794 -3108 -21053 -23651 32382 39649 8109 -11589 -24635 -15903
10025 -15903 -2739 15039 45803 13413 -5862 562 8903 9551 12654 17243 2188 -30489 -39237
10012 -39237 -9908 -24620 -11210 22215 26714 39730 17676 -18488 -11952 -16854 -13463 -10470 16160
9999 16160 38741 5560 -33387 -43095 -37075 -5772 25878 17611 9352 -2435 8035 33754 25770
9986B5770k5692J4854J8978j7436J5390N345m754k0927K456k0441p21K4706J3171
9973C0699J4342k4498p2425j3668K1333l524K3885J5487K3867q937L087K1459
9961C1107o367k2101q517L3157k429N852J3806q270L858L173n1859q524L5547
9948A8433J7562K1796j4762j7469k3823k3215o938K354J3110J3066o754K2305
9936A5665J349J045k1493o341j1840R457R840j8491j0749J4088O440J5374j3113
9923h769K79K3301P298K3405j3878p066o222j6410j7925j7234P232K3760K4638
9910B2409j0876K80K3748J7447m3922j254m248k9920O777J9618j245j8958p326
9897b7470m195N141l423J0322K0120Q476p332J4674o455k3089J2667l316O21L038
$$ plain form
9986 25770 78 14932 33910 16474 31864 37209 32455 11528 13984 -6457 -7178 17528 30699
9973 30699 45041 20543 -51882 -65550 -44217 -47741 -23856 -8369 15498 6561 9648 31107
9961 31107 24740 2639 -5878 27279 24850 30702 44508 36238 40096 43269 -8590 -17114 18433
9948 18433 35995 57791 43029 25560 1737 -21478 -28416 -26062 -12952 114 -6640 15665
9936 15665 17014 18059 -3434 -9775 -21615 -12158 -2318 -20809 -31558 -17470 -11030 4344 -8769
9923 -8769 -8490 14811 22109 45514 31636 24570 18348 1938 -15987 -33221 -25989 -2229 22409
9910 22409 11533 11813 35561 53008 9086 7832 3584 -26336 -19559 59 -1186 -20144 -27470
9897 -27470 -31665 -26524 -29947 -19625 495 8971 1639 16313 9858 -13231 -564 -3880 -3259 -221
9883b21l11p71K7354R58r059J6336K039K4625j68j4244m631j3503n916K4002J6467
9868F2957j2163j5920l3719k6776l394J0034J6737J2756M5583O567j9255q620
9856C4787k3229O121K005L01q303J064k2796n071q584J9872J4413K6471Q055l55
9842D4751k2538J6040j2629l791k3694k2300K2275N476m461j1958j7909p217J8645
9829a9310l235j0113R203M8900J1953J60k5522j5634q753j1338R106N4554o514
9816C3457K320J0813j9003j3040l7936n328L9521O179N008J4380N510k1069l049
9803A7763o13O215M7097k8343k9990L484J3890Q166j9572j5467j58R3j2044J3882
9789D403q933q264k694l228J576K6498j9244k9215L5351K8615l0344q741O489
$$ plain form
9883 -221 -532 -1303 26051 27009 17950 34286 36325 60950 60782 46538 41907 28404 22488 46490 62957
9868 62957 50794 34874 1155 -25621 -29015 -18981 -2244 10512 56095 62662 43407 34787
9856 34787 11558 17679 19684 19985 11682 12746 -10050 -15121 -23705 -3833 10580 37051 45106 44751
9842 44751 22213 38253 25624 21833 -1861 -24161 -1886 3590 -871 -12829 -30738 -37955 -19310
9829 -19310 -22545 -32658 -23455 25445 37398 37558 12036 -3598 -12351 -23689 -14583 39971 33457
9816 33457 35777 46590 27587 14547 -23389 -28717 10804 16983 21991 36371 41881 20812 17763
9803 17763 17150 23365 70462 42119 12129 15613 29503 37669 18097 2630 2472 2565 -9479 4403
9789 4403 -4530 -12794 -15488 -18716 -17140 9358 -9886 -39101 -3750 24865 -5479 -14220 -7731
9776g731k129k4805J2855K8273J8869J3997O395J9491P11m7249k4356N225K7596
9763B7142Ll0624n13j450J1538K4899J74l7217J7890K2007J903l391N683r275
9749B8769q211J892R942L4769O831k4142m0151K5096L588l4548L568J4999J0676
9736C3078j0178j3433P297Q240p172j5705k0153j2350j956J2086J0319n92j7298
9723b7817q209J9066K4014J4028l9760q342J0835n821J3247M5364R802l8237p241
9710I29p855k0433J0102J6836j1135K21J4402j1098o936K8657K4237N170k9531
9697A3566k1953j5876j839K3051J7521j4580j3116j0024L8516K4510o85L111m0717
9684A485k8742Q90L7513K484j1845o01L411M36n02L978K7721j3389l1078j2927
$$ plain form
9776 -7731 -9860 -34665 -21810 6463 25332 39329 45724 65215 65926 18677 -5679 -454 27142
9763 27142 27145 -3479 -3992 -5442 6096 30995 31169 -6048 11842 33849 35752 32361 38044 28769
9749 28769 20558 22450 32392 67161 73992 49850 9699 34795 38383 3835 7403 22402 33078
9736 33078 22900 9467 16764 25004 17832 2127 -18026 -30376 -32332 -20246 -9927 -10519 -27817
9723 -27817 -36026 -16960 7054 21082 -18678 -27020 -16185 -22006 -8759 36605 46407 8170 929
9710 929 -6926 -27359 -17257 -421 -11556 -11335 3067 -8031 -14967 13690 37927 43097 13566
9697 13566 -8387 -24263 -26102 -3051 14470 -110 -13226 -23250 15266 39776 39091 42202 1485
9684 1485 -27257 -26367 11146 13630 1785 1184 4595 5031 4529 8507 36228 22839 -8239 -21166
9670b1166j7988K6825P557J0525J8901j5046J7178k9789j5883j731K195P208K3290
9657A2076k755N071p567j9855M58r55K190M4756K3326o133j9356O140P545j4707
9643C0234k9243j1944j438Q128j3435j6088J4041Q514L898J7260K5629J2101k6713
9630B0944k290l4323k1067J2341K6838o011K5336j2149P01K308j3589J6909P226
9617B3174K6991J6112J1456M748J4513j8227p548P581j7017k6494k7403m7184
9605c9298r555K9721N826O968j3323o471j3341K2474J5120K8181P254L915j7164
9592B0307k2813l1523p933R993J7926j7135K1040q184J0631K1690J6n847l0801
9579b2633M463P775J0665Q264j797j2650p903N648J5417J8575J8075K72o64J9713
$$ plain form
9670 -21166 -39154 -12329 -4772 5753 24654 9608 26786 -3003 -18886 -20617 -18422 -11214 12076
9657 12076 9321 14392 6825 -13030 -12572 -13527 -11337 33419 56745 50612 31256 37396 44941 30234
9643 30234 991 -10953 -12391 -4263 -17698 -33786 -19745 -11231 -7333 9927 35556 47657 20944
9630 20944 18654 -15669 -36736 -24395 2443 -3568 21768 9619 10320 12628 -961 15948 23174
9617 23174 50165 66277 77733 82481 96994 78767 71219 78800 61783 35289 7886 -39298
9605 -39298 -48853 -19132 -13306 -6338 -19661 -26132 -39473 -16999 -1879 26302 33556 37471 20307
9592 20307 -2506 -34029 -41962 -31969 -14043 -31178 -10138 -18322 -7691 13999 14015 8168 -22633
9579 -22633 -18170 -10395 270 8534 6737 -5913 -13816 -8168 7249 25824 43899 44171 43507 63220
9565F3220M675k2092j6181m104k1462J5162J7937l1997O136j3537P684L711l876
9552E276P472L0163L862q811k6748N775K9067k0799O522J1999R51J4996j1793
9539D7932j2864q280n051j6801k244L9623j0069j191L401J920K3194N39n608j2007
9525D2494J0977o259k1303L356L7470J8395k5318L377j0074j7388k1165K0763
9513C5325O051l76J6932m23q70n180P703Q011j2864q511R886k5191K586K3513
9499E6592J4363j9250k8271M402J4497J5386K8282J5968J2966K720j5309k7283
9487G5063j120J2597R103j226K5366N993n084l0769M504J8338l1940j4905L8151
9474A04071K3028k1658J5126L8885O552j6072l46j4257j6753q906O760r93K6184
$$ plain form
9565 63220 67895 45803 29622 25518 4056 19218 37155 5158 11294 -2243 5441 9152 5276
9552 5276 12748 42911 46773 37962 11214 16989 46056 25257 31779 43778 44729 59725 47932
9539 47932 35068 26788 21737 4936 2692 42315 32246 31055 34456 36376 59570 60109 54501 42494
9525 42494 53471 47212 25909 29265 66735 85130 59812 63189 53115 35727 14562 35325
9513 35325 41376 41000 57932 57509 56639 51459 59162 67173 54309 45798 55684 30493 33079 56592
9499 56592 70955 51705 23434 27836 42333 57719 86001 101969 114935 117655 102346 75063
9487 75063 73943 86540 95643 94417 119783 125776 120692 89923 94427 112765 80825 65920 104071
9474 104071 127099 105441 120567 159452 166004 149932 149586 135329 118576 109670 116430 115437 141621
9461A41621J9044K1244K5407K0520j3472j9351p421k768J7047O0582L0192M17
9449B93062M667P3300O8435K4283J9670M8095O1524J11522J33603J53112K11341
9438A202614K76403L40603M70361O16700Q41836J185416J738889K446982K760596
9429A1880400J357209j154327k506650k272497j577229j025727o94273n15564
9421C491342l72119k98309k60815k22739j87051j43153j11538r6884n3094p9212
9411A666428p9867m7868j9149l8184k0674m4530o7360n1286o78j0980q792L0826
9399A307886L140J1657J368l3302k2411k3024k7899k3174r132k1992p0187p5732
9387A017198p3866l3287n6659n8758n4385m7410n3474l3286n8095n4464j4051
$$ plain form
9461 141621 160665 181909 207316 227836 214364 195013 187592 184824 201871 262453 292645 293062
9449 293062 297729 371029 439464 463747 483417 531512 593036 704558 838161 991273 1202614
9438 1202614 1479017 1819620 2289981 2906681 3748517 4933933 6672822 9119804 11880400
9429 11880400 13237609 12083282 9576632 7304135 5726906 4701179 4006906 3491342
9421 3491342 3119223 2820914 2560099 2337360 2150309 2007156 1895618 1798734 1745640 1666428
9411 1666428 1586561 1538693 1519544 1481360 1460686 1416156 1348796 1297510 1296832 1285852 1277060 1307886
9399 1307886 1311026 1322683 1324051 1290749 1268338 1245314 1217415 1194241 1185109 1163117 1092930 1017198
9387 1017198 943332 910045 853386 794628 740243 692833 639359 606073 547978 493514 479463
9376D79463o885j8919k1332r296j4202o910n0069j9978q026l1311m8453Q625l420
9363B49287J3299j4598k8056j249j4247k5286k3095l222K443K7797l928j0539
9351A68606M858k9993k7948n275j3290j3942j0194N352J3772J6692m0359l4082
9339C4197K5569K9195q168l8343l5145R123N904l37O379j484K3283O934l0160
9326B6947j0704L641k530l14l1568l1574J595J7117M3242n172J4349K163q553
9313A8639J0401o961m923N478J0308J65j3328r687J6515K5269k4499k2748m991
9300c62L8270M0226N153l5815l8101j7358J2845j6144Q377J0116P81K0788o496
9287B2280n5282N424L9949j0455l7723J1114K92r398j4505Q431K3840j8395o19
$$ plain form
9376 479463 472578 453659 432327 423031 408829 401919 351850 331872 323846 292535 244082 252707 249287
9363 249287 262586 247988 219932 218683 204436 179150 156055 152833 155276 183073 179145 168606
9351 168606 173464 143471 115523 110248 96958 83016 72822 78174 91946 108638 68279 34197
9339 34197 59766 88961 80793 42450 7305 16428 22332 21995 28374 26890 50173 57107 26947
9326 26947 16243 19884 17354 17040 -14528 -46102 -44507 -27390 15852 10680 25029 27192 18639
9313 18639 29040 22079 17156 22634 32942 33107 19779 10092 26607 51876 27377 4629 -362
9300 -362 37908 78134 83287 47472 9371 -7987 4858 -11286 -2909 7207 7988 28776 22280
9287 22280 -33002 -27578 12371 1916 -35807 -24693 -24401 -33799 -48304 -39873 -16033 -34428 -35047
9274c5047r893j2447J4330M4145K9665J2502r515j8679j1038K263K716K449K3967
9261C5418K6686M262N080M375k5835m2044j0956j8313p823M7381K2178J4489N927
9248F0825N18p457l0816k5554J9020p076j1132J3567p449j1326L0019j6290o99
9235F150N142M236K696K0495q864j3940j9618j3352K34L9500K0128N980j2926
9222C5861K8378k3179j9983J352J206L206n463q20L266j856M702j3949k1876j6271
9208b5426J7882K8951j1305j0492M330O139J9467K0419r752M31p273k3280q028
9195B063r1L907J4049R993j5116l5163M548K479R171j556J5590K2781q430J7351
9181D1576P345j6843l4559j341J9818j824O34m816N542J0235L06l1480o172J1331
$$ plain form
9274 -35047 -44940 -57387 -43057 1088 30753 43255 33740 15061 4023 6286 9002 11451 35418
9261 35418 62104 66366 71446 75821 49986 7942 -3014 -21327 -29150 18231 40409 54898 60825
9248 60825 61343 53886 23070 -2484 16536 9460 -1672 11895 4446 -6880 23139 6849 6150
9235 6150 11292 15528 18224 38719 29855 15915 -3703 -17055 -16821 22679 42807 48787 35861
9222 35861 64239 41060 21077 22429 23635 26841 21378 20558 23824 21968 26670 12721 -9155 -25426
9208 -25426 -7544 21407 10102 -390 3940 10079 29546 49965 40213 40644 33371 10091 2063
9195 2063 1972 5879 19928 29921 14805 -20358 -15810 -13331 -4160 -5716 9874 32655 24225 41576
9181 41576 48921 32078 -2481 -3822 15996 14172 14806 9990 15532 25767 26073 -5407 -11579 -248
9167b48j4288J1106J6928N153j7816k2530j1838J31O531J4712R565j5765L121
9154a5238N714N124p344J931K4944J614j5132J3885L367j4188j2123M57j1665
9141a8654J8060L285J4399K5771j4019k8913j1583j0213j7160J8898K2873o690
9129c946j8776j2206J3286J3204k4171k4307J2293K8639J3862j1741l0733L8638
9117e958K9094r402L3719O530j7846p366j0112p003o090K293K1508J5560K1880
9104F6807R359j2386k4718m3667P700K2105K4965j6397j6118j2928K667R587J4180
9091C1156k896K0953q708k8926r945L4373j809k4607l0168K0265K6460J7982k4034
9078B0096l649K403J9027m361J0184j486j0293k4752m942j848m348J9633J2783
$$ plain form
9167 -248 -14536 -3430 13498 18651 835 -21695 -33533 -33402 -26871 -12159 -2594 -18359 -15238
9154 -15238 -9524 -4400 -11744 -9813 15131 16745 1613 15498 18865 4677 -7446 -6989 -18654
9141 -18654 -594 2691 17090 42861 28842 -71 -11654 -21867 -39027 -20129 2744 -3946
9129 -3946 -22722 -34928 -21642 -8438 -32609 -56916 -44623 -15984 -2122 -13863 -44596 -5958
9117 -5958 23136 13734 47453 53983 36137 28771 18659 11656 5566 7859 29367 44927 66807
9104 66807 76166 63780 39062 -4605 3095 25200 50165 33768 17650 4722 7389 16976 31156
9091 31156 28260 49213 40505 11579 1634 36007 34198 9591 -20577 -312 26148 44130 20096
9078 20096 16447 18850 37877 33516 43700 42214 31921 7169 2227 379 -3969 15664 28447
9065B8447O978k6258m252L0542O823l5869m39Q001q655k034L655J2199R885k3295
9051E728j9550P617n81j8345j0286K615K4289k0546m8580J1416O9095R594j4004
9038a538l799R160K7967k6019j7976l6275k749o275K1501J5708J9474K5128k9779
9025e472k7800m1483J4964K8341K3899j8008J3466J025j9618l079J4679j2365
9013c1451L888J7364k149J3677k912J4155j6628j2821J8757l534j7211q466k497
9000b9828k344K0660J5053J2404J8308k0346J5469j0838j5615J1640k2303r531
8988a7271j718K5401J8114Q825j7898K0192j3515r561o639l6333r720n578N023
8975d0678L7684K1119m197j7855n332J13J1021J3420l526j2055k4734O877O525
$$ plain form
9065 28447 35425 9167 4915 35457 42280 6411 5972 13973 5318 3284 6939 19138 29023 5728
9051 5728 -13822 -6205 -6786 -25131 -35417 -32802 -8513 -29059 -77639 -66223 2872 12466 -1538
9038 -1538 -5337 3823 31790 5771 -12205 -48480 -51229 -57504 -36003 -20295 -821 24307 -5472
9025 -5472 -33272 -74755 -59791 -31450 -7551 -25559 -12093 -11068 -30686 -33765 -19086 -31451
9013 -31451 -27563 -10199 -12348 1329 -1583 12572 -4056 -16877 1880 -1654 -18865 -27331 -29828
9000 -29828 -32172 -11512 3541 15945 34253 13907 29376 18538 2923 14563 -7740 -17271
8988 -17271 -18989 6412 24526 33351 15453 35645 22130 12569 5930 -30403 -40123 -45701 -40678
8975 -40678 -2994 18125 13928 -3927 -9259 -9146 1875 15295 11769 -286 -25020 -18143 -11618
8962a1618J1699m280j9524J392J3967j8946R64P271J8446K2266K8960k742k0365
8949B7490r401J0687o243k5902j3785L6982J3436k6160l1578K665K0394o20m808
8936f843l6753M56J7126K5854n830k988K3268J1237O998r473J0895N118n704J399
8922C4760k2595k2366j4850O085O041J424J8821k0630j7092L697r616n122L1332
8909a0111J3459L8748J761j0885l5186J7834k0871j9644l464L4069L0221J9078
8897E5009m393j4530k3081k0332m243J5628j9595l8130j4688l624J6589L8027
8885a7363Q736j2848q76l7993J7090M3281j145l5074k327L5329K4169m075J02
8872A7006p786r823j1884M1306L5272Q400k3387l1866J5243p394j7142p675K123
$$ plain form
8962 -11618 81 -4199 -23723 -22331 -8364 -27310 -26346 -19075 -629 21637 50597 47855 27490
8949 27490 18089 28776 22533 -3369 -17154 19828 33264 7104 -24474 -21809 -1415 -2035 -6843
8936 -6843 -43596 -43140 -26014 -160 -5990 -8978 14290 25527 32525 23052 33947 39065 33361 34760
8922 34760 12165 -10201 -25051 -18966 -12925 -11501 7320 -13310 -30402 -26705 -36321 -41443 -10111
8909 -10111 3348 42096 43857 32972 -2214 15620 -5251 -24895 -28359 5710 35931 55009
8897 55009 50616 36086 13005 -7327 -11570 4058 -15537 -53667 -68355 -71979 -55390 -17363
8885 -17363 -8627 -21475 -22351 -60344 -43254 27 -1118 -36192 -38519 -3190 20979 16904 17006
8872 17006 9220 -603 -12487 28819 64091 72491 49104 17238 32481 25087 7945 270 2393
8859B393n332n553l342j2642K7861K2944N74j3272k4107k0808j783J756L0696
8846f15L4415J2636Q765l2120l3012R391P57j7065r79L2192J0469k7532j8699
8833b1397l1927R063M5834Q446l2393J9974J6338j0424o390K8857M949j9504j1957
8820e31p170J2913p864M552p434L229K5775Q81j3236k0148J933j4061k7277J1650
8806c6788J0571J8770Q900K601J1591j4968j491K5547J295l6638K5921J6678j7612
8793A4377j3636J6474L317K171j8087j0025J0297m494L827R223r307J4758P858
8780B6753j1691m3646k0504J1803K924K0666K1998M2971J2094l5653m0229k3935
8768c6449J504J7946q157K0764L151o328k5518l6334k6688J7882R821K1070J2194
$$ plain form
8859 2393 -2939 -8492 -11834 -24476 3385 26329 26903 13631 -10476 -31284 -33067 -31311 -615
8846 -615 33800 46436 55201 23081 -9931 -540 217 -16848 -17827 14365 24834 -2698 -21397
8833 -21397 -53324 -44261 1573 10019 -22374 -2400 13938 3514 -2876 25981 30930 11426 -531
8820 -531 -7701 5212 -2652 1900 -5534 -2305 23470 24351 11115 -9033 -7100 -21161 -48438 -36788
8806 -36788 -26217 -7447 1453 4054 15645 677 -814 24733 26028 -10610 15311 31989 14377
8793 14377 741 17215 20532 22703 4616 -5409 4888 394 4221 13444 4137 18895 26753
8780 26753 15062 -28584 -49088 -37285 -34361 -13695 8303 51274 63368 27715 -12514 -36449
8768 -36449 -34945 -16999 -25156 -4392 -1241 -7569 -33087 -69421 -96109 -78227 -68406 -47336 -35142
8755c5142K3140j3800q2n114K961K827j5432L7356p011J319R640j728j8829q320
8741b8215K5114R273l167j6479l4816O383L1329J9813m367J9800Q562k6934o64
8728E632J477N067k1453k5668J2532O831Q935N881K5617R439R275L717k8309Q046
8714B7019J5555K4145q472p005j7947j5205j279K0660J8027l7159k3882L204L923
8701A584O12j025p86p862R341P463j1910J6465j606k4311l2286L16M3746J3986
8687A3727q482j6795J2726M1696l035k0717n275j0326r125r443j3592j0034P863
8674c0812M658J1324k009J7450L2961K4064j7804m5133Q552N5J1154J0095k0907
8661C648k1525O350o568n502J6183j79m4131J235K5500K6239L189k9472J5693
$$ plain form
8755 -35142 -12002 -25802 -25884 -30998 -28037 -25210 -40642 -3286 -10297 -8978 662 -1066 -19895 -28215
8741 -28215 -3101 6172 3005 -13474 -48290 -41907 -10578 9235 4868 24668 33230 6296 5632
8728 5632 7109 12176 -9277 -34945 -22413 -15582 -6647 -766 24851 34290 43565 47282 18973 27019
8714 27019 42574 66719 58247 51242 33295 18090 16811 37471 55498 18339 -5543 -2339 1584
8701 1584 2196 1171 385 -7477 1864 9327 -2583 13882 12276 -12035 -44321 -44005 -259 13727
8687 13727 5245 -11550 1176 42872 39837 19120 13845 3519 -5606 -15049 -28641 -38675 -30812
8674 -30812 -26154 -14830 -16839 611 33572 57636 39832 -5301 3251 3306 14460 24555 3648
8661 3648 -17877 -11527 -18095 -23597 -7414 -7593 -51724 -50489 -24989 1250 4439 -25033 -9340
8648i340J5632L397M168m543L789Q620j7305j8193L5235L78N414j9536j7932L3882
8634B3666N237n7645k3910J4945K2864K0838o65j2490j3448o608K5377J1672n315
8621D518r465P444j1457l5246l845J227j6376M50L4005K4070j8626m03M531N847
8607a3326n9j2284j7456j484M7097k4514K683K1185j6478R229J1768n574j9631
8594a8844o387l477L7830J6783M042J433R382j7402J3126J4826l18m8469j5148
8581a2623L3295P434o038N753j3043j6342J338K7854Q792l1312m19Q287k7091
8568a4115l461N960R172n813m545K8810n282k2151P512p0j6385O622P311k509
8554h944j7492q4R56M894L1768J5591j1012j8854n683q360M221K0248J8273j7242
$$ plain form
8648 -9340 6292 9689 13857 9314 13103 21723 4418 -13775 21460 21838 27252 7716 -10216 23666
8634 23666 28903 -28742 -52652 -37707 -14843 5995 5330 -7160 -20608 -27216 -1839 9833 4518
8621 4518 -4947 2497 -8960 -44206 -48051 -46824 -63200 -62750 -28745 -4675 -23301 -23704 -19173 -13326
8607 -13326 -13385 -25669 -43125 -44609 2488 -22026 -19343 1842 -14636 -5407 6361 787 -18844
8594 -18844 -25231 -28708 9122 25905 29947 31380 40762 23360 36486 51312 50994 2525 -12623
8581 -12623 20672 28106 22068 27821 14778 -1564 -226 27628 36420 5108 4689 12976 -14115
8568 -14115 -17576 -11616 -2444 -8257 -12802 16008 10726 -11425 -3913 -3983 -20368 -13746 -6435 -8944
8554 -8944 -26436 -26520 -25564 -20670 11098 26689 15677 -3177 -8860 -17220 -12999 7249 25522 8280
8540H280j1177r553j3522J7921n50r03r348l146K4111K8984R669N557j5988J971
8526C2306K453J3159O784k7954k2751J2516L8854J2697k1403k5448j6620J5693
8514B0286l6119N743K9151K1344L96q262j0649m5808J778q181M875q997k929m584
8500d1956K4611L8040N920m1944m2490J0694M843k748m282R572K122L5290N513
8487C185J817K1353j0213j9627J6976L3846Q596k9751j8958J2695j4498n073J8903
8474A9251K1125J8662M881l1436k2883L296J8524q019K645n942j0749j5575n636
8461a1856j0056j6113m55K0802R26l999L132N361J1209l626n165q623l177J5475
8447f165K0177o349j7778r284K1038l9730j2573K7399m47J7246J8851j5511j6049
$$ plain form
8540 8280 -2897 -12450 -25972 -8051 -8601 -9504 -18852 -21998 2113 31097 40766 46323 30335 32306
8526 32306 34759 47918 54702 26748 3997 16513 55367 68064 46661 21213 4593 20286
8514 20286 -15833 -10090 19061 40405 40801 32539 21890 -23918 -22140 -30321 -25446 -34443 -37372 -41956
8500 -41956 -17345 20695 26615 -15329 -57819 -47125 -42282 -45030 -49312 -39740 -37618 -2328 3185
8487 3185 5002 26355 16142 -3485 13491 47337 55933 26182 7224 19919 5421 348 19251
8474 19251 40376 59038 63919 32483 9600 12896 31420 23401 26046 20104 9355 -6220 -11856
8461 -11856 -21912 -38025 -38480 -17678 -16752 -20751 -17619 -12258 -1049 -4675 -9840 -18463 -21640 -6165
8447 -6165 14012 7663 -10115 -19399 1639 -38091 -50664 -23265 -23712 -6466 12385 -3126 -19175
8434a9175l169M452M872LJ7103J85n286k1198p051l791K560J5536K018k764j3400
8419b9105p611J9674r601P080k1258k5572M218J0418K9471K2388K7530k3002j441
8406C189R628q136K0950j7478j4566j7550j7540k294J6772J3648q018K449p205
8393b6151O130J0561J6403J9225j3921k1390j5320J3883J2820n076K5849M332
8381B7345j3043j608l6583K150j5820l634K3153j744L540N810J3867Q582K4747
8368C6762j3050k0507l521j031j604M395O470j2131j1608q424j0349k860J0712
8355b6746J0989P527J9013K7555M4624j4095n1768n911M973k1999L184K89l2919
8342c5284k0540J3536J6221K2415K5299L074j9840j3514k120m4161O30L2116M144
$$ plain form
8434 -19175 -22344 -17892 -13020 -13017 4086 4271 -1015 -22213 -29264 -33055 -30495 -14959 -12941 -15705 -29105
8419 -29105 -36716 -17042 -26643 -19563 -40821 -66393 -62175 -51757 -22286 102 27632 4630 3189
8406 3189 12817 4681 25631 8153 -6413 -23963 -41503 -43797 -27025 -13377 -21395 -18946 -26151
8393 -26151 -20021 -9460 6943 26168 12247 -9143 -24463 -10580 2240 -2836 23013 27345
8381 27345 14302 12694 -23889 -21739 -37559 -41193 -18040 -19784 -16244 -10434 3433 12015 36762
8368 36762 23712 3205 -316 -1347 -2951 1444 7914 -4217 -15825 -24249 -34598 -37458 -26746
8355 -26746 -15757 -8230 10783 38338 82962 68867 17099 11188 16161 -5838 -2654 -2365 -35284
8342 -35284 -55824 -42288 -26067 -3652 21647 24721 4881 -8633 -10753 -54914 -54284 -22168 -18024
8329a8024k3753o338P647j3270N417M3494L5466n724j8183J416k111k73N948o992
8315D720m0335o150J3360K0653N974p708k257q275j1123J1255r05q908k1231R610
8301d1320J3694K5222j868j4273n138J205j411k6838r21J4696M327k898K6631
8288h892M208l2292k1852o337O1985L4415j4167O817j931J7038o312k5345o282
8275A053O891j5834M829J4734P567j3978j5617j440J2685j3241J261M984n802
8262a1908o771N198K1409N3226Q597l2023k4396q414o599N0J842l749p769L938
8248g369N471j7343R158q430J7664L061m8827r251J7667M8382R545j8167J458
8235C019k3910o413K448J958J5327P742o305K1169j038l924j5270L1559o922k5368
$$ plain form
8329 -18024 -41777 -48115 -40468 -53738 -48321 -4827 30639 24915 6732 8148 6037 5764 11712 4720
8315 4720 -35615 -41765 -28405 -7752 -1778 -9486 -11743 -20018 -31141 -19886 -20791 -29699 -50930 -41320
8301 -41320 -27626 -2404 -4272 -18545 -23683 -22478 -23889 -50727 -51648 -36952 -32625 -35523 -8892
8288 -8892 -4684 -36976 -58828 -65165 -3180 31235 17068 23885 21954 38992 32680 7335 1053
8275 1053 7944 -7890 -3061 11673 19240 5262 -10355 -11795 890 -12351 -11090 -6106 -11908
8262 -11908 -18679 -13481 7928 61154 69751 37728 13332 4918 -1681 -1631 211 -3538 -11307 -7369
8248 -7369 -1898 -19241 -10083 -18513 -849 2212 -46615 -55866 -38199 10183 19728 1561 3019
8235 3019 -20891 -27304 -24856 -22898 -7571 171 -6134 15035 13997 10073 -5197 26362 19440 -5928
8221e928J2040L84j5223j2858j5741k7250l604L8332J1315q258k6226K2428M2008
8208A1419P27m783m2560N032R559O597K3639J760m720K917r896j8584l0554J299
8194d8148L4371O686K0991L2870j7044M567k62K2653k7230n444k975k2054j7544
8181a8563j5660J51j414J4840J4687l7359J198J8096m803q701l536K0504j971
8168b2531k0986K8973L2112k3412m548K1089K585M412N697k9671k8326l69K0855
8155a4120j6173k8027k00K974M6197L9886j2691l857j7952j4010M604L3147j985
8142A7793m530j1236j5735L3126P330k8799j0726J3022J275J4820K024Q258R062
8129C5684j0134J0970L261l07k9282k1144j1937K150K8914L4972k0544r036P526
$$ plain form
8221 -5928 6112 6496 -8727 -21585 -37326 -64576 -68180 -29848 -18533 -26791 -53017 -30589 11419
8208 11419 12146 7363 -35197 -30165 -20606 -14009 9630 11390 6670 9587 -309 -18893 -49447 -48148
8194 -48148 -13777 -7091 13900 46770 29726 34293 34031 56684 29454 24010 21035 -1019 -18563
8181 -18563 -34223 -34072 -35486 -20646 -5959 -43318 -42120 -24024 -28827 -37528 -41064 -20560 -22531
8168 -22531 -43517 -14544 17568 -5844 -10392 10697 13282 17694 23391 -6280 -34606 -34975 -14120
8155 -14120 -30293 -58320 -58520 -55546 -9349 30537 17846 13989 -3963 -17973 -13369 19778 17793
8142 17793 13263 2027 -13708 19418 26748 -2051 -12777 245 1520 16340 18364 26622 35684
8129 35684 25550 36520 39781 39474 10192 -10952 -22889 -20739 8175 43147 22603 13567 21093
8116B1093K8235p337l0126j1829j8759N068M0194J3357k6314l3804p059j1930
8104c9211R732J0589Q995j4689j4827m864m551Q652L979j5366K4228K2715o080
8091a0698k0761k1639K0426J3408J3098J9690l355j2297j447l747M2909K6016
8079F1603k0013m0694k3184K6053M7621K2872M338n6854o3143L578Q392j0657
8067d0088m652k3212J0908L8000K3202K1599k0422l9026J3704L667P587j262k387
8054a2382J4324J6154J043q323R371j4051k9532l139Q511j9075Q981J9342K2189
8041A3413J7782J9981k2877l3972l8688j418K1734O01Q828O701K9445J1969l5306
8028a807l3342J9735K8093P281j1109J3567J866J9371k0167J5580K2535k3740
$$ plain form
8116 21093 49328 41991 11865 36 -18723 -13655 26539 39896 13582 -20222 -27281 -39211
8104 -39211 -29479 -18890 -9895 -24584 -39411 -44275 -48826 -40174 -36195 -51561 -27333 -4618 -10698
8091 -10698 -31459 -53098 -32672 -19264 -6166 13524 10169 -2128 -3575 -7322 35587 61603
8079 61603 41590 896 -22288 3765 51386 74258 78596 21742 -41401 -37823 -29431 -40088
8067 -40088 -44740 -67952 -57044 -19044 4158 25757 5335 -33691 -19987 -16320 -8733 -9995 -12382
8054 -12382 1942 18096 19139 10816 20187 6136 -23396 -26535 -18024 -37099 -28118 -8776 13413
8041 13413 31195 51176 28299 -5673 -44361 -45779 -24045 -23444 -14616 -7915 21530 33499 -1807
8028 -1807 -35149 -15414 12679 19960 8851 22418 24284 43655 23488 39068 61603 37863
8016C7863J4347J418j9082j8625j3084J96L353L552o750M86Q027r133l431Q006
8002G143j3684j0340N99J012k4111k6293N792j1425N24J3827K2843J6986J0250
7989f877J732Q03M218J4585N106j6868J441K6029J0566p09M736k3155k6512J6409
7975A1504K983k8962K1600M2850j3973p831k2547l1291l372L4247n766k465M484
7962A461o008Q585J1350K2709r089m0673k2884J7644K4623R270P782r670q745
7949F355J7198M4386j8979j4426k335N43j4308q526M236k393K4409J279k7779
7936I660k9021K0828K0289j7353l8233J6870r231j632L956L493Q457K4370K5167
7923C7620K1359j1693j9562l4914m8198J255J4698N972k326L3888m492r389J9349
$$ plain form
8016 37863 52210 53628 34546 15921 2837 3033 6386 9938 3188 3674 11701 2568 -863 7143
8002 7143 -6541 -16881 -16282 -15270 -39381 -65674 -59882 -71307 -70783 -56956 -34113 -17127 -6877
7989 -6877 -5145 -4342 -124 14461 19567 2699 4140 30169 40735 40026 44762 21607 -4905 11504
7975 11504 14487 -14475 7125 49975 36002 28171 5624 -25667 -29039 5208 -558 -3023 1461
7962 1461 -4547 4038 15388 38097 29008 -11665 -34549 -16905 7718 16988 24770 15100 6355
7949 6355 23553 67939 48960 34534 32199 32742 18434 9908 14144 11751 36160 37439 9660
7936 9660 -19361 1467 21756 4403 -33830 -16960 -26191 -27823 -23867 -20374 -11917 12453 37620
7923 37620 58979 47286 27724 -7190 -55388 -54133 -39435 -33463 -35789 -1901 -6393 -15782 3567
7910C567J9112K4073J4191K569j0956j9069k4958j4445K8613K3266j0350o225
7898B9388J3470J3843K332J458k020k864J7435o030k3536k1753j6065j3202n225
7885a2769J2102j2565J2656N930q827J3282o942j0324J0098J1595J4711j3939
7873A5008N678Q739J4838j5065l9436j5246j4189K31J0767J3157K0313j529J7187
7860B0453J6306j7852o696j0382j4990j5742K58L3190M2087K4455k3728j5855
7848C1504k1965l2745M651K4911J5801l1567k4467j5669J3351J4236j984J5040
7836h903J0203l498p043k2863J3764Q603N651k0067o464J3966k067n704M4245
7823A9823K653k1722M775J1069j1875k0677J7440J6838j7369k2048J0187K158
$$ plain form
7910 3567 22679 46752 60943 63512 52556 33487 8529 -5916 22697 45963 35613 29388
7898 29388 42858 56701 59033 60491 58471 55607 73042 67012 43476 21723 5658 -7544 -12769
7885 -12769 -667 -13232 -576 5354 -3473 9809 2867 -7457 2641 14236 28947 15008
7873 15008 20686 29425 44263 29198 -10238 -25484 -39673 -39442 -28675 -15518 4795 3266 20453
7860 20453 36759 18907 12211 1829 -13161 -28903 -28645 4545 46632 71087 47359 31504
7848 31504 9539 -23206 -18555 6356 22157 -9410 -33877 -49546 -36195 -21959 -23943 -8903
7836 -8903 1300 -2198 -9241 -32104 -18340 -9737 -4086 -24153 -30617 -16651 -18718 -24422 19823
7823 19823 22476 754 5529 16598 4723 -15954 1486 18324 955 -21093 -10906 -8748
7811h748l6867k5129J0720J9453k426O271K3962O150o88r671q572J3630L8025
7798B6110L2426k5509k5035j4671k4029J3656J8649m213K0949L886j3283l5964
7786b7028j8127J0101Q531Q922P13J0677m284j2041j3383K3331J5326j5127J111
7773a1278M0595K1997k0933j1481l8490j3847N558J2052J1509k567M468k1818
7761b4235K633K0852j1491k0904n554M1697J2142N32n829N942J837k3167J2485
7748F940J033j1522j4878l703K9434L337j1291k6819r487j6387J2083L7081P457
7735C278P195J0352j4229o717J6364k6992p10L832L786m087k2196l598R602J7900
7721f220K3564o427M705j4142p065M877L667m015l9431O727L4080L0325k700l7993
$$ plain form
7811 -8748 -45615 -70744 -60024 -40571 -42997 -36726 -12764 -6614 -7302 -16973 -25545 -11915 26110
7798 26110 58536 33027 7992 -6679 -30708 -17052 1597 -2616 18333 22219 8936 -27028
7786 -27028 -45155 -35054 -26523 -17601 -16888 -6211 -10495 -22536 -35919 -12588 2738 -12389 -11278
7773 -11278 29317 51314 30381 18900 -19590 -33437 -27879 -15827 -4318 -6885 -2417 -24235
7761 -24235 -21602 -750 -12241 -33145 -38699 2998 15140 15672 9843 15785 17622 -5545 6940
7748 6940 7973 -3549 -18427 -22130 7304 10641 -650 -27469 -36956 -53343 -41260 -4179 3278
7735 3278 10473 20825 6596 -121 16243 -10749 -11459 -7627 -3841 -7928 -30124 -33722 -24120 -6220
7721 -6220 17344 10917 15622 1480 -5585 -708 2959 -1056 -40487 -33760 320 30645 27945 -10048
7707a0048l1842m307K4508j4594J0880K0855p478Q732M870L803J6290L053r106
7694A5616m0769l6564p29L8575K0331k4412J6116J031J2994k1420J1443k2119
7682b9907j0486Q753K0162j0151N040K5533M29l512J0860j6497k0101M901J7024
7669B048J1792K241l1678l332M156J9535k6200l2479J157L217K3419J8358J2679
7656D913L967K7083J2493j7875O61j0017k7106K373l131j9439j912J3386J334
7643a3270k1594l5892J8193M807Q096K2816K2422k594K782N708K4116k9172O952
7630A3370N626j9565J2136o334J0001M6400P150m4434k4237q083k5212l7720j3372
7617h4274J7555J5924k258j7315K1947J149J1995K9132j2211p908j7795L603K5292
$$ plain form
7707 -10048 -41890 -46197 -21689 -36283 -25403 -4548 -12026 -3294 1576 5379 21669 24722 15616
7694 15616 -25153 -61717 -62446 -23871 -3540 -27952 -11836 -10805 2189 -19231 -7788 -29907
7682 -29907 -40393 -31640 -11478 -21629 -16589 8944 9373 5861 16721 224 -19877 -14976 2048
7669 2048 13840 16081 -15597 -18929 -14773 4762 -21438 -53917 -52760 -49543 -26124 -7766 4913
7656 4913 8880 35963 48456 30581 31242 21225 -5881 -3508 -6639 -26078 -27990 -14604 -13270
7643 -13270 -34864 -70756 -52563 -47756 -39660 -16844 5578 2984 5766 11474 35590 6418 13370
7630 13370 18996 -569 11567 5233 15234 61634 68784 24350 113 -7970 -33182 -70902 -84274
7617 -84274 -66719 -50795 -53053 -70368 -48421 -47272 -35277 -6145 -18356 -26264 -44059 -40456 -15164
7604a5164J0158m576l173j5616k003K0586J6712J138n377L131o390M76l8328K4178
7590a4248J0163J1287q198O335l245m7069J2172K846J7992K7839n880l729j5873
7577i608k7931L1940J7524k790Q168j1727j5102j596J8317O506o728R118j9481
7564c390k6961p451J0065K6360K038j8088o930J8794J6108J3885j4483l4161N71
7551b3643p480K4209K2997K0600l166K410o251J1267k4623k6666j1456k2091L125
7538d0768L666j6229q590L475K1965K516L8369K4384p113l0875q396K1068N180
7525H652m861k0587q025j5136j2065M9838M0964J3574k5061l6103p679j1690N587
7512b2592K7929O198k1785l367k555J3879L4899J2907n732m7146m0326J0187M2806
$$ plain form
7604 -15164 -5006 -9582 -12755 -28371 -30374 -9788 6924 8062 2685 5816 -574 -98 -38426 -14248
7590 -14248 -4085 7202 -996 5339 2094 -44975 -32803 -29957 -11965 15874 9994 6265 -9608
7577 -9608 -37539 -5599 11925 9135 17303 5576 -9526 -11122 7195 13701 6973 16091 -3390
7564 -3390 -30351 -37802 -27737 -1377 661 -17427 -24357 -5563 10545 24430 9947 -24214 -23643
7551 -23643 -31123 -6914 16083 36683 33517 35927 29676 40943 16320 -10346 -21802 -43893 -40768
7538 -40768 -37102 -53331 -61921 -58446 -36481 -33965 4404 28788 21675 -9200 -17596 3472 8652
7525 8652 3791 -16796 -24821 -39957 -52022 -2184 38780 52354 27293 -8810 -16489 -28179 -22592
7512 -22592 5337 11535 -10250 -13617 -16172 -2293 32606 45513 39781 -7365 -47691 -37504 5302
7499E302K8180k1659k2035p313J479K8248L525n27p160j6973K5423J4672n281
7486B5881m702j4189k7150r893O647k1457J0190q128k5282J8109R782O019J8559
7473a5614n373j3174j976m408J6595M1095O875K4883r636j2064o357j3470J8569
7460B5945K787o998J1399k0296l4989j9822J5830K9405K1965J1326P230K8464
7448G2246l5406m4703n481q52j5331j7813J3999j5631j375K8162k1826J10K8638
7435a5263L363j0325K536l877R268J8237O212J6030r886k0722l3307M592J7272
7422a5870J0035L635k3678j2593P152R471N315K2309K7594j5177l3142J2288J6115
7409A3454l2282k9205J2321K3106K6352j2941j1761K8986J1061j3447m4168l2968
$$ plain form
7499 5302 33482 11823 -10212 -17525 -16046 12202 15727 15200 8040 -8933 16490 31162 25881
7486 25881 21179 6990 -20160 -30053 -23406 -44863 -34673 -42801 -68083 -49974 -40192 -34173 -15614
7473 -15614 -20987 -34161 -36137 -40545 -23950 17145 24020 48903 39267 27203 20846 7376 25945
7460 25945 28732 21734 33133 12837 -22152 -41974 -26144 3261 25226 36552 43782 72246
7448 72246 36840 -7863 -13344 -14196 -29527 -47340 -33341 -48972 -50347 -22185 -44011 -43901 -15263
7435 -15263 -11900 -22225 -19689 -23566 -14298 3939 10151 26181 16295 -4427 -37734 -33142 -15870
7422 -15870 -5835 -2200 -25878 -38471 -31319 -21848 -16533 5776 33370 18193 -14949 -2661 13454
7409 13454 -18828 -48033 -35712 -12606 13746 805 -10956 18030 29091 15644 -28524 -61492
7397f1492k2797L049K0337K7234J6024k2598j078O276K0238K4251k550j2430M276
7384a260R108K03P187j3088j6712j0295J0066J1102j394p760L254q997o681m584
7370b9851j7560K0873L5854j3433j8982j3748k1916R232J2386J9194K1141j7715
7358a4525J3524r19K0200k669k0004j5674q204j2124J1605K8092J2259N368j6127
7345H02J9520N357P08j7738j2926p263L3169k2446k1301m2628J770n278J3827
7332e4427P105n55m889J3824O108J3754K9796J1919K714j0584j4418O164J91M077
7318A0779J925m0600p604J0724K1186q275j4378k0704L261P087p15J0054o595
7305c3855K3519J0976k885K5987L298m5320q988K765O455J2047N177J1991m8344
$$ plain form
7397 -61492 -84289 -81240 -60903 -33669 -17645 -40243 -41321 -35045 -14807 9444 6894 -5536 -1260
7384 -1260 7848 8051 15238 2150 -14562 -24857 -14791 -3689 -5083 -12843 -9589 -18586 -25267 -29851
7370 -29851 -47411 -26538 9316 -4117 -23099 -36847 -58763 -49531 -37145 -17951 3190 -14525
7358 -14525 -1001 -1920 18280 15611 -4393 -20067 -28271 -40395 -28790 -698 11561 16929 802
7345 802 20322 25679 26387 8649 -4277 -11540 21629 -817 -22118 -64746 -62976 -68254 -54427
7332 -54427 -47322 -47877 -52766 -38942 -32834 -19080 10716 22635 25349 14765 347 6511 6702 10779
7318 10779 12704 -27896 -35500 -24776 -3590 -11865 -26243 -46947 -43686 -36599 -37314 -27260 -33855
7305 -33855 -10336 640 -2245 23742 27040 -18280 -27268 -24503 -18048 -6001 -824 11167 -37177
7292c7177k396m891J9686K0561J2243J3194o032K9398P67l3788l0476l346j298
7279b3555K2932P444N71J5514L634j9807j5666k1000j3318m34R132M370L0303
7266A20K1725j5605j1455K5640k042k8927K024J4617j4650p53J0929p09j5062
7253a4148n750j0821K6853K5303J2975R342Q478j3083j9653L552m020k2527j9771
7240b3270j3461l1066J3411j089O409K7047n880P533J8954j349r81l081K4067
7227A7244J3113J5490j3737j1195J0945J906k7170l5527J380K8326M044k7090
7215b2271q382n177R985J5397L8341J0552k4937l332m409O382O647j9012O589
7202F373J7756p652j0339j0781k1233J373J3058N825P966J672J7817J9861j5857
$$ plain form
7292 -37177 -39573 -44464 -24778 -4217 8026 21220 15188 44586 45353 11565 -18911 -22257 -23555
7279 -23555 -623 6821 7392 22906 26540 6733 -8933 -29933 -43251 -43685 -34553 -30183 120
7266 120 21845 6240 -5215 20425 18383 -10544 -8520 6097 -8553 -9306 1623 914 -14148
7253 -14148 -19898 -30719 -3866 21437 34412 43754 52232 39149 19496 23048 19028 -3499 -23270
7240 -23270 -36731 -67797 -54386 -55475 -49066 -22019 -27899 -20366 -1412 -2761 -3742 -6823 17244
7227 17244 30357 45847 32110 20915 31860 33766 6596 -28931 -27551 775 4819 -22271
7215 -22271 -30653 -35830 -25845 -10448 27893 38445 13508 10176 5767 12149 18796 -216 6373
7202 6373 24129 16477 6138 -4643 -25876 -24503 -11445 -5620 2346 4018 21835 41696 25839
7189B5839k8017k6259N861K9951j0861O60M3447J7324l761j0408l1680l90R292
7176B0998j626o751j5272n448r580k028J1883Q287l1738l6583M5466L1367k537
7163F438q648m367l525j3637l905K5344J0652p548m1026n921m134J0776N412Q595
7149b5494j2417j8218R442M3181K0006l769j8849O23k5592k950J3957K1313j027
7136B06m910Q761J1842n544O42K6343J1212J176k5416k339R325k067k5544l1079
7122b7392p490Q735R240j3504K189J3885l4266p010o629L2151K0716p155L086
7109a3444P646J9903J5934p929k5164n773j5475j3657O536J4622o85K1896N712
7096A0122j2235p867k3480k34J9016J9804K695j5882q406M236K5597k520J4880
$$ plain form
7189 25839 -2178 -28437 -22576 7375 -3486 -2826 40621 57945 54184 43776 12096 11706 20998
7176 20998 19372 12621 -2651 -8099 -17679 -19707 -7824 463 -31275 -67858 -22392 8975 6438
7163 6438 -2210 -6577 -10102 -23739 -27644 -2300 8352 804 -40222 -46143 -50277 -39501 -34089 -25494
7149 -25494 -37911 -56129 -46687 -3506 16500 12731 -6118 -5495 -31087 -34037 -20080 1233 206
7136 206 -4704 4057 15899 10355 10997 37340 48552 49728 24312 21973 31298 29231 3687 -27392
7122 -27392 -34882 -26147 -16907 -30411 -28222 -14337 -48603 -55613 -62242 -30091 -9375 -16530 -13444
7109 -13444 -5798 14105 30039 22110 -3054 -8827 -24302 -37959 -31423 -16801 -17486 4410 10122
7096 10122 -2113 -9980 -33460 -33694 -14678 5126 7821 -8061 -16467 -12231 13366 10846 25726
7083B5726o679j2762k179j0280P578j1854j0628j2234R369K5862P704m477j0342
7070e196n301k707J064J0575o748o383P76L33R279L0491J843J407P441N908L403
7055D6185o82l4634k1035R663M919Q311L80N193N011l145o86K1931l8603J015
7041C823L270K4000n891m0933k3976P068j6063L1621J9892l586m137n917J6725
7028E896K109q052j2360J523j6206K52J7217k010r440J1346K4947O218J5496k5366
7014A1570j8433L0189K2855L04l4558m9693j0530J328M89J0096M6446K699L418
7001A6180J5138L792N656k54l1085k6849l3464p26P11K8328j2399M892j2843j2920
6987e5843m783J0721J1849J2838J7686o034k7522l349P729j1892j5389P88K7558
$$ plain form
7083 25726 19047 6285 4106 -6174 1404 -10450 -21078 -33312 -23943 1919 9623 5146 -5196
7070 -5196 -10497 -13204 -12140 -1565 -8313 -14696 -13920 -13587 -4308 26183 28026 29433 36874 42782 46185
7055 46185 45503 10869 -10166 -503 4416 12727 13107 18300 23311 20166 19480 41411 2808 3823
7041 3823 7093 31093 25202 -15731 -39707 -32639 -48702 -17081 2811 -775 -4912 -10829 5896
7028 5896 8005 -47 -12407 -10884 -27090 -26838 -9621 -11631 -21071 -9725 15222 21440 36936 11570
7014 11570 -6863 23326 46181 46485 11927 -37766 -48296 -46968 -46479 -36383 10063 12762 16180
7001 16180 31318 35110 40766 40512 9427 -17422 -50886 -51612 -50901 -22573 -34972 -30080 -42923 -55843
6987 -55843 -60626 -49905 -38056 -25218 -7532 -13566 -41088 -44437 -36708 -48600 -63989 -63201 -35643
6974c5643N403k19O259L517l23q691l732J4714K943J4982J4602k0700j8471J602
6960b3757J9094m396l1703J1596J6832L2164q60J5685j7061j6345k895m194J6033
6947A0193k2182O469j468J0437K7317L3093j3865o3989l2920L4615n907k0429
6935c8636j7507R153j0294k4583L038N6414L1343k5437j2979k430J6106L1522
6923A5710J052j9581k726K6874o753j5968j254j6914K798N846K2401J1253j4794
6910G944R404l223k7510j443J0266m468L391R813j2578r240o25L4474J7938j6910
6896A7233P624M248n697p42O181l4016n302j0165j6260L1740M3579J607o244n21
6882C3265K1473k5581j9499K945Q755q859j6427r852L2481J9956k4217l240Q819
$$ plain form
6974 -35643 -30240 -30459 -24200 -20683 -21006 -29697 -33429 -18715 -15772 -790 13812 -6888 -25359 -23757
6960 -23757 -4663 -9059 -40762 -29166 -12334 19830 18970 34655 17594 1249 -1646 -5840 10193
6947 10193 -11989 -5520 -6988 3449 30766 63859 49994 -13995 -46915 -12300 -18207 -38636
6935 -38636 -56143 -46990 -57284 -81867 -78829 -22415 8928 -16509 -29488 -31918 -15812 15710
6923 15710 16762 -2819 -5545 21329 14576 -1392 -2646 -19560 -16762 -10916 11485 22738 7944
6910 7944 17348 14125 -13385 -14828 -4562 -9030 -5639 4174 -8404 -17644 -18269 16205 34143 17233
6896 17233 24857 29105 23408 22666 28847 -5169 -10471 -20636 -36896 -5156 38423 40030 33786 33265
6882 33265 54738 29157 9658 12603 21358 12499 -3928 -13780 18701 38657 14440 11200 20019
6869B0019J1139q094k4564k1622K2233L1636J5683r945j3711k3852J0104J6688
6857B5714J490o477l0206j9356L3581J6142j7959j1658Q292n0328l1856J2161
6845g0460L8201K4489K2012o508k9494Q824N14J3506K3252k5154k5056p820M787
6832b8907k1600J1217K3936J5806J2895j3423Q448j1767k7220n4j3043J5686K3925
6819d101J4558k2371J0555J6438O947j6797k1504J6779M5500J9827l337J09l7812
6806B4791k5826j8504J6729l409k8556K6341J1752l5516j630Q899J1866l7901
6794e0964j4407K4652L7411j0888m782O448M956N159l1691J938M3314M0357M7
6781E1550m4889K204j0627O428K4392K9228k1265k0460o217q924l49p17k17J8798
$$ plain form
6869 20019 31158 23064 -1500 -23122 -889 30747 46430 36485 22774 -1078 9026 25714
6857 25714 27204 20727 -9479 -28835 4746 20888 2929 -8729 -437 -50765 -82621 -70460
6845 -70460 -32259 -7770 14242 7734 -21760 -12936 -12422 1084 24336 -818 -25874 -33694 -28907
6832 -28907 -50507 -39290 -15354 452 13347 -76 8372 -3395 -30615 -30669 -43712 -28026 -4101
6819 -4101 10457 -11914 -1359 15079 22026 5229 -16275 504 46004 65831 62494 62603 24791
6806 24791 -1035 -19539 -2810 -6219 -34775 -8434 3318 -32198 -33828 -24929 -13063 -50964
6794 -50964 -65371 -40719 -3308 -14196 -18978 -12530 -7574 -2415 -34106 -32168 11146 51503 51550
6781 51550 6661 8865 -1762 4666 29058 58286 37021 16561 10344 1420 1071 354 137 18935
6767A8935j5473J2068j0817l4804j817l368k4448k0428J1905N0562k2321q71L3587
6754g290R667j1929K2801k3308k9494J6001J2008j698K0006j2060k320K060J1798
6741F242j5616k4565J6259N722r088k707K5373K5292q434m2739j1526l109j7902
6728e6798J3286K2371J4860J2729m613R675K6691o653m5422k3218j2728K4690
6716b5130J1364R14J3275P543J1441j0420j0382j9431J6218K0197J255j0064l1227
6703b4447j1320J2776n965K8455l035p17l9699R890N177K0853L7324Q140j4872
6690B2560p22k059K2353J18k3312j170O183J281j1065j3661k9871J6359K0978
6677G972J9402j5941K1260r998m3627m6294N425L9611P342J0191j0045N886q968
$$ plain form
6767 18935 3462 15530 4713 -30091 -31908 -35276 -59724 -80152 -68247 -17685 -40006 -40877 -7290
6754 -7290 2377 -9552 13249 -10059 -39553 -23552 -11544 -13242 6764 -5296 -7616 -5556 6242
6741 6242 -9374 -33939 -17680 -11958 -21046 -23753 1620 26912 18478 -24261 -35787 -38896 -56798
6728 -56798 -43512 -21141 -6281 6448 1835 11510 38201 31548 -13874 -37092 -49820 -25130
6716 -25130 -13766 -12852 423 7966 19407 8987 -1395 -20826 -4608 15589 16844 6780 -24447
6703 -24447 -35767 -22991 -28956 -501 -3536 -4253 -43952 -34062 -28885 -8032 29292 37432 22560
6690 22560 21838 19779 42132 42250 18938 17768 23951 25232 14167 506 -29365 -13006 7972
6677 7972 27374 11433 32693 22695 -20932 -67226 -61801 -22190 -14848 -4657 -14702 -8816 -17784
6664a7784k6177j5316M333K3796m300j3847k767j7624q612m23k800J9684K8137
6651c3700M341L159o094p187J608P848K3311J2523J602j9872r299p769O668j8213
6637d1074k450R115j3898l258M48L5598M443K918k3418q286L2190K0770N471J7938
6623C6507q044j7972m909L6733j3303k3022m709q112j2584p796J1773K3875j5760
6610g323k9813j2349K8294K1956J1525q673K5610m770k9899j8625K1465J7533
6598A4931L2264J8043J6177m7650m2520J8588j6263k0192K4947R297k5414K7568
6586I776J1315k452k7950m605j9735J4196L0002M069n993N615L2351K073l5892
6573A2770j8696j1857K5070Q286k8209l165l836k6785j4664J8191K0470P257j2256
$$ plain form
6664 -17784 -43961 -59277 -54944 -31148 -35448 -49295 -52062 -69686 -78298 -78721 -81521 -61837 -33700
6651 -33700 -29359 -26200 -32294 -39481 -37873 -30025 -6714 5809 7411 -12461 -21760 -29529 -22861 -41074
6637 -41074 -43524 -34409 -48307 -51565 -51117 -15519 -11076 -8158 -31576 -39862 -7672 13098 18569 36507
6623 36507 28463 10491 5582 42315 29012 5990 1281 -6831 -19415 -27211 -15438 8437 -7323
6610 -7323 -37136 -49485 -21191 765 12290 3617 29227 24457 -5442 -24067 -2602 14931
6598 14931 47195 65238 81415 33765 -8755 9833 -6430 -26622 -1675 7622 -17792 9776
6586 9776 21091 18639 -9311 -13916 -33651 -19455 10547 14616 8623 14238 46589 48662 12770
6573 12770 -5926 -17783 7287 15573 -12636 -15801 -19637 -46422 -61086 -42895 -22425 -15168 -27424
6560b7424m210r45O201L7189N930l9961m1270J9433K5330n905L972J0646l782
6547a4796j8928j0899K0268j0955j6007L5849J2796J881J3155j0085l3800p240
6535c8761J1697J0747N946j4864k9362n275P99K8856P157K755j8575J7507L6835
6522A5462l6886k7678O3009M6616l6704K768O756J495j7971l3892l7222J1198
6510d3049K7818K2408r249j1010k2782j5279M1698J1423N785J9845m142N767j2566
6497A6667k5823j2811O763N2599k0659j7278q10J4813k3921k7856J5914j1924
6485c4326j912k477j4451L2535p466k4188n204K0796J5525J0860J3658J2142m671
6472A0821j9756k399K0799J1085J3505M662N831l0740m3454R09J8502J6906j6673
$$ plain form
6560 -27424 -31634 -32579 -26378 10811 16741 -23220 -64490 -45057 -19727 -25632 -21660 -11014 -14796
6547 -14796 -33724 -44623 -24355 -35310 -51317 -15468 -2672 -791 12364 2279 -31521 -38761
6535 -38761 -27064 -16317 -10371 -25235 -54597 -59872 -59073 -30217 -23060 -20305 -38880 -21373 15462
6522 15462 -21424 -49102 13907 60523 23819 26587 33343 34838 16867 -17025 -54247 -43049
6510 -43049 -15231 7177 -2072 -13082 -35864 -51143 -9445 1978 7763 27608 23466 29233 16667
6497 16667 -9156 -21967 -15204 37395 16736 -542 -1352 13461 -10460 -38316 -22402 -34326
6485 -34326 -36238 -38715 -53166 -20631 -28097 -52285 -57489 -36693 -21168 -10308 3350 15492 10821
6472 10821 -8935 -11334 9465 20550 34055 38717 44548 13808 -29646 -28737 -10235 6671 -10002
6459a0002k7361j6376K6337M2106J8459l325j8494p722r130p229m428m94q268
$$ plain form
6459 -10002 -37363 -53739 -27402 14704 33163 29838 11344 3622 -5508 -12737 -17165 -17659 -25927
$$ [...]
##END NTUPLES=NMR SPECTRUM
##END=
