##TITLE=Analysis number 320781
Compound Code mo 00610
Project Code adrs
Chemist Name ugmt
##JCAMPDX= 6.0         $$ Bruker NMR JCAMP-DX V2.0
##DATA TYPE= NMR SPECTRUM
##DATA CLASS= NTUPLES
##ORIGIN= Bruker BioSpin GmbH
##OWNER= nmr
$$ XWIN-NMR		Version 3.5
$$ Mon Jul 10 14:42:07 2006 GMT Daylight Time (UT+1h)  MAYBRIDGE\nmr@NMR_250MHZ
##.OBSERVE FREQUENCY= 250.131544655141
##.OBSERVE NUCLEUS= ^1H
##.ACQUISITION MODE= SIMULTANEOUS (DQD)
##.ACQUISITION SCHEME= undefined
##.AVERAGES= 16
##.DIGITISER RES= 18
##SPECTROMETER/DATA SYSTEM= dpx250
##.PULSE SEQUENCE= zg30
##.SOLVENT NAME= CDCl3
##.SHIFT REFERENCE= (INTERNAL, CDCl3, 0, 16.522)
##AUDIT TRAIL= $$ (NUMBER, WHEN, WHO, WHERE, WHAT)
$$ ##TITLE= Audit trail, XWIN-NMR		Version 3.5
$$ ##JCAMPDX= 5.01
$$ ##ORIGIN= Bruker BioSpin GmbH
$$ ##OWNER= nmr
$$ C:\u/data/dgb/nmr/ADRS/2560/pdata/1/auditp.txt
$$ ##AUDIT TRAIL=  $$ (NUMBER, WHEN, WHO, WHERE, WHAT)
(   1,<2006-07-10 14:41:34.75 +100>,<MAYBRIDGE\nmr>,<NMR_250MHZ>,
      <created by zg, POWCHK disabled, PULCHK disabled
       configuration hash MD5:
       E2 DF 36 D8 04 B2 41 60 5A D7 A3 38 5A 4B D0 FE
       data hash MD5: 64K
       A0 15 C9 9C E5 1A 23 EB 89 1E 51 22 0B AA 36 42>)
(   2,<2006-07-10 14:41:51.48 +100>,<MAYBRIDGE\nmr>,<NMR_250MHZ>,
      <Start of raw data processing
       ef LB = 0.3 FT_mod = 6 PKNL = 1 SI = 32K 
       data hash MD5: 32K
       BA EB D1 1B 94 21 48 F2 5E 43 8A 43 37 FA 8E 34>)
(   3,<2006-07-10 14:41:54.75 +100>,<MAYBRIDGE\nmr>,<NMR_250MHZ>,
      <apk 
       data hash MD5: 32K
       E4 7D 4D 2B DD C0 5B 06 9B 3F B1 3C 1E 2B BC 49>)
(   4,<2006-07-10 14:41:56.00 +100>,<MAYBRIDGE\nmr>,<NMR_250MHZ>,
      <abs ABSG = 5 
       data hash MD5: 32K
       4A BB 98 3B 5F 87 F9 55 40 A6 DF 2A 07 9E DD 93>)
$$ ##END=
$$ 
$$ hash MD5
$$ CA 87 94 8C 66 15 40 D7 DE CF BF EC 67 9F 52 E4
##$RELAX= 
##$RELAX= 
##$RELAX= 
##$RELAX= 
##$RELAX= 
##$RELAX= 
##$RELAX= 
$$ Bruker specific parameters
$$ --------------------------
##$DU= <C:\u>
##$EXPNO= 2560
##$NAME= <ADRS>
##$PROCNO= 1
##$TYPE= <nmr>
##$USER= <dgb>
##$AMP= (0..31)
100 100 100 100 100 100 100 100 100 100 100 100 100 100 100 100 100 100 
100 100 100 100 100 100 100 100 100 100 100 100 100 100 
##$AQSEQ= 0
##$AQ_mod= 3
##$AUNM= <au_zg>
##$AUTOPOS= <29 >
##$BF1= 250.13
##$BF2= 250.13
##$BF3= 250.13
##$BF4= 250.13
##$BF5= 500.13
##$BF6= 500.13
##$BF7= 500.13
##$BF8= 500.13
##$BYTORDA= 1
##$CFDGTYP= 0
##$CFRGTYP= 5
##$CHEMSTR= <none>
##$CNST= (0..31)
1 1 145 1 1 1 1 1 1 1 1 1 1 1 1 1 1 1 1 1 1 1 1 1 1 1 1 1 1 1 1 1 
##$CPDPRG= <>
##$CPDPRG1= <>
##$CPDPRG2= <>
##$CPDPRG3= <>
##$CPDPRG4= <mlev>
##$CPDPRG5= <mlev>
##$CPDPRG6= <mlev>
##$CPDPRG7= <mlev>
##$CPDPRG8= <mlev>
##$CPDPRGB= <>
##$CPDPRGT= <>
##$D= (0..31)
0 1 0 0 0 0 0 0 0 0.06 0 0 0 0 0 0 0.0002 0 0 0 0 0 0 0 0 0 0 0 0 0 0 
0 
##$DATE= 1152538893
##$DBL= (0..7)
120 120 120 120 120 120 120 120 
##$DBP= (0..7)
150 150 150 150 150 150 150 150 
##$DBP07= 0
##$DBPNAM0= <>
##$DBPNAM1= <>
##$DBPNAM2= <>
##$DBPNAM3= <>
$$ [...]
##$SUBNAM7= <"">
##$SUBNAM8= <"">
##$SUBNAM9= <"">
##$SW= 20.6930455092707
##$SWIBOX= (0..15)
0 0 3 0 0 0 0 0 0 0 0 0 0 0 0 0 
##$SW_h= 5175.983436853
##$TD= 65536
##$TD0= 1
##$TE= 296.16
##$TE2= 300
##$TE3= 300
##$TEG= 300
##$TL= (0..7)
0 120 120 120 120 120 120 120 
##$TP= (0..7)
150 150 150 150 150 150 150 150 
##$TP07= 0
##$TPNAME0= <>
##$TPNAME1= <>
##$TPNAME2= <>
##$TPNAME3= <>
##$TPNAME4= <>
##$TPNAME5= <>
##$TPNAME6= <>
##$TPNAME7= <>
##$TPOAL= (0..7)
0.5 0.5 0.5 0.5 0.5 0.5 0.5 0.5 
##$TPOFFS= (0..7)
0 0 0 0 0 0 0 0 
##$TUNHIN= 0
##$TUNHOUT= 0
##$TUNXOUT= 0
##$USERA1= <user>
##$USERA2= <user>
##$USERA3= <user>
##$USERA4= <user>
##$USERA5= <user>
##$V9= 5
##$VALIST= <valist>
##$VCLIST= <CCCCCCCCCCCCCCC>
##$VD= 0
##$VDLIST= <DDDDDDDDDDDDDDD>
##$VPLIST= <PPPPPPPPPPPPPPP>
##$VTLIST= <TTTTTTTTTTTTTTT>
##$WBST= 1024
##$WBSW= 4
##$XGAIN= (0..3)
0 0 0 0 
##$XL= 0
##$YL= 0
##$YMAX_a= 285066
##$YMIN_a= -440840
##$ZGOPTNS= <>
##$ZL1= 120
##$ZL2= 120
##$ZL3= 120
##$ZL4= 120
##$ABSF1= 16.522
##$ABSF2= -4.171173
##$ABSG= 5
##$ABSL= 3
##$ALPHA= 0
##$AQORDER= 0
##$ASSFAC= 0
##$ASSFACI= 0
##$ASSFACX= 0
##$ASSWID= 0
##$AUNMP= <proc_1d>
##$AZFE= 0.1
##$AZFW= 0.1
##$BCFW= 0
##$BC_mod= 0
##$BYTORDP= 0
##$COROFFS= 0
##$CY= 12.5
##$DATMOD= 1
##$DC= 0
##$DFILT= <>
##$DTYPP= 0
##$F1P= 14.0000005364418
##$F2P= -0.99999901652339
##$FCOR= 0.5
##$FTSIZE= 32768
##$FT_mod= 6
##$GAMMA= 0
##$GB= 0
##$INTBC= 1
##$INTSCL= 1
##$ISEN= 128
##$LB= 0.3
##$LEV0= 0
##$LPBIN= 0
##$MAXI= 10000
##$MC2= 0
##$MEAN= 0
##$ME_mod= 0
##$MI= 0
##$NCOEF= 0
##$NC_proc= -5
##$NLEV= 6
##$NOISF1= 0
##$NOISF2= 0
##$NSP= 0
##$NTH_PI= 0
##$NZP= 0
##$OFFSET= 16.522
##$PC= 1
##$PHC0= 168.0549
##$PHC1= 5.933792
##$PH_mod= 1
##$PKNL= yes
##$PPARMOD= 0
##$PSCAL= 4
##$PSIGN= 0
##$REVERSE= no
##$SF= 250.13
##$SI= 32768
##$SIGF1= 0
##$SIGF2= 0
##$SINO= 400
##$SIOLD= 32768
##$SREGLST= <1H.CDCl3>
##$SSB= 0
##$STSI= 32768
##$STSR= 0
##$SW_p= 5175.98343685301
##$SYMM= 0
##$S_DEV= 0
##$TDeff= 65536
##$TDoff= 0
##$TI= <Analysis number 999999
Compound Code 99
Book Reference 9
Project Code 9>
##$TILT= no
##$TM1= 0
##$TM2= 0
##$TOPLEV= 0
##$USERP1= <user>
##$USERP2= <user>
##$USERP3= <user>
##$USERP4= <user>
##$USERP5= <user>
##$WDW= 1
##$XDIM= 32768
##$YMAX_p= 359318993
##$YMIN_p= -999614
$$ End of Bruker specific parameters
$$ ---------------------------------
##NTUPLES= NMR SPECTRUM
##VAR_NAME=  FREQUENCY,     SPECTRUM/REAL,   SPECTRUM/IMAG
##SYMBOL=    X,             R,               I
##VAR_TYPE=  INDEPENDENT,   DEPENDENT,       DEPENDENT
##VAR_FORM=  AFFN,          ASDF,            ASDF
##VAR_DIM=   32768,         32768,           32768
##UNITS=     HZ,            ARBITRARY UNITS, ARBITRARY UNITS
##FACTOR=    0.157963299565203, 1,           1
##FIRST=     4132.6476996994, 0,             0
##LAST=      -1043.33573715361, 0,           0
##MIN=       -1043.33573715361, -999614,     0
##MAX=       4132.6476996994, 359318993,     0
$$ Real data points
##PAGE= N=1
##DATA TABLE= (X++(R..R)), XYDATA
$$ [...]
15201g8663r7813L20694J835k07965l1125j69771P3167N6652R5174j05788j72569
$$ -78663 -176476 144218 146053 -61912 -93037 -262808 -189641 -132989 -37815 -143603 -316172
15190c16172J72718Q9141p4425J44038J47586l42380j67178J98441N7818P633
$$ -316172 -143454 -54313 -128738 15300 162886 -179494 -346672 -148231 -90413 -82780
15180h2780Q4536k49408l38257n9816K18224R3064K05236M5510O677r0039j08681
$$ -82780 1756 -247652 -585909 -645725 -427501 -334437 -129201 -83691 -77014 -167053 -275734
15169b75734J17222R6887k254J41259j75705n8603N0078j8060m5573q5344J58337
$$ -275734 -158512 -61625 -63879 77380 -98325 -156928 -106850 -124910 -170483 -255827 -97490
15158i7490j28606k66794K66932K25087J69421k12225j41616j762J10715j2492
$$ -97490 -226096 -492890 -225958 -871 168550 -43675 -185291 -187053 -76338 -88830
15148h8830j21204L45405R5898J0948n3567l65456k01925k4492o8068Q3096K57319
$$ -88830 -210034 135371 231269 242217 188650 -176806 -378731 -403223 -471291 -388195 -130876
15137a30876J36108j12892O461K04295J35994o1172k03390R4093K30175L2945
$$ -130876 5232 -107660 -101199 103096 239090 177918 -25472 68621 298796 331741
15127C31741j67332j64567P7964K1758k73016n7713j33509J3396J03629j86955
$$ 331741 164409 -158 77806 99564 -173452 -231165 -364674 -351278 -247649 -434604
15117d34604O7796K9620M1408K20540K97102R5795j44330L4162j94269k43736
$$ -434604 -366808 -337188 -295780 -75240 221862 317657 173327 207489 13220 -230516
15107b30516M205L32221O4348J6868p2941R4483r1488j55528M0661R5297M1877
$$ -230516 -226311 105910 170258 187126 114185 208668 117180 -38348 2313 97610 139487
15096A39487j8311j4717k33380K3804N844j48528K4837K55616K16305o1864k06144
$$ 139487 121176 106459 -126921 -103117 -97273 -245801 -220964 34652 250957 189093 -17051
15085a7051L8365O8466J5043K04968q1526k31421j12626l3691K22350K74648P4983
$$ -17051 21314 89780 104823 309791 228265 -3156 -115782 -149473 72877 347525 422508
15074D22508k79365k56885j06871J70740K25614o3770j74284Q2201O9451o1572
$$ 422508 143143 -113742 -220613 -49873 175741 111971 -62313 19888 89339 27767
15064B7767j02426m3306R6482j1664K8374N6525j88612J17135o0442M838m9461
$$ 27767 -74659 -117965 -21483 -33147 -4773 51752 -136860 -19725 -80167 -75329 -124790
15053a24790L6490j47422K5148J87954J21564Q9187j66712q4059O0811o5920n9731
$$ -124790 -88300 -235722 -210574 -22620 98944 188131 21419 -62640 -1829 -67749 -127480
15042a27480m8853L2999o8955k85096J58561m7567L00110L07104r5415j66253
$$ -127480 -176333 -143334 -212289 -497385 -338824 -386391 -86281 220823 125408 -40845
15032d0845r9897o3144M96K1888N0748J06254J46482P3198k18962l9993J57147
$$ -40845 -140742 -203886 -203390 -181502 -130754 -24500 121982 195180 -23782 -63775 93372
15021I3372n4152j39836K26543J25460r6668m3696j03814j01021r2994q479n8385
$$ 93372 39220 -100616 125927 251387 154719 111023 7209 -93812 -186806 -195285 -253670
15010b53670j72688J63642L55410M71658M44349L49976N46279L05959J83374p6385
$$ -253670 -426358 -262716 92694 564352 1008701 1358677 1904956 2210915 2394289 2317904
15000B317904l28068p26551m79589l55115j35364j68630k36880K0976J7588J68532
$$ 2317904 1989836 1263285 783696 428581 293217 124587 -112293 -91317 -73729 94803
14990I4803J10566N8904J21286K18494n3781k08948q8705j31469j09671L8286
$$ 94803 205369 264273 385559 604053 550272 341324 252619 121150 11479 49765
14980D9765j15631P4112K46065Q9974k20946j40969k61312p5833j4835P1540K18741
$$ 49765 -65866 8246 254311 344285 123339 -17630 -278942 -354775 -369610 -298070 -79329
14969g9329J212r1540N0472m2136K9437n9252j01625Q0783J61497J16862q331
$$ -79329 -78117 -169657 -119185 -161321 -131884 -191136 -292761 -211978 -50481 66381 58050
14958E8050l7388j93429J26484L7440j31245j09822J61994R5762n984j62071J21454
$$ 58050 20662 -172767 -46283 -8843 -140088 -249910 -87916 7846 1862 -160209 -38755
14947c8755n1632j62980j48182j54593k3812J96899J90058L30791M3471k08815
$$ -38755 -90387 -253367 -401549 -556142 -579954 -383055 -192997 137794 181265 -27550
14937b7550l95000R347L04126k08433o2707M7860p4426o3609q4434K550R5008
$$ -27550 -422550 -413203 -109077 -317510 -380217 -332357 -406783 -470392 -554826 -552276 -457268
14926d57268K34053l6905k9873O5181J56700L4311L25694l1221m76539j15946
$$ -457268 -223215 -260120 -289993 -224812 -68112 -33801 291893 260672 -215867 -331813
14916c31813J43863L98773J03238j11769r136j2039q6275L9565j95519q1239Q5001
$$ -331813 -187950 210823 314061 202292 193156 181117 94842 134407 -61112 -142351 -57350
14905e7350Q15o283k50097O9281N2310n1309J27K43500k4380K9932J07718J94992
$$ -57350 -56535 -62818 -312915 -243634 -191324 -242633 -242506 994 -23386 6546 114264 309256
14893C09256o0580j15018K8228k55498k21500K76674K36876l4846j74741j10435
$$ 309256 248676 133658 161886 -93612 -315112 -38438 198438 163592 -11149 -121584
14883a21584P8156O9469J77410l2223j35381j85058j03480m5900j25383O3552
$$ -121584 -43428 26041 203451 171228 35847 -149211 -252691 -298591 -423974 -360422
14873c60422J79658k6464j01196j74087K69726L7824O480M6495j24990j72117
$$ -360422 -180764 -207228 -308424 -482511 -212785 -174961 -168481 -121986 -246976 -419093
14863d19093J67719J37454K17276j07111p5925O9019O4469J09260l29314j69059
$$ -419093 -251374 -113920 103356 -3755 -79680 -10661 53808 163068 -166246 -335305
14853c35305j9456Q7851R9427M1174P2178M442o399j22851K1802J14447j4727
$$ -335305 -354761 -266910 -167483 -126309 -54131 -49689 -56088 -178939 -157137 -42690 -57417
14842e7417n6032q9767J1452k61281L5933K31639K16685K04494j20409n8644P8557
$$ -57417 -113449 -203216 -191764 -453045 -417112 -185473 31212 235706 115297 56653 135210
14831A35210k00030P6431J49734k95779r2623J00378l9096j78486o9792J11908
$$ 135210 -64820 11611 161345 -134434 -227057 -126679 -165775 -344261 -414053 -302145
14821c02145K3983J6644J8113K49418K79166j21545k19559p34J47864Q4258K04622
$$ -302145 -278162 -261518 -243405 6013 285179 163634 -55925 -56659 91205 175463 380085
14810C80085k13669j86046k66738j28408M2793n4134J51363Q6767M5601Q5447
$$ 380085 166416 -19630 -286368 -414776 -371983 -426117 -274754 -187987 -142386 -56939
14800e6939L925J20421n3629p8950L9606M5489j2113L7920J58885o8576J79355
$$ -56939 -53014 67407 13778 -65172 -25566 19923 7810 45730 204615 136039 315394
14789C15394N1846J06789l63973l07901K3586K41473J57539j0883k79732J2781
$$ 315394 367240 474029 110056 -197845 -174259 67214 224753 213870 -65862 -53081
14779e3081L33628M7134k75860l08210r0439J91648j22744j3582J90554J36283
$$ -53081 280547 327681 51821 -256389 -346828 -155180 -277924 -291506 -100952 35331
14769C5331J74879l0118k39558j58580P2432n773R0700k5747j8242j42325J6167
$$ 35331 210210 180092 -59466 -218046 -145614 -151387 -60687 -86434 -104676 -247001 -230834
14758b30834M1298J50783K0187l4029J75206Q9733k02213j77785P7193O1037J38180
$$ -230834 -189536 -38753 -18566 -52595 122611 212344 10131 -167654 -90461 -29424 108756
14747A08756q8321L0282J57294J36244J39649k43281m04860k23622R9256K19276
$$ 108756 20435 50717 208011 344255 483904 240623 -164237 -387859 -288603 -69327
14737f9327K66170J70195j6990m42430j66252k6903K21723J96869L7036l62247
$$ -69327 196843 367038 350048 -92382 -258634 -285537 -63814 133055 170091 -192156
14727a92156m80818l12357J93238Q7474L50033L06894P0169j58210L2091m9950
$$ -192156 -672974 -985331 -792093 -704619 -354586 -47692 22477 -135733 -103642 -153592
14717a53592K50052k19206j5642J510N6965J63119N2507k04679P4959K21115j32919
$$ -153592 96460 -122746 -138388 -136878 -79913 83206 135713 -68966 5993 227108 94189
14706I4189K18028J40846k30998k15815J294J8884p6049r9645Q7628K41471j3780
$$ 94189 312217 453063 222065 6250 7544 26428 -49621 -149266 -61638 179833 166053
14695A66053O6343q664j84369l0931j06296n8256J57865J0808R8272l26342k31048
$$ 166053 232396 223732 39363 8432 -97864 -156120 1745 12553 110825 -215517 -446565
14684d46565q1489j16110K49446K93952j19301p0217q1465P6682K8499R0917k09698
$$ -446565 -528054 -644164 -394718 -100766 -220067 -290284 -371749 -295067 -266568 -175651 -385349
14673c85349n7633J16776K2813J48888R9510m8384j09160K25423R2358J59267
$$ -385349 -442982 -326206 -303393 -154505 -54995 -103379 -212539 12884 105242 264509
14663B64509L0560j39266k31225K00999J90443O6814O8686k93695k68715j95694
$$ 264509 295069 155803 -75422 125577 316020 382834 451520 157825 -110890 -306584
14653c06584q9232M5603K34104L13349o0860p4550J04935k78902j09507J46937
$$ -306584 -395816 -350213 -116109 197240 136380 61830 166765 -112137 -221644 -74707
14643g4707m1684j26065k2370j20047q4574J00927j04530p778j32557L3510J83515
$$ -74707 -116391 -242456 -264826 -384873 -469447 -368520 -473050 -480828 -613385 -579875 -396360
14632c96360J84723k58503O3074L175J52846K28857q6050J65385R5753J69521
$$ -396360 -211637 -470140 -407066 -403891 -251045 -22188 -108238 57147 152900 322421
14622C22421J29292j02608k4076k58191j72063l8403p5293n0259n4183k32073
$$ 322421 451713 349105 325029 66838 -105225 -143628 -218921 -269180 -323363 -555436
14612e55436J26314J85984M84033J95072k73270k43876j34707J37752l096n7530
$$ -555436 -429122 -243138 240895 435967 162697 -81179 -215886 -78134 -81230 -138760
14602a38760j10526l68785j87681J52499K83513l6152J1313j27859J87340K98015
$$ -138760 -249286 -618071 -805752 -653253 -369740 -405892 -394579 -522438 -335098 -37083
14592c7083M8741q8388J4123r5688J6368m88r0948J74267L3203J10132j7923n4064
$$ -37083 11658 -76730 -62607 -158295 -141927 -142415 -233363 -59096 -25893 84239 66316 12252
14580A2252k11817j00620n5290n105K68460O0578J19486M7860n5135K370j17013
$$ 12252 -199565 -300185 -355475 -360580 -92120 -31542 87944 135804 80669 83039 -33974
14569c3974j14091J6895j18852R5425J16492k63534l65752K75994K55724P5233
$$ -33974 -148065 -131170 -250022 -154597 -38105 -301639 -667391 -391397 -135673 -60440
14559f0440j79621J05247O3361J1827R764K2374K42297k1198j20198l6911p5342
$$ -60440 -240061 -134814 -71453 -59626 -49862 -27488 214809 193611 73413 36502 -38840
14548c8840L2124k89783J37574J43165n3314k23346k26596J49950K99272K41986
$$ -38840 -6716 -296499 -158925 -15760 -69074 -292420 -519016 -369066 -69794 172192
14538A72192m7849j96480j76900j74813p6687L43545J55427l9404O2520k3903
$$ 172192 124343 -72137 -249037 -423850 -500537 -156992 -1565 -40969 21551 -2352
14528b352m2309J99250J11265j25140j71033l6672k77337k0946M6911q04p4161
$$ -2352 -44661 154589 265854 140714 -30319 -66991 -344328 -365274 -318363 -319167 -393328
14517c93328j11604K15200M18965J13395K367k07511l2506j28740R187j81761
$$ -393328 -504932 -289732 129233 242628 244995 37484 4978 -123762 -114575 -296336
14507b96336N543J09755k06511j91731J31292O4464J32405P1771n6823j32297
$$ -296336 -290793 -181038 -387549 -579280 -447988 -383524 -251119 -179348 -236171 -368468
14497c68468O1888J32659K31426M1173k5795M6022q3958k61793k47701P5605J13728
$$ -368468 -306580 -173921 57505 98678 72883 118905 34947 -226846 -474547 -398942 -285214
14486b85214J7637j60680l104J403L3162N7308Q8766J39348o201n8352p8406J70037
$$ -285214 -267577 -428257 -431361 -429958 -396796 -339488 -250722 -111374 -117575 -175927 -254333 -84296
14474h4296l2071P2248L800j0618R9338j31486R6369J26005L0770k89503j47227
$$ -84296 -116367 -44119 -40319 -50937 48401 -83085 13284 139289 170059 -119444 -266671
14463b66671J16849K31955o4070j25168j62414K6318J32842K05977j49530p674
$$ -266671 -149822 82133 18063 -107105 -269519 -243201 -110359 95618 -53912 -61586
14453f1586J1838j98556q7699J43083K35179q2079Q109j73189j18126K36827l46064
$$ -61586 -49748 -248304 -336003 -192920 42259 -39820 -31711 -204900 -323026 -86199 -432263
14442d32263k30473J64160J78325j31822l9891Q904J01510q5368L11502J02915
$$ -432263 -662736 -498576 -320251 -452073 -491964 -483060 -381550 -466918 -155416 -52501
14432e2501k00807p648M9152j9971j15669O3346J54247m4054k10014O0040P3165
$$ -52501 -253308 -260956 -211804 -231775 -347444 -284098 -129851 -173905 -383919 -323879 -250714
14421b50714J76052J5179j43126K17037K20523k3469l9214M7669j57876L3155
$$ -250714 -74662 -59483 -202609 14428 234951 211482 172268 219937 62061 95216
14411I5216J5610j07197o2382J18200k1146j08808r9590j62981J17219J46097
$$ 95216 110826 3629 -58753 59447 38301 -70507 -170097 -333078 -215859 -69762
14401f9762K63504L9868l36852l502K49664L0631p7797L6848q9954N1669j67390
$$ -69762 193742 233610 -103242 -106744 142920 173551 95754 132602 42648 94317 -73073
14390g3073L0570J67448J3834j39648j31743Q4400m2885r3779k39716J8852j15793
$$ -73073 -42503 124945 138779 -869 -132612 -48212 -91097 -184876 -424592 -405740 -521533
14379e21533L518J12621K43864J16355n8097k992L1025l6793m8249l27949p1212
$$ -521533 -518015 -405394 -161530 -45175 -103272 -106264 -75239 -112032 -160281 -488230 -559442
14368e59442j18574J87253L11628m7442R4415J2404m4153n2756J14216J23512
$$ -559442 -678016 -490763 -179135 -226577 -132162 -119758 -163911 -216667 -102451 21061
14358B1061J48439j2331r7687j07475n0679r6664J25149r2717p6699J9324j66530
$$ 21061 169500 157169 59482 -47993 -98672 -195336 -70187 -162904 -239603 -220279 -386809
14347c86809j17457M8428j0287L08795N3267Q8236L7067J27479q1985K4319M9067
$$ -386809 -504266 -455838 -466125 -157330 -104063 -15827 21240 148719 66734 91053 140120
14336A40120q1366J13747n9232j56180j93911k00532j33632k6889J11028K72069
$$ 140120 58754 172501 113269 -42911 -236822 -437354 -570986 -597875 -486847 -214778
14326b14778K13400J58499j78168j72772j9002R6258q7876N7629K1627j48928
$$ -214778 -1378 157121 -21047 -193819 -212821 -116563 -204439 -146810 -125183 -274111
14316b74111j20671l1127L60446J38440O7835j5763J07798O482j40613k31179
$$ -274111 -394782 -425909 -65463 72977 140812 125049 232847 239329 98716 -132463
14306a32463M074J43791J15961J0284r3706j28436o2637J25886Q4981J2574k1674
$$ -132463 -128389 15402 131363 141647 47941 -80495 -143132 -17246 67735 80309 58635
14295E8635M540j78617p5002J44016J73191o8338J23045j37298r8569K0946K60256
$$ 58635 63175 -115442 -190444 -46428 126763 58425 181470 44172 -54397 -33451 226805
14284B26805J5341j70516k32857K8480J36486K87163N4651k63637l32832j3951
$$ 226805 242146 71630 -161227 -132747 3739 290902 345553 81916 -250916 -264867
14274b64867l132k37242m3646R7152O6929J38472J93643L5409K111j484j08240
$$ -264867 -267999 -505241 -548887 -451735 -384806 -246334 -52691 -17282 -15171 -16655 -124895
14263a24895O6821J40950m3172j58276l16745j03279L38591L2711r982J90512
$$ -124895 -58074 82876 39704 -118572 -435317 -538596 -200005 -167294 -177276 13236
14253A3236q3447q6267P3992j69985j56046j59092L13548J84385K79133N0061
$$ 13236 -70211 -156478 -82486 -252471 -408517 -567609 -254061 -69676 209457 259518
14243B59518j82178n6586q1914n5171m387m0024N5696O7801R2199l14891j48243
$$ 259518 77340 20754 -61160 -116331 -120718 -160742 -105046 -37245 54954 -259937 -408180
14232d08180P1549J554j81588p9714J69542J98139j04881m2119J73330l1887L00475
$$ -408180 -336631 -335077 -516665 -596379 -426837 -228698 -333579 -375698 -202368 -234255 66220
14221F6220k7484k00666k4376k6442m752k2610M8678O3235J80179N568j34106
$$ 66220 38736 -161930 -186306 -212748 -217500 -240110 -191432 -128197 51982 57550 -76556
14210g6556j20684J11766K09814L1109o0586k7177j45007L0504j7784l83073j34655
$$ -76556 -197240 -85474 124340 155449 94863 67686 -77321 -46817 -64601 -447674 -582329
14199e82329K44446k1531J05057N8860j47616J28989L05376j25930k40117k1228
$$ -582329 -337883 -359414 -254357 -195497 -343113 -214124 91252 -34678 -274795 -296023
14189b96023L1112o508L5192K3259K26219M8323K017j42455o3665j78131K36949
$$ -296023 -264911 -271419 -236227 -212968 13251 61574 63591 -78864 -142529 -320660 -83711
14178h3711J38151l4364j59346k9096m1724q5491j03156M6983K66101L03235r35
$$ -83711 54440 20076 -139270 -168366 -210090 -295581 -398737 -351754 -85653 217582 216647
14167B16647p2664J18231j25727k21276J11313J71819m0937J93438P3523l09808
$$ 216647 143983 262214 136487 -84789 26524 198343 157406 350844 424367 114559
14157A14559n9825m8198k1054J33094j1475j10722j05741j25365m2708n9130k9742
$$ 114559 54734 6536 -14518 118576 107101 -3621 -109362 -234727 -277435 -336565 -366307
14146c66307J55974J62440J85448j17015q2343l67138k73705J63431J6562K65897
$$ -366307 -210333 -47893 137555 20540 -61803 -428941 -702646 -539215 -522653 -256756
14136b56756P9920q449J63403j32064r2850n1955q4629j36350n2660J31628K5050
$$ -256756 -176836 -185285 -21882 -153946 -246796 -298751 -383380 -519730 -572390 -440762 -415712
14125d15712m5077j60797O9038Q5562J8998J57717J35222K9063m4176R2040l8730
$$ -415712 -460789 -621586 -552548 -466986 -447988 -290271 -155049 -125986 -170162 -78122 -116852
14114a16852L1090q5883J00324Q1598k13118r1928J6504k4571j66126O2984P9891
$$ -116852 -85762 -171645 -71321 10277 -202841 -294769 -278265 -302836 -468962 -405978 -326087
14103c26087Q1038N5186j1702K2231J24185m4481K6542p337Q9642J0639j52983
$$ -326087 -245049 -189863 -201565 -179334 -55149 -99630 -73088 -80425 9217 19856 -133127
14092a33127j664N6482L2790R4042J05292k51954q8291K58062J9449j5217J19864
$$ -133127 -134791 -78309 -45519 48523 153815 -98139 -186430 71632 91081 75864 195728
14081A95728k3440J20628j04189j3007m3263L0537j35154j67506j25305p4113
$$ 195728 172288 292916 188727 175720 132457 162994 27840 -139666 -264971 -339084
14071c39084j52297J7007l2382j29403K09489J36797j24173J02333L48430q84
$$ -339084 -491381 -474374 -506756 -636159 -426670 -289873 -414046 -311713 36717 35833
14061C5833J28993r3612k144P9647J3132J46456j4725m6960J9693R2445j54287
$$ 35833 164826 71214 69070 148717 161849 308305 293580 246620 266313 358758 204471
14050B04471K291L2793k73629j73818k18032K33141P1976Q7673J6692j24036R7266
$$ 204471 206762 239555 -34074 -207892 -425924 -192783 -120807 -33134 -16442 -140478 -43212
14039d3212q7499j69690L31560J68937j08875J56309K46380k01785m58386j31076
$$ -43212 -130711 -300401 31159 200096 91221 247530 493910 292125 -166261 -297337
14029b97337K44606k6278n5325o3301K4305k85721k28412J16331M2655O3653M02058
$$ -297337 -52731 -79009 -134334 -197635 -173330 -459051 -687463 -571132 -528477 -464824 -62766
14018f2766l366j43983O5121J4231J1396K26228M5391j86249l81511M2212J34080
$$ -62766 -66132 -210115 -144994 -130763 -119367 106861 152252 -33997 -415508 -373296 -239216
14007b39216o677j91449q6193P7621r305J8144J64430K95618J64883r723J18437
$$ -239216 -245893 -437342 -523535 -445914 -455219 -437075 -272645 22973 187856 178133 296570
13996B96570j13828k56437j05597J3670p6665J8431J04227M05296r6262k11680
$$ 296570 182742 -73695 -179292 -165622 -242287 -223856 -119629 285667 189405 -22275
13986b2275j60213K32228K72722N3043r561j55378k39445K4402K52403j58572
$$ -22275 -182488 49740 322462 375505 365944 210566 -28879 -4477 247926 89354
13976H9354j72691J46012J26010q5278k7793Q4983j82045o0772J26627q8586O4004
$$ 89354 -83337 62675 188685 103407 75614 160597 -21448 -82220 44407 -44179 19825
13965A9825J41239N2075q0901k10561k7541R6759J00632k8458k65232m743J50233
$$ 19825 161064 213139 132238 -78323 -105864 -9105 91527 63069 -202163 -206906 -56673
13954e6673p3574J87218K63280k17262k50147m4007L1105m4753L8896L03206J76486
$$ -56673 -130247 56971 320251 102989 -147158 -191165 -160060 -204813 -165917 137289 313775
13943C13775j17746l02543M8626P2511k25501o3668j17404q2442m6672K1241J47113
$$ 313775 196029 -106514 -57888 14623 -210878 -274546 -391950 -474392 -521064 -499823 -352710
13932c52710R4194L43164O3500l62082k41422R3818n7759k4046J09756M04001
$$ -352710 -258516 84648 148148 -213934 -455356 -361538 -419297 -443343 -333587 70414
13922G0414L8889n4774j69702K8295O2627K58535j35137n2368P0122j4127J50406
$$ 70414 109303 54529 -115173 -86878 -24251 234284 99147 46779 116901 102774 253180
13911B53180K9565j21703j44075L2611K36206J85608R98q3407k01801j47340j02687
$$ 253180 282745 161042 16967 49578 285784 471392 472390 388983 187182 39842 -62845
13900f2845J94646J09361K88332q2548k24317m3119l899k07168j04897J89022
$$ -62845 131801 241162 529494 446946 222629 179510 175611 -31557 -136454 52568
13890E2568K9946j38506Q0629j52655m9202r618k1445O8224J52252J40096P6801
$$ 52568 82514 -55992 24637 -128018 -177220 -186838 -208283 -140059 12193 152289 229090
13879B29090o211k06597k37668J167k64313P8855J23249K25549K75506M644k51848
$$ 229090 222879 16282 -221386 -220219 -484532 -405677 -282428 -56879 218627 223271 -28577
13868b8577l09696K49327J74707j39851j82863j2102J22160q6346k23562j6385
$$ -28577 -338273 -88946 85761 -54090 -236953 -249055 -126895 -213241 -436803 -453188
13858d53188K10563K56987P9401o2000q3463k01121k2954J92536J49343J41136
$$ -453188 -242625 14362 93763 31763 -51700 -252821 -275775 -83239 66104 207240
13848B07240K16616L0247j13517j19054m52190j81752L25051N5627n9239j50339
$$ 207240 423856 454103 340586 221532 -230658 -412410 -87359 -31732 -90971 -241310
13838b41310K25113J08954m8145r0845N952K2603k22807q642R0051K062J56700
$$ -241310 -16197 92757 44612 -46233 -40281 -17678 -240485 -249127 -159076 -157014 -314
13827c14P7873k30719j17835J59290k1486l89513j20550L32654J16842k886m4030
$$ -314 77559 -153160 -270995 -111705 -133191 -522704 -643254 -310600 -193758 -196644 -240674
13816b40674k11245O4494L27694L55289K01100l77889j63113L0338l58232o0541
$$ -240674 -451919 -387425 -59731 295558 496658 118769 -44344 -14006 -372238 -432779
13806d32779K22293J08031N481q0120j11095J21961L48220J33187l242j64063
$$ -432779 -210486 -102455 -96974 -177094 -288189 -166228 181992 315179 311937 147874
13796A47874j30537j15518j46271O7178J59145k08097m02977L4130K70568K18094
$$ 147874 17337 -98181 -244452 -177274 -18129 -226226 -629203 -595073 -324505 -106411
13786a06411R6400K01239j86733k04955l96773L3995J83134J50618J48838J84162
$$ -106411 -10011 191228 4495 -200460 -597233 -563238 -380104 -229486 -80648 103514
13776A03514K61780J93837O9276K92549J00950k45487l32663j68413L4784J24445
$$ 103514 365294 559131 628407 920956 1021906 776419 443756 275343 310127 434572
13766D34572j10447n624O0867j88349O9342M9332j90035k04836j6035N0669m710
$$ 434572 324125 318501 379368 191019 260361 309693 119658 -85178 -101213 -50544 -55254
13755e5254K7355J11857K81035q0903o20501j04695J60510q3R1039K54825N6301
$$ -55254 -27899 83958 364993 284090 -336411 -441106 -280596 -280679 -189640 65185 121486
13744A21486L2981m8203k1814q6506l47079j00748L96498J90895J0731p95K18274
$$ 121486 154467 106264 84450 -2056 -349135 -449883 -53385 137510 148241 147446 365720
13733C65720Q6009j84954l44160R5722J21015J57348K08943J00533p7713J15289
$$ 365720 451729 266775 -77385 18337 139352 296700 505643 606176 528463 643752
13723F43752n279K06031M28118Q9951o1780P0995l48966l34821O705M5237k52467
$$ 643752 638473 844504 1272622 1362573 1300793 1371788 1022822 688001 694706 739943 487476
13712D87476J7697l8848p5453j84455R5408K74804k309L6221k4762j40346q1315
$$ 487476 505173 466325 390872 206417 301825 576629 574320 610541 585779 445433 364118
13701C64118k37490l49419j05026k488R8754J29570P6018j28407Q9910L78128
$$ 364118 126628 -222791 -327817 -330305 -231551 -101981 -25963 -154370 -64460 313668
13691C13668K08489p7298K71258J87644m34254j37199J9613J26453K36311K73600
$$ 313668 522157 444859 716117 903761 469507 332308 351921 478374 714685 988285
13681I88285j60518j51266l01023n333l9772N6646J06253k61340q7922K00866
$$ 988285 827767 676501 375478 370145 330373 387019 493272 231932 144010 344876
13671C44876P405k50746j69600K31546J93088K31575k8860J26788o1688K20399
$$ 344876 352281 101535 -68065 163481 356569 588144 559284 686072 624384 844783
13661H44783r3615j4220J47478n3883L6638m47709k84143J15494J04930P4653
$$ 844783 751168 736948 884426 830543 867181 419472 135329 250823 355753 430406
13651D30406P3916n2796j01181k05829j49800j09987K13094M3428m9705J497N86
$$ 430406 504322 451526 350345 144516 -5284 -115271 97823 141251 91546 93043 93629
13640I3629k3408J76731L8386k08324p0607m2336j8007l3956J66666o0872K7222
$$ 93629 70221 246952 285338 77014 6407 -35929 -53936 -87892 78774 17902 45124
13629D5124J16228o733l18757o3954K07206J30225k2385n0291k00676l2799K3625
$$ 45124 161352 154619 -164138 -228092 -20886 109339 86954 36663 -164013 -196812 -173187
13618a73187Q1444M975J10941N399K28359M7370l24333K6309L7355j36637K1193
$$ -173187 -91743 -86768 24173 29572 257931 305301 -19032 7277 44632 -92005 -70812
13607g0812J73374m2218l420q0199P9983J34711k90992P4399N3638O5514L7846
$$ -70812 102562 60344 56924 -23275 56708 191419 -99573 -25174 28464 93978 131824
13596A31824j16966L1780K45319K5809j40578o2028R1265j64165N1978J88561
$$ 131824 14858 46638 291957 317766 177188 115160 206425 42260 94238 282799
13586B82799M7576J64218l72208n2603J12479P7702o0028J14622n3504k5354j14223
$$ 282799 330375 494593 122385 69782 182261 259963 199935 314557 261053 235699 121476
13575A21476r2081j54631j37287J41181P4524k07717O5375K85765j32636N1856
$$ 121476 29395 -125236 -262523 -121342 -46818 -254535 -189160 96605 -36031 15825
13565A5825j2149J7081M5282J25932L78332L3663k09487j53635l49564j90445
$$ 15825 3676 20757 66039 191971 570303 603966 394479 240844 -108720 -299165
13555b99165O2578Q4628R5135J56522j4970J48953j03489o6807K36178J20533
$$ -299165 -236587 -151959 -56824 99698 84728 233681 130192 63385 299563 420096
13545D20096j31771p4312o1422j03146j55618L96164K28250l06303k7981k99696
$$ 420096 288325 214013 152591 49445 -106173 289991 518241 211938 183957 -115739
13535a15739q6747Q6146q04O6845J25735j12983p4506J12737k18537j5391J95979
$$ -115739 -202486 -116340 -117144 -50299 75436 -37547 -112053 684 -217853 -233244 -37265
13524c7265o5391J9703m6892J9444L3501K75743M0137O850K87166J1627j02675
$$ -37265 -102656 -82953 -129845 -110401 -76900 198843 238980 245830 532996 544623 441948
13513D41948l1619j44055k95131l58424K00276J86494l7914k13005k15510L16082
$$ 441948 410329 266274 -28857 -387281 -187005 -511 -38425 -251430 -466940 -150858
13503a50858K32125K27143K0627P5204k38570j21082n8925j004j5823j5629K29489
$$ -150858 81267 308410 329037 404241 165671 44589 -14336 -15340 -31163 -46792 182697
13492A82697J36721j3631m2972o2390m244P5270K9173j14097q4205o949J69641
$$ 182697 319418 305787 262815 200425 196181 271451 300624 186527 102322 95373 265014
13481B65014o037j65721p0820K31423J65409r1359m9057k47122M2112O5733L8015
$$ 265014 258977 93256 22436 253859 419268 327909 278852 31730 73842 139575 177590
13470A77590M7495r8466l42858k36960J90589M34572K24807K6403l1833J2546
$$ 177590 225085 126619 -216239 -453199 -262610 171962 396769 423172 391339 403885
13460D03885J26576j58193k09139j00937L280j93715l9566J18661p5106j91249
$$ 403885 530461 372268 163129 62192 65472 -128243 -167809 -49148 -124254 -315503
13450c15503k31497K53254J30119J7697O9976O8464M1065n6900M3748K33440K53802
$$ -315503 -547000 -293746 -163627 -145930 -75954 -7490 33575 -23325 20423 253863 507665
13439E07665j31191o0182p1318K2864k4101j50238O9624k33731K56557K83458
$$ 507665 376474 316292 244974 267838 243737 93499 163123 -70608 185949 469407
13429D69407l8584j27486k60090j30494J40837Q6043N5349K14275J39182k66412
$$ 469407 430823 303337 43247 -87247 53590 139633 194982 409257 548439 282027
13419B82027r5761J78354J97974P5929J21340j25391k67857K21757L53758m7594
$$ 282027 186266 364620 562594 638523 759863 634472 366615 588372 942130 894536
13409H94536j44167p7744l6623j43272M4213k9753K12988j70623k00025J37151
$$ 894536 750369 672625 636002 492730 536943 507190 720178 549555 349530 486681
13399D86681k46100l07985j10325J32992J20030K30587K21979j08859j05345J51954
$$ 486681 240581 -67404 -177729 -44737 75293 305880 527859 419000 313655 465609
13389D65609r7976j1871l0862j6762m2089J67313K27039K59380Q0624q4311r280
$$ 465609 367633 355762 324900 308138 266049 433362 660401 919781 1000405 916094 906814
13378I06814j95237k27476k7198J40815K27191R6850N0114O9803n1697r8032k78581
$$ 906814 711577 484101 456903 597718 824909 921759 971873 1041676 989979 891947 613366
13367F13366j26257M52849L31443K24893J32416k18968k30607J20828O5589j36138
$$ 613366 487109 939958 1271401 1496294 1628710 1409742 1179135 1299963 1365552 1229414
13357A229414R2389m1276K59729J63547o7805k22273P6909L03523K77247Q5714
$$ 1229414 1321803 1280527 1540256 1703803 1635998 1413725 1490634 1794157 2071404 2157118
13347B157118K24236J39337K48026K23772M21757J79450K74893M67832N70228
$$ 2157118 2381354 2520691 2768717 2992489 3414246 3593696 3868589 4336421 4906649
13338D906649O11158N20272N83115J202049R19850J439367J880188K129490K684432
$$ 4906649 5517807 6038079 6621194 7823243 8743093 10182460 12062648 14192138 16876570
13329A6876570L356915L818233N254886O842888R183215J3035662J7641544K1112669
$$ 16876570 20233485 24051718 29306604 36149492 45332707 58368369 76009913 97122582
13321I7122582K1925280J8660695J1231163R80453r079351j6074053j8981635
$$ 97122582 119047862 137708557 148939720 149920173 140840822 124766769 105785134
13314A05785134j8558473j5761776j1808139p918899n498366l544592k700648
$$ 105785134 87226661 71464885 59656746 51737847 46239481 42694889 39994241
13307C9994241k268579k312663k636907k808595k802750k171062j645957j088970
$$ 39994241 37725662 35412999 32776092 29967497 27164747 24993685 23347728 22258758
13299B2258758q75476p45796n90153o31809m85685k49505j20019J53596K37668
$$ 22258758 21383282 20637486 20047333 19415524 18929839 18680334 18560315 18713911 18951579
13290A8951579J20250N11135N66293N35539M64868K94031P22528P94237Q58776
$$ 18951579 19071829 19582964 20149257 20684796 21149664 21443695 22166223 22960460 23819236
13281B3819236J260147J828554K119635K462819L267812M223185N756340P764223
$$ 23819236 25079383 26907937 29027572 31490391 34758203 38981388 44737728 52501951
13273E2501951J0020703J4084679J9736455K6968978L3274031L5321794L0723167
$$ 52501951 62522654 76607333 96343788 123312766 156586797 191908591 222631758
13266B22631758K1151486R128043l577764j2598520j5234059j3666020j2162640
$$ 222631758 243783244 252911287 249333523 236735003 221500944 207834924 195672284
13259A95672284j2971069j5297098j7887904j9490981j9931394j7700235j3752057
$$ 195672284 182701215 167404117 149516213 130025232 110093838 92393603 78641546
13252G8641546j0018206p514582n553361m404870l826734k973032k183910j854536
$$ 78641546 68623340 61108758 55555397 51150527 47323793 44350761 42166851 40312315
13244D0312315j715485j372474j378604j133142q97427p61196m60030L3885j05689
$$ 40312315 38596830 37224356 35845752 34712610 33815183 33053987 32593957 32627842 32522153
13235C2522153k36206k56153k05710j42137k85910m34281k16836j83609j74312
$$ 32522153 32285947 32029794 31824084 31681947 31396037 30961756 30744920 30561311 30386999
13226C0386999L62361N82770J134838J403475K213592K496184L160874L608992
$$ 30386999 30749360 31332130 32466968 33870443 36084035 38580219 41741093 45350085
13218D5350085L847846M558371N999069Q464214J2697707J8144352K3593102K6645959
$$ 45350085 49197931 53756302 59755371 68219585 80917292 99061644 122654746 149300705
13210A49300705K3544227J4372895J840409j0883991k0618117k5215227k4205502
$$ 149300705 172844932 187217827 189058236 178174245 157556128 132340901 108135399
13203A08135399j9947834j5068667j1011888p959542o107724m863956l783295
$$ 108135399 88187565 73118898 62107010 54147468 48039744 43175788 39392493
13196C9392493l126134k353703k073448j838280j630279j415913j346297j173744
$$ 39392493 36266359 33912656 31839208 30000928 28370649 26954736 25608439 24434695
13188B4434695r35435o01492q62946q53629o17481o62601m56226J43378l06745
$$ 24434695 23499260 22897768 22034822 21181193 20563712 19901111 19444885 19588263 19281518
13179A9281518p37595j99974k19907l16163m29869p19345j032722q34614q18875
$$ 19281518 18543923 18343949 18124042 17807879 17378010 16658665 15625943 14791329 13972454
13170A3972454p15267n88061p95004o28337k93170n77568l62853j44761l07513
$$ 13972454 13257187 12669126 11874122 11245785 10952615 10375047 10012194 9867433 9559920
13161I559920l00151k80174k14256k22204m85933m40888j64848K3937j83658k93848
$$ 9559920 9259769 8979595 8765339 8543135 8057202 7616314 7451466 7475403 7291745 6997897
13151F997897l13473j46131j68897l8886j92158k99279j97798j35257k75428k22942
$$ 6997897 6684424 6538293 6369396 6330510 6138352 5839073 5641275 5506018 5230590 5007648
13141E007648j71833M1365l12166k97865r5380j14248L2203P6395q0710k4818
$$ 5007648 4835815 4877180 4565014 4267149 4171769 4057521 4089724 4166119 4085409 4060591
13131D060591k14585m1879N9261j59446k72387k93196k14181n1945J17597K28399
$$ 4060591 3846006 3804127 3863388 3703942 3431555 3138359 2924178 2872233 2989830 3218229
13121C218229j53050j63802j95747j19080j30465j48202J26932o337k84289j84982
$$ 3218229 3065179 2901377 2705630 2586550 2456085 2307883 2434815 2428478 2144189 1959207
13111A959207j26796Q3080K18601J91700P4806r5913M6358k79345j11937p2212
$$ 1959207 1832411 1915491 2134092 2325792 2400598 2304685 2351043 2071698 1959761 1887549
13101A887549M0605J2307Q2695j11025M4220J70184L0047J13869O734J20308L3014
$$ 1887549 1928154 1940461 2023156 1912131 1956351 2126535 2156582 2270451 2277185 2397493 2430507
13090B430507n8623j57656j04904j08464k51327j05889q6592m1263n3454J70110
$$ 2430507 2371884 2214228 2109324 2000860 1749533 1643644 1557052 1515789 1462335 1632445
13080A632445K85213K5130o764J14976j66250j74248p1578j97190j00209q9180
$$ 1632445 1917658 1942788 1936024 2051000 1884750 1710502 1638924 1441734 1341525 1252345
13070A252345J94255J92296q8925j77502L1447K46849J92973j12382k97421k26146
$$ 1252345 1446600 1638896 1549971 1372469 1403916 1650765 1843738 1731356 1433935 1207789
13060A207789j2534m2715j02775j44959j75878k83683n8173K50216K7123P2871
$$ 1207789 1195255 1152540 1049765 904806 728928 445245 387072 637288 664411 737282
13050G37282J88742q3771K6504j16340L5786k26092p8477R056P0350k0549Q3447
$$ 737282 926024 842253 868757 752417 788203 562111 483634 492690 563040 542491 625938
13039F25938J03621j56778n3414j4101l328j14057q0947L2909K28376K32490K0289
$$ 625938 729559 572781 519367 505266 501938 387881 306934 339843 568219 800709 820998
13028H20998k78317m6224J40440K58479O1603L2728j88829q8182J38497m7541
$$ 820998 542681 496457 636897 895376 956979 989707 800878 712696 851193 803652
13018H03652j76374k5438q0734l3326N5180J00145m9571k34634R1566J95843j31313
$$ 803652 627278 601840 521106 487780 542960 643105 593534 358900 450466 646309 514996
13007E14996o0389k10379O4210j4012k10609Q5722L3556Q0834J11827k6976k58796
$$ 514996 454607 244228 308438 294426 83817 169539 203095 283929 395756 368780 109984
12996A09984J9875J07872K03142K41627J1117k24836n6694m9757n2481q7445j46126
$$ 109984 129859 237731 440873 682500 693617 468781 412087 362330 309849 222404 76278
12985G6278o744J35363k5730K04963J91747j72260o2062P1602o1070n2773J09716
$$ 76278 69534 204897 179167 384130 575877 403617 341555 413157 352087 299314 409030
12974D09030N8635M0054Q3943k47165k21421j85248O700J12082J53516M8434n4905
$$ 409030 467665 507719 591662 344497 123076 -62172 -55472 56610 210126 258560 203655
12963B03655j67944q6840l0064K89482J0839l91178J01042J00129j22918r1590
$$ 203655 35711 -51129 -81193 208289 219128 -172050 -71008 29121 -93797 -185387
12953a85387J83050K14437M8942q912j79628j05600j50792K34960K15525N3083
$$ -185387 -2337 212100 261042 252130 72502 -33098 -183890 51070 266595 319678
12943C19678j7055K1075Q312J63070L4327J15833k11512j34308m5289m9869l2915
$$ 319678 302623 323698 332010 495080 529407 645240 433728 299420 254131 204262 171347
12932A71347q107j31360j45444P0166l4859M30156O0944K3160o8624k59030q2007
$$ 171347 163240 31880 -113564 -43398 -78257 351899 412843 436003 367379 108349 26342
12921B6342Q5411k9893P8861R5805n3176k06895l8493j13967Q1313R9256K59362
$$ 26342 111753 81860 160721 256526 203350 -3545 -42038 -156005 -74692 24564 283926
12910B83926j60348j96885n6638L4502J88774K94209q0380j85666M5317K83404
$$ 283926 123578 -73307 -129945 -95443 93331 387540 307160 121494 166811 450215
12900D50215P2597j26651k34124j12805k5208j77521N6388J6696j57646M5073
$$ 450215 522812 396161 162037 49232 24024 -153497 -97109 -80413 -238059 -192986
12890a92986O2202L5719K25753q140k45598l6134P4717L6033j07447R0585J60014
$$ -192986 -130784 -95065 130688 122548 -123050 -159184 -84467 -48434 -155881 -65296 94718
12879I4718j47142p4819R1105Q6215j8296K70951r7177k61180k32699Q851Q6778
$$ 94718 -52424 -127243 -36138 50077 31781 302732 205555 -55625 -288324 -279473 -192695
12868a92695M9124K08719L16921K59180j38550j36936J42512K34374J00454R119
$$ -192695 -143571 65148 382069 641249 502699 365763 508275 742649 843103 852222
12858H52222m9781j73164J52584o8339j03428j00888k0793l8716k86745k7090
$$ 852222 802441 629277 781861 713522 610094 509206 488413 449697 162952 135862
12848A35862K22844Q2244j61276O485J08570J65687Q8447Q9124R9864M1951l09484
$$ 135862 358706 440950 279674 286159 394729 560416 648863 737987 837851 879802 570318
12837E70318j91033o5224R9803K20143j50390k32452k7952R109K17330l15012
$$ 570318 379285 314061 413864 634007 483617 251165 223213 232322 449652 134640
12827A34640l6608J41017R7601k12997j11162j8182N5807n8382l5477K0624m4245
$$ 134640 98032 239049 336650 123653 12491 -5691 50116 -8266 -43743 -23119 -67364
12816f7364j06730J01467N206Q3145L3087k60392J25147K76133K16717R0178L23290
$$ -67364 -174094 -72627 -67421 15724 48811 -211581 -86434 189699 406416 496594 819884
12805H19884K66394J10862L3082l2093k74476l40363j1694M9658J31264r0334
$$ 819884 1086278 1197140 1230222 1198129 923653 583290 571596 621254 752518 662184
12795F62184J12100j26747k27154k16494m6642J83268R6538q8936O4898o2594
$$ 662184 774284 647537 420383 203889 157247 340515 437053 348117 413015 350421
12785C50421j02685k29741K99134R8190j39224j02910O2133N2088m4167J20684
$$ 350421 247736 17995 317129 415319 276095 173185 235318 287406 243239 363923
12775C63923j98015Q2821J8256j64559j87398k29538J6532J68382R5555R2029
$$ 363923 165908 248729 266985 102426 -84972 -314510 -297978 -129596 -34041 57988
12765E7988N7359j70606J35134Q1617M8259J0165m9801k3650n4961n1124K19098
$$ 57988 115347 -55259 79875 161492 209751 219916 170115 146465 91504 40380 259478
12754B59478J25392j03396Q5601R122l15616p7317K93409K41545o0292J09654
$$ 259478 384870 281474 367075 376197 60581 -16736 276673 518218 457926 567580
12744E67580J86432K04153p7980j73340k83856J4763j86073j56272q9196J17517
$$ 567580 754012 958165 880185 706845 422989 437752 251679 95407 6211 123728
12734A23728r6627J19213J63375j08085p6701O4117J52290j0100J3452P2760k19120
$$ 123728 27101 146314 309689 201604 124903 189020 341310 331210 344662 417422 198302
12723A98302N9763K72781r5354m20282n3527Q0026K51704l9500l3958K18321m1743
$$ 198302 258065 530846 435492 15210 -38317 41709 293413 253913 219955 438276 396533
12712C96533o3737k49392k33897j13253l5104R8155K02811j94666j79563O4495
$$ 396533 332796 83404 -150493 -263746 -298850 -200695 2116 -192550 -372113 -307618
12702c07618P4256J82778n7427J28866J41667J06831j18831J91682q997j76876
$$ -307618 -233362 -50584 -108011 20855 162522 269353 150522 342204 333207 156331
12692A56331o1954K2569j50565R363K96151J51612m6865j67388j36598k47662
$$ 156331 94377 116946 -33619 -24256 271895 423507 376642 209254 72656 -175006
12682a75006J893L0229M4328k76518j7202J05993p76m8212m9481P3471P0861K28105
$$ -175006 -173113 -142884 -98556 -375074 -392276 -286283 -287059 -335271 -384752 -311281 -240420 -12315
12670a2315K88057j7784O7254j05666q4740j24821k52643p3008j36997j17682
$$ -12315 275742 257958 325212 219546 134806 9985 -242658 -315666 -452663 -570345
12660e70345J32793J34955K9675O9266J45617k1703J02085q0797j38189j39196
$$ -570345 -437552 -302597 -272922 -203656 -58039 -79742 22343 -58454 -196643 -335839
12650c35839K63930K42819l5042n1130O2256r453M8841J74606l7391n0885k19256
$$ -335839 -71909 170910 135868 84738 146994 137541 186382 360988 323597 272712 53456
12639E3456J36637J21465Q4019o0241j5279k78989j63666M1635j14219n8156j96898
$$ 53456 190093 311558 395577 335336 320057 41068 -122598 -80963 -195182 -253338 -450236
12628d50236J25883p1096J2272K03832j04746j12684K2972K10330J11202j6339
$$ -450236 -324353 -395449 -383177 -179345 -284091 -396775 -373803 -163473 -52271 -68610
12618f8610K6830R9298Q2242o9131k69136j24190m6514L13075m008k75264j09190
$$ -68610 -41780 57518 139760 70629 -198507 -322697 -369211 -56136 -60144 -335408 -444598
12607d44598j8943L34235J64602L4793J28966J21511o647j94817k8299j64425
$$ -444598 -463541 -129306 35296 70089 199055 320566 313919 119102 90803 -73622
12597g3622O7473K72393J9147l3809M6538o8315R0868l7936n2195j4701k10045
$$ -73622 -6149 266244 285391 251582 298120 229805 320673 282737 230542 215841 5796
12586E796j06636m1017M44637J03168j51515j34574j42980o5587o5994l5751Q2957
$$ 5796 -100840 -141857 302780 405948 254433 119859 -23121 -88708 -154702 -190453 -107496
12575a07496K21365J74181P6650P0380j141k60508l30217J18982J26932j49286
$$ -107496 113869 288050 364700 435080 433939 173431 -156786 -37804 89128 -60158
12565f0158n665K5651j66462K12239J12196L37612O0570l66910p6624m7413O2113
$$ -60158 -65823 -40172 -206634 5605 117801 455413 515983 149073 72449 25036 87149
12554H7149J03525J4053m0257j03642K2743p6865n4881j10502r3131k2013J68656
$$ 87149 190674 204727 164470 60828 83571 6706 -48175 -158677 -251808 -273821 -105165
12543a05165K87804K20721M387k21866j27464Q4640k04447k69862j33591M8388
$$ -105165 182639 403360 407747 185881 58417 143057 -61390 -331252 -464843 -416455
12533d16455J53152K21981J29719K07562K86577J7412q2037p2096J74965K14744
$$ -416455 -263303 -41322 88397 295959 582536 599948 517911 445815 620780 835524
12523H35524p4196q0881n5258k45855j50563j48395j62889P667j46051K71499
$$ 835524 761328 680447 625189 379334 228771 80376 -82513 -74846 -220897 50602
12513E0602O7447L439r9861K01553p5594j03433N0543r7684r8275R4635P3799
$$ 50602 118049 121488 21627 223180 147586 44153 94696 -2988 -101263 -6628 67171
12502F7171j35080K43467L52537j65616k64882j67727p7208Q6414Q675j94525
$$ 67171 -67909 175558 528095 362479 97597 -70130 -147338 -60924 -52249 -246774
12492b46774j43372J85283j7569Q3491K33607K17439J48793K002j92369j61642
$$ -246774 -390146 -204863 -222432 -138941 94666 312105 460898 462900 270531 108889
12482A08889j40021K64453j40663l95j03714k680m8445L2594Q1359N7860j52884
$$ 108889 -31132 233321 92658 92263 -11451 -14131 -62576 -29982 51377 109237 -43647
12471d3647N259j08934r0732J1570J35498p8257k704J50509N3812j01159J2185
$$ -43647 -38388 -147322 -238054 -226484 -90986 -169243 -171947 -21438 32374 -68785 -56600
12460e6600K06006L9023k9584j56000m4481n4381k20336j54869K76568J18361
$$ -56600 149406 188429 158845 2845 -41636 -96017 -316353 -471222 -194654 -76293
12450g6293j15914P4880J0635L78763J86137k08599j25965j0767J16124j1162
$$ -76293 -192207 -117327 -106692 272071 458208 249609 123644 112877 229001 217839
12440B17839J04653q5217j80533j28070j38403j63607J38921J65120K55922J19446
$$ 217839 322492 237275 56742 -71328 -209731 -373338 -234417 -69297 186625 306071
12430C06071L2148J3977k91312j17000q4051J5105n1939r0882n4300Q6170P3514
$$ 306071 338219 352196 60884 -56116 -140167 -125062 -177001 -267883 -322183 -236013 -162499
12419a62499K02507L14465q3019l83044k41033j6442J88339K82003J15020l85300
$$ -162499 40008 354473 271454 -111590 -352623 -369065 -180726 101277 216297 -169003
12409a69003j63937K7632q8724l68931Q0517J93797k3599m7991O1968L52465P8349
$$ -169003 -332940 -305308 -394032 -762963 -682446 -488649 -512248 -560239 -498271 -145806 -67457
12398f7457J18075L2437K28322P0929n3612o8807q9470j01976Q7979k3949k54775
$$ -67457 50618 83055 311377 382306 328694 259887 170417 68441 156420 132471 -122304
12387a22304P9045J71136K05k78180k7292J41961j13943k76397p3353K00183R4876
$$ -122304 -43259 127877 128082 -150098 -177390 -35429 -149372 -425769 -499122 -298939 -204063
12376b04063j09922j40123J55382K09689P2391r8904P8370J9445l0006O8328j1514
$$ -204063 -313985 -454108 -298726 -89037 -16646 -115550 -37180 -17735 -47741 20587 9073
12365I073l7412r6973n3610o1521Q0501J60929J35305j41849j35688K73476M1227
$$ 9073 -28339 -125312 -178922 -240443 -159942 987 136292 -5557 -141245 132231 173458
12354A73458n6583J633j0242p492j22698O7921J09531K59668N6467k96720k03229
$$ 173458 116875 118508 108266 100774 -21924 45997 155528 415196 471663 174943 -28286
12343b8286j22009K05208J31819J59994J96137P3196N4987k2863j33027j51457
$$ -28286 -150295 54913 186732 346726 542863 616059 671046 648183 515156 363699
12333C63699k26387J78002L94952k25540j59277o7326j40392M9929k27867L6641
$$ 363699 137312 315314 710266 484726 325449 258123 117731 167660 -60207 -23566
12323b3566J95644J11971R9643j18686J6731J20648J90895m36583k09110L87284
$$ -23566 172078 284049 383692 265006 281737 402385 593280 156697 -52413 334871
12313C34871J16162k08684k92728p7001j66218J20630P4681K28888q709M3316
$$ 334871 451033 242349 -50379 -127380 -293598 -172968 -98287 130601 121892 165208
12303A65208J48782J66893J300j14591J68921P3876j95380Q0694j38360p6212
$$ 165208 313990 480883 482183 367592 536513 610389 415009 495703 357343 281131
12293B81131K5393K53351j10418k0386J14527J77847k12484R48J60923n6644n8306
$$ 281131 306524 559875 449457 429071 543598 721445 508961 509909 670832 614188 555882
12282E55882J12336J3504j00196j06812l1411j53986N7518O5657r328o1256R4878
$$ 555882 668218 681722 581526 474714 443303 289317 346835 412492 403164 341908 436786
12271D36786K83890j21793K8150q113l8721m8749l46417j06390l7264K29547J0722
$$ 436786 720676 598883 627033 618920 580199 531450 185033 78643 41379 270926 281648
12260B81648j5660j5098l9335j34629k07719Q0097J23234P0008J22066j79670
$$ 281648 265988 250890 211555 76926 -130793 -50696 72538 142546 264612 84942
12250H4942j54563o1146l0341Q3779J51175P9339k46214j53857K20183J08406
$$ 84942 -69621 -130767 -161108 -77329 73846 153185 -93029 -246886 -26703 81703
12240H1703j68976J28646J00752K33268J40374j84660k00590j17042O9177K8986
$$ 81703 -87273 41373 142125 375393 515767 331107 130517 13475 82652 111638
12230A11638J01439P6338J81421J98800r2105j93775j8617L2013r3805K3868o4367
$$ 111638 213077 289415 470836 669636 577531 383756 365139 397152 303347 327215 262848
12219B62848J13808k57587k31318J75063o7284J64605J90469q1941Q3761K0593
$$ 262848 376656 119069 -112249 62814 -4470 160135 350604 268663 352424 373017
12209C73017J7353p2657o6646O571q78j28352j74038j11340L21750K41609L8963
$$ 373017 390370 317713 251067 257638 256760 128408 -45630 -156970 164780 406389 445352
12198D45352k47093m40188j26530J8407O8312K95226k44155Q8876J52119j09481
$$ 445352 198259 -241929 -368459 -350052 -281740 13486 -230669 -141793 10326 -99155
12188i9155M2744J00288j45540o4475o7077J71742Q843K6215J51595j53992k23398
$$ -99155 -56411 43877 -101663 -166138 -233215 -61473 -52630 -26415 125180 -28812 -252210
12177b52210J35837K69466K44565J59506j78982l69626n9145j30051J1895k17009
$$ -252210 -116373 153093 397658 557164 378182 8556 -50589 -180640 -168745 -385754
12167c85754j58205J05812K75808L18570n2793R7555J85506M5315l40838m4479
$$ -385754 -543959 -438147 -162339 156231 103438 200993 386499 431814 90976 46497
12157D6497J48302m6293N9100J54223q431j84757j54006O5626K13535J23286p5979
$$ 46497 194799 148506 207606 361829 353398 168641 14635 80261 293796 417082 341103
12146C41103k2753N8111q5853j19005J00546J2281O1162j7688o068J15915R5937
$$ 341103 318350 376461 290608 171603 272149 284430 345592 327904 321836 437751 533688
12135E33688k33860p734q1448J85593M0171r6064j22349q5390o3675j4872P6789
$$ 533688 299828 292094 210646 396239 436410 340346 217997 132607 68932 54060 130849
12124A30849q1401R6620n9492J32736J06007o722o8199O4175O3287Q0679K0763
$$ 130849 49448 146068 86576 219312 325319 318597 250398 314573 377860 458539 479302
12113D79302P2312j5528j44084j67397o4840P1100P1766K16519K32898p9082j96276
$$ 479302 551614 536086 392002 224605 159765 230865 302631 519150 752048 672966 476690
12102D76690j25011R9852J0321P1503K50925J72584p1121j7822J151K7772N4551
$$ 476690 351679 451531 461852 533355 784280 956864 885743 867921 869072 896844 951395
12091I51395k24891p5181j37828k57286q6302K08469P34n2388k55701K152J6318
$$ 951395 726504 651323 513495 256209 169907 378376 379110 326722 71021 73173 89491
12080H9491J66999k28801l43186J14372K16624L41610J57803J3731m004r32j51192
$$ 89491 256490 27689 -315497 -201125 15499 357109 514912 528643 524639 523707 372515
12069C72515k54497n1223n474K13035J05864P004P0173K3617q130m1937k20168
$$ 372515 118018 66795 61321 274356 380220 387224 457397 481014 472884 430947 210779
12058B10779R7860o5811O259K33923k27703r3445P1047J16613J98606M8738l4639
$$ 210779 308639 242828 249087 483010 255307 161862 232909 349522 548128 596866 562227
12047E62227n604j00771J14397j9526p3738j84146k24653N9403J57173N840j39268
$$ 562227 556623 455852 570249 550723 476985 292839 68186 127589 284762 290602 151334
12036A51334k5604J20338N3428j9233J27633L8744O6026Q8602j03678K02968J36465
$$ 151334 125730 246068 299496 280263 407896 446640 512666 601268 497590 700558 837023
12025H37023r4934P7619M40300L7225m8690j76692k34845j75632J0334J79185
$$ 837023 742089 819708 1260008 1297233 1248543 1071851 837006 661374 671708 850893
12015H50893k9096J80752M7171j40940K30784j17510l32997J30212O7878j03396
$$ 850893 821797 1002549 1049720 908780 1139564 1022054 689057 819269 887147 783751
12005G83751J613L50902J39657k39255j87652R8235j34480j50519k2265O9506
$$ 783751 785364 1136266 1275923 1036668 849016 947251 812771 662252 639987 709493
11995G09493J62042m8635j10927J05806P4863l181p565P6279P6225J05510J76691
$$ 709493 871535 822900 711973 817779 892642 889461 881896 958175 1034400 1139910 1316601
11984A316601K08952q3228J06468j50632j31647K85489J54715K8884N3808J23045
$$ 1316601 1525553 1442325 1548793 1398161 1266514 1552003 1706718 1735602 1789410 1912455
11974A912455j46533k1592j58259j13311M16839J73164L8989m5389K69467j06070
$$ 1912455 1765922 1744330 1586071 1472760 1889599 2062763 2101752 2056363 2325830 2219760
11964B219760J01491Q6100K67216J07466L5453q5708J77377J86023J20813K31123
$$ 2219760 2321251 2407351 2674567 2782033 2817486 2731778 2909155 3095178 3215991 3447114
11954C447114K55811J49954l7688J17418K52107K25941K62732L99246L28833M49406
$$ 3447114 3702925 3852879 3815191 3932609 4184716 4410657 4673389 5072635 5401468 5850874
11944E850874M65344L31765N96371M24526M88065M83510P18372N38179M67984
$$ 5850874 6316218 6647983 7244354 7668880 8156945 8640455 9358827 9897006 10364990
11935A0364990P76724J235571J253253Q36269J193998J436807J505478J760656
$$ 10364990 11141714 12377285 13630538 14466807 15660805 17097612 18603090 20363746
11927B0363746J830473K060605K102636K497202K774585L102115L498195L320562
$$ 20363746 22194219 24254824 26357460 28854662 31629247 34731362 38229557 41550119
11919D1550119L765244M206352M250715M049652L823505L694335L350887K973222
$$ 41550119 45315363 49521715 53772430 57822082 61645587 65339922 68690809 71664031
11911G1664031K403186J699458J326601J086506P0716o07995j364820j901953
$$ 71664031 74067217 75766675 77093276 78179782 78250498 77642503 76277683 74375730
11903G4375730k068448k500181k854133l235375l187990l173896l310579k871690
$$ 74375730 72307282 69807101 66952968 63717593 60529603 57355707 54045128 51173438
11895E1173438k584455k390569k158263j905782j704562j437132j019456p96738
$$ 51173438 48588983 46198414 44040151 42134369 40429807 38992675 37973219 37176481
11887C7176481p65293p95548n48093r9015K54181K60893M07826N31772R80009
$$ 37176481 36411188 35615640 35067547 34968532 35222713 35483606 35891432 36423204 37403213
11878C7403213J082695J323943J865695J930421J825571K475705K880167L302173
$$ 37403213 38485908 39809851 41675546 43605967 45431538 47907243 50787410 54089583
11870E4089583L459172L681480M471398M566363M935071N419288N682006N878875
$$ 54089583 57548755 61230235 65701633 70267996 75203067 80622355 86304361 92183236
11862I2183236N843919N721316N591640N211431M826974M039562L315085K303583
$$ 92183236 98027155 103748471 109340111 114551542 119378516 123418078 126733163 129036746
11854A29036746J743697N98112m59281j216663k010242k924649l921122m790702
$$ 129036746 130780443 131378555 130919274 129702611 127692369 124767720 120846598 116055896
11846A16055896n184590n561745n493347n435264n248488n389449n202633m769136
$$ 116055896 110871306 105309561 99816214 94380950 89132462 83743013 78540380 73771244
11838G3771244m636380m038691l459741l294249k624948k668538k141737j819970
$$ 73771244 69134864 65096173 61636432 58342183 55717235 53048697 50906960 49086990
11830D9086990j805185j437923j030464p76447j153626r08566o04064l21890j39800
$$ 49086990 47281805 45843882 44813418 44036971 42883345 41974779 41370715 41048825 40909025
11821D0909025j17339L84780O79551M56209P63040Q53381J093389J438645J745425
$$ 40909025 40791686 41176466 41856017 42312226 43075266 43928647 45022036 46460681 48206106
11812D8206106J962567K100028K250112K527655K841732K649538K557095K420880
$$ 48206106 50168673 52268701 54518813 57046468 59888200 62537738 65094833 67515713
11804F7515713K017347K091069J596146J091829Q18414N99805M0595p73788j184049
$$ 67515713 69533060 71624129 73220275 74312104 75130518 75730323 75770918 74997130 73813081
11795G3813081j446439k051652k519253k893486l152596l185082l377858l296526
$$ 73813081 72366642 70314990 67795737 64902251 61749655 58564573 55186715 51890189
11787E1890189l251209l156732k789461k524981k438591k080674k023001j743469
$$ 51890189 48638980 45482248 42692787 40167806 37729215 35648541 33625540 31882071
11779C1882071j796883j495501j205530j016408j181108j066076r47896p84450
$$ 31882071 30085188 28589687 27384157 26367749 25186641 24120565 23172669 22388219
11771B2388219q55956j110149p88974n16193n49980o83576m97451p06388p80283
$$ 22388219 21532263 20422114 19633140 19116947 18566967 17883391 17385940 16679552 15899269
11762A5899269m64226m06208o52075q41192m87824l89682k51562k91045m20324
$$ 15899269 15435043 15028835 14376760 13535568 13047744 12658062 12406500 12115455 11695131
11753A1695131q3645k48532n96448j74872J44000l59155m32529k47027k78583
$$ 11695131 11611486 11362954 10766506 10591634 10735634 10376479 9943950 9696923 9418340
11744I418340P1013k02366l43915k35225j57042k06239j81429n06790k14865l10161
$$ 9418340 9489353 9286987 8943072 8707847 8550805 8344566 8163137 7656347 7441482 7131321
11734G131321k18613k6782L912p1849j17012k01136J45979p8206m23360j00565
$$ 7131321 6912708 6885926 6889838 6817989 6700977 6499841 6645820 6567614 6144254 6043689
11724F043689P6993l2989j45044j79016k19750k21154j28297k39719j54879k50594
$$ 6043689 6120682 6087693 5942649 5763633 5543883 5322729 5194432 4954713 4799834 4549240
11714D549240j92926N6301M1878k18492k8179j22646l51005k15153J41362k92704
$$ 4549240 4356314 4412615 4454493 4236001 4207822 4085176 3734171 3519018 3660380 3367676
11704C367676J5849J36288r3220l18606K57999J28862j87338l5627j8256Q3570
$$ 3367676 3383525 3519813 3426593 3107987 3365986 3494848 3307510 3271883 3253627 3337197
11694C337197j83132N8934K7938k35787J3605o0174k07953j55362j9476N9224
$$ 3337197 3154065 3212999 3240937 3005150 3018755 2958581 2750628 2595266 2575790 2635014
11684B635014j34896K82444M4692K545j76667j47913j4684J14623K95108n8813
$$ 2635014 2500118 2782562 2827254 2829799 2653132 2505219 2490535 2605158 2900266 2841453
11674B841453R8938o046k33080j49096j88939o8363j3422J94624j91680k7963
$$ 2841453 2940391 2934345 2701265 2552169 2363230 2294867 2281445 2476069 2284389 2256426
11664B256426O3337Q957k93554M0105j26434J34493J59083K78367m0388q950l18155
$$ 2256426 2319763 2328720 2035166 2075271 1948837 2083330 2242413 2520780 2480392 2471442 2153287
11653B153287l57701j20174J70865N4307J375o9972j39286j20649j08423J20047
$$ 2153287 1795586 1675412 1846277 1900584 1901959 1831987 1692701 1572052 1463629 1583676
11643A583676J57593j08620J95329K16402m8889k76167m65273k82580m12j4508
$$ 1583676 1741269 1632649 1827978 2044380 1995491 1719324 1254051 971471 971059 956551
11633I56551p1713L53539L16477J25192J28449k92308n33698k80717L01628L10166
$$ 956551 884838 1238377 1554854 1680046 1808495 1516187 982489 701772 1003400 1313566
11623A313566J00348k72400k53278J17293l0075l5975L05079J7069r8224p6152
$$ 1313566 1413914 1141514 888236 1005529 975454 939479 1244558 1261627 1163403 1087251
11613A087251N972O5747J16527O9209m6786j1319J44857J14451L808j78830j80246
$$ 1087251 1093223 1158970 1275497 1344706 1297920 1286601 1431458 1545909 1549717 1370887 1190641
11602A190641k47351K9139j32217Q4724q3907k2428j20450J29746j31504m698
$$ 1190641 943290 972429 840212 924936 841029 818601 698151 827897 696393 691695
11592F91695K83861K0682k12201p6897J5231J53678J14518J70798k21228k45748
$$ 691695 975556 996238 784037 707140 722371 876049 990567 1161365 940137 694389
11582F94389j32976j4021l9886l9550N2038J29012Q0093j87053Q1339j21557l11385
$$ 694389 561413 547392 507506 467956 519994 649006 729099 542046 623385 501828 190443
11571A90443O9914Q789L8969J71591R0141L6914j36550j61194j5237o3153J06004
$$ 190443 260357 269146 308115 479706 569847 606761 470211 309017 293780 230627 336631
11560C36631J59565k9858q644j28850k3188m3907Q1844K2934J09565q1412L5179
$$ 336631 496196 466338 457694 328844 305656 261749 343593 366527 476092 394680 429859
11549D29859M2582o1546J90912j9215K204k29946r6364j10444m9475J56756p6778
$$ 429859 472441 410895 601807 582592 584796 354850 258486 148042 98567 255323 178545
11538A78545J26627K01829R5805n3692n6563O0872N4086J16799K35980j11245
$$ 178545 305172 507001 602806 549114 492551 553423 607509 724308 960288 849043
11528H49043j42588j76929o1469j24731k4079r268Q4414J20346r2572j96605n3764
$$ 849043 706455 529526 468057 343326 319247 309979 394393 514739 422167 225562 171798
11517A71798J77101N9121J3153R43q8709j71219r5483k6337J86740l178L45276
$$ 171798 348899 408020 421173 422116 333407 162188 66705 40368 227108 223930 569206
11506E69206J71304n7638r4492k89916o2389O9387n1573P0926J49082r3048k70978
$$ 569206 740510 682872 588380 298464 236075 305462 253889 324815 473897 380849 109871
11495A09871L2998R8891p0296K30010j56500j96264O9590n947J98284K59009k192
$$ 109871 142869 241760 171464 401474 244974 48710 118300 112353 310637 569646 567454
11484E67454o0486J01462p3044j46996r0911p9358N1976J92758J30070Q7977q5652
$$ 567454 506968 608430 535386 388390 297479 218121 270097 462855 592925 680902 595250
11473E95250k6090m4028J08962q5745J34637P2579q3289l54523m6187J00665q8475
$$ 595250 569160 525132 634094 548349 682986 755565 672276 317753 271566 372231 283756
11462B83756j27098j16815K4583J17702m081j9284P7129J46242r2552j23k951
$$ 283756 156658 39843 64426 182128 178047 158763 235892 382134 289582 289459 286508
11451B86508M127J10457l4244j83749j87218j35433L0701P8268P675K79138M7609
$$ 286508 290635 401092 366848 183099 -4119 -139552 -108851 -30583 -22908 256230 303839
11440C03839J16040m3398J71002K57444K5251k06523j73821j47075K25524L14810
$$ 303839 419879 376481 547483 804927 830178 623655 449834 302759 528283 843093
11430H43093Q9426n5998k61522p1245K46662J12599m8162j86231j69403J71364
$$ 843093 932519 876521 614999 543754 790416 903015 854853 668622 499219 670583
11420F70583j07882m19964j7703J13246P5292j71795m9890N0874K14517L4883
$$ 670583 562701 142737 125034 238280 313572 141777 91887 142761 357278 392161
11410C92161J36001o0432j37962K2159L21906J7495k4114p1962j25448j96838
$$ 392161 528162 467730 329768 351927 673833 691328 667214 595252 469804 272966
11400B72966K258L88600k09838l26842k16401j01953K52400K21809K2212j09897
$$ 272966 275224 663824 453986 127144 -89257 -191210 61190 282999 305211 195314
11390A95314m3091p1132j26593K48302j6142j40674R6727J40883j6793n9857l3743
$$ 195314 152223 81091 -45502 202800 186658 45984 142711 283594 266801 206944 173201
11379A73201n539j29035J03414J30986J33779j37704l7802j2684J68567j58009
$$ 173201 167662 38627 142041 273027 406806 269102 231300 218616 387183 229174
11369B29174P8749J38954L3313J41799L13617j90103m12368j65775J38373J31445
$$ 229174 307923 446877 480190 621989 935606 745503 333135 167360 305733 437178
11359D37178j85290K15725k2375J46564J30920j62615k28546J78470K8253J65845
$$ 437178 251888 467613 445238 591802 722722 560107 331561 510031 538284 704129
11349G04129L6334m7247k16026j49041P7097M6244j36577k8406O1841j24034n808
$$ 704129 740463 693216 477190 328149 405246 451490 314913 286507 348348 224314 218506
11338B18506n2421J62383R2461r4494n2134p9723n1889R6139K70180J64434J45373
$$ 218506 166085 328468 420929 326435 274301 194578 142689 238828 509008 673442 818815
11327H18815k27209l11779L5561Q0500k84550J28959p248k06108J41455P9792
$$ 818815 591606 279827 315388 395888 111338 240297 233049 26941 168396 248188
11317B48188K0180K5160l19972l41558J10551j8809K9546J15192P7455L3809J43519
$$ 248188 268368 293528 -26444 -368002 -257451 -276260 -246714 -131522 -54067 -20258 123261
11306A23261Q6273p819N6570P2986k95691j49833P9757m3945q1911R3792J53337
$$ 123261 209534 201715 258285 331271 35580 -114253 -34496 -78441 -160352 -66560 86777
11295H6777m7672j65581p6795J13967K1227J24635j5071k27804j06865P4555l0007
$$ 86777 39105 -126476 -203271 -89304 -68077 56558 41487 -186317 -293182 -218627 -248634
11284b48634P4731O2191l9955K5564j33399j13279N0362K76963K28588L7302p4902
$$ -248634 -173903 -111712 -151667 -126103 -259502 -372781 -322419 -45456 183132 220434 145532
11273A45532j9643l7388j59400K79648K92382p8897j28403N9702k21966J42496
$$ 145532 125889 88501 -70899 208749 501131 422234 293831 353533 131567 274063
11263B74063K29521l8499j44429N0624p6169j1987j30526k91792L8300p8411K30507
$$ 274063 503584 465085 320656 371280 295111 283124 152598 -139194 -100894 -179305 51202
11252E1202K96277j94046j02746K6782J08755p1289j49573j43364j99207j1495
$$ 51202 347479 153433 50687 77469 186224 114935 -34638 -178002 -377209 -388704
11242c88704P7429o6281K9104L12749N9806l4393K18822Q6187J72757k93090J19092
$$ -388704 -311275 -377556 -348452 -35703 24103 -10290 208532 294719 467476 174386 293478
11231B93478N8317l24679j72678J53740O4685j30071O5858Q3429j2833j91943
$$ 293478 351795 27116 -145562 8178 72863 -57208 8650 92079 79246 -112697
11221a12697m095J30885m3386p3327l2532n4902M4913L44611M1758q1764j38886
$$ -112697 -116792 14093 -29293 -102620 -135152 -190054 -145141 199470 241228 159464 20578
11210B0578P3425J22074j12955k07082M0124k93008m3801Q5873L39897R0912l02441
$$ 20578 94003 216077 103122 -103960 -63836 -356844 -400645 -314772 25125 116037 -186404
11199a86404R187R5756K05874j675j17695M6183n5669l7652k68686j4651K47540
$$ -186404 -177217 -81461 124413 122738 5043 51226 -4443 -42095 -310781 -325432 -77892
11188g7892J46870j642J41876K72007N2048k33937j55069p4591Q9391J36062q5027
$$ -77892 68978 67336 209212 481219 533267 299330 144261 69670 159061 295123 210096
11177B10096k0049J09649j33733j78184L8208j51613R5055J77331j06389k19414
$$ 210096 190047 299696 165963 -12221 25987 -125626 -30571 146760 40371 -179043
11167a79043j58582m7388r564J99531M3031Q7482M05058j76702j40508M9991R0693
$$ -179043 -337625 -385013 -394577 -195046 -152015 -64533 340525 163823 23315 73306 163999
11156A63999j000k03125J23937k5607m3706j60855k62646R2211K64706k14371
$$ 163999 162999 -40126 83811 58204 14498 -146357 -409003 -316792 -52086 -266457
11146b66457p4897P8270K56336J04172j20988J4047j06228R767j85572n8815Q4637
$$ -266457 -341354 -263084 -6748 97424 -23564 -9517 -115745 -105978 -291550 -350365 -265728
11135b65728k917Q7815K01385J07482j04915l44689j9275K66455K39755j38080
$$ -265728 -268645 -180830 20555 128037 23122 -321567 -340842 -74387 165368 27288
11125B7288k4806K4459K00963k871j12942l22222j04801J66020J24193J79419
$$ 27288 2482 26941 227904 225033 112091 -210131 -314932 -148912 -24719 154700
11115A54700k68101l1695K28663R4899p3904k70412j45845J61719J77322L2539
$$ 154700 -113401 -145096 83567 178466 104562 -165850 -311695 -149976 27346 59885
11105E9885r4734J29434J56008k17223m38274r4377L14350J82069k32723j88100
$$ 59885 -34849 94585 250593 33370 -404904 -499281 -184931 -2862 -235585 -423685
11095d23685R435K59121K56291p3551K7929j2615j6533M4148O8444L54144k75523
$$ -423685 -414250 -155129 101162 27611 55540 42925 26392 70540 138984 493128 217605
11084B17605k60354M4802j35628o2547o2023J97268Q3084j5931p9310j32337p0334
$$ 217605 -42749 2053 -133575 -196122 -258145 -60877 22207 6276 -73034 -205371 -275705
11073b75705k6785J5104R1157J26008J50813J60232J06608o9591J91583j1829
$$ -275705 -302490 -287386 -196229 -70221 80592 240824 347432 277841 469424 457595
11063D57595j47440j05270J2226O1272k04656j43654n5944J09506j9058k93512
$$ 457595 310155 204885 217111 278383 73727 -69927 -125871 -16365 -35423 -328935
11053c28935l265j086m2710J66604J8450K15147k3013l7753O6261j22089j08468
$$ -328935 -332200 -333286 -375996 -209392 -190942 24205 1192 -36561 29700 -92389 -200857
11042b00857K63229K1389k774J45988J07943j07022j56266j96723N467j13530
$$ -200857 62372 83761 80987 226975 334918 227896 71630 -125093 -119626 -233156
11032b33156Q846J48757K73923P0598k90689j40012O7652m2785o5286R0062J36391
$$ -233156 -224310 -75553 198370 268968 -21721 -161733 -94081 -136866 -202152 -112090 24301
11021B4301J01026J64807K17809j35349k16581k24322J72127J07671j7691n2155
$$ 24301 125327 290134 507943 372594 156013 -68309 103818 211489 193798 141643
11011A41643m7189M3707K54500N643k27183j13553O9033J53930q1711l8494M1781
$$ 141643 94454 138161 392661 398304 171121 57568 126601 280531 198820 160326 202107
11000B02107O8141o8212j09246j17860P9246J0677J50435j21664R0427N7037O6936
$$ 202107 270248 202036 92790 -25070 54176 64853 215288 93624 184051 241088 308024
10989C08024K0604n8313j29747k21662R8629L05027R0071J99143k2315k87014
$$ 308024 328628 270315 140568 -81094 17535 322562 412633 611776 589461 302447
10979C02447Q8003K97438j0896k74229k01167j52392k7840R9685J61060K85559
$$ 302447 390450 687888 676992 402763 201596 49204 21364 121049 282109 567668
10969E67668j6066r9096l81798q9425L5463J05238J48451o1535r423N8843k10054
$$ 567668 551602 452506 70708 -18717 16746 121984 270435 208900 199477 258320 48266
10958D8266r1575p196j95701k25641J31459p8610n7215J29669J31019J58003J98484
$$ 48266 -43309 -50505 -246206 -471847 -340388 -418998 -476213 -346544 -215525 -57522 140962
10947A40962Q8767k0406L3477J40922j69832l5491o3551j82116M19701K19733
$$ 140962 229729 209323 242800 383722 213890 178399 114848 -67268 352433 572166
10937E72166K1746k72660p3796Q6534P2285K7328k53074k63462L280K5513J12175
$$ 572166 593912 321252 247456 333990 406275 433603 180529 -82933 -79653 -54140 58035
10926E8035k5842j58423O5195K18204j24038L7638j03839q9822j35062o7118L5647
$$ 58035 32193 -126230 -61035 157169 33131 70769 -33070 -122892 -257954 -325072 -289425
10915b89425J57194J14443N2492Q817K33033J16211p593Q808k51532p2517j30197
$$ -289425 -132231 -17788 34704 43521 276554 392765 385172 393980 142448 69931 -60266
10904f0266j48764O5889K17533L83656M4553Q283J4282r2571R298k53426n6339
$$ -60266 -209030 -143141 74392 458048 502601 510884 525166 432595 441893 188467 132128
10893A32128K51232n6548k94208j414L01026K01668j32709j48127q8954n3926
$$ 132128 383360 326812 32604 31190 332216 533884 401175 253048 164094 110168
10883A10168q1310n3124J50847j03218j53547J3724k4224n7546J36084K17105
$$ 110168 28858 -24266 126581 23363 -130184 -116460 -140684 -198230 -62146 154959
10873A54959p8361R7301K4526O0130J1028K58969k71700l44000P3378q3160J80064
$$ 154959 76598 173899 198425 258555 269583 528552 256852 -87148 -13770 -96930 83134
10862H3134J05007J74009J28437k10044j62787l1625P6729J16825n0217N5597
$$ 83134 188141 362150 490587 280543 117756 86131 162860 279685 229468 285065
10852B85065O3965j87920L6880k0443r4212P0321M7029R7069p915K51413J24157
$$ 285065 349030 161110 197990 177547 83335 153656 200685 297754 289839 541252 665409
10841F65409j12396l26439m8552m3097M7416j82146j97406N7819K14303K81512
$$ 665409 553013 226574 178022 134925 182341 195 -197211 -139392 74911 356423
10831C56423K0599k16650j77019k56304k3357K57484J98090J61574j1326J9379
$$ 356423 377022 160372 -16647 -272951 -296308 -38824 159266 320840 309514 328893
10821C28893n8104J11343J85307J23459j87055k71145k14767J07756J1352J1663
$$ 328893 270789 382132 567439 690898 503843 232698 17931 125687 137039 148702
10811A48702M46684J61570j15652n9661P371k1960j67279m2713m8425r4229q1564
$$ 148702 595386 756956 641304 581643 589014 567054 399775 357062 308637 214408 132844
10800A32844K6318M8763m3910o0649P3436K4745r591J67214j09997k01118k79230
$$ 132844 159162 207925 164015 103366 176802 201547 191956 359170 249173 48055 -231175
10789b31175j81800P1465J83301K69576J41147m1695J54818K7201J70452M4596
$$ -231175 -412975 -341510 -158209 111367 252514 210819 365637 392838 563290 607886
10779F07886k25661J245N6016N7910k56108j89534K2035o3980k3782L28041r201
$$ 607886 382225 383470 439486 497396 241288 51754 73789 9809 -13973 314068 304867
10768C04867j42214j35319j4323J11413l1337n2912M9734M54909J41367k13402
$$ 304867 162653 27334 13011 124424 93087 40175 89909 544818 686185 472783
10758D72783l6603R7389K485j05262k97495j09190n1772n6951J14384L34508L4953
$$ 472783 436180 533569 536054 430792 133297 24107 -27665 -84616 29768 364276 399229
10747C99229j85303R87K07682j51609J12399J58432o2761k2962n0501P7671m0763
$$ 399229 213926 214913 422595 270986 383385 541817 479056 456094 405593 483264 442501
10736D42501J1227L056j434J70942p2579M1374K97000j12705j50852J95176J4801
$$ 442501 453728 456784 455350 626292 553713 595087 892087 779382 628530 823706 838507
10725H38507l49237j11475k20940j34050J64511M4635q3778N7155k1923k24948
$$ 838507 489270 377795 156855 22805 187316 231951 148173 205328 183405 -41543
10715d1543Q8837O0706K50705K30022M6966J24343Q3156j42013k42802j88180
$$ -41543 47294 108000 358705 588727 635693 760036 843192 701179 458377 270197
10705B70197N5887L40328L6414j51307j34823K4268L3399R2372P5579J0516M6041
$$ 270197 326084 666412 702826 551519 416696 440964 474363 566735 642314 652830 698871
10694F98871N6412m2764K701L8134j77796j0653O6741J56808p7455q3608J25663
$$ 698871 755283 712519 715220 753354 575558 564905 631646 788454 710999 627391 753054
10683G53054J33787r6325k83119j59532J56155L06680k8935K7362r4987j2067
$$ 753054 886841 790516 507397 347865 504020 810700 781765 809127 714140 702073
10673G02073K54560k6105l55282j54609L17109L62592j5066k46327R6188M2419
$$ 702073 956633 930528 575246 420637 737746 1100338 1085272 838945 935133 977552
10663I77552J90888J69753p8762J5961q2130o8020J17699K65498M11200J87109
$$ 977552 1168440 1338193 1259431 1275392 1193262 1125242 1242941 1508439 1919639 2106748
10653B106748k9966P4594K68658K70716O4628j99537j83408k0408R4964K18407
$$ 2106748 2076782 2151376 2420034 2690750 2755378 2555841 2372433 2352025 2446989 2665396
10643B665396j41556j93260j27792J0697r781k1741j18864m0878n2546k12749
$$ 2665396 2523840 2330580 2202788 2213485 2203704 2181963 2063099 2022221 1969675 1756926
10633A756926k49817O054M094L2780k00143J86171J20081J03458j90879k87510
$$ 1756926 1507109 1513163 1517257 1550037 1349894 1536065 1656146 1759604 1568725 1281215
10623A281215j49537J42481r09j22044M2730K46338r6983k07596O529k6572K07895
$$ 1281215 1131678 1274159 1273250 1151206 1193936 1440274 1343291 1135695 1142224 1115652 1323547
10612A323547J10076o0104J29816q4429q3392K48288j59194j89649m9012J70190
$$ 1323547 1433623 1373519 1503335 1418906 1335514 1583802 1424608 1234959 1185947 1356137
10602A356137j10728K00647J3869q5803j34168n8399Q8614j66114j71006L7462
$$ 1356137 1245409 1446056 1459925 1374122 1239954 1181555 1270169 1104055 933049 970511
10592I70511L58070K01101J82047J2470k32501j55475J24688L6802o0332q3334
$$ 970511 1328581 1529682 1711729 1724199 1491698 1336223 1460911 1497713 1437381 1354047
10582A354047j49638k50450n1009K55776J42072j70513O0549P371K6334q2990
$$ 1354047 1204409 953959 902950 1158726 1300798 1130285 1190834 1198205 1224539 1141549
10572A141549k83319O4215J44886L6458K42094P6216J29554J98956O6610L9335
$$ 1141549 858230 922445 1067331 1103789 1345883 1422099 1551653 1750609 1817219 1856554
10562A856554P821k16858j29935j40366K22855m5856j60295j9764Q0561N5144
$$ 1856554 1864375 1647517 1517582 1377216 1600071 1554215 1393920 1374156 1454717 1509861
10552A509861K9853J5570j94890j15322L3933L09126J92147l6287k77593k22522
$$ 1509861 1539714 1555284 1360394 1245072 1279005 1588131 1780278 1743991 1466398 1243876
10542A243876j07795L1255J4086k4070L5192J03873j09202j09254j52427j20234
$$ 1243876 1136081 1167336 1181422 1157352 1192544 1296417 1187215 1077961 925534 805300
10532H05300K42181J36247P0738q7906o4986J12674K35279K09810m9963k60092
$$ 805300 1047481 1183728 1254466 1166560 1101574 1214248 1449527 1659337 1609374 1349282
10522A349282j2219P3705Q9329n4801j0745N6509K25514j42095q8039K28754j7822
$$ 1349282 1337063 1410768 1500097 1445296 1434551 1491060 1716574 1574479 1486440 1715194 1697372
10511A697372J02941K32834j42438o7517K6013k9609J36410J23620N5122J37447
$$ 1697372 1800313 2033147 1890709 1823192 1849205 1819596 1956006 2079626 2134748 2272195
10501B272195q0360j44697j25516j41887J45335J11665P0773j43738l15621R4532
$$ 2272195 2191835 2047138 1921622 1779735 1925070 2036735 2107508 1963770 1648149 1742681
10491A742681J47071P7051j12863K11398J61507R2238l38694q5842P6815j56263
$$ 1742681 1889752 1966803 1853940 2065338 2226845 2319083 1980389 1894547 1971362 1815099
10481A815099K32633O015N0945J40184Q963q0192j802j25678p307j8916J67780
$$ 1815099 2047732 2053747 2104692 2244876 2253839 2173647 2171845 2046167 2038860 2019944 2187724
10470B187724K2048R4930J79621J7565j30487k41468q0072N1926Q4465o7375j75465
$$ 2187724 2209772 2304702 2484323 2501888 2371401 2129933 2049861 2101787 2186252 2118877 1943412
10459A943412O2170R9846J09611j20254K9236L9783K99635L15414P1369k56246
$$ 1943412 2005582 2105428 2215039 2094785 2124021 2163804 2463439 2778853 2850222 2593976
10449B593976j76072q8094P3232l0414l9215n7351K46992J91222K6526k19809
$$ 2593976 2417904 2329810 2403042 2372628 2333413 2276062 2523054 2714276 2740802 2520993
10439B520993k83718q863O3659m3579r2591K34522p5633R8250j65676q0184k16308
$$ 2520993 2237275 2228412 2292071 2248492 2155901 2390423 2314790 2413040 2247364 2167180 1950872
10428A950872k11598k8153L6228m0568R1578n3952n6641J61450J44671K53659
$$ 1950872 1739274 1711121 1747349 1706781 1798359 1744407 1687766 1849216 1993887 2247546
10418B247546J74544j13663j44944J00230J10996J03757j53253n1716L3344R2503
$$ 2247546 2422090 2308427 2163483 2263713 2374709 2478466 2325213 2273497 2306841 2399344
10408B399344j46961o5825j24069J33348K96714M18553L25151o7417j34848j85312
$$ 2399344 2252383 2186558 2062489 2195837 2492551 2911104 3236255 3168838 3033990 2848678
10398B848678Q1372J15888q4439j98526J00843J63404J12907j03460K12098J82486
$$ 2848678 2930050 3045938 2961499 2762973 2863816 3027220 3140127 3036667 3248765 3431251
10388C431251K57590K34179p3359k36481k29100K90398L10583J92372j12304M4702
$$ 3431251 3688841 3923020 3849661 3613180 3384080 3674478 3985061 4177433 4065129 4109831
10378D109831M8020K59182J67881N3541p8693j80829J47108Q5152j49364K3665
$$ 4109831 4157851 4417033 4584914 4638455 4559762 4378933 4526041 4611193 4461829 4485494
10368D485494l0430j05151L17250K01128n7062O6666J10836J08545K17452L76300
$$ 4485494 4455064 4349913 4667163 4868291 4811229 4877895 4988731 5097276 5314728 5691028
10358E691028L58638j936L9237q7956j96379P9432K28888l5509l54314o2084L76460
$$ 5691028 6049666 6047730 6086967 5999011 5802632 5882064 6110952 6075443 5721129 5659045 6035505
10347F035505M19573l8591J02906J70810P9178p5049o0853J79998L24073N9519
$$ 6035505 6455078 6416487 6519393 6690203 6769381 6694332 6633479 6813477 7137550 7197069
10337G197069K0348J94315L33543L45636J14039j2998K62681K67853P0790l03529
$$ 7197069 7217417 7411732 7745275 8090911 8204950 8191952 8454633 8722486 8793276 8489747
10327H489747N3011K31223L71091N24191J43031J56258R3341m2831P5669M10903
$$ 8489747 8542758 8773981 9145072 9669263 9812294 9968552 10061893 10019062 10094731 10505634
10317A0505634L84582L50719K43331J15724M00592L84732L24235J61685L18486
$$ 10505634 10890216 11240935 11484266 11599990 12000582 12385314 12709549 12871234 13189720
10308A3189720L01647L58570M12877K83920L65237N21798N94056O83280M58819
$$ 13189720 13491367 13849937 14262814 14546734 14911971 15433769 16027825 16711105 17169924
10299A7169924K16355L49470N24858P11591N70725O24192R46909O29080O58560
$$ 17169924 17386279 17735749 18260607 18972198 19542923 20167115 21114024 21743104 22401664
10290B2401664O19026R30986Q67133J006064J139072J054314J053656J177927
$$ 22401664 23020690 23951676 24818809 25824873 26963945 28018259 29071915 30249842
10282C0249842J624765J354479J172692J717766J895547J851821J980074K106251
$$ 30249842 31874607 33229086 34401778 36119544 38015091 39866912 41846986 43953237
10274D3953237K580256K550664K497253K864981L355719M011084L945284M191832
$$ 43953237 46533493 49084157 51581410 54446391 57802110 61813194 65758478 69950310
10266F9950310M614779M958202N556067O095711O648271P236274P936697Q923960
$$ 69950310 74565089 79523291 85079358 91175069 97823340 105059614 112996311 121920271
10258A21920271R857368J0770330J1999257J2826037J4231142J5403002J6600814
$$ 121920271 131777639 142547969 154547226 167373263 181604405 197007407 213608221
10251B13608221J7497215J8428742J9006765J8861164J8261372J7008015J4533533
$$ 213608221 231105436 249534178 268540943 287402107 305663479 322671494 337205027
10244C37205027J1258894P497057L358015j266839n563154r393237j2746283j4801829
$$ 337205027 348463921 355960978 359318993 358052154 352489000 343095763 330349480 315547651
10236C15547651j5658613j6586694j6753935j6507596j5848941j4895283j3567568
$$ 315547651 299889038 283302344 266548409 250040813 234191872 219296589 205729021
10229B05729021j2572232j1501687j0626443r507161q675749p978536p363005
$$ 205729021 193156789 181655102 171028659 161521498 152845749 144867213 137504208
10222A37504208o812669o308439n556076m970260m636462m675332m282413l828902
$$ 137504208 130691539 124383100 118827024 113856764 109220302 104544970 100262557 96433655
10214I6433655l453839l371765k716959k374061k152522j529079j498220j364401
$$ 96433655 92979816 89608051 86891092 84517031 82364509 80835430 79337210 77972809
10206G7972809q55476o39117j043312j169178j672849k502293k818960l061715
$$ 77972809 77117333 76478216 75434904 74265726 72592877 70090584 67271624 64209909
10198F4209909l566665l406080k742823k619975k506036k154683k035355j823963
$$ 64209909 60643244 57237164 54494341 51874366 49368330 47213647 45178292 43354329
10190D3354329j908960j650663j375125j115174j216660j177631j098118j136775
$$ 43354329 41445369 39794706 38419581 37304407 36087747 34910116 33811998 32675223
10182C2675223j096455r09984p59463q61133j130315j147713q48741o41191p04280
$$ 32675223 31578768 30668784 29909321 29048188 27917873 26770160 25921419 25280228 24575948
10173B4575948q16932q19505n89908o69664l22360k95706l81272n72612q44500
$$ 24575948 23759016 22939511 22349603 21679939 21357579 21061873 20680601 20107989 19263489
10164A9263489p17400o32235l57375m03354m94726l52146k60088m66793o73000
$$ 19263489 18546089 17913854 17556479 17153125 16658399 16306253 16046165 15579372 14906372
10155A4906372m99124j21373m34394n29869m12909m79379m57581l05393j5380
$$ 14906372 14407248 14285875 13851481 13321612 12908703 12429324 11971743 11666350 11650970
10146A1650970j04435k08167j39703k35777l32762m66089k68670k38617J6517
$$ 11650970 11546535 11338368 11198665 10962888 10630126 10164037 9895367 9656750 9673267
10137I673267j5581k22979l18134Q886k550j18219p6578N8203N5866J35636n0873
$$ 9673267 9657686 9434707 9116573 9125459 9122909 9004690 8928112 8986315 9042181 9177817 9126944
10126I126944R951j10869n96454m11112l73700m62425l68785k97440k24387l82552
$$ 9126944 9136895 9026026 8429572 8018460 7644760 7182335 6813550 6516110 6291723 5909171
10116E909171j10353k66159l40856o6471j15492r1708k57118l54843l1475K53314
$$ 5909171 5798818 5532659 5191803 5125332 5009840 4918132 4661014 4306171 4274696 4528010
10106D528010j11583l25925j06375R1873l7587j64577L89186O6275m10386l14309
$$ 4528010 4416427 4090502 3984127 4076000 4038413 3873836 4263022 4329297 3918911 3604602
10096C604602k96397k3308m4450j42918K20153K07446k51245n3447K06937p2375
$$ 3604602 3308205 3284897 3240447 3097529 3317682 3525128 3273883 3220436 3427373 3354998
10086C354998j02959K70164J87258j99837k97528o9149J02597J35000j47578o2827
$$ 3354998 3252039 3522203 3709461 3509624 3212096 3142947 3245544 3380544 3232966 3170139
10076C170139j72373M7364M3893M2435n1500J1380j37711j99343K9273j10204
$$ 3170139 2997766 3045130 3089023 3131458 3079958 3091338 2953627 2754284 2783557 2673353
10066B673353N3707J64874O331Q5338O9873j61233K438K10524j69608K12156J76820
$$ 2673353 2727060 2891934 2898265 2983603 3053476 2892243 2894681 3105205 2935597 3147753 3324573
10055C324573K76584K20083l8091M8451P08113P96811O98240L91777k49259n45736
$$ 3324573 3601157 3821240 3783149 3831600 4539713 5336524 6034764 6426541 6177282 5631546
10045E631546q53513r94817p29612m72120l35646k76425k30575L2887N4288R0951
$$ 5631546 4778033 3783216 3053604 2581484 2245838 1969413 1738838 1771725 1826013 1916964
10035A916964j62539k55951O1622J01696R0942j19633r2544l6605J78782Q9337
$$ 1916964 1754425 1498474 1560096 1661792 1752734 1633101 1540557 1503952 1682734 1772071
10025A772071K9560R4139j59724j13737n0704j28503k06128k17980J49539L05951
$$ 1772071 1801631 1895770 1736046 1622309 1571605 1443102 1236974 1018994 1168533 1474484
10015A474484J20383p8192j58020k37566k73858K66728J96849K5794j4351j81297
$$ 1474484 1594867 1516675 1358655 1121089 847231 1113959 1310808 1336602 1322251 1140954
10005A140954j10934J77324J72424m10915l0675J13497O8761j27510J5722k655
$$ 1140954 1030020 1207344 1379768 968853 938178 1051675 1120436 992926 1008648 1005993
9995A005993j22702J78601J69692p5943k61491k25185j90655K1302J3697J80670
$$ 1005993 883291 1061892 1231584 1155641 894150 668965 478310 499612 513309 693979
9985F93979J6870j42633O0631j19141r2267j95882K12309L41824J2645m2191K31817
$$ 693979 710849 568216 628847 509706 417439 221557 433866 775690 788335 746144 977961
9974I77961K4727k79707K7322O0890j47295q7343K1626j36444j8738O7464J37743
$$ 977961 1002688 722981 750303 811193 663898 576555 598181 461737 442999 510463 648206
9963F48206J85787j59064p4719K5350k79377J45933K37720j08413k03598J23588
$$ 648206 833993 674929 600210 625560 346183 492116 729836 621423 417825 541413
9953E41413J21300j18955j29833j89703k6877j04522J3368L13091L16506J41832
$$ 541413 662713 543758 413925 224222 197345 92823 106191 419282 735788 877620
9943H77620j79580j28324J69116Q8944n7088j42138k64581k27066M1259j8647
$$ 877620 698040 569716 738832 827776 770688 628550 363969 136903 178162 159515
9933A59515j723K01823M7156O9947p0745j53062J55160M37192J01616m34337l58878
$$ 159515 157792 359615 406771 476718 405973 252911 408071 845263 946879 512542 153664
9922A53664L2201Q7175Q9211J4741K7518K46653L54011m6844q6876j5685k24536
$$ 153664 185865 273040 362251 376992 404510 651163 1005174 958330 871454 855769 631233
9911F31233p1447Q2956k41308j60593J98669k12773r5375l818Q9094n29k2213
$$ 631233 559786 642742 401434 240841 439510 226737 131362 127544 216638 216109 193896
9900A93896q046J29981K96415K11086k02564O017J33140N8618o5502Q6707j31602
$$ 193896 185850 315831 612246 823332 620768 626785 759925 818543 753041 839748 708146
9889G08146k85959k83803K26319Q4055j01722J7620q098l2469q8952k36922J18487
$$ 708146 422187 138384 364703 448758 347036 364656 356558 324089 235137 -1785 116702
9878A16702k3070j31972j2683L9106J94071n246j31967j47223L4868R9544K21842
$$ 116702 93632 -38340 -51023 -11917 182154 176908 44941 -102282 -67414 32130 253972
9867B53972J59921j41709J58196J37699N0085r069P6806J65375O8911j41156q1219
$$ 253972 413893 272184 430380 568079 618164 609095 685901 851276 920187 779031 697812
9856F97812L2081J86182M6463k3030p4312l8813J60566j43238l04530J66116L32759
$$ 697812 729893 916075 962538 939508 865196 826383 986949 843711 539181 705297 1038056
9845A038056Q7076J54122K55320j2921k9904J61738K18452O5703m4505J2120O8322
$$ 1038056 1125132 1279254 1534574 1521653 1491749 1653487 1871939 1937642 1893137 1905257 1973579
9834A973579N3406K5613n6406o5714k64330m0920K2344m9725j79631J10257J36563
$$ 1973579 2026985 2052598 1996192 1930478 1666148 1625228 1647572 1597847 1418216 1528473 1665036
9823A665036k4621k05155m5741j31350k4421J36884R5896j69668k18830j09471
$$ 1665036 1640415 1435260 1389519 1258169 1233748 1370632 1466528 1296860 1078030 968559
9813I68559K8926j08330N5057j7498p2122j73078k48497l3239J04827K71757J75330
$$ 968559 997485 889155 944212 926714 854592 681514 433017 399778 504605 776362 951692
9802I51692k0448j29551p7823r7469k13065L6533P0217j87293N1624J04940J15657
$$ 951692 931244 801693 723870 626401 413336 449869 520086 332793 384417 489357 605014
9791F05014Q5699P2844k40412m4816L5637k12045j51909P2841l5706k97095R4551
$$ 605014 690713 763557 523145 478329 513966 301921 150012 222853 187147 -109948 -15397
9780a5397J97106L7001o1019J89475j15855m6907O5334L7733O7597l31523J3036
$$ -15397 181709 218710 157691 347166 231311 184404 249738 287471 355068 23545 36581
9769C6581J05603J12100p2648K7004Q9442J97071m7102p6445r3839J1200j93402
$$ 36581 142184 254284 181636 208640 298082 495153 448051 371606 277767 288967 95565
9758I5565n7511K76286J7728j58981J8593n4558j29922j19175j9558Q2328j72945
$$ 95565 38054 314340 332068 173087 191680 137122 7200 -111975 -131533 -49205 -222150
9747b22150O9769J36039K6178j5396J1098K23692K12844j79218j69988o5362K31633
$$ -222150 -152381 -16342 9836 -5560 5538 229230 442074 262856 92868 27506 259139
9736B59139J55406N8336k63417j35208j92321j50640O1478N7152J23861m3639
$$ 259139 414545 472881 209464 74256 -118065 -268705 -207227 -150075 -26214 -69853
9726f9853j62377R8272L16342J34088k26065k2981J54510J76936j38867j8768
$$ -69853 -232230 -133958 182384 316472 90407 67426 221936 398872 260005 241237
9716B41237q6536k08656K24282K1625j92649r2429J02717j4611K64557P6523k30918
$$ 241237 154701 -53955 170327 191952 -697 -93126 9591 -5020 259537 336060 105142
9705A05142l550k26635J47746J89445q8444m9508k94731k29191N7374j33239K29005
$$ 105142 101592 -125043 22703 212148 123704 74196 -220535 -449726 -392352 -525591 -296586
9694b96586L05654R0398j31874k02124J63661K19430p8410J11798K08317j05853
$$ -296586 9068 99466 -32408 -234532 -70871 148559 70149 181947 390264 284411
9684B84411l9707j21005p523M0644J93076J93571j45807l31987K7277M3808p569
$$ 284411 244704 123699 116176 156820 349896 543467 397660 65673 92950 136758 129189
9673A29189l5866P6308L8757k26069k23092n277P3184J29095P6520J23120j55317
$$ 129189 93323 169631 208388 -17681 -240773 -246050 -172866 -43771 32749 155869 552
9662E52j02940m9374J44057M07641L00222j50654j80357k10358k44546J16364
$$ 552 -102388 -151762 -7705 399936 700158 549504 369147 158789 -85757 30607
9652C0607J03166j8552r1121j00887P696O3280K22902K62257j19096m9275k05507
$$ 30607 133773 115221 24100 -76787 -69091 -5811 217091 479348 360252 310977 105470
9641A05470J3862Q4003L2739j0310r1043j88445o9291r9056K09009J91788M8126
$$ 105470 119332 203335 236074 225764 134721 -53724 -123015 -222071 -13062 178726 226852
9630B26852O1761p3352N6069L6489j74775J03707K2537l8158p0381k47826M4226
$$ 226852 288613 215261 271330 307819 133044 236751 259288 221130 150749 -97077 -52851
9619e2851j20836j0137j18559k0450j2736K5677K1018R5944J6226J06967l2091
$$ -52851 -173687 -183824 -302383 -322833 -335569 -309892 -288874 -192930 -176704 -69737 -101828
9608a01828j25245K28879m137l5759M1727J17534l36180n6055J45371M6439N8120
$$ -101828 -227073 1806 -2331 -38090 3637 121171 -215009 -271064 -125693 -79254 -21134
9597b1134J88211j6454l10941j77209r9051K67221L71372j25734j83479K022j88006
$$ -21134 167077 150623 -160318 -337527 -436578 -169357 202015 76281 -107198 -105176 -293182
9586b93182o1621J42722J30483q9196J1030P835j21370P8268n3879J98670k30091
$$ -293182 -354803 -212081 -81598 -170794 -159764 -151929 -273299 -195031 -248910 -50240 -280331
9575b80331n5247K09744J1302O3053j31518m451R8757j11035j38038J66175K29765
$$ -280331 -335578 -125834 -114532 -51479 -182997 -187448 -88691 -199726 -337764 -171589 58176
9564E8176j13711n2054L31691j78167L120p165j69953l8668J68781K0770J65396
$$ 58176 -55535 -107589 224102 45935 49055 41890 -128063 -166731 2050 22820 188216
9553A88216q3913j45401k00372K23031K03553j59575R156J00807k15608j73890
$$ 188216 104303 -41098 -241470 -18439 185114 25539 34695 135502 -80106 -253996
9543b53996r2145j1463j8122L4638K67781J15717K06763n7881J39118j38661o4311
$$ -253996 -346141 -357604 -375726 -341088 -73307 42410 249173 191292 330410 191749 127438
9532A27438j88906r316L5259k14315j36750O7388Q9532j06992l641J41040K75893
$$ 127438 -61468 -70784 -35525 -249840 -386590 -319202 -229670 -336662 -340303 -199263 76630
9521G6630j09298l19093j56465k7875L23371L1624K08778J65693r1296n8464j03005
$$ 76630 -32668 -351761 -508226 -536101 -212730 -181106 27672 193365 102069 43605 -59400
9510e9400K234J46716O4908J09164p5179k98411j3029K29119L6392M7539K17867
$$ -59400 -57166 89550 154458 263622 188443 -109968 -122997 106122 142514 190053 407920
9499D07920o6982j8254j00301l36918o4225r732K0263j28616O970J86522N788
$$ 407920 340938 322684 222383 -114535 -178760 -188492 -168229 -296845 -289875 -103353 -97565
9488i7565Q4744j6544k25293k31798L11L90497K15111n6390k22893J69649j87647
$$ -97565 -12821 -29365 -254658 -486456 -486145 -95648 119463 63073 -159820 9829 -177818
9477a77818J6576K92580j38722P841k8203R1469L3955k03250L6635N951L7428
$$ -177818 -161242 131338 -7384 457 -27746 63723 97678 -105572 -68937 -62986 -25558
9466b5558J15760R1278J31113j93881P4641R9001r3277l45816k40493J24090M3647
$$ -25558 90202 181480 312593 118712 193353 292354 199077 -146739 -387232 -263142 -219495
9455b19495j04271j15101K00421k65930J27689L23462J39186j28681O1460j85573
$$ -219495 -323766 -438867 -238446 -504376 -376687 -53225 85961 -42720 18740 -166833
9445a66833j80823K62802l9284k38553J33473L72695j76605m9968P5915m2732
$$ -166833 -347656 -84854 -124138 -362691 -229218 143477 -33128 -83096 -7181 -49913
9435d9913n721p1681J46320J22284o2752j4590k5236P8229J79220j57013j45251
$$ -49913 -55634 -127315 19005 141289 78537 63947 38711 116940 296160 139147 -6104
9424f104L0405K33815j90553k8136k4155J04645j28203J05996p2805m9538J8732
$$ -6104 24301 258116 67563 39427 15272 119917 -8286 97710 24905 -24633 -5901
9413e901j27924J5673J55166J87406k9599O4722j49612k50967R5211J56123R1609
$$ -5901 -133825 -118152 37014 224420 194821 259543 109931 -141036 -45825 110298 201907
9402B01907r8652K83355k14985j60162P1994L5906j11329K0815N7851M1881j41005
$$ 201907 103255 386610 171625 11463 83457 119363 8034 28849 86700 128581 -12424
9391a2424l03295O4188m6008J53530N2372j128O2866J11272J22169l32825K6012
$$ -12424 -315719 -251531 -297539 -144009 -91637 -92765 -29899 81373 203542 -129283 -103271
9380a03271J38209K28635J10549L0978j31814j11467q6945P2533J7382L3062J5327
$$ -103271 34938 263573 374122 405100 273286 161819 74874 147407 164789 197851 213178
9369B13178J60698j18308n9899L7765N4787j20040l69675j50100J1013J13151
$$ 213178 373876 255568 195669 233434 288221 168181 -201494 -351594 -340581 -227430
9359b27430R629K54792J44989K1916j22027J40973J742l1541M3499O0690J96005
$$ -227430 -217801 36991 181980 203896 81869 222842 224584 193043 236542 297232 493237
9348D93237L3882O2461r515K36981j66911l46464l64903k09896p2128K79337k6558
$$ 493237 527119 589580 580065 817046 650135 303671 -61232 -271128 -343256 -63919 -90477
9337i0477j14579J2934l5886J49492m4436J33247K16995J27535k32687k05943
$$ -90477 -205056 -192122 -228008 -78516 -122952 10295 227290 354825 122138 -83805
9327h3805o3552j26648K684K02395J45150Q6716J15938J0726k28087l1542J49306
$$ -83805 -147357 -274005 -271321 -68926 76224 162940 278878 289604 61517 29975 179281
9316A79281J46592L8782j9752n9889R886k98018j69711o9801r9546k10567j06072
$$ 179281 325873 364655 344903 285014 294900 -3118 -172829 -242630 -342176 -552743 -658815
9305f58815L5594n7216R1155p5682J05363L22624J00206J49219J6929q4728m9794
$$ -658815 -623221 -680437 -589282 -664964 -559601 -236977 -136771 12448 29377 -55351 -105145
9294a05145J21031o8633j56779R3963l2284M671J07378J52304l1085J49008M140
$$ -105145 15886 -52747 -209526 -115563 -147847 -143176 -35798 116506 85421 234429 238569
9283B38569j42420l3462J44610J61725k86668J0970l8810P9572L9740q0766J95186
$$ 238569 96149 62687 207297 369022 82354 93324 54514 134086 173826 93060 288246
9272B88246K60934m9078j84155j2329j54249j59373M8333K34960j16559L0592
$$ 288246 549180 500102 315947 303618 149369 -10004 38329 273289 156730 187322
9262A87322j42340o649k9915k073J54201j34544r5780l3520K23941K5470k95487
$$ 187322 44982 38333 8418 6345 160546 26002 -69778 -103298 120643 146113 -149374
9251a49374k10510k17655K16960L32932o087j11454j13153O0317K00864J23835
$$ -149374 -359884 -577539 -360579 -27647 -33734 -145188 -258341 -198024 2840 126675
9241A26675P452J62119J18147k34677p3430K82383j43177K6788j43657l5920M5526
$$ 126675 134127 296246 414393 179716 106286 388669 245492 272280 128623 92703 138229
9230A38229P7965J04540Q1635p1296j19395J24002J35249K14992o3127j79633
$$ 138229 216194 320734 402369 331073 211678 335680 470929 685921 622794 443161
9220D43161M6890J34991r0317q0327j51342q9706K67011j90676k08464L6454k909
$$ 443161 490051 625042 534725 454398 303056 213350 480361 289685 81221 117675 114766
9209A14766L136J93837J1017j28811J91439m5961j38024m6935k1820R3822n8991
$$ 114766 117902 311739 322756 193945 385384 339423 201399 154464 132644 226466 167475
9198A67475K03573J33357j11481q5747O0273M7396n2527N2748M8341q6750O333
$$ 167475 371048 504405 392924 307177 367450 414846 362319 415067 463408 376658 382991
9187C82991l654r5810Q7404J22292J7634K7128j31004o75j11443r8680M1759L47905
$$ 382991 379337 283527 370931 493223 510857 537985 406981 406306 294863 196183 237942 585847
9175E85847l4542j16995J42213J27386j44091N472L77055L5288j27576l7935O2706
$$ 585847 551305 434310 576523 703909 559818 565290 942345 977633 850057 812122 874828
9164H74828j17058M3173K00039M094O2719J3324m16073l36600r0913K47828K58094
$$ 874828 757770 800943 1000982 1005076 1067795 1081119 665046 328446 237533 485361 743455
9153G43455N35917K85223q3747j86813k39571K62728M86569M51129J35547K38822
$$ 743455 1279372 1564595 1480848 1294035 1054464 1317192 1803761 2254890 2390437 2629259
9143B629259K92789k993J80546L98166O99335N06037N43346M84348N24855N47301
$$ 2629259 2922048 2919055 3099601 3497767 4197102 4703139 5246485 5730833 6255688 6802989
9133F802989R51527R41984J075741J573728J810797K177462K861751L536382M354000
$$ 6802989 7754516 8696500 9772241 11345969 13156766 15334228 18195979 21732361 26086361
9124B6086361N924647Q008979J1165451J5378213K0836514K5516757K5607875
$$ 26086361 32011008 40019987 51185438 66563651 87400165 112916922 138524797
9117A38524797J8094318O006438o795340j6847666k2528525k2782376j9347216
$$ 138524797 156619115 162625553 155830213 138982547 116454022 93671646 74324430
9110G4324430j4424586j0382551p628860n427502m245882l399637k600361k282382
$$ 74324430 59899844 49517293 41888433 36460931 32215049 28815412 26215051 23932669
9102B3932669j890254j378240j356903j024391q40246j018735q54478o32302n17718
$$ 23932669 22042415 20664175 19307272 18282881 17442635 16423900 15569422 14937120 14419402
9093A4419402m71062l97544n09064n27656o21546m42486l11480l12404m12992
$$ 14419402 13948340 13550796 13041732 12514076 11892530 11450044 11138564 10826160 10413168
9084A0413168l10813o26089o03600m27180k59054k54866k46946k00911l74878
$$ 10413168 10102355 9476266 8872666 8445486 8186432 7931566 7684620 7483709 7108831
9075G108831l89814l83643k12945j5861m00651j17725K62359R0260j47187j34148
$$ 7108831 6719017 6335374 6122429 6106568 5705917 5588192 5850551 5940811 5793624 5659476
9065E659476l70688l04271k46678k29870k45378j17825l38715l67873o4030M7087
$$ 5659476 5288788 4984517 4737839 4507969 4262591 4144766 3806051 3438178 3374148 3421235
9055C421235J41266p2026k19289n0801j04794j86047p4124N8083j17845l05163
$$ 3421235 3562501 3490475 3271186 3220385 3115591 2929544 2855420 2913503 2795658 2490495
9045B490495l9738j14565L9783K12469L26760K3978k64926k49946N4145k07254
$$ 2490495 2450757 2336192 2375975 2588444 2915204 2939182 2674256 2424310 2478455 2271201
9035B271201k70184l4533k61987p6694L95376J25283m8639j36232k58731j85386
$$ 2271201 2001017 1966484 1704497 1627803 2023179 2148462 2099823 1963591 1704860 1519474
9025A519474J35800k01917J42004O2909j71797m1051p6508l25768j11703K60942
$$ 1519474 1655274 1453357 1595361 1658270 1486473 1445422 1368914 1043146 931443 1192385
9015A192385L5023L29l9190k48927J08810J31458r7314p1822P6368l1347j53376
$$ 1192385 1227408 1227737 1188547 939620 1048430 1179888 1082574 1010752 1087120 1055773 902397
9004I02397k02702j2142K15655o8469K3793J22570J2516P6512O3328J18138k02757
$$ 902397 699695 687553 903208 834739 858532 981102 993618 1070130 1133458 1251596 1048839
8993A048839j66070M1035j28797q9755Q3796j17166l56039q4089J83863K72238
$$ 1048839 882769 923804 795007 705252 789048 671882 315843 231754 415617 687855
8983F87855k53588m46616j97074L10855L29579Q5399J01432l2467k06482l0401
$$ 687855 434267 -12349 -209423 101432 431011 516410 617842 585375 378893 348492
8973C48492j02292J5940J37805j26682k50654J1015P1176K00721O7439O2504j06622
$$ 348492 246200 262140 399945 273263 22609 33624 104800 305521 372960 435464 328842
8962C28842k96466K48574J36601R7201j02698k20384Q3624n0239k15851j87753
$$ 328842 32376 280950 417551 514752 412054 191670 275294 225055 9204 -178549
8952a78549M12052Q2090M0136Q3339j89196j2806R3635r6032J9977l504J616r2507
$$ -178549 233503 315593 355729 439068 249872 237066 330701 234669 254646 251142 252758 160251
8940A60251K76323K48658j92308l06452l6870J4905P5646K17520Q4854k8697N3470
$$ 160251 436574 685232 492924 186472 149602 164507 240153 457673 542527 513830 567300
8929E67300n4606k88592j91859K06246K14732J8403k21055j20442P9419P8430
$$ 567300 512694 224102 32243 238489 453221 471624 250569 130127 209546 287976
8919B87976j85561n0494k5730m9137Q9931R5350J42730k9665m6712J2242m4836
$$ 287976 102415 51921 26191 -22946 66985 162335 305065 275400 228688 240930 196094
8908A96094j04647j24774K16300l0493j31215l4475j73216N525L31120J85943
$$ 196094 91447 -33327 182973 152480 21265 -13210 -186426 -180901 150219 336162
8898C36162J42436j83736j88338j58554Q4509Q0828j10503K24022N286p092R7991
$$ 336162 478598 294862 106524 -52030 32479 113307 2804 226826 232112 225020 323011
8887C23011J79346k00980k01016L7670K1682j03517j50802l3270J92719L42700
$$ 323011 502357 301377 100361 138031 159713 56196 -94606 -127876 64843 407543
8877D07543J5628m0069j11210j53859j33561L1778j34900K12595R0255j94614
$$ 407543 423171 383102 271892 118033 -15528 16250 -118650 93945 184200 -10414
8867a0414p9370K67242N3302j18927N2504J06662q2073j61678M8047J11032R820
$$ -10414 -89784 177458 230760 111833 164337 270999 188926 27248 75295 186327 196147
8856A96147j19484k65885p6449K33648P5035k87591R3719J63830K9847j07333
$$ 196147 76663 -189222 -265671 -32023 43012 -244579 -150860 12970 42817 -64516
8846f4516P471j00818l6651J13613O7728N3199J8234J81889K6495k85245k42401
$$ -64516 -57045 -157863 -194514 -80901 -13173 40026 58260 240149 266644 -18601 -261002
8835b61002O2100K8048L6975J49574J53063K27541J20041j00086J3884j91922
$$ -261002 -198902 -170854 -133879 15695 168758 396299 516340 416254 430138 238216
8825B38216j66821n6168l35502K84334L2936L4548M8631j26219k04593K52231
$$ 238216 71395 15227 -320275 -35941 -3005 31543 80174 -46045 -250638 1593
8815A593L82991O4765l11685k31780J53559J18680l5571P2492l899j17059j08716
$$ 1593 384584 449349 137664 -94116 59443 178123 142552 215044 211145 94086 -14630
8804a4630n282k618J66227J9753j30857o9461l5779j68039K57177K01784q1576
$$ -14630 -19912 -22530 143697 163450 32593 -36868 -72647 -240686 16491 218275 136699
8793A36699j12771j91590J29787K66963Q5254p4619J2568j21279k7557O55J24304
$$ 136699 23928 -167662 -37875 229088 314342 239723 252291 131012 103455 104110 228414
8782B28414M3980J98228N9890k61782o9519K00807J10227j25201j64534L5844
$$ 228414 272394 470622 530512 268730 199211 400018 510245 385044 220510 256354
8772B56354j23859p2609J41330q0281J9271n9746L180K25624j0976o8275L0756
$$ 256354 132495 59886 201216 120935 140206 80460 83640 309264 298288 230013 260769
8761B60769j13706K6851k8818J75484k8798o8845q1683K51700j32068l83719j4546
$$ 260769 147063 173914 145096 320580 291782 222937 141254 392954 260886 -122833 -137379
8750a37379J75248J10098j065P775j95522j19945j11076j128J3147m1059J7622
$$ -137379 37869 147967 146902 154677 -40845 -160790 -271866 -272994 -259847 -300906 -283284
8739b83284M0448j19869R6495J36583R3408o5140J59505L33297N9196j25632k12223
$$ -283284 -242836 -362705 -266210 -129627 -36219 -101359 58146 391443 450639 325007 112784
8728A12784k38375P0386K29033N6256k10797O5829Q1274q0638J51553J8071p2663
$$ 112784 -125591 -55205 173828 230084 19287 85116 166390 85752 237305 255376 182713
8717A82713K5118j92645k0558j3952j27321j03386K0653P261p8382J17475J24519
$$ 182713 207831 15186 -5372 -19324 -146645 -250031 -229378 -222117 -300499 -183024 -58505
8706e8505L4664m0511j24636j47374J3564J46457J68301Q6347J56251J38034l06466
$$ -58505 -23841 -64352 -188988 -336362 -322798 -176341 -8040 78307 234558 372592 66126
8695F6126k29761L31385n9200r8057O3054j15451P6877m9430J46398r5903l74598
$$ 66126 -163635 167750 108550 10493 73547 -41904 34973 -14457 131941 36038 -338560
8684c38560j88905l768J54429p879R2520K80786J95846l8285j85721M1710q0381
$$ -338560 -527465 -531233 -376804 -384683 -292163 -11377 184469 146184 -39537 2173 -78208
8673g8208q2557o7543M0468J95018J37726p5177j52902K9659J82581j39068l5591
$$ -78208 -160765 -228308 -187840 7178 144904 69727 -83175 -53516 129065 -10003 -45594
8662d5594j68710J5724L7514J57142J01133j1174j80609q285K00990J62226j38934
$$ -45594 -214304 -198580 -161066 -3924 97209 86035 -94574 -102859 98131 260357 121423
8651A21423j32747J9716J80079j0033j93512k4641n5640m9181O6025Q4805M4883
$$ 121423 -11324 8392 188471 178438 -15074 -39715 -95355 -144536 -78511 6294 51177
8640E1177j87862j53570j3809j49199N2927J22884l0041r9968J13041J83490j35928
$$ 51177 -136685 -290255 -304064 -453263 -400336 -277452 -307493 -407461 -294420 -110930 -246858
8629b46858n9494J38868J11820J09449r7195k63852J52569L70574j26177j41670
$$ -246858 -306352 -167484 -55664 53785 -43410 -307262 -154693 215881 89704 -51966
8619e1966J5583J52312j04173J5565n7629l3065j69126P8129J23097J21286R1339
$$ -51966 -36383 115929 11756 27321 -30308 -63373 -232499 -154370 -31273 90013 181352
8608A81352r016L9008P3586o4091k53507N5841M1586j4625n6859L43744q8963
$$ 181352 172336 211344 284930 220839 -32668 23173 64759 50134 -6725 337019 248056
8597B48056K12145j06456j34776J7984R6079l6828j03103j29249k12390K174M5926
$$ 248056 460201 353745 218969 236953 333032 296204 193101 63852 -148538 -146364 -100438
8586a00438J3894J70080R0442j4039O6117p7274j80393K6540J06345m6615k7267
$$ -100438 -86544 83536 173978 159939 226056 148782 -31611 -5071 101274 54659 27392
8575B7392j33365K22262M07409k68849k92694l01634n5333L39244L59280m1202
$$ 27392 -105973 116289 523698 254849 -37845 -339479 -394812 -55568 303712 262510
8565B62510K59651k02758k50594O1456j06702j00626M4481L3284l328P8289r0024
$$ 262510 522161 319403 68809 130265 23563 -77063 -32582 702 -2626 75663 -14361
8554a4361J13939J78340q9218k03606K0023J34245K99209L2040j92238o7919j3461
$$ -14361 99578 277918 188700 -14906 5117 139362 438571 470611 278373 210454 196993
8543A96993O1206j65314J07338R3941j60023M2836K5105o6814P2225o2888l3155
$$ 196993 258199 92885 200223 294164 134141 176977 202082 135268 207493 144605 111450
8532A11450j20533j8278j85489m8990L9184Q6721p8614o7049L07767N62349L43639
$$ 111450 -9083 -27361 -212850 -261840 -222656 -135935 -214549 -281598 26169 588518 932157
8521I32157p536l3860J00305k92431L2356O1323q9131m8324k47135k60120l91355
$$ 932157 924621 890761 991066 698635 730991 792314 703183 654859 407724 147604 -243751
8510b43751L9703m78n7350n3344r9897L31865K63581q9842k84816k6440k30478
$$ -243751 -204048 -204526 -261876 -315220 -415117 -83252 180329 90487 -194329 -220769 -451247
8499d51247L47868K35184o2615O8697n4274m6975L1910M2793J30661P4831K3427
$$ -451247 -103379 131805 69190 137887 83613 36638 68548 111341 242002 316833 340260
8488C40260J40169K91427j05534l22209j23890k5013p0417P938K60995K71428
$$ 340260 480429 771856 666322 344113 220223 195210 124793 132731 393726 665154
8478F65154J11151Q1775j88813l82177P9465k5354j39620j3878J87328J00032
$$ 665154 776305 858080 669267 287090 366555 341201 201581 187703 375031 475063
8468D75063m6882p6925j20626R961r3248r5804k21821r5310K5273K85901O4275
$$ 475063 428181 351256 230630 240591 147343 51539 -170282 -265592 -240319 45582 109857
8457A09857j51870k7121J0410O9099J42554m4207l8192K45116J57328k66402j76585
$$ 109857 -42013 -69134 -58724 10375 152929 108722 70530 315646 472974 206572 29987
8446B9987M2338J48734r0806k20020P4193j36790k14104p6016Q0357J22892j58683
$$ 29987 72325 221059 130253 -89767 -15574 -152364 -366468 -442484 -362127 -239235 -397918
8435c97918J9048J99917L21499J63493j47206k89160q9371O0790O0937m5553J02432
$$ -397918 -378870 -178953 142546 306039 158833 -130327 -219698 -158908 -97971 -143524 -41092
8424d1092J17047k15613j51728k0318K21510J89734o3196n315L1468k27186o4632
$$ -41092 75955 -139658 -291386 -311704 -90194 99540 36344 31029 62497 -164689 -229321
8413b29321K2871J18286r9811k2080j29783K21825J86812o7700r7471J32267P9328
$$ -229321 -206450 -88164 -187975 -210055 -339838 -118013 68799 1099 -96372 35895 115223
8402A15223K75n6983q7364k8731p9072j90840J63871p438J0164J83289L3318j14607
$$ 115223 115498 58515 -28849 -57580 -136652 -327492 -163621 -171059 -160895 22394 55712 -58895
8390e8895J33395j618k16715l8088q5490O2310K05716J71412j75866k46016j51038
$$ -58895 74500 72882 -143833 -181921 -267411 -205101 615 172027 -3839 -249855 -400893
8379d00893K29729L71499J14930j59k23183q5607j3148J86183j82275Q4227O7152
$$ -400893 -171164 200335 315265 315106 91923 6316 -6832 179351 -2924 81303 148455
8368A48455O6091j47914L2681k36237k00348K78719P0143j92609p6370j31801
$$ 148455 214546 66632 99313 -136924 -337272 -58553 11590 -181019 -257389 -389190
8358c89190o1903J8977P8807k1290j78175J62598J37940l5778J64286J59256J59946
$$ -389190 -451093 -432116 -353309 -374599 -552774 -390176 -252236 -288014 -123728 35528 195474
8347A95474j84165k73729j92580L4098J12813K18743m2338k51893J00956K96261
$$ 195474 11309 -262420 -455000 -420902 -308089 -89346 -131684 -383577 -282621 13640
8337A3640J35947J83376j1810j03788k48833K1515J87258Q9902L2776O9364o4407
$$ 13640 149587 332963 321153 217365 -31468 -9953 177305 267207 299983 369347 304940
8326C04940p6725k29631k63725j46516m7427K55195L26731J96745m7826j12850
$$ 304940 228215 -1416 -265141 -411657 -459084 -203889 122842 319587 271761 158911
8316A58911j08299j75487m4828K81872R7187j0295R1146J9423J14309L9379m14784
$$ 158911 50612 -124875 -169703 112169 209356 199061 290207 309630 423939 463318 48534
8305D8534j44909J6341L55844J91030J19885j91793j78887p9918p072k10352j66747
$$ 48534 -96375 -80034 275810 466840 586725 394932 216045 136127 129055 -81297 -248044
8294b48044K01708K26210K8286k46989k17334J47385J08059j91379l4224P2287
$$ -248044 -46336 179874 208160 -38829 -256163 -108778 -719 -192098 -226322 -154035
8284a54035j81193K00099L9703N1872J12818m7042j36418k6842L4675P6847J26361
$$ -154035 -335228 -135129 -95426 -43554 69264 22222 -114196 -141038 -106363 -29516 96845
8273I6845J4071k634l244j41075j60151J855K10834R4783o0197j06008J21127
$$ 96845 110916 108282 105038 -36037 -196188 -194333 16501 111284 51087 -54921 66206
8262F6206m2566M8582m4652Q1861q450l9572J48198l489j52036j80639j46621
$$ 66206 23640 72222 27570 109431 100981 61409 209607 206118 54082 -126557 -273178
8251b73178j66214k16739J66877K23584J22833J15674K26834J06836k65479j78307
$$ -273178 -439392 -656131 -489254 -265670 -142837 -27163 199671 306507 41028 -137279
8241a37279O2501n6602m2504J08175l124k3140j5471O0877L41618J02354k69220
$$ -137279 -74778 -131380 -173884 -65709 -68833 -91973 -107444 -46567 295051 397405 128185
8230A28185O7872l7110j62242q0857o0785P3214K18338J50538P4765l86127o3907
$$ 128185 196057 158947 -3295 -84152 -144937 -71723 146615 297153 371918 -14209 -78116
8219g8116m6603J71552q0556j34600J827p1848j4768M6850k8896r051J18244j43511
$$ -78116 -124719 46833 -33723 -168323 -166496 -238344 -253112 -206262 -235158 -244209 -125965 -269476
8207b69476n6444n7793J751K19361K07234K82549J13271j45953j76506k24783
$$ -269476 -325920 -383713 -381962 -162601 44633 327182 440453 294500 117994 -106789
8197a06789j04344j86329M0377J08741L07140J37059j31771k42354J18470J30334
$$ -106789 -211133 -397462 -357085 -248344 58796 195855 64084 -178270 -59800 70534
8187G0534m434k6696L7179O309j9011K15625J07152n862O0620M4717R6758j92591
$$ 70534 66100 39404 76583 82892 63881 279506 386658 380796 441416 486133 582891 390300
8175C90300k60060m7647L8949m6902j2023m1650m6936k77255M4269j31710p0724
$$ 390300 130240 82593 121542 74640 62617 20967 -25969 -303224 -258955 -390665 -461389
8164d61389L32005L50859K1528p6607J49378P5061j69445j82711j10705K8953
$$ -461389 -129384 221475 243003 166396 315774 390835 221390 38679 -72026 -43073
8154d3073J85237q3163k36697j46729L7621j50803Q1702N8792j44879P1490J72894
$$ -43073 142164 59001 -177696 -324425 -286804 -437607 -355905 -297113 -441992 -370502 -197608
8143a97608L7588P4827K00872J4721K03952K7251k07266j20432R6575l4632Q7484
$$ -197608 -160020 -85193 115679 130400 334352 361603 154337 33905 130480 95848 183332
8132A83332O1776l4938j84768J22945j15111l15200j68162K38335J98716L4880
$$ 183332 245108 210170 25402 148347 33236 -281964 -450126 -211791 -13075 21805
8122B1805J12666P4287k44953l0452R4090j19174m4195j19438j42596l4444J28893
$$ 21805 134471 208758 -36195 -66647 27443 -91731 -135926 -255364 -397960 -432404 -303511
8111c03511J66697K56715j3402j89606n9110J86340l1181r3625K8439J06130k79461
$$ -303511 -136814 119901 106499 -83107 -142217 44123 12942 -80683 -52244 53886 -225575
8100b25575m8992Q0619o063j8271J42034J06551J70672N3313l75354P163P2872
$$ -225575 -274567 -193948 -200011 -218282 -76248 30303 200975 254288 -121066 -113903 -41031
8089d1031K0069K54907J11710k07394j34083k07194O9105J06936K37149J51045
$$ -41031 -20962 233945 345655 138261 4178 -203016 -133911 -26975 210174 361219
8079C61219Q72k81140l40678j84304N4704j3787n61l19025J86792J84856J37174
$$ 361219 362091 80951 -259727 -444031 -389327 -403114 -403675 -722700 -535908 -351052 -213878
8068b13878K8335Q7083l08585j68761L51769Q8739j89413l5812K24694k243j17215
$$ -213878 -185543 -98460 -407045 -575806 -224037 -135298 -324711 -360523 -135829 -138072 -255287
8057b55287l2912l2394R5063L9073j36529j04838J92284L07280n7063J69214L21267
$$ -255287 -288199 -320593 -225530 -186457 -322986 -427824 -235540 71740 14677 183891 505158
8046E05158j09085m02730j95710q1175j045J61423K30630J33972j03683n5714
$$ 505158 396073 -6657 -202367 -283542 -284587 -123164 107466 241438 137755 82041
8036H2041p1203J84191P1775O4424j20424j33113j64100j9814K3393j04620Q6316
$$ 82041 10838 195029 266804 331228 210804 77691 -86409 -106223 -82830 -187450 -101134
8025a01134K4419R7214P2090j10378m4800J74645q5598k45967j75427M4204l4578
$$ -101134 -76715 20499 92589 -17789 -62589 112056 26458 -219509 -394936 -350732 -385310
8014c85310J47385p9324K42668K12717O5659J50118j96045j0011N6466K8764k08746
$$ -385310 -237925 -317249 -74581 138136 203795 353913 157868 147857 204323 233087 24341
8003B4341k70889n9402K85200L9238k2097K10501J6055j07987n4544k97348l53964
$$ 24341 -246548 -305950 -20750 18488 -3609 206892 222947 114960 60416 -236932 -590896
7992e90896J26649K74331L65113J18583k47732q8179J78387j5761J80347q5771
$$ -590896 -464247 -189916 175197 293780 46048 -42131 136256 120495 300842 215071
7982B15071j71459K0643k6267j71657k956l5491j46091J40788P5760N8870J15156
$$ 215071 43612 64255 37988 -133669 -136625 -172116 -318207 -177419 -101659 -42789 72367
7971G2367q6419k80500l2716J08703p3168K1657M2983K28973J61175l15348l1551
$$ 72367 -14052 -294552 -327268 -218565 -291733 -270076 -227093 1880 163055 -152293 -183844
7960a83844J10352K06828J00989k85691k14017p713K65789J69551J64495r7607
$$ -183844 -73492 133336 234325 -51366 -265383 -273096 -7307 162244 326739 229132
7950B29132j53681M13228m8039p7904l02772P13R3457r8169j60958N2342k6146
$$ 229132 75451 488679 440640 362736 59964 60677 154134 55965 -104993 -52651 -78797
7939g8797n816J05838j43056j85769N7919L7334j33719r9435j07816K06311Q2886
$$ -78797 -84613 21225 -121831 -307600 -249681 -212347 -346066 -445501 -553317 -347006 -264120
7928b64120R1088r0539K21373L7433j85255p5856J18522j21308J30070J57336
$$ -264120 -173032 -263571 -42198 -4765 -190020 -265876 -147354 -268662 -138592 18744
7918A8744j77898l9790Q9790j21852p1976K97870J64723l7442J92807k54896Q9641
$$ 18744 -159154 -198944 -109154 -231006 -302982 -5112 159611 122169 314976 60080 149721
7907A49721k15891k03109p7640j09703K99474N798j13331N550J33098L49839J50326
$$ 149721 -66170 -269279 -346919 -456622 -157148 -151350 -264681 -259131 -126033 223806 374132
7896C74132R3742J06866K19016N7747j28899j62994l64193k91832j0628K4522
$$ 374132 467874 574740 793756 851503 722604 559610 195417 -96415 -107043 -82521
7886h2521k19677J87353L5974j54645r3837o6852J48038m9890m0584L6386K26191
$$ -82521 -302198 -114845 -78871 -233516 -327353 -394205 -246167 -296057 -336641 -300255 -74064
7875g4064k0843M7711o8141o9965J26351L18410N7939k05836P1264K0122j73925
$$ -74064 -94907 -47196 -115337 -185302 -58951 259459 317398 111562 182826 202948 29023
7864B9023m2106j09233k39272j71094L31001L31351P4736J01040P120j34738O6849
$$ 29023 -13083 -122316 -361588 -532682 -201681 129670 204406 305446 312566 177828 244677
7853B44677m3907m54305k64591K24646K72608J7211o266K503k66490J0607j89649
$$ 244677 200770 -253535 -518126 -293480 -20872 -3661 -9927 -7424 -273914 -263307 -452956
7842d52956l2182K07766Q9484K31028J87815r474K5465R3207r1892j01584j31628
$$ -452956 -485138 -277372 -187888 43140 230955 221481 246946 340153 248261 146677 15049
7831A5049j06993M3977J09187p278j1193O794N3011J82511j51142r392R68J62858
$$ 15049 -91944 -47967 61220 53942 42749 49543 102554 285065 133923 124531 125499 288357
7819B88357J12594o1449J1242j41503j75567R0531j05726j02695K1745J51811
$$ 288357 400951 339502 350744 209241 33674 124205 18479 -84216 -62471 89340
7809H9340j21863j3708r004J3372K26448Q2645J49942j07580j00877n4207o9452
$$ 89340 -32523 -46231 -55235 -41863 184585 267230 417172 309592 208715 154508 85056
7798H5056N6193K7707j95444l07480j40759K18556K36105N1057j59676J6313P5605
$$ 85056 141249 168956 -26488 -333968 -474727 -256171 -20066 30991 -128685 -112372 -36767
7787c6767m659p8292j62119q8111j36209N6941R7257j9035m5645J05235K28597
$$ -36767 -41426 -119718 -281837 -369948 -506157 -449216 -351959 -370994 -416639 -311404 -82807
7776h2807L2064j08201j61758K08618Q3938k8253K3308k2657M1309j03630p601
$$ -82807 -50743 -158944 -320702 -112084 -28146 -56399 -33091 -55748 -14439 -118069 -125670
7765a25670Q7073j2011j03345q1688L45859J81019j8338j44746j15097N3347J60782
$$ -125670 -38597 -50608 -153953 -235641 110218 291237 272899 128153 13056 66403 227185
7754B27185O9713m8599j8569m3073j98063p15K96103M9725j24290k541J7654j05141
$$ 227185 296898 248299 229730 186657 -11406 -12121 283982 333707 209417 206876 224530 119389
7742A19389l5222M7968k81477j10927m9118J28403L97897J45850j43493k28354
$$ 119389 84167 132135 -149342 -260269 -309387 -180984 216913 362763 219270 -9084
7732i084N942l0089R2022p7231j07356k1186k273N5061R22j34364J00520Q5574
$$ -9084 -3142 -33231 58791 -18440 -125796 -146982 -149255 -94194 -93272 -227636 -127116 -41542
7720d1542J74926J38882m44511R0033O2818K04152K62225r2591j74806J38815
$$ -41542 133384 272266 -172245 -82212 -19394 184758 446983 354392 179586 318401
7710C18401J42664k02726l05405l2749P9020N2679m2457N0743R0630k3484j02330
$$ 318401 461065 258339 -47066 -79815 -795 51884 9427 60170 150800 127316 24986
7699B4986k59736P5877N9421j61234j24486K2626K04666K360o1109k82863K3861
$$ 24986 -234750 -158873 -99452 -260686 -385172 -362546 -157880 -155520 -216629 -499492 -475631
7688d75631J71803K24625n2088J10586K83529j55545j60094k39024j11404L21584
$$ -475631 -303828 -79203 -131291 -20705 262824 107279 -52815 -291839 -403243 -81659
7678h1659J89286m0920o1057K8510J77030N182j99304j34068K4262j08719j70803
$$ -81659 107627 66707 5650 34160 211190 216372 17068 -117000 -92738 -201457 -372260
7667c72260R1658P2101m3433M1610J03061Q1771j10419N7544O596N0793R7735
$$ -372260 -280602 -208501 -251934 -210324 -107263 -25492 -135911 -78367 -71771 -20978 76757
7656G6757m415j04846j57924n7449J23760R1287K3657n819O7332O0641j31526
$$ 76757 72342 -32504 -190428 -247877 -124117 -32830 -9173 -14992 52340 112981 -18545
7645a8545l5060J33593j19620K13887J11743j43236k45476L5560K55080K83593
$$ -18545 -53605 79988 -39632 174255 285998 142762 -102714 -67154 187926 471519
7635D71519m5311j61322Q8322j91446j27163k8882K0422k9906n9645k6821J18878
$$ 471519 426208 264886 353208 161762 34599 5717 26139 -3767 -63412 -90233 28645
7624B8645J4617J50368k65388l11648J5623L87588N51160P9130j6041l8680l25069
$$ 28645 43262 193630 -71758 -383406 -367783 19805 570965 650095 634054 595374 270305
7613B70305l13281j67291O3483o8224J63577J10842p8411j48413N2K96399l0056
$$ 270305 -42976 -210267 -146784 -215008 -51431 59411 -19000 -167413 -167361 129038 98982
7602I8982k62897q5143O9081N8618J4560R4356j11038k28141K72623L07332l8756
$$ 98982 -163915 -249058 -179977 -121359 -106799 -12443 -123481 -351622 -78999 228333 189577
7591A89577j91466l59600m0574J93045J9443J10639m6688l07772M6722Q0348J1075
$$ 189577 -1889 -361489 -402063 -209018 -189575 -78936 -125624 -433396 -386674 -306326 -295251
7580b95251l4285L64055J86777M2731q7242m8151K27463K76582j49358k741L1580
$$ -295251 -329536 34519 221296 264027 176785 128634 356097 632679 483321 480580 512160
7569E12160N0951K0791j86499k50272k96698j90292L8975J37861K06608J03196
$$ 512160 563111 583902 397403 147131 -149567 -339859 -300884 -163023 43585 146781
7559A46781q2852l35108j42709m9624m126P4520J50007L84398J92743J07529j50202
$$ 146781 63929 -271179 -413888 -463512 -467638 -393118 -243111 141287 334030 441559 291357
7548B91357l51713j92855J86897J14608J57114M3692k45172K4011J02444J53325
$$ 291357 -60356 -253211 -66314 48294 205408 249100 3928 27939 130383 283708
7538B83708J37405j31887j36122J04238M2521o5697q009n7093k3518l8361r0877
$$ 283708 421113 289226 153104 257342 299863 234166 226157 169064 145546 107185 16308
7527A6308j27880l17335M8074J5519J44346M0489J87796K1209J0226j51069n955
$$ 16308 -111572 -428907 -380833 -365314 -220968 -180479 7317 28526 38752 -112317 -118272
7516a18272n0728M0498R8326j40467j32398J39860j9560k1790N562K08177j98573
$$ -118272 -169000 -128502 -30176 -170643 -303041 -163181 -182741 -204531 -198969 9208 -189365
7505a89365j61433J92097O5115M2891j1160k2624j14217J38826R5008q5707R4150
$$ -189365 -350798 -158701 -93586 -50695 -61855 -84479 -198696 -59870 35138 -50569 43581
7494D3581p949k9548J48902r6774m6499j02113k45493K6211L07979K0863Q9543
$$ 43581 35632 6084 154986 58212 11713 -90400 -335893 -309682 -1703 19160 108703
7483A08703J4324P5943j21777J1577n4869q4615N8333J02956M24l19891l0277
$$ 108703 123027 198970 77193 88770 33901 -50714 7619 110575 110999 -208892 -239169
7472b39169J93534J89272k52394M2664N6796n1378k09723R2915j84292k6791J17099
$$ -239169 -45635 143637 -108757 -66093 -9297 -60675 -270398 -177483 -361775 -388566 -271467
7461b71467J01138o6111k6930P7569L8141J44741n0806R041M11519J68969j02706
$$ -271467 -170329 -236440 -263370 -185801 -147660 -2919 -53725 -44684 366835 535804 433098
7450D33098k26114j29600J20221q4246o9813M0689K22450l9256J17528K7624k13986
$$ 433098 206984 77384 197605 113359 43546 84235 306685 267429 384957 412581 198595
7439A98595K1672k4667k87208k16990J59760K64625J7j78006K35927j77330k03542
$$ 198595 220267 195600 -91608 -308598 -148838 115787 115804 -62202 173725 -3605 -207147
7428b07147Q1636K14447J94520j16611k28730k54333r8180J30197j16658K6848
$$ -207147 -125511 88936 283456 166845 -61885 -316218 -414398 -284201 -400859 -374011
7418c74011j1495p7996P9173J3861k22936J03534J35739j60272o1101L20506N43704
$$ -374011 -385506 -463502 -384329 -370468 -593404 -489870 -354131 -514403 -575504 -254998 288706
7407B88706J94395k64634k36415o9796M1305O7466L3411j17491j29244J54953
$$ 288706 483101 218467 -17948 -87744 -46439 21027 54438 -63053 -192297 -37344
7397c7344j44982j26824j25879L43993J86968Q7738k1251O3928J9087q4840k82877
$$ -37344 -182326 -309150 -435029 -91036 95932 183670 162419 226347 245434 160594 -122283
7386a22283K27344L7372j93114J27228J61606j17837K69231N8807q8787l02684
$$ -122283 105061 142433 -50681 76547 238153 120316 389547 448354 359567 56883
7376E6883k41689k52122J00961J93304L88372J24660p4459j2585r3619j20387
$$ 56883 -184806 -436928 -335967 -142663 245709 370369 295910 283325 189706 69319
7366F9319K6788J55747j0020J65859K8597j17909j9783j42794r2561n4771O2447
$$ 69319 96107 251854 241834 407693 436290 318381 298598 155804 63243 8472 70919
7355G0919K11428p9908l53172j23928j9891k62509M9038M78470K02255m4390j06108
$$ 70919 282347 202439 -150733 -274661 -294552 -557061 -508023 -29553 172702 128312 22204
7344B2204N2458n7438j21149o4651J08011N0199J42546M3760j63427J1757n3326
$$ 22204 74662 17224 -103925 -168576 -60565 -10366 132180 175940 12513 24270 -29056
7333b9056l2064m7071J11655Q6580J75162l37265J52763J50200J20296p0633j95786
$$ -29056 -61120 -108191 3464 90044 265206 -72059 80704 230904 351200 280567 84781
7322H4781j94920j35049j24647J25335K1530j00577J16764j29646p5194k0404
$$ 84781 -110139 -245188 -369835 -244500 -222970 -323547 -206783 -336429 -411623 -432027
7312d32027J32707K5436J53460j69122j95317l3081J87027J82623J78373K3032
$$ -432027 -299320 -273884 -120424 -289546 -484863 -517944 -330917 -148294 30079 53111
7302E3111M2850j13472q9613q350J08875L4409j3194J5379l01064L0672R3246
$$ 53111 95961 -17511 -107124 -115474 -6599 27810 14616 29995 -271069 -240397 -147151
7291a47151m0576n7680j58953K1450m1544J06690L8322M8742M3293K06184N9269
$$ -147151 -187727 -245407 -404360 -382910 -424454 -317764 -279442 -230700 -187407 18777 78046
7280G8046k2396j27773J21638L0218J68802J29371j31449k52703K93314K41136
$$ 78046 55650 -72123 49515 79733 248535 377906 246457 -6246 287068 528204
7270E28204j37876k87608r2950P0137J764k96570r7309o3822J61411K16740M2824
$$ 528204 390328 102720 9770 79907 81671 -214899 -312208 -376030 -214619 2121 44945
7259D4945J7103Q4550m4461l34247k48284l505K03468K83947K77775m9893j08603
$$ 44945 62048 146598 102137 -232110 -480394 -483899 -280431 3516 281291 231398 122795
7248A22795j37163j52422J2155J99918N4339j48870r8537J73771R2569o5094j89247
$$ 122795 -14368 -166790 -154635 45283 99622 -49248 -147785 25986 118555 53461 -135786
7237a35786j12731j56233K47620L9857k24612j32496K20027O8121q6018M8906
$$ -135786 -248517 -404750 -157130 -117273 -341885 -474381 -254354 -186233 -272251 -223345
7227b23345n691j25104o4084K29484J7684j4213j9478p2818K86226J23953R8865
$$ -223345 -229036 -354140 -418224 -188740 -171056 -185269 -204747 -277565 8661 132614 231479
7216B31479j82036j0294j17320j92781P7370K92995J74083k93841k51457R4432
$$ 231479 49443 39149 -78171 -270952 -193582 99413 273496 -20345 -271802 -177370
7206a77370j39032o3406J22260K8941J7505J30876k750j81057j22410L25259J04047
$$ -177370 -316402 -379808 -257548 -228607 -211102 -80226 -82976 -264033 -386443 -61184 42863
7195D2863n3421J4015Q5384q861K22680J41206r3808j70739j21174j32946p5926
$$ 42863 -10558 3457 88841 79980 302660 443866 350058 179319 58145 -74801 -150727
7184a50727j46866M062O8624Q1633J5932j30863j81591J68310J52499L77098K67409
$$ -150727 -297593 -293531 -224907 -143274 -127342 -258205 -439796 -271486 -118987 258111 525520
7173E25520j90308j55903k11588J4379J31032j07657j58816j10053K45159j17916
$$ 525520 335212 179309 -32279 -17900 113132 5475 -153341 -263394 -18235 -136151
7163a36151o1047K84672l2315K1431P2554m4338K09805m0508r9605J3704k57828
$$ -136151 -197198 87474 55159 76590 149144 104806 314611 274103 174498 188202 -69626
7152f9626k0724r6221P0583p4565J72484R1777l7n2619k16180j13027j8534J02748
$$ -69626 -90350 -186571 -115988 -190553 -18069 73708 73671 21052 -195128 -308155 -326689 -223941
7140b23941P9590j74834K33470L9223j06853o324j20312j81409M313J96188M40982
$$ -223941 -144351 -319185 -85715 -46492 -153345 -159669 -279981 -461390 -457077 -260889 180093
7129A80093J85984k44087k05817j31950L20711K24017j265l30393J15855M0573
$$ 180093 366077 121990 -83827 -215777 104934 328951 327686 -2707 113148 153721
7119A53721K03500o7274k70727k32123k006R5939n5682J33336N394r3313j10121
$$ 153721 357221 289947 19220 -212903 -214909 -118970 -174652 -41316 -35922 -129235 -239356
7108b39356n4258Q3172P9470q1396J67358J49192K38991K16472j8951m05300k13853
$$ -239356 -293614 -210442 -130972 -212368 -45010 104182 343173 559645 540694 135394 -78459
7097g8459o0666m9877N9929J64181K5377J57925q5402k58280L9812j00080k06903
$$ -78459 -139125 -189002 -129073 35108 60485 218410 133008 -125272 -85460 -185540 -392443
7086c92443J28194J32115R9873L943J21404L1305N8336j40356J16250J43512O5303
$$ -392443 -264249 -132134 -32261 -28318 93086 124391 182727 42371 158621 302133 367436
7075C67436L2629j55435r9651j82303o9034J41539N323q7134j8411J20790j72720
$$ 367436 400065 244630 144979 -37324 -106358 35181 40504 -46630 -65041 55749 -116971
7064a16971q93J37029K8000P8741m6141j65469r4778L2991q3619j84903N2483
$$ -116971 -117864 19165 47165 125906 79765 -85704 -180482 -147491 -231110 -416013 -363530
7053c63530M9875p7663p5828J8515o0593J42205M05729L00903L771M5754m1175
$$ -363530 -313655 -391318 -467146 -448631 -509224 -367019 38710 339613 343384 389138 347963
7042C47963j21094j26059o4244K45741O5203m6763j98547j15121J11610j63895
$$ 347963 226869 100810 36566 282307 347510 300747 102200 -12921 98689 -65206
7032f5206P9124J09900l6855m2394K16861M9799j38599k03787J97081P8449J41067
$$ -65206 13918 123818 86963 44569 261430 311229 172630 -31157 165924 244373 385440
7021C85440n9844q4593j5034j29268l29907k02494J68268L55003m8019j2447M306
$$ 385440 325596 241003 225969 96701 -233206 -435700 -267432 87571 39552 27105 31411
7010C1411O8012L2695P1731J30466N7448k36370q0114r6619J27637L0108K3311
$$ 31411 99423 132118 203849 334315 391763 155393 75279 -21340 106297 136405 159716
6999A59716j13343j61601M0033M1526J2238l4186k27298j8274Q0156K06204K02525
$$ 159716 46373 -115228 -75195 -33669 -21431 -55617 -282915 -301189 -221033 -14829 187696
6988A87696J1218l05484n0456J94066N6903j25720L6668k21200J5269R4854J24698
$$ 187696 198914 -106570 -157026 37040 93943 -31777 4891 -216309 -201040 -106186 18512
6977A8512P9282j76513k79455k9717J13407J1620J5934k86642j40597L08921J07919
$$ 18512 97794 -78719 -358174 -387891 -274484 -262864 -246930 -533572 -674169 -365248 -257329
6966b57329L3089Q7916m46351j85166o5404K73521J49326K02585P2886p6895L0122
$$ -257329 -224240 -136324 -582675 -767841 -833245 -559724 -410398 -207813 -134927 -211822 -181700
6955a81700K23801o8696k33223m4220p3831j34952M16160K81138j90608k86632
$$ -181700 42101 -26595 -259818 -304038 -377869 -512821 -96661 184477 -6131 -292763
6945b92763l3743N0687L43080R2268J04579o322k75824n5788L2009O3333K55047
$$ -292763 -326506 -275819 67261 159529 264108 257786 -18038 -73826 -41817 21516 276563
6934B76563j74472j93948l646k4229m5150Q5901m957o3552R6174k6953j51388
$$ 276563 102091 -91857 -95503 -119732 -164882 -78981 -83938 -147490 -51316 -78269 -229657
6923b29657k27282j65263Q3342K06258K73556p1130k24196Q1559J49551j82975
$$ -229657 -456939 -622202 -538860 -332602 -59046 -130176 -354372 -272813 -123262 -306237
6913c06237M3029j89319J48070J25294O2687J25925K85898k7178p3180p2722k92858
$$ -306237 -263208 -452527 -304457 -179163 -116476 9449 295347 268169 194989 122267 -170591
6902a70591K7827P1498Q1604J29807m7697Q098m104r8723l84403m4982j89619
$$ -170591 -142764 -71266 10338 140145 92448 100546 96442 -2281 -386684 -431666 -621285
6891f21285J89967L8200k57J3998q1672q6928j60552K16926K93853L89278N3281
$$ -621285 -431318 -393118 -393375 -379377 -461049 -547977 -708529 -491603 -197750 191528 244809
6880B44809k4131m4687J16786j27951j07740P2529J03486P2614J08540n6628q3779
$$ 244809 220678 175991 292777 164826 57086 129615 233101 305715 414255 357627 273848
6869B73848j72718l49832j6786K18501j79916k2132J66912j09008J3248K54929
$$ 273848 101130 -248702 -265488 -46987 -226903 -249035 -82123 -191131 -177883 77046
6859G7046J68875K024J42501q3252k96740r4154r247j77303l0375J00226J76942
$$ 77046 245921 247945 390446 307194 10454 -83700 -92947 -270250 -300625 -200399 -23457
6848b3457N9801j63313O0904J64620J13965q651j55371o6691R8047j11321k82834
$$ -23457 36344 -126969 -66065 98555 212520 203869 48498 -18193 79854 -31467 -314301
6837c14301L6242J05293K45765K85770O3710k70713k44423p4548r6558j03998
$$ -314301 -278059 -172766 72999 358769 422479 151766 -92657 -167205 -263763 -367761
6827c67761J62774R238Q7042K11061J21950M663o8M9644K1670o7154K1917p2708
$$ -367761 -204987 -195749 -108707 102354 224304 228967 228899 278543 300213 233059 254976 182268
6815A82268k6960k54778j05323M9571J65918K53036N9893m46356j33606j9199
$$ 182268 155308 -99470 -204793 -155222 10696 263732 323625 -122731 -256337 -275536
6805b75536j02849R1272P6665p0671m4563q4080k0836K15695M03960P3309k3956
$$ -275536 -378385 -287113 -210448 -281119 -325682 -409762 -430598 -214903 189057 262366 238410
6794B38410k38693k62942Q3472L8632J55957k17493j97160O4808J2333k0443l6616
$$ 238410 -283 -263225 -179753 -141121 14836 -202657 -399817 -335009 -322676 -343119 -379735
6783c79735Q3941O9393J14354J63257K944r2625q59O0j20127L8959j9844R987
$$ -379735 -295794 -226401 -112047 51210 54154 -38471 -39330 -39270 -159397 -120438 -140282 -130295
6771a30295p2724J90054J66952Q1664L1O8694k72444k20851M1487R6490K711J23742
$$ -130295 -203019 -12965 153987 235651 235682 304376 31932 -188919 -147432 -50942 -48231 75511
6759G5511n9381p3972R1857j35016j51524j70467K50995K08961k48164J9425K45004
$$ 75511 16130 -57842 34015 -101001 -252525 -422992 -171997 36964 -211200 -191775 53229
6748E3229Q2055k12845O4400m007k22001r6430L28115P7121R7583l1902q7326
$$ 53229 135284 -77561 -13161 -17168 -239169 -335599 -7484 69637 167220 135318 47992
6737D7992P1801J64230K62449j85269j58370j95462k62750r1553M5915j6371l2510
$$ 47992 119793 284023 546472 361203 202833 7371 -255379 -346932 -301017 -317388 -349898
6726c49898O9636P7763J29869Q5444K10743m2889j29837Q1823O7618k50834l02254
$$ -349898 -280262 -202499 -72630 12814 223557 180668 50831 132654 200272 -50562 -352816
6715c52816k4126P8078J82045J02767j1367K0048k45782j32526p7M11265p7325
$$ -352816 -376942 -298864 -116819 -14052 -25419 -5371 -251153 -383679 -383756 27509 -49816
6704d9816k61692j69988j9605j088P6069L2281K81714P8683K11710j18852j64642
$$ -49816 -311508 -481496 -501101 -502189 -426120 -393839 -112125 -33442 178268 59416 -105226
6693a05226r6966J55960J02159M2175l2391p4153J64318j28593o6715K9830M489
$$ -105226 -202192 -46232 55927 98102 65711 -8442 155876 27283 -39432 -9602 -5113
6682e113J95737j67749o8835j85447q1187K19277K77151O8027N7471l31845j72858
$$ -5113 190624 22875 -45960 -231407 -312594 -93317 183834 251861 309332 -22513 -195371
6671a95371o1697k1508j93281q3458K33320Q0386J28585N7203r2054l89924L7417
$$ -195371 -257068 -278576 -471857 -555315 -321995 -241609 -113024 -55821 -147875 -537799 -500382
6660e00382L9720J56751J38507K7398J21405J12985k07248j66732j250o6676k02650
$$ -500382 -460662 -303911 -165404 -138006 -16601 96384 -110864 -277596 -278846 -345522 -548172
6649e48172j14544K35615M99322M7922K61155O2094k15669j27510L0446o5991
$$ -548172 -662716 -427101 72221 120143 381298 443392 227723 100213 130659 64668
6639F4668K4362p7778j8326N8258J48475K52239j61640n3018j4809j84430j74293
$$ 64668 89030 11252 -7074 51184 199659 451898 290258 237240 222431 38001 -136292
6628a36292r9030p0367n6296K6706L88876N4230j4460J09391n5226N9853n6408
$$ -136292 -235322 -305689 -361985 -335279 53597 107827 93367 202758 147532 207385 150977
6617A50977L1669k26265k00383J93542J65072J19687j4883j34987j35869l7532
$$ 150977 182646 -43619 -244002 -50460 114612 234299 219416 84429 -51440 -88972
6607h8972K11050J71932k4310j81005k80337q9371N1953J09873K28897R3359J22208
$$ -88972 122078 294010 269700 88695 -191642 -281013 -229060 -119187 109710 203069 325277
6596C25277L1787k19001L6506J67582j90624k19062k48410j28957Q7719J43494
$$ 325277 357064 138063 174569 342151 151527 -67535 -315945 -444902 -357183 -213689
6586b13689k17259j45117k5705L49511L07342j14233j25354j46627L4024J70251
$$ -213689 -430948 -576065 -601770 -252259 55083 -59150 -184504 -331131 -297107 -126856
6576a26856K47433K4848k04801q5927j20990p255O4304K1180L0748J88853J74848
$$ -126856 120577 145425 -59376 -145303 -266293 -273548 -209244 -188064 -157316 31537 206385
6565B06385J2338k25171k97963j15963j4598J37265J73834J01222q8611J0488
$$ 206385 218723 -6448 -304411 -420374 -434972 -297707 -123873 -22651 -111262 -100774
6555a00774L99037N6752k73192J8025O2430o7451k97949P5060j22917J39129n0710
$$ -100774 298263 355015 81823 99848 162278 94827 -203122 -128062 -250979 -111850 -162560
6544a62560o8617m5753M3151L6547J95853p1052k8007J86479n2209J11628p8283
$$ -162560 -231177 -276930 -233779 -197232 -1379 -72431 -100438 86041 33832 145460 67177
6533F7177q986J60531q9458k8675P7423m3642j9722J01320J3785J43529j11523
$$ 67177 58191 218722 129264 100589 178012 134370 114648 215968 229753 373282 261759
6522B61759k08626L33084j2611j0161K56331N7232j92897k16918j67982k02081
$$ 261759 53133 386217 373606 363445 619776 677008 484111 267193 99211 -102870
6512a02870M323p2174j72354j76191p4418k854m2379J51957R6377p618L44842
$$ -102870 -98547 -170721 -343075 -519266 -593684 -596538 -638917 -486960 -390583 -398201 -53359
6501e3359K04767l08043q8506J7997r706J60007j9354k35925Q2466L41290K97790
$$ -53359 151408 -156635 -245141 -227144 -236850 -76843 -96197 -332122 -249656 91634 389424
6490C89424P4652j69529q7324M1529J20132l00047n2115N3082k6593J50630k084
$$ 389424 464076 294547 207223 248752 368884 68837 16722 69804 43211 193841 191757
6479A91757j9258k27821n1980J9828m7580O6820K8452O5919q4543k37909N1862
$$ 191757 172499 -55322 -107302 -87474 -135054 -68234 -39782 26137 -58406 -296315 -244453
6468b44453K82363J16549m0965j46869j6927j07135k09376J04330K47385j01482
$$ -244453 37910 154459 113494 -33375 -50302 -157437 -366813 -262483 -15098 -116580
6458a16580N4358K4173K00226k39752l25021J58300J46780j80169R4986M05674
$$ -116580 -62222 -38049 162177 -77575 -402596 -244296 -97516 -277685 -182699 222975
6448B22975K8709K492k34282k52036k5253k5992j08899m7777R7738J82326K3236
$$ 222975 251684 254176 19894 -232142 -257395 -283387 -392286 -440063 -342325 -159999 -136763
6437a36763k17801n4340J58039J38055K03287o6552k01837k60858J85142K51362
$$ -136763 -354564 -408904 -250865 -112810 90477 23925 -177912 -438770 -253628 -2266
6427b266J51787J03267M3259j4274m27334L3592j35901j04505P3138P0196p6945
$$ -2266 149521 252788 296047 281773 -145561 -111969 -247870 -352375 -279237 -209041 -285986
6416b85986j26351j44501J34850L53596O5376N0647q6248Q6741P1334l01513J81666
$$ -285986 -412337 -556838 -421988 -68392 -3016 47631 -38617 48124 119458 -182055 -389
6405c89K29774J3783O010R833q7558j71086j41802K09775l3935K26935n7927j34377
$$ -389 229385 243168 249178 259011 171453 367 -141435 68340 34405 261340 203413 69036
6393F9036J52005N7383m26554k37638R4561M9392J64498J81685J81587q5976k67949
$$ 69036 221041 278424 -148130 -385768 -291207 -241815 -77317 104368 285955 199979 -67970
6382f7970j36782l8148K23877J62442q1230k8890q6662O1993K70873j98355j66455
$$ -67970 -204752 -242900 -19023 143419 62189 33299 -53363 8630 279503 81148 -85307
6371h5307J22626m1895j05163k291J43789L4736R5958P5896j5040O9320j70687
$$ -85307 37319 -4576 -109739 -112030 31759 66495 162453 238349 223309 292629 121942
6360A21942k27869p1590J63128J35023q6822p8652J06207K06634J02664K8597
$$ 121942 -105927 -177517 -14389 120634 33812 -44840 61367 268001 370665 399262
6350C99262j21528j74260J12147J36246k21149j59421J40663O5679j96134R6852
$$ 399262 277734 103474 215621 351867 130718 -28703 111960 177639 -18495 78357
6340G8357K01794M6160k69397k71936M07235K32998k79864j09274j29316j95542
$$ 78357 280151 326311 56914 -215022 192213 425211 145347 36073 -93243 -288785
6330b88785r0879j84691O9053J33118k172Q9328K50267J64525k01265Q22J53034
$$ -288785 -379664 -564355 -495302 -362184 -364356 -275028 -24761 139764 -61501 -60679 92355
6319I2355j18058n7229J24115p7147r376N3208m7818p6438J07387k09568L6738
$$ 92355 -25703 -82932 41183 -35964 -45340 7868 -39950 -116388 -9001 -218569 -181831
6308a81831K49119J51019o9244j62038k43343j34365L97164p2663j78262j32479
$$ -181831 67288 218307 149063 -12975 -256318 -390683 6481 -66182 -244444 -376923
6298c76923j58123N4286J1697j4843l4451P8038J15256l0269J74230J9743j61373
$$ -376923 -535046 -480760 -469063 -483906 -518357 -440319 -325063 -355332 -181102 -161359 -322732
6287c22732j38154Q039L69715P2109j7624q6976J0980j5076J10548K38380Q0443
$$ -322732 -460886 -452847 -83132 -11023 -28647 -115623 -104643 -119719 -9171 229209 309652
6276C09652O6414n1729j82681N3243j99943r8385j20180L10819L24885l5144o8627
$$ 309652 376066 324337 141656 194899 -5044 -103429 -223609 87210 412095 376951 308324
6265C08324m3970r2716o5282K2954J45549k94109j44623K32045J2750j887j30022
$$ 308324 264354 171638 106356 129310 274859 -19250 -163873 68172 80922 79035 -50987
6254e0987n3679K08071K73989j24259l61861J8289p2092k91539n126j34438K8233
$$ -50987 -104666 103405 377394 253135 -108726 -90437 -162529 -454068 -459194 -593632 -565399
6243e65399K74658J27127j39397k67933J49892K89617J51133M3912m9265q8516
$$ -565399 -290741 -163614 -303011 -570944 -421052 -131435 19698 63610 14345 -74171
6233g4171R2637K66976M9421k11192P7301o5808m7655k35727k12886M1292L04087
$$ -74171 18466 285442 334863 123671 200972 135164 87509 -148218 -361104 -319812 -15725
6222a5725J15388K3326q0580p0580k9927M8847n0173k00189k18485R4174J4795
$$ -15725 99663 122989 42409 -28171 -58098 -9251 -59424 -259613 -478098 -383924 -369129
6211c69129k5302j15879J05318L54163J31064j67776n577J87023n5154j71636
$$ -369129 -394431 -510310 -404992 -50829 80235 -87541 -93118 93905 38751 -132885
6201a32885j02928J43571J457q775k70576k33643J52042J83017j02687k7663r406
$$ -132885 -235813 -92242 -90785 -99560 -370136 -603779 -451737 -268720 -371407 -399070 -408476
6190d08476O4155J1753J41352K17355j68099p8232r1387m1946J66091r9263j56503
$$ -408476 -344321 -332568 -191216 26139 -141960 -220192 -311579 -353525 -187434 -286697 -443200
6179d43200L61676K57181l3780k35950j19836p3912m0852J55815R9111j82217
$$ -443200 -81524 175657 141877 -94073 -213909 -287821 -328673 -172858 -73747 -255964
6169b55964o4537j14624K29654J98502n8309J3464K21600J83372o4879j53476
$$ -255964 -320501 -435125 -205471 -6969 -65278 -51814 169786 353158 288279 134803
6159A34803j42395j85555K2722K49971n9554n6831L1079J17999j8J96081K73376
$$ 134803 -7592 -193147 -170425 79546 19992 -36839 -5760 112239 112221 308302 581678
6148E81678O6070m54469l27587J48856L4470k29182k49520J15440o0859N2864
$$ 581678 647748 193279 -134308 14548 49018 -180164 -429684 -314244 -375103 -322239
6138c22239J04713O0948M0295P0969j31977j85706j23776j03721L3664L13135
$$ -322239 -217526 -156578 -116283 -45314 -177291 -362997 -486773 -590494 -556830 -243695
6128b43695K31755j7527j39595K13772K49803o5729k59093p8051j82451j67723
$$ -243695 -11940 -29467 -169062 44710 294513 228784 -30309 -108360 -290811 -458534
6118d58534K08140j86301j47197L4895J69887K77493J26425N0510o1380j359K07777
$$ -458534 -250394 -436695 -583892 -548997 -379110 -101617 24808 75318 13938 12579 220356
6107B20356j18703j23850K01470M0345N5283P4244n8517k12563j10063j07207
$$ 220356 101653 -22197 179273 219618 274901 349145 290628 78065 -31998 -139205
6097a39205l8398m8003L21399L43381l2325k12277M3851j3413j89176k64736j75080
$$ -139205 -177603 -225606 95793 439174 406849 194572 238423 225010 35834 -228902 -403982
6086d03982K50609J45438j69205J08673J52337m0813M5444k13991j31093J68871
$$ -403982 -153373 -7935 -177140 -68467 83870 43057 88501 -125490 -256583 -87712
6076h7712K27987K53663l9660l26478l86327l28917J46020L54932J61677J29624
$$ -87712 140275 393938 354278 27800 -358527 -687444 -541424 -186492 -24815 104809
6066A04809J08519j31529k94613q1980J34237J31511K5595k17444k19911K6583
$$ 104809 213328 81799 -212814 -294794 -160557 -29046 -3451 -220895 -440806 -414223
6056d14223P6201j79393J35310K95606M8532J00779J34604k08887k17132O1243
$$ -414223 -338022 -517415 -382105 -86499 -37967 62812 197416 -11471 -228603 -167360
6046a67360L9672R7979J37337O8107q2139o5799j07385r4387j80040P3286k8855
$$ -167360 -127688 -29709 107628 175735 93596 27797 -79588 -173975 -354015 -280729 -309584
6035c09584J09491j64868L5996L1543k4769J17700J80098J13644L5075j15522
$$ -309584 -200093 -364961 -328965 -297422 -322191 -204491 -24393 89251 124326 8804
6025H804k1797J21392o9810N0331J67390o2167o9585j61250J14756K97167K254
$$ 8804 -12993 108399 38589 88920 256310 194143 124558 -36692 78064 375231 377485
6014C77485j21018k80273j14409K50714J46036J29124N3597k06777M6465L3860
$$ 377485 256467 -23806 -138215 112499 258535 387659 441256 234479 280944 314804
6004C14804j67689k47163j57442r4202k43244q8506M1703R7864J43345Q9958N7071
$$ 314804 147115 -100048 -257490 -351692 -594936 -683442 -641739 -543875 -400530 -310572 -253501
5993b53501q5990p7914Q9924K52715k1410L2191J42920J70056J09840R9397k19941
$$ -253501 -339491 -417405 -327481 -74766 -96176 -63985 78935 248991 358831 458228 238287
5982B38287l97880J2286J39871k03536j39935L562J07420K77114N4578r4290j7419
$$ 238287 -159593 -147307 -7436 -210972 -350907 -347345 -239925 37189 91767 -2523 -19942
5971a9942J19417l3686p0043k6622L7710J53313j19929j64596o2397j84401L1703
$$ -19942 99475 65789 -4254 -30876 6834 160147 40218 -124378 -186775 -371176 -339473
5960c39473L05089L8619j64540k2636j3421J60298r5077J96849p07J50682Q6843
$$ -339473 -34384 4235 -160305 -182941 -196362 -36064 -131141 65708 65001 215683 302526
5949C02526k48314j15558K24428K12306J11321M3525R043j49190k15532k73435
$$ 302526 54212 -61346 163082 375388 486709 530234 539277 390087 174555 -98880
5939i8880m4335m6069J4082J5330K37108O7307o0908n5226j02227r2234n8282
$$ -98880 -143215 -189284 -175202 -159872 77236 144543 83635 28409 -73818 -166052 -224334
5928b24334j07691J23761K27227p0989k74203K5066K86000J71854K1227q1765
$$ -224334 -332025 -208264 18963 -52026 -326229 -301163 -15163 156691 177918 96153
5918I6153j7992k87955n6016k2167K87585L23662J25144l41923j39224L7079r5992
$$ 96153 78161 -209794 -265810 -287977 -392 323270 448414 106491 -32733 4346 -91646
5907i1646J0657K26240L8120k40239k23915q5186J64573m1999J35319K14665R6921
$$ -91646 -80989 145251 183371 -56868 -280783 -365969 -201396 -243395 -108076 106589 203510
5896B03510O0648j2713k78173j68468J30382k4646J18444L41149j44402j43087
$$ 203510 264158 251445 -26728 -195196 -64814 -89460 28984 370133 225731 82644
5886H2644n2143k39519k13257J18391K48943O2658J18024K17753j91173k30682
$$ 82644 30501 -209018 -422275 -303884 -54941 7717 125741 343494 152321 -78361
5876g8361j60138q0825J87476J08449o3576p1786Q6402M2390R8404k9718M4289
$$ -78361 -238499 -319324 -131848 -23399 -86975 -158761 -72359 -29969 68435 38717 83006
5865H3006J33476J95702j19572l07477j00153k6356K80025N6654k92165J60914
$$ 83006 216482 412184 292612 -14865 -115018 -141374 138651 195305 -96860 64054
5855F4054M2579N2098L1227k71754j29018j39261j07721J15529J24324J65154
$$ 64054 106633 158731 189958 -81796 -210814 -350075 -457796 -342267 -217943 -52789
5845e2789M9878j11501K0234J66681M0802j62135j67960O6218M111k08603J29631
$$ -52789 -2911 -114412 -94178 72503 113305 -48830 -216790 -150572 -146461 -355064 -225433
5834b25433L1098m4116j45049k23517P4461M3387N9275j7122J16669J40143j5706
$$ -225433 -194335 -238451 -383500 -607017 -532556 -489169 -429894 -447016 -330347 -190204 -205910
5823b05910Q9671j4189k4722j12930l7083J85654J75768k2654O6721k35426j9827
$$ -205910 -116239 -130428 -155150 -268080 -305163 -119509 56259 33605 100326 -135100 -154927
5812a54927K05867J7069j17524O1567R0576K90721l612j72009O9753q7344J23899
$$ -154927 50940 68009 -49515 12052 102628 393349 389737 217728 287481 200137 324036
5801C24036l1673k53222o1902L63p2614Q8403J58158O6335J9517n6538J09552
$$ 324036 292363 39141 -22761 -22398 -95012 -6609 151549 217884 237401 180863 290415
5790B90415K175M8975j76958p0358q011j30890k23328n6307J50529L7524R3821
$$ 290415 292590 341565 164607 94249 86238 -44652 -267980 -324287 -173758 -136234 -42413
5779d2413p3208k29530k2077M3931J10740J04487J15599M1276r3223M8212J70572
$$ -42413 -115621 -345151 -367228 -323297 -212557 -108070 7529 48805 -44418 3794 174366
5768A74366P1638K52807R5281l35821j14213P8176l37265m8147J92414j74610
$$ 174366 246004 498811 594092 258271 144058 222234 -115031 -163178 29236 -145374
5758a45374p793L56555Q648o0442m26589l8091L08905J12954K8345j66629K21635
$$ -145374 -153167 203388 212036 151594 -274995 -313086 -4181 108773 137118 -29511 192124
5747A92124Q5733k2281K1184r6901j57424j49218m5176J46984K33548l70353l784
$$ 192124 277857 255576 276760 179859 22435 -126783 -171959 -24975 208573 -161780 -165564
5736a65564J89728j4856j21762p94J90069P2092J86087j06635k70670k3336J65439
$$ -165564 24164 9308 -112454 -113248 76821 148913 335000 228365 -42305 -65641 99798
5725I9798j29714p7200j10729J03404L4173P61m2923J30389J18011j93562l1092
$$ 99798 -29916 -107116 -217845 -114441 -80268 -79507 -122430 7959 125970 -67592 -98684
5714i8684J24615l40616n4398J02415n0728J26056P9036k2218R9571R4162p7103
$$ -98684 25931 -314685 -369083 -266668 -317396 -191340 -112304 -134522 -34951 59211 -17892
5703a7892j20725J8245P4368k37286j01795j45519J1967j6948k0312L7349j82592
$$ -17892 -138617 -120372 -46004 -283290 -385085 -530604 -518637 -535585 -555897 -518548 -701140
5692g01140O6441J68447K16313j04240J59448M3367m1016o8160J0028q4938M555
$$ -701140 -634699 -466252 -249939 -354179 -194731 -151364 -192380 -260540 -250512 -335450 -330895
5681c30895K73103M9294n6771N6327J2775J04543Q349k1179j35548m2358K37325
$$ -330895 -57792 -8498 -65269 -8942 3833 108376 116725 95546 -40002 -82360 154965
5670A54965K37231p6165j27309R0376K10893J03373l99073k88053J05404N1918
$$ 154965 392196 316031 188722 279098 489991 593364 194291 -93762 11642 63560
5660F3560j64467n2274J19413P4895k16520j35758J48172L64076K27373o9301
$$ 63560 -100907 -153181 -33768 41127 -175393 -311151 -162979 201097 428470 359169
5650C59169n4671r0670k60959J42029j30796k02644J372k18889m3298K15237n9030
$$ 359169 304498 213828 -47131 94898 -35898 -238542 -237170 -456059 -499357 -284120 -343150
5639c43150j81055M4242K79641m5331q0201P3845o7724O7747J39813J03352n3964
$$ -343150 -524205 -479963 -200322 -245653 -325854 -252009 -319733 -251986 -112173 -8821 -62785
5628f2785j47611K2781k5684r0241K11597L74218K15878J39781k77578j33347
$$ -62785 -210396 -187615 -213299 -303540 -91943 282275 498153 637934 360356 227009
5618B27009R9083O2586j23923J64353J9273j15268j38247j96332k52604o6490
$$ 227009 326092 388678 264755 429108 448381 333113 194866 -1466 -254070 -320560
5608c20560K43137j183J2134N3608k35100J45658J88977O8362j02856J23255J02048
$$ -320560 -77423 -78606 -66472 -12864 -247964 -102306 86671 155033 52177 175432 277480
5597B77480J4758J44530l18661L8569M3555j42962J20565M56J15027j04761k48808
$$ 277480 292238 436768 118107 156676 200231 57269 177834 178290 293317 188556 -60252
5586f0252j72605j40802M8716j9248k0581O2327L10361J37430M3266J0909K58216
$$ -60252 -232857 -373659 -324943 -344191 -364772 -302445 7916 145346 188612 199521 457737
5575D57737j06027n00506l05190K68781K23961j66205r1967J06508J63983j37709
$$ 457737 351710 -148796 -453986 -185205 38756 -127449 -219416 -112908 51075 -86634
5565h6634q0520j2994J43873P5198l4897j26747J85893L1079J7152K5881K35868
$$ -86634 -167154 -180148 -36275 38923 4026 -122721 63172 94251 111403 137284 373152
5554C73152k86228j19941j74123K03690J84110O2974k44734j4338K32582m0386
$$ 373152 86924 -33017 -207140 -3450 180660 243634 -1100 -15438 217144 176758
5544A76758k21895K6481R3316l8762m047l9384P3635N571n7601L3301m353J60980
$$ 176758 -45137 -18656 74660 35898 31851 -7533 66102 71673 14072 47373 43020 204000
5532B04000J3848q5697j4402N9624q4938k01755J78127o7873M2723J89265M9617
$$ 204000 217848 132151 117749 177373 92435 -109320 68807 934 43657 232922 282539
5521B82539P5761k7095j74266l0561O4000J36762K9029j87717j38040k902k19009
$$ 282539 358300 331205 156939 126378 190378 327140 356169 168452 30412 27510 -191499
5510a91499j10126L2554J52714n5173J12257R5094j02986R9700J85326k82807
$$ -191499 -301625 -269071 -116357 -171530 -59273 35821 -67165 32535 217861 -64946
5500f4946J7969K0927j86557k86710n4435K65597J60846Q8740j1419J54156J84446
$$ -64946 -46977 -26050 -212607 -499317 -553752 -288155 -127309 -38569 -49988 104168 288614
5489B88614l23464m3291K04125k06434k03037K07381K01175k45962l15649j41377
$$ 288614 -34850 -78141 125984 -80450 -283487 -76106 125069 -120893 -436542 -577919
5479e77919L7805K93430J07591O4439o7840J3730J97195k04328P8459O3741j44153
$$ -577919 -540114 -246684 -139093 -74654 -142494 -128764 68431 -135897 -57438 6303 -137850
5468a37850j35999L3362K6799J01210J02419r1549m7491L40455J25855k38110
$$ -137850 -273849 -240487 -213688 -112478 -10059 -101608 -149099 191356 317211 79101
5458G9101j31321L3242k06520J6414m1309J49776K28483R6791P1624L28740K25758
$$ 79101 -52220 -18978 -225498 -209084 -250393 -100617 127866 224657 296281 625021 850779
5447H50779j43688m27671l38890j7220N3428p5477K95074R1796l09144j15899
$$ 850779 707091 279420 -59470 -76690 -23262 -98739 196335 288131 -21013 -136912
5437a36912N3698p9845j45408P1823N3972p5264p7030K5344J17363J68736K4346
$$ -136912 -83214 -163059 -308467 -236644 -182672 -257936 -334966 -309622 -192259 -23523 823
5426H23j32387n7544P0793P9322p266O7319Q5708n707o5253m37971k36823k5370
$$ 823 -131564 -189108 -118315 -38993 -46259 21060 106768 101061 35808 -402163 -638986 -664356
5414f64356L08016J95931K50690n5661L2654P7207j51514p7627L1451m432J18044
$$ -664356 -356340 -160409 90281 34620 67274 144481 -7033 -84660 -53209 -57641 60403
5403F0403n0434m5587j49595m3558J11694K3243j85896j21648J43790J69995l2548
$$ 60403 9969 -35618 -185213 -228771 -117077 -93834 -279730 -401378 -257588 -87593 -120141
5392a20141M0718J80635j06885P5714P2344O4795j16982J99265j04776j80390
$$ -120141 -79423 101212 -5673 70041 142385 207180 90198 289463 184687 4297
5382D297J00571k93495k40566Q989K21725r1608o4878K15752R975K18966p8231
$$ 4297 104868 -188627 -429193 -420204 -198479 -290087 -354965 -139213 -129238 89728 11497
5371A1497r8675J60168j99204m14J4108J10552J11168p3967Q5392N5333j42991
$$ 11497 -87178 72990 -126214 -126628 -112520 -1968 109200 35233 120625 175958 32967
5360C2967j4548j5323p2706N9679L0862j41653j18120Q8858J95802j0972O238
$$ 32967 18419 3096 -69610 -9931 20931 -120722 -238842 -149984 45818 34846 41084
5349D1084m4010j37880j668j21776N8503R5461P1131N0381O5408J08128k6571
$$ 41084 -2926 -140806 -142474 -264250 -205747 -110286 -39155 11226 76634 184762 158191
5338A58191J201o1510k68397j53698J28944J2042l6354J80069J39883M1177k31693
$$ 158191 159392 97882 -170515 -324213 -195269 -183227 -219581 -39512 100371 141548 -90145
5327i0145n3305l6574L1409J79924L79946K21693m1934j13502o8134j28287J41723
$$ -90145 -143450 -180024 -148615 31309 411255 632948 591014 477512 409378 281091 422814
5316D22814j03478q2897j02529j9168J31636K19796j32277k12868j23976K5497
$$ 422814 319336 236439 133910 114742 246378 466174 333897 121029 -2947 22550
5306B2550R8313j04666j59274M4954O8916r6815J82388K4447L5304M3183j28248
$$ 22550 120863 16197 -143077 -98123 -29207 -126022 56366 80813 116117 159300 31052
5295C1052l00489k12800J22969L0511K13574J17227L1381p395K16207L6953Q301
$$ 31052 -269437 -482237 -359268 -328757 -115183 2044 33425 26030 242237 279190 287491
5284B87491k42306k03807k97983N7782J41191r4233k12962n4252J80077K05065
$$ 287491 45185 -158622 -456605 -398823 -257632 -351865 -564827 -619079 -439002 -233937
5274b33937m0862L96713K50638l1971j72803n026j16493m8098N6799K77397J36538
$$ -233937 -274799 121914 372552 340581 167778 162752 46259 -1839 54960 332357 468895
5263D68895J3933m4233j07415j16654J37732J32327k3791j74346j14099j33037
$$ 468895 482828 438595 331180 214526 352258 484585 460794 286448 172349 39312
5253C9312K6089o5360l54573j31685J36597J74302K78177L3147k13487J50769
$$ 39312 65401 41 -354532 -486217 -349620 -175318 102859 136006 -77481 73288
5243G3288K565m3717P2210n3810j26125l35009J58003J91093N7571j06854j78110
$$ 73288 75853 32136 104346 50536 -75589 -410598 -252595 -61502 -3931 -110785 -288895
5232b88895J30712o262k39501p3579k2407Q7040K25962Q3451p3756J36392J1791
$$ -288895 -158183 -164445 -403946 -477525 -499932 -412892 -186930 -103479 -177235 -40843 -29052
5221b9052p3934O1894k2344J5415p118K4450J80978J5370k71096j77590L98804
$$ -29052 -102986 -41092 -63436 -48021 -55139 -30689 150289 165659 -105437 -283027 115777
5210A15777L10228k2314l92615j21946N5607p8228n5395K15661K67492Q1890p8716
$$ 115777 426005 403691 11076 -110870 -55263 -133491 -188886 26775 294267 376157 297441
5199B97441n972L9905l5268l48479j74404k81465m4111m2950N0563J27059O6869
$$ 297441 291469 331374 296106 -52373 -226777 -508242 -552353 -595303 -544740 -417681 -350812
5188c50812K2775K91521K23269p2126O8631j26065k2155j34052p2366J91571J66313
$$ -350812 -328037 -36516 186753 114627 183258 57193 35038 -99014 -171380 20191 186504
5177A86504k05871J318J28635N821r1994j73209M4611K52966L13572k9829l18598
$$ 186504 -19367 -18049 110586 116407 24413 -148796 -104185 148781 462353 432524 113926
5166A13926k13751o0370N6020K20617J84976o5476r8212j04580p1452j01357m0941
$$ 113926 -99825 -160195 -104175 116442 301418 235942 137730 33150 -38302 -139659 -180600
5155a80600L33257K0096k91719q9844J66831J6585k67092J17412q9277n4732r6961
$$ -180600 152657 172753 -118966 -208810 -41979 -25394 -292486 -175074 -264351 -319083 -416044
5144d16044O6860K59259K06774m2474L6903j31720k0932L9575o6688M7433K12776
$$ -416044 -349184 -89925 116849 74375 111278 -20442 -41374 -1799 -68487 -21054 191722
5133A91722N5788k0544j22827K9105n0900k8655m3972k47566j98781Q7832n0759
$$ 191722 247510 226966 104139 133244 82344 53689 9717 -237849 -436630 -348798 -399557
5122c99557K16993J19107k8254j61607P8978r1697j72552j276L4744R8040K63364
$$ -399557 -182564 -63457 -91711 -253318 -174340 -266037 -438589 -439865 -405121 -307081 -43717
5111d3717K39071K42391r8834l58076k92888r6267j1631P8201L37303K76357o6266
$$ -43717 195354 437745 338911 -19165 -312053 -408320 -419951 -341750 -4447 271910 205644
5100B05644n4985j27684o0706o8538k8525K30137J47857K9418l3866j20031o6473
$$ 205644 150659 22975 -37731 -106269 -134794 95343 243200 272618 238752 118721 52248
5089E2248k55570j60910N446J00299J65231O7807l6429J5606j19951k03030j34760
$$ 52248 -203322 -364232 -358786 -258487 -93256 -25449 -61878 -46272 -166223 -369253 -504013
$$ [...]
##END NTUPLES=NMR SPECTRUM
##END=
