##TITLE=Analysis number 317825
Compound Code mo 07074
Book Reference 456/116/8
Project Code adrs
Chemist Name anns
##JCAMPDX= 6.0         $$ Bruker NMR JCAMP-DX V2.0
##DATA TYPE= NMR SPECTRUM
##DATA CLASS= NTUPLES
##ORIGIN= Bruker BioSpin GmbH
##OWNER= nmr
$$ XWIN-NMR		Version 3.5
$$ Mon Mar  6 13:52:19 2006 GMT Standard Time (UT+0h)  MAYBRIDGE\nmr@NMR_250MHZ
##.OBSERVE FREQUENCY= 250.131544655141
##.OBSERVE NUCLEUS= ^1H
##.ACQUISITION MODE= SIMULTANEOUS (DQD)
##.ACQUISITION SCHEME= undefined
##.AVERAGES= 16
##.DIGITISER RES= 18
##SPECTROMETER/DATA SYSTEM= dpx250
##.PULSE SEQUENCE= zg30
##.SOLVENT NAME= CDCl3
##.SHIFT REFERENCE= (INTERNAL, CDCl3, 0, 16.522)
##AUDIT TRAIL= $$ (NUMBER, WHEN, WHO, WHERE, WHAT)
$$ ##TITLE= Audit trail, XWIN-NMR		Version 3.5
$$ ##JCAMPDX= 5.01
$$ ##ORIGIN= Bruker BioSpin GmbH
$$ ##OWNER= nmr
$$ C:\u/data/dgb/nmr/ADRS/100/pdata/1/auditp.txt
$$ ##AUDIT TRAIL=  $$ (NUMBER, WHEN, WHO, WHERE, WHAT)
(   1,<2006-03-06 13:51:51.77 +000>,<MAYBRIDGE\nmr>,<NMR_250MHZ>,
      <created by zg, POWCHK disabled, PULCHK disabled
       configuration hash MD5:
       84 BC 41 DB A1 6E 1D 46 DA 25 12 A5 C1 ED C5 3A
       data hash MD5: 64K
       37 3C 3A E3 CD 4D FD D6 8E DA CA A7 9A 29 BE 47>)
(   2,<2006-03-06 13:52:07.99 +000>,<MAYBRIDGE\nmr>,<NMR_250MHZ>,
      <Start of raw data processing
       ef LB = 0.3 FT_mod = 6 PKNL = 1 SI = 32K 
       data hash MD5: 32K
       49 CB 77 3A E9 AD 25 96 FD 69 89 39 97 10 E5 F7>)
(   3,<2006-03-06 13:52:09.82 +000>,<MAYBRIDGE\nmr>,<NMR_250MHZ>,
      <apk 
       data hash MD5: 32K
       12 89 C0 AF 3E 6C 53 10 F1 56 02 B5 1E 02 65 CD>)
(   4,<2006-03-06 13:52:10.66 +000>,<MAYBRIDGE\nmr>,<NMR_250MHZ>,
      <abs ABSG = 5 
       data hash MD5: 32K
       B1 5E B3 05 6E 90 2F DD 81 00 47 01 01 4E F5 AA>)
$$ ##END=
$$ 
$$ hash MD5
$$ 54 12 72 7C 36 87 7C A6 9B 83 94 B1 F3 92 4B 67
##$RELAX= 
##$RELAX= 
##$RELAX= 
##$RELAX= 
##$RELAX= 
##$RELAX= 
##$RELAX= 
$$ Bruker specific parameters
$$ --------------------------
##$DU= <C:\u>
##$EXPNO= 100
##$NAME= <ADRS>
##$PROCNO= 1
##$TYPE= <nmr>
##$USER= <dgb>
##$AMP= (0..31)
100 100 100 100 100 100 100 100 100 100 100 100 100 100 100 100 100 100 
100 100 100 100 100 100 100 100 100 100 100 100 100 100 
##$AQSEQ= 0
##$AQ_mod= 3
##$AUNM= <au_zg>
##$AUTOPOS= <37 >
##$BF1= 250.13
##$BF2= 250.13
##$BF3= 250.13
##$BF4= 250.13
##$BF5= 500.13
##$BF6= 500.13
##$BF7= 500.13
##$BF8= 500.13
##$BYTORDA= 1
##$CFDGTYP= 0
##$CFRGTYP= 5
##$CHEMSTR= <none>
##$CNST= (0..31)
1 1 145 1 1 1 1 1 1 1 1 1 1 1 1 1 1 1 1 1 1 1 1 1 1 1 1 1 1 1 1 1 
##$CPDPRG= <>
##$CPDPRG1= <>
##$CPDPRG2= <>
##$CPDPRG3= <>
##$CPDPRG4= <mlev>
##$CPDPRG5= <mlev>
##$CPDPRG6= <mlev>
##$CPDPRG7= <mlev>
##$CPDPRG8= <mlev>
##$CPDPRGB= <>
##$CPDPRGT= <>
##$D= (0..31)
0 1 0 0 0 0 0 0 0 0.06 0 0 0 0 0 0 0.0002 0 0 0 0 0 0 0 0 0 0 0 0 0 0 
0 
##$DATE= 1141653110
##$DBL= (0..7)
120 120 120 120 120 120 120 120 
##$DBP= (0..7)
150 150 150 150 150 150 150 150 
##$DBP07= 0
##$DBPNAM0= <>
##$DBPNAM1= <>
$$ [...]
##$SUBNAM7= <"">
##$SUBNAM8= <"">
##$SUBNAM9= <"">
##$SW= 20.6930455092707
##$SWIBOX= (0..15)
0 0 3 0 0 0 0 0 0 0 0 0 0 0 0 0 
##$SW_h= 5175.983436853
##$TD= 65536
##$TD0= 1
##$TE= 293.16
##$TE2= 300
##$TE3= 300
##$TEG= 300
##$TL= (0..7)
0 120 120 120 120 120 120 120 
##$TP= (0..7)
150 150 150 150 150 150 150 150 
##$TP07= 0
##$TPNAME0= <>
##$TPNAME1= <>
##$TPNAME2= <>
##$TPNAME3= <>
##$TPNAME4= <>
##$TPNAME5= <>
##$TPNAME6= <>
##$TPNAME7= <>
##$TPOAL= (0..7)
0.5 0.5 0.5 0.5 0.5 0.5 0.5 0.5 
##$TPOFFS= (0..7)
0 0 0 0 0 0 0 0 
##$TUNHIN= 0
##$TUNHOUT= 0
##$TUNXOUT= 0
##$USERA1= <user>
##$USERA2= <user>
##$USERA3= <user>
##$USERA4= <user>
##$USERA5= <user>
##$V9= 5
##$VALIST= <valist>
##$VCLIST= <CCCCCCCCCCCCCCC>
##$VD= 0
##$VDLIST= <DDDDDDDDDDDDDDD>
##$VPLIST= <PPPPPPPPPPPPPPP>
##$VTLIST= <TTTTTTTTTTTTTTT>
##$WBST= 1024
##$WBSW= 4
##$XGAIN= (0..3)
0 0 0 0 
##$XL= 0
##$YL= 0
##$YMAX_a= 349028
##$YMIN_a= -410889
##$ZGOPTNS= <>
##$ZL1= 120
##$ZL2= 120
##$ZL3= 120
##$ZL4= 120
##$ABSF1= 16.522
##$ABSF2= -4.171173
##$ABSG= 5
##$ABSL= 3
##$ALPHA= 0
##$AQORDER= 0
##$ASSFAC= 0
##$ASSFACI= 0
##$ASSFACX= 0
##$ASSWID= 0
##$AUNMP= <proc_1d>
##$AZFE= 0.1
##$AZFW= 0.1
##$BCFW= 0
##$BC_mod= 0
##$BYTORDP= 0
##$COROFFS= 0
##$CY= 12.5
##$DATMOD= 1
##$DC= 0
##$DFILT= <>
##$DTYPP= 0
##$F1P= 14.0000005364418
##$F2P= -0.99999901652339
##$FCOR= 0.5
##$FTSIZE= 32768
##$FT_mod= 6
##$GAMMA= 0
##$GB= 0
##$INTBC= 1
##$INTSCL= 1
##$ISEN= 128
##$LB= 0.3
##$LEV0= 0
##$LPBIN= 0
##$MAXI= 10000
##$MC2= 0
##$MEAN= 0
##$ME_mod= 0
##$MI= 0
##$NCOEF= 0
##$NC_proc= -3
##$NLEV= 6
##$NOISF1= 0
##$NOISF2= 0
##$NSP= 0
##$NTH_PI= 0
##$NZP= 0
##$OFFSET= 16.522
##$PC= 1
##$PHC0= -108.9642
##$PHC1= 5.667137
##$PH_mod= 1
##$PKNL= yes
##$PPARMOD= 0
##$PSCAL= 4
##$PSIGN= 0
##$REVERSE= no
##$SF= 250.13
##$SI= 32768
##$SIGF1= 0
##$SIGF2= 0
##$SINO= 400
##$SIOLD= 32768
##$SREGLST= <1H.CDCl3>
##$SSB= 0
##$STSI= 32768
##$STSR= 0
##$SW_p= 5175.98343685301
##$SYMM= 0
##$S_DEV= 0
##$TDeff= 65536
##$TDoff= 0
##$TI= <Analysis number 999999
Compound Code 99
Book Reference 9
Project Code 9>
##$TILT= no
##$TM1= 0
##$TM2= 0
##$TOPLEV= 0
##$USERP1= <user>
##$USERP2= <user>
##$USERP3= <user>
##$USERP4= <user>
##$USERP5= <user>
##$WDW= 1
##$XDIM= 32768
##$YMAX_p= 362930545
##$YMIN_p= -245857
$$ End of Bruker specific parameters
$$ ---------------------------------
##NTUPLES= NMR SPECTRUM
##VAR_NAME=  FREQUENCY,     SPECTRUM/REAL,   SPECTRUM/IMAG
##SYMBOL=    X,             R,               I
##VAR_TYPE=  INDEPENDENT,   DEPENDENT,       DEPENDENT
##VAR_FORM=  AFFN,          ASDF,            ASDF
##VAR_DIM=   32768,         32768,           32768
##UNITS=     HZ,            ARBITRARY UNITS, ARBITRARY UNITS
##FACTOR=    0.157963299565203, 1,           1
##FIRST=     4132.6476996994, 0,             0
##LAST=      -1043.33573715361, 0,           0
##MIN=       -1043.33573715361, -245857,     0
##MAX=       4132.6476996994, 362930545,     0
$$ Real data points
##PAGE= N=1
##DATA TABLE= (X++(R..R)), XYDATA
$$ [...]
$$ plain form
16349 37686 81529 19331 -70368 -45226 -53498 -54821 -75552 -75755 -57187 -52748 -34229 17795 -6271
16336 -6271 -38251 -55666 17174 13750 40343 89408 34638 19940 54268 122127 111545 93221
16324 93221 29447 -76517 -79967 -37742 62297 99849 29981 23727 -23915 -34729 -11771 -89596
16312 -89596 -86521 -11115 24656 25415 -69669 -137326 -57136 39085 -3018 -13874 -31174 -89129
16300 -89129 -65966 -24521 35016 66511 60111 46318 52502 45410 25461 8980 -4386 -71677
16288 -71677 -99220 -95417 -88587 -94293 -79986 -52050 -7108 -12148 20393 92612 54901 -51845
16276 -51845 -99734 -40397 -5764 7007 -2951 -23589 23748 78635 87136 36533 30788 -12591
16264 -12591 -40474 -41810 -1134 34194 -29431 -31799 -37582 -81711 -61130 6404 -19692 617
$$ packed form
16349C7686M3843o2198q9699K5142q272j323k0731k03J8568M439J8519N2024k4066
16336f271l1980j7415P2840l424K6593M9065n4770j4698L4328O7859j0582j8324
16324I3221o3774j05964l450M2225J00039L7552o9868o254m7642j0814K2958p7825
16312h9596L075P5406L5771P59r5084o7657Q0190R6221m2103j0856j7300n7955
16300h9129K3163M1445N9537L1495o400j3793O184p092j9949j6481j3366o7291
16288g1677k7543L803O830n706J4307K7936M4942n040L2541P2219l7711j06746
16276e1845m7889N9337L4633J2771r958k0638M7337N4887Q501n0603n745m3379
16264a2591k7883j336M0676L5328o3625k368n783m4129K0581O7534k6096K0309
$$ plain form
16252 617 -28229 -140310 -101715 -16367 -61630 -27421 29530 -4772 -45795 -87154 -161411 -114111
16240 -114111 -49580 16558 -3518 -27596 -7674 4857 -22187 -11445 -23860 -62652 -87616
16229 -87616 -125134 -51710 19674 95594 48816 -12668 -4239 -19614 -60663 -55361 -53594 52606
16217 52606 31805 1601 33573 43469 -10268 -9472 47483 92959 45967 87575 95998 33851
16205 33851 -58484 -81803 -51966 -54285 -42124 -50534 -60987 -29698 1831 23873 -49307 -46690
16193 -46690 -86974 -126469 -81459 5649 127397 127726 92815 72946 -73698 -168188 -123491 -89572
16181 -89572 -48696 -59541 -316 34254 36748 2891 -30015 -21188 -35685 11470 -17149 -41724
16169 -41724 35663 74460 23174 -16269 41206 84607 125026 129388 43815 -4671 29972 -10297
$$ packed form
16252F17k8846j12081L8595Q5348m5263L4209N6951l4302m1023m1359p4257M7300
16240a14111O4531O6138k0076k4078J9922J2531k7044J0742j2415l8792k4964
16229h7616l7518P3424P1384P5920m6778o1484Q429j5375m1049N302J767J06200
16217E2606k0801l0204L1972R896n3737P96N6955M5476m6992M1608Q423o2147
16205C3851r2335k3319K9837k319J2161q410j0453L1289L1529K2042p3180K617
16193d6690m0284l9495M5010Q7108J21748L29l4911j9869j46644r4490M4697L3919
16181h9572M0876j0845N9225L4570K494l3857l2906Q827j4497M7155k8619k4575
16169d1724P7387L8797n1286l9443N7475M3401M0419M362q5573m8486L4643m0269
$$ plain form
16157 -10297 -72116 -70398 -67354 1356 36334 30627 -19676 -92218 -78226 -54732 -23607 -33817
16145 -33817 -70231 -30455 16873 11400 -4094 38021 27278 -47284 -83522 -76716 -27484 962
16133 962 46354 71871 37381 8754 -48548 -39066 -57673 -120903 -78925 -23179 747 -458
16121 -458 -44540 -155644 -157597 -69227 -27206 -44858 -35466 30672 -5839 18965 -30107 -60649
16109 -60649 -85303 -59924 -15663 -60941 -37420 5248 -19677 -29251 -14776 -20774 22455 67558
16097 67558 11085 -1031 5524 -12550 -78424 -122931 -160702 -172805 -134643 -57276 21877 59175
16085 59175 16033 -20621 -71759 -92429 -39047 60745 82709 102339 55066 52783 -4230 -90082
16073 -90082 -80504 -60331 -79973 -127040 -112300 -101746 -51569 -15064 -21807 -2764 32926 38313
$$ packed form
16157a0297o1819J718L044O8710L4978n707n0303p2542J3992K3494L1125j0210
16145c3817l6414L9776M7328n473j5494M2115j0743p4562l6238O806M9232K8446
16133I62M5392K5517l4490k8627n7302R482j8607o3230M1978N5746K3926j205
16121d58m4082j11104j953Q8370M2021j7652R392O6138l6511K4804m9072l0542
16109f0649k4654K5379M4261m5278K3521M2668k4925r574J4475n998M3229M5103
16097F7558n6473j2116O555j8074o5874m4507l7771j2103L8162P7367P9153L7298
16085E9175m3142l6654n1138k0670N3382R9792K1964J9630m7273k283n7013q5852
16073i0082R578K0173j9642m7067J4740J0554N0177L6505o743J9043L5690N387
$$ plain form
16061 38313 61489 90273 72802 63320 83046 55669 -14368 -11550 -44198 -4901 21831 -26479
16049 -26479 -65563 -115342 -55900 -59027 -83035 -39559 -46277 -22082 -9466 -41215 -62128 -75772
16037 -75772 20864 88762 80421 84086 94053 25782 -58994 -78909 -61127 -46947 -23027 35286
16025 35286 12061 -61618 -70383 -96108 -44208 -35025 -30747 -22838 -33625 -31976 31396 -22465 -57682
16012 -57682 -40440 -34869 -98858 -119516 -55784 16430 -4808 66270 69252 54957 -29019 -119022
16000 -119022 -112379 -121698 -45333 1434 77070 151265 148018 79155 100708 56986 -13162 -31046
15988 -31046 -24756 -39112 -18893 -109798 -90904 -64777 26296 12071 -51788 -124002 -112691 -56460
15976 -56460 -58760 -85817 -46618 21036 102387 75797 35975 32918 36242 -1288 -2845 22942
$$ packed form
16061C8313K3176K8784j7471r482J9726k7377p0037K818l2648L9297K6732m8310
16049b6479l9084m9779N9442l127k4008M3476o718K4195J2616l1749k0913j3644
16037g5772R6636O7898q341L665R967o8271q4776j9915J7782J4180K3920N8313
16025C5286k3225p3679q765k5725N1900R183M278P909j0787J649O3372n3861l5217
16012e7682J7242N571o3989k0658O3732P2214k1238P1078K982j4295q3976r0003
16000a19022O643r319P6365M6767P5636P4195l247o8863K1553m3722p0148j7884
15988c1046O290j4356K0219r0905J8894K6127R1073j4225o3859p2214J1311N6231
15976e6460k300k7057L9199O7654Q1351k6590l9822l057L324l7530j557K5787
$$ plain form
15964 22942 -15482 -46529 -77410 -65818 -69885 -108769 -130195 -108373 -62112 -40774 -80686 -125963
15952 -125963 -129670 -184048 -103185 -63361 -113617 -145809 -158330 -169981 -46905 12442 25285
15941 25285 -15239 -3837 13384 -38017 -43520 -63737 -73787 -55974 14550 41055 30868 40817
15929 40817 65130 52871 72527 41711 69614 133064 127361 60402 41259 -12608 -40878 20452
15917 20452 17748 13885 20846 30608 9091 34211 45307 20880 44588 102184 103471 36054 23099
15904 23099 6649 98335 69677 528 -15278 22844 44813 22392 6619 9654 53236 63716
15892 63716 1362 -40998 -41714 -27899 -68663 -39220 -36882 -31598 -12860 8939 1882 -19787 -9753
15879 -9753 -9857 -20335 48758 78745 70224 15508 -99793 -164077 -136059 -82797 -38276 60019
$$ packed form
15964B2942l8424l1047l0881J1592m067l8884k1426K1822M6261K1338l9912m5277
15952a25963l707n4378Q0863L9824n0256l2192j2521j1651J23076N9347J2843
15941B5285m0524J1402J7221n1401n503k0217j0050J7813P0524K6505j0187R949
15929D0817K4313j2259J9656l0816K7903O3450n703o6959j9143n3867k8270O1330
15917B0452k704l863O961R762k1517K5120J1096k4427K3708N7596J287o7417j2955
15904B3099j6450R1686k8658o9149j5806L8122K1969k2421j5773L035M3582J0480
15892F3716o2354m2360p16J3815m0764K9443K338N284J8738K1799p057k1669J0034
15879i753j04j0478O9093K9987q521n4716j15301o4284K8018N3262M4521R8295
$$ plain form
15867 60019 91748 39125 5345 77328 57001 74185 50180 82806 82094 66969 25504 -4415
15855 -4415 -22350 -37528 604 -5461 6238 -54953 -49689 -19811 10188 99 -19641 -55312
15843 -55312 -77919 -21947 31616 -3737 -12300 21366 75572 17892 7199 -16831 -21616 -26515
15831 -26515 -16644 -22661 -46560 4910 43813 74450 67169 66271 53649 85149 107531 85666 22000
15818 22000 -9746 -7890 300 -20324 -83305 -141058 -170389 -77699 -60950 -128722 -74570 -48699
15806 -48699 -47527 -13828 -11578 -52995 -39046 -17427 -35132 -39417 -43535 -33571 -57321 -73462 -26874
15793 -26874 7439 14599 43790 5074 -89075 -130203 -71436 50095 91218 75233 15020 -57224
15781 -57224 -157639 -108974 -31243 -20995 22294 78580 116469 77388 -66135 2371 86062
$$ packed form
15867F0019L1729n2623l3780P1983k0327J7184k4005L2626p12j5125m1465k9919
15855d415j7935j5178L8132o065J1699o1191N264K9878K9999j0089j9740l5671
15843e5312k2607N5972N3563l5353q563L3666N4206n7680j0693k4030m785m899
15831b6515R871o017k3899N1470L8903L0637p281q98j2622L1500K2382k1865o3666
15818B2000l1746J856Q190k0624o2981n7753k9331R2690J6749o7772N4152K5871
15806d8699J172L3699K250m1417J3949K1619j7705m285m118R964k3750j6141M6588
15793b6874L4313P160K9191l8716r4149m1128N8767J21531M1123j5985o0213p2244
15781e7224j00415M8665P7731J0248M3289N6286L7889l9081j43523O8506Q3691
$$ plain form
15770 86062 61236 -43268 -34146 45858 97509 107000 94767 93656 51834 9120 -67425 -58783
15758 -58783 -29313 5326 7017 -66447 -87586 -30308 42894 36191 51837 12659 15798 32261
15746 32261 61265 73526 17355 -81087 -149453 -71576 7568 4664 -1769 9195 15940 29915
15734 29915 36965 36307 -965 -19413 16951 -29638 -29461 60046 55804 20579 -56315 -54286 36644
15721 36644 77698 65166 32473 25457 10449 -50493 -79394 -94569 -19891 -45894 -22657 -46516
15709 -46516 -92830 -23417 -19430 -53703 -14691 -37104 -25647 -9402 35940 22282 -39320 -70807
15697 -70807 -13533 916 -19701 20762 12292 -52922 -78933 -53109 -23212 -60437 -68314 -43619
15685 -43619 -41566 5654 29239 -24014 -2161 33293 18662 -11552 -41257 -67790 -114136 -89257
$$ packed form
15770H6062k4826j04504R122Q0004N1651R491j2233j111m1822m2714p6545Q642
15758e8783K9470L4639J691p3464k1139N7278P3202o703J5646l9178L139J6463
15746C2261K9004J2261n6171r8442o8366P7877P9144k904o433J0964O745J3975
15734B9915P050o58l7272j8448L6364m6589J77Q9507m242l5225p6894K029R0930
15721C6644M1054j2532l2693p016j5008o0942k8901j5175P4678k6003K3237k3859
15709d6516m6314O9413L987l4273L9012k2413J1457J6245M5342j3658o1602l1487
15697g0807N7274J4449k0617M0463q470o5214k6011K5824K9897l7225p877K4695
15685d3619K053M7220K3585n3253K1853L5454j4631l0214k9705k6533m6346K4879
$$ plain form
15673 -89257 -53465 62692 66214 -32920 -26559 -45578 -66848 -62122 -63030 -48090 -22657 8142
15661 8142 42705 68094 80339 95850 165667 188483 73754 126301 123475 129427 116310 75841
15649 75841 18618 -37326 -75607 -61572 -61410 -88342 -15077 7590 -54666 -32462 -11472 -139951
15637 -139951 -145046 -15049 48133 52981 62478 40175 52561 39380 -49469 -82883 -34396 50247
15625 50247 74335 25333 -15875 26093 80398 -23660 -92085 -60159 62014 81229 -21267
15614 -21267 -16540 14568 -21338 -13459 25350 8579 51058 52809 36744 49163 54172 88345
15602 88345 28929 -51329 -56861 17493 41733 -12245 -101942 -110705 -91339 -59608 -148221 -212351
15590 -212351 -175984 -140516 -117422 -132014 -112787 -119300 -75343 -73494 489 37788 44893 24522
$$ packed form
15673h9257L5792J16157L522r9134O361j9019k1270M726r08J4940K5433L0799
15661H142L4563K5389J2245J5511O9817K2816j14729N2547k826N952j3117m0469
15649G5841n7223n5944l8281J4035J62k6932P3265K2667o2256K2204K0990j28479
15637a39951n095J29997O3182M848R497k2303J2386j3181q8849l3414M8487Q4643
15625E0247K4088m9002m1208M1968N4305j04058o8425L1926J22173J9215j02496
15614b1267M727L1108l5906P879L8809j6771M2479J751j6065J2419N009L4173
15602H8345n9416q0258n532P4354K4240n3978q9697q763J9366L1731q8613o4130
15590b12351L6367L5468K3094j4592J9227o513M3957J849P3983L7299P105k0371
$$ plain form
15578 24522 68675 92566 28328 -23849 -63004 -46031 1559 86378 62637 67038 76826 108590
15566 108590 23758 -15011 -29029 -592 27894 9910 20784 100679 164318 92165 15462
15555 15462 -20830 37280 51010 44773 19203 -60296 -52961 -4473 30120 -21219 27717 12829
15543 12829 -19121 -28906 -20262 3025 63721 72297 47809 4891 15896 -40191 -100175 -31496
15531 -31496 3645 19272 7904 -52229 -139790 -138039 -100104 -61700 -58389 -78696 -69322 -70419
15519 -70419 -7290 3849 33075 40649 -13590 -15909 -18493 -72715 -58759 3993 82083 79715
15507 79715 115246 80867 5551 5898 31728 34779 38229 58490 54579 18911 26999 41615 84658
15494 84658 70847 66454 37906 13889 46472 58980 43183 71652 41952 -14807 -35063 -89459
$$ packed form
15578B4522M4153K3891o4238n2177l9155J6973M7590Q4819k3741M401R788L1764
15566A08590q4832l8769j4018K8437K8486j7984J0874P9895O3639p2153p6703
15555A5462l6292N8110J3730o237k5570p9499P335M8488L4593n1339M8936j4888
15543A2829l1950r785Q644K3287O0696Q576k4488m2918J1005n6087n9984O8679
15531c1496L5141J5627j1368o0133q7561J751L7935L8404L311k0307R374j097
15519g0419O3129J1139K9226P574n4239k319k584n4222J3956O2752P8090k368
15507G9715L5531l4379p5316L47K5830L051L450K0261l911l5668Q088J4616M3043
15494H4658j3811m393k8548k4017L2583J2508j5797K8469k9700n6759k0256n4396
$$ plain form
15482 -89459 -99944 -94537 -133809 -92256 -9498 10473 -18379 -4633 19351 -2165 -59254 -144077
15470 -144077 -154839 -147727 -93974 -34000 6216 -2309 6464 64092 -36514 16673 70718 71620
15458 71620 38740 -7252 -37821 -27224 2010 51956 18672 10768 -30903 -76974 -83887 -29670
15446 -29670 -63241 -75977 -37838 19599 92583 88023 70454 136861 110047 61807 44855 35458
15434 35458 2965 -22453 -81054 -91471 -48878 19030 18854 -6120 -29528 -69540 -43689 40226
15422 40226 89224 49597 15146 37582 29432 -1578 -27971 -58240 -14701 45911 69818 60103
15410 60103 -33961 -76737 -26457 17291 32391 67253 41156 -44739 -29574 3381 -47589 4944
15398 4944 56132 94912 69003 48485 65648 -4134 -9675 -7978 38378 73905 73696 79707 56757
$$ packed form
15482h9459j0485N407l9272M1553Q2758J9971k8852J3746K3984k1516n7089q4823
15470a44077j0762P112N3753N9974M0216q525Q773N7628j00606N3187N4045R02
15458G1620l2880m5992l0569J0597K9234M9946l3284p904m1671m6071o913N4217
15446b9670l3571j2736L8139N7437P2984m560j7569O6407k6814m8240j6952r397
15434C5458l2493k5418n8601j0417M2593O7908j76k4974k3408m0012K5851Q3915
15422D0226M8998l9627l4451K2436q150l1010k6393l0269M3539O0612K3907r715
15410F0103r4064m2776N0280M3748J5100L4862k6097q5895J5165L2955n0970N2533
15398D944N1188L8780k5909k0518J7163o9782n541J697M6356L5527k09O011k2950
$$ plain form
15385 56757 69724 65306 103062 50219 -28680 -10171 36627 -27433 -79135 -58999 -58397 -23434
15373 -23434 7638 22537 49268 129108 113993 19274 -13335 -15252 29241 3832 -26556 -44070
15361 -44070 37137 46476 80005 74339 44528 -40399 -124242 -55676 2931 63019 139340 133420
15349 133420 87540 99459 112064 -13785 -55230 12254 7834 24173 -71353 -106128 -126898
15338 -126898 -55281 14231 11229 27692 98797 159242 100382 26017 9355 3508 74153 101961
15326 101961 45257 42029 -3813 -12340 6520 -32766 12992 31924 19087 22460 73063 81003
15314 81003 -16420 -77796 -66920 3175 32035 36533 70847 86516 105631 47017 -34416 -70701
15302 -70701 -93679 -40000 7617 19723 11398 126669 120720 102080 137180 74085 -5141 -69369
$$ packed form
15385E6757J2967m418L7756n2843p8899J8509M6798o4060n1702K0136O02L4963
15373b3434L1072J4899K6731P9840j5115r4719l2609j917M4493k5409l0388j7514
15361d4070Q1207R339L3529n666k9811q4927q3843O8566N8607O0088P6321n920
15349A33420m5880J1919J2605j25849m1445O7484m420J6339r5526l4775k0770
15338a26898P1617O9512l002J6463P1105O0445n8860p4365j6662n847P0645K7808
15326A01961n6704l228m5842q527J8860l9286M5758J8932j2837L373N0603P940
15314H1003r7423o1376J0876P0095K8860M498L4314J5669J9115n8614q1433l6285
15302g0701k2978N3679M7617J2106q325J15271n949j8640L5100o3095p9226o4228
$$ plain form
15290 -69369 -68099 -34436 -53993 -59885 -107543 -78919 -81546 -61236 -768 5234 26117 18840 -57666
15277 -57666 -69972 -105996 -91242 -20257 19372 12029 108502 145207 108219 65846 62973 58503
15265 58503 114635 134720 96805 99253 52499 -7809 -17528 25112 58769 -26512 17199 -19468
15253 -19468 -83719 -30343 48078 81494 -7332 -60822 -4434 -22053 -12670 41229 12567 -35295
15241 -35295 -32802 -100157 -113260 -51177 13931 71712 40815 -2247 65207 58001 84536 81349
15229 81349 -224 -52360 -79402 -82377 -82638 -19978 53706 5201 64981 115949 91190 -87528
15217 -87528 -167283 -153042 -120373 -91864 -59978 18900 10236 -18707 -118971 -27643 -43020 -45506
15205 -45506 -36324 -47109 3559 59061 79707 124542 123197 70411 7747 47610 40903 88923
$$ packed form
15290f9369J270L3663j9557n892m7658K8624k627K0310O0468O002K0883p277p6506
15277e7666j2306l6024J4754P0985L9629p343R6473L6705l6988m2373k873m470
15265E8503N6132K0085l7915K448m6754o0308r719M2640L3657q5281M3711l6667
15253a9468o4251N3376P8421L3416q8826n3490N6388j7619R383N3899k8662m7862
15241c5295K493o7355j3103O2083O5108N7781l0897m3062O7454p206K6535l187
15229H1349q1573n2136k7042k975k61O2660P3684m8505N9780N0968k4759j78718
15217h7528p9755J4241L2669K8509L1886P8878q664k8943j00264R1328j5377k486
15205d5506R182j0785N0668N5502K0646M4835j345n2786o2664L9863o707M8020
$$ plain form
15193 88923 123980 107661 34312 41992 45730 79118 75899 20236 -4773 10058 10100 14059 55238
15180 55238 56246 70199 53312 -5849 -93122 -61307 -56435 -35443 -46996 -47805 51608 94192
15168 94192 75215 23722 -39135 -43927 8310 43137 29655 -15626 -50429 -30098 -33123 -69527
15156 -69527 -88517 -83746 -83434 -90449 -41853 176 28287 -13202 37156 -6822 -15028 -23383 -43558
15143 -43558 -127841 -95894 -35163 -24306 -30816 -29035 -43399 -62084 -64499 -47364 32329 76193
15131 76193 34285 10925 -67570 -73985 -21995 6291 -21944 -72527 -97973 -85762 -52676 -21102
15119 -21102 5940 67136 64735 11502 -31885 -16281 -7896 -17829 -38156 -86952 -64224 51967
15107 51967 72776 41090 28378 23867 37155 36547 -15355 -47755 -68128 12041 -2430 48052
$$ packed form
15193H8923L5057j6319p3349P680L738L3388l219n5663k5009J4831M2L959M1179
15180E5238J008J3953j6887n9161q7273L1815M872K0992j1553q09R9413M2584
15168I4192j8977n1493o2857m792N2237L4827j3482m5281l4803K0331l025l6404
15156f9527j8990M771L12p015M8596M2029K8111m1489N0358m3978q206q355k0175
15143d3558q4283L1947O0731J0857o510J781j4364j8685k415J7135P9693M3864
15131G6193m1908k3360p8495o415N1990K8286k8235n0583k5446J2211L3086L1574
15119b1102K7042O1196k401n3233m3387J5604Q385r933k0327m8796K2728J16191
15107E1967K0809l1686j2712m511J3288o08n1902l2400k0373Q0169j4471N0482
$$ plain form
15095 48052 78064 111673 131634 88004 -11923 -130899 -143014 -86567 -33516 -20390 -18015 -47397
15083 -47397 -75389 -25566 -22827 3236 8861 -46357 -63264 -131150 -124776 -19298 6178 -21612
15071 -21612 -61625 -10741 31540 -23004 -73166 -26278 -34604 -120351 -140851 -54067 1874 -28131
15059 -28131 -123170 -102517 -48653 -59465 -58746 21285 12465 -40572 4073 61418 79744 122644
15047 122644 91357 37919 13147 -4871 -73109 -50750 70671 150910 140425 58157 -47119
15036 -47119 -96862 -126997 -157361 -123926 -194586 -182403 -104689 -69183 -2381 -8998 -42966 45610
15024 45610 29639 27481 23944 -30676 -80029 -102129 -77033 -29058 -41616 -56389 -37711 -39654
15012 -39654 -6734 24463 3806 20329 57589 143989 148254 64071 -5302 -14439 -55603 -62892
$$ packed form
15095D8052L0012L3609J9961m3630r9927j18976j2115N6447N3051J3126K375k9382
15083d7397k7992M9823K739K6063N625n5218j6907o7886O374J05478K5476k7790
15071b1612m0013N0884M2281n4544n0162M6888q326q5747k0500Q6784N5941l0005
15059b8131r5039K0653N3864j0812P19Q0031q820n3037M4645N7345J8326M2900
15047A22644l1287n3438k4772j8018o8238K2359J21421Q0239j0485q2268j05276
15036d7119m9743l0135l0364L3435p0660J2183P7714L5506O6802o617l3968Q8576
15024D5610j5971k158l537n4620m9353k2100K5096M7975j2558j4773J8678j943
15012c9654L2920L1197k0657J6523L7260Q6400M265q4183o9373r137m1164p289
$$ plain form
15000 -62892 -28733 -42802 -40359 -61802 -21440 20918 38758 -8536 -4394 87702 126641 135599
14988 135599 145610 61390 57233 82118 56439 23686 -19044 -62150 -52737 17634 3393 -90335
14976 -90335 -81303 -55277 -12814 7605 -28852 -57169 -29833 -41679 -22493 -35472 -62145 -34516
14964 -34516 -40447 -19467 -2275 -58942 -119791 -86468 9487 1676 -66988 -91314 -68227 -111348
14952 -111348 -72948 -12010 -29454 -31497 -51133 -3087 41293 -11393 12858 58216 91076 90366
14940 90366 143485 142969 127948 49316 -28740 -1536 54763 106546 163467 150223 74517 72057
14928 72057 36930 5733 6819 -43100 -25087 -84529 -80333 -17400 4364 33876 29602 12372
14916 12372 60708 91214 101516 85298 63557 40628 -11993 -73879 -17577 76348 52049 47528
$$ packed form
15000f2892L4159j4069K443k1443M0362M2358J7840m7294M142R2096L8939Q958
14988A35599J0011q4220m157K4885k5679l2753m2730m3106R413P0371j4241r3728
14976i0335R032K6026M2463K0419l6457k8317K7336j1846J9186j2979k6673K7629
14964c4516n931K0980J7192n6667o0849L3323R5955p811o8664k4326K3087m3121
14952a11348L8400O0938j7444k043j9636M8046M4380n2686K4251M5358L2860p10
14940I0366N3119n16j5021p8632p8056K7204N6299N1783N6921j3244p5706k460
14928G2057l5127l1197J086m9919J8013n9442M196O2933K1764K9512m274j7230
14916A2372M8336L0506J0302j6218k1741k2929n2621o1886N6302R3925k4299m521
$$ plain form
14904 47528 16792 -25285 -17193 26489 69368 120283 200270 173447 173824 112302 38638 -26032
14892 -26032 -60765 -50793 -55903 -64239 -81869 -92928 -109311 -26144 23624 61655 51515 24993
14880 24993 -39765 -26032 -15689 -100649 -107094 -110286 -110325 -48678 -67441 -79344 -13036 1772 -12760
14867 -12760 33943 22905 62619 60454 30138 22411 38992 89405 58240 41407 22719 15129
14855 15129 61720 62570 6538 -94946 -158579 -119547 -65980 -9016 -34518 17414 48901 26691
14843 26691 -29613 -36635 -29882 -27418 -61494 -4434 -31911 -77382 -54212 13171 -27087 450
14831 450 43111 101611 158405 174457 167452 121606 68857 17230 1842 118917 99897 33004
14819 33004 32954 17024 -13878 13760 -6996 -3356 -31922 -73392 -59288 -13371 -36249 -27294 -67841
$$ packed form
14904D7528l0736m2077Q092M3682M2879N0915P9987k6823L77o1522p3664o4670
14892b6032l4733R972n110q336j7630j1059j6383Q3167M9768L8031j0140k6522
14880B4993o4758J3733J0343q4960o445l192l9O1647j8763j1903O6308J4808j4532
14867a2760M6703j1038L9714k165l0316p727J6581N0413l1165j6833j8688p590
14855A5129M6591Q50n6032j01484o3633L9032N3567N6964k5502N1932L1487k2210
14843B6691n6304p022O753K464l4076N7060k7477m5471K3170O7383m0258K7537
14831D50M2661N8500N6794J6052p005m5846n2749n1627j5388J17075j9020o6893
14819C3004n0j5930l0902K7638k0756L640k8566m1470J4104M5917k2878Q955m0547
$$ plain form
14806 -67841 -86735 -115525 -123135 -73074 -134527 -145480 -62478 -29669 12127 -18028 -29281 -45453
14794 -45453 -70092 -20121 -20543 -49031 -54554 -116967 -150818 -166301 -155047 -135020 -87560 -86411
14782 -86411 -41917 61851 116413 104319 127369 91408 22389 -6164 -24266 -32983 -49670 -91751
14770 -91751 -125916 -133654 -106517 -45920 -8890 -6717 -34830 -25876 -69277 -87558 -124011 -88114
14758 -88114 -94819 -99847 -106466 -80703 -35145 -99315 -161775 -112804 -10721 -65384 -68125 -74539
14746 -74539 -105467 -96028 -106530 -37907 -50394 -35420 45141 83105 37005 17488 68047 57215
14734 57215 10562 -29793 -156742 -129677 -86683 -82549 -47026 -24777 -48243 -38282 -86884 -72554
14722 -72554 -31794 -99216 -112989 -89489 -47432 -58439 -96129 -70316 -50066 -73616 -49574 19729
$$ packed form
14806f7841j8894k8790p610N0061o1453j0953Q3002L2809M1796l0155j1253j6172
14794d5453k4639M9971m22k8488n523o2413l3851j5483J1254K0027M7460J149
14782h6411M4494J03768N4562j2094K3050l5961o9019k8553j8102q717j6687m2081
14770i1751l4165p738K7137O0597L7030K173k8113Q954m3401j8281l6453L5897
14758h8114o705n028o619K5763M5558o4170o2460M8971J02083n4663k741o414
14746g4539l0928R439j0502O8623j2487J4974Q0561L7964m6100j9517N0559j0832
14734E7215m6653m0355j26949K7065M2994M134L5523K2249k3466R961m8602J4330
14722g2554M0760o7422j3773K3500M2057j1007l7690K5813K0250k3550K4042O9303
$$ plain form
14710 19729 -58461 -62915 -42166 -36338 -29183 -38270 -15842 11164 43267 -20586 15294 82559
14698 82559 42392 26601 51789 97863 58417 26872 -54269 -50264 58288 23416 -66965 -110020
14686 -110020 -79402 -19574 -22190 -8084 16875 -23988 -32377 -24509 -41929 -38021 -17022 -24142
14674 -24142 -37827 3448 21803 -14996 -73130 -27895 32486 110929 76897 -44991 -13716
14663 -13716 20242 -46088 25126 5215 -2544 35792 68725 60929 16945 10216 35305 39321
14651 39321 98183 95210 14284 35630 85430 71703 51454 51348 29072 -25406 -83375 -80541
14639 -80541 29029 44489 51657 67676 11097 -10127 -37611 -86580 -57248 -18943 -16054 43996
14627 43996 56360 22294 46568 -5156 -29155 20664 12525 3275 -34206 61582 90360 61930
$$ packed form
14710A9729p8190m454K0749N828P155r087K2428K7006L2103o3853L5880O7265
14698H2559m0167j5791K5188M6074l9446l1545q1141M005J08552l4872r0381m3055
14686a10020L0618N9828k616J4106K4959m0863q389P868j7420L908K0999p120
14674b4142j3685M1275J8355l6799n8134M5235O0381P8443l4032j21888L1275
14663a3716L3958o6330P1214j9911p759L8336L2933p796m3984o729K5089M016
14651C9321N8862k973q0926K1346M9800j3727k0249j06k2276n4478n7969K834
14639h0541J09570J5460P168J6019n6579k1224k7484m8969K9332L8305K889O0050
14627D3996J2364l4066K4274n1724k3999M9819q139r250l7481R5788K8778k8430
$$ plain form
14615 61930 46984 -22242 -34823 -68435 -72921 -117178 -107149 -36767 -13861 27881 27940 72055
14603 72055 74482 69008 -7263 -47582 31561 41220 -9787 -3721 -9715 7894 50127 45116 25603
14590 25603 31160 7454 12163 78529 48764 -72388 -48238 6236 78761 47143 -20496 -68171
14578 -68171 -91927 -83931 -46951 -49233 -88925 -66514 -40362 -74185 -148857 -152112 -108220 -25025
14566 -25025 14503 -17543 -93846 -99491 -99619 -66102 -38690 -9536 10579 15611 93815 81889
14554 81889 18467 17453 27117 -16838 -11991 -18364 -782 34713 36919 71809 54685 8400 28627
14541 28627 4650 24464 10798 49522 5905 -1331 43739 27542 45409 82121 26093 -1820
14529 -1820 19862 -35052 -62808 18711 28836 12163 86235 73335 60080 46326 25292 -13118
$$ packed form
14615F1930j4946o9226j2581l3612m486m4257J0029P0382K2906M1742N9M4115
14603G2055K427n474p6271m0319P9143R659n1007O066n994J7609M2233n011j9513
14590B5603N557k3706M709O6366k9765j21152K4150N4474P2525l1618o7639m7675
14578f8171k3756P996L6980k282l9692K2411K6152l3823p4672l255M3892Q3195
14566b5025L9528l2046p6303n645j28L3517K7412K9154K0115N032P8204j1926
14554H1889o3422j014R664m3955M847o373J7582L5495K206L4890j7124m6285K0227
14541B8627k3977J9814j3666L8724m3617p236M5070j6197J7867L6712n6028k7913
14529a820K1682n4914k7756Q1519J0125j6673P4072j2900j3255j3754k1034l8410
$$ plain form
14517 -13118 -54380 -42180 11356 22612 21627 1716 57438 62588 20589 26644 70998 16392
14505 16392 -6641 30668 79076 -3357 -127700 -79403 -25909 5085 -6352 -40089 -56866
14494 -56866 -90061 -76796 -99068 -88971 -6245 60691 5163 -82693 -65804 -3024 14724 -3052
14482 -3052 36397 3290 -52745 -50504 -27227 -3853 -48573 -36655 -9565 -5561 46555 -60784
14470 -60784 -5408 2491 -60904 -45858 59644 72237 61220 35673 -32173 -50421 15594 34823
14458 34823 -7071 -21169 401 -15252 -75852 -79682 -97038 -129605 -70657 -11968 -28700 -16738
14446 -16738 599 5468 67109 144275 145609 147605 77114 76332 105267 88686 64379 43432 105084
14433 105084 170202 161694 176631 184872 54362 18432 -7281 -106803 -42263 -3106 -47799 -74467
$$ packed form
14517a3118m1262J2200N3536J1256r85j9911N5722N150m1999O055M4354n4606
14505A6392k3033L7309M8408q2433j24343M8297N3494L0994j1437l3737j6777
14494e6866l3195J3265k2272J0097Q2726O6936n5528q7856J6889O2780J7748j7776
14482c052L9449l3107n6035K241K3277K3374m4720J1918K7090M004N2116j07339
14470f0784N5376P899o3395J5046J05502J2593j1017k5547o7846j8248O6015J9229
14458C4823m1894j4098K1570j5653o0600l830j7356l2567N8948N8689j6732J1962
14446a6738J7337M869O1641P7166J334J996p0491p82K8935j6581k4307k0947O1652
14433A05084O5118q508J4937Q241j30510l5930k5713r9522O4540L9157m4693k6668
$$ plain form
14421 -74467 -34303 -42736 -101139 -143346 -134692 -112170 -107321 -76043 -26012 -32812 -73844 -36189
14409 -36189 52122 87437 58224 61942 81711 58616 25670 16075 40391 -676 -21574 -13371
14397 -13371 14819 5198 -17849 18221 57628 115507 67609 29708 94057 83383 19799 -42344
14385 -42344 -84314 -82939 -108513 -105647 -38430 38556 52569 -51044 -143664 -116418 -57087 -13775
14373 -13775 -2048 18376 22006 -20833 -97579 -127616 -67153 47754 97323 103812 113300 46317
14361 46317 69366 63105 61485 51739 32441 55617 -50425 -63043 49800 96050 51527 46054
14349 46054 -85541 -142533 -78298 -44656 5583 6881 -3452 3570 -11074 43679 30421 27538
14337 27538 -24052 -110537 -158993 -79520 16857 71856 18522 -55061 -76729 -89098 -87268 -103035
$$ packed form
14421g4467M0164q433n8403m2207Q654K2522M849L1278N0031o800m1032L7655
14409c6189Q8311L5315k9213L718J9769k3095l2946r595K4316m1067k0898Q203
14397a3371K8190r621k3047L6070L9407N7879m7898l7901O4349j0674o3584o2143
14385d2344m1970J375k5574K866O7217P6986J4013j03613r2620K7246N9331M3312
14373a3775J1727K0424L630m2839p6746l0037O0463J14907M9569O489R488o6983
14361D6317K3049o261j620r746j9298K3176j06042j2618J12843M6250m4523n473
14349D6054j31595n6992O4235L3642N0239J298j0333P022j4644N4753j3258k883
14337B7538n1590q6485m8456P9473R6377N4999n3334p3583k1668j2369J830j5767
$$ plain form
14325 -103035 -109347 -132519 -96685 -39095 -1935 80411 51415 -56102 -56071 -55329 -54642 44568 108907
14312 108907 122847 124646 39003 -47914 11341 67411 12479 -4608 -12535 -52987 -62600 -102776
14300 -102776 -72407 -72615 -77840 -76898 -60123 -105869 -54995 -15636 -51393 -12786 78365 99461
14288 99461 97578 85504 40304 7683 -78767 -87660 -40144 -37167 -17528 54787 45740 18672
14276 18672 -6729 7052 23355 -64642 -83119 -32541 -9670 -14734 2760 -63942 -80188 -130304
14264 -130304 -131989 -111791 -58033 -10984 45513 60304 29452 15907 5125 -15575 -13078 29131
14252 29131 61432 25927 37236 60183 29466 52949 77302 66247 48307 7955 86336 126558
14240 126558 99636 79417 62413 -3381 -32696 -31483 -66400 -50998 34383 120879 125703 163207
$$ packed form
14325a03035o312k3172L5834N7590L7160Q2346k8996j07517L1P42O87R9210O4339
14312A08907J3940J799q5643q6917N9255N6070n4932j7087p927m0452r613m0176
14300a02776L0369k08n225R42J6775m5746N0874L9359l5757L8607R1151K1096
14288I9461j883j2074m5200l2621q6450q893M7516K977J9639P2315r047k7068
14276A8672k5401J3781J6303q7997j8477N0578K2871n064J7494o6702j6246n0116
14264a30304j685K0198N3758M7049N6497J4791l0852j3545j0782k0700K497M2209
14252B9131L2301l5505J1309K2947l0717K3483K4353j1055j7940m0352P8381M0222
14240A26558k6922k0219j7004o5794k9315J213l4917J5402Q5381Q6496M824L7504
$$ plain form
14228 163207 99172 64353 42689 63313 40360 -17384 38874 75219 9149 262 39655 -3741
14216 -3741 13120 29968 33944 32155 83184 84014 18910 -6608 -60968 -33314 -8966 9439 -43584
14203 -43584 -88749 -71407 -19985 624 18038 52147 811 -48479 -26579 -17747 23440 57763
14191 57763 53740 -16499 -133382 -139989 13225 91878 119932 87370 39342 71286 85456 139446
14179 139446 121254 42382 -18221 -29373 66747 124167 154819 80059 -2690 19235 58275
14168 58275 97292 2304 -8464 5009 -6884 26542 3131 -30536 105157 208773 131446
14157 131446 115267 78680 78505 17318 -66947 16379 46658 35571 -22191 -30826 -115546 -162961
14145 -162961 -129012 -25739 48948 38234 25451 14708 19946 -1286 -18661 -25455 -63993 -23241
$$ packed form
14228A63207o4035l4819k1664K0624k2953n7744N6258L6345o6070q887L9393m3396
14216c741J6861J6848L976j789N1029Q30o5104k5518n4360K7654K4348J8405n3023
14203d3584m5165J7342N1422K0609J7414L4109n1336m9290K1900Q832M1187L4323
14191E7763m023p0239j16883o607J53214P8653K8054l2562m8028L1944J4170N3990
14179A39446j8192p8872o0603j1152R6120N7420L0652p4760q2749K1925L9040
14168E8275L9017r4988j0768J3473j1893L3426k3411l3667J35693J03616p7327
14157A31446j6179l6587j75o1187q4265Q3326L0279j1087n7762q635q4720m7415
14145a62961L3949J03273P4687j0714j2783j0743N238k1232j7375o794l8538M0752
$$ plain form
14133 -23241 -76144 -70345 -68378 25949 83482 127000 66904 38205 18607 70087 74116 47925
14121 47925 32623 52497 92464 47196 -2362 -676 37720 589 10406 33214 53475 82184
14109 82184 31765 -32108 -25239 -37658 -34722 -100495 -68940 -52827 -20482 2122 -10887 17772
14097 17772 -66656 -103813 -61301 -34351 -17082 -18931 -3874 -20011 -31091 24812 41569 45422
14085 45422 16314 34063 -29404 -12944 -39922 -10689 31047 -686 -2389 45101 49041 1281
14073 1281 -30305 31774 98649 47175 74225 92361 55778 19724 68734 174070 146820 29858
14061 29858 51521 22130 -19165 -82219 -70561 -22808 21780 63710 66476 39788 60516 -28725
14049 -28725 1568 79838 -1103 22117 79392 98682 68503 -20802 -23166 -48567 -62753 -85467
$$ packed form
14133b3241n2903N799J967R4327N7533M3518o0096k8699j9598N1480M029k6191
14121D7925j5302J9874L9967m5268m9558J686L8396l7131R817K2808K0261K8709
14109H2184n0419o3873O869j2419K936o5773L1555J6113L2345K2604j3009K8659
14097A7772q4428l7157M2512K6950J7269j849J5057j6137j1080N5903J6757L853
14085D5422k9108J7749o3467J6460k6978K9233M1736l1733j703M7490L940m7760
14073A281l1586O2079O6875n1474K7050J8136l6583l6054M9010J05336k7250j16962
14061B9858K1663k9391m1295o3054J1658M7753M4588M1930K766k6688K0728q9241
14049b8725L0293P8270q0941K3220N7275J9290l0179q9305k364k5401j4186k2714
$$ plain form
14037 -85467 -105448 -17726 68970 107548 90448 62339 58289 98748 154050 113038 23256 -20177
14025 -20177 -12848 32613 -49651 -12857 47285 76270 57499 70535 50219 41323 9936 -30109
14013 -30109 -48610 -3997 48748 76007 77775 92955 92845 82051 62419 50350 54597 38480
14001 38480 60068 17740 39081 61267 5534 -77418 -102845 9086 87428 29532 -14383
13990 -14383 18508 33034 -87478 -73662 -8982 -20783 -39080 -45209 -53757 -24310 -71432 -11765
13978 -11765 -11501 -53035 -29406 -9662 -18421 -14373 19251 93443 69286 14175 52155 23289
13966 23289 -65965 -104545 -106109 -53961 -56087 -49015 -19968 -13569 -2799 40439 127989 198306
13954 198306 199489 156355 117495 126480 120607 13968 -14244 -4199 892 40396 88644 45192
$$ packed form
14037h5467j9981Q7722Q6696L8578j7100k8109m050M0459N5302m1012q9782m3433
14025b0177P329M5461q2264L6794O0142K8985j8771J3036k0316q896l1387m0045
14013c0109j8501M4613N2745K7259J768J5180j10j0794j9632j2069M247j6117
14001C8480K1588m2328K1341K2186n5733q2952k5427J11931P8342n7896m3915
13990a4383L2891J4526j20512J3816O4680j1801j8297o129q548K9447m7122N9667
13978a1765K64m1534K3629J9744q759M048L3624P4192k4157n5111L7980k8866
13966B3289q9254l8580j564N2148k126P072K9047O399J0770M3238Q7550P0317
13954A98306J183m3134l8860Q985n873j06639k8212J0045N091L9504M8248m3452
$$ plain form
13942 45192 -16712 52294 162254 160484 87436 87112 81890 -16952 -102066 -89048 -29778 -14961
13930 -14961 -32596 13396 7007 19888 37701 99125 95857 -23882 -89429 -77196 -112160 -67034
13918 -67034 9832 69126 29355 55850 -17222 31937 70020 28568 24797 46377 -27310 -21353
13906 -21353 41008 88155 18685 -45612 -63916 -66838 -33443 -5182 12707 55785 13117 -12568
13894 -12568 -41868 -41949 10638 1997 -21761 -14806 42291 24401 -27496 -38011 -63067 -83245 -29446
13881 -29446 -15419 -41343 -36532 -25557 -17653 5136 -27147 3458 64649 108301 -6730 -31797
13869 -31797 24738 -40603 -15633 60405 81431 70320 110098 89204 28314 -3582 -7753 -17904
13857 -17904 71651 194156 108617 28963 -9055 26643 31543 36425 36655 11608 4229 -30950
$$ packed form
13942D5192o1904O9006J09960j770p3048l24n222r8842q5114J3018N9270J4817
13930a4961j7635M5992o389J2881J7813O1424l268j19739o5547J2233l4964M5126
13918f7034P6866N9294l9771K6495p3072M9159L8083m1452l771K1580p3687N957
13906b1353O2361M7147o9470o4297j8304k922L3395K8261J7889M3078m2668k5685
13894a2568k9300q1N2587q641k3758O955N7097j7890n1897j0515k5056k0178N3799
13881b9446J4027k5924M811J0975P904K2789l2283L0605O1191M3652j15031k5067
13869c1797N6535o5341K4970P6038K1026j1111L9778k0894o0890l1896m171j0151
13857a7904Q9555J22505q5539p9654l8018L5698M900M882K30k5047p379l5179
$$ plain form
13845 -30950 -59686 -5077 26572 -26192 -28377 -36407 26242 66684 34861 132352 188686 163303
13833 163303 113314 78215 91715 77522 46180 5449 1984 -3474 -3755 33423 6812 -47206
13821 -47206 -77062 -104913 -88897 -112555 -101442 -31771 21297 39141 20920 -23505 -46174 -89750
13809 -89750 -155175 -72182 5076 -26748 -57427 -35949 -16053 212 6546 23080 41602 -62607
13797 -62607 -149523 -116411 -50269 -28262 -14771 1008 -34352 -72981 -95573 -79930 -33905 -11226
13785 -11226 47093 90399 40463 57569 134359 103438 79101 71193 38875 46076 -36614 -58662
13773 -58662 -79327 -80544 1337 68384 68473 53285 49976 3457 -61631 -22760 -69352 -127598 -87203
13760 -87203 -80240 -121842 -108194 -126571 -70206 14208 -2888 15727 62256 37391 25597 -6680
$$ packed form
13845c0950k8736N4609L1649n2764k185q030O2649M0442l1823R7491N6334k5383
13833A63303m9989l5099J3500j4193l1342m0731l465n458k81L7178k6611n4018
13821d7206k9856k7851J6016k3658J1113O9671N3068J7844j8221m4425k2669m3576
13809h9750o5425Q2993P7258l1824l0679K1478J9896J6265O334J6534J8522j04209
13797f2607q6916L3112O6142K2007J3491J5779l5360l8629k2592J5643M6025K2679
13785a1226N8319M3306m9936J7106P6790l0921k4337p908l2318P201q2690k2048
13773e8662k0665j217Q1881O7047Q9j5188l309m6519o5088L8871m6592n8246M0395
13760h7203O963m1602J3648j8377N6365Q4414j7096J8615M6529k4865j1794l2277
$$ plain form
13748 -6680 -63783 -30004 28273 84877 88271 166281 118763 63756 104348 88243 -5009 18639
13736 18639 120539 143114 77179 72314 111287 52344 6222 -6403 13696 24300 -5163 -12563
13724 -12563 -54058 -119821 -48160 -87952 -86916 -73881 -47869 49051 51004 77805 99503 71548
13712 71548 98597 88980 8563 -25774 19165 27623 8324 91185 129557 91847 105140 74687
13700 74687 35622 105502 32416 -61420 -104619 -94119 -132540 -153464 -40854 -10776 -67357
13689 -67357 -11922 87828 49280 24829 -11633 -3347 25129 -24343 -100611 -146269 -59572 55198
13677 55198 49962 43432 7395 -21632 -20453 6504 -65034 -55398 -37023 833 -3242 14386 11568
13664 11568 -18850 -12696 52918 31798 18615 -29024 -35431 3356 60607 112951 169112 125868
$$ packed form
13748f680n7103L3779N8277N6604L394P8010m7518n5007M0592j6105r3252K3648
13736A8639J01900K2575o5935m865L8973n8943m6122j2625K0099J0604k9463p400
13724a2563m1495o5763P1661l9792J036J3035K6012R6920J953K6801K1698k7955
13712G1548K7049r617q0417l4337M4939Q458j9299Q2861L8372l7710J3293l0453
13700G4687l9065O9880p3086r3836m3199J0500l8421k0924J12610L0078n6581
13689f7357N5435R9750l8548k4451l6462Q286K8476m9472p6268m5658Q6697J14770
13677E5198n236o530l6037k9027J179K6957p1538R636J8375L7856m075J7628k818
13664A1568l0418O154O5614k1120j3183m7639o407L8787N7251N2344N6161m3244
$$ plain form
13652 125868 27561 -96778 -92792 -27038 48602 57898 46950 2920 -66887 -135487 -113194 -78905
13640 -78905 -61562 -84659 -42221 917 6861 -482 -1697 -58252 -32086 -26556 -39744 -55645
13628 -55645 13406 10308 53111 51604 53444 -5932 -37135 -85790 -65596 -57477 -92771 -20888
13616 -20888 56849 -10956 33473 48111 13104 -1508 3514 -47673 -18459 -62043 -34111 -5056
13604 -5056 32110 36544 99021 107611 23244 18060 -12743 36127 50198 -16553 -55246 -50100 -38547
13591 -38547 -76153 -57207 -48410 -21088 2048 61909 47453 25244 9763 14260 -13463 -100423
13579 -100423 -47709 -54280 -105720 -79929 -47284 32214 142692 243126 241173 277409 207112
13568 207112 115079 83314 119895 104566 92471 90890 159101 104793 -677 -28594 -14495
$$ packed form
13652A25868r8307j24339L986O5754P5640R296j0948m4030o9807o8600K2293L4289
13640g8905J7343k3097M2438M3138N944p343j215n6555K6166N530j3188j5901
13628e5645O9051l098M2803j507J840n9376l1203m8655K0194Q119l5294P1883
13616b0888P7737o7805M4429J4638l5007j4612N022n1187K9214m3584K7932K9055
13604e056L7166M434O2477Q590q4367n184l0803M8870J4071o6751l8693N146J1553
13591c8547l7606J8946Q797K7322K3136N9861j4456k2209j5481M497k7723q6960
13579a00423N2714o571n1440K5791L2645P9498J10478J00434j953L6236p0297
13568B07112r2033l1765L6581j5329j2095j581O8211n4308j05470k7917J4099
$$ plain form
13557 -14495 19034 68110 76956 19360 76152 82317 24374 10314 -58127 -62978 -84164 -147304
13545 -147304 -90727 88837 129859 43062 75742 50563 47799 84759 52558 -9638 -69259
13534 -69259 30927 112714 125798 89618 -28496 -79579 -15785 67536 26882 -20605 -10280
13523 -10280 43012 17479 32600 43006 -14204 -32465 -14973 -18675 -5414 15401 20122 21713
13511 21713 -2449 -20001 -25647 -82864 -152114 -109357 -54492 -58246 -52805 18978 46576 32707
13499 32707 8001 15866 44817 63248 43789 -20105 -16967 1772 26494 63845 73073 13663
13487 13663 -102690 -105565 -21817 26612 11911 19885 -59262 -157244 -115085 -83058 -60477 -51764
13475 -51764 -43033 -85950 -83046 -104421 -64651 -15922 -27433 -28074 -29857 -21840 5674 -5760 5039
$$ packed form
13557a4495L3529M9076Q846n7596N6792O165n7943j4060o8441m851k1186o3140
13545a47304N6577J79564M1022q6797L2680k5179k764L6960l2201o2196n9621
13534f9259J00186Q1787J3084l6180j18114n1083O3794Q3321m0654m7487J0325
13523a0280N3292k5533J5121J0406n7210j8261J7492l702J3261K0815M721J591
13511B1713k4162j7552n646n7217o9250M2757N4865l754N441P1783K7598j3869
13499C2707k4706P865K8951J8431j9459o3894L138J8739K4722L7351R228n9410
13487A3663j16353k875Q3748M8429j4701P974p9147r7982M2159L2027K2581Q713
13475e1764Q731m2917K904k1375L9770M8729j1511o41j783Q017K7514j1434J0799
$$ plain form
13462 5039 18957 -20490 -98915 -101017 -28686 -62386 -9352 83119 63735 31397 38184 42342
13450 42342 5736 -63182 -97952 -72973 -51456 -14619 29262 39598 71503 45599 55617 -98531
13438 -98531 -186361 -147879 -52556 -8470 -4105 13235 39178 40291 5840 -68006 -128765 -121666
13426 -121666 -137120 -85754 -84410 -93939 -65910 -30572 3800 27576 20858 -3652 -13025 -5128
13414 -5128 21374 75891 86809 58541 84658 71697 17261 104366 146224 165783 117980 77089
13402 77089 37465 -154 -22657 -29036 27631 97659 79283 45660 46462 43605 18772 5299
13390 5299 -15421 18347 54854 105764 105759 108909 19546 -22791 -39685 -96738 -102894 -103928 -109120
13377 -109120 -60835 26154 49080 115913 129966 122446 87932 84925 82114 -12155 -75966 14743
$$ packed form
13462E039J3918l9447p8425k102P2331l3700N3034R2471j9384l2338O787M158
13450D2342l6606o8918l4770K4979K1517L6837M3881J0336L1905k5904J0018j54148
13438i8531q7830L8482R5323M4086M365J7340K5943J113l4451p3846o0759P099
13426a21666j5454N1366J344r529K8029L5338L4372K3776o718k4510r373P897
13414e128K6502N4517J0918k8268K6117j2961n4436Q7105M1858J9559m7803m0891
13402G7089l9624l7619k2503o379N6667P0028j8376l3623Q02k857k4833j3473
13390E299k0720L3768L6507N0910nL150q9363m2337j6894n7053o156j034n192
13377a09120M8285Q6989K2926O6833J4053p520l4514l007k811r4269o3811R0709
$$ plain form
13365 14743 108260 168415 160340 98528 75379 116574 141844 121455 85384 62675 37894 14666
13353 14666 -5936 -57223 2780 33233 -15446 -61770 -41710 -36377 -107409 -86370 -69336 -16874
13341 -16874 33770 -7714 -11527 -4996 25796 -5915 -29598 -67911 -105163 -72639 -73875 -77452
13329 -77452 -95670 -163109 -142024 -46328 19873 43989 83984 8699 42633 85155 64766 49455
13317 49455 53849 74230 108893 40681 21885 -55551 -89515 -47170 -66133 -49059 4059 -37565
13305 -37565 -64558 -82744 -6906 50683 19301 -23551 42080 92147 63648 39340 2795 -54137
13293 -54137 -121089 -157765 -116410 -46841 -31823 -25606 -26348 -12575 77065 102944 49724 -33166
13281 -33166 -25970 18878 -39328 -12020 -7342 -3075 71692 105011 108843 54952 108468 85958
$$ packed form
13365A4743R3517O0155q075o1812k3149M1195K5270k0389l6071k2709k4781k3228
13353A4666k0602n1287O0003L0453m8679m6324K0060N333p1032K1039J7034N2462
13341a6874N0644m1484l813O531L0792l1711k3683l8313l7252L2524j236l577
13329g7452j8218o7439K1085R5696O6201K4116L9995p5285L3934M2522k0389j5311
13317D9455M394K0381L4663o8212j8796p7436l3964M2345j8963J7074N3118m1624
13305c7565k6993j8186P5838N7589l1382m2852O5631N0067k8499k4308l6545n6932
13293e4137o6952l6676M1355O9569J5018O217p42J3773Q9640K5879n3220q2890
13281c3166P196M4848n8206K7308M678M267P4767L3319L832n3891N3516k2510
$$ plain form
13269 85958 76396 -12463 -23744 10617 -26870 -55189 -2702 45042 -3910 -3773 13716 17371
13257 17371 20092 60377 -7012 -95670 -45745 10502 4761 -16959 -14824 41341 32318 80791
13245 80791 132126 148338 111302 95210 170787 153311 114154 143828 93537 45915 40121 78949
13233 78949 72215 57901 23061 21402 -15757 -94806 -62370 9896 33832 -16747 -16128 -39585
13221 -39585 -85542 -91722 -67897 -141641 -149966 -122432 -116974 -94186 -22944 -23914 -90663 -86278 -31988
13208 -31988 47472 102161 157285 121471 96220 76868 10420 -3229 -95702 -117160 -84092 -116697
13196 -116697 -103090 -57244 -58388 -100588 -52480 63481 42174 -13950 -78752 -101985 -42088
13185 -42088 13439 -60400 -56417 -15394 -3721 -89754 -93452 -15119 29508 47851 -11040 18359
$$ packed form
13269H5958r562q8859j1281L4361l7487k8319N2487M7744m8952J37J7489L655
13257A7371K721M0285o7389q8658M9925N6247n741k1720K135N6165r023M8473
13245H0791N1335J6212l7036j6092P5577j7476l9157K9674n0291m7622n794L8828
13233G8949o734j4314l4840j659l7159p9049L2436P2266K3936n0579O19k3457
13221c9585m5957o180K3825p3744q325K7534N458K2788P1242r70o6749M385N4290
13208c1988P9460N4689N5124l5814k5251j9352o6448j3649r2473k1458L3068l2605
13196a16697J3607M5846j144m2200M8108J15961k1307n6124o4802k3233N9897
13185d2088N5527p3839L983M1023J1673q6033l698P8333M4627J8343n8891K9399
$$ plain form
13173 18359 120724 106421 37121 -18734 -78912 -82126 -69448 -30712 -11812 -58588 -94283 -56247
13161 -56247 25465 29471 20942 40830 17276 24243 25132 24534 22395 81242 84938 120562 152078
13148 152078 147633 96341 102247 54880 12155 -15417 13118 37610 -33862 -89751 -84763 -124030
13136 -124030 -74278 8150 5742 -54561 -60665 -30357 -48769 -60658 -57282 -54985 -77328 -32128
13124 -32128 607 52281 98485 129219 55409 -1413 33035 69910 30994 20585 84404 80583
13112 80583 134635 174518 72116 -54354 -45506 -90117 -88463 -58166 -67142 -147920 -217534 -111337
13100 -111337 -54985 -49447 15658 21686 44408 16685 12572 52006 99462 121185 85248 21975
13088 21975 -41711 -55408 -21566 32346 73428 90728 -10027 -42339 4399 92985 89861 39289
$$ packed form
13173A8359J02365j4303o9300n5855o0178l214J2678L8736J8900m6776l5695L8036
13161e6247Q1712M006q529J9888k3554O967Q89n98k139N8847L696L5624L1516
13148A52078m445n1292N906m7367m2725k7572K8535K4492p1472n5889M988l9267
13136a24030M9752Q2428k408o0303o104L0308j8412j1889L376K297k2343M5200
13124c2128L2735N1674M6204L0734p3810n6822L4448L6875l8916j0409O3819l821
13112H0583N4052L9883j02402j26470Q848m4611J654L0297q976q0778o9614J06197
13100a11337N6352N538O5105O028K2722k7723m113L9434M7456K1723l5937o3273
13088B1975o3686j3697L3842N3912M1082J7300j00755l2312M6738Q8586l124n0572
$$ plain form
13076 39289 -24648 -67677 -21938 -53755 -68429 -19964 17110 33401 89251 99212 75532 9880
13064 9880 -65240 -4084 40529 438 -35963 -40678 -74101 -12636 43153 102054 71915 -14744
13052 -14744 -12440 -4158 60584 42242 11235 1673 51460 55201 56676 -2497 -42848 16367 57318
13039 57318 -3273 -24347 17329 -33712 -23545 21496 -1969 -37786 -14147 1169 -25115 5518
13027 5518 52132 31903 61056 78847 7911 -73362 -43899 32863 41085 62080 113310 174213
13015 174213 150354 55816 6888 64578 70770 41577 49243 100210 64574 15642 -85261 -41619
13003 -41619 65621 18153 911 -100 1010 946 -29628 10498 61763 92596 117299 114653 61156
12990 61156 17449 31523 25004 72188 63723 -7064 -7749 31635 44736 45544 -18463 45387 125694
$$ packed form
13076C9289o3937m3029M5739l1817j4674M8465L7074J6291N5850R961k3680o5652
13064I880p5120O1156M4613m0091l6401m715l3423O1465N5789N8901l0139q6659
13052a4744K304Q282O4742j8342l1007r562M9787L741J475n9173m0351N9215M0951
13039E7318o0591k1074M1676n1041J0167M5041k3465l5817K3639J5316k6284L0633
13027E518M6614k0229K9153J7791p0936q1273K9463P6762Q222K0995N1230O0903
13015A74213k3859r4538m8928N7690O192k9193P666N0967l5636m8932j00903M3642
13003d1619J07240m7468j7242j011J110o4l0574M0126N1265L0833K4703k646n3497
12990F1156m3707J4074o519M7184q465p0787o85L9384J3101Q08o4007O3850Q0307
$$ plain form
12977 125694 178445 151275 139603 92600 -16438 -19734 3103 29683 -30220 -114495 -120922 -119593
12965 -119593 -117071 -154467 -141783 -122313 -5246 -23259 -65709 -76890 -109366 -111906 -88354 -78222
12953 -78222 -114548 -70402 -58899 -31623 -32567 -79584 -82815 -73900 -38122 25731 12462 38019
12941 38019 77994 84014 52022 51884 -8711 5535 25611 11544 -14759 13814 61124 110433
12929 110433 67445 -23414 -72733 -28463 29082 31185 40880 -16734 28118 15577 -26833 -125954
12917 -125954 -176051 -121035 -59360 53267 119882 78322 7989 -57970 -85011 -63983 -36236
12906 -36236 -7384 7000 -3934 -25543 -32189 -71272 -50256 58455 76036 -48060 -62204
12895 -62204 -38668 18688 7937 5671 30200 25305 -15705 -101778 -98787 -123072 -45629 -36601
$$ packed form
12977A25694N2751k7170j1672m7003j09038l296K2837K6580n9903q4275o427J329
12965a19593K522l7396J2684J9470J17067j8013m2450j1181l2476k540K3552J0132
12953g8222l6326M4146J1503K7276r44m7017l231Q915L5778O3853j3269K5557
12941C8019L9975O020l1992j38o0595J4246K0076j4067k6303K8573M7310M9309
12929A10433m2988r0859m9319M4270N7545K103R695n7614M4852j2541m2410r9121
12917a25954n0097N5016O1675J12627O6615m1560p0333o5959k7041K1028K7747
12906c6236K8852J4384j0934k1609o646l9083K1016J08711J7581j24096j4144
12895f2204K3536N7356j0751k266K4529m895m1010q6073K991k4285P7443R028
$$ plain form
12883 -36601 -58159 -21196 21046 51467 37701 68484 66505 34670 11973 -27292 -51563 -87636
12871 -87636 -86498 -72179 -30718 -17049 -65886 -48094 -8656 71852 81593 2751 32545 -4415
12859 -4415 -62260 -55856 -53142 -91695 -83943 -51522 7205 -26590 -15357 -53930 -80505 -68163
12847 -68163 -34207 -48442 21005 10573 111 -14288 -4964 -14461 -96099 -101830 -98753 -79030
12835 -79030 -4951 22605 -10774 40736 -4190 21128 52511 71853 -5095 -68107 23388 28096
12823 28096 1795 15182 -21085 -28099 -67892 -89033 -34423 -21823 672 -19881 -63775 -74025
12811 -74025 -24340 -32160 -34265 -43759 34407 68590 23669 -58825 -65504 -78673 -54108 94193
12799 94193 144951 131617 79338 89076 76072 66036 31010 -57098 -88949 -141878 -163617 -79612
$$ packed form
12883c6601k1558L6963M2242L0421j3766L0783j979l1835k2697l9265k4271l6073
12871h7636J138J4319M1461J3669m8837J7792L9438Q0508R741p8842K9794l6960
12859d415n7845O404K714l8553P752L2421N8727l3795J1233l8573k6575J2342
12847f8163L3956j4235O9447j0432j0462j4399R324r497q1638n731L077J9723
12835g9030P4079K7556l3379N1510m4926K5318L1383J9342p6948o3012R1495M708
12823B8096k6301J3387l6267p014l9793k1141N4610J2600K2495k0553m3894j0250
12811g4025M9685p820k105r494P8166L4183m4921q2494o679j3169K4565J48301
12799I4193N0758j3334n2279R738j3004j0036l5026q8108l1851n2929k1739Q4005
$$ plain form
12787 -79612 -29023 -49125 -53147 -39174 -34992 -15340 43855 111896 47324 -20792 -17044 10843
12775 10843 53637 34180 -9534 -10434 4119 -803 -66297 -120711 -149305 -165419 -86991 26509
12763 26509 29423 -4944 -77039 -70696 -95439 -91541 -90178 -55571 -4984 1095 -4980 -80475 -164413
12750 -164413 -200679 -118942 -120010 -137150 -101794 -82959 -76864 -57480 -38201 -48400 -35855 -23287
12738 -23287 -45862 -82067 -29862 41018 28720 27104 1217 -2840 38928 22734 41478 -13507
12726 -13507 -52413 -23139 18902 38817 -17615 -37419 -10071 -30505 -16189 139 11428 31929
12714 31929 -6260 -34188 -115502 -115964 -21166 3546 -1361 61203 26293 -60944 -51184 40518
12702 40518 27955 -48981 -25595 84309 116000 121618 90454 19253 67389 -49515 -64773
$$ packed form
12787g9612N0589k0102m022J3973M182J9652N9195O8041o4572o8116L748K7887
12775A0843M2794j9457m3714r00J4553m922o5494n4414k8594j6114P8428J13500
12763B6509K914l4367p2095O343k4743L898J363L4607N0587O079o075p5495q3938
12750a64413l6266Q1737j068j7140L5356J8835O095J9384J9279j0199J2545J2568
12738b3287k2575l6205N2205P0880j2298j616k5887m057M1768j6194J8744n4985
12726a3507l8906K9274M2041J9915n6432j9804K7348k0434J4316J6328J1289K0501
12714C1929l8189k7928q1314m62R4798K4712m907O2564l4910q7237R760R1702
12702D0518j2563p6936K3386J09904L1691N618l1164p1201M8136j16904j5258
$$ plain form
12691 -64773 -24408 -35758 -10166 -6124 49563 18440 -49563 -76884 -53723 -31516 -84231 -98846
12679 -98846 3714 -52913 -107271 -64497 25124 136811 97066 35029 14600 71151 129285
12668 129285 88896 38875 38748 14953 10040 -28673 -37123 -14449 49720 46068 -52057 -43827 -10477
12655 -10477 -39242 -45130 23731 -4932 -43235 1250 -19425 -72090 -104090 -48356 45444 96500
12643 96500 128423 137477 101950 45324 -5965 -27313 -69608 -81398 -99026 -73780 -49185 -10231
12631 -10231 -23991 -68145 -120782 -104511 -97402 -129223 -105407 -135438 -112725 -38362 26521 14969
12619 14969 6478 -44178 18338 83956 25150 -112766 -60446 -37232 -627 4040 -15180 -529
12607 -529 43065 104066 121373 68435 64166 2606 -1440 34661 -10987 2320 52232 -21977
$$ packed form
12691f4773M0365j1350K5592M042N5687l1123o8003k7321K3161K2207n2715j4615
12679i8846J02560n6627n4358M2774Q9621J11687l9745o2037k0429N6551N8134
12668A29285m0389n0021j27k3795m913l8713q450K2674O4169l652r8125Q230L3350
12655a0477k8765n888O8861k8663l8303M4485k0675n2665l2000N5734R3800N1056
12643I6500L1923R054l5527n6626n1289k1348m2295j1790j7628K5246K4595L8954
12631a0231j3760m4154n2637J6271P109l1821K3816l0031K2713P4363O4883j1552
12619A4969q491n0656O2516O5618n8806j37916N2320K3214L6605M667j9220J4651
12607e29M3594O1001J7307n2938m269o1560m046L6101m5648J3307M9912p4209
$$ plain form
12595 -21977 -25980 -25520 -84946 -25223 62092 15578 25415 42423 -28739 -35494 -764 -43463 37003
12582 37003 4645 -6561 -28254 -53581 -144590 -166516 -145317 -143194 -100010 -35042 44673 70307
12570 70307 65104 68001 -9210 -9368 8178 40321 42859 91791 82407 44326 8265 9510 80248
12557 80248 17809 -83360 -26102 -35517 -34913 -4225 58355 99016 102889 43054 -28 34463
12545 34463 116551 139331 86812 -39625 -93476 -5817 49351 67333 56424 7727 -36212
12534 -36212 -11124 69476 101719 72582 75708 44606 3954 -62497 -42899 -35305 -69706 -79980
12522 -79980 -55312 -50052 -2955 20992 41566 49097 32210 -28436 12025 56494 48350 12227
12510 12227 45352 13209 -15485 15318 65762 83460 31537 45340 108444 73943 24575 156
$$ packed form
12595b1977m003M60n9426N9723Q7315m6514R837J7008p1162o755L4730m2699Q0466
12582C7003l2358j1206k1693k5327r1009k1926K1199K123M3184O4968P9715K5634
12570G0307n203K897p7211j58J7546L2143K538M8932r384l8081l6061J245P0738
12557H0248o2439j01169N7258r415O04L0688O2580M0661L873n9835m3082L4491
12545C4463Q2088K2780n2519j26437n3851Q7659N5168J7982j0909m8697m3939
12534c6212K5088Q0600L2243k9137L126l1102m0652o6451J9598P594l4401j0274
12522g9980K4668N260M7097K3947K0574P531j6887o0646M0461M4469q144l6123
12510A2227L3125l2143k8694L0803N0444J7698n1923J3803O3104l4501m9368k4419
$$ plain form
12498 156 -10859 19217 8642 -64210 -140238 -100076 -64725 -39948 -65991 -91575 -42494 -26911
12486 -26911 -35577 -42493 119992 113139 58075 8106 -57684 -62796 -34778 -23354 2191 49030
12474 49030 32595 26010 52609 -25011 -29458 -96794 -123938 -45955 -21951 11899 -51288 -87326
12462 -87326 -24203 -22388 -87020 -120264 -108937 -42450 -37103 -84763 -4647 39445 62733 81653
12450 81653 86245 37483 -31968 3590 105158 57123 37436 32250 9660 12301 16601 46802
12438 46802 5210 47378 10481 3267 40216 61016 6131 -33175 41543 42591 48046 66016
12426 66016 73574 47665 26252 -40212 -47314 -50403 -38118 -27669 -43061 -86401 -14417 66069
12414 66069 -2710 -28207 47838 85865 19164 -45874 -60728 -35688 18559 70667 128764 119927
$$ packed form
12498A56j1015L0076j0575p2852p6028M0162L5351K4777k6043k5584M9081J5583
12486b6911q666o916J62485o853n5064m9969o5790n112K8018J1424K5545M6839
12474D9030j6435o585K6599p7620m447o7336k7144P7983K4004L3850o3187l6038
12462h7326O3123J815o4632l3244J1327O6487N347m7660Q0116M4092K3288J8920
12450H1653M592m8762o9451L5558J01568m8035j9687n186k2590K641M300L0201
12438D6802m1592M2168l6897p214L6949K0800n4885l9306P4718J048N455J7970
12426F6016P558k5909k1413o6464p102l089J2285J0449j5392m3340P1984Q0486
12414F6069o8779k5497P6045L8027o6701o5038j4854K5040N4247N2108N8097q837
$$ plain form
12402 119927 61203 88789 21441 -17758 -19557 -50853 -15099 -5258 -27678 16998 -7780 22741
12390 22741 34535 38534 20459 -23089 -17614 -4118 26994 -35838 -31000 -16808 -16138 -7616 -21382
12377 -21382 -31271 -46440 -792 8819 18862 32300 37841 62334 -2150 -31016 -41548 -6754
12365 -6754 -47528 -65530 -19807 6554 -17724 -109506 -138035 -103268 -7019 36848 79682 90689
12353 90689 64756 42058 50313 75754 86570 50400 -98376 -116266 -1113 33979 -8091
12342 -8091 26473 31323 14860 -2041 -20727 -56954 -71622 -39358 -95770 -73139 -88656 -176165
12330 -176165 -239969 -199425 -148548 -103901 -57827 -48184 40078 70960 16732 -22194 -4689 -625
12318 -625 -18039 -3782 -17838 -79015 -127274 -167351 -102781 -64556 -125458 -125587 -127405 -110420 -97758
$$ packed form
12402A19927n8724K7586o7348l9199j799l1296L5754R841k2420M4676k4778L0521
12390B2741J1794L999j8075m3548N475J3496L1112o2832M838J4192O70Q522j3766
12377b1382r889j5169M5648R611J0043J3438N541K4493o4484k8866j0532L4794
12365f754m0774j8002M5723K6361k4278r1782k8529L4767R6249M3867M2834J1007
12353I0689k5933k2698Q255K5441J0816l6170j48776j7890J15153L5092m2070
12342h091L4564M850j6463j6901j8686l6227j4668L2264n6412K2631j5517q7509
12330a76165o3804M0544N0877M4647M6074R643Q8262L0882n4228l8926J7505M064
12318f25j7414J4257j4056o1177m8259m0077O4570L8225o0902j29j818J6985J2662
$$ plain form
12305 -97758 -48898 -56124 -53040 -12930 -9374 -35151 7762 5969 4873 82911 140322 109132 1638
12292 1638 32556 78711 62479 -9090 -95187 -36381 -25354 14440 55485 -23805 -64678 -49297
12280 -49297 -53761 -52807 -79073 -123888 -113966 -79375 -23266 -42038 -56699 -59184 -19526 -14934 -22313
12267 -22313 -49020 -58740 -45968 -216 41871 -9198 -96816 -158549 -92899 -35007 -27004 -98623
12255 -98623 -159747 -43052 -12904 -59788 -100356 -74849 -12916 25856 40943 -9748 13482
12244 13482 33882 35102 -22011 7645 23826 -2333 3031 -28929 -51850 -65184 -66212 -62429
12232 -62429 -41306 8813 17154 -3492 -12465 -15159 6043 7255 -26261 -54661 -45191 -43789 1027
12219 1027 3802 -69553 -112300 -83476 -1273 -7889 -27782 -5438 -26501 -15564 -9248 -38000
$$ packed form
12305i7758M8860p226L084M0110L556k5777M2913j793j096P8038N7411l1190j07494
12292A638L0918M6155j6232p1569q6097N8806J1027L9794M1045p9290m0873J5381
12280d9297m464R54k6266m4815R922L4591N6109j8772j4661k485L9658M592p379
12267b2313k6707r720J2772M5752M2087n1069q7618o1733O5650N7892Q003p1619
12255i8623o1124J16695L0148m6884m0568K5507O1933L8772J5087n0691K3230
12244A3482K0400J220n7113K9656J6181k6159N364l1960k2921j3334j028L783
12232f2429K1123N0119Q341k0646q973k694K1202J212l3516k8400R470J402M4816
12219A027K775p3355m2747K8824Q2203o616j9893K2344k1063J0937O316k8752
$$ plain form
12207 -38000 -86246 -104071 -25131 27617 32256 51321 46875 7493 74476 118422 98711 10595
12195 10595 -21546 64772 91446 126474 94778 17486 -48431 -8644 54138 62337 41914 39541
12183 39541 103796 103228 72059 32470 -10393 -18769 12396 67155 93627 110186 61079 -33368
12171 -33368 -25891 21634 72892 91007 60543 36791 -22086 -40960 -25131 -59840 -83508 -40681
12159 -40681 23268 131333 156824 139107 113447 44669 41437 31689 -11718 44518 50967 43188
12147 43188 24884 71279 96725 149399 182107 196723 250361 226690 227998 143620 44472 -623
12135 -623 -11445 32869 22340 43305 62369 18011 -27172 -53459 -66798 -8854 54210 63872
12123 63872 106644 93220 82956 100069 66085 25977 -43562 -45944 -54982 -97233 -122907 -125012
$$ packed form
12207c8000m8246j7825P8940N2748M639J9065m446l9382O6983M3946j9711q8116
12195A0595l2141Q6318K6674L5028l1696p7292o5917L9787O2782Q199k0423k373
12183C9541O4255n68l1169l9589m2863q376L1165N4759K6472J6559m9107r4447
12171c3368P477M7525N1258J8115l0464k3752n8877j8874J5829l4709k3668M2827
12159d0681O3949J08065K5491j7717k5660o8778l232r748m3407N6236O449p779
12147D3188j8304M6395K5446N2674L2708J4616N3638k3671J308q4378r9148m5095
12135f23j0822M4314j0529K0965J9064m4358m5183k6287j3339N7944O3064R662
12123F3872M2772j3424j0264J7113l3984m0108o9539k382r038m2251k5674k105
$$ plain form
12111 -125012 -69029 -39925 -128649 -151704 -62340 -2850 41110 -14644 -59964 -269 22976
12100 22976 46662 48788 110768 244012 271280 226410 225349 206646 118231 80561 57217 -13765
12088 -13765 -97728 -136120 -114927 -40718 65371 31424 25191 2237 24814 70669 27594 28514
12076 28514 38594 47570 44449 65068 22879 -17258 -33840 -22367 34477 115925 120241 37277
12064 37277 -8774 5154 12744 -31924 -74919 -72837 -74578 -82494 -77123 -102370 -67859 -17117 18035
12051 18035 11906 14773 70600 119943 74978 22645 67513 81896 87918 17309 36023 -5075
12039 -5075 -47827 -78453 -87964 -85218 -55587 -104717 -62525 -35542 -51105 -71296 -83363 -39625
12027 -39625 -14491 17005 -38055 -1892 16434 14396 -56002 11747 32432 26370 -45058 -67957
$$ packed form
12111a25012N5983K9104q8724k3055Q9364N9490M3960n5754m5320N9695K3245
12100B2976K3686K126O1980J33244K7268m4870j061j8703q8415l7670k3344p0982
12088a3765q3963l8392K1193P4209J06089l3947o233k2954K2577M5855m3075R20
12076B8514J0080Q976l121K0619m2189m0137j6582J1473N6844Q1448M316q2964
12064C7277m6051J3928P590m4668m2995K082j741p916N371k5247L4511N0742L5152
12051A8035o129K867N5827M9343m4965n2333M4868J4383O022p0609J8714m1098
12039e075m2752l0626r511K746K9631m9130M2192K6983j5563k0191j2067M3738
12027c9625K5134L1496n5060L6163J8326k038p0398O7749K0685o062p1428k2899
$$ plain form
12015 -67957 -72785 -103102 -39234 6915 51033 37870 37800 28328 10352 -63340 -16406 3947 70378
12002 70378 165664 106731 33095 -72398 -13929 23248 -65957 -70022 -15642 -44631 -54931 -14510
11990 -14510 -22406 -49655 -143013 -129446 -56415 -70059 -47489 583 33 -4843 -19358 -32227
11978 -32227 -9689 10949 -13293 -37808 -19559 -34845 -96560 -90586 -99472 -61739 -48717 -65242
11966 -65242 -114486 -137946 -110324 -44050 -10379 -6751 55191 28332 -25360 -52372 -43734 -95961
11954 -95961 -147014 -125993 -40615 42509 124865 109567 19383 -22983 8033 37985 22231 60599
11942 60599 112386 60248 32138 30508 22260 74762 28120 8702 -24733 -44290 -65303 -63882
11930 -63882 -22347 -17604 -21891 -77585 -76838 4865 41800 53815 -12682 -2990 -8205 -4631 3230
$$ packed form
12015f7957m828l0317O3868M6149M4118j3163p0r472j7976p3692M6934K0353O6431
12002G0378R5286n8933p3636j05493N8469L7177q9205m065N4380k8989j0300M0421
11990a4510p896k7249r3358J3567P3031j3644K2570M8072n50m876j4515j2869
11978c2227K2538K0638k4242k4515J8249j5286o1715N974q886L7733J3022j6525
11966f5242m9244k3460K7622O6274L3671L628O1942k6859n3692k7012Q638n2227
11954i5961n1053K1021Q5378Q3124Q2356j5298r0184m2366L1016K9952j5754L8368
11942F0599N1787n2138k8110j630q248N2502m6642j9418l3435j9557k1013J421
11930f3882M1535M743m287n5694P47Q1703L6935J2015o6497R692n215L574P861
$$ plain form
11917 3230 -37931 -48383 18889 21104 1891 26901 45992 34767 71164 -21114 -46414 14875
11905 14875 21044 -34750 61951 90987 27085 34685 -5206 -57043 -8407 79810 153250 126071
11893 126071 21320 -10745 -5216 34025 37400 -2497 10726 78745 30099 195 -7674 -3362
11881 -3362 -2061 -74655 -133525 -153525 -160183 -109838 -8641 -40999 -47912 -33560 -4113 5603
11869 5603 -40601 13715 -6020 -58267 -40373 -73036 -19873 5149 -97623 -118331 -73856 -67752
11857 -67752 -53614 -76218 -79317 -24715 -37356 -72485 -69038 -8440 16352 26855 -35788 -46333
11845 -46333 -35870 -27257 -67979 -62678 12462 -3792 -6244 -113827 -89460 -84144 -73210 -79665
11833 -79665 -131568 -138554 -85899 -68904 -74769 -110149 -64517 12561 19873 21076 -85710 -113106
$$ packed form
11917C230m1161j0452O7272K215j9213K5010J9091j1225L6397r2278k5300O1289
11905A4875O169n5794R6701K9036o3902P600l9891n1837M8636Q8217P3440k7179
11893A26071j04751l2065N529L9241L375l9897J3223O8019m8646k9904p869M312
11881c362J301p2594n8870k0000o658N0345J01197l2358o913J4352K9447R716
11869E603m6204N4316j9735n2247J7894l2663N3163K5022j02772k0708M4475O104
11857f7752J4138k2604l099N4602j2641l5129L447O0598K4792J0503o2643j0545
11845d6333J0463Q613m0722N301P5140j6254k452j07583K4367N316J0934o455
11833g9665n1903o986N2655J6995n865l5380M5632P7078P312J203j06786k7396
$$ plain form
11821 -113106 -77511 -42510 29782 -5730 -35257 -40571 4109 17842 6212 6506 -39969 -41427
11809 -41427 -43910 -20466 493 -38899 -44476 35026 -5431 -56393 -13419 43297 19529 -24820
11797 -24820 -2693 25066 20553 -11827 -112660 -99762 -44046 -23500 -30689 12649 58327 40020
11785 40020 8097 -11461 18965 22262 -9811 -16206 -23143 -21519 -88255 -115744 -155037 -92701
11773 -92701 -75184 -104634 -58882 22859 27522 -37947 -47809 -13960 -15858 -52566 -13598 7037
11761 7037 4426 -54076 -57709 -5048 16102 41935 12405 38540 83885 70549 12356 5381
11749 5381 4749 22015 82942 99256 16435 -10474 2885 41566 90941 127764 66585 -8970
11737 -8970 -43916 -27806 38211 53625 4235 -16252 -19807 -47015 11307 -21656 -39405 -13786
$$ packed form
11821a13106L5595L5001P2292l5512k9527n314M4680J3733j1630K94m6475j458
11809d1427k483K3444K0959l9392n577P9502m0457n0962M2974N6716k3768m4349
11797b4820K2127K7759m513l2380j00833J2898N5716K0546p189M3338M5678j8307
11785D0020l1923j9558L0426L297l2073o395o937J624o6736k7489l9293O2336
11773i2701J7517k9450M5752Q1741M663o5469r862L3849j898l6708L8968K0635
11761G037k611n8502l633N2661K1150K5833k9530K6135M5345j3336n8193o975
11749E381o32J7266O0927J6314q2821k6909J3359L8681M9375L6823o1179p5555
11737h970l4946J6110O6017J5414m9390k0487l555k7208N8322l2963j7749K5619
$$ plain form
11725 -13786 -20448 -27168 -11857 -14350 -781 -16177 -90151 -65824 -61262 -75290 -109313 -101031 -87535
11712 -87535 -111469 -104583 -68903 -15047 -5078 -1970 -55583 -33791 59808 40564 -36800 -76675
11700 -76675 -17228 6738 -4125 21458 30540 -1352 9520 45424 14380 12680 67286 66494
11688 66494 96083 47921 43633 89213 61014 -39273 -49148 3899 -62511 -127935 -96182 -72569
11676 -72569 -55562 18689 -37071 -27724 -59988 -111368 -89571 -35846 -38378 -88151 -152986 -72657
11664 -72657 -94314 -35754 23401 -18340 -55519 -15213 36555 39137 -1461 19029 -1337 -20751
11652 -20751 -11992 -42607 -23555 11034 4253 -10965 -62088 -122888 -102232 -23711 37095 13705
11640 13705 -81160 -91367 -54058 12022 39305 17709 30854 10817 -55728 -147418 -179603 -144983
$$ packed form
11725a3786o662o720J5311k493J3569j5396p3974K4327M562j4028l4023Q282J3496
11712h7535k3934O886L5680N3856R969L108n3613K1792R3599j9244p7364l9875
11700g6675N9447K3966j0863K5583R082l1892J0872L5904l1044j700N4606p92
11688F6494K9589m8162m288M5580k8199j00287r875N3047o6410o5424L1753K3613
11676g2569J7007P4251n5760R347l2264n1380K1797N3725k532m9773o4835Q0329
11664g2657k1657N8560N9155m1741l7179M0306N1768K582m0598K0490k0366j9414
11652b0751Q759l0615J9052L4589o781j5218n1123o0800K0656P8521O0806k3390
11640A3705r4865j0207L7309O6080K7283k1596J3145k0037o6545r1690l2185L4620
$$ plain form
11628 -144983 -123650 -119526 -27067 66221 36083 -7408 29452 45233 54158 120663 111690 120290
11616 120290 104599 96285 102035 -55595 -193415 -225707 -193022 -135896 -143659 -148214 -99511 -110063
11604 -110063 -99403 -74582 -121235 -112865 -83678 -69532 -48000 -91855 -163344 -172194 -83197 -54837
11592 -54837 -74636 -130602 -124034 -84344 -43771 -29311 -14711 -83145 -61332 -72686 -41641 -13889
11580 -13889 -37906 3280 24410 18300 -52336 -55056 -43697 -14140 -16307 -78905 -43271 -41912
11568 -41912 -41305 5409 -9238 -44779 -121818 -159913 -133366 -137938 -122660 -57909 -63806 -88947
11556 -88947 -78512 -23623 44860 39158 40078 2112 -32794 51007 76877 26284 35547 17451
11544 17451 45728 129093 61820 7921 -35167 -28810 -25373 -20180 67965 93099 90271 27680
$$ packed form
11628a44983K1333M124R2459R3288l0138m3491L6860J5781Q925O6505q973Q600
11616A20290j5691q314N750j57630j37820l2292L2685N7126p763m555M8703j0552
11604a10063J0660K4821m6653Q370K9187J4146K1532m3855p1489q850Q8997K8360
11592e4837j9799n5966O568L9690M0573J4460J4600o8434K1813j1354L1045K7752
11580a3889k4017M1186K1130o110p0636k720J1359K9557k167o2598L5634J359
11568d1912O07M6714j4647l5541p7039l8095K6547m572J5278O4751n897k5141
11556h8947J0435N4889O8483n702R20l7966l4906Q3801K5870n0593R263j8096
11544A7451K8277Q3365o7273n3899m3088O357L437N193Q8145K5134k828o2591
$$ plain form
11532 27680 -10945 28136 -20244 -129169 -88134 15923 12324 -25430 -27311 -39716 -56743 -69958
11520 -69958 -9698 -35115 7695 47681 53223 35328 -66392 -124879 -96517 -7793 15038 23625
11508 23625 41481 -13358 22724 -31237 -75831 -21624 -31032 -36123 36100 69672 16508 9268
11496 9268 -78177 -74502 -67416 -57406 -40603 -109305 -103128 -90746 -62618 37749 81000 77991
11484 77991 40488 -58513 -26939 -20876 68466 128844 138132 106149 -643 -3350 3164 8216
11472 8216 304 61733 47749 3261 -907 32340 15483 -15114 -7827 -26210 -19762 69667 50819
11459 50819 -2057 -35270 -96693 -140521 -90362 -74309 -46576 10913 3147 12041 25322 51188
11447 51188 5979 -32403 -20943 78705 39009 -59442 -77739 -78723 -50029 5537 30275 3194
$$ packed form
11532B7680l8625L9081m8380j08925M1035J04057l599l7754j881j2405j7027j3215
11520f9958O0260k5417M2810L9986N542j7895j01720n8487K8362Q8724K2831Q587
11508B3625J7856n4839L6082n3961m4594N4207r408n091P2223L3572n3164p240
11496I268q7445L675P086J0010J6803o8702O177J2382K8128J00367M3251l009
11484G7991l7503r9001L1574O063Q9342O0378R288l1983j06792k707O514N052
11472H216p912O1429j3984m4488m168L3247j6857l0597P287j8383O448Q9429j8848
11459E0819n2876l3213o1423m3828N0159J6053K7733N7489p766Q894J3281K5866
11447E1188m5209l8382J1460R9648l9696r8451j8297r84K8694N5566K4738k7081
$$ plain form
11435 3194 -45412 -102465 -54946 -74937 -99732 -80160 -64625 -46247 -63438 -57482 -4203 -41024
11423 -41024 -128698 -104786 -81922 -4263 83140 159838 203747 123105 68811 61076 5656 -6187
11411 -6187 11702 8266 57087 110705 128214 109926 83749 59169 29996 51925 111370 143592
11399 143592 4163 -67965 -85686 -110448 -100008 -23058 24228 24841 20871 87709 113426 144013
11387 144013 103871 65770 46419 -24931 -79086 -68561 -64918 -52318 -59248 -116911 -125010 -89142
11375 -89142 -34425 35163 55303 24575 -30151 -58974 -61974 -59327 -80862 -29170 -36394 -121920
11363 -121920 -94860 -25817 22541 388 -81326 -163490 -154213 -58983 26837 3106 35572 10638
11351 10638 13297 63784 -4102 -17073 -62532 -84916 -85722 -142741 -140941 -108539 -73864 -36579
$$ packed form
11435C194m8606n7053M7519j9991k4795J9572J5535J8378j7191N956N3279l6821
11423d1024q7674K3912K2864P7659Q7403P6698M3909q0642n4294p735n5420j1843
11411f187J7889l436M8821N3618J7509j8288k6177k4580k9173K1929N9445L2222
11399A43592j39429p2128j7721k4762J0440P6950M7286O13l970O6838K5717L0587
11387A44013m0142l8101j9351p1350n4155J0525L643J2600o930n7663q099L5868
11375h9142N4717O9588K0140l0728n4726k8823l000K647k1535N1692p224q5526
11363a21920K7060O9043M8358k2153q1714q2164R277R5230Q5820k3731L2466k4934
11351A0638K659N0487o7886j2971m5459k2384q06n7019J800L2402L4675L7285
$$ plain form
11339 -36579 -27461 -33256 -60152 -47754 -38751 27280 44164 16174 -597 -28125 -57387 -86851
11327 -86851 -49454 23706 -3458 15146 21930 44328 67935 5373 31391 42539 38785 15673
11315 15673 -13537 -11649 -38143 -5125 40683 69636 20933 6416 -31383 3032 2728 -66158
11303 -66158 -44645 -18898 -38079 -48589 -35387 -36854 -22858 -28629 -99 56492 24860 -121247
11291 -121247 -61258 70761 86334 61653 3086 8423 -5389 3070 40244 53349 76816 66299
11279 66299 37393 77147 81212 39865 39098 475 7554 -25487 -18525 -54933 -56110 -66228 -52542
11266 -52542 109783 120553 81370 72134 8285 -12921 -3263 -40117 -99428 -73134 -21481 -36929
11254 -36929 -30070 -4155 -1816 24124 67556 84395 7525 -69628 -41512 -5743 80329 93351
$$ packed form
11339c6579R118n795k6896J2398R003O6031J6884k7990j6771k7528k9262k9464
11327h6851L7397P3160k7164J8604O784K2398K3607o2562K6018J1148l754k3112
11315A5673k9210J888k6494L3018M5808K8953m8703j4517l7799L4415l04o8886
11303f6158K1513K5747j9181j0510J3202j467J3996n771K8530N6591l1632j46107
11291a21247N9989J32019J5573k4681n8567N337j3812Q459L7174J3105K3467j0517
11279F6299k8906L9754M065m1347p67l8623P079l3041O962l6408j177j0118J3686
11266e2542J62325J0770l9183r236o3849k1206R658l6854n9311K6294N1653j5448
11254c6929O859K5915K339K5940M3432J6839p6870p7153K8116L5769Q6072J3022
$$ plain form
11242 93351 53144 23222 73746 65950 -36895 -57495 -78064 -96738 -19150 -9691 28642 20844
11230 20844 41611 12888 -29985 -26945 -33202 -33780 -29598 -27393 27553 61573 31622 14704 10659
11217 10659 14737 -27854 -51572 -8555 37396 54186 88053 149552 159167 168928 171883 146428
11205 146428 186712 163123 118535 89155 45823 -27891 -25139 73826 103854 89384 85559 108215
11193 108215 61759 -18031 17207 54880 53391 26478 -32380 -63014 -78148 -24235 -5450 6057
11181 6057 -6439 -43585 -71047 -39928 -23282 -34915 18906 60192 54518 69158 76096 42544
11169 42544 -13818 34579 24362 108557 143513 53405 -3055 2963 62524 135263 137589 128810
11157 128810 66909 87563 147631 159776 111243 101228 97782 124099 69387 105337 133183 129965
$$ packed form
11242I3351m0207k9922N0524p796j02845k0600k0569j8674P7588R459L8333p798
11230B0844K0767k8723m2873L040o257n78M182K205N4946L4020k9951j6918m045
11217A0659M078m2591k3718M3017M5951J6790L3867O1499R615R761K955k5455
11205A46428M0284k3589m4588k9380m3332p3714K752R8965L0028j4470l825K2656
11193A08215m6456p9790L5238L7673j489k6913n8858l0634j5134N3913J8785J1507
11181F057j2496l7146k7462L1119J6646j1633N3821M1286n674J4640O938l3552
11169D2544n6362M8397j0217Q4195L4956r0108n6460O018N9561P2739K326q779
11157A28810o1901K0654O0068J2145m8533j0015l446K6317n4712L5950K7846l218
$$ plain form
11145 129965 132237 96320 71163 52141 84510 110466 63851 69852 100027 107118 109790 31847
11133 31847 -1250 -18098 -35590 2206 56452 34287 79476 98816 118560 108817 64386 97457
11121 97457 98546 8488 -46545 -39147 -21620 -38504 -56737 -74184 -66836 -11016 -658 -70149
11109 -70149 -47413 -70897 -82316 -28072 -33490 7479 42723 85167 174471 119786 60052 33460
11097 33460 -2411 -2747 66443 53536 54026 55768 100640 105978 61607 58147 3464 -28611 60430
11084 60430 65114 78766 110746 92647 126570 71063 83924 19462 -52140 -79889 -98178 -27989
11072 -27989 38882 53932 -32765 -61017 -47356 -45185 -63660 -48086 13554 -11059 -36100 2929
11060 2929 93851 118162 47854 2602 24748 28532 41307 50350 43412 22433 -5557 13372
$$ packed form
11145A29965K272l5917k5157j9022L2369K5956m6615O001L0175P091K672p7943
11133C1847l3097j6848j7492L7796N4246k2165M5189J9340J9744r743m4431L3071
11121I7457J089r0058n5033P398J7527j6884j8233j7447P348N5820J0358o9491
11109g0149K2736k3484j1419N4244n418M0969L5244M2444Q9304n4685n9734k6592
11097C3460l5871l36O9190j2907M90J742M4872N338m4371l460n4683l2075Q9041
11084F0430M684J3652L1980j8099L3923n5507J2861o4462p1602k7749j8289P0189
11072b7989O6871J5050q6697k8252J3661K171j8475J5574O1640k4613k5041L9029
11060B929R0922K4311p0308m5252K2146L784J2775R043o938k0979k7990J8929
$$ plain form
11048 13372 74920 95429 95864 94437 56161 57566 82732 141424 205058 249777 361202 586946
11036 586946 804666 1191470 1695055 1905253 1761524 1398798 986393 682467 526047 443790
11026 443790 366796 276294 263235 249140 232710 237044 217360 128800 176127 222378 175050 138055
11014 138055 147416 170358 146830 90050 82071 76067 37316 -47965 38370 80650 84391 107382
11002 107382 60071 111178 153960 172965 200866 311047 461622 673495 944520 1201762
10992 1201762 1439372 1674817 1834239 1936466 1991985 2009603 1970902 1887866 1695382 1420470
10982 1420470 1229036 985236 715147 535014 473951 489015 489065 431972 370065 375386 285367
10971 285367 222978 177844 146273 100715 103425 84569 47237 -8242 -2313 67240 69517 121483
$$ packed form
11048A3372O1548K0509M35j427l8276J405K5166N8692O3634M4719J11425K25744
11036E86946K17720L86804N03585K10198j43729l62726m12405l03926j56420q2257
11026D43790p6994r0502j3059j4095j6430M334j9684q8560M7327M6251m7328l6995
11014A38055R361K2942k3528n6780p979o004l8751q5281Q6335M2280L741K2991
11002A07382m7311N1107M2782J9005K7901J10181J50575K11873K71025K57242
10992A201762K37610K35445J59422J02227N5519J7618l8701q3036j92484k74912
10982A420470j91434k43800k70089j80133o1063J5064N0n7093o1907N321r0019
10971B85367o2389m5134l1571m5558K710j8856l7332n5479N929O9553K277N1966
$$ plain form
10959 121483 121171 42355 46184 54577 48528 122930 105916 98561 100407 99734 103344 91522 35125
10946 35125 11117 41715 43344 19141 59967 12160 173 45133 64108 47358 18987 -7227
10934 -7227 89381 188225 114316 39365 42382 21290 16809 30348 15952 -2137 60215 88822
10922 88822 102203 29207 45089 31960 3207 19365 29707 95757 111644 30642 28588 31302
10910 31302 62052 107081 175680 129665 107770 133018 151944 136239 99505 66640 44977 49951
10898 49951 85764 133911 236285 248719 211998 108884 51620 11366 3810 41234 33564 18835
10886 18835 -43757 -63339 -58338 -30739 12193 28369 37745 45995 75389 68617 66736 12371 -44042
10873 -44042 -17020 -666 -3799 -36917 -51185 5720 -7111 15633 4530 -36583 9708 56659
$$ packed form
10959A21483l12p8816L829Q393o049P4402j7014p355J846o73L610j1822n6397
10946C5125k4008L0598J629k4203M0826m7807j1987M4960J8975j6750k8371k6214
10934g227R6608R8844p3909p4951L017k1092m481J3539j4396j8089O2352K8607
10922H8822J3381p2996J5882j3129k8753J6158J0342O6050J5887q1002k054K714
10910C1302L0750M5029O8599m6015k1895K5248J8926j5705l6734l2865k1663M974
10898D9951L5813M8147J02374J2434l6721j03114n7264m0254p556L7424p670j4729
10886A8835o2592j9582N001K7599M2932J6176R376Q250K9394o772j881n4365n6413
10873d4042K7022J6354l133l3118j4268N6905j2831K2744j1103m1113M6291M6951
$$ plain form
10861 56659 24406 -13040 -106272 -101239 -58620 10582 33094 18250 14103 46368 38644 77156
10849 77156 149391 166454 170720 195960 182273 226391 281993 310264 314919 261301 268291 324228
10837 324228 390107 288474 226395 200600 191029 265632 274473 299858 328382 264078 212569 235924
10825 235924 200101 157260 130421 124626 143643 130419 92162 41767 76744 116397 107545 108449
10813 108449 92272 94851 158284 164490 161262 149477 161279 143554 118164 129547 197824 210347
10801 210347 243560 247793 224309 224912 279116 166581 107193 101995 55972 40397 46000 51933
10789 51933 21239 -60525 -87026 -76988 -68000 -106565 -82096 -51009 -47302 6602 -9464 -78987
10777 -78987 -15436 -5634 -38454 -21797 49602 119060 117732 147460 161353 179703 163526 101807
$$ packed form
10861E6659l2253l7446r3232N033M2619O9202K2512j4844m147L2265p724L8512
10849G7156P2235J7063M266K5240j3687M4118N5602K8271M655n3618O990N5937
10837C24228O5879j01633o2079k5795r571P4603Q841K5385K8524o4304n1509K3355
10825B35924l5823m2841k6839n795J9017j3224l8257n0395L4977L9653q852R04
10813A08449j6177K579O3433O206l228j1785J1802j7725k5390J1383O8277J2523
10801B10347L3213M233k3484O03N4204j12535n9388n198m6023j5575N603N933
10789E1933l0694q1764k6501J0038Q988l8565K4469L1087L707N3904j6066o9523
10777g8987O3551R802l2820J6657P1399O9458j328K9728J3893J8350j6177o1719
$$ plain form
10765 101807 74904 63330 105808 68353 94241 92810 -23743 -66470 722 45032 25307
10754 25307 76284 214925 272912 231129 206366 191462 195612 169430 124229 84817 26435 -5284
10742 -5284 -68797 -59630 -1105 -6693 41776 15896 -22828 21202 30779 69788 83550 133633
10730 133633 161247 170985 67072 -11535 -1795 31241 -24800 8120 95242 115936 117897 152082
10718 152082 210507 268222 297260 300318 327307 337942 401457 460802 478353 507916 555424 561800
10706 561800 508370 469318 429856 372096 380909 392604 315414 258553 196479 208959 228575 233177
10694 233177 219258 166102 111709 105760 134280 159697 137404 132032 178168 178409 177378 180342 211260
10681 211260 240339 246876 217055 227798 312046 271457 268313 269519 211248 195575 203786 232979
$$ packed form
10765A01807k6903j1574M2478l7455K5888j431j16553m2727O7192M4310j9725
10754B5307N0977J38641N7987m1783k4763j4904M150k6182m5201l9412n8382l1719
10742e284o3513R167N8525n588M8469k5880l8724M4030R577L9009J3762N0083
10730A33633K7614R738j03913p8607R740L3036n6041L2920Q7122K0694J961L4185
10718A52082N8425N7715K9038L058K6989J0635O3515N9345J7551K9563M7508O376
10706E61800n3430l9052l9462n7760Q813J1695p7190n6861o2074J2480J9616M602
10694B33177j3919n3156n4393n949K8520K5417k2293n372M6136K41j031K964L0918
10681B11260K9079O537k9821J0743Q4248m0589l144J206n8271j5673Q211K9193
$$ plain form
10669 232979 310153 299117 235344 286272 297189 318039 374784 446496 550865 603521 644554
10658 644554 667998 689951 645947 539589 472874 511618 556806 541949 500050 485496 446331
10647 446331 453499 487154 563041 588899 700768 740628 780771 811242 928675 1070657 1111901
10636 1111901 1185561 1326819 1508194 1650150 1783606 1812933 1933518 2055667 2174574 2361358
10626 2361358 2496647 2620635 2707075 2829502 3006959 3144220 3353337 3566645 3799691 4087301
10616 4087301 4470416 4893773 5453941 6243461 7170576 8254994 9440672 10663521 11941460
10607 11941460 13316152 14629087 16090522 17744709 19829057 22578225 26192280 31266661
10599 31266661 38673226 50199920 68882878 99120076 142369306 191334169 239252104
$$ packed form
10669B32979P7174j1036o3773N0928J0917K0850N6745P1712J04369N2656M1033
10658F44554K3444K1953m4004j06358o6715L8744M5188j4857m1899j4554l9165
10647D46331P168L3655P5887K5858J11869L9860M0143L0471J17433J41982M1244
10636A111901P3660J41258J81375J41956J33456K9327J20585J22149J18907J86784
10626B361358J35289J23988Q6440J22427J77457J37261K09117K13308K33046K87610
10616D087301L83115M23357N60168P89520R27115J084418J185678J222849J277939
10607A1941460J374692J312935J461435J654187K084348K749168L614055N074381
10599C1266661P406565J1526694J8682958L0237198M3249230M8964863M7917935
$$ plain form
10592 239252104 282551536 314855041 339397583 358331715 362930545 356577630 341669159
10585 341669159 315330909 281196067 239844416 191223398 144667972 106668742 79540352
10578 79540352 61887872 50419761 42615378 37114132 33144648 30043450 27452239 25167544
10570 25167544 22988666 20999040 19075433 17171711 15373849 13757525 12250286 10988547
10562 10988547 9965493 9051929 8270278 7691564 7225587 6832815 6406380 6004144 5643431
10553 5643431 5295645 4970881 4602811 4281262 4012416 3697382 3360161 3052272 2827107
10544 2827107 2628026 2385291 2236467 2087638 1909091 1826719 1786655 1776052 1699992 1574609
10534 1574609 1539709 1497154 1445128 1353387 1299597 1325083 1408751 1327551 1270753 1216791 1128142
$$ packed form
10592B39252104M3299432L2303505K4542542J8934132M598830o352915j4908471
10585C41669159k6338250l4134842m1351651m8621018m6555426l7999230k7128390
10578G9540352j7652480j1468111p804383n501246l969484l101198k591211k284695
10570B5167544k178878j989626j923607j903722j797862j616324j507239j261739
10562A0988547j023054r13564p81651n78714m65977l92772m26435m02236l60713
10553E643431l47786l24764l68070l21549k68846l15034l37221l07889k25165
10544B827107j99081k42735j48824j48829j78547q2372m0064j0603p6060j25383
10534A574609l4900m2555n2026r1741n3790K5486Q3668q1200n6798n3962q8649
$$ plain form
10523 1128142 1019945 978111 938337 884908 880636 906385 863951 787992 716052 648762 709405
10512 709405 683594 615483 593316 638574 684749 728478 687527 682257 627879 558593 572939 625805
10500 625805 658055 609632 467559 499165 560467 528402 453350 491720 483605 535856 589151
10489 589151 531243 513231 479279 386992 369123 329367 335492 386777 410350 377113 206370
10478 206370 142120 94368 57486 98617 139271 170124 151778 100889 101177 226977 293827 238839
10466 238839 196484 130770 204713 200763 157091 164405 136666 155790 245502 270825 252076 249102
10454 249102 279819 297982 255501 259998 286735 307352 293310 325182 386437 349915 346414 397250
10442 397250 427888 455792 430986 353178 320360 299932 287957 348407 324550 343305 363571
$$ packed form
10523A128142j08197m1834l9774n3429m272K5749m2434p5959p1940o7290O0643
10512G09405k5811o8111k2167M5258M6175M3729m0951n270n4378o9286J4346N2866
10500F25805L2250m8423j42073L1606O1302l2065p5052L8370q115N2251N3295
10489E89151n7908j8012l3952r2287j7869l9756O125N1285K3573l3237j70743
10478B06370o4250m7752l6882M1131M0654L0853j8346n0889K88J25800O6850n4988
10466B38839m2355o5714P3943l950m3672P314k7739J9124Q9712K5323j8749k974
10454B49102L0717J8163m2481M497K6737K0617j4042L1872O1255l6522l501N0836
10442C97250L0638K7904k4806p7808l2818k0428j1975O0450k3857J8755K0266
$$ plain form
10431 363571 298958 175341 70240 48612 97041 198531 220324 229719 269037 324732 320665
10420 320665 255129 257880 285409 314110 313308 261517 196090 194620 183884 106858 73753 64867
10408 64867 94962 108123 158667 206145 225509 206830 212290 194622 225245 248213 243762 246924
10396 246924 342342 357758 258715 275098 268472 263666 261992 272950 272883 177464 135723 221940 203585
10383 203585 124914 67545 106339 125040 123072 89834 49855 87034 50789 53940 93212 104703
10371 104703 108505 50932 3045 -49838 -78687 -124429 -116751 38170 127976 148609 100872 53332
10359 53332 63151 120582 146496 161409 142368 105960 92725 56406 42181 42472 72849 129692
10347 129692 150422 134160 76475 14265 -59506 -35365 7447 56193 137204 148901 165124
$$ packed form
10431C63571o4613j23617j05101k1628M8429J01490K1793R395L9318N5695m067
10420C20665o5536K751K7529K8701q02n1791o5427j470j0736p7026l3105q886
10408F4867L0095J3161N0544M7478J9364j8679N460j7668L0623K2968m451L162
10396B46924R5418J5416r9043J6383o626m806j674J0958o7r5419m1741Q6217j8355
10383B03585p8671n7369L8794J8701j968l3238l9979L7179l6245L151L9272J1491
10371A04703L802n7573m7887n2883k8849m5742P678J54921Q9806K0633m7737m7540
10359E3332R819N7431K5914J4913j9041l6408j3235l6319j4225K91L0377N6843
10347A29692K0730j6262n7685o2210p3771K4141M2812M8746Q1011J1697J6223
$$ plain form
10336 165124 111566 95613 76663 108727 142912 113129 63059 58985 62398 84475 88523 95098
10324 95098 159899 195513 148006 158152 148633 125420 120812 201138 199726 170688 11264 -14629
10312 -14629 8907 26694 14008 -42911 -72498 -8054 29760 54644 105138 97865 63729 70528
10300 70528 135003 95390 25618 -17929 3462 61176 67892 23543 24586 37698 57634 64411
10288 64411 79297 29009 7114 113152 105558 43992 -23658 -44941 -8037 1021 -19199 -71152
10276 -71152 -87032 -84745 -83401 -66731 1332 -22243 -19626 30157 96164 55051 28082 76276
10264 76276 60117 102106 102125 104996 69986 66834 85459 112316 84639 90256 177544 148235 106697
10251 106697 121968 117561 126096 148792 156746 130868 68378 -3031 -15626 72542 132485 126902
$$ packed form
10336A65124n3558j5953j8950L2064L4185k9783n0070m074L413K2077M048O575
10324I5098O4801L5614m7507J0146r519k3213m608Q0326j412k9038j59424k5893
10312a4629K3536J7787j2686n6919k9587O4444L7814K4884N0494p273l4136O799
10300G0528O4475l9613o9772m3547K1391N7714O716m4349J043J3112J9936O777
10288F4411J4886n0288k1895J06038p594o1566o7650k1283L6904R058k0220n1953
10276g1152j5880K287J344J6670O8063k3575K617M9783O6007m1113k6969M8194
10264G6276j6159M1989J9K871l5010l152J8625K6857k7677N617Q7288k9309m1538
10251A06697J5271m407Q535K2696P954k5878o2490p1409j2595Q8168N9943n583
$$ plain form
10239 126902 132626 144675 108532 106364 146525 124103 98853 59926 -217 10151 -55433 -113307
10227 -113307 -100785 -166242 -94083 -20237 31836 6393 15131 -13239 -95885 -129433 -52072 -50962
10215 -50962 -50412 -40538 -15356 6387 50256 4930 15502 150605 134830 82575 16832 157
10203 157 20373 20775 43917 50667 60989 82797 96699 113288 158750 237859 303857 367985 470411
10190 470411 725580 983133 1228799 1491090 1671199 1766311 1816437 1866486 1908710 1780929
10180 1780929 1613623 1464386 1262704 1017872 755518 593868 503984 485933 398414 260387
10170 260387 182481 170450 169455 130951 71800 91199 135701 131503 75047 50666 61177 34858
10158 34858 27186 60848 25674 89135 114286 112965 144118 99997 61066 68690 33219 13473
$$ packed form
10239A26902N724J2049l6143k168M0161k2422k5250l8927o0143J0368o5584n7874
10227a13307J2522o5457P2159P3846N2073k5443Q738k8370q2646l3548P7361J110
10215e0962N50R874K5182K1743M3869m5326J0572J35103j5775n2255o5743j6675
10203A57K0216M02K3142O750J0322K1808J3902J6589M5462P9109O5998O4128J02426
10190D70411K55169K57553K45666K62291J80109R5112N0126N0049M2224j27781
10180A780929j67306j49237k01682k44832k62354j61650q9884j8051q7519j38027
10170B60387p7906j2031r95l8504n9151J9399M4502m198n6456k4381J0511k6319
10158C4858p672L3662l5174O3461K5151j321L1153m4121l8931P624l5471j9746
$$ plain form
10146 13473 35206 40016 72911 42058 49315 96583 66525 31031 45373 3832 2766 -28712
10134 -28712 -23249 -8941 -18726 -21293 -6957 -38775 -18978 -37420 -21203 -43397 -92980 -118601
10122 -118601 -123198 -112434 -41568 -42012 -21385 -23520 16177 75059 83703 69897 84434 62734
10110 62734 46256 57016 85637 68002 6437 41557 63898 61309 13499 -36916 27571 34474
10098 34474 52534 70376 53557 94988 115548 102188 93900 18473 -34465 -51568 -2783 -51594
10086 -51594 -32492 20674 -4206 -25035 -51819 -49753 -41354 -33422 19854 63278 24335 -13966
10074 -13966 62159 93632 47915 3111 -37100 11327 89023 30162 -24653 14503 29190 -57339
10062 -57339 -48441 24634 41708 50162 85886 86525 92546 167293 169080 138325 176301 214669 124230
$$ packed form
10146A3473K1733M810L2895l0853P257M7268l0058l5494J4342m1541j066l1478
10134b8712N463J4308r785k567J4336l1818J9797j8442J6217k2194m9583k5621
10122a18601m597J0764P0866m44K0627k135L9697N8882Q644j3806J4537k1700
10110F2734j6478J0760K8621j7635o1565L5120K2341k589m7810n0415O4487O903
10098C4474J8060J7842j6819M1431K0560j3360q288p5427n2938j7103M8785m8811
10086e1594J9102N3166k4880k0829k6784K066Q399P932N3276M3424l8943l8301
10074a3966P6125L1473m5717m4804m0211M8427P7696n8861n4815L9156J4687q6529
10062e7339Q898P3075J7074Q454L5724O39O021P4747J787l0755L7976L8368r0439
$$ plain form
10049 124230 44209 -14481 -42171 -102279 -68779 -25225 32246 12208 12442 -17123 13382 55385
10037 55385 74336 28104 -5926 14482 46270 44320 -3261 -42730 -25785 -48260 -45771 -26752
10025 -26752 15584 65326 65714 131732 143979 67963 -50702 -110080 -126480 -107641 -52272 -81530
10013 -81530 -23210 -7464 71443 168311 142479 78644 56325 -32060 -91130 -62634 -28852 24888
10001 24888 19886 19265 10754 -33240 -38661 5540 28366 57532 -28858 -1053 64121 47690 -45183
9988 -45183 -20733 -4260 101579 201944 150502 65866 66684 53761 94079 133517 110028 65290
9976 65290 39518 45290 -36713 -91453 -97679 -93274 -76809 -109622 -115851 -134880 -72513 23718 41127
9963 41127 86279 111977 148530 159443 102763 102284 55576 63217 -42038 -70368 -25962 42977
$$ packed form
10049A24230q0021n8690k7690o0108L3500M3554N7471k0038K34k9565L0505M2003
10037E5385J8951m6232l4030K0408L1788j950m7581l9469J6945k2475K489J9019
10025b6752M2336M9742L88O6018J2247p6016j18665n9378j6400J8839N5369k9258
10013h1530N8320J5746P8907R6868k5832o3835k2319q8385n9070K8496L3782N3740
10001B4888n002o21q511m3994n421M4201K2826K9166q6390K7805O5174j6431r2873
9988d5183K4450J6473J05839J00365n1442q4636Q18j2923M0318L9438k3489m4738
9976F5290k5772N772q2003n4740o226M405J6465l2813o229j9029O2367R6231J7409
9963D1127M5152K5698L6553J0913n6680m79m6708P641j05255k8330M4406O8939
$$ plain form
9951 42977 65940 92291 66548 58963 -819 -1913 -14218 -70108 54235 63284 15398 43531
9939 43531 102694 165982 142123 36023 14165 50232 47168 13569 42189 -7660 -54270 -55266
9927 -55266 47578 -19995 -13467 81743 18776 -30886 15165 -10765 44992 15176 -51199 1682
9915 1682 29613 5705 -32330 7926 46308 75408 75522 27125 -20035 -26099 30973 77901 100431
9902 100431 78597 52056 83844 54742 8872 28156 59428 29539 -4481 65858 50295 5727
9890 5727 31546 35397 -24909 -14218 -56599 -56163 39331 148476 156443 81121 8742 -72636 -64973
9877 -64973 -59130 -18812 -59761 -130506 -76029 49457 144807 145802 160173 171606 127960 44184
9865 44184 44389 118893 72314 77454 106367 71245 49517 100846 168774 210179 130747 83379
$$ packed form
9951D2977K2963K6351k5743p585n9782j094j2305n5890J24343R049m7886K8133
9939D3531N9163O3288k3859j06100k1858L6067l064l3599K8620m9849m6610r96
9927e5266J02844o7573O528R5210o2967m9662M6051k5930N5757k9816o6375N2881
9915A682K7931k3908l8035M0256L8382K9100J14m8397m7160o064N7072M6928K2530
9902A00431k1834k6541L1788k9102m5870J9284L1272k9889l4020P0339j5563m4568
9890E727K5819L851o0306J0691m2381M36R5494J09145P967p5322p2379q1378P663
9877f4973N843M0318m0949p0745N4477J25486R5350R95J4371J1433m3646q3776
9865D4184K05P4504m6579N140K8913l5122k1728N1329O7928M1405p9432m7368
$$ plain form
9853 83379 41183 -9329 50778 55886 20616 -8023 33101 -15635 -13307 -27363 -42423 -12758
9841 -12758 40373 15465 62511 152202 36688 -91125 -135697 -151044 -161271 -97197 27367
9830 27367 19167 -37179 -102201 -112301 -86014 -106147 -86408 -87496 -10413 10266 -8975 -19559
9818 -19559 -49705 -30038 11603 32954 13855 -34990 15702 122916 140123 45637 -18814 -85463
9806 -85463 -48728 10612 11862 35713 32034 -14784 -101583 -79979 -70053 -45357 -42603 -39498 -66523
9793 -66523 -103107 -165382 -159695 -41256 -20917 -83032 -25421 13432 27119 13278 26438 84381
9781 84381 18444 -25832 -29769 -84824 -64995 -29724 18347 36041 62566 54092 13176 65347
9769 65347 94633 21355 -16532 -87260 -131715 -60142 7624 -3374 17228 67897 60824 58795
$$ packed form
9853H3379m2196n0512O0107N108l5270k8639M1124m8736K328j4056j5060K9665
9841a2758N3131k4908M7046Q9691j15514j27813m4572j5347j0227O4074J24564
9830B7367q200n6346o5022j0100K6287k0133J9739j088P7083K0679j9241j0584
9818a9559l0146J9667M1641K1351j9099m8845N0692J07214J7207r4486o4451o6649
9806h5463L6735N9340J250K3851l679m6818q6799K1604R926K4696K754L105k7025
9793f6523l6584o2275N687J18439K0339o2115N7611L8853J3687j3841J3160N7943
9781H4381o5937m4276l937n5055J9829L5271M8071J7694K6525q474m0916N2171
9769F5347K9286p3278l7887p0728m4455P1573O7766j0998K0602N0669p073k029
$$ plain form
9757 58795 4461 -10318 -48016 -91461 -122610 -98433 -82447 -60272 -14012 74930 89799 158213
9745 158213 146739 119176 31483 -37164 50013 44210 12629 28246 8319 -47701 7196 -3294
9733 -3294 -35972 8258 43937 104887 103128 73214 56423 34845 5296 49452 76438 63360
9721 63360 9104 30674 71422 54379 28837 -67965 -104019 -136251 -104080 -32457 -14825 -68135
9709 -68135 -48131 -4320 756 11890 -10171 -47692 -95621 -80847 -64335 -106451 -107854 -42439
9697 -42439 8606 11943 -14256 -35856 -8286 -33077 -4062 8279 4871 43164 70933 46842
9685 46842 26924 -21850 -70000 -63573 -16165 -8336 -52461 -39800 -20265 23266 48665 39744
9673 39744 40058 1040 -5576 -9277 39822 8118 -27871 -50864 -56394 -76180 14169 132584 150618
$$ packed form
9757E8795n4334j4779l7698m3445l1149K4177J5986K2175M6260Q8942J4869O8414
9745A58213j1474k7563q7693o8647Q7177n803l1581J5617j9927n6020N4897j0490
9733c294l2678M4230L5679O0950j759k9914j6791k1578k9549M4156K6986j3078
9721F3360n4256K1570M0748j7043k5542r6802l6054l2232L2171P1623J7632n3310
9709f8135K0004M3811N076J1134k2061l7521m7929J4774J6512m2116j403O5415
9697d2439N1045L337k6199k1600K7570k4791K9015J2341l408L8293K7769k4091
9685D6842j9918m8774m8150O427M7408P829m4125J2661J9535M3531K5399q921
9673C9744L14l9018o616l701M9099l1704l5989k2993n530j9786R0349J18415J8034
$$ plain form
9660 150618 126953 42833 -477 -22630 -20419 -6965 -23033 -38185 -25742 -79777 -99340 -45653
9648 -45653 23897 8798 37397 70392 16793 29111 -26410 -50604 -40275 -13658 9275 40686
9636 40686 -20159 -78118 -43223 -24917 14161 -932 -10259 34351 15212 -6504 8441 -25346
9624 -25346 -57549 -40780 -42673 -92770 -103614 -92283 -22590 35336 18756 -58772 -188244 -216032
9612 -216032 -134232 -62205 -35428 -79299 10542 67130 56498 18443 -17359 -9497 32330 63975
9600 63975 -72912 -91421 -52054 -25189 9747 12276 -34518 -64730 -72181 -31149 33822 5949
9588 5949 43469 89310 66524 43180 -32315 15701 64272 36710 -89451 -83205 -38522 47505
9576 47505 97680 120373 163338 90843 86916 80443 -6007 1154 33469 -44142 -80914 -97394
$$ packed form
9660A50618k3665q4120m3310k2153K211J3454j6068j5152J2443n4035j9563N3687
9648d5653O9550j5099K8599L2995n3599J2318n5521k4194J0329K6617K2933L1411
9636D0686o0845n7959L4895J8306L9078j5093r327M4610j9139k1716J4945l3787
9624b5346l2203J6769j893n0097j0844J1331O9693N7926j6580p7528j29472k7788
9612b16032Q1800P2027K6777m3871Q9841N6588j0632l8055l5802P862M1827L1645
9600F3975j36887j8509L9367K6865L4936K529m6794l0212p451M1032O4971k7873
9588E949L7520M5841k2786k3344p5495M8016M8571k7562j26161O246M4683Q6027
9576D7505N0175K2693M2965p2495l927o473q6450P161L2315p7611l6772j6480
$$ plain form
9564 -97394 -152955 -115478 -36170 35488 25789 -6034 -15298 -48627 -66623 -30951 11335 36557
9552 36557 20182 8775 -44912 -36571 18821 65718 70307 55029 -14649 -87502 -140305 -71393
9540 -71393 -13950 46886 18409 56024 80370 46871 51781 57028 47736 77031 83773 86511 95415
9527 95415 119663 75457 50074 37145 38742 12139 35733 41133 20968 60524 92390 136913
9515 136913 66612 670 -37018 -18628 -8940 46487 62398 22395 43603 59149 18900 4387
9503 4387 -13364 -45318 -11732 -3699 -35696 -104211 -109296 -29230 -6135 -25385 -39357 94
9491 94 45990 45352 76963 79867 33277 63225 66564 8169 -9702 -34263 -52363 -17898 -71461
9478 -71461 -58645 31045 59782 90540 107293 173494 154491 30812 -44083 -141901 -78875 44265
$$ packed form
9564i7394n5561L7477P9308P1658r699l1823r264l3329j7996L5672M2286K5222
9552C6557j6375j1407n3687Q341N5392M6897M589j5278o9678p2853n2803O8912
9540g1393N7443O0836k8477L7615K4346l3499M910N247r292K9295O742K738Q904
9527I5415K4248m4206k5383j2929J597k6603K3594N400k0165L9556L1866M4523
9515A36913p0301o5942l7688J8390R688N5427J5911m0003K1208J5546m0249j4513
9503D387j7751l1954L3586Q033l1997o8515n085Q0066K3095j9250j3972L9451
9491I4M5896o38L1611K904m6590K9948L339n8395j7871k4561j8100L4465n3563
9478g1461J2816Q9690K8737L0758J6753O6201j9003j23679p4895r7818O3026J23140
$$ plain form
9466 44265 43739 91663 108993 62111 39601 57202 31897 11844 -6812 -3544 570 -32825 -17253
9453 -17253 12807 -82020 -82292 -17389 1864 -6582 39070 95299 103464 94228 8578 -26409 -18820
9440 -18820 14214 -18753 -74226 -34033 -47271 -14736 -71454 -80542 -16662 3585 16903 -1930
9428 -1930 -3357 8195 14871 53143 38881 42655 102286 70684 77321 96089 88633 104247 112207
9415 112207 115938 139150 67438 -2688 4472 144199 191673 80611 2428 -33912 2081 -860
9403 -860 12252 49631 83489 17681 2261 1009 -13440 -49462 4800 14252 58093 39639 -15722
9390 -15722 -30235 23049 29607 16923 -2071 -7265 -16414 11923 82737 84374 7037 -38671 -14964
9377 -14964 -21930 -43148 -52992 -23499 -23462 21181 -69145 -121755 -196018 -159350 -101943 -94053 -89995
$$ packed form
9466D4265n26M7924J7330m6882k2510J7601k5305k0053j8656L268M114l3395J5572
9453a7253L0060r4827k72O4903J9253q446M5652N6229Q165r236q5650l4987P589
9440a8820L3034l2967n5473M0193j3238L2535n6718r088O3880K0247J3318j8833
9428a930j427J1552O676L8272j4262L774N9631l1602O637J8768p456J5614P960
9415A12207L731K3212p1712p0126P160J39727M7474j11062p8183l6340L5993k941
9403h60J3112L7379L3858o5808j5420j252j4449l6022N4262R452M3841j8454n5361
9390a5722j4513N3284O558j2684j8994n194r149K8337P0814J637p7337m5708K3707
9377a4964o966k1218r844K9493L7M4643r0326n2610p4263L6668N7407P890M058
$$ plain form
9364 -89995 -35845 -51511 -62372 -18147 26611 -9270 -36851 -25649 -64987 -85842 -39940 8650
9352 8650 -9930 37647 59931 18952 14530 11438 -90978 -132590 -190075 -136496 -24505 -54787
9340 -54787 -34692 -60440 -7942 -1313 -8363 -19487 -157318 -155619 -45840 38466 43504 64154
9328 64154 118415 31262 -2751 -18554 -51238 -20541 -729 -50296 -33937 -24 -27503 -86033
9316 -86033 -52113 -32381 20599 -10130 -108050 -122089 -84114 -17299 13371 41788 921 -64703
9304 -64703 -33765 -51886 -39018 -39788 28782 78013 54341 -21982 -8625 7887 -17705 44476
9292 44476 93470 142039 66187 18641 46538 39339 24363 3425 53452 42295 27456 10378
9280 10378 12893 9202 31183 52928 43954 1337 9163 -70008 -43380 8398 37189 50286 47374
$$ packed form
9364h9995N4150j5666j0861M4225M4758l5881k7581J1202l9338k0855M5902M8590
9352H650j8580M7577K2284m0979m422l092j02416m1612n7485N3579J11991l0282
9340e4787K0095k5748N2498O629p050j1124j37831J699J09779Q4306N038K0650
9328F4154N4261q7153l4013j5803l2684L0697J9812m9567J6359L3913k7479n8530
9316h6033L3920J9732N2980l0729r7920j4039L7975O6815L0670K8417m0867o5624
9304f4703L0938j8121J2868p70O8570M9231k3672p6323J3357J6512k5592O2181
9292D4476M8994M8569p5852m7546K7897p199j4976k0938N0027j1157j4839j7078
9280A0378K515l691K1981K1745q974m2617P826p9171K6628N1778K8791J3097k912
$$ plain form
9267 47374 37712 81491 116388 102363 105543 85299 4297 -11405 -56190 -14978 92680 77749
9255 77749 15452 13511 61842 27871 21340 52478 65291 90431 86556 84447 91675 94155 48749
9242 48749 126766 171848 61817 52012 88930 29476 -52375 -59092 -35131 -33012 -10766 55471
9230 55471 97276 114971 67172 55826 48676 18024 41995 -16213 -82753 -90876 -54951 -66902
9218 -66902 -90363 -75599 -39103 -34332 -85190 -34477 -26784 -64582 -89887 -124078 -155477 -118501
9206 -118501 -107844 -24057 75204 1622 -100214 -90799 -69196 -22592 -26250 -103278 -170151 -149210
9194 -149210 -138620 -160692 -131856 -90916 -1072 13383 43948 69103 67884 -12524 -78698 -96206
9182 -96206 -82427 -44873 -38315 -23581 -21141 -18615 -34544 -8279 62512 32169 -36282 -54170
$$ packed form
9267D7374r662M3779L4897j4025L180k0244q1002j5702m4785M1212J07658j4931
9255G7749o2297j941M8331l3971o531L1138J2813K5140l875k109P228K480m5406
9242D8749P8017M5082j10031r805L6918n9454q1851o717K3961K119K2246O6237
9230E5471M1805J7695m7799j1346p150l0652K3971n8208o6540q123L5925j1951
9218f6902k3461J4764L6496M771n0858N0713P693l7798k5305l4191l1399L6976
9206a18501J0657Q3787R9261p3582j01836R415K1603M6604l658p7028o6873K0941
9194a49210J0590k2072K8836M0940Q9844J4455L0565K5155j219q0408o6174j7508
9182i6206J3779L7554O558J4734K440K526j5929K6265P0791l0343o8451j7888
$$ plain form
9170 -54170 -55733 -107622 -76586 -46746 -27944 -22148 -37698 -48156 -62318 -32194 6137 47168
9158 47168 35983 -11151 1009 16655 83526 85158 52562 27997 -4512 16824 26961 80199
9146 80199 50486 -44802 -101372 -110327 -80520 -31782 -16833 30657 143160 135722 66996 30241
9134 30241 34166 46182 51030 48980 73641 134259 151631 191416 152216 70368 11173 -24978
9122 -24978 -39339 -59820 -14137 31599 34394 19921 -19131 -49058 -24010 34034 63700 160919
9110 160919 248383 163053 117277 77074 24208 51824 89215 145534 164955 96943 112072 155713
9098 155713 217532 113542 122416 157056 198432 169241 163027 171821 249874 316055 295374 282195
9086 282195 307794 311890 410172 517650 605516 731577 846427 969789 1064310 1248453 1525635
$$ packed form
9170e4170j563n1889L1036K9840J8802N796j5550j0458j4162L0124L8331M1031
9158D7168j1185m7134J2160J5646O6871J632l2596k4565l2509K1336J0137N3238
9146H0199k9713r5288n6570q955K9807M8738J4949M7490J12503p438o8726l6755
9134C0241L925J2016M848k050K4661O0618J7372L9785l9200q1848n9195l6151
9122b4978j4361k0481M5683M5736K795j4473l9052k9927K5048N8044K9666R7219
9110A60919Q7464q5330m5776m0203n2866K7616L7391N6319J9421o8012J5129M3641
9098A55713O1819j03990Q874L4640M1376k9191o214Q794P8053O6181k0681j3179
9086B82195K5599M096R8282J07478Q7866J26061J14850J23362R4521J84143K77182
$$ plain form
9075 1525635 1863546 2279375 2861872 3825883 5018384 7085980 10503469 16160986 24881981
9066 24881981 33499980 35329168 30438700 22799503 15688893 10792166 7786824 5902283
9058 5902283 4705713 3791492 3115442 2604513 2240049 1900198 1665321 1508293 1307078
9049 1307078 1149673 1098986 1089576 1013867 898275 741983 679036 594960 608726 497334 308574
9038 308574 343601 339710 284355 258437 225356 236890 345414 419043 371089 400139 382463 295119
9026 295119 209046 175734 149797 134411 150939 88587 37657 32438 37887 30273 -1678 28350
9014 28350 108710 78803 75009 79964 110391 155438 160150 82032 79140 70250 78779 123939 157647
9001 157647 131609 72627 -25990 -19984 -14628 -12528 -25397 -63751 -4828 92703 113663 61424
$$ packed form
9075A525635L37911M15829N82497R64011J192501K067596L417489N657517Q720995
9066B4881981Q617999J829188m890468p639197p110610m896727l005342j884541
9058E902283j196570r14221o76050n10929l64464l39851k34877j57028k01215
9049A307078j57405n0687r410p5709j15592j56292o2947q4076J3766j11392j88760
9038C08574L5027l891n5355k5918l3081J1534J08524P3629m7954K9050j7676q7344
9026B95119q6073l3312k5937j5386J6528o2352n0930n219N449p614l1951L0028
9014B8350Q0360k9907l794M955L0427M5047M712p8118k892q890Q529M5160L3708
9001A57647k6038n8982r8617O006N356K100j2869l8354N8923R7531K0960n2239
$$ plain form
8989 61424 70760 47769 6253 -24144 -21284 24076 -12239 16264 53053 18420 -50770 -84764
8977 -84764 -16553 -7800 -47008 -107717 -61116 -39892 -24441 29699 33537 7455 78070 89707
8965 89707 74184 12414 12420 20769 -18686 -70713 -101505 -35287 69616 107784 86946 48186 23217
8952 23217 110331 106518 75252 -20610 -28974 -116224 -126834 7544 105161 74478 70373 90235
8940 90235 45012 17337 -53203 -6490 71466 58060 45144 57815 112994 92167 52661 41163
8928 41163 73239 100424 108937 77445 23608 37456 69682 27677 24822 26133 20349 9271 87028
8915 87028 153137 155982 65064 1715 27194 49826 406 -19031 -20062 43539 59718 51161
8903 51161 41615 -16677 -11532 59558 53907 -59988 -7 46020 66395 146084 140007 51634
$$ packed form
8989F1424R336k2991m1516l0397K860M5360l6315K8503L6789l4633o9190l3994
8977h4764O8211Q753l9208o0709M6601K1224J5451N4140L838k6082P0615J1637
8965H9707j5523o1770OQ349l9455n2027l0792O6218J04903L8168k0838l8760k4969
8952B3217Q7114l813l1266r5862q364q7250j0610J34378R7617l0683m105J9862
8940I0235m5223k7675p0540M6713P7956j3406j2916J2671N5179k0827l9506j1498
8928D1163L2076K7185Q513l1492n3837J3848L2226m2005k855J311n784j1078P7757
8915H7028O6109K845r0918o3349K5479K2632m9420j9437j031O3601J6179q557
8903E1161r546n8292N145P1090n651j13895N9981M6027K0375P9689o077q8373
$$ plain form
8891 51634 -4750 16920 10716 39984 -9242 20301 67577 79979 65668 104854 139776 161534
8879 161534 145598 115705 109010 71115 -5430 -22986 -27871 -46495 -69526 -69240 -82049 -81167 -25595
8866 -25595 3504 -5457 87307 135019 147982 119304 93191 49706 14747 -21073 -24717 17215
8854 17215 64622 27364 16875 93252 86121 30576 -11020 -36934 -27961 -39574 -46190 -120422
8842 -120422 -81177 -25803 -18574 76775 106200 63263 -31430 -80345 -10709 57123 40506 54797
8830 54797 -15494 -67240 -22875 -27491 -50448 -109933 -73341 -14054 45917 33619 -66553 -56414
8818 -56414 -38045 24711 34435 34070 56424 34408 -13229 -57465 -55230 -38057 -51322 -51119 -72135
8805 -72135 -48411 -48241 -52641 -100690 -131416 -46496 -55048 -16866 29877 62292 14317 -26245 -149
$$ packed form
8891E1634n6384K1670o204K9268m9226K9543M7276J2402j4311L9186L4922K1758
8879A61534j5936k9893o695l7895p6545j7556m885j8624k3031K86j2809Q82N5572
8866b5595K9099q961R2764M7712J2963k8678k6113m3485l4959l5820l644M1932
8854A7215M7407l7258j0489P6377p131n5545m1596k5914Q973j1613o616p4232
8842a20422L9245N5374P229R5349K9425m2937r4693m8915O9636O7832j6617J4291
8830E4797p0291n1746M4365m616k2957n9485L6592N9287N9971j2298j00172J0139
8818e6414J8369O2756R724l65K2354k2016m7637m4236K235J7173j3265K03k1016
8805g2135K3724J70m400m8049l0726Q4920q552L8182M6743L2415m7975m0562K6096
$$ plain form
8792 -149 -22072 -16403 -37760 -44962 30315 45899 -1127 1670 -1609 71522 19768 -24269 -119982
8779 -119982 -145926 -86325 -62164 -42097 -72293 -52584 17186 40664 38245 3562 -22167 -25689
8767 -25689 -49122 -81444 -90306 2632 19266 -4911 9232 13540 5661 27768 27153 -33444 -106495
8754 -106495 -89083 -90011 -11812 60858 35008 -59752 -120732 -133174 -111019 -21500 35930 -25286
8742 -25286 -39725 45050 81154 65079 102558 95366 101066 19889 -11755 11337 55965 78515
8730 78515 83246 102550 116357 96666 48676 73045 43078 5334 6668 -17098 -59642 -5272
8718 -5272 61109 41110 24469 -27365 1421 47951 111058 127035 61087 7676 152 -27819
8706 -27819 -13766 25870 9864 -7316 -85795 -53198 47603 1075 54989 5899 -70859 -84932
$$ packed form
8792a49k1923N669k1357p202P5277J5584m7026K797l279P3131n1754m4037r5713
8779a19982k5944N9601K4161K0067l0196J9709O9770K3478k419l4683k5729l522
8767b5689k3433l2322q862R2938J6634k4177J4143M308p879K2107o15o0597p3051
8754a06495J7412r28P8199P2670k5850r4760o0980j2442K2155Q9519N7430o1216
8742b5286j4439Q4775L6104j6075L7479p192N700q1177l1644K3092M4628K2550
8730G8515M731J9304J3807j9691m7990K4369k9967l7744J334k3766m2544N4370
8718e272O6381j9999j6641n1834K8786M6530O3107J5977o5948n3411p524k7971
8706b7819J4053L9636j6006j7180p8479L2597J00801m6528N3914m9090p6758j4073
$$ plain form
8694 -84932 -111145 -77219 -42680 39450 72043 72970 57158 -6532 -34176 -1958 -4570 -42079
8682 -42079 -3577 93448 90149 15239 -55927 -76007 -12341 -10295 -23113 20886 73499 64484
8670 64484 42593 24878 30769 37046 22754 -20632 -8410 -83561 -108275 -88984 -9182 83637
8658 83637 76486 107907 129225 121504 102730 6723 -8873 -56579 -58314 5238 19415 30009
8646 30009 31620 61871 36370 59343 114152 112678 36902 -45113 12497 -7765 -18295 -18591 3373
8633 3373 14486 -35689 -70034 -42634 -8182 45781 135263 169491 167071 136452 119167 188357
8621 188357 211060 152423 118435 116950 117684 163961 169042 95501 53832 42607 2615 28488
8609 28488 8022 33820 39611 60918 126803 144772 145211 163612 144754 100938 139095 148417 178808
$$ packed form
8694h4932k6213L3926L4539Q2130L2593R27j5812o3690k7644L2218k612l7509
8682d2079L8502R7025l299p4910p1166k0080O3666K046j2818M3999N2613r015
8670F4484k1891j7715N891O277j4292m3386J2222p5151k4714J9291P9802R2819
8658H3637p151L1421K1318p721j8774r6007j5596m7706j735O3552J4177J0594
8646C0009J611L0251k5501K2973N4809j474p5776q2015N7610k0262j0530k96K1964
8633C373J1113n0175l4345K7400L4452N3963Q9482L4228k420l0619j7285O9190
8621A88357K2703n8637l3988j485P34M6277N081p3541m1669j1225l9992K5873
8609B8488k0466K5798N791K1307O5885J7969M39J8401j8858m3816L8157R322L0391
$$ plain form
8596 178808 198189 174434 139538 216912 175534 73672 98695 97435 36317 -50692 65392
8585 65392 139190 136504 154323 128833 76196 34162 -17227 -2583 -25954 -65344 -50043 -12529
8573 -12529 83080 92739 143517 264176 355525 298516 200923 72008 32577 35868 102543 158998
8561 158998 130363 125989 116803 85760 69221 78285 44482 11879 -2451 -27257 -58098 -3205
8549 -3205 21543 17535 49488 65004 50813 61886 10178 -51068 -124320 -53315 6448 80945
8537 80945 90938 122510 107856 135082 111283 104585 154265 156974 104537 149869 255014 404546
8525 404546 564728 626705 509977 366913 219150 98786 89066 75151 42789 42064 80327
8514 80327 93642 189397 170756 91700 39121 4442 9994 81857 44644 29213 62552 -30251
$$ packed form
8596A78808J9381k3755l4896P7374m1378j01862K5023j260o1118q7009J16084
8585F5392P3798k686J7819k5490n2637m2034n1389J4644k3371l9390J5301L7514
8573a2529R5609R659N0778J20659R1349n7009r7593j28915l9431L291O6675N6455
8561A58998k8635m374r186l1043j6539R064l3803l2603j4330k4806l0841N4893
8549c205K4748m008L1953J5516j4191J1073n1708o1246p3252P1005N9763P4497
8537H0945R993L1572j4654K7226k3799o698M9680K709n2437M5332J05145J49532
8525D04546J60182O1977j16728j43064j47763j20364r720j3915l2362p25L8263
8514H0327J3315R5755j8641p9056n2579l4679N552P1863l7213j5431L3339r2803
$$ plain form
8502 -30251 -97907 -105247 -84324 -29133 -16103 -3330 47255 55807 25206 -20075 -49379 -21379
8490 -21379 -41972 -84952 -62259 -34155 -717 -19892 675 78386 213590 330232 316839
8479 316839 289761 272550 182431 170728 148596 25094 -140024 -132602 -66145 -81287 -51037
8468 -51037 -26984 33168 25538 40747 33657 -5246 -31287 -13563 -15743 -4463 -3935 -35446 -27963
8455 -27963 -52982 -13258 -2627 26960 83632 64147 74947 55714 36939 57889 70220 33532
8443 33532 39625 156738 183735 144855 76157 71321 21389 6776 11204 14400 43131 46230 25528
8430 25528 17794 -4291 -58788 -101268 -82796 -10593 -13575 -21480 42687 33781 -7290 -76045 -61607
8417 -61607 30670 98673 127165 114749 140583 79245 50231 1336 -13523 24549 21611 51602
$$ packed form
8502c0251o7656p340K0923N5191J3030J2773N0585Q552l0601m5281k9304K8000
8490b1379k0593m2980K2693K8104L3438j9175K0567P7711J35204J16642j3393
8479C16839k7078j7211r0119j1703k2132j23502j65118P422O6457j5142L0250
8468e1037K4053O0152p630J5209p090l8903k6041J7724k180J1280N28l1511P483
8455b7963k5019L9724J0631K9587N6672j9485J0800j9233j8775K0950J2331l6688
8443C3532O093J17113K6997l8880o8698m836m9932j4613M428L196K8731L099k0702
8430B5528p734k2085n4497m2480J8472P2203k982p905O4167q906m1071o8755J4438
8417f1607R2277O8003K8492j2416K5834o1338k9014m8895j4859L8072k938K9991
$$ plain form
8405 51602 80705 43069 47124 53360 -5619 50294 158717 107360 31218 17319 56089 59590
8393 59590 31467 50948 24626 21322 72889 120216 78489 58490 9709 95387 162432 116501
8381 116501 44141 -55122 -83795 -100376 -75692 -86773 -45861 -8920 -12667 -25292 -91067 -111540
8369 -111540 -50476 -52391 -74304 -47170 60356 119631 108756 37457 44262 66008 8352 -17082
8357 -17082 9871 -28906 -93580 -168946 -172996 -99874 -60858 -72180 -82419 -46457 27498 15196
8345 15196 -1296 100328 87356 50713 75524 53746 -6058 -29705 -17921 15315 -91431
8334 -91431 -77555 -71526 -31269 7312 19181 5199 -3151 16014 -51184 -83715 -67909 -9724
8322 -9724 56889 69414 111306 169249 146207 54253 21981 -9819 -30541 -27791 -20222 -65119
$$ packed form
8405E1602K9103l7636M055O236n8979N5913J08423n1357p6142j3899L8770L501
8393E9590k8123J9481k6322l304N1567M7327m1727j9999m8781Q5678O7045m5931
8381A16501p2360r9263k8673j6581K4684j1081M0912L6941l747j2625o5775k0473
8369a11540O1064j915k1913K7134J07526N9275j0875p1299O805K1746n7656k5434
8357a7082K6953l8777o4674p5366m050P3122L9016j1322j0239L5962P3955j2302
8345A5196j6492J01624j2972l6643K4811k1778n9804k3647J1784L3236j06746
8334i1431J3876O029M0257L8581J1869j3982q350J9165o7198l2531J5806N8185
8322i724O6613J2525M1892N7943k3042r1954l2272l1800k0722K750P569m4897
$$ plain form
8310 -65119 -29976 -35263 -23180 3843 9789 -897 -28699 -76335 -31903 52731 117518 79912
8298 79912 35010 27063 55373 67526 118460 11338 -26984 -6500 12880 23280 -18650 8402
8286 8402 4221 -50501 -55125 -31720 -12814 -2107 -43464 -104135 -105712 -56106 -58427 -54948 -27316
8273 -27316 -18599 -53521 -41873 -44857 -58198 -85573 -90523 -115804 -82484 -75947 -85657 -73304 -82744
8260 -82744 16107 75665 43817 36805 -10809 -120016 -43975 -30303 -31640 -25623 -26270 -28041 48812
8247 48812 19223 13636 41972 18591 49973 103165 -355 -84210 -49142 8861 30643 29727
8235 29727 28720 -17908 -27399 873 11114 -8435 27018 108338 84287 54013 66661 36548
8223 36548 49049 53616 40552 22189 3443 -15996 13453 39564 103563 47324 40613 17334
$$ packed form
8310f5119L5143n287J2083K7023N946j0686k7802m7636M4432Q4634O4787l7606
8298G9912m4902p947K8310J2153N0934j07122l8322K0484J9380J0400m1930K7052
8286H402m181n4722m624K3405J8906J0707m1357o0671j577M9606k321L479K7632
8273b7316Q717l4922J1648k984j3341k7375m950k5281L3320O537r710J2353r440
8260h2744R8851N9558l1848p012m7614j09207P6041J3672j337O017o47j771P6853
8247D8812k9589n587K8336k3381L1382N3192j03520q3855L5068N8003K1782r16
8235B9727j007m6628r491K8272J0241j9549L5453Q1320k4051l0274J2648l0113
8223C6548J2501M567j3064j8363j8746j9439K9449K6111O3999n6239o711k3279
$$ plain form
8211 17334 -5880 -7717 12602 27454 -49923 -150241 -185842 -167208 -71819 -95000 -145422 -123618
8199 -123618 -108362 -100452 -30281 -40106 -62736 -65698 -72261 -134576 -178652 -77486 -51592 -80708
8187 -80708 -86546 -27161 -66861 -118374 -155529 -101096 -90769 -82064 -10477 43149 77579 21439
8175 21439 -27812 -69974 -81265 -26472 -37923 13559 -7891 -34995 -14606 -58992 -91496 -34121
8163 -34121 59320 52533 -3622 -62586 -110272 -55079 -13855 -7923 2178 50430 69352 48559
8151 48559 -2158 29700 38182 24452 60990 32635 16868 2715 -53436 -72640 -69424 372
8139 372 52390 46685 57204 75102 48158 -25337 -64169 -10519 -22374 -3909 -54324 -65080
8127 -65080 -31908 -28283 -29559 -40156 20001 69451 20172 -104362 -121254 -78872 13562 76804
$$ packed form
8211A7334k3214j837K0319J4852p7377j00318l5601J8634R5389k3181n0422K1804
8199a23618J5256P910P0171r825k2630k962o563o2315m4076J01166K5894k9116
8187h0708n838N9385l9700n1513l7155N4433J0327Q705P1587N3626L4430n6140
8175B1439m9251m2162j1291N4793j1451N1482k1450k7104K0389m4386l2504N7375
8163c4121R3441o787n6155n8964m7686N5193M1224N932J0101M8252J8922k0793
8151D8559n0717L1858Q482j3730L6538k8355j5767j4153n6151j9204L216O9796
8139C72N2018n705J0519J7898k6944p3495l8832N3650j1855J8465n0415j0756
8127f5080L3172L625j276j0597O0157M9450m9279j24534j6892M2382R2434O3242
$$ plain form
8115 76804 47154 31727 -62919 -18556 -28119 -29600 7723 3324 -11736 -3724 -23525 7222 738
8102 738 3084 69974 30575 -39859 -49775 -7438 30264 48633 70370 32352 33028 14967 -14886
8089 -14886 29808 66962 11165 -19229 -108242 -156273 -128666 -48790 -36608 78167 115531 54215
8077 54215 -26747 -44218 38485 65601 -17632 18087 -8431 73406 102990 133308 146258 111054
8065 111054 33214 34251 53465 12988 -29755 -65824 -123188 -93974 -52024 91124 159741 80154
8053 80154 32655 -13270 -36868 -27290 -19107 -24552 -16736 -104845 -137100 -81192 9155 34130 70389
8040 70389 120035 119252 170084 108946 44146 75538 113791 84643 -14126 -84792 -34299 -41699
8028 -41699 -11782 36029 -15254 -4881 -10629 -54233 -44770 -52767 -69324 -103869 -48815 8630
$$ packed form
8115G6804k9650j5427r4646M4363r563j481L7323m399j5060Q012j9801L0747o484
8102G38K346O6890l9399p0434r916M2337L7702J8369K1737l8018O76j8061k9853
8089a4886M4694L7154n5797l0394q9013m8031K7607P9876J2182J14775L7364o1316
8077E4215q0962j7471Q2703K7116q3233L5719k6518Q1837K9584L0318J2950l5204
8065A11054p7840J037J9214m0477m2743l6069n7364K9214M1950J43148O8617p9587
8053H0154m7499m5925k3598R578Q183n445P816q8109l2255N5908R0347K4975L6259
8040G0389M9646p83N0832o1138o4800L1392L8253k9148r8769p0666N0493p400
8028d1699K9917M7811n1283J0373n748m3604R463p997j6557l4545N5054N7445
$$ plain form
8016 8630 69231 105375 73655 44445 64563 110334 160892 98408 61644 110913 103522 105720
8004 105720 137241 144338 123005 176918 134607 108943 116572 132770 173032 201744 194298 221514
7992 221514 253209 225981 114143 19084 14195 -54510 -53122 28882 85404 75506 89268 94487
7980 94487 -20032 -26348 -1189 -60693 -62461 -50365 6323 46602 -20879 7287 50141 57099
7968 57099 92 -16435 59161 78533 52555 91598 90897 63515 30625 67884 175860 212039
7956 212039 232739 165244 129765 101001 81560 128618 138254 88382 114688 39051 -7343 22737
7944 22737 -58109 -83638 -69613 -13137 33329 63748 99297 100540 116650 83470 31594 -11270
7932 -11270 -4646 112128 170442 114177 133010 109045 113688 117801 121226 15213 49787 172841
$$ packed form
8016H630O0601L6144l1720k9210K0118M5771N0558o2484l6764M9269p391K198
8004A05720L1521P097k1333N3913m2311k5664P629J6198M0262K8712p446K7216
7992B21514L1695k7228j11838r5059m889o8705J388Q2004N6522r898J3762N219
7980I4487j14519o316K5159n9504j768J2096N6688M0279o7481K8166M2854O958
7968E7099n7007j6527P5596J9372k5978L9043p01k7382l2890L7259J07976L6179
7956B12039K0700o7495l5479k8764j9441M7058R636m9872K6306p5637m6394L0080
7944B2737q0846k5529J4025N6476M6466L0419L5549J243J6110l3180n1876m2864
7932a1270O624J16774N8314n6265J8833k3965M643M113L425j06013L4574J23054
$$ plain form
7920 172841 228096 209245 158889 122688 89734 121724 106013 85009 67738 86195 134677 152652
7908 152652 191130 120178 66168 43317 14359 101173 89509 62696 67610 18248 1314 59067
7896 59067 11757 1930 7284 -493 18474 34713 22932 64707 10329 -2041 26697 23466 27147
7883 27147 70248 55446 -5788 4111 58184 -34188 -69175 -60730 -134034 -164638 -99388 -16452
7871 -16452 -17762 -62914 -23854 -30914 -35560 17230 76476 118378 86383 38737 -8586 3998
7859 3998 10758 41029 54098 87005 171315 184392 111036 96839 172284 178788 62552 12203
7847 12203 -43077 -15524 30116 64942 68265 17658 3112 -38855 -4399 13403 -16032 -23689
7835 -23689 14765 -6543 11515 -36940 -95231 -99947 -57243 -26286 41756 100533 73960 20389
$$ packed form
7920A72841N5255j8851n0356l6201l2954L1990j5711k1004j7271J8457M8482J7975
7908A52652L8478p0952n4010k2851k8958Q6814j1664k6813M914m9362j6934N7753
7896E9067m7310r827N354p777J8967J6239j1781M1775n4378j2370K8738l231L681
7883B7147M3101j4802o1234R899N4073r2372l4987Q445p3304l0604O5250Q2936
7871a6452j310m5152L9060p060m646N2790N9246M1902l1995m7646m7323J2584
7859C998O760L0271J3069L2907Q4310J3077p3356j4197P5445O504j16236n0349
7847A2203n5280K7553M5640L4826L323n0607j4546m1967L4456J7802k9435p657
7835b3689L8454k1308J8058m8455n8291m716M2704L0957O8042N8777k6573n3571
$$ plain form
7823 20389 -2479 -12634 -40805 -33927 -54702 -100932 -135532 -137425 -194799 -161408 -119972 -73512
7811 -73512 -34832 -39999 -6185 -2223 4697 52675 77315 27218 -72023 -103831 -45628 13726
7799 13726 22364 -34097 -42580 -10460 41476 74285 103413 60070 2230 -69790 -30285 -57315
7787 -57315 -45026 -19624 -48188 -142563 -158163 -64605 20299 95598 58529 63651 -4890 -40937
7775 -40937 -29761 -49549 -68011 -27080 -32391 5675 50648 76564 40303 -13173 -73293 -116532
7763 -116532 -26509 51843 -38680 -67298 2697 -29502 -69978 -20838 267 -63257 -55260 -36648
7751 -36648 -76250 -121346 -77817 -17955 15656 -9076 -29238 -38788 -1647 38720 -19045 -29278
7739 -29278 -55944 33107 -47471 -137980 -110589 -111534 -89888 -38606 -4800 -30168 4296 4544 -62663
$$ packed form
7823B0389k2868j0155k8171O878k0775m6230l4600j893n7374L3391M1436M6460
7811g3512L8680n167L3814L962O920M7978K4640n0097r9241l1808N8203N9354
7799A3726Q638n6461q483L2120N1936L2809K9128m3343n7840p2020L9505k7030
7787e7315J2289K5402k8564r4375j5600R3558Q4904P5299l7069N122o8541l6047
7775d0937J1176j9788j8462M0931n311L8066M4973K5916l6261n3476o0120m3239
7763a16532R0023P8352r0523k8618O9995l2199m0476M9140K1105o3524P997J8612
7751c6648l9602m5096M3529N9862L3611k4732k0162r550L7141M0367n7765j0233
7739b9278k6666Q9051q0578r0509K7391r45K1646N1282L3806k5368L4464K48o7207
$$ plain form
7726 -62663 -47903 -16807 -2146 17970 91396 97210 35580 40399 24471 -17489 -65368 -1593
7714 -1593 -5608 -17052 -3485 -37531 -30233 -12177 -66169 -95889 -30686 -6690 -29712 9237
7702 9237 75755 34287 31719 49645 29714 22709 77589 46803 -17074 -51395 23899 48708
7690 48708 -12397 21443 97319 63600 88734 134002 172601 110583 47782 26517 27815 -22229
7678 -22229 -64722 -18747 -36614 -43098 -17981 -59364 -83783 -14639 46977 16435 -10075 20586
7666 20586 51527 35624 35182 34205 -61007 -69619 -15770 9418 -31996 -35200 -1833 58587 28310
7653 28310 41456 22892 -28870 -37065 -88413 -142492 -140530 -117102 -54772 -76627 -25352 26650
7641 26650 -69965 -118394 -147286 -148822 -38255 21138 -26323 -1262 53448 43540 30113 42580
$$ packed form
7726f2663J4760L1096J4661K0116P3426N814o1630M819j5928m1960m7879O3775
7714a593m015j1444J3567l4046P298J8056n3992k9720O5203K3996k3022L8949
7702I237O6518m1468k568J7926j9931p005N4880l0786o3877l4321P5294K4809
7690D8708o1105L3840P5876l3719K5134M5268L8599o2018o2801k1265J298n0044
7678b2229m2493M5975j7867o484K5117m1383k4419O9144O1616l0542k6510L0661
7666B0586L0941j5903m42r77r5212q612N3849K5188m1414l204L3367O0420l0277
7653B8310J3146j8564n1762q195n1348n4079J962K3428O2330k1855N1275N2002
7641B6650r6615m8429k8892j536J10567N9393m7461K5061N4710r908j3427J2467
$$ plain form
7629 42580 84239 82574 110869 79128 17141 669 -14709 -50216 -55118 7847 35787 -31505
7617 -31505 -50835 -77462 -43590 11008 72732 55616 -3876 36826 1031 6879 46501 50605
7605 50605 55657 40962 -53481 -112578 -88341 -13132 3291 -5335 1664 -62851 -84992 -67370
7593 -67370 -41850 -11136 38273 66571 68289 34495 -77136 -129153 -53164 22059 62273 56435
7581 56435 -2599 26379 26856 -23758 -41210 -114687 -130827 -97871 -115562 -132077 -98010 -4896
7569 -4896 74998 91249 66475 20774 -40197 -27249 -6202 -39992 -12051 27841 68032 22959
7557 22959 3748 -2652 28704 18862 63905 72238 7037 48120 127292 124304 71884 -2201 14609
7544 14609 7992 -52033 -102340 -150617 -105777 -6845 4853 1101 -81254 -125898 -97222 -80588
$$ packed form
7629D2580M1659j665K8295l1741o1987j6472j5378l5507m902O2965K7940o7292
7617c1505j9330k6627L3872N4598O1724j7116n9492M0702l5795N848L9622M104
7605E0605N052j4695r4443n9097K4237P5209J6423q626O999o4515k2141J7622
7593f7370K5520L0714M9409K8298J718l3794j11631n2017P5989P5223M0214n838
7581E6435n9034K8978M77n0614j7452p3477j6140L2956j7691j6515L4067R3114
7569d896P9894J6251k4774m5701o0971J2948K1047l3790K7941L9892M0191m5073
7557B2959j9211o400L1356r842M5043Q333o5201M1083P9172k988n2420p4085J6810
7544A4609o617o0025n0307m8277M4840R8932J1698l752q2355m4644K8676J6634
$$ plain form
7532 -80588 -120941 -98173 -100741 -73483 -76112 -59267 -44388 -30760 -33948 7925 -69649 -15925
7520 -15925 17822 4651 -32588 -55687 -62833 -55769 -63501 -62096 -1771 62516 70019 4751 -15758
7507 -15758 17036 38924 62764 -25597 -64673 -43900 -30935 -43365 -58571 -11033 15039 36050
7495 36050 84486 39829 69183 24124 -5107 -1419 -31211 -80232 -97251 -4333 52268 43245
7483 43245 27713 37317 41425 42656 -10109 31302 9541 11084 39729 20800 45766 -34491 -57684
7470 -57684 14339 9385 -12241 -21304 -64347 -1563 110872 117242 19930 -524 26865 47988
7458 47988 24863 -69589 -74222 -10683 -35471 -109880 -84004 21339 80039 117034 162083 104413
7446 104413 26524 85045 141240 92697 61060 43273 -2403 -85156 -53012 -29766 -20991 -256
$$ packed form
7532h0588m0353K2768k568K7258k629J6845J4879J3628l188M1873p7574N3724
7520a5925L3747j3171l7239k3099p146P064p732J405O0325O4287P503o5268k0509
7507a5758L2794K1888K3840q8361l9076K0773J2965j2430j5206M7538K6072K1011
7495C6050M8436m4657K9354m5059k9231L688k9792m9021j7019R2918N6601r023
7483D3245j5532R604M108J231n2765M1411k1761J543K8645j8929K4966q0257k3193
7470e7684P2023m954k1626r063m3043O2784J12435O370r7312k0454K7389K1123
7458D7988k3125r4452m633O3539k4788p4409K5876J05343N8700L6995M5049n7670
7446A04413p7889N8521N6195m8543l1637j7787m5676q2753L2144K3246Q775K0735
$$ plain form
7434 -256 -14767 -33033 -36155 32003 22145 -86879 -117865 -65149 -69433 -157588 -172818 -110723 -46003
7421 -46003 -70464 -149285 -112537 -113756 -97760 -62299 -95725 -110315 -85448 -9064 -4962 -21979
7409 -21979 -35690 12547 -11003 -76169 41949 65702 -4491 -4989 -30218 -71839 -19995 -10606
7397 -10606 -57107 -108816 -55039 -29776 -56148 -66605 -41027 -48572 34633 32093 -51049 -56769
7385 -56769 -41479 -39148 -11951 30223 18139 9235 -49463 26198 100774 103142 20640 -118508
7373 -118508 -74060 -84475 -8000 86503 51385 -36591 -6669 -26091 -40643 -68847 -92591 -59989
7361 -59989 -23810 -7877 -18036 -97213 -98549 -18761 -52583 -85711 -123663 -136084 -83513 -40414
7349 -40414 -84329 -74667 -75720 -94471 -123459 -143163 -130524 -90141 -48549 -73236 -83403 -80828
$$ packed form
7434b56j4511j8266l122O8158r858j09024l0986N2716m284q8155j5230O2095O4720
7421d6003k4461p8821L6748j219J5996L5461l3426j4590K4867P6384M102j7017
7409b1979j3711M8237k3550o5166J18118K3753p0193m98k5229m1621N1844R389
7397a0606m6501n1709N3777K5263k6372j0457K5578p545Q3205k540q3142n720
7385e6769J5290K331K7197M2174j2084q904n8698P5661P4576K368q2502j39148
7373a18508M4448j0415P6475R4503l5118q7976K9922j9422j4552k8204k3744L2602
7361e9989L6179J5933j0159p9177j336P9788l3822l3128l7952j2421N2571M3099
7349d0414m3915R662j053j8751k8988j9704J2639M0383M1592k4687j0167K575
$$ plain form
7337 -80828 -85279 -25678 -63105 -55242 -45177 -27900 25990 42434 24445 15873 -22872 -25378 11790
7324 11790 -21761 -55111 -34238 17348 47328 50779 18551 -18232 866 25398 24179 -62272
7312 -62272 8717 87663 88094 30263 -64128 -188641 -167202 -60299 -67761 -105450 -99818 1015
7300 1015 54516 7518 -13002 -10392 89502 46255 56451 59581 64732 55853 122901 151368 105522
7287 105522 107178 107206 90736 27627 5249 50364 69181 34781 -12672 -78047 -93352 -15070
7275 -15070 -32537 -31612 26352 -6746 -89048 -104663 -90646 -76672 -103404 -200585 -245857 -239239
7263 -239239 -71530 -20779 -77906 -96068 -67896 -77349 -80452 -52265 -38989 -51110 -30949 30990
7251 30990 104099 71696 21885 28266 57056 67073 18581 -53009 -31536 -10587 -64083 -94544
$$ packed form
7337h0828m451N9601l7427P863J0065J7277N3890J6444j7989q572l8745k506L7168
7324A1790l3551l3350K0873N1586K9980L451l2228l6783J9098K4532j219q6451
7312f2272P0989P8946M31n7831r4391j24513K1439J06903p462l7689N632J00833
7300A015N3501m6998k0520K610R9894m3247J0196L130N151q879O7048K8467m5846
7287A05522J656K8j6470o3109k2378M5115J8817l4400m7453o5375j5305P8282
7275a5070j7467R25N7964l3098q2302j5615J4017J3974k6732r7181m5272O618
7263b39239J67709N0751n7127j8162K8172r453l103K8187J3276j2121K0161O1939
7251C0990P3109l2403m9811O381K8790J0017m8492p1590K1473K0949n3496l0461
$$ plain form
7239 -94544 -120447 -112701 -130009 -62724 -79197 -130745 -89306 -27510 -12737 -50618 -85079 -7833
7227 -7833 30240 6281 -49500 -122310 -64610 -29520 -9725 -2304 10133 -16546 -11198 31732
7215 31732 16903 -19885 -4513 13808 -60114 -67457 -61029 -64279 34554 49457 16887 -14287
7203 -14287 -71815 -98511 -90349 -14581 55211 15939 57208 10476 31516 34407 22264 24333
7191 24333 -58052 -119979 -76969 -69083 -51934 -25022 27493 -14380 -64168 -49455 -47073 -32865
7179 -32865 36564 27052 44123 -19110 -2714 60636 38403 -18682 -11388 17912 -31537 -14934
7167 -14934 51110 78643 3451 13313 37908 44224 -2136 -1703 2911 27312 -48013 -136968 -66440
7154 -66440 84959 95762 32692 -92380 -95059 -105154 -130414 -72670 -32699 -24945 21977 62484
$$ packed form
7239i4544k5903P746j7308O7285j6473n1548M1439O1796J4773l7881l4461P7246
7227g833L8073k3959n5781p2810N7700L5090J9795P421J2437k6679N348M2930
7215C1732j4829l6788J5372J8321p3922p343O428l250R8833J4903l2570l1174
7203a4287n7528k6696Q162P5768O9792l9272M1269m6732K1040K891j2143K069
7191B4333q2385o1927M3010P886J7149K6912N2515m1873m9788J4713K382J4208
7179c2865O9429r512J7071o3233J6396O3350k2233n7085P294K9300m9449J6603
7167a4934O6044K7533p5192R862K4595O316m6360M33M614K4401p5325q8955P0528
7154f6440J51399J0803o3070j25072k679j0095k5260N7744L9971P754M6922M0507
$$ plain form
7142 62484 99061 89282 6043 -11483 10574 -4348 -5995 -15165 -54173 -59329 30648 -14661 -49205
7129 -49205 -80740 -54675 -36183 6899 -79019 -101338 -69456 6653 12530 -45470 -23425 -50440
7117 -50440 -94928 -77708 -30371 -22353 -48858 -75224 -110380 -126983 -87417 -32743 -14553 -60282
7105 -60282 -90765 -84568 -135460 -130988 -81771 -77736 -51009 -18326 -13086 -39282 -83595 -33292 -57117
7092 -57117 -43201 -15545 14059 28153 38685 65558 14467 -24013 16948 -31052 -53089 -42776
7080 -42776 14840 -53822 -60098 -8546 65746 -7199 -66439 -44778 22689 39785 3580 -42425
7068 -42425 -102189 -168702 -124721 -146819 -131611 -44654 12139 20111 16603 42636 40927 60552
7056 60552 30462 5206 2947 -39957 -84399 -19814 30483 8102 20391 -30649 10779 23097
$$ packed form
7142F2484L6577r779q3239j7526K2057j4922j647r170l9008n156Q9977m5309l4544
7129d9205l1535K6065J8492M3082q5918k2319L1882P6109N877n8000K2045k7015
7117e0440m4488J7220M7337Q018k6505k6366l5156j6603L9566N4674J8190m5729
7105f0282l0483O197n0892M472M9217M035K6727L2683N240k6196m4313N0303k3825
7092e7117J3916K7656K9604J4094J0532K6873n1091l8480M0961m8000k2037J0313
7080d2776N7616o8662o276N1552P4292p2945n9240K1661O7467J7096l6205m6005
7068d2425n9764o6513M3981k2098J5208Q6957N6793P972l508K6033j709J9625
7056F0552l0090k5256k259m2904m4442O4585N0297k2381J2289n1040M1428J2318
$$ plain form
7044 23097 17553 2536 -18925 -21398 -45874 32130 74817 175787 185769 61736 31499 135063
7032 135063 84025 81 11149 -59629 -30913 4493 -36036 -65990 -68102 -40395 -57521 -1177
7020 -1177 -13379 -84890 -80335 36346 80497 77771 63252 41998 -33625 -77912 -23536 -49076
7008 -49076 -41849 -18473 -15905 -21379 -67385 21449 10613 19810 14542 4982 12269 -29461 -54996
6995 -54996 12378 63142 55542 -41137 -73255 -89112 -90397 -45081 -31019 6856 -25019 -18908
6983 -18908 59550 79743 852 -37478 -48762 -43583 -41133 -30160 -32128 -35478 -26200 -25801 14943
6970 14943 42864 -26941 -131764 -107890 -92176 -143953 -164796 -121720 -125536 -77183 -5024 37279
6958 37279 19431 -45218 -50085 -8552 -69475 -78359 -55979 -38974 1881 -12333 -7717 46572
$$ packed form
7044B3097n544j5017k1461k473k4476P8004M2687J00970R982j24033l0237J03564
7032A35063n1038q3944J1068p0778K8716L5406m0529k9954k112K7707j7126N6344
7020a177j2202p1511M555J16681M4151k726j4519k1254p5623m4287N4376k5540
7008d9076P227K3376K568n474m6006Q8834j0836R197n268r560P287m1730k5535
6995e4996O7374N0764p600r6679l2118j5857j285M5316J4062L7875l1875O111
6983a8908P8458K0193p8891l8330j1284N179K450J0973j968l350R278L99M0744
6970A4943K7921o9805j04823K3874J5714n1777k0843M3076l816M8353P2159M2303
6958C7279j7848o4649m867M1533o0923q884K2380J7005M0855j4214M616N4289
$$ plain form
6946 46572 74413 41355 13475 34590 40231 42945 -16781 -60265 -72901 -38798 -38892 -102354 -70422
6933 -70422 -20363 29748 13381 -68022 -83051 -78693 -65601 -60664 -36141 35606 28366 -44927
6921 -44927 -111613 -97294 -86413 -91208 -48846 -17936 -32757 56613 128645 60481 24942 -48121
6909 -48121 -101596 -151224 -187020 -143300 -28276 36799 10542 -78536 -140123 -95449 -118995 -50622
6897 -50622 -3435 -62342 -59503 -78184 -61451 -89997 -34534 -33443 -1816 13176 6253 56037
6885 56037 60856 67885 86996 37043 -9946 -39644 45204 98701 50717 23582 -1792 27479
6873 27479 1823 -43416 -30567 -88573 -67816 -14282 32850 22527 35820 81638 119575 103985
6861 103985 12859 -50961 -28333 14964 -38996 -111968 -133882 -64776 -18945 -4769 -46043 -53747
$$ packed form
6946D6572K7841l3058k7880K1115N641K714n9726m3484j2636L4103r4o3462L1932
6933g0422N0059N0111j6367q1403j5029M358J3092M937K4523P1747p240p3293
6921d4927o6686J4319J0881m795M2362L0910j4821Q9370P2032o8164l5539p3063
6909d8121n3475m9628l5796M3720J15024O5075k6257q9078o1587M4674k3546O8373
6897e0622M7187n8907K839j8681J6733k8546N5463J091L1627J4992o923M9784
6885E6037M819P029J9111m9953m6989k9698Q4848N3497m7984k7135k5374K9271
6873B7479k5656m5239J2849n8006K0757N3534M7132j0323J3293M5818L7937j5590
6861A03985r1126o3820K2628M3297n3960p2972k1914O9106M5831J4176m1274p704
$$ plain form
6849 -53747 15359 105697 103856 -5261 -53030 -70327 -51364 -4405 17498 3177 12939 -31282
6837 -31282 -58567 -7636 44886 10503 31452 91517 69364 7869 -16752 18530 130 1855
6825 1855 -14637 -46447 -59759 -76310 -87930 -130990 -110347 -79214 61417 79900 78303 117822
6813 117822 113392 58195 -1864 -45417 28248 124134 192753 174280 143083 113949 115202 50694
6801 50694 -27171 -70900 -47158 37702 3382 -13562 -37127 -25260 -40189 -38203 30750 34527
6789 34527 33859 9729 -39606 -49619 -75839 -53444 -46808 -88274 -93042 -102724 -21549 -18544 -31571
6776 -31571 -41138 -83152 -49637 23341 39427 28100 38682 39223 71618 56560 130007 52884
6764 52884 55003 64031 -9159 -79104 -60348 -44135 -52657 -95595 -72116 22731 32752 -30152
$$ packed form
6849e3747O9106R0338j841j09117m7769j7297J8963M6959K1903j4321R762m4221
6837c1282k7285N0931N2522l4383K0949O0065k2153o1495k4621L5282j8400J725
6825A855j6492l1810j3312j6551j1620m3060K0643L1133J40631J8483j597L9519
6813A17822m430n5197o0059m3553P3665R5886O8619j8473l1197k9134J253o4508
6801E0694p7865m3729K3742Q4860l4320j6944k3565J1867j4929J986O8953L777
6789C4527o68k4130m9335j0013k6220K2395O636m1466m768r682Q1175L005j3027
6776c1571r567m2014L3515P2978J6086j1327J0582N41L2395j5058P3447p7123
6764E2884K119R028p3190o9945J8756J6213q522m2938K3479R4847J0021o2904
$$ plain form
6752 -30152 -51037 -43309 -22106 -55297 -23777 -35672 -54964 -72622 -25560 16137 -16456 -31093
6740 -31093 -4216 32608 56103 91793 59208 -16417 -80170 -129127 -145885 -80133 -49933 -84074
6728 -84074 -106879 -122124 -106293 -34880 5787 21947 -30208 -33400 35785 80294 82676 86225
6716 86225 47896 10802 5380 -26198 -24148 65289 32747 -44599 -74505 -101941 -96356 -114907
6704 -114907 -140908 -115452 -101768 -90040 -115085 -167901 -110532 -109593 -152286 -97908 -44006 49240
6692 49240 38059 -27756 -20896 -11562 6360 6854 -27663 31428 44069 -9682 -106718 -35973 -27081
6679 -27081 -23785 -16660 -4384 12792 40235 31468 -268 7417 29739 91870 100159 82205 16014
6666 16014 21536 29088 21766 -6078 38231 90726 129794 117886 78978 32044 23727 -42740 -75533
$$ packed form
6752c0152k0885P728K1203l3191L1520j1895j9292j7658M7062M1697l2593j4637
6740c1093K6877L6824K3495L5690l2585p5625o3753m8957j6758O5752L0200l4141
6728h4074k2805j5245J5831P1413M0667J6160n2155l192O9185M4509K382L549
6716H6225l8329l7094n422l1578K050Q9437l2542p7346k9906k7436N585j8551
6704a14907k6001K5456J3684J1728k5045n2816N7369R39m2693N4378N3902R3246
6692D9240j1181o5815O860R334J7922M94l4517N9091J2641n3751r7036P0745Q892
6679b7081L296P125J2276J7176K7443q767l1736P685K2322O2131Q289j7954o6191
6666A6014N522P552p322k7844M4309N2495L9068j1908l8908m6934q317o6467l2793
$$ plain form
6653 -75533 -1752 13731 44674 7346 103 -40228 -9657 -45689 -44624 -20160 13383 9211
6641 9211 -26284 -10587 -57815 -79330 -44361 -71909 -123277 -157969 -83023 -54145 -104561 -136290
6629 -136290 -44948 -45423 -83888 -125748 -108101 -111150 -46302 11348 5398 38225 38771 36161 12187
6616 12187 -2117 -6708 -26319 -16937 -34526 -35344 6902 41731 11147 -23824 -19840 103230 87043
6603 87043 68201 92014 60711 28994 28694 -16905 -56321 -88047 -102842 -29971 34108 25156
6591 25156 63082 67932 8074 8783 30355 8329 16675 3080 29843 153345 186269 96591
6579 96591 63479 55692 17208 -14364 -98308 -187749 -162829 -157922 -133576 -79007 -57395 -61579
6567 -61579 -107138 -132364 -64017 -32755 -11654 31889 -13064 12418 87654 89047 99922 100040
$$ packed form
6653g5533P3781J5483L0943l7328p243m0331L0571l6032J065K4464L3543m172
6641I211l5495J5697m7228k1515L4969k7548n1368l4692P4946K8878n0416l1729
6629a36290R1342m75l8465m1860J7647l049O4848N7650n950L2827N46k610k3974
6616A2187j4304m591j9611R382j7589q18M2246L4829l0584l4971L984J23070j6187
6603H7043j8842K3813l1303l1717l00m5599l9416l1726j4795P2871O4079q952
6591B5156L7926M850n9858P09K1572k2026Q346j3595K6763J23502L2924q9678
6579I6591l3112p787l8484l1572q3944q9441K4920M907K4346N4569K1612m184
6567f1579m5559k5226O8347L1262K1101M3543m4953K5482P5236J393J0875J18
$$ plain form
6555 100040 41488 16650 2815 42831 83059 40154 31670 26757 25152 48778 -3544 2986
6543 2986 -22638 -1853 42332 -17842 14758 55805 65295 15089 -84796 -139699 -93591 -19845
6531 -19845 31183 -12510 -73906 -27063 -2260 23648 54441 59074 68011 14049 2519 -122775
6519 -122775 -143901 -79141 -70404 -11550 42653 -5624 -62043 -116478 -110386 -79712 -83200 -87494
6507 -87494 -59706 -37675 -22321 144 5923 39561 -50207 -151086 -123184 -66549 -35657 -98327
6495 -98327 -193682 -194848 -97162 -57929 -78416 -93345 -86373 -80491 -90982 -145795 -148499 -112046 -111599
6482 -111599 -24860 -8972 -4008 -54136 -67881 -135561 -186222 -107438 -43551 -23211 22835 78821
6470 78821 -22039 -69602 -127382 -124205 -49597 -81234 -106599 -85527 -9407 99298 80307 -7570
$$ packed form
6555A00040n8552k4838j3835M0016M0228m2905q484m913j605K3626n2322O530
6543B986k5624K0785M4185o0174L2600M1047R490n0206r9885n4903M6108P3746
6531a9845N1028m3693o1396M6843K4803K5908L0793M633Q937n3962j1530j25294
6519a22775k1126O4760Q737N8854N4203m8277n6419n4435O092L0674l488m294
6507h7494K7788K2031J5354K2465N779L3638q9768j00879K7902N6635L0892o2670
6495i8327r5355j166R7686L9233k0487j4929O972N882j0491n4813k704L6453M47
6482a11599Q6739J5888M964n0128j3745o7680n0661P8784O3887K0340M6046N5986
6470G8821j00860m7563n7780L177P4608l1637k5365K1072P6120J08705j8991q7877
$$ plain form
6458 -7570 -18948 -83812 -115046 -8075 -26780 -71265 -39701 -24634 -27836 -2717 -41942 6528
6446 6528 -18161 -80876 -67251 -87308 -71034 -14110 40715 95252 99876 78616 30582 11549
6434 11549 424 18675 22411 38045 85940 118285 40291 29684 50814 82059 30037 24576
6422 24576 25485 -22640 -98623 -99851 -38485 13987 -34837 -79335 -127792 -132804 -122064 -101456 -89414
6409 -89414 -99455 -57923 24686 55981 49571 24995 5937 51486 110302 49500 -9712 -11144
6397 -11144 4149 -33741 -64250 -124625 -115220 -46406 32679 43980 28599 50726 102337 126189
6385 126189 122110 76870 46691 116175 56840 -20579 -56972 -41227 -44986 -101611 -85776 -94006
6373 -94006 -78365 -35497 33889 96432 126266 4112 7596 16702 25021 40381 98517 77396
$$ packed form
6458g570j1378o4864l1234J06971j8705m4485L1564J5067l202K5119l9225M8470
6446F528k4689o2715J3625k0057J6274N6924N4825N4537M624k1260m8034j9033
6434A1549j1125J8251L736J5634M7895L2345p7994j0607K1130L1245n2022n461
6422B4576R09m8125p5983j228O1366N2472m8824m4498m8457n012J0740K0608J2042
6409h9414j0041M1532Q2609L1295o410k4576j9058M5549N8816o0802n9212j432
6397a1144J5293l7890l0509o0375R405O8814P9085J1301j5381K2127N1611K3852
6385A26189m079m5240l0179O9484n9335p7419l6393J5745l759n6625J5835q230
6373i4006J5641M2868O9386O2543K9834j22154L484R106Q319J5360N8136k1121
$$ plain form
6361 77396 47190 21243 -756 -25344 -61265 -92230 -58937 -67146 -57160 2562 -6524 -75360
6349 -75360 -127808 -85317 3720 5611 87486 148570 99945 80730 122581 81295 83407 6054
6337 6054 -54864 -32898 -33115 -9308 -17412 -65913 -13051 -30203 -29478 -73811 12041 119504 128883
6324 128883 82364 77002 65094 44734 41171 22586 24409 35230 24217 -34680 7837 -97065
6312 -97065 -130329 -23137 -36768 -29010 29300 61113 69448 -19706 8119 54447 73561 61888
6300 61888 40594 55733 6990 -47987 -87751 -171331 -188842 -175651 -67382 371 3646 41193
6288 41193 23777 -2012 5419 23182 -9831 -32142 -64934 -33690 -1067 40663 11580 -15370
6276 -15370 1967 58593 67900 44688 68320 38172 -13032 -95483 -139700 -153173 -59448 -51812
$$ packed form
6361G7396l0206k5947k1999k4588l5921l0965L3293q209R986N9722r086o8836
6349g5360n2448M2491Q9037J891Q1875O1084m8625j9215M1851m1286K112p7353
6337F054o0918K1966k17K3807q104m8501N2862j7152P25m4333Q5852J07463R379
6324A28883m6519n362j1908k0360l563j8585J823J0821j1013n8897M2517j04902
6312i7065l3264J07192j3631P758N8310L1813Q335q9154K7825M6328J9114j1673
6300F1888k1294J5139m8743n4977l9764q3580j7511J3191J08269O7753L275L7547
6288D1193j7416k5789P431J7763l3013k2311l2792L1244L2623M1730k9083k6950
6276a5370J7337N6626R307k3212K3632l0148n1204q2451m4217j3473R3725P636
$$ plain form
6264 -51812 435 24534 18699 2023 -26626 -64 -29508 -26933 -70026 -59969 8042 12401
6252 12401 -36132 50392 45923 46305 -23832 -86922 -69174 -60160 7919 39192 5039 52989 75141
6239 75141 -34977 -123695 -90689 -51080 -22700 -48271 -9742 25763 43819 81033 72275 77345
6227 77345 117750 54232 7577 -950 -6714 -41617 -48759 6098 39658 67366 26278 -35457
6215 -35457 -55846 -51847 -47823 -3107 41476 471 -3854 39330 50283 37438 11731 14580 -48524
6202 -48524 -92262 -121558 -179594 -118126 -17452 39444 62778 104069 159281 128482 98272 2888
6190 2888 -78243 9284 33880 43030 134830 105605 99139 -13673 -50670 -22571 7110 59972
6178 59972 75990 40733 11292 10308 30669 58756 26541 -19316 -67610 -26045 8137 -31098
$$ packed form
6264e1812N2247K4099n835j6676k8649K6562k9444K575m3093J0057O8011M359
6252A2401m8533Q6524m469L82p0137o3090J7748R014O8079L1273l4153M7950K2152
6239G5141j10118q8718L3006L9609K8380k5571L8529L5505J8056L7214q758N070
6227G7345M0405o3518m6655q527n764l4903p142N4857L3560K7708m1088o1735
6215c5457k0389L999M024M4716M4583m1005m325M3184J0953j2845k5707K849o3104
6202d8524m3738k9296n8036O1468J00674N6896K3334M1291N5212l0799l0210r5384
6190B888q1131Q7527K4596R150R1800k9225o466j12812l6997K8099K9681N2862
6178E9972J6018l5257k9441r84K0361K8087l2215m5857m8294M1565L4182l9235
$$ plain form
6166 -31098 -51048 -50458 -68392 -94393 -98474 -113084 -69933 -39500 -65113 -94709 -94251 -79041 -55087
6153 -55087 -14999 -11700 1687 20586 16937 -65857 -56205 37232 82890 13402 40840 76444
6141 76444 114280 67507 14442 -17595 -97691 -103480 -37769 34353 31381 66081 51915 29882
6129 29882 -19894 -15290 41051 5634 26531 -4347 206 42247 1323 -38992 -51157 -109636
6117 -109636 -122346 -68678 -10128 -85758 -70478 -9026 -5944 -31905 -24778 35420 91682 90357
6105 90357 116132 76278 -42053 -158585 -195907 -189932 -137723 -64594 -26983 -25486 -27800 15264
6093 15264 -31724 -45238 7758 -36288 -81888 -95776 -106428 -56068 -77532 -102426 -96853 -73474
6081 -73474 -81175 -57493 -44473 9302 90784 103865 115252 38882 42210 104501 55460 -6431
$$ packed form
6166c1098j9950N90j7934k6001m081j4610M3151L0433k5613k9596M58J5210K3954
6153e5087M0088L299J3387J8899l649q2794R652R3437M5658o9488K7438L5604
6141G6444L7836m6773n3065l2037q0096n789O5711P2122k972L4700j4166k2033
6129B9882m9776M604N6341l5417K0897l0878M553M2041m0924m0315j2165n8479
6117a09636j2710N3668N8550p5630J5280O1452L082k5961P127O0198N6262j325
6105I0357K5775l9854j18331j16532l7322N975N2209P3129L7611J497k314M3064
6093A5264m6988j3514N2996m4046m5600j3888j0652N0360k1464k4894N573K3379
6081g3474p701K3682J3020N3775Q1482J3081J1387p6370L328O2291m9041o1891
$$ plain form
6069 -6431 18515 66328 64539 51868 31003 -51363 -48459 1351 -21812 -56347 -37275 -43895 -48717
6056 -48717 3125 -38414 -47245 -67573 -140549 -141786 -103992 -54682 -33694 7233 -36843 -52051
6044 -52051 -97201 -141348 -121176 -124168 -137651 -174420 -75596 -38671 -41682 22823 48008 -1338
6032 -1338 19057 39142 37603 104083 41324 -27667 5508 54077 94763 49705 -10102 -20313
6020 -20313 -46697 -7174 59530 93647 42955 -1890 9514 -6831 55391 20446 15766 69234
6008 69234 47293 -38548 -74626 -80741 -48621 -39684 -13470 61357 -20094 -52188 -56714 -56561 -23766
5995 -23766 -8690 -38114 -21662 30410 46306 15020 67375 38329 14764 33447 132987 169120
5983 169120 148346 136000 62293 -24439 -62123 -26659 17198 15852 20649 -3890 -60915 -39339
$$ packed form
6069f431K4946M7813j789j2671k0865q2366K904M9810k3163l4535J9072o620m822
6056d8717N1842m1539q831k0328p2976j237L7794M9310K0988M0927m4076j5208
6044e2051m5150m4147K0172k992j3483l6769R8824L6925l011O4505K5185m9346
6032a338K0395K0085j539O6480o2759o8991L3175M8569M0686m5058n9807j0211
6020b0313k6384L9523O6704L4117n0692m4845J1404j6345O2222l4945m680N3468
6008F9234k1941q5841l6078o115L2120Q937K6214P4827q1451l2094m526J53L2795
5995b3766J5076k9424J6452N2072J5896l1286N2355k9046k3565J8683R9540L6133
5983A69120k0774j2346p3707q6732l7684L5464M3857j346M797k4539n7025K1576
$$ plain form
5971 -39339 -16868 -5076 -39277 -90682 -26661 18886 19818 70616 48935 54381 51287 55437 -14193
5958 -14193 -79970 -81999 -37666 -77941 -38817 -8901 13241 14295 10071 79713 84671 19517 -48906
5945 -48906 -68608 -11554 68537 53572 56423 57043 57163 30470 -13916 -8307 -42863 -39307 -36281
5932 -36281 -42086 -81224 -30372 65520 111457 98017 6578 -55605 -44722 -68908 -59250 -999
5920 -999 45079 29028 21102 29606 51890 -9230 -64343 -48196 -38457 -11102 10564 24018 34959
5907 34959 12512 -10491 -29555 10751 -44563 -136518 -151467 -166596 -116008 -74693 -57453 -14720
5895 -14720 10453 -12680 -2104 30287 74372 78485 68497 69973 33277 43505 23089 43030
5883 43030 27612 -34583 -48930 20146 -992 -24009 -1988 -48695 -44702 33698 66383 80853
$$ packed form
5971c9339K2471J1792l4201n1405O4021M5547R32N0798k1681N446l094M150o9630
5958a4193o5777k029M4333m0275L9124K9916K2142J054m224O9642M958o5154o8423
5945d8906j9702N7054Q0091j4965K851O20J20k6693m4386N609l4556L556L026
5932c6281n805l9138N0852R5892M5937j3440r1439o2183J0883k4186R658N8251
5920i99M6078j6051p926Q504K2284o1120n5113J6147R739K7355K1666J3454J0941
5907C4959k2447k3003j9064M0306n5314r1955j4949j5129N0588M1315J7240M2733
5895a4720K5173k3133J0576L2391M4085M113r988J476l6696J0228k0416J9941
5883D3030j5418o2195j4347O9076k1138k3017K2021m6707L993P8400L2685J4470
$$ plain form
5871 80853 18674 -87331 -81565 -68472 -91248 -120524 -105479 -36926 -6895 54311 122195 104535
5859 104535 105638 103552 -38541 -67976 -96653 -70735 -5614 13992 26719 85391 85941 106097
5847 106097 110835 109369 76366 -1519 -19370 41327 132265 210651 189207 121518 61800 -6639
5835 -6639 23912 47861 -19320 -88958 -69176 -27239 -44003 -7246 -2327 26239 27283 9768
5823 9768 -25812 -80390 -23678 -11806 -20748 -48972 13029 67601 -28410 -70792 -18133 29773
5811 29773 18354 56121 60910 34440 62751 61938 69473 84361 -11397 -101461 -77882 -39779 12587
5798 12587 47723 4973 -52366 -57324 -61988 -19665 74687 36229 -1510 16092 28780 21553
5786 21553 1012 16366 -37273 -25929 20600 56512 -29805 -112336 -132679 -117016 -37959 -6895
$$ packed form
5871H0853o2179j06005N766J3093k2776k9276J5045O8553L0031O1206O7884j7660
5859A04535J103k086j42093k9435k8677K5918O5121J9606J2727N8672N50K0156
5847A06097M738j466l3003p7885j7851O0697R0938P8386k1444o7689n9718o8439
5835f639L0551K3949o7181o9638J9782M1937j6764L6757M919K8566J044j7515
5823I768l5580n4578N6712J1872q942k8224O2001N4572r6011m2382N2659M7906
5811B9773j1419L7767M789k6470K8311q13P535J4888r5758r0064K3579L8103N2366
5798A2587L5136m2750n7339m958m664M2323R4352l8458l7739J7602J2688p227
5786B1553k0541J5354n3639J1344M6529L5912q6317q2531k0343J5663P9057L1064
$$ plain form
5774 -6895 -24335 -44012 -73379 -112541 -61262 -84813 -104428 -131404 -89799 -48107 -5423 4494
5762 4494 -3910 10528 9859 -5184 -25596 -15381 11124 32720 -24782 -65309 -126361 -115399 -110041
5749 -110041 -75576 -49504 -28937 -45027 -28855 -22783 -31030 -118529 -104576 -43187 -28924 -60391
5737 -60391 -18596 17722 -15198 -37126 19960 72710 14843 -41156 -1692 44976 32681 -46794
5725 -46794 -121130 -118533 -86942 -63378 -26477 -32387 -53439 -78494 -22258 -14856 -1925 -1047 84802
5712 84802 93778 91076 101730 61301 42399 34492 49667 87482 98465 72700 9609 -25282
5700 -25282 -43345 -81119 -89851 -106499 -122102 -37718 -27496 -57991 -103191 -98924 -12901 -29454
5688 -29454 -86623 -45486 -7751 -24779 -59962 -61895 13767 -21675 -7068 64927 106697 64617
$$ packed form
5774f895j7440j9677k9367l9162N1279k3551j9615k6976M1605M1692M2684R917
5762D494q404J4438o69j5043k0412J0215K6505K1596n7502m0527o1052J0962N358
5749a10041L4465K6072K0567j6090J6172O072q247q7499J3953O1389J4263l1467
5737f0391M1795L6318l2920k1928N7086N2750n7867n5999L9464M6668j2295p9475
5725d6794p4336K597L1591K3564L6901n910k1052k5055N6236P402J2931Q78Q5849
5712H4802Q976k702J0654m0429j8902p907J5175L7815J0983k5765o3091l4891
5700b5282j8063l7774q732j6648j5603Q4384J0222l0495m5200M267Q6023j6553
5688b9454n7169M1137L7735j7028l5183j933P5662l5442J4607P1995M1770m2080
$$ plain form
5676 64617 -62818 -73096 -26388 6656 -13309 -27932 -38731 -120801 -89176 -34796 14860 39157
5664 39157 29716 41824 -26487 -65073 -654 29968 19413 37792 42631 4435 -43675 -13452
5652 -13452 -50081 -63607 -32963 28118 47940 -17921 -11778 18891 9125 50038 47993 -866
5640 -866 -30321 -5554 16275 28184 67421 81854 93645 68860 6511 -75837 -79557 19666
5628 19666 -19182 -39298 -54338 -30095 19437 75282 86849 37514 -8150 -5535 20124 76750
5616 76750 92093 60761 12446 41186 117918 94169 -10794 22394 37511 31981 56280 65906
5604 65906 79092 -53412 -82501 -34904 -41277 -20724 25081 76796 43602 30027 75024 1352
5592 1352 -68887 -83060 -22290 20951 61265 114349 109959 55860 -88756 -92332 -23351 59073
$$ packed form
5676F4617j27435j0278M6708L3044j9965j4623j0799q2070L1625N4380M9656K4297
5664C9157r441J2108o8311l8586O4419L0622j0555J8379M839l8196m8110L0223
5652a3452l6629j3526L0644O1081J9822o5861O143L0669r766M0913k045m8859
5640h66k9455K4767K1829J1909L9237J4433J1791k4785o2349q2348l720R9223
5628A9666l8848k0116j5040K4243M9532N5845J1567m9335m5664K615K5659N6626
5616G6750J5343l1332m8315K8740P6732k3749j04963L3188J5117n530K4299R626
5604F5906J3186j32504k9089M7597o373K0553M5805N1715l3194j3575M4997p3672
5592A352p0239j4173O0770M3241M0314N3084m390n4099j44616l576O8981Q2424
$$ plain form
5580 59073 97649 115366 123227 120247 160838 156721 69889 25184 34168 35334 5347 14801 -14287
5567 -14287 -49412 -128619 -116481 -120075 -77318 -44870 -2857 -19082 -91316 -111666 -91521 -45506
5555 -45506 -48536 -71232 1954 43967 2869 -31711 -27714 33071 26726 28887 68665 -7558 -102119
5542 -102119 -129937 -86481 22486 15456 10017 707 -23660 -16013 2756 -16108 -9269 -1161 -33926
5529 -33926 -32210 -12403 23596 42976 24191 19820 -291 -14783 -35624 -60492 -91169 -110974
5517 -110974 -75631 -78291 -88331 -112638 -131623 -155655 -87152 16598 32580 56803 57274 94707
5505 94707 31060 40768 55236 -31670 -29842 -5078 -51820 -73382 -60203 23768 38346 29787
5493 29787 44683 54483 -12096 -19516 -16237 -65880 -54315 -49818 -51266 -78445 -47093 -32816 -105388
$$ packed form
5580E9073L8576J7717P861k980M0591m117q6832m4705Q984J166k9987R454k9088
5567a4287l5125p9207J2138l594M2757L2448M2013j6225p2234k0350K0145M6015
5555d5506l030k2696P3186M2013m1098l4580L997O0785o345K161L9778p6223r4561
5542a02119k7818M3456J08967p030n439r310k4367P647J8769j8864O839Q108l2765
5529c3926J716J9807L5999J9380j8785m371k0111j4492k0841k4868l0677j9805
5517a10974L5343k660j0040k4307j8985k4032O8503J03750J5982K4223M71L7433
5505I4707o3647R708J4468q6906J828K4764m6742k1562J3179Q3971J4578q559
5493B9787J4896R800o6579p420L279m9643J1565M497j448k7179L1352J4277p2572
$$ plain form
5480 -105388 -59207 12827 13371 20236 -25415 34820 157844 190736 129295 122869 53437 24267
5468 24267 -1173 -1142 19800 10150 57102 112015 78659 60661 87019 59132 -8071 -11546 -7342
5455 -7342 15626 41723 45177 41299 -15396 -50841 -71417 -112597 -41749 32548 99803 98331 -3527
5442 -3527 -64536 -118950 -46571 38028 26960 -20116 -59370 -53232 -89019 -79161 -87739 -100116 -25590
5429 -25590 28334 -14619 -6140 -11913 -5474 -31318 16148 84494 68938 10881 -18600 -9865 -39858
5416 -39858 -67807 -83153 -33628 -17289 -22356 -36606 -35814 -27240 -36676 19985 85761 48701 21203
5403 21203 36902 48246 110391 63259 -273 4030 84502 67872 39058 62954 61357 14131
5391 14131 56372 84524 28559 12901 39824 57980 84830 49000 -5822 -23349 -25714 -59141
$$ packed form
5480a05388M6181P2034N44O865m5651O0235J23024L2892o1441o426o9432k9170
5468B4267k5440L1K0942r650M6952N4913l3356j7998K6358k7887o7203l475M204
5455g342K2968K6097L454l878n6695l5445k0576m1180P0848P4297O7255j472j01858
5442c527o1009n4414P2379Q4599j1068m7076l9254O138l5787R858q578j2377P4526
5429b5590N3924m2953Q479n773O439k5844M7466O8346j5556n8057k9481Q735k9993
5416c9858k7949j5346M9525J6339n067j4250P92Q574r436N6661O5776l7060k7498
5403B1203J5699J1344O2145m7132o3532M303Q0472j6630k8814K3896j597m7226
5391A4131M2241K8152n5965j5658K6923J8156K6850l5830n4822j7527k365l3427
$$ plain form
5379 -59141 -82903 -21414 23858 11390 -30731 -56158 -21966 -16425 10935 -61002 -82972 -30645
5367 -30645 -44430 -121288 -67354 -672 -60917 -71171 53028 42935 -7741 -32981 -26858 -36034
5355 -36034 -41386 -55668 -18341 -64088 -108913 -95389 -148815 -89884 -16789 53932 50111 22648
5343 22648 -6969 24141 -40670 -20504 43720 73064 50441 -798 21157 -1159 -60697 -54782
5331 -54782 26983 119947 81959 39453 -13764 -63069 -57237 -31451 -60715 -85727 -50753 -66411
5319 -66411 -76625 -38601 38533 52289 72013 110950 82229 35904 15895 -27412 -89941 -178163
5307 -178163 -145658 -48825 -6637 3112 -893 10520 49335 26755 -76020 -132940 -145994 -57087
5295 -57087 -8909 -21691 -75816 -71379 -122020 -113232 -77296 -7680 7824 28935 -2941 -33230
$$ packed form
5379e9141k3762O1489M5272j2468m2121k5427L4192N541K7360p1937k1970N2327
5367c0645j3785p6858N3934O6682o0245j0254J24199j0093n0676k5240O123r176
5355c6034n352j4282L7327m5747m4825J3524n3426N8931P3095P0721l821k7463
5343B2648k9617L1110o4811K0166O4224K9344k2623n1239K1955k2316n9538N915
5331e4782Q1765R2964l7988m2506n3217m9305N832K5786k9264k5012L4974j5658
5319f6411j0214L8024P7134J3756J9724L8937k8721m6325k0009m3307o2529q8222
5307a78163L2505R6833M2188R749m005J1413L8815k2580j02775n6920j3054Q8907
5295e7087M8178j2782n4125M437n0641Q788L5936O9616J5504K1111l1876l0289
$$ plain form
5283 -33230 -34158 -51584 -14651 19239 -28005 -41743 -28911 96 60930 58420 30518 62752
5271 62752 92878 76999 15704 -25919 2406 69494 101009 27372 1875 -9823 -22339 -25173
5259 -25173 23946 31669 -45699 -57171 66163 59148 -10557 -37691 -47528 -5087 -30046 19092
5247 19092 59563 39675 26038 32623 61840 31026 62942 96115 49726 -34934 -40962 -61427
5235 -61427 -106018 -96740 -77599 -5730 2153 -40458 -58533 -86407 -74719 -34367 27976 6415
5223 6415 8053 5099 69622 60736 -5320 -50280 -45098 -30255 -15501 42690 33998 54577 137510
5210 137510 76560 38544 42820 57420 32370 68563 19949 -45836 -63139 -115755 -133473 -80433
5198 -80433 -13285 77988 53018 -28090 -60868 -69366 -47650 -55831 1775 -1274 48387 113099
$$ packed form
5283c3230r28j7426L6933L3890m7244j3738J2832K9007O0834k510k7902L2234
5271F2752L0126j5879o1295m1623K8325O7088L1515p3637k5497j1698j2516k834
5259b5173M9119P723p7368j1472J23334p015o9705k7134r837M2441k4959M9138
5247A9092M0471j9888j3637O585K9217l0814L1916L3173m6389q4660o028k0465
5235f1427m4591R278J9141P1869P883m2611j8075k7874J1688M0352O2343k1561
5223F415J638k954O4523q886o6056m4960N182J4843J4754N8191q692K0579Q2933
5210A37510o0950l8016M276J4600k5050L6193m8614o5785j7303n2616j7718N3040
5198h0433O7148R1273k4970q1108l2778q498K1716q181N7606l049M9661O4712
$$ plain form
5186 113099 111515 56714 13775 -25960 3063 35105 73821 62709 -2360 44086 131814 109829
5174 109829 69386 15334 16664 25573 63131 77957 55832 88303 120891 124793 86159 54862
5162 54862 -8485 -43691 -9451 -3392 -13008 -42138 -22964 -43050 35333 5621 -27912 30148
5150 30148 100016 118357 134293 75484 50848 63787 81604 92730 98501 26591 -38308 -59005
5138 -59005 -9944 2351 -73717 -59386 30405 9333 -46501 -48398 8333 15736 -8829 28997
5126 28997 -183 -14024 -33605 -16785 -11766 -53907 31546 -68632 -138278 -167111 -94597 1828
5114 1828 16193 87165 108344 81413 84293 -17039 -60898 -24613 -1503 -40674 -43137 15503
5102 15503 50023 -1510 63501 53119 -31180 -38784 -25875 -53495 -50137 43381 54454 20771
$$ packed form
5186A13099j584n4801m2939l9735K9023L2042L8716j1112o5069M6446Q7728k1985
5174A09829m0443n4052J330Q909L7558J4826k2125L2471L2588L902l8634l1297
5162E4862o3347l5206L4240O059r616k9130J9174k0086P8383k9712l3533N8060
5150C0148O9868J8341J5936n8809k4636J2939J7817J1126N771p1910o4899k0697
5138e9005M9061J2295p6068J4331Q9791k1072n5834j897N6731P403k4565L7826
5126B8997k9180j3841j9581J6820N019m2141Q5453j00178o9646k8833P2514R6425
5114A828J4365P0972K1179k6931K880j01332m3859L6285K3110l9171k463N8640
5102A5503L4520n1533O5011j0382q4299p604J2909k7620L358R3518J1073l3683
$$ plain form
5090 20771 31795 51545 33399 24004 -9606 -41372 -44289 -1406 4225 42956 142385 121587
5078 121587 93221 74687 66384 36956 50943 57380 87077 62124 25559 -25350 -19361 74857
5066 74857 68163 23226 31796 30383 -64080 -149118 -113583 -351 52573 -52754 -114594 -74033
5054 -74033 35403 -19444 -3139 8365 10186 -40097 -70175 -64785 -14737 -10216 -2959 -45494
5042 -45494 -82773 -72694 -36838 1160 12417 37379 83888 99775 48036 63863 33245 13913
5030 13913 -2132 -36182 27855 82938 66062 68045 36354 7757 35794 12684 20600 28220
5018 28220 17240 -3426 45577 91812 104875 65758 12539 27548 629 2345 68645 48219
5006 48219 -25471 -37390 -52792 -16802 42226 26910 17504 -3971 78038 54906 44769 78730
$$ packed form
5090B0771J1024J9750j8146r395l3610l1766k917M2883N631L8731R9429k0798
5078A21587k8366j8534q303k9428J3987O437K9697k4953l6565n0909N989R4218
5066G4857o694m4937Q570j413r4463q5038L5535J13232N2924j05327o1840M0561
5054g4033J09436n4847J6305J1504J821n0283l0078N390N0048M521P257m2535
5042d5494l7279J0079L5856L7998J1257K4962M6509J5887n1739J5827l0618j9332
5030A3913j6045l4050O4037N5083j6876J983l1691k8597K8037k3110P916P620
5018B8220j0980k0666M9003M6235J3063l9117n3219J5009k6919J716O6300k0426
5006D8219p3690j1919j5402L5990N9028j5316r406k1475Q2009k3132j0137L3961
$$ plain form
4994 78730 13206 35213 786 5165 5389 -10715 -37554 -51872 -30672 -31777 -15732 -10520 -53331
4981 -53331 -68104 -78161 -92801 -150652 -82702 -44589 31801 -5619 -86347 -61304 18579 40073
4969 40073 18416 52570 100026 51882 -54984 -109189 -117841 -103218 -106568 -72240 -24874 -43119
4957 -43119 2598 111005 178904 101106 -2441 -53720 43496 26499 36451 18516 14474 52110
4945 52110 60384 73209 94867 108593 148582 144470 79002 47515 -36923 -130806 -133414 -62646
4933 -62646 -22844 -29474 -34259 -30257 9496 -47713 -70462 -37630 -27257 -16982 34517 105916
4921 105916 127994 104700 43241 34094 104810 81297 95903 47192 56610 111253 82267 47997
4909 47997 -41276 -45044 -39256 503 11639 -3207 9903 6527 6215 -34071 -52645 17815 -22584
$$ packed form
4994G8730o5524K2007l4427M379K24j6104k6839j4318K1200j105J6045N212m2811
4981e3331j4773j0057j4640n7851O7950L8113P6390l7420q0728K5043P9883K1494
4969D0073k1657L4154M7456m8144j06866n4205q652J4623l350L4328M7366j8245
4957d3119M5717J08407O7899p7798j03547n1279R7216j6997R952j7935m042L7636
4945E2110Q274J2825K1658J3726L9989m112o5468l1487q4438r3883k608P0768
4933f2646L9802o630m785M002L9753n7209k2749L2832J0373J0275N1499P1399
4921A05916K2078k3294o1459r147P0716k3513J4606m8711R418N4643k8986l4270
4909D7997q9273l768N788L9759J1136j4846J3110l376l12m0286j8574P0460m0399
$$ plain form
4896 -22584 -38489 -45027 14818 29008 16685 8322 -1889 -3181 11078 33308 34639 7807 8265
4883 8265 71091 102638 15739 37203 82669 103031 88911 120615 104700 79170 31433 1886
4871 1886 60142 57987 41111 73859 75092 22770 -9815 -31189 7453 58230 96387 83385
4859 83385 86846 -14400 -83504 -76769 -44962 -68418 -46885 -68335 -80698 -156132 -128234 -74212
4847 -74212 -35033 6232 -16318 -71305 -17424 34383 12488 -34798 -100335 -37079 -51504 -12678
4835 -12678 3851 21900 -16878 -18990 46280 62085 4463 -37441 2250 21940 7138 -23475
4823 -23475 -19502 17032 113773 188780 150110 87310 36764 12849 51224 139422 122084 48914
4811 48914 -3126 -6862 9807 -7314 46476 104410 60123 62539 13946 -22295 -34929 -71171
$$ packed form
4896b2584j5905o538N9845J4190j2323q363j0211j292J4259K2230J331k6832M58
4883H265O2826L1547q6899K1464M5466K0362j4120L1704j5915k5530m7737k9547
4871A886N8256k155j6876L2748J233n2322l2585k1374L8642N0777L8157j3002
4859H3385L461j01246o9104O735L1807k3456K1533k1450j2363p5434K7898N4022
4847g4212L9179M1265k2550n4987N3881N1807k1895m7286o5537O3256j4425L8826
4835a2678J6529J8049l8778k112O5270J5805n7622m1904L9691J9690j4802l0613
4823b3475L973L6534R6741P5007l8670o2800n0546k3915L8375Q8198j7338p3170
4811D8914n2040l736J6669j7121N3790N7934m4287K416m8593l6241j2634l6242
$$ plain form
4799 -71171 -93850 -107562 -70615 22378 54527 17766 -32651 -52585 14525 59482 -18081 -105647
4787 -105647 -129115 -133361 -33941 37538 24812 18492 33244 88294 103786 110540 132031 103734
4775 103734 118020 71388 104638 71199 -30045 -32365 -58397 -100288 -59685 -33497 45450 -10038
$$ packed form
4799g1171k2679j3712L6947R2993L2149l6761n0417j9934O7110M4957p7563q7566
4787a05647k3468m246R9420P1479j2726o320J4752N5050J5492O754K1491k8297
4775A03734J4286m6632L3250l3439j01244k320k6032m1891M0603K6188P8947n5488
$$ [...]
##END NTUPLES=NMR SPECTRUM
##END=
