##TITLE=Analysis number 320782
Compound Code mo 07350
Project Code adrs
Chemist Name fudan
##JCAMPDX= 6.0         $$ Bruker NMR JCAMP-DX V2.0
##DATA TYPE= NMR SPECTRUM
##DATA CLASS= NTUPLES
##ORIGIN= Bruker BioSpin GmbH
##OWNER= nmr
$$ XWIN-NMR		Version 3.5
$$ Mon Jul 10 14:49:32 2006 GMT Daylight Time (UT+1h)  MAYBRIDGE\nmr@NMR_250MHZ
##.OBSERVE FREQUENCY= 250.131544655141
##.OBSERVE NUCLEUS= ^1H
##.ACQUISITION MODE= SIMULTANEOUS (DQD)
##.ACQUISITION SCHEME= undefined
##.AVERAGES= 16
##.DIGITISER RES= 18
##SPECTROMETER/DATA SYSTEM= dpx250
##.PULSE SEQUENCE= zg30
##.SOLVENT NAME= DMSO
##.SHIFT REFERENCE= (INTERNAL, DMSO, 0, 16.5675)
##AUDIT TRAIL= $$ (NUMBER, WHEN, WHO, WHERE, WHAT)
$$ ##TITLE= Audit trail, XWIN-NMR		Version 3.5
$$ ##JCAMPDX= 5.01
$$ ##ORIGIN= Bruker BioSpin GmbH
$$ ##OWNER= nmr
$$ C:\u/data/dgb/nmr/ADRS/2570/pdata/1/auditp.txt
$$ ##AUDIT TRAIL=  $$ (NUMBER, WHEN, WHO, WHERE, WHAT)
(   1,<2006-07-10 14:49:09.93 +100>,<MAYBRIDGE\nmr>,<NMR_250MHZ>,
      <created by zg, POWCHK disabled, PULCHK disabled
       configuration hash MD5:
       E2 DF 36 D8 04 B2 41 60 5A D7 A3 38 5A 4B D0 FE
       data hash MD5: 64K
       A1 4E 5C 56 53 27 94 D9 7C 95 F8 67 CA B9 F3 38>)
(   2,<2006-07-10 14:49:22.75 +100>,<MAYBRIDGE\nmr>,<NMR_250MHZ>,
      <Start of raw data processing
       ef LB = 0.3 FT_mod = 6 PKNL = 1 SI = 32K 
       data hash MD5: 32K
       24 52 58 98 FC CE C5 9C 9F 6F E4 FD 20 16 23 35>)
(   3,<2006-07-10 14:49:24.29 +100>,<MAYBRIDGE\nmr>,<NMR_250MHZ>,
      <apk 
       data hash MD5: 32K
       F4 73 3D A6 36 88 36 23 53 83 CC 7D 66 93 54 53>)
(   4,<2006-07-10 14:49:25.09 +100>,<MAYBRIDGE\nmr>,<NMR_250MHZ>,
      <abs ABSG = 5 
       data hash MD5: 32K
       5E A9 C1 32 47 D3 0A 18 78 65 BF FD F9 C7 3E FE>)
$$ ##END=
$$ 
$$ hash MD5
$$ D7 C2 0A 7A 4A B4 EF 65 FE DE DC 1F 57 0D 2C 3F
##$RELAX= 
##$RELAX= 
##$RELAX= 
##$RELAX= 
##$RELAX= 
##$RELAX= 
##$RELAX= 
$$ Bruker specific parameters
$$ --------------------------
##$DU= <C:\u>
##$EXPNO= 2570
##$NAME= <ADRS>
##$PROCNO= 1
##$TYPE= <nmr>
##$USER= <dgb>
##$AMP= (0..31)
100 100 100 100 100 100 100 100 100 100 100 100 100 100 100 100 100 100 
100 100 100 100 100 100 100 100 100 100 100 100 100 100 
##$AQSEQ= 0
##$AQ_mod= 3
##$AUNM= <au_zg>
##$AUTOPOS= <30 >
##$BF1= 250.13
##$BF2= 250.13
##$BF3= 250.13
##$BF4= 250.13
##$BF5= 500.13
##$BF6= 500.13
##$BF7= 500.13
##$BF8= 500.13
##$BYTORDA= 1
##$CFDGTYP= 0
##$CFRGTYP= 5
##$CHEMSTR= <none>
##$CNST= (0..31)
1 1 145 1 1 1 1 1 1 1 1 1 1 1 1 1 1 1 1 1 1 1 1 1 1 1 1 1 1 1 1 1 
##$CPDPRG= <>
##$CPDPRG1= <>
##$CPDPRG2= <>
##$CPDPRG3= <>
##$CPDPRG4= <mlev>
##$CPDPRG5= <mlev>
##$CPDPRG6= <mlev>
##$CPDPRG7= <mlev>
##$CPDPRG8= <mlev>
##$CPDPRGB= <>
##$CPDPRGT= <>
##$D= (0..31)
0 1 0 0 0 0 0 0 0 0.06 0 0 0 0 0 0 0.0002 0 0 0 0 0 0 0 0 0 0 0 0 0 0 
0 
##$DATE= 1152539348
##$DBL= (0..7)
120 120 120 120 120 120 120 120 
##$DBP= (0..7)
150 150 150 150 150 150 150 150 
##$DBP07= 0
##$DBPNAM0= <>
##$DBPNAM1= <>
##$DBPNAM2= <>
##$DBPNAM3= <>
$$ [...]
##$SUBNAM7= <"">
##$SUBNAM8= <"">
##$SUBNAM9= <"">
##$SW= 20.6930455092707
##$SWIBOX= (0..15)
0 0 3 0 0 0 0 0 0 0 0 0 0 0 0 0 
##$SW_h= 5175.983436853
##$TD= 65536
##$TD0= 1
##$TE= 296.16
##$TE2= 300
##$TE3= 300
##$TEG= 300
##$TL= (0..7)
0 120 120 120 120 120 120 120 
##$TP= (0..7)
150 150 150 150 150 150 150 150 
##$TP07= 0
##$TPNAME0= <>
##$TPNAME1= <>
##$TPNAME2= <>
##$TPNAME3= <>
##$TPNAME4= <>
##$TPNAME5= <>
##$TPNAME6= <>
##$TPNAME7= <>
##$TPOAL= (0..7)
0.5 0.5 0.5 0.5 0.5 0.5 0.5 0.5 
##$TPOFFS= (0..7)
0 0 0 0 0 0 0 0 
##$TUNHIN= 0
##$TUNHOUT= 0
##$TUNXOUT= 0
##$USERA1= <user>
##$USERA2= <user>
##$USERA3= <user>
##$USERA4= <user>
##$USERA5= <user>
##$V9= 5
##$VALIST= <valist>
##$VCLIST= <CCCCCCCCCCCCCCC>
##$VD= 0
##$VDLIST= <DDDDDDDDDDDDDDD>
##$VPLIST= <PPPPPPPPPPPPPPP>
##$VTLIST= <TTTTTTTTTTTTTTT>
##$WBST= 1024
##$WBSW= 4
##$XGAIN= (0..3)
0 0 0 0 
##$XL= 0
##$YL= 0
##$YMAX_a= 305876
##$YMIN_a= -317497
##$ZGOPTNS= <>
##$ZL1= 120
##$ZL2= 120
##$ZL3= 120
##$ZL4= 120
##$ABSF1= 16.56752
##$ABSF2= -4.125654
##$ABSG= 5
##$ABSL= 3
##$ALPHA= 0
##$AQORDER= 0
##$ASSFAC= 0
##$ASSFACI= 0
##$ASSFACX= 0
##$ASSWID= 0
##$AUNMP= <proc_1d>
##$AZFE= 0.1
##$AZFW= 0.1
##$BCFW= 0
##$BC_mod= 0
##$BYTORDP= 0
##$COROFFS= 0
##$CY= 12.5
##$DATMOD= 1
##$DC= 0
##$DFILT= <>
##$DTYPP= 0
##$F1P= 14.0000005364418
##$F2P= -0.99999901652339
##$FCOR= 0.5
##$FTSIZE= 32768
##$FT_mod= 6
##$GAMMA= 0
##$GB= 0
##$INTBC= 1
##$INTSCL= 1
##$ISEN= 128
##$LB= 0.3
##$LEV0= 0
##$LPBIN= 0
##$MAXI= 10000
##$MC2= 0
##$MEAN= 0
##$ME_mod= 0
##$MI= 0
##$NCOEF= 0
##$NC_proc= -5
##$NLEV= 6
##$NOISF1= 0
##$NOISF2= 0
##$NSP= 0
##$NTH_PI= 0
##$NZP= 0
##$OFFSET= 16.56752
##$PC= 1
##$PHC0= 160.9035
##$PHC1= 1.040561
##$PH_mod= 1
##$PKNL= yes
##$PPARMOD= 0
##$PSCAL= 4
##$PSIGN= 0
##$REVERSE= no
##$SF= 250.129988612839
##$SI= 32768
##$SIGF1= 0
##$SIGF2= 0
##$SINO= 400
##$SIOLD= 32768
##$SREGLST= <1H.DMSO>
##$SSB= 0
##$STSI= 32768
##$STSR= 0
##$SW_p= 5175.98343685301
##$SYMM= 0
##$S_DEV= 0
##$TDeff= 65536
##$TDoff= 0
##$TI= <Analysis number 999999
Compound Code 99
Book Reference 9
Project Code 9>
##$TILT= no
##$TM1= 0
##$TM2= 0
##$TOPLEV= 0
##$USERP1= <user>
##$USERP2= <user>
##$USERP3= <user>
##$USERP4= <user>
##$USERP5= <user>
##$WDW= 1
##$XDIM= 32768
##$YMAX_p= 410572176
##$YMIN_p= -882788
$$ End of Bruker specific parameters
$$ ---------------------------------
##NTUPLES= NMR SPECTRUM
##VAR_NAME=  FREQUENCY,     SPECTRUM/REAL,   SPECTRUM/IMAG
##SYMBOL=    X,             R,               I
##VAR_TYPE=  INDEPENDENT,   DEPENDENT,       DEPENDENT
##VAR_FORM=  AFFN,          ASDF,            ASDF
##VAR_DIM=   32768,         32768,           32768
##UNITS=     HZ,            ARBITRARY UNITS, ARBITRARY UNITS
##FACTOR=    0.157963299565203, 1,           1
##FIRST=     4144.03362436178, 0,            0
##LAST=      -1031.94981249123, 0,           0
##MIN=       -1031.94981249123, -882788,     0
##MAX=       4144.03362436178, 410572176,    0
$$ Real data points
##PAGE= N=1
##DATA TABLE= (X++(R..R)), XYDATA
$$ [...]
$$ plain form
15636 -378782 -511886 -397326 95471 446706 630055 428846 666320 682212 450328 325057
15626 325057 69872 76753 192309 194533 -94155 -238382 -309934 -468875 -347698 -139848
15616 -139848 194074 255129 161093 174221 300550 88034 29353 119180 32015 -239239 -279249
15605 -279249 -88168 34571 74960 83103 114137 245112 156928 56384 -55906 52673
15595 52673 119646 131070 70099 55456 -120392 -37132 62895 255981 110135 -111118 -133077
15584 -133077 -177577 -138342 -32653 -58701 -266075 -232503 -96175 3147 -33202 -47929 6360
15573 6360 188039 431491 499247 523458 508236 387642 39235 -110257 33368 -43188 -110337
15562 -110337 -174895 -242247 -208494 39509 84884 61074 84519 92699 189366 176560 94354
$$ packed form
15636c78782j33104J14560M92797L51235J83349k01209K37474J5892k31884j25271
15626C25057k55185O881J15556K224k88688j44227p1552j58941J21177K07850
15616a39848L33922O1055r4036J3128J26329k12516n8681Q9827q7165k71254m0010
15605b79249J91081J22739M0389Q143L1034J30975q8184j00544j12290J08579
15595E2673O6973J1424o0971j4643j75848Q3260J00027J93086j45846k21253k1959
15584a33077m4500L9235J05689k6048k07374L3572J36328R9322l6349j4727N4289
15573F360J81679K43452O7756K4211j5222j20594l48407j49492J43625p6556o7149
15562a10337o4558o7352L3753K48003M5375k3810K3445Q180R6667j2806q2206
$$ plain form
15551 94354 -9028 -171361 -236200 -256408 -97999 68014 44624 -8752 3466 -28231 16876
15540 16876 63562 127896 130863 53497 42222 -73909 -259734 -298307 -153466 148600 173694
15529 173694 40475 23442 60964 -87628 -171262 -168032 55332 198558 396478 240397
15519 240397 -202965 -72881 -95102 -65416 129560 -11902 -82698 82471 65253 -96612
15509 -96612 -182771 -72322 179613 128701 -67330 -177850 -319961 -256202 -129671 -155833
15499 -155833 -321965 -532235 -457260 -402584 -638477 -550014 -294501 -70961 188339 450255
15489 450255 418099 259631 226883 74839 130805 225450 133983 165920 91313 -146010 -40522
15478 -40522 37635 80533 299073 407377 603827 541556 303343 190307 283813 78190
$$ packed form
15551I4354j03382j62333o4839k0208J58409J66013k3390n3376J2218l1697M5107
15540A6876M6686O4334K967p7366j1275j16131j85825l8573J44841L02066K5094
15529A73694j33219j7033L7522j48592q3634L230K23364J43226J97920j56081
15519B40397m43362J30084k2221K9686J94976j41462p0796J65169j7218j61865
15509i6612q6159J10449K51935n0912j96031j10520j42111O3759J26531k6162
15499a55833j66132k10270P4975N4676k35893Q8463K55513K23540K59300K61916
15489D50255l2156j58468l2748j52044N5966R4645r1467L1937p4607k37323J05488
15478d0522P8157M2898K18540J08304J96450o2271k38213j13036R3506k05623
$$ plain form
15468 78190 15072 368721 480117 290457 133655 -29709 -14220 13819 -148616 62965
15458 62965 438165 176938 -73394 26368 180963 116393 117887 389173 193989 -19985
15448 -19985 -29952 111743 111469 -184493 -382505 -512339 -746441 -759058 -287268 -105889 -33203
15437 -33203 47063 61539 85841 43931 100449 19732 27487 -182363 -339371 -321148 -370437
15426 -370437 -357567 -238869 137946 90505 120750 126784 176867 165489 51236 -248387 -280212
15415 -280212 -69500 275405 191705 -218035 -185947 213976 559822 404389 442666 301751
15405 301751 28686 -11966 215894 63004 -326436 -213125 -164166 -173022 -104295 -62380 -122985
15394 -122985 -3754 294967 378239 371866 390359 434737 293287 23702 115991 131564 116936
$$ packed form
15468G8190o3118L53649J11396j89660j56802j63364J5489K8039j62435K11581
15458F2965L75200k61227k50332R9762J54595o4570J494K71286j95184k13974
15448a9985r967J41695k74k95962j98012j29834k34102j2617M71790J81379P2686
15437c3203Q0266J4476K4302m1910N6518q0717P755k09850j57008J8223m9289
15426c70437J2870J18698L76815m7441L0245O034N0083j1378j14253k99623l1825
15415b80212K10712L44905q3700m09740L2088L99923L45846j55433L8277j40915
15405C01751k73065m0652K27860j52890l89440J13311M8959q856O8727M1915o0605
15394a22985J19231K98721Q3272o373J8493M4378j41450k69585R2289J5573j4628
$$ plain form
15383 116936 204949 96479 64577 177659 138383 232900 76984 124602 168705 150296 -87793
15372 -87793 -63555 -89789 -168545 -156506 -22851 139339 98745 83870 -1921 -47657 -76045
15361 -76045 -116438 -155942 -119127 -260137 -374577 -264352 -30749 -128151 -213961 -211516 -282609
15350 -282609 -250113 -251500 -211604 -200910 -29507 225033 342442 256430 42146 -143298 -229336
15339 -229336 -114330 -192960 -378359 -224467 -260139 -279052 -514986 -464186 -68791 33494
15329 33494 101250 -493573 -845839 -658502 -317040 -147245 -319774 -305883 -158929 -338969
15319 -338969 -415240 -291385 -359264 -288336 -115553 -80773 -66866 138622 274057 274212 46739
15308 46739 -196364 -277982 -169814 -23670 127665 -23547 -170678 -240338 -43624 168823
$$ packed form
15383A16936Q8013j08470l1902J13082l9276R4517j55916M7618M4103j8409k38089
15372h7793K4238k6234p8756J2039J33655J62190m0594j4875q5791m5736k8388
15361g6045m0393l9504L6815j41010j14440J10225K33603r7402q5810K445p1093
15350b82609L2496j387L9896J0694J71403K54540J17409q6012k14284j85444q6038
15339b29336J15006p8630j85399J53892l5672j8913k35934N0800L95395J02285
15329C3494O7756n94823l52266J87337L41462J69795j72529J3891J46954j80040
15319c38969p6271J23855o7879P0928J72783L4780J3907K05488J35435J55k27473
15308D6739k43103q1618J08168J46144J51335j51212j47131o9660J96714K12447
$$ plain form
15298 168823 71024 -88575 -201342 -199366 -219947 -37927 -89415 -50001 102928 6469 73015
15287 73015 -6061 -127771 107775 137012 -22591 -205007 256 113777 126857 169227
15277 169227 58204 -71886 25462 -236068 -456582 -458141 -317453 -286280 -321880 -242999 -229609
15266 -229609 -326207 -384724 -328640 -493931 -443077 -186616 5182 64839 -86224 -68703 -57997
15255 -57997 -139565 -139518 21094 69152 130021 -45386 -73611 -18035 23105 48795 -13934 61133
15243 61133 68927 110679 103762 345370 442549 391410 380384 224059 -67720 -70110 -142116 10459
15231 10459 175160 -44808 -377657 -467205 -290703 -132376 -26055 -202815 -241716 -167028
15221 -167028 -394525 -581205 -347298 154631 76373 -49876 27885 -55263 -128953 -241673
$$ packed form
15298A68823r7799j59599j12767J976k0581J82020n1488L9414J52929r6459O6546
15287G3015p9076j21710K35546K9237j59603j82416K05263J13521J3080M2370
15277A69227j11023j30090R7348k61530k20514j559J40688L1173l5600P8881J3390
15266b29609r6598n8517N6084j65291N0854K56461J91798N9657j51063J7521J0706
15255e7997q1568M7J60612M8058O0869j75407k8225N5576M1140K5690o2729P5067
15243F1133P794M1752o917K41608R7179n1139j1026j56325k91779k390p2006J52575
15231A0459J64701k19968l32849q9548J76502J58327J06321j76760l8901P4688
15221a67028k27497j86680K33907N01929p8258j26249P7761q3148p3690j12720
$$ plain form
15211 -241673 -314879 -160153 -72140 44859 -44630 -63578 -13725 -140004 -174770 -170309 -148568
15200 -148568 -241499 -110032 -68575 -62510 90376 138078 -196101 -311413 -252909 -100467 -239254
15189 -239254 -237015 -7006 102362 40903 228372 246790 201329 121390 -58654 -244486 -78373
15178 -78373 -165226 -337389 -188419 -105947 -366905 -317950 -226432 -45542 -33225 87615 -146525
15167 -146525 -202615 -157588 -61346 -21767 -95124 82743 -88388 -290083 -384695 -275418 -165072
15156 -165072 -85326 -28593 204267 116783 -59008 -212 -71874 -72244 157336 -12435 21064
15145 21064 22717 94598 106042 -379 -51887 27564 81984 192771 329507 174268 27501
15134 27501 -117359 -24099 48994 -5859 202043 224792 104208 81986 92474 -84288 -27362
$$ packed form
15211b41673p3206J54726Q8013J16999q9489j8948M9853j26279l4766M461K1741
15200a48568r2931J31467M1457O065J52886M7702l34179j15312N8504J52442j38787
15189b39254K239K30009J09368o1459J87469J8418m5461p9939j80044j85832J66113
15178g8373q6853j72163J48970Q2472k60958M8955R1518J80890J2317J20840k34140
15167a46525n6090M5027R6242L9579p3357J77867j71131k01695r4612J09277J10346
15156a65072P9746N6733K32860q7484j75791N8796p1662l70K29580j69771L3499
15145B1064J653P1881J1444j06421n1508P9451N4420J10787J36736j55239j46767
15134B7501j44860R3260P3093n4853K07902K2749j20584k2222J0488j76762N6926
$$ plain form
15123 -27362 45088 -162597 -30955 -44051 -230271 -166618 -169695 -51494 -164635 -99238 -139578
15112 -139578 -191739 -275556 -398347 -348569 -435222 -310112 -152308 14443 43479 -12694 -92889
15101 -92889 -170394 -216746 -228287 -337979 -380510 -227905 -170142 -204460 -58714 -48263 -257040
15090 -257040 -225244 -109005 -230064 14538 77481 -294302 -255622 -72514 -217450 -193747
15080 -193747 144599 321053 399580 362639 227971 276757 14856 -181551 -215312 -179193
15070 -179193 -41732 77469 -75483 -174991 -158932 -362426 -381836 -258020 -88853 28762
15060 28762 -102598 -207806 -27303 135231 -64654 -107736 27368 -25339 -224966 -412797
15050 -412797 -315686 -138271 96097 140914 -13030 -120782 -96045 28728 -14939 -57011
$$ packed form
15123b7362P2450k07685J31642j3096j86220O3653l077J18201j13141O5397m0340
15112a39578n2161q3817j22791M9778q6653J25110J57804J66751K9036n6173q0195
15101i2889p7505m6352j1541j09692m2531J52605N7763l4318J45746J0451k08777
15090b57040L1796J16239j21059K44602O2943l71783L8680J83108j44936K3703
15080a93747L38346J76454P8527l6941j34668M8786k61901j96407l3761L6119
15070a79193J37461J19201j52952r9508J6059k03494j9410J23816J69167J17615
15060B8762j31360j05208J80503J62534j99885m3082J35104n2707j99627j87831
15050d12797R7111J77415K34368M4817j53944j07752K4737J24773m3667m2072
$$ plain form
15040 -57011 268051 315783 139001 -91948 55946 364073 619155 450712 -10742 -345645
15030 -345645 -398669 -342820 -144365 -304497 -296045 -163842 -169843 -157209 5953 -51603 -328905
15019 -328905 -416403 -434761 -490976 -462366 -366201 -261353 -278541 -285375 -21654 -8091 -55360
15008 -55360 24709 64470 -67855 88788 66747 -342358 -471084 49490 191595 45486
14998 45486 1699 -112482 -12168 115553 -99819 -138492 -308220 -147917 -71509 -113707
14988 -113707 -171766 -34278 -60338 -291683 -380601 -230958 -179532 -206480 -219674 -87618 -118074
14977 -118074 7902 148460 281517 431673 413406 423998 342451 33384 -15997 -31092
14967 -31092 -48278 185958 161515 -44832 106150 221797 58344 -201182 -49108 -29915
$$ packed form
15040e7011L25062M7732j76782k30949J47894L08127K55082j68443m61454l34903
15030c45645n3024N5849J98455j60132Q452J32203o001J2634J63162n7556k77302
15019c28905q7498j8358n6215K8610R6165J04848j7188o834K63721J3563m7269
15008e5360Q0069L9761j32325J56643k2041m09105j28726N20574J42105j46109
14998D5486m3787j14181J00314J27721k15372l8673j69728J60303P6408m2198
14988a13707n8059J37488k6060k31345q8918J49643N1426k6948j3194J32056l0456
14977a18074J25976J40558J33057J50156j8267J0592q1547l09067m9381j5095
14967c1092j7186K34236k4443k06347J50982J15647j63453k59526J52074J9193
$$ plain form
14957 -29915 -164196 -177275 -178525 -171061 -187619 -91901 79541 250124 214879 -64800 -135417
14946 -135417 -85301 48646 101004 156183 303261 130328 78780 -119359 -20883 215495
14936 215495 238320 202935 29194 115228 -26715 -17356 -38857 -227208 -133962 -53618 3411
14925 3411 -46478 3487 -514 203218 380056 96860 -73460 139863 258598 262114 254504
14914 254504 188405 -17634 -289602 -62871 3294 -117972 -101699 19663 172560 315171
14904 315171 390693 314486 165100 87931 42248 140771 -28212 -135439 -99537 30356 -93549
14893 -93549 -208302 -186305 -53910 98671 168215 138914 50500 -25587 -285799 -364579 -270063
14882 -270063 -389838 -367315 -3452 -20250 -131294 -195055 -135240 -124314 -155292 -81669 42093
$$ packed form
14957b9915j34281j3079j250P464j6558R5718J71442J70583l5245k79679p0617
14946a35417N0116J33947N2358N5179J47078j72933n1548j98139R8476K36378
14936B15495K2825l5385j73741Q6034j41943R359k1501j88351R3246Q0344N7029
14925C411m9889M9965m001K03732J76838k83196j70320K13323J18735L516p610
14914B54504o6099k06039k71968K26731O6165j21266J6273J21362J52897J42611
14904C15171P5522p6207j49386p7169m5683R8523j68983j07227L5902J29893j23905
14893i3549j14753K1997J32395J52581O9544k9301q8414p6087k60212p8780R4516
14882b70063j19775K2523L63863j6798j11044o3761N9815J0926l0978P3623J23762
$$ plain form
14871 42093 -177553 -336591 -196300 -4312 -8167 19452 -67762 -144549 -190534 -222783 -192489
14860 -192489 -305894 -314993 38074 47700 -113892 174750 159723 93317 52035 176262 324916
14849 324916 359740 142792 -83641 32552 158739 126924 145626 -7123 -228515 -81846
14839 -81846 -2878 -179280 -169628 5840 30947 79072 162459 138527 -28735 49930 -101257
14828 -101257 -259295 -279736 69877 101343 101232 -32315 -267862 -503062 -289184 -77000
14818 -77000 -68924 -155406 98693 295547 291384 99064 161525 246009 167545 109416 -8251
14807 -8251 -177785 -138881 -76382 69976 -72758 -397602 -696686 -811149 -554782 -315530
14797 -315530 66781 402194 588874 586665 487506 534441 293168 111435 -93139 20213
$$ packed form
14871D2093k19646j59038J40291J91988l855K7619q7214p6787m5985l2249L0294
14860a92489j13405r099L53067R626j61592K88642j5027o6406m1282J24227J48654
14849C24916L4824k16948k26433J16193J26187l1815J8702j52749k21392J46669
14839h1846P8968j76402R652J75468K5107M8125Q3387k3932j67262P8665j51187
14828a01257j58038k0441L49613L1466j11j33547k35547k35200K13878K12184
14818g7000Q076q6482K54099J96854m163j92320O2461Q4484p8464n8129j17667
14807h251j69534L8904O2499J46358j42734l24844k99084j14463K56367K39252
14797c15530L82311L35413J86680k209r9159M6935k41273j81733k04574J13352
$$ plain form
14787 20213 113887 153100 155181 172321 80822 -59226 182997 28911 -70025 325787 234433
14776 234433 -77444 -319079 -178757 87553 166542 56922 -87657 91635 126893 -103662
14766 -103662 -100638 -93709 -129069 -230354 -222183 -217847 -211748 -271403 -321477 -434305 -125031 35072
14754 35072 59844 146410 104642 193946 321319 222650 116134 69254 171605 109390 -190026
14743 -190026 -59561 81786 217989 47046 -168849 -305650 -221398 -193777 -212191 -200240
14733 -200240 -177249 -128374 169101 115084 35589 -14148 -82619 -157658 -198371 -310467 -470781
14722 -470781 -511549 -172518 -110672 -287439 -182420 -98567 -122210 -15542 131301 220276
14712 220276 268550 189595 241528 284567 273078 175984 218027 138183 15389 68889 -60659
$$ packed form
14787B0213R3674L9213K081J7140r1499j40048K42223j54086r8936L95812r1354
14776B34433l11877k41635J40322K66310P8989j09620j44579J79292L5258k30555
14766a03662L024O929l5360j01285Q171M336O099n9655n0074j12828L09274J60103
14754C5072K4772Q6566m1768Q9304J27373r8669j06516m6880J02351o2215k99416
14743a90026J30465J41347J36203j70943k15895j36801Q4252K7621j8414J1951
14733b00240K2991M8875K97475n4017p9495m9737o8471p5039m0713j12096j60314
14722d70781m0768L39031O1846j76767J05019Q3853k3643J06668J46843Q8975
14712B20276M8274p8955N1933M3039j1489r7094M2043p9844j22794N3500j29548
$$ plain form
14701 -60659 6924 154917 112543 185676 253576 201823 -7555 35150 178414 352399 -31456
14690 -31456 -255367 -324711 -343223 -388397 -137646 213783 69889 -102480 76689 -134794
14680 -134794 -308394 -209696 -32246 -13432 213650 147128 -18900 -94615 -15794 142619
14670 142619 230858 171886 -88525 -97444 -83409 -126340 -17874 -38255 39683 -43759 -35998
14659 -35998 98933 320660 222538 -18521 26767 88353 294989 296700 65702 114724 -12772
14648 -12772 -86563 -229880 -590094 -699172 -577772 -349484 -204920 -80141 41706 183227
14638 183227 166405 18640 -143841 -331349 -175118 93028 78264 -51281 -179180 -284162
14628 -284162 -210521 -221932 -33836 38165 3483 -45879 50835 -82520 -85495 -111934 -260301
$$ packed form
14701f0659O7583J47993m2374P3133O7900n1753k09378M2705J43264J73985l83855
14690c1456k23911o9344j8512m5174K50751L51429j43894j72369J79169k11483
14680a34794j73600R8698J77450J8814K27082o6522j66028p5715P8821J58413
14670A42619Q8239n8972k60411q919J4035m2931J08466k0381P7938q3442P761
14659c5998J34931K21727r8122k41059M5288O1586K06636J711k30998M9022j27496
14648a2772p3791j43317l60214j09078J21400K28288J44564J24779J21847J41521
14638A83227j6822j47765j62481j87508J56231K68146j4764j29545j27899j04982
14628b84162P3641j1411J88096P2001l4682m9362R6714j33355k975k6439j48367
$$ plain form
14617 -260301 -182895 -112922 -117371 -77653 59878 -253132 -420115 -390815 -154038 -317691 -304481
14606 -304481 -263272 -397370 -355379 -383456 -135183 -192008 -266468 -343346 -526246 -585688 -454805
14595 -454805 -335367 -458615 -458135 -590114 -532213 -461843 -356050 -376232 -213073 -279988 -536869
14584 -536869 -519189 -468390 -267963 -62076 42670 117650 210727 57587 54641 105781 -101208
14573 -101208 -195896 -138513 -140102 -116057 -96677 -23446 95010 -29073 -125498 -122847 -71096
14562 -71096 37468 7778 -80928 -35873 108525 102774 149976 164691 157389 256413 236896 158279
14550 158279 81294 -100106 -18015 -47957 142356 68034 50622 -1477 -206320 -285928 -92040
14539 -92040 -10669 48056 215142 158644 28336 -171943 -205594 -218147 -410752 -227581 93999
$$ packed form
14617b60301P7406O9973m449L9718J37531l13010j66983K9300K36777j63653J3210
14606c04481M1209j34098M1991k8077K48273n6825p4460p6878j82900n9442J30883
14595d54805J19438j23248M80j31979N7901P0370J05793k0182J63159o6915k56881
14584e36869J7680N0799K00427K05887J04746P4980R3077j53140k946N1140k06989
14573a01208r4688N7383j589K4045J9380P3231J18456j24083r6425K651N1751
14562g1096J08564k9690q8706M5055J44398n751M7202J4715p302R9024j9517p8617
14550A58279p6985j81400Q2091k9942J90313p4322j7412n2099k04843p9608J93888
14539i2040Q1371N8725J67086n6498j30308k00279l3651j2553j92605J83171L21580
$$ plain form
14528 93999 -5804 -167331 -180327 -232946 -326450 -374226 -335101 -379231 -217749 -217242 -451968
14517 -451968 -372817 -147946 -70905 29003 85737 -114904 -201782 -198014 -56914 155971 142107
14506 142107 45464 -42281 -85668 -179909 -4194 209572 284326 346972 492865 399499 213566
14495 213566 99229 48943 73181 339052 455682 165881 18939 48396 164125 184119
14485 184119 -60013 -129530 85978 49807 248451 315107 124822 300128 151344 250848
14475 250848 288417 246564 127971 53610 302146 269524 345381 369888 302779 307338 290027
14464 290027 128283 -67873 -297246 -45902 93333 -53034 -165694 30125 -16701 -328628
14454 -328628 -396622 -259735 -224669 -249957 -371293 -661422 -409114 99400 30771 -19700
$$ packed form
14528I3999r9803j61527j2996n2619r3504m7776L9125m4130J61482N07k34726
14517d51968P9151K24871P7041R9908N6734k00641q6878L768J41100K12885j3864
14506A42107r6643q7745m3387r4241J75715K13766P4754O2646J45893r3366j85933
14495B13566j14337n0286K4238K65871J16630k89801j46942K9457J15729J9994
14485A84119k44132o9517K15508l6171J98644O6656j90285J75306j48784R9504
14475B50848L7569m1853j18593p4361K48536l2622P5857K4507o7109M559j7311
14464B90027j61744j96156k29373K51344J39235j46367j12660J95819m6826l11927
14454c28628o7994J36887L5066k5288j21336k90129K52308N08514o8629n0471
$$ plain form
14444 -19700 103294 -47094 -99901 98740 114777 8705 -47867 -59785 140088 294956
14434 294956 61246 -93886 72879 213165 -143247 -268120 -165476 -75060 -78736 -240722
14424 -240722 -228748 -303214 -188196 -37614 42146 43542 118633 -89835 -301331 -126255 133617
14413 133617 180244 29397 -150491 13924 -92009 -109684 -159479 -407600 -548122 -490528
14403 -490528 -333272 -170994 -31284 -31019 -197274 -181021 -157427 -168741 -14018 131191 -62124
14392 -62124 16359 -7832 -191149 -137848 34254 277375 209511 -65651 -133903 158061 159852
14381 159852 230934 357162 206996 167463 188533 169321 108346 187405 401932 221395 151954
14370 151954 85485 -75388 62443 216126 65112 -194881 -218574 -142640 185628 45963
$$ packed form
14444a9700J22994j50388n2807J98641J6037j06072n6572j1918J99873J54868
14434B94956k33710j55132J66765J40286l56412j24873J02644R0416l676j61986
14424b40722J1974p4466J15018J50582P9760J396P5091k08468k11496J75076K59872
14413A33617M6627j50847j79888J64415j05933j7675m9795k48121j40522N7594
14403d90528J57256J62278J39710K65j66255J6253K3594j1314J54723J45209j93315
14392f2124P8483k4191j83317N3301J72102K43121o7864k75162o8252K91964J791
14381A59852P1082J26228j50166l9533K1070j9212o0975P9059K14527j80537o9441
14370A51954o6469j60873J37831J53683j51014k59993k3693P5934L28268j39665
$$ plain form
14360 45963 -69857 39644 -119982 25392 -70777 -260163 -342595 -442657 -441919 -243807 -122744
14349 -122744 -433498 -492757 -250294 -74017 -147256 -169004 -212309 -117354 -60364 -35866 113866
14338 113866 147336 47242 -159780 -164134 -159353 -152925 -96034 -248643 -19356 45262 181791
14327 181791 -3554 -60390 -239486 -327906 -71328 -155503 -230251 -223489 -131058 -338393 -260648
14316 -260648 -177544 -30498 -85439 -15821 -96435 -97265 -114270 9542 93034 107484 244949
14305 244949 387244 455077 394490 475655 228269 50178 -72669 -352451 -272044 38436
14295 38436 18284 -74619 17078 231713 432394 36277 -283895 -9284 263551 282889
14285 282889 154018 -65453 -186839 -19703 -104835 -178248 -145885 8846 81839 -36444
$$ packed form
14360D5963j15820J09501j59626J45374r6169j89386q2432j00062P38J98112J21063
14349a22744l10754n9259K42463J76277p3239k1748m3305R4955N6990K4498J49732
14338A13866L3470j00094k07022m354M781O428N6891j52609K29287O4618J36529
14327A81791j85345n6836j79096q8420K56578q4175p4748O762R2431k07335P7745
14316b60648Q3104J47046n4941O9618q0614q30j7005J23812Q3492J4450J37465
14305B44949J42295O7833o0587Q1165k47386j78091j22847k79782Q0407L10480
14295C8436k0152r2903R1697K14635K00681l96117l20172K74611K72835J9338
14285B82889j28871k19471j21386J67136q5132p3413L2363J54731P2993j18283
$$ plain form
14275 -36444 -158781 -276472 -132030 33171 138893 185809 217950 97743 -70270 61029
14265 61029 374467 510497 277293 253156 169518 98309 282452 308631 225457 -153234 -287729
14254 -287729 33804 246581 325728 394798 263453 122244 -108500 -240457 -363507 -312445
14244 -312445 -94492 68987 15968 36460 42812 -76346 -74880 -133830 -84287 35347 20384
14233 20384 141571 121612 -92443 -257607 -401113 -374436 -189799 -158425 -62861 -88595 1685
14222 1685 -40125 -193966 -196112 30816 161291 165009 27184 44042 242723 -4067 -301690
14211 -301690 -373412 -207132 -78996 -156210 -427476 -424035 -126086 -146380 99345 187248 136764
14200 136764 22433 -118695 -332595 -288952 -78642 -18550 106666 74810 -26460 13537
$$ packed form
14275c6444j22337j17691J44442J65201J05722M6916L2141j20207j68013J31299
14265F1029L13438J36030k33204k4137q3638p1209J84143K6179q3174l78691j34495
14254b87729L21533K12777P9147O9070j31345j41209k30744j31957j23050N1062
14244c12445K17953J63479n3019K0492O352j19158J466n8950M9543J19634j4963
14233B0384J21187j9959k14055j65164j43506K6677J84637L1374R5564k5734R0280
14222A685m1810j53841k146K26928J30475L718j37825J6858J98681k46790k97623
14211c01690p1722J66280J28136p7214k71266L441K97949k0294K45725Q7903n0484
14200A36764j14331j41128k13900M3643K10310O0092J25216l1856j01270L9997
$$ plain form
14190 13537 37916 71976 49465 -64481 -120129 -185765 -355473 -247475 -115906 -114210 -179915
14179 -179915 -200412 -203580 -151669 -87232 -132868 -113848 -106244 -272057 -418147 -355543 -387811
14168 -387811 -79183 148897 112643 75653 6714 -130728 38697 64376 -92417 10523
14158 10523 41182 -65546 8852 -165962 -210517 131709 382605 294469 121582 230406
14148 230406 232230 92370 81853 78699 32639 -110254 -307434 -118953 -21534 -174613 -199984
14137 -199984 -140644 -48111 -123109 -211849 -338694 -271472 -337711 -149143 55455 182698 115577
14126 115577 -19715 -64527 -150156 -219644 -98599 -81972 -146828 -87361 -106915 -114251 -256670
14115 -256670 -205159 115829 409928 620527 279243 32779 3673 14580 -36069 -253802
$$ packed form
14190A3537K4379L4060k2511j13946n5648o5636j69708J07998J31569J696o5705
14179a79915k0497l168N1911O4437m5636J9020P604j65813j46090O2604l2268
14168c87811L08628K28080l6254l6990o8939j37442J69425K5679j56793J02940
14158A0523L0659j06728P4398j74814m4555L42226K50896q8136j72887J08824
14148B30406J824j39860j0517l154m6060j42893j97180J88481R7419j53079k5371
14137a99984N9340R2533p4998q8740j26845O7222o6239J88568K04598J27243o7121
14126A15577j35292m4812q5629o9488J21045J6627o4856N9467j9554p336j42419
14115b56670N1511L20988K94099K10599l41284k46464k9106J0907n0649k17733
$$ plain form
14105 -253802 -268780 -250313 -74622 -44652 60681 272716 365941 299260 472369 513098 311576
14094 311576 -95436 -225772 -152062 -243000 -98031 -73190 -145617 -107344 49973 124419 185075
14083 185075 107553 53358 83965 85762 -12740 -114710 -222311 -183473 340180 529863 299879
14072 299879 106399 -66690 -21890 157132 189986 221598 141614 18959 -38659 186364
14062 186364 495387 591313 449253 365551 48234 -75877 -84052 -115626 -189075 -191289 -139863
14051 -139863 -70999 -180266 -51721 -87064 -164578 -329096 -407100 -253959 -266567 -535332
14041 -535332 -384004 -184887 -165901 -267145 -228204 -217159 -223604 -199458 4773 194640 395430
14030 395430 713586 776514 569191 311684 65445 26985 122175 251755 850 -73338
$$ packed form
14105b53802j4978J8467J75691K9970J05333K12035R3225o6681J73109M0729k01522
14094C11576m07012j30336P3710r0938J44969K4841p2427L8273J57317P4446O0656
14083A85075p7522n4195L0607J797r8502j01970j07601L8838N23653J89683k29984
14072B99879j93480j73089M4800J79022L2854L1612p9984j22655n7618K25023
14062A86364L09023R5926j42060q3702l17317j24111q175l1574p3449k214N1426
14051a39863O8864j09267J28545l5343p7514j64518p8004J53141j2608k68765
14041e35332J51328J99117J8986j01244L8941J1045o445K4146K04231J89867K00790
14030C95430L18156O2928k07323k57507k46239l8460R5190J29580k50905p4188
$$ plain form
14020 -73338 -143137 -52767 -47461 13516 -690 -92111 74569 -73342 -155394 -199040 -306873
14009 -306873 -99134 242090 347584 133362 -2906 -241911 -152317 -211657 -142860 -9508
13999 -9508 35529 18671 -35809 -90759 -118868 -11639 -89614 32113 50668 -16023 -78883
13988 -78883 -45965 42093 189251 181062 24273 49138 85891 -51187 -207777 -93078 70930
13977 70930 374394 321850 197401 297982 295643 64480 -23196 16457 280889 222038 43828
13966 43828 -253392 -575312 -505557 -331359 -362661 -250246 -235780 -61878 102095 14983
13956 14983 -115048 71525 98492 -27907 -153370 -118045 -70355 -34341 -34892 -44420 -57074
13945 -57074 203166 334764 280649 57247 -54585 -288330 -388690 -301182 -87074 -84011
$$ packed form
14020g3338o9799R0370N306O0977j4206r1421J66680j47911q2052m3646j07833
14009c06873K07739L41224J05494k14222j36268k39005Q9594n9340O8797J33352
13999i508M5037j6858n4480n4950k8109J07229p7975J21727J8555o6691o2860
13988g8883L2918Q8058J47158q189j56789K4865L6753j37078j56590J14699J64008
13977G0930L03464n2544j24449J00581k339k31163q7676L9653K64432n8851j78210
13966D3828k97220l21920O9755J74198l1302J12415J4466J73902J63973q7112
13956A4983j30031J86573K6967j26399j25463L5325M7690L6014n51r528j2654
13945e7074K60240J31598n4115k23402j11832k33745j00360Q7508K14108L063
$$ plain form
13935 -84011 71824 219034 255107 338853 496374 348240 290365 323875 172835 173273 137885
13924 137885 -51192 -170569 -290847 -385133 -427440 -219225 79942 495558 680963 591581
13914 591581 211933 65564 136254 147176 86924 -57342 -28121 -41823 78062 151334 -71468
13903 -71468 -238769 -321317 -323504 -107908 -69791 -269936 -331570 -140283 90984 110738 103166
13892 103166 85646 -43705 12949 84343 -109320 60356 306882 244567 55399 157000
13882 157000 263644 128227 182839 325713 212076 -7738 164415 258406 47282 -378871
13872 -378871 -310149 -73372 -73187 -130708 -223838 -73537 4618 290978 375028 405288 298177
13861 298177 93437 67005 130156 113281 -68651 -369437 -273835 -359315 -315620 -26015 29893
$$ packed form
13935h4011J55835J47210L6073Q3746J57521j48134n7875L3510j51040M38l5388
13924A37885j89077j19377j20278r4286m2307K08215K99167M15616J85405q9382
13914E91581l79648j46369P0690J0922o0252j44266K9221j3702J19885P3272k22802
13903g1468j67301q2548k187K15596L8117k00145o1634J91287K31267J9754p572
13892A03166j7520j29351N6654P1394j93663J69676K46526o2315j89168J01601
13882A57000J06644j35417N4612J42874j13637k19814J72153R3991k11124m26153
13872c78871O8722K36777J85n7521r3130J50301P8155K86360Q4050L0260j07111
13861B98177k04740k6432O3151j6875j81932l00786R5602q5480M3695K89605N5908
$$ plain form
13850 29893 -6951 -90301 -294997 -397609 -407777 -340356 -198775 -41553 13148 -229480 -486490
13839 -486490 -286794 42991 167140 192455 125906 58448 127883 66004 -354026 -435950 -191998
13828 -191998 64648 226219 422878 353692 416123 509538 437319 113934 -64021 -167551
13818 -167551 -120048 -215068 111852 209404 319967 -51115 -123536 -110006 -258946 -113270
13808 -113270 -109171 108924 160831 58843 -91496 -313711 -215191 43075 -36808 91478
13798 91478 163921 19278 -27725 203501 259055 20739 24838 88911 305484 440629 500407
13787 500407 434766 258473 20704 -17192 65420 -35131 -94827 128269 121527 36956 -166192
13776 -166192 -213083 -289554 -271439 -208487 2582 236279 194810 -7933 -192333 -282692 -105560
$$ packed form
13850B9893l6844q3350k04696j02612j0168O7421J41581J57222N4701k42628k57010
13839d86490J99696L29785J24149K5315o6549o7458O9435o1879m20030q1924K43952
13828a91998K56646J61571J96659o9186O2431R3415p2219l23385j77955j03530
13818a67551M7503r5020L26920R7552J10563l71082p2421J3530j48940J45676
13808a13270M099K18095N1907j01988j50339k22215R8520K58266p9883J28286
13798I1478P2443j44643m7003K31226N5554k38316M099O4073K16573J35145N9778
13787E00407o5641j76293k37769l7896Q2612j00551n9696K23096o742q4571k03148
13776a66192m6891p6471J8115O2952K11069K33697m1469k02743j84400r0359J77132
$$ plain form
13765 -105560 173449 27557 -315993 -275593 -267998 -112644 -77128 -79165 -201045 -119414 -2915
13754 -2915 -925 -34892 -250099 -285550 -230534 -70452 62188 1185 75568 -41190 -35999
13743 -35999 -355828 -506334 -507436 -507270 -345948 -272741 -203789 103047 364904 562086 357207
13732 357207 211488 93653 285780 183094 92776 128300 6027 -166536 -296256 -85203
13722 -85203 68379 36047 -88199 20892 17678 -139080 -314419 -241857 -239839 -245614 -63683
13711 -63683 -89518 -88110 -154674 -52362 -128869 71117 150778 -149272 -55638 27842 -173297
13700 -173297 -368491 -247386 119636 465211 598373 484676 100503 -44802 63819 404216
13690 404216 540835 307389 458226 459979 322963 225464 47356 172701 -35414 -87555
$$ packed form
13765a05560K79009j45892l43550M0400P595J55354L5516k037j21880Q1631J16499
13754b915J990l3967k15207l5451N5016J60082J32640o1003P4383j16758N191
13743c5999l19829j50506j102J66J61322P3207O8952L06836K61857J97182k04879
13732C57207j45719j17835J92127j02686r0318L5524j22273j72563j29720K11053
13722h5203J53582l2332j24246J09091l214j56758j75339P2562K018n775J81931
13711f3683k5835J408o6564J02312p6507J99986P9661l00050R3634Q3480k01139
13700a73297j95194J21105L67022L45575J33162j13697l84173j45305J08621L40397
13690D04216J36619k33446J50837J753j37016r7499j78108J25345k08115n2141
$$ plain form
13680 -87555 15257 222318 212643 59646 17028 -39496 -8473 -189876 -133167 6815 187277
13669 187277 328323 370865 303387 94472 -25995 93411 490839 356918 119967 302724
13659 302724 297161 78779 218812 499953 497541 318835 285810 325862 260292 52560 -86222
13648 -86222 -260921 -208601 -376750 -348684 -352009 -24468 285435 61327 -27578 101056 -70817
13637 -70817 -154964 -53265 263126 392513 353751 93183 -160418 -143259 112061 235994
13627 235994 212359 345780 380010 83670 -126217 -195345 39406 41463 112282 402185 415281
13616 415281 322898 302162 226424 103038 -84443 -53914 -32361 -22621 -112064 135690 217978
13605 217978 107191 109147 46443 72346 75776 168639 157881 176397 112966 147754 87977 36439
$$ packed form
13680h7555J02812K07061r675j52997m2618n6524L1023j81403N6709J39982J80462
13669A87277J41046M2542o7478k08915j20467J19406L97428j33921k36951J82757
13659C02724n563k18382J40033K81141k412j78706l3025M0052o5570k07732j38782
13648h6222j74699N2320j68149K8066l325L27541L09903k24108q8905J28634j71873
13637g0817q4147J01699L16391J29387l8762k60568k53601J7159K55320J23933
13627B35994k3635J33421L4230k96340k09887o9128K34751K057P0819K89903J3096
13616D15281r2383k0736p5738j23386j87481L0529K1553R740q9443K47754Q2288
13605B17978j10787J956o2704K5903L430R2863j0758J8516o3431L4788n9777n1538
$$ plain form
13593 36439 109521 340589 337040 402546 222913 163880 203206 276401 -41865 222655 170792
13582 170792 299417 176452 -65729 51613 184072 117020 45100 110596 41729 -16744
13572 -16744 -32227 151647 290083 503020 413260 377056 353312 37165 100424 69193 -16056
13561 -16056 -46715 -95318 -60892 24040 -140209 -116568 -29483 -208199 -427505 -387266 -40727
13550 -40727 -73783 9928 -43596 -286717 -501935 -377502 -337799 -238777 -239051 -255969 -10365
13539 -10365 152590 17940 -23027 -22856 130606 237301 211951 179172 163504 283139 453703
13528 453703 396910 337026 403351 400563 431866 360796 358131 236216 73493 54540 129643
13517 129643 64666 -320497 -390127 -412214 -469876 -48997 216172 272163 153036 41554
$$ packed form
13593C6439P3082K31068l549O5506j79633n9033L9326P3195l18266K64520n1863
13582A70792J28625j22965k42181J17342J32459o7052p1920O5496o8867n8473
13572a6744j5483J83874J38436K12937q9760l6204k3744l16147O3259l1231q5249
13561a6056l0659m8603L4426Q4932j64249K3641Q7085j78716k19306M0239L46539
13550d0727l3056Q3711n3524k43121k15218J24433L9703R9022k74j6918K45604
13539a0365J62955j34650m0967J71J53462J06695k5350l2779j5668J19635J70564
13528D53703n6793n9884O6325k788L1303p1070k665j21915j62723j8953P5103
13517A29643o4977l85163o9630k2087n7662M20879K65169N5991j19127j11482
$$ plain form
13507 41554 14279 4285 -178874 -96014 -144243 -143310 -51267 55645 13160 -94708 -1921 10043
13495 10043 -126551 -360742 -324253 -69984 -59883 -33112 278060 158837 -17685 -181790
13485 -181790 -66295 -80211 -181890 -385528 -357073 -237192 -77635 53082 94580 -95264
13475 -95264 -174284 -247121 -152408 -157481 -146687 -217128 1252 314733 201319 20471 -65227
13464 -65227 6866 -50431 30063 202556 164723 247738 465978 454949 196084 -66555 -122726
13453 -122726 -112237 22265 156885 78119 95601 -168532 -196759 97813 60874 238312
13443 238312 546202 393717 153879 38512 -255788 -127720 18859 62304 -46009 96217
13433 96217 291273 473622 409503 241254 -37344 120509 245289 250861 262722 141565
$$ packed form
13507D1554k7275r994j83159Q2860m8229R33R2043J06912m2485j07868R2787J1964
13495A0043j36594k34191L6489K54269J0101K6771L11172j19223j76522j64105
13485a81790J15495j3916j01679k03638K8455J19881J59557J30717M1498j89844
13475i5264p9020p2837R4713n073J0794p0441K18380L13481j13414j80848q5698
13464f5227P2093n7297Q0494J72493l7833Q3015K18240j1029k58865k62639n6171
13453a22726J0489J34502J34620p8766J7482k64133k8227K94572l6939J77438
13443B38312L07890j52485k39838j15367k94300J28068J46579M3445j08313J42226
13433I6217J95056J82349o4119j68249k78598J57853J24780N572J1861j21157
$$ plain form
13423 141565 -119312 -140834 173712 155038 -48388 -159151 -479620 -549079 -318710 -192363
13413 -192363 -170336 -230567 -327875 -130675 129110 325071 366908 556619 533253 494524 106199
13402 106199 -147439 -142147 -113261 98363 -133851 -62496 -50717 -49692 -94465 -77513 -84106
13391 -84106 -38621 166166 73750 4395 27027 -125982 -88779 71566 59381 80257 185124
13380 185124 145747 19388 -246526 -312618 -163569 -112835 -216175 -394224 -452947 -175535
13370 -175535 -45951 -40614 -35219 -262476 -192122 -2353 -97303 87631 226672 5042 -133658
13359 -133658 -151597 -166902 -151392 -35442 -6335 -192032 -506938 -416362 -525273 -492779 -274701
13348 -274701 -72862 -144093 -187131 -677 178117 52083 61141 118586 -97421 109153
$$ packed form
13423A41565k60877k1522L14546j8674k03426j10763l20469o9459K30369J26347
13413a92363K2027o0231r7308J97200K59785J95961M1837J89711k3366l8729l88325
13402A06199k53638N292K8886K11624k32214P1355J1779J025m4773J6952o593
13391h4106M5485K04787r2416o9355K2632j53009L7203J60345j2185K0876J04867
13380A85124l9377j26359k65914o6092J49049N0734j03340j78049n8723K77412
13370a75535J29584N337N395k27257P0354J89769r4950J84934J39041k21630j38700
13359a33658j7939j5305J5510J15950K9107j85697l14906R0576j08911L2494K18078
13348b74701K01839p1231m3038J86454J78794j26034R058N7445k16007K06574
$$ plain form
13338 109153 345538 305304 313028 124896 -204934 -233606 -114116 -129967 6042 120210
13328 120210 247156 311933 23296 267132 249061 -108900 -112865 38706 122399 94839 86353
13317 86353 37576 -178018 -128690 -91551 28065 85706 24607 -42470 -117687 -4384 -56726
13306 -56726 184203 131627 -121630 -243780 46446 296949 148877 -24485 35319 113824
13296 113824 179494 223374 427024 318083 98828 -150965 -337286 -534828 -748211 -434530
13286 -434530 -137118 -98545 -64600 -36888 -217625 -172262 121868 141838 23029 20627 13412
13275 13412 -37871 158105 312369 157845 -92200 93631 401700 537774 584253 430169
13265 430169 434526 542851 613948 605045 211373 -35425 62829 -18059 12013 57877 15282
$$ packed form
13338A09153K36385m0234P724j88132l29830k8672J19490j5851J36009J14168
13328A20210J26946O4777k88637K43836j8071l57961l965J51571Q3693k7560q486
13317H6353m8777k15594M9328L7139J19616N7641o1099o7077p5217J13303n2342
13306e6726K40929n2576k53257j22150K90226K50503j48072j73362N9804P8505
13296A13824O5670M3880K03650j08941k19255k49793j86321j97542k13383L13681
13286d34530K97412L8573L3945K7712j80737M5363K94130J9970j18809k402p215
13275A3412n1283J95976J54264j54524k50045J85831L08069J36074M6479j54084
13265D30169M357J08325P1097q903l93672k46798R8254q0888L0072M5864m2595
$$ plain form
13254 15282 69253 -106706 -212894 -114641 -288983 -236055 -186847 -122789 -394958 -216717 -91177
13243 -91177 210105 379547 388456 262361 339349 69808 -28664 -45045 113244 134206 35388
13232 35388 -171997 -132547 -58765 -92435 -143918 30462 118737 36825 -258329 -308553 -140300
13221 -140300 97780 224149 209813 99098 -50034 -178364 -88482 44078 51634 89855
13211 89855 183370 214295 109760 68580 -6636 126573 -40072 -41104 195289 311910 410614
13200 410614 218819 86340 -91025 -130696 20566 31407 -115295 -395331 -162473 247867
13190 247867 214980 170930 97497 135303 187293 147163 149416 18100 -5016 -199149 -81545
13179 -81545 -6326 -25156 19264 44173 354664 269719 8323 127196 32199 -211819 -89356
$$ packed form
13254A5282N3971j75959j06188R8253j74342N2928M9208O4058k72169J78241J25540
13243i1177L01282J69442Q909j26095P6988k69541r8472j6381J58289K0962r8818
13232C5388k07385L9450P3782l3670n1483J74380Q8275q1912k95154n0224J68253
13221a40300K38080J26369j4336j10715j49132j28330Q9882J32560P556L8221
13211H9855R3515L0925j04535m1180p5216J33209j66645j032K36393J16621R8704
13200D10614j91795j32479j77365l9671J51262J0841j46702k80036K32858M10340
13190B47867l2887m4050p3433L7806N1990m0130K253j31316k3116j94133J17604
13179h1545P5219j8830M4420K4909L10491q4945k61396J18873r4997k44018J22463
$$ plain form
13168 -89356 176322 335272 304814 420226 409996 252936 186613 198747 368128 328371 248995
13157 248995 412119 481124 148412 107307 105402 37566 -12275 -233379 -11109 254299 193967
13146 193967 256713 410055 422065 78944 -48525 2388 56824 158601 -5192 -5762 175337
13135 175337 369677 313282 9548 -11208 -109700 -88260 -291495 -187726 -98543 107579
13125 107579 168500 4273 -91720 -55671 145953 52030 -72812 -67642 139239 177956 13488
13114 13488 45535 146633 252692 198410 228273 238017 453388 557199 465520 577175 411345
13103 411345 174319 -106057 -195011 -228332 -136810 -35460 43021 -272570 -255527 -149337
13093 -149337 141968 268572 345903 309022 339153 216556 226471 238988 149379 199247 284157
$$ packed form
13168h9356K65678J58950l0458J15412j0230j57060o6323J2134J69381l9757p9376
13157B48995J63124O9005l32712m1105j905o7836m9841k21104K22270K65408o0332
13146A93967O2746J53342J2010l43121j27469N0913N4436J01777j63793n70J81099
13135A75337J94340n6395l03734k0756r8492K1440k03235J03769Q9183K06122
13125A07579O0921j64227r5993L6049K01624r3923j24842N170K06881L8717j64468
13114A3488L2047J01098J06059n4282K9863R744K15371J03811r1679J11655j65830
13103D11345k37026k80376q8954l3321R1522J01350P8481l15591J7043J06190
13093a49337K91305J26604P7331l6881L0131j22597R915J2517q9609M9868Q4910
$$ plain form
13082 284157 325309 340050 246043 338232 340660 405579 157964 -47349 118095 212660 -54263
13071 -54263 -123575 -170851 -241222 -96723 81901 131175 -22163 112030 308083 414771
13061 414771 287049 533811 633746 317841 242590 245626 73568 238938 461085 694925
13051 694925 622716 615937 387534 245451 112061 -4423 -106895 179514 187441 94283 41036
13040 41036 48705 72301 97367 263455 356675 538786 488799 351663 171551 19909 -31424
13029 -31424 28821 -226807 -155921 -119735 91960 73961 -141909 -156667 54183 303950 384454
13018 384454 328421 172796 311394 405443 513316 631391 514931 361450 118341 153243
13008 153243 432442 441752 156037 116308 146345 4696 -107225 -51329 -169867 85899
$$ packed form
13082B84157M1152J4741r4007R2189K428O4919k47615k05313J65444R4565k66923
13071e4263o9312m7276p0371J44499J78624M9274j53338J34193J96053J06688
13061D14771j27722K46762R9935l15905p5251L036j72058J65370K22147K33840
13051F94925p2209o779k28403j42083j33390j16484j02472K86409P927r3158n3247
13040D1036P669K3596K5066J66088R3220J82111m9987j37136j80112j51642n1333
13029c1424O0245k55628P0886L6186K11695j7999k15870j4758K10850K49767Q0504
13018C84454n6033j55625J38598R4049J07873J18075j16460j53481k43109L4902
13008A53243K79199R310k85715l9729L0037j41649j11921N5896j18538K55766
$$ plain form
12998 85899 184746 213446 335424 173009 77658 -130647 -330625 66792 310541 416987
12988 416987 322350 120266 -73430 -38722 -56081 -6341 160682 269015 223076 47904
12978 47904 -62155 -23825 75637 4371 -224741 -104298 91258 246014 129805 23622
12968 23622 26962 229038 221237 163864 -99179 -341830 -52089 -75791 -85953 121665 211738
12957 211738 191853 47630 -37428 5258 46784 -90724 -156306 67470 182042 293985
12947 293985 123632 26329 291795 467931 543422 448398 398776 298877 -64335 -53408 39756
12936 39756 -10202 -7805 -111420 -141497 -42563 -164782 -187819 -277673 -331562 -408756 -119032
12925 -119032 233010 392721 353946 277449 -72973 -126309 72773 290406 235342 131354
$$ packed form
12998H5899R8847K8700J21978j62415r5351k08305j99978L97417K43749J06446
12988D16987r4637k02084j93696L4708j7359M9740J67023J08333m5939j75172
12978D7904j10059L8330R9462p1266k29112J20443J95556J54756j16209j06183
12968B3622L340K02076p801n7373k63043k42651K89741k3702j0162K07618R0073
12957B11738j9885j44223q5058M2686M1526j37508o5582K23776J14572J11943
12947B93985j70353r7303K65466J76136P5491r5024m9622r9899l63212J0927R3164
12936C9756m9958K397j03615l0077R8934j22219k3037q9854n3889p7194K89724
12925a19032L52042J59711l8775p6497l50422n3336J99082K17633n5064j03988
$$ plain form
12915 131354 44810 6781 8061 11854 296004 317726 361756 148098 -169769 -373560 -425171
12904 -425171 -69901 177762 236994 240762 70081 101798 226324 239256 61459 -91820
12894 -91820 -258255 -289126 -252813 -28120 134037 213260 430652 218603 160464 70207 198048
12883 198048 135705 161291 179498 135687 113344 209730 317452 231000 122023 60502 10015
12872 10015 205786 231636 133535 -90438 91810 175330 261916 532161 482153 178810 96161
12861 96161 167721 343296 395537 382917 233292 -7491 244656 289814 50376 9528 -53846
12850 -53846 -3829 40260 56327 126796 138713 95881 38260 57937 60289 128129 162687 234590
12838 234590 443436 538181 549779 303226 137923 183197 157083 86399 -25564 57124 200743
$$ packed form
12915A31354q6544l8029J280L793K84150K1722M4030k13658l17867k03791n1611
12904d25171L55270K47663N9232L768j70681L1717J24526J2932j77797j53279
12894i1820j66435l0871L6313K24693J62157P9223K17392k12049n8139r0257J27841
12883A98048o2343K5586J8207m3811k2343R6386J07722q6452j08977o1521n0487
12872A0015J95771K5850r8101k23973J82248Q3520Q6586K70245n0008l03343q2649
12861I6161P1560J75575N2241j2620j49625k40783K52147M5158k39438m0848o3374
12850e3846N0017M4089J6067P0469J1917m2832n7621J9677K352O7840L4558P1903
12838B34590K08846R4745J1598k46553j65303M5274k6114p0684j11963Q2688J43619
$$ plain form
12827 200743 352303 264770 318788 568836 591720 552977 452379 119349 -96166 -46665
12817 -46665 -363433 -357692 -92800 116373 111155 -6096 33645 149710 424233 198501 46231
12806 46231 155612 189615 73852 -215308 -211847 -229166 -272566 -79646 -77592 -154647 6753
12795 6753 -66166 -112269 -63021 -126221 -39534 131836 -154503 -158943 -52144 151737 162354
12784 162354 108944 6719 -115841 -63896 127846 240750 231535 420015 626448 510815
12774 510815 152005 55778 11927 -245238 -125386 -109236 -152293 -37546 60986 87368 162458
12763 162458 208469 162078 194694 335396 435478 467797 545289 407895 178808 -149707
12753 -149707 -286437 -231546 -199906 -200263 -7158 228094 33355 26524 87016 96463 -53417
$$ packed form
12827B00743J51560q7533N4018K50048K2884l8743j00598l33030k15515M9501
12817d6665l16768N741K64892K09173n218j17251L9741J16065K74523k25732j52270
12806D6231J09381L4003j15763k89160L461j7319m3400J92920K054p7055J61400
12795F753p2919m6103M9248o3200Q6687J71370k86339m440J06799K03881J0617
12784A62354n3410j02225j22560N1945J91742J12904r215J88480K06433j15633
12774E10815l58810r6227m3851k57165J19852J6150m3057J14747R8532K6382P5090
12763A62458M6011m6391L2616J40702J00082L2319P7492j37394k29087l28515
12753a49707j36730N4891L1640l57J93105K35252j94739o831O0492R447j49880
$$ plain form
12742 -53417 41741 102764 44777 151399 262576 374710 532201 584932 675910 513166 352477
12731 352477 375792 264955 -7583 15307 124828 280292 244123 107165 90077 80607 -152070
12720 -152070 35481 186549 157139 159565 166461 -65398 -135484 -32942 -123201 -68947 -44782
12709 -44782 4473 201668 447945 384443 443929 450898 428058 277110 -36229 160448 289991
12698 289991 44891 -12536 -146204 -117882 -138718 47955 175024 80722 165353 49003
12688 49003 -10334 -37450 -68065 -143778 -106564 44303 -130545 -135527 90372 120937 231238
12677 231238 211012 212561 79019 91072 323666 250518 410053 469733 340501 379864 434367
12666 434367 360260 404298 369824 426297 568060 628894 304110 -121114 -263662 -7375
$$ packed form
12742e3417R5158O1023n7987J06622J11177J12134J57491N2731R0978j62744j60689
12731C52477K3315j10837k72538K2890J09521J55464l6169j36958j7088r470k32677
12720a52070J87551J51068k9410K426O896k31859p0086J02542r0259N4254K4165
12709d4782M9255J97195K46277o3502N9486O969k2840j50948l13339J96677J29543
12698B89991k45100n7427j33668K8322k0836J86673J27069r4302Q4631j16350
12688D9003n9337k7116l0615p5713L7214J50867j74848m982K25899L0565J10301
12677B31238k0226J549j33542J2053K32594p3148J59535N9680j29232L9363N4503
12666D34367p4107M4038l4474N6473J41763O0834l24784m25224j42548K56287
$$ plain form
12656 -7375 269905 348248 571506 673547 659667 572878 419569 245666 -50635 -214870
12646 -214870 18873 184891 116908 210685 232388 148297 191872 107945 46969 216734 547372
12635 547372 512576 249789 311206 412995 521599 651874 434937 183153 99316 100892
12625 100892 329178 185575 -48108 121235 296053 340107 160118 208430 350615 503712
12615 503712 554063 414314 198705 339911 481402 236479 141676 85994 175608 246846
12605 246846 98445 -130044 -184565 -33503 252428 279970 247857 206413 228303 455211
12595 455211 521785 274546 129962 238313 140375 -94966 -143271 -178434 -21690 82565
12585 82565 -20772 90114 101106 230960 65823 131248 277329 145236 52459 -30042
$$ packed form
12656g375K77280P8343K23258J02041j3880q6789j53309j73903k96301j64235
12646b14870K33743J66018o7983R3777K1703q4091M3575q3927o0976J69765L30638
12635E47372l4796k62787O1417J01789J08604J30275k16937k51784q3837J576
12625A00892K28286j43603k33683J69343J74818M4054j79989M8312J42185J53097
12615E03712N0351j39749k15609J41206J41491k44923r4803n5682Q9614P1238
12605B46846j48401k28489n4521J51062K85931K7542l2113m1444K1890K26908
12595D55211O6574k47239j44584J08351r7938k35341m8305l5163J56744J04255
12585H2565j03337J10886J0992J29854j65137O5425J46081j32093r2777q2501
$$ plain form
12575 -30042 -130865 -157965 803 35324 45587 79565 44633 -5733 307527 685871 864002
12564 864002 683349 377984 212233 299952 291160 26862 127163 61020 186455 250686
12554 250686 64891 -76400 150572 292209 145777 60531 103911 -53553 -24877 -120581
12544 -120581 -195743 858 -54230 174733 303192 230087 243348 228221 433725 274683
12534 274683 204076 428934 406828 250645 -78123 -159461 -145660 2337 284887 263790
12524 263790 209073 106103 102407 237360 310048 287175 231040 -84073 -60109 -74068 -198064
12513 -198064 -166747 12754 291094 334841 387962 409903 445737 451017 356917 309005 394029
12502 394029 387641 425103 258439 128742 67167 -127784 -153531 150976 420124 490053 273874
$$ packed form
12575c0042j00823k7100J58768L4521J0263L3978l4932n0366L13260L78344J78131
12564H64002j80653l05365j65751Q7719q792k64298J00301o6143J25435O4231
12554B50686j85795j41291K26972J41637j46432q5246M3380j57464K8676r5704
12544a20581p5162J96601n5088K28963J28459p3105J3261j5127K05504j59042
12534B74683p0607K24858k2106j56183l28768q1338J3801J47997K82550k1097
12524B63790n4717j02970l696J34953P2688k2873n6135l15113K3964j3959j23996
12513a98064L1317J79501K78340M3747N3121K1941L5834N280r4100m7912Q5024
12502C94029o388L7462j66664j29697o1575j94951k5747L04507K69148O9929k16179
$$ plain form
12491 273874 285602 223224 274164 388662 494864 502020 372801 148492 -38138 -156651
12481 -156651 -86696 -11356 122438 105955 216223 336545 342317 117940 9193 -89160 65523
12470 65523 66279 84229 157475 144951 69476 180835 319310 238337 -98205 -121786 -22752
12459 -22752 -21282 5356 81181 233219 195854 205680 228266 228976 276204 301982 139385 165917
12447 165917 246069 402265 311805 193368 169236 212007 120354 148279 380557 392261 296867
12436 296867 148349 62221 187605 410320 571714 615097 247119 191474 174613 409429
12426 409429 597989 695398 672600 550584 378342 462488 374892 206724 103810 -101083
12416 -101083 45040 154439 261099 315566 355314 641443 675520 579163 670286 494966
$$ packed form
12491B73874J1728o2378N0940J14498J06202P156j29219k24309j86630j18513
12481a56651O9955P5340J33794j6483J10268J20322N772k24377j08747r8353J54683
12470F5523P56J7950P3246j2524p5475J11359J38475q0973l36542k3581R9034
12459b2752J470K6638P5825J52038l7365R826K2586P10M7228K5778j62597K6532
12447A65917Q0152J56196r0460j18437k4132M2771r1653K7925K32278J1704r5394
12436B96867j48518q6128J25384K22715J61394M3383l67978n5645j6861K34816
12426D09429J88560R7409k2798j22016j72242Q4146q7596j68168j02914k04893
12416a01083J46123J09399J06660N4467L9748K86129L4077r6357R1123j75320
$$ plain form
12406 494966 446932 328914 328744 414544 389344 487190 527405 612080 532263 442787 266523
12395 266523 392247 540761 570298 408654 242904 460379 494469 284337 279344 377615
12385 377615 266936 338067 544757 614271 511536 175068 -77395 -52744 161315 307889
12375 307889 492571 423913 234189 248301 204265 207752 410459 544189 766517 787711 710032
12364 710032 545634 549412 376007 203254 329222 440705 510247 705567 693085 536308
12354 536308 536842 563834 672881 742882 583778 607925 647475 486902 283739 211569 143943
12343 143943 196731 261357 448373 380765 376266 364212 335293 236391 270645 277165 228714 229230
12331 229230 338148 288799 412865 416001 500626 359946 260597 159202 110321 355027 441666
$$ packed form
12406D94966m8034j18018j70Q5800k5200R7846M0215Q4675p9817q9476j76264
12395B66523J25724J48514K9537j61644j65750K17475L4090k10132m993R8271
12385C77615j10679P1131K06690O9514j02735l36468k52463K4651K14059J46574
12375C07889J84682o8658j89724J4112m4036L487K02707J33730K22328K1194p7679
12364G10032j64398L778j73405j72753J25968J11483O9542J95320j2482j56777
12354E36308N34K6992J09047P0001j59104K4147L9550j60573k03163p2170o7626
12343A43943N2788O4626J87016o7608m499j2054k8919r8902L4254O520m8451N16
12331B29230J08918m9349J24066L136Q4625j40680r9349j01395m8881K44706Q6639
$$ plain form
12320 441666 451028 361971 354481 560261 680293 638561 595185 417014 362639 432194 531040
12309 531040 451295 279210 327059 469113 521658 507987 557899 509833 563113 712027 611115
12298 611115 507222 856800 831499 699985 721953 625933 609646 750959 825076 583236
12288 583236 520185 708969 648955 587539 625479 668644 539190 735923 1118641 1317544
12278 1317544 1285599 1379196 1501315 1431547 1639225 1943620 1983562 1667588 1344103 1111771
12268 1111771 1255173 1215491 948721 826936 639190 695765 698901 679951 751185 916409
12258 916409 752185 552631 416078 368378 216008 345125 500209 470498 665198 701896
12248 701896 820035 724167 436083 637742 998413 948051 745636 562107 482739 625378
$$ packed form
12320D41666R362q9057p490K05780J20032m1732m3376j78171n4375O9555R8846
12309E31040p9745j72085M7849J42054N2545j3671M9912m8066N3280J48914j00912
12298F11115j03893L49578k5301j31514K1968r6020j6287J41313P4117k41840
12288E83236o3051J88784o0014o1416L7940M3165j29454J96733L82718J98903
12278A317544l1945R3597J22119o9768K07678L04395L9942l15974l23485k32332
12268A111771J43402l9682k66770j21785j87746N6575L136j8950P1234J65224
12258I16409j64224j99554j36553m7700j52370J29117J55084k9711J94700L6698
12248G01896J18139r5868k88084K01659L60671n0362k02415j83529p9368J42639
$$ plain form
12238 625378 751313 713289 782904 945439 1097324 993493 681626 464879 481077 562576
12228 562576 656480 694470 624371 736494 936808 841737 789427 980271 974834 892606 973330
12217 973330 1020192 1050729 922223 1086569 1017629 749433 566255 601995 788843 1022124
12207 1022124 1075822 1241811 1208818 1182217 1163109 1369752 1364295 1098667 1090184 1143304 1471335
12196 1471335 1324611 1081984 1087350 1204969 1080894 984737 788376 933455 888429 964468
12186 964468 941970 1021281 882018 925910 1099056 1406987 1633364 1461289 1377379 1489086
12176 1489086 1648240 1491494 1387908 1415727 1619412 1442110 1337420 1390275 1494806 1344289
12166 1344289 1431336 1479701 1518284 1452884 1568107 1615828 1501975 1406603 1427134 1498004 1574848
$$ packed form
12238F25378J25935l8024O9615J62535J51885j03831l11867k16747J6198Q1499
12228E62576R3904L7990p0099J12123K00314r5071n2310J90844n437q2228Q0724
12217I73330M6862L0537j28506J64346o8940k68196j83178L5740J86848K33281
12207A022124N3698J65989l2993k6601j9108K06643n457k65628q483N3120L28031
12196A471335j46724k42627N366J17619j24075r6157j96361J45079m5026P6039
12186I64468k2498P9311j39263M3892J73146L07931K26377j72075q3910J11707
12176A489086J59154j56746j03586K7819K03685j77302j04690N2855J04531j50517
12166A344289Q7047M8365L8583o5400J15223M7721j13853r5372K0531P0870P6844
$$ plain form
12155 1574848 1476493 1236158 1071488 1278613 1090953 832180 1139478 1324840 1335521 1486555
12145 1486555 1683846 1798087 1644382 2051221 1941405 1707986 1747182 1857813 1794848 1616929
12135 1616929 1508402 1458163 1512780 1698613 1993401 1932441 1744363 1520224 1568254 1648663
12125 1648663 1752222 1847980 1969142 1982508 2185024 2314184 2410062 2703355 2627166 2434869
12115 2434869 2391057 2383591 2311735 2125823 2205115 2493619 2693933 2558939 2667878 2555884
12105 2555884 2601605 2582545 2607288 2433588 2405130 2509386 2677009 2582398 2399001 2394510 2426139
12094 2426139 2721719 2919256 2995902 2708590 2439209 2648734 2861477 2825683 2879794 2811999
12084 2811999 2872195 2848732 2898333 3076049 3097620 3285802 3422475 3518987 3468038 3451625 3543959
$$ packed form
12155A574848r8355k40335j64670K07125j87660k58773L07298J85362J0681J51034
12145A486555J97291J14241j53705M06839j09816k33419L9196J10631o2965j77919
12135A616929j08527n0239N4617J85833K94788o0960j88078k24139M8030Q0409
12125A648663J03559R5758J21162J3366K02516J29160R5878K93293p6189j92297
12115B434869m3812p466p1856j85912P9292K88504K00314j34994J08939j11994
12105B555884M5721j9060K4743j73700k8458J04256J67623r4611j83397m491L1629
12094B426139K95580J97537P6646k87312k69381K09525K12743l5794N4111o7795
12084B811999O0196k3463M9601J77716K1571J88182J36673R6512n0949j6413R2334
$$ plain form
12073 3543959 3472091 3566910 3543718 3683430 3633170 3326952 3365248 3463530 3463411 3713568 4135182
12062 4135182 4280595 4327680 4137333 4203087 4352495 4329252 4313165 4242988 4368072 4376805 4429948
12051 4429948 4473996 4646515 4683078 4561712 4352240 4321928 4474739 4664844 5008546 5191432
12041 5191432 5357145 5398854 5187704 5164431 5416764 5789244 5752254 5616706 5686554 5987637
12031 5987637 6253885 6293784 6319369 6317721 6267104 6592902 6898981 6847070 7098585 7485283
12021 7485283 7630121 7924442 8098664 8052091 8141244 8324276 8264994 8434272 8537218 8598747
12011 8598747 8872781 9037027 9140915 9373464 9738400 9957872 10130157 10304202 10738197
12002 10738197 11371285 11792921 11764371 11954538 12273552 12468626 12818852 13083994 13402423
$$ packed form
12073C543959p1868R4819k3192J39712n0260l06218L8296R8282j19K50157M21614
12062D135182J45413M7085j90347O5754J49408k3243j6087p0177J25084Q733N3143
12051D429948M4048J72519L6563j21366k09472l0312J52811J90105L43702J82886
12041E191432J65713M1709k11150k3273K52333L72480l6990j35548O9848L01083
12031E987637K66248L9899K5585j648n0617L25798L06079n1911K51515L86698
12021G485283J44838K94321J74222m6573Q9153J83032n9282J69278J02946O1529
12011H598747K74034J64246J03888K32549L64936K19472J72285J74045M33995
12002A0738197O33088M21636k8550J90167L19014J95074L50226K65142L18429
$$ plain form
11993 13402423 13629864 13775862 14296358 14699942 15245222 15849830 16265035 16828063 17442909
11984 17442909 17837980 18284333 19001765 19563373 20177507 20816201 21660692 22436348 23372519
11975 23372519 24288877 25385443 26408722 27516249 28412802 29129086 30113168 31038177 32312247
11966 32312247 33754195 35540673 37257213 38705234 40553406 42214411 44226100 46394215
11958 46394215 48805879 51373667 54090094 56583680 59165256 61961514 64930582 68061029
11950 68061029 71610366 75448111 79650474 83900677 87951949 92171847 96680495 101375498
11942 101375498 105899278 110463554 115139601 119572628 123958778 128448473 132877279 136589573
11934 136589573 140005249 142846272 144906084 146649780 147789499 147851955 147345036 146396388
$$ packed form
11993A3402423K27441J45998N20496M03584N45280O04608M15205N63028O14846
11984A7442909L95071M46353P17432N61608O14134O38694Q44491P75656R36171
11975B3372519R16358J096566J023279J107527Q96553P16284R84082R25009J274070
11966C2312247J441948J786478J716540J448021J848172J661005K011689K168115
11958D6394215K411664K567788K716427K493586K581576K796258K969068L130447
11950F8061029L549337L837745M202363M250203M051272M219898M508648M695003
11942A01375498M523780M564276M676047M433027M386150M489695M428806L712294
11934A36589573L415676K841023K059812J743696J139719O2456n06919r48648
$$ plain form
11926 146396388 145120825 143229718 140361535 137033866 133751134 130039471 126008345 121989343
11918 121989343 118040530 113842253 109655383 105507959 101409321 97510469 93936314 90264888
11910 90264888 86557690 83125944 80085812 77089627 74149112 71325429 68366705 65827543
11902 65827543 63545839 61615967 59400172 56982409 54910237 52958494 51076505 49095665
11894 49095665 47364222 45848348 44416697 43115227 41696317 40303843 38999444 37949374
11886 37949374 36861598 35639115 34504247 33270019 32213801 31211592 30505669 29513701
11878 29513701 28751835 28035234 27354229 26751259 26157494 25371896 24300289 23541964 22959269
11869 22959269 22481756 21853062 21215708 20778204 20404421 19923689 19530912 19013291 18475201
$$ packed form
11926A46396388j275563j891107k868183l327669l282732l711663m031126m019002
11918A21989343l948813m198277m186870m147424m098638l898852l574155l671426
11910I0264888l707198l431746l040132k996185k940515k823683k958724k539162
11902F5827543k281704j929872k215795k417763k072172j951743j881989j980840
11894D9095665j731443j515874j431651j301470j418910j392474j304399j050070
11886C7949374j087776j222483j134868j234228j056218j002209p05923r91968
11878B9513701p61866p16601o81005o02970n93765p85598j071607p58325n82695
11869B2959269m77513o28694o37354m37504l73783m80732l92777n17621n38090
$$ plain form
11860 18475201 17845029 17100360 16614061 16495104 16408066 16230671 15863470 15386686 15144713
11851 15144713 14789182 14274499 13971038 13493333 13025368 12685042 12479302 12300683 12015838
11842 12015838 11785131 11497380 11138976 10725568 10393831 10153139 9921663 9764192 9706382
11833 9706382 9472691 9277290 9112433 8874503 9002819 9000008 8601803 8381878 8219360 7965343
11823 7965343 7678741 7452294 7328515 7489408 7436692 7257450 7327989 7340168 7071467 6776970
11813 6776970 6803011 6789012 6610495 6505136 6224776 6079388 5910686 5695991 5614221 5502617
11803 5502617 5362362 5450643 5398909 5199853 5132133 4961362 4861881 4714511 4622390 4774733
11793 4774733 4790172 4696969 4629512 4433918 4152030 4255129 4300041 4220615 4298743 3889021
$$ packed form
11860A8475201o30172p44669m86299j18957q7038j77395l67201m76784k41973
11851A5144713l55531n14683l03461m77705m67965l40326k05740j78619k84845
11842A2015838k30707k87751l58404m13408l31737k40692k31476j57471n7810
11833I706382k33691j95401j64857k37930J28316k811l98205k19925j62518k54017
11823G965343k86602k26447j23779J60893n2716j79242P0539J2179k68701k94497
11813F776970K6041j3999j78517j05359k80360j45388j68702k14695q1770j11604
11803E502617j40255Q8281n1734j99056o7720j70771r9481j47370r2121J52343
11793D774733J5439r3203o7457j95594k81888J03099M4912p9426P8128m09722
$$ plain form
11783 3889021 3867780 3877054 3732745 3820967 3615515 3479564 3395575 3301333 3071232 3069158 3106931
11772 3106931 3240904 3274917 3026447 3210001 3390846 3531141 3369967 3083479 2715022 2813524
11762 2813524 2798986 2565248 2492076 2431380 2432632 2770151 2588040 2382233 2218493 2110315
11752 2110315 2177813 2414403 2536435 2524512 2516308 2527367 2260470 1888973 1699963 1708361 1719080
11741 1719080 1738688 1795799 1847037 1777789 1633021 1915556 1896659 1683595 1545271 1627011
11731 1627011 1496851 1491922 1736560 1791764 1973301 1780015 1447484 1392014 1528451 1734250
11721 1734250 1815036 1704348 1824580 1997261 2108799 2191154 2074194 1809836 1730936 1850894
11711 1850894 1942732 1731561 1637931 1595541 1533128 1719790 1825740 1761090 1678117 1536877
$$ packed form
11783C889021k1241R274j44309Q8222k05452j35951q3989r4242k30101k074L7773
11772C106931J33973L4013k48470J83554J80845J40295j61174k86488l68457R8502
11762B813524j4538k33738p3172o0696J252L37519j82111k05807j63740j08178
11752B110315O7498K36590J22032j1923q204J1059k66897l71497j89010Q398J0719
11741A719080J9608N7111N1238o9248j44768K82535j8897k13064j38324Q1740
11731A627011j30160m929K44638N5204J81537j93286l32531n5470J36437K05799
11721A734250Q0786j10688J20232J72681J11538Q2355j16960k64358p8900J19958
11711A850894R1838k11171r3630m2390o2413J86662J05950o4650q2973j41240
$$ plain form
11701 1536877 1311457 1216670 1397047 1550843 1619079 1352219 1354494 1347946 1421600 1391677 1177750
11690 1177750 1034208 1114005 1209404 1041803 1276905 1444102 1331945 1607459 1561098 1361431
11680 1361431 1443352 1475942 1483410 1438748 1365425 1215260 1184972 1311369 962691 845365 791625
11669 791625 835925 1041155 1079776 855164 853644 994548 1320512 1638708 1681762 1688213 1958483
11658 1958483 1902163 1864411 1863623 2182173 2373402 2222227 2460765 3100324 4011150 4849286
11648 4849286 5475802 5940099 6182303 6426565 6706020 6601324 5892225 5147873 4576876
11639 4576876 4020539 3430438 3177168 2927014 2612601 2265397 2036885 1975820 2050130 1868651
11629 1868651 1585907 1413209 1291323 1421811 1375036 1525628 1446636 1294531 1200494 1256870
$$ packed form
11701A536877k25420r4787J80377J53796O8236k66860K275o548P3654k9923k13927
11690A177750j43542P9797R5399j67601K35102J67197j12157K75514m6361j99667
11680A361431Q1921L2590P468m4662p3323j50165l0288J26397l48678j17326n3740
11669G91625M4300K05230L8621k24612j520J40904L25964L18196M3054O451K70270
11658A958483n6320l7752p88L18550J91229j51175K38538O39559R10826Q38136
11648D849286O26516M64297K42204K44262K79455j04696p09099p44352n70997
11639D576876n56337n90101k53270k50154l14413l47204k28512o1065P4310j81479
11629A868651k82744j72698j21886J30488m6775J50592p8992j52105r4037N6376
$$ plain form
11619 1256870 1231581 999118 997732 1175448 1118245 998158 1131513 1105851 947942 840425
11609 840425 777494 916742 830583 745381 571027 304329 329776 498390 572361 732276
11599 732276 597718 444006 422763 434732 499013 577905 586856 651867 943899 997652 952811
11588 952811 1080288 901257 544720 250270 252221 312977 461678 634511 546892 535731
11578 535731 679952 663553 591216 785782 976531 785796 744826 742786 848656 831049 889157
11567 889157 710219 415409 516607 719533 768953 365459 224815 343836 542136 364602
11557 364602 230006 295345 450302 456526 361158 533201 686476 362914 364353 564921 625058
11546 625058 629793 418956 554677 371986 386470 752146 820416 861437 1076230 1069272 893201
$$ packed form
11619A256870k5289k32463j386J77716n7203j20087J33355k5662j57909j07517
11609H40425o2931J39248q6159q5202j74354k66698K5447J68614P3971J59915
11599G32276j34558j53712k1243J1969O4281P8892Q951O5011K92032N3753m4841
11588I52811J27477j79031l56537k94450J951O0756J48701J72833q7619j1161
11578E35731J44221j6399p2337J94566J90749j90735m0970k040J05870j7607N8108
11567H89157j78938k94810J01198K02926M9420m03494j40644J19021J98300j77534
11557C64602j34596O5339J54957O224r5368J72043J53275l23562J439K00568O0137
11546F25058M735k10837J35721j82691J4484L65676O8270M1021K14793o958j76071
$$ plain form
11535 893201 756480 556864 410141 486821 536126 305490 -10579 45354 292066 531556
11525 531556 484940 307570 335880 445726 294257 194393 278193 352313 524151 491944 722572
11514 722572 702317 610719 520940 415990 314578 268340 289305 410409 291257 108323
11504 108323 21608 -84339 114446 584173 747707 449932 99964 150502 295259 196936
11494 196936 147051 333562 186125 156242 90733 12149 106382 237226 291576 306285 192869
11483 192869 324193 295060 220370 424092 479134 533230 334553 -53490 -159260 10396
11473 10396 261019 586005 452361 568037 485332 395376 395247 311223 327503 711984 713602
11462 713602 593647 295145 206257 307542 478023 318238 268791 255724 273079 274454 341009
$$ packed form
11535H93201j36721j99616j46723P6680M9305k30636l16069N5933K46712K39490
11525E31556m6616j77370K8310J09846j51469r9864Q3800P4120J71838l2207K30628
11514G22572k0255r1598q9779j04950j01412m6238K0965J21104j19152j82934
11504A08323q6715j05947J98785M69727J63534k97775l49968N0538J44757r8323
11494A96936m9885J86511j47437k9883o5509p8584R4233J30844N4350J4709j13416
11483A92869J31324k9133p4690K03722N5042N4096j98677l88043j05770J69656
11473A0396K50623L24986j33644J15676q2705q9956j29q4024J6280L84481J618
11462G13602j19955k98502q8888J01285J70481j59785m9447j3067J7355J375O6555
$$ plain form
11451 341009 411579 340880 209720 233249 312050 411180 482905 664501 599836 473857 296404
11440 296404 415846 334596 302047 327860 214281 232052 233657 336440 228539 64897 -88021
11429 -88021 19580 197860 64165 83018 235144 244446 301970 362634 485531 418497 443439
11418 443439 512823 304632 170342 104144 46853 79031 150886 46813 -30345 4136 -112337
11407 -112337 -183156 -141552 -119459 -73142 -50226 217338 162019 80747 318021 702381 754890
11396 754890 722514 466302 147394 85128 120140 394162 350118 151814 81156 274635
11386 274635 351881 316953 435383 512692 432549 456865 433572 647178 565319 536951 394822
11375 394822 347381 299013 226785 184994 356347 330122 229279 267338 350548 382148 335357
$$ packed form
11451C41009P0570p0699j31160K3529P8801R9130P1725J81596o4665j25979j77453
11440B96404J19442q1250l2549K5813j13579J7771J605J02783j07901j63642j52918
11429h8021J07601J78280j33695J8853J52126R302N7524O0664J22897o7034K4942
11418D43439O9384k08191j34290o6198n7291L2178P1855j04073p7158L4481j16473
11407a12337p0819M1604K2093M6317K2916K67564n5319q1272K37274L84360N2509
11396G54890l2376k56212l18908o2266L5012K74022m4044j98304p0658J93479
11386B74635P7246l4928J18430P7309q0143K4316k3293K13606q1859k8368j42129
11375C94822m7441m8368p2228m1791J71353k6225j00843L8059Q3210L1600m6791
$$ plain form
11364 335357 337120 200314 307204 303860 366906 493414 538278 496188 464808 323239 330372
11353 330372 286939 293015 363341 315391 213816 327022 408627 391910 293780 296431 -3105
11342 -3105 -220109 -9575 221323 397537 429218 331201 406372 616714 522849 280641 551401
11331 551401 761793 456518 324957 386091 352489 483404 423848 118923 -204396 -437988
11321 -437988 -432920 -316116 -108328 106906 258391 442779 226182 96640 377189 414990
11311 414990 136459 53458 -130775 -86760 202585 27297 -120845 59275 256420 285565
11301 285565 405082 513503 598231 699508 808464 423069 201116 334468 472491 428908
11291 428908 569709 515259 310996 235019 197297 193114 126496 150677 268291 399123 534293
$$ packed form
11364C35357J763j36806J06890l344O3046J26508M4864m2090l1380j41569P133
11353C30372m3433O076P0326m7950j01575J13206Q1605j6717r8130K651k99536
11342c105k17004K10534K30898J76214L1681r8017P5171K10342r3865k42208K70760
11331E51401K10392l05275j31561O1134l3602J30915n9556l04925l23319k33592
11321d37988N068J16804K07788K15234J51485J84388k16597j29542K80549L7801
11311D14990k78531q3001j84233M4015K89345j75288j48142J80120J97145K9145
11301B85565J19517J08421Q4728J01277J08956l85395k21953J33352J38023m3583
11291D28908J40801n4450k04263p5977l7722m183o6618K4181J17614J30832J35170
$$ plain form
11280 534293 436913 274655 287797 326293 298022 312571 388871 522848 453154 325287 378650
11269 378650 354192 437890 333512 92331 340241 478794 323783 217532 103713 62846
11259 62846 93929 345065 351799 376865 166663 44075 55388 45232 -49483 63016 156244
11248 156244 140381 131922 190793 143191 291518 212573 149910 -29597 -201794 -33335 177790
11237 177790 322571 423459 625272 456702 256793 95258 217582 131654 68141 26461
11227 26461 15294 55119 200883 120611 -87037 -142538 -82396 -207343 -436563 -472504 -349712
11216 -349712 -476252 -124075 14146 171545 241859 258045 192580 137755 106186 222418
11206 222418 370364 340808 350764 345093 120639 -28867 78047 414819 444073 337271 255674
$$ packed form
11280E34293r7380j62258J3142L8496k8271J4549P6300J33977o9694j27867N3363
11269C78650k4458Q3698j04378k41181K47910J38553j55011j06251j13819m0867
11259F2846L1083K51136O734K5066k10202j22588J1313j0156r4715J12499R3228
11248A56244j5863q459N8871m7602J48327p8945o2663j79507j72197J68459K11125
11237A77790J44781J00888K01813j68570j99909j61535J22324q5928o3513m1680
11227B6461j1167L9825J45764q0272k07648n5501O0142j24947k29220l5941J22792
11216c49712j26540L52177J38221J57399P0314J6186o5465n4825l1569J16232
11206B22418J47946k9556R956n671k24454j49506J06914L36772K9254j06802q1597
$$ plain form
11195 255674 341334 264668 209513 246789 272343 260526 461247 411044 497421 427074 436866
11184 436866 177687 326598 349298 436964 356647 292120 244854 388883 250137 325665 411886
11173 411886 398331 510436 447320 541934 423528 233154 192652 505603 421956 389811 476952
11162 476952 221752 35537 199930 254673 -7796 52410 152634 -160886 -318073 -148806
11152 -148806 78165 107178 146337 71081 190879 171566 28620 77711 213488 426312
11142 426312 565050 613711 475996 492507 341319 117852 77013 -30712 21854 248417
11132 248417 453717 471218 402885 215474 191358 53234 52881 231013 315044 294450 367786
11121 367786 298903 349042 313934 212975 140226 196006 147358 -152395 117288 55394 139508
$$ packed form
11195B55674Q5660p6666n5155L7276K5554j1817K00721n0203Q6377p0347R792
11184D36866k59179J48911K2700Q7666q0317o4527m7266J44029j38746P5528Q6221
11173D11886j3555J12105o3116R4614j18406j90374m0502L12951q3647l2145Q7141
11162D76952k55200j86215J64393N4743k62469O0206J00224l13520j57187J69267
11152a48806K26971K9013L9159p5256J19798j9313j42946M9091J35777K12824
11142D26312J38738M8661j37715J6511j51188k23467m0839j07725N2566K26563
11132B48417K05300J7501o8333j87411k4116j38124l53J78132Q4031k0594P3336
11121C67786o8883N0139l5108j00959p2749N5780m8648k99753K69683o1894Q4114
$$ plain form
11110 139508 94474 16558 -93134 -68984 92444 377565 490644 384950 216932 156970
11100 156970 196069 221991 251997 214084 143046 -65483 -184239 -45739 181589 366265
11090 366265 476153 527255 544225 421581 163083 268497 271611 28977 54993 129014 189719
11079 189719 265805 582382 708140 596274 760246 619535 434739 98451 -59656 79383
11069 79383 182442 143500 466166 586379 421527 231814 190207 166942 457609 542893
11059 542893 506919 436985 455813 294911 265814 504050 710558 685632 590175 389736 522432
11048 522432 864970 931493 1016333 973043 1232560 1433626 1164644 1149840 1368556 1616624
11038 1616624 1748508 1869623 1882629 1766185 1629436 1664396 1712059 1814964 1748198 1869163
$$ packed form
11110A39508m5034p7916j09692K4150J61428K85121J13079j05694j68018n9962
11100A56970L9099K5922L0006l7913p1038k08529j18756J38500K27328J84676
11090C66265J09888N1102J6970j22644k58498J05414L114k42634K6016P4021O0705
11079A89719P6086L16577J25758j11866J63972j40711j84796l36288j58107J39039
11069G9383J03059l8942L22666J20213j64852j89713m1607k3265K90667Q5284
11059E42893l5974o9934J8828j60902k9097K38236K06508k4926r5457k00439J32696
11048E22432L42538O6523Q4840m3290K59517K01066k68982j4804K18716K48068
11038A616624J31884J21115J3006j16444j36749L4960M7663J02905o6766J20965
$$ plain form
11028 1869163 2015076 2334512 2454922 2564007 2683038 2898868 3001385 2675808 2399571
11019 2399571 2370296 2181205 1904796 1787467 1908102 2088820 2219718 2011703 1794212 1583888
11009 1583888 1647326 1753632 1750739 1586133 1475077 1326250 1302769 1186023 1158855 1238101
10999 1238101 1400596 1509944 1521931 1338172 1042730 771656 763111 884874 773999 713211
10989 713211 810986 662585 566039 395854 578633 559521 527501 837510 862485 811952 709189
10978 709189 740693 617802 564611 517671 451630 298065 448599 754689 1044212 907508
10968 907508 689118 407421 271989 165789 101224 247718 312550 419996 594372 725748
10958 725748 666327 530402 607027 698713 598661 448683 486056 550817 342882 197038
$$ packed form
11028A869163J45913L19436J20410J09085J19031K15830J02517l25577k76237
11019B399571k9275j89091k76409j17329J20635J80718J30898k08015k17491k10324
11009A583888O3438J06306k893j64606j11056j48827k3481j16746k7168P9246
10999A238101J62495J09348J1987j83759k95442k71074q545J21763j10875o0788
10989G13211R7775j48401r6546j70185J82779j9112l2020L10009K4975n0533j02763
10978G09189L1504j22891n3191m6940o6041j53565J50534L06090K89523j36704
10968I07508k18390k81697j35432j06200o4565J46494O4832J07446J74376J31376
10958G25748n9421j35925P6625R1686j00052j49978L7373O4761k07935j45844
$$ plain form
10948 197038 232783 349269 203207 217136 330404 376936 203406 281089 311984 200913
10938 200913 101152 -84301 -35738 27317 3453 84843 83380 136368 155811 142070 324105
10927 324105 512610 456292 209459 113273 189683 94428 408205 372481 269018 323797 337878
10916 337878 253008 272735 385552 276883 238802 305611 225358 263366 302733 304565 317131
10905 317131 259840 314997 308350 324423 373703 283100 400107 418505 332607 164795 -40363
10894 -40363 -19858 303731 357506 95389 93763 107226 24648 191188 426799 521878 594894
10883 594894 338520 -30690 92090 264674 70678 91118 317358 302521 196334 205172
10873 205172 419274 585191 682520 986910 825577 721604 624715 420483 163173 6538
$$ packed form
10948A97038L5745J16486j46062J3929J13268M6532j73530P7683L0895j11071
10938B00913r9761j85453M8563O3055k3864Q1390j463N2988J9443j3741J82035
10927C24105J88505n6318k46833r6186P6410r5255L13777l5724j03463N4779J4081
10916C37878q4870J9727J12817j08669l8081O6809q0253L8008L9367J832J2566
10905C17131n7291N5157o647J6073M9280r0603J17007J8398q5898j67812k05158
10894d0363K0505L23589N3775k62117j626J3463q2578J66540K35611R5079P3016
10883E94894k56374l69210J22780J72584j93996K0440K26240j4837j06187Q838
10873B05172K14102J65917R7329L04390j61333j03973r6889k04232k57310j56635
$$ plain form
10863 6538 -33437 184425 245880 278688 643378 586218 587545 730018 798275 655888 705335
10852 705335 642196 521764 667305 947612 838461 823651 912104 883696 1098011 956590
10842 956590 755802 472060 529276 767356 782755 562820 492887 328969 287876 280637 242290
10831 242290 267617 55937 54091 -36601 251036 518590 570583 505932 338323 613723 808566
10820 808566 721169 639083 563148 442187 325968 209508 -34943 332971 777702 694682
10810 694682 483816 526950 558271 513051 802842 880618 729187 782748 799929 828649 763108
10799 763108 693646 608438 875480 1011426 1091495 1126265 970946 1164609 1121110 796013
10789 796013 923204 970622 881267 794518 946827 1001933 1030293 973770 957365 1151593 1232315
$$ packed form
10863F538l9975K17862O1455L2808L64690n7160J327J42473O8257j42387M9447
10852G05335o3139j20432J45541K80307j09151j4810Q8453k8408K14315j41421
10842I56590k00788k83742N7216K38080J5399k19935o9933j63918m1093p239l8347
10831B42290K5327k11680j846r0692K87637K67554N1993o4651j67609K75400J94843
10820H08566q7397q2086p5935j20961j16219j16460k44451L67914M44731q3020
10810F94682k10866M3134L1321m5220K89791P7776j51431N3561J7181K8720o5541
10799G63108o9462q5208K67042J35946Q0069L4770j55319J93663m3499l25097
10789G96013J27191M7418q9355q6749J52309N5106K8360n6523j6405J94228Q0722
$$ plain form
10778 1232315 1286679 1308905 1391709 1589213 1490400 1462110 1318012 1326921 1649456 1728853 1519545
10767 1519545 1086698 1065538 1206568 1190833 1207688 1400902 1471753 1525966 1858725 2080129
10757 2080129 2036782 1809036 1378014 1252879 1502873 1504877 1464821 1431100 1310986 1232923
10747 1232923 1224567 1365201 1485099 1520205 1157549 1118422 1198987 1081074 1040166 1075838 1130658
10736 1130658 1116272 1080733 1336814 1508108 1485830 1549996 1526882 1247565 1015905 1109130
10726 1109130 1308897 1467506 1400033 1479531 1314733 1179077 1584140 1743126 1717562 1579310
10716 1579310 1398011 1236844 1272325 1407566 1436686 1413457 1328247 1205280 1524954 1641133
10706 1641133 1851913 1925217 1970514 1917247 2096837 2287092 2292909 2194207 2185295 2166706 2216246
$$ packed form
10778A232315N4364K2226Q2804J97504r8813k8290j44098Q909L22535P9397k09308
10767A519545m32847k1160J41030j5735J6855J93214P0851N4213L32759K21404
10757B080129m3347k27746m31022j25135K49994K004m0056l3721j20114p8063
10747A232923q356J40634J19898L5106l62656l9127Q0565j17913m0908L5672N4820
10736A130658j4386l5539K56081J71294k2278O4166k3114k79317k31660R3225
10726A109130J99767J58609o7473P9498j64798j35656M05063J58986k5564j38252
10716A579310j81299j61167L5481J35241K9120k3229q5210j22967L19674J16179
10706A641133K10780P3304M5297n3267J79590J90255N817r8702q912j8589M9540
$$ plain form
10695 2216246 2255126 1984706 1740373 1699342 1897727 1934797 2067567 2372480 2373949 2412372
10685 2412372 2338841 2117559 2196844 2317435 2177935 2085677 2396574 2503246 2402235 2181041
10675 2181041 2267875 2523067 2775823 2872902 2763875 2848140 2828464 2852703 2941310 2942590 3042048
10664 3042048 3171920 3579345 3826160 3885877 4029608 4001583 4122071 4422838 4888054 5313215
10654 5313215 5729302 6064813 6598096 6985008 6907663 6956729 7236840 7403218 7490483 7413286
10644 7413286 7667765 7895388 8238590 8894303 9429898 9963249 11040425 12285254 13575389
10635 13575389 14732906 15814541 16985884 18582122 20437810 22072718 23681870 25789073
10627 25789073 28622638 32385927 37425326 43917187 52240856 62301037 74486823 88665000
$$ packed form
10695B216246L8880k70420k44333m1031J98385L7070J32770L04913J469L8423
10685B412372p3531k21282P9285J20591j39500r2258L10897J06672j01011k21194
10675B181041Q6834K55192K52756R7079j09027Q4265j9676K4239Q8607J280R9458
10664C042048J29872M07425K46815N9717J43731k8025J20488L00767M65216M25161
10654E313215M16087L35511N33283L86912p7345M9066K80111J66378Q7265p7197
10644G413286K54479K27623L43202O55713N35595N33351J077176J244829J290135
10635A3575389J157517J081635J171343J596238J855688J634908J609152K107203
10627B5789073K833565L763289N039399O491861Q323669J0060181J2185786J4178177
$$ plain form
10619 88665000 103434971 116743229 128378858 138649420 147260122 153949522 158659766
10612 158659766 162595533 168923571 180339394 197729992 219747228 242992353 263717618
10605 263717618 280745418 294858898 304367164 307163584 303416362 296629690 293821093 300275051
10597 300275051 316861049 340341397 364961831 385384798 400373096 409623569 410572176
10590 410572176 399524281 377253845 349628120 325781195 312100247 308377101 311679803
10583 311679803 317099044 320447259 320958856 318518243 310456285 294534989 271542605 246077874
10575 246077874 223639035 207593863 197783551 192026918 188115077 183962779 178759130 172109119
10567 172109119 163246688 150991005 136050213 120068551 105443876 93161769 83397445
$$ packed form
10619H8665000J4769971J3308258J1635629J0270562Q610702O689400M710244
10612A58659766L935767O328038J1415823J7390598K2017236K3245125K0725265
10605B63717618J7027800J4113480R508266K796420l747222o786672k808597O453958
10597C00275051J6585998K3480348K4620434K0422967J4988298R250473R48607
10590D10572176j1047895k2270436k7625725k3846925j3680948l723146L302702
10583C11679803N419241L348215N11597k440613q061958j5921296k2992384k5464731
10575B46077874k2438839j6045172r810312n756633l911841m152298n203649o650011
10567A72109119q862431j2255683j4940792j5981662j4624675j2282107r764324
$$ plain form
10560 83397445 75494242 69115176 64180618 60020120 56429420 53273758 50502467 48443582
10552 48443582 46675978 44688776 42647213 41028877 39538771 38196988 36607571 35116243
10544 35116243 33754968 32450776 31296986 30479951 29422785 28319066 27159398 26173190
10536 26173190 25343830 24503992 23773392 23107184 22381983 21674408 20810874 20019269 19391130
10527 19391130 18948706 18247979 17622203 17160867 16602238 16232814 15800088 15406126 15128184
10518 15128184 14823758 14405645 14021966 13310341 12884905 12651700 12355676 12014923 11711585
10509 11711585 11436114 10977342 10875234 10716153 10424053 10127310 9758526 9497353 9263402
10500 9263402 8636860 8285392 7909955 7606396 7155705 7071829 7027889 7013137 7053052 6817603
$$ packed form
10560H3397445p903203o379066m934558m160498l590700l155662k771291k058885
10552D8443582j767604j987202k041563j618336j490106j341783j589417j491328
10544C5116243j361275j304192j153790q17035j057166j103719j159668r86208
10536B6173190q29360q39838p30600o66208p25201p07575q63534p91605o28139
10527A9391130m42424p00727o25776m61336n58629l69424m32726l93962k77942
10518A5128184l04426m18113l83679p11625m25436k33205k96024l40753l03338
10509A1711585k75471m58772j02108j59081k92100k96743l68784k61173k33951
10500I263402o26542l51468l75437l03559m50691q3876m3940j4752L9915k35449
$$ plain form
10490 6817603 6488104 6215294 6093051 5917157 5569498 5419130 5185954 5308056 5283390 5253351
10480 5253351 5080121 4796905 4728156 4846209 4826737 4727325 4563327 4302333 4083593 4125597
10470 4125597 4155264 4072931 3738962 3696690 3757193 3674546 3688452 3625899 3393050 3273889 3039897
10459 3039897 2940362 2828041 2746172 2667093 2590131 2671104 2697010 2630755 2645973 2591230 2499045
10448 2499045 2669805 2488351 2147850 2063514 1961059 1773148 1747585 2009288 1805070 1530383
10438 1530383 1479041 1220610 1259571 1345356 1151477 1228505 1309774 1313569 1203915 1070256 832941
10427 832941 742122 763571 759514 846896 711473 671513 697038 656669 401557 387761 271687
10416 271687 -17162 50525 4628 41729 140068 120010 65598 46839 259724 45870 -143017
$$ packed form
10490F817603l29499k72810j22243j75894l47659j50368k33176J22102k4666l0039
10480E253351j73230k83216o8749J18053j9472r9412j63998k60994k18740M2004
10470D125597K9667q2333l33969m2272O0503q2647J3906o2553k32849j19161k33992
10459C039897r9535j12321q1869p9079p6962Q0973K5906o6255J5218n4743r2185
10448B499045J70760j81454l40501q4336j02455j87911k5563K61703k04218k74687
10438A530383n1342k58431L8961Q5785j93879P7028Q1269L795j09654j33659k37315
10427H32941r0819K1449m057Q7382j35423l9960K5525m0369k55112j3796j16074
10416B71687k88849O7687m5897L7101R8339k0058n4412j8759K12885k13854j88887
$$ plain form
10405 -143017 -49016 -140726 -60843 77581 53812 -10211 -48802 -5164 -238445 -312618 -313418
10394 -313418 -457050 -310799 -406222 -473264 -258720 -34990 2246 -30141 46729 86590 218241
10383 218241 461805 438030 227146 65503 -52774 -137630 127811 169290 253775 307192
10373 307192 236151 129909 134619 114474 2855 123409 274072 277842 305623 173726 16446
10362 16446 62444 184970 42035 198304 411207 393149 221880 357241 411841 344084
10352 344084 297026 219376 197992 235797 396835 604282 597184 522884 464777 416001 179624
10341 179624 183327 297767 450456 314828 364053 384428 135761 -19246 -2948 101016
10331 101016 126867 81644 173921 285678 365642 382738 372083 398500 440454 437304 221930
$$ packed form
10405a43017R4001r1710P9883J38424k3769o4023l8591M3638k33281p4173q00
10394c13418j43632J46251r5423o7042K14544K23730L7236l2387P6870L9861J31651
10383B18241K43564k3775k10884j61643j18277q4856K65441M1479Q4485N3417
10373C07192p1041j06242M710k0145j11619J20554J50663L770K7781j31897j57280
10362A6446M5998J22526j42935J56269K12903j8058j71269J35361N4600o7757
10352C44084m7058p7650k1384L7805J61038K07447p098p4300n8107m8776k36377
10341A79624L703J14440J52689j35628M9225K0375k48667j55007J6298J03964
10331A01016K5851m5223R2277J11757P9964J7096j0655K6417M1954l150k15374
$$ plain form
10320 221930 36483 258487 328822 406277 435776 224401 4857 -267802 -143114 -29358
10310 -29358 -198170 -193559 4779 146465 113495 76990 -45414 -60499 82149 185302 282382
10299 282382 205526 114619 -72886 -46463 -15091 -77740 9506 -29836 -185349 -279047 -221925
10288 -221925 -38556 -39779 30318 148031 192150 -22958 -79809 -35661 249344 409665 280824
10277 280824 254603 227937 176519 -79360 -142432 -317403 -505751 -510640 -418815 -219578 -153319
10266 -153319 90568 -25653 -48671 49105 58770 -7597 295 48367 123855 -55019 -296135
10255 -296135 -266508 -192516 -168775 -66413 165013 136076 -181989 -390994 -331859 -210158
10245 -210158 -148492 -187443 -394721 -395567 -395585 -548313 -423660 -388678 -327833 -254536 -241328 -129094
$$ packed form
10320B21930j85447K22004P0335P7455K9499k11375k19544k72659J24688J13756
10310b9358j68812M611J98338J41686l2970l6505j22404j5085J42648J03153R7080
10299B82382p6856r0907j87505K6423L1372o2649Q7246l9342j55513r3698N7122
10288b21925J83369j223P0097J17713M4119k15108n6851M4148K85005J60321j28841
10277B80824k6221k6666n1418k55879o3072j74971j88348m889R1825J99237O6259
10266a53319K43887j16221k3018R7776R665o6367P892M8072P5488j78874k41116
10255b96135K9627P3992K3741J02362K31426k8937l18065k09005N9135J21701
10245b10158O1666l8951k07278q46j8j52728J24653L4982O0845P3297J3208J12234
$$ plain form
10233 -129094 -260469 -443885 -440439 -442209 -147407 -57977 -118962 -308376 -198288 -211810 -190689
10222 -190689 -80444 98416 116471 224977 258565 257980 327933 134044 -65683 118166 228409
10211 228409 11533 263795 341372 143265 -30015 -109024 -22822 -107843 -102579 -362850 -311278
10200 -311278 12665 132280 -58816 -138238 -4545 203829 324299 214835 307168 304054
10190 304054 86127 255412 550050 547643 286593 411140 457560 515120 793508 1056648
10180 1056648 936566 637990 638062 769939 681594 962800 1233020 1312046 1197389 1308349
10170 1308349 1355571 1638842 1720808 1770770 1512056 1310595 1269696 1244001 1498175 1648465
10160 1648465 2007896 2082783 2192243 2201519 2304940 2339374 2223446 2065054 1972349 1924160
$$ packed form
10233a29094j31375j83416L446j770K94802Q9430o0985j89414J10088j3522K1121
10222a90689J10245J78860J8055J08506L3588n85O9953j93889j99727J83849J10243
10211B28409k16876K52262P7577j98107j73280p9009Q6202q5021N264k60271N1572
10200c11278L23943J19615j91096p9422J33693K08374J20470j09464R2333l114
10190C04054k17927J69285K94638k407k61050J24547M6420N7560K78388K63140
10180A056648j20082k98576P2J31877q8345K81206K70220P9026j14657J10960
10170A308349M7222K83271Q1966M9962k58714k01461m0899k5695K54174J50290
10160A648465L59431P4887J09460R276J03421L4434j15928j58392r2705m8189
$$ plain form
10150 1924160 1830919 1529020 1454658 1732574 1832619 1642653 1460884 1377940 1367171 1361357
10140 1361357 1317715 1218793 1225788 1239569 1176831 1240125 1083591 893819 878067 897903 878579
10129 878579 537059 552387 540965 615542 692248 537874 463459 276867 75377 40100 38243
10118 38243 200254 37444 -16345 -3174 464480 632221 277249 31301 121127 174212
10108 174212 75613 83439 -23706 -65945 89688 215451 220790 -138865 -329535 -141272 -33029
10097 -33029 -72796 -37815 -87712 -249712 -251992 -108085 127943 172814 204071 341778 295152
10086 295152 -58779 -387518 -769021 -649777 -527375 -579835 -524162 -424380 -249943 -218509
10076 -218509 -56143 -125010 -171029 -87756 42010 64191 49059 -67736 -188913 -140159 -85006
$$ packed form
10150A924160r3241l01899p4362K77916J00045j89966j81769q2944j0769n814
10140A361357m3642r8922O995J3781o2738O3294j56534j89772j5752J9836j9324
10129H78579l41520J5328j1422P4577P6706j54374p4415j86592k01490l5277j857
10118C8243J62011j62810n3789J3171M67654J67741l54972k45948Q9826N3085
10108A74212r8599P826j07145m2239J55633J25763N339l59655j90670J88263J08243
10097c3029l9767L4981m9897j62000k280J43907K36028M4871L1257J37707m6626
10086B95152l53931l28739l81503J19244J22402n2460N5673R9782J74437L1434
10076b18509J62366o8867m6019Q3273J29766K2181j5132j16795j21177M8754N5153
$$ plain form
10065 -85006 -4369 -186516 -206013 -5688 7587 -19295 127163 147587 216009 284003 218723
10054 218723 299016 336504 533537 439971 264259 238444 310974 128888 -33688 -113016 -57986
10043 -57986 -80480 -218671 -292272 -189602 -158881 -245972 -205096 -341878 -474543 -314531 -173839
10032 -173839 -205310 -143663 -65481 77246 123745 -65136 102 -140238 -147667 -239938 -278913
10021 -278913 -105785 -201125 -340367 -149138 -18345 -23603 -118166 48973 -25425 -198749
10011 -198749 -127194 -79389 -303477 -518220 -666019 -666346 -408532 -209370 -157909 -27277 -60062
10000 -60062 -104519 93217 158636 256640 333208 479585 313275 70893 61346 -31273 19388
9989 19388 -36290 -454547 -524583 -404596 -409844 -351635 -102047 -108927 -332703 -398831 -348336
$$ packed form
10065h5006Q0637j82147j9497K00325J3275k6882J46458K0424O8422O7994o5280
10054B18723Q0293L7488J97033r3566j75712k5815P2530j82086j62576p9328N5030
10043e7986k2494j38191p3601J02670L0721q7091M0876j36782j32665J60012J40692
10032a73839l1471O1647P8182J42727M6499j88881O5238j40340p429r2271l8975
10021b78913J73128r5340j39242J91229J30793n258r4563J67139p4398j73324
10011a98749P1555M7805k24088k14743j47799l27K57814J99162N1461J30632l2785
10000f0062m4457J97736O5419R8004P6568J46377j66310k42382r547r2619N0661
9989A9388n5678m18257p0036J19987n248N8209K49588o880k23776o6128N0495
$$ plain form
9978 -348336 -212086 -71477 -1333 -261567 -197169 -227114 -150291 -96532 -88656 -140103 -173600
9967 -173600 -228154 -371660 -357830 -384525 -314336 -396262 -570112 -525243 -277501 -96192 -140769
9956 -140769 -67553 9071 97554 117025 -1545 -102710 -235796 -234409 81848 94190 277745
9945 277745 -5555 -71430 -162999 -115407 -84969 -160151 -298494 -103938 -8726 127093 417708
9934 417708 419799 222095 349819 642393 888493 873136 1032381 1175862 970435 362011
9924 362011 307661 379938 513254 396313 274227 159058 122252 -7652 121282 225352
9914 225352 187760 297247 151625 10737 24098 310837 552409 430258 194069 20976
9904 20976 16137 31908 -19379 -26752 -221481 -185195 -1721 58754 -41129 -93819 -188617 -109627
$$ packed form
9978c48336J36250J40609P0144k60234O4398k9945P6823N3759P876n1447l3497
9967a73600n4554j43506J3830k6695P0189q1926j73850M4869K47742J81309m4577
9956a40769P3216P6624Q8483J9471j18570j01165j33086J387L16257J2342J83555
9945B77745k83300o5875r1569M7592L0438p5182j38343J94556R5212J35819K90615
9934D17708K091j97704J27724K92574K46100j5357J59245J43481k05427o08424
9924C62011n4350P2277J33316j16941j22086j15169l6806j29904J28934J04070
9914B25352l7592J09487j45622j40888J3361K86739K41572j22151k36189j73093
9904B0976m839J5771n1287p373j94729L6286J83474O0475r9883n2690r4798P8990
$$ plain form
9892 -109627 -34725 -305889 -471588 -470083 -331605 -98313 -6949 212358 254106 195669 100878
9881 100878 -6032 85130 259387 357478 317149 143126 81399 95809 13873 77611 -72032
9870 -72032 -86390 -269407 -221305 226597 264662 304595 266509 235818 162168 99178 -110812
9859 -110812 28794 150563 227426 152332 169642 207198 346708 340129 185211 106489 -65414
9848 -65414 -137801 -59354 -116597 -84301 -118293 -184558 -12501 163587 342582 538889 432539
9837 432539 441436 422072 350559 229348 384128 19450 -258901 -224554 -119972 125104 226999
9826 226999 9219 -341400 -384115 -163531 99316 218386 254644 -11320 -228724 -366175
9816 -366175 -414632 -208792 -15439 -64843 -23580 -160 -133877 -15919 237266 42549
$$ packed form
9892a09627P4902k71164j65699J505J38478K33292R1364K19307M1748n8437r4791
9881A00878j06910R1162J74257R8091m0329j74023o1727J4410q1936O3738j49643
9870g2032j4358j83017M8102M47902L8065L9933l8086l0691p3650o2990k09990
9859a10812J39606J21769P6863p5094J7310L7556J39510o579j54918p8722j71903
9848f5414p2387P8447n7243L2296l3992o6265J72057J76088J78995J96307j06350
9837D32539Q897j9364p1513j21211J54780l64678k78351L4347J04582K45076J01895
9826B26999k17780l50619m2715K20584K62847J19070L6258k65964k17404j37451
9816c66175m8457K05840J93353m9404M1263K3420j33717J17958K53185j94717
$$ plain form
9806 42549 46665 282234 418929 652486 778463 1111064 1306058 1187448 1149441 1131623 953839
9795 953839 787626 475830 214053 250887 55223 -95706 23516 218101 373559 450241
9785 450241 404545 241422 186145 274826 228752 273413 188154 201315 183558 241018 304595
9774 304595 383973 150039 -228767 -142790 -181870 -254438 -61229 -175490 -315531 -492823
9764 -492823 -394186 -188050 307705 224958 46728 -5143 156547 149989 6040 -386120 -272427
9753 -272427 -116684 -221315 86 -70398 -127055 25053 -58946 98385 365640 280911
9743 280911 92034 -111536 -211769 1643 95245 43850 63408 185006 211001 213529 100554
9732 100554 6718 125834 248567 343008 303975 298893 283544 218182 224446 103188 88931
$$ packed form
9806D2549M116K35569J36695K33557J25977L32601J94994j18610l8007j7818j77784
9795I53839j66213l11796k61777L6834j95664j50929J19222J94585J55458P6682
9785D50241m5696j63123n5277Q8681m6074M4661q5259J3161j7757N7460O3577
9774C04595P9378k33934l78806Q5977l9080p2568J93209j14261j40041j77292
9764d92823R8637K06136M95755q2747j78230n1871J61690o558j43949l92160J13693
9753b72427J55743j04631K21401p0484n6657J52108q3999J57331K67255q4729
9743B80911j88877k03570j00233K13412R3602n1395J9558J21598K5995K528j12975
9732A00554r3836J19116J22733R4441l9033n082j5349o5362O264j21258j4257
$$ plain form
9721 88931 68018 19990 80271 237862 363312 289396 209074 98383 30321 118758 111737
9710 111737 25905 -52303 114195 -62375 -59814 124976 218018 377364 428165 225930 169762
9699 169762 296307 348670 99209 94046 -14631 -51849 -63046 67330 292506 675591 662184
9688 662184 254654 54975 79934 -51553 8474 357803 406836 319137 476336 354820
9678 354820 410668 537884 426310 432061 714347 678971 462974 519166 585476 773669 1117437
9667 1117437 1497835 1738268 2120148 2334111 2769558 3462426 4322682 5374622 7230482
9658 7230482 10180197 14225256 19525231 24958305 27868922 29300974 31476715 33307236
9650 33307236 32378129 27537034 19836646 13978610 10321334 7830642 6339699 5408849
$$ packed form
9721H8931k0913m8028O0281J57591J25450p3916q0322j10691o8062Q8437p021
9710A11737q5832p8208J66498j76570K561J84790R3042J59346N0801k02235n6168
9699A69762J26545N2363k49461n163j08677l7218j1197J30376K25176L83085j3407
9688F62184m07530j99679K4959j31487O0027L49329M9033q7699J57199j21516
9678C54820N5848J27216j11574N751K82286l5376k15997N6192O6310J88193L43768
9667A117437L80398K40433L81880K13963M35447O92868Q60256J051940J855860
9658G230482K949715M045059N299975N433074K910617J432052K175741J830521
9650C3307236r29107m841095p700388n858036l657276k490692j490943r30850
$$ plain form
9642 5408849 4718163 4383632 3979557 3592914 3243403 2863678 2837164 2855932 2765473 2523898
9632 2523898 2272965 2038286 2090882 1914899 1912633 2051735 1927816 1816696 1689844 1291398
9622 1291398 1222596 1230713 1322951 1387468 1550500 1600642 1456993 1090964 1120140 950483 769656
9611 769656 775696 858903 931742 832615 607497 675323 895923 946316 668916 652330 624283
9600 624283 645702 628813 635690 633822 567458 423269 467366 536065 732705 664682 675269 546757
9588 546757 397705 455879 661284 617464 566307 599837 424352 434537 359395 264061 327451
9577 327451 72333 95228 249829 220856 176495 140516 91759 222512 387542 389674 254581
9566 254581 -122503 -134510 28359 104949 282977 352715 481061 526700 476187 130306 -14173
$$ packed form
9642E408849o90686l34531m04075l86643l49511l79725k6514J8768r0459k41575
9632B523898k50933k34679N2596j75983k266J39102j23919j11120j26852l98446
9622A291398o8802Q117R2238O4517J63032N0142j43649l66029K9176j69657j80827
9611G69656O040Q3207P2839r9127k25118O7826K20600N0393k77400j6586k8047
9600F24283K1419j6889O877j868o6364j44189M4097O8699J96640o8023J0587j28512
9588E46757j49052N8174K05405m3820n1157L3530j75485J0185p5142r5334O3390
9577C27451k55118K2895J54601k8973m4361l5979m8757J30753J65030K132j35093
9566B54581l77084j2007J62869P6590J78028O9738J28346M5639n0513l45881j44479
$$ plain form
9555 -14173 -166293 -18795 139190 90713 132900 93569 -33634 99511 98644 -6338 -245042
9544 -245042 -184139 -174671 -209294 -339133 -479647 -491061 -342192 -242604 -109052 -222404 -313776
9533 -313776 -435444 -269379 -323702 8848 163701 -35638 -333617 -379475 -194715 -137428
9523 -137428 -43130 -167191 -289862 -433993 -339750 -293790 -209895 -36547 144395 184831 153706
9512 153706 112139 33683 -194097 -496936 -525640 -340954 -320880 -384288 -435306 -246739 -86146
9501 -86146 106040 371022 184579 -74293 -21033 -32962 -235268 -323994 -223345 -94625
9491 -94625 -221455 -383368 -65450 128560 31631 -53099 -168867 -348451 -386886 -299776 -129643
9480 -129643 88693 385004 250879 -59079 -59098 190602 276683 235794 363769 289137 108262
$$ packed form
9555a4173j52120J47498J57985m8477M2187l9331j27203J33145q67j04982k38704
9544b45042O0903R468l4623j29839j40514j1414J48869R9588J33552j13352r1372
9533c13776j21668J66065n4323L32550J54853j99339k97979m5858J84760N7287
9523a37428R4298j24061j22671j44131R4243M5960Q3895J73348J80942M0436l1125
9512A53706m1567p8456k27780l02839k8704J84686K0074o3408n1018J88567J60593
9501h6146J92186K64982j86443k58872N3260j1929k02306q8726J00649J28720
9491i4625j26830j61913L17918J94010r6929q4730j15768j79584l8435Q7110J70133
9480a29643K18336K96311j34125l09958j9K49700Q6081m0889J27975p4632j80875
$$ plain form
9469 108262 279979 -72752 -363027 -426038 -377455 -373889 -181240 -240926 -222928 48214 97532
9458 97532 -20278 -19912 64577 129445 251696 298535 312859 327206 117402 79844 210003
9447 210003 250099 -124974 -444664 -498258 -296050 -145957 -74404 -133570 -181807 -384251 -558075
9436 -558075 -332741 -158535 -429152 -247934 99775 102386 39015 13060 78695 -200263 -195923
9425 -195923 -15097 -123074 -51622 -115807 -283921 -201290 185180 125811 188497 104904 272797
9414 272797 296325 281955 251227 -131144 -162097 -11479 79258 216848 460057 561028 360026
9403 360026 57445 -232295 -306623 15186 28259 101448 -80533 -183144 64115 -87963
9393 -87963 -144554 -154794 -100182 242944 358185 280810 192154 148818 -117609 -195886 95431
$$ packed form
9469A08262J71717l52731k90275o3011M8583L566J92649n9686J7998K71142M9318
9458I7532j17810L66Q4489O4868J22251M6839J4324J4347k09804l7558J30159
9447B10003M0096l75073l19690n3594K02208J50093P1553n9166m8237k02444j73824
9436e58075K25334J74206k70617J81218L47709K611o3371k5955O5635k78958M340
9425a95923J80826j07977P1452o4185j68114Q2631L86470n9369O2686q3593J67893
9414B72797K3528j4370l0728l82371l0953J50618R0737J37590K43209J00971k01002
9403C60026l02581k89740p4328L21809J3073P3189j81981j02611K47259j52078
9393h7963n6591j0240N4612L43126J15241p7375q8656m3336k66427p8277K91317
$$ plain form
9382 95431 294028 245334 276806 111721 -183488 -102140 -61946 -68945 -75208 -7453 63878 -10303
9370 -10303 -330996 -372083 -436627 -661779 -602931 -149179 91638 177327 381497 51837 -115503
9359 -115503 95435 83284 -415373 -821435 -706276 -327245 -196898 -197789 -246809 -119947 90519
9348 90519 359683 378761 213974 250339 158852 308370 385630 154553 -93855 -127309 -145411
9337 -145411 -321204 -419294 -235767 -384265 -627648 -363263 -49010 77822 168204 69697
9327 69697 -59541 -142357 -227777 -349492 -272321 54843 181616 225000 239566 102535 8818
9316 8818 58761 65500 106230 -336084 -550986 -538132 -342018 -101835 65912 193442 25369
9305 25369 -160107 -390812 -439357 -144429 98164 171029 110024 -28848 -40977 -207778 -207675
$$ packed form
9382I5431J98597m8694L1472j65085k95209Q1348M0194o999o263O7755P1331p4181
9370a0303l20693m1087o4544k25152N8848M53752K40817Q5689K04170l29660j67340
9359a15503K10938j2151m98657m06062J15159L79031J30347q91m9020J26862K10466
9348I0519K69164J9078j64787L6365r1487J49518P7260k31077k48408l3454j8102
9337a45411j75793r8090J83527j48498k43383K64385L14253J26832R0382r8507
9327F9697j29238q2816q5420j21715P7171L27164J26773M3384J4566j37031r3717
9316H818M9943O739M0730m42314k14902J2854J96114K40183J67747J27530j68073
9305B5369j85476k30705m8545K94928K42593P2865o1005j38872j2129j66801J03
$$ plain form
9294 -207675 -36610 78969 312596 415625 257408 -33768 -133298 -235113 92574 227589
9284 227589 253541 292319 184926 166896 220320 310938 -89806 -550528 -550650 -757453 -694211
9273 -694211 -439322 -139475 92083 71452 -96338 -137859 -159998 -291001 -257012 19004
9263 19004 329116 182139 -95272 -112170 -261516 -354394 -269656 -163114 -56594 -238690
9253 -238690 -256867 -60663 15562 51484 55414 132776 -150866 -298355 -175863 159395 -36316
9242 -36316 -175560 13060 228571 434010 211487 -84881 -266164 -254422 -118605 -221205
9232 -221205 -296836 -291930 -528493 -320315 -247176 -185553 -9152 66569 -59674 -85967 -167141
9221 -167141 -151292 32078 -209304 -509419 -527020 -422157 -218150 -203308 -300291 -240255 -320070
$$ packed form
9294b07675J71065J15579K33627J03029j58217k91176r9530j01815L27687J35015
9284B27589K5952L8778j07393j8030N3424R0618m00744m60722j22k06803O3242
9273f94211K54889K99847K31558k0631j67790m1521k2139j31003L3989K76016
9263A9004L10112j46977k77411j6898j49346r2878Q4738J06542J06520j82096
9253b38690j8177J96204P6225L5922L930P7362k83642j47489J22492L35258j95711
9242c6316j39244J88620K15511K05439k22523k96368j81283J1742J35817j02600
9232b21205p5631M906k36563K08178P3139O1623J76401P5721j26243k6293q1174
9221a67141J5849J83370k41382l00115j7601J04863K04007J4842r6983O0036p9815
$$ plain form
9210 -320070 -545477 -428009 -274633 -106991 -28969 -105669 93919 54701 -106861 -149922
9200 -149922 -170072 -314187 -282743 81871 356938 324329 290324 29406 -8758 -18533 -97703
9189 -97703 -109813 -43629 -4561 -93274 -256358 -307705 -95686 66849 178029 31931 -145088
9178 -145088 -265102 -71706 -20167 -119427 -248734 -257221 -238507 -298504 -143859 -46444 167241
9167 167241 240168 101487 25223 203912 412258 303414 364280 264617 165760 134366 -91516
9156 -91516 -177528 45242 199381 128945 -155273 -396950 -489124 -328657 -127818 113579
9146 113579 248951 -21345 -240413 -374386 -4514 251968 193774 153638 152520 -74147
9136 -74147 -69802 -42620 -208858 -279941 -508119 -612935 -467351 -475842 -389518 -299759 -172641
$$ packed form
9210c20070k25407J17468J53376J67642P8022p6700J99588l9218j61562m3061
9200a49922k0150j44115L1444L64614K75067l2609l4005k60918l8164r775p9170
9189i7703j2110O6184L9068q8713j63084n1347K12019J62535J11180j46098j77019
9178a45088j20014J93396N1539r9260j29307q487J8714n9997J54645R7415K13685
9167A67241P2927j38681p6264J78689K08346j08844O0866r9663r8857l1394k25882
9156i1516q6012K22770J54139p0436k84218k41677r2174J60467K00839K41397
9146A13579J35372k70296k19068j33973L69872K56482n8194m0136j118k26667
9136g4147M345K7182j66238p1083k28178j04816J45584q491Q6324Q9759J27118
$$ plain form
9125 -172641 15021 199310 193027 -108899 -235984 -29678 -139597 -101315 -136305 -495850
9115 -495850 -494496 -369910 -45071 -278597 -242316 -232029 -245515 -186389 -152039 38792 -57835
9104 -57835 -165548 -108180 51009 266624 201575 -68463 -115221 -98341 -194546 -161345 -118072
9093 -118072 -147527 -71807 -173709 -240309 -232519 -270238 -167411 -195641 -202887 -261594 -214427 -254440
9081 -254440 -370543 -294964 -152085 -52565 72597 177752 -69451 -91951 -137996 -200659 -130761
9070 -130761 -7269 -6366 -371789 -463863 -307252 -186146 -183925 -181447 -95578 -13743 -23694 29902
9058 29902 -16994 -224026 -408255 -561123 -546944 -518330 -414811 -320026 -266796 -328064 -258438
9047 -258438 -312643 -178782 -179375 -240184 -324211 -241073 -347877 -419505 -599967 -640804 -827878
$$ packed form
9125a72641J87662J84289o283l01926j27085K06306j09919L8282l4990l59545
9115d95850J354J24586L24839k33526L6281J0287j3486N9126L4350J90831r6627
9104e7835j07713N7368J59189K15615o5049k70038m6758J6880r6205L3201M3273
9093a18072k9455P5720j01902o6600P790l7719J02827k8230p246n8707M7167m0013
9081b54440j16103P5579J42879R9520J25162J05155k47203k2500m6045o2663O9898
9070a30761J23492R03l65423r2074J56611J21106K221K478Q5869Q1835r951N3596
9058B9902m6896k07032j84229j52868J4179K8614J03519R4785N3230o1268O9626
9047b58438n4205J33861n93o0809q4027Q3138j06804p1628j80462m0837j87074
$$ plain form
9036 -827878 -806683 -495037 -162524 162816 376700 469119 350415 372526 481631 287007
9026 287007 -223809 -388938 -160981 144480 107028 121768 54553 -230308 -326348 -97055
9016 -97055 -66418 -179257 -275890 -216621 -153551 -87308 113145 253713 123466 -295907 -502525
9005 -502525 -480611 -392090 -167812 -73237 -58220 -35660 -219666 -99550 -23733 79327 260828
8994 260828 178205 -5896 -24674 -193890 -161197 61294 82111 9019 -33233 -143682 -37887
8983 -37887 39648 12503 10036 -227848 -215636 -276876 -205173 -46703 -26835 2920 142140
8972 142140 57243 -65281 105514 113667 7156 -1867 97803 41630 12872 -74299 162112
8961 162112 114617 -188086 -90494 -49968 -142241 -328093 -148436 338211 428910 401361 317186
$$ packed form
9036h27878K1195L11646L32513L25340K13884R2419j18704K2111J09105j94624
9026B87007n10816j65129K27957L05461l7452J4740o7215k84861r6040K29293
9016i7055L0637j12839r6633N9269O3070O6243K00453J40568j30247m19373k06618
9005e02525K1914Q8521K24278R4575J5017K2560j84006J20116P5817J03060J81501
8994B60828q2623j84101j8778j69216L2693K22491K0817p3092m2252j10449J05795
8983c7887P7535k7145k467k37884J2212o1240P1703J58470J9868K9755J39220
8972A42140q4897j22524J70795Q153j06511r023R9670n6173k8758q7171K36411
8961A62112m7495l02703R7592M0526r2273j85852J79657M86647R0699k7549q4175
$$ plain form
8950 317186 218395 291871 219624 145936 119713 40573 8956 36291 -194232 -245543 -148445
8939 -148445 -60202 38158 -16344 -202451 -228282 -400384 -446914 -371007 -272078 -339357 -245856
8928 -245856 -58388 -38803 -111002 -236639 -62509 91059 235375 299335 175775 -130053
8918 -130053 -309895 -69450 70671 123830 61264 -54068 -144696 -154885 25275 55081 -10265
8907 -10265 -85629 -156940 -101896 29594 150085 108666 106162 123010 149050 -114078 -164536
8896 -164536 -25931 59927 -64667 -161440 -112359 98849 75709 -192978 -405970 -98288
8886 -98288 -52027 -63713 -14345 -33400 -30953 92934 60254 -193667 -28076 209382 258362
8875 258362 94567 -65144 -229819 -431299 -89890 14583 -125625 -527223 -491108 -300755
$$ packed form
8950C17186r8791P3476p2247p3688k6223p9140l1617K7335k30523n1311R7098
8939a48445Q8243R8360n4502j86107k5831j72102m6530P5907R8929o7279R3501
8928b45856J87468J9585p2199j25637J74130J53568J44316O3960j23560l05828
8918a30053j79842K40445J40121N3159o2566j15332r0628j0189J80160K9806o5346
8907a0265p5364p1311N5044J31490J20491m1419k504J6848K6040k63128n0458
8896a64536J38605Q5858j24594r6773M9081K11208k3140k68687k12992L07682
8886i8288M6261j1686M9368j9055K447J23887l2680k53921J65591K37458M8980
8875B58362j63795j59711j64675k01480L41409J04473j40208m01598L6115J90353
$$ plain form
8865 -300755 -113827 -70775 43546 68994 -73405 -259496 -217817 -261691 -146246 -81286 -217303
8854 -217303 -246766 -195732 67900 222455 284212 265481 282574 154733 16823 -174877 -271622
8843 -271622 -313667 -286317 -146780 89567 75590 53818 -78074 -77663 -163610 -229961 -275265
8832 -275265 -469374 -252520 12188 -225156 -355610 -465220 -758352 -874288 -694124 -417977
8822 -417977 -200019 13972 172977 -29242 -37809 76321 -85965 -255947 -204647 -176004
8812 -176004 -107674 -155637 -65355 -100182 -206147 -92384 27785 -82771 -425666 -330661 -61408
8801 -61408 -58609 -95951 -254544 -250771 -206475 -104427 155443 161330 199132 352724 310737 158062
8789 158062 198645 231638 162573 60310 110261 110133 111920 129996 260283 66016 -310644
$$ packed form
8865c00755J86928M3052J14321K5448j42399j86091M1679m3874J15445O4960j36017
8854b17303k9463N1034K63632J54555O1757j8731J7093j27841j37910j91700r6745
8843b71622m2045K7350J39537K36347j3977k1772j31892M11q5947o6351m5304
8832b75265j94109K16854K64708k37344j30454j09610k93132j15936J80164K76147
8822d17977K17958K13991J59005k02219q567J14130j62286j69982N1300K8643
8812a76004O8330m7963R0282l4827j05965J13763J20169j10556l42895R5005K69253
8801f1408K799l7342j58593L773M4296J02048K59870N887L7802J53592m1987j52675
8789A58062M0583L2993o9065j02263M9951j28J787J8076J30287j94267l76660
$$ plain form
8778 -310644 -369899 -138045 -63407 -44524 173921 229922 200663 -78178 -188730 -31017 1399
8767 1399 -60082 206279 344877 212381 -63365 104268 265257 73016 -144544 -153328 -108908
8756 -108908 -25568 -172467 -284281 -386811 -244436 -247890 -242426 -69000 -374381 -614674 -380423
8745 -380423 -150850 65953 26194 6108 131442 316311 443238 389078 230286 166441
8735 166441 -115215 -336295 -386142 -255473 -226719 -6699 97104 -115895 -254854 -182836
8725 -182836 9876 -86508 -216518 -236434 -318245 -405723 -483333 -648635 -682159 -754402 -756605
8714 -756605 -535833 -304599 -68514 -2873 -160973 -232575 -126716 -2869 -91266 -112598
8704 -112598 104596 209803 92407 59026 -109019 -114553 -53374 -99333 -157182 -224623 -15177
$$ packed form
8778c10644n9255K31854P4638J8883K18445N6001k9259k78841j10552J57713L2416
8767A399o1481K66361J38598j32496k75746J67633J60989j92241k17560q784M4420
8756a08908Q3340j46899j11814j02530J42375l454N464J73426l05381k40293K34251
8745c80423K29573K16803l9759k0086J25334J84869J26927n4160j58792o3845
8735A66441k81656k21080m9847J30669K8754K20020J03803k12999j38959P2018
8725a82836J92712r6384j30010j9916q1811q7478p7610j65302l3524p2243k203
8714g56605K20772K31234K36085O5641j58100p1602J05859J23847q8397k1332
8704a12598K17194J05207j17396l3381j68045n534O1179m5959n7849o7441K09446
$$ plain form
8693 -15177 294145 494100 267909 -106208 -326623 -516185 -400634 -314279 -289473 -65859
8683 -65859 199319 225735 119645 167760 1702 -255018 -336500 -496651 -536894 -473910 -417721
8672 -417721 -184380 -192322 -29844 -4130 -141658 -12218 219558 194107 221857 111741 65581
8661 65581 -95511 -62621 150441 -6612 -26043 -3193 -272097 -366844 -331387 -229973 -243392
8650 -243392 -280398 -165164 81336 91211 128635 178851 99141 66004 -151785 -291717 -147895
8639 -147895 52630 185864 341917 158807 160099 237256 214802 201497 113372 199565 127840
8628 127840 -3169 -137773 -182697 -17077 16914 -12227 -5556 119683 98533 -19961 51125
8617 51125 -47179 -160001 -200729 -244450 -206392 -66775 65867 16220 171419 314762 191243
$$ packed form
8693a5177L09322J99955k26191l74117k20415j89562J15551Q6355K4806K23614
8683f5859K65178K6416j06090M8115j66058k56720q1482j60151m0243O2984N6189
8672d17721K33341p942J62478K5714j37528J29440K31776k5451K7750j10116m6160
8661F5581j61092L2890K13062j57053j9431K2850k68904r4747L5457J01414j3419
8650b43392l7006J15234K46500R875L7424N0216p9710l3137k17789j39932J43822
8639a47895K00525J33234J56053j83110J292P7157k2454j3305q8125Q6193p1725
8628A27840j31009j34604m4924J65620L3991k9141O671J25239k1150j18494P1086
8617E1125r8304j12822m0728m3721L8058J39617J32642m9647J55199J43343j23519
$$ plain form
8606 191243 98889 147069 280695 257969 222467 122520 219248 236268 398422 313642 280145
8595 280145 431173 239662 -11923 -101529 -486762 -496791 -478313 -377244 -364634 -307894 -286952
8584 -286952 -432307 -450668 -206563 125867 46514 23977 -100347 -95510 25278 177051 71665
8573 71665 -12088 -222276 -49054 -110882 -422618 -387189 -232743 -202784 -78341 -197125 -185105
8562 -185105 103957 63731 -84628 43837 -299565 -336583 -237261 -183331 -182138 -333721 -262390
8551 -262390 -48274 75623 -40146 -101017 -60716 -86707 -264038 -362356 -282630 -112680 10511
8540 10511 -135443 -579364 -616645 -432637 -186782 -77772 -130446 -184244 -345653 -386358 -416592
8529 -416592 -583270 -350283 -239448 -229486 -103488 63327 180961 282255 312004 187563
$$ packed form
8606A91243r2354M8180J33626k2726l5502r9947R6728J7020J62154q4780l3497
8595B80145J51028j91511k51585q9606l85233j0029J8478J01069J2610N6740K0942
8584b86952j45355j8361K44105L32430p9353k2537j24324M837J20788J51773j05386
8573G1665q3753k10188J73222o1828l11736L5429J54446K9959J24443j18784J2020
8562a85105K89062m0226j48359J28465l43402l7018R9322N3930J193j51583P1331
8551b62390K14116J23897j15769o0871M0301k5991j77331r8318P9726J69950J23191
8540A0511j45954m43921l7281J84008K45855J09010n2674n3798j61409m0705l0234
8529d16592j66678K32987J10835R962J25998J66815J17634J01294K9749j24441
$$ plain form
8519 187563 250207 452259 235682 125281 115483 -106962 -183 -37796 -62498 -62629 -131180
8508 -131180 -172197 98139 158076 289665 204739 85786 -30370 -123002 -125656 48913 26943
8497 26943 20068 -236393 -309582 -306974 -354233 -189323 85483 206949 79969 14304 139303
8486 139303 178499 29773 -19500 -93820 -19719 68225 125282 164299 70440 97619 26515
8475 26515 -234281 -356877 -132228 -103439 -192078 107865 73240 4054 13143 50953 -126392
8464 -126392 -222004 -259480 -32897 65325 -34072 -120128 -177642 -162901 -69595 -117386 -75349
8453 -75349 75589 12005 -116062 39467 183427 70943 288331 433434 285366 117585
8443 117585 132428 -29350 -2328 204232 160962 83759 71421 -167551 -128140 10557 81099
$$ packed form
8519A87563O2644K02052k16577j10401r798k22445J06779l7613k4702j31o8551
8508a31180m1017K70336N9937J31589q4926j18953j16156r2632k654J74569k1970
8497B6943o875k56461p3189K608m7259J64910K74806J21466j26980o5665J24999
8486A39303L9196j48726m9273p4320P4101Q7944N7057L9017r3859K7179p1104
8475B6515k60796j22596K24649K8789q8639K99943l4625o9186R089L7810j77345
8464a26392r5612l7476K26583R8222r9397q6056n7514J4741R3306m7791M2037
8453g5349J50938o3584j28067J55529J43960j12484K17388J45103j48068j67781
8443A17585J4843j61778K7022K06560m3270p7203j2338k38972L9411J38697P0542
$$ plain form
8432 81099 112302 91224 350492 136451 -150586 -153914 -75297 110112 -110302 -240946 -101926
8421 -101926 -95672 -223862 -116024 -3027 -115320 -287208 9421 102066 57930 -104876
8411 -104876 -245732 -288363 -143718 107498 219217 86247 -308005 -470612 -355553 -302066
8401 -302066 -300451 -210760 -281805 -311070 -291135 -265460 -226960 -142487 -143164 115937 -131418 -291236
8389 -291236 -286737 -68148 -7428 41152 61011 -102105 -257177 -101189 174318 142238 66804
8378 66804 -33602 -23972 -52844 -153173 -155070 -356140 -281802 -242739 -121655 117182 78015
8367 78015 -165108 -313214 -122979 109341 131577 207132 115409 -104084 -182651 -73423 -118729
8356 -118729 -357487 -304718 -328035 -461130 -306767 -311794 -417726 -230888 -129701 -162125 -24609
$$ packed form
8432H1099L1203k1078K59268k14041k87037l328P8617J85409k20414j30644J39020
8421a01926O254j28190J07838J12997j12293j71888K96629R2645m4136j62806
8411a04876j40856m2631J44645K51216J11719j32970l94252j62607J15059N3487
8401c02066J615Q9691p1045k9265J9935K5675L8500Q4473o77K59101k47355j59818
8389b91236M499K18589O0720M8580J9859j63116j55072J55988K75507l2080p5434
8378F6804j00406R630k8872j00329j897k01070P4338L9063J21084K38837l9167
8367G8015k43123j48106J90235K32320K2236P5555r1723k19493p8567J09228m5306
8356a18729k38758N2769k3317j33095J54363n027j05932J86838J01187l2424J37516
$$ plain form
8345 -24609 -59691 -31042 -180198 72357 168174 27186 -33319 31511 -3441 -185748 -329050
8334 -329050 -561777 -618568 -469768 -646715 -748321 -454579 -181626 -189758 -358282 -195022
8324 -195022 2056 -23839 -164158 -333853 -350696 -658 228999 252611 -114834 -236182
8314 -236182 -387253 -256392 90007 143977 -314027 -347369 -130844 -245704 -195499 79649
8304 79649 222209 165592 194405 29805 -156208 -217162 -271181 -153541 -156848 123777 76954
8293 76954 -47714 -119194 -243545 -199346 -44255 217183 410992 354085 187720 -17768
8283 -17768 -83306 -228810 -642559 -882788 -777046 -730276 -636857 -358139 -366008 -372932 -220133
8272 -220133 -299949 -352015 -556860 -434620 -212261 -42304 188179 373040 138991 -127416
$$ packed form
8345b4609l5082K8649j49156K52555R5817j40988o0505O4830l4952j82307j43302
8334c29050k32727n6791J48800j76947j01606K93742K72953q132j68524J63260
8324a95022J97078k5895j40319j69695j6843L50038K29657K3612l67445j21348
8314b36182j51071J30861L46399N3970m58004l3342K16525j14860N0205K75148
8304G9649J42560n6617K8813j64600j86013o0954n4019J17640l307K80625m6823
8293G6954j24668p1480j24351M4199J55091K61438J93809n6907j66365k05488
8283a7768o5538j45504m13749k40229J05742M6770R3419K78718p869o924J52799
8272b20133p9816n2066k04845J22240K22359J69957K30483J84861k34049k66407
$$ plain form
8262 -127416 -101911 -102116 -42185 -50867 -154710 -230384 -77364 -4301 -151854 -276462 -300249
8251 -300249 -205769 -132567 -96895 -91261 -77312 7712 122004 167360 341000 416517 296582
8240 296582 112020 177626 288988 295651 199033 216598 145077 151467 -49619 -67111 -136956
8229 -136956 -112455 -37213 -158922 -436490 -208966 -49474 186255 124410 91573 303372
8219 303372 271521 86801 -137074 111502 104807 -205490 -157822 216755 346317 -814
8209 -814 -208856 -378598 -177427 730 -57528 -260629 -374847 -454778 -409812 -524271 -383596
8198 -383596 -220430 -93367 60874 139199 42997 110063 192278 70992 136430 187589 228394
8187 228394 99171 166558 37837 -94880 -137311 85557 158179 97461 -22670 -186098
$$ packed form
8262a27416K5505k05N9931q682j03843p5674J53020P3063j47553j24608k3787
8251c00249R4480P3202L5672N634J3949Q5024J14292M5356J73640P5517j19935
8240B96582j84562O5606J11362O663r6618J7565p1521O390k01086j7492o9845
8229a36956K4501P5242j21709k77568K27524J59492K35729o1845l2837K11799
8219C03372l1851j84720k23875K48576o695l10297M7668L74577J29562l47131
8209h14k08042j69742K01171J78157n8258k03101j14218p9931M4966j14459J40675
8198c83596J63166J27063J54241P8325r6202O7066Q2215j21286O5438N1159M0805
8187B28394j29223O7387j28721j32717m2431K22868P2622o0718j20131j63428
$$ plain form
8177 -186098 -332920 -363071 -562937 -551434 -550544 -410125 -242067 -181250 -251886 -321233 -363247
8166 -363247 -361376 -352557 -355278 -233296 77303 16777 -126756 59070 210719 -11721 -197586
8155 -197586 -31946 -187373 -245905 -4849 -40451 5052 264210 340092 261990 352031 299361
8144 299361 66255 32574 -3126 90950 133779 160808 -68894 1409 243067 286111 70445
8133 70445 -153597 -329271 -354452 -138921 37906 68945 -62053 -365730 -409063 -326806 -138541
8122 -138541 42375 60805 -53056 -63998 -63176 -107560 -98072 22453 205169 29146 -121250
8111 -121250 -38399 -177903 -19034 152186 -59828 -103789 34863 151001 213646 203045
8101 203045 170294 -151471 -231040 130834 11259 -86043 -40621 -278150 -620512 -397070
$$ packed form
8177a86098j46822l0151j99866J1503Q90J40419J68058O0817p0636o9347m2014
8166c63247J871Q819k721J21982L10599o0526j43533J85826J51649k22440j85865
8155a97586J65640j55427n8532K41056l5602M5503K59158P5882p8102R0041n2670
8144B99361k33106l3681l5700R4076M2829K7029k29702P0303K41658M3044k15666
8133G0445k24042j75674k5181K15531J76827L1039j30998l03677m3333Q2257J88265
8122a38541J80916J8430j13861j0942Q22m4384R488J20525J82716j76023j50396
8111a21250Q2851j39504J58869J71220k12014m3961J38652J16138O2645j0601
8101B03045l2751l21765p9569L61874j19575r7302M5422k37529l42362K23442
$$ plain form
8091 -397070 -366875 -569207 -437251 -511732 -450197 -514655 -645974 -398573 34013 37240 -245367
8080 -245367 -407001 -372943 -247854 -235233 -233955 -163917 67875 235182 363688 135296 -269181
8069 -269181 -318568 -503833 -600928 -453581 -279363 -141258 -169132 -234691 -82416 -15535 -44235
8058 -44235 114617 134011 62751 -20242 -147544 -365404 -333174 -183767 -111155 -97310 -110513
8047 -110513 -106594 72294 184030 102602 96050 235023 72935 -66653 -245775 -540181 -588360
8036 -588360 -550281 -453640 -296697 -272833 -60778 -27871 -282364 -473509 -387502 -489966 -409861
8025 -409861 -222538 -130078 10766 112990 -79382 -444514 -515020 -395296 -148251 -240846
8015 -240846 -473847 -263411 -229913 -262600 -144845 -43081 135190 24378 -106350 -25221
$$ packed form
8091c97070L0195k02332J31956p4481O1535o4458j31319K47401M32586L227k82607
8080b45367j61634L4058J25089J2621J278P0038K31792J67307J28506k28392m04477
8069b69181m9387j85265r7095J47347J74218J38105k7874o5559J52275O6881k8700
8058d4235J58852J9394p1260q2993j27302k17860L2230J49407P2612J3845j3203
8047a10513L919J78888J11736q1428o552J38973j62088j39588j79122k94406m8179
8036e88360L8079R6641J56943K3864K12055L2907k54493j91145Q6007j02464Q0105
8025d09861J87323R2460J40844J02224j92372l65132p0506J19724K47045r2595
8015b40846k33001K10436L3498l2687J17755J01764J78271j10812j30728Q1129
$$ plain form
8005 -25221 -171991 -233509 20143 -31974 50654 29486 -147946 -283981 -308826 -363787 -246059
7994 -246059 -178854 -260488 -399635 -521660 -491900 -484379 -472821 -215460 -125278 -209213 -252709
7983 -252709 -80919 158803 398206 398314 399989 271071 87472 106054 263095 330175 81733
7972 81733 -156575 -123666 -167671 -366851 -469601 -694002 -586178 -134751 120473 68514
7962 68514 226190 -4042 -88376 55164 149370 319818 173228 8846 6475 -248918 -173953
7951 -173953 -34862 -327316 -387279 -253683 68918 185492 57645 50573 192875 188771 3503
7940 3503 -105343 354 276106 360724 91222 -37783 -229086 -265599 -89792 -144345 -234934
7929 -234934 -330925 -50941 -101042 -236299 -243526 -208509 -115683 -73472 -184197 -262732 -413048
$$ packed form
8005b5221j46770o1518K53652n2117Q2628k1168j77432j36035k4845n4961J17728
7994b46059O7205q1634j39147j22025K9760P521J1558K57361R0182q3935m3496
7983b52709J71790K39722K39403J08J675j28918j83599J8582J57041O7080k48442
7972H1733k38308L2909m4005j99180j02750k24401J07824M51427K55224n1959
7962F8514J57676k30232q4334J43540R4206J70448j46590j64382k371k55393P4965
7951a73953J39091k92454n9963J33596L22601J16574j27847p072J42302m104j85268
7940C503j08846J05697K75752Q4618k69502j29005j91303l6513J75807n4553r0589
7929b34934r5991K79984n0101j35257p227L5017R2826M2211j10725p8535j50316
$$ plain form
7918 -413048 -453328 -453057 -288791 -166658 -50334 -173856 -255722 -281544 -260579 -143230 38861
7907 38861 -61577 -172201 -96057 9008 31647 111745 319647 374162 209994 99897 36984
7896 36984 -109098 -6542 1582 71929 92473 -61200 74321 333965 449549 578626 657475
7885 657475 568701 320982 184995 211900 126145 -254513 -374569 -199704 -126522 -203364 -241693
7874 -241693 -69011 -67618 -68040 -170184 -71508 80831 163448 -220373 -380524 -431640 -269447
7863 -269447 -397395 -207374 -79819 -129305 -213737 -237869 -116728 133089 -94665 -346256
7853 -346256 -360083 -258770 -199948 -187275 -126775 -268725 -248326 -154359 -287619 -287995 -308897
7842 -308897 -352076 -348416 -347069 -309328 29526 48937 -6282 55195 117064 149428 346543 321839
$$ packed form
7918d13048m0280K71J64266J22133J16324j23522q1866k5822K0965J17349J82091
7907C8861j00438j10624P6144J05065K2639Q0098K07902N4515j64168j10097o2913
7896C6984j46082J02556Q124P0347K0544j53673J35521K59644J15584J29077P8849
7885F57475q8774k47719j35987K6905q5755l80658j20056J74865P3182p6842l8329
7874b41693J72682J393m22j02144R8676J52339Q2617l83821j60151n1116J62193
7863b69447j27948J90021J27555m9486q4432k4132J21141K49817k27754k51591
7853c46256j3827J01313N8822J2673O0500j41950K0399R3967j33260l76k0902
7842c08897m3179L660J347L7741L38854J9411n5219O1477O1869L2364J97115k4704
$$ plain form
7830 321839 -17034 -31223 -25672 -62822 -236871 -172783 -224656 -406255 -288822 -158894 5948
7819 5948 166410 42353 -171746 -121736 -120226 -312648 -201167 -45633 -64894 -147764 -129342
7808 -129342 -22530 -243171 -240654 -109921 78532 224962 55609 -134926 -145893 -194797
7798 -194797 -115958 -371965 -376067 -448313 -439571 -252518 -257603 -347344 -114962 -174823 -327618
7787 -327618 -341944 -286765 -144307 -55200 -42378 -209284 -238337 -199174 -131987 -67798 -142643
7776 -142643 -321790 -622268 -504428 -489559 -472441 -271978 -189589 -219075 -66001 -90236 -66294
7765 -66294 -72302 -79057 -69536 -278873 -203354 -260915 -174099 -14097 138718 201451 156070 326268
7753 326268 429971 363932 176179 153197 102151 -146659 -218871 135758 74030 15002 90912
$$ packed form
7830C21839l38873j4189N551l7150j74049O4088n1873j81599J17433J29928J64842
7819E948J60462j24057k14099N0010J510j92422J11481J55534j9261q2870J8422
7808a29342J06812k20641K517J30733J88453J46430j69353j90535j0967m8904
7798a94797P8839k56007m102p2246Q742J87053n085q9741K32382n9861j52795
7787c27618j4326N5179J42458Q9107J2822j66906k9053L9163O7187O4189p4845
7776a42643j79147l00478J17840J4869J7118K00463Q2389k9486J53074k4235K3942
7765f6294o008o755R521k09337P5519n7561Q6816J60002J52815O2733m5381J70198
7753C26268J03703o6039j87753k2982n1046k48810p2212L54629o1728n9028P5910
$$ plain form
7742 90912 -66139 -130491 12172 144915 96412 -297701 -492761 -460886 -66953 164756
7732 164756 177254 162112 34406 12410 -15998 -168253 -344618 -308335 -379211 -290720 -106471
7721 -106471 -55080 115706 313022 343193 379775 318344 195151 55225 -373130 -206267
7711 -206267 -218057 -207088 -45126 18191 -90346 -103867 -322493 -389925 -140213 104617 -12355
7700 -12355 -233300 -247241 -101696 131627 17337 -267189 -308916 -341188 -352283 -208160 -126083
7689 -126083 -82428 -152126 -74098 76874 138898 -98294 22616 83389 129126 141300 94911
7678 94911 -111905 -75802 -117133 -122564 -281671 -155072 -151823 -252853 -351870 -62992 102789
7667 102789 161627 -48878 -95989 -26966 -94308 -116024 -157980 -245493 -107964 130685 451864
$$ packed form
7742I0912j57051o4352J42663J32743m8503l94113j95060L1875L93933K31709
7732A64756J2498j5142j27706k1996k8408j52255j76365L6283p0876Q8491J84249
7721a06471N1391J70786J97316L0171L6582o1431j23193j39926m28355J66863
7711b06267j1790J0969J61962O3317j08537j3521k18626o7432K49712K44830j16972
7700a2355k20945j3941J45545K33323j14290k84526m1727l2272j1095J44123Q2077
7689a26083M3655o9698P8028J50972O2024k37192J20910O0773M5737J2174m6389
7678I4911k06816L6103m1331n431j59107J26599L249j01030r9017K88878J65781
7667A02789N8838k10505m7111O9023o7342k1716m1956q7513J37529K38649L21179
$$ plain form
7656 451864 512662 341805 63606 -123202 -334908 -514413 -588065 -449897 -505485 -407079
7646 -407079 -272130 -323384 -156952 -185345 -297230 -278919 -181137 -190588 -126402 -15062 116092
7635 116092 201014 119772 147058 -86745 -134300 200181 118374 -218052 -75284 -179190 -382253
7624 -382253 -322046 -126716 -188072 -82982 -138492 -347363 -363871 -295582 -116044 -133024 -237498
7613 -237498 -244655 -144943 -34605 -150301 -251040 -147302 -21591 -4053 -256786 -233314 -239132
7602 -239132 -175563 -202707 -298961 -364987 -250825 -85609 -195797 -75160 -119097 -350913 -388017
7591 -388017 -262849 -216219 -262244 -267275 -173550 -62788 35971 -582 -79216 78077 175464
7580 175464 211915 173582 -173834 -254652 -32535 -198364 -305674 -447583 -496843 -389436
$$ packed form
7656D51864O0798j70857k78199j86808k11706j79505p3652J38168n5588R8406
7646d07079J34949n1254J66432k8393j11885J8311R7782r451O4186J11340J31154
7635A16092Q4922q1242K7286k33803m7555L34481q1807l36426J42768j03906k03063
7624c82253O0207J95330o1356J05090n5510k08871j6508O8289J79538j6980j04474
7613b37498p157R9712J10338j15696j00739J03738J25711J7538k52733K3472n818
7602b39132O3569k7144r6254o6026J14162J65216j10188J20637m3937k31816l7104
7591c88017J25168M6630m6025n031R3725J10762R8759l6553p8634J57293R7387
7580A75464L6451l8333l47416q0818K22117j65829j07310j41909m9260J07407
$$ plain form
7570 -389436 -261951 -322593 -95813 102785 151403 149792 65796 64222 89099 103599 60473
7559 60473 72494 170317 33423 -67914 32011 64709 64208 -71619 -103613 -47127 32734 244365
7547 244365 230765 178132 -34930 96048 231239 301806 364605 36751 -85381 91377
7537 91377 155127 10103 -237725 -183507 -36306 92802 162918 66610 -22140 -5639 -17758
7526 -17758 -181976 -397817 -402974 -278990 -250327 -305784 -157679 -192802 -312358 -1635 88025
7515 88025 -103594 -304085 -221789 16943 -124674 -184504 -59278 -78334 -104033 -37203 -50823
7504 -50823 -69478 -62212 -134762 -70894 9146 -66565 62271 82595 98355 58740 208287 -77846
7492 -77846 -126456 -213983 -136017 -69759 -67269 84122 108682 149927 226421 142530 -139352 -279259
$$ packed form
7570c89436J27485o0642K26780J98598M8618j611q3996j574K4877J4500m3126
7559F0473J2021R7823j36894j01337R9925L2698n01j35827l1994N6486P9861K11631
7547B44365j3600n2633k13062J30978J35191P0567O2799l27854j22132J76758
7537I1377O3750j45024k47828N4218J47201J29108P0116r6308q8750J6501j2119
7526a7758j64218k15841n157J23984K8663n5457J48105l5123j19556L10723Q9660
7515H8025j91619k00491Q2296K38732j41617n9830J25226j9056k5699O6830j3620
7504e0823j8655P266p2550O3868Q0040p5711J28836K0324J5760l9615J49547k86133
7492g7846m8610q7527P7966O6258K490J51391K4560M1245P6494q3891k81882j39907
$$ plain form
7480 -279259 -315680 -357590 -379867 -546594 -443783 -200917 -28851 127058 -37440 183276
7470 183276 112177 -123085 -75239 -2189 87132 323936 325206 284951 125708 -128943 -193044
7459 -193044 36490 178070 301736 195400 107422 -75929 -171292 5254 79770 202657
7449 202657 211129 97288 -33799 -8272 -76463 -157170 -16053 -58368 -25741 26247 153817
7438 153817 30795 -80633 -111994 -235730 -295855 -116715 115998 217982 61361 23335
7428 23335 89935 90106 144008 236460 617631 654882 565717 487042 358294 494425 243957
7417 243957 58106 45933 -95666 -182507 -175994 -88897 -155326 -266785 -103577 -21187 80508
7406 80508 141995 52968 18140 132463 190381 11669 -272690 -338468 -233720 -75499 -190583
$$ packed form
7480b79259l6421m1910k2277j66727J02811K42866J72066J55909j64498K20716
7470A83276p1099k35262M7846P3050Q9321K36804J270m0255j59243k54651o4101
7459a93044K29534J41580J23666j06336q7978j83351r5363J76546P4516J22887
7449B02657Q472j13841j31087K5527o8191q0707J41117m2315L2627N1988J27570
7438A53817j23022j11428l1361j23736o0125J79140K32713J01984j56621l8026
7428B3335O6600J71N3902R2452L81171L7251q9165p8675j28748J36131k50468
7417B43957j85851j2173j41599q6841O513Q7097o6429j11459J63208Q2390J01695
7406H0508O1487q9027l4828J14323N7918j78712k84359o5778J04748J58221j15084
$$ plain form
7395 -190583 -295030 -141515 -128840 -118202 -2882 14838 -10465 -26 106574 138769 174391
7384 174391 103114 123169 125069 12526 -146313 -139360 5219 86700 180935 28156 8931
7373 8931 147966 -57723 -69518 171076 103135 -64446 -15018 -33171 -51281 -121562 -183113
7362 -183113 -174643 6880 73343 -108500 -327250 -54921 104534 -6470 -153535 -101506
7352 -101506 -38346 170151 152605 8839 -265545 -176434 -127407 -271025 -228658 -202490 -157793
7341 -157793 -246098 -327265 -238783 -20873 69880 4048 14741 -190500 -54853 57303 61365
7330 61365 -77093 -281937 -155023 -381151 -492924 -492710 -165101 -96378 -61416 -133706 -118066
7319 -118066 31309 -140857 -375380 -321103 -229463 -74838 -165648 -165488 174310 73863 -225087
$$ packed form
7395a90583j04447J53515J2675J0638J15320J7720k5303J0439J06600L2195L5622
7384A74391p1277K0055J900j12543j58839O953J44579Q1481R4235j52779j9225
7373H931J39035k05689j1795K40594o7941j67581M9428j8153j8110p0281o1551
7362a83113Q470J81523O6463j81843k18750K72329J59455j11004j47065N2029
7352a01506O3160K08497j7546j43766k74384Q9111M9027j43618M2367K6168M4697
7341a57793q8305q1167Q8482K17910R0753o5832J0693k05241J35647J12156M062
7330F1365j38458k04844J26914k26128j11773K14L27609O8723L4962p2290J5640
7319a18066J49375j72166k34523N4277R1640J54625r0810J60L39798j00447k98950
$$ plain form
7308 -225087 -137753 -216667 28819 187124 348029 238470 121167 40022 -114767 -118468 23253
7297 23253 -4064 -137780 -147444 -165305 -131901 -101573 -374947 -424549 -136501 124562 152871
7286 152871 36100 -45829 14273 4407 -53862 -135383 21101 14027 97210 -84019 -259796
7275 -259796 -470610 -368045 -163677 -183977 -296860 -301479 -86405 147520 342231 266249
7265 266249 239913 -113319 -41533 -201897 -534852 -411886 -178528 -340646 -459836 -443975
7255 -443975 -266007 5350 123788 -45390 59558 103676 229867 274975 359220 320526
7245 320526 79816 -20817 -79372 -63474 -153603 -172755 -95033 -79961 -162902 -194814 -320393
7234 -320393 -237646 -65570 91074 -2710 -137975 -14233 -71841 -138636 37676 61901 187025
$$ packed form
7308b25087Q7334p8914K45486J58305J60905j09559j17303q1145j54789l701J41721
7297B3253k7317j33716r664j7861L3404L0328k73374m9602K88048K61063K8309
7286A52871j16771q1929O0102r866n8269q1521J56484p074Q3183j81229j75777
7275b59796k10814J02565K04368k0300j12883m619K15074K33925J94711p5982
7265B66249k6336l53232P1786j60364l32955J22966K33358j62118j19190J5861
7255d43975J77968K71357J18438j69178J04948M4118J26191M5108Q4245l8694
7245C20526k40710j00633n8555J5898r0129j9152P7722J5072q2941l1912j25579
7234c20393Q2747J72076J56644r3784j35265J23742n7608o6795J76312K4225J25124
$$ plain form
7223 187025 225957 81008 135774 277218 221459 206799 114087 -5472 314866 280615 200211
7212 200211 134656 -64271 -116792 -168447 -19175 78607 129786 -58525 -97702 -22164 -313857
7201 -313857 -248848 -68635 -160725 -204747 -297547 -214670 -127158 -227657 -108 143205 13937
7190 13937 -54772 -14035 81755 -159344 -320133 -248305 -88843 88183 184202 329957 454387
7179 454387 319407 141200 99642 -67168 -31004 -253752 -661722 -665562 -327090 -23667
7169 -23667 311993 187951 -165667 -137562 -129701 -220453 82279 110810 -113459 -159277 -264851
7158 -264851 -453420 -369353 -274087 -161803 -59169 224776 167061 186428 194938 59103 -120596
7147 -120596 -197929 -16489 87020 151813 29400 -52109 -20137 -114067 -189878 -65105 -69886
$$ packed form
7223A87025L8932j44949N4766J41444n5759j4660r2712j19559L20338l4251q0404
7212B00211o5555j98927n2521n1655J49272R7782N1179j88311l9177P5538k91693
7201c13857O5009J80213r2090m4022r2800Q2877Q7512j00499K27549J43313j29268
7190A3937o8709M0737R5790k41099j60789P1828J59462J77026R6019J45755J24430
7179D54387j34980j78207m1558j66810L6164k22748m07970l840L38472L03423
7169b3667L35660j24042l53618K8105P861r0752L02732K8531k24269m5818j05574
7158b64851j88569Q4067R5266J12284J02634K83945n7715J9367Q510j35835j79699
7147a20596p7333J81440J03509O4793j22413q1509L1972r3930p5811J24773m781
$$ plain form
7136 -69886 -126164 -165469 -311726 -107402 -13501 -73758 -92129 50482 21796 -271171 -241524
7125 -241524 -188043 -213640 -214937 15576 203500 100055 24796 22916 19216 -61472 -97225 80515
7113 80515 202977 276840 115967 -45638 -213950 -234466 -240694 -223691 -1407 -36460 -216246
7102 -216246 -263139 -103695 185167 316840 320465 322954 233444 66885 181262 42839 -128183
7091 -128183 -180363 -367785 -301602 -193605 -272922 -312202 -283818 -433894 -442949 -342377 -270998
7080 -270998 -62803 139348 123676 39684 -22531 -22554 -125556 145893 -17800 -121609 -41907
7069 -41907 64927 -83554 -242085 -422785 13928 210716 33407 -96058 -155310 -99808
7059 -99808 -26295 -59796 -249342 -202509 27201 -24553 -89386 -469416 -485070 -301572 -323638
$$ packed form
7136f9886n6278l9305j46257K04324R3901o0257j8371J42611k8686k92967K9647
7125b41524N3481k5597j297K30513J87924j03445p5259j880l700q0688l5753J77740
7113H0515J22462P3863j60873j61605j68312k0516o228J7003K22284l5053j79786
7102b16246m6893J59444K88862J31673L625K489q9510j66559J14377j38423j71022
7091a28183n2180j87422O6183J07997p9317l9280K8384j50076r055J00572P1379
7080b70998K08195K02151j5672q3992o2215k3j03002K71449j63693j03809P9702
7069d1907J06834j48481j58531j80700M36713J96788j77309j29465n9252N5502
7059i9808P3513l3501j89546M6833K29710n1754o4833l80030j5654J83498k2066
$$ plain form
7048 -323638 -498465 -529099 -310079 -323775 -66606 96156 65668 -114971 -161963 4711
7038 4711 235207 148132 -32166 -123618 4483 -51082 -82971 -13317 -356028 -437174 -462320
7027 -462320 -398033 -264400 -71268 -47764 181651 294765 228483 -4639 -52253 -28399 -18387
7016 -18387 -250651 -418664 -343071 -208130 -104396 -152429 6656 -23262 -266111 -360580 -134861
7005 -134861 -200684 -130444 17619 -96013 -265416 -315353 -254088 -73136 77940 108868 291473
6994 291473 243000 290499 188358 141877 38704 -148238 -379412 -364158 -338954 -304188 -367915
6983 -367915 -300212 -121223 -205924 -351380 -376298 -298536 -160326 -40970 -94677 -66033 124153
6972 124153 -45405 -138659 -205430 -185124 -172499 56656 371960 201147 298605 86888 -350906
$$ packed form
7048c23638j74827l0634K19020j3696K57169J62762l0488j80639m6992J66674
7038D711K30496q7075j80298r1452J28101n5565l1889O9654l42711q1146k5146
7027d62320O4287J33633J93132K3504K29415J13114o6282k33122m7614K3854J0012
7016a8387k32264j68013P5593J34941J03734m8033J59085k9918k42849r4469K25719
7005a34861o5823P0240J48063j13632j69403m9937O1265J80952J51076L0928J82605
6994B91473m8473M7499j02141m6481j03173j86942k31174J5254K5204L4766o3727
6983c67915O7703J78989q4701j45456k4918P7762J38210J19356n3707K8644J90186
6972A24153j69558r3254o6771K0306J2625K29155L15304j70813R7458k11717m37794
$$ plain form
6961 -350906 -414773 -110597 88538 65912 -39391 -270181 -44197 113563 110712 242822
6951 242822 74037 5419 81169 116581 112755 -184759 -305444 22568 337031 601599 471812
6940 471812 149815 48299 46442 137290 149586 119153 -19844 -48968 -37024 -213929 -103909
6929 -103909 149269 180905 39981 36647 -102825 -23562 101888 201327 276192 96035 87905
6918 87905 295619 14557 -5219 193934 117934 126312 279764 246995 180659 195470 81171
6907 81171 -121332 95466 199383 141299 77068 74655 128394 152972 140829 -189532 -304687
6896 -304687 -333202 -193403 -272320 -282765 41045 447823 463020 362495 218445 167309 42698
6885 42698 -193245 -214623 -301085 -175859 -90606 -128769 -100446 -85510 -126971 31910 97361
$$ packed form
6961c50906o3867L04176J99135k2626j05303k30790K25984J57760k851J32110
6951B42822j68785o8618P5750L5412l826k97514j20685L28012L14463K64568j29787
6940D71812l21997j01516j857R0848J2296l0433j38997k9124J1944j76905J10020
6929a03909K53178L1636j40924l334j39472P9263J25450R9439P4865j80157q130
6918H7905K07714k81062j9776J99153p6000Q378J53452l2769o6336J4811j14299
6907H1171k02503K16798J03917n8084o4231k413N3739K4578j2143l30361j15155
6896c04687k8515J39799p8917j0445L23810M06778J5197j00525j44050n1136j24611
6885D2698k35943k1378q6462J25226Q5253l8163K8323J4936m1461J58881O5451
$$ plain form
6874 97361 186490 290934 358987 346987 212221 -8022 -216402 -90339 170225 224339 293858
6863 293858 26514 -244491 -161306 -108772 181750 156552 44818 12974 -119915 -77964 -18033
6852 -18033 84953 52199 -105374 -99569 100051 230391 49446 -196041 -260216 -169865 -34957
6841 -34957 -142252 168104 547745 324224 48001 -254323 -154600 91756 116736 29666
6831 29666 -17109 11337 -117103 110652 281444 243542 335498 232578 -72700 -37992 153466
6820 153466 323903 215826 22724 -51632 55309 -175773 -90870 48302 187350 220948
6810 220948 181177 278169 114176 -58524 -86443 -149005 -265020 -237536 -91304 -48136 -204899
6799 -204899 -192406 -315044 -85438 146242 80408 -8997 74958 -12502 -71928 -146436 -124702
$$ packed form
6874I7361Q9129J04444O8053j2000j34766k20243k08380J26063K60564N4114O9519
6863B93858k67344k71005Q3185N2534K90522k5198j11734l1844j32889M1951N9931
6852a8033J02986l2754j57573N805J99620J30340j80945k45487o4175R0351J34908
6841c4957j07295L10356L79641k23521k76223l02324R9723K46356K4980q7070
6831B9666m6775K8446j28440K27755J70792l7902R1956j02920l05278L4708J91458
6820A53466J70437j08077j93102p4356J06941k31082Q4903J39172J39048L3598
6810B20948l9771R6992j63993j72700k7919o2562j16015K7484J46232M3168j56763
6799b04899J2493j22638K29606K31680o5834q9405Q3955q7460n9426p4508K1734
$$ plain form
6788 -124702 -52292 22070 150804 288884 249901 197645 161642 179375 -381 -255753 -383720
6777 -383720 -202094 -113619 -239402 -243221 -123938 61878 1871 -85706 -4755 -40151 78637
6766 78637 131268 -9061 84698 182071 89854 -1638 25079 -17577 4886 153188 96994
6755 96994 -73259 934 245649 381596 219349 -134595 -250417 -161734 -13369 110455
6745 110455 59658 127218 226938 129227 25878 -192450 -228847 -191817 -207258 -180967 -164480
6734 -164480 33907 279106 219528 159161 422619 534274 475115 357777 188317 217738
6724 217738 215728 228604 412935 344288 261299 181058 208384 252689 131870 130679 349090
6713 349090 324846 279887 346433 482308 497044 334550 165401 233213 400409 472653 385553
$$ packed form
6788a24702P2410P4362J28734J38080l8983n2256l6003J7733j79756k55372j27967
6777c83720J81626Q8475j25783l819J19283J85816o0007q7577Q0951l5396J18788
6766G8637N2631j40329R3759R7373r2217r1492K6717m2656K2463J48302n6194
6755I6994j70253P4193K44715J35947j62247l53944j15822Q8683J48365J23824
6745A10455n0797O7560R9720r7711j03349k18328l6397L7030j5441K6291J6487
6734a64480J98387K45199n9578o0367K63458J11655n9159j17338j69460K9421
6724B17738k010J2876J84331o8647q2989q0241K7326M4305j20819j191K18411
6713C49090k4244m4959O6546J35875J4736j62494j69149O7812J67196P2244q7100
$$ plain form
6702 385553 323026 192805 -27474 -64939 44394 41926 -113542 -14673 68767 183611 385979
6691 385979 479300 314348 329829 340838 377588 398962 394779 398682 120116 -58794 -29728
6680 -29728 -88612 57727 229025 151121 293215 519610 671822 593516 557112 468426 241389
6669 241389 59619 304912 300544 344968 375244 466384 487427 411622 367307 206749 136384
6658 136384 184565 270079 250354 540519 549395 431802 277449 254068 118725 73729 310380
6647 310380 417559 317870 236074 24700 201537 448891 290916 366223 367981 335806 207535
6636 207535 57569 416140 454828 238823 339583 138172 116576 239812 284167 63408
6626 63408 10166 64239 249020 264257 290825 483477 416490 502558 781185 875023 610372
$$ packed form
6702C85553o2527j30221k20279l7465J09333k468j55468R8869Q3440J14844K02368
6691C85979R3321j64952J5481J1009L6750K1374m183L903k78566j78910K9066
6680b9728n8884J46339J71298p7904J42094K26395J52212p8306l6404q8686k27037
6669B41389j81770K45293m368M4424L0276R1140K1043p5805m4315j60558p0365
6658A36384M8181Q5514j9725K90165Q876j17593j54353k3381j35343m4996K36651
6647C10380J07179r9689q1796k11374J76837K47354j57975P5307J758l2175j28271
6636B07535j49966L58571L8688k16005J00760k01411k1596J23236M4355k20759
6626F3408n3242N4073J84781J5237K6568J92652o6987Q6068K78627R3838k64651
$$ plain form
6615 610372 510490 597484 652270 669642 590562 667331 668871 611423 537797 226346 136626 305617
6603 305617 414200 419567 397785 548926 464938 356485 374521 549405 598639 470353 451568
6592 451568 301840 469780 740132 813712 772963 723868 734824 804735 891499 1108921 1252309
6581 1252309 1240947 980346 783621 866017 894622 958246 923719 1216784 1186829 1000106 821314
6570 821314 801546 873779 917109 860908 1031949 1159635 833356 687376 789092 878411 1085141
6559 1085141 1396679 1518384 1721558 1567678 1685156 1896404 1831046 1827239 1780325 1682477
6549 1682477 1554793 1665708 1947259 2166088 2452467 2746759 2902536 2906386 2860388 2930410
6539 2930410 2990123 3305544 3730243 4099048 4131857 4125417 4210383 4109289 3710298 3657332 3574853
$$ packed form
6615F10372r9882Q6994N4786J7372p9080P6769J540n7448p3626l11451q9720J68991
6603C05617J08583N367k1782J51141q3988j08453J8036J74884M9234j28286j8785
6592D51568j49728J67940K70352P3580m0749m9095J0956O9911Q6764K17422J43388
6581A252309j1362k60601j96725Q2396K8605O3624l4527K93065k9955j86723j78792
6570H21314j9768P2233M3330n6201J71041J27686l26279j45980J01716Q9319K06730
6559A085141L11538J21705K03174j53880J17478K11248o5358l807m6914r7848
6549A682477j27684J10915K81551K18829K86379K94292J55777L850m5998P0022
6539B930410N9713L15421M24699L68805L2809o440Q4966j01094l98991n2966q2479
$$ plain form
6528 3574853 3566400 3327092 3220727 3244394 3144326 2960809 2817003 2852624 2786373 2442875
6518 2442875 2370542 2338800 2204224 2265380 2100243 2000988 1967726 1781427 1598024 1604867 1800097
6507 1800097 1765654 1590466 1605438 1451719 1422693 1417918 1271831 1245026 1013057 1047700 1060826
6496 1060826 958742 1055467 1085312 916222 914749 957096 808216 789377 786286 902042 837471
6485 837471 895685 1064123 1148093 1044322 1063348 1107837 1178389 1396763 1183533 962982 847874
6474 847874 689820 731401 831592 929562 1082157 998585 637902 409176 282542 288303 665775
6463 665775 774522 802354 619023 517233 680283 688166 723316 587005 441274 202760
6453 202760 74022 44253 215366 522152 541189 577029 344410 417458 514853 661629 619243
$$ packed form
6528C574853q453k39308j06365K3667j00068j83517j43806L5621o6251l43498
6518B442875p2333l1742j34576O1156j65137r9255l3262j86299j83403O843J95230
6507A800097l4443j75188J4972j53719k9026m775j46087k6805k31969L4643J3126
6496A060826j02084R6725K9845j69090j473M2347j48880j8839l091J15756o4571
6485H37471N8214J68438Q3970j03771J9026M4489P0552K18374k13230k20551j15108
6474H47874j58054M1581J00191R7970J52595q3572l60683k28726j26634N761L77472
6463F65775J08747K7832j83331j01790J63050P883L5150j36311j45731k38514
6453B02760j28738k9769J71113L06786J9037L5840k32619P3048R7395J46776m2386
$$ plain form
6442 619243 520930 247364 186690 206600 41320 -100884 -106692 43757 281306 646230 584145
6431 584145 520654 598014 762867 653204 392396 124724 -66944 47497 -90231 -300541
6421 -300541 -209606 -75641 6443 902 191634 382751 253909 118448 75076 232225 441980
6410 441980 503594 428245 330670 129602 207545 227200 105421 123438 284724 358395 146389
6399 146389 120495 119606 327631 136703 97118 194249 172721 247864 262671 106581 132999
6388 132999 186599 -26772 10559 145886 178895 291180 407354 390901 246778 209410 77604
6377 77604 105889 369532 153571 -48227 -121368 -63419 -65980 24347 -92795 -45216 168795
6366 168795 231992 134124 -180994 -170761 -32401 72347 -94573 -202595 31741 126490
$$ packed form
6442F19243r8313k73566o0674J9910j65280j42204n808J50449K37549L64924o2085
6431E84145o3491P7360J64853j09663k60808k67672j91668J14441j37728k10310
6421c00541R0935J33965Q2084n541J90732J91117j28842j35461m3372J57149K09755
6410D41980O1614p5349r7575k01068P7943J9655j21779J8017J61286P3671k12006
6399A46389k5894q89K08025j90928l9585R7131k1528P5143J4807j56090K6418
6388A32999N3600k13371L7331J35327L3009J12285J16174j6453j44123l7368j31806
6377G7604K8285K63643k15961k01798p3141N7949k561R0327j17142M7579K14011
6366A68795O3197r7868l15118J0233J38360J04748j66920j08022K34336R4749
$$ plain form
6356 126490 63635 -6295 81301 -54619 1196 177485 106723 -197119 -350040 -222545 -267118
6345 -267118 -234371 -89520 -104985 -313562 -186388 -59275 87831 184363 368688 330603
6335 330603 381668 264237 404152 401001 137819 -99319 -352462 -491360 6701 533626
6325 533626 321559 119982 128299 38081 -48083 -71353 -320899 -238396 -4870 98002 -26253
6314 -26253 -139626 62704 94456 222320 288479 283245 200765 324367 319424 185822 176848
6303 176848 -55765 -50447 -47649 -14036 71045 322710 336954 311349 473705 447576 329814
6292 329814 266172 294239 372511 367610 536255 499048 335087 155179 -8640 -131679 -239777
6281 -239777 -306918 -102576 47395 -55409 -40464 -65918 -113684 -309955 -242591 -219629 -143656
$$ packed form
6356A26490o2855o9930Q7596j35920N5815J76289p0762l03842j52921J27495m4573
6345b67118L2747J44851j5465k08577J27174J27113J47106R6532J84325l8085
6335C30603N1065j17431J39915l151k63182k37138k53143j38898M98061N26925
6325E33626k12067k01577Q317r0218q6164k3270k49546Q2503K33526J02872j24255
6314b6253j13373K02330L1752J27864O6159n234q2480J23602m943j33602q974
6303A76848k32613N318K798L3613Q5081K51665J4244k5605J62356k6129j17762
6292C29814o3642K8067P8272m901J68645l7207j63961j79908j63819j23039j08098
6281b39777o7141K04342J49971j02804J4945k5454m7766j96271O7364K2962P5973
$$ plain form
6270 -143656 -38565 -146217 -158877 -36610 -76874 41907 162718 112480 100427 -76642
6260 -76642 -79582 -74762 218328 302224 345090 190826 215164 273827 112713 150618 428306
6249 428306 265873 319162 502899 523930 333750 213165 352220 402556 460035 357627
6239 357627 100830 52154 150347 259134 112922 -218143 -199440 7086 78910 46459 -4443
6228 -4443 35016 310990 465567 206897 1669 31707 155678 155279 -49631 43255 212406
6217 212406 214557 -21399 -111724 -87827 -114258 27470 -111793 -141961 -144091 -166606 155811
6206 155811 219046 34009 -97578 137076 107619 -303665 -201251 -162094 -15892 23328
6196 23328 -259706 -292360 -166676 -38215 -269987 -44209 -34998 53280 143557 113981 165158
$$ packed form
6270a43656J05091j07652j2660J22267m0264J18781J20811n0238j2053j77069
6260g6642k940M820K93090Q3896M2866j54264K4338N8663j61114L7905K77688
6249D28306j62433N3289J83737K1031j90180j20585J39055N0336N7479j02408
6239C57627k56797m8676R8193J08787j46212l31065J8703K06526P1824l2451n0902
6228d443L9459K75974J54577k58670k05228L0038J23971l99k04910R2886J69151
6217B12406K151k35956r0325K3897k6431J41728j39263l0168k130k2515L22417
6206A55811O3235j85037j31587K34654k9457m11284J02414L9157J46202L9220
6196B3328k83034l2654J25684J28461k31772K25778R211Q8278R0277k9576N1177
$$ plain form
6185 165158 37403 -167888 -149565 13179 283952 322021 209833 326465 510711 464639
6175 464639 148422 -161500 -303403 -438591 -329934 -340796 -281712 -59289 23437 105433
6165 105433 268653 459056 420015 421297 279172 501639 541785 359029 114052 89145 -63063
6154 -63063 -157203 -29038 -41061 -140985 -214084 77046 49425 -154893 -347318 -305450 -141644
6143 -141644 -107954 -65925 -79465 -68293 72107 -55088 -44230 37444 -119606 -178625 -249997
6132 -249997 -223593 -258028 -108792 3382 84445 14373 -234377 -150595 109358 335473 377016
6121 377016 208276 -102233 19457 153313 94242 -66129 -155765 -62370 209303 293180
6111 293180 36819 -130485 -153273 -100011 -50233 58420 58446 140694 273991 100927 147124
$$ packed form
6185A65158j27755k05291J8323J62744K70773L8069j12188J16632J84246m6072
6175D64639l16217l09922j41903j35188J08657j0862N9084K22423Q2726Q1996
6165A05433J63220J90403l9041J282j42125K22467M0146j82756k44977k4907j52208
6154f3063r4140J28165j2023r9924p3099K91130k7621k04318j92425M1868J63806
6143a41644L3690M2029j3540J1172J40400j27195J0858Q1674j57050n9019p1372
6132b49997K6404l4435J49236J12174Q1063p0072k48750Q3782K59953K26115M1543
6121C77016j68740l10509J21690J33856n9071j60371q9636R3395K71673Q3877
6111B93180k56361j67304k2788N3262M9778J08653K6Q2248J33297j73064M6197
$$ plain form
6100 147124 54614 17733 -12639 171056 136014 92714 -40294 -170294 88663 -19431 -154059
6089 -154059 -120831 97831 -30549 -36587 -41661 -23277 150852 13061 -284259 27130 46232
6078 46232 149817 204314 35531 -152392 -344260 107047 303513 125124 -209900 -229164
6068 -229164 -302564 -427327 -13400 289344 450590 231857 56254 171070 197786 282257
6058 282257 584260 349955 180678 111043 208649 -4274 -79376 -177364 -180655 -40612 66809
6047 66809 -328 -132735 32772 22740 260952 334577 28591 -27145 -72632 -171383 -109537
6036 -109537 99595 -23382 -346790 -270361 -158469 -67035 -44763 200308 186459 274469 535031
6025 535031 431206 139927 60595 149891 337473 293937 76739 -14752 123445 231117
$$ packed form
6100A47124r2510l6881l0372J83695l5042m3300j33008j30000K58957j08094j34628
6089a54059L3228K18662j28380o038n074J8384J74129j37791k97320L11389J9102
6078D6232J03585N4497j68783j87923j91868M51307J96466j78389l35024j9264
6068b29164p3400j24763M13927L02744J61246k18733j75603J14816K6716Q4471
6058B82257L02003k34305j69277o9635R7606k12923p5102r7988l291J40043J07421
6047F6809o7137j32407J65507j0032K38212P3625l05986n5736m5487r8751O1846
6036a09537K09132j22977l23408P6429J11892R1434K2272K45071j3849Q8010K60562
6025E35031j03825k91279p9332Q9296J87582m3536k17198r1491J38197J07672
$$ plain form
6015 231117 179408 181012 -19242 -6961 116486 63813 30231 175709 -107378 -342089 -244992
6004 -244992 -51051 -28936 -1164 78501 286562 276869 182642 367250 197956 -176804 15897
5993 15897 121729 142215 198069 72416 153262 213915 345713 450082 285163 137477 72644
5982 72644 6630 54372 -84732 -85575 -48135 -79361 -62979 75618 10772 -252759 -266888 -161389
5970 -161389 -145204 -236037 -207859 -135601 128699 166163 81494 91334 -33399 -81806 -290761
5959 -290761 -434629 -163742 -35318 -120247 -53368 -33680 23972 -22771 -86923 -140709 -127686
5948 -127686 -200547 -86009 -8397 63172 10808 -18420 17871 -165115 -433097 -534903 -459982
5937 -459982 -292277 -116815 112428 384930 280386 1210 -49121 21200 -41781 -166366
$$ packed form
6015B31117n1709J604k00254J2281J23447n2673l3582J45478k83087k34711R7097
6004b44992J93941K2115K7772P9665K08061r693r4227J84608j69294l74760J92701
5993A5897J05832K0486N5854j25653Q0846O0653J31798J04369j64919j47686o4833
5982G2644o6014M7742j39104q43L7440l1226J6382J38597o4846k63531j4129J05499
5970a61389J6185r0833K8178P2258K64300L7464q4669R840j24733m8407k08955
5959b90761j43868K70887J28424q4929O6879J9688N7652m6743o4152n3786J3023
5948a27686p2861J14538P7612P1569n2364k9228L6291j82986k67982j01806P4921
5937d59982J67705J75462K29243K72502j04544k79176n0331P0321o2981j24585
$$ plain form
5927 -166366 -257113 -448194 -677377 -661463 -348967 -232618 -378535 -501352 -561949 -493462
5917 -493462 -267461 -131471 -15329 -166736 -150668 -175353 -42358 -147893 58629 268005
5907 268005 202432 158217 -10003 -182173 134131 358926 351588 447121 426992 349573 519175
5896 519175 441726 236645 61491 57545 84793 133503 5901 -269302 -190486 56892 -21263
5885 -21263 -407865 -257872 -25872 61148 157280 100798 19570 -222893 -217762 -161244 -156688
5874 -156688 230681 442126 476509 143179 -151170 -243020 -118261 -309610 -473006 -509109
5864 -509109 -469925 -270911 -118523 -134779 -203910 -286936 -173922 9037 121012 31732 -149818
5853 -149818 -71170 190746 426827 444923 553023 562467 312666 -42957 -400727 -498575 -311585
$$ packed form
5927a66366r0747j91081k29183J5914L12496J16349j45917j22817o0597O8487
5917d93462K26001J35990J16142j51407J6068k4685J32995j05535K06522K09376
5907B68005o5573m4215j68220j72170L16304K24795p338R5533k0129p7419J69602
5896E19175p7449k05081j75154l946K7248M8710j27602k75203P8816K47378p8155
5885b1263l86602J49993K32000Q7020R6132n6482q1228k42463N131N6518M556
5874a56688L87369K11445L4383l33330k94349r1850J24759j91349j63396l6103
5864e09109L9184J99014J52388j6256o9131q3026J13014J82959J11975q9280j81550
5853a49818P8648K61916K36081J8096J08100R444k49801l55623l57770r7848J86990
$$ plain form
5842 -311585 236792 372358 327893 201023 -13472 -192740 -239259 -304414 -204064 33301
5832 33301 -208584 -335723 -357214 -182163 -18576 -16192 -85628 99375 -100298 -110022 -215889
5821 -215889 -306623 -75419 -9241 -52938 -15675 341118 471896 246562 152808 23755 256832
5810 256832 215168 70230 64511 35425 74544 114145 329689 94339 -77690 64839 236337
5799 236337 53353 -232208 -331426 -272018 -51749 2791 45685 -4014 -116761 54539 187132
5788 187132 250112 270532 -19717 -179466 -131286 62688 93495 -185305 -208495 -319326 -202003
5777 -202003 -205380 -16761 249509 393712 172766 173933 166587 -149238 -337512 -214227 -78002
5766 -78002 -87333 -221296 -222007 -330876 -188280 172194 471260 379317 72667 37952 153357
$$ packed form
5842c11585N48377J35566m4465j26870k14495j79268m6519o5155J00350K37365
5832C3301k41885j27139k1491J75051J63587K384o9436J85003j99673r724j05867
5821b15889r0734K31204O6178m3697L7263L56793J30778k25334r3754j29053K33077
5810B56832m1664j44938n719k9086L9119L9601K15544k35350j72029J42529J71498
5799B36337j82984k85561r9218N9408K20269N4540M2894m9699j12747J71300J32593
5788A87132O2980K0420k90249j59749M8180J93974L0807k78800k3190j10831J17323
5777b02003l377J88619K66270J44203k20946J167p346l15825j88274J23285J36225
5766g8002r331j33963p11j08869J42596L60474K99066r1943l06650l4715J15405
$$ plain form
5755 153357 46146 200337 230879 -43388 -533772 -541275 -242579 -200937 -265950 -120239 -206619
5744 -206619 -475451 -554874 -514230 -493909 -380902 -168200 -152316 -172507 -339445 -386221 -192590
5733 -192590 67905 271998 242050 -77272 -83984 -36212 105395 183313 79560 -138627 -231596
5722 -231596 -271132 -365224 -220102 191090 323287 193254 250584 266703 202492 319425 99771
5711 99771 -83516 -25823 18303 105779 -11887 94358 197085 -4283 23492 41314 -135650
5700 -135650 101562 151701 65480 137536 191848 24408 -208194 -345335 -349634 -265913 -236459
5689 -236459 -304097 -311690 -325326 -125733 91269 151267 188489 174208 63954 112639 179366
5678 179366 192436 232237 86325 167061 376404 339555 145439 50646 52711 -127094 -259187
$$ packed form
5755A53357j07211J54191L0542k74267m90384p503K98696M1642o5013J45711q6380
5744b06619k68832p9423M0644K0321J13007K12702J5884k0191j66938m6776J93631
5733a92590K60495K04093k9948l19322o712M7772J41607P7918j03753k18187r2969
5722b31596l9536r4092J45122M11192J32197j30033N7330J6119o4211J16933k19654
5711I9771j83287N7693M4126Q7476j17666J06245J02727k01368K7775J7822j76964
5700a35650K37212N0139q6221P2056N4312j67440k32602j37141m299Q3721K9454
5689b36459o7638p593j3636J99593K17002N9998L7222j4281j10254M8685O6727
5678A79366J3070L9801j45912Q0736K09343l6849j94116r4793K065j79805j32093
$$ plain form
5667 -259187 -371317 -141181 -136935 -104053 255780 54443 -246288 -245851 -78220 -127061 -67592
5656 -67592 -48240 28065 20854 -72447 -8838 65350 248653 141404 50241 -332434 -335848 -368644
5644 -368644 -113394 -63628 -71730 5550 -56633 -4323 -119368 -383212 -110051 83485 -193591
5633 -193591 -284477 -46273 6190 -63680 143728 231059 117460 -50159 114863 325875
5623 325875 286901 116285 213653 260312 120451 201151 80846 45172 277560 1178 -230400
5612 -230400 13858 355713 212952 -71571 79889 140831 9645 86693 -66778 -8294
5602 -8294 238742 229539 25143 -151606 -289166 -359927 -444148 -253459 -103421 191562 208550
5591 208550 223455 30239 -194648 -99715 -211522 -264900 -157464 112610 84778 269724
$$ packed form
5667b59187j12130K30136M246L2882L59833k01337l00731M37J67631m8841N9469
5656f7592J9352P6305p211r3301O3609P4188J83303j07249r1163l82675l414l2796
5644c68644K55250M9766q102P7280o2183N2310j15045k63844K73161J93536k77076
5633a93591r0886K38204N2463o9870K07408Q7331j13599j67619J65022K11012
5623C25875l8974j70616R7368M6659j39861Q0700j20305l5674K32388k76382k31578
5612b30400K44258L41855j42761k84523J51460O0942j31186P7048j53471N8484
5602h294K47036r203k04396j76749j37560p0761q4221J90689J50038K94983J6988
5591B08550J4905j93216k24887R4933j11807n3378J07436K70074k7832J84946
$$ plain form
5581 269724 254217 320351 285234 372965 498928 336905 335067 422730 159113 164202 225352
5570 225352 85178 182295 262459 176338 -53631 -79681 -47528 39080 28999 131300 357868
5559 357868 438312 454397 59182 -102288 -120571 -65327 -12290 278665 221585 -90781 1636
5548 1636 202421 316179 22590 -56936 143720 -22526 -31071 47413 61808 20703 59013
5537 59013 57974 59759 -72696 -183403 -297682 -64393 129688 217564 106679 -154611 -444481
5526 -444481 -399867 -262972 -141012 -60544 -105746 49373 402737 365574 8162 38526 221378
5515 221378 187974 175394 312712 207520 141359 18332 -30450 1006 -25463 136855 -74806
5504 -74806 -155863 -34991 182352 223010 255643 222657 355831 52345 -18230 49449 57307
$$ packed form
5581B69724j5507O6134l5117Q7731J25963j62023j838Q7663k63617N089O1150
5570B25352j40174R7117Q0164q6121k29969k6050L2153Q6608j0081J02301K26568
5559C57868Q0444J6085l95215j61470j8283N5244N3037K90955n7080l12366R2417
5548A636K00785J13758k93589p9526K00656j66246q545P8484J4395m1105L8310
5537E9013j039J785j32455j10707j14279K33289J94081Q7876j10885k61290k89870
5526d44481M4614J36895J21960Q0468m5202J55119L53364l7163l57412L0364J82852
5515B21378l3404j2580J37318j05192o6161j23027m8782L1456k6469J62318k11661
5504g4806q1057J20872K17343M0658L2633l2986J33174l03486p0575O7679P858
$$ plain form
5493 57307 -150163 -457932 -568580 -446552 -153652 -30837 89289 117224 -88690 -27013
5483 -27013 171954 188381 -58707 -53201 -195 44720 39538 57067 266855 299955 222599 -90009
5471 -90009 -508840 -510351 -401231 -502652 -521237 -381015 -348405 -296451 -459703 -517169 -542068
5460 -542068 -335726 -27245 92966 -13706 -258108 -177716 -41289 104921 251587 225443
5450 225443 234500 264598 468350 523684 463845 266543 64824 164593 181006 46491 -111243
5439 -111243 -200258 53338 -7391 -400446 -115233 -65878 -114257 -90402 76293 210209 238896
5428 238896 59198 -169633 82734 -74386 -486283 -380489 -125776 -33293 -76130 -161362
5418 -161362 -63868 25999 85673 -1205 -265120 -298521 -288669 -174783 -75151 -207792 -186105
$$ packed form
5493E7307k07470l07769j10648J22028K92900J22815J20126K7935k05914O1677
5483b7013J98967J6427k47088N506N3006M4915n182J7529K09788L3100p7356l12608
5471i0009m18831j511J09120j01421j8585J40222L2610N1954j63252n7466k4899
5460e42068K06342L08481J20211j06672k44402Q0392J36427J46210J46666k6144
5450B25443R057L0098K03752N5334n9839j97302k01719R9769J6413j34515j57734
5439a11243q9015K53596o0729l93055K85213M9355m8379K3855J66695J33916K8687
5428B38896j79698k28831K52367j57120m11897J05794K54713R2483m2837q5232
5418a61362R7494Q9867N9674q6878k63915l3401R852J13886R9632j32641K1687
$$ plain form
5407 -186105 -13024 -111427 -467145 -257497 -273594 -253293 -183470 -110445 78648 125050 94183
$$ packed form
5407a86105J73081r8403l55718K09648j6097K0301O9823P3025J89093M6402l0867
$$ [...]
##END NTUPLES=NMR SPECTRUM
##END=
