##TITLE=Analysis number 320780
Compound Code mo 07401
Project Code adrs
Chemist Name frontier sci
##JCAMPDX= 6.0         $$ Bruker NMR JCAMP-DX V2.0
##DATA TYPE= NMR SPECTRUM
##DATA CLASS= NTUPLES
##ORIGIN= Bruker BioSpin GmbH
##OWNER= nmr
$$ XWIN-NMR		Version 3.5
$$ Mon Jul 10 14:34:29 2006 GMT Daylight Time (UT+1h)  MAYBRIDGE\nmr@NMR_250MHZ
##.OBSERVE FREQUENCY= 250.131544655141
##.OBSERVE NUCLEUS= ^1H
##.ACQUISITION MODE= SIMULTANEOUS (DQD)
##.ACQUISITION SCHEME= undefined
##.AVERAGES= 16
##.DIGITISER RES= 18
##SPECTROMETER/DATA SYSTEM= dpx250
##.PULSE SEQUENCE= zg30
##.SOLVENT NAME= DMSO
##.SHIFT REFERENCE= (INTERNAL, DMSO, 0, 16.522)
##AUDIT TRAIL= $$ (NUMBER, WHEN, WHO, WHERE, WHAT)
$$ ##TITLE= Audit trail, XWIN-NMR		Version 3.5
$$ ##JCAMPDX= 5.01
$$ ##ORIGIN= Bruker BioSpin GmbH
$$ ##OWNER= nmr
$$ C:\u/data/dgb/nmr/ADRS/2550/pdata/1/auditp.txt
$$ ##AUDIT TRAIL=  $$ (NUMBER, WHEN, WHO, WHERE, WHAT)
(   1,<2006-07-10 14:34:07.61 +100>,<MAYBRIDGE\nmr>,<NMR_250MHZ>,
      <created by zg, POWCHK disabled, PULCHK disabled
       configuration hash MD5:
       E2 DF 36 D8 04 B2 41 60 5A D7 A3 38 5A 4B D0 FE
       data hash MD5: 64K
       B5 C1 63 A7 67 A1 29 B3 23 26 24 16 1B 11 78 1F>)
(   2,<2006-07-10 14:34:21.00 +100>,<MAYBRIDGE\nmr>,<NMR_250MHZ>,
      <Start of raw data processing
       ef LB = 0.3 FT_mod = 6 PKNL = 1 SI = 32K 
       data hash MD5: 32K
       79 50 14 F0 87 3C AB 3E D7 18 CA 7D 67 09 E7 4E>)
(   3,<2006-07-10 14:34:22.59 +100>,<MAYBRIDGE\nmr>,<NMR_250MHZ>,
      <apk 
       data hash MD5: 32K
       14 15 CF 41 6B AE 98 41 0F 71 D9 10 00 2A A8 8E>)
(   4,<2006-07-10 14:34:23.40 +100>,<MAYBRIDGE\nmr>,<NMR_250MHZ>,
      <abs ABSG = 5 
       data hash MD5: 32K
       C8 E1 65 B7 E2 29 79 16 BD 64 CA B6 3B 00 D4 68>)
$$ ##END=
$$ 
$$ hash MD5
$$ B8 53 32 21 C1 FA AD 84 B4 71 1D E5 2F F4 AA 91
##$RELAX= 
##$RELAX= 
##$RELAX= 
##$RELAX= 
##$RELAX= 
##$RELAX= 
##$RELAX= 
$$ Bruker specific parameters
$$ --------------------------
##$DU= <C:\u>
##$EXPNO= 2550
##$NAME= <ADRS>
##$PROCNO= 1
##$TYPE= <nmr>
##$USER= <dgb>
##$AMP= (0..31)
100 100 100 100 100 100 100 100 100 100 100 100 100 100 100 100 100 100 
100 100 100 100 100 100 100 100 100 100 100 100 100 100 
##$AQSEQ= 0
##$AQ_mod= 3
##$AUNM= <au_zg>
##$AUTOPOS= <28 >
##$BF1= 250.13
##$BF2= 250.13
##$BF3= 250.13
##$BF4= 250.13
##$BF5= 500.13
##$BF6= 500.13
##$BF7= 500.13
##$BF8= 500.13
##$BYTORDA= 1
##$CFDGTYP= 0
##$CFRGTYP= 5
##$CHEMSTR= <none>
##$CNST= (0..31)
1 1 145 1 1 1 1 1 1 1 1 1 1 1 1 1 1 1 1 1 1 1 1 1 1 1 1 1 1 1 1 1 
##$CPDPRG= <>
##$CPDPRG1= <>
##$CPDPRG2= <>
##$CPDPRG3= <>
##$CPDPRG4= <mlev>
##$CPDPRG5= <mlev>
##$CPDPRG6= <mlev>
##$CPDPRG7= <mlev>
##$CPDPRG8= <mlev>
##$CPDPRGB= <>
##$CPDPRGT= <>
##$D= (0..31)
0 1 0 0 0 0 0 0 0 0.06 0 0 0 0 0 0 0.0002 0 0 0 0 0 0 0 0 0 0 0 0 0 0 
0 
##$DATE= 1152538446
##$DBL= (0..7)
120 120 120 120 120 120 120 120 
##$DBP= (0..7)
150 150 150 150 150 150 150 150 
##$DBP07= 0
##$DBPNAM0= <>
##$DBPNAM1= <>
##$DBPNAM2= <>
$$ [...]
##$SUBNAM7= <"">
##$SUBNAM8= <"">
##$SUBNAM9= <"">
##$SW= 20.6930455092707
##$SWIBOX= (0..15)
0 0 3 0 0 0 0 0 0 0 0 0 0 0 0 0 
##$SW_h= 5175.983436853
##$TD= 65536
##$TD0= 1
##$TE= 296.16
##$TE2= 300
##$TE3= 300
##$TEG= 300
##$TL= (0..7)
0 120 120 120 120 120 120 120 
##$TP= (0..7)
150 150 150 150 150 150 150 150 
##$TP07= 0
##$TPNAME0= <>
##$TPNAME1= <>
##$TPNAME2= <>
##$TPNAME3= <>
##$TPNAME4= <>
##$TPNAME5= <>
##$TPNAME6= <>
##$TPNAME7= <>
##$TPOAL= (0..7)
0.5 0.5 0.5 0.5 0.5 0.5 0.5 0.5 
##$TPOFFS= (0..7)
0 0 0 0 0 0 0 0 
##$TUNHIN= 0
##$TUNHOUT= 0
##$TUNXOUT= 0
##$USERA1= <user>
##$USERA2= <user>
##$USERA3= <user>
##$USERA4= <user>
##$USERA5= <user>
##$V9= 5
##$VALIST= <valist>
##$VCLIST= <CCCCCCCCCCCCCCC>
##$VD= 0
##$VDLIST= <DDDDDDDDDDDDDDD>
##$VPLIST= <PPPPPPPPPPPPPPP>
##$VTLIST= <TTTTTTTTTTTTTTT>
##$WBST= 1024
##$WBSW= 4
##$XGAIN= (0..3)
0 0 0 0 
##$XL= 0
##$YL= 0
##$YMAX_a= 340713
##$YMIN_a= -397753
##$ZGOPTNS= <>
##$ZL1= 120
##$ZL2= 120
##$ZL3= 120
##$ZL4= 120
##$ABSF1= 16.522
##$ABSF2= -4.171173
##$ABSG= 5
##$ABSL= 3
##$ALPHA= 0
##$AQORDER= 0
##$ASSFAC= 0
##$ASSFACI= 0
##$ASSFACX= 0
##$ASSWID= 0
##$AUNMP= <proc_1d>
##$AZFE= 0.1
##$AZFW= 0.1
##$BCFW= 0
##$BC_mod= 0
##$BYTORDP= 0
##$COROFFS= 0
##$CY= 12.5
##$DATMOD= 1
##$DC= 0
##$DFILT= <>
##$DTYPP= 0
##$F1P= 14.0000005364418
##$F2P= -0.99999901652339
##$FCOR= 0.5
##$FTSIZE= 32768
##$FT_mod= 6
##$GAMMA= 0
##$GB= 0
##$INTBC= 1
##$INTSCL= 1
##$ISEN= 128
##$LB= 0.3
##$LEV0= 0
##$LPBIN= 0
##$MAXI= 10000
##$MC2= 0
##$MEAN= 0
##$ME_mod= 0
##$MI= 0
##$NCOEF= 0
##$NC_proc= -5
##$NLEV= 6
##$NOISF1= 0
##$NOISF2= 0
##$NSP= 0
##$NTH_PI= 0
##$NZP= 0
##$OFFSET= 16.522
##$PC= 1
##$PHC0= 156.5916
##$PHC1= 9.477269
##$PH_mod= 1
##$PKNL= yes
##$PPARMOD= 0
##$PSCAL= 4
##$PSIGN= 0
##$REVERSE= no
##$SF= 250.13
##$SI= 32768
##$SIGF1= 0
##$SIGF2= 0
##$SINO= 400
##$SIOLD= 32768
##$SREGLST= <1H.DMSO>
##$SSB= 0
##$STSI= 32768
##$STSR= 0
##$SW_p= 5175.98343685301
##$SYMM= 0
##$S_DEV= 0
##$TDeff= 65536
##$TDoff= 0
##$TI= <Analysis number 999999
Compound Code 99
Book Reference 9
Project Code 9>
##$TILT= no
##$TM1= 0
##$TM2= 0
##$TOPLEV= 0
##$USERP1= <user>
##$USERP2= <user>
##$USERP3= <user>
##$USERP4= <user>
##$USERP5= <user>
##$WDW= 1
##$XDIM= 32768
##$YMAX_p= 520288519
##$YMIN_p= -1113505
$$ End of Bruker specific parameters
$$ ---------------------------------
##NTUPLES= NMR SPECTRUM
##VAR_NAME=  FREQUENCY,     SPECTRUM/REAL,   SPECTRUM/IMAG
##SYMBOL=    X,             R,               I
##VAR_TYPE=  INDEPENDENT,   DEPENDENT,       DEPENDENT
##VAR_FORM=  AFFN,          ASDF,            ASDF
##VAR_DIM=   32768,         32768,           32768
##UNITS=     HZ,            ARBITRARY UNITS, ARBITRARY UNITS
##FACTOR=    0.157963299565203, 1,           1
##FIRST=     4132.6476996994, 0,             0
##LAST=      -1043.33573715361, 0,           0
##MIN=       -1043.33573715361, -1113505,    0
##MAX=       4132.6476996994, 520288519,     0
$$ Real data points
##PAGE= N=1
##DATA TABLE= (X++(R..R)), XYDATA
$$ [...]
25006B7003J30728J67018m6584R5628j6570J84986J51586n7671j45405L2353J07436
24995F30508p2577r5746j92883L8963J72379R0656k9055n7955l4555L5146J2785
24984D97666K0774O5381K0884j45569j54756q5976J92251R9215j51977k13160
24974A44733J9932J28855M2521j20753L9924j43728N6607n8563l9166K80238J29206
24963D79806j35083J80861l2361k48746k79461P1652J08696J31769P5180n2345
24953B99968p159k4644Q3360J41495J3416p7324o1380n9392J61845m5090j19794
24942C05301j8669M3352m6333J32048J97019p6483j71202P541J74708j09036l8915
24931C99331J04260N8856j8301p4929j40552k11553K9624J27111K172J5116l284
$$ y = [27003, 157731, 324749, 278165, 373793, 357223, 542209, 693795, 636124, 490719, 523072, 630508, 557931, 462185, 269302, 308265, 480644, 571300, 542245, 484290, 449735, 484881, 497666, 518440, 583821, 604705, 459136, 304380, 218404, 410655, 509870, 357893, 144733, 164665, 293520, 336041, 215288, 255212, 111484, 168091, 109528, 70362, 350600, 479806, 344723, 525584, 493223, 244477, -34984, 36668, 145364, 277133, 352313, 299968, 292809, 268165, 351525, 493020, 506436, 429112, 367732, 308340, 470185, 425095, 305301, 286632, 329984, 283651, 415699, 612718, 536235, 365033, 372574, 547282, 438246, 399331, 503591, 562447, 544146, 469217, 328665, 117112, 146736, 273847, 276019, 291135, 287851]
24920B87851j26148j59147J4995N0828n5080R3269P3083j3093k0856j04348M4373
24909H5727o6545J35132q5605j02066J15302K08587j0526P8727O3494m4357j86814
24898A91056n8206K6205R1883K3593q031J84218j26649k25764J00468J75827O3398
24887D37998J0832L7995K0284n4137N5135J2550l4631N1463k09131j80340l4611
24876A13407q792J03534J53315O7575j5616j42850L363R6706j24198n4373R5012
24865B87083M4937O519k7563j17415N9615Q1322J23714p6456q3572L6615M8003
24854C82802R357J51241k2625j49239j35326r7411Q870l3777N5181N6o5667l5465
24842F7997O4989J84620M1677j47313q3438o3178J03972K1633J2991n0579j80887
$$ y = [287851, 161703, 2556, 17551, 68379, 13299, 106568, 179651, 166558, 145702, 41354, 85727, 19182, 154314, 68709, -33357, 81945, 290532, 280006, 358733, 422227, 377870, 191056, 132850, 159055, 250938, 274531, 266500, 450718, 324069, 98305, 198773, 374600, 437998, 448830, 486825, 507109, 452972, 508107, 520657, 486026, 537489, 328358, 148018, 113407, 104615, 208149, 361464, 429039, 413423, 270573, 273936, 370642, 246444, 192071, 287083, 332020, 338539, 310976, 193561, 253176, 334498, 458212, 381756, 298184, 334799, 382802, 392159, 543400, 520775, 371536, 236210, 138799, 147669, 113892, 169073, 169129, 103462, 67997, 132986, 317606, 359283, 211970, 128532, 65354, 169326, 190959, 203950, 153371, -27516]
24831b7516J76185N8743o0629M055M899n9636M6956O4539P9609j18564M4991J49857
24819C63489P9372K87470j64012j11640r4277K7556P9541q0850r8457j09717k6541
24808A51934K64164R1798k8273j74840M7667J03262J36758k0551j16956j65442
24798B89521r9314n0255P7849j8600p2608j53711N4866K8591j05821p053K31991
24787A75456M0826M0815m4621o0464n869q9576p2302Q7679J59573J1666j38476
24776A04707k2655M4409K3607j4946m3830l8092J39550r8713L7927J98428N1799
24765C82191j44698L6275J21743r9827j04443p4088q2016Q0591j9319j07160L9151
24754B8400K21159J25312j31204n8010j51503p4118O7785J16168q6865R2107n8633
$$ y = [-27516, 148669, 207412, 146783, 150838, 155737, 96101, 143057, 207596, 287205, 168641, 213632, 363489, 442861, 730331, 566319, 454679, 360402, 387958, 467499, 386649, 288192, 178475, 151934, 416098, 507896, 479623, 304783, 352450, 455712, 592470, 571919, 454963, 289521, 190207, 139952, 217801, 199201, 126593, -27118, 27748, 56339, -49482, -56535, 175456, 216282, 257097, 212476, 152012, 146143, 56567, -15735, 71944, 231517, 243183, 104707, 82052, 126461, 150068, 135122, 91292, 53200, 192750, 94037, 131964, 330392, 382191, 237493, 273768, 395511, 295684, 191241, 117153, 35137, 115728, 96409, -10751, 28400, 249559, 374871, 243667, 185657, 34154, -39964, 27821, 143989, 57124, 149231, 90598]
24743I0598o5629n1708J90613J59746j39409P0652Q9060M3901J8728n6030j06198
24732B44324K782r0023L5725j30069j29086J2186J21989R6317p9013j03838l0844
24721d9550R7826M0110r9504P601K70083P8768k18353n4178J9446M6942k511j64173
24709b7493q1344R1102L0673P1468k7323M6605J2232P8553N700k7335r0699M5415
24697A27554R5980N6441J8557L7148J53993p509j83746m2526l3970N4221j46998
24686A29145j0228J21540P3581l6j14809k2661N5352o452M9629j5833N167P618
24674B72013O9740P7548J2036j62608j75797J57447M207k7288j06062k7598J31249
24663B24887K2987J9308J03087l7822m9700K55Q6730j494l4871R0839j62493j55825
$$ y = [90598, 24969, -26739, 163874, 323620, 184211, 254863, 343923, 387824, 406552, 350522, 244324, 247106, 157083, 192808, 62739, -66347, -54161, 67828, 164145, 85132, -18706, -49550, 48276, 88386, -11118, -3517, 266566, 345334, 126981, 72803, 92249, 139191, 136680, -27493, -108837, -17735, 12938, 84406, 57083, 103688, 115920, 194473, 200173, 172838, 82139, 127554, 223534, 279975, 298532, 335680, 489673, 482164, 298418, 255892, 221922, 276143, 129145, 118917, 240457, 314038, 314002, 199193, 176532, 231884, 225432, 275061, 259228, 264395, 272013, 341753, 419301, 431337, 268729, 92932, 250379, 254586, 227298, 121236, 93638, 224887, 247874, 267182, 370269, 332447, 282747, 283002, 369732, 368238, 333367, 424206, 261713, 105888]
24651A05888J23832N9364l6854j87627M7799K6586j6101J70530J74345j10125
24641C57637j09402J15824k00298p1820K70858K555j7203Q9171q1463k26499j34903
24630e543l3622p77J94055J57364O6259q098j67904q480K38398J48731R681k79511
24618C10553k53820j19797O3511R0092J16630k30391j93431J57926K72378n2253
24608A61398k36490O0821J0187J36144l1457m3442K066o0373J1191J877K3155
24597C5077M2820k2897K8072k6004O0250J517m1987K4673J56496K5967j13571
24586A70413r2397o9838J17372J3883Q1137J27121j2423k3700Q7510N1806j14708
24575C36176J04853J9121j58224j67858m1160K40660p8984j20779J46801J4699
$$ y = [105888, 229720, 289084, 252230, 64603, 112402, 138988, 122887, 293417, 467762, 357637, 248235, 364059, 163761, 91941, 362799, 365354, 348151, 437322, 355859, 129360, -5543, -39165, -39942, 154113, 311477, 377736, 369638, 201734, 193254, 431652, 580383, 590064, 310553, 56733, -63064, 447, 90539, 207169, -23222, -216653, -58727, 213651, 161398, -75092, -14271, -4084, 132060, 100603, 57161, 59227, -1146, 10045, 11922, 35077, 77897, 55000, 83072, 57068, 117318, 118835, 76848, 101521, 258017, 283984, 170413, 78016, 8178, 125550, 139433, 220570, 347691, 335268, 311568, 399078, 450884, 336176, 441029, 460150, 301926, 134068, 92908, 333568, 254584, 133805, 280606, 295305]
24565B95305j1171M4393m3424R7490K39697j9272j19432j52597Q8820n406O1747
24554D76150M9853L8618j30402L2506n1613k03222o3045N6899Q4025j08192R9979
24543B81556J90184Q2054j8615l6753n0594J5040k1564j05622o2089l1159j18637
24532A23801j01957l2083K8170L6604o4000M9781J26847R5805L6041J4419j18981
24521A94447p1474L5730r1417o9128P8429R2463p416q8238p8980j12865K61340
24510A42891K23104M0583j48700j60722j89847l5347J78083N9806j00674k28049
24500b18872P0800O8212P8783J25133J38434Q903j96988j03473o014J47808j10473
24489B253l1285l8857M583M8269K8297k40J49034Q8166j4137K8114o9891j25646
$$ y = [295305, 284134, 328527, 285103, 382593, 622290, 603018, 483586, 330989, 419809, 414403, 476150, 526003, 564621, 434219, 466725, 415112, 211890, 148845, 205744, 289769, 181577, 281556, 471740, 553794, 535179, 498426, 447832, 462872, 441308, 335686, 273597, 242438, 123801, 21844, -10239, 17931, 54535, -9465, 40316, 167163, 262968, 299009, 313428, 194447, 122973, 158703, 67286, -1842, 76587, 169050, 161634, 73396, -5584, -118449, 142891, 365995, 406578, 257878, 97156, -92691, -128038, 50045, 109851, 9177, -218872, -148072, -79860, -1077, 124056, 262490, 271393, 74405, -29068, -35082, 112726, 2253, -29032, -67889, -63306, -15037, 13260, 13020, 162054, 250220, 236083, 264197, 194306, 68660]
24477F8660O2767R1758k9812J7324n2773r0972m5179J04306m9612o6416n8652
24466d8601l8021O5326O3548L0519r026l1004j911J08962p9956j27194J16195
24455D8837J47880j18808j17127J67279J29705o5163l47742r169O4235J95963
24445I5890K55677O4358j36083p2017k7908n824k2644j86572M4079m8148J29951
24434I0759J73922j04333K1899K79314O8339k18890k00470J5578m267K4989J08883
24423B55723n2175O2268n8125j58900L0979N4436j7571p5527q6786n2040J23972
24412B6254J0188r4949l073l1125p718j74328Q5169K11580J7554n5659N9640O8303
24400A11836j1359N717q300Q8890O569r5809j30124J3083J110k8198j1053K3543
$$ y = [68660, 131427, 223185, 193373, 210697, 157924, 66952, 21773, 126079, 76467, 10051, -48601, -86622, -21296, 42252, 72771, 63745, 32741, 30830, 139792, 59836, -67358, 48837, 196717, 77909, -39218, 128061, 257766, 192603, -155139, -164308, -100073, 95890, 351567, 415925, 279842, 207825, 179917, 174093, 151449, -35123, 8956, -39192, 90759, 264681, 160348, 182247, 461561, 529900, 311010, 110540, 126118, 121851, 146840, 255723, 203548, 265816, 207691, 48791, 79770, 134206, 116635, 41108, -45678, -97718, 26254, 36442, -58507, -61580, -92705, -100423, -274751, -189582, 21998, 39552, -16107, 43533, 111836, 100477, 106194, 97894, 186784, 193353, 97544, -32580, -19497, -18387, -46585, -57638, -34095]
24388c4095K1919n015k9064o392J67644o9833R55O3347p078J6994J536J0967o1505
24375G0380l8641P9109p1981m8713J51445m1646j36687R7128J39558J15692J5327
24364C30971j05957j11218O034M2971K5768q9272l9069Q3401r9061j67J66424
24353B10825Q6237M2170j0072j14061j03116j98903P836K20229l7010J23446j0718
24342B16863K2531p3602N172p876P8878l2063n3473j06499l8014r7186L0778M7931
24330f560n8848q7733L3076R1939J05732M9472J1396k6908o6669j23109K3679
24319e4533q6124P0963J13783M9308j91356L2392K32548K12643n2005j20978k0375
24308A86266j82485J15756o5227j48163O9235M729m3779j94199K7526O6401R6500
$$ y = [-34095, -12176, -17191, -46255, -52647, 114997, 45164, 46119, 109466, 102388, 119382, 120918, 131885, 70380, 31739, 110848, 38867, -9846, 141599, 99953, -36734, 60394, 199952, 315644, 330971, 225014, 113796, 119830, 162801, 188569, 99297, 60228, 143629, 44568, 44401, 210825, 297062, 339232, 329160, 215099, 111983, -86920, -79084, 141145, 104135, 227581, 216863, 239394, 165792, 170964, 163088, 241966, 209903, 156430, 49931, 11917, -85269, -54491, -6560, -65408, -153141, -120065, -28126, 77606, 127078, 138474, 111566, 44897, -78212, -54533, -140657, -69694, 44089, 93397, -97959, -65567, 166981, 379624, 327619, 206641, 186266, 3781, 119537, 54310, -93853, -24618, -19889, -63668, -257867, -230341, -163940, -67440]
24297f7440J03437N830j35693k8665J6822J6242r6185n1574J65372k689L03389
24286B28846J79523j67977j92588j99781o5918J30053M9368J15427j5570n3393
24276G990o418R3427J101N2722P0802M5414n1338l0689l9061j05134K1849m9428
24264A1237k7918j6849l0174M5986k1350p3914M0301k9621J57771J60497j90889
24253B5077r0018r6846l0726J0476M2364J80035q4614j89499M1149R7984J2109
24242h2509J59398N17k08800j41685L1241K09235q336n4902n374K22230M2640
24231A63655l8845n6969p9496l3759k9893J2059j24176n6226m3146J05967O0180
24220a20649r1882R3303J9386j5471J69726J5833r0219P4064o8918J7618l0970
$$ y = [-67440, 35997, 41827, -93866, -122531, -105709, -89467, -185652, -237226, -71854, -74543, 228846, 408369, 240392, 47804, -151977, -217895, -87842, -38474, 76953, 61383, 7990, 1572, 94999, 96100, 148822, 219624, 265038, 213700, 183011, 143950, 38816, 60665, 11237, -16681, -33530, -63704, -17718, -39068, -112982, -72681, -102302, 55469, 215966, 25077, -64941, -161787, -192513, -182037, -139673, 40362, -44252, -233751, -192602, -94618, -82509, 76889, 77406, -131394, -273079, -241838, -32603, -40939, -95841, -101215, 121015, 163655, 124810, 67841, -11655, -45414, -75307, -63248, -187424, -243650, -286796, -180829, -120649, -212531, -119228, -99842, -115313, 54413, 70246, -19973, 54091, -14827, 2791, -28179]
24209b8179o0990J07991J8048k29024K1363J48211l5078k8501m609P5414m6828
24198f2182Q5128M7421j32684n7468O3530L2174J01657M1873j42118k9318N1807
24187a80l9605r7210J17501Q8693L2287P4877k65n8722j0502j6986j09775j1819
24175c1706L2772M9171J43446m2876j57315J07782J89850j74012k9738Q6365r9571
24164G4168j5985n3102m7355n9395P7154J11782j4210P4832j35958n0772N169
24153c3672j80719O0194M3923R1770p6516O8219J19599m1470l7249J2333j04792
24142g8380j08557O6448J04552P2083j34338k3565J39051q9054K9668J72349J07872
24131B58129K6669r6444k70378j56478M9957J22859K655O1921K0494q989k8342
$$ y = [-28179, -89169, 18822, 36870, -192154, -170791, -22580, -57658, -86159, -90768, -15354, -62182, 22946, 70367, -62317, -119785, -56255, -24081, 77576, 119449, -22669, -51987, -180, -39785, -136995, -19494, 69199, 101486, 176363, 176098, 117376, 106874, 89888, -19887, -31706, 1066, 50237, 193683, 150807, -6508, 101274, 291124, 117112, 87374, 173739, 74168, 58183, 5081, -42274, -101669, -24515, 87267, 73057, 147889, 11931, -38841, -33672, -214391, -154197, -110274, -18504, -95020, -26801, 92798, 51328, 14079, 26412, -78380, -186937, -120489, -15937, 56146, -78192, -101757, 37294, -51760, -22092, 150257, 258129, 284798, 188354, -82024, -238502, -188545, -65686, -63031, -1110, 19384, 10395, -17947]
24120a7947p0053m4004j09387K5225k9986N4531J36681k2046p7020k26448j31153
24109e11607K32112K35812l341J22985r441j69360k1070O614J09283j6273Q6732
24098F2446J07280p9278n9079q2933p5242q9188J05948N9771n8348N0567o1825
24087a19881j2348J17482K43170r2945j72256M8806L9050q0633J2409J5449P4300
24076G2603N4915j04482k6162M5606o7730p0953J617J44647K4366P7548Q3994
24065B35969q6082R0474p7505j31839J19019k8200k17483j52231o3606M1887K19373
24054e0224K2124j30262m4259N7401K17462M4861M9987j0767L4337K1490m8149
24043A64001O0894r1401m9520m8817j99987N0211O7339L5522M7617M3991j46011
$$ y = [-17947, -88000, -132004, -241391, -216166, -246152, -191621, -54940, -76986, -154006, -380454, -511607, -279495, -43683, -47024, 75961, 66520, -102840, -123910, -117296, -8013, -24286, 62446, 169726, 90448, 31369, -51564, -126806, -215994, -110046, -50275, -108623, -58056, -119881, -132229, -14747, 228423, 135478, -36778, 12028, 51078, -29555, -17146, -1697, 72603, 127518, 23036, -3126, 42480, -25250, -96203, -94586, 50061, 74427, 151975, 235969, 149887, 240361, 162856, 31017, 150036, 121836, -95647, -247878, -311484, -269597, -50224, -28100, -158362, -202621, -145220, 72242, 117103, 167090, 156323, 190660, 212150, 164001, 224895, 133494, 83974, 35157, -164830, -114619, -47280, -11758, 35859, 79850, -66161]
24032f6161j2023P1807j29622K7684J17358J268k9973Q2015j24776J30302K34037
24021C01916J04004j03618J5310l2768Q2695q491k07518j24441k0799m072r4453
24010i2235j2599P0393K6257q7782J10935J26204K06617r0606j38459j15490P8220
23999H1455J199j68123K4248o8323J55076l2609k08454J82483J04051q2971j32883
23988a44851k186j2807l4079J1357N4468n3521N111K24447J17195m9149J49231
23977B65216K1443k32550j05043J5548R0652M9282M7986j76391k05476J32088
23967i7245J78068O4147j327j2042P8275q9673r8835Q4540m1354r2841j10515
23956a38802K2953n7264K927Q1064J5525j33107j43160J07430J19446J28366Q1632
$$ y = [-66161, -78184, -6377, -135999, -108315, 9043, 10311, -19662, 62353, -62423, 67879, 301916, 405920, 302302, 317612, 284844, 367539, 359048, 151530, 27089, 6290, 2218, -92235, -104834, -34441, -8184, -95966, 14969, 141173, 347790, 257184, 118725, 3235, 81455, 82654, -85469, -61221, -129544, 25532, -7077, -215531, -33048, 71003, -11968, -144851, -147037, -159844, -193923, -182566, -128098, -181619, -176508, 47939, 165134, 115985, 265216, 286659, 54109, -50934, -35386, 55266, 104548, 152534, -23857, -229333, -97245, 80823, 144970, 143643, 131601, 209876, 120203, 21368, 105908, 64554, -28287, -138802, -115849, -173113, -170186, -89122, -73597, -206704, -349864, -242434, -122988, 5378, 87010]
23945H7010K20548j01792k55757j05845j75158l1690J4533Q9191K66503J19645
23935A27188J82655l7748j0610o4151k91658j30584Q0015J97663l6754o3034Q073
23924c8945J14178R7190M5083r7238l7112P0221J9423q7018L427J2231J0787q021
23912A04206r4716k7444K4511J56283K6949k0510q640p1177J6146n243p080J44120
23900B37405K7604j56294j81913J06867l820J09670N1858l9897J13771Q0460j97842
23889A47869j30133l4319L5629j65591j7482m7489M4146Q600m4028j07634J5931
23878b94501J28114k8993K7801m5043j7884O663j5170J21121L21887j13180k09910
23867a19095J3865k8175L4536J51107L32831o1896j10995j82243J7805k6635r3331
$$ y = [87010, 307558, 205766, -49991, -155836, -330994, -362684, -348151, -258960, 7543, 127188, 309843, 272095, 261485, 197334, -94324, -224908, -144893, 52770, 16016, -47018, -38945, 75233, 172423, 217506, 120268, 83156, 153377, 172800, 85782, 89209, 101440, 112227, 104206, 9490, -17954, 6557, 162840, 189789, 169279, 160639, 89462, 105608, 100365, 93285, 237405, 265009, 108715, -73198, 33669, 29849, 139519, 191377, 151480, 265251, 345711, 147869, 17736, -16583, 19046, -146545, -164027, -211516, -167370, -158770, -202798, -310432, -294501, -166387, -195380, -167579, -212622, -230506, -223843, -239013, -117892, 203995, 90815, -119095, -105230, -133405, -98869, 52238, 385069, 323173, 212178, 29935, 47740, 21105, -72226]
23856g2226k00880J16688J95863Q8940M1204Q581j76983p1448J955J59724J23374
23845B14792j83048q9630o5936K10166J3678j38962l5087J95615P1926q2736j31523
23834b0745J44096J63684r7192q354Q253j97652J24658N8910p9082k9058j31590
23823f4072k04929P1620J56272J20322k786o9941l8389m6716j9375J3099p7441
23812a62336j24660j2479J73378J18149J240J20329P2709N472m441j7151L2566
23801B02776j6565j21844j76714j16312m3645j31216R4542K1305M9909J30420
23791a07344K1966j21782r9251m6669R5902J74410O9879m9072k65639K3810J08470
23780a95320L8725L2619K6672J07142Q253L3057J1512m591J6499n2039L6740R1940
$$ y = [-72226, -273106, -156418, 39445, 128385, 169589, 178170, 1187, -70261, -68306, 91418, 214792, 31744, -57886, -123822, 86344, 100022, -38940, -74027, 121588, 193514, 110778, -20745, 123351, 287035, 189843, 181489, 189742, -7910, 116748, 175658, 96576, 67518, -64072, -269001, -197381, -41109, 79213, 76427, 6486, -31903, -78619, -97994, -84895, -162336, -286996, -299475, -126097, -7948, -6708, 113621, 186330, 191802, 187361, 170210, 202776, 186211, 64367, -112347, -228659, -272304, -403520, -308978, -287673, -237764, -107344, -85378, -207160, -306411, -353080, -257178, -82768, -12889, -61961, -327600, -303790, -195320, -156595, -123976, -97304, 9838, 18091, 51148, 62660, 58069, 74568, 22529, 59269, 151209]
23768A51209J12817j3091O6065R2671j75910q9069q863k8277j089r2805j3223
23757D35j2618k3068k4397j05555J7793J5731m1015L4450J38620R2097j11574
23746a9101n265j7469K1446j23809J8431m9395j30176Q585J0290K75100N7081
23735D5718r7039N7889K3517k15300n2682J87385J74504k3937L6494q1909M6067
23724A00707p3615n3697n4347p8665q9584q473R0542K4937L2200J49923N1952
23713I1880j05655J0468j0587j59328q8085J47590J02835j25209k5315N0743j35656
23702b46319L0789K0854L111K2653L2096K4033L6034m6507J06723J69447L5704
23691A88618l8097l20693k599K19210J67578p6712j44583j55252K3071J46500
$$ y = [151209, 264026, 250935, 317000, 409671, 233761, 144692, 135829, 107552, 106463, 13658, 435, -12183, -35251, -59648, -165203, -147410, -131679, -172694, -138244, 376, 92473, -19101, -24366, -41835, -20389, -144198, -125767, -175162, -305338, -296753, -286463, -11363, 45718, -51321, 6568, 30085, -185215, -237897, -50512, 123992, 100055, 136549, 54640, 100707, 27092, -26605, -80952, -159617, -249201, -257674, -167132, -142195, -109995, 39928, 91880, -13775, -3307, -13894, -173222, -261307, -113717, -10882, -136091, -161406, -110663, -246319, -215530, -194676, -191565, -168912, -136816, -112783, -76749, -123256, -16533, 152914, 188618, 150521, -170172, -172771, 46439, 214017, 137305, -7278, -162530, -139459, 7041]
23681G041Q972J25310o994j04698j27160Q2409N3303R5602J58494n0203n2226
23670A89850m7509m2371O4184K8157L0896L9305p5794j59634j8396j163M7600
23659E5125L0576j62J14728n0386P2200n5991k6908m3213J32211J00396j8913
23648C09663k4103j75250O2475J01048o0730k2878R621j5273m7566r2758n4181
23637i932L6860J06207L0215q5490r366J32432q8013o0840j22493M5910N5132
23626C0622K5795j8442l4745o4009j44683Q930J37195O9308M653l0705p5707M111
23614h7677O5153K8644J42402J6922J5121P4470r9404j92519n0538R6463k3306
23603a4269L7786N7612k799j7507n5479N762N5239m5847L1811m1583n7362L8618
$$ y = [7041, 16013, 141323, 134329, 29631, -97529, -15120, 38183, 133785, 292279, 242076, 189850, 142341, 99970, 164154, 192311, 223207, 262512, 186718, 27084, 8688, 7525, 55125, 85701, 85539, 200267, 149881, 222081, 166090, 139182, 95969, 228180, 328576, 309663, 285560, 110310, 172785, 273833, 213103, 190225, 199846, 184573, 137007, 44249, -9932, 26928, 133135, 163350, 77860, 68494, 200926, 112913, 52073, -70420, -24510, 30622, 56417, 37975, 3230, -60779, -205462, -196532, -59337, 9971, 14624, -16081, -91788, -87677, -22524, 6120, 148522, 165444, 180565, 255035, 155631, -36888, -87426, 9037, -14269, 23517, 81129, 78330, 60823, 5344, 11106, 66345, 20498, 52309, 10726, -46636, -8018]
23591h018k0533J0993k9371n2199J7927J970m5919J9125Q9632K6553l3961j1456
23579c5257J12859k572j88607r6469L1151K5580j38682l8185l6582J7769M0104
23568c08891O8239k8108l6240P4310K53039P3268j28572p6862n8646J11667K57366
23557B00570R466j66828m5985j03441n9185P3202J23194R6491m6586M7826n0579
23546G8145k5089J42219j03433j66272J917J03332O4841q9302n2986O7754j64152
23535a43026m4060N5077o55m6729m3690K04144R7220j03626Q891K42145m1417
23524A84274j11672m8507j3967J9106J00010k17451K4894q8319J10013j3976l7691
23513i3286J342l9564k44726K5066N6724N105M1740l9694R5031K1062Q7392j1897
$$ y = [-8018, -28551, -17558, -46929, -99128, -81201, -79231, -125150, -106025, -16393, 10160, -23801, -35257, 77602, 75030, -113577, -210046, -178895, -153315, -291997, -330182, -366764, -348995, -308891, -240652, -268760, -305000, -230690, 22349, 95617, -32955, -109817, -168463, -56796, 200570, 210036, 43208, -2777, -106218, -165403, -92201, 30993, 127484, 80898, 128724, 78145, 53056, 195275, 91842, -74430, -72513, 30819, 95660, 6358, -46628, 21126, -143026, -187086, -132009, -132664, -179393, -223083, -18939, 78281, -25345, -16454, 225691, 184274, 72602, 24095, 10128, 29234, 129244, -88207, -63313, -151632, -41619, -55595, -93286, -91944, -131508, -376234, -351168, -294444, -289339, -247599, -287293, -192262, -171200, -83808, -95705]
23501i5705Q2965L424p0435K4162N5081R2126J66473j15277j66665p8256J20449
23490A8342P6856O212m4317m6282k46046K5076J00894M0660M6012N2132J47205
23479A76744J11300l2208j22306r0155J46157J10730j69413K07317J00734k07426
23469B31474j80428P7394j74205j58410l1561R4517J83969l4513j09215N5738
23459d5240J44887J177O0292j06915J0601K6169o7884p6107j72878k07541O2178
23448c71261K48737J33313J772o4111j43654M051K29583l5809k08585p3359k9067
23437c08390K1368J9001M2397q5568J41729L4606p6J08899N7089j89761j4463
23426a73169j0611J12008R0455j54294j77194m0175P1910J31063j01234j35433
$$ y = [-95705, -12740, -9316, -79751, -55589, -508, 91618, 258091, 142814, -23851, -102107, 18342, 95198, 101410, 57093, 10811, -235235, -210159, -109265, -68605, -22593, 29539, 176744, 288044, 255836, 133530, 43375, 189532, 300262, 130849, 338166, 438900, 231474, 51046, 128440, -45765, -204175, -235736, -141219, 42750, 8237, -100978, -45240, 99647, 100824, 161116, 54201, 64802, 90971, 23087, -53020, -225898, -433439, -371261, -122524, 10789, 12561, -51550, -195204, -191153, 38430, 2621, -205964, -279323, -308390, -287022, -268021, -225624, -311192, -169463, -134857, -134933, -26034, 31055, -158706, -173169, -183780, -71772, 18683, -135611, -312805, -352980, -281070, -150007, -251241, -386674]
23416c86674Q2088K96612J67703j45757o6241m0286k3180K5418p2441o9704N8976
23405a73486J7496k7175J39490O6683O306r14N1416k9706j04590r7861J22952
23394b9389Q9747K3429l0070J18425j59488j93228n2726Q1004L6678j2738K0907
23383a07449N1893P2006R508q8025n2536R0272N21j51093k96238l4322P4533P9927
23371c51003J05166k32257p5192J58443J28725m0290P4149N7171L5485O705j56287
23360b89185m7985J6646K0436m5398R3519K20421N241m6324M9821J71560Q8144
23349B36896j76924k39407P1568J51415r3175j90147k26066P5515K00877R9602
23339h9846J48517n9565N6204p175J527o9976j00107j45086r7670R6994L4737
$$ y = [-386674, -304586, -7974, 159729, 13972, -52269, -92555, -115735, -90317, -162758, -232462, -173486, -155990, -183165, -43675, 23008, 29314, 28400, 79816, 50110, -54480, -152341, -29389, 60358, 83787, 53717, 172142, 12654, -180574, -233300, -152296, -115618, -128356, -107449, -55556, 16450, 25958, -62067, -114603, -24331, -23810, -174903, -471141, -505463, -430930, -351003, -245837, -478094, -553286, -394843, -266118, -306408, -232259, -175088, -139603, -132898, -289185, -337170, -320524, -300088, -345486, -251967, -31546, -26305, -72629, -22808, 148752, 236896, 59972, -179435, -107867, 43548, -49627, -239774, -465840, -390325, -189448, -89846, 58671, -894, 55310, 48135, 49662, -20314, -120421, -265507, -363177, -266183, -231446]
23328b31446n4188P1227R998K0224j6050J36035n4386M6622n0665j5835L5041
23317a03423o4185O1064o6566P0787P9264M7450n8303n6800j33683l0709L8807
23306b16297J51653J29447j1955P0011p1076p7215J34059p6101j55204j1587k3967
23295a58232j79553K34726L1656r0466j29305k8189r5406Q8196L1745J11748k3624
23284b06704o8548q9094O8650q945j6221L4875j68065l373N5535K8183l2046p918
23272d13671J61021J50237j7690p297J06506J06520R6763n5689m0091j35303J7239
23261c1455J92686J2474j34965n2022J13728O3658J8190L0600j01358j40069m4742
23250g3275k11526k11679J49604K28372J20009O2660l7578j99661J62232J04114
$$ y = [-231446, -285634, -214407, -204409, -184185, -200235, -64200, -118586, -71964, -122629, -138464, -103423, -167608, -106544, -173110, -102323, -23059, 24391, -33912, -90712, -224395, -255104, -216297, -64644, 64803, 52848, 122859, 51783, -25432, 108627, 32526, -122678, -134265, -158232, -337785, -103059, -71403, -161869, -291174, -319363, -414769, -326573, -294828, -183080, -206704, -275252, -364346, -295696, -304641, -320862, -285987, -454052, -457425, -401890, -373707, -405753, -413671, -252650, -102413, -120103, -127400, -20894, 85626, 182389, 126700, 86609, -48694, -31455, 161231, 173705, 38740, -13282, 100446, 164104, 182294, 212894, 111536, -28533, -73275, -284801, -496480, -346876, -118504, 1505, 64165, 26587, -173074, -10842, 93272]
23240I3272Q895J0386l2397J4154L8366j4256k1092j1915j21347j72514j5447
23229b23895O7968J65355n4121m2450N4467K2127J05659l4359r00n9433j4836
23218a4418j53322K1098J93468m519J78035J60374j71957j88332M397j13758j13676
23207b02610O130o3535j13489K71609L7234j8138M6474j44230L1835K27668N1092
23196A30040L4576o3343n8756j29657Q2202J97545O6405j49968n2880k1020P6133
23185A11277J87306j08331p0025n4539q0244J817l5254J6327o9694j18837l137
23174b23334L2504p7365J07259K28368J61946j84681j00740K6809Q9257M4998
23164A05021j01642L5659J25825k5738k07746j57702N8456L5134K6230N8561J9420
$$ y = [93272, 102167, 112553, 80156, 94310, 132676, 118420, 97328, 85413, -35934, -208448, -223895, -155927, 9428, -44693, -87143, -32676, -10549, 95110, 60751, 59851, 418, -14418, -167740, -146642, 46826, 42307, 220342, 380716, 208759, 20427, 24824, -88934, -202610, -196480, -260015, -373504, -101895, -64661, -82799, -36325, -180555, -148720, 78948, 130040, 164616, 101273, 42517, -87140, -4938, 192607, 259012, 109044, 56164, 35144, 111277, 298583, 190252, 120227, 65688, -14556, -12739, -47993, -31666, -101360, -220197, -223334, -190830, -268195, -160936, 67432, 229378, 44697, -56043, -29234, 60023, 105021, 3379, 39038, 164863, 139125, -68621, -226323, -167867, -132733, -106503, -47942, -28522]
23153b8522Q5348J32519L7719r5750Q495l5479j18323k49221k5774J01036k6884
23142b14836k8215L962M7065L0534q0425L7287n7072R4118M2959o7072p07J07292
23130h5110J64632j6079J17935p069k25820j19201J19169N0716J20704q822J25836
23119B36891k8652m2024q8432o9514n3456k08539j35123o1135M0243K18403K04412
23108A3074O4224J93525l128k24046k1624J66644l08125r3163K43669L28758J7112
23097C76920r7305L4736l417J2778j52532M0843j00011k24491o8493j31124j46503
23086d58599K4414J40260J68076J13253m8804j58057J30001Q3681k0205L2819
23076F839k76514k15894Q1578P5097J57934J07596k0757l2151j2673K79858L1529
$$ y = [-28522, 56826, 189345, 227064, 131314, 139809, 104330, -13993, -263214, -288988, -187952, -214836, -243051, -239089, -192024, -161490, -241915, -204628, -261700, -167582, -124623, -191695, -192402, -85110, 79522, 63443, 181378, 174309, -51511, -170712, -51543, -827, 119877, 111055, 236891, 208239, 166215, 77783, 8269, -45187, -253726, -388849, -449984, -409741, -191338, 13074, 77298, 270823, 267695, 43649, 22025, 188669, -119456, -212619, 31050, 359808, 376920, 279615, 314351, 310934, 323712, 171180, 212023, 112012, -112479, -180972, -312096, -458599, -434185, -293925, -125849, -12596, -61400, -219457, -89456, -5775, -25980, 6839, -269675, -485569, -403991, -328894, -170960, -63364, -84121, -116272, -128945, 150913, 182442]
23065A82442N990j63778j47537l9938K1748j6195K4906M6793n661P4197K9100
23054A2067n0958j57477p2051J96898J59753N3832J01522K6251j63481j51225
23044d4869o5223k77m6354J66321O7641M1848p1932j18974R8499k075l6732k8531
23032d0658K1003P4973n6250j27782N5649j7332L223K8845R4818j2797k7660o644
23020a0612o7273j65739j0607o6474n9455j4860Q062L543J39243K91230J5157
23009F2215r5486L9505J9158R6650M2466L6061m8244o1760j47280j47726j873
22998b06314Q3958j29957J32787J0736j11230j65314R4468J04280R0344m7757
22988a43999L5146J5921m5118l6988L1816j63333P177R6972M6318l190L5759J17151
$$ y = [182442, 188432, 24654, -122883, -162821, -141073, -157268, -132362, -85569, -91230, -17033, 12067, -38891, -196368, -268419, -71521, 88232, 142064, 243586, 269837, 106356, -44869, -110092, -110369, -156723, 9598, 77239, 119087, 47155, -71819, 26680, 24605, -12127, -40658, -19655, 55318, -932, -128714, -73065, -90397, -87174, -58329, 36489, 23692, -3968, -10612, -77885, -243624, -254231, -320705, -380160, -395020, -386958, -383415, -244172, 47058, 62215, -33271, 6234, 25392, 122042, 164508, 200569, 152325, 90565, -56715, -204441, -206314, -122356, -252313, -119526, -108790, -220020, -385334, -290866, -186586, -96242, -143999, -108853, -92932, -138050, -175038, -143222, -306555, -299378, -202406, -156088, -159278, -123519, -6368]
22976f368J6024j0724j0032m0834r4870J28199Q0012J17586M6565k36291q6925
22965i7658J25499K9838j85569j78034J54328J25612k0445r1318j03180q5266
22955c26193M1954J55923N525J64273J26758m1701P8971q6364r1551J0068j54512
22944a16849N5299Q8794L0200o1578P3949j3521m6278J01214O629L7563k2741
22933A32681k01650R2153Q7481m5856j15741O6177L1285m6196j23177o1523r9268
22922b83634J21571J95846P6446P1860M1531K2200j34217j04843m2569N3717l0703
22911a2795J21656L8504j84613R2847J39349K9023Q9637L09582J78744J83292
22901I85226L98147L08205K61463K15211p4643n6295q4033j74515j38534k05022
$$ y = [-6368, 9656, -1068, -11100, -51934, -146804, -18605, 61407, 178993, 225558, -10733, -97658, 27841, 57679, -127890, -305924, -151596, -25984, -46429, -137747, -240927, -326193, -284239, -128316, -122791, 41482, 168240, 126539, 205510, 119146, 27595, 37663, -116849, -61550, 27244, 57444, -4134, 69815, 56294, 10016, 111230, 117859, 155422, 132681, -68969, 23184, 110665, 64809, -50932, 15245, 46530, 334, -122843, -184366, -283634, -162063, 33783, 110229, 182089, 223620, 245820, 111603, 6760, -35809, 17908, -12795, 108861, 147365, -37248, 55599, 194948, 223971, 313608, 623190, 801934, 985226, 1383373, 1691578, 1953041, 2168252, 2093609, 2037314, 1953281, 1778766, 1640232, 1435210]
22891A435210l21723l14809k40542K0563l3711j19557J20895l4015l0568J1787
22881D93530m4431j0692j60738o6526P3965R292j03953j05239p1237L4219J31683
22870A79873j02328J37226K2348j43463J28870K446r6713m0529j34162k8539O8795
22859f176j11600j86785k3856J24310K562L0201J35367l0546M1886j2085Q4594
22848D7872r7582n7177Q0905k9966p1910q4726L9403M6620R9930J01043q8987
22837a4575O2971r112J529R4222m316l8492J33351m2730j13618n9756j09807q0138
22825a80471j74407r4206M7450O4977Q7438R9096j11254N0465P2107q612k0877
22814a68294Q5311n6568m9509O084Q5524q4679n0260K20352J13684j02223r659
$$ y = [1435210, 1113487, 798678, 558136, 578699, 544988, 425431, 546326, 512311, 481743, 493530, 449099, 438407, 277669, 211143, 285108, 294400, 190447, 85208, 13971, 48190, 179873, 77545, 214771, 237119, 93656, 222526, 224972, 128259, 87730, -46432, -74971, -6176, -117776, -304561, -328417, -204107, -201545, -171344, -35977, -66523, -24637, -36722, 47872, -49710, -106887, -25982, -55948, -127858, -212584, -173181, -126561, -26631, 74412, -14575, 48396, 39284, 40813, 135035, 130719, 92227, 225578, 182848, 69230, 9474, -100333, -180471, -354878, -449084, -401634, -336657, -249219, -150123, -261377, -210912, -138805, -147417, -168294, -82983, -139551, -189060, -182976, -97452, -182131, -232391, -12039, 101645, -578, -10237]
22803a0237m1251O7758R4909J45124j72838j29593L3732m2725M9206j7089J22928
22792I9924J03241q9615j30557J29248j65869j18742j36333Q0896L1259k0982
22782b17530m4358J26679Q6109Q402j1793k37612j02647K7911K12834J951K6958
22771a23096j09445q7156o9522r9682J20232J22511p0206P3407J24605L2233j54609
22760b40728o0734o02k1966J2999O1101P7704M003m578O184k2499M3096K70655
22748A24635J54311j21282n2160j65732q3067l9601m3828J074j06458N3944k4697
22737c02861J64145J05326J5712j21146o5982K8465q4303N1450K3088j26706q0418
22726c93230j8839M6465J95098J64093J0178l3645m898m0040o7238N8485J36558
$$ y = [-10237, -51488, 16270, 111179, 256303, 83465, -46128, -12396, -55121, -5915, -23004, 99924, 203165, 113550, -17007, 112241, -53628, -172370, -308703, -227807, -196548, -217530, -261888, -135209, -49100, -40698, -52491, -290103, -392750, -364839, -152005, -150054, -123096, -232541, -319697, -389219, -488901, -368669, -246158, -316364, -242957, -118352, -86119, -240728, -301462, -302064, -324030, -311031, -249930, -172226, -168223, -172801, -166617, -189116, -146020, 124635, 278946, 157664, 105504, -60228, -143295, -182896, -226724, -225650, -332108, -278164, -302861, -138716, -33390, -17678, -138824, -204806, -176341, -260644, -209194, -186106, -312812, -393230, -412069, -365604, -170506, -6413, 3765, -29880, -34778, -74818, -142056, -83571, 52987]
22715E2987P108j62472j34136J55521L7389k02995n6211P805j2060Q6406Q9807
22704a30851J2616k11150n1725N7417L0566J08041R7272j6649m135j70223N8817
22693b20004L029q7946K5837J15767Q7873N6925J7141m1612m0100q5333J20190
22682d8233J48422o7538j2502J01301j67890N0635J85057l4101j84326n0579M7281
22671c2473r9928r4772J17617N9246J21821q8084J76m3837l8609l313P82m2959
22659a44333j41117K86469J17506m436j13716l8559L8017M8751j78303j87201
22649c16922l5226O7706k7828N3987l7719O6175J52941J71938L3821p4311J17276
22638A71838M9251j34383k47671J6056l1236Q4584R9751o7613Q5313K6058p118
$$ y = [52987, 60095, -102377, -236513, -80992, -43603, -246598, -302809, -295004, -307064, -220658, -130851, -118235, -329385, -381110, -323693, -293127, -185086, -87814, -104463, -108598, -278821, -220004, -216975, -304921, -279084, -163317, -75444, -18519, -1378, -42990, -83090, -168423, -48233, 100189, 32651, 20149, 121450, -46440, 4195, 189252, 155151, -29175, -79754, -32473, -132401, -227173, -109556, -50310, 71511, -16573, -16397, -60234, -98843, -102156, -101374, -144333, -285450, 1019, 118525, 114089, 373, -38186, -169, 48582, -129721, -316922, -352148, -284442, -312270, -258283, -296002, -229827, -76886, 95052, 128873, 54562, 171838, 221089, 86706, -160965, -144909, -176145, -91561, 8190, -59423, 25890, 51948, 44830]
22627D4830r0231J07N8577J10432n4973Q5683K16168j92030j15604P6428K28742
22616C68129k2384j83025j3629O0948N044p6754m3517J22031J2147j40406q7695
22605H89j8462n291j33809M4082o3556O4604Q5966R367J5458R0217J4724r0749
22593A3440j37878Q8026K69r642J41210K95740j33548l17130r0597j44641j4132
22582c08883K22253J45179o6073j29651p148N8350J43089L6104j55511m7103K081
22571a07313r8116O400J34843m2288J5317K80006q1404j35644o137k7012l8111
22560i9459p8740r5471j17221l8814n2910Q2313j2551q265Q9144j02791J36808
22549b97957J70483M6948j7365L2839k914O4460J8245j84218q5023J82753L6652
$$ y = [44830, -45401, -45294, 13283, 123715, 68742, 154425, 370593, 178563, 62959, 139387, 368129, 345745, 162720, 149091, 210039, 215083, 138329, 94812, 216843, 228990, 88584, 889, -17573, -22864, -156673, -112591, -176147, -111543, -25577, -16210, -752, 89465, 104189, 13440, -124438, -36412, -36143, -45785, 95425, 391165, 257617, -59513, -150110, -294751, -308883, -86630, 58549, -7524, -137175, -144323, -85973, 57116, 93220, -62291, -109394, -107313, -205429, -199029, -64186, -106474, -91157, 188849, 107445, -28199, -34336, -61348, -99459, -178199, -273670, -390891, -429705, -482615, -400302, -412853, -421118, -331974, -434765, -297957, -127474, -80526, -97891, -65052, -67966, -3506, 14739, -169479, -254502, -71749, -35097]
22538c5097j86468R8356j8760P7172J36407l6800L3682N4484J53413R8861J3649
22527C88899j15634j80229l765m7554p5233Q1853J75755P3872J3794M6755m16211
22516e7698m8671J95643J606k4826K6984J5535J78695m4270k7694M023j0065j964
22504B07298m1858j2116K1716l9183K18589O702m3043Q792Q7798k07817k9723
22493A77155l9362J04256J08534j29707J66092n5019k49927l2345K19998R8291
22483C67966L8084q112K3607L2574l5129j04107M9292J4972j56146O9661J57419
22472D50081N6349K3235p2784K7215o5560L5637R4380n4789l9587r214j1001N1721
22460D85683r0439o0692J17701N9883O6028N9115O8556J15410n7874R7862J435
$$ y = [-35097, -221565, -123209, -141969, -64797, 71610, 34810, 68492, 122976, 276389, 375250, 388899, 273265, 93036, 89271, 41717, -33516, 48337, 224092, 297964, 311758, 358513, -57698, -106369, 89274, 90880, 66054, 93038, 108573, 287268, 242998, 215304, 219327, 209262, 207298, 165440, 153324, 175040, 135857, 354446, 361148, 318105, 326897, 414695, 206878, 177155, 137793, 242049, 350583, 220876, 386968, 331949, 82022, 49677, 269675, 367966, 406050, 397938, 421545, 454119, 418990, 314883, 364175, 379147, 223001, 292662, 450081, 506430, 529665, 456881, 484096, 418536, 454173, 548553, 493764, 454177, 444963, 433962, 485683, 395244, 334552, 452253, 512136, 578164, 637279, 705835, 821245, 763371, 861233, 862668]
22449H62668j3218J23727J34171R1626K99091M45349L28486J83773L49671K70610
22439C075954J44450J44210j40141m24414m49873k37942j39888j21829j11195
22430A739332o3205j94595j22919k57141o7714k5732o2509R506m3528n2840J23349
22419I82004l0358p3536J18190k0470k457M7218K18066l3491q5346Q9475J51474
22408A360769J50591M3091O434J16474J05182K04579K72197L28657J18695r346
22398B697323O3415N4884K53745L47743M28851K63534K89659M55715K54422J82647
22388E291938N27418P22696P91519J082922J069966J091033R36995J170066J357998
22379A4042551J661553J772382J816771K133567K769816L852296N245134P215435
$$ y = [862668, 849450, 973177, 1107348, 1198974, 1498065, 1943414, 2271900, 2455673, 2805344, 3075954, 3220404, 3364614, 3224473, 2800059, 2350186, 2112244, 1972356, 1850527, 1739332, 1676127, 1481532, 1358613, 1101472, 1033758, 1008026, 945517, 955023, 911495, 858655, 982004, 951646, 878110, 996300, 975830, 973373, 1020591, 1238657, 1205166, 1119820, 1209295, 1360769, 1511360, 1554451, 1560885, 1677359, 1782541, 1987120, 2259317, 2587974, 2706669, 2697323, 2760738, 2815622, 3069367, 3417110, 3845961, 4109495, 4399154, 4854869, 5109291, 5291938, 5819356, 6542052, 7333571, 8416493, 9486459, 10577492, 11514487, 12684553, 14042551, 15704104, 17476486, 19293257, 21426824, 24196640, 28048936, 33294070, 40509505]
22371D0509505J0432004J5574546K4645497M1586119O6586979Q6318307Q4915737
22364C70568694O5281661M0650913K5652512J8134739r463355n6126437r5052464
22357C59646263j04382888q0229026m7064213k6589353j6398101j1316727q382806
22350F5283149o241466m568794l474973k348799k042477j795728j503480j395454
22342D1911978j617945k122058k275521k006025j919938j682954j593085j658261
22334B7036191j490092j301659r83768j015502q73719p56628p29222q36588o77009
22325A8372004p75391q37335o15048o82049n12044n04080o83025m88000r8569
22316A3176463j81418l55822l49911l93522k08219k94652k57936l06038m64137
$$ y = [40509505, 50941509, 66516055, 91161552, 132747671, 199334650, 285652957, 370568694, 435850355, 476501268, 502153780, 520288519, 510825164, 454698727, 359646263, 255263375, 175034349, 127970136, 101380783, 84982682, 73665955, 65283149, 59041683, 54472889, 50997916, 48649117, 46606640, 44810912, 43307432, 41911978, 40294033, 38171975, 35896454, 33890429, 31970491, 30287537, 28694452, 27036191, 25546099, 24244440, 23260672, 22245170, 21371451, 20614823, 19885601, 19049013, 18372004, 17596613, 16759278, 16144230, 15462181, 14950137, 14446057, 13763032, 13275032, 13176463, 12995045, 12639223, 12289312, 11895790, 11687571, 11392919, 11134983, 10828945, 10364808]
22307A0364808m56003l10085j91912k32672l13626j78878l05779l10927k19863
22298G845063j81700k66730j86778q3173k48357j85602q3795j40823j92420J9269
22288F294954K35728K69424L62614J52937J11536J40444j4701j23860l24067o93576
22278F411433r31768n64057j89212l10891k38317l79554j60167j07862l9951Q9295
22268C578949j71693j95604k5505k1032m8557p078k79813j08515k17366p1150
22258B432636J2550n4499l42555k12442J15879R9027J46786P7171q5351j55985
22248B033217m6305j24122n4042N2751K14622r4035p6066K01359J51978O694j22914
22237B143137j18490j09790R0697r2711O066j23132j77330l59497k16423K41001
$$ y = [10364808, 9908805, 9598720, 9406808, 9174136, 8860510, 8681632, 8375853, 8064926, 7845063, 7663363, 7396633, 7209855, 7126682, 6878325, 6692723, 6608928, 6468105, 6275685, 6294954, 6530682, 6800106, 7162720, 7315657, 7427193, 7567637, 7552936, 7429076, 7105009, 6411433, 5479665, 4915608, 4726396, 4415505, 4177188, 3797634, 3637467, 3529605, 3489654, 3578949, 3407256, 3211652, 3186147, 3165115, 3116558, 3109480, 2829667, 2721152, 2503786, 2432636, 2445186, 2390687, 2048132, 1835690, 1951569, 2050596, 2197382, 2274553, 2189202, 2033217, 1986912, 1862790, 1808748, 1861499, 2076121, 1982086, 1906020, 2107379, 2259357, 2266051, 2143137, 2024647, 1914857, 2005554, 1912843, 1918909, 1795777, 1618447, 1258950, 1042527, 1283528]
22227A283528J66271j7983l5947j19576j18541o1393j50791m2145K34640k8304
22217A109759r1430j86845j88047k1069N1701m830J57017j7008M6445j3669j03571
22206G38453j75916r0011p0774j14259l9151J74666o113j32250j49694N9212J14254
22195C08417j28755k8580K84440N4019k09990j11896P6321P7092j69402l9910
22185A11756L40L9052Q406M2796j52134K0661J60562J58468P940p5874J35398
22174D57371Q2711N0796L0999O6021N5197P944j66924j84256j39921M5378J8739
22163C24055P6950j65752N8534j42699K8044J16526L0637j71917j6544J172P3985
22152B12991L186j185M6906J49810R7217P1915K7393o7495j2597m3431m1005j47778
$$ y = [1283528, 1449799, 1431816, 1395869, 1276293, 1157752, 1096359, 945568, 903423, 1138063, 1109759, 1018329, 831484, 643437, 622368, 674069, 669239, 826256, 809248, 855693, 842024, 738453, 562537, 472526, 401752, 287493, 248342, 423008, 416895, 284645, 134951, 194163, 308417, 179662, 151082, 435522, 489541, 279551, 167655, 243976, 321068, 151666, 111756, 112096, 151148, 159554, 202350, 50216, 70877, 231439, 389907, 397847, 321973, 457371, 540082, 590878, 621877, 687898, 743095, 751039, 584115, 399859, 259938, 305316, 324055, 401005, 235253, 293787, 151088, 179132, 295658, 326295, 154378, 137834, 139006, 212991, 216177, 214992, 261898, 411708, 508925, 580840, 608233, 540738, 528141, 484710, 443705, 295927]
22140B95927m571M8540n7862N9316J75634j44272k15702P4678L442n2925k35669
22129e3464j8781k255J37246K22561k2048J3591j02919O0096k6591N7052m2419
22118B22069k19937j7800K8543n1730J82575R8723J99259J53652j64344k73831
22108A57179p2313J87005P892P9632M6289o9293k20668Q317N3068N4427p5689
22097A55846J67153J31079r9298K6643j7461m1926q404j00591R3286k59940j25166
22086g8779J89220k5198q0121J10875m5512M7256l9258r0206j5053O7063J54915
22075A95202K1475q3101N1199k6236j38192k3217Q8903k29126J8300J65497J1211
22064E1915M4912j1449j25932n1289j8184L2887Q4749M6676J6134M0361K4187
$$ y = [295927, 291356, 339896, 282034, 341350, 516984, 372712, 157010, 231688, 235130, 182205, -53464, -72245, -74500, 62746, 285307, 263259, 276850, 173931, 234027, 207436, 264488, 222069, 2132, -15668, 12875, -38855, 143720, 242443, 441702, 595354, 431010, 157179, 84866, 271871, 279763, 359395, 405684, 336391, 115723, 124040, 177108, 231535, 155846, 322999, 454078, 354780, 381423, 363962, 322036, 313632, 213041, 306327, 46387, -78779, 110441, 85243, 5122, 115997, 70485, 117741, 78483, -11723, -26776, 40287, 195202, 216677, 133576, 184775, 158539, 20347, -2870, 86033, -143093, -124793, 40704, 51915, 96827, 85378, -40554, -91843, -110027, -77140, 7609, 54285, 70419, 110780, 134967]
22053A34967J01301p64k5576j55135j66527M6639N0819j02632j27570m0036J10492
22042a74022K01864r8639N7089n5832j32222o5492L4314k2419K64705O4728Q0439
22031A54513N0708n2214k49554k35161l8103Q6174K97938J01805n0375k55433
22021a89702p6727n5760J56741J75988P7804K3525k36191k4009R9098l7680K0383
22010f6530J71209P1909m406J53341j16707j33598M9231l8435n5800J05055k7541
21999A07728q2405l4723L0755k6544J89488l7821k8616j2062k29238p2747j10330
21988c06515M3123q4514K4559R2986K04106p7183j1336K09930M7488j13598M0497
21977F9543j73393n7396R0469k3166R7059j7232k12294o3157j7335O8763J37534
$$ y = [134967, 236268, 235504, 209928, 54793, -111734, -65095, -14276, -116908, -244478, -284514, -174022, 27842, -70797, -13708, -69540, -201762, -267254, -232940, -255359, 9346, 74074, 154513, 205221, 153007, -96547, -331708, -369811, -283637, 14301, 116106, 65731, -189702, -266429, -322189, -165448, 10540, 88344, 111869, -124322, -148331, -49233, -86913, -66530, 104679, 176588, 172182, 325523, 208816, 75218, 124449, 86014, 30214, 135269, 107728, 25323, -9400, 21355, -5189, 184299, 146478, 117862, 105800, -123438, -196185, -306515, -263392, -347906, -323347, -230361, -26255, -103438, -114774, 95156, 142644, 29046, 69543, -103850, -161246, -70777, -93943, 3116, -14116, -226410, -289567, -306902, -238139, -100605]
21966a00605K0893p0612p0052J30849K1914p6828l2675R9913K23840J2711R4101
21955B53449Q9379j16947l5360n2831j53578n1728p8671n1433L9782K9423k9416
21944a57931R6213K22209J45368p930R7248j00857k11148k59576j10760P1536
21934b15628K26989J7863K4328j01828j63975j8515J08048J34491p4752j6989
21924g9968j81040j03270O7443K12537J80806j3699k05301o4915m8814j2261K26558
21913b1924R0534J3722q6526j30988M8471n2458L5671L1329Q8998M1817R1841
21902A50487l2710j82915p1727J03374l3417L2045J3901k8219j09739J04269j46531
21891b01182m5598J24730p2052J76328P7657n6516J336J21400L0123K2257j04692
$$ y = [-100605, -79712, -150324, -220376, -89527, -67613, -144441, -177116, -77203, 146637, 159348, 253449, 342828, 225881, 190521, 137690, -15888, -67616, -146287, -197720, -157938, -128515, -157931, -61718, 160491, 305859, 297929, 395177, 294320, 83172, -176404, -287164, -215628, 11361, 29224, 53552, -48276, -212251, -230766, -122718, 11773, -62979, -79968, -261008, -364278, -296835, -84298, 96508, 82809, -122492, -187407, -236221, -248482, -21924, 68610, 82332, -4194, -135182, -86711, -139169, -103498, -72169, 16829, 58646, 150487, 117777, -65138, -136865, -33491, -66908, -34863, -20962, -49181, -158920, -54651, -201182, -246780, -122050, -194102, -17774, 59883, 3367, 4703, 126103, 156226, 178483, 73791]
21880G3791l46047q1363K41276R3549n7831N1964q1319r0498k5342m534J0680
21869b15674O1643J69173m5009k28n2502r9556m874K16388Q8933o1331K7931L6578
21857A21472l1018j43695N6707N4925O375l5771J5218J4229q6311Q4982r8781
21846d1668k28435j21130O3939J44812K6144J10167j03393k0788N1332p2800o0153
21835b51973R4021J11343J39726N24O649J91609J91177J02342q6471p5465p8642
21824C44840J57310K61506K84280M38835M52642L14433R5290l5929m9841q5862
21814B177504k69167l70462n08398n74288k30387J66865N0193p0870k5902j95613
21804A49475j59841M1792K81632r8443r2005m5806m2659P7923P0328L0604j45772
$$ y = [73791, -272256, -353619, -112343, -18794, -76625, -24661, -105980, -196478, -221820, -226354, -215674, -154031, 15142, -29867, -30095, -82597, -182153, -187027, 29361, 118294, 56963, 84894, 121472, 90454, -53241, 3466, 58391, 64766, 28995, 44213, 58442, -27869, 57113, -41668, -270103, -391233, -327294, -182482, -156338, -46171, -149564, -170352, -119020, -191820, -251973, -157952, -46609, 93117, 93641, 100290, 291899, 483076, 585418, 498947, 423482, 344840, 502150, 763656, 1047936, 1486771, 1939413, 2253846, 2349136, 2313207, 2263366, 2177504, 1908337, 1537875, 1029477, 455189, 224802, 391667, 441860, 370990, 345088, 149475, -10366, 31426, 313058, 214615, 122610, 76804, 34145, 112068, 182396, 213000, 67228]
21793F7228L7627O1754L8511j07077j55452k32021r1906J42634J7839K08930K35120
21782B23187J229k0079p7310k63793n2291K3938l3712P9448Q791K0239J41398
21771E1045j36417J59617k4731j00142M2866j07766o0984J08636M9439J26463
21761A08026O5317Q3272o4092R409q1929r9075j18646J12400j1556L3694L4769
21750G1589r7833k13141N3588K38463J12461j69762j66854o6274P0466o0895r2936
21739c21128M62J46348J17144J7734j32538j02519L614l8032J96867P5043L6368
21728f37J8455K650j32177o7720J6823k17845L8605R872O9033K07648l5283o892
21716i7468j43155K3554J71739m9054Q7156J07856j1572Q2779N3823k34056k10411
$$ y = [67228, 104855, 166609, 205120, 98043, -57409, -289430, -381336, -238702, -220863, -11933, 223187, 224416, 204337, 127027, -136766, -189057, -165119, -198831, -119383, -110592, -90353, 51045, -85372, 74245, 49514, -50628, -7762, -115528, -176512, -67876, -18437, 108026, 173343, 256615, 192523, 201932, 120003, 20928, -97718, 14682, 3126, 36820, 71589, -26244, -239385, -185797, 52666, 165127, -4635, -171489, -237763, -167297, -228192, -321128, -320666, -174318, -57174, -39440, -171978, -274497, -270883, -308915, -112048, -37005, -637, 17818, 20468, -111709, -179429, -162606, -380451, -341846, -331974, -262941, -55293, -90576, -97468, -240623, -217069, -45330, -94384, -7228, 100628, 89056, 171835, 225658, -8398, -218809]
21705b18809M1479J06209M880p4442Q5305J56437L3459j64812k65472J13558K50282
21694F8074J16227j76795j57943j18371J50633J60164p1731k22187j12563n1562
21684d16054L5723n7477J18982J9288Q7580R2514K6282J6613Q4396O4421M8451
21673A20719k8768j57646r5001J20065K79060n7879n1966J4234r6892q4381N2951
21662A4496k53425J02914J70394J8052r710q410n7038j69451J34891J77596k1161
21651I9148P6228j64592r7863J4248N696j0609L7149O509P8459q1130k8747K0522
21639d4982Q8815M6408o1338k0476K97642K37793j71923k18987n0756j28339k02510
21628b28653k6230J5887J0006J12838Q3442q0844o8452P8527l9124J04369O3821
$$ y = [-218809, -177330, -71121, -66241, -140683, -55378, 101059, 134518, -30294, -295766, -182208, 68074, 184301, 7506, -150437, -268808, -118175, 41989, -29742, -251929, -364492, -416054, -380331, -437808, -318826, -299538, -211958, -119444, -93162, -76549, 7847, 72268, 120719, 91951, -65695, -160696, -40631, 238429, 180550, 128584, 142818, 45926, -38455, 14496, -238929, -136015, 34379, 52431, 42721, 34311, -22727, -192178, -57287, 120309, 99148, 175376, 10784, -87079, -72831, -67135, -77744, -40595, -34086, 44373, -36757, -65504, -44982, 43833, 90241, 28903, 8427, 306069, 543862, 371939, 152952, 102196, -26143, -228653, -254883, -238996, -228990, -116152, -32710, -113554, -182006, -103479, -142603, -38234, 25587]
21617B5587j63364j43262j57468K643J55351K04034J06393k3866j14525k4037
21607a32514p7607M6213p1638j06443M8499K20676n0151K0869P472Q7240j7228
21596b4612m5190K9604m8568r5911o472J78934Q3842j63621q6267j01406M7170
21585b32497L2604j2906o0810R6406n6073j58067J16248J48081M2708K02631K5709
21574A44034l9746o5361p5640k9866q4678k436Q2837p6839M3293Q0926K9034j06941
21562a01383p0120o5736J5744k7445Q8657J02636k8926r1794N0606N5462q4374
21551a56673j0499k98o5893J45492Q9774J61661M2670j45340j5207j28025J3484
21540f8854j53258n5731l9251K7810K4965N6472J12244L53K2665J12620k9911
$$ y = [25587, -137777, -281039, -438507, -435864, -280513, -76479, 29914, 6048, -108477, -132514, -210121, -163908, -235546, -341989, -293490, -72814, -122965, -102096, -94624, -7384, -24612, -69802, -40198, -88766, -184677, -191149, -12215, 71627, -91994, -178261, -279667, -232497, -199893, -212799, -273609, -177203, -233276, -391343, -275095, -127014, -84306, 118325, 144034, 104288, 38927, -36713, -66579, -151257, -153693, -70856, -147695, -104402, -23476, 5558, -101383, -171503, -237239, -221495, -248940, -160283, -57647, -86573, -178367, -127761, -72299, -156673, -167172, -167470, -233363, -87871, 1903, 163564, 206234, 60894, 45687, -82338, -68854, -222112, -277843, -317094, -289284, -264319, -207847, -95603, -95250, -72585, 40035, 10124]
21529A0124j98965J65012o3322J502q7088k45387k5710J20182O4522K3206m1365
21518b77289R1474J78310j721n355l8672p618J69030l5682J5784n182k52580R7184
21506g2317J39293j9951j59575j33692q8312j59520J54343l5554n450J06390J54779
21495a19566J02257K7797j30148p7600j24806k3534o6258K08454n7486J90420
21485g0470J36973j29807l3392J43595L017q1344n7182J05072J45242j09649j39663
21474h7608p1553K9965J0309M7421J36231J88580M034j02140N6123j90971k45431
21463b25040M957J0682J01876P7706p6832j33647L5960K97867J6745m9864o6008
21452e598L372j3404O4762r9794k0563J68515j28432k26745j24683R0624O4460
$$ y = [10124, -188841, -23829, -87151, -85649, -172737, -418124, -443834, -323652, -259130, -235924, -277289, -185815, -7505, -9226, -14581, -53253, -60871, 108159, 72477, 88261, 83079, -169501, -72317, 66976, 47025, -112550, -246242, -334554, -494074, -339731, -375285, -380735, -274345, -119566, -17309, 10488, -119660, -197260, -322066, -345600, -411858, -203404, -260890, -70470, 66503, -63304, -96696, 46899, 49916, -31428, -88610, 16462, 161704, 52055, -87608, -159161, -129196, -118887, -71466, 64765, 253345, 257379, 155239, 211362, 20391, -225040, -220083, -209401, -107525, -29819, -106651, -240298, -204338, 93529, 110274, 60410, -5598, -2226, -15630, 49132, -50662, -71225, 97290, -31142, -257887, -382570, -291946, -227486]
21441b27486K8599R9095j03139Q4774J74449J97932j56273j41766j71473j66613
21431c81901j12627K18301J19668R3925k9615j55268k10396J28076J66938L0406
21421a32493L0664Q4946j30255j5398J25593M3637p5877o1604m1760l5038J43631
21410f3954l9872l8002J88234J51983J13177O7495q859j69957j60079j10647K7134
21399d3347p9765J38509P2539q7847J1260N3618j8632k2759j72303j78157m0172
21388c67056J57104Q7304n0513o9107K13626Q6264J9572R015r1418m5236j16477
21377a66922o8574J22672J2381j40689j29343J4687L4802J4654J03877m5246p0857
21366c18558J07809r9964J306J08429O9070M8356o4656K2195K10873J61087k9985
$$ y = [-227486, -198887, -99792, -202931, -118157, 56292, 254224, 97951, -43815, -215288, -381901, -494528, -276227, -156559, -62634, -92249, -247517, -457913, -329837, -162899, -132493, -101829, -16883, -147138, -162536, -36943, 6694, -69183, -130787, -172547, -207585, -63954, -103826, -141828, 46406, 198389, 311566, 379061, 370202, 200245, 40166, -70481, -43347, -123112, 15397, 87936, 89, 11349, 64967, 46335, 23576, -148727, -326884, -367056, -209952, -122648, -173161, -242268, -28642, 57622, 77194, 86209, -5209, -50445, -166922, -235496, -112824, -100443, -241132, -370475, -355788, -320986, -306332, -202455, -247701, -318558, -210749, -310713, -309407, -200978, -131908, -83552, -148208, -126013, 84860, 245947, 215962]
21355B15962k6257j15209j50048k03700K3039N7892j03321K9142N8312N2376J50756
21344a1056J7430l3958O9022K7080O2473j49572o1201J12755N7781O2716r7358
21333E6112k65486P6804J4485n0822Q8138K91416o9441j75328j48972j45231M6650
21322b81675J58467q9119k32900N4315J46808M574N089J20899P3359L6117j38542
21311a42608K2464J82282o3947j88020j43247j07643K52575K58124p6923j61982
21301a68925K0908r2797m6989J72257n3112m7552j21506L295O4962P5382j63674
21290c57751j60682N8424J20740J98984J23976j81349J29275K70737j31423j17777
21280d6846J4390N7501o3868M9868L4385J337N0020J9844r8170j06337j4692k4183
$$ y = [215962, 189705, 74496, -75552, -279252, -256213, -198321, -301642, -272500, -214188, -161812, -11056, 6374, -27584, 41438, 68518, 130991, -18581, -79782, 32973, 90754, 153470, 56112, -209374, -132570, -118085, -168907, -80769, 210647, 141206, -34122, -183094, -328325, -281675, -123208, -212327, -445227, -390912, -244104, -239530, -234441, -113542, -40183, -4066, -142608, -120144, 62138, -1809, -189829, -333076, -440719, -188144, 69980, -6943, -168925, -148017, -240814, -287803, -115546, -168658, -216210, -337716, -334421, -269459, -194077, -357751, -518433, -460009, -339269, -140285, -16309, -197658, -68383, 202354, 70931, -46846, -32456, 25045, -38823, 11045, 45430, 46767, 96787, 116631, 18461, -87876, -102568, -126751]
21268a26751J02431P3649k6435j11542o3348J639P6722k1211J15983n442Q1711
21257I7406J9596n7408Q5644L3787j45799j30125k4164q4725m1321Q5123M0372
21246a21614q5772j52673r2689o9097J04631L4240j7025P2245L8830K1678R6940
21235a70306Q0789L7205L9765j48494j39064O2730j47402j40240n2390r0041Q1244
21224e86204J57582J55347K216M3392K37664O3502k33390K9200J17650j51k6453
21213c9645r3016n8604L8023m8165K28684N5533M4958J3305J4859k7772j17978
21202A0182j48268N2051R6639O2237N6405o7370n8834K7935J2829n6340j06143
21191a18677K7221O3199p8301l4451J29773m1681J40396M662k16526q8269O2287
$$ y = [-126751, -24320, 49329, 22894, -88648, -151996, -150357, -73635, -94846, 21137, 15695, 97406, 117002, 59594, 145238, 179025, 33226, -96899, -121063, -205788, -247109, -161986, -121614, -207386, -360059, -452748, -521845, -417214, -382974, -399999, -327754, -288924, -267246, -170306, -89517, -52312, -12547, -161041, -300105, -237375, -384777, -525017, -577407, -667448, -586204, -428622, -273275, -271059, -227667, 9997, 73499, -159891, -130691, -13041, -13192, -39645, -132661, -191265, -153242, -201407, 27277, 82810, 127768, 141073, 155932, 128160, 10182, -138086, -86035, 10604, 72841, 129246, 61876, 3042, 30977, 43806, -12534, -118677, -91456, -28257, -106558, -141009, -11236, -52917, 87479, 92141, -124385, -212654, -150367]
21180a50367j4873M2019j54265p4709Q1787J21998j4326k29210R4735J46721k3087
21169a73577l070m7080P7649R2084J1238l1128K5350j36626j84778j07746J99648
21158b78036J09195M8452Q2803N2984r7454P7666L8049j59721j42180N0933O2551
21147a54758j15145N8098J59899o7756k72363j46205J21532J21410P4492J4381
21137b06415J1065L4444p3364l6011R1756r1011N3841j2767M7146J24724j76270
21126b32862N2684K07818P5694q0891m0968k0076j00872k1679J72342l274j9778
21115a1862p3457o2581O1574m1848j4957J0573J0772N1622O5864P2570p5245n2155
21103e9130j2836k6770j31896R059L038l7963Q3986L9224L5734P9033O352q0897
$$ y = [-150367, -165240, -123221, -277486, -352195, -270408, -148410, -162736, -391946, -297211, -150490, -173577, -176647, -223727, -146078, -53994, -42756, -73884, -48534, -185160, -369938, -477684, -278036, -168841, -120389, -37586, 15398, -82056, -4390, 33659, -126062, -268242, -217309, -154758, -269903, -211805, -51906, -119662, -392025, -538230, -416698, -295288, -220796, -206415, -195350, -160906, -234270, -270281, -178525, -269536, -215695, -228462, -181316, -56592, -232862, -180178, 27640, 103334, 22443, -18525, -38601, -139473, -161152, 11190, 7916, -11862, -85319, -147900, -86326, -128174, -143131, -132558, -121786, -70164, -4300, 68270, -6975, -59130, -71966, -98736, -230632, -221573, -218535, -256498, -172512, -133288, -97554, -18521, -12169, -93066]
21091i3066j09571K498J72018j77373q1213j13177J3757J38373Q5246J7384P616
21080a37508o3051q0648l3476l8662K3164L3716R3420j48548m3425O372k6821
21069d15467K90090K03917P192o4984l6599q2273k0306j31213L423j7604R7121
21058a66703R3557j08985j05917O8793Q2096P3230k50067q3394O8576K3275J14224
21047a91315j0211q9511R7264J13072R73n0904l3627O1964J01285n7967j39894
21036a98871m8278O219j5974J01772J09416N3267k3572K8009R6451j31904q7574
21025a11039Q3662J02282L1145p1526n4430j71732O7891P3285L7272l6466J79734
21014A30078j50911k0639M6741j8219R860j28660O2852K908k40176n271K18090
$$ y = [-93066, -202637, -200139, -28121, -205494, -286707, -399884, -386127, -247754, -162508, -145124, -137508, -200559, -281207, -314683, -353345, -330181, -296465, -203045, -351593, -395018, -388646, -415467, -125377, 78540, 85732, 20748, -15851, -98124, -118430, -249643, -246220, -263824, -166703, -73146, -182131, -288048, -219255, -137159, -63929, -313996, -397390, -328814, -305539, -191315, -201526, -291037, -193773, -80701, -79728, -130632, -164259, -102295, -1010, -58977, -198871, -247149, -240930, -256904, -155132, -45716, 7551, -16021, 11988, 108439, -23465, -111039, -27377, 74905, 106050, 34524, -19906, -191638, -123747, -50462, -13190, -49656, 130078, -20833, -41472, 5269, -12950, -3090, -131750, -68898, -65990, -306166, -311437, -93347]
21003i3347o4385k9646J98091R1721m1346j38047m1676j08396M8057J18438P4674
20992A4138r3914R5255j9234q2327j59842j18033J17552j08370n4448m0004J21952
20981c27275J87691K55490K0021l00756j89852J42673K18343K3916j12742q6739
20971a69230M6897R240N0229j16919q6445L9378L8869j10601k9377J6983J13699
20960a97277J40645q3607m3042K8142R0460l6304J1135n3785J52057j62896k93372
20949d47844l0648K41882K30384O6720r8667j2644k21574j76716Q3230j5374P3090
20938c08161o6149N6689R7112R1006J16536l2796k1940j32286j34325K8223J34737
20927a71354l8227M0151r5223J75978J24417Q4715N1594j04661j20371n3401k6067
$$ y = [-93347, -157732, -187378, 10713, 102434, 61088, -76959, -118635, -227031, -178974, -60536, 14138, -79776, 15479, -3755, -86082, -245924, -363957, -246405, -354775, -409223, -449227, -327275, -139584, 115906, 135927, -164829, -354681, -212008, 6335, 30251, -82491, -169230, -122333, -113093, -62864, -179783, -266228, -226850, -187981, -298582, -327959, -310976, -197277, -56632, -140239, -183281, -155139, -64679, -100983, -89848, -143633, 8424, -154472, -447844, -478492, -236610, -6226, 60494, -38173, -50817, -272391, -449107, -365877, -381251, -308161, -374310, -317621, -220509, -129503, -12967, -45763, -67703, -199989, -334314, -306091, -171354, -209581, -169430, -264653, -88675, 35742, 120457, 172051, 67390, -52981, -106382, -132449]
20916a32449k8607L7193N829m0358q715q1966j8558k7242N1146K35419k6469n563
20904d0340j07610K4760J19969m0396r4168r0219j74630M1696K42967J3821J2866
20893i1284N4238o3213j1469n9051k10179J26717J04947j13306j07218j4571M4910
20882c39479L0215m67J4608Q4328q623K454j05251j9746J99723J07516l5719n9626
20870a30067n6671M3507Q0822p6251N3542J87752J37912j03746k43191m4179k8992
20859a79562J9066J74992O2584j22184j9345j32612L4184J43800K6564J26762
20849A34249R3849j20091k72331J0987K08554J20154l8976K8327k4638j04297
20839C5787j08848j62475o4709J81868J69928p9244j26990O1848n4775p8107r1961
$$ y = [-132449, -161056, -123863, -118034, -158392, -167107, -249073, -267631, -294873, -243727, -8308, -34777, -40340, -147950, -123190, -3221, -43617, -137785, -228004, -402634, -360938, -117971, -104150, -91284, -37046, -100259, -111728, -170779, -380958, -254241, -149294, -262600, -369818, -384389, -339479, -309264, -309731, -295123, -210795, -219418, -216964, -322215, -341961, -142238, -34722, -70441, -130067, -186738, -143231, -62409, -138660, -85118, 102634, 240546, 136800, -106391, -150570, -179562, -160496, 14496, 77080, -45104, -64449, -197061, -162877, -19077, 7487, 134249, 228098, 108007, -164324, -153337, 55217, 175371, 136395, 164722, 140084, 35787, -73061, -235536, -300245, -118377, 51551, -27693, -154683, -92835, -147610, -225717, -317678]
20828c17678l1553K45754L9923K7661N4351m1170l5949j67351k30328k9710K2104
20817d63946l4455R0671J61936J31587q1143M0635J40254n1475j4119R5527N4050
20806F9522p3920L3893o2514l4266j7604j36933M7665o3475L6796J20796k19136
20795b99176r3479J90316J66123J30430m6599n6171j24709p1635m0294J04982
20785a40212p2703j48968O5433K8126P3082l665J55132O851o4104j11855n1606
20774b64489O624p1558n4141O6454J62081R7825J9445j20144J83123J26941k00376
20763d8215r0632n3202j5386p1853j27672J19841K77327P1963o0070r746j38816
20752a46461j22063K2715l4912o7803R369L3122K3361K6621o475M6983q9274m2518
$$ y = [-317678, -349231, -103477, -63554, -35893, 18458, -22712, -58661, -226012, -456340, -486050, -463946, -498401, -407730, -245794, -114207, -195350, -154715, -14461, -65936, -80055, 15472, 69522, -4398, 29495, -33019, -67285, -84889, -221822, -174157, -237632, -200836, -80040, -299176, -392655, -202339, -36216, 94214, 47615, -8556, -133265, -204900, -245194, -140212, -212915, -361883, -296450, -268324, -195242, -198907, -43775, -36924, -101028, -212883, -264489, -257865, -329423, -383564, -317110, -155029, -57204, -37759, -157903, 25220, 152161, -48215, -138847, -192049, -207435, -279288, -406960, -287119, -9792, 62171, 2101, -7645, -146461, -268524, -245809, -280721, -348524, -339155, -306033, -282672, -256051, -262526, -215543, -304817, -347335]
20740c47335k0516R8417N4957q4692j11077Q1571J49850l4304k33002m5584R5620
20729c96095J05976N6874l6616J9943J7081M1710J04683J08627r196m867j27800
20718a19680q3149J73764M0842J9448l0244j29569k38478L2779N6174J03478L5795
20707a38840P2679j20100k44707L4987J80649o9611o9696m1064j71374k5899L33700
20696b59276J57008J05921r030N8055j35014k14887j9159l7696N9819R8380j2811
20685b08690j21641Q4046L1792N1738J3787M7256K94163N36j12407k75287M0557
20674a54150r725P0648N9M8499J3902j26326j4568j17039j02347J25551J91527
20663g3969J18254J3939k6799N1714j01897o5931j78863j69539J85901J92256
$$ y = [-347335, -367851, -269434, -214477, -299169, -410246, -328675, -178825, -213129, -446131, -491715, -396095, -290119, -233245, -269861, -249918, -232837, -191127, -86444, 22183, 12987, 8120, -119680, -202829, -29065, 11777, 31225, 981, -128588, -367066, -334287, -278113, -174635, -138840, -66161, -186261, -430968, -395981, -215332, -284943, -354639, -395703, -567077, -592976, -259276, -102268, 3653, -5377, 52678, -82336, -297223, -316382, -354078, -294259, -195879, -208690, -330331, -246285, -214493, -162755, -148968, -101712, 192451, 192987, 80580, -194707, -154150, -163875, -93227, -93168, -44669, -30767, -157093, -171661, -288700, -391047, -265496, -73969, 44285, 58224, 31425, 83139, -18758, -84689, -263552, -433091, -247190, -54934]
20653e4934J6360j00839l9708M3744l9860R2293q4175J474r8442J0972j5577q5076
20641c53768p525J19584J21080m9891L8138J6622M1811M890J9024J46492N6691
20630A53148j64812r9972L6000P9254L1152j18346j04130p621r843o8933J45880
20619a28223O0356k7892n8420K6203L9729J8967M7033l853q8516o8862J143j0901
20607a93236J30658Q1862K598J4K30530j893k01178P7671k4163j27799j03112
20596a28048j50871l5247J44416O2373L4235O6500j20417L1200K3143P3790j80831
20585a79757o7931O0327L5778o812j18835O5882J98985p168P87M4622J71789q3079
20573A14588m9627m2902n2046m0299j22130Q2359N8764j43694n7838J34315J67565
$$ y = [-54934, -38574, -139413, -179121, -135377, -175237, -82944, -167119, -165645, -264087, -253115, -268692, -353768, -361293, -241709, -120629, -170520, -132382, -115760, -73949, -69059, -50035, 96457, 153148, -11664, -111636, -75636, 3618, 34770, -83576, -187706, -195327, -205170, -274103, -128223, -67867, -95759, -154179, -127976, -88247, -69280, -22247, -26100, -114616, -183478, -182335, -193236, -62578, 19284, 21882, 21896, 252426, 250533, 49355, 127026, 102863, -24936, -128048, -278919, -314166, -169750, -107377, -73142, -6642, -127059, -95859, -72716, 1074, -179757, -247688, -187361, -151583, -158395, -277230, -211348, -12363, -19531, -18744, 25878, 197667, 114588, 64961, 22059, -29987, -70286, -192416, -110057, -51293, -194987, -252825, -118510, 49055]
20562D9055p962l0079K800o1035j18394m1738J58060j1051j33041j9014M7077
20551a65322J2972m431J2848j20100k43211R4099J71468m502j40860l8987K3871
20540d02155P528m7425j07353J11040K29071J86695j11082j310j02253q7078r228
20529c33550L7095K17976J11614j0924j37519O281O4962r2939j27851j73562J35923
20518c02494J92461P9541J84975j00305j78067j79660j3023J00545R035J23627
20508h3365L3792n6753J2290K7809n8299j3399K3286m2301L0031r4962j17667
20497c39538O9894O6120Q4211J47749J47740j0045j4402o9327J835J5141Q037
20486A07415j17361J995J00140l8328j32828m9978K12670J28783L5602K6702q46
$$ y = [49055, 41093, 11014, 13814, -47221, -165615, -207353, -49293, -60344, -193385, -212399, -165322, -152350, -156781, -143933, -264033, -507244, -413145, -241677, -246179, -387039, -426026, -402155, -394627, -442052, -549405, -438365, -209294, -22599, -133681, -134991, -237244, -324322, -333550, -296455, -78479, 33135, 22211, -115308, -109027, -44065, -137004, -264855, -438417, -302494, -110033, -30492, 154483, 54178, -123889, -303549, -316572, -216027, -206992, -83365, -49573, -106326, -94036, -66227, -124526, -137925, -114639, -156940, -126909, -221871, -339538, -269644, -203524, -119313, 28436, 176176, 166131, 151729, 82402, 84237, 99378, 107415, -9946, -7951, 92189, 53861, -78967, -128945, 83725, 212508, 248110, 274812, 273966]
20475B73966j14274P3113n6352o5697o2254m269R4734j59346j25338M5562N4283
20464d5872j35996r7646l3079N6345m1885J24650L0564K07185n082r0367N4752
20453B3569N7767j67549n9723N7978J05563M9952J90j47468M4949p4771M0360
20442f9183O1119O5320q6483j50370q3980J12333J95569L0019j44090K6795p0775
20431a13726p4427j29016n8388J07602j9L1203o1112L3457J6650p6308O8341K57236
20419A493J76630L2579k24985r4555m3708k40969O9444L48622K61233m6088k37484
20408B212j31822Q186K5590K17732M28394L80624K34949K20461K03066K11125
20398A800517J84577j65l3250r1233l86821m31254j80468n4805l54236l6575L5709
$$ y = [273966, 159692, 232805, 176453, 110756, 48502, 44233, 138967, -20379, -145717, -100155, -45872, -181868, -279514, -312593, -256248, -298133, -173483, -142919, 64266, 59184, -31183, 23569, 81336, -86213, -145936, -87958, 17605, 67557, 67747, -79721, -34772, -109543, -69183, -8064, 57256, -29227, -179597, -263577, -151244, 44325, 74344, -69746, -42951, -113726, -188153, -317169, -375557, -267955, -267974, -236771, -297883, -264426, -247776, -324084, -255743, 1493, 178123, 210702, -14283, -108838, -152546, -393515, -324071, 24551, 285784, 239696, 2212, -129610, -121424, -95834, 121898, 550292, 930916, 1165865, 1386326, 1589392, 1800517, 1985094, 1984929, 1951679, 1860446, 1473625, 1042371, 861903, 807098, 452862, 416287, 451996]
20387D51996n5287j62284k7260l1638J17910M1483j43861l7932K06822p6556j00559
20376A82834k03868k0887O8139P4367J21539J65876j09349j52792l05167q1361
20366b60669J77466L5067L5412O0395J54798J40775J4472j49841j44005k7707
20356C6163j58175L0973Q505J17293Q2529k3341m3134p3753k5929j0248q0606
20345a39723Q5290P338q0124J1264L4878o2453j6717Q6288P8033J26099l6249
20334I3924k51118j30178J39714J15166M8212l8871R8165j59141p2821j03572
20324b60520r7810l5082O2670q7444k4499M31080J11463k06458K5876o386K0737
20313f6373j6217j28190J5265P0704p1903k09479R1165J92763O4880n8058J75131
$$ y = [451996, 396709, 234425, 207165, 175527, 293437, 334920, 191059, 153127, 359949, 283393, 182834, -21034, -41921, 26218, 100585, 222124, 388000, 278651, 125859, -179308, -260669, -83203, -48136, -12724, 47671, 202469, 343244, 357716, 207875, 63870, 36163, -122012, -91039, -82534, 34759, 117288, 93947, 50813, -22940, -48869, -59117, -139723, -54433, -47095, -127219, -115955, -81077, -143530, -160247, -73959, 4074, 130173, 93924, -157194, -287372, -147658, -32492, 15720, -23151, 75014, -84127, -156948, -260520, -358330, -393412, -330742, -418186, -442685, -11605, 99858, -106600, -80724, -87110, -66373, -82590, -210780, -195515, -124811, -196714, -406193, -315028, -122265, -57385, -115443, 59688]
20302E9688J52606j07473j25306R5846m5884j89913j06815L3167j15j1988J59425
20291h6762J40093o3290p4423L8967m7074R9766N7616j5664K9354O7930n0542
20280I5971m6987j06347j8668O6609J72799L2270l24894j23782J24801Q5746J7175
20269b5307Q5135o444k1638k5067k33389j2901L0527m7125N3189j33167n9275
20258c95462M7595K14710R6669k7939J2766j46680J39341J21571P2546k6517k59574
20247a50974r1426J02956M3375p551l5503L3303j69026Q0969J51097J25921o0996
20236B2145j71025P3913q464p6975k7000K8960o7351o3172q3500L5126J00661
20225b36682L6468J17224K6917J4914o3435j04533m297J30038K7259j19939j29644
$$ y = [59688, 212294, 104821, -20485, 75361, 29477, -160436, -267251, -234084, -234199, -246187, -86762, 53331, -9959, -84382, -45415, -92489, 7277, 64893, 49229, 78583, 146513, 95971, 48984, -57363, -76031, -9422, 163377, 195647, -129247, -253029, -128228, -42482, -25307, 59828, 53384, 31746, 6679, -226710, -239611, -209084, -256209, -203020, -336187, -395462, -347867, -133157, -36488, -64427, -51661, -198341, -59000, 62571, 135117, 108600, -150974, -242400, -139444, -96069, -103620, -139123, -105820, -274846, -193877, -42780, 83141, 22145, -148880, -74967, -83431, -160406, -187406, -158446, -225797, -288969, -372469, -337343, -236682, -200214, -82990, -56073, -41159, -104594, -209127, -213424, -83386, -56127, -176066, -305710]
20214c05710N9753J63027J53602m9131j09239O7195k4187N2115j45561q2013o5304
20203b85453O8013J50069j42557j33762J46314J29562m6238M0730m0685n9817
20193a73824j06388N6769O0741M2671J81793Q9929M7117k60862q5951j99584o785
20182c54374J34987J2375n1082J07328K25114N5429J74925J44686m0434j25675
20172B83279j48359j6514k49J27922L1224j80174j30346J21464L3424j10459k9811
20161a8599k52994j37704J64177L6922m3078K05254p6817Q585J48059k4595j54519
20150a45309j0005M0447l0654k9810k9250o7889p4613J5297R8328P6727j252N6813
20138a01170n7305N7628J22181k04916J1066P9032J5092L7667M0894l5962j15133
$$ y = [-305710, -245957, -82930, 70672, 21541, -87698, -20503, -44690, 7425, -138136, -220149, -285453, -217440, -67371, -209928, -343690, -197376, -67814, -114052, -73322, -114007, -173824, -280212, -223443, -162702, -120031, 61762, 151691, 198808, -62054, -148005, -347589, -354374, -219387, -207012, -258094, -150766, 74348, 129777, 304702, 449388, 408954, 283279, 134920, 118406, 118157, 246079, 277303, 97129, -33217, 88247, 121671, 11212, -18599, -271593, -409297, -245120, -208198, -251276, -46022, -122839, -114254, 33805, 9210, -145309, -155314, -114867, -145521, -175331, -204581, -272470, -347083, -331786, -233458, -156731, -157983, -101170, -158475, -100847, 21334, -183582, -172516, -93484, -78392, -40725, 169, -35793, -150926]
20127a50926R3330K7285j42039o2958O0404L5669L9098P1550J85540j1509j66459
20116b1015K9662j65346l0774n4421q2154M8345O19L7353k3904j73530J62730
20105b72435J07785M2436j16919p4703O4152K603j0740J28468K1160L1881M2046
20094c4266j8270n7068k0922l5204j18872r0290J71297P1760n6509j1805p0592
20083b70741P586J05797n5620j9584m8814P844O6775J97975P9569m6448j7990
20072F349J1910R7503J98573k8799P8242R8157r1386k26051j02190k6617M6135
20061F1826j03172M4824L9816Q1692J17413m5073p4209j22347j76319k0056L7252
20050a58353r1711J2267J92756R9945m7481J09490p6572R0J52928K465j3719j91289
$$ y = [-150926, -57596, -30311, -172350, -235308, -174904, -139235, -100137, -28587, 156953, 145444, -21015, 8647, -156699, -187473, -241894, -324048, -275703, -275084, -237731, -261635, -435165, -272435, -164650, -122214, -239133, -313836, -249684, -247081, -257821, -129353, -108193, -76312, -34266, -52536, -109604, -130526, -165730, -284602, -374892, -203595, -131835, -188344, -200149, -270741, -263155, -157358, -212978, -232562, -281376, -273532, -206757, -8782, 70787, 24339, 6349, 18259, 115762, 314335, 285536, 363778, 461935, 370549, 144498, 42308, 15691, 61826, -41346, 3478, 43294, 124986, 242399, 197326, 123117, 770, -175549, -195605, -158353, -250064, -237797, -45041, 54904, 7423, 116913, 40341, 40431, 193359, 195824, 182105, -9184]
20038i184m7356j191J57887m4402r6909p6427p6375J8532N2921J24288J32907
20027A34691j48367k48838M6111k9610n1856J6110K3836l222l4086J39409J21067
20016c4755j02997q1410L0088p895l8526Q3308p6121Q4384J9074j52358n9849
20005c37057m5393o1532L9355N5651J8780q3044r280O247J73669J5409o3830P9268
19993b11757L366K13441o6684J53936J17418q5696j53776M2990k8100m5996l9111
19982i9969k23927J63194O0443L5316j57752j10753J75499J72878k75O9M6077
19971F0800K6417j04468j45876j10825q8767N4878J42415J21017M7874k3055k466
19960b2056m4954L5263J4831j4680O8087J26350n4290k19706J48452q1699k1686
$$ y = [-9184, -56540, -57731, 100156, 55754, -41155, -117582, -193957, -175425, -122504, 1784, 134691, -13676, -262514, -216403, -246013, -297869, -281759, -257923, -261145, -295231, -155822, -34755, -137752, -219162, -189074, -196969, -235495, -152187, -228308, -143924, -124850, -277208, -337057, -382450, -443982, -404627, -348976, -330196, -413240, -422520, -416273, -242604, -227195, -291025, -211757, -208391, 5050, -61634, 92302, 209720, 124024, -29752, 13238, -14862, -60858, -99969, -323896, -160702, -100259, -64943, -222695, -333448, -157949, 14929, 14654, 14723, 60800, 87217, -17251, -163127, -273952, -362719, -307841, -165426, -44409, 3465, -19590, -22056, -67010, -31747, -16916, -31596, 36491, 162841, 108551, -111155, 37297, -44402, -66088]
19949f6088Q9052J16750L4036J95068n3955j17511j3452N2065o9145l0933J19906
19938B55793L213J7883K5470P9711O9557n861o5615j5654j03328l1923J29907
19927C59153o513L217r2158q3448m3293k3029j08415J79652K33417n692q5096
19916C27795M044r966m0130m5294J65457L5035j09230p1477j518J9175R7158K6854
19904C97903K08842J26430r0011r7697q0320k5058N0830j0670L9109K3953M0177
19893E83488n4842p8919O6740Q3708J23225J05968J03988R8946N5353J34211J84825
19882A406691K43278J23821j21411j14920M4744j54627k41071j93623p947J55594
19872A140529J21881q0144j18605n1291n6017J06887N7993l4451M8798l0870p5585
$$ y = [-66088, 22964, 139714, 173750, 368818, 314863, 197352, 183900, 235965, 166820, 135887, 255793, 259006, 276889, 302359, 382070, 451627, 445766, 380151, 364497, 261169, 229246, 359153, 352640, 355857, 263699, 180251, 136958, 113929, 5514, 185166, 418583, 412891, 327795, 331839, 321873, 281743, 236449, 401906, 436941, 327711, 256234, 254716, 273891, 371049, 397903, 606745, 733175, 643164, 545467, 465147, 440089, 490919, 480249, 519358, 543311, 583488, 528646, 449727, 516467, 600175, 723400, 829368, 933356, 1032302, 1087655, 1221866, 1406691, 1649969, 1773790, 1652379, 1537459, 1582203, 1427576, 1186505, 992882, 984935, 1140529, 1262410, 1182266, 1063661, 1012370, 956353, 1063240, 1121233, 1086782, 1135580, 1104710, 1029125]
19861A029125N7981P7305J73924L1264N4967J63057J54413P3801j73110J14887
19851A757614K99260K62959L00960K03228J5971J76231K51002O03361O50737O75626
19841E196949R91116Q76598Q01955J016162J275763J538108J433466J247301Q15554
19832A5192972N60551Q23939J253480R39993N41864N38267J019341J940339K671152
19823B5481898L605628N045419O536593R133804J2750812J8423530K8678581M7065434
19815A56721699P3719745R2420071P9231425M6289604K7189928K2460196J4266077
19808E12298745j7354740p6427586j12073657r3768516n7764461l3648076k0958804
19801A00302905j4329472j0479972p976741o022035m732277l544709k606199j714808
$$ y = [1029125, 1087106, 1164411, 1338335, 1369599, 1424566, 1587623, 1742036, 1815837, 1642727, 1757614, 2056874, 2319833, 2620793, 2824021, 2839992, 3016223, 3267225, 3870586, 4521323, 5196949, 6188065, 7064663, 7866618, 8882780, 10158543, 11696651, 13130117, 14377418, 15192972, 15753523, 16577462, 17830942, 18770935, 19312799, 19851066, 20870407, 22810746, 25481898, 29087526, 34132945, 40669538, 49803342, 62554154, 80977684, 109656265, 156721699, 230441444, 322861515, 402092940, 448382544, 475572472, 498032668, 512298745, 494944005, 418516419, 306442762, 212674246, 154909785, 121261709, 100302905, 85973433, 75493461, 67516720, 61494685, 56762408, 53217699, 50611500, 48896692]
19793D8896692j321344j344984r90551j070595j261946j420417j629071j655489
19785C8202295j746588j952790k117799k106025j907507j651555j590978j411994
19777B3717059j364351j056812q14997p99946r91913q39232o00003p57068n34730
19768A5958007m45182m60349m57365l33564k98002j68852l51566o48312n17922
19759A2276893n64428l82546k69514l93448l38739k14912j05594k69929l66985
19750I370798l56430l66021l45869j87128m2365p3182m04472k61608j35646k14047
19740F984030l65724j28071k10051j82547k83593j97800k16377j04147k11972
19731E083748k27759k80114p8101O3552k19011k26676l23467n5211q9239L2901
$$ y = [48896692, 47575348, 46230364, 45239813, 44169218, 42907272, 41486855, 39857784, 38202295, 36455707, 34502917, 32385118, 30279093, 28371586, 26720031, 25129053, 23717059, 22352708, 21295896, 20480899, 19680953, 18689040, 17849808, 17249805, 16492737, 15958007, 15512825, 15052476, 14595111, 14261547, 13963545, 13794693, 13443127, 12794815, 12276893, 11712465, 11329919, 11060405, 10666957, 10328218, 10113306, 10007712, 9737783, 9370798, 9014368, 8648347, 8302478, 8115350, 8072985, 7999803, 7595331, 7333723, 7198077, 6984030, 6618306, 6490235, 6280184, 6097637, 5814044, 5616244, 5399867, 5295720, 5083748, 4855989, 4575875, 4497774, 4561326, 4342315, 4115639, 3792172, 3736961, 3647722, 3680623]
19721C680623K0036k2940l7842k0480l3896k34253m1909j12359j16264n9766l6242
19710B984708k25998j7022r3510R8871k38789j61557L0985n8189j22073p5403
19700B122023o4837J63493O3179k7771j65227q7896n6913L9676L3207k29214j35773
19689A653947Q2288J64176P102M9940o4891j32514q7941J33395J15390L2712k93431
19678A660173j64551J34355o833j78882j05880r4874k12250M0113n535p8731j25398
19667H61707P5576N6100M6507O7331j01711n6527l9997j0354j96474j99033R7547
19656F00672l8816P854o7138o9479Q0305k6094n4789m8314j9565q7535j43968
19645A33133K41957L66255p3558j43008r125l6127K6761J2013m4100q8905n5640
$$ y = [3680623, 3700659, 3677719, 3639877, 3619397, 3585501, 3351248, 3309339, 3196980, 3080716, 3020950, 2984708, 2758710, 2741688, 2648178, 2747049, 2508260, 2346703, 2377688, 2319499, 2197426, 2122023, 2057186, 2220679, 2283858, 2256087, 2090860, 2002964, 1946051, 1985727, 2018934, 1789720, 1653947, 1736235, 1900411, 1907513, 1957453, 1892562, 1760048, 1672107, 1805502, 1920892, 1953604, 1660173, 1495622, 1629977, 1623144, 1444262, 1338382, 1243508, 1031258, 1071371, 1065836, 987105, 861707, 937283, 993383, 1039890, 1107221, 1005510, 948983, 908986, 898632, 702158, 503125, 600672, 561856, 569710, 502572, 433093, 513398, 487304, 432515, 384201, 364636, 277101, 133133, 375090, 741345, 667787, 524779, 515654, 479527, 506288, 518301, 474201, 385296, 329656]
19634C29656J9186J35667N4087m0115m3786J03202n6411j15097k5204Q3551m850
19623D39886J41125j08447Q4195J36562K7734M1127J1303m9844K5346J24277m0850
19612H32414p1933l0545j00974j35363k1255j2160N0507J05287K6314q5803O8823
19601F25312j38964j43391R2463J26717Q1793M384j71365j36770K5484N5413J5445
19590D36521q3853r0478O7773N8180J22216K03593m9035r4865p2078j5932j40630
19579C41412j0822L7774j84015k05949J7588J45363J85576J25787J28364N6634
19569F37712j59417j96384K23523j06650j68867j19479Q0940L26029r1919j73719
19559B51769j13074Q8830m8487J06108L2079j43056K5238m8803r4614m0549k8455
$$ y = [329656, 348842, 484509, 538596, 498481, 454695, 557897, 501486, 386389, 361185, 444736, 439886, 581011, 472564, 556759, 693321, 721055, 762182, 773485, 723641, 748987, 873264, 832414, 760481, 729936, 628962, 493599, 472344, 460184, 510691, 615978, 642292, 556489, 625312, 486348, 342957, 435420, 562137, 643930, 648314, 476949, 340179, 365663, 421076, 436521, 352668, 262190, 329963, 388143, 510359, 713952, 664917, 570052, 497974, 482042, 341412, 330590, 368364, 184349, -21600, -4012, 141351, 326927, 452714, 581078, 637712, 478295, 281911, 505434, 398784, 229917, 110438, 191378, 517407, 425488, 251769, 138695, 227525, 179038, 285146, 317225, 174169, 199407, 150604, 55990, 15441, -13014]
19548a3014K5592K3757k10195n2120L08043K12913L6693Q2082O3218q04j55841
19537C20324k07487p0768K197J63743K01765j75841r0236p537J02926j39907j5955
19526H3224J11816J23140p0208r7779K6267j66396j31575M3650Q3337Q5606Q6991
19515A78073k5662l2659J23840J10138k5798j08298j5287J15297m1861J8571r9187
19504A97167O9818k0322J04647J21385k7668J57812J9051j46320M4366r9568J27772
19493E48140N8965j51179j58237p6183O2902J35637j26184n3135J25324J30367
19483D96417j50401q4671q41J29207L1012j35801j41418j02058J7727l2415J30260
19472A57018Q7033J75592M0546m9222j7787j61196j251r4335j83490J8863k0921
$$ y = [-13014, 12578, 36335, -173860, -225980, 82063, 294976, 331669, 413751, 476969, 476165, 320324, 112837, 42069, 44266, 208009, 409774, 233933, 143697, 136160, 239086, 99179, 83224, 195040, 318180, 247972, 150193, 176460, 10064, -121511, -77861, 5476, 91082, 178073, 152411, 119752, 243592, 353730, 327932, 219634, 204347, 319644, 277783, 296354, 197167, 266985, 246663, 351310, 472695, 445027, 602839, 621890, 475570, 519936, 420368, 548140, 607105, 455926, 297689, 221506, 284408, 420045, 293861, 240726, 366050, 496417, 346016, 261345, 260504, 389711, 420723, 284922, 143504, 41446, 59173, 26758, 157018, 244051, 419643, 460189, 410967, 393180, 231984, 230733, 136398, -47092, -28229, -49150]
19461d9150j10922L3971J4643J52723J29180J6064o3715l9252j1953l4957Q7180
19450A23812K36955O1742j31457J60142K03648l3612p1332j55432N9533J41135
19440E95134O8071n0682j80074J3650j55366j10221J90137J65055K05963l7930
19430G03737r7235k7067k963J8045l8991p2276p3580N5011R0752J32645L9812
19419G27890k31237Q2840Q4713P5015r009j15343Q5403P5479P6116L1758J03514
19408I87139J34646J898J25433J90293N5615J96201L36864L39407R6274J57835
19398B621605K93415l6375O7926K21737J57614J4882J38158K29846K90940J13833
19388D113581J04393J22544K42693L69241L73450L54960K26876M26943M59596
$$ y = [-49150, -160072, -126101, -111458, 41265, 170445, 186509, 122794, 83542, 71589, 36632, 123812, 360767, 422509, 291052, 451194, 654842, 621230, 549898, 394466, 453999, 595134, 663205, 612523, 432449, 446099, 290733, 180512, 370649, 535704, 741667, 703737, 606502, 579435, 576472, 594517, 555526, 483250, 409670, 464681, 555433, 688078, 727890, 496653, 579493, 664206, 739221, 730212, 614869, 700272, 775751, 851867, 883625, 987139, 1121785, 1123683, 1249116, 1439409, 1495024, 1691225, 2028089, 2367496, 2463770, 2621605, 2915020, 2878645, 2946571, 3168308, 3325922, 3340804, 3478962, 3708808, 3999748, 4113581, 4217974, 4340518, 4583211, 4952452, 5325902, 5680862, 5907738, 6334681, 6794277]
19379F794277M71551O30037Q07882R86904J232350J627078K194771L054263M114772
19370B1913885N597326Q251891J2891925J9731619K5375313K6943141K7328825
19363A48033925K6928634K5407933K0286147P778753p599864j7006506k2511705
19356A81317317k6167302k8802331l0002657k4682428j5785975r661427o210210
19349D0004987m442648l434785k363028j898554j536542j261841r97630p80041
19341B3289918o67341n64638m14783m46688l90697m80204n65059m23423m32090
19332A8904995n41942m59895m39072j25091k73222N9823K41641L91779N47505
19323A8306521R03481Q72227J175872J774263K672508L652875M981216P317930
$$ y = [6794277, 7265828, 7895865, 8703747, 9690651, 10923001, 12550079, 14744850, 17799113, 21913885, 27511211, 35763102, 48655027, 68386646, 93761959, 120705100, 148033925, 174962559, 200370492, 220656639, 228435392, 220835528, 203829022, 181317317, 155150015, 126347684, 96345027, 71662599, 55876624, 46215197, 40004987, 35562339, 32127554, 29764526, 27865972, 26329430, 25067589, 24069959, 23289918, 22622577, 22057939, 21643156, 21196468, 20805771, 20325567, 19760508, 19337085, 18904995, 18363053, 17903158, 17464086, 17338995, 17065773, 17125596, 17367237, 17759016, 18306521, 19210002, 20082229, 21258101, 23032364, 25704872, 29357747, 34338963, 41656893]
19315D1656893J1632837J8919190K6301627K9342404K9690003L0140730K9228708
19308B16912392K5076693J4102902l674525j6188645k3024701k7456857l1469773
19301A54277486l3419309l0539289k0945794j2720269q423129n962368m537964
19294C7729364l329811k407316k083459j741737j361777j139004r51872q47555
19286B3866833p93354p78530p35899r19121q94495r27660r23228o20858o01128
19277A6672560o30794m56402m68819m32188m64762o65736n02012j62191l88103
19268A2501553o42410n86288n07468m88115n00898n59645l29287k36059j78095
19259H473288k61692l94409k98424j19146L5975j14250k29829k51586j19288k81659
$$ y = [41656893, 53289730, 72208920, 98510547, 127852951, 157542954, 187683684, 216912392, 241989085, 256091987, 252417462, 236228817, 213204116, 185747259, 154277486, 120858177, 90318888, 69373094, 56652825, 48229696, 42267328, 37729364, 34399553, 31992237, 29908778, 28167041, 26805264, 25666260, 24714388, 23866833, 23073479, 22294949, 21559050, 20639929, 19745434, 18817774, 17894546, 17273688, 16672560, 16041766, 15585364, 15116545, 14684357, 14219595, 13553859, 13051847, 12889656, 12501553, 11859143, 11272855, 10765387, 10277272, 9776374, 9216729, 8887442, 8651383, 8473288, 8211596, 7817187, 7518763, 7399617, 7435592, 7321342, 7091513, 6839927, 6720639, 6438980]
19249F438980l38954j93969p9717o6743k42312j73167R2160k3922k7736n9947
19239E324673j36955k54955j40131j28566j7147r8597j35661m7328l808q2864
19229D278661p5844j53882k09758N2732j03584m4257J62573J67914K06907J92723
19219D474185K22239K23157R5306j65283M9328j7784m59234n28054l83384l61627
19209C148849j71945k49872k71351p6426m7601j45138j88321n0734r1091p4019
19199A782351k2024J10662p6146k80699P4856q0888j00158J71040K44898J94101
19189B017993j1048n1769j41195k8855j28415n6706k8267p3772n4454m7363P1250
19178A467399q4704j60993m1698n6938j44332O6301N2771q5487j00421m1491m5730
$$ y = [6438980, 6100026, 5906057, 5826340, 5759597, 5517285, 5344118, 5436278, 5412356, 5384620, 5324673, 5187718, 4932763, 4792632, 4664066, 4646919, 4548322, 4412661, 4365333, 4361525, 4278661, 4202817, 4048935, 3839177, 3891909, 3788325, 3744068, 3906641, 4074555, 4281462, 4474185, 4696424, 4919581, 5014887, 4849604, 4898932, 4881148, 4421914, 3893860, 3510476, 3148849, 2976904, 2727032, 2455681, 2379255, 2331654, 2186516, 1998195, 1947461, 1856370, 1782351, 1760327, 1870989, 1794843, 1514144, 1589000, 1508112, 1407954, 1578994, 1823892, 2017993, 2006945, 1955176, 1813981, 1785126, 1656711, 1600005, 1571738, 1497966, 1443512, 1396149, 1467399, 1382695, 1221702, 1180004, 1123066, 978734, 1045035, 1097806, 1012319, 911898, 870407, 824677]
19167H24677K11171k5739j21861J24469Q258j56917j87090m7548j0709k1o2077
19156E56613J25444l1003j9421k5720p9156K5638J26116j6068j62792J1497M9777
19145E60925l38975n9585J05500J06344L4179j5590l3825J0510N2338K29197R0387
19134G41405k55887n4822n838J251K2068J3196j11088j60279J1154J44335P2835
19123D18330o7692m179N3562P223Q8127L0014o2207J34549N7911L1455r7125p999
19111E81969J58677K5844j41035M8142J14900n6455k44392j36836k3001J01325
19101D29138P7235J6692P0658k8114P8203R9711N2423j32541N341n4969O7003
19090F80780K25369p848r5736j01099r4462j91884j31842j40654J15779m4355
$$ y = [824677, 1035848, 1010109, 888248, 1012717, 1020975, 864058, 676968, 629420, 618711, 618690, 556613, 682057, 651054, 631633, 605913, 526757, 552395, 678511, 662443, 499651, 511148, 560925, 221950, 162365, 267865, 374209, 408388, 392798, 358973, 369483, 421821, 651018, 741405, 485518, 430696, 424858, 426109, 448177, 461373, 350285, 190006, 201160, 345495, 418330, 350638, 346459, 400021, 407244, 495371, 525385, 463178, 597727, 655638, 687093, 589968, 581969, 740646, 766490, 625455, 673597, 788497, 732042, 487650, 350814, 327813, 429138, 506373, 523065, 593723, 565609, 643812, 743523, 795946, 663405, 668746, 613777, 680780, 906149, 898301, 802565, 701466, 607004, 415120, 283278, 142624, 258403, 214048]
19080B14048n2076J23026R3183o9945k9760J81683q900j18826j12476o1081j40714
19069A8162N62K15656l6315N6181J65657r7500q3421j53939J12037O1190K51774
19058E10044J3868p4814k0039P7016j3690j07600j59645l4231R2968J10784k44931
19047A49730m2344J29707j14448j40631o7234n3704p9818J19195Q413L370N6146
19036c1618r2618k2093N0340P9727N04k21271k00987l4813P2638K17206Q5355
19025i7630J0698j8246n7439J30037J85497o2944o5606O9624J0843O3469J01917
19014B70220j18017l04650l5614n1217J75817J28542N2285m449J86974j90809
19004A09082q6523J03632j5464l8763M5775J5523l6815L5296J13508J0414p7179
$$ y = [214048, 161972, 284998, 378181, 308236, 278476, 460159, 451259, 332433, 219957, 158876, 18162, 18724, 234380, 198065, 254246, 419903, 322403, 238982, 85043, 197080, 258270, 510044, 523912, 449098, 429059, 506075, 492385, 384785, 225140, 190909, 283877, 394661, 149730, 107386, 237093, 122645, -17986, -85220, -138924, -218742, -99547, -91134, -87764, -31618, -124236, -146329, -95989, -16262, -15758, -237029, -438016, -472829, -400191, -182985, -97630, -86932, -105178, -162617, -32580, 152917, 89973, 24367, 93991, 104834, 168303, 270220, 152203, -152447, -188061, -239278, -63461, 65081, 117366, 112917, 299891, 109082, 22559, 126191, 110727, 71964, 117739, 133262, 96447, 131743, 245251, 255665, 178486]
18993A78486p9249p9467J4283J83306N264m4153J22541J3682K291L8509j16779
18982B38714r7576J7376j15720k2171K736K15289J63954p0118j96138R059M3529
18971A88934n5244O2692J28369M3359J70401Q7307n073j88934j26213P3915L4636
18960D14149m2028K2933J19961J34282n5669o4043r7092R5459n6399o5590J02858
18949E08821J68356j8749r2542j44847j28088K1903l5988j8969J44099o3184o5671
18938B75141J12569J67535L5694M5957J5971o4182j53989o4650r7793m5351J20790
18927C47692M4352q875M5137J39219m2993N0456j35566r9084J07914K00494O9202
18916G17948j52685m255K62911j48J2003o8473j16255j34501R3978J55281q2013
$$ y = [178486, 99237, 19770, 34053, 217359, 222623, 178470, 301011, 314693, 316984, 355493, 238714, 141138, 158514, 42794, 20623, 23359, 238648, 402602, 332484, 136346, 145405, 188934, 133690, 196382, 324751, 368110, 538511, 625818, 620745, 431811, 305598, 379513, 414149, 372121, 395054, 515015, 649297, 593628, 529585, 432493, 527952, 471553, 405963, 508821, 677177, 658428, 565886, 421039, 292951, 314854, 278866, 259897, 403996, 340812, 275141, 387710, 555245, 590939, 636896, 652867, 588685, 434696, 370046, 272253, 226902, 347692, 392044, 383169, 428306, 567525, 524532, 574988, 439422, 340338, 448252, 648746, 717948, 565263, 561008, 823919, 823771, 835774, 767301, 651046, 516545, 610523, 765804, 683791]
18905F83791j4430k00849k2998J75965m068J15342l690L3045Q6445J40139J34001
18894A122693m0734N5355O0289J25716J21057Q3378l815m0922J5190J24397J33905
18883A756509J21016L88405L72788K75261M69710L85452L00443J98021R6096L71483
18873D735184N55866N62894P40773O31924R45482J148863J299687J196954J426321
18864A3243948J631781J991168K479107L116665M160833N799253Q577013J3240790
18856E4240558K0664410K8434391L0188233K7268923K9359402L1880276K4684823
18849B46721016J0801190n036196j4403794j0083315m847718n921800k750809
18842B14478574M312999J2192216K0887150K0256288R395153p190286k3974613
$$ y = [683791, 669361, 468512, 445514, 621479, 617411, 732753, 729063, 762108, 848553, 988692, 1122693, 1081959, 1137314, 1197603, 1323319, 1444376, 1527754, 1523939, 1483017, 1498207, 1622604, 1756509, 1877525, 2265930, 2638718, 2913979, 3383689, 3769141, 4069584, 4267605, 4363701, 4735184, 5291050, 5853944, 6594717, 7226641, 8172123, 9320986, 10620673, 11817627, 13243948, 14875729, 16866897, 19346004, 22462669, 26623502, 32422755, 40999768, 54240558, 74904968, 103339359, 133527592, 160796515, 190155917, 222036193, 246721016, 257522206, 252486010, 238082216, 227998901, 223151183, 217229383, 214478574, 218791573, 230983789, 251870939, 272127227, 281522380, 274332094, 250357481]
18835B50357481k7729047k4300531l1070914l7006428l0045704j8813244j1261399
18828G0130214p860806o149356m483333l535258k913736k260039k059902k018799
18820C8848985j946097j995737j654884j682830j900327j623159j458104j306360
18812B5281487j189237j143695j152676j186299q23755n33111p10393o25211m52918
18803A7464192o66644n72769l89973m61118n56536l48156l92383l94779l09492
18794A3372342k81700j55973l70165l37671k25302j64634l32414m25542j21341
18785A0957600n521l9833o9705j95164l05377l14524k98739k16257k65248k94143
18775H953089l56224n68137n15322l84980k71532j26871k78900k25203k15576
$$ y = [250357481, 222628434, 198327903, 167256989, 130250561, 100204857, 81391613, 70130214, 62269408, 56120052, 51636719, 48101461, 45187725, 42927686, 40867784, 38848985, 36902888, 34907151, 33252267, 31569437, 29669110, 28045951, 26587847, 25281487, 24092250, 22948555, 21795879, 20609580, 19785825, 19252714, 18542321, 17917110, 17464192, 16797548, 16224779, 15834806, 15373688, 14817152, 14468996, 14076613, 13681834, 13372342, 13090642, 12934669, 12564504, 12226833, 12001531, 11836897, 11504483, 11078941, 10957600, 10952079, 10912246, 10842541, 10647377, 10342000, 10027476, 9728737, 9512480, 9247232, 8953089, 8596865, 8028728, 7513406, 7128426, 6856894, 6730023, 6451123, 6225920, 6010344]
18766F010344j14057k14390k06929o6130k14601l55718j97584p2883j84789l07701
18756D075562J2134o9264l31709Q7676N8672o8772k38959n6882J2102k48548j13159
18745C118853P4518J56963q4950j01410j44880o5777m6976J8090O3832Q639k20847
18734B776055j17094J55942o833K0006l8050m6901n5494J20343n8614J04382J0984
18723B864726r9602j62656j37466j00995r9090j75857j10638j52023J86866P2021
18713B085286J36564m1620j52373o9681j52891r5325N0260r4587k08444Q5713
18703A542902j11371M8591J99533K6982p1702k6798m3260J2954l5098l0005J02186
18692A614914o8374j05946j92809o3068j64291J7927J06301P735l9969M157L8550
$$ y = [6010344, 5896287, 5681897, 5474968, 5408838, 5194237, 4838519, 4640935, 4568052, 4383263, 4075562, 4087696, 4018432, 3686723, 3774399, 3833071, 3764299, 3525340, 3468458, 3480560, 3232012, 3118853, 3193371, 3350334, 3265384, 3163974, 3019094, 2953317, 2906341, 2924431, 2988263, 2996902, 2776055, 2658961, 2814903, 2808070, 2828076, 2790026, 2743125, 2687631, 2807974, 2749360, 2853742, 2864726, 2765124, 2602468, 2465002, 2364007, 2264917, 2089060, 1978422, 1826399, 2013265, 2085286, 2221850, 2180230, 2027857, 1958176, 1805285, 1709960, 1760220, 1665633, 1457189, 1542902, 1431531, 1480122, 1679655, 1706637, 1634935, 1608137, 1564877, 1577831, 1542733, 1512728, 1614914, 1546540, 1440594, 1247785, 1184717, 1020426, 1038353, 1144654, 1152389, 1112420, 1116577, 1155127]
18681A155127k00431j78685m7853k9657J56236J00139N64k63244l16714j6643
18671C58839J05475K53460K34779k8400o7630p3035j17318m7938N6445o6227n4670
18660E53780N9464J48247O656K41506l6940j07144m1590N5742k00199j0218o1368
18649F07936P9857J02694N0536J28520J03155q4129j29295j1182j32073n01O0802
18638G76320K27631j500j27957L641J1824j24549r3613j95137l8185O3497q7555
18627D14417J4189J02610P1054o4988M3602Q6200n4372J3280k4407p4278J1776
18616E39083Q5227R1598j63801P2656j13311j10136L4049J17366P5685L0713k6062
18605F33067K3788J7480j52315p9879N8903q1577J05785N6020q2951r9861N4053
$$ y = [1155127, 954696, 776011, 728158, 698501, 854737, 954876, 955440, 692196, 375482, 358839, 464314, 717774, 952553, 924153, 856523, 783488, 666170, 618232, 674677, 608450, 553780, 613244, 761491, 768147, 1009653, 972713, 865569, 823979, 879721, 679522, 669304, 607936, 687793, 790487, 841023, 969543, 1072698, 988569, 859274, 848092, 716019, 715518, 776320, 1003951, 1002451, 874494, 878135, 889959, 765410, 671797, 476660, 438475, 501972, 414417, 428606, 531216, 602270, 537282, 580884, 667084, 612712, 625992, 601585, 527307, 539083, 624310, 715908, 552107, 624763, 511452, 401316, 435365, 552731, 628416, 659129, 633067, 656855, 674335, 522020, 442141, 501044, 419467, 525252, 581272, 498321, 398460, 452513]
18594D52513J96551P4610j67082J8932r7136j126Q0058j47857n140J01466N8002
18583E63791k5246J23835L205j15360o4990p7396J29239N1469R506n2855r6770
18572D48428o5624J0260K8474r4451J18724j30984j04885J00124K60486N4126
18562F24678N0826l926k38940j07229M0992j12022P7767K27456M9942q3265o0467
18551D65812j47227j29289J5118R5466o6850J15937J96742j49283m1690Q2028
18541D36764O9243m2351j49011o8771J89755J12884J24395l00436m3124Q5249
18531D14597j34228j46691J37396L518M0812R659n763K0685K2620L6423j61851
18520B37177j67762K6256l9309K8652J7726r5472J34330J53230l8072j62690k4466
$$ y = [452513, 649064, 723674, 556592, 575524, 478388, 477262, 557320, 409463, 404323, 505789, 563791, 538545, 662380, 665585, 550225, 485235, 407839, 537078, 588547, 598053, 545198, 448428, 382804, 393064, 421538, 327087, 445811, 314827, 209942, 310066, 570552, 624678, 675504, 671578, 432638, 325409, 366401, 254379, 332146, 559602, 609544, 526279, 465812, 318585, 189296, 204414, 299880, 233030, 348967, 545709, 396426, 354736, 436764, 506007, 463656, 314645, 245874, 435629, 548513, 672908, 372472, 329348, 414597, 280369, 133678, 271074, 274592, 315404, 325063, 319300, 339985, 362605, 399028, 237177, 69415, 95671, 56362, 85014, 102740, 7268, 141598, 294828, 256756, 94066, 69600]
18509F9600k0961J218K07930j08950j52037j45775o8186J20331J45094R8764L6361
18498A83389K5869N6636P8762J95691j2724j31429p8087L4605p7925M2810o6705
18487B50892j35147j81047L269P2538J00431l0205l4319J49475J8968p601j00753
18476A06501K2641l1091m4453J12851L029k3196k3272l9172J6261K9433J13630
18465B43162R3747q8934o7654j3149q303K75807R3655j31590m9643J8363j96090
18454A69371j83733M7821r8853k794l9481K4621P7943N420R7307K5110j05730
18443A7002K2736J74024J10579J57839o4172j3659r0455j43935k2179P7427J01857
18432C27064m7050o668r763P450N5437J97893J7372j97859M0212o526K4602j29285
$$ y = [69600, 48639, 49857, 257787, 148837, -3200, -148975, -217161, -96830, 48264, 147028, 183389, 209258, 265894, 344656, 540347, 527623, 396194, 318107, 352712, 274787, 317597, 250892, 115745, -65302, -62033, 10505, 110936, 80731, 46412, 195887, 214855, 207254, 106501, 129142, 98051, 53598, 166449, 169478, 146282, 123010, 83838, 100099, 129532, 243162, 336909, 247975, 180321, 167172, 158869, 434676, 528331, 396741, 347098, 365461, 169371, -14362, 33459, -65394, -68188, -107669, -83048, -5105, 315, 97622, 122732, 17002, 39738, 213762, 324341, 482180, 418008, 404349, 313894, 169959, 147780, 225207, 327064, 280014, 273346, 263583, 271033, 326470, 524363, 541735, 343876, 384088, 377562, 402164, 272879]
18420B72879m2319R281P4336J53304k7205j36890j44384p7183K3639J41857p3879
18409A73436J0905J04089p8379J48104J50305Q3292l748L6735J2739p3364j54595
18398D09519P2945P0052n8335j60064k8574l5720J21263P7272P3553K355k3126
18387E21140j48709j45229m6146K33891N5828k10272j44134j26726J03611L66720
18377D59974P8300o7600l5790R8696Q9458L9592Q7575o1771k29428n1947M4025
18366D51084J66290K12435J39696J88205j13632j11221N0570J93079K52442J24761
18356A553709J8568J9169L25730K50839K2830L03121L82749K53668R4630J00717
18346C325730K11408K06219K47123L29837L92523M78625O44432N49579M72096
$$ y = [272879, 230560, 239841, 314177, 467481, 440276, 303386, 159002, 81819, 105458, 247315, 173436, 184341, 288430, 210051, 358155, 508460, 591752, 588004, 624739, 637478, 564114, 409519, 482464, 552516, 494181, 334117, 305543, 269823, 391086, 468358, 541911, 544266, 521140, 372431, 227202, 181056, 414947, 470775, 260503, 116369, -10357, 93254, 459974, 538274, 470674, 434884, 533580, 623038, 662630, 750205, 688434, 459006, 407059, 451084, 617374, 829809, 969505, 1157710, 1044078, 932857, 983427, 1176506, 1428948, 1553709, 1572277, 1591446, 1917176, 2168015, 2190845, 2493966, 2876715, 3130383, 3225013, 3325730, 3537138, 3743357, 3990480, 4320317, 4712840, 5191465, 5835897, 6385476, 6857572]
18337F857572N81963R56867R20074J111119J739227K211489K922889L957946O336298
18328B7595444R899824J5906109K3784479K6080558J8641909J0535942Q366342
18321A40810607Q145334N036389p256255k2286328k2539130q266674P356521J7057499
18313A18057963J5641816Q166754M132604L638916K000925n863172k1697344l0443357
18305I3635105k4266659j4575509q827558n618935l935792l090301k233438k026326
18297B9060587j724525j567974j362010p79627o34848p06942n79964n35858n86701
18288B0582138l93042l80620K58j7607J1860J21989J90445M70985P13937J231488
18278B2531831K000948K815224M456789O998498J1647888J8534617K3407676J9739530
$$ y = [6857572, 7439535, 8396402, 9316476, 10427595, 12166822, 14378311, 17301200, 21259146, 27595444, 37495268, 53401377, 77185856, 103266414, 121908323, 132444265, 140810607, 148955941, 153992330, 146736075, 124449747, 101910617, 93643943, 101000464, 118057963, 133699779, 141866533, 145999137, 149638053, 151638978, 145775806, 124078462, 93635105, 69368446, 54792937, 45965379, 40346444, 36410652, 33320351, 31086913, 29060587, 27336062, 25768088, 24406078, 23626451, 22991603, 22284661, 21704697, 21168839, 20582138, 20189096, 19808476, 19808734, 19791127, 19802987, 19924976, 20115421, 20586406, 21300343, 22531831, 24532779, 27348003, 31804792, 38803290, 50451178, 68985795, 92393471, 112133001]
18270A12133001J1363587P541409P085381N522185j935611j6173691k2651506
18263A02884755j3214130J674881J3379765J6038925R525589M199089L353881
18256A37842755K651573j774558j4800239k7297723k5731506j6352283r586652
18249D4951367n905608l994269k929444k443108j972611j752984j497087j355232
18241B3101024j111030r60557q18162q84785q94684n98885o41908q12144o10391
18232A5768478n34131p11740n89979o08299q75696m41651o05962n73166l57562
18223A0470292j54761j38375m26932m14235k25922k84751l06399j54549k08736
18214H155632l50922k82956j58732j37368k34273j13542k04501k76434j10452
$$ y = [112133001, 123496588, 131037997, 138123378, 143645563, 141709952, 125536261, 102884755, 89670625, 91345506, 104725271, 120764196, 130289785, 134488874, 137842755, 140494328, 138719770, 123919531, 96621808, 70890302, 54538019, 44951367, 39045759, 35051490, 32122046, 29678938, 27706327, 25953343, 24456256, 23101024, 21989994, 21029437, 20211275, 19326490, 18431806, 17832921, 17191013, 16378869, 15768478, 15234347, 14522607, 13932628, 13324329, 12448633, 12006982, 11401020, 10827854, 10470292, 10315531, 10177156, 9750224, 9335989, 9110067, 8825316, 8518917, 8364368, 8155632, 7804710, 7521754, 7363022, 7225654, 6991381, 6877839, 6673338, 6396904, 6286452]
18205F286452k07465k97031l8056j8427j27055k34245j49987j98950q5801o3889
18195D865546l19724j26568p4264O0522j61426j03792q3462N3012J7312o8910
18185D058246j73666j35739j73677j05850j54472k24702p6931L7378r7342o3008
18175B890237j02478j48804m2904o2604J29151p1527j28791M783j19959l3574
18165B313530k5976m7838j31546P4974k7829O5790l3619j14094j72886L2685j07870
18154A825321j58949l3094P4079J7568k82813M1319J52176j08592J8471M9283
18144A594769o5070p0289L0433j52311k0656O9064O2635O4596P0106J19377M528
18133A707182n8217q204j0495p7122p1678p4914j22771p0913K2016j891l8905
$$ y = [6286452, 6078987, 5781956, 5743900, 5725473, 5598418, 5364173, 5214186, 5015236, 4929435, 4865546, 4545822, 4419254, 4344990, 4405512, 4244086, 4140294, 4056832, 4109844, 4127156, 4058246, 3884580, 3748841, 3575164, 3469314, 3314842, 3090140, 3013209, 3050587, 2953245, 2890237, 2787759, 2638955, 2596051, 2533447, 2662598, 2591071, 2462280, 2467063, 2347104, 2313530, 2287554, 2239716, 2108170, 2183144, 2155315, 2221105, 2187486, 2073392, 1900506, 1933191, 1825321, 1666372, 1633278, 1707357, 1724925, 1442112, 1483431, 1635607, 1527015, 1545486, 1594769, 1529699, 1459410, 1489843, 1337532, 1316876, 1385940, 1448575, 1513171, 1583277, 1702654, 1707182, 1648965, 1640761, 1630266, 1553144, 1481466, 1406552, 1283781, 1212868, 1234884, 1232993, 1194088]
18122A194088l0560L0166N6559q0512r6305j25484p6809j15664L3628m4497R427
18111G54037p9250M862K19927j2611l3909j37191r9502j81257Q9408J59358K8597
18100G12469K27126n1503k94600k6180M2033m9724M8972o870o2937K21707j495
18089G58998K5589N480J86276J6110l2211J03661Q9712J48288k5283o7843P1153
18078A279930O7281r3764m1005j25829n0138n5570q7011j26155q0941j00383k25099
18067C61316m1212L1007J16892L5102n9129J7896j5144J80375R9723L02o6705
18056F60423j46767N028K47261o0264p9750J22287m9951J407R1779j22288j20366
18045E48799q8113J24049J13112q2708j2018p4193o2409M962K8001Q5705P5457
$$ y = [1194088, 1163528, 1193694, 1250253, 1169741, 1073436, 947952, 871143, 755479, 789107, 744610, 754037, 674787, 679649, 899576, 886965, 853056, 715865, 616363, 435106, 524514, 683872, 712469, 939595, 888092, 593492, 567312, 609345, 559621, 608593, 601723, 538786, 760493, 758998, 784587, 790067, 976343, 992453, 960242, 1063903, 1153615, 1301903, 1276620, 1208777, 1279930, 1347211, 1253447, 1212442, 1086613, 1036475, 980905, 893894, 767739, 686798, 586415, 361316, 320104, 351111, 468003, 503105, 443976, 461872, 446728, 627103, 726826, 727128, 660423, 513656, 518684, 765945, 705681, 625931, 748218, 698267, 699674, 791453, 669165, 548799, 460686, 584735, 697847, 615139, 603121, 528928, 466519, 471481, 499482, 585187, 660644]
18034F60644O1429q03M0487M2285q9443k6388r288k309q7984j24574O7911K14613
18022G46580L7366r442k2918k9388R1611J21701j5998j00145n8317j65963k5614
18011E69473j41927l4557J18023M6490j49926M164J85715O418L705k633P7347
18000F82292k9805q8974J34582k1990r7857j76298N871K4607q1101m8827Q8323
17989C90823m9947m0473K6806n7548J54610p3810j31966O492Q3228n3583K096
17978B56728M9257q6887J31602N6386r0441O08R5835k1585j46999k5446j4207
17967B04851q2480K05721o7489j85996n8872O6435O5517Q6410O473j10242k1895
17956A08433R6758L1133j52171j48555J88779J14246q8598j23048n3127O5038
$$ y = [660644, 722073, 721270, 761757, 804042, 714599, 688211, 678923, 676614, 588630, 464056, 531967, 746580, 783946, 774504, 751586, 722198, 813809, 935510, 919512, 819367, 761050, 595087, 569473, 427546, 392989, 511012, 557502, 407576, 411740, 597455, 603873, 607578, 604945, 682292, 652487, 563513, 698095, 676105, 578248, 401950, 407821, 432428, 351327, 302500, 390823, 340876, 300403, 327209, 269661, 424271, 350461, 218495, 224987, 308215, 254632, 256728, 305985, 219098, 350700, 407086, 316645, 317253, 413088, 391503, 244504, 219058, 204851, 122371, 328092, 260603, 74607, 15735, 82170, 147687, 234097, 240570, 130328, 108433, 205191, 236324, 84153, -64402, 124377, 238623, 150025, 26977, -26150, 38888]
17946C8888J43277o1341j25400j6916P3218P2925K1187n0364l8628j1987J53640
17935A98499R9881j92191j88577j14165k8036j59965j31274K88444K93548m7263
17925A8901j2377Q2523r303J3428M9849K0664m3315m5895L316K3508o5226K03211
17913B39284K17212j27614r8968J35419R7271o7526j21961j43985j5568M754J7717
17902A36035m9277J03525J76319O4340J3325j06253o1083j22075j8329l5739p4790
17891B5998m5968M7691M5357R4634J19536p6235j05130m9725n4587q5097m3021
17880a26547O4917Q1612J928o0708j75394M9449K54855K21641J26149r2954j81022
17869A63926J4290m4065L6834r6438K61926L52089j06454m3893R4110n0098M763
$$ y = [38888, 182165, 120824, -4576, -21492, 51726, 124651, 145838, 95474, 56846, 44859, 198499, 298380, 106189, -82388, -196553, -224589, -384554, -515828, -227384, 66164, 18901, 6524, 89047, 79744, 93172, 143021, 163685, 120370, 74475, 77791, 101299, 36073, 239284, 456496, 328882, 229914, 365333, 462604, 395078, 273117, 129132, 113564, 118318, 136035, 86758, 190283, 366602, 430942, 444267, 338014, 276931, 154856, 136527, 100788, 25998, -19970, 27721, 73078, 167712, 287248, 211013, 105883, 56158, 1571, -83526, -126547, -61630, 19982, 21910, -38798, -214192, -164743, 90112, 311753, 437902, 344948, 163926, 178216, 134151, 170985, 74547, 336473, 688562, 582108, 538215, 632325, 582227, 586990]
17858E86990n6899r0855j27601q8700L4092N3666J46296j47333j74932m4439o8699
17847B1586j20989J26966J51311n5295k50621Q4421m3917j40103j1095O8386N0157
17836a19193Q7247l7975O2999L1844M0244J15851k1127J7655L7269J04553n0719
17825B68648q7432n439M2514J10542r2742J89521K9012j71948r0757P6921J8947
17814B87787N041j69133p1831l191K28100J70778m3843p9525m906K8991J052K6882
17802C76202r9563q2362J29274J65440J08323o1163J60323J80197k6784J5085
17792H64972j2908j73388o4654J25993q1292j60995J03684N4261N9785j66236
17782E49222L4051J63979j30592l4117K1807n2687j23682k3281m5601j76834N4102
$$ y = [586990, 530091, 439236, 311635, 222935, 257027, 310693, 456989, 309656, 134724, 90285, 21586, -99403, 27563, 178874, 123579, -127042, -42621, -86538, -226641, -237736, -169350, -119193, -31946, -69921, -6922, 24922, 65166, 181017, 159890, 177545, 214814, 319367, 268648, 181216, 175777, 218291, 328833, 236091, 425612, 454624, 282676, 191919, 268840, 287787, 292828, 123695, 51864, 48673, 276773, 447551, 403708, 324183, 319277, 348268, 349320, 376202, 276639, 194277, 323551, 488991, 597314, 536151, 696474, 876671, 849887, 864972, 852064, 678676, 614022, 740015, 658723, 497728, 601412, 655673, 715458, 549222, 583273, 747252, 616660, 582543, 604350, 551663, 427981, 404700, 359099, 182265, 236367]
17771B36367J47121k43526j42817J75305K43730M770K85r2177j9461r4268n6684
17760A58645R6815L5869L9282J94229p9236q8873J75485K7501j59820j17249r1464
17749A91184J2631M1471J52676J33626J64059P0888O1540k7256Q2683L4644p4302
17738H43844J62467j9332k83100o3598J1399P3824R4730n7280p7251o4316J08338
17727G29725J5441K5919n4208j95867j63043J79613P0844M374m1861k67560j09819
17716A93558j64803r3822J47896M4308J8946R401J76971L3707M7657k04723j01772
17705A07324J09040J01651k3819j10924J10940M2825j2015j00371P5939N5372
17695C55962O8210O0605p4063M5924j03879j71818j53577M0400R9795J13320K3331
$$ y = [236367, 383488, 139962, -2855, 172450, 416180, 420950, 421235, 329058, 309597, 215329, 158645, 255460, 291329, 330611, 524840, 445604, 356731, 532216, 559717, 399897, 282648, 191184, 203815, 245286, 397962, 531588, 695647, 766535, 828075, 800819, 883502, 918146, 843844, 1006311, 986979, 703879, 640281, 651680, 725504, 820234, 762954, 685703, 621387, 729725, 745166, 771085, 716877, 521010, 357967, 537580, 608424, 612798, 570937, 303377, 193558, 28755, -65067, 82829, 127137, 146083, 155484, 332455, 366162, 413819, 209096, 107324, 216364, 318015, 294196, 183272, 294212, 337037, 325022, 224651, 300590, 355962, 424172, 484777, 410714, 456638, 352759, 180941, 27364, 67764, 167559, 280879, 304210]
17684C04210k06122j01453j00627P2534q9709J2196q34R2915M45352J47812r9944
17673D76330j09156j15039K8807M3324r7654j21619M8479N8324N4164k32192m4468
17662a0700J66169P4569L093Q3291P1202j31142j45500J17249J93659q5383j7534
17651C18973j02330R1116j21401j14169R0913N695P7328N2208j13611j47926j0137
17640B6659n269r1374Q2959N1444L203J58729K5551Q3458j57411j17513N2183
17629A12619l0043M4629J48946q1840P4080J00439P7121j9273j4286j88238r6991
17618A27163l7233j44796P2945M2950N1065J33167j36127j69204o8789j9844J68875
17607B0172R9869m5575j52474M1228O71q8127K2002N6684m4347O048K4828J09062
$$ y = [304210, 98088, -3365, -103992, -31458, -121167, -108971, -109805, -16890, 428462, 576274, 476330, 367174, 252135, 280942, 324266, 226612, 104993, 153472, 211796, 265960, 33768, -10700, 155469, 230038, 233131, 316422, 387624, 256482, 110982, 228231, 421890, 336507, 318973, 216643, 307759, 186358, 72189, 163102, 168797, 246125, 298333, 184722, 36796, 26659, 21390, -69984, 12975, 64419, 67622, 226351, 251902, 335360, 177949, 60436, 112619, 82576, 127205, 276151, 194311, 268391, 368830, 445951, 426678, 412392, 224154, 127163, 89930, -54866, 18079, 61029, 112094, 245261, 109134, -60070, -128859, -148703, 20172, 120041, 74466, -78008, -36780, -36109, -124236, -102234, -45550, -89897, -83849, -59021, 50041]
17595E0041M164j8682j11009k1298L3891J04792m1687R8586m1302p8018q503M2492
17583A3467J36157M568j73322n5007J7195J7241j5987J40705Q2254j34641r9283
17572f6653O1536J13194n6687j0104L6881L9339O7607L6870j44682j35964j59222
17561b17885j26072P6063J58204K47146L0888j78496q5195j1056j9625L4168J86563
17550I4703K87371l1595J38176j27707j10260M4537l0993m6504j50755o4713K7939
17539C0199O6964o0617n5891j00337J35327K27296J1375j47543j61340k42842
17529b97409N0068J22006N7151Q4183J83564L9076p4150R5977K3738j10107J342
17518A75439Q2112m8812Q2577n9158j96381p0242O24m3642R5688P5344J47601
$$ y = [50041, 54205, 35523, -75486, -96784, -62893, 41899, 212, 98798, 57496, -20522, -29025, 13467, 149624, 154192, -19130, -74137, -56942, -39701, -55688, 85017, 167271, 32630, -66653, -5117, 108077, 51390, 41286, 78167, 117506, 185113, 221983, 77301, -58663, -217885, -343957, -267894, -109690, 137456, 168344, -10152, -95347, -106403, -126028, -91860, 94703, 382074, 350479, 488655, 360948, 250688, 295225, 264232, 217728, 66973, 2260, 30199, 97163, 36546, -19345, -119682, 15645, 242941, 254316, 106773, -54567, -297409, -247341, -125335, -68184, 15999, 199563, 238639, 164489, 260466, 284204, 174097, 175439, 257551, 208739, 291316, 232158, 35777, -34465, -33841, -77483, 18205, 93549, 241150]
17507B41150J88575P0689J02654Q1632p9116j17081j66824k58675p7952j7298
17497c2246K27164Q4033j3929N5680R5869j34595j00812J4161m0384p6695j96997
17486a18751n7819K72142j12707J933L2319M2790R8973R0043q5325r3564o2944
17475G090j44521P408q161M2496J94054K4335o2948k5146j10021j43929P3351
17464a45992K66545L3725r4677J22733j8163j40478q5058J1855J02453K9951r3145
17453a0251j71069P0238l5095r0431J29946K2560n0460j05884J46317K1901M5145
17442b7083J3529r142P0039M7391j15386j73412l5033q2981j59007J88991L09227
17431B7133K71690L0568o6892k31687j85704K69332J23052O0993m3757P678n4775
$$ y = [241150, 429725, 500414, 603068, 684700, 605584, 488503, 321679, 63004, -14948, -32246, 194918, 278951, 265022, 320702, 416571, 281976, 181164, 195325, 154941, 78246, -118751, -176570, 95572, -17135, -15202, 17117, 59907, 158880, 248923, 163598, 70034, 7090, -137431, -130023, -138184, -95688, 98366, 122701, 59753, 34607, -75414, -219343, -145992, 120553, 154278, 59601, 182334, 164171, 23693, -61365, -49510, 52943, 82894, -10251, -181320, -111082, -146177, -236608, -106662, -84102, -134562, -240446, -94129, -72228, -27083, -13554, -22696, 47343, 94734, -20652, -194064, -229097, -312078, -471085, -282094, 27133, 298823, 329391, 262499, 30812, -154892, 114440, 237492, 298485, 254728, 262406, 207631]
17420B07631K3996r9798K552R2840l3918j37335j6352M2147m7667o3892o7712
17409i7508r6195J02406J30276J9217L0229l6650j13570j86501P0873J39619p04
17398c8508r0130J7042N4870j0213r3833K2306n0062p479P4667J1145J58838O0088
17386A08731O2243J5796m3258j18627J14848r1473m172L3869j9529p7873J65058
17375A45613J52069j41140n0932m0944M3771n4971n4646L8945N8534K5464n1703
17364G0060m639j30355L8139J91718R6547j33839j98400O5581K4973j22346o4670
17353a67231l5360J73930N8671k12590k1617M6139P5147L6369j57008p3819l9646
17342c17015j12667j01240Q6901L03151J55038N931m348Q068o1499r8906P380
$$ y = [207631, 231627, 131829, 134381, 227221, 193303, 55968, 39616, 81763, 34096, -29796, -97508, -193703, -91297, 38979, 58196, 88425, 51775, -61795, -248296, -177423, -37804, -38508, -128638, -111596, -56726, -66939, -160772, -138466, -188528, -196007, -121340, -110195, 48643, 108731, 170974, 186770, 143512, 24885, 139733, 48260, 44088, 77957, 58428, -19445, 145613, 297682, 156542, 105610, 64666, 108437, 53466, -1180, 37765, 96299, 121763, 70060, 65421, -64934, -26795, 164923, 261470, 127631, -70769, -5188, 19785, -102561, -167231, -202591, -28661, 30010, -182580, -204197, -158058, -82911, -46542, -203550, -277369, -317015, -429682, -530922, -444021, -140870, 14168, 20099, 15751, 23819, -37680, -136586, -129206]
17331a29206O4194J06256P2262o0362j9938R66l4018j7669J40827q0672j01624
17320e8984j33626J31531M1210k4555L201P4407J05091j10249Q1661J33005j85041
17309E7651j45565r1642J8414K0579P18M0720N2260K5638q2894k689L4897o1145
17297a33058n8780N5479k6912J6201j7061J48645l92k0783P0345q871j20804o1209
17285a57200q202K8988J08843Q1509j30269J841K4542j04957j5190J02991k9449
17274i6553l4734J6761N4641k5346l4661j461K33634k8228k2882l0816r4748K1005
17262d3388m0960K7447J0961m7730j8771J00145k3604j71675p5655L7145O7521
17251a78564L042Q876O9564K1921M8013J56712J19676q8474k4891k8094k52359
$$ y = [-129206, -65012, 41244, 113506, 53144, 33206, 34172, 154, -17515, 123312, 42640, -58984, -192610, -61079, -19869, -44424, -41223, 33184, 138275, 28026, 109687, 242692, 57651, -87914, -179556, -161142, -140563, -139845, -99125, -46865, -21227, -104121, -106810, -71913, -133058, -191838, -136359, -163271, -147070, -164131, -15486, -15878, -36661, 33684, 24813, -95991, -157200, -165402, -136414, -27571, 53938, -76331, -74490, -49948, -154905, -170095, -67104, -96553, -131287, -114526, -59885, -85231, -119892, -121353, 112281, 84053, 61171, 30355, -64393, -43388, -84348, -56901, -45940, -93670, -112441, -12296, -35900, -207575, -283230, -246085, -178564, -175522, -166646, -97082, -75161, -27148, 129564, 249240, 160766, 135875, 107781, -144578]
17240a44578k14974O1103M7464N1349p4225M830J57243n8526q717P2481o6782
17229a73332m0003j51580L2574O3243O9805n2282j3675J78743j728j42370r177
17218b39782j9699j78138J14257J37318P0913j4674n7523J10781N2333N0828J710
17207B8324l2621J62019j4490j2809L8597K0085R2099J45628J7745k5933k10324
17196B08320j22656m3540J6004p3634N382p2305J2381j01626j15496r3146J22550
17185b57766R5615n0108m402m1778J25249j04119O756Q3403L0549q7665n5793
17174b60059K09612P4055P3116q3127L0907N2252r8126n6295j09643J09116J18992
17163F0800k7078p6451M123K3604r1606Q3594q0436J55962j6185j2655n376M521
$$ y = [-144578, -359552, -298449, -250985, -199636, -273861, -269031, -111788, -170314, -179031, -106550, -173332, -213335, -364915, -332341, -269098, -199293, -251575, -265250, -86507, -88235, -230605, -239782, -259481, -437619, -323362, -186044, -115131, -129805, -187328, -76547, -24214, 26614, 28324, -4297, 157722, 143232, 130423, 169020, 189105, 281204, 426832, 444577, 418644, 208320, 85664, 42124, 58128, -15506, -10124, -82429, -70048, -171674, -287170, -380316, -257766, -162151, -212259, -216661, -258439, -133190, -237309, -230553, -147150, -116601, -204266, -260059, -50447, 23608, 96724, 13597, 44504, 96756, -1370, -57665, -167308, -58192, 60800, 33722, -42729, -38606, -15002, -106608, -23014, -103450, 52512, 36327, 23672, 18296, 22817]
17151B2817o3337p5755Q0762M7441P5821M5375j14128j69685n666O4987J4482
17140g6886L0913O1645p547n9116k2223q487j38939n1474K8110O6106l7921m376
17128b20195J65754N4760r2816m2684m6995Q1540r4739j1174J80976J1443l3477
17117d7607K151j7750j10993j03255o3083J92747J87036o1591j23372L6324J23549
17106A4156m9792N0277M2540N417p2221K5413R9994l1925O6524j64298m7903J98532
17094A36714P9907O2987O5333j05903O9833j91518k3257p340j79594k39349R5250
17083b36937J01919j54354j01548J12021N1272q8857Q4127K16518j5158m7525
17073g8522M8139l5295j02750l1716l0993K05311J71983M6713m5189j32561p1529
$$ y = [22817, -40520, -116275, -35513, 11928, 87749, 133124, 18996, -150689, -156355, -91368, -76886, -45973, 15672, 8125, -50991, -73214, -81701, -220640, -272114, -244004, -177898, -215819, -220195, -54441, 319, -92497, -135181, -182176, -100636, -195375, -206549, -25573, -14130, -47607, -45456, -63206, -174199, -277454, -340537, -147790, 39246, -22345, -145717, -109393, 14156, -35636, 14641, 57181, 62598, -9623, 15790, 115784, 83859, 150383, -13915, -61818, 136714, 216621, 279608, 344941, 239038, 308871, 117353, 94096, 86756, -92838, -332187, -236937, -135018, -289372, -390920, -278899, -227627, -316484, -232357, -15839, -30997, -78522, -30383, -65678, -168428, -200144, -231137, -25826, 146157, 192870, 147681, 15120, -56409]
17062e6409o0045J12545j44752j32140M3470M4086P5302P4547K2427r2010O0427
17051e2552r441N1564N7759k8520R5754J37145J2726l3051J02003N890r4160r3166
17039A51951j82592j20660k3254J38731m823j26212p535O3202N848L543O6419
17028c5382M733p839J66902p6374q839O305L357M9161Q6873j12695k49764l7128
17016b10690K42152J18238Q900q0538J5142J76773o1802q0427J27761N0605j34832
17005A71282j12152p1501J95659J34615P5624j09660j11052k0977j64159j05729
16995a18050J3468j37900M8213Q1003q8360p0773K10190j00830o3735k704K7000
16984b02478J63690J76119O8895l1553J70312N6146j40855j63111q3642l4044
$$ y = [-56409, -116454, -3909, -148661, -280801, -237331, -193245, -117943, -43396, -20969, -112979, -52552, -61993, -10429, 47330, 18810, 114564, 251709, 264435, 231384, 333387, 339277, 245117, 151951, -30641, -151301, -174555, -35824, -40647, -166859, -174394, -111192, -105344, -101801, -35382, -30649, -38488, 128414, 52040, 43201, 49506, 52863, 102024, 188897, 76202, -173562, -210690, 31462, 149700, 158600, 78062, 93204, 269977, 208175, 127748, 255509, 306114, 171282, 59130, -12371, 183288, 317903, 393527, 283867, 172815, 151838, -12321, -118050, -104582, -242482, -194269, -113266, -201626, -272399, -62209, -163039, -226774, -229478, -202478, -38788, 137331, 206226, 174673, 344985, 401131, 260276, 97165, 13523, -20521]
16974b0521j20137j51252P1849J47732K00181Q777j04334j74992j32966r7653
16964c73316j2998J25441J23074l8725O3368L8475Q6635o7390o5405j463P7285
16953d5019j24966k07143n4455J69314J07185l9027o5716j50204j622N9470J1051
16942c41132K5428o1005J28139j46253o1800M6971K20603J69429k34979j79974
16932d34573J52826K40489K34682j6212l339J3781J34771o3028p142N0525q1864
16921B20916k3929o3589p4557j23382j62805j7405O9682J7758J2714k7757l4468
16910b06822j23804Q6671O9810j98533K0573Q2334J5209P4034N4545q9700R2646
16899a23037N4907o3902o0607J02486n8481o000O8067J08828l038n1298j18731
$$ y = [-20521, -140658, -291910, -220061, -72329, 127852, 136629, 32295, -142697, -275663, -373316, -386314, -260873, -137799, -176524, -113156, -74681, 11954, -55436, -120841, -122304, -45019, -169985, -377128, -431583, -262269, -155084, -194111, -259827, -410031, -411653, -352183, -341132, -315704, -376709, -248570, -394823, -456623, -409652, -189049, -19620, -254599, -434573, -281747, -41258, 193424, 177212, 173873, 187654, 322425, 259397, 252255, 302780, 220916, 196987, 133398, 58841, -64541, -227346, -244751, -175069, -157311, -144597, -172354, -206822, -330626, -243955, -174145, -372678, -352105, -269771, -254562, -180528, -125983, -215683, -123037, -68130, -132032, -192639, -90153, -148634, -154634, -86567, 22261, 19223, -32075, -150806]
16888a50806L1022P5261m1455m4723J14783J8181k1246M8970P34k1015j15033
16877a05327N7966m5802M2561o3308M9500K26224P7578k30271l4212k3522L4239
16866a4374J72540m8235k0905M5472n8140m0462J09247j02911j06712p2718J568
16855a35630j54092R3677J88812K76490Q3471j79345N2200M5823j51347k45297
16845a25238n9665j6976J49199o850K780J44001j39967j16727J26467l0116M7194
16834b5898J04959m5497O092R3306J32647m7121k70919j75663J47887J78259j00906
16823b854k5961J00440J30737k9943j99973o0225J34248Q8871J2252l6636J1969
16812A22925Q865K664j6887k8434K4356l3529j76901J71692J85703r4151o0255
$$ y = [-150806, -119784, -44523, -85978, -130701, -15918, 2263, -18983, 29987, 30721, 9706, -105327, -47361, -93163, -50602, -113910, -64410, 161814, 239392, 9121, -25091, -48613, -14374, 158166, 109931, 89026, 134498, 76358, 35896, 145143, 42232, -64480, -137198, -135630, -289722, -196045, -7233, 269257, 352728, 173383, 225583, 271406, 120059, -125238, -184903, -201879, -52680, -59530, -56750, 87251, -52716, -169443, -42976, -73092, -25898, 79061, 33564, 39656, 132962, 265609, 218488, -52431, -228094, -80207, 98052, -2854, -28815, 71625, 202362, 172419, -27554, -87779, 46469, 135340, 147592, 110956, 122925, 131790, 134454, 117567, 89133, 113489, 79960, -96941, 74751, 260454, 166303, 106048]
16801A06048O5002r2841o7113j25655l9862j26305N5807J26033j9986j16731k766
16790b38369p1972J49099K2571r1636Q5332j83165k62325m4177K45163K00573
16780a88906j7626k30746k4043J68240q5918j4840J59990K09155J17412P229j20995
16769b1048j31126m3794J29897l2884n9561Q3886N4859J8129J26053q9875p5304
16758d0768l6119k5233m8596K3457J06280O1871j43557p5173n1060J49961o4961
16747a43898j88446J25938m0841j6000m795Q1257J85633J22511j43758k33849
16737b56248j59456M0677K9631J98550J19692q8332J56827r9679k7432q1319p8557
16726b45646N601J94312J16216r6854k6948K35663J32742m3595j17622k12749
$$ y = [106048, 171050, 78209, 11096, -114559, -154421, -280726, -224919, -98886, -118872, -235603, -238369, -310341, -161242, -138671, -230307, -144975, -328140, -590465, -634642, -389479, -188906, -206532, -437278, -461321, -293081, -378999, -393839, -233849, -24694, 92718, 99947, -21048, -152174, -195968, -66071, -98955, -158516, -74630, -19771, -1642, 124411, 34536, -40768, -76887, -102120, -150716, -127259, -20979, 40892, -102665, -177838, -228898, -78937, -143898, -332344, -206406, -247247, -263247, -268042, -186785, -1152, 121359, -22399, -256248, -415704, -375027, -345396, -146846, -27154, -115486, 41341, -58338, -85770, -167089, -245646, -240045, -45733, 70483, -26371, -53319, 182344, 315086, 271491, 153869, -58880]
16716e8880j67410M9583K04021n3335k8062m4254J14218J49711j6008j43443o3120
16705e6979l0864J04600j2355j65815j0190J0272j00519P8642J30590N4523j01360
16694i9455j63696n8394k4505L4459J38233l0131O2285J9027j34287P277J92983
16683e6204Q1362j53309j41609q1518P006O9352j57986k5289L5378J21806J69944
16672a31067N3117l6001l7222j34438L4133O0098N1298N9012J6286K43331l1941
16661A46606k76963k81136k6666J88934J36400J98451P1022p6680p7814l5925
16651c3771q4795q9685l7042j61031J09120N1155J16524K66793J10574n0773j52408
16640D4661l3450J3722J5486n0839L0423l4658j17839q2503J2727J51580N4789
$$ y = [-58880, -226290, -176707, 27314, -26021, -54083, -98337, 15881, 165592, 149584, 6141, -56979, -87843, 16757, 4402, -161413, -171603, -161331, -261850, -183208, -52618, 1905, -99455, -263151, -321545, -346050, -311591, -173358, -203489, -141204, -122177, -256464, -249187, -56204, 25158, -128151, -269760, -351278, -344272, -274920, -432906, -458195, -422817, -301011, -131067, -77950, -113951, -151173, -285611, -251478, -191380, -140082, -81070, -64784, 178547, 146606, -130357, -411493, -438159, -249225, -112825, 85626, 156648, 79968, 2154, -33771, -118566, -208251, -245293, -406324, -297204, -246049, -129525, 137268, 247842, 197069, 44661, 11211, 24933, 40419, -10420, 20003, -14655, -132494, -214997, -202270, -50690, 4099]
16629D099o0899k8813p1939Q4790j37498O3969m8612k56643q5537J04187O7837
16618c65059R9462J13746j24586L6795N0409m0834M1685K59912L2551k790o4581
16607C6710j33250j10126R905o9938R6520o7313N7140j5002o3869J2940r8883
16596c45166n7319J34133J92592m7224p8028L4156R6941o5465p3201M4449L9309
16585a24823Q5171M8766m9301j803K6342m2322j31209J04974Q4810M9106q4621
16574c4910L8216K9650n3531k46566p3036M6922K22339J73698j42313q9721j21418
16563b50670J01547k2151r6889P6225M2976N35K59757Q6439p7690q6232Q5877
16552A19724K37480N8004j75949j76271j11614K8262K971M658r3331p759n3918
$$ y = [4099, -56800, -85613, -157552, -72762, -210260, -146291, -194903, -451546, -537083, -432896, -365059, -265597, -151851, -276437, -239642, -189233, -230067, -188382, 71530, 104081, 101291, 36710, -96540, -206666, -196761, -266699, -170179, -237492, -180352, -195354, -259223, -246283, -345166, -402485, -268352, -75760, -122984, -201012, -166856, -69915, -135380, -208581, -164132, -124823, -39652, 9114, -40187, -41990, -15648, -57970, -189179, -84205, 605, 49711, -34910, 3306, 32956, -20575, -267141, -340177, -293255, -70916, 102782, -39531, -129252, -250670, -149123, -171274, -268163, -191938, -148962, -148427, 111330, 197769, 120079, 33847, 119724, 357204, 415208, 239259, 62988, -48626, -20364, -17393, -12735, -106066, -113825, -167743]
16541a67743J5134P3196J48965J29587K8016j19867j25828j6245n399q1534n6288
16530a78006J59849J7446O8467M4641j74226n3300q6574J0596N6294q739O8917
16519g4635K9110J06790K1727L0169J9119p6409m3387l3559J72523n4198j35089
16508c7839j07198M944j06481O8064J02408j4275l0356l4770J02101n9712k30757
16497c43871N3178J53310j2805n7356n658p7700M3215J26446o324q3439j54735
16486c65739m1818J67527N4976n0874n4943M1906R5503k6402K17907J04205j09273
16475C2975p1209m7295l8448j25292m361K39053R9064m8979M8804M0177r6117
16464B8372O2299l2111l934o0870N2856J92925M8584j96304j82710o8689K4691
$$ y = [-167743, -152609, -79413, 69552, 199139, 227155, 107288, -18540, -34785, -40184, -121718, -178006, -18157, -711, 67756, 112397, -61829, -115129, -201703, -191107, -134813, -143552, -74635, -45525, 61265, 82992, 113161, 132280, 55871, 12484, -21075, 151448, 97250, -37839, -145037, -140093, -246574, -178510, -76102, -90377, -120733, -155503, -53402, -113114, -343871, -290693, -137383, -150188, -207544, -213202, -290902, -247687, -121241, -127565, -211004, -365739, -407557, -240030, -185054, -235928, -290871, -248965, -153462, -179864, 38043, 142248, 32975, -38234, -85529, -123977, -249269, -253630, -14577, 84487, 35508, 84312, 124489, 28372, 90671, 58560, 54626, -6244, 46612, 239537, 288121, 91817, -90893, -159582, -134891]
16453a34891J3935N8020K4391o2108J6775J7449j87168m0147J15000j27218j29045
16442d35007J51148J26645J49598p9569m7251l975r3285Q7269J75357J07291K9432
16431A67653K1846j99171j42454p2942p619o0153m531L1097J55441M8534j27865
16420a90164j8374R6468K20569k7893K1331j0389q2815J4680j05988o6322k6650
16409a75547J98225J30979J19705j9200j94632k3709j20684l5316o2862m3444
16399b26485J87909J31971J7399j24137n2263L28622J03360K0992M6289k48969
16389A84688k01595J6691K1064J8957j04186l2156O8447l3981k00490k07950J53764
16378c16747K21197L5391p5350j26989N4316Q2262j23135o8297m2622P8015K09134
$$ y = [-134891, -120956, -62936, -38545, -100653, -83878, -66429, -253597, -293744, -178744, -305962, -435007, -283859, -157214, -7616, -87185, -134436, -138411, -231696, -144427, 30930, 138221, 167653, 189499, -9672, -152126, -225068, -232687, -292840, -297371, -266274, -110833, -62299, -190164, -208538, -112070, 108499, 80606, 101937, 91548, 8733, 23413, -82575, -148897, -175547, 22678, 153657, 273362, 254162, 59530, 35821, -84863, -120179, -183041, -226485, -38576, 93395, 110794, -13343, -65606, 263016, 366376, 387368, 433657, 184688, -16907, -216, 20848, 39805, -64381, -96537, -28090, -62071, -262561, -470511, -316747, -95550, -60159, -135509, -262498, -208182, -125920, -249055, -317352, -359974, -281959, -72825]
16367g2825J16839J36383o6054j10721J63255J45080k05726k01293j469J41158
16357D4627O6247k13791O4468k434m8538N3021j7878J14573m9398j36283j15845
16346b41231j48184P6438J5240J36898M0794L5472j6287k2481J44024L2751m491
16335D8943o1939L2732J30920K710j96606j65972j06693J06113J27435K02822
16325A20465r4805o0218N7796k7430k04877m1111L0007J87186N9600n4464o1956
16314h9807j2563k2510R6982l5603j8031J53381j19965R819J91291J22667j49657
16303A26004j57174r5679m2070k9950J72210K9659M1137P51j99200R9851J48491
16292I4030l8979j12656p8059J22846J23091j5241L6680p4284q7840j91818J1888
$$ y = [-72825, 44014, 180397, 114343, 3622, 166877, 311957, 106231, -95062, -96531, 44627, 110874, -102917, -38449, -40883, -89421, -36400, -54278, 60295, 10897, -125386, -241231, -389415, -312977, -297737, -160839, -120045, -84573, -100860, -123341, 20683, 53434, 48943, -12996, 19736, 150656, 153366, -43240, -209212, -315905, -209792, -82357, 120465, 25660, -34558, 23238, -4192, -209069, -250180, -220173, -32987, 26613, -27851, -89807, -102370, -124880, -27898, -63501, -81532, 71849, -48116, -38297, 152994, 275661, 126004, -31170, -126849, -168919, -198869, -26659, 3000, 44137, 44888, -154312, -54461, 94030, 55051, -57605, -135664, -12818, 110273, 95032, 131712, 57428, -30412, -222230, -210342]
16281b10342J44275P2150N2025l1531k19282K6323p8183R5900Q0422J5602J14118
16270F1477p6691j82J20955M2227j81940l9533L6837m1608j31488j7744K25270
16259b420O2458J14424l9491j61667k08655q6073J6150K8096J36216R8407j55858
16248a98413n2308Q136L1807j66902O8899J77172K6733r5141J46085j91071n4180
16237b99183J44972K5076L1115q0425K8164R7066m3674p6938K348N6099J12540
16226b840N2269j41659j28963j2586J04128k0495l3743Q6579j90783P64Q5395
16215b01934L7864j08345j51996N3266P9680J60068n2137M7393O1265K05616J10354
16204B41094j06854j81940j03532J79944l3234P0189o22K5338p0892P9078J05956
$$ y = [-210342, -66067, 6083, 58108, 26577, -192705, -166382, -244565, -148665, -68243, -52641, 61477, -15214, -15396, 105559, 147786, -34154, -73687, -36850, -78458, -209946, -227690, -2420, 60038, 174462, 134971, -26696, -235351, -321424, -305274, -277178, -140962, -42555, -198413, -250721, -242585, -210778, -377680, -308781, -131609, -104876, -200017, -53932, -245003, -299183, -154211, -129135, -98020, -178445, -150281, -53215, -96889, -173827, -171479, -115380, -2840, 49429, -92230, -221193, -233779, -129651, -150146, -183889, -97310, -288093, -287329, -201934, -164070, -272415, -424411, -371145, -291465, -131397, -183534, -136141, -74876, 130740, 241094, 134240, -47700, -151232, 28712, -4522, 65667, 65045, 90383, 19491, 98569, 204525]
16193B04525l7632M4252r3977p5987M1340j17643M494R1504O9889N1443J3883
16182A96091r7431o7344k2372J2241J85574J35315k55571j29388q9053J01425
16172c0513O5439q3309j0762K3858O1642J9046J3115J21774P3218J4198o5271
16161B02435r121j77331j73148L070M3081O8289q0168l6716J04826Q3715j60227
16150a31295j58153J7852K1424P6495K90963q145o79r594J7124r5199K4098O3498
16138A08389k7858n7375p0005n39L9350N4793n4043j69411j19456M837J55102
16127a36216J0814J40540J47198J7467j7357j31794L5438k1186m0992j74107K7516
16116a42679L3465K8453J1005q0753q5932J10956p3651n2570J35660R1113R4496
$$ y = [204525, 166893, 211145, 117168, 41181, 82521, -35122, -30628, 60876, 130765, 182208, 196091, 98660, 31316, 8944, 21185, 206759, 342074, 86503, -42885, -131938, -30513, 34926, -48383, -59145, -35287, 26355, 45401, 58516, 180290, 253508, 267706, 202435, 193314, 15983, -157165, -154095, -111014, -42725, -122893, -159609, -54783, 28932, -131295, -289448, -271596, -250172, -173677, 117286, 109141, 108462, 98868, 115992, 20793, 44891, 108389, 80531, 23156, -46849, -47388, -8038, 46755, -7288, -176699, -296155, -291318, -136216, -125402, 15138, 162336, 179803, 162446, 30652, 66090, 44904, 3912, -170195, -142679, -109214, -80761, -69756, -150509, -236441, -125485, -199136, -251706, -116046, -24933, 69563]
16105F9563J11568j9166k7806j67083l00426j38397J05642k9997M6299J87564
16095a62239P1500L1724k5923l3195j48172J28396J67800j16506k0106M0089K314
16084f4318J50910K8451q5005M8937M816k12972j39049m7585N5098k5072J62666
16073a23123J34323j67928J73007N5912K017P9697J16759j85383m2008K5692r9921
16062c0956j28288j5383O9177K27373J32396k27581j89329N4183J83458O0247
16052A35297k76470j10985K01730l8641j05728q0055J55000M9783k31528l3433
16042c35030J04377R0635q0586K25593P9196j34450q845J05793L1873J38844N5018
16031B72418j63098k04969j6402J34850Q9361O3256j6513L8041j6304j46222j98526
$$ y = [69563, 181131, 161965, 134159, -32924, -333350, -471747, -366105, -396102, -349803, -162239, -90739, -59015, -84938, -118133, -266305, -137909, 29891, -86615, -106721, -66632, -64318, 86592, 115043, 30038, 78975, 83791, -129181, -268230, -315815, -260717, -285789, -123123, 11200, -156728, 16279, 72191, 74208, 153905, 270664, 85281, 43273, 68965, -30956, -159244, -174627, -105450, 121923, 254319, 26738, -162591, -108408, 75050, 135297, -141173, -252158, -50428, -89069, -194797, -274852, -119852, -70069, -301597, -335030, -230653, -140018, -220604, 4989, 84185, -50265, -59110, 46683, 78556, 217400, 272418, 109320, -95649, -112051, 22799, 112160, 175416, 158903, 196944, 180640, 34418, -164108]
16020a64108J12820J86958P6180m2475o2854m8070j71273r5029Q919K35002L5616
16009G1686j36965k47093r0672L6614P7105l378O0731J5413j26273j52997J28769
15998c67060J33050J85127j05988q3644N1871J25348l087o7956M5347J75918K5960
15987A14886l1739l8029R237l63N2036n9217m3566j6983O976p7934k7854j9419
15975a31969q9711n0283j22650J50954J25728M4800q834m3979R7097K9892O918
15964G963n498k4295j84165m5657O0245j54557j06848j812R2636K22281M2158
15953i7549J4919m1103r2789r6969j0396o696P9626M9647M9658j2523R3062J26016
15941E4903n0696M3891Q8438o5936p0972o6947N0471P2052j1630R0076n0515j92226
$$ y = [-164108, -51288, 135670, 211850, 169375, 106521, 58451, -112822, -207851, -198932, 36070, 71686, -65279, -312372, -403044, -366430, -289325, -292703, -231972, -216559, -342832, -495829, -367060, -234010, -48883, -154871, -238515, -186644, -61296, -64383, -132339, -86992, 88926, 114886, 83147, 45118, 54355, 53992, 106028, 46811, 3245, -13738, -6762, -84696, -112550, -131969, -221680, -271963, -394613, -243659, -117931, -73131, -81965, -125944, -28847, 1045, 7963, 2465, -21830, -205995, -251652, -191407, -345964, -452812, -454624, -361988, -139707, -97549, -82630, -123733, -216522, -313491, -323887, -330583, -250957, -201310, -151652, -164175, -71113, 54903, 4207, 48098, 136536, 70600, -372, -67319, -16848, 55204, 43574, 133650, 83135, -109091]
15929a09091j26521k469M2817N9267K06916J01090k3668O4653L0483L1905P331
15918B82713M7089o805j71155L3042P1559J50580q9438k94969K7692M6711j26321
15907b9302L6962R3658R0378j31062j88465j7642j5600K103K8475l8990L498l0868
15895a96855J05084J16698J03649P5932o201j99986j20092j37223K19861J80567
15885A41434j39309j24934L0498P2951Q8191j71891L558o0823j25898Q2252j32899
15874c36870p1638J47297J71244R8928R3316k62892j5511J6364j80442P9593Q6933
15863a73678M3529j3448k3834J12006j7934Q3238J12530p3988j47884p1346R7184
15852g3625j477J28952j3691j83405J30155P2476L9846p5229k0242j12491J95784
$$ y = [-109091, -235612, -238081, -195264, -135997, 70919, 172009, 148341, 212994, 243477, 275382, 282713, 329802, 322997, 151842, 184884, 256443, 407023, 317585, 22616, 50308, 97019, -29302, 7660, 101318, 191696, 60634, -127831, -145473, -161073, -158970, -130495, -169485, -165987, -196855, -91771, 24927, 128576, 204508, 198307, -1679, -121771, -258994, -39133, 141434, 2125, -122809, -92311, -19360, 68831, -103060, -99502, -160325, -286223, -203971, -336870, -408508, -261211, -89967, 8961, 102277, -160615, -176126, -159762, -340204, -260611, -173678, -130149, -143597, -167431, -55425, -73359, 9879, 122409, 48421, -99463, -170809, -73625, -75102, 53850, 40159, -143246, -13091, 59385, 99231, 24002, 3760, -108731, 87053]
15841H7053M2452j59411j07884j24375k6496Q6000P7909K9577o9820K4207K22592
15830H1804O1380R0506k33375j89865q0427J04487K4092l2162k71636M1434L54501
15819d9261m0617n4406j42353j0935Q1569K3746M1807k12472j36710J44343j5197
15808c70486J01748j07683L1575J07021J88809J5866r7206n7256J71272k0598
15798c6938N9347m1093O066J008j31015k773N3785q9817j2813J94375l978J08661
15786A04815J43980J4766j89967J31683q4741l44311j38699K05875K61037k1956
15776H2482j7694K12455l1370j73982j34694k22407O5515K11074N7365q5312k6889
15765f3457j14107r5459q2635N3298J72469k1717O7529J70091J09022j23796j11988
$$ y = [87053, 129505, -29906, -137790, -262165, -288661, -202661, -124752, -95175, -164995, -140788, 81804, 143184, 233690, 315, -189550, -269977, -165490, -141398, -173560, -445196, -403762, -49261, -89878, -144284, -286637, -297572, -216003, -192257, -150450, -362922, -499632, -355289, -370486, -268738, -376421, -344846, -237825, -49016, -33150, -130356, -187612, -16340, -36938, 22409, -18684, -12618, -11610, -142625, -145398, -91613, -181430, -194243, 132, -3846, 104815, 248795, 263561, 73594, 205277, 120536, -223775, -362474, -156599, 104438, 82482, 64788, 277243, 245873, 71891, -62803, -285210, -219695, -8621, 48744, -36568, -63457, -177564, -273023, -355658, -302360, -129891, -151608, -84079, 86012, 195034, 71238, -40750]
15754d0750P625j35719n1048p530J04773q045j9627J0013Q9857K4030j93607n8673
15742b78701O5273K06497L9264r2361j27343L5884P1363J48717p7797j0534m4483
15731f4221j9530Q3823r5003r1879P778k6001R5865j9531p6094m0323Q3887K2594
15719a38635M8428N8766J13258J96250J09198j49406o5724q5147L0121Q5855n6044
15708A46920k00485j28891K0193M3326O2991L0264m6098l9326l1906O6941L3370
15697d2701K6801Q9567q06j62820j33934N0994K21005J5143N8361N1053o7660
15686A05003r7379k42470J0096o0731L3514J09866l2554o705L0272M7675j02923
15675b06336J13534K39079R0114m3395j77367M7742r4437m5371J8245r3983K8450
$$ y = [-40750, -33125, -168844, -219892, -227422, -122649, -130694, -150321, -140308, -50451, -26421, -220028, -278701, -213428, -6931, 32333, -60028, -187371, -151487, -80124, 68593, -9204, -19738, -64221, -83751, 72, -94931, -186810, -179032, -205033, -109168, -128699, -204793, -245116, -161229, -138635, -90207, -31441, 81817, 278067, 387265, 237859, 172135, 86988, 117109, 202964, 146920, -53565, -182456, -162263, -118937, -55946, -25682, -71780, -111106, -143012, -76071, -42701, -15900, 73667, 72861, -89959, -223893, -172899, 48106, 63249, 121610, 172663, 105003, 7624, -234846, -224750, -285481, -251967, -142101, -174655, -181360, -151088, -103413, -206336, -92802, 146277, 236391, 192996, 15629, 63371, -31066, -76437, -58192, -152175, -123725]
15664a23725J27917m033N1476j93170j05023M926J14564J15430O6908J68030J26788
15653C50088j08783j43588Q3023l3260n2937j313j94664j77541J54729R2315o4606
15642i6537K28568K33528J19877k42533j94256L8328k7692L4339j92504j37727
15632b36609J30631J03117K7942k4763j22775J2366J14903k3044J6613l8197K8266
15621a1550J27092p0580K5798j9304n2722j7995o0402l4627P4676J3529K1632
15610d453q3615J90186Q3628n5194N056n3198j74745p2936j16690Q1307K9769
15599a70885K9432k4666L9157j3935P8393J18362J02024N4188j82079j69155q2618
15588b21782J32105m1240M5790J8636O2740l1253l0926n2851r2094J64442J49629
$$ y = [-123725, 4192, 159, 51635, -141535, -246558, -241632, -127068, -11638, 55270, 223300, 350088, 241305, 97717, 180740, 147480, 94543, 93230, -101434, -278975, -124246, -31931, -96537, 132031, 365559, 485436, 242903, 48647, 86975, 59283, 93622, -98882, -236609, -105978, -2861, 25081, 318, -122457, -110091, 4812, -18232, -1619, -39816, -11550, 115542, 44962, 70760, 51456, -1266, -19261, -79663, -114290, -39614, -26085, -4453, -88068, 102118, 185746, 130552, 135608, 82410, -92335, -165271, -281961, -200654, -170885, -141453, -166119, -126962, -140897, -62504, 55858, 157882, 212070, 29991, -139164, -221782, -89677, -130917, -85127, -66491, -3751, -35004, -65930, -118781, -210875, -46433, 103196]
15577A03196j74531j89667q7699N3803R9507m7333L8133O5107M0185L4035P2284
15566G020o6420j03910m6606q9102J03767K18332o1822L6696J30801p4613J8439
15555G2582O446j2651O0278r9838k27050M3601q229q7493q8969P9934J10805p1307
15543b21891P4514K912J27674K4675Q2817l9570j910j28199J01o5628J18118K14133
15531A87746Q9416p7843k41374o6883j0278N9540O2865J81636R0823k08576o8696
15520a624N7825j62248p7482p2363Q7887L4285m0349K20480L1816N2853L0552
15509A61632M2270L1413o8849m9404q8455j53837j46866J65934J96113M6293p4006
15498F2238k34390q4744K7709N9716L4376n5775J08628N0607j40968j14247k281
$$ y = [103196, -71335, -261002, -348701, -294898, -195391, -242724, -204591, -139484, -99299, -65264, 7020, -59400, -163310, -209916, -299018, -195251, 23081, -38741, -2045, 128756, 54143, 72582, 79028, 66377, 126655, 26817, -200233, -156632, -164861, -252354, -341323, -261389, -150584, -221891, -147377, -144465, -16791, 7884, 90701, 51131, 49221, -78978, -78877, -144505, -26387, 187746, 277162, 199319, -42055, -108938, -119216, -59676, 3189, 184825, 275648, 67072, -1624, 56201, -106047, -183529, -255892, -168005, -133720, -174069, 46411, 78227, 131080, 161632, 203902, 235315, 166466, 117062, 28607, -125230, -272096, -106162, 89951, 136244, 62238, -172152, -256896, -229187, -169471, -135095, -190870, -82242, -31635, -172603, -286850, -289131]
15487b89131K38863q288k92819l3913J54732Q6451J5874m2365n0854k6636J37682
15476a10404m5699J2861K5472Q7492J93027p6680j45414J7397J15100J78448k1470
15465B30130r3516o1435n5692k7799j42094j45134K3145Q0129l6172O5874J25217
15454c7347M8497J87270p1721q9812j42999j66127m0494J8711j6633M8486l5963
15443b98132K48127Q9858r6607l0736O117j71607n5588o1814J68911J07430j4484
15432a08525n8777K1146L278j6680L9117l3304L5104j4933o1192J48966M9680
15421C880m220O0857j5181j00124p1418J6845k0592J32946N6379O1594P2531k05707
15409a2210j67998m7482m5124j5508n3432J28Q8214K34203P0439k8762k10358
$$ y = [-289131, -50268, -58556, -351375, -385288, -230556, -144105, -128231, -170596, -221450, -248086, -110404, -156103, -143242, -117770, -30278, 162749, 86069, -59345, -41948, 73152, 251600, 230130, 136614, 75179, 19487, -8312, -150406, -295540, -272395, -192266, -228438, -162564, -37347, 11150, 198420, 126699, 36887, -106112, -272239, -312733, -294022, -310655, -262169, -298132, -50005, 39853, -56754, -87490, -81373, -252980, -308568, -370382, -201471, -94041, -108525, -167302, -146156, -142878, -159558, -120441, -153745, -118641, -133574, -194766, -45800, 3880, -340, 60517, 45336, -54788, -126206, -109361, -129953, 2993, 59372, 120966, 193497, -12210, -180208, -227690, -272814, -288322, -341754, -341626, -253412, -19209, 51230, 22468, -187890]
15398a87890k01186P1481J71882J50880Q4813o6949j6433j9046m2482L3123J49484
15387A27677j3460P565N7755M1245m311p4582n343j29216j12003q0838r8697l0731
15375c14939j3165Q7562M1622Q5585J08310O5993j38017J8226J7656j47271N0802
15364a37636P7515J13715j5341L9903J56316j13312j53877J68567K2661P3105
15354B31616r000L4461j99794j99189M993J79575Q240J2085q9683m8524L2302
15343d2918P8850m4508n1217P991J6282n4021j48787R436J5698K27620K6534j90278
15331a49318R9836J69691j69826l4126j40540L653k0969J5769O5226M8086k059
15320a14577r928Q913R1145J81371j9254o3397j21386j0419J18042O4656q6676
$$ y = [-187890, -389076, -317595, -145713, 5167, 89980, 23031, 6598, -12448, -54930, -21807, 127677, 114217, 121782, 179537, 220782, 216471, 141889, 136546, 7330, -104673, -185511, -284208, -314939, -328104, -240542, -198920, -113335, -5025, 60968, -77049, -58823, -41167, -188438, -137636, -60121, 53594, 38253, 78156, 234472, 121160, -32717, 135850, 158511, 231616, 222616, 257077, 57283, -141906, -136913, 42662, 50902, 62987, -26696, -75220, -42918, 35932, -8576, -59793, -51802, -35520, -89541, -238328, -228892, -213194, 14426, 40960, -149318, -49482, 120209, -49617, -83743, -224283, -220630, -241599, -225830, -160604, -112518, -114577, -124505, -115592, -24447, 156924, 137670, 74273, -47113, -57532, 60510, 125166, 38490]
15309C8490q4667K3327j0230Q4081O1072J0529O2725K2471l2124j66086q0468
15298g0880n252j6058L2590L1071j31576k11607Q4038K83654J89738Q9678k9278
15287B46118k22266p0796j50014J7077N6124l3750r258R588j70752n4383r607
15276c91919J08581P2378J06751J01320J3070k7140o9780J34360J40972R9653
15266B88246k96685j32892p753K3612L4023k2950N5931K0570J109O3998J14365
15255A41574j07587q6571K32085P2735j21854P89J5307j02032j25090K8609k0866
15244g2901P7696M1980M493j31197m7846j20543O6460p512j0800O1342J9914p0451
15232a89365M7049J39847q0491j46071K9188L3940J73137J19851M9513r2615j02929
$$ y = [38490, -46177, -22850, -33080, 51001, 112073, 122602, 185327, 207798, 175674, 9588, -70880, -76132, -92190, -59600, -28529, -160105, -371712, -287674, -4020, 185718, 275396, 246118, 23852, -46944, -196958, -179881, -123757, -157507, -166765, -157177, -327929, -382312, -391919, -283338, -210960, -104209, -2889, 10181, -16959, -86739, 47621, 188593, 288246, -8439, -141331, -149084, -125472, -91449, -114399, -58468, -37898, -36789, 27209, 141574, 33987, -52584, 179501, 252236, 130382, 131171, 146478, 44446, -80644, -52035, -72901, 4795, 46775, 51268, -79929, -127775, -248318, -181858, -189370, -200170, -138828, -118914, -189365, -142316, -2469, -82960, -229031, -199843, -165903, 7234, 127085, 176598, 83983, -18946]
15221a8946j27609o8944K19029o3633L177M3138J5708j6948k1694P270J34334
15210A04882l7461J1760p2965j31885j12862j65319J18109J00720J62624j5205
15200c7602P8852N8291q7327j49738j15229J25505P8409m4662j97441j34718M0546
15189c85114L221J48994l0887N2021R6564K5943q4677K9761m7602m0803J04481
15178a28098J06129q5448p6716J23643J6983q5159q5344q8153M0673K31830O1975
15167C2315p97j61333j72932M8010L1064k20291j38104K34755L8128N2771L841
15156b52573M0052j6978j21346l6762J82836J45159o2261m7932k4317j15776K6437
15145b83461J70530j5334J24694L8541l2656R0739r2849o1639J39167R0851J1813
$$ y = [-18946, -146555, -215499, 3530, -60103, -56926, -13788, 1920, -15028, -36722, -29452, 104882, 67421, 79181, 6216, -125669, -238531, -403850, -285741, -185021, -22397, -37602, 41250, 99541, 12214, -137524, -252753, -127248, -48839, -93501, -290942, -425660, -385114, -381893, -232899, -263786, -211765, -115201, -89258, -173935, -144174, -191776, -232579, -128098, -21969, -107417, -184133, -60490, -43507, -128666, -214010, -302163, -261490, -29660, 32315, 31518, -129815, -302747, -254737, -223673, -443964, -582068, -347313, -309185, -256414, -252573, -212521, -229499, -350845, -387607, -204771, -59612, -121873, -169805, -194122, -309898, -283461, -112931, -128265, -3571, 34970, 2314, 93053, 204, -61435, 77732, 168583, 180396]
15134A80396j24997m5162q9075q7481j02358k9237l5407J43429J79815j01110
15124a11187k6429O7299L6359L4851r0010P338J44555L7452J01799O2964j66574
15113I8417k38321K1473J43750J4101j4836J9075m6949k6445Q4290r5179j73664
15102b14288N5748P8644p2780n6758J61057J31690O0140j72360k64183o4646K00415
15091a57321n4121K5473K09211N9374K7308k01387j11765J29584o9050j64777
15081c07471J30605m9906j08278J20719l8755J2048P3302O3444K7130l9932j40942
15070b58036N0255J66439J28922J46907j43847j0451P2387J3097o1088j30751
15060b6166O799N1305J67403R1623L5837j39185k24902K1355j90980j35714K09940
$$ y = [180396, 55399, 10237, -78838, -166319, -268677, -297914, -333321, -189892, -10077, -111187, -137616, -70317, -33958, 893, -89117, -81779, 62776, 100228, 202027, 264991, 98417, -139904, -118431, 25319, 39420, 24584, 43659, -3290, -29735, 54555, -40624, -214288, -158540, -79896, -152676, -209434, -48377, 83313, 143453, -28907, -293090, -357736, -157321, -211442, -185969, 23242, 82616, 109924, -91463, -203228, -73644, -142694, -307471, -176866, -226772, -335050, -214331, -253086, -241038, -167736, -104292, -77162, -117094, -258036, -207781, -41342, 87580, 234487, 90640, 80189, 152576, 165673, 104585, -26166, -19367, 31938, 199341, 290964, 326801, 187616, -37286, -15931, -206911, -342625, -132685]
15049a32685J38362r430j8008K359j67375j1659J00229N063R473L2972N9314j40806
15037a32191J38232J68203m0866o9488P963J30224q5085M1590J04422J8241j42407
15026A38838r7361L3122J18145m9865o5524j3260O5012l4116L6807j37026o0709
15015f5937J10823q643o4800k9100l0419j45570j34228Q9755J75189M6068m5463
15004a02325N4637p0729O0827m8827n6444M3201n3051m8715l018P1262K3514p1884
14992b01552J49961K5288Q745k5265K0619O951M9655j26903L713n1309r3305J27241
14980a06161j19053n5250q8963J73139Q9533k8604l1198m8336k1571q373Q1235
14969a63602l217N5409O2093j25634K3374q2433m7649r0692J91855Q0411J1707
$$ y = [-132685, 5677, -3753, -21761, -19402, -186777, -198436, -98207, -93144, -83671, -50699, 8615, -132191, 6041, 174244, 133378, 63890, 71853, 202077, 116992, 158582, 263004, 281245, 138838, 41477, 74599, 192744, 142879, 77355, 64095, 129107, 94991, 131798, -5228, -65937, 44886, 36243, -28557, -57657, -88076, -233646, -367874, -278119, -102930, -56862, -102325, -47688, -118417, -57590, -106417, -162861, -119660, -172711, -221426, -224444, -153182, -129668, -201552, -51591, -26303, -17558, -42823, -22204, -15253, 34402, -92501, -88788, -140097, -233402, -106161, -225214, -280464, -369427, -196288, -106755, -135359, -166557, -214893, -236464, -244837, -163602, -166819, -111410, -49317, -174951, -151577, -234010, -281659, -372351, -180496, -100085, -88378]
14958h8378P0551k0215P1216j89610j12671n1865J23615O3884J16045J3144j04764
14947a09048L1774R9990m235k4499m9053Q0443M7156l4657J12527M2312n0657
14936A42053j72550K3018k0051j10990q3728j14376J2212J13288J99142L5135
14926B3153n9559m5685M3706Q57j61112j88195J12J28399P5546J20242k3966M3688
14914d2814J18343j92189j97881l9071J24637J98087J60343k2395R3132j45988
14904E4204o4304j30477J1011K7419L4496j05537M3363R11n1160J7732J23838
14893c8504R8893q9122j14704j3252l0052r2178j36310O5738J1376J17407K7013
14882a93695N8233N0238P4776J59577m644j84763n0160Q2563K3770M424M681R2597
$$ y = [-88378, -17827, -38042, 33174, -156436, -269107, -320972, -197357, -133473, -17428, -4284, -109048, -77274, 22716, 18481, -6018, -55071, 25372, 72528, 37871, 150398, 192710, 142053, -30497, -7479, -27530, -138520, -222248, -336624, -324412, -211124, -11982, 23153, -36406, -82091, -38385, -37528, -198640, -386835, -386723, -258324, -182778, -62536, -86502, -42814, 75529, -116660, -314541, -353612, -228975, -30888, 129455, 107060, 200192, 54204, -10100, -140577, -129566, -102147, -67651, -173188, -129825, -128914, -180074, -162342, -38504, 60389, -28733, -143437, -156689, -186741, -278919, -415229, -349491, -338115, -220708, -193695, -135462, -85224, -10448, 149129, 144485, -40278, -90438, -7875, 15895, 20319, 25000, 117597]
14870A17597M0929j55038j67630P2301Q2448K4826l3276N1831r8833p4834J35036
14859d643r2260K2846N3042o2581P5540N6812Q8947r0293j42171J59981J41048
14848B06268j18235j10310p4175n0224N6431R9685R3846r455m2134j87159j43340
14837b78802J65422q8207j9539Q783j8782j30045J2687O7567n8338R9328M8416
14826a91510M6946o5087q0275J27393J74795K6562n8037m2878K2727j46300o3549
14815b49213J15745R0059M3714N6386J9432J4648k08324j07444Q267j2540J16065
14804a13205l6376j2959J77603J84915j63893j63521J13844R0721j17473j50170
14794a90514j53440J2877M3613L5866L3014q3454j5625L653L0557K39341J05139
$$ y = [117597, 158526, 3488, -164142, -91841, -9393, 15433, -17843, 33988, -64845, -139679, -4643, -96903, -74057, -21015, -83596, -8056, 48756, 137703, 47410, -94761, 65220, 206268, 88033, -22277, -96452, -146676, -90245, 9440, 103286, 93831, 51697, -135462, -278802, -113380, -201587, -221126, -212343, -231125, -361170, -348483, -280916, -339254, -239926, -191510, -144564, -209651, -289926, -162533, 12262, 38824, -19213, -62091, -39364, -185664, -249213, -133468, -43409, 305, 56691, 76123, 90771, -117553, -224997, -216730, -229270, -113205, -149581, -162540, 15063, 199978, 36085, -127436, -13592, 77129, -40344, -190514, -343954, -331077, -287464, -251598, -218584, -302038, -317663, -314010, -283453, -44112, 61027]
14783F1027r4478k5927M6862p5339P1391Q2445o7249L2250l9155j03111m4366
14772a55650j6259M4037J51417j51815K0703J79059o9907o6491o7129J1549l9622
14761a60108P6681K05550K8988m1321j1829j63174k7118k7800l0653L5632M765
14750a10387K5166O3055Q5349K7951n5073L2748j10168r0031Q6602J23766p7812
14739A166K5582O6336m1542k5463q4252j25385M5474P3661j11909r5205l7286
14728c08823L4758p8809N5508M7748Q8151J73377Q6959n7731j36437n0167R8279
$$ y = [61027, -33451, -59378, -12516, -87855, -16464, 65981, -1268, 30982, -8173, -111284, -155650, -171909, -127872, 23545, -128270, -107567, 71492, 1585, -64906, -132035, -120486, -160108, -83427, 122123, 151111, 109790, 97961, -65213, -92331, -120131, -150784, -115152, -110387, -85221, -22166, 63183, 91134, 36061, 68809, -41359, -131390, -44788, 78978, 1166, 26748, 93084, 51542, 26079, -58173, -183558, -138084, -64423, -176332, -271537, -308823, -274065, -352874, -297366, -249618, -161467, 11910, 98869, 41138, -95299, -145466, -47187]
$$ [...]
##END NTUPLES=NMR SPECTRUM
##END=
