##TITLE=Analysis number 313448
Compound Code mo 07419
Book Reference 402/80
Project Code adrs
Chemist Name geraintj
##JCAMPDX= 6.0         $$ Bruker NMR JCAMP-DX V2.0
##DATA TYPE= NMR SPECTRUM
##DATA CLASS= NTUPLES
##ORIGIN= Bruker BioSpin GmbH
##OWNER= NMR
$$ XWIN-NMR		Version 3.5
$$ Wed Jul 12 09:05:26 2006 GMT Daylight Time (UT+1h)  MAYBRIDGE\nmr@NMR_250MHZ
##.OBSERVE FREQUENCY= 250.131544655141
##.OBSERVE NUCLEUS= ^1H
##.ACQUISITION MODE= SIMULTANEOUS (DQD)
##.ACQUISITION SCHEME= undefined
##.AVERAGES= 16
##.DIGITISER RES= 18
##SPECTROMETER/DATA SYSTEM= dpx250
##.PULSE SEQUENCE= zg30
##.SOLVENT NAME= CDCl3
##.SHIFT REFERENCE= (INTERNAL, CDCl3, 0, 16.522)
##AUDIT TRAIL= $$ (NUMBER, WHEN, WHO, WHERE, WHAT)
$$ ##TITLE= Audit trail, XWIN-NMR		Version 3.5
$$ ##JCAMPDX= 5.01
$$ ##ORIGIN= Bruker BioSpin GmbH
$$ ##OWNER= NMR
$$ C:\u/data/dgb/nmr/ADRS/9100/pdata/1/auditp.txt
$$ ##AUDIT TRAIL=  $$ (NUMBER, WHEN, WHO, WHERE, WHAT)
(   1,<2005-09-08 14:29:29.21 +100>,<MAYBRIDGE\NMR>,<NMR_250MHZ>,
      <created by zg, POWCHK disabled, PULCHK disabled
       configuration hash MD5:
       62 19 C7 07 E1 42 D1 B7 37 6C 3D D0 77 39 F9 E6
       data hash MD5: 64K
       F1 8D B7 F4 C0 91 90 4F 0F 5D F6 8A 25 AA 8E CB>)
(   2,<2005-09-08 14:29:40.25 +100>,<MAYBRIDGE\NMR>,<NMR_250MHZ>,
      <Start of raw data processing
       ef LB = 0.3 FT_mod = 6 PKNL = 1 SI = 32K 
       data hash MD5: 32K
       EB A3 65 BA 0E E7 9B AE 7E 66 BF 3F 0E A6 08 0B>)
(   3,<2005-09-08 14:29:41.96 +100>,<MAYBRIDGE\NMR>,<NMR_250MHZ>,
      <apk 
       data hash MD5: 32K
       D1 0B FC 96 57 15 4E EE B7 E9 4F D0 FB DD 0A 61>)
(   4,<2005-09-08 14:29:42.72 +100>,<MAYBRIDGE\NMR>,<NMR_250MHZ>,
      <abs ABSG = 5 
       data hash MD5: 32K
       99 F7 CC C8 88 66 5C FC CF D9 42 11 F2 55 C5 34>)
$$ ##END=
$$ 
$$ hash MD5
$$ BD EF 61 2C 56 A6 D5 64 43 ED 16 44 15 B3 DA 0A
##$RELAX= 
##$RELAX= 
##$RELAX= 
##$RELAX= 
##$RELAX= 
##$RELAX= 
##$RELAX= 
$$ Bruker specific parameters
$$ --------------------------
##$DU= <C:\Restored>
##$EXPNO= 9100
##$NAME= <ADRS>
##$PROCNO= 1
##$TYPE= <nmr>
##$USER= <dgb>
##$AMP= (0..31)
100 100 100 100 100 100 100 100 100 100 100 100 100 100 100 100 100 100 
100 100 100 100 100 100 100 100 100 100 100 100 100 100 
##$AQSEQ= 0
##$AQ_mod= 3
##$AUNM= <au_zg>
##$AUTOPOS= <33 >
##$BF1= 250.13
##$BF2= 250.13
##$BF3= 250.13
##$BF4= 250.13
##$BF5= 500.13
##$BF6= 500.13
##$BF7= 500.13
##$BF8= 500.13
##$BYTORDA= 1
##$CFDGTYP= 0
##$CFRGTYP= 5
##$CHEMSTR= <none>
##$CNST= (0..31)
1 1 145 1 1 1 1 1 1 1 1 1 1 1 1 1 1 1 1 1 1 1 1 1 1 1 1 1 1 1 1 1 
##$CPDPRG= <>
##$CPDPRG1= <>
##$CPDPRG2= <>
##$CPDPRG3= <>
##$CPDPRG4= <mlev>
##$CPDPRG5= <mlev>
##$CPDPRG6= <mlev>
##$CPDPRG7= <mlev>
##$CPDPRG8= <mlev>
##$CPDPRGB= <>
##$CPDPRGT= <>
##$D= (0..31)
0 1 0 0 0 0 0 0 0 0.06 0 0 0 0 0 0 0.0002 0 0 0 0 0 0 0 0 0 0 0 0 0 0 
0 
##$DATE= 1126186168
##$DBL= (0..7)
120 120 120 120 120 120 120 120 
##$DBP= (0..7)
150 150 150 150 150 150 150 150 
##$DBP07= 0
##$DBPNAM0= <>
$$ [...]
##$SUBNAM7= <"">
##$SUBNAM8= <"">
##$SUBNAM9= <"">
##$SW= 20.6930455092707
##$SWIBOX= (0..15)
0 0 3 0 0 0 0 0 0 0 0 0 0 0 0 0 
##$SW_h= 5175.983436853
##$TD= 65536
##$TD0= 1
##$TE= 295.16
##$TE2= 300
##$TE3= 300
##$TEG= 300
##$TL= (0..7)
0 120 120 120 120 120 120 120 
##$TP= (0..7)
150 150 150 150 150 150 150 150 
##$TP07= 0
##$TPNAME0= <>
##$TPNAME1= <>
##$TPNAME2= <>
##$TPNAME3= <>
##$TPNAME4= <>
##$TPNAME5= <>
##$TPNAME6= <>
##$TPNAME7= <>
##$TPOAL= (0..7)
0.5 0.5 0.5 0.5 0.5 0.5 0.5 0.5 
##$TPOFFS= (0..7)
0 0 0 0 0 0 0 0 
##$TUNHIN= 0
##$TUNHOUT= 0
##$TUNXOUT= 0
##$USERA1= <user>
##$USERA2= <user>
##$USERA3= <user>
##$USERA4= <user>
##$USERA5= <user>
##$V9= 5
##$VALIST= <valist>
##$VCLIST= <CCCCCCCCCCCCCCC>
##$VD= 0
##$VDLIST= <DDDDDDDDDDDDDDD>
##$VPLIST= <PPPPPPPPPPPPPPP>
##$VTLIST= <TTTTTTTTTTTTTTT>
##$WBST= 1024
##$WBSW= 4
##$XGAIN= (0..3)
0 0 0 0 
##$XL= 0
##$YL= 0
##$YMAX_a= 228626
##$YMIN_a= -262229
##$ZGOPTNS= <>
##$ZL1= 120
##$ZL2= 120
##$ZL3= 120
##$ZL4= 120
##$ABSF1= 16.522
##$ABSF2= -4.171173
##$ABSG= 5
##$ABSL= 3
##$ALPHA= 0
##$AQORDER= 0
##$ASSFAC= 0
##$ASSFACI= 0
##$ASSFACX= 0
##$ASSWID= 0
##$AUNMP= <proc_1d>
##$AZFE= 0.1
##$AZFW= 0.1
##$BCFW= 0
##$BC_mod= 0
##$BYTORDP= 0
##$COROFFS= 0
##$CY= 12.5
##$DATMOD= 1
##$DC= 0
##$DFILT= <>
##$DTYPP= 0
##$F1P= 14.0000005364418
##$F2P= -0.99999901652339
##$FCOR= 0.5
##$FTSIZE= 32768
##$FT_mod= 6
##$GAMMA= 0
##$GB= 0
##$INTBC= 1
##$INTSCL= 1
##$ISEN= 128
##$LB= 0.3
##$LEV0= 0
##$LPBIN= 0
##$MAXI= 10000
##$MC2= 0
##$MEAN= 0
##$ME_mod= 0
##$MI= 0
##$NCOEF= 0
##$NC_proc= -3
##$NLEV= 6
##$NOISF1= 0
##$NOISF2= 0
##$NSP= 0
##$NTH_PI= 0
##$NZP= 0
##$OFFSET= 16.522
##$PC= 1
##$PHC0= -75.85548
##$PHC1= 7.340988
##$PH_mod= 1
##$PKNL= yes
##$PPARMOD= 0
##$PSCAL= 4
##$PSIGN= 0
##$REVERSE= no
##$SF= 250.13
##$SI= 32768
##$SIGF1= 0
##$SIGF2= 0
##$SINO= 400
##$SIOLD= 32768
##$SREGLST= <1H.CDCl3>
##$SSB= 0
##$STSI= 32768
##$STSR= 0
##$SW_p= 5175.98343685301
##$SYMM= 0
##$S_DEV= 0
##$TDeff= 65536
##$TDoff= 0
##$TI= <Analysis number 999999
Compound Code 99
Book Reference 9
Project Code 9>
##$TILT= no
##$TM1= 0
##$TM2= 0
##$TOPLEV= 0
##$USERP1= <user>
##$USERP2= <user>
##$USERP3= <user>
##$USERP4= <user>
##$USERP5= <user>
##$WDW= 1
##$XDIM= 32768
##$YMAX_p= 418223723
##$YMIN_p= -223752
$$ End of Bruker specific parameters
$$ ---------------------------------
##NTUPLES= NMR SPECTRUM
##VAR_NAME=  FREQUENCY,     SPECTRUM/REAL,   SPECTRUM/IMAG
##SYMBOL=    X,             R,               I
##VAR_TYPE=  INDEPENDENT,   DEPENDENT,       DEPENDENT
##VAR_FORM=  AFFN,          ASDF,            ASDF
##VAR_DIM=   32768,         32768,           32768
##UNITS=     HZ,            ARBITRARY UNITS, ARBITRARY UNITS
##FACTOR=    0.157963299565203, 1,           1
##FIRST=     4132.6476996994, 0,             0
##LAST=      -1043.33573715361, 0,           0
##MIN=       -1043.33573715361, -223752,     0
##MAX=       4132.6476996994, 418223723,     0
$$ Real data points
##PAGE= N=1
##DATA TABLE= (X++(R..R)), XYDATA
$$ [...]
15089F170R726k2903k3324K8838k4551j4986k2810l9315K0113j1667j6768J7263
15077i4214O2433L9572P241L8594k8924l4384m0090r317O4122j3088J2243M5515
15065D9703M932J2929r543n821m3958J1546j867J0056J9757K6620k9324l6125
15053H905k5117l95k8265q2491J0878J08203L7319m2360k1820P047J8754o309
15041a5651J8718j747J691l1061K3429J9222L0790L163J2202J6249q3775m481
15029a1251k2562K8635O8318K9378m2234l8721l8832p277J1706r841l6674k100
15017g1455N526K2541j8188K4618J8610k4711k0285k3447o097J1250n557L3402
15005e3793K764M3162P992m7022m0658K0948M950j6761n110K2470n387R619M481
$$ y = [6170, 15896, -7007, -30331, -1493, -26044, -41030, -63840, -103155, -83042, -94709, -111477, -94214, -31781, 7791, 15032, 53626, 24702, -9682, -49772, -59089, 5033, -8055, 4188, 49703, 54635, 67564, 58021, 52200, 8242, 19788, 17921, 27977, 47734, 74354, 45030, 8905, -16212, -16607, -44872, -127363, -116485, -8282, 29037, -13323, -35143, -28096, -9342, -15651, 3067, 1320, 3011, -28050, -4621, 14601, 45391, 48554, 60756, 77005, -6770, -11251, -33813, -5178, 63140, 92518, 50284, 11563, -27269, -34546, -22840, -32681, -69355, -71455, -65929, -43388, -61576, -36958, -18348, -43059, -63344, -86791, -92888, -81638, -87195, -53793, -51029, -7867, 125, -46897, -87555, -66607, -61657, -78418, -83528, -61058, -66445, -56826, -52345]
14992e2345K3947M6176Q5169N5880n6653p5820l5359K7903K5439k935M2715n1382
14980C2735l8219O5080m8255m8515J2555M0410l0613k2823M5250q237l9681l2592
14968g2905o519k7083J0044L8358O9194L274j5578k7340l6822L99j4304N0854
14956b8428N9095n085r7328k1126o940L5452L7879O5347K242M860K828m1651q4325
14943g7180J3636N153j1876k434J03433J21743j4292j16278m4942k5911l6944
14932h5892K8477O5127M0249M606l2266o7674K1145M5143J7744n3891j5130K5941
14920f421J8111J2768o687K8387m5964K15j1571j7860M7753N814K2648r749l4875
14907B569Q509k8092L6473K9847m0183K0603K0232L0932m815K4515j9182l9058
$$ y = [-52345, -28398, 17778, 102947, 158827, 102174, 26354, -9005, 18898, 44337, 41402, 84117, 32735, -5484, 59596, 11341, -37174, -24619, 15791, -14822, -37645, 7605, -632, -40313, -72905, -79424, -106507, -96463, -58105, 11089, 14363, -1215, -28555, -65377, -64978, -79282, -28428, 30667, 25582, -71746, -92872, -99812, -64360, -26481, 38866, 41108, 45968, 48796, 7145, -77180, -63544, -58391, -70267, -72701, 30732, 152475, 138183, 21905, -23037, -48948, -85892, -57415, 7712, 47961, 52567, 20301, -47373, -26228, 18915, 36659, -17232, -32362, -6421, 11690, 24458, 17771, 46158, 194, 409, -11162, -29022, 18731, 24545, 47193, 37444, 2569, 11078, -17014, 19459, 49306, 9123, 29726, 49958, 80890, 76075, 100590, 81408, 42350]
14895D2350j3782K9304m2464J5639J3310m186n0570K2201m382k5990k0280K5747
14883a3103j1036j1570L4573j2390q764r360M505K6615k4077L3539J3759m2101
14871a9410j6890P544k7975n820L1007L5935L6437R200q2894n6677K4402P573
14859e7568L3894k4216l1077O310M4516M7998k7511o9384L6466L3604K8013J498
14847B2543m6286K1801M6403l5595k6467r620M8438O112R403k1747L681n3931
14835c5265l3580k913N1221L0432O264q544n647N2528J028p1300m9590K0174K6628
14822a8564J6866L7333m288j6100R098j4660P78K8600n9625K885l582k1120K3625
14809a8754m7394o8057M5969N4966l3786l1857J3427p817K0688K2360l5946L1101
$$ y = [42350, 28568, 57872, 15408, 31047, 44357, 40171, -10399, 11802, 7420, -18570, -38850, -13103, -24139, -35709, -1136, -13526, -22290, -31650, -27145, -530, -24607, 8932, 22691, -19410, -36300, -28756, -56731, -62551, -31544, 4391, 40828, 50028, -32866, -89543, -65141, -57568, -23674, -47890, -78967, -72657, -28141, 19857, -7654, -77038, -40572, -6968, 21045, 22543, -23743, -1942, 44461, 8866, -17601, -27221, 21217, 27329, 36732, 14985, 18666, -35265, -68845, -71758, -20537, 9895, 16159, 7615, 1968, 54496, 55524, -15776, -65366, -45192, -18564, -1698, 35635, 31347, 15247, 24345, 9685, 10463, 39063, -20562, -17677, -21259, -42379, -18754, -66148, -134205, -88236, -33270, -67056, -98913, -85486, -93303, -72615, -50255, -86201, -55100]
14797e5100P9199M5110J6588k7423l4496k9464M016M5591P656l530o835L4528
14785G5840N5491K5037J478j00312q2756r066N140O938K4366j2517m1074j9671
14773g1106m4774k28L4239L0890M1624K5739k7383R959K2041m321K3575j4013
14761B6242J2090l4603n401K1744k763L887J234rJ1115K450k2132M079m1864l8573
14747f2504O1109J4224l1148k8776J7748q953k5931l0660J026M1205J7345l622
14735c8937L6813L2410N2538j5738o4203m243l5557l5655L879P4058M8497k5065
14723B8797k4592l3525j0795J1797N1362j559M9126M3746j0079K2818l2686p3574
14711B0836J8020L2159j2856m0158J1737M8503J3667J3519N0075l0086r9335l7224
$$ y = [-55100, 24099, 69209, 85797, 58374, 23878, -5586, -1570, 44021, 51677, 48147, 41312, 75840, 131331, 156368, 157846, 57534, -25222, -34288, -29148, -22210, 2156, -10361, -51435, -71106, -115880, -116108, -81869, -50979, -9355, 16384, -10999, -1040, 21001, 16680, 40255, 26242, 38332, 3729, -1672, 20072, 17309, 21196, 22430, 22421, 33536, 35986, 13854, 17933, -23931, -62504, -1395, 12829, -18319, -47095, -29347, -38300, -64231, -94891, -93865, -52660, -35315, -38937, -2124, 30286, 82824, 67086, 2883, -1360, -36917, -72572, -68693, 5365, 53862, 28797, 4205, -29320, -40115, -28318, 23044, 21485, 70611, 114357, 104278, 127096, 94410, 20836, 38856, 71015, 58159, 18001, 29738, 78241, 91908, 105427, 155502, 125416, 26081, -11143]
14699a1143n0087m3358N3494K9313j996O3764m9114k2420P1778L2648o7720n2155
14687d6996R952M593j2241P614N3515N1471J8221p783n3447J6261N420n979J4446
14674E5047l5863k5184J971n6555J1321O6842O0018K1766k9336l6988j0204J622
14662B4457N464M153k0645L4591L2584o9897m4991L19K5289P278J0050n7445j4872
14649f3665N3970R536L4099m5251p8442l1870q866J727K1593P1816M8975L9759
14637E3381j4557L90J2317l3138l913M7587J5335l9287P498n846k6201p27P312
14624B0151J740k0589J0538J2110J9409j3929m1162m7435l2638l0114N949N9440
14612e6530l3802L9916K6949K079K2623j170j77L3784J6545k2771p5924k963J11826
$$ y = [-11143, -61230, -104588, -51094, -21781, -23777, 39987, -9127, -31547, 40231, 72879, 5159, -46996, -37044, -32451, -44692, -37078, 16437, 67908, 86129, 78346, 24899, 41160, 46580, 40601, 55047, 19184, -6000, -4029, -60584, -49263, 17579, 77597, 99363, 70027, 33039, 22835, 24457, 29921, 34074, 13429, 48020, 80604, 10707, -34284, -33965, -8676, -1398, 8652, -48793, -63665, -9695, -159, 33940, -11311, -89753, -121623, -130489, -128762, -107169, -35353, 13622, 53381, 38824, 39214, 51531, 18393, 14480, 62067, 77402, 38115, 45613, 39767, 13566, 12839, 20151, 21891, 1302, 11840, 23950, 43359, 29430, -11732, -59167, -91805, -121919, -115970, -56530, -90332, -50416, -23467, -21388, 1235, 65, -112, 33672, 50217, 27446, -48478, -51441, 60385]
14599F0385K820n9464o0360m0158k6195R024J0989O4691N7015l7202Q092j5965
14587b6328k1094J6856N4770M2921K974n0814j1466N7171P0064k1899m1224o2286
14575I645j6046L1356n1347K2635J1878J5936N877j7850r589M5962K7425k6805
14563D9077k7977j9667O447j2196p693j5323l2155p610P285K9580j5875m2187
14551h8294j7554N7294P1592L4560J8526j91n0514m2260l0608J9922K1620Q532
14539B625O9109j3510k3294N0186K2620k5392k4788r034J6419m2477o2381r556
14527d9473L4009k5954j322M538L3837J2718j5122k1920l3241J6918k1094J7448
14515d8658j0767P515K7671O1923J00531N0626m7105o1665p584k5237l9930K0555
$$ y = [60385, 63205, 3741, -56619, -96777, -122972, -113948, -102959, -38268, 18747, -18455, -10363, -26328, -47422, -30566, 24204, 67125, 70099, 19285, 7819, 64990, 135054, 113155, 71931, 9645, -6401, 24955, -26392, -3757, 8121, 24057, 29934, 12084, 2495, 48457, 75882, 49077, 21100, 1433, 7880, -4316, -12009, -27332, -59487, -67097, -59812, -30232, -46107, -88294, -105848, -48554, 23038, 57598, 76124, 75933, 25419, -16841, -47449, -27527, -5907, 2625, 71734, 58224, 34930, 85116, 107736, 82344, 57556, 48522, 64941, 22464, -39917, -49473, -15464, -41418, -42740, -38202, -4365, 8353, -6769, -28689, -61930, -45012, -66106, -48658, -59425, -51910, -24239, 37684, 138215, 188841, 141736, 80071, 72487, 47250, 7320, 27875]
14503B7875N1673p39p834J6396k9992O747k5119n960k4186p0878O048R607R252
14490c7110K5822p657J3152l8336O758L7400J7787k5159j3549J1854j1531L1320
14478A0751K1155j6353p114J1789k8621k2848K0046Q144K3963K9031J4222k5017
14466C9148l7550M303J1977R153R549m2661p1278p487J1317J7020N4782K4332
14454B2605n5354l9628L2411M4823N7055o3490p9375L6808O6272m4152k7368k5930
14442g5323j761j817J7700M7832M9356J9204M1430r475p1199n3934r742L2005
14430a5724l472J2597K9697K367k7229k7774R3156L7620K1277M299n4252j5700
14418E6862m6482p1531K8296K7245r661l2715o645n834l3496J7146j0968K5289
$$ y = [27875, 79548, 78809, 70975, 87371, 57379, 64126, 39007, 33047, 8861, -62017, -55969, -46362, -37110, -11288, -18945, -5793, -44129, -37371, 29, 17816, -7343, -20892, -9038, -20569, 10751, 31906, 15553, 8439, 20228, -8393, -31241, -11195, -3051, 20912, 49943, 64165, 39148, 1598, 5901, 17878, 27031, 36580, -6081, -77359, -84846, -73529, -56509, -1727, 22605, -32749, -72377, -39966, 4857, 61912, -1578, -80953, -44145, 22127, -22025, -49393, -75323, -77084, -78901, -61201, -13369, 35987, 55191, 96621, 87146, 15947, -37987, -47729, -15724, -19196, -6599, 23098, 25465, -1764, -29538, 63618, 101238, 122515, 126814, 72562, 56862, 10380, -61151, -32855, -5610, -15271, -47986, -54631, -60465, -93961, -76815, -87783, -62494]
14406f2494K1999J8761O0301l1766l5343L9856j607q009L6545R494k2491r2825
14394f7579m3443N1238K4899Q510N533l2534L338k7098K1936N2365J6060k6282
14382a3057j0754n06j5090M4816L6387O1044n5480p2008J324p3691k4j4957j4113
14369a26109P1608K5408j8688q92J7997p84J9202L5462J7252N010k8567m5666
14357b8767O7501N1084K1643K6791n026m9119q1490l1839m3557n4343K2644N4807
14345d9671l115J0560l4172p944L3495J1414j8787j0755J8018K8378K5457j9996
14333a7118p315m0206M1303o455K1928l0887m365L7276k7698K4209N2396k1867
14321B1201n1005L1696M0369k9422l94j1781K09n3746l3062K6819L9842J1167
$$ y = [-62494, -40495, -21734, 38567, 6801, -28542, 11314, 9707, 1698, 38243, 47737, 25246, -67579, -111022, -59784, -34885, -26375, -20842, -53376, -50038, -77136, -55200, -2835, 13225, -13057, -23811, -24317, -39407, 5409, 41796, 102840, 47360, -24648, -23324, -97015, -97039, -111996, -126109, -54501, -29093, -47781, -48673, -30676, -31460, -12258, 23204, 40456, 45466, 16899, -28767, 38734, 89818, 111461, 138252, 133226, 84107, 2617, -29222, -72779, -127122, -104478, -49671, -52786, -42226, -76398, -84342, -50847, -39433, -58220, -68975, -50957, -22579, 2878, -17118, -24433, -64639, -23336, -29791, -7863, -38750, -43115, -5839, -33537, -9328, 43068, 21201, -29804, 1892, 42261, 12839, 12445, 664, 873, -52873, -85935, -59116, -19274, -8107]
14309h107j6353k6354p0012M7M8499L0963j8269r450N4713o372l597K0951N136
14296A795j492O401j0012K5485K0554K1222K7367l7631j7249P672k7770j219L8596
14283E3719N622j1477L5313M1508m4598l1505p943J2584K9570m1519N93M138j2902
14270C3103O399p997o50l3844Q20M00k613J8247M151m0011l2986o7692O37M6095
14256g5941K6208N7495K3927Q087r654l8854k0568j133K8741N7205J9366m4906
14244B9973n2704k084L85O80J0969M4125m898j729n3762k5943j7212j0406O4015
14231a8591K4234N1587n4680Q562P833o2391j9881M9981J6133l466J433L4649
14219C5403N3063m3229K7010P178n1745l6775P147L7103K3684o7611K0621J1522
$$ y = [-8107, -24460, -50814, -120826, -120779, -72280, -41317, -59586, -69036, -14323, -20695, -24292, -3341, 1795, 303, 6704, -3308, 22177, 42731, 63953, 91320, 53689, 36440, 44112, 16342, 15123, 53719, 59341, 47864, 83177, 124685, 80087, 48582, 40639, 53223, 82793, 41274, 41867, 46005, 33103, 39502, 31505, 30855, -2989, -2169, -1769, -4382, 13865, 18016, -21995, -54981, -122673, -122036, -75941, -49733, 7762, 31689, 39776, 30122, -8732, -29300, -30433, -1692, 55513, 74879, 29973, -22731, -24815, -24430, -23750, -12781, 31344, 26446, 24717, -29045, -54988, -72200, -82606, -18591, 5643, 57230, 2550, 11112, 18945, -43446, -63327, -13346, 2787, -679, 754, 35403, 88466, 45237, 72247, 79425, 27680, -9095, -1948, 35155, 58839, -8772, 11849, 23371]
14207B3371L8269n3k7905R328N065j6008j7942m430K1284K444J2991o6879j180
14194b1645K0395M35l2705l6526L6555L4647L6791K513p3567j0468R0073K2786
14182F9284J3597L9086n2013n5456j7223L448p217J5514J4489M3722k9567o5890
14170b8226K1036j4547Q649N0397J1126o7469k3647p545q3854N8076J41388Q8243
14158A53627o4791m2712o3853J5490k1787k188k0921R119R2571L4149m2723k9674
14146A6307J8021n563l4442M3593k7782l0747M0076K7683l343o020j3052j552
14134B3179J0654j3081J3326k8729k0104K5991l4524N317K2672q409n0181N4482
14122E93P8041p7157k5205J1105K4501K5910O800K5857r800N427n4866j4850l136
$$ y = [23371, 61640, 61587, 33682, 43010, 48075, 32067, 14125, 9695, 30979, 33423, 46414, -20465, -21645, -1250, -815, -33520, -70046, -33491, 1156, 37947, 40460, -33107, -43575, 46498, 69284, 82881, 121967, 69954, 14498, -2725, 723, -6494, 9020, 23509, 67231, 37664, -28226, -7190, -21737, -13088, 37309, 48435, -19034, -42681, -50226, -134080, -76004, 65384, 153627, 88836, 46124, -17729, -2239, -24026, -26214, -47135, -38016, 54555, 88704, 45981, 16307, 34328, 28765, -5677, 37916, 10134, -20613, 19463, 47146, 43803, 37783, 24731, 23179, 33833, 20752, 34078, 5349, -14755, 11236, -23288, -17971, 4701, -3708, -53889, 593, 78634, 1477, -23728, -12623, 11878, 37788, 44588, 70445, 60645, 66072, 11206, -3644, -6780]
14109f780M1566p060L0611M218l8105j9271l172k9228k4176J5106M8433j329l847
14096F966Q919L371J541L9888k413J3614r900m9097p8645k287L0102M608K3682
14083i651L1765L1163L1455o651m1744J9967k0431r423N261L5127k4817o2808
14071b0787M5642o7928j848N7314K7972m8268o0669N6719J21108k6309l0855k8966
14059B3125o3458n1004K2689K8519J8003O1828K6536o9446r5023K3933P8200M6832
14047E0734J4300k7819O7558J653l9522n7138j5310n6781j8870M0359K8545L1849
14035A9558N8371o201k0545M449O0048p039j3195O526k0768l2451l7769J5218
14023B6202j3969j1266K5087M035n7754J794M9517k6204l9541J7736k2218n5422
$$ y = [-6780, 34786, 27726, 58337, 62555, 24450, 5179, 2007, -27221, -51397, -36291, 12142, 10813, 6966, 15885, 19256, 20797, 60685, 58272, 71886, 61986, 12889, -65756, -68043, -37941, -33333, -9651, 22114, 53277, 84732, 78081, 36337, 56304, 35873, 26450, 31711, 66838, 42021, -20787, 24855, -43073, -44921, 12393, 40365, -7903, -68572, -11853, 109255, 82946, 52091, 23125, -40333, -91337, -68648, -40129, -22126, 39702, 66238, -3208, -98231, -74298, 3902, 50734, 65034, 37215, 104773, 106426, 66904, 9766, -5544, -62325, -81195, -40836, -12291, 19558, 77929, 71728, 51183, 55632, 115680, 108641, 95446, 101972, 81204, 48753, 10984, 26202, 12233, 967, 26054, 30089, -27665, -25871, 23646, -2558, -42099, -24363, -46581, -102003]
14011a02003Q070K9252j1680J8169m959J4363M4429K9226K2518J8337k3835m8976
13999g089K5603L2223r836K262o7221j3823l7798m1974M2118P0878J1882J3231
13987B0456P061L2572J9238j0520l208J5428k3714k6065P084n4995o94O5254J1448
13974E9345m0827o1735R407M2185Q758J3908N9090l3034o4285k8303p373N1314
13962H450j8222l5127r61K9408J3313N3554L229l9009M722j8275j8006j9140j5193
13949e1257m795P398N0303Q912L2951M331l8292m8216j9381L737o5240l1405L251
13936a47703M9656K0554P819J9484K8599M7804K3508n8211J739J5913K0802R101
13924C9065K246n0355k4043K3792K3383n965J4439M333J7241M1617P693n4651
$$ y = [-102003, -93933, -64681, -76361, -58192, -63151, -48788, -4359, 24867, 47385, 65722, 41887, -7089, 18514, 50737, 40901, 43163, -24058, -37881, -75679, -117653, -75535, -4657, 7225, 20456, 27517, 60089, 79327, 68807, 65599, 81027, 57313, 31248, 38332, -16663, -17357, 47897, 59345, 18518, -43217, -33810, 8375, 17133, 31041, 90131, 57097, -7188, -35491, -42864, 8450, -9772, -44899, -45860, -16452, -3139, 50415, 53644, 14635, 19357, 1082, -16924, -36064, -51257, -56052, -48654, 1649, 10561, 43512, 47843, 9551, -38665, -58046, -54309, -119549, -150954, -147703, -98047, -77493, -69674, -50190, -21591, 26213, 49721, -8490, -6751, 9162, 29964, 39065, 41311, -9044, -33087, -9295, 14088, 8123, 22562, 26895, 44136, 85753, 93446, 38795]
13912C8795r763K8844q048n9658l9089J1990L675l6876m8965R409K7217N9048
13900b3421P9441P745o9313j1975P2673l3999k3123l1229Q990J3821n4405K1869
13888d2926M7295J4472p0215j3626J2885k1871O236J3372J0983L3158k5184k8792
13876f4213K5591j1495J2394J6108k6888K2039J6812k8874K3280o177M8404L7904
13864F4885j5809l6248j6567J4873l5347k2127k244J5359m479k6401k321M1873
13852b4553m862k0782r154L2972K0365k5972k8280j1478J4314n9682k7530P6410
13840f8232K5734L1374Q2997j670L730K8227k6522l6327J162o3415j6274K2536
13828a6680L198k8227j0523P2871K8883J5k1470k2212k8220k4432K0788P1507
$$ y = [38795, 29032, 57876, 49828, -9830, -48919, -36929, -33254, -70130, -119095, -109686, -82469, -23421, 56020, 63765, -5548, -17523, 55150, 21151, -1972, -33201, -24211, -10390, -64795, -42926, 4369, 18841, -51374, -65000, -52115, -73986, -67750, -54378, -43395, -10237, -35421, -64213, -38622, -50117, -37723, -21615, -48503, -26464, -9652, -38526, -15246, -21423, 26981, 64885, 49076, 12828, -3739, 11134, -24213, -46340, -48584, -33225, -37704, -64105, -66426, -24553, -29415, -50197, -59351, -26379, -6014, -31986, -60266, -71744, -57430, -117112, -144642, -68232, -42498, -11124, 71873, 70203, 73933, 102160, 75638, 39311, 40473, -22942, -39216, -16680, -13482, -41709, -52232, 20639, 49522, 49537, 28067, 5855, -22365, -46797, -26009, 45498]
13816D5498l308k5552m118K8436m6956m6143K3238N2758K3840n5603l1976k9097
13804f8983J0364L2101j4235M3888M7476k089R076J3064J7357k7703p3126K8409
13792A5599j4749n5346j2531K9261K1088J821L2446k7318k7668j9212k9943L444
13780h3108M6756Q1499k6721n0324l9054L8774K4176q629L5390l8253j3276P8035
13768D5265N7780j8348l8758J3893M3149J1115m5771m8694L3029k2481l4585N9001
13756E4595n244p4584j345L6091L0542L2716J7266J0347J1858l5989l5544n378
13744C5331L4478L99k6610m0453J0350J3842k8297J1619r111k2382M518j321L6025
13731A8388l690m0376m5151J752K5903L7795M6589m6620l442L3277l117K7275
$$ y = [45498, 42190, 16638, 12520, 40956, -6000, -52143, -28905, 23853, 47693, -7910, -39886, -68983, -58619, -26518, -40753, 3135, 50611, 48522, 57598, 70662, 88019, 60316, -12810, 15599, 850, -54496, -67027, -37766, -16678, -14857, 17589, -9729, -37397, -56609, -86552, -83108, -36352, 45147, 18426, -31898, -70952, -32178, -8002, -16631, 18759, -19494, -32770, 45265, 103045, 84697, 45939, 59832, 102981, 114096, 68325, 19631, 52660, 30179, -4406, 54595, 49351, -25233, -26578, 9513, 40055, 72771, 90037, 100384, 112242, 76253, 40709, 35331, 69809, 70208, 43598, 3145, 13495, 27337, -960, 10659, 1548, -20834, -16316, -17637, 18388, 14698, -25678, -70829, -69077, -43174, -5379, 41210, -5410, -8852, 24425, 21308, 48583]
13719D8583L9046j6478n6311l279L4149K5452o164k6599N108J3746J4305m5609
13707B5949r424l5402j2334L0013k5843p7508J897L5908l278N3992K1793L4789
13695D0552l1482q824K532m290L5850L7624j6365j7860J0204O869Q172j3889m5533
13682C560k4228K7223M7729L5531n7290q965M757o1413Q00L956O5794N754j5960
13669B7248J4480J8026l8879m2167q670r034P5054j9636J6852p3396j6392M2723
13657a3791k2291k3913J574K4581M0155k5445j2165k1333J9983j6154m983L1050
13645b2732J5115M344j297l0378l4244J1097K788N3258j080n848K1151q426j6767
13632a3019K6573N8387O667m1491m8889k7844k9483J8268L4812M6517R894M3583
$$ y = [48583, 87629, 71151, 14840, 11561, 45710, 71162, 64998, 38399, 43507, 57253, 71558, 25949, 16525, -18877, -31211, -1198, -27041, -104549, -102652, -66744, -70022, -16030, 5763, 40552, 9070, 246, 2778, -1512, 34338, 71962, 55597, 37737, 47941, 54810, 62982, 49093, 3560, -20668, 6555, 54284, 89815, 32525, 23560, 28317, -33096, -32296, -28340, 37454, 43208, 27248, 41728, 59754, 20875, -21292, -29962, -38996, 36058, 16422, 33274, -40122, -56514, -13791, -36082, -59995, -58421, -33840, 6315, -19130, -31295, -52628, -32645, -48799, -53782, -22732, -7617, -3273, -4570, -34948, -69192, -58095, -55307, -2049, -3129, -8977, 12174, 3748, -13019, 13554, 71941, 78608, 37117, -11772, -39616, -69099, -50831, -16019, 30498, 40392, 83975]
13620H3975O069L4263k8350n1011l4449J7350m8318J1777R719O3245J1190r956
13608F5504n287M422j3835k5429K9147k9657m0388M2794K2767l3697o347J6506
13596B6500r660R194o358n66K491m7449N0383r246J1729l207k2258l9738L0138
13583h047O620L8127k006N288J560m7432K0571O7537Q201l4075k0198j5313J4594
13570C5427J2008p731L4754N7007l7398n4714K661k6640N479k9674L5436L1530
13558E8145l2542l7065M613M886K9454J47271q468P746k0049r3467k8195J1783
13546D4112k7391k4618M7270M4256n8095p264j6102J0807k3282o9675k5676J5284
13534i0374L7416M0481J9484J3867J3594K5442J7700m3920k5811k779l0548j2021
$$ y = [83975, 90044, 124307, 95957, 44946, 10497, 27847, -20471, -8694, 1025, 64270, 75460, 65504, 60217, 64639, 50804, 25375, 54522, 24865, -15523, 27271, 50038, 16341, 9994, 26500, 16840, 26034, 19676, 19110, 21601, -25848, 24535, 15289, 27018, 23811, 1553, -38185, -8047, -1427, 36700, 34694, 39982, 41542, -5890, 14681, 82218, 90419, 56344, 36146, 20833, 35427, 47435, 39704, 74458, 131465, 94067, 39353, 42014, 15374, 20853, -8821, 26615, 58145, 25603, -11462, -6849, -1963, 27491, 174762, 166294, 174040, 153991, 60524, 32329, 44112, 16721, -7897, 39373, 83629, 25534, 18270, 2168, 12975, -10307, -79982, -105658, -90374, -52958, -12477, 7007, 20874, 34468, 59910, 77610, 33690, 7879, 5100, -25448, -37469]
13522c7469k311K4335R925M4918L5810k4155j6325m0448k9033K8291J2663j4888
13510h687j3655K5585Q5704K5617n9635p0072k4227J2510L459L2737K9143n001
13498C3478M808j1897K7759N892l1503j5008m6891m6354m8817K3765M9260N76
13486e4932R1k6093M4246P6819L5535l3058P787o1013p2026k8336J1322n5799
13474a55457j957r136K2788j6j2969J6838J8573N8047K7041N3693L9652n0327
13462F770l291J8998L055k3031m3256n1685j9148Q7027O1379k3486L4898N399
13450E3629j4000j877n8218m175N5597J1302L1445j6727J7592o353n7987p2402
13438f2174n4552o2355J637M5267N5791r977M340k688J1321j9807M1240k932n3081
$$ y = [-37469, -39780, -15445, -5520, 39398, 75208, 51053, 34728, -5720, -34753, -6462, 6201, -8687, -22342, 3243, 88947, 114564, 54929, -15143, -39370, -26860, -23401, 9336, 38479, 33478, 38286, 26389, 54148, 60040, 28537, 13529, -33362, -79716, -128533, -104768, -55508, -54932, -54841, -80934, -36688, 40131, 75666, 42608, 50395, -10618, -82644, -110980, -99658, -155457, -157414, -166550, -143762, -143778, -156747, -139909, -121336, -63289, -36248, 17445, 57097, 6770, 3479, 22477, 25532, 2501, -40755, -92440, -111588, -24561, 36818, 13332, 48230, 53629, 39629, 37752, -20466, -24641, 30956, 42258, 73703, 56976, 74568, 68215, 10228, -62174, -116726, -179081, -177444, -132177, -76386, -86363, -82023, -84711, -73390, -93197, -51957, -54889, -107970]
13425a07970J046O8194M2581L8223L2698M5499k7734q813l3155o2036l0398l4504
13413g6369n7639M3330K4190N5296M5335k2832m770p458L9528N6746n4136j5876
13401B5345k7615j3520N630L6600J3445k537N090j2275o0836n8710p970j6660
13389a14013N6822j8488m9416P2647J09424L4081n3133k4412m7137J0177J5146
13378h302M4570k1912r751n77l4517j793j2176K4162L5738k4307k1263j1247K8356
13365a3019k0571n8449k167N2515O8212O907P3263J5516N598Q785k57n8514p3792
13352D027j3342L003P656L9351L551n3914R797L4594q71j8448k840L6313K9596
13339G8473J9059N508j3833J4911M297J33418J63597J72640J80095J73229Q415
$$ y = [-107970, -106924, -38730, 3851, 42074, 74772, 120271, 92537, 83724, 50569, -11467, -41865, -76369, -134008, -90678, -66488, -11192, 34143, 11311, 6541, -917, 38611, 95357, 41221, 25345, -2270, -15790, -10160, 26440, 39885, 37348, 42438, 30163, -30673, -89383, -97353, -114013, -57191, -75679, -125095, -52448, 56976, 91057, 37924, 13512, -33625, -23448, -8302, 36268, 14356, 4605, 4028, -30489, -32282, -44458, -20296, 15442, -8865, -30128, -41375, -13019, -33590, -92039, -94206, -41691, 26521, 33428, 106691, 122207, 127805, 136590, 136333, 77819, 4027, -9315, -6312, 1344, 40695, 44246, -9668, 129, 34723, 33852, 15404, 12564, 48877, 78473, 97532, 103040, 89207, 104118, 108415, 241833, 405430, 578070, 758165, 931394, 939809]
13328I39809j26982k62845k35831j62650n0064J5073p5264n4197l2417q965K0561
13317c3772j9563o0140K7226j3350L9885O470m1778J433K2290M577N8508j9970
13305b8184N6420K7585l3054k3164L0220P6100o717o751O3888N7531o8018q7661
13293E8195P176r146j3224m417L8616l0902r981n4636k2542N116j8001r617K4863
13280c8500J6293j8930o6311r281Q2334j589q064Q6596N5335O920n45m8807k8477
13267B6974M7180K1883k4753r231n0797K7491J9260k6674k9483J4150M7772L5426
13255I9198j4591l7673o609l0754K4459J7325m6584n3692j2749N8592J0489o5732
13243e8321n2086l8739K2971O4914m5865q30k5056M1147Q2611J6882M598j3221
$$ y = [939809, 812827, 549982, 314151, 151501, 101437, 116510, 41246, -12951, -45368, -54333, -33772, -53335, -113475, -86249, -99599, -59714, -53244, -95022, -93589, -71299, -66722, -8214, -28184, 28236, 55821, 22767, -397, 29823, 105923, 99206, 92455, 156343, 213874, 145856, 58195, 65371, 56225, 43001, 38584, 77200, 46298, 36317, -18319, -40861, -35745, -53746, -63363, -38500, -22207, -41137, -107448, -116729, -34395, -35984, -44048, 42548, 97883, 104803, 104258, 55451, 26974, 74154, 96037, 71284, 62053, 11256, 38747, 58007, 31333, 1850, 16000, 63772, 99198, 84607, 46934, 40325, 9571, 34030, 51355, 4771, -48921, -61670, -3078, 7411, -58321, -110407, -149146, -126175, -61261, -107126, -107956, -133012, -91865, -9254, 7628, 12226, -995]
13231i95l4824K7867O5193L6677j8968l3332k4394l3331K5009J9965J4953j3537
13219C0283l5405r3858j5298J4766M2459L8913K6497M3469J8932k1473l5402j9852
13207e969K4481l3425j7797L3204j0210J487L7385J2923j0225k7974O688J0387
13195B0955j5330k0011k3054J4685K5660j3693N1443K511L062N8700O633M66o1389
13182E0638j02J0015p020j2174j7752k3431k7554l7641R272J06056M4810j0095
13170H5022m6155l5173K9886j3626l9315n649J4115N3067N828l909J3195O6821
13158A24107J2724Q418q2307l4153M014K4911K4718k2273L5438L8507J701J6006
13146A51811l4424j7896l9017k3942K1735P913o935q644n1313m1775O683n768
$$ y = [-995, -35819, -7952, 57241, 93918, 74950, 41618, 17224, -16107, 8902, 28867, 43820, 30283, -5122, -98980, -114278, -99512, -57053, -18140, 8357, 51826, 70758, 49285, 13883, -5969, 18512, -14913, -32710, 494, -9716, -8229, 29156, 42079, 31854, 3880, 10568, 20955, 5625, -14386, -37440, -22755, 2905, -10788, 40655, 43166, 46228, 104928, 111561, 112027, 50638, 50536, 60551, 53531, 41357, 23605, 174, -27380, -65021, -55749, 50307, 95117, 85022, 38867, 3694, 33580, 19954, -19361, -25010, -10895, 42172, 48000, 44091, 57286, 124107, 136831, 145249, 62942, 28789, 32803, 57714, 82432, 60159, 95597, 134104, 135805, 151811, 117387, 99491, 60474, 36532, 58267, 66180, 59245, 50601, -712, -42487, -35804, -41572]
13134d1572l60M4066K2765m9965J9113k1197K147L6836L5996N0343P3905L869
13122A75946n2656o9934j177K5549N924K7730l9940l120J6161J9603k3525k795
13110G7766M2812q843p4630q342J469m4751O053N4594K0566o0919N122K4455L9097
13097G4449p158q831J0141L8552K049l4257J8840o7248K2886Q264k9770n0280
13085b2363k9648N5020O7878J3134m0289k1347m6788j5157N5795N4103k0764J4347
13073F3921N5380k0292j1042L8020n574l5334R483k1803m4243k5566l0044L4426
13061G332P4334K5923o5518n8946K049m2381K303K8100J0336r342M973M0343l5210
13048a5704l9770j8242L1586K484K3370M6148N7497p257j4056m9649l7903k2473
$$ y = [-41572, -41932, 2134, 24899, -25066, -5953, -27150, -25003, 11833, 47829, 98172, 172077, 175946, 123290, 53356, 52179, 77728, 83652, 111382, 71442, 68322, 84483, 104086, 80561, 77766, 120578, 111735, 37105, 28763, 30232, -14519, -8466, 46128, 66694, 5775, 10897, 35352, 74449, 67291, 58460, 68601, 107153, 109202, 74945, 93785, 26537, 49423, 57687, 27917, -22363, -52011, 3009, 70887, 84021, 43732, 22385, -24403, -39560, 16235, 70338, 49574, 63921, 119301, 99009, 87967, 125987, 120413, 85079, 94562, 72759, 28516, 2950, -27094, 7332, 81666, 107589, 42071, -16875, -14826, -57207, -54904, -26804, -16468, -25810, -20837, 19506, -15704, -55474, -73716, -42130, -39646, -16276, 29872, 87369, 80112, 66056, 16407, -21496, -43969]
13036d3969K6815K5779j0566R252p925n502J3038L5418M9922K3832k2274l8976
13024E4844O594O2127j827p212m5753n0242P426O692l3618L3808k335m734q463
13011A7307K5964k7498n8646k61P8306L3151L4610l410Q092j1384O895j0444l0335
12998F2347N800k4590m11m5256n0958N9353L9868J6371j0695L967j819J1506O9928
12985A35411M8293J7990l0731J0260k193Q839j3898m9586n6797m5179r018O6402
12973G9793M7191m6891l4529O3017m172l6209N0319O1965m0530k021j1491m1620
12961H4822L0217L3413j0973l3077K4769O827l5256M3900N4430l1101o1478l2770
12949G3723K0847K6701J8115M5567K0655K034l0259j4126J0398K3955m267L7676
$$ y = [-43969, -17154, 8625, -1941, 7311, -614, -6116, 6922, 42340, 92262, 116094, 93820, 54844, 61438, 123565, 121738, 114526, 68773, 18531, 25957, 32649, -969, 32839, 30504, 25770, 17307, 43271, 15773, -42873, -43134, 35172, 68323, 102933, 99523, 107615, 96231, 103126, 92682, 62347, 68147, 43557, 43146, -2110, -53068, 6285, 46153, 62524, 51829, 55796, 53977, 65483, 135411, 183704, 201694, 170963, 181223, 179030, 187869, 173971, 124385, 67588, 22409, 13391, 79793, 126984, 80093, 45564, 108581, 104409, 68200, 118519, 180484, 139954, 137933, 126442, 84822, 115039, 148452, 137479, 104402, 129171, 135998, 100742, 144642, 199072, 167971, 106493, 73723, 94570, 121271, 139386, 184953, 205608, 207642, 177383, 163257, 173655, 197610, 193343, 231019]
12937B31019l8028L40M7851K9703k6542p4483j2226K7444K2638K3840J9743O0961
12925C12260L9227K6277J9103j5789O4291P0956o278j9571m0236n0171J3340N6544
12913D69953R429J5771q26m202K7651O0876O1572L6631L2980P3430P0437J7865
12901H71567P4129O0331L9924O8235J18632J81630P4473J45057J25257J65255
12891A924490J68719K50001K40531K25978L44707M77615N88788O09340O80513
12882E510682R58385J271089J437659J528667J525592J771040K395363L622704
12874B0021181N485835Q560827J4074142K4039790L9514717M9481218K7254521
12867A88432231j8150854m2518987l7692027k6609657j7958959j2120212q098035
$$ y = [231019, 192991, 193331, 241182, 270885, 244343, 169860, 157634, 185078, 207716, 231556, 251299, 312260, 351487, 377764, 396867, 381078, 445369, 516325, 510047, 490476, 450240, 400069, 413409, 469953, 479382, 495153, 494327, 490125, 517776, 578652, 640224, 676855, 709835, 783265, 853702, 871567, 945696, 1006027, 1045951, 1114186, 1232818, 1414448, 1488921, 1633978, 1759235, 1924490, 2093209, 2343210, 2583741, 2809719, 3154426, 3632041, 4220829, 4830169, 5510682, 6469067, 7740156, 9177815, 10706482, 12232074, 14003114, 16398477, 20021181, 25507016, 34067843, 48141985, 72181775, 111696492, 161177710, 188432231, 170281377, 127762390, 90070363, 63460706, 45501747, 33381535, 25283500]
12860B5283500n630857m009929k792609j870049j433916j317589j256258j066770
12852E905523q65377o83304n46882m07182m05838l39432k40566k04743j92257
12843B019942j39525j29672j37614j36443n4486q0604o0318m5869r6908q2710
12833A055793m5154m6779J844j1782n3317j04179o4012m8848j2601k0840k8202
12822F21923m5269o6417n3303j4479k5768J9296o3845j6975L5495L2791j1768
12811D11681l7626p4438K0187j0781J5124J6712k2296m3165k2040l6738L487j8687
12799B01420k7021R6187N4380l6956J4427q4895j7024K4914K4712j11k4956%n269
12786B19808N688m5582j1267k1360j4190L7471l4344k7178M2106Q271m3732l8156
$$ y = [25283500, 19652643, 15642714, 12850105, 10980056, 9546140, 8228551, 6972293, 5905523, 5040146, 4356842, 3809960, 3402778, 2996940, 2657508, 2416942, 2212199, 2019942, 1880417, 1750745, 1613131, 1476688, 1422202, 1341598, 1281280, 1235411, 1138503, 1055793, 1010639, 963860, 965704, 953922, 900605, 796426, 732414, 683566, 670965, 650125, 621923, 576654, 510237, 456934, 442455, 416687, 435983, 372138, 355163, 390658, 423449, 411681, 374055, 299617, 319804, 309023, 324147, 340859, 318563, 275398, 253358, 216620, 220107, 201420, 174399, 270586, 324966, 288010, 302437, 217542, 200518, 225432, 250144, 250033, 225077, 225077, 219808, 225496, 179914, 168647, 147287, 133097, 170568, 136224, 109046, 151152, 159423, 115691, 77535]
12774G7535n8975j1864J664L0656N618M5092J8975j505L2975O0591J7039n9789
12762A58012m6097m1365L8353L0620n0388k0711K5768K9623K45N5411M7387k3306
12750B03552n0571j3718J4091K9878L6828Q977m3811j4559K7087O2758L3937k255
12738B92194m5914o9537m5334L5147K611k944q670l9900m4283k247l3322O0207
12726I8008M0419l6436k3422k750k7759l1553K1410J6939l3656m7663K1479P0623
12714F5639J8962q5975O674J4254K0911P1867O6020n7787l5202K6495o097q890
12702I6871k2370J9772M0888R435j1177M781P01j9397j1780M773Q980l8952j3245
12689F9280M3407P2703r707m2828j8990L030M86l0346J0979m1579k8516N8905
$$ y = [77535, 18560, 6696, 8360, 39016, 44634, 89726, 108701, 107196, 140171, 200762, 217801, 158012, 111915, 70550, 108903, 139523, 89135, 68424, 94192, 123815, 124060, 179471, 226858, 203552, 152981, 139263, 153354, 183232, 220060, 229037, 185226, 170667, 197754, 260512, 294449, 292194, 246280, 176743, 131409, 166556, 169167, 166223, 157553, 117653, 73370, 71123, 37801, 98008, 138427, 101991, 78569, 75819, 48060, 16507, 37917, 54856, 21200, -26463, -4984, 65639, 84601, -1374, 5300, 19554, 40465, 112332, 178352, 120565, 85363, 111858, 105761, 96871, 74501, 94273, 135161, 144596, 133419, 138200, 138901, 119504, 107724, 112497, 121477, 82525, 69280, 112687, 185390, 175683, 132855, 113865, 116895, 117381, 87035, 98014, 56435, 27919, 86824]
12677H6824L784O902N233n1203l1851l4272j5183j9829j6858J1639M9151p998
12665a3661j2759o728n9178J5141P0096N6607J2737k882j2016J4054m797l4150
12653B2464q767l5608q688L0697j1350j571L869J2790j8824P250j1266J2252K3555
12640A6803J2229J5035n5868m1156K4137j3694N6566M0412P525n872k4560k1025
12628A0532N1792l5987l5989j5988N1988n139l7484K4254k3068k7817L6597L6837
12616C0528M8397J8484p533n1517k4739l8247l4547J5545j9901q073M6434M6336
12604B1167L4676n9003L9801R493N048j4024k2703J5434l6328k6662J4262J1154
12592g685j1445r143L2699n5253N5428N0471M1791O2341j6232o1546q8393K590
$$ y = [86824, 90608, 97510, 102743, 51540, 19689, -14583, -29766, -49595, -66453, -54814, -5663, -13661, -26420, -33148, -92326, -77185, -7089, 49518, 62255, 59373, 47357, 61411, 56614, 22464, 13697, -21911, -30599, 98, -11252, -12823, -8954, 3836, -14988, -7738, -19004, -6752, 16803, 29032, 44067, -11801, -52957, -28820, -42514, 14052, 54464, 61989, 56117, 31557, 10532, 62324, 26337, -9652, -25640, 26348, 21209, -16275, 7979, -15089, -42906, -6309, 30528, 78925, 97409, 89876, 38359, 13620, -24627, -59174, -43629, -63530, -71603, -25169, 21167, 55843, -3160, 36641, 46134, 51182, 37158, 14455, 29889, -6439, -33101, -18839, -7685, -19130, -28273, 4426, -50827, 4601, 55072, 96863, 159204, 142972, 81426, -6967, -4377]
12580d377L1049L1624q120j9239n8498m963O1692L2573j9245p8698K7377O4768
12568E5943K5434k2056r921J1701J5869J5264m0360n079k2808K262J2010K4479
12556F2738j4299m499N2846J5517l326m239m0907j9812m5854k0708N3207L4451
12544F5115P987m8224m407p014n3372k133j7537o877o427K1939O3489J4182n3648
12531b6927R904K8738K4525m2791k6279Q2116L7383o0629o8027K355M613O3414
12519B8395M5180l8356o2337J2697M2332K7865l4745l5349N4326o994k9127J4921
12507A8808N8675J4132l3824k2916j2148J881K2151j0455K3411k1493n1787O2721
12495D9156L4746m5789J2720J8892J8385j9200o4579p3127k2481J4029J9532P5072
$$ y = [-4377, 26672, 58296, 50176, 30937, -27561, -32524, 29168, 61741, 42496, -36202, -8825, 55943, 81377, 59321, 49400, 61101, 76970, 92234, 51874, 46795, 23987, 26249, 38259, 62738, 48439, 43940, 96786, 112303, 108977, 104738, 63831, 44019, -1835, -22543, 30664, 65115, 73102, 24878, 20471, 13457, -39915, -42048, -59585, -66462, -72889, -50950, 12539, 26721, -26927, -17023, 11715, 36240, -6551, -32830, 49286, 86669, 26040, -41987, -39632, -35019, 28395, 73575, 35219, -27118, -14421, 27911, 55776, 21031, -14318, 40008, 33014, 3887, 18808, 77483, 91615, 57791, 34875, 22727, 24608, 46759, 36304, 59715, 38222, -13565, 49156, 83902, 38113, 50833, 69725, 88110, 68910, 4331, -68796, -91277, -77248, -57716, 17356]
12483A7356J05492K8562m0481j08155m3850J1212j0673J9598N4044K1344k680
12472E1769j4465p646m0687r150l0795J550M0037J1547n8640l3470K8089P0626
12460H765K2961K6325l5823m4956p4207m4706J8750M1363M8964N9577m3894k3731
12448d0612M0065K7606r704o3129o3677K1421R6982R905j6915n919L0312L7596
12436F3931k1965M14l7890j0338o933j1951r071L1077J7257P14J4221K3896J6870
12423G0232k7270M713K3534j2968m5885l0677L7173O843J6512J0929J9085J0964
12411H3185L5406P276k4057m0481J9644L4811J7058O9734K9957M2716J43811K64089
12399F83149K13612K073j90614k16228j27234n5109r8672o2508R287k3055r8026
$$ y = [17356, 122848, 151410, 110929, 2774, -41076, -29864, -40537, -20939, 33105, 54449, 51769, 37304, 29658, -11029, -20179, -50974, -49424, -9387, 2160, -56480, -89950, -61861, 8765, 31726, 58051, 22228, -22728, -96935, -141641, -122891, -81528, -32564, 27013, -16881, -40612, -547, 27059, 17355, -45774, -109451, -88030, 8952, 18857, 1942, -3977, 26335, 63931, 41966, 42380, 4490, -5848, -12781, -24732, -33803, -2726, 14531, 15245, 29466, 53362, 70232, 42962, 47675, 71209, 58241, 12356, -18321, 18852, 25695, 42207, 53136, 72221, 83185, 118591, 125867, 101810, 61329, 80973, 115784, 132842, 202576, 232533, 275249, 419060, 683149, 896761, 898834, 708220, 491992, 364758, 309649, 210977, 148469, 157756, 134701, 36675]
12388C6675K3053J005l4545N2370J5188k2469m3290j748K9528k1447r477j1731
12376A3112m6200R569K0910J5598L627n7995n5960M4027K7194p452M0800j4590
12364g360r5146j6086Q4885K4984l6627k0894L2034J7093j6404J854k8560j3257
12352g3484N4555L6942o920q561q872M4140K269m0139l7904L912M3955N9961l008
12339F6846k3737l5257J5667O7854J577o4170m8939j2828l8005k8126p827j8405
12327a25350r589P1858J01717O3306n6930O547m1692n0138r831K3217l7834K165
12315f2554M1723p982j187K5122j0941J9237j663r139j8941j4195J0793L6233
12303F506L2263m0904K039o44O5308j3370n6502l5541k1183Q9734K6914l1794
$$ y = [36675, 59728, 60733, 26188, 78558, 93746, 71277, 27987, 26239, 55767, 34320, 24843, 13112, -33088, -23519, -2609, 12989, 16616, -41379, -97339, -53312, -26118, -33570, 7230, -7360, -102506, -118592, -33707, -8723, -45350, -66244, -34210, -17117, -33521, -31667, -60227, -73484, -18929, 18013, 11093, 2532, -6340, 37800, 40069, -70, -37974, -34062, 9893, 69854, 66846, 43109, 7852, 23519, 91373, 92950, 28780, -20159, -32987, -70992, -99118, -106945, -125350, -134939, -63081, 38636, 101942, 45012, 51559, 9867, -40271, -50102, -26885, -64719, -62554, -20831, -28813, -30000, -4878, -15819, 3418, 1755, -7384, -26325, -40520, -29727, 6506, 38769, -2135, -96, -740, 64568, 51198, -5304, -40845, -62028, 27706, 54620, 22826]
12291B2826k40K206q090K43Q466l3114l7475j572N8295K6077J9273m9264K7239
12278C4870R7075k294l4528K8087q728m9644k5969k3451K9723l6378p522M240
12266E481o3028m7639O249O1544J7853l955L4683O6961K4258l5158q4022m4729
12254f1502L5361J7349L2061K6790k4166k9103r022J1276l0957M2635q284J8053
12242B0491L6747l7924Q008o7172k5259n475k4678J1076N6053N6818l131j6765
12230H789l3526J1086L6192l9580l0621Q098L8649M0242L2560l9936p890j2677
12218A1386J941k925L6667M781l5860l293L5015L4637q460k0655n9938l0720q695
12205d6119M203J9012j00m6566J3651k7465J3588K0761K3519J5975l1399l3025
$$ y = [22826, 22586, 24792, 16702, 16945, 25411, -7703, -45178, -46750, 11545, 37622, 56895, 7631, 34870, 131945, 129651, 95123, 123210, 114482, 64838, 38869, 15418, 45141, 8763, 1241, 5481, -57547, -105186, -98937, -37393, -19540, -23495, 11188, 78149, 102407, 67249, -16773, -61502, -26141, -8792, 23269, 50059, 25893, -3210, -12232, -956, -31913, 10722, 2438, 20491, 57238, 19314, 27322, -39850, -65109, -70584, -95262, -84186, -28133, 28685, 25554, 8789, -24737, -13651, 22541, -17039, -47660, -39562, -913, 39329, 71889, 31953, 24063, 11386, 13327, 10402, 47069, 51850, 15990, 12697, 47712, 82349, 73889, 53234, -6704, -37424, -46119, -41916, -22904, -23004, -69570, -55919, -83384, -69796, -49035, -25516, -9541, -40940, -73965]
12193g3965l1524N0195Q2515M2781k10M329l5463l6161J0381L2359K5794n6652
12181A4379l9740M0267O7777l1906l1993L0733M656j8103K5963O5772o7682q9436
12169b9313M2854Q2679m7873l8897l9321k5348k7007M4608L4661j0775l9813K4096
12157b9449j6514l5798L9966O0075J6734K3262L4682m9357l8166n1093m5669N8630
12145c2697J7455L572L9219L4087k9477j1115N5608l0316j4174k1478j5664M0429
12133C5449l631l3574j3684l1377J2726P28j5592j8940L4683L3612j6959J953
12121a4606m805O7102r945p2403n869K0029k6813k3493Q723M1503N65j0182L1921
12108A727k6969l22L3688k571Q473n719l8902q3342M3591l5181k2782L5743L6889
$$ y = [-73965, -105489, -55294, 27221, 70002, 69792, 74121, 38658, 2497, 12878, 45237, 71031, 14379, -25361, 14906, 82683, 50777, 18784, 49517, 54173, 36070, 62033, 127805, 60123, -29313, 13541, 96220, 48347, 9450, -29871, -55219, -82226, -37618, -2957, -13732, -53545, -29449, -45963, -81761, -41795, 18280, 35014, 58276, 92958, 43601, 5435, -45658, -91327, -32697, -15242, -11670, 27549, 61636, 32159, 21044, 76652, 46336, 32162, 10684, -4980, 35449, 31818, -1756, -15440, -46817, -34091, -33363, -48955, -67895, -33212, 400, -16559, -14606, -19411, 47691, 37746, -34657, -40526, -20497, -47310, -70803, -62080, -20577, -20012, -30194, 1727, -25242, -25564, 8124, 5553, 14026, 8307, -30595, -113937, -70346, -105527, -128309, -92566, -55677]
12095e5677Q0962M4910n804n3870p8439p7992L7545N0068j757o20J7087k7356
12083g0943K140Q5563l6959n0757j8840k5920J7500M612M9654L0821M1043J3555
12071D1469K0481j0080k4202m4529k1416P3399Q169m6612L9426K2316j335J9598
12059G6684l6325p3191k7845J5175M5781J6437o814o7279j4367k757M3417N2494
12047B1410R320q334m773K042J5814K4106K2970j9360l8586j7264J1747m1965
12035b2873q668M8997M9779l1199l0103j1334M763J6609J2436L0222k4259O381
12023D0751n2622O702m3822L9522N0550J9726q833L54l6030k1048n7154L0045
12011c1859L7860L9437m4684R493l8046l7232m2271N7453K268O995N2980K1084
$$ y = [-55677, 25285, 70195, 64391, 10521, -67918, -145910, -108365, -58297, -60054, -60674, -43587, -70943, -68803, 16760, -20199, -70956, -89796, -115716, -98216, -93604, -43950, -13129, 27914, 41469, 61950, 51870, 27668, -16861, -38277, 35122, 43291, -3321, 36105, 58421, 57086, 76684, 40359, -32832, -60677, -45502, 279, 16716, 9902, -57377, -71744, -74501, -31084, 21410, 30730, 22396, 17623, 19665, 35479, 59585, 82555, 63195, 24609, 7345, 19092, -22873, -31541, 17456, 67235, 36036, 5933, -5401, -638, 15971, 28407, 58629, 34370, 40751, -11871, -5169, -48991, -9469, 41081, 60807, 51974, 52328, 16298, -4750, -61904, -31859, 6001, 45438, 754, 10247, -27799, -65031, -107302, -49849, -47581, -40586, 12394, 33478]
11999C3478j8551o6282k4158K4915K0887J8372J6110j6998n47J8655o1085n6158
11987a11362M3166L6972J8508j0549K8096L0769j6379j735j7920j6175j125j6546
11975c4280l1457R983m5312K4831N7812k6656K7741l8365j6941N81p889L5713
11963d4239O734M7389l9061m0405j5760J4296j2169l128k1835m8871K7558R6566
11951c2925P7403O1209p8522o2252M1226k3299j9875K8426Q8664J1077l6973n2633
11939A526l1466K7735L9430L4701l1654J5395j9791m1162N2293K0986n2842m762
11927A0389O364Q787k0903L025q889l9909K1488P1483M1690j6560m7521q1787
11915e2343M5430L1521l4802L9787m1283l6555L8069M384j7348k6205J0387K9208
$$ y = [33478, 14927, -51355, -75513, -50598, -29711, -11339, 4771, -12227, -12774, 5881, -55204, -111362, -68196, -31224, -12716, -23265, 4831, 35600, 19221, 17486, -434, -16609, -17734, -34280, -65737, -55754, -101066, -76235, -18423, -45079, -17338, -55703, -72644, -72063, -79952, -44239, -37505, 9884, -29177, -69582, -85342, -71046, -83215, -86343, -108178, -157049, -129491, -32925, 44478, 105687, 27165, -35087, 6139, -17160, -37035, -8609, 80055, 91132, 54159, 1526, -29940, -2205, 37225, 71926, 40272, 55667, 35876, -5286, 47007, 67993, 15151, 10389, 16753, 25540, 4637, 7662, -1227, -41136, -19648, 51835, 93525, 76965, 29444, -52343, -6913, 24608, -10194, 29593, -11690, -48245, -10176, -5792, -23140, -49345, -38958, -9750]
11903i750j256J6030K4982K332o1775J2928O6004M1483n7494j7408k2563n3193
11891e9680L1272J8895k9818M394J9954M578L8910r333n3586j9210N0000j1927
11879a5551j1988J9719K3778n839k8672j8562r701K063j0479P0345K8488j2463
11867C1138l1480L0755K7537K587j6451j0286l5235l3354n1781M5472M130J9372
11855a7596M8244j8727O293k5704m5184n2325O502K6994J1468n41M2729J6170
11843a677P537m7468l9756K7963K1786J1848k614J7144J2287k5950M0100P69j8516
11830C453l9290n2877j9478J4126n0118J1563N9168R192P972M4304M8586j098
11818C5503J0787l3969M9331J2497q6164j6321O6299l9035J8563L4099J2040l1436
$$ y = [-9750, -11006, 5024, 30006, 32338, -29437, -16509, 49495, 90978, 33484, 16076, -6487, -59680, -28408, -9513, -39331, -34937, -14983, -10405, 28505, 19172, -34414, -53624, -3624, -15551, -27539, -7820, 15958, 10119, -18553, -37115, -46816, -44753, -55232, 15113, 43601, 31138, -342, 30413, 57950, 60537, 44086, 33800, -1435, -34789, -86570, -41098, -36968, -17596, 30648, 11921, 18214, -7490, -52674, -104999, -98497, -71503, -60035, -60576, -17847, -1677, 5860, -41608, -81364, -53401, -31615, -19767, -22381, -5237, 7050, -18900, 21200, 21969, 3453, -35837, -88714, -108192, -94066, -144184, -132621, -73453, -64261, -56289, -11985, 36601, 35503, 46290, 12321, 61652, 74149, -12015, -28336, 37963, -1072, 17491, 51590, 63630, 32194]
11806C2194j6220k8187l0297K0575J3859k1096n1803J1804N1732M6194K5668N1637
11794A06060J9963k2682k0301k6716J0007o0758l2324L4205L9680N3454k7261
11783G3327m9222o005j432L4832Q3370J1263j7028P404L5165J22789J10847J65193
11771E70503L26829M19748M90691K76528j45239m29766l90841l04927k45783j47749
11761D19994n4210n4070l2832m0855q2397l9318l8738l2083r7004m7347M9201
11750d9659N7899M9426J8260n318j1395K05m0618K455J8891o1908p1663j757K1624
11737g3558J1071J6163Q4148J5247k8597p771k9987o5740j13K6679L0128m750
11725b7080J5523j981L722r364J4995N3372K2710l4714J4120K4986P759p4033
$$ y = [32194, 15974, -12213, -42510, -21935, -8076, -29172, -80975, -69171, -17439, 28755, 54423, 106060, 126023, 103341, 83040, 56324, 66331, 5573, -26751, 7454, 47134, 100588, 73327, 24105, 18100, 16668, 51500, 134870, 146133, 129105, 136509, 171674, 294463, 405310, 570503, 897332, 1317080, 1807771, 2084299, 1939060, 1509294, 1118453, 813526, 567743, 419994, 365784, 311714, 278882, 238027, 155630, 116312, 77574, 45491, -51513, -98860, -49659, 8240, 57666, 75926, 70608, 59213, 59418, 18800, 21255, 40146, -21762, -93425, -95182, -73558, -62487, -46324, 37824, 53071, 24474, 16703, -13284, -79024, -79137, -52458, -22330, -27080, -11557, -13538, -9816, -19180, -4185, 49187, 71897, 37183, 51303, 76289, 84048, 10015]
11713A0015l9606j2313M6997L2456K8707j1103k3918j6660n518l021l086j9252
11701a6302k8475j1732l1564L4035m639j8333N4261J06654J8639n9624k7454K1138
11689C6604n3380k0307k3696q085J000N1840L3799k6089j7521k5048N6363k6056
11677b0576j4440K3486O228Q917R538L8315N1201j8967P936o1117n9953k9473
11665e8905l2075n415M7940M8060J8399J2316m0529R86J4910m3136q9160j0883
11653a37492K9141O751K2093K3816j875j3010L7402M5761K719L9707l4843m4586
11641b4416m8035j7028Q4835j6513j5569Q972j0766M0372R023j6316l8285J6820
11629b6906M9429K6085m5165k4335L2618K3867l1553L655M1352M8927l7097k9870
$$ y = [10015, -29591, -41904, 5093, 37549, 66256, 55153, 31235, 14575, 9057, 6036, 2950, -16302, -44777, -56509, -88073, -54038, -58677, -77010, -22749, 83905, 102544, 42920, 15466, 36604, -16776, -37083, -60779, -68864, -67864, -16024, 17775, -8314, -25835, -50883, 5480, -20576, -35016, -11530, -5302, 3615, 13153, 51468, 102669, 83702, 91638, 30521, -29432, -58905, -90980, -96395, -48455, -395, 18004, 30320, -10209, -9223, 5687, -37449, -126609, -137492, -108351, -101600, -79507, -55691, -57566, -70576, -33174, 12587, 15306, 55013, 20170, -24416, -72451, -89479, -4644, -21157, -36726, -27754, -38520, 1852, 10875, -5441, -43726, -26906, 22523, 48608, 3443, -20892, 11726, 35593, 4040, 7695, 49047, 97974, 60877, 31007]
11617C1007o2204p8367m1463J6968O2402J7160k1096P6853R7286k9083m8119J497
11605B2841J2639k661k4673L260k2730k713l952O614K9016K1562L8449n020J2010
11592H4642m6325o0607J4063l9862k3141R874r139N4580M5810l6039K1243K4757
11580C9856K7979j20257p8430K109q950n3381P619L3861M2950L3017k0935L7977
11568e6585L9850J7233j61k8569P436L9294M2389n1321k4003J7785o1296p2777
11556a30725j449N0889J9143j3338m0657K296K765K40J0746k5161J7752J9505
11544h7994N2235k2709k6287N0277j1487p2617L1928L6720N8897J3612j07270
11533h4695n0026K5929Q2595K652j2511J4157R524k7287m701j1750r372j9711
$$ y = [31007, -31197, -109564, -151027, -134059, -71657, -54497, -75593, 1260, 98546, 69463, 21344, 22841, 35480, 32819, 8146, 11406, -11324, -14037, -17989, -11375, 17641, 39203, 77652, 72632, 84642, 38317, -22290, -8227, -48089, -71230, -61356, -70495, -15915, 29895, -6144, 15099, 39856, 67835, -52422, -130852, -128743, -137693, -191074, -183455, -149594, -106644, -73627, -94562, -56585, -16735, 498, 337, -28232, -20796, 18498, 60887, 9566, -14437, 3348, -57948, -130725, -132174, -81285, -62142, -75480, -116137, -113841, -111076, -110836, -100090, -125251, -107499, -87994, -35759, -58468, -84755, -34478, -45965, -118582, -86654, -49934, 8963, 22575, -84695, -134721, -108792, -26197, -23545, -36056, -21899, -12375, -39662, -44363, -56113, -65485, -85196]
11521h5196J1625k8783l1290K2633M6644M9682K8427j4499P903K6085l8071k2203
11509b7043J4621M681M4132M2270k7649k1113j9465l1391O42N913Q3855K4440
11497I3893j07917o9158M3902l3637l1819J656R002k000j5347P5458L9356M0642
11485D4031N495M539Q135R370j4551l3819L0554j6562K0058p738n9700o040L5193
11472A8965J5987j2452M0578M4205M0793j1089k1375l3556k1487o1084j5353J7406
11460A538N3773K9242n5913m2527L742m2072l052l1962j8054J2832K9018M3606
11448a9829k986M5016L1656m5767k8134K1792K1318k972l1819J1259J3286M5914
11436E8734R856M3848L4634n9401j01691l8237k4644l0815l604m485N3049N8668
$$ y = [-85196, -73571, -102354, -133644, -111011, -64367, -14685, 13742, -757, 7146, 33231, -4840, -27043, -12422, -7741, 36391, 78661, 51012, 29899, 10434, -20957, -20315, -14402, 69453, 93893, -14024, -83182, -39280, -72917, -104736, -103080, -94078, -96078, -111425, -35967, 3389, 44031, 49526, 54065, 62200, 71570, 57019, 23200, 53754, 37192, 57250, 49512, -10188, -16228, 18965, 34952, 22500, 63078, 107283, 148076, 136987, 115612, 82056, 60569, -515, -15868, 1538, 55311, 84553, 28640, -13887, -10145, -52217, -55269, -87231, -105285, -92453, -63435, -19829, -22815, 22201, 53857, 8090, -20044, 1748, 23066, 20094, -11725, -466, 12820, 58734, 68590, 112438, 147072, 87671, -14020, -52257, -76901, -107716, -111320, -115805, -62756, -4088]
11424d088L0563J6826P934k8736j2426K1676R656j1534p9579k5593k0285Q191
11412h7395M7344Q653j9999l3814J4369N2158K8742o2395r8954k5884O2422O1673
11400e3080J5772J8166N0650L325o348P877K1500N8797L3675n0805n3265m0131
11388F133K725K3652L1442k1086J460n1190n2710m0354K9968N5054J3587J1099
11376I780k5369M679l4242p0022l606j3130M2918P9917N5583K7622l8772p9013
11364d3655p062O135M0335K9397l7964K6321K8414K1419j2119p8862l4430L7797
11352b4274N5841R219l9756j0672m819L2949m1416l6319J3100q221m802j9659
11340g8829j4483O645M7395l2831Q956q853K3356q071m2310j6294K5418K2410
$$ y = [-4088, 26475, 43301, 51235, 22499, 10073, 31749, 41405, 29871, -49708, -75301, -95586, -87395, -40051, -31398, -51397, -85211, -70842, -18684, 10058, -52337, -151291, -177175, -114753, -53080, -37308, -19142, 31508, 34833, 28485, 36362, 57862, 116659, 150334, 99529, 46264, 6133, 8858, 32510, 63952, 42866, 44326, -6864, -59574, -99928, -69960, -14906, -1319, 9780, -15589, -10910, -45152, -115174, -118780, -131910, -88992, -9075, 46508, 74130, 35358, -43655, -50717, -44582, -4247, 25150, -12814, 13507, 41921, 63340, 51221, -27641, -62071, -24274, 31567, 40786, 1030, -9642, -14461, 18488, -22928, -59247, -46147, -54368, -59170, -78829, -93312, -86667, -39272, -72103, -63147, -72000, -48644, -56715, -99025, -115319, -89901, -67491]
11328f7491O1933K8086N07n1856j9946j5726Q353k3254m7359J0109K2959l99J2735
11315h1349M5641M1831q332o9435J2050K5517N65M4592j42j0376J7004j5131j1722
11302i287K902P443Q424K0099L4491M5072L862l5116K1565L3334j7323r200n7418
11289D8848m6781J9671l6185N1636J3638o0506n322k3637k4562j7154L7498J8385
11277b4471L3141j2780o8253L1610N0260O635m0115j1407K3382kL0729k6534j5818
11264b3623O209J2588k517J6644q60K4295J0129l458q701n5075k7613J7986J4529
11251a9467L6404N6808j5730k9796o4651k8008J000m253k7459m5546K6098Q1879
11239c2721M0270K8795K2763j4045r402k1499Q414K9104O745l4166j7810J0790
$$ y = [-67491, -5558, 22528, 23035, -28821, -48767, -64493, -56140, -79394, -126753, -116644, -93685, -94084, -81349, -35708, 6123, -2209, -71644, -59594, -34077, -33512, 11080, 10938, 562, 17566, 2435, -9287, -6385, 1058, 9482, 29581, 64072, 109144, 113006, 77890, 99455, 132789, 115466, 106266, 48848, 2067, 21738, -14447, 37189, 50827, -9679, -15001, -38638, -63200, -80354, -42856, -24471, 8670, -4110, -72363, -40753, 9507, 16142, -23973, -35380, -11998, -12000, 18729, -7805, -23623, -17414, -4826, -7343, 9301, 8441, 32736, 42865, 39407, 30706, -24369, -51982, -33996, -19467, 16937, 73745, 58015, 28219, -36432, -64440, -63440, -67693, -95152, -140698, -114600, -32721, 7549, 36344, 59107, 45062, 35660, 14161, 22575, 51679, 58424, 24258, 6448, 17238]
11227A7238j1373j1658P1382M1808m5170j06418J7131K9037r784k2814j1739N600
11215c6760o055L5719J3226J9052J800l9124m1731K771L8020l644k7844j3333
11203e7903N0654j6822K6654l0986J3179j3450K9775L0766N29k8398j4897N1722
11191D0823N6908k8818l1288l8448K7844M7577m2697j3825M5998L1145J5495P897
11179A18611l0186l4428k0982o0862L4813M932J7622n169l7072r624m1724K253
11167f1816J466j0608N6130K0319q13o2177k0834P321L2074r226J2119J2543k0624
11154d4126p367o645K1890l2947M600J7775j3116k4477J3892J8016l073L2679
11142b2899j2659m234k26P959m3885L6958M1880k905L326L7479l9119q4917l7842
$$ y = [17238, 5865, -5793, 65589, 107397, 62227, -44191, -27060, 1977, -7807, -30621, -42360, -36760, -42815, -7096, 6130, 25182, 26982, -12142, -53873, -51102, -13082, -16726, -44570, -57903, -7249, -24071, 2583, -28403, -15224, -28674, 1101, 31867, 32396, 3998, -10899, 40823, 97731, 68913, 37625, -823, 27021, 74598, 31901, 18076, 64074, 95219, 110714, 118611, 88425, 53997, 33015, -27847, 6966, 11898, 29520, 24351, -12721, -22345, -64069, -61816, -60350, -70958, -14828, 5491, 4678, -57499, -78333, -71012, -38938, -48164, -36045, -23502, -44126, -51493, -58138, -36248, -69195, -64595, -46820, -59936, -84413, -70521, -52505, -55578, -22899, -35558, -39792, -40018, -32059, -75944, -38986, 2894, -11, 3315, 40794, 1675, -83242, -121084]
11129a21084k0041J988J6923M5370L1475k0863m8709M0788n1975j3883K5270M3929
11117g0812N7482n6501P140k7746L2590j0964o4413J0195Q1332M1886K969k3206
11105b0048J7482M5894L6830n89l5208k4609J3443m4435k5532L6247k3318k6688
11093e0531j0048L4043J35604p8435m2361m4941l3169Q1155J3135R315J3334K5222
11081E2323J0350L3552k6603m3492o0913n6070Q405L5712l5316L4725O2923J3334
11069B8930k0252K0033j8624n9924J2985K5872R991r636J6416M257j8593p0192
11057g8737O7790J8332m9943j5135K0347K3346L2563k0336j6729K5172k0617l2163
11045d6110J0240L1069K0000n293J1884l5653m3688L0566q201r768R607o215l0615
$$ y = [-121084, -141125, -139137, -122214, -76844, -45369, -66232, -114941, -74153, -126128, -140011, -114741, -70812, -13330, -69831, -62691, -90437, -57847, -68811, -133224, -123029, -41697, 189, 3158, -20048, -2566, 43328, 80158, 79569, 44361, 19752, 33195, -11240, -36772, -525, -23843, -50531, -60579, -26536, 109068, 30633, -11728, -56669, -89838, -8683, 4452, 13767, 27101, 52323, 62673, 96225, 69622, 26130, -34783, -90853, -82448, -46736, -82052, -47327, 15596, 28930, 8678, 28711, 10087, -49837, -36852, -10980, -989, -10625, 5791, 10048, -8545, -78737, -10947, 7385, -42558, -57693, -37346, -14000, 18563, -1773, -18502, 6670, -13947, -46110, -35870, -4801, 15199, 9906, 21790, -13863, -57551, -26985, -35186, -44954, -35347, -41562, -72177]
11032g2177J1898J8507J0109k5663L0588K1163k5990k3737Q581j4963j0786K2672
11020d9798R567M619p1757m5453M2154J5682N303L4389N4104l0622k6558K9301
11008b9069L7717k5214n1648N032O4470L6234j7714q721k8262m059m1527o3955
10996a26716p290O8579N7944j5213L6363l6904l05l5726q75R2771j0813m2622
10984b0807j7722Q389K0371K9103m621q1361R0448O4007k075q780n0528q7451
10972f1027K1713R5690l987o8282n209N1777J1822k2439K4853L3808j9179q4781
10960b5241j447l087j1366k7541m2820j8257P7380O2213Q2548m6763m1354K8200
10948C2465J4547r282K3522k9735j9894N6796J766k1754j3373k332j0566M003
$$ y = [-72177, -60279, -41772, -31663, -57326, -26738, -5575, -31565, -55302, -46721, -61684, -72470, -49798, -40231, -35612, -107369, -152822, -110668, -94986, -89683, -55294, -1190, -31812, -58370, -29069, 8648, -16566, -68214, -63182, 1288, 37522, 19808, 11087, -17175, -21234, -62761, -126716, -134006, -65427, -7483, -22696, 13667, -23237, -23542, -59268, -60143, 32628, 21815, -20807, -38529, -30140, -9769, 19334, 14713, -66648, 23800, 87807, 85732, 76952, 26424, -61027, -39314, 56376, 52389, -15893, -21102, 30675, 42497, 20058, 44911, 78719, 59540, -25241, -26688, -29775, -41141, -68682, -111502, -129759, -52379, 9834, 92382, 45619, 4265, 32465, 47012, 37730, 61252, 31517, 11623, 68419, 70185, 48431, 35058, 32726, 22160, 26163]
10936B6163k2142l2173k1830M2712N1013k9992m6605j2981Q94J4388j2947l2813
10924g6313l4095K7768O0137O0705N3384n9943l7638l5031l0751m804L5242K338
10912c9001K6035J5868j2740M263l2830j6514O939j5679j3290M7854L7572j9873
10900a1396r602k7251M6218L6967k5281O215M728M0823L060j7866l4887M6671
10888E8399J1080k3417k9232k944l9270l0323k4387j971N0562N83J9913N3792
10876D2785N3822j03475p5223P0835K4570o47K2010N2585l8209j9261L327j948
10864C1171o9171k9896N1957l4179r492L58K8125N2243O2440k8192m9130n2665
10852d6431k5016j7017O4630K4024m6072n3l0480k7742J6930q852L9918K0871
$$ y = [26163, 4021, -28152, -49982, -7270, 43743, 13751, -32854, -45835, -44941, -30553, -43500, -76313, -110408, -82640, -22503, 38202, 91586, 31643, -5995, -41026, -71777, -76581, -41339, -39001, -12966, 2902, -9838, -5575, -38405, -54919, -47980, -63659, -76949, -29095, 8477, -11396, -20998, -48249, -2031, 34936, 9655, 15870, 20598, 61421, 64481, 46615, 11728, 58399, 69479, 46062, 16830, 13886, -25384, -55707, -80094, -82065, -31503, -30920, -11007, 42785, 96607, -6868, -82091, -11256, 13314, 12667, 34677, 87262, 49053, 29792, 33119, 31171, -38000, -67896, -15939, -50118, -59610, -59252, -31127, 21116, 83556, 55364, 6234, -46431, -71447, -88464, -23834, 190, -45882, -45935, -76415, -104157, -87227, -96079, -56161, -35290]
10840c5290l2740N2139J8224j7686R923r287j9r18j2879r485K638j7864J7593
10827c5651P931L5076K0471j8879k1279M804m6244j8045O4918P9105J5255n2666
10815C4796m5946k3728M3354M6025M2998p933n6427o690l7727j3947k6462k1290
10803g2977N4146L3125l7448M4956k0037m4363q130L5488j9880j5451L1934L9955
10791B1318j1625m3739j6337K0230O6079k8474M30N4040j3658p1915l1207r977
10779f4835l3478J2902K5230J0315n095K8518j84K9959O003M108Q1839N8429r1142
10766F2569q7312l5893k6902l805k9882L4455K2467Q7797P4652o3911p1129j7379
10754e4273P710P5640J7623n2802K0673K3644j3965K5679k8549o7814n2856M2941
$$ y = [-35290, -68030, -15891, 2333, -15353, -5430, -14717, -14736, -15654, -28533, -38018, -35380, -53244, -35651, -27720, 7356, 27827, 8948, -12331, -7527, -53771, -71816, -6898, 72207, 87462, 34796, -11150, -34878, 8476, 54501, 97499, 89566, 33139, 26449, -11278, -25225, -51687, -72977, -18831, 14294, -23154, 21802, 1765, -42598, -50728, -15240, -35120, -50571, -18637, 21318, 9693, -34046, -50383, -30153, 35926, 7452, 7882, 61922, 48264, -23651, -54858, -64835, -98313, -85411, -60181, -49866, -54961, -26443, -26627, 3332, 9335, 13443, 95282, 153711, 62569, -24743, -60636, -87538, -91343, -121225, -86770, -64303, 23494, 98146, 34235, -36894, -54273, -46563, 29077, 46700, -6102, 14571, 38215, 24250, 49929, 21380, -46434, -99290, -56349]
10742e6349N1971o723N77p378k688L0961K3660m3866m7286k6116K1969L2724l0778
10729e9322k0037m520n366N5668n7016m9116L958J9883M1023K3229L3324K6666
10717H374l2379o814K6838L1180q097L2905k3733o7909n0149M62O1438O0680m805
10704B7991m1011l557m2214K5031N2853P3669l3375q716j4201k6470m0852k7669
10692e8521M1622L8985J8281O9666j7921n5691K013m0079Q150K8228q359j5368
10680A1006J5388n00N170m1943J098J4055j5568n6017N9743M2938j9079K7096
10668D3387n099k4539p3181n8146M0202k358N9322L4471P090j1603q3363j9457
10656i3274O335L7499Q647j1444M477L8468L0754r270j4317j9790j8661P212N1719
$$ y = [-56349, -4378, -11101, -10524, -17902, -20590, 10371, 34031, -9835, -57121, -83237, -61268, -28544, -59322, -79359, -83879, -89245, -33577, -90593, -139709, -135751, -115868, -74845, -51616, -18292, 8374, -24005, -30819, -3981, 27199, 19102, 52007, 28274, -39635, -89784, -89322, -27884, 32796, 27991, -13020, -16577, -58791, -33760, 19093, 92762, 59387, 50671, 36470, 10000, -30852, -58521, -16899, 22086, 40367, 110033, 92112, 36421, 38434, -1645, 6505, 34733, 26374, 11006, 26394, 25894, 31064, -10879, -9781, 4274, -11294, -67311, -7568, 35370, 16291, 43387, 38288, 13749, -59432, -117578, -77376, -79734, -20412, 14059, 21149, 9546, -73817, -93274, -86939, -49440, -40793, -52237, -47760, -9292, 21462, 12192, -2125, -21915, -40576, -33364, 18355]
10643A8355P1284M637j13135j25311M4229N0811K6327r010J5929K2862j0148q686
10631a1856J7650k3532k0644j9366n091L3472n071J3747J1166k4075L0865J9837
10619A7102m5587o7707l8261Q6654P3885j5006o989M7662M5892J0369j078k585
10607A04351l4358j2097k6798l9100j7346K7443j2487l0917m9456K0455L228m936
10595g2018J9615L5399M3982n712J1970r2462n4575K2843J02557L9276j3856n2566
10583a5547k5051K0793j3174o948K2997L1168k3210r999Q058L4394R965O659k1200
10570A8905o4316k2872L4919J8492n3487L4281m1579o2765R015L0900J232j5824
10558a13099J4219K0981l2760l88J806j6721r38j1619N1045J09991L0819q3705
$$ y = [18355, 89639, 94276, -18859, -144170, -99941, -49130, -22803, -31813, -15884, 6978, -3170, -11856, 5794, -17738, -38382, -57748, -62839, -29367, -34438, -20691, -9525, -33600, -2735, 17102, -28485, -96192, -134453, -47799, 26086, 11080, 4091, 51753, 97645, 108014, 106936, 104351, 69993, 57896, 31098, -8002, -25348, 2095, -10392, -41309, -90765, -70310, -67082, -72018, -52403, -17004, 26978, 21266, 33236, -59226, -113801, -90958, 11599, 50875, 37019, -15547, -40598, -19805, -32979, -39927, -16930, 14238, -8972, -18971, -10913, 23481, 33446, 40105, 18905, -45411, -68283, -33364, -14872, -68359, -34078, -75657, -138422, -129407, -98507, -97275, -113099, -98880, -77899, -110659, -111047, -109241, -125962, -126900, -138519, -87474, 22517, 53336, -30369]
10546c0369O726L173k8584m4343L7129K8565O4157K5576o3137j06220p254L5025
10534g9556R4880L3349k0848r111k8103k5763j810J4151K2599k4051j6464L319
10522c7408K931K9050Q9400n0179J6730m1592p8888n0891K2194Q9897J2088m922
10510a590m8466n282O8532M0378J525p0494l2998Q908O8071L499o5493l5770N300
10497f3880N670P7221k4571j3442J9093K65Q956j0453L3136J3981j2229n6046
10485b2299p1854o4892N1209J9918K078j735L0506P104K9155P701M8264j8310
10473A6845n2043p4357P1646R4810K0382j2838L879l8478j0390J1070K2172l999
10461D8699q3765n9106P2078J9072J5313l1258J7152P598n1939m6603K5446K0399
$$ y = [-30369, -23643, -20470, -49054, -93397, -56268, -27703, 36454, 62030, -1107, -107327, -114581, -79556, 15324, 48673, 27825, 18714, -9389, -35152, -36962, -22811, -212, -24263, -40727, -37408, -34477, -5427, 83973, 33794, 50524, 8932, -69956, -120847, -98653, -8756, 3332, -1590, -50056, -55338, 13194, 53572, 55097, -15397, -48395, -39487, 28584, 32083, -33410, -69180, -63880, -58210, 19011, -5560, -19002, 91, 356, 9312, -1141, 31995, 45976, 33747, -22299, -94153, -159045, -107836, -87918, -85840, -87575, -57069, -49965, -20810, -13109, 35155, 16845, -35198, -109555, -37909, 56901, 77283, 64445, 68324, 29846, 19456, 30526, 52698, 48699, -35066, -94172, -22094, -3022, 12291, -18967, -1815, 5783, -46156, -92759, -67313, -46914]
10449d6914L9581K1234L273l4018p599L656k1019j4234N8810J7202k4023l7384
10437d1435K80J1668P209l8511L9187M46r804J6107J0466K0282n5141l3247n1364
10424a23857K5814O7652L7553L9060j369M0887j5262k1175L3593J5867k4710m7872
10412B6181p6033n6547O5126O5920l0812l2931L5031O8800k2840Q210k0387m5223
10400a5505l2103R503k3649N4909J914q108R229K010Q6433n483j10991j29407
10388a61248K2890R2496L6133m1920L6928O1084j1150j8699K7338K8754k7127
10377D5479k6744m1999J4381L8652k1651l5605L1996J8047K812j9082j6112n250
10365a5076N1342j6853n4039k0366l2179n662j6994L0971P445J720J5311l4771
$$ y = [-46914, -7333, 13901, 17174, -16844, -24443, -20787, -41806, -56040, 2770, 19972, -4051, -41435, -41155, -29487, -22278, -60789, -21602, -21156, -30960, -14853, -4387, 15895, -39246, -72493, -123857, -98043, -30391, 7162, 46222, 44853, 85740, 70478, 49303, 82896, 98763, 74053, 26181, -49852, -106399, -41273, 24647, -6165, -39096, -4065, 64735, 41895, 50105, 29718, -15505, -47608, -38105, -61754, -6845, -4931, -13039, -3810, -1800, 84633, 79150, -31841, -161248, -138358, -45862, -9729, -51649, -14721, 46363, 35213, 16514, 43852, 72606, 45479, 18735, -23264, -8883, 29769, 8118, -27487, 4509, 22556, 25368, 6286, -9826, -15076, 36266, 19413, -34626, -54992, -87171, -92833, -109827, -78856, -71411, -69691, -54380, -89151]
10353h9151k1127j9069k2803J3561j0642O2721L1782n2029k4479j5091O0905N2743
10341c2679r222J3078K1015M8239k2317m2774M4528n199k9947n7019m2992K6292
10329h8997P1479J963l3431L1321J9504p017K7504J9230J4292m2834p909L4114
10317C9219l8965j2912j3432L0831M1856J3680k3591k4132l3373m307J2689k952
10305a5389J0781j0062j1898M5995k2817K808R15k256M0062m4821m034j3854K8230
10292C660n5588k1236j9614K3124k8871m6919P6710R2004L3351o6156m1128L8490
10280a2173L4463N8951K0946l5055o3210q1644N4315k895l0475K6161P108p04
10268b4212o2034l6206J7593Q7856J9952k9072M0957r39L0559l4269j0737l7694
$$ y = [-89151, -110278, -129347, -152150, -138589, -149231, -86510, -54728, -106757, -131236, -146327, -85422, -32679, -41901, -28823, -7808, 40431, 18114, -24660, 19868, 14669, -15278, -72297, -115289, -88997, -17518, -15555, -48986, -17665, 1839, -5178, 22326, 41556, 55848, 13014, 5105, 39219, 254, -12658, -26090, 4741, 46597, 60277, 36686, 12554, -20819, -25126, -12437, -15389, -4608, -14670, -26568, 19427, -3390, -582, 333, -1923, 38139, -6682, -10716, -24570, 3660, -51928, -73164, -92778, -69654, -98525, -145444, -68734, 23270, 56621, -9535, -50663, -12173, 22290, 81241, 102187, 67132, 3922, -77722, -23407, -26302, -56777, -30616, -23508, -24212, -86246, -122452, -104859, -17003, 2949, -26123, 14834, 13895, 44454, 10185, -552, -38246]
10256c8246J9236J1481k3577M8378M587k9504N1184j659p4941j0207K8977K1993
10244G702L119m4789l7428N5303M4129m2046j4719k6954J2178Q1339N2141L6975
10232A26950k8194m4753J6660k922q613j0148m4424P519k1154j3395o31k4682
10220d7787J9725k2609m094J6533J5104k8053P1461k5736n5504k7799J7744k1877
10208i2892P798M5715M1289m0360k8685N1535M773o950k0562L7808O1883Q0m0603
10195B0829k5567K8744j5699j1333J5213R577M7292K7038K770L5216l3252n1374
10183D9454Q213J2755q554j0639k5296j06507r09N0235j0592m4993O0903N360
10171b0570O273k532m7645N9999O6785j5194k8863N013o9466j4065m258J3945
$$ y = [-38246, -19010, -7529, -31106, 17272, 21859, -7645, 43539, 41880, -33061, -43268, -14291, 7702, 10821, -33968, -71396, -16093, 28036, -14010, -28729, -55683, -43505, 37834, 89975, 126950, 98756, 54003, 70663, 67741, 59128, 48980, 4556, 12075, -9079, -22474, -23105, -47787, -28062, -50671, -54765, -38232, -23128, -51181, 20280, -5456, -60960, -88759, -71015, -92892, -85094, -39379, 1910, -38450, -67135, -15600, -10827, -17777, -38339, -531, 61352, 61432, 20829, -4738, 24006, 8307, -3026, 12187, 21764, 69056, 96094, 98864, 134080, 100828, 49454, 57667, 70422, 61868, 51229, 25933, -80574, -81483, -31248, -41840, -86833, -25930, -20570, -14297, -16829, -64474, -4475, 62310, 47116, 18253, 23266, -46200, -60265, -64523, -50578]
10159e0578L006L6109O4634K0258l5793l6272K115M6540o1595r65K0591K2881
10147C0931m861o9351j9076Q232N358K6730J2335j4242K2509L6459j1231o2350
10135c8557Q645Q396K5503K0347m6164J989Q484j7316L1328L3790J656j3897J0896
10122C5100k66m6664n5941L686j6050o3854P817P5132P6924j8772l9744l1285
10110g3917J8415K3177l8692j9875k1539J1381K4934M569l0965N8158L9010K1033
10098A5689j2940L6769l6022o8593r428j2491l9247J9487O6311P923j0890J7600
10086b5832Q5935K4303r7265l7449J0906J8704j7115J6534O576k6604K7429l8783
10074e2661l4723r674N9387M1148L100O504o6855m0681L8331K0952M0299j355
$$ y = [-50578, -47572, -11463, 53171, 73429, 37636, 1364, 3479, 50019, -11576, -12541, 8050, 30931, 26070, -43281, -62357, -54125, -48767, -22037, -9702, -23944, -1435, 35024, 23793, -38557, -29912, -21516, 3987, 24334, -21830, -19841, -11357, -28673, 2655, 36445, 38101, 24204, 35100, 34834, -11830, -67771, -64085, -80135, -143989, -136172, -61040, 15884, -2888, -42632, -73917, -55502, -32325, -71017, -90892, -112431, -101050, -76116, -71547, -102512, -44354, -5344, 15689, 2749, 39518, 3496, -65097, -74525, -87016, -126263, -106776, -40465, -32542, -43432, -25832, 60103, 84406, -12859, -50308, -39402, -20698, -37813, -21279, -14703, -41307, -13878, -52661, -87384, -97058, -37671, 3477, 6577, 13081, -53774, -94455, -56124, -35172, 5127, 3772]
10062C772J5128M0841k0767l5754n8457L6584l5861k1169K4193N5624R627O516
10050B0277j0437l3529N0969J9623N3854N7349l7061p3073n4089j6391j8085j3164
10038e3757N2932k0040K5842K4836P5197m0247p8050K2164l6177j0192K4927N6228
10026D3663J7431K198m8054p1192M9537M7889M83K762J6648j073k9532l460o74
10013B6626o3173m9565l6619L8516N0235k6672L6210Q6242k5743n5690J8352N6034
10001E4753K0079R721l5712p0936j919P0402K248j1660N835K2840k7200N0276
9989H8727N678q6358j5150N1121k523n7584l0561J4131O2584K5868J918J6819
9977G4670j3080j3977J0657j8479p5225j553K9462k5695k0396J835j3971o7L5626
$$ y = [3772, 18900, 59741, 38974, 3220, -55237, -18653, -54514, -75683, -51490, 4134, 13761, 20277, 9840, -23689, 27280, 46903, 100757, 158106, 121045, 47972, -6117, -22508, -40593, -53757, -825, -20865, 4977, 29813, 105010, 64763, -13287, 8877, -27300, -37492, -12565, 43663, 61094, 63292, 15238, -55954, -6417, 41472, 41955, 44717, 61365, 60292, 30760, 27300, 26626, -36547, -86112, -122731, -84215, -33980, -60652, -24442, 61800, 36057, -19633, -1281, 54753, 74832, 84553, 48841, -22095, -24014, 46388, 48636, 36976, 42811, 65651, 38451, 88727, 94405, 8047, -7103, 44018, 41495, -16089, -46650, -32519, 30065, 55933, 57851, 74670, 61590, 47613, 58270, 39791, -35434, -36987, -7525, -33220, -53616, -51781, -65752, -65819, -30193]
9964c0193m5555p2754M0164O9940N0037n3327k1135P9381J7772L6881k5554j34
9952D5523n517m619m4545N1431N1771J1028j52676o9958L9928N5744R5848n5596
9940A8362m0796Q773J118J8826O283N965o929k8007O1964N3875q151n7142k5921
9927H220n4447L8894L3788J3951J3312k8810L8541O6221J704n1019k2960l3549
9915B3846n0018k1901m2093J3161n980J7727K5584J5877M3471j752m3620r4201
9903a19899N4435Q5773O6377J3923q437K0359L2928j051m4143j6348k2002j5182
9891D6733l5100k5395j5582J8356R328l6197j2990K0324K5509m3280K8481P963
9879a1850K2141N6581M409o9766n3558p749O6533N3687k4936n7661m207N7560
$$ y = [-30193, -75748, -148502, -108338, -38398, 11639, -41688, -62823, 16558, 34330, 71211, 45657, 45523, 40006, 35387, -9158, 42273, 94044, 105072, -47604, -117562, -77634, -21890, 73958, 18362, -22434, -13661, -12543, 6283, 12566, 18531, 11602, -16405, 45559, 99434, 91283, 34141, 8220, -46227, -7333, 26455, 40406, 53718, 24908, 63449, 129670, 131374, 80355, 57395, 23846, -26172, -48073, -90166, -77005, -82985, -65258, -39674, -23797, 19674, 17922, -25698, -119899, -65464, 20309, 86686, 100609, 92172, 112531, 145459, 144408, 100265, 83917, 61915, 46733, 11633, -13762, -29344, -10988, -1660, -37857, -50847, -30523, -5014, -48294, -19813, -11850, 10291, 66872, 71281, 1515, -52043, -59792, 6741, 60428, 35492, -22169, -26376, 31184]
9867C1184K210J3391K1137M6358k5830n0725K080K4307L2363M8429J8414j4906
9855A48412J9677O8501O3102J26052Q3397o9617j43312p2454r6857j3026o5577
9844D8298l4382L7669j5807k0684j8909k3169m2803L5236P7198J1208O283k3190
9832C6948k3719k789L9467K4585j6418k0643J4834O051J335r979p3713k4764m3146
9819i1951j6726N7081R219O3981J3542M0615L1451m8022m0308L0971Q640j03678
9807d5185p4230L3165N6962N4535j3828r0998j3938l2029J2178M4404M6175M5219
9795B2430R510o694l0861k3386m2106o50M7078M5212j7454j1656M7994j2750j1844
9782A4823K8137L5824L0106p1655n5294k0662k4354K3207M954j1374K6219L4560
$$ y = [31184, 33394, 46785, 67922, 114280, 88450, 37725, 39805, 64112, 96475, 144904, 163318, 148412, 168089, 236590, 299692, 425744, 509141, 439524, 296212, 223758, 126901, 113875, 48298, 13916, 51585, 35778, 15094, -3815, -26984, -69787, -34551, 42647, 53855, 60138, 36948, 13229, 10440, 49907, 74492, 58074, 37431, 52265, 58316, 59651, 49672, -24041, -48805, -91951, -108677, -51596, -42377, 21604, 35146, 75761, 107212, 59190, 18882, 49853, 58493, -45185, -119415, -86250, -29288, 25247, 11419, -79579, -93517, -125546, -113368, -68964, -22789, 22430, 31940, 25246, -5615, -29001, -71107, -71757, -24679, 20533, 3079, -8577, 39417, 26667, 14823, 42960, 78784, 108890, 37235, -18059, -38721, -63075, -39868, -34914, -46288, -20069, 14491]
9770A4491j6874J0139m893k1480k1657o09O0159K48m1571j462L9728k5455n2207
9757f1443j3668J9625L4991q6511L853N8246K5828M695l1178Q9107Q7653j098
9745A30100r490J0352j6720n6944Q011J0824P75L217K4069l6674O6162p018j0862
9732A15802k5491J537p00q870l3227j8914j1812m3785k928k5949M4371m6155l5146
9719i1267j9281L8780L8026k3115o423J6018N5432N3550O553m669J2915k8594
9707D7925Q087N6658P7691K0436N8849R5362L2743L2183Q7311P4657J19383J01687
9695H12972J33285R4101Q2394Q4419J2886J2460K5914P44q9798j89344j42278
9684H37755r7505j05306j86220r0059n9505o4488j0977n739N191m6256n7754J6485
$$ y = [14491, -2383, 7756, 2863, -18617, -40274, -40883, 19276, 19524, -22047, -23509, 16219, -9236, -61443, -75111, -55486, -20495, -107006, -103153, -44907, -19079, -14384, -45562, 43545, 131198, 130100, 120610, 130962, 114242, 57298, 65309, 76133, 76908, 80125, 104194, 67520, 133682, 126664, 115802, 90311, 91848, 91148, 82278, 49051, 30137, 18325, -25460, -28388, -54337, -9966, -56121, -91267, -110548, -71768, -33742, -56857, -63280, -47262, 8170, 61720, 68273, 63604, 76519, 47925, 56012, 112670, 190361, 210797, 269646, 365008, 397751, 429934, 517245, 591902, 711285, 812972, 946257, 1040358, 1122752, 1207171, 1220057, 1232517, 1258431, 1259175, 1169377, 980033, 837755, 740250, 634944, 448724, 358665, 299160, 234672, 223695, 217956, 223147, 176891, 119137, 135622]
9672A35622K873m8385j4795k0130l5767L0567M9110k5499p7818l6977O2433M9514
9660G0748K1338j8321l6185Q62J801J2414K7068K9909l0468m907r380n0386N3495
9647F7988j0649k7755K05N152l0321p718O301R2110K1641K5914l8049n6769j9347
9634B8703j7962n061N650J9016M3305j0038j3999j0752m0072N1600P335n0469
9622G256k5571n2520J1791L3100K8536K9831o325k6009m7346o745N5046K6721
9610B7765N903r243r948M2507M8813L8077p0990l7180M7792J9392L435j1574L1859
9597A26608M7954p9183n6328O0514J5109k9683O1309P2558L2765p2794j08969
9586F9860l7827J8488j155q632J1557l0932J6923j4137J918p884l6138J7362K2891
$$ y = [135622, 138495, 90110, 75315, 55185, 19418, 49985, 99095, 73596, -4222, -41199, 21234, 70748, 92086, 73765, 37580, 38442, 40243, 52657, 79725, 109634, 79166, 74259, 64879, 14493, 67988, 57339, 29584, 29789, 34941, 4620, -3098, 3203, 95313, 116954, 142868, 104819, 48050, 28703, 10741, 5680, 11330, 30346, 73651, 63613, 49614, 38862, -1210, 50390, 57725, 7256, -18315, -70835, -59044, -25944, 2592, 32423, 26098, 89, -47257, -54002, 1044, 27765, 33668, 24425, 14477, 56984, 105797, 143874, 72884, 35704, 83496, 102888, 106323, 94749, 126608, 174562, 95379, 39051, 99565, 114674, 84991, 146300, 218858, 251623, 178829, 69860, 32033, 50521, 49366, 40734, 52291, 21359, 38282, 24145, 26063, 18179, -17959, -597, 22294]
9573B2294M9439j4244j846M7881k9041N458Q6784K6761m9261n7566L9094N4472
9561A80225M1679l5445m6815j6356J2947R434L7279l7853q3990O01Q6782O2233
9549B10721R636J69P7430O6886J4303k9317r623o8996j3842n5332j03894J6290
9537A14431j7403l4809K4741m439K1764O9603k2942m2691k128P528j1803k5650
9525G6202k2820m9616K7870q315O5044k5081r168J1312J0464K9149k5714l1514
9513D7813L78Q045m1557m7702r88M4853K3056n9442k5238n363R1779M1074p1266
9500E442n1279n851L8566O4346J0284p60k6257K0364L4546N6624J5298j4065L845
9487A51103k2945m7809j3582j7059j251m9837k8036K40j383J13R633r700j3233
$$ y = [22294, 71733, 57489, 55643, 103524, 74483, 79941, 166725, 193486, 144225, 86659, 125753, 180225, 221904, 186459, 139644, 123288, 136235, 145669, 182948, 145095, 61105, 61706, 148488, 210721, 220357, 220526, 297956, 364842, 379145, 349828, 340205, 271209, 257367, 202035, 98141, 114431, 97028, 62219, 86960, 82521, 104285, 173888, 150946, 108255, 106127, 113655, 101852, 76202, 53382, 3766, 31636, 23321, 88365, 63284, 54116, 65428, 75892, 105041, 79327, 47813, 48191, 56236, 14679, -33023, -34011, 10842, 33898, -25544, -50782, -56145, 35634, 76708, 5442, -45837, -51688, -13122, 51224, 61508, 60748, 34491, 54855, 89401, 146025, 161323, 147258, 151103, 128158, 80349, 66767, 49708, 48457, -1380, -29416, -29176, -30559, -30446, -20813, -30513, -43746]
9474d3746J1259K0133k1047k6528n2249O420M985J9028Q0100L7519m0643m404
9462i173L8500J1936K2855N44m0131p313q914M0810L1006J8495m2902m246L8711
9449I0178r260M7528J4459m4071J3827J9105m2444N5867j9299o5752J0161l3558
9437C6741l958j9463J7657J7292l8214N6304K1758M3366p735L1545J0632J8914
9425A84839m8443l1878N6194K0229j8962m050q3432o5471m0277Q1776O4940P0591
9413A86056K6280N733N1966O5562m1602j0459k522K2053K5853k9585k073K4075
9401C21337O8295k0678m3668j0867N7099K7728K5411k4903m7021J8267K9983l916
9389C97067l6114r020P8164M2704l0059n340n758l212k0476O6054N9133P7287
$$ y = [-43746, -32487, -12354, -33401, -59929, -112178, -105758, -100773, -81745, -1645, 35874, -4769, -9173, 29327, 41263, 64118, 64662, 24531, 17218, 8304, 49114, 80120, 98615, 55713, 51467, 90178, 80918, 128446, 142905, 98834, 112661, 131766, 89322, 145189, 125890, 60138, 70299, 36741, 32783, 13320, 30977, 48269, 10055, 66359, 88117, 131483, 123748, 155293, 165925, 184839, 136396, 104518, 160712, 180941, 161979, 157929, 74497, 9026, -31251, 50525, 115465, 186056, 212336, 218069, 270035, 335597, 293995, 283536, 281014, 303067, 328920, 299335, 297262, 321337, 389632, 368954, 325286, 314419, 371518, 399246, 424657, 399754, 352733, 371000, 400983, 397067, 360953, 351933, 430097, 472801, 442742, 437402, 431644, 428432, 407956, 474010, 533143, 610430]
9377F10430k8821N820N1970L1699n5368m8771L1745M4479J8626J1240O0438J06930
9365H40417Q2637M2384K2365K917K5538K9635o5218n2990J4688N1910R1543K8998
9353A114824k4603O8815L7858K4703P4769Q6131O2676K7017M9771M9526Q2760
9342A654247J9408k5131J7835M6078K8464M9637J15949P5279R9666J11841N4393
9331B247666J57681K05428K12420J66631J85831K01670K17708K53217K67180K96117
9321D411549L71441M04304M04791M83092N85121O40208O92744Q76087J034574
9312I903911J149778J400802J665517J950881K293871K678712L225083L807815
9304B8076370M434039M961250N474119O104488P412251J0016089J4211692K0558922
$$ y = [610430, 581609, 587429, 639399, 671098, 615730, 566959, 598704, 643183, 661809, 673049, 733487, 840417, 923054, 965438, 987803, 990720, 1016258, 1045893, 980675, 927685, 942373, 994283, 1085826, 1114824, 1090221, 1159036, 1196894, 1221597, 1296366, 1382497, 1445173, 1472190, 1521961, 1571487, 1654247, 1673655, 1648524, 1666359, 1712437, 1740901, 1790538, 1906487, 1981766, 2081432, 2193273, 2247666, 2405347, 2610775, 2823195, 2989826, 3175657, 3377327, 3595035, 3848252, 4115432, 4411549, 4782990, 5187294, 5592085, 6075177, 6660298, 7300506, 7993250, 8869337, 9903911, 11053689, 12454491, 14120008, 16070889, 18364760, 21043472, 24268555, 28076370, 32510409, 37471659, 42945778, 49050266, 56462517, 66478606, 80690298, 101249220]
9296A01249220L0341862M4960734O4433680Q0631176P2039304K4567747l6012094
9289C82211629o9458401p0424646n7481441m3267758l1637125k2895032j6641159
9282G0406067j2261550r064922o745625n145945m212281l826338l632678l251286
9274B2265442k792497k384479k034142j689259j349047j163879r54573q66527
9266I031039p64371o08811n66867n13616m34041m50887l72912k83846k88268k14608
9256D532812k02707k34973k07488j77996j84302j42162j51974k11863j51631j12911
9246B754805j12349q9804j39755j09111j10815j22351q5626j09504l3708o7301
9236A774481j49100j19067m6687n6483j3025l2690n3427K23j8895k9001K8257
$$ y = [101249220, 131591082, 176551816, 240985496, 321616672, 393655976, 418223723, 382211629, 312753228, 242328582, 184847141, 141579383, 109942258, 87047226, 70406067, 58144517, 49079595, 42333970, 37188025, 32975744, 29149406, 25516728, 22265442, 19472945, 17088466, 15054324, 13365065, 12016018, 10852139, 9897566, 9031039, 8266668, 7657857, 7090990, 6577374, 6143333, 5692446, 5319534, 5035688, 4747420, 4532812, 4330105, 4095132, 3887644, 3709648, 3525346, 3383184, 3231210, 3019347, 2867716, 2754805, 2642456, 2552652, 2412897, 2303786, 2192971, 2070620, 1984994, 1875490, 1841782, 1774481, 1625381, 1506314, 1459627, 1403144, 1390119, 1357429, 1304002, 1304225, 1285330, 1256329, 1284586]
9225A284586n322l6239l0437l5929o0162r1785j35830r9087p6077l772M3709M6654
9213H00309M1249M4939q389j8237j9094k4714o8746n9546q094L0459J5034k5098
9201G00072m61l6245k0869r090m5344k4653K2308O1364k5847J7029K8892m623
9189F62533k5205k8376m3255k4570K7955o252l9245L4922J4505o9306l8077K3518
9177D89147k0145L1845K3563k7391j5357o0635k3154J665L7581L0896J30267J24449
9165G22731M1501k2111q144M820n0671j08334q023L7764J9769j0820M585n2770
9153E70297J8323Q626m1424k2260J6791L4717j5055J3676k820K1730k8190L5574
9141F09985k0121n1774k7834J7139m9372p7740M539O0761J1835K2390K0879l8995
$$ y = [1284586, 1279264, 1243025, 1212588, 1176659, 1116497, 1024712, 888882, 789795, 713718, 709946, 753655, 800309, 841558, 886497, 878108, 859871, 840777, 816063, 747317, 687771, 679677, 710136, 725170, 700072, 699611, 663366, 642497, 633407, 588063, 563410, 585718, 647082, 621235, 638264, 667156, 662533, 637328, 608952, 565697, 541127, 569082, 562830, 523585, 558507, 573012, 503706, 465629, 489147, 469002, 500847, 524410, 497019, 481662, 421027, 397873, 399538, 437119, 468015, 598282, 722731, 764232, 742121, 733977, 738797, 688126, 579792, 571769, 609533, 629302, 618482, 623067, 570297, 588620, 597246, 555822, 533562, 550353, 585070, 570015, 583691, 580871, 602601, 574411, 609985, 589864, 538090, 510256, 527395, 478023, 400283, 404822, 465583, 477418, 499808, 520687, 481692]
9129D81692k961M4443L1500P2985K8589J7852J1224m897m9802k2921M9842L5380
9117F92926P0053K458j6735K2848O9996l7980J8572J5982j8625O4084p603K4650
9105I00626L7588k957P3758M4814M1528K3925M4377R2683J20629J25340J51875
9094A654186J49975J27973J19879J87329K08945K59437L47795M02416L60841M18955
9084D237731M35297O04705P14422P71978R84989J151925J372741J527439J738677
9075A3539904J827804J745703J442329R32895K32296n88547j225754j583993j791478
9066A4531159j817330j571224j487770j308997j100617r11549p70235o17215m86599
9057D459623m87314m43418l47287k41308k57997k31193j65527j72037j59716j60364
$$ y = [481692, 478731, 523174, 554674, 627659, 656248, 674100, 685324, 680427, 630625, 607704, 657546, 692926, 762979, 765437, 748702, 771550, 841546, 803566, 822138, 838120, 819495, 883579, 875976, 900626, 938214, 935257, 1009015, 1053829, 1095357, 1119282, 1163659, 1256342, 1376971, 1502311, 1654186, 1804161, 1932134, 2052013, 2239342, 2448287, 2707724, 3055519, 3457935, 3818776, 4237731, 4673028, 5277733, 5992155, 6764133, 7749122, 8901047, 10273788, 11801227, 13539904, 15367708, 17113411, 18555740, 19488635, 19720931, 19132384, 17906630, 16322637, 14531159, 12713829, 11142605, 9654835, 8345838, 7245221, 6333672, 5563437, 4946222, 4459623, 3972309, 3528891, 3181604, 2940296, 2682299, 2451106, 2285579, 2113542, 1953826, 1793462]
9047A793462j10040j19830j69403o8592q3302p6026j02687m4278o5389j28210
9037H25705k8580j9950o1210l0190j0217n2956j3642P155K3304p59k9027o9624
9025E40009k2867M9720m4568m3676K3046K0640m6025o6154m458k6985m4762k2422
9013C11498Q804O596J4929k8268l2699q730K7075L067n5626K1844M5917J8211
9001C32618n9911l0797J273l9515m9636M623L9927R954L514L6573J5255m6629
8989B17249p1735l6933l747L9111K1133L6974N0820K1201M675l8156N6678j4095
8977B83175j3019j5535j6493m6158p7987J6904L6125K5389J5067r026Q86j2641
8965A86687j0397m4959J3235K9776n7467l327J5450L2721M7417j3430N002m491
$$ y = [1793462, 1683422, 1563592, 1394189, 1325597, 1242295, 1166269, 1063582, 1019304, 953915, 825705, 797125, 777175, 715965, 685775, 675558, 622602, 608960, 616115, 639419, 638660, 609633, 540009, 517142, 566862, 522294, 478618, 501664, 522304, 476279, 410125, 405667, 378682, 333920, 311498, 320302, 326898, 341827, 313559, 280860, 272130, 299205, 302272, 246646, 268490, 314407, 332618, 272707, 241910, 243183, 203668, 154032, 158655, 198582, 208536, 212050, 248623, 263878, 217249, 145514, 108581, 104834, 143945, 165078, 202052, 252872, 274073, 278748, 240592, 297270, 283175, 270156, 254621, 238128, 191970, 113983, 130887, 167012, 192401, 207468, 198442, 199328, 186687, 176290, 131331, 144566, 174342, 116875, 113548, 128998, 161719, 209136, 195706, 200708, 196217]
8953A96217m6452j2453N308K3378K8428O795M417l5265q4573J8805O2329M6915
8941B13849j5712j9547k7925l5532n142J9533Q4549J7243j770m1533k3164j8560
8929A46289k7674m2967k4884l5975j2966J8307M6135M7952Q179K2003L1818M0649
8917B16866k793l2121p7897J5488J3166J8957k8727P0748P6106J801n9754J0771
8905B22611N879k3464J648L8458J9945k6297M3146P0804J1534K132P4521J13862
8893E54779J65235J55871Q9474J09788J03675O1717J07589K1876J2242j3395k8234
8882A340617q0890j18362j49142j97340j17032j02270o2712k682q6604p6141q3709
8871B63733p5813K3257L3826o982j1371K5487Q7605N6290m7166l7070m9614r8292
$$ y = [196217, 149765, 137312, 142620, 165998, 194426, 201221, 205638, 170373, 85800, 104605, 166934, 213849, 198137, 178590, 150665, 115133, 109991, 129524, 214073, 231316, 229546, 188013, 164849, 146289, 118615, 75648, 50764, 14789, 1823, 20130, 66265, 114217, 122396, 144399, 176217, 216866, 214073, 181952, 104055, 119543, 132709, 151666, 122939, 193687, 269793, 271594, 211840, 222611, 228490, 205026, 206674, 245132, 265077, 238780, 281926, 352730, 364264, 366396, 440917, 554779, 720014, 875885, 965359, 1075147, 1178822, 1240539, 1348128, 1370004, 1382246, 1368851, 1340617, 1259727, 1141365, 992223, 794883, 677851, 575581, 512869, 510187, 423583, 347442, 263733, 187920, 211177, 245003, 238021, 226650, 252137, 339742, 396032, 348866, 311796, 262182, 163890]
8859A63890o2707M4752P7095k1821l8112o0424j959p7825l0063N8258K367o1561
8847h110J7991L8937N628m115l5446o0390L1956R9330M0193m9797q1365l1861
8835c7049J4432Q054J353M0351j2717m0629J6788L2207K0059K8676L813p2209
8823C129m2696K3302J5836M4079O6864M9662m1036o2023l6306n266n609k6397
8811a6461L6991M9743L6714J7194Q72j5755J3140k1452J0846L7600n1204p6710
8799B1518l7663N0019K3132n578j9531L9166K3814O417L065j5465n5775J4147
8787D7266r801m7556k9684O1340L1707O674Q993J4181m383K6048K3893K501J517
8774A32696J0808n4691l9568n2355n864N8202M0101j4482n8856L7577L3466q743
$$ y = [163890, 101183, 145935, 223030, 201209, 163097, 102673, 100714, 22889, -7174, 51084, 53451, -8110, 9881, 48818, 54446, 50331, 14885, -45505, -13549, 85781, 125974, 76177, -5188, -37049, -22617, -14563, -13210, 27141, 14424, -26205, -9417, 22790, 42849, 71525, 75338, 3129, -39567, -16265, -429, 43650, 110514, 160176, 119140, 57117, 20811, 15545, 9936, -16461, 20530, 70273, 106987, 124181, 125053, 109298, 122438, 100986, 111832, 149432, 98228, 21518, -16145, 33874, 57006, 51428, 31897, 71063, 94877, 101294, 104359, 88894, 33119, 47266, 37465, -10091, -39775, 21565, 53272, 59946, 68939, 83120, 78737, 104785, 128678, 131179, 132696, 143504, 88813, 49245, -3110, -8974, 49228, 89329, 74847, 15991, 53568, 87034, 78291]
8762G8291J9503N521J4048l1763j2001L1511l9794p2243l9977J9130K0177o9109
8750g6706j1234M0558L3614R671P4643Q8573l8654j8263n969J3598J5998J1557
8738A37386l6786p3065l9638k8239k9321K5110J8229j2535N3656L0894N0102L862
8726I9655m6457j5796R113l5953j28n4617J202O0199j7211J7905P2712O8231M950
8713A63805k4567k7670j2217Q031m9860j011j4699k5357l7057q815L4424N6226
8701F1233M7804r35j2115R70k2363p2215l9127j1637Q0962O8590j5834n0019k127
8688C3187K6515p421J924M2777p494k9544p7068L66K5396M4318n758q4572p222
8675d4596J6768M687L6648M2857L4646R482j0566l7066k6490j5049q250m8583
$$ y = [78291, 97794, 103315, 117363, 85600, 73599, 105110, 65316, -6927, -46904, -27774, -7597, -76706, -87940, -47382, -13768, -4097, 70546, 159119, 120465, 102202, 96233, 109831, 125829, 137386, 100600, 27535, -12103, -40342, -69663, -44553, -26324, -38859, 14797, 45691, 95793, 99655, 53198, 37402, 46515, 10562, 10434, -44183, -42981, 17218, 7, 17912, 90624, 158855, 163805, 139238, 111568, 99351, 107382, 57522, 56511, 41812, 16455, -20602, -29417, 5007, 61233, 109037, 108102, 95987, 96957, 74594, 2379, -36748, -48385, 32577, 101167, 85333, 35314, 33187, 59702, 52281, 54205, 96982, 89488, 59944, -17124, -16758, 8638, 52956, 47198, -37374, -44596, -27828, -23141, 13507, 56364, 91010, 100492, 89926, 52860, 26370, 11321, 3071, -45512]
8663d5512M68O3648L4764Q99l0696J1132J2755K563L6640L5572j3923o7484R1251
8650A32077L8554o466j7035l7671k0284j2368l3236r101j4945l3813M0868J6612
8638D3192m4482j5714M5211J2338l4002l8627K3565L4795l4908n764j2402o605
8626c3403L9259L9727j507l3276K3894L4578n8458j2813O4772K9000Q958j7012
8614H3719j9063j4590M60J3087N6459L5343j1260L0169o118J4982Q0575o2271
8602B01492n417n5642r6202j6097K8550k2518m1430l2603L9182P5516q474M398
8590G0755n097n7568k8982k9566N0245L2535o0879K5297l0L46O675O1261K4104
8577H9096m1747r5575l552K5711k1398K7314l1860P344L6159K9533K8978l8589
$$ y = [-45512, -45044, 18604, 53368, 54267, 23571, 34703, 47458, 50021, 86661, 122233, 108310, 40826, 132077, 170631, 164165, 147130, 109459, 89175, 76807, 43571, 34470, 19525, -14288, 26580, 43192, -1290, -17004, 28207, 40545, 6543, -32084, -8519, 26276, -8632, -14396, -26798, -33403, 5856, 45583, 44076, 10800, 34694, 69272, 10814, -1999, 62773, 91773, 100731, 83719, 64656, 50066, 50526, 63613, 120072, 155415, 144155, 174324, 168206, 183188, 263763, 201492, 196075, 140433, 44231, 28134, 56684, 34166, -7264, -39867, -685, 74831, 66357, 70755, 65658, 8090, -20892, -50458, -213, 32322, -28557, -3260, -3290, -2944, 3731, 64992, 89096, 47349, -48226, -51778, -26067, -47465, -20151, -52011, -44667, -8508, 21025, 50003, 11414]
8565A1414n4020K3912K0719J9003K129m8160M0611m1332n3696O5796L7138m1774
8553a8260k0286P203N467N4184k3503k5653l8582k6565L4251K9951l4248j6341
8541g2382O1225p481K0569K063L0063n515j7723N0027n702m0992J7130n8k8753
8528B471L8757j962k6170M4868K154j7587o5065o1872k0735Q2504M9498K5354
8516E2215R649k4335k0180N715n8226P882M673R234K6770L0354Q768K4988j4106
8503F3401l6288n1629L5487L9119k2979k7368O035N6905J3011n6941j1538L9097
8491D6312N7279o366m9455n0992l8378N0419L1747o2897k5618K2169j1143K8964
8479g959O7542P6720l7781n018m7874l7376N1564k3023p4515K1348m0291J4500
$$ y = [11414, -42606, -18694, 2025, 21028, 23157, -25003, 15608, -25724, -79420, -13624, 23514, -18260, -38546, -31343, -25876, 28308, 4805, -20848, -59430, -85995, -51744, -21793, -56041, -72382, -11157, -18638, 1931, 3994, 34057, 28542, 10819, 60846, 55144, 14152, 31282, 31224, 2471, 41228, 39266, 13096, 57964, 60118, 42531, -22534, -84406, -105141, -22637, 26861, 52215, 61864, 37529, 17349, 23064, -35162, -27280, -22607, -13373, 13397, 43751, 52519, 77507, 63401, 27113, -24516, 10971, 50090, 27111, -257, 5778, 62683, 75694, 18753, 7215, 46312, 103591, 97225, 47770, -3222, -41600, 8819, 40566, -22331, -47949, -25780, -36923, -7959, 59583, 136303, 98522, 93504, 45630, 8254, 59818, 36795, -37720, -16372, -56663, -42163]
8467d2163L8528j45N203L4540J2649m0866n9393R055O9024J710k0841J7892K0134
8454D5327K1014l8025o5520m3350k2835j2873P1578N8405j005J5096O785M181
8442C8778K1378K9995k6143n132N9822L7118k3889J7585l0181r4673p3761j8020
8430f7123P9689N8265k7462k8017j3486K6526j5410k0168n5926j6592N6562N8486
8418C5344J787J4462K3886n0284o8578o9669N071N4737L3932q272l7555J439k7139
8405i0839L7085Q965l311q770k6151L9370Q3176l8488j6143J5380k2687L1489
8393I076P2256N5753j8205p8827k4183L9104m021l2801k9228K192L4217K8800
8381E4133M3586m7600L3773N9769m4987p756q404n7684M412p988K0352K0282K0754
$$ y = [-42163, -3635, -3780, 1423, 35963, 48612, 7746, -51647, -42592, 26432, 28142, 7301, 25193, 45327, 66341, 28316, -37204, -80554, -103389, -116262, -44684, 13721, 12716, 27812, 34597, 38778, 60156, 90151, 64008, 58876, 118698, 155816, 131927, 149512, 119331, 24658, -49103, -67123, 12566, 70831, 43369, 15352, 1866, 28392, 12982, -7186, -63112, -79704, -23142, 35344, 37131, 51593, 75479, 25195, -43383, -113052, -107981, -53244, -19312, -27584, -65139, -63700, -90839, -53754, -44789, -48100, -56870, -83021, -43651, 39525, 1037, -15106, 274, -22413, 9076, 81332, 137085, 118880, 40053, 15870, 54974, 50953, 18152, -11076, -8884, 25333, 54133, 97719, 50119, 83892, 143661, 98674, 90918, 82514, 24830, 29242, 21254, 41606, 61888, 82642]
8368H2642k585k1150J6252m545K8304l661p1360p3200k9839Q352L491J4950L4414
8355a7935q695p631l8869M5936M7066k7999J4421j5034L2395M0895O54l2037j6474
8342A6693l7933n1559k7082K2890J3651L1390R007R008m0286o1772k2618j2958
8330a51569Q3416M3219O3338M2538J4591j7767k2037l0985K7777n4394p7529l1743
8318a11145J689N3000M6594N260Q163m1050m1759o9999J7703K1220N2599K7151
8306c0574j4332k2019O8868P4745k0729k9201j5981l656j3193k4934k5609l6447
8294i3062k2835J2623Q0270M4466j6740p622m673L441N8638L1142r224m4205j531
8281C0688L4363n0957l6312N8900J06397J0147o2205o3093l3318N143N2789K360
$$ y = [82642, 80057, 58907, 75159, 70614, 98918, 95257, 23897, -49303, -79142, -70790, -67299, -52349, -17935, -26630, -34261, -73130, -27194, 19872, -8127, 6294, -8740, 23655, 64550, 65204, 33167, 16693, -21240, -72799, -99881, -76991, -63340, -31950, -22943, -13935, -54221, -115993, -138611, -151569, -68153, -24934, 38404, 80942, 95533, 77766, 55729, 24744, 52521, -1873, -79402, -111145, -109456, -56456, -9862, -4602, 3561, -37489, -79248, -149247, -131544, -110324, -57725, -30574, -44906, -66925, 1943, 76688, 55959, 26758, 10777, 7121, -6072, -31006, -56615, -93062, -115897, -103274, -23004, 21462, 4722, -2900, -7573, -4132, 54506, 85648, 76424, 32219, 30688, 65051, 14094, -22218, 36682, 143079, 153226, 91021, 27928, -5390, -247, 52542, 54902]
8269E4902j1813K3721j8615n1585j7359R069l16J9236j9776M2954j5787J6015
8257C0646j4402k0591l8309k7169L1385M7792M1284l7596j153m903K9124l183
8245C2925J6968o656l8908K6997K1115o7401K7135M0405p687j2118N0770j5698
8233F7847k2260L1637J083m4644n7123J4708K8123R897M0394Q285j818l034n2380
8220B0715m2523O8688j841l5838k5490j3708j67N32k6970p81J0850P552M175n123
8206c9929q358k2606K54L7976k262j6790j0676J9342k594K5313P2418K0270p8602
8193f244J1730K7291l9566m1248l8171J6413j8275M6082M7635N4153M1151n6500
8181D4451o1971j1316n309k4998n0840m8360K0532L5101N2674K7304M887K4087
$$ y = [54902, 43089, 66810, 48195, -3390, -20749, -11680, -11996, 7240, -12536, 30418, 14631, 30646, 16244, -4347, -42656, -69825, -38440, 9352, 50636, 13040, 11887, 6984, 36108, 32925, 49893, 43237, 4329, 31326, 52441, -14960, 12175, 52580, 44893, 32775, 83545, 67847, 45587, 77224, 78307, 33663, -23460, -8752, 19371, 29268, 69662, 77947, 76129, 73095, 20715, -21808, 46880, 45039, 9201, -16289, -29997, -30164, -29632, -56602, -57383, -46533, -38981, -34806, -39929, -48287, -70893, -70639, -32663, -34925, -51715, -62391, -43049, -45643, -20330, 52088, 72358, -6244, 5486, 32777, -6789, -48037, -86208, -69795, -88070, -41988, 5647, 59800, 100951, 44451, -17520, -28836, -34145, -59143, -109983, -158343, -137811, -102710, -50036, -22732, -17845, 6242]
8169F242J2284L6264k6499n3542l7380K7773K8044O4955J3678o9087j9791q3317
8157a00376o168O0941J4574M1208N1232L1553n9752j0474O499J8904q0979p712
8145d0550J5222J6563J8667R596L1057l2998p0990j8655J3560L725Q005K7158
8133a9640J8754j625k5999K3809O1264K9508n0489k335j7084o2764m4925K2437
8121f9089M2811Q3636O9355l7210j5542j6269l9772m4029m6213j6470j539N0622
8109c9709k4287m877Q3558P9862l2237L2781N144k4943j1257r6204n5888n66m698
8096i3321L1122M2495J4598K9796K1501R217P790j2988n6627o854m385M2781K6037
8083E1162n8073m3442Q6692j6790J0416L7654j1810n3898l1819j5390n2180M0483
$$ y = [6242, 18526, 54790, 28291, -25251, -62631, -34858, -6814, 58141, 71819, 2732, -17059, -100376, -106544, -45603, -31029, 10179, 61411, 92964, 33212, 22738, 29237, 48141, -32838, -40550, -25328, -8765, 9902, 19498, 50555, 17557, -53433, -72088, -58528, -54803, -46798, -19640, -886, -2511, -28510, -4701, 56563, 86071, 35582, 33247, 16163, -46601, -91526, -69089, -26278, 57358, 126713, 89503, 73961, 57692, 17920, -26109, -72322, -88792, -90331, -39709, -63996, -68873, 14685, 94547, 62310, 95091, 100235, 75292, 64035, -32169, -88057, -88623, -93321, -62199, -19704, -5106, 24690, 46191, 55408, 63198, 50210, -6417, -13271, -17656, 25125, 51162, -6911, -50353, 36339, 19549, 29965, 67619, 55809, 1911, -29908, -45298, -97478, -56995]
8071e6995P9693N9354L1613q3350m2586J4254l4969k1388J6339L3122j3392j7624
8059c5929j7923j5980K4632J9725L317K1926k2371M000j9567r568n3550J0568
8047i0720K4680O261P04P9033O8828p1704j9435M8917J598q337K6651j1435k2406
8034C2635K0033q037Q217k880m5801j8368K2548n706J1985L0401J7797k9597p2718
8021c9491n398k8978J6882K0610l5369K2041Q8346P149k1166L9812K9020j810
8009I1648k5212M4001N3623K8590p1571n1085j5029l2480l2026L0345L404k0328
7997C880k788M2759Q050j3823j9868k9009O648q473j1472L7077l1836L1153O0278
7984G2576K8849k0052o873k9310m7094k8550k2908k8350P1080O9058k0249K994
$$ y = [-56995, 22698, 82052, 113665, 30315, -12271, 1983, -32986, -54374, -38035, -4913, -18305, -35929, -53852, -69832, -45200, -25475, -22158, -232, -22603, -18603, -38170, -47738, -101288, -90720, -66040, -59779, -59075, 19958, 88786, 17082, -2353, 46564, 48162, 39825, 66476, 55041, 32635, 52668, 44631, 52848, 49968, 4167, -14201, 8347, 2641, 14626, 45027, 62824, 33227, -39491, -44889, -73867, -56985, -36375, -71744, -49703, 38643, 45792, 24626, 64438, 93458, 91648, 66436, 110437, 164060, 192650, 121079, 69994, 54965, 22485, -9541, 20804, 24208, 3880, 1092, 43851, 51901, 38078, 18210, -10799, -4151, -12624, -24096, 12981, -18855, 12298, 72576, 101425, 81373, 74500, 45190, -1904, -30454, -53362, -81712, -10632, 58426, 38177, 41171]
7972D1171P5360K7279n9457j0888l5452K9421J8467k9642J4519K6895m381L3817
7960A27109J6432n5639j10540K5962N9392O089j2322J5250L3815l2422k9169m4439
7948d82m1957J0570P7952q304k6363m3636P177O4580L161p686L5999o8818m6848
7935d4655K8722o173P228l1523P0637J2398j4312P4453M3100n6833r0257n2612
7923e9827J7962N2098J2255k1894m5002k7638k903M7972M623J6587j0491L9706
7911B3448O8482P245k0615j4035k6301l2678J3549J00684q085m4112J3881K2619
7899A04082m7630o7145j515L766J9653J5034j5375m6612K1890N2005J0813K1050
7887G0016j8035k3870j6589P109J9451N1716j4729o9517j1229Q880N689P6022
$$ y = [41171, 116531, 143810, 84353, 73465, 38013, 67434, 85901, 56259, 70778, 97673, 93292, 127109, 143541, 87902, -22638, 3324, 62716, 68805, 56483, 71733, 105548, 73126, 43957, -482, -42439, -31869, 46083, 37779, 11416, -32220, -25043, 39537, 42698, 35012, 71011, 2193, -44655, -15933, -22106, -14878, -46401, 24236, 36634, 22322, 96775, 139875, 83042, -7215, -59827, -41865, 10233, 22488, 594, -44408, -72046, -74949, -26977, -22354, -5767, -16258, 23448, 91930, 99175, 78560, 64525, 38224, 5546, 19095, 119779, 111694, 67582, 81463, 104082, 56452, -10693, -12208, -8442, 11211, 26245, 10870, -35742, -13852, 38153, 48966, 70016, 51981, 28111, 11522, 18631, 38082, 89798, 75069, 5552, -5677, 3203, 8892, 84914]
7875H4914j3900l7931P168J1301J900K056K6225l5429l1169L171m0008L2514r46
7862I866k8503J0109J0181o3771O6109P3516J6287l0010o2217n1072K083M867
7850d2555M4770j0115J6556L3933l1435J3447k5538m359L7844m3202k1422K8443
7838c633K9652P1595L8619o0548j8521O267l8565m5493j5942M5733J5951K285
7826B7400r915j71k5065N0347M3342j2133J2478j6827l7019J4124q134R988L9787
7813H8202l3728m8832p8241l1131K3799L7639O7992J0964o3719p8277k0995M5923
7801h0404R1299L4888n7186p3182J8845L3364J2506J3600r502m0076j0489K4499
7789d1838l3920K4956M6621J5363j3034K1284J8503n7166p6822O2845M1724J4628
$$ y = [84914, 71014, 33083, 40251, 51552, 53452, 55508, 81733, 46304, 15135, 18306, -21702, 10812, 9866, -18637, -8528, 1653, -62118, 3991, 77507, 93794, 63784, 1567, -49505, -47422, -42555, 2215, -7900, 8656, 42589, 11154, 24601, -937, -5296, 32548, -10654, -32076, -3633, 26019, 97614, 136233, 75685, 57164, 63431, 24866, -20627, -36569, 9164, 25115, 27400, 17485, 17314, -7751, 42596, 85938, 73805, 86283, 69456, 32437, 46561, 38427, 48415, 88202, 54474, 5642, -72599, -103730, -79931, -42292, 25700, 36664, -27055, -105332, -126327, -80404, 10895, 45783, -11403, -84585, -65740, -32376, -19870, -6270, -15772, -55848, -66337, -41838, -75758, -50802, -4181, 11182, -1852, 19432, 37935, -19231, -96053, -33208, 8516, 23144]
7777B3144k2228l6070P0330k159K3609K3629n0727k5221L9676P3025k0649n6840
7765C9519p4445l5560j4307N6170R722M774o7629L9742N7215k5308l1259L8179
7753c187J508N9102L7943m3086j1989n1980o0131l380Q5530L5500l6258k2223
7741a2651L8279J7073K081l7148L7342J1053K2696j1821m7725l396J3777P522
7729C7082l0985j0919K0988K0345O944n594j5992m1715k9968O1O1236j6963n6710
7716f2190m749N8588N3082j2249n4207J8729m137J9306K5095M2311K6952o3277
7704D3254j6568l3097m3262j4080R0M4576J7988J5908K656M073n9011J2280N9595
7691C4402M2689Q469k6866j0779o0447p54O530O164k4984k1779L6347L1132j3384
$$ y = [23144, 916, -35154, 35176, 33017, 56626, 80255, 29528, 4307, 43983, 117008, 96359, 39519, -34926, -70486, -84793, -28623, -18901, -14127, -81756, -42014, 15201, -10107, -41366, -3187, -1679, 57423, 95366, 52280, 40291, -11689, -71820, -75200, 10330, 45830, 9572, -12651, 25628, 42701, 44782, 7634, 44976, 56029, 78725, 66904, 19179, 15783, 29560, 37082, 6097, -4822, 16166, 36511, 43455, 37861, 21869, -19846, -49814, -49753, 11483, -5480, -62190, -66939, -8351, 44731, 32482, -21725, -2996, -7133, 12173, 37268, 79579, 106531, 43254, 26686, -6411, -49673, -63753, -63663, -19087, -1099, 14809, 17465, 21538, -37473, -25193, 34402, 77091, 85560, 58694, 47915, -12532, -13286, -6756, -592, -25576, -47355, -11008, 20124, 6740]
7678F740j8051j0620J5039j5521N182l7587O6826M1484l5224k8896l5317o473
7666e2418M4387M8609n7756l9043K638L4389j6691l622P723K6151O4582k220k5571
7653C1158p7764k7264P3505N5623P527m5839J011L5454N51j7094j2599p6665k2798
7640g5194N8331L4728k8843l2356N0698N4020M9528o7335p5596K1512J9470o0371
7628e1408n1282O9069L6784j7431J8484P357q089m7033l7792j818M9093L8045
7616C979l723l0783j5661q678K3152l3133K2309R0050m1878n4278j6467m7465
7604a12576q501K9274O1005K4627L1780j4506q6001k5303L6017M9053L8211K2581
7592D5661p39M4154j6540m7249o0519J5879O2082J2567p325p832q2742l8790J1149
$$ y = [6740, -11311, -21931, -6892, -22413, -17231, -54818, 12008, 53492, 18268, -10628, -45945, -52418, -8031, 40578, -17178, -56221, -53583, -19194, -35885, -39507, -31784, -5633, 58949, 56729, 31158, -46606, -73870, -365, 55258, 62785, 16946, 17957, 53411, 53962, 36868, 24269, -52396, -75194, -16863, 17865, -10978, -43334, 7364, 61384, 110912, 43577, -32019, -10507, 8963, -51408, -102690, -33621, 3163, -14268, 4216, 11573, 3484, -43549, -81341, -83159, -34066, 3979, 256, -30527, -46188, -54866, -31714, -64847, -42538, 47512, 5634, -48644, -65111, -112576, -121077, -91803, -30798, -6171, 25609, 11103, -74898, -100201, -64184, -15131, 23080, 45661, 44922, 89076, 72536, 25287, -35232, -19353, 42729, 55296, 47971, 40139, -42603, -81393, -70244]
7579g0244m7632o884P7849N8403l9958k1114O0579j1661k496N3920R132m668K2951
7566G8177n439j2612j6580k1241M19J4955k7073r7522J2963J3189N0796J9155
7554I187J0419J1981l2475j2927O664J3923K7870l6708n5931J1674O2436R0037
7542A06150K2408o1886L971k8739K077K4490k0776k244N491N072M9233k2999N710
7529H7958o9796k2551m4173k7291k7573O1677M703l584p862J2791J5834M9560
7517B9693K0544K7120l5876Q408K9115m247p8387m1733J989L5074k9317K4857
7505a2760J1599l7016l0966l0718m692J9377J0876k8234N6219O1017j9883J9420
7493A4239l0468m6257K8169L9301J613j6179l6477n367K7848m6372n0972N0906
$$ y = [-70244, -117876, -124760, -46911, 11492, -28466, -49580, 10999, -662, -3158, 50762, 59894, 55226, 78177, 72738, 60126, 43546, 22305, 22724, 37679, 10606, -86916, -73953, -60764, -9968, 9187, 19606, 31587, -888, -13815, -7151, 6772, 34642, -2066, -57997, -46323, 16113, 106150, 128558, 66672, 70643, 41904, 43981, 68471, 47695, 45451, 50942, 56014, 105247, 82248, 87958, 18162, -4389, -48562, -75853, -103426, -41749, -37046, -40630, -48492, -35701, -19867, 29693, 50237, 77357, 41481, 49889, 79004, 74757, -3630, -45363, -43374, -8300, -37617, -12760, -1161, -38177, -69143, -99861, -104553, -85176, -74300, -102534, -46315, 14702, -5181, 14239, -16229, -62486, -34317, 4984, 6597, -9582, -46059, -51426, -23578, -69950, -120922, -70016]
7481g0016P4344j8240l6641M956P466L4719l0534k6097J6876j4426r710N8169
7469i134N3188o219k7532j368J5738M4011j2477k4261m4570N436J7673J9263k6948
7456B800K5042j2727o645K5017K1606K4168Q295k0287J836j4912k4623n4203l2465
7443e7098j4615K4534j9798j097k251O8560K5760n2415L172j2647K0867N5917
7431C8889L7181J8413O0922m6998j13474m9827j5932N8550N4661L3042O4314m8936
7419I0805r9644o4945J3008J9466L3479K5509J2026L367l0983m1244J4823o7622
7407i1955k5181O1253N1985J3519j825N4545M5486m3047j9301m9252L5388M2186
7395G3801J9141j2547n5378J158K9700j5372J6641r6905m709M6443Q948k7751
$$ y = [-70016, 4328, -13912, -50553, -45597, -38131, -3412, -33946, -60043, -43167, -57593, -67303, -9134, 44054, 37835, 10303, 8935, 24673, 68684, 56207, 31946, -12624, -7188, 10485, 29748, 2800, 27842, 15115, 8470, 33487, 55093, 79261, 87556, 67269, 69105, 54193, 29570, -24633, -57098, -71713, -47179, -66977, -68074, -70325, -1765, 23995, -28420, -25248, -37895, -17028, 38889, 76070, 94483, 155405, 108407, -5067, -54894, -70826, -12276, 42385, 75427, 139741, 90805, -8839, -73784, -60776, -41310, -7831, 17678, 29704, 33071, 2088, -39156, -24333, -91955, -117136, -55883, -3898, 9621, 7796, 62341, 107827, 64780, 45479, -3773, 31615, 73801, 92942, 80395, 25017, 26175, 55875, 40503, 57144, -39761, -44470, 1973, 10921, -16830]
7383a6830J6567M4833P086l176j0029j8641R755J4785J0149k2047k7158O798n3080
7370d0988m8471K9115n339N0703K6161K7011l6853K522J3885N4955o977J0516
7358G6240J311n2530p1116l7430J328N0615k0970j301M5127L5709J4522n0547
7346i042L688J5603J5089N4422j5648n72K5686n1132r516j5066k950o4557m2082
7333i6077k6323N8263P3040k9707k7539N057L0126L8587J3558m8641o9518l0884
7321a10058N2565M2334n671J6105L8175M7922J1763n7524p49r436k5158K7101
7309B7369K4691L9124L5477k2136J0286m3293n812J3649l7154o9162r4784J6261
7297a05484L1286N8470M77R49k4827L3576K8473l440L6312L613l0375r9712n0576
$$ y = [-16830, -263, 44570, 51656, 48480, 38451, 19810, 29565, 44350, 54499, 32452, 5294, 12092, -40988, -89459, -60344, -65683, -14980, 11181, 38192, 1339, 3861, 17746, 72701, 65724, 76240, 77551, 25021, -46095, -83525, -82197, -31582, -52552, -53853, -8726, 26983, 41505, -9042, -5354, 10249, 25338, 79760, 64112, 63540, 89226, 38094, 28578, 13512, 10562, -53995, -96077, -122400, -64137, 8903, -20804, -48343, -43286, -13160, 25427, 38985, -9656, -79174, -110058, -57493, -15159, -20830, -4725, 33450, 81372, 93135, 35611, 34862, 25426, 268, 27369, 52060, 91184, 126661, 104525, 114811, 71518, 65706, 79355, 42201, -26961, -121745, -105484, -74198, -15728, -15251, -14302, -39129, -5553, 22920, 19480, 55792, 59405, 29030, -70682, -121258]
7284a21258K6844P4865O0529q534k8251k4684M2786o75p572M0238k2812n2815
7272b1339J6884L3341K6052l5288p6824M6984J6675q682q59K9432j1952k5404
7260a0980j9653k0220j07558l6876L0714J7732O0741R9471j0914j6169K3231j3921
7248d402O025j6058L7032k6296k4503q464M6409J7446K6493M7987n915p5393p4565
7235e4204L1169K8630j164p062j4063k6944J1701k8855L4144M4916q594k5816
7223a6142k0643M3385L4187q714o7657L429K6778j750J1169o9388J4003K9446
7211b1897m7601K3482K0824p87N0518N009l3910p565J3057O522k0094J0070o2108
7198f4480n172K2718K0430l7626O023q847R549K3317L6698J6053j5498M1411J2204
$$ y = [-121258, -94414, -19549, 40980, 32446, 4195, -20489, 22297, 21622, 14050, 54288, 31476, -21339, -4455, 28886, 54938, 19650, -57174, -10190, 6485, -2197, -3056, 26376, 14424, -10980, -30633, -50853, -158411, -195287, -164573, -146841, -86100, 13371, 2457, -13712, 9519, -4402, 1623, -14435, 22597, -3699, -28202, -36666, 9743, 27189, 53682, 101669, 95754, 20361, -54204, -23035, 5595, 4431, -2631, -16694, -43638, -31937, -60792, -26648, 18268, 9674, -16142, -36785, 6600, 40787, 32073, -35584, -32155, -5377, -7127, 4042, -65346, -51343, -21897, -69498, -46016, -25192, -25979, 24539, 29548, -4362, -11927, 1130, 7652, -12442, -2372, -64480, -69652, -46934, -26504, -64130, -58107, -66954, -57405, -34088, 2610, 18663, 3165, 44576, 56780]
7185E6780p7212k6939N420M0600m0831k0134k539O3539J07577p680m0987m3355
7173A4239J1146L0191L6424o8772j9402j9948J6699R3822J8074q1321l7263N1672
7161D5561J8155J7522k0702m9430J941l184k8644r839J7302J9444j9266J8309
7149G169L9594L0287k9331k0439L6107L0365k7813q1837k2444m595K8329M1179
7137B6571k4172m867N4608p153n0667L851j9314j3533o4610r5316M5988O8988
7125g9626j1607J0282j0018j06J0249N8684M7714P675J912j5802m6686K3098j4339
7112a8570m2245k8424N2522Q351l203O628j4443L766m5021K8019k8446k0604J3682
7099h7988K7315N8098J2822R187k4291l4640k6165K4368N896K5134N8437P447
$$ y = [56780, -20432, -47371, -41951, -1351, -42182, -62316, -64855, -1316, 106261, 98581, 57594, 14239, 25385, 55576, 92000, 23228, 3826, -16122, 577, 94399, 112473, 31152, -6111, 45561, 63716, 81238, 60536, 11106, 13047, 9863, -18781, -28620, -11318, 8126, -11140, 7169, 46763, 77050, 47719, 27280, 63387, 93752, 65939, -15898, -38342, -42937, -14608, 26571, 2399, -2468, 52140, 44987, -5680, -1829, -21143, -34676, -99286, -194602, -148614, -79626, -91233, -80951, -90969, -91075, -80826, -22142, 25572, 33247, 35159, 19357, -27329, -4231, -18570, -60815, -89239, -36717, -28366, -31569, -24941, -39384, -35618, -80639, -52620, -81066, -101670, -87988, -60673, -2575, 10247, 19434, -4857, -39497, -65662, -41294, -35398, -10264, 48173, 55620]
7087E5620n4590o284k0159K4371O8044n8234l9456J9268J3648j620l6324j0015
7075d5731K2250R424L6281j1501K0960J9600l106l9025o975J9447n5713n4961
7063h9050J939N2921M3515N7347l7607n2134n991J9405M37j4567j1475N3854p451
7050A1143n4923k9359M2402p224J9373N5797M268J5121j8088J1783j8660P446
7038C9079l8740J6705P6162r872o8122p8409j658k4331K2640J5420M0637J3762
7026C273p0242j0146J2568k1625M523N2419J8112n710k0898J3105J4589J9336
7014I304L1720j624m891l6881r881p66L5046n7537o3187k4295L9004P6904J5159
7001H075n435J9990n6287q391p424j6366J4038K2870O3883K6452k7755k8858l9106
$$ y = [55620, 1030, -5254, -25413, -1042, 67002, 8768, -30688, -11420, 2228, 608, -35716, -45731, -23481, -14057, 22224, 10723, 31683, 51283, 48177, 9152, 2177, 21624, -34089, -89050, -87111, -34190, 9325, 66672, 29065, -23069, -29060, -9655, -9218, -23785, -35260, 18594, 11143, -43780, -73139, -30737, -37961, -18588, 37209, 41477, 56598, 38510, 50293, 31633, 39079, 339, 17044, 93206, 83334, 15212, -63197, -64855, -89186, -66546, -51126, -10489, 3273, -66969, -77115, -64547, -86172, -81649, -29230, -11118, -16828, -37726, -24621, -10032, 9304, 41024, 39400, 34509, -2372, -12253, -13019, 22027, -35510, -98697, -122992, -83988, -7084, 8075, 2640, 22630, -33657, -42048, -49472, -65838, -51800, -28930, 34953, 61405, 33650, 4792, -34314]
6988c4314n0555m8006p1965L2988n859M6617O8054m318k2146K9826L4534K1138
6976d006k3254N934k6241J4320j1789k5834N1671K7889j8288m5415r402m2322
6964a06737l3209M5191K6480K5949L6407p080M9239r519j076J2175L8473m3065
6952C3228P41M840k961K9188r17k5174m4952j637k545n5637M4698K0348K403r4066
6938i2443J60R607j3722J1163J8709O675J9019o682j1044j1352J3375O0136P8854
6925H2455p549r4094l6836J9860O5054J1347r2765m3642k3326M2199N4572L9227
6913A6502J8498k5936k2254P144m684o0856K4742K8249K3076k5485o4215K1446
6901f3773J6358O9356J1371L8144J512r6688n0374j3842L483j0528K902R2939
$$ y = [-34314, -84869, -132875, -204840, -171852, -177711, -131094, -63040, -67358, -89504, -59678, -25144, -4006, -27260, -21326, -47567, -33247, -45036, -70870, -19199, 8690, -9598, -55013, -64415, -106737, -139946, -94755, -68275, -42326, -5919, -12999, 36240, 26721, 25645, 37820, 76293, 33228, 33969, 38809, 35848, 65036, 64119, 38945, -6007, -7644, -10189, -65826, -21128, -780, 1623, -92443, -92283, -82676, -96398, -85235, -66526, -59851, -40832, -47514, -58558, -69910, -56535, 3601, 82455, 74906, -19188, -56024, -36164, 28890, 40237, -52528, -96170, -119496, -77297, -22725, 16502, 35000, 9064, -13190, -6046, -10730, -71586, -46844, -18595, 4481, -21004, -85219, -63773, -47415, 21941, 33312, 71456, 72968, -23720, -74094, -87936, -84453, -94981, -92079, 860]
6889H60K153o4779N3393N9939K5453o9118o6404N074K0376j7950J0290J1828P7012
6876D8127N4407m4662n7586m335K8794M3814k4454o7051k8460K3607K2862M6773
6864D1836J1716q381l1247P403l1796k6797r298l3957l4096l696j0039O943L4902
6851h6507O7194J6811r991O071L5757K4717q824j9499M93Q081o0943m0399m7956
6838a14995Q18M2819O0204N9237J8320j5005l6289M5363n512k5525O5589m1322
6826E3702L437J6325l5268p5845j0617L0955K6956M379O8269L1340k8161l8228
6814D7244k9669Q075Q67k7176k9759M906L1718o795K4171J7316n573m1550P680
6801A455q579l9047O8112m8441q7589m2499L5051L8958J8762J5838O363K7308
$$ y = [860, 3013, -61766, -8373, 51566, 77019, 7901, -58503, -53429, -33053, -51003, -40713, -28885, 48127, 102534, 57872, 286, -4049, 24745, 68559, 44105, -22946, -51406, -27799, -4937, 41836, 53552, 45171, 13924, 21327, -10469, -37266, -46564, -80521, -114617, -118313, -128352, -121409, -86507, -19313, -2502, -12493, -6422, 29335, 54052, 45228, 25729, 26222, 34303, -26640, -67039, -114995, -114177, -71358, -11154, 48083, 66403, 51398, 15109, 60472, 54960, 29435, 95024, 53702, 57139, 73464, 38196, -37649, -48266, -17311, 9645, 14024, 82293, 113633, 85472, 47244, 17575, 25650, 26517, -659, -30418, -25512, 6206, -589, 23582, 40898, 35325, -6225, 1455, -7124, -46171, 21941, -26500, -114089, -156588, -121537, -82579, -63817, -47979, -41616, -14308]
6789a4308K8904K076l9028j5726J3338K7533k1279N2055J4092k2358l3021m2976
6777e0698r735N2567K8242l9124p824R0001r781M2483k9584q6613m1449N6132
6765e383K4389k8444K709N120J0334k7109l7649r063L838K4972N8250k7348o2668
6752f8052K3308L3257p579j7349M1418R446M776r38K2317k0847m8045q504o385
6739d3177o89p432J0193q851J4289L2899J3019K33l2888O6320m8758n9840J0345
6726e4337o163J9882J0682l4735R10M032J4609k5097J1532N5628P1234k9162l1971
6713G044K0317j5120K7004K9776o7728p1963l0697O7180J1246M227J0408M3908
6701C5602M0449m2724n2328P6840K3029o2150k2219K092j4154P3743M715m5588
$$ y = [-14308, 14596, 16672, -22356, -38082, -24744, 2789, -18490, 33565, 47657, 25299, -7722, -50698, -60433, -7866, 20376, -18748, -26572, 63429, 53648, 96131, 66547, -20066, -61515, -5383, 19006, -9438, -6729, -1609, 8725, -18384, -56033, -65096, -61258, -36286, 21964, -5384, -68052, -44744, -11487, -19066, -36415, 5003, 14449, 19225, 18287, 40604, 19757, -28288, -36792, -43177, -43866, -51298, -41105, -49956, -35667, -2768, 10251, 10484, -22404, 43916, -4842, -64682, -54337, -60500, -40618, -29936, -64671, -63761, -59729, -45120, -70217, -58685, -3057, 68177, 39015, 7044, 27361, 12241, 39245, 69021, 1293, -70670, -101367, -34187, -22941, -18714, -8306, 35602, 76051, 33327, -19001, 57839, 80868, 18718, -3501, -1409, -15563, 58180, 62895, 17307]
6689A7307l4662K1394N3876M7909l2018l5673N647r058m7329K7649Q640J4915
6677C8597o911M9181J718k1127q396j9341k6819k9435L6267M7393k954k7659m2941
6664a2427k8342m3147K9784L1971k2272m9238O1248J04470j6111n6212M57K3648
6652B3829K7953K4878l9057j16614o2112Q603P1054r101r027j0177K6124K9264
6640c4383M3667O827j1336l3933j8553J5413O1553M9304J4396l1621n6821j2496
6628g983J2589k4813k0519j6323j4089J812l1089K6981K1951J1996p374m547l6639
6615h8047J5648N8512K4306M141R725M5474K870n946k9489q9257l1193N7346L2343
6602F433o994m743M4803k9440L791m3155O617R076N2922J0690k4888J6241Q256
$$ y = [17307, -17355, 4039, 57915, 105824, 73806, 38133, 43780, 34722, -12607, 15042, 23682, 38597, 31686, 80867, 82585, 61458, 53062, 33721, 6902, -22533, 13734, 61127, 58173, 30514, -12427, -40769, -83916, -54132, -22161, -44433, -93671, -32423, 72047, 55936, -276, 181, 23829, 51782, 76660, 37603, -79011, -141123, -132520, -61466, -70567, -79594, -89771, -63647, -34383, 9284, 16111, 4775, -29158, -47711, -32298, 29255, 78559, 92955, 61334, 4513, -7983, 4606, -20207, -40726, -57049, -71138, -69326, -100415, -73434, -51483, -39487, -46861, -51408, -88047, -72399, -13887, 10419, 14560, 24285, 69759, 72629, 66683, 37194, -52063, -83256, -25910, 6433, -561, -5304, 39499, 10059, 13850, -29305, -22688, -13612, 39310, 50000, 25112, 41353, 49609]
6589D9609K4793k8587k7491J1093J05159L2260p2731n7645n6700n5209j0019R371
6577g6097N6203K0780L1016K6565o6324q6359J5009L0431K8170k8243l2566M8013
6565c3402P5851Q777o9635q597M1780K0885L2468n829k3487J2422L5051l9572
6553D6712l3810o7125m7699M6668Q9607K6187J9463l6333l7368J6749l797K7794
6541D7048l2233m1113M100K9610l3684p4149m3749Q677N8764Q4703l457m2886
6529c8369m5610l9805L0454L3995N5468L9446m2590j115l4203l1930N9889K1241
6517F871m9393k2061j7132j2943L2842O0895N0117j176n3200m7048o915L5384
6505b3759k5706L6893J0207N946k9263l3420m6625J3358J9236K2632K0243J8552
$$ y = [49609, 74402, 45815, 18324, 29417, 134576, 166836, 94105, 36460, -20240, -75449, -85468, -76097, -19894, 886, 31902, 58467, -7857, -94216, -79207, -48776, -20606, -48849, -81415, -33402, 42449, 51226, -18409, -27006, 14774, 35659, 68127, 62298, 38811, 51233, 86284, 46712, 12902, -54223, -101922, -55254, 34353, 60540, 80003, 43670, 6302, 23051, 19254, 47048, 14815, -26298, -22198, 7412, -26272, -100421, -144170, -135493, -76729, 7974, 4517, -38369, -83979, -123784, -93330, -59335, -3867, 35579, -7011, -8126, -42329, -74259, -14370, 6871, -42522, -64583, -81715, -94658, -61816, -921, 49196, 48020, -5180, -52228, -59143, -23759, -49465, -12572, -2365, 3581, -25682, -59102, -105727, -92369, -73133, -50501, -30258, -11706]
6493a1706N018K0358n0889O407J7141M00K4956K1940j08472j2102N4840L0334
6481a775l8697p294Q0112K9157k9384l2461n4488N696K8311J5655Q633j104k9607
6468b7246k1613k9971M1066N2467L9683k9697k3680q254m1793N6593L0189q670
6456B9074q470L6137N1867J4423o7683l9041K1306j6930K5666k1968m337N0947
6444G0991r71n9846k0518J5724O953P515n2620N315M7486l4116p7440K3810k6005
6431i3722k4476M196l9155N9874m2448l3092N6062Q8009L8621k6848o844P0115
6419E0292L3973o9297K4397L3731r252j2234R861P1340k0883p6866o9772m9842
6407h4552L8751J3633l5250j6545m348N7439N532l0038R519L3101k6891L92J9693
$$ y = [-11706, -6688, 13670, -37219, -30812, -13671, -13271, 11685, 33625, -74847, -86949, -32109, -1775, -40472, -47766, 32346, 61503, 32119, -342, -54830, -49134, -20823, -5168, 3465, 2361, -27246, -48859, -78830, -37764, 14703, 54386, 24689, 1009, -7245, -49038, 7555, 37744, 29074, 20604, 56741, 108608, 123031, 55348, 16307, 37613, 20683, 46349, 24381, 20044, 70991, 70020, 10174, -10344, 5380, 12333, 19848, -32772, -27457, 20029, -14087, -91527, -67717, -93722, -118198, -114002, -153157, -93283, -135731, -168823, -112761, -24752, 13869, -12979, -19823, 50292, 84265, 14968, 39365, 73096, 63844, 51610, 61471, 132811, 111928, 35062, -34710, -84552, -45801, -32168, -67418, -83963, -88311, -30872, -25340, -55378, -45859, -12758, -39649, -39257, -19564]
6394a9564k9370m5174M7574M6458j480K8652K0609o4008n3350L6740N9707k0361
6382F433K491j3481k0393M3996j2677k4313K8588J559o816K9424K6193n603M4857
6369A00258j7292n5627n8523j4340K3450k9746k4592N417M7970k105o7177L0259
6357f2048N402j8465K0250K2278O8254L5451o4243L132L8588O768k1759J1994
6345D5602M1555l3423j8530k2916k9379L7587K4966n3602n5940n582J3594j4595
6333g0663m581N5518M9149o5199j1880L6584R505L2264r0750k6556L8469O6813
6321A8673k3346n7832O755K2333l518m3365K0139R982R205j5326p4327J8172N2665
6308e9790P5768l6400n476K0040m9786J1728N0851o11j0727K25Q193r979n0190
$$ y = [-19564, -48934, -94108, -46534, -76, -1556, 27096, 47705, -16303, -69653, -32913, 26794, 6433, 8924, -4557, -24950, 19046, 6369, -17944, 10644, 12203, 5387, 34811, 61004, 55401, 100258, 82966, 27339, -31184, -45524, -22074, -51820, -76412, -70995, -23025, -25130, -92307, -62048, -56646, -75111, -54861, -32583, 35671, 71122, 6879, 10011, 48599, 55367, 33608, 45602, 87157, 53734, 35204, 12288, -17091, 20496, 45462, -8140, -64080, -69662, -56068, -70663, -75244, -19726, 29423, -35776, -47656, -11072, -1567, 30697, -60053, -86609, -48140, 18673, -4673, -62505, -55750, -33417, -36935, -80300, -60161, -50179, -40974, -56300, -130627, -112455, -59790, 15978, -20422, -25898, -5858, -55644, -43916, 6935, 6324, -4403, -4178, 4015, -5964, -56154]
6295e6154j2314L7006k260r324j2121M9176l6969k1829Q040J2507l5680r513P8420
6282a1015j2495p8024K7830K0508O9394N6882l7883k4240N8217k617K7237k2452
6270G1342r0870j3292J864l5570M2942J7440J2938J6841k3812m0872l2998M020
6258g0027M7891J9584K5364k4530j8545j1776O32K3311K0366j4972k2530o5240
6246i0472K9895k7826L4914L7335J0035L6102j4292m8281N7609N8478j8792j4267
6234E0438k2219l0107r36k8182l3308k6063M2065q141K4698m2585k2510K9300
6222f7550Q2112K4561n3235M1786N2219k2714q013k163J6848k7721J6109k8702
6210B3537p6293k7378j0170R0813R3728m799j1554p2019n205K4846m351o45P184
$$ y = [-56154, -68468, -31462, -33722, -43046, -55167, -5991, -42960, -64789, -56749, -44242, -79922, -89435, -11015, -23510, -101534, -73704, -53196, 16198, 73080, 35197, 10957, 69174, 66557, 93794, 71342, -19528, -32820, -30956, -66526, -23584, -6144, 6794, 23635, -177, -41049, -74047, -70027, -22136, -2552, 22812, -1718, -20263, -32039, -31407, -8096, 12270, -2702, -25232, -90472, -60577, -88403, -53489, -16154, -6119, 29983, 15691, -32590, 25019, 83497, 64705, 50438, 28219, -1888, -2824, -31006, -64314, -90377, -48312, -56453, -31755, -74340, -96850, -67550, 14562, 39123, -14112, 27674, 79893, 57179, 49166, 47003, 63851, 36130, 52239, 23537, -52756, -80134, -90304, 509, 94237, 89438, 77884, 5865, 660, 25506, 21155, 20510, 27694]
6197B7694n060m8781L7062M0042k9022k8014K5824j6679K8065m5590j2083M6437
6185A9895m1137p6346K3102J7539N0758L0845m0437k2620J579k3701j4250k016
6173g6789L9644Q3872N7119j9814J4126Q13o0336k9506N2668N5416k9361p0860
6161A6992j9762k5109j4573o3636j4612M7515N6350Q561m9258N9114k2911l0325
6149e1654m720k6818K7699k6444L4207P0248M7062Q1337k4202n5832q7179L377
6137a2919j2132n7713J8217J4863M5782K1537j6188L4842L8062K2232K876k6405
6125G3054K0763j6432k9266O970j935m9664k7038p788n8672N628L5032M2889K299
6112d160j0027n803l2491K1801P2502J4861K5471J0134j7132j5365j1756j2369
$$ y = [27694, 22634, -26147, 10915, 50957, 21935, -6079, 19745, 3066, 31131, -14459, -26542, 19895, -21242, -97588, -74486, -56947, -6189, 24656, -15781, -38401, -36822, -60523, -74773, -76789, -37145, 46727, 103846, 84032, 98158, 98971, 38635, 9129, 61797, 117213, 87852, 16992, -2770, -27879, -42452, -106088, -120700, -73185, -16835, -8274, -57532, 1582, -21329, -51654, -56374, -83192, -55493, -81937, -47730, 22518, 69580, 150917, 126715, 70883, -16296, -12919, -25051, -82764, -64547, -49684, -3902, 17635, 1447, 36289, 74351, 96583, 99459, 73054, 93817, 77385, 48119, 55089, 53154, 3490, -23548, -31336, -90008, -84380, -49348, -6459, -4160, -14187, -19990, -52481, -30680, 41822, 56683, 82154, 92288, 75156, 59791, 48035, 35666]
6100C5666m2063j0164n735k3595P165k3664l2466O9289J16882N3209n5555p1946
6088A7023m5945n274O6425P2075N6384j1465k0478o7268j1797k0464K7493n2515
6076D194q091M095k8324P352o560j3227N3959k6459J518N2953P1587j177m1488
6063G0332n4924k6825L3572o2655n054N1899l6415m0597K402M540K9508P4567
6051D0350J8008m0018o5835j9224j3017n963K2079k7885p777K1268J0052J3932
6039e4030j5949Q712K0814N4929L0296M3806N384j4317J1894q9699j8462j9601
6027c6223n1905K3676N1691o2108k925Q4098L4850L332k2871L258j457l3493l3133
6014d3210M2709J6835j06875K534M5760R154j3202Q612M1100O2647k494j9643
$$ y = [35666, -6397, -16561, -22296, -45891, -38726, -62390, -94856, -25567, 91315, 144524, 88969, 17023, -28922, -34196, 32229, 104304, 160688, 149223, 128745, 61477, 49680, 29216, 56709, 4194, -3897, 198, -28126, -20774, -27334, -40561, 13398, -13061, -11543, 41410, 112997, 111820, 70332, 15408, -11417, 22155, -40500, -45554, 6345, -30070, -70667, -68265, -63725, -34217, 40350, 58358, 18340, -47495, -66719, -79736, -85699, -63620, -91505, -99282, -78014, -67962, -54030, -69979, -61267, -40453, 14476, 44772, 88578, 93962, 79645, 91539, 1840, -16622, -36223, -88128, -64452, -12761, -74869, -77794, 6304, 41154, 44486, 21615, 24873, 23416, -10077, -43210, -501, 16334, -90541, -88007, -42247, -33093, -46295, -37683, 3417, 66064, 63570, 43927]
6002D3927n166R98o740k1447m9858l9682j8836J6216J0652L324p438O429O3659
5989c962K1785O978m2061K019L8380J6204m2199l7355j9324N848M3373N7376k3326
5976B3736j2425K0370l9726K8964l352k5719J1862j8169l0706l4272k6620J818
5964a04239Q7894N1620l2280q3515L4495P04n3942L9636N1247M5735K0152P676
5952F5183r699m2708j6070m3229L5051J5332r617K8537M3486l207n0152Q662m2387
5939b0818l8450J4751k7358q072L1033l0710J277j7126L4058k67L0256L7297l8090
5926c2219k8577K9048K3292p91l2200k9300m6459l4247J8352J5323N8539J8779
5914d0460p2723l9426N8741P7592O9368N272J0174k3510q11J521J1852L6561j464
$$ y = [43927, 38761, 39759, 33019, 11572, -38286, -77968, -96804, -80588, -69936, -66612, -74050, -67621, -3962, 17823, 24801, -17260, -15241, 23139, 39343, -2856, -40211, -59535, -53687, -10314, 47062, 23736, 11311, 31681, -8045, 20919, 17567, -8152, 3710, -14459, -45165, -79437, -106057, -104239, -16345, 35275, 2995, -80520, -46025, -45321, -99263, -59627, -8380, 37355, 57507, 65183, 55484, 12776, -3294, -46523, -11472, 3860, -5757, 22780, 66266, 63059, 12907, 21569, -20818, -59268, -44517, -71875, -79947, -48914, -79624, -78347, -95473, -61415, -61682, -31426, 5871, -32219, -60796, -31748, -8456, -9247, -41447, -70747, -117206, -151453, -133101, -117778, -59239, -40460, -113183, -152609, -93868, -16276, 53092, 58364, 68538, 45028, 44217, 45738, 57590, 94151, 92687]
5901I2687j177j4194j5386k3004O437k0159K4168j679m1755p4058j88M6058p014
5888b9264m8733l774O7665M7459m0709j4857L0035K2010R329K1823J3268p585
5876F6667j2622M216J5053l5748K502j0439J0939p220R204l7254K0163m775j0772
5863I914K317m6325l7291l1109N8575K7038j6097J2152J3278o4220N819O9427
5851C478N4068m626j8085n655L0135k8087l8721p3702j163R3780M5440m2859j0892
5838C111K9698j2780j777L2983m7447l1594K400m9144m0803K3517M1929K4134
5826b5773j1908k6355k6005L1068K2031R24O0854K2246q790K4813k3097k312m0703
5813c007l0806P4610R534k9115j3164j6226j5152P60Q531J1183J8090N5348q935
$$ y = [92687, 91510, 77316, 61930, 38926, 45363, 25204, 49372, 47693, 5938, -68120, -68308, -22250, -29264, -77997, -81771, -14106, 33353, -7356, -22213, 7822, 29832, 39161, 60984, 74252, 66667, 54045, 58261, 73314, 37566, 40068, 29629, 40568, 33348, 42552, 5298, 25461, 20686, 9914, 12231, -34094, -71385, -102494, -43919, -16881, -32978, -20826, -7548, -71768, -65949, 3478, 57546, 52920, 34835, 29180, 59315, 31228, -7493, -81195, -82358, 11422, 56862, 14003, 3111, 32809, 20029, 18252, 51235, 3788, -27806, -25406, -74550, -115353, -91836, -49907, -25773, -37681, -64036, -90041, -58973, -36942, -36018, 24836, 47082, 38292, 63105, 40008, 37696, -3007, -33813, 40797, 50331, 21216, 8052, -8174, -23326, -22566, -14035, -2852, 15238, 70586, 61651]
5800F1651j8204K1128L980n273k4049o2839M0566O3439j7901o0699l1373k4028
5788e3602k0456M390M8480M7766l4642k8710k907L8372N731K958J0851M2084r1986
5775c1671n4434r350K5819k839M8978N0869j7823l6360p385L4784l5079l7843
5763g2334K4464N9683N2883L3925K2397O599m2527l4276J5163Q951J6635J0330
5751A01893k7177k7130L0948M5634j3296j12848n7467J4934J5440j8265K9163
5740a8171M8627L1365o6888j2432L9040o189Q536r731N27j6174l8938N6512N2012
5727F8096J2633l0574o4559k9544q581p380m6150J8007M6125J9736L618P6278
5715E7705K9766R209m4387k0110k465l5848L2446J9576k2407J936J6218J2988
$$ y = [61651, 43447, 64575, 68555, 63282, 39233, -23606, 16960, 80399, 62498, 1799, -29574, -53602, -74058, -69668, -21188, 26578, -8064, -36774, -39681, -1309, 4422, 7380, 18231, 60315, -31671, -86105, -95455, -69636, -72475, -23497, 27372, 9549, -26811, -34196, 588, -34491, -72334, -47870, 11813, 64696, 98621, 121018, 127617, 85090, 50814, 65977, 74928, 91563, 101893, 74716, 47586, 78534, 124168, 110872, -1976, -59443, -44509, -29069, -47334, -18171, 30456, 61821, -5067, -17499, 21541, 15352, 23888, 14157, 14684, -1490, -40428, 16084, 68096, 80729, 50155, -14404, -43948, -52529, -59909, -106059, -88052, -41927, -22191, -18573, 57705, 87471, 96680, 52293, 32183, 29718, -6130, 26316, 45892, 23485, 25421, 41639, 54627]
5703E4627N5095m7312j9316n7919j5856K6129l1706k3497Q055K1501k1081j1161
5691f2441J9563J3344K4799J0855K3858j6402N3831K7173n1429m5178q788R6315
5679H5500N7703l2053n5158n18J97j4799L71k867o980J1617n8948J0692n891N6674
5665D5540O8159k9539q8017k6278K8120J3043j7549M670j9514k2506l6929k3888
5653a04688l1541J9153L2959M8196K6521J1441L6369J9433J1191k4042j00879
5642e5887p4278K7080O8753j6948O806O5742M2669Q934R664k5427n5156q786K2408
5629A5574r782l6297M749J3451q455j8419K2023j4604m681m0747k2844N5972L4172
5616i888m928O075p916L867N7134j7328j5227n8875K0199o848J8488m662p6957
$$ y = [54627, 109722, 62410, 43094, -14825, -30681, -4552, -36258, -59755, -51700, -30199, -51280, -62441, -42878, -29534, -4735, 6120, 29978, 13576, 67407, 94580, 43151, -2027, -10815, 85500, 143203, 111150, 55992, 55474, 55671, 40872, 41243, 38376, 31396, 43013, -15935, -5243, -11134, 45540, 113699, 84160, -3857, -30135, -2015, 11028, -6521, -1851, -21365, -43871, -80800, -104688, -136229, -117076, -84117, -35921, -9400, 2041, 38410, 57843, 69034, 44992, -55887, -130165, -103085, -34332, -51280, -44474, 21268, 63937, 72871, 82535, 57108, 1952, -6834, 15574, 5792, -30505, -25756, -12305, -20760, -39179, -17156, -31760, -36441, -77188, -100032, -44060, -9888, -14816, -8741, -16657, -12790, 44344, 27016, 11789, -47086, -26887, -33735, -15247, -19909, -96866]
5603i6866j7228p206m673L185J1029N8028K8116K1738L84j9910M971J3143l807
5590i096M1736l0759m3189n4413l2816p386j9052O4044K4186m9458k5004K1284
5578a19923M8545O1599J6499j6847K168k0769k9328l441M0213N6973O1266K505
5566I9460q5684Q882j645K1041k8183m2249L8863L5850j1855j030R729k8325j5981
5553a127k9383K6575k8343n8256L1469J7122P697J0158M4534P04n1073K8780j0924
5540a2067N798j5219J5243j4522p638Q184L0913N1751K436p0596K8905K4603P759
5527E5550P145O7439n5711q6110j805K9740L9329J3609m2264j6025J2268l1336
5515h171n653l8346J7768P9925O6432l8278m8709l8578q767K3748J5191j3920
$$ y = [-96866, -114094, -121300, -125973, -122788, -111759, -53731, -25615, -3877, -3493, -23403, -18432, -5289, -9096, 32640, 1881, -41308, -95721, -128537, -135923, -154975, -90931, -66745, -116203, -141207, -119923, -71378, -9779, 6720, -10127, -7959, -28728, -58056, -61497, -21284, 35689, 96955, 99460, 13776, 22658, 21013, 42054, 13871, -28378, 10485, 46335, 34480, 33450, 43179, 14854, -1127, -30510, -3935, -32278, -90534, -59065, -41943, -34246, -24088, 20446, 21150, -29923, -1143, -12067, -6269, -21488, -6245, -20767, -28405, -20221, 10692, 62443, 64879, -5717, 23188, 47791, 55550, 62695, 130134, 74423, -11687, -13492, 16248, 55577, 69186, 26922, 10897, 23165, -8171, -13824, -52170, -34402, 45523, 111955, 73677, 24968, -13610, -22377, 1371, 16562, 2642]
5503B642L1386k5169l3653K3596M0469J6889M6145j069o7383j0697l2773l5108
5491d4725J6705L2664O084j6128N7946j9299m3373n9544k8330J8033K1064L6894
5479b2009M6556k8026j7336k8523Q490L1798o9453j6153p199J5608N2484O5221
5467C1458N432j6793k4858K639j2885J3974m2344m6248R978L0868J13887l3018
5455C2090l830m5096k4777L5526N0030K9613L5171j04709n4903J7329K8863k4383
5443b9076n248K856K1460l9531L333j2082j9934j8336M943J0943L6078k4166J6824
5430e1936M8387M3570p1556l3549L4488q762m1488J7092Q2432J9701r714L2739
5418F1404J9005k6822l2102l8935m5735K9150J2671m0331n982L2280K7974k2893
$$ y = [2642, 34028, 8859, -24794, -1198, 39271, 56160, 102305, 101236, 33853, 23156, -9617, -44725, -28020, 4644, 10728, -5400, 52546, 33247, -10126, -69670, -98000, -79967, -58903, -22009, 24547, -3479, -20815, -49338, -40848, -9050, -78503, -94656, -101855, -86247, -33763, 31458, 36890, 20097, -4761, -2122, -15007, -1033, -43377, -89625, -79647, -48779, 65108, 32090, 28260, -16836, -41613, -6087, 43943, 73556, 108727, 4018, -50885, -33556, -4693, -29076, -34324, -31468, -10008, -49539, -46206, -58288, -78222, -96558, -91615, -80672, -44594, -68760, -51936, -3549, 40021, -31535, -65084, -30596, -39358, -80846, -63754, 18678, 38379, 28665, 61404, 80409, 53587, 21485, -17450, -63185, -34035, -21364, -61695, -67677, -35397, -7423, -30316]
5406c0316K0269L5987K7610m3274q4641L7695K1958N064J3810m0987r3507O2627
5394f7705M3693J857J5676O787M8553l4766j072k1848j7105k2501K109K7734K4758
5381F170Q2675Q701k1916j5917q068j8426o16L367M4366j72J3991p88m4496m5647
5367C224M8349L3841n6139n9698J8114P7022m4299j6454L7937j9903k0792k0178
5355a8976J6424L0445M9544K1500n3876o5564n148P428p615n781N306J5527M3844
5342C3058L589M908k4179q081p583M1187o857j7576m0541j1715m7026J4261O6536
5329a9N4508p661l6482P478j9575l9652j298l5M0129M9823O5647J4403j5825K24
5315A11665q1731m3072L590M1678j3341j3953m7398j7215j3941N6059P7667o319
$$ y = [-30316, -10047, 25940, 53550, 10276, -74365, -36670, -14712, -9648, 4162, -36825, -130332, -67705, -24012, -22155, -6479, 308, 48861, 14095, 13023, -8825, -25930, -48431, -46322, -18588, 6170, 88845, 97546, 75630, 59713, 51645, 33219, 32603, 35970, 80336, 80164, 94155, 93367, 48871, 3224, 51573, 85414, 29275, -30423, -12309, 64713, 20414, 3960, 41897, 21994, 1202, -18976, -2552, 27893, 77437, 98937, 45061, -20503, -25651, -18223, -25838, -31619, -26313, -10786, 33058, 36647, 41555, 17376, 9295, 1712, 42899, 36042, 18466, -22075, -33790, -80816, -66555, -19, 54489, 46828, 10346, 17824, -1751, -41403, -42701, -42736, -2607, 47216, 112863, 127266, 111441, 111665, 29934, -13138, -9548, 32130, 18789, 4836, -42562, -59777, -73718, -17659, 60008, 53689]
5303E3689q043J305p734m9615j8750k410M5157J5099p185m7806j07392J0851J9299
5290a03535m1983K8053N0749L5308J2114K6812N6621Q3257j9068m3127l3337k7006
5278B4858J6330k8287m6736n3617J0815L2035r923m1485o868L5734K8420O7274
5266B8550K7747L9586K6481l7008l0976J5641k790j5239m6630j5848J7089J8657
5254B5260l8930J6020j0842j0010m3055k4479M19P7450M4723L7020p8582m9090
5242e4096K0794L6420N029j5486j3915l7068k4389L8806K292l6170K0743Q893
5230d8147M0140L4132k1759J3553l2333l8984K7242j1912m9209p8913K1178M1920
5218a03092N1576O6982N2119j5126l3480M725j2357j0648p237m6921K5974J8605
$$ y = [53689, 45646, 46951, 39217, -10398, -29148, -31558, 13599, 28698, 21513, -26293, -133685, -122834, -103535, -145518, -117465, -66716, -31408, -19294, 7518, 64139, 147396, 128328, 85201, 51864, 24858, 41188, 12901, -33835, -87452, -76637, -44602, -54525, -96010, -102878, -67144, -38724, 28550, 56297, 95883, 122364, 85356, 54380, 70021, 67231, 51992, 5362, -10486, 6603, 25260, -13670, 2350, -8492, -18502, -61557, -86036, -85617, -8167, 36556, 73576, -5006, -54096, -33302, 3118, 8147, -7339, -21254, -58322, -82711, -43905, -41613, -77783, -57040, -48147, -8007, 26125, 4366, 17919, -14414, -53398, -26156, -38068, -87277, -166190, -145012, -103092, -51516, 15466, 67585, 52459, 18979, 23704, 11347, 699, -6538, -53459, -27485, -8880]
5206h880K1542j1098M9337J14445l4714n9491l3467o5509J3423p21Q751N4888
5194D8506k457n2943k8988J3038O887K6714m0102l2184k812j7657l1644j4956
5182a28598N3379L6843j6259L2306L1897k4478K710K2706J1970J2112n1698j2294
5170b9404J7416L4418o18q032j1359N0111q835p6657q0979J8881j2542O710l8207
5157a39097J2455N5880P6422j9753M4067N4488n2437P033j7968l2909P189k5983
5145c0613L4639N2145n123R951l9739n1258j529l7830j5897J7735J0038j109N6173
5132b417K7258k4829N5424k1371l0486K1737j2438r371l5589O851J6570L7612
5120B8951r595k8708r03N7856M1992O158M612k3779o7392m4886J9319P8470l2490
$$ y = [-8880, 12662, 1564, 50901, 165346, 130632, 71141, 37674, -27835, -14412, -15133, -6382, 48506, 46049, -6894, -35882, -22844, -15957, 10757, -29345, -61529, -64341, -81998, -113642, -128598, -75219, -38376, -54635, -22329, 9568, -14910, -12200, 10506, 22476, 34588, -17110, -29404, -11988, 22430, 21812, 13780, 2421, 52532, 43697, -32960, -113939, -95058, -107600, -100890, -139097, -126642, -70762, 5660, -14093, 29974, 84462, 32025, 39058, 21090, -11819, -4630, -30613, 4026, 56171, 51048, 60999, 21260, -29998, -31527, -69357, -85254, -67519, -57481, -58590, -2417, 24841, 12, 55436, 34065, 3579, 25316, 12878, 3507, -32082, -25231, -8661, 28951, 19356, -9352, -10255, 47601, 89593, 95751, 100363, 76584, 9192, -35694, -16375, 62095, 29605]
5107B9605n3205j3083K0093M4400j9723m7376J4186L7947K4694l9486p6820m435
5095h3203M2269O809q009L1794k5920K421P391l3581J6619K9936N7950j413l0699
5082A2364r314L5182Q277J0873k356j7855l3736R439K1039L6197m0974m1288K9969
5069A7817P439l6926q222L1134L2529j6701L2705k3779M853N9280M373K6674p150
5056A24026l1865k9339k8832k8011q680m222j1559P032O5791L694n9549K4927
5044B3413K210o6048r985O7103L1253J5309J020l9894o4986L6063J5219n4091
5032d3414O3284M9658r5956J9619q7572p3090L048J0328K7652P5599j073J3345
5020c8572q848J3052j7591R41J0779K2420o01K3167P2437r519k6240m5109k7183
$$ y = [29605, -23600, -36683, -16590, 27810, 8087, -39289, -25103, 12844, 37538, -1948, -78768, -83203, -40934, -34125, -42134, -10340, -36260, -33839, -26448, -60029, -43410, -13474, 44476, 43063, 12364, 3050, 38232, 46509, 57382, 55026, 37171, 3435, 12874, 33913, 70110, 29136, -12152, 17817, 25256, -11670, -19892, 11242, 43771, 27070, 59775, 35996, 40849, 100129, 104502, 131176, 124026, 92161, 62822, 33990, 5979, -2701, -6923, -18482, -11450, 54341, 58035, -1514, 23413, 25623, -40425, -50410, 16693, 47946, 63255, 64275, 24381, -40605, -4542, 10677, -43414, 19870, 69528, -26428, -6809, -94381, -167471, -164423, -154095, -126443, -50844, -51917, -38572, -47420, -34368, -51959, -51018, -40239, -17819, -18420, 4747, 77184, 67665, 41425, -3684, -30867]
5007c0867O2491N2793M120K6127j17209n9980L9692M8539N062j0721O3073K4488
4995A07608K177m5884k2339j4499m5910M486L2726m6613M7490N8198j2489l0630
4983C4321k5959m9208K0184O5908J8381m0744L8095L120n5449m998J05l5233j0485
4970d1962M3024O2280l2968p909j9106k3837O0377N4828O977m422M205q4102p5510
4957e8125k9221J4627J5882O5643N1609M6500o048O669K5660p7124l0195p088
4945A8789k6504Q972k6241n6600k9133k3921l309M3318M3270N1800J6180k4550
4933g929m7259o8838J166r982N014O2052M0780P7346K2832k1235p3380l7078M3946
4920a2565O8227J7395k497k3398l7654o030p460J3625M6914n760J8595K8315m747
$$ y = [-30867, 31624, 84417, 88537, 114664, -2545, -62525, -22833, 25706, 30768, 20047, 83120, 107608, 109785, 63901, 41562, 27063, -18847, -14361, 18365, -28248, 19242, 77440, 64951, 34321, 8362, -40846, -20662, 45246, 63627, 22883, 60978, 64098, 8649, 3651, 3756, -31477, -41962, 1062, 63342, 30374, 22465, 3359, -20478, 39899, 94727, 101704, 97282, 101487, 17385, -58125, -87346, -72719, -56837, 8806, 60415, 106915, 100867, 107536, 133196, 56072, 25877, 18789, -7715, 1257, -24984, -81584, -110717, -134638, -137947, -94629, -51359, 441, 16621, -7929, -55188, -124026, -122860, -132842, -127828, -65776, -24996, 52350, 75182, 53947, -19433, -56511, -12565, 55662, 73057, 70560, 47162, 9508, 3478, -3982, 9643, 56557, 50797, 69392, 97707, 92960]
4907I2960k1449o762k7087p9684k8590O5914K8268m9118n280P641L4487M1197
4895E2497m769n6789n2929L3769P2995O306K1530Q918p527m0593n9959k2051M015
4882d4587m3308m244Q1743N5209o300J7228J8141j3527m4210K3587j437k8378
4870I917l380M0418N5082l0155k3117m5884O792J1890j1552L2108l5688j5998
4858i567N541O216k619o650k8418J7035P8963j2324j4113J1395L0833j4965J9536
4845H0863n3791j1614j5736K9558O2446n3044m2290L5184k137o7987m7517K5239
4833f0826M6291j113M3280K5001k1637k1408m3653k1139j4710j6585n8023l3555
4821a78077J974L7093L8339L6078j164n0739j9236K8296J1013P3897J3317m2006
$$ y = [92960, 71511, 64749, 37662, -42022, -70612, -4698, 23570, -25548, -30828, -23187, 11300, 52497, 47728, -9061, -61990, -28221, 44774, 51080, 72610, 81528, 74001, 33408, -26551, -48602, -44587, -87895, -92139, -10396, 44813, 38513, 55741, 73882, 60355, 16145, 39732, 38295, 9917, 6537, 46955, 102037, 71882, 48765, 2881, 9673, 21563, 10011, 42119, 6431, -9567, -4026, 2190, -429, -7079, -35497, -18462, 60501, 48177, 34064, 45459, 76292, 61327, 80863, 27072, 15458, -278, 29280, 91726, 38682, -3608, 31576, 29439, -38548, -86065, -60826, -14535, -15648, 27632, 52633, 30996, 9588, -34065, -55204, -69914, -86499, -144522, -178077, -176103, -139010, -100671, -64593, -65757, -116496, -135732, -107436, -96423, -22526, -9209, -51215]
4809e1215K5871J327o3224m4736p259J0505K8226K4672J9781M0170K0447O4295
4797F8860L5333l674j3142k2080n6631l9970M8528M4869M4140j4203k4889l037
4785F4104J620p7318k6741j0792L5688r671J367N3258m9299J1572L8314q032J7372
4772D1442J162J0319Q23p858J2257l1982j2865P961l7043j2183J5334J3722m141
4759c052J1238N7616L085o276j8681k9347K268K7796k9667N262j3975m1337L3491
4746a579k3531J5518M3037J3784m211o784J178n4430J1385J1374k7880k6717J8390
4733c0466N0901R043J4581M5837k17j8262p0097l2280L0695j9146j7158l230J1094
4720b8705k9868J765O9998L0242n4844j3271k4260o647K1586j5911j5513Q150
$$ y = [-51215, -25344, -24017, -87241, -131977, -139236, -128731, -100505, -75833, -56052, -15882, 4565, 68860, 104193, 100519, 87377, 65297, 8666, -31304, 17224, 62093, 106233, 92030, 67141, 64104, 65724, -11594, -38335, -49127, -13439, -23110, -21743, 31515, -17784, -6212, 32102, 24070, 41442, 42604, 52923, 53746, 45888, 58145, 26163, 13298, 21259, -15784, -27967, -12633, 1089, -3052, 8186, 65802, 68887, 62611, 43930, 14583, 16851, 44647, 14980, 20242, 6267, -35070, -1579, -25110, -9592, 33445, 47229, 43018, 36234, 37412, -17018, -5633, 5741, -22139, -48856, -30466, 20435, 29478, 44059, 89896, 89679, 71417, 1320, -30960, -265, -19411, -36569, -39799, -28705, -58573, -56808, 13190, 43432, -11412, -24683, -48943, -55590, -34004, -49915, -65428, -57278]
4708e7278L1633j997L933j7691p458j7693m643o343N6445M221j7985p986j4624
4695e7466J0448M6304J2982K993J937k5707l813J1458L2686L3792M6370n9162
4683E2822p3897K2174K9469L035J2183K0027J9580J1540m0280j4086J3225p5764
4671a9972o255l1640M4735q168K6935l5845m0176J7316l795m0111J6415K2491
4659e8070j168L1877M0479k2669k1811k5764m6400r616M7242p848k4173M6325
4647e1596J09796K0332K502J2557j3475j3770l234j0596K0244m2640l7842K9057
4635B1335L6075k7784l370j2727j8177n6542l3544L6090k3163k135Q999M9775
4623b5168N7404M4012j7346j9146m0566j9911J1652K6340K231J4185j7729K6134
$$ y = [-57278, -25645, -27642, -23709, -41400, -48858, -66551, -71194, -77537, -21092, -16871, -34856, -42842, -57466, -47018, -714, 12268, 15261, 17198, -8509, -12322, -864, 31822, 65614, 111984, 52822, -21075, 1099, 30568, 33603, 45786, 65813, 85393, 96933, 56653, 42567, 55792, -19972, -26227, -57867, -13132, -21300, 5635, -30210, -70386, -53070, -56865, -96976, -80561, -58070, -59238, -27361, 13118, -9551, -31362, -57126, -103526, -113142, -65900, -73748, -97921, -51596, 58200, 78532, 81034, 93591, 80116, 66346, 63112, 52516, 72760, 30120, -7722, 21335, 57410, 29626, 26256, 13529, -4648, -61190, -94734, -58644, -81807, -83942, -74943, -25168, 32236, 76248, 58902, 39756, -810, -20721, -9069, 17271, 19502, 33687, 15958, 42092]
4611D2092K1064N698L967l5048j03923q575K6484l783l8947K3700n611K184n4387
4598a25085k8981J00855O6409r213K2850K9726J0436Q137m7125l7419l7255j90
4586d6855O7157O0397K2003k4296j6825j1040M0184j2439m2994j1803N0446L2064
4574A05999k0594n2009K8272M8511q209K024j9415o7284j10698l2036K2742L8646
4562f4051K5677l5474J7471n393l2627P1297j7411K9361J5526r377j076n2132
4550e8209K1542O6741J9232j1276K5121k3827o1843K0558K7938M395q930l2572
4538a1130j2236L9153r442q325j1492k17j2543J1663l658M3680K4506k4317J18
4525B5760m9819L2393K3500n3585l1261p314K7949m731n5075J4584L0994J59q389
$$ y = [42092, 63156, 68854, 72821, 37773, -66150, -74725, -48241, -52024, -90971, -67271, -72882, -70698, -125085, -154066, -53211, 13198, 3985, 26835, 56561, 66997, 75134, 28009, -9410, -46665, -46855, 20302, 80699, 102702, 78406, 61581, 50541, 90725, 78286, 35292, 23489, 73935, 105999, 85405, 33396, 61668, 110179, 101970, 103994, 84579, 17295, -93403, -125439, -102697, -64051, -38374, -73848, -56377, -61770, -94397, -23100, -40511, -11150, 4376, -5001, -6077, -58209, -36667, 30074, 49306, 38030, 63151, 39324, -22519, -1961, 25977, 30372, 21442, -11130, -23366, 15787, 6345, -1980, -13472, -13689, -26232, -14569, -18227, 25453, 49959, 25642, 25760, -24059, 8334, 31834, -21751, -53012, -60326, -32377, -37108, -92183, -77599, -46605, -46446, -54835]
4512e4835M4043R1726M1866l2661m742k0506k0409J4600j3193K940n9757l4276
4500d5204Q45M7675M3135j1161K2276J615k1999p554r397O843N377n1103j2329
4487c0981l6287Q0835m8344m5232L6584k3754j751N4528j4373o2158Q073M9489
4475c3371j3739m5146J2010J5640k3433J6062M7552K4880j5605N29l671n2735
4463g1027o1499q364M0891j4086K5540K6845L0700r073l0030K1516J9162J1702
4451a7723j3161o0487m424m608J0050M5251O1465M7588j2406j5576o1606k9063
4439e4700M71K7911r216k6106j1118j083L5807M1625P740j8315n351J1840k4976
4426b5471K3551O846k6831J0319L4752M102P709k5355l1697k693N3530M1632K1813
$$ y = [-54835, -10792, 80934, 122800, 90139, 85397, 64891, 44482, 59082, 45889, 48829, -10928, -45204, -44359, 3316, 46451, 35290, 57566, 59181, 37182, 29628, 20231, 27074, 32451, -18652, -30981, -67268, 13567, -34777, -80009, -43425, -67179, -68930, -14402, -28775, -90933, -82860, -33371, -47110, -92256, -80246, -64606, -88039, -71977, -24425, 455, -15150, -14621, -18292, -71027, -132526, -140890, -99999, -114085, -88545, -61700, -31000, -40073, -70103, -48587, -29425, -17723, -30884, -91371, -95795, -100403, -90353, -45102, 16363, 63951, 51545, 35969, -25637, -54700, -54229, -26318, -35534, -61640, -72758, -73841, -38034, 3591, 11331, -6984, -12335, -495, -25471, -1920, 4926, -21905, -11586, 23166, 27268, 34977, 9622, -22075, -24768, 28762, 70394, 92207]
4413I2207k282P371J769l2285p8471l8761M4844J6895J4964L6918j922R523J3165
4400H3935j297l5263m5770m342l869L1074p433n0601k9011J1281J4046J6121J2308
4387h821J2575j4785K3038L5879J1074n2804P364n5155Q856j7016J4861K2124
4375a2810K1551m642j5903n911K2093m0273o0306P3396r25m067L4464R974k1778
4362e137K2179J691j9215l9151L28L834l0557m613L7132J9170k4052j7731J3245
4349d2877K438k72k6347J6272M6835K2274l4917m6309K7456N1476J6414R410M324
4336D6177k9533j0372k2836m6626K6567J9888Q500J6205l345j0730m0039p465
4324e3609M0073L4295k1299p67n9603L0462M2608j5199K470P0268j1229n3522
$$ y = [92207, 89925, 97296, 99065, 66780, -11691, -50452, -5608, 11287, 26251, 63169, 61247, 70770, 83935, 82638, 47375, 1605, -2737, -6606, 24468, 17035, -33566, -62577, -51296, -37250, -21129, -8821, 3754, -11031, 12007, 47886, 58960, 6156, 13520, -41635, -32779, -49795, -34934, -12810, 8741, 4099, -11804, -17715, 4378, -35895, -96201, -22805, -23730, -27797, 6667, 16641, -5137, 17042, 18733, -482, -39633, -39305, -35471, -66028, -70641, -33509, -14339, -38391, -56122, -42877, -40439, -40711, -67058, -50786, -3951, 18323, -16594, -62903, -35447, 16029, 32443, 41853, 46177, 16644, 6272, -16564, -63190, -36623, -16735, -8235, 7970, 4625, -6105, -46144, -53609, -13536, 20759, -540, -1307, -60910, -30448, 12160, -3039, -569, 69699, 58470, 4948]
4312D948J4731P024j5201k712j8958J9730O842l481l5309l8741L3357N517p901
4299c0154j7972J1958M9194N976J2646N8779k0477J0029J3164P01j1745k30N504
4286H7373r6596l9620j3781k921j1612J9703J0161M4355k9806K1963r244L4471
4274A4446M8388m7925q6330j2818Q7871K4215o470M6612l2716n7076j1166R642
4262b3327L8587L1639l3945q0859o1690M0428k7286Q604K4363m008L2769J9199
4250c5526L9276J3958L0610K0745j0594l2288k0927K1611j6535j857m284j0157
4238e968M6461l9787m4993M2149R823l3398j1658L9506o8946k8506J07990P2745
4226H5418L922k183L414j225l3983l6864K2595l217l6231m3414M7844J3168l272
$$ y = [4948, 19679, 26703, 11502, 8790, -10168, 9562, 16404, 12923, -22386, -61127, -27770, -22253, -30154, -48126, -36168, 13026, 19002, 31648, 90427, 69950, 79979, 93143, 93844, 82099, 81869, 87373, -9223, -48843, -62624, -65545, -77157, -57454, -47293, -2938, -32744, -10781, -20025, 14446, 62834, 14909, -71421, -84239, 3632, 27847, 21377, 67989, 35273, -21803, -32969, -23327, 15260, 46899, 12954, -67905, -129595, -89167, -116453, -107849, -83486, -87494, -54725, -35526, 3750, 17708, 48318, 69063, 58469, 26181, 5254, 26865, 10330, 8473, 4189, -5968, 40493, 706, -44287, -2138, 7685, -25713, -37371, 2135, -66811, -95317, 12673, 85418, 89340, 87157, 90571, 89346, 55363, 18499, 41094, 37877, 1646, -41768, 6076, 19244, 15972]
4213A5972n020J846j2622L0210N6220l3863n3767J3795M0092k8711J5614K2445
4201F2211k2990K2739m3159j5108M4315J6276l2132k2795J5662M6745K5738n4848
4189D2654l0445R837l2774k62l9160L9902M7299l4952j8337k4252L1881P3226
4177F4617L6863J7475p039q2828n7216L387Q6021L4696j5148j6109n7190M9486
4165E7015k86J7976k4508K1453J0927m8830l1949o0823l1830k7809o316P2347
4153e2633L7923l1265P705J1643k3009n6389L3420o432J1493M3786P3144N3192
4141A02578J7464N442m7062n6300k4937J9532M973j9624M3356l4007l2385p734
4129b8704j6746k0947q9j7807K2217Q1446O2752J4919n8327n3384n1372J8734
$$ y = [15972, 10952, 12798, 176, 30386, 86606, 52743, -1024, 12771, 52863, 24152, 39766, 62211, 39221, 61960, 18801, 3693, 48008, 64284, 32152, 9357, 25019, 71764, 97502, 42654, 12209, 22046, -10728, -10990, -50150, -10248, 37051, 2099, -16238, -40490, -8609, 64617, 101480, 118955, 111916, 29088, -28128, -24741, 61280, 95976, 80828, 64719, 7529, 57015, 56729, 74705, 50197, 71650, 82577, 33747, 1798, -59025, -90855, -118664, -124980, -52633, -14710, -45975, -38270, -26627, -49636, -106025, -72605, -79037, -67544, -23758, 49386, 102578, 120042, 125484, 78422, 22122, -2815, 16717, 21690, 2066, 45422, 11415, -20970, -28704, -45450, -66397, -66486, -84293, -62076, 19370, 82122, 97041, 38714, -14670, -66042, -47308]
4117d7308M1263K6665m2627m7085J3235P3171M0588L971l9720P495M081k984p24
4104C0021n1884J2797O8309j0579n5612m0224l6686J0662j6508j8236l7774J2539
4092a33175m495k6828L3161Q7929j0460p80o102K042K7184J0215J9447J5440n979
4079G599K8416k8410J3674n1667k4852O1784j6288l1837L8167J668m3274J3053
4067c1967P9283l4832L4648N3322o1744l8382o128L2774L589k6458M464k4087
4055a5518j3066K8272Q359l1098M4363L0297p9978O515M1656m8519m4001k4785
4043i7503J0680K6568N4008P2387k3662l0846j3933K763j8413N910K0709L6120
4031D4788o189k8575l5856m1946M46K6493n600j6854J4340j4422L2498J09873
$$ y = [-47308, -6045, 20620, -22007, -69092, -55857, 17314, 57902, 61873, 22153, 29648, 33729, 30745, 30021, -21863, -9066, 59243, 48664, -6948, -47172, -83858, -73196, -89704, -107940, -145714, -133175, -137670, -164498, -131337, -43408, -53868, -54648, -60750, -58708, -31524, -21309, -1862, 13578, 7599, 36015, 7605, 21279, -30388, -55240, 6544, -9744, -41581, -3414, -1746, -45020, -31967, 47316, 12484, 47132, 100454, 38710, 328, -5800, 26974, 30563, 4105, 8569, -15518, -28584, -312, 8047, -23051, 21312, 51609, -28369, -21854, 19802, -28717, -72718, -97503, -86823, -60255, -6247, 66140, 42478, 11632, -2301, 462, -17951, -12041, 8668, 44788, 38599, 10024, -25832, -67778, -67332, -40839, -46439, -63293, -48953, -63375, -30877, 78996]
4019G8996L4272l6664L026K818M250n2561l8202L5249m5497k732K0460O4037q754
4006E8698l2287k2838k6577N943K5509o602J3523l4098K6589n9226Q3591O830
3994C9055k3579k2359N0101j8911k903K5043m2225K7937j1086j4648L4310j2491
3982B8244l5136J8203k1081m4346l856M8540K8840j9923q155R1889J7788n6462
3970D4545l217r026O6348M04L3336k0635q1080l5444k8327k6759L8471N147l9650
3957e5887M9189M6054K6992k8071j1065L569k6832p070J5214J4580P1063K270
3945A00006n3523j2943L0796K8233l5679J0823O2494m2911P08j3414k2580L0886
3933H2896m8163o564k1261o016k219l0699J1862L3184O6427R020o2347J2298n5241
$$ y = [78996, 113268, 76604, 79630, 82448, 86698, 34137, -4065, 31184, -14313, -17045, 3415, 67452, 58698, 26411, 3573, -23004, -17061, 8448, 1846, 15369, -18729, 7860, -51366, 32225, 39055, 15476, -6883, 43218, 24307, 21404, 46447, 4222, 32159, 21073, 6425, 40735, 28244, -6892, 11311, -9770, -54116, -57972, -9432, 19408, -515, -8670, 83219, 101007, 44545, 41328, 32302, 98650, 99054, 132390, 111755, 30675, -4769, -33096, -59855, -21384, -16237, -55887, -6698, 39356, 66348, 38277, 27212, 30781, 3949, -3121, 12093, 26673, 97736, 100006, 46483, 33540, 64336, 92569, 56890, 67713, 130207, 87296, 88004, 74590, 52010, 82896, 34733, 28169, 6908, 892, -1327, -32026, -20164, 13020, 79447, 88467, 26120, 38418, -16823]
3920a6823m609J0009M8380L2690j24154k1262N6412O7144O1275j4869k2404l6908
3908C4881j6364k6998j7693o25L5899m9413K7810K9843M6167k0057j3005k3519
3896F926K3467K0817M8j3605k2302n0334l0640L3110o77m7983N571J8719o234
3883f3117K035M9850Q9699m956l7022p496L1379n9827J2728P3764K2396o5626
3871D3807r3729n028L3999J8441k7056j8281o2848j018N5601K8710O6162K4964
3859F3724n2851n0253l4950K779l27n1364N4328P205L0908K6024l2086j136j173
3846c9172k8467N6612m3488n834l5192K3376r996j1312N3667k5435m7679M5747
3834f7173P0783m0067j1568j9018K6228J0798j145N7842M5176k7728l8665j1786
$$ y = [-16823, -21432, -11423, 36957, 69647, -54507, -75769, -19357, 47787, 109062, 94193, 71789, 34881, 18517, -8481, -26174, -26799, 9100, -40313, -12503, 17340, 63507, 43450, 30445, 6926, 30393, 51210, 51258, 37653, 15351, -34983, -65623, -32513, -33190, -81173, -75602, -56883, -63117, -61082, -11232, 78467, 73511, 36489, 28993, 60372, 545, 13273, 87037, 109433, 43807, -49922, -54950, -20951, -2510, -29566, -47847, -110695, -111713, -56112, -27402, 38760, 63724, 10873, -39380, -74330, -71551, -71878, -123242, -68914, -61709, -30801, -4777, -36863, -37999, -39172, -67639, -11027, -54515, -60349, -95541, -72165, -82161, -93473, -39806, -65241, -112920, -67173, 3610, -36457, -48025, -67043, -40815, -30017, -31162, 26680, 71856, 44128, 5463, -6323]
3822f323M835o0772j4055O516M9528M6179n2754M451L7151K2880L8786L6362o901
3809A05883k9275q7807M5543K0155N530q2644k9706J4472J8864L048M0017P619
3797C1699J5357L035j4551K913K2393K7540n9024j6862J5412k3050P353Q4572
3785I6787M1968j9328j6638p1280l9356J6556O1997q0687j2217P6179J5212J5731
3773H4924l9532n805K4925J0908k8675l1330p078m8437J7266P0200j0066j9087
3761A8213L9687M0659m3901o7653l4795O480J7588K4208j2257j0823J4008L7216
3749B8630j4741p8342j0987L3513P7863M8345p280m4048r2092o0588k7715P069
3737a40373L1942J3285K2737M3686Q5407N0335l9354m2886K1012k3050n0224q882
$$ y = [-6323, -1488, -62260, -76315, -69799, -20271, 25908, -26846, -22395, 14756, 37636, 76422, 112784, 105883, 76608, -11199, 34344, 54499, 60029, -22615, -52321, -37849, -18985, -15937, 24080, 31699, 47056, 50091, 35540, 38453, 60846, 88386, 29362, 12500, 27912, 4862, 12215, 96787, 138755, 119427, 102789, 31509, -7847, 8709, 70706, -9981, -22198, 53981, 69193, 84924, 45392, 39587, 64512, 75420, 46745, 15415, 8337, -40100, -22834, 47366, 37300, 18213, 57900, 98559, 54658, -12995, -47790, -41310, -23722, 486, -11771, -22594, -8586, 28630, 13889, -64453, -75440, -41927, 35936, 84281, 77001, 32953, -59139, -119727, -147442, -140373, -108431, -95146, -72409, -28723, 56684, 107019, 67665, 24779, 45791, 22741, -27483, -36365]
3725c6365M4325M1429J2665K0420K3690R947q691p8190K1629l6946j9912J0636
3713D637J5888J3558K2871L6579K3895K8020j9150j4067k5170l9562L8822m4333
3701D1988n2638j0218J0962J5580L0726m433O2297L597p4364p1525K0200M8076
3689B0248n1571j7098N8510J9647k0720k411J328J4997N2549N6284j4565R260
3677A26458j1628j5243J6416m0159k9504p5731l2547m003K583N0366L3311l5383
3665a5064n875k810k7631O4437K4334n1258l6999M5083K4034K9766l012m3205
3653A800o721o0065L4458M5475L2564L1958j1577n3552K0095K0194q719J1722
3641E7632K992n5173L9598J7065M3480o2774k2708l2469p0514k2880K5782K9061
$$ y = [-36365, 7960, 49389, 62054, 82474, 106164, 116111, 107420, 29230, 50859, 13913, -5999, 4637, 20525, 34083, 56954, 93533, 117428, 145448, 126298, 112231, 87061, 47499, 86321, 41988, -10650, -20868, -9906, 5674, 36400, 31967, 94264, 97861, 23497, -48028, -27828, 20248, -31323, -48421, 10089, 29736, 9016, 6605, 7933, 22930, 75479, 131763, 117198, 126458, 114830, 99587, 116003, 75844, 46340, -29391, -61938, -65941, -63358, -12992, 20319, -15064, -20939, -23749, -51380, 13057, 37391, -13867, -50866, -5783, 18251, 48017, 45005, 1800, -4921, -64986, -30528, 14947, 47511, 79469, 67892, 14340, 34435, 54629, 45910, 57632, 60624, 5451, 45049, 62114, 105594, 42820, 20112, -12357, -82871, -105751, -79969, -50908]
3629e0908J7206k2026o856K6517L1256M3510j0880k1587J1166K477K4042L4256
3617G8173j772n4253k2236o6315K3665O1799Q9826l8471q0632j9900M4096K0092
3605C4072j1888K1357j605k7870k9753L4663k41l8525N0517m5587l228J5053j874
3592d909J0080O2817j0469n8460L3L4184O3150k9721n1526n0798j6306N5858M0366
3579D4299n4175J6824J4098j3720m467J1065r225P928k0138J1754M9694L7261
3567I1198m0992m8339o3809J4450N1444O4136J4085k4717n8409j2510k2750m4496
3555h0709J8652J48L9140Q474k3437K8600r788K9408m8376n5449r725m244L4446
3542g2860n946K6292o793j8396j8344M9205P6233K289L353K5635L0486P634m0867
$$ y = [-50908, -33702, -55728, -62584, -36067, -4811, 38699, 27819, 6232, 17398, 19875, 43917, 78173, 76401, 22148, -88, -66403, -42738, 19061, 108887, 70416, -10216, -30116, 13980, 34072, 22184, 43541, 41936, 14066, -15687, 18976, 18735, -19790, 30727, -14860, -18088, -3035, -4909, 5171, 67988, 57519, -941, -908, 33276, 96426, 66705, 15179, -35619, -51925, 3933, 44299, -9876, 6948, 21046, 7326, 2859, 13924, 4699, 12627, -7511, 4243, 53937, 91198, 50206, 1867, -61942, -47492, 3952, 68088, 82173, 57456, -953, -13463, -36213, -80709, -62057, -61909, -22769, -14295, -37732, -9132, -18920, 10488, -37888, -93337, -103062, -107306, -72860, -78806, -52514, -59307, -77703, -96047, -46842, 29391, 31680, 35033, 60668, 91154, 98788, 57921]
3529E7921n6879m014L77p7197j797k5782L8534J2168n465J5440j5319j7346L0470
3516d8889K3139l0604j4486Q0084j152n8583l6429L7147N2577L5571j6839l1584
3504a0048o942j2139m1856l6926Q0282R0663N639m0948l1336k0445k6958j7118
3492f8132n780R15J4567q70K1339m777L884K2016L7990L43Q721m494j6102J5416
3478B5036j2850M4959M9032m1399o8661K2744l648n83n6429l9406N8718M9515
3466B7028J4701l8062l4929K316Q496l5126m4235o7500J0876K6247Q3474N3184
3454F470k1539l8008J767J654r948J4310R287k3671k5286K6133Q3745L3286k1632
3441C6568q621K1242L2571j1962j1298P559n107M148p1112l490J9706j2670m4192
$$ y = [57921, 1042, -2972, -2595, -79792, -81589, -107371, -68837, -56669, -62134, -46694, -62013, -79359, -48889, -25750, -56354, -70840, 9244, 8092, -50491, -86920, -49773, 2804, 38375, 21536, -10048, -16990, -29129, -70985, -107911, -27629, 63034, 68673, 27725, -3611, -24056, -51014, -68132, -73912, -72997, -58430, -59300, -37961, -42738, -38854, -16838, 21152, 21495, 30216, 25722, 9620, 25036, 12186, 57145, 106177, 64778, -3883, 18861, 15213, 14630, -41799, -81205, -22487, 27028, 41729, 3667, -31262, -28946, -20450, -55576, -99811, -167311, -156435, -130188, -46714, 6470, -15069, -53077, -51310, -49656, -59604, -45294, -36007, -59678, -84964, -58831, 24914, 58200, 36568, 27947, 49189, 81760, 69798, 58500, 66059, 60952, 65100, -6012, -9502, 10204, -2466, -46658]
3428d6658J5298L5772K134j778J4962o562p4582M686M3547m910l9700J5027j1062
3415e3826j2819L7503N0186K6794l5817l1416q4314n2007K5457N0158J8120N1515
3403a0466O9807M2536m487k8450o1132J479L1387m6657K9697J3346J7871k7276
3391B7655l0642L7697J7413n7542j3129J8712M2642n2180K8875P6444k2420o7278
$$ y = [-46658, -31360, 4412, 6546, 4768, 19730, 13168, -61414, -56728, -13181, -18091, -57791, -42764, -53826, -66645, -29142, 21044, 47838, 12021, -19395, -103709, -155716, -130259, -80101, -61981, -10466, 59341, 101877, 97390, 68940, 7808, 9287, 40674, -5983, 23714, 37060, 54931, 27655, -2987, 34710, 52123, -5419, -18548, 164, 42806, -9374, 19501, 95945, 73525, 6247]
$$ [...]
##END NTUPLES=NMR SPECTRUM
##END=
