##TITLE=Analysis number 320914
Compound Code mo 07809
Project Code adrs
Chemist Name fudan
##JCAMPDX= 6.0         $$ Bruker NMR JCAMP-DX V2.0
##DATA TYPE= NMR SPECTRUM
##DATA CLASS= NTUPLES
##ORIGIN= Bruker BioSpin GmbH
##OWNER= nmr
$$ XWIN-NMR		Version 3.5
$$ Tue Jul 18 08:46:28 2006 GMT Daylight Time (UT+1h)  MAYBRIDGE\nmr@NMR_250MHZ
##.OBSERVE FREQUENCY= 250.131544655141
##.OBSERVE NUCLEUS= ^1H
##.ACQUISITION MODE= SIMULTANEOUS (DQD)
##.ACQUISITION SCHEME= undefined
##.AVERAGES= 16
##.DIGITISER RES= 18
##SPECTROMETER/DATA SYSTEM= dpx250
##.PULSE SEQUENCE= zg30
##.SOLVENT NAME= DMSO
##.SHIFT REFERENCE= (INTERNAL, DMSO, 0, 16.522)
##AUDIT TRAIL= $$ (NUMBER, WHEN, WHO, WHERE, WHAT)
$$ ##TITLE= Audit trail, XWIN-NMR		Version 3.5
$$ ##JCAMPDX= 5.01
$$ ##ORIGIN= Bruker BioSpin GmbH
$$ ##OWNER= nmr
$$ C:\u/data/dgb/nmr/ADRS/2870/pdata/1/auditp.txt
$$ ##AUDIT TRAIL=  $$ (NUMBER, WHEN, WHO, WHERE, WHAT)
(   1,<2006-07-18 08:46:03.19 +100>,<MAYBRIDGE\nmr>,<NMR_250MHZ>,
      <created by zg, POWCHK disabled, PULCHK disabled
       configuration hash MD5:
       E2 DF 36 D8 04 B2 41 60 5A D7 A3 38 5A 4B D0 FE
       data hash MD5: 64K
       A7 8D 1C FB 4C 5E 44 E1 B4 27 D7 8B 8B DE 9E E3>)
(   2,<2006-07-18 08:46:16.87 +100>,<MAYBRIDGE\nmr>,<NMR_250MHZ>,
      <Start of raw data processing
       ef LB = 0.3 FT_mod = 6 PKNL = 1 SI = 32K 
       data hash MD5: 32K
       6E 8C EF 40 FA C0 25 53 87 5C 98 BF 9D 2B 1A 24>)
(   3,<2006-07-18 08:46:18.44 +100>,<MAYBRIDGE\nmr>,<NMR_250MHZ>,
      <apk 
       data hash MD5: 32K
       CC 31 C8 5B 93 E1 3F 4E 71 20 5F 3C 26 05 CB 69>)
(   4,<2006-07-18 08:46:19.19 +100>,<MAYBRIDGE\nmr>,<NMR_250MHZ>,
      <abs ABSG = 5 
       data hash MD5: 32K
       DB 1E 7F 8A C9 63 32 AA D4 2E D3 1B 5A B6 3A 68>)
$$ ##END=
$$ 
$$ hash MD5
$$ 02 C9 22 AD 6E 33 AC 64 DB B8 28 DF B5 73 24 11
##$RELAX= 
##$RELAX= 
##$RELAX= 
##$RELAX= 
##$RELAX= 
##$RELAX= 
##$RELAX= 
$$ Bruker specific parameters
$$ --------------------------
##$DU= <C:\u>
##$EXPNO= 2870
##$NAME= <ADRS>
##$PROCNO= 1
##$TYPE= <nmr>
##$USER= <dgb>
##$AMP= (0..31)
100 100 100 100 100 100 100 100 100 100 100 100 100 100 100 100 100 100 
100 100 100 100 100 100 100 100 100 100 100 100 100 100 
##$AQSEQ= 0
##$AQ_mod= 3
##$AUNM= <au_zg>
##$AUTOPOS= <1 >
##$BF1= 250.13
##$BF2= 250.13
##$BF3= 250.13
##$BF4= 250.13
##$BF5= 500.13
##$BF6= 500.13
##$BF7= 500.13
##$BF8= 500.13
##$BYTORDA= 1
##$CFDGTYP= 0
##$CFRGTYP= 5
##$CHEMSTR= <none>
##$CNST= (0..31)
1 1 145 1 1 1 1 1 1 1 1 1 1 1 1 1 1 1 1 1 1 1 1 1 1 1 1 1 1 1 1 1 
##$CPDPRG= <>
##$CPDPRG1= <>
##$CPDPRG2= <>
##$CPDPRG3= <>
##$CPDPRG4= <mlev>
##$CPDPRG5= <mlev>
##$CPDPRG6= <mlev>
##$CPDPRG7= <mlev>
##$CPDPRG8= <mlev>
##$CPDPRGB= <>
##$CPDPRGT= <>
##$D= (0..31)
0 1 0 0 0 0 0 0 0 0.06 0 0 0 0 0 0 0.0002 0 0 0 0 0 0 0 0 0 0 0 0 0 0 
0 
##$DATE= 1153208762
##$DBL= (0..7)
120 120 120 120 120 120 120 120 
##$DBP= (0..7)
150 150 150 150 150 150 150 150 
##$DBP07= 0
##$DBPNAM0= <>
##$DBPNAM1= <>
##$DBPNAM2= <>
##$DBPNAM3= <>
$$ [...]
##$SUBNAM7= <"">
##$SUBNAM8= <"">
##$SUBNAM9= <"">
##$SW= 20.6930455092707
##$SWIBOX= (0..15)
0 0 3 0 0 0 0 0 0 0 0 0 0 0 0 0 
##$SW_h= 5175.983436853
##$TD= 65536
##$TD0= 1
##$TE= 295.16
##$TE2= 300
##$TE3= 300
##$TEG= 300
##$TL= (0..7)
0 120 120 120 120 120 120 120 
##$TP= (0..7)
150 150 150 150 150 150 150 150 
##$TP07= 0
##$TPNAME0= <>
##$TPNAME1= <>
##$TPNAME2= <>
##$TPNAME3= <>
##$TPNAME4= <>
##$TPNAME5= <>
##$TPNAME6= <>
##$TPNAME7= <>
##$TPOAL= (0..7)
0.5 0.5 0.5 0.5 0.5 0.5 0.5 0.5 
##$TPOFFS= (0..7)
0 0 0 0 0 0 0 0 
##$TUNHIN= 0
##$TUNHOUT= 0
##$TUNXOUT= 0
##$USERA1= <user>
##$USERA2= <user>
##$USERA3= <user>
##$USERA4= <user>
##$USERA5= <user>
##$V9= 5
##$VALIST= <valist>
##$VCLIST= <CCCCCCCCCCCCCCC>
##$VD= 0
##$VDLIST= <DDDDDDDDDDDDDDD>
##$VPLIST= <PPPPPPPPPPPPPPP>
##$VTLIST= <TTTTTTTTTTTTTTT>
##$WBST= 1024
##$WBSW= 4
##$XGAIN= (0..3)
0 0 0 0 
##$XL= 0
##$YL= 0
##$YMAX_a= 261273
##$YMIN_a= -448583
##$ZGOPTNS= <>
##$ZL1= 120
##$ZL2= 120
##$ZL3= 120
##$ZL4= 120
##$ABSF1= 16.522
##$ABSF2= -4.171173
##$ABSG= 5
##$ABSL= 3
##$ALPHA= 0
##$AQORDER= 0
##$ASSFAC= 0
##$ASSFACI= 0
##$ASSFACX= 0
##$ASSWID= 0
##$AUNMP= <proc_1d>
##$AZFE= 0.1
##$AZFW= 0.1
##$BCFW= 0
##$BC_mod= 0
##$BYTORDP= 0
##$COROFFS= 0
##$CY= 12.5
##$DATMOD= 1
##$DC= 0
##$DFILT= <>
##$DTYPP= 0
##$F1P= 14.0000005364418
##$F2P= -0.99999901652339
##$FCOR= 0.5
##$FTSIZE= 32768
##$FT_mod= 6
##$GAMMA= 0
##$GB= 0
##$INTBC= 1
##$INTSCL= 1
##$ISEN= 128
##$LB= 0.3
##$LEV0= 0
##$LPBIN= 0
##$MAXI= 10000
##$MC2= 0
##$MEAN= 0
##$ME_mod= 0
##$MI= 0
##$NCOEF= 0
##$NC_proc= -4
##$NLEV= 6
##$NOISF1= 0
##$NOISF2= 0
##$NSP= 0
##$NTH_PI= 0
##$NZP= 0
##$OFFSET= 16.522
##$PC= 1
##$PHC0= 163.1847
##$PHC1= 6.118388
##$PH_mod= 1
##$PKNL= yes
##$PPARMOD= 0
##$PSCAL= 4
##$PSIGN= 0
##$REVERSE= no
##$SF= 250.13
##$SI= 32768
##$SIGF1= 0
##$SIGF2= 0
##$SINO= 400
##$SIOLD= 32768
##$SREGLST= <1H.DMSO>
##$SSB= 0
##$STSI= 32768
##$STSR= 0
##$SW_p= 5175.98343685301
##$SYMM= 0
##$S_DEV= 0
##$TDeff= 65536
##$TDoff= 0
##$TI= <Analysis number 999999
Compound Code 99
Book Reference 9
Project Code 9>
##$TILT= no
##$TM1= 0
##$TM2= 0
##$TOPLEV= 0
##$USERP1= <user>
##$USERP2= <user>
##$USERP3= <user>
##$USERP4= <user>
##$USERP5= <user>
##$WDW= 1
##$XDIM= 32768
##$YMAX_p= 370962253
##$YMIN_p= -508188
$$ End of Bruker specific parameters
$$ ---------------------------------
##NTUPLES= NMR SPECTRUM
##VAR_NAME=  FREQUENCY,     SPECTRUM/REAL,   SPECTRUM/IMAG
##SYMBOL=    X,             R,               I
##VAR_TYPE=  INDEPENDENT,   DEPENDENT,       DEPENDENT
##VAR_FORM=  AFFN,          ASDF,            ASDF
##VAR_DIM=   32768,         32768,           32768
##UNITS=     HZ,            ARBITRARY UNITS, ARBITRARY UNITS
##FACTOR=    0.157963299565203, 1,           1
##FIRST=     4132.6476996994, 0,             0
##LAST=      -1043.33573715361, 0,           0
##MIN=       -1043.33573715361, -508188,     0
##MAX=       4132.6476996994, 370962253,     0
$$ Real data points
##PAGE= N=1
##DATA TABLE= (X++(R..R)), XYDATA
$$ [...]
17234H6163j6263L6572J1648n4476L0499n2456m2147R263K9635P0641K5886J82682
17222C17647n0898j35994j06184L1111j5538K3752N1392J2965l7064j4159k8357
17211D8673m9040J8175O4112R2370j5366r2519j02044r5674J3271J21423P3743
17200G7124l5815n5931j9885R3862r1903O9767N9433q785n5630o8709J6424J7731
17188b317L3386R9074J6598N5348j55440l3189J04981J6714n1650j922Q6389n424
17176A62548j2405q0214J68704K50430o4620k46032k6249L1906n5616J7097Q6945
17165B32494L3774M8126K8233P8012J18360k9127n9309j10280q6460r985m7977
17154A95861K5271n277m8619k1196L8183J9469K0984l0004j22260R7471L0170
$$ plain form
17234 86163 69900 106472 118120 63644 94143 41687 -460 8803 38438 109079 134965 317647
17222 317647 266749 130755 24571 55682 40144 63896 115288 128253 91189 77030 48673
17211 48673 -367 17808 81920 174290 158924 66405 -35639 -131313 -118042 3381 77124
17200 77124 41309 -14622 -34507 59355 -32548 37219 96652 87867 32237 -36472 -20048 -2317
17188 -2317 31069 130143 146741 202089 46649 13460 118441 135155 83505 81583 167972 162548
17176 162548 150143 69929 238633 489063 424443 178411 152162 184068 128452 145549 232494
17165 232494 266268 314394 342627 420639 538999 509872 450563 340283 253823 243838 195861
17154 195861 221132 215855 167236 146040 184223 203692 224676 194672 72412 169883 200053
17143B00053l8213p9885j23451j9159P0524P8557P4705N4128j23838j91642n6264
17132a54485J76779L7481l1957q6919m7326K0069M1069R04k5026L4959j4018O4198
17120A5728J31116R8377L7830M507n2293q1628k3904n719M0356o297q4152n0646
17108B3275k6394l6070M1274J07129k475j8745m9280j59309q7740J63870J67967
17097A23502m9565j3212n9853k6360N5221L9491L5734k9906j3420k4274k5700
17086A1658O9348j1952m0160l087n1602m3346R0451J08978j68783j07370n9837
17075b05702p6571l3093J09676K04840N6561L9743j5516j8501p8091R0595J04235
17064A78176k8868j11784j13084n7398J92836q6340n4466J24583k900l2017m0260
$$ plain form
17143 200053 161840 81955 -41496 -60655 9869 88426 163131 217259 93421 -98221 -154485
17132 -154485 22294 59775 27818 -59101 -106427 -86358 -45289 -44385 -69411 -34452 -48470 15728
17120 15728 146844 245221 283051 287558 235265 153637 129733 124014 164370 158073 73921 23275
17108 23275 -3119 -39189 2085 109214 106739 87994 38714 -120595 -208335 -44465 123502
17097 123502 73937 60725 872 -25488 29733 69224 104958 75052 61632 37358 11658
17086 11658 81006 69054 28894 25807 -25795 -69141 21310 130288 -38495 -145865 -205702
17075 -205702 -282273 -315366 -205690 -850 55711 95454 79938 61437 -16654 73941 178176
17064 178176 149308 37524 -75560 -132958 59878 -26462 -80928 43655 40755 8738 -31522
17053c1522O7280J21636m1814j1924q244n463l791J5115m9372k8201j03332l307
17041h2939N6543r4880L9061Q1418J5242L5986l3031J9522O4328l8890K0124O9774
17029A52258m6222N9284J02778Q5342r0014k6737N1855k596J9144n2518l6057
17018B16517k2914J30634q001m7387p7619n9711q42m3188j1803P6964j5452j23518
17006A3680r934K8380L0944r1184M8079O0130K4094K2202j19966J07111N6852
16995A70388o5572p8661J2902J43748N5070j04792j00497m0458p8235K5384J56417
16984I5694k2312L4281K6152L5143M3482P8499q8636q4638R8745r2731J9042P0357
16972B13078j6933o5206j3158O7492Q2651J5444n8088n1862r1809N9864K9408
$$ plain form
17053 -31522 35758 157394 115580 103656 95412 89949 86158 101273 51901 23700 -79632 -82939
17041 -82939 -26396 -121276 -82215 -797 14445 50431 17400 36922 101250 62360 82484 152258
17029 152258 106036 165320 268098 353440 263426 236689 288544 285948 305092 252574 216517
17018 216517 193603 324237 316236 268849 191230 131519 130677 87489 75686 152650 137198 13680
17006 13680 3746 32126 63070 -28114 19965 80095 104189 126391 6425 113536 170388
16995 170388 104816 26155 39057 182805 237875 133083 32586 -7872 -86107 -60723 95694
16984 95694 73382 107663 133815 168958 212440 290939 202303 117665 216410 123679 142721 213078
16972 213078 196145 130939 117781 185273 267924 283368 225280 173418 81609 141473 170881
16961A70881M7091K4670J4511L8333O895j27448K1098Q2195N281j2160j2223R4089
16949C53213M9241m1958J6743n7869J70463K09662J0392l8942Q0449O7640n3970
16938G65064L8015R0864J00088j55087r2635m7331p1964R1257J34553R6255O8325
16927A017404J78894J34023K02405J50038R1961K83456M96635M64699M27153N67875
16917D014543R91133J431916J838770K287183K492795K989759L761855M044802
16909B3852756L315909K725765K374601J847725P18837n85829j189573k376147
16901C0684044l406516l158612k409437j997234j504442n76951L95824J218267
16893A9244943J936537K616133L272055K884060K136014J788651J183583K40234
$$ plain form
16961 170881 217972 242642 257153 295486 302381 174933 196031 278226 283507 271347 259124 353213
16949 353213 402454 360496 377239 319370 489833 699495 709887 670945 751394 819034 765064
16938 765064 803079 893943 994031 838944 746309 698978 627014 718271 852824 949079 1017404
16927 1017404 1196298 1330321 1532726 1682764 1774725 2058181 2554816 3019515 3446668 4014543
16917 4014543 5005676 6437592 8276362 10563545 13056340 16046099 19807954 23852756
16909 23852756 27168665 29894430 32269031 34116756 34835593 34249764 33060191 30684044
16901 30684044 27277528 24118916 21709479 19712245 18207803 17630852 18026676 19244943
16893 19244943 21181480 23797613 27069668 29953728 32089742 33878393 35061976 35302210
16885C5302210q68908j459339k560445l778441l859011l268478k793285k591526
16877A4122777k115561j551193j215487o84205m01323l90430k76425k21033k11722
16868G055398p2397P3339Q6443K62583N34489R46503J345925J720539K146420
16859A4099242K655994L195139L725702L533572K629825K122509J859656Q72732
16851C4694371k47494r27485j814722l106133l378309k707179k110747j681511
16843A8720791r50452N7770Q20066J401565K225822K895813L024160K153641J682293
16834C2031469J483721P49444m70558j165176j937156l410693l969588l481852
16826A9829611k939717k524097k227520j855874j298084r26661q16131n79397
$$ plain form
16885 35302210 34433302 32973963 30413518 26635077 22776066 19507588 16714303 14122777
16877 14122777 12007216 10456023 9240536 8556331 8155008 7764578 7488153 7267120 7055398
16868 7055398 6983001 7056340 7142783 7405366 7939855 8886358 10232283 11952822 14099242
16859 14099242 16755236 19950375 23676077 27209649 29839474 31961983 33821639 34694371
16851 34694371 34446877 33519392 31704670 28598537 25220228 22513049 20402302 18720791
16843 18720791 17770339 17828109 18648175 20049740 22275562 25171375 28195535 30349176 32031469
16834 32031469 33515190 34264634 33794076 32628900 30691744 27281051 23311463 19829611
16826 19829611 16889894 14365797 12138277 10282403 8984319 8057658 7241527 6662130
16818F662130l20184l92648m39407k82254k68389k36709k95047k94537j57753
16809C975202j46824j71892p1113j02573q5210j73795o3642j18215j41312k80770
16799B619856j40695N2444l6355j04142j35725j55899q3836L4541O5822l3042
16789B082969j98415l2274L9927J4033o25p2167p935j33098p9734q4937r5473
16778A432271l9218k174j38668j50450j95627L9839J35501k4063m9442N3747l0657
16767A031059j13371L6840L3970o9736K3909K6128j30642j0805R3272P2914j44280
16756H49258p5005j45164p7819R7090J06802q7417q6578K6034K8810r555J23357
16745G49813J12096m7685j10648j19669k5807q649J8439N9109j42860p2099O3571
$$ plain form
16818 6662130 6341946 5949298 5509891 5227637 4959248 4722539 4427492 4132955 3975202
16809 3975202 3828378 3656486 3585373 3482800 3397590 3223795 3160153 3041938 2900626 2619856
16799 2619856 2479161 2531605 2495250 2391108 2255383 2099484 2015648 2050189 2116011 2082969
16789 2082969 1884554 1852280 1892207 1906240 1905615 1833448 1825513 1692415 1612681 1527744 1432271
16778 1432271 1393053 1390879 1252211 1101761 906134 945973 1081474 1057411 1007969 1061716 1031059
16767 1031059 917688 954528 988498 918762 942671 968799 838157 827352 920624 993538 849258
16756 849258 774253 629089 551270 648360 755162 667745 581167 607201 636011 626456 749813
16745 749813 861909 814224 703576 583907 558100 549451 567890 626999 484139 412040 475611
16734D75611N2119j36759j1699L6334o6382j4722p417j2504j613L4667p1136k7979
16722B48520J09534N8366P8258J827j46218j98224L4943J58238q759K50Q198p9434
16710B65499j01356O6840J1241l5291P5646J9342J842J311m8588k0022j23973
16699A12491l1880l3719Q1990p8071N1289M4286J8676j5054q8787o0616l1423
16688c0818R4011Q7788J3982j49146q5767K3470L3949L2224K34451k8846M1265
16677B66563J2301n5523L432q5763P9386k6189k14261j5433Q4350m4318j41772
16666a37227L5175J17586L5898P3193L8771l5058n5858L6036n4289R549p2012
16655h236Q0906Q3749p9688r0009o372P5636L8048P0362p3808l1895N104N6949
$$ plain form
16734 475611 527730 390971 379272 415606 349224 334502 327085 314581 312968 347635 276499 248520
16722 248520 358054 416420 494678 496505 350287 152063 187006 345244 336485 336735 344933 265499
16710 265499 164143 230983 242224 206933 282579 301921 303763 305074 256486 236464 112491
16699 112491 80611 46892 128882 50811 102100 146386 165062 150008 61221 605 -30818
16688 -30818 63193 150981 164963 15817 -69950 -46480 -12531 19693 254144 225298 266563
16677 266563 278864 223341 226773 141010 220396 194207 -20054 -35487 48863 4545 -137227
16666 -137227 -102052 15534 51432 124625 163396 128338 72480 108516 54227 63776 -8236
16655 -8236 72670 156419 76731 -13278 -19650 55986 94034 164396 90588 58693 63797 120746
16643A20746k3619m5337r2569k0068J29409N2995o4073n0458L6806R751n0246
16632C337J00634M0517k4375p1236K1542J84183o1027j07747o7057L09R64m9481
16620b9437k3331q3075L8504J20792R1063N6058K979J1768J200p1645m6646J5616
16608H3846r423j8347J7408l8018N1122k7991k8508M7503m122m5835k0946j6464
16596i775p252l9106k6882J8164O2787o9904l5053K6568M2546Q9230N8844K554
16584A12721l4832j34718O6149J91868L5404o0960p7238j21044n9495j19592Q4778
16573a16959J17214M7189R0849k9439r5615J8880m9493O9344J4862q9109j0267
16562c2544O403J18425j2852M5109K8813k3630r7029n545j40363l4469Q5495M0417
$$ plain form
16643 120746 97127 51790 -40779 -60847 68562 121557 57484 7026 43832 53583 3337
16632 3337 103971 144488 120113 48877 70419 254602 193575 85828 18771 19080 20044 -29437
16620 -29437 -52768 -135843 -97339 23453 114516 170574 173553 185321 186521 114876 68230 83846
16608 83846 74423 56076 73484 35466 86588 58597 30089 77592 73470 27635 6689 -9775
16596 -9775 -17027 -56133 -83015 -64851 -2064 -71968 -107021 -80453 -37907 51323 110167 112721
16584 112721 77889 -56829 9320 201188 236592 175632 98394 -22650 -82145 -201737 -116959
16573 -116959 255 47444 138293 108854 13239 32119 -17374 51970 66832 -22277 -32544
16562 -32544 -26141 92284 79432 124541 153354 129724 32695 27150 -113213 -147682 -62187 -21770
16550b1770J3794N0204m9695O4240j50497j04555r289J29286Q636j05678K9439
16539a45885N3383m1020q710R9356J34826M2698o1893q1888q4467P434K45500
16528A59334M0894n4225j73180l3021L4803N2696j42968j09655J78758J72769
16518A26205m1125j9176k295r3731l2360Q6157L6707p4645r5128k792Q4672J7991
16506i520r4157O7895N6640J7001n1272M0135M7838j8960k0183K9391n0521j07248
16494i2961J6286J3670J5512L1860j1280r5137p31j5648l4448J01102J58283k6478
16482F0030m440n2081l2277K1842K7701L9833j2891o0278r8693M5732j2027m5234
16470a22783l1317n692K3515j2210J04914o4880J979m8152p1831N3291L3793O5555
$$ plain form
16550 -21770 -7976 42228 -7467 56773 -93724 -198279 -207568 -78282 -69646 -175324 -145885
16539 -145885 -92502 -133522 -142232 -42876 91950 134648 72755 -9133 -93600 -86166 159334
16528 159334 200228 146003 -27177 -60198 -25395 27301 -115667 -225322 -46564 126205
16518 126205 85080 65904 63609 -30122 -62482 23675 60382 -14263 -109391 -112183 -27511 -9520
16506 -9520 -103677 -35782 20858 37859 -13413 26722 74560 55600 35417 64808 14287 -92961
16494 -92961 -76675 -63005 -47493 -15633 -26913 -122050 -122781 -138429 -172877 -71775 86508 60030
16482 60030 55590 3509 -28768 -6926 20775 60608 47717 -12561 -111254 -65522 -77549 -122783
16470 -122783 -154100 -159792 -136277 -148487 -43573 -108453 -106474 -154626 -226457 -173166 -139373 -73818
16458g3818o343K3198J00999o6382j71577m94j1038P9546m6252J5231J11262Q3120
16446C7452j03582q3218K717k122p2532m2741P4957K2151P2358R1184k9928L1586
16434a718N0435j5383R496J45824j6739j00311o3807N7657o0926K0465J2417j13853
16422g6443p2763j8043j4519J7808M0402J9722Q1166q7512j38112J10034j164
16411a39424P2729K9406J6728r569P8937N3023m4582q2095m691O100J8877m0155
16399d4716O4374R3453q6659M066Q0369m1580k6701m1545l567J0553j9684m0184
16387e1821O0761O7662L2488r0087j6538r9964Q0395J07202n5341K5058P4383
16376A34198J3453j5049l5204K6103O2916q1849p046o4447M9457O4675N0433J00675
$$ plain form
16458 -73818 -80161 -56963 44036 -22346 -193923 -194417 -205455 -125909 -172161 -156930 -45668 37452
16446 37452 -66130 -149348 -146631 -148753 -221285 -264026 -189069 -166918 -94560 -3376 -33304 -1718
16434 -1718 48717 33334 42830 188654 171915 71604 7797 65454 4528 24993 37410 -76443
16422 -76443 -149206 -167249 -181768 -163960 -123558 -103836 -22670 -110182 -248294 -138260 -139424
16411 -139424 -66695 -37289 -20561 -30130 48807 101830 57248 -24847 -29538 -23438 -4561 -44716
16399 -44716 19658 113111 26452 30518 110887 69307 42606 1061 -2506 8047 -11637 -51821
16387 -51821 8940 76602 109090 19003 2465 -97499 -17104 90098 34757 59815 134198
16376 134198 147651 132602 97398 123501 186417 104568 97522 33075 82532 147207 197640 298315
16364B98315k5773j15149N721j35896r9417k3135J21160N0007j34806j58105l9720
16353b56798Q7307R1974J02871q3578J2225K3087P499O4417L4340J38874n1354
16342A70864j41278M9093m7769P5870R1085J1035j4361l0880j04976O8098O1457
16331A88238K0517P6792P5269j75195j67971j29822P4176J77608L7478l8937K1123
16320A59276k20384K3552J26248P609M1209p2365l5143o8388N8706k5131M4614
16309C9803k6005j2680k0997N3999J09276L9579k2932l8929q2228J1386j00538
16298e0266q7047m2664p8395n111J22188J68889R712Q5050n8891l6026J8978j8281
16286B8136P7811l8072o0413M204P6588J8646N3504M3476k4636j69024M4143R210
$$ plain form
16364 298315 272542 157393 163114 27218 -72199 -95334 25826 75833 -58973 -217078 -256798
16353 -256798 -169491 -77517 25354 -58224 -45999 -22912 -15413 49004 83344 222218 170864
16342 170864 29586 78679 30910 106780 197865 208900 194539 163659 58683 126781 188238
16331 188238 208755 285547 360816 185621 17650 -112172 -37996 139612 177090 138153 159276
16320 159276 -61108 -37556 88692 96301 137510 65145 30002 -38386 20320 -4811 39803
16309 39803 13798 1118 -19879 34120 143396 182975 160043 121114 38886 50272 -50266
16298 -50266 -137313 -179977 -258372 -263483 -141295 27594 37306 122356 63465 27439 46417 28136
16286 28136 105947 67875 7462 11666 88254 106900 160404 203880 179244 10220 54363 63573
16274F3573K2184k2766n2925r538J0112R130q1106k3597M5501R2410j6603K1942
16262E8317m8486q9091o1610j23271Q7013K4334J5525R7634K9337n7311j6371
16251h3980J09230P9183J1665j72658p5235R1986J24518N3641M2603n0251k9048
16240A01654O1041j2870r5796j7750n6628l0262N5515j7465j07846M4792P8203
16229B588j9513m2878P981M5684q0119l5506Q2182Q6828M3257o6981n6661J5110
16217a8028O8060p7478m8752P5966J28136K4354l2871p0159m6666q1221k8890
16206a07549K4245J2343n3278j11283J3435J03433J1478k4836N1122N9650M6257
16195B5017J11703r870o7554M3104o6657l6288j9795J8291o3174J13763O8534
$$ plain form
16274 63573 85757 62991 10066 528 10640 19770 -61336 -84933 -39432 52978 36375 58317
16262 58317 9831 -79260 -140870 -264141 -177128 -152794 -137269 -39635 -10298 -67609 -83980
16251 -83980 25250 104433 116098 -56560 -131795 -39809 84709 138350 180953 130702 101654
16240 101654 162695 149825 54029 36279 -20349 -50611 4904 -12561 -120407 -75615 2588
16229 2588 -16925 -59803 -51822 -6138 -86257 -121763 -39581 47247 90504 23523 -33138 -18028
16217 -18028 50032 -27446 -76198 -232 127904 152258 119387 49228 2562 -78659 -107549
16206 -107549 -83304 -70961 -124239 -235522 -222087 -118654 -107176 -132012 -80890 -21240 25017
16195 25017 136720 126850 59296 102400 35743 -545 -20340 -2049 -65223 48540 117074
16184A17074j77703O3300L6212p3631J05293O3492N1226l6192j26531o9595K2199
16173b4856O9579o3874p9902N9256J1366l5289n6205J17188P6729J4110o8266
16162A9836m8495k5745l831J6194J15802R376J3674j08780k9761M3288j7984J0204
16150f222Q5477K4665L2834j3019O3900j8142j30737m6415N2050j24110p7541
16139a57260M0232M5937Q0831L3782l3663j1752P0083N4094O2461m6758r8348
16128C9639j35521r5685l6607P4103m553R1624K8055M9004O0445m1573p893J9713
16116D0751O984n2919M6718K0861j3194n8667l29j67160K2715j1264n0884L1395
16104a84993P3261P0438K1638J1091K1027p8619o2988J23145P160j01964j7833
$$ plain form
16184 117074 -60629 2671 38883 -34748 70545 134037 185263 149071 22540 -47055 -24856
16173 -24856 44723 -19151 -99053 -39797 -28431 -63720 -119925 -2737 73992 88102 19836
16162 19836 -28659 -54404 -58235 -42041 73761 83137 96811 -11969 -41730 1558 -16426 -6222
16150 -6222 79255 103920 136754 123735 187635 169493 38756 -7659 44391 -79719 -157260
16139 -157260 -117028 -71091 9740 43522 9859 -1893 68190 122284 184745 137987 39639
16128 39639 -95882 -191567 -228174 -154071 -158624 -67000 -38945 10059 70504 28931 21038 40751
16116 40751 47735 -5184 41534 62395 49201 -9466 -9795 -176955 -154240 -165504 -216388 -184993
16104 -184993 -111732 -41294 -19656 -8565 12462 -66157 -129145 -6000 1160 -100804 -118637
16093a18637n6168L090m9451N4074O4881J00821l1916o3713r6432J01320J25922
16082C3791k2321P5755l9404N897o6322j18566j9215j3061M5942R2642J58405
16071A33543j3117j46137j29738O751m02M1204m5045J9428J07524l2959J32221
16060G3273Q5910o6775r3838M530L6654r7216O5200p6926j3567K4495p8198J17032
16048a9426J39719p7505p0992Q3480n8047o1018r6666j5800m0610N8378O9496
16037h8991K6926M322n0854J16599r932j05953j02466o1102O4302m462P5256P4804
16025f1551j19734k7159J31289P3337M4979M6074j138j33168r6207P7612L6611
16014b9055J8792J12913j91m877j07227j8221j07681k6284J0754J6233P6310j0978
$$ plain form
16093 -118637 -174805 -171715 -221166 -167092 -102211 -1390 -33306 -97019 -193451 -92131 33791
16082 33791 11470 87225 47821 53718 -12604 -131170 -150385 -163446 -117504 -24862 133543
16071 133543 120426 -25711 -155449 -148698 -149100 -107896 -152941 -133513 -25989 -58948 73273
16060 73273 159183 92408 -1430 3100 39754 -57462 7738 -69188 -82755 -58260 -136458 -19426
16048 -19426 120293 42788 -28204 55276 -2771 -63789 -160455 -176255 -216865 -158487 -88991
16037 -88991 -62065 -57743 -108597 8002 -1930 -107883 -210349 -271451 -207149 -211611 -136355 -61551
16025 -61551 -181285 -208444 -77155 -3818 41161 87235 86097 -47071 -143278 -65666 -29055
16014 -29055 -10263 102650 102459 97582 -9645 -27866 -135547 -161831 -151077 -134844 -58534 -69512
16002f9512k7159N0415j09622r4401P5882j1583n777j8132j7981J18650J9369
15991h9851k9851M6046o4179R2407L6896k7826k9360j309R7395M9743j866m8703
15979B9542o4653j1575q5448N8359Q3933l644k0320m8346n1876n3618J25952K2443
15967a9251j7838j8843n5610K2495l3830p9492p2991Q8597L0494k7609L4652l2963
15955a82189O343P0000r062M6418r5586K4383L4547n7519P9505K4673M0381n8246
15943g6352p0317L298m53n4933m4092Q5425J05228J29192M4761j6555j22952o812
15931b4562n2252q3820J8995L1071l8639j9641K6432j8555Q8794R7966q2755r0809
15919a47775Q1697M5013j5508o8511P4227K5281K5302j3732k6269r2656n3110
$$ plain form
16002 -69512 -96671 -46256 -155878 -250279 -174397 -185980 -191757 -209889 -227870 -109220 -89851
15991 -89851 -119702 -73656 -137835 -45428 -8532 -36358 -65718 -67027 30368 80111 78245 29542
15979 29542 -35111 -46686 -132134 -73775 10158 6514 -13806 -62152 -114028 -167646 -41694 -19251
15967 -19251 -37089 -55932 -111542 -89047 -122877 -202369 -275360 -186763 -156269 -183878 -149226 -182189
15955 -182189 -175846 -105846 -114908 -68490 -164076 -139693 -105146 -162665 -83160 -58487 -18106 -76352
15943 -76352 -146669 -143371 -143824 -198757 -242849 -157424 -52196 76996 121757 105202 -17750 -24562
15931 -24562 -76814 -160634 -141639 -110568 -149207 -168848 -142416 -160971 -72177 25789 -56966 -147775
15919 -147775 -66078 -21065 -36573 -105084 -30857 -5576 19726 5994 -20275 -112931 -166041
15908a66041o6801M8431K3035j3761J0082P5330J2715j19942q705R5668K2556
15897h7433R4048j20331J0368K2019n1424m1914K3482K1811j5554J0806m0328
15886a74450M9O1769P4517J4346r5075l7742J0836O7980O227k1266m1836m9619
15874a84264L6625J99370J76995n9589r9952j65006o3097k4100L1074M1810k7099
15863a37233L982J1281J1219M8537J4232q9343l3555M4273R9958o1283j7359n9401
15851a64692P4907J7522M6861j0466j29251p0074K8870M9083M0173k843j74313
15840b94223j43053J40617R4559n7724O6693N7650m6682J16086K9964L2999P7889
15829G4775J69743o1949r6860j22192j26545O0648J03942J1246N7377J2624j09309
$$ plain form
15908 -166041 -232842 -184411 -161376 -175137 -165055 -89725 -77010 -196952 -205657 -109989 -87433
15897 -87433 6615 -113716 -103348 -81329 -132753 -174667 -151185 -129374 -144928 -134122 -174450
15886 -174450 -174401 -112632 -38115 -23769 -118844 -156586 -145750 -77770 -71543 -92809 -134645 -184264
15874 -184264 -147639 51731 228726 169137 69185 -95821 -158918 -183018 -151944 -110134 -137233
15863 -137233 -133251 -121970 -110751 -62214 -47982 -137325 -170880 -126607 -26649 -87932 -105291 -164692
15851 -164692 -89785 -72263 -25402 -35868 -165119 -235193 -206323 -157240 -117067 -119910 -294223
15840 -294223 -437276 -296659 -202100 -259824 -193131 -135481 -182163 -66077 -36113 -3114 74775
15829 74775 244518 182569 85709 -36483 -163028 -102380 1562 12808 70185 82809 -26500
15818b6500j33505J0857P4766J25078q6836j35072j4852L6450l5227Q2316N5838
15807d6687M2992n645q3292J104k2539k2338J04722K5910m3464L6857J48498O1023
15795A97141q0054J4796m2549l9050j18813M0100J50366r4362r7576l9203J1437
15784i7767l6094p7871L7484O6294K8642j494J52943K9160j1629M8163l5721N827
15772A07937K0860o1280q75j4056j7876m2299j40273P8432J48396L3190j22037
15761i881K6901l4243p0159K6137j0996J8169L7418N9908L2749p7595j36310P2995
15749f4907P6526j16230l2210M15m1159J7339n081P3135K9180J50786r6437j43307
15737a51950k6071M6902J52958K3726q8236k871K4145K35874K034j54516n2447
$$ plain form
15818 -26500 -160005 -149148 -74382 50696 -36140 -171212 -186064 -149614 -184841 -102525 -46687
15807 -46687 -3695 -9340 -92632 -91528 -114067 -136405 -31683 -5773 -49237 -12380 136118 197141
15795 197141 117087 131883 89334 50284 -68529 -28429 121937 27575 -70001 -109204 -97767
15784 -97767 -133861 -211732 -174248 -107954 -79312 -80806 72137 101297 89668 137831 102110 107937
15772 107937 128797 67517 66642 52586 34710 -7589 -147862 -69430 78966 112156 -9881
15761 -9881 17020 -17223 -87382 -61245 -72241 -54072 -16654 43254 76003 -1592 -137902 -64907
15749 -64907 11619 -104611 -136821 -136406 -177565 -160226 -165307 -92172 -62992 87794 -8643 -151950
15737 -151950 -178021 -131119 21839 45565 -42671 -45542 -21397 214477 216511 61995 9548
15726I548l2510j17152j11018J55029R6317M1969l7907L7359k0885q4210p0336
15715a33796J18929R4388k3988k6354R2921l9185o2893q0983j66563L4466R5767
15704i7291O4870l9551n0790L4600O3936k0929O0235Q0395q4560j49990k22992
15693c62067l9109K25449J15171j5143m2761l161m2999K00185P6461K3738m2110
15682I3654j43568p1293O5554M1400M7354l3215p7158j31671q3061p8004J09106
15671b60902R8342K0047J79826J2357l3870m3947o8554l5801L1754k9395J6518
15660a13625R7678L7523n4904j7776J912n941J0849m3932k1802Q525K3435M8756
15648b9302R7769j9613j16885q1501O9635J9300l4215m5266m0523O2481M6516
$$ plain form
15726 9548 -22962 -140114 -251132 -96103 214 42183 4276 41635 20750 -63460 -133796
15715 -133796 -14867 79521 55533 29179 122100 82915 20022 -60961 -227524 -193058 -97291
15704 -97291 -32421 -71972 -122762 -88162 -24226 -45155 15080 95475 10915 -139075 -362067
15693 -362067 -401176 -175727 -60556 -75699 -118460 -121621 -164620 35565 112026 135764 93654
15682 93654 -49914 -121207 -55653 -14253 33101 -114 -77272 -208943 -292004 -370008 -260902
15671 -260902 -162560 -142513 37313 49670 15800 -28147 -96701 -132502 -100748 -130143 -113625
15660 -113625 -15947 21576 -33328 -51104 -49192 -55133 -44284 -88216 -110018 -101493 -78058 -29302
15648 -29302 68467 48854 -68031 -149532 -79897 -60597 -94812 -140078 -180601 -118120 -71604
15637g1604J9576R7341K1258n3942j71270j20307P6951j2821N0874m377J35126
15626c3195Q4489j14941K1695R2443j24189K7196o118m4425O44m0456K7134j7340
15614a27063r0250P4859J06264J10592O7629J5380j53028j67316M5983K04320
15604H7370O2928j02886l9995P8878R9757q0171p1616o2059L4820M2555l0896
15593A8685j31789M8564J36444L8389j9546K9761Q2175q6373k376j6167l5240
15582F2527K1958J01282q2654j35056L348N9106o697j32090m297R4739j2755n0169
15570h0758L8928J32384k8607j07309j99349r1507K50969J10794Q467K5241P4787
15559A34040o7838r3938j09393R1446K02415j1021j75012p2633l1991q9932m8829
$$ plain form
15637 -71604 -52028 45313 66571 12629 -158641 -278948 -201997 -214818 -163944 -168321 -33195
15626 -33195 51294 -63647 -41952 50491 -73698 -46502 -52620 -97045 -96401 -136857 -109723 -127063
15614 -127063 -217313 -142454 -36190 74402 142031 157411 4383 -162933 -116950 87370
15604 87370 150298 47412 7417 86295 186052 105881 34265 -27794 7026 49581 18685
15593 18685 -113104 -64540 71904 110293 90747 120508 202683 116310 113934 97767 62527
15582 62527 84485 185767 103113 -31943 -28595 30511 23814 -108276 -112573 -17834 -30589 -80758
15570 -80758 -41830 90554 61947 -45362 -244711 -336218 -85249 25545 34012 59253 134040
15559 134040 66202 -27736 -137129 -45683 156732 145711 -29301 -101934 -133925 -223857 -272686
15548b72686J88343Q619j3379L391r021M7396J04929J7540k8261j40008n8093
15537a51230n0609N9983o74k9614J0614J04839K3635K6159m9723r7018L1553M0762
15525h1323j639K5686m8641j5831O9097M1922R807m420M1804o1870k16764N1043
15513a91129Q0943j2701Q508K4249n7865K1009K7461M0958j00357k2338J05456
15502g5806N8011M2718Q1741n4658j86822n2936P9338L8477l5144m6584l2215
15491a83880n9069J03538P5801K9728J4965n1668J8838q9767k6581P7198K4426
15480f6471k9230O429O7710o2309k8290O5437n4810l6635J1674M7473k1513P974
15468i2561J07904J23188q2381p3534J37046o8370l2110P980K7580M8890m3555
$$ plain form
15548 -272686 -84343 -75724 -89103 -85712 -94733 -47337 57592 75132 46871 -93137 -151230
15537 -151230 -201839 -141856 -142530 -172144 -161530 -56691 -33056 -6897 -56620 -153638 -122085 -81323
15525 -81323 -82962 -57276 -105917 -121748 -52651 -10729 -922 -5342 36462 -25408 -242172 -191129
15513 -191129 -110186 -122887 -114379 -90130 -147995 -126986 -99525 -58567 -158924 -181262 -75806
15502 -75806 -17795 24923 106664 52006 -134816 -187752 -108414 -69937 -105081 -151665 -183880
15491 -183880 -242949 -139411 -63610 -33882 -18917 -70585 -51747 -141514 -168095 -90897 -66471
15480 -66471 -95701 -89272 -21562 -83871 -112161 -46724 -101534 -138169 -126495 -79022 -100535 -92561
15468 -92561 15343 138531 56150 -17384 119662 51292 19182 27162 54742 103632 60077
15457F0077p088p9097j2990N1785p5329N0203K4956P9152r0217N919J5145m7267
15445b4751N1800m4313o9455K2419p71j0298l332P8294L353l4008m8475K2558
15433e6979n1922K409P3970Q1261N5318r091j23669q9515r173J3671j6120N7292
15421g2548M9861J25071L8134k4160q0616K2503J06247K2661q7748l1620J02894
15410A70679m3667j06465o0346k4814K7314O3270J51859r833M087N4313J5626
15399B42023q7447j38836j09163J47212l7903j21874l7385N0012N0636j6701l5162
15388i4588J14962Q0901Q0626J49363N4124N4433m853j3480n9294p1099O4051
15377C55146Q3618m7357j14825q2540N4910n723L0030j59886j21876J26827J08254
$$ plain form
15457 60077 52989 -26108 -39098 12687 -62642 -12439 12517 91669 1452 7371 22516 -24751
15445 -24751 27049 -17264 -86719 -64300 -65071 -75369 -78701 -407 2946 -31062 -79537 -56979
15433 -56979 -108901 -106492 -32522 48739 104057 94966 -28703 -118218 -127391 -113720 -129840 -72548
15421 -72548 -22687 102384 140518 116358 35742 58245 164492 187153 99405 67785 170679
15410 170679 127012 20547 -39799 -64613 -37299 25971 177830 167997 172084 226397 242023
15399 242023 154576 15740 -93423 53789 15886 -105988 -143373 -93361 -42725 -59426 -94588
15388 -94588 20374 101275 181901 331264 385388 439821 434968 421488 362194 291095 355146
15377 355146 438764 391407 276582 194042 248952 243229 273259 113373 -8503 118324 226578
15366B26578q566p2039J7847m2889l1609O6091L2018n8359L4223p8709N971J6699
15354A07256m539J54726J64550K7524J24693O9080P7552K3832j066R8678j8263
15343H24023r8437m4251r0716j37361n5759K1379r7105j69354J9411M5968O3243
15332B81041J3550l0115k4802N6820J01323l8396j05614j6012q8397N9401J33124
15321C41923R8592K5959j71674j94063R3926K31425J15460O8992j09174r9175
15311D02191R346Q705r977J45995M7582j32120p5027l3189K238r1480q2650R3940
15299B85554q4507j24091L4498L3273L3769m9080q5174k7341L7760P2465Q2654
15288B09780n2558m10K2842R477j13188N839j5645n1394M9221N9438K5669p5952
$$ plain form
15366 226578 218012 145973 163820 120931 89322 155413 187431 129072 163295 84586 90557 107256
15354 107256 102717 257443 421993 449517 574210 643290 720842 744674 743608 842286 824023
15343 824023 725586 681335 590619 453258 397499 418878 321773 152419 171830 217798 281041
15332 281041 294591 264476 239674 296494 397817 359421 253807 237795 149398 208799 341923
15321 341923 440515 466474 294800 100737 194663 426088 541548 610540 501366 402191
15311 402191 411537 420242 410265 556260 603842 471722 396695 363506 365744 274264 191614 285554
15299 285554 201047 76956 111454 144727 178496 129416 44242 16901 54661 127126 209780
15288 209780 157222 156812 179654 189131 75943 81782 66137 14743 63964 123402 149071 73119
15276G3119p9377P9291M4635P2690j08311n5833M0657L8825K00652n442j43182
15265A57724J7694L4380K6013n6169l1744O0153J76875o3926k1053N0276L6370
15254C86593J4322q5644q4941O220J1979J55226J8303k29j896l9924J18215J7115
15242E15339J0749N894L0700J39900L9583M7943Q5691M660K0653J2246K5386M0593
15230I79337J01797M6078Q4357K84052L55277J10968K13562L01898L29051M76342
15220C282719O23078Q63298J063830J332716J798225K392508L194130L755250
15212A8305754L493054K763946K199036J951725J469763O02279o24383k075628
15204B8085546l408429m125205l556192k858065k055084j404696j046571q02553
$$ plain form
15276 73119 -6258 73033 117668 190358 82047 26214 66871 105696 306348 300906 157724
15265 157724 175418 209798 235811 179642 147898 208051 384926 321000 299947 350223 386593
15254 386593 400915 315271 230330 236550 248529 403755 422058 421829 419933 380009 498224 515339
15242 515339 526088 531982 562682 702582 742165 790108 875799 880459 901112 913358 938744 979337
15230 979337 1081134 1127212 1211569 1495621 1850898 1961866 2175428 2477326 2806377 3282719
15220 3282719 3905797 4769095 5832925 7165641 8963866 11356374 14550504 18305754
15212 18305754 21798808 24562754 26761790 28713515 30183278 30785557 30161174 28085546
15204 28085546 24677117 20551912 16995720 14137655 12082571 10677875 9631304 8828751
15196H828751n75216m62764l40699k73425J9866N5166o028R9128K00603L96000
15186G941382O23432R05154J160368J541163K054546K898188M125478N793630
15178B7043341P807655R015649P907477N687918M214230L791277K917196N95627
15170F8980370k217157n844622r988097j0957012q653782n891021m008231k752841
15162A8667607k028948j580213j316669j014856q29552o38204m74858n58537k81660
15153I944110K9421n7211p3101L7697L33700N81752O57585J062423J641866K381990
15143A6540232L155129L587075L612902L045954K216333J795522J328429M73149
15135C5754725n96112j892152l674829m706477m537434l627213k599156j842762
$$ plain form
15196 8828751 8253535 7790771 7450072 7176647 7196513 7251679 7245651 7344779 7545382 7941382
15186 7941382 8564814 9469968 10630336 12171499 14226045 17124233 21249711 27043341
15178 27043341 34850996 43866645 51774122 57462040 61676270 65467547 68384743 68980370
15170 68980370 66763213 60918591 50930494 39973482 31319700 25428679 21420448 18667607
15162 18667607 16638659 15058446 13741777 12726921 11897369 11259165 10784307 10225770 9944110
15153 9944110 9973531 9916320 9843219 9880916 10214616 10796368 11453953 12516376 14158242 16540232
15143 16540232 19695361 23282436 26895338 29941292 32157625 33953147 35281576 35754725
15135 35754725 35158613 33266461 29591632 24885155 20347721 16720508 14121352 12278590
15127A2278590j401934j188037r86130p32142o00610n57237m34421l36082l46951
15118E695046k43044l06316k91650k16673k43512j81793j78027j25572j62991
15109C745468j68822j79274j85285j33634P4705j8514j79068j67413j08136j21727
15099B558300j0877L4411n9025k27410j05514j89824j44631m7936L5294p5985
15089A766803M234o4566m8293p5013N8279r0736q8651q3310n9747o4286n2593
15078A202121J8051O5166O7935p7869j43762j3918M4112P640O5874M420n3221
15067A186549o7407n5499p3593N951J9372j12039O035Q1608p6624n893o5024p0908
15055G72528m0442N3619r9222j00238k0951N9364J9466J02766J59726l3155j24065
$$ plain form
15127 12278590 10876656 9688619 8702489 7970347 7369737 6812500 6378079 6041997 5695046
15118 5695046 5452002 5145686 4854036 4637363 4393851 4212058 4034031 3908459 3745468
15109 3745468 3576646 3397372 3212087 3078453 3153158 3134644 2955576 2788163 2680027 2558300
15099 2558300 2547423 2581834 2522809 2295399 2189885 2000061 1855430 1807494 1842788 1766803
15089 1766803 1771037 1706471 1658178 1583165 1641444 1550708 1462057 1378747 1319000 1254714 1202121
15078 1202121 1220172 1285338 1353273 1275404 1131642 1117724 1161836 1169476 1235350 1239770 1186549
15067 1186549 1119142 1063643 990050 996001 1015373 903334 909369 990977 914353 908460 843436 772528
15055 772528 732086 785705 686483 586245 565294 624658 644124 746890 906616 873461 749396
15044G49396q1664q0281o1434O4474M8987L793r7097p3748j50248Q7809Q7237
15033D97224r51j24884o2693k446M2505Q0764Q428J7476j61955j99294j4383K8620
15021A08411J29242j13482M416N7569l1201J9189Q3419L3760N5179J1404j66744
15010A91162j17379j1089K199O856J22575k1581l5829r2195l3554M1629Q6652
14999A39446M5851r7667l7568n3662M4985J21692O7034O868j81008k5309O9561
14988A00223q2953p8012L798k5162r3617J26989R7320o1108o5899J9833P4557
14977A5969R5974m6890n5394K5117k5780K0383N0871k8573K6899r768Q4806O4356
14965B17970q1737m3372j31207M6504j2092k3185j2473n0283J0832Q6431m1031
$$ plain form
15044 749396 667732 587451 526017 590491 639478 643271 546174 472426 322178 409987 497224
15033 497224 496273 371389 308696 306250 348755 429519 437947 455423 293468 94174 79791 108411
15021 108411 237653 124171 128587 186156 154955 174144 257563 291323 346502 357906 191162
15010 191162 73783 62694 64893 71749 194324 172743 136914 44719 11165 52794 139446
14999 139446 185297 87630 50062 -3600 41385 163077 230111 236979 55971 30662 100223
14988 100223 17270 -60742 -56944 -82106 -175723 -48734 48586 -12522 -78421 -58588 15969
14977 15969 111943 65053 9659 34776 8996 29379 80250 51677 78576 68808 153614 217970
14965 217970 136233 92861 -38346 8158 -3934 -27119 -39592 -89875 -79043 7388 -33643
14954c3643r7959k3380J66804K51810J28250m2965r9951m5547p180j5185q0267
14943A00787j05705j15337O5060L779j09071J00910K05653J11557j03343n1628
14933A02662J950j8418J26543L4934N1179Q7347J4643Q668l0057j79189j07042
14922I3220o4068K435M1425l5748J54056M5778j28280n9093k2943n0736J22465
14911I8511L3457r2150J1499L184l4108p9883m2088j4640J23285N8655N305O3881
14899A34908j5323N9541P8280j63372q2778N9985L0979M2490o8223r630m0252
14888B6605N2068O7632r8497l0219Q4952M1433k2386j6195j04908k3820m9020
14877g2355j20817n1908Q530r2036p7793J72775J98190Q1195N9526l6585k9044
$$ plain form
14954 -33643 -131602 -154982 11822 263632 391882 348917 248966 203419 196239 181054 100787
14943 100787 -4918 -120255 -55195 -51416 -160487 -59577 146076 257633 154290 102662
14933 102662 104612 86194 212737 247671 298850 386197 400840 409508 379451 200262 93220
14922 93220 29152 31587 73012 37264 191320 237098 108818 49725 26782 -23954 98511
14911 98511 131968 39818 51317 54501 20393 -59490 -101578 -116218 7067 65722 71027 134908
14899 134908 119585 179126 257406 94034 11256 71241 102220 144710 76487 66857 26605
14888 26605 78673 146305 47808 17589 102541 143974 121588 105393 485 -23335 -72355
14877 -72355 -193172 -245080 -236550 -328586 -406379 -233604 -35414 45781 105307 68722 39678
14866C9678M3338p2343L4863J94557j1259j33506j5393N4067r2064q2386o837
14855d7285l9491k8956J51100P9356J3133j16177m8822K8199K0605o8207K4834
14844c1711J8501O5799n8780o3677R3932N9218M4775Q3489r6901L7436M3569j39272
14832E6378j0503p291m2336l842M3261j9515k7927J04835l8799r7823N2734K3893
14820C3065K732j4843N1760M8548r729k5552N5921o2948p7029n7583K8133k748
14808c0273R4516K9346q2229n036m3192j5682L2538J6641k7170N734N5645l4689
14796c851K2593p7842R1367J58459J9082j21796q8872o6625k7174M4063j66997
14785b17593o7179J32642P1681m4847m3227m2289L9574o4845k6602R3602R4650
$$ plain form
14866 39678 83016 10673 45536 240093 228834 95328 79935 134002 41938 -40448 -47285
14855 -47285 -86776 -115732 35368 114724 127857 11680 -37142 -8943 11662 -56545 -31711
14844 -31711 -13210 52589 -6191 -69868 24064 83282 128057 211546 114645 152081 195650 56378
14832 56378 45875 38584 -3752 -7594 35667 16152 -11775 93060 54261 -43562 9172 33065
14820 33065 35797 20954 72714 121262 111533 85981 141902 78954 1925 -55658 -27525 -30273
14808 -30273 64243 93589 11360 6324 -36868 -52550 -20012 -3371 -30541 -24807 30838 -3851
14796 -3851 18742 -59100 32267 190726 209808 88012 -860 -67485 -94659 -50596 -217593
14785 -217593 -284772 -152130 -80449 -125296 -168523 -210812 -171238 -236083 -262685 -169083 -74433
14774g4433M8904L8250j17922N2186R9708R9249l8975N907P133j39390q376j8362
14762d6121k9062M1320j9787l479k3183j384P1512K2967k1697J333n0749l7252
14750i5582M7514Q0848J3457l6215n9577k3774P5724r3410j32877l6204k3806
14739b83902J44054J41537k5833j8649N3569K2766K4757R0697o9095j31585L5026
14728a6658J30591j2340j31424o6411p4686O7678J3850j5843O0457r001p8994
14717a32781n2096M6838J28645l6928k6652M4823L8347J7316q8650K4257N0403
14706A3522J8207J03831l1599n9482J1296P2160k1811j88242L006j6734K3625
14695g2221K0827l75P234n5981J00837k2810J49818J95121j03614r1366p0090
$$ plain form
14774 -74433 -25529 12721 -105201 -53015 46693 145942 106967 112874 120007 -19383 -27759 -46121
14762 -46121 -75183 -33863 -53650 -57129 -80312 -81696 -10184 12783 -8914 -7581 -58330 -95582
14750 -95582 -48068 32780 46237 10022 -49555 -73329 2395 -91015 -223892 -260096 -283902
14739 -283902 -139848 1689 -24144 -42793 10776 33542 58299 148996 79901 -51684 -16658
14728 -16658 113933 101593 -29831 -96242 -170928 -103250 -89400 -105243 -44786 -53787 -132781
14717 -132781 -184877 -138039 -9394 -46322 -72974 -28151 10196 27512 -61138 -36881 13522
14706 13522 31729 135560 103961 44479 55775 127935 106124 -82118 -79112 -95846 -72221
14695 -72221 -51394 -51769 -44535 -100516 321 -22489 127329 322450 218836 127470 57380
14684E7380r493L7722j307n1042n2673j36315J3826J98336J02175j52501j44944
14673a38836J06869O3750J12942j6728j66622q2926K5402J17679J2278j07998
14663g4190O7574K5355r7561p2978O0674J9662O0085Q024J4428O6795O316K7246
14651A11430j4251k2461R0920k8418l0506n3387K1721J1165O2312k8987j17479
14640B059j63015n2101K4995K4618M1971j5092O7173J08934l9057p5471J2025
14629f2961J1650j05929r6635J21106L9656l3883L7960j6626o8355m4216J82812
14618c5421R5861n515j00162m4575n8825j1996J0109R80k4694P3417k8630L1247
14606i8204N1256j8899N3109P8411n790l1189p2747k5806M3425j24695N3758P0517
$$ plain form
14684 57380 47887 85609 84302 33260 -19413 -155728 -141902 56434 158609 6108 -138836
14673 -138836 -31967 31783 144725 127997 -38625 -121551 -96149 21530 33808 -74190
14663 -74190 -6616 18739 -78822 -151800 -91126 -71464 -11379 -3355 11073 77868 84184 111430
14651 111430 97179 74718 165638 137220 106714 53327 75048 86213 148525 119538 2059
14640 2059 -160956 -213057 -188062 -163444 -121473 -136565 -69392 39542 485 -74986 -62961
14629 -62961 -51311 -157240 -253875 -132769 -93113 -126996 -89036 -105662 -174017 -218233 -35421
14618 -35421 60440 54925 -45237 -89812 -148637 -160633 -150524 -149544 -174238 -100821 -129451 -98204
14606 -98204 -46948 -65847 -12738 65673 59883 28694 -44053 -69859 -26434 -151129 -97371 -26854
14594b6854n9979j9387L0887Q5555R5001O99j28555m1325j12927m6458K2824Q5233
14582a15286o698K2078L251j8778L9955O7689p1696j35620j1480M4492O3428m27
14570a19092M8850N9313k6697q7140l4879q9464n0896l206J53709R1575J7543
14559d0384j6267n8867k1094Q8686J09571q4423n2515k178j02319n7952o1712
14548b99454J45148J61575K4546k6674m4702P0818R5025j400q0361m0235p5459
14537g1173n2554L3546r3084r6493Q5932J46019n0525Q1420Q1371N2735K233L7578
14525A57005o7579j72077p6375M7741P4094J46931P062j30011j84513q7847K5320
14514b60249N4925P6343Q4274P0505j08333j63518P5058J34881J35959j32375
$$ plain form
14594 -26854 -86833 -106220 -75333 10222 105223 105922 -22633 -63958 -176885 -223343 -200519 -115286
14582 -115286 -121984 -99906 -96655 -115433 -75478 -7789 -79485 -215105 -226585 -182093 -118665 -119092
14570 -119092 -70242 -10929 -37626 -124766 -159645 -249109 -300005 -303211 -149502 -57927 -40384
14559 -40384 -56651 -115518 -136612 -47926 61645 -22778 -75293 -77471 -179790 -237742 -299454
14548 -299454 -154306 7269 31815 5141 -39561 31257 126282 124882 44521 4286 -71173
14537 -71173 -123727 -90181 -183265 -279758 -193826 -47807 -98332 -16912 64459 117194 119427 157005
14525 157005 89426 -82651 -159026 -111285 -37191 109740 116802 -13209 -197722 -285569 -260249
14514 -260249 -205324 -128981 -44707 25798 -82535 -246053 -170995 -36114 99845 -32530
14504c2530k53542n4198K22045J40757J2573M6778N0266L0017n8193p759p3379
14493B2835l7237j21087m8076L8286J8832Q1683M2826l0072p480Q4759Q1501o841
14481A19929N3251q3988L4190N0291J1278j43969j86768j1692Q1294n4324N3673
14470g6835P2271o7202o0803l595J25021M6305n0180p8213J1170O7120k8081N0166
14458G144q4482l1454k3620J02697K52126P7334p7594m8798l4793k0340n6378
14447F1842l8044k8969p9735R961j14550N0691N6869p0351N7533J74271M899l3314
14435E1103k6845l7537P1315K2669O3413P6613M7113n4815r6104j65799O4098
14424A5224m5376j16535J2263l4716M1105J11616Q7380J6085L1130j102p6803
$$ plain form
14504 -32530 -286072 -340270 -118225 22532 35105 81883 132149 162166 103973 96214 22835
14493 22835 -14402 -135489 -183565 -145279 -126447 -44764 -1938 -32010 -39490 45269 126770 119929
14481 119929 173180 89192 123382 173673 184951 40982 -145786 -157478 -76184 -130508 -76835
14470 -76835 -4564 -71766 -132569 -136164 -11143 35162 -15018 -93231 -82061 -14941 -43022 7144
14458 7144 -77338 -108792 -132412 -29715 222411 299745 222151 173353 138560 118220 61842
14447 61842 23798 -5171 -84906 -74945 -189495 -138804 -81935 -152286 -94753 79518 84417 51103
14435 51103 24258 -13279 58036 80705 144118 220731 267844 213029 116925 -48874 15224
14424 15224 -30152 -146687 -134424 -169140 -128035 -16419 70961 87046 118176 117074 40271
14413D0271j44375n1937O1504m3495m2192m93L8056J39886O4960K4660l0903j27136
14401g1194n193J34002O527Q25j03126p3103p4223J15806O0872n7427r449M7446
14389b8237M8228N2591j03575j1170o6223l2986P4328k5884l6707N5082j32231
14378b06784k9208P3928L2054o9194N1695Q038o845R7943J44226K3827q9503o4111
14366c3934o1976j18962K0998J51718l5643L8151N8754j0090r7599q669P7030
14355b0222l6530r3210k3760J13550Q7777j4395j15285j8551P4617k5752J20401
14344D8640k9852o0316L7254j09543j24402k15M7201n5281R44L875N3781P5713
14332a12201J61464P7414L940O9953p2175o7862k7537o398K7768m3321P5702k9314
$$ plain form
14413 40271 -104104 -156041 -94537 -138032 -180224 -180717 -142661 -2775 62185 86845 55942 -71194
14401 -71194 -76387 57615 64142 64967 -38159 -111262 -185485 -69679 -8807 -66234 -75683 -28237
14389 -28237 19991 72582 -30993 -42163 -108386 -141372 -67044 -92928 -129635 -74553 -206784
14378 -206784 -235992 -162064 -130010 -199204 -147509 -139471 -146316 -48373 95853 119680 30177 -33934
14366 -33934 -95910 -214872 -193874 -42156 -77799 -39648 19106 9016 -88583 -97252 -20222
14355 -20222 -56752 -149962 -173722 -60172 27605 13210 -102075 -120626 -46009 -71761 48640
14344 48640 18788 -41528 -4274 -113817 -238219 -238434 -191233 -246514 -245570 -241695 -187914 -112201
14332 -112201 49263 126677 130617 200570 128395 60533 32996 26598 54366 11045 86747 57433
14320E7433j33874o240L7371k0565J7802r5540p318R6579k5580m9745J17237L2830
14308B0390k6863q1521j11721m1320O1399J52461o8295r4832p6338R8580L9142
14297a28918j7471L9678N9866l2518L2766K7380R1442J65226o7131R231L2395
14286B11946j16755r6938K81n9646k6912J72516l8367j66432q2354m7877O911
14275b43627O0565J35276R2446m056m236m2162k1597j10816j12853N5043J09844
14264h6173M0811p9276j5015j30833k2693J57176L2636J2536K8327j5478l3582
14253a11564j29818p1720q964M4962J70588J23859l8743p7399R6064K09978l7830
14242A69413q4519j44356j42106l308J6008R2760k6473q2191r0547Q367R6420
$$ plain form
14320 57433 -76441 -82681 -45310 -65875 -48073 -143613 -150931 -54352 -79932 -129677 -12440 20390
14308 20390 -6473 -87994 -199715 -241035 -179636 -27175 -95470 -190302 -266640 -168060 -128918
14297 -128918 -146389 -106711 -46845 -79363 -46597 -19217 72225 237451 170320 179551 211946
14286 211946 95191 -1747 -1466 -61112 -88024 84492 46125 -120307 -202661 -250538 -243627
14275 -243627 -183062 -47786 44660 40604 36368 -5794 -27391 -138207 -251060 -196017 -86173
14264 -86173 -45362 -124638 -139653 -270486 -293179 -136003 -103367 -90831 -62504 -77982 -111564
14253 -111564 -241382 -313102 -322066 -277104 -106516 17343 -21400 -98799 -2735 207243 169413
14242 169413 84894 -59462 -201568 -204876 -188868 -96108 -122581 -204772 -295319 -286952 -190532
14231a90532J41129o9255O386J24830Q9935N2981j17653o2853k7537n6671l401
14220a12641R4818o732n703m1677N7925n6020K0040J8717j1733K2512k9473K3776
14208b6191m0733l4088m8805l5604L614R4820J10446m791M2102p0341j83212j29617
14196c22400J03158J19763P6871m6647N8203k4715l445O862l1260J2734J12470
14185F1594J33070L2314n4869j33462L1849l1068j18480m3028j3192n2186M2900
14174a44558k3848L2562M6252O3922j9974o6427J3653j32791O1662M0326k7263
14163a56484J13552k5952j35181o5247m3597Q3211O4740J31922k191q655m3627
14152h7509L9280M4809k0560r1127o6519k0820P3410L876J13882J24121p182r7208
$$ plain form
14231 -190532 -49403 -118658 -112272 12558 102493 155474 37821 -25032 -52569 -109240 -112641
14220 -112641 -17823 -24555 -30258 -71935 -14010 -70030 -49990 -31273 -43006 -20494 -49967 -26191
14208 -26191 -66924 -101012 -149817 -185421 -181807 -86987 23459 18668 60770 -9571 -192783 -322400
14196 -322400 -219242 -99479 -22608 -69255 -11052 -35767 -39212 -32350 -63610 -50876 61594
14185 61594 194664 226978 172109 38647 70496 39428 -79052 -122080 -135272 -187458 -144558
14174 -144558 -168406 -135844 -89592 -25670 -45644 -112071 -98418 -231209 -169547 -129221 -156484
14163 -156484 -42932 -68884 -204065 -269312 -312909 -229698 -164958 -33036 -35227 -43882 -87509
14152 -87509 -48229 -3420 -23980 -115107 -181626 -202446 -129036 -125160 -11278 112843 105661 8453
14140H453k0448J17944k1783p963R059n292p1555q2887M6535L7966k3076P4110
14128F1063o5104j42508l4689M8738K6880o1375q4095Q7651m105P9270O8271J11230
14116I1227N7374k5136k8399M6420L0496p1264o3596m0332K3695J41580L6780
14105A98845j67604K3672M6131p3288j72526K3930K6749O3388L0304K3537P3455
14094I6593Q9395o6384q3871n3516O5873J9152m6379q9944M8348J01805N2223
14083A33295j79697j327Q6686r6318q7945n8472L5642J4619P0966O3454q3822
14072a02919O240K9393m042j25039Q5483J70953q98n1573j05381q1846O6094N2736
14060f0799j31351K3356R0803M4312j09767j2636k9925l5913J40716P3557l9943
$$ plain form
14140 8453 -11995 105949 84166 76203 85262 79970 8415 -74472 -27937 10029 -13047 61063
14128 61063 -4041 -146549 -181238 -132500 -105620 -166995 -251090 -163439 -167544 -88274 -20003 91227
14116 91227 148601 123465 95066 141486 171982 100718 37122 -3210 20485 162065 198845
14105 198845 31241 54913 101044 27756 -144770 -120840 -94091 -30703 -399 23138 96593
14094 96593 185988 119604 35733 -17783 48090 67242 20863 -69081 -20733 81072 133295
14083 133295 -46402 -47729 38957 -57361 -145306 -203778 -168136 -153517 -82551 -19097 -102919
14072 -102919 -96679 -67286 -71328 -196367 -110884 60069 59171 7598 -97783 -179629 -113535 -60799
14060 -60799 -192150 -168794 -77991 -33679 -143446 -156082 -186007 -221920 -81204 -7647 -47590
14049d7590l1460Q1736K6779l5979k1069q955K5014j30998N6106m7590n6510l3802
14037b24318Q2613Q3672L7854J4680p9097l6026P5547l546n3658l646L7219o3830
14025a32536Q0939M4734k1005N5548r5557M0911j15798N1895J06948j4413J09444
14014A11110K0015o9074l3357m2754M3477L984p9735j25201j2984P486O2363M4532
14002g0138k4599j1820o259P1764N6679J22928Q8039n6557j20789o2716p3192
13991h6660O0966O273L7749L7671l1423j72434l1836Q0068M3982M2066j3502r2722
13979a19802R7883N6666J2087J8251m7023k6211q0911o0398M4351N886N3517R7101
13967E1397p5221m232O7900L3589K7360k6890j3472j9696m0814P5829Q7735j25514
$$ plain form
14049 -47590 -79050 2686 29465 -6514 -27583 -36538 -11524 -142522 -86416 -134006 -190516 -224318
14037 -224318 -141705 -58033 -20179 -5499 -84596 -120622 -45075 -48621 -102279 -105925 -68706 -132536
14025 -132536 -51597 -6863 -27868 27680 -67877 -26966 -142764 -90869 16079 1666 111110
14014 111110 131125 62051 28694 -14060 29417 33401 -46334 -171535 -184519 -177033 -114670 -70138
14002 -70138 -94737 -106557 -112816 -41052 15627 138555 226594 170037 49248 -13468 -86660
13991 -86660 -25694 -19421 18328 55999 24576 -147858 -179694 -99626 -55644 -13578 -27080 -119802
13979 -119802 -21919 34747 46834 65085 18062 -8149 -89060 -149458 -105107 -99221 -45704 51397
13967 51397 -23824 -28056 39844 73433 100793 73903 60431 40735 -79 75750 163485 37971
13955C7971N685M1489p8700K0855o772N5579j0980O1622R7004m806J9836j9724
13943B19059j83212K9532n5377j04026m7951K2655N5390J0175K4897j8212n2438
13932i9508l6936L7906j2924O1652p262q0711L5465J02429Q542j39835K0415K58
13920a10509L4861J17808J25173m0235K299q5222K3165m6174q0130Q869Q6617
13909C6522J10746L0530O7896J226r4346M4227j2000J33307J45987M5007n8200
13898D50902N3857o7365j36078J79122J7563r4936j22650K9878Q2420q5516j85756
13887A21441L4377k281r6659j0295p8571o6816n4283N2089J70074K9555q2678
13876A5953j0472P6400O4332l7958j2824J63107R8212M3295l8468O0898J4035
$$ plain form
13955 37971 43656 85145 6445 27300 20528 76107 65127 126749 223753 218947 238783 219059
13943 219059 35847 65379 10002 -94024 -141975 -119320 -63930 -53755 -28858 -47070 -99508
13932 -99508 -136444 -98538 -111462 -49810 -57072 -137783 -102318 111 8653 -131182 -110767 -110509
13920 -110509 -75648 42160 167333 127098 129397 44175 67340 21166 -58964 -50095 36522
13909 36522 147268 177798 245694 246920 152574 196801 184801 318108 464095 509102 450902
13898 450902 504759 437394 301316 480438 498001 403065 280415 310293 392713 307197 121441
13887 121441 155818 153537 56878 46583 -31988 -98804 -153087 -100998 69076 98631 15953
13876 15953 5481 81881 146213 108255 95431 258538 356750 400045 361577 422475 436510
13865D36510M9573l4691L0410l150m6640l4298m0969p3543p5195j5177n6030n3736
13853H3064P6080P0918K1000L351l4653n8912l2182J815J426m4098q6201J8669
13841B0277l4304O4951K9150r140p1053K967K6850o7872l9290J10824N0944n187
13829G9117j82802j00028J23326O0028m0181M7360l301r2269o9039R8261k9395
13818a08923j2109Q5706J53607N0871p3986o4370M0554m134o4251N4129l1189
13807B5905j4696p8965Q8744N0255R126l190j2848m8555k6478N8711l5607K4980
13795C7382o1856j0157M0929K5731L1356J04016o1053j05191m5869K6641p4627
13784i2698j09095P9501P1517M8500n6678O959k0503P182L5468l9070l5374L5901
$$ plain form
13865 436510 486083 451392 481802 478652 432012 397714 356745 283202 208007 192830 136800 83064
13853 83064 159144 230062 251062 254413 219760 160848 128666 130481 131907 87809 1608 20277
13841 20277 -14027 50924 80074 70934 -119 2848 29698 -38174 -77464 33360 84304 79117
13829 79117 -103685 -203713 -80387 -20359 -60540 -13180 -16481 -108750 -177789 -79528 -108923
13818 -108923 -121032 -35326 118281 169152 95166 30796 71350 67216 2965 57094 25905
13807 25905 11209 -67756 20988 71243 80369 77179 64331 15776 -10702 48009 12402 37382
13795 37382 -24474 -34631 6298 32029 63385 167401 106348 1157 -44712 -18071 -92698
13784 -92698 -201793 -122292 -50775 -2275 -58953 -51994 -72497 -65315 -29847 -68917 -104291 -68390
13772f8390P1510O3873N9116k38j29973p6642o2931j19241k2318K4050N225K14677
13760d1282J72385j6519m5465l6879j97077M6911J00349n7225N487N5638P5590
13749F1913L8191o9685m0215N8971J36148K5979q3235p8376n3217k1301k4758
13738d9585J5418j21156j03999M6831J27467R0977p5362R9572N4382K5649p3618
13727C6576o5573J0142J59933P6570J3348j2570r6541m0759r0316M2215J10662
13716A43687P7571l6671J10357M9813j08576j71428J04256J37081K1430N1825
13706C79345L5843N8074O916q241r3995r5684q686o3252n2257j08583j34626n935
13694i1081N0868j0871R2785J60224m823j18088N5848k5173j9262J299P2216R9070
$$ plain form
13772 -68390 3120 66993 126109 125871 -4102 -80744 -143675 -262916 -285234 -261184 -255959 -41282
13760 -41282 131103 114584 69119 32240 -164837 -117926 -17577 -74802 -69315 -13677 61913
13749 61913 100104 30419 -9796 49175 185323 211302 128067 49691 -3526 -24827 -49585
13738 -49585 -34167 -155323 -259322 -212491 -85024 5953 -69409 30163 84545 110194 36576
13727 36576 -28997 -18855 141078 217648 230996 218426 121885 81126 -9190 33025 143687
13716 143687 221258 184587 294944 344757 236181 64753 169009 306090 327520 379345
13706 379345 415188 473262 480178 471937 377942 282258 273572 210320 158063 49480 -85146 -91081
13694 -91081 -40213 -51084 41701 201925 197102 79014 134862 109689 90427 91726 163942 263012
13682B63012p6995p027N0891M4695P2991J01433r404k14438q8545R3876K4481
13671B54970J27391J29392R583j37016q1223q2055J8727j1897j30967p0956L9824
13660F5773L8266l8549m5252r6253K6503O9465M0722N2380l8441P0195P3405k420
13648B15794J50712J98452j70562n1315k7584n1482m415Q6737m0237j41173m0028
13637A24899n4752O404J25772q2552n7759m6646o3479j3011M0784J22190J21118
13626B22968j4813M6220o1168l2308j6935M6683L0975M2824l1025j1940k6024
13615A95457L6110p4754j97P4181r4700j53263M7563J17664M415j12048q9174
13604d8746K7011O9715J7391O5793Q4419P9333n0864j07660O476J39844O6584
$$ plain form
13682 263012 186017 178990 229881 274576 347567 449000 439596 225158 136613 230489 254970
13671 254970 382361 511753 521336 384320 303097 221042 239769 227872 96905 25949 65773
13660 65773 104039 65490 20238 -76015 -49512 19953 60675 113055 74614 144809 218214 215794
13648 215794 366506 564958 394396 343081 315497 264015 259600 346337 306100 164927 124899
13637 124899 70147 76551 202323 119771 62012 15366 -48113 -61124 -20340 101850 222968
13626 222968 208155 254375 193207 160899 143964 190647 221622 264446 233421 221481 195457
13615 195457 231567 156813 156616 230797 136097 -17166 30397 148061 152476 40428 -48746
13604 -48746 -21735 47980 65371 131164 215583 294916 244052 136392 142868 282712 349296
13593C49296j52362q173N0618Q705M5039Q9781L0237M1540l361L7474m688J5714
13581D99820j59251n8192l6116N1245n2396k6581l1268j0440N7522j6914r8107
13570A19322q3495R2514Q7349N0843P5972J07971j64784l2282P7329J24778P1289
13559E26806K606k1413J0423K0309j0732m8203j01505K1404J05208Q0990Q1631
13548F67524o928j66880J7287P4907j4427M5991j23640j10809j4484k8813L5711
13537C75439Q2857N4827l1497J3191P778j10956m6930M1353J17780L9473k6572
13526E16743j0306j9484L4308P3791J7911p4721p5338J5096k7486k503K2418M7513
13514E17942j1543M4165Q2719K4582j7430k8742J3900P7368J18373J0033j28232
$$ plain form
13593 349296 196934 188761 239379 248084 293123 382904 413141 454681 451320 488794 484106 499820
13581 499820 340569 282377 246261 297506 245110 218529 187261 176821 234343 217429 119322
13570 119322 35827 128341 215690 266533 342505 450476 285692 253410 330739 455517 526806
13559 526806 529412 507999 518422 538731 527999 479796 378291 399695 504903 585893 667524
13548 667524 660596 493716 511003 585910 571483 617474 493834 383025 368541 339728 375439
13537 375439 458296 513123 481626 494817 502595 391639 344709 386062 503842 543315 516743
13526 516743 506437 486953 521261 595052 612963 538242 462904 478000 450514 448011 470429 517942
13514 517942 506399 550564 633283 657865 640435 611693 625593 702961 821334 831367 703135
13503G03135K7112J36097J228o1011k1796J58642R0709n0299N4654J95497K45907
13492A479875J12380o9070L6883J61130J18975j0712J06975K50914J79263O1445
13482B428058J43873K37649K64521L33061L98192M84368M88095N45357P01893
13473F025067P30981R06959J295600J668315J985634K350554L046492L929824
13465B1939426M898489N913572O928518P667827Q336759R010454R280342Q961890
13457H2937277P721777O024971M313878K431482M59880j794971m082459o003803
13449I2008032p276888p738984p826940p734063p408757o747437n781052m586441
13441C6907470l390064k387433j760054j277845p74436k85437J87643O18944J222241
$$ plain form
13503 703135 730247 866344 867572 806561 784765 943407 1034116 983817 1038471 1233968 1479875
13492 1479875 1592255 1523185 1560068 1721198 1840173 1829461 1936436 2187350 2366613 2428058
13482 2428058 2571931 2809580 3074101 3407162 3805354 4289722 4777817 5323174 6025067
13473 6025067 6756048 7663007 8958607 10626922 12612556 14963110 18009602 21939426
13465 21939426 26837915 32751487 39680005 47347832 55684591 64695045 73975387 82937277
13457 82937277 90659054 96684025 100997903 103429385 103889265 102094294 98011835 92008032
13449 92008032 84731144 76992160 69165220 61431157 54022400 47274963 41493911 36907470
13441 36907470 33517406 31129973 29369919 28092074 27317638 27032201 27219844 27838788 29061029
13432B9061029J846361K535906L646590M658091N619991O399218P123116P906503
13424F8796805Q339863Q162207P431901N945261M123903K558198O72011j443201
13416A04586948l620437n661024p164342q182751q443277p958790p563719p241219
13408D8751389o660519n531584m364423l336060k652269k121035j789709j650627
13400B0645163j310206j097124j092288j107943r05301p89171p94571p25992o17721
13391A2204846n14594o39866n66360m62069l96371k94111m37447m53397l37162
13382H103469k69281k75273j85065j66589j35148k78736k21828j31402p0639j05322
13372F264186Q9715K269r2616j34915j26651k12660j46839n2783k09669q7360
$$ plain form
13432 29061029 30907390 33443296 37089886 41747977 47367968 53767186 60890302 68796805
13424 68796805 77136668 85298875 92730776 98676037 102799940 105358138 106030149 104586948
13416 104586948 100966511 95305487 88141145 79958394 71515117 63556327 55992608 48751389
13408 48751389 42090870 36559286 32194863 28858803 26206534 24085499 22295790 20645163
13400 20645163 19334957 18237833 17145545 16037602 15132301 14343130 13548559 12822567 12204846
13391 12204846 11690252 11050386 10484026 10021957 9625586 9331475 8894028 8440631 8103469
13382 8103469 7834188 7558915 7373850 7207261 7072113 6793377 6571549 6440147 6369508 6264186
13372 6264186 6353901 6356170 6263554 6128639 6001988 5789328 5642489 5589706 5380037 5292677
13362E292677p1358j78149k15873k67850k96689k13872j13473j26853j44612m3371
13352C620577l6727j75623j89787r9000j23971o4332J8270L1752j7547j02210
13342B861402k05161j28663j15469j01761j00931l8544l7616j35591q7060K5961
13332A936567j25279k09319o1615p815Q6756J925J6223m8850O0349L3685k31260
13321A451367q0659L3488j306m5886K3872j1694P9663K4134j46301k22197n4646
13310A049835p3050j11600K7503M5351K040m2744L7820q1794K6461O7600m8264
13299H99158p1761J4474P6197N705K5341k9859j14969p3988j6537o896J273N4418
13287G62556P354j42480m6357j3264N2112r4984j0583P4457l5469R8120Q536l6166
$$ plain form
13362 5292677 5221319 5043170 4827297 4559447 4262758 4048886 3935413 3808560 3663948 3620577
13352 3620577 3583850 3408227 3218440 3119440 2995469 2931137 2949407 2981159 2963612 2861402
13342 2861402 2656241 2527578 2412109 2310348 2209417 2170873 2133257 1997666 1910606 1936567
13332 1936567 1811288 1601969 1540354 1532539 1619295 1621220 1637443 1588593 1648942 1682627 1451367
13321 1451367 1370708 1404196 1402890 1357004 1380876 1369182 1448845 1472979 1326678 1104481 1049835
13310 1049835 976785 865185 892688 938039 940079 897335 935155 853361 879822 947422 899158
13299 899158 827397 841871 918068 923773 949114 919255 804286 730298 713761 706865 708138 762556
13287 762556 769910 627430 581073 567809 619921 524937 514354 588811 553342 651462 659998 623832
13275F23832n2590M3295j137j50537o0475q2812n7640m8465Q9575J11829M3281
13264D58156k71361q4948R3397Q8859q1325m2144R6889R6948O2704l587p762j29156
13252B76670j48712M9088O1591N7016O8307P5162o0160o2427M4467k1809j97112
13241A42081J01045J3773J7662R25k7718M7379j59416p4766o8532m2819p4486
13230a24872J09905Q0057O9977j12979P0568M1729n0583K266l215l7607L7287
13219H2533M894O3563j9311M4263J58132j68365j43069J52012O9075m7887L0317
13208B26157j1581n00m0584j09571j16004K4378P4172P4353P6750J9253j8122
13197A98701k2953N9759P1070K111j9767L6295J03501m4767k3303r3377q8420
$$ plain form
13275 623832 571242 614537 613400 462863 402388 319576 261936 213471 303046 414875 458156
13264 458156 186795 101847 195244 284103 202778 160634 257523 354471 417175 413588 405826 276670
13252 276670 127958 177046 238637 295653 363960 439122 378962 316535 361002 339193 142081
13241 142081 243126 256899 274561 275486 247768 295147 135731 60965 -7567 -50386 -124872
13230 -124872 -14967 65090 135067 22088 92656 134385 83802 86068 82853 45246 82533
13219 82533 87427 150990 131679 175942 334074 165709 22640 174652 243727 195840 226157
13208 226157 214576 214076 173492 63921 -52083 -27705 46467 120820 197570 216823 198701
13197 198701 175748 235507 306577 308688 288921 325216 428717 383950 360647 267270 178850
13186A78850m1104m4184J4011K1683M4555K1134J5856q260m4112L7997K8434k1552
13174B03308j68059q5079j783p2120J9948J37258J8796k8832m1439j0759K7400
13163a361J1322P3690J9803J0258O3364M4981j19325m5072J9679l9570P0247J53685
13151B61701N616L3756p8109j20329k1022k7867Q3931N6138k9164p9205q8804
13140c358J14346L3174j03146m2456K8657L9657L8344m6637J2700k4149M7925
13129I5057K8104K2169K4583L7294j50298k10141J61680J96421o9147m9926J7010
13118A02806n2916k300P5298l6034l2910O0356M4375N5866j03618j22248R34o0406
13106g0797r9049J43841k5184o6154Q3626J46261o6206n0444k5526j882N8244
$$ plain form
13186 178850 137746 93562 107573 129256 173811 194945 210801 202541 158429 196426 224860 203308
13174 203308 35249 -49830 -51613 -123733 -103785 33473 52269 23437 -18002 -28761 -1361
13163 -1361 9961 83651 103454 113712 177076 222057 102732 57660 77339 37769 108016 261701
13151 261701 267317 301073 222964 102635 81613 53746 137677 193815 164651 85446 -3358
13140 -3358 110988 144162 41016 -1440 27217 66874 105218 58581 71281 47132 95057
13129 95057 123161 145330 169913 207207 56909 -153232 8448 204869 135722 85796 102806
13118 102806 49890 47590 122888 86854 53944 114300 158675 214541 110923 -11325 -10391 -70797
13106 -70797 -169846 -26005 -51189 -117343 -33717 112544 46338 -4106 -29632 -31514 26730
13095B6730k0462j3406j19683j56835j20272J22843Q7517M2089J25584Q4531P7805
13084A36441m6934K1381k0057J817n1614p0230K3075K6747P7772J2445L0283j4988
13072A26138N3305j7729j4623J63978L8640k8876p8933j47933j0056p6538k2508
13061a5135q3190l5225L2320O2100q9999P165R047k0753J0660J11057M1988j15534
13049h5499m4322Q4067J17080M5780J02524J3400L872k2194J32130l0769J1275
13038C27344R8179J70188O0489k4553N4412R5713J4909K5900l5201j12676j74065
13027E00639j87942l9666L7355o2088o1926m703K7699r6683q199J12445j1711
13016B05220L281O9393J59446N8111j26168j16344N6173J33568M0888m8177L1767
$$ plain form
13095 26730 6268 -7138 -126821 -283656 -403928 -281085 -193568 -151479 -25895 58636 136441
13084 136441 89507 110888 90831 92648 41034 -29196 -6121 20626 98398 110843 141126 126138
13072 126138 179443 161714 147091 311069 349709 320833 241900 93967 83911 7373 -15135
13061 -15135 -98325 -133550 -101230 -39130 -129129 -121964 -112917 -133670 -123010 -11953 30035 -85499
13049 -85499 -129821 -45754 71326 117106 219630 233030 236902 214708 346838 316069 327344
13038 327344 425523 595711 656200 631647 686059 781772 796681 822581 787380 674704 500639
13027 500639 312697 273031 310386 248298 186372 181669 209368 112685 104486 216931 205220
13016 205220 208501 277894 437340 495451 369283 252939 309112 442680 483568 435391 467158
13005D67158p3445O3241J43022N0594q1579q1603n3294k0804P0957m1023k4292
12994D18932o4657j5041J69281K49839j7341J56454P1054J04166L3297j20073
12984I85911k19006k00712o1653m4512m9873N3645j4345j30305j13862L6436L3764
12973B75488N4861L0066M4267k4805N9379L6024J02242m3970j9588K1335j28222
12962D07077J4635Q9967r0650q0463N8090M8197o1556o4115j27488J5786q3744
12951A25736j21257M0846m5948N4866O890M0391J04857N2664J89453n164p7956
12940C65378L9383R9584J5863j45615j72367j69296M8892J23573J0914R9716M8358
12929C64383r5300j04254r3525K9121k0483K7670J1760J8163n2045j73405J3374
$$ plain form
13005 467158 393713 456954 599976 650570 568991 487388 434094 413290 484247 443224 418932
12994 418932 354275 339234 508515 758354 741013 897467 968521 1072687 1105984 985911
12984 985911 766905 566193 504540 460028 410155 463800 449455 319150 205288 241724 275488
12973 275488 330349 360415 404682 379877 439256 475280 577522 533552 513964 535299 407077
12962 407077 421712 511679 421029 340566 398656 446853 385297 321182 193694 209480 125736
12951 125736 4479 45325 -623 54243 61133 101524 206381 259045 448498 443334 365378
12940 365378 404761 504345 520208 374593 202226 32930 81822 205395 216309 316025 364383
12929 364383 269083 164829 71304 100425 79942 107612 119372 137535 85490 -87915 -74541
12918g4541j9073J04481J32648K8949n7047r5409L1689j4090L9815n6774Q5212
12907A05860J5953K6173l6979o0122j30356N396K8304j2937r333O4669J9733l8631
12895b2270j923P4032P0233J707p3969q6380o5419J5974k9933M7351m596L2434
12883d2759j48425j2048J03449L3905L9355q7324n7023J23851j04366l6212J62354
12872b5243l8085j06327Q4332R6343O0334l7858j26988K4247Q6227k1942m6L4888
12860B9882p6317o6445L0920J46059K7034j10959r905L3501P5837M3075j8136
12849A04546m7583k8654m2079J7351N6157o3412j43460l6527J1887L1908Q4276
12838e5590r8157j17712l4065L2786Q4591M7879R1318Q2132k67j36916J24575
$$ plain form
12918 -74541 -93614 10867 143515 172464 115417 20008 51697 37607 77422 20648 105860
12907 105860 121813 147986 111007 50885 -79471 -74075 -45771 -58708 -68041 -3372 16361 -22270
12895 -22270 -24193 49839 120072 121779 47810 -38570 -103989 -88015 -117948 -70597 -75193 -42759
12883 -42759 -191184 -203232 -99783 -65878 -26523 -113847 -170870 -47019 -151385 -187597 -25243
12872 -25243 -63328 -169655 -85323 11020 71354 33496 -93492 -69245 16982 -4960 -5006 29882
12860 29882 -46435 -112880 -81960 64099 91133 -19826 -29731 3770 79607 122682 104546
12849 104546 56963 28309 -13770 3581 59738 -3674 -147134 -183661 -171774 -139866 -55590
12838 -55590 -153747 -271459 -305524 -272738 -188147 -140268 -48950 33182 32915 -104001 20574
12827B0574P8668K4866O2986P1999q2050m0260M0620J6348p2623j23072o9674
12816g1618m0667N108J95095M5054n4010m917O4507j02898q1768q0010r1226J0443
12804b06907k1883M4087K5870J19757L4812K6269j3963j61697O2623N9866J1023
12793b0143m194p8926m4272P8731Q4491j39623l5052n13k4907K7100J19998J637
12781c5673O0357L0098p1456k1780J8415l1017p0537p3449K0410K4158o046J9081
12769a37439J19166Q7844P4256j6111j27782o0084m0544k6413K3688M4799N5639
12758b981p5488j7323l1370N8382N7538L8994N1891M8021m6084r9942q2828l9469
12746a40659O8968q2497r5176M4933Q2550l8349Q8660L8905P2076k3537k2997
$$ plain form
12827 20574 99242 124108 187094 259093 177043 136783 177403 193751 121128 -1944 -71618
12816 -71618 -112285 -107177 87918 132972 78962 74045 138552 35654 -46114 -126124 -217350 -206907
12804 -206907 -228790 -184703 -158833 -39076 -4264 22005 8042 -153655 -91032 -31166 -20143
12793 -20143 -24337 -103263 -147535 -68804 15687 -123936 -158988 -159501 -184408 -157308 -37310 -35673
12781 -35673 24684 54782 -16674 -38454 -20039 -51056 -121593 -195042 -174632 -150474 -156520 -137439
12769 -137439 -18273 69571 143827 127716 -66 -60150 -100694 -127107 -103419 -58620 -2981
12758 -2981 -78469 -95792 -127162 -68780 -11242 27752 79643 127664 81580 -18362 -101190 -140659
12746 -140659 -71691 -154188 -249364 -204431 -121881 -160230 -71570 -32665 39411 15874 -7123
12735g123P577k0965k5503Q9681M4211j43923l0311J9601K0554j858Q0878k4933
12723G886j21371L4918L3126K2172R2266K3223p618m4707l7835n6899j7276M002
12711f8113R1131R1230n6775n3725j07359j5199J92472O7537J3009L6978K6865
12700B18051j4968r4415j64636l0981L6334P8652N0290J33800R3631n6022p4671
12689A75065j1478p7096r9657N762j011m5271j3490j39379P2278R3533N2851m7775
12677c5668n6034m16N1832O7899k1646P853N5153q1655R8028K9852p3423j9441
12665B2334o811r8402n6153r4936O0869Q3000K3985J31920K9432J2809l740l0230
12653G4077r853n6394l0808Q8273m776j5444l2832m4679j2847o1533K215R2258
$$ plain form
12735 -7123 454 -20511 -46014 43667 87878 -56045 -86356 -66755 -46201 -48059 32819 7886
12723 7886 -113485 -78567 -45441 -23269 68997 92220 84602 39895 2060 -54839 -72115 -68113
12711 -68113 23018 114248 57473 3748 -103611 -118810 73662 141199 154208 191186 218051
12700 218051 203083 108668 -55968 -86949 -50615 28037 78327 212127 305758 249736 175065
12689 175065 163587 86491 -13166 -7404 -8415 -53686 -67176 -206555 -134277 -40744 12107 -35668
12677 -35668 -91702 -92118 -40286 27613 5967 13820 68973 -12682 85346 115198 41775 22334
12665 22334 15523 -82879 -139032 -233968 -173099 -90099 -66114 65806 95238 108047 104307 74077
12653 74077 64224 7830 -22978 65295 60519 45075 12243 -32436 -45283 -106816 -104601 -12343
12641a2343J7310R0061r6439n8510J40734J80694j7190m1343j48078K8797j50999
12630f7306p1033N0220k4800J2437K9783R733L3358o5508Q7308r6577l8360l6957
12618a77702R5770R2635M887o833J25195J7872j14655q6400J1150O0717M3853
12607F6489j09042k1681K1358J32498m391q4246J8681k1261j855P1588q131J0046
12595G0053J39736Q1554O5634m6628j31736n0331m8452M3584L9303L4378K4429
12584B21524P4044J06892n0156j9944k3679j82681j98090p1076R1450M4964m7675
12573e4427j1846N7940J9814L18N2324O3783k0959k5816m1904j0598m6624N8331
12561D0336k9003p219O2331L971p1642O536L0197J40990L7266o7270o3567J1520
$$ plain form
12641 -12343 4967 95028 -1411 -59921 80813 261507 244317 202974 54896 83693 -67306
12630 -67306 -138339 -88119 -112919 -100482 -70699 -60966 -27608 -93116 -5808 -102385 -140745 -177702
12618 -177702 -81932 10703 15590 8757 133952 151824 37169 -49231 -38081 22636 66489
12607 66489 -42553 -64234 -42876 89622 85231 985 19666 -1595 -3450 68138 60007 70053
12595 70053 209789 291343 356977 310349 178613 128282 79830 123414 162717 197095 221524
12584 221524 295568 402460 352304 332360 308681 126000 -72090 -143166 -51716 -6752 -54427
12573 -54427 -66273 -8333 11481 11799 64123 127906 106947 81131 39227 28629 -17995 40336
12561 40336 11333 4114 66445 70416 -1226 5310 35507 176497 213763 146493 82926 94446
12549I4446O7222k4556l6042M7558m2134q0475k9440k356O8019o354q1735q6641
12537a12488L9319l5339j21896j6731O4945P7298K6843K252j7368J12126O821
12526B5782n060J32629J5174j48472j03376L8540R1595R9703q139O810m0117m6322
12514E8747l7872j16458R656O1357J1098J69208L2571l5991q128R610N2360R4144
12502C00302m5963j3703l5800j00425p9084j3933L3106J5193M0134m0082j19076
12491e9331p5522K0873K3488R8927n7620m0847K2425M0824Q7820p3977P1356j22880
12479f4464l6924N1374O8434m376N7963P2743o7724q8192k1832m5596J8774Q9349
12467B9529q757j15055J6313M0873J14242P3420r0l8159j08469m5212N1347j19738
$$ plain form
12549 94446 161668 137112 101070 148628 106494 26019 -3421 -5777 62242 55888 -25847 -112488
12537 -112488 -73169 -108508 -230404 -247135 -182190 -104892 -78049 -75797 -93165 18961 25782
12526 25782 20722 153351 168525 20053 -83323 -44783 46812 146515 138376 145186 105069 58747
12514 58747 20875 -95583 -85927 -24570 -13472 155736 188307 152316 144188 153798 206158 300302
12502 300302 254339 240636 204836 104411 25327 11394 44500 59693 99827 59745 -59331
12491 -59331 -134853 -113980 -90492 8435 -49185 -90032 -67607 -26783 61037 -12940 58416 -64464
12479 -64464 -101388 -50014 18420 14044 72007 144750 77026 -11166 -32998 -78594 -59820 29529
12467 29529 20772 -94283 -77970 -37097 77145 150565 150475 112316 3847 -41365 9982 -109756
12455a09756M2787K0867K3222K8909q0049L1734N1852p9722m2213J8023J09830
12444A5484l0759r7616l6731M4563J7554J1639l3668m4041J19773R4346M7181
12433A07725J5564N2530j3606k3991q4061m7967J32935q3256m4481K1493o952
12422B5933n6905r8097p5594O908J642o4245l5726N8397M4590j9648M4107J92029
12410B3391J48044R006j07533j44309m9318k9903n4786j3610J02044K7581P6862
12399a2531P1488Q0232K2282j8990P2181J4985n5039r6466L7768l8986j15383
12388c8459K9382q4333N1432K7978l0137J24499J17088l429r7316q656m3476N2738
12376I7311K4798q8949k2343J21043O8419O8088k0435p5113q5446q4723j1876
$$ plain form
12455 -109756 -66969 -46102 -22880 6029 -74020 -42286 9566 -70156 -112369 -94346 15484
12444 15484 -15275 -112891 -149622 -105059 -87505 -75866 -109534 -153575 -33802 60544 107725
12433 107725 123289 175819 162213 138222 54161 6194 139129 55873 11392 32885 25933
12422 25933 -30972 -129069 -204663 -197755 -196113 -260358 -296084 -237687 -193097 -212745 -168638 23391
12410 23391 171435 180441 72908 -71401 -120719 -150622 -205408 -219018 -116974 -89393 -12531
12399 -12531 58957 139189 161471 142481 214662 229647 174608 78142 115910 76924 -38459
12388 -38459 -9077 -93410 -41978 -14000 -44137 80362 197450 194021 96705 88049 44573 97311
12376 97311 122109 33160 10817 131860 200279 268367 247932 172819 87373 2650 -9226
12365i226j0905m1609L4870R4396O2164n5816k6082j7122o1129n1836M995L9764
12353c7536k4877p6522M4686J05103m7476p071P7694K2704J96572j0643L43q3792
12341A59185j21301k7049O9627K2526O6133n6176j5800J03012o2585j31883N2224
12330E7913Q1869k3265j56806o7049m5212o5396R464R4352N1389j1401j2261M8654
12318c7749N2843O4379K7502Q919l4047K9888J2211j4265n4857p3287o9878J3294
12306g5047K2151P0296M0915J3415K8671N5112o7463P5396k3277m3132p6777k9961
12294i701P3997m0945K8663M6550M3801Q1062j11197j33584m1889m9338J02747
12283i834M9545o4704j8573j01357L166k5387J96934N0594k10324j13865M4083
$$ plain form
12365 -9226 -20131 -61740 -26870 67526 129690 73874 47792 30670 -30459 -82295 -77300 -37536
12353 -37536 -62413 -138935 -94249 10854 -36622 -43693 34001 56705 253277 242634 242977 159185
12341 159185 37884 10835 80462 102988 169121 112945 97145 200157 137572 5689 57913
12330 57913 139782 116517 -40289 -107338 -152550 -217946 -208482 -114130 -62741 -74142 -86403 -37749
12318 -37749 15094 79473 106975 115894 81847 111735 123946 109681 54824 -18463 -88341 -75047
12306 -75047 -52896 17400 58315 71730 100401 155513 88050 163446 140169 97037 20260 -9701
12294 -9701 64296 23351 52014 98564 142365 223427 112230 -21354 -63243 -112581 -9834
12283 -9834 39711 -24993 -43566 -144923 -141757 -167144 29790 80384 -129940 -243805 -199722
12272a99722J8950M1809R3823m6200j764p7141M7934r133p1772p3338n8502J68291
12260a66765N2146p9581J7844P4898P135k1769R3495M6366J7560j4698r0317j31405
12248a95091J9826M4963K1197J30873M9916K0304l260L2237j52048n2327j36280
12237b19690p1275N5687J05386M3328N3246L1479M6419M3571o0894K6481L5426
12226H9164L9390R6966k7338j93267p9491O180J00803K7605p0391M0187j4732
12215A5076O9492J1065J0555J8727j7936J30855Q9202m4691k07728n5186N8116
12204G7547q2959o2849p3946o9536P6084K40036P1719j21208q8602K4338m846
12193a4222N171K3715j45559O4060J25215k7788P4596J28406p8984n6676p7086
$$ plain form
12272 -199722 -180772 -138963 -45140 -91340 -93104 -170245 -122311 -131444 -203216 -276554 -335056 -166765
12260 -166765 -114619 -194200 -176356 -101458 -94323 -116092 -22597 23769 41329 26631 -63686 -195091
12248 -195091 -175265 -130302 -109105 21768 71684 91988 88728 120965 -31083 -83410 -219690
12237 -219690 -290965 -235278 -129892 -86564 -33318 -1839 44580 88151 27257 53738 89164
12226 89164 128554 225520 198182 4915 -74576 -68396 32407 60012 -10379 29808 15076
12215 15076 84568 95633 106188 124915 106979 237834 327036 282345 74617 19431 77547
12204 77547 -5412 -68261 -142207 -211743 -135659 104377 176096 54888 -33714 -9376 -14222
12193 -14222 -9051 14664 -130895 -66835 58380 30592 105188 233594 154610 97934 20848
12182B0848O96K0277R6495P4140M21l5596K4227M6000l2411p1098j00791M3538
12170H6746k9591J4129J861o624J33057k064j8389K2124M1733r4187j16206J5727
12158D8316j16683l5936M4789J60895P4288r1323r1867J06041l517m5313q5321
12147c5631l8558R009N746O1963N519M2460L0929m0502j02379K6750K5139j8415
12135b7970N7504O5524K8206O4828k9658p9184Q34O6297O8586q7424o7079j22170
12123f1706j2996K21255k7863K6737M7028J36469J38760L569l7893P314J19008
12112E59682L0071o0275j4072J5234j67407j03632J5704j5762q2026j40712k5256
12101A1549M6997o9285L4526P719j14100J9976M614l3271j8521O149J1956p9900
$$ plain form
12182 20848 21544 41821 138316 212456 212877 177281 201508 247508 215097 143999 43208 86746
12170 86746 57155 71284 73145 66521 199578 197514 179125 201249 242982 148795 32589 48316
12158 48316 -68367 -104303 -59514 101381 175669 84346 -7521 98520 95003 49690 -35631
12147 -35631 -74189 -65180 -59434 2529 8048 50508 81437 40935 -61444 -34694 -9555 -27970
12135 -27970 29534 95058 123264 188092 158434 79250 80084 146381 214967 127543 60464 -61706
12123 -61706 -74702 146553 118690 145427 192455 328924 467684 471253 433360 440674 559682
12112 559682 589753 529478 515406 530640 363233 259601 275305 259543 177517 36805 11549
12101 11549 58546 -10739 23787 31506 -82594 -62618 -58004 -91275 -109796 -103647 -91691 -171591
12089a71591P2212Q8640j36626N4411J16201J21275p9428L4183J1018m8804j23226
12078f1735r306P1582O0364L3126j03120J12876P7066O4180P4250q8809o7617
12067A62857K105L8916K4372l8995o4009Q0802m9268o6547J9931O1781O9833J05570
12055C47348J45047J35123K4391j10563L6N9181Q1381Q87o5817p5862j12128m5514
12043C83510n740o2274R091j8082M2482n1024n2051l084j9967k5236L9960K1980
12031B59565O205M3365j1427k2114j8532J08952J02287r7957J1781k7251J1177
12020C66051J5983R6978j69422n4637Q2218j9939m8066P3331J01004r2376l7606
12009C13519O2873R7777P9262M8453p1325j2514J2253L9273q6433j48210N2048
$$ plain form
12089 -171591 -99379 -10739 -147365 -92954 23247 144522 65094 99277 110295 61491 -61735
12078 -61735 -71041 541 60905 94031 -9089 103787 180853 245033 319283 230474 162857
12067 162857 164962 203878 228250 189255 125246 206048 156780 90233 110164 171945 241778 347348
12055 347348 492395 627518 651909 541346 541382 600563 681944 682831 617014 541152 429024 383510
12043 383510 377770 315496 324587 306505 348987 297963 245912 242828 222861 197625 237585 259565
12031 259565 265770 309135 297708 275594 257062 366014 468301 370344 382125 354874 366051
12020 366051 382034 479012 309590 254953 337171 317232 269166 342497 443501 351125 313519
12009 313519 376392 474169 553431 601884 530559 518045 530298 569571 483138 334928 386976
11998C86976J55100N6322M6580R4449Q6238q4751j6251K7010O2845Q9559M0896
11987I44973m3022JK5766N4160K9754o5500p6659Q0857J626q6863k0964P4580
11975I18709M5802K9283J63073J24155J17886J28184l0169J01871K2285L1383
11965A652462K07365L32896J43402k3255L6470K75919J35975J51656J74356J54077
11955C241323K55162L20061J99599L63430M62426M31793M53021N36619O14008
11946F877442O28379P62237Q96869J039464J322359J629130J774462K154643K656080
11937A9741065L325034M230024N672632P504419J0259963J4963296K2308438L3499892
11929A21504763M7708948N5345186M5445356K8383681K3737278K5723705J8766994
$$ plain form
11998 386976 542076 598398 644978 739427 825665 740914 724663 751673 814518 904077 944973
11987 944973 901951 901952 927718 981878 1011632 946132 869473 950330 951956 865093 844129 918709
11975 918709 964511 993794 1156867 1281022 1398908 1527092 1496923 1598794 1621079 1652462
11965 1652462 1859827 2192723 2336125 2312870 2349340 2625259 2761234 2912890 3087246 3241323
11955 3241323 3496485 3816546 4016145 4379575 4842001 5273794 5726815 6263434 6877442
11946 6877442 7505821 8268058 9164927 10204391 11526750 13155880 14930342 17084985 19741065
11937 19741065 23066099 27296123 32968755 40473174 50733137 65696433 88004871 121504763
11929 121504763 169213711 224558897 270004253 298387934 322125212 347848917 366615911
11922C66615911M346342j1834714l8749121o6909267o6095794m7057083l0646564
11915A09669710k0202169j3787029r991637p357156n711216m633148l890563l343838
11907D0752954k756895k505075k161210j986640j735754j540642j423907j423464
11899B5219367j248643r80398j001461q79648p63114o74204q52301p86531p64979
11890A7268088q54891n59965n41537n03948n15780n66638n79716n54871m26002
11881A2164740l35923k22254l69058m02625m55523k86443k39608k18932j80954
11872I453420k71577l09374k94038l95525k85464j82402j06126k89267l37328
11863F982319l08210j55779k12041j01522r0301n6779j47543l00064j89473j1324
$$ plain form
11922 366615911 370962253 359127539 320378418 253469151 187373357 140316274 109669710
11915 109669710 89467541 75680512 65688875 58331719 52620503 47987355 44096792 40752954
11907 40752954 37996059 35490984 33329774 31343134 29607380 28066738 26642831 25219367
11899 25219367 23970724 22990326 21988865 21109217 20346103 19671899 18819598 18033067 17268088
11890 17268088 16413197 15853232 15311695 14807747 14291967 13725329 13145613 12590742 12164740
11881 12164740 11828817 11606563 11237505 10834880 10379357 10092914 9853306 9634374 9453420
11872 9453420 9181843 8872469 8578431 8182906 7897442 7715040 7608914 7319647 6982319
11863 6982319 6674109 6518330 6306289 6204767 6114466 6057687 5910144 5610080 5420607 5409283
11853E409283j17095j26498j61314k80578k43883q0828k05971m5512j8405j62997
11843C966202j72251p6091j06544k50948m5135n4755j65593j66440J8354l3127
11833B913672n6571R0781m1568j96796r6110r6814l7073J2269p496j50002p7944
11822B256348r4123n4316k0683m6871l1695O1521q0677j02131p2081j62575M7978
11811A700695O6844P26o7481q5920J4262L7930l6685P3337L8097j74409j74036
11800A393360l3295J99100J77486O3317j19088k06007p5982l6256P5873p8077
11790A360431k8487j46446p8811n164K1550N8733k02757j64596j19254k3241r5152
11779E76806k0867P5639l3006N6433J186J0316N1702j21142q8159J5335K7559
$$ plain form
11853 5409283 5292188 5165690 5004376 4723798 4479915 4399087 4193116 4147604 4129199 3966202
11843 3966202 3793951 3717860 3611316 3360368 3315233 3260478 3094885 2928445 2946799 2913672
11833 2913672 2857101 2947882 2906314 2709518 2613408 2516594 2479521 2491790 2484294 2334292 2256348
11822 2256348 2162225 2107909 2087226 2040355 2008660 2070181 1989504 1887373 1815292 1652717 1700695
11811 1700695 1767539 1768265 1700784 1614864 1629126 1667056 1630371 1703708 1741805 1567396 1393360
11800 1393360 1360065 1559165 1736651 1799968 1680880 1474873 1398891 1362635 1438508 1360431
11790 1360431 1331944 1185498 1106687 1101523 1123073 1181806 979049 814453 695199 671958 576806
11779 576806 555939 631578 598572 655005 656191 666507 718209 597067 508908 524243 551802
11768E51802j9536j25777m9936R3636J21142R0690j0930k8713j34954k3118Q0043
11757E44349j05952j8518L9105k5891J570Q1476J47872k9159L3030k20621j30434
11746C16827J1996O6504M4148k2445N0778q2006l2747l8140k1306j7340r2412
11735A83857q8045n0969p6177j1467J13653R8066K0185J49491o6867L045j04819
11724A69953r0788l4392K3054K5022R4065l9167j80639N5296K3203j10609K08310
11713A43308J70403N2485k4197l6225o9099j06115K4610J43430k9349k1603J01171
11702C48819l7892j29791n9258L7384O5640k9676Q795M7254m4290M4386r7883
11691A53488q7785M5036O1165o121Q7203N0919m9500j31300j60922l7466J72478
$$ plain form
11768 551802 532266 406489 356553 450189 571331 662021 651091 622378 487424 464306 544349
11757 544349 438397 419879 458984 433093 434663 516139 664011 634852 667882 447261 316827
11746 316827 328823 395327 439475 417030 467808 385802 353055 314915 293609 276269 183857
11735 183857 95812 44843 -31334 -42801 70852 168918 189103 338594 271727 274772 169953
11724 169953 79165 44773 67827 92849 186914 147747 -32892 22404 45607 -65002 143308
11713 143308 313711 366196 341999 305774 236675 130560 155170 298600 269251 247648 348819
11702 348819 310927 181136 121878 159262 224902 195226 204021 251275 206985 251371 153488
11691 153488 65703 110739 171904 165783 252986 303905 254405 123105 -37817 -75283 97195
11680I7195O3141j9087k0427L0686m7633O4859K45539K8162j08482k0965K9329
11669C42317m7717M039Q1226N4550n4571l6200j29268n6286n5495n5191O3406
11658A10810k8111j09241J86224O4617l0094J6603J24918o1300j46248j09904
11648A8274L5281K9528r8652l4936j3462Q3152R8586M5147M3202k9004j51635
11637B5481K1534M1010J0973m1509L8662L9567k7630j12123N3578O1450m7784
11626F3209k22815j01182J24215R3237j30278k3942L8271K188J1051J10971r2436
11615a27511j8365K15613R7250m3604o6803l2338Q9733o4403m8294M8294m2792
11604F780K1518L2584l3880J2115m7658j18269k3801J42962P8946N6991M7161
$$ plain form
11680 97195 160336 141249 120822 151508 103875 168734 414273 442435 333953 312988 342317
11669 342317 294600 298639 379865 434415 379844 343644 214376 158090 102595 47404 110810
11658 110810 82699 -26542 159682 224299 194205 210808 335726 274426 128178 18274
11648 18274 53555 83083 -15569 -50505 -63967 19185 117771 162918 206120 177116 25481
11637 25481 47015 88025 98998 57489 96151 135718 108088 -4035 49543 110993 63209
11626 63209 -159606 -260788 -136573 -43336 -173614 -197556 -159285 -157097 -146046 -35075 -127511
11615 -127511 -145876 69737 166987 123383 56580 24242 113975 49572 1278 49572 6780
11604 6780 28298 60882 27002 39117 -8541 -126810 -150611 -7649 71297 128288 175449
11593A75449j54614N171N5701j7073o886K9993n0397m3550k0547Q5011Q2048k9945
11581A10361j11109M2874J0940J9786K2571Q910J12381l326L6383k8490o5816
11570A55465K2292N6949k9903p0010M2767O2155N711q8157j55764j31177j9979
11559a49651K1419J2363j4024J11186M6164k2752M243n5848m7005J62107J02385
11548A70587J5326l3456j00537J2653n020J2438O9506J66797l35q5748O29k7334
11536A95506l7595R96m2243K3041n7583j08884j5736M4393j06448j02864p014
11525b14431k211j7151O9214P8381J0182O9207N9444j33481N1314P1516n7906
11514a5922k9925O2621O378J8341j9942Q3111o1455P4173K8994j5481M7787l5120
$$ plain form
11593 175449 20835 26006 81707 64634 57748 87741 37344 -6206 -26753 58258 140306 110361
11581 110361 -748 42126 53066 72852 95423 104333 216714 213388 249771 221281 155465
11570 155465 177757 234706 204803 134793 177560 239715 245426 157269 1505 -129672 -149651
11559 -149651 -128232 -115869 -129893 -18707 27457 4705 8948 -46900 -93905 68202 170587
11548 170587 185913 152457 51920 64573 59553 71991 141497 308294 307959 222211 222840 195506
11536 195506 157911 158907 116664 139705 82122 -26762 -42498 1895 -104553 -207417 -214431
11525 -214431 -216642 -233793 -164579 -86198 -76016 -6809 52635 -80846 -29532 41984 -15922
11514 -15922 -45847 16774 23152 41493 21551 104662 43207 117380 146374 130893 178680 143560
11502A43560m0397l5621p4873N5834j8012p3189K0571j7029K9891J01987j44373
11491e1651o4729Q2619M2952l0308j15299n5744N9253J42480O1496K0383p8879
11480A2573J3780J41184K4045k6341r1216N4112l9316J3447j28504j34780L6264
11469a24752R0159j8677L3348P1080j49163j20491K4704p0980J50159J27534j5756
11458b835k2999J88231l2693q8334K1116L2185L9934n8697J669M3298j19122n0230
11446d8477k5354J06254Q2728P6820k8185o875J3428M9179l5635j41461m6174
11435c752Q9023J0886j96111q9551J05511q812j09938k9817P7057J15467l7105
11424g7142L2844L3570M8312Q70L2162J30975N5214k22023j53984J10575n6901
$$ plain form
11502 143560 103163 67542 -7331 48503 30491 -42698 -22127 -39156 -9265 92722 -51651
11491 -51651 -116380 -33761 9191 -21117 -136416 -192160 -132907 9573 71069 91452 12573
11480 12573 26353 167537 191582 165241 74025 128137 88821 102268 -26236 -161016 -124752
11469 -124752 -34593 -53270 -19922 51158 -98005 -218496 -193792 -264772 -114613 12921 -2835
11458 -2835 -25834 162397 129704 41370 62486 94671 134605 75908 77577 120875 1753 -48477
11446 -48477 -73831 32423 115151 191971 163786 156911 170339 219518 183883 42422 -3752
11435 -3752 85271 96157 -99954 -189505 -83994 -92806 -202744 -232561 -155504 -40037 -77142
11424 -77142 -44298 -10728 37584 38454 70616 201591 256805 34782 -119202 -8627 -65528
11413f5528K3406k8389j45298J31963J85059O9619o9125P3912J5599o7565m7096
11402G6557m3541k0904K4861N274o2533j5222N0836j2133r7254M1764j053k5910
11390g9258J8171J8020n2740k3940O6198P5995R6898o5280J5403K83q5903r0526
11378a06679K2794N5150K6316j53879o849O506m5169Q5659J9278p4880N9186J23121
11366A0554J18215R3449j20127j61898K7169M6867o6386m5821l6250N6048J49762
11355G1582j3017k5968k0202m3852L2532j9604N7228J2358K6204l1333J4413m5347
11343A4994Q0361N9305j5335Q874L4123o1788K902k14K5979m6575k6277q1254
11331d905p5761K2429R0544J5604p404q8930K8607l0142O2916L2207R476j16404
$$ plain form
11413 -65528 -42122 -70511 -215809 -83846 101213 170832 101707 175619 191218 123653 76557
11402 76557 33016 12112 36973 42247 -20286 -35508 15328 3195 -94059 -52295 -53348 -79258
11390 -79258 -61087 -43067 -95807 -119747 -53549 22446 119344 54064 69467 69750 -16153 -106679
11378 -106679 -83885 -28735 -2419 -156298 -163147 -156641 -201810 -116151 -96873 -171753 -112567 10554
11366 10554 128769 222218 102091 -59807 -32638 14229 -52157 -97978 -134228 -78180 71582
11355 71582 58565 32597 12395 -31457 1075 -18529 38699 51057 77261 45928 60341 14994
11343 14994 95355 154660 139325 148199 182322 120534 123436 123222 149201 102626 76349 -4905
11331 -4905 -80666 -58237 32307 47911 40507 -48423 -19816 -49958 12958 45165 54641 -61763
11319f1763j9461k7868J4948n1757m9689P2781K1663R106J82899j0464n7415l263
11307A9717p197p7509J6136J23336M4650L5735q8961M015j6500j0786J19450N7008
11295B19094j74585j22125n6603J9554J33090j6780n2250j0739q1531K0781O8201
11284e3893J03660k6431J7712k6083p2818p25O6685l3625r6862j12789k279O3005
11272a74443J73Q884k2107R9093R2707k700O822J2463N0570l3705j0755j18427
11260i1425K4254J1815M817J8542J4279j8478m5822K6969l6047M2544Q3519m3726
11248h759l8220m360q2015M069P5713m5538K9191J78633R450l4681q4174L0844
11236C0153N517k0253p6985j01702J04377O5412r519j93227j6209R7433O7348
$$ plain form
11319 -61763 -81224 -109092 -94144 -145901 -195590 -122809 -101146 -92040 90859 80395 22980 19717
11307 19717 12520 -64989 -48853 74483 119133 154868 65907 69922 53422 42636 162086 219094
11295 219094 44509 -77616 -134219 -114665 18425 1645 -50605 -61344 -142875 -122094 -53893
11284 -53893 49767 23336 41048 14965 -57853 -58578 8107 -25518 -122380 -235169 -237448 -174443
11272 -174443 -174270 -165386 -187493 -88400 4307 1607 8429 20892 71462 37757 27002 -91425
11260 -91425 -67171 -55356 -50539 -31997 -17718 -36196 -82018 -55049 -91096 -48552 34967 -8759
11248 -8759 -46979 -51339 -133354 -129285 -53572 -99110 -69919 108714 118164 83483 -691 30153
11236 30153 35670 15417 -61568 -163270 -58893 6519 -3000 -196227 -212436 -115003 -47655
11225d7655P0085j093J4601K2790L1646N004o7869J2338O2945m3819k7962m4251
11213a3240o850j08936j3195l0171M6208R1976n399l3222P245J50656k1581j2602
11201E0889N886K012p6598P6931j7057n5333l3550J30731j15573o4769J15175
11190A8744m199K159L7266m9188K9681J91286Q7500P248q6511m2979j91274P5122
11178G4855n9191J2621P6523n645o1213o4210j7011j5755M386j59980m4625R8361
11166a60884N3869n937O0750P1980q127o8967m335R5420J5388q4084K1737L8550
11154B5360N4136m1693r5897Q4463J06192p7722j72771J5406L0929Q6424O5000
11143G9827r889r5249M692o3902M529j7035K9506Q6651M3893n128j8979l3396
$$ plain form
11225 -47655 22430 21337 35938 58728 90374 95378 27509 39847 102792 58973 31011 -13240
11213 -13240 -20090 -129026 -142221 -172392 -126184 -34208 -39607 -72829 -65584 85072 63491 50889
11201 50889 56775 58787 -17811 59120 42063 -13270 -46820 83911 -31662 -96431 18744
11190 18744 14545 16704 53970 4782 34463 225749 313249 320497 233986 191007 -267 74855
11178 74855 15664 28285 104808 99163 37950 -26260 -43271 -59026 -54640 -214620 -259245 -160884
11166 -160884 -107015 -112952 -52202 19778 11651 -57316 -61651 33769 49157 -34927 -13190 25360
11154 25360 79496 37803 -58094 26369 132561 54839 -117932 -102526 -71597 14827 79827
11143 79827 69938 -25311 -20619 -84521 -79992 -97027 -67521 19130 63023 57895 38916 5520
11131E520o6411M175J25862j8157N7643l1582N0976Q7612q192j13637M7752O6393
11119B07954O9767M91j27494n7571o4850j01695J3762M7998M5099l8212L8891
11108C4140J2535R17P5877J33226r7029j31854o2636n1491J1831R2066M732j24027
11096a01713j27247K7142O5374L4883J01623J24922j03043o0235P2616N273p0958
11085c1363k8353j08427K745N9574R955l4469J1393P9425l867K3537N7601q4991
11073d7240N1715j8553M8110N9542m6200r6388l8073J42289m4960n8965J38414
11062H9691J9112q2888r0101J24307R0794M2782l5915q7510K9635P2656J974K7797
11050B02334j17044J8960J77965L4474n8984j06099j0543R4070Q8002K4892J50224
$$ plain form
11131 5520 -60891 -56716 69146 50989 108632 77050 128026 215638 207446 93809 141561 207954
11119 207954 277721 278212 150718 93147 28297 -73398 -59636 -11638 33461 -4751 34140
11108 34140 46675 47592 123469 256695 159666 27812 -34824 -86315 -74484 17582 22314 -101713
11096 -101713 -228960 -201818 -136444 -101561 62 124984 21941 -38294 34322 39595 -31363
11085 -31363 -59716 -168143 -165398 -105824 -95869 -130338 -118945 -39520 -43387 -19850 37751 -47240
11073 -47240 4475 -14078 34032 93574 47374 -49014 -87087 55202 10242 -48723 89691
11062 89691 108803 25915 -64186 60121 150915 193697 157782 70272 99907 172563 174537 202334
11050 202334 85290 104250 282215 316689 257705 151606 141063 235133 323135 348027 498251
11039D98251J12911L5214r8016m0488J5058P6113Q9321O6992m4104k5999J21578
11028H06831o5598K0028J24426K4322r9647p8018O4438m4386j70633j00224O8267
11017E49806L6976J0317K3212l0709m7274P6811K7984q9149j57530K0915N543
11006D26902m7194L4486p251k0028j981J7228j6578q0564l866P9083k7866o4934
10994B87437k4203K4585o7915m562N3940J2977k5314j26214n8356l3061j11633
10983g2319Q7670L0876j08804N300J38036J8971j16174j00349K4027M2401l3802
10972h4167O3464M7000M5671j7607P4485K2626O198n4971l7111n0139K4997j33973
10960i3527l0076J04554j5278N6117O675n202k9198j11071j56626j16846N6978
$$ plain form
11039 498251 611162 646376 548360 507872 522930 599043 688364 755356 711252 685253 806831
11028 806831 741233 761261 885687 910009 810362 732344 796782 752396 581763 481539 549806
11017 549806 586782 597099 620311 589602 542328 619139 647123 557974 400444 421359 426902
11006 426902 379708 414194 406943 386915 384934 402162 385584 305020 301154 380237 352371 287437
10994 287437 263234 287819 219904 215342 269282 282259 256945 130731 72375 39314 -72319
10983 -72319 15351 46227 -62577 -57277 80759 99730 -16444 -116793 -92766 -50365 -84167
10972 -84167 -20703 26297 71968 54361 128846 151472 157670 102699 65588 15449 40446 -93527
10960 -93527 -123603 -19049 -34327 21790 28465 23263 -5935 -117006 -273632 -390478 -333500
10949c33500o10K02171J43013K4645M2165l0440p3617k4696j34898j3010K9052
10938a69725J2041l2003p6969K4592J52480J72453L9304j75549o9356J01674j8611
10927c9669n6516k9247q096l8606P2800k3885L3149R0840P8883j15779j00955
10916a37081o6059N8165O9199O8324R1353N9105k8074r3440m9884K3542k91m0322
10904d5463M9077m515r5786m0239K7479Q475L0453J22350m675J7246M0845M0112
10892A45359M7623m1256j5252p7134j06298L8563M6455j45941j05167N4078J3187
10881a45783K8208J24777l7783M9704K9413j00j6646J35469Q3462p2039n3017
10870A25665M0634j1951L232l6597m3576l6214L825J08664j1110r9997Q9099N1082
$$ plain form
10949 -333500 -334110 -131939 11074 35719 77884 47444 -26173 -50869 -185767 -198777 -169725
10938 -169725 -157684 -189687 -266656 -242064 -89584 82869 122173 -53376 -122732 -21058 -39669
10927 -39669 -96185 -125432 -133528 -172134 -99334 -123219 -90070 770 79653 -36126 -137081
10916 -137081 -203140 -144975 -75776 -7452 83901 143006 114932 21492 -28392 -4850 -5141 -45463
10904 -45463 3614 -901 -96687 -136926 -109447 -100972 -70519 51831 47156 64402 105247 145359
10892 145359 192982 151726 136474 59340 -46958 -8395 38060 -107881 -213048 -158970 -145783
10881 -145783 -117575 7202 -30581 19123 48536 48436 31790 167259 250721 178682 125665
10870 125665 166299 154348 157580 120983 77407 41193 45018 153682 142572 42575 131674 182756
10858A82756j4398j9548p150L6258n9071j95714j9771P9188Q7258o2729k3289
10847a6210K6382L3678N0453l7041L5376O0876n4085K1173J03778J3934m0721
10836A97593j00763N1748j0669k7725Q5303r7269j0251O8638n2395j34959O9355
10825C8606n3187m5026J08871J30578K4626O177r6816j00947m9062J4016Q1347
10814E9183o3975j7412k9430P4801j4002l7190J4152J31975R0026l7147j1740
10803A59241j00403j12839O2976N6555J49278m2831j07043o6133j43659O3794
10793h1064J20035J35096L3011N0442p6632j15553m2048O7271M5179r3635o8770
10782b6668N4951n277j3901Q9687K6493N2740K6374o5751K4995J329m9063p344
$$ plain form
10858 182756 168358 148810 141660 177918 118847 -76867 -96638 -17450 69808 7079 -16210
10847 -16210 10172 43850 94303 57262 92638 153514 99429 120602 224380 238314 197593
10836 197593 96830 148578 137909 110184 195487 98218 87967 156605 104210 -30749 38606
10825 38606 -14581 -59607 49264 179842 204468 210645 113829 12882 -36180 -22164 59183
10814 59183 -4792 -22204 -51634 23167 9165 -28025 -13873 118102 208128 170981 159241
10803 159241 58838 -54001 8975 65530 214808 171977 64934 -1199 -144858 -81064
10793 -81064 38971 174067 207078 257520 180888 65335 23287 90558 135737 42102 -26668
10782 -26668 28283 23006 9105 98792 125285 178025 204399 138648 163643 164972 115909 108565
10770A08565j32927L0670J41285O0889J6274K9600p7773r1520l7934N019N9939
10759A12087k5999j65776K9596J22822l4839p0174k110M7523R5730r1202m4298
10748b6640J2307J25698O8393m2376n8086L5701n3000J10951P0539j03144K515
10737A42858J01010n147l3737J39147j8922q8595j47587K9988M016n727L3933
10726A51237l560j0901O926J4170J3389j386Q0996Q4560M3495k2506L788O3079
10714D23287N741k1049o2715o5752M3890J06639J31126l4688j15262j15789J18312
10703D13740M6634j19128m379q2852k456k3155O465m3978L4984J01185L2868j4966
10691C44962j0657J1712q3518n0636L4187P7486j6101O548l3203l4927r863J1497
$$ plain form
10770 108565 -24362 6308 147593 208482 224756 254356 176583 85063 47129 52148 112087
10759 112087 86088 -79688 -50092 72730 37891 -32283 -34393 13130 108860 17658 -26640
10748 -26640 -14333 111365 179758 137382 79296 114997 61997 172948 243487 140343 142858
10737 142858 243868 238721 204984 344131 325209 236614 89027 119015 123031 117304 151237
10726 151237 147677 136776 143702 157872 171261 169875 250871 335431 378926 356420 360208 423287
10714 423287 429028 407979 345264 279512 323402 430041 561167 526479 411217 295428 413740
10703 413740 460374 341246 336867 254015 251559 228404 234869 190891 225875 327060 359928 344962
10691 344962 334305 346017 262499 211863 246050 323536 307435 313983 280780 245853 235990 247487
10679B47487L6601N5231M0666J8277k4540J75731L1894r2565j20004n2581O3485
10668C79682Q2077R2074q1766j27554L7502L6784K2023P2050J04106m6151L5699
10657F06526M2629n2686P1290P525J13776J98823N9238k1120N9627J53680k8454
10646A210854o9282j857J63790J54428O7663J30183Q4775K20805K88809L53469
10636B603637L27641L38042M83295M26103M17087N06005P80565J037985J305574
10627H225934J628300K100997L063598L846041M546983M968339M810752M504105
10619C7695049M439961M145896L798228L347052K777307K196318K489539M080457
10611F4969807O256209P493116P469307O788981O473720O003988N013516L357264
$$ plain form
10679 247487 284088 339319 379985 398262 373722 549453 581347 488782 368778 316197 379682
10668 379682 461759 553833 472067 344513 382015 418799 440822 512872 616978 570827 606526
10657 606526 649155 596469 667759 675284 789060 987883 1047121 1026001 1085628 1239308 1210854
10646 1210854 1141572 1139715 1303505 1457933 1525596 1655779 1740554 1961359 2250168 2603637
10636 2603637 2931278 3269320 3752615 4178718 4595805 5101810 5882375 6920360 8225934
10627 8225934 9854234 11955231 15018829 18864870 23411853 28380192 33190944 37695049
10619 37695049 42135010 46280906 50079134 53426186 56203493 58399811 60889350 64969807
10611 64969807 71226016 78719132 86188439 92977420 99451140 105455128 110468644 113825908
10603A13825908J283465o82283r69981J625762N045473P078026P016401O178819
10595A40401590N701011M908494K539256p46450m496774q253630r529437p448132
10587A23075928l549879q45174R3324K69741L39475l7081j476055l673377o286382
10578A07910520q861701r602589p817932n369722l482177k331097j943290j809083
10570F6692929j977407k680415l895076m902011n567601n955411n492702m326125
10562C1896181l349564k693292k169173j832347j450122j155372j095801r48234
10554A7202276o95613p39522p83201m92112n61810n59973n24116n04558l71513
10545A1969858l50691l54175m80350m14900l66695l44905l81086l34025k00338
$$ plain form
10603 113825908 115109373 114427090 113457109 115082871 120128344 127206370 134222771 140401590
10595 140401590 146102601 151011095 153550351 152803901 148307127 140053497 130524060 123075928
10587 123075928 119526049 118680875 118774199 119043940 119383415 119346334 117870279 114196902 107910520
10578 107910520 99048819 89446230 81628298 76258576 72776399 70445302 68502012 66692929
10570 66692929 64715522 62035107 58140031 53238020 47670419 41715008 36222306 31896181
10562 31896181 28546617 25853325 23684152 21851805 20401683 19246311 18150510 17202276
10554 17202276 16506663 15767141 14983940 14491828 13930018 13370045 12845929 12341371 11969858
10545 11969858 11619167 11264992 10784642 10369742 10003047 9658142 9277056 8943031 8742693
10536H742693j78332k19263k97653k20570k77947l34616k74079k01795j38608
10527F599830j92196k90429k16818k70501m3411k8504j21100j26349j79669j89033
10517D941820q3507j65278n3467j69793j31394k03051j66311o1716m1948p8972
10507C786383j11735j67488j22995l5110k6450r7390j83122m1171j04714j49846
10497B746362m4779M5123j39118m4975k0417J06883K0236k25109j17325j01695
10487B225186j20475j28753j54657K7011L6097m420M7588p1294j24087j14798
10477A617398M3245j2083j9449L7J0752j33317j8267M5302L2953m981M6534j2700
10465A595424j80331K6025m5336o253k2548j11026l8906j2193q9727k2223o372
$$ plain form
10536 8742693 8564361 8345098 8047445 7826875 7548928 7214312 6940233 6738438 6599830
10527 6599830 6407634 6117205 5900387 5629886 5586475 5557971 5436871 5310522 5130853 4941820
10517 4941820 4858313 4693035 4639568 4469775 4338381 4135330 3969019 3907303 3865355 3786383
10507 3786383 3674648 3507160 3384165 3349055 3322605 3225215 3042093 3000922 2896208 2746362
10497 2746362 2701583 2746706 2607588 2562613 2542196 2649079 2669315 2444206 2326881 2225186
10487 2225186 2104711 1975958 1821301 1848312 1884409 1879989 1927577 1856283 1732196 1617398
10477 1617398 1660643 1648560 1629111 1629148 1639900 1506583 1488316 1533618 1566571 1561590 1608124 1595424
10465 1595424 1415093 1441118 1395782 1389529 1366981 1255955 1217049 1204856 1115129 1092906 1086534
10454A086534j53084m956L5018P3444l433p3576j7324l7006l0834q1566j5092
10443G78125q3463j18m0188j20317R5616R7731J4203j6838m3958l2811P3764j30980
10431E90766M2866J03260j44897j59494q6074o4735N9902j5034M9844j8375r6195
10420B61834j50281j05314J00352J12193j22119L5579O8469L3327M2247Q6538
10410C62825m8765k4701l4540l1296J5575R948j19741r9323j6464R8658J64362
10399B76538j5170j51432J4934J00230K7323m6420q5844O9759N0887N9959j5875
10388B84889N9559n8376n1511M5637N9639q166L9051M7707R3879m241m2730l4650
10376D30687p9953j8954k4103k7391o6516l4271Q7035J0569r0579J0652J17679
$$ plain form
10454 1086534 933450 928494 963512 1036956 1033523 959947 942623 905617 874783 793217 778125
10443 778125 694662 694544 654356 534039 629655 727386 741589 724751 680793 647982 721746 590766
10431 590766 633632 736892 591995 432501 346427 281692 341594 326560 376404 358029 261834
10420 261834 111553 6239 106591 218784 96665 132244 200713 234040 276287 362825
10410 362825 314060 289359 254819 223523 239098 249046 129305 29982 13518 112176 276538
10399 276538 261368 109936 124870 225100 252423 206003 120159 189918 240805 300764 284889
10388 284889 344448 286072 234561 280198 339837 331671 370722 418429 512308 508067 465337 430687
10376 430687 350734 331780 307677 280286 213770 179499 266534 277103 186524 197176 314855
10365C14855R68l3611m2855L2771m50n2699P403m6551k2075L5096M5230L5305
10353B73387j03381L316K47305r312j78584J7434r2103l3879J53139M0233M7277
10342C64832j8039j7521M9760K5717o8298j72291J175R6302r1302P5832K0073
10331B66240q4040p361J42362M5634k31596j23056n9864J20974J12009O5847q7985
10320A59164P452O2408p5105p1457J7783J3118N0599L4490j53710l3410o7951
10309e6619Q0323O2246K1463l5349j4952r5302q247J4404O7159J18085p593j07527
10297C8091j00713P4489m150K8116L5263l5985M8312J875m8285M5693J20330m627
10285A98409q5380n9984O1778k3518q1429j09337K0421P7938K788r6027O70J7358
$$ plain form
10365 314855 315823 282212 239357 272128 271678 218979 226382 179831 157756 192852 238082 273387
10353 273387 170006 173322 420627 411315 232731 250165 158062 124183 277322 317555 364832
10342 364832 346793 329272 379032 404749 336451 164160 165335 261637 170335 246167 266240
10331 266240 182200 174839 317201 362835 131239 8183 -51681 69293 181302 247149 159164
10320 159164 166616 229024 153919 82462 100245 113363 163962 198452 44742 11332 -56619
10309 -56619 23704 85950 107413 72064 57112 -38190 -46437 -32033 35126 153211 145618 38091
10297 38091 -62622 11867 7717 35833 71096 35111 83423 85298 37013 82706 203036 198409
10285 198409 113029 53045 114823 91305 9876 -99461 -79040 -1102 1686 -94341 -93671 -76313
10273g6313K9495m3517K0179J22179J7641j35446R7824J17102K3260L5187M4934
10262B52525p5321r7928q1497J1456R2402Q6907q2819L2143P2401M0136k6115
10251B24290r934J26388p1027j67058K7654K034k3576p7101L5735n4235J5666
10240B8836L182M4952o8465m6923Q1920N8198Q7148L720q5453O2729k009j48442
10228A9393l4659n1908J06991R4680m2038p753q6872l2560j6802r821J10907J7963
10216F7521q1746n4957M0722J52315N8780j10952K940j4940n1715K3963P5013
10205A06944M5148m9387j17129o8924J80273R8721K6466M3153K9038r5755q8917
10194A09631K6524q153n922M0264r8025M9939M2130J8942N7144k5918m6240O4299
$$ plain form
10273 -76313 -46818 -90335 -70156 52023 69664 -65782 32042 149144 172404 207591 252525
10262 252525 177204 79276 -2221 9235 101637 188544 105725 137868 210269 250405 224290
10251 224290 214356 340744 269717 102659 130313 132347 108771 31670 67405 13170 28836
10240 28836 32018 76970 8505 -38418 43502 101700 188848 192568 107115 169844 167835 19393
10228 19393 -15266 -67174 39817 134497 92459 84706 -2166 -34726 -51528 -61349 49558 67521
10216 67521 -14225 -69182 -28460 123855 182635 71683 74623 59683 7968 31931 106944
10205 106944 152092 102705 -14424 -83348 96925 195646 222112 265265 294303 198548 109631
10194 109631 136155 128002 122080 162344 64319 114258 156388 175330 232474 206556 160316 224615
10182B24615M8082J9855O7004Q029R6068J36217J8812j15076P4555r471k9031
10171E39659Q9508K4443P3395L4238L6225J3832j78161J7751P4761R9434n6193
10160G68892P4654L7020j20788L4308J11522j52702j1765P8186o3430r5920N8726
10149G18703L8802m1462M5439J8652k9573P6788l4449q5086j15698q5533j65993
10138C40590k9172K5484j06793m2886Q5124O5630p5772j02499j5201R843J9886
10127A74234P1958R1558m8283j49152l867o1716q7377N2083P3466L559k9994j4694
10115G1775N4918R6748l4173j35344m0095j1983K9348O3779j11805o2900J3920
10104f5812N3240j06843L4041K1312q8450L9207O1074K1426J08961O8567o5853
$$ plain form
10182 224615 272697 292552 359556 367585 463653 599870 618682 503606 578161 568690 539659
10171 539659 629167 653610 727005 761243 797468 811300 633139 650890 725651 825085 768892
10160 768892 843546 880566 759778 794086 905608 752906 741141 819327 755897 659977 718703
10149 718703 757505 716043 761482 780134 750561 827349 792900 707814 592116 506583 340590
10138 340590 311418 336902 230109 187223 272347 337977 262205 159706 144505 154348 174234
10127 174234 246192 337750 289467 140315 136448 74732 -12645 39438 112904 116463 86469 71775
10115 71775 126693 223441 189268 53924 13829 1846 31194 94973 -16832 -79732 -65812
10104 -65812 -12572 -119415 -85374 -64062 -152512 -113305 -52231 -30805 78156 146723 80870
10093H0870l5011j1005q1269J4046l2489J8947R1268O1960j25476j1419L792j27997
10081a53783j22087R0760J94412o82K8087J3341k8289l9501M7802R4582O480p8035
10069E3087j07380J18979R5177m4176k2240O0279R7837m915p6288q2904k7192
10058F0264k8767J32412K9913J7927o7941q0578M450m1074o6715L8302N6660J37215
10046A92068L2274M2274j07305j81174j5421j45794j2576J53794L1790j34104
10036a44174L9488J31796L0864j35061r168J3m6118R9518J12127p0337r8296m1841
10024a31189N0889N276k5198O705L7989l698N281Q35k9549o6300O8814R1484N8395
10011F9734r733K0789n1863l5039L9587N3837p6071Q694J10304l7370K207Q6255
$$ plain form
10093 80870 45859 34854 -46415 -32369 -64858 -45911 45357 107317 -18159 -29578 -25786 -153783
10081 -153783 -275870 -185110 9302 8620 36707 50048 21759 -17742 30060 124642 131122 53087
10069 53087 -54293 64686 159863 115687 93447 153726 251563 246648 170360 87456 60264
10058 60264 31497 163909 193822 211749 143808 63230 67680 26606 -40109 -1807 54853 192068
10046 192068 224342 266616 159311 -21863 -37284 -183078 -195654 -41860 -10070 -144174
10036 -144174 -104686 27110 57974 -77087 -86255 -86242 -132360 -32842 79285 8948 -89348 -131189
10024 -131189 -80300 -75024 -100222 -93517 -55528 -59226 -53945 -53110 -82659 -148959 -80145 11339 69734
10011 69734 60001 80790 28927 -6112 33475 87312 11241 19935 130239 92869 95076 181331
9999A81331O5572j01531k8274Q2102L7704J3600k7193p0785J5509n1801J4134
9988A30368L654q8246m3302j3748m5766l7830n1963Q9107J91317k9624r2896l7761
9976b6690n4300r4351J24907O1413J64433Q5028n3313p0360j12284m6165j0018
9965c1700p5939J14375K118n4415J1387J3693L3095O4470O1882n9392j1958J5213
9953H2829o0018o5026r2132R0938J18899P8395L883q2352l9724j42578N36J32056
9941B5706O4297K6259j9000N5475j5110j9070P4090r9611q5335J08687K04090
9930C20478M5790j14870r2166N247P7035p2461K1659K1915o327n0482l453j09149
9918D3216l7148j2932l7662J00466r743m9999m733m8197m8151l1889M0868P1087
$$ plain form
9999 181331 246903 145372 117098 199200 236904 250504 223311 152526 168035 116234 130368
9988 130368 134022 45776 2474 -11274 -57040 -94870 -146833 -57726 133591 103967 11071 -26690
9976 -26690 -80990 -175341 -50434 10979 175412 260440 207127 136767 24483 -21682 -31700
9965 -31700 -107639 6736 8854 -45561 -34174 -20481 12614 77084 138966 79574 67616 82829
9953 82829 22811 -42215 -134347 -43409 75490 153885 157768 75416 35692 -106886 -106350 25706
9941 25706 90003 116262 97262 152737 137627 118557 192647 93036 7701 116388 320478
9930 320478 366268 251398 159232 164479 241514 169053 190712 212627 206300 155818 152365 43216
9918 43216 6068 -6864 -44526 55940 46197 -3802 -8535 -56732 -104883 -136772 -95904 -24817
9906b4817J33513J8258r8902k21882j05370J16306M5600m2078j870J24525J2759
9895d3958k0950K2212N8355j07210K2988L8562r7014n0834n239K0710J1264Q8576
9883f2538N1888P0202O9277J96791l9425r1498j77084j22460L2829Q0971q5671
9872g6718M144p8171J4959N9325j53852O4869J44707q5199Q9756o374Q959o3477
9860g7072M4111j5211P5144m9800J1695o0141k3263J52704N9437J1822R2997n843
9848B16580r7583j01393M8573J55324J22788J6664j39403l9303q3764j17635M4596
9837B5444J8539j5789n1893J6140O929J2392j7887o8423j29980N7513Q5575J9567
9825d1873Q8244K1067Q4537j0502q6553o6066l6491m1976m109K05869M7557p6247
$$ plain form
9906 -24817 108696 126954 28052 -193830 -299200 -182894 -137294 -179372 -181242 -56717 -43958
9895 -43958 -64908 -42696 15659 -91551 -68563 -30001 -127015 -177849 -183088 -162378 -151114 -62538
9883 -62538 -10650 59552 128829 325620 286195 194697 17613 -104847 -72018 8953 -76718
9872 -76718 -72574 -150745 -135786 -76461 -230313 -165444 -20737 -105936 -16180 -22554 -13595 -77072
9860 -77072 -32961 -48172 26972 -22828 -11133 -71274 -94537 58167 117604 129426 222423 216580
9848 216580 118997 17604 66177 221501 344289 360953 221550 182247 98483 -19152 25444
9837 25444 43983 28194 -23699 -7559 -630 11762 -6125 -74548 -204528 -147015 -61440 -41873
9825 -41873 46371 67438 151975 141473 54920 -11146 -47637 -89613 -93722 112147 159704 83457
9813H3457Q898l2504J35620Q3249N2671p5821o8433k0766j3782J4511n6897o721
9801A03482j5777N5955L9020k3018j73831j38942K5437K31453K0788J554J48390
9790B74511J50090K03081K16007L55877N83966M91468K19617J88203K34901J56820
9780C074541q117j47274m43005n76805n06345k64001k18881k21673n7336j2550
9770F18554r4567j03610j12307j03853p1504N3692K57127K3501j79187j0550J37790
9759D15086n8387m6585m6313j17787m8606O0184O8370j04474J46524R0738L827
9748C62577o7731M261J01111M3282n6379j6423j17611k38539n1737N6001p524
9737A1288P1638L4469k9789k900L3172l9042k7762J2092N682J49383M9238j62509
$$ plain form
9813 83457 92355 59851 195471 278720 331391 255570 187137 166371 152589 167100 110203 103482
9801 103482 87705 143660 182680 159662 -14169 -153111 -127674 103779 124567 126121 274511
9790 274511 424601 627682 843689 1199566 1783532 2275000 2494617 2682820 2917721 3074541
9780 3074541 3066424 2919150 2476145 1899340 1392995 1128994 910113 688440 631104 618554
9770 618554 523987 420377 308070 204217 132713 186405 443532 467033 287846 277296 415086
9759 415086 356699 310114 263801 146014 97408 157592 225962 121488 268012 358750 362577
9748 362577 294846 299107 400218 443500 387121 370698 253087 14548 -37189 18812 11288
9737 11288 82926 117395 87606 84706 117878 78836 51074 63166 68848 218231 267469 104960
9725A04960n6567k9967J20507J0928K1163p0651p9200M3377J8764l3772j0264
9714C9278J4760L6876J06516l1726m0120n4805q6718j49322R4185O7436r6350
9703i9990l7589l8744j1089J0804P8344J45769L4522K3790k3812j15761l9083
9692g2839k6887M1612R3164m6380O4212J937j4554q4056k757n7022K6932J14642
9680C8004R7844J5706M2221o2923j7550j01035q3635m6286R7246P6569L828j55881
9668i5892l939j3241m7071n2520R3831J00939M0972N7123k9765P2852P028p7066
9656E3251k5702N0382P5266L877r4619P2156J76058p7319J8649M5981l5331j17837
9644A44812q4433Q3068R7963l0736j72474k3087K9434K7809K525K1328J6898o2139
$$ plain form
9725 104960 48393 18426 138933 149861 171024 100373 21173 64550 83314 49542 39278
9714 39278 54038 90914 197430 165704 125584 70779 -15939 -165261 -71076 -3640 -99990
9703 -99990 -137579 -176323 -187412 -176608 -98264 47505 82027 105817 82005 -33756 -72839
9692 -72839 -99726 -58114 35050 -11330 52882 54819 40265 -43791 -46548 -103570 -76638 38004
9680 38004 135848 151554 193775 130852 113302 12267 -71368 -117654 -20408 56161 59989 -95892
9668 -95892 -99831 -113072 -160143 -212663 -118832 -17893 23079 80202 50437 123289 130317 53251
9656 53251 27549 77931 153197 157074 62455 134611 310669 233350 251999 297980 262649 144812
9644 144812 60379 143447 241410 210674 38200 15113 44547 72356 74881 96209 113107 50968
9632E0968N8840k1045K1995K6699o0586j80916r9758J12186J02352L3990n2642
9621g917j2690M1593O8865r8766r5848M2986R8220J14716K8795o9161O0834J8619
9609A90246k1928j6504j11583P5270q041j04261R9559K2565l7619n0449j10768
9598g3513j03895J65361L8970j117l3656L7314K0367j4920m2683j06775J6821
9587i7726J27804p4686J4628K34653j2119j36237p9327M6788j04026k1279O2149
9576c9378P2231n447m2025o4955J8210M4254L0149n6455j23588J29483K13168
9565A75647J533j22269l6387o3303m6525N3759O9720N4246k0034j3579M6588j5445
9553H3951n6304j33439O3331K6421o8398J9733O8787k76M7866P652n9527p6116
$$ plain form
9632 50968 109808 88763 110758 137457 76871 -104045 -203803 -91617 10735 44725 -7917
9621 -7917 -20607 20986 89851 -8915 -104763 -61777 36443 151159 179954 110793 171627 190246
9609 190246 168318 151814 40231 115501 107460 3199 102758 125323 87704 37255 -73513
9598 -73513 -177408 -12047 26923 25806 -7850 29464 49831 34911 -7772 -114547 -97726
9587 -97726 30078 -44608 -29980 204673 192554 56317 -23010 23778 -80248 -101527 -39378
9576 -39378 32853 27406 -14619 -79574 -61364 -17110 13039 -43416 -167004 -37521 175647
9565 175647 177180 54911 18524 -44779 -91304 -37545 32175 86421 66387 52808 99396 83951
9553 83951 27647 -105792 -42461 -16040 -84438 -64705 4082 3806 51672 59324 -203 -76319
9541g6319q0921r6947P3021O3905L868o888j0465k5817O2185R6272N7016p7212
9529a8302j81431q4865J49766P4786N776q575J6308R2789k1866o2869r6334k9597
9517a64414O0272L3042M3767J07835R17j25715m6208N596J14710L1402K2729O4219
9505A48152Q5632j1525k06370l8000l9099j14704O2751J15185J7330r7968p1503
9494a50119P4705N4027J15523j412j78758r3756N4356k5359P8249j2179p6116
9483a60839L3363J08048L1380M0820q570Q5848K5991j02458k9585O6463j07613
9472a7152k5753O8392k323L7591J19553R2135r5825r8324N077l7599o4966j42213
9460a61407o7255J7079m1987p5437k4467J00358J90178L6328q5820k0996R5778
$$ plain form
9541 -76319 -157240 -254187 -181166 -117261 -113393 -120281 -130746 -156563 -94378 1894 58910 -18302
9529 -18302 -199733 -284598 -134832 -60046 -54270 -62845 -46537 46252 24386 -38483 -134817 -164414
9517 -164414 -104142 -71100 -27333 80502 81419 -44296 -90504 -84908 29802 61204 83933 148152
9505 148152 233784 222259 15889 -22111 -61210 -175914 -113163 2022 19352 -78616 -150119
9494 -150119 -75414 -21387 94136 92724 -86034 -179790 -125434 -150793 -72544 -84723 -160839
9483 -160839 -127476 -19428 11952 52772 44202 130050 156041 53583 23998 90461 -17152
9472 -17152 -42905 25487 23164 60755 180308 272443 176618 78294 83371 45772 -19194 -161407
9460 -161407 -228662 -211583 -253570 -329007 -353474 -253116 -62938 -26610 -112430 -133426 -37648
9449c7648j39129o2480Q9343J60846o1858P0566Q9907P8643K4384o7832j37339
9438G403m2211J6239l8180L4061M8972p8324L44l628Q2947J22984j0544j14703
9426B5360N1856K4169o3852N259L3146j60625N0127J69301n5709j10024l3914
9415f4906K7891Q418J9696N5095M3798M8718r5970j84000l3408L5324k7988J8037
9403a49295p623R8296J4881j46637p9433P7277J04093J6290O6096K09776O2853
9392B66574j08753l5368P0571j06429m6412J07763L4257j08885m2684k1063j07237
9381i7666O949J82194L5160K5311L1287n8562K6067N5681Q295j3792n8835m7389
9369I4700j3206n5301j6974p1986k3506N3039J2807K7659O0587m3523n8600O9783
$$ plain form
9449 -37648 -176777 -239257 -149914 10932 -50926 19640 109547 188190 212574 144742 7403
9438 7403 -34808 -18569 -56749 -22688 26284 -52040 -51696 -55324 27623 150607 140063 25360
9426 25360 77216 101385 37533 42792 75938 -84687 -34560 134741 79032 -30992 -64906
9415 -64906 -37015 -28597 -8901 46194 89992 138710 42740 -141260 -174668 -139344 -167332 -149295
9403 -149295 -156918 -58622 -43741 -190378 -269811 -192534 -88441 -72151 -6055 203721 266574
9392 266574 157821 122453 193024 86595 40183 147946 182203 73318 30634 9571 -97666
9381 -97666 -90717 91477 126637 151948 183235 124673 150740 206421 214716 200924 142089 94700
9369 94700 81494 26193 9219 -62767 -86273 -33234 -20427 7232 67819 24296 -34304 35479
9357C5479m1408l4671L7109O9411L7427q3976L5615M8818j02224n4346l2619J07292
9345B1907J33957l2342N82n8807r0700m7142k6706P2246n0637N9818P6029K9337
9333H7542J8194o5523k169l4840q1997J0603p661N2337l3896o5740K1717P1944
9321b9489o7963q7883J02805O7588L4790k3378p6192k1427l1671j8756K9380n1715
9309a73911J8736N2324q2319o9750j4859J66032J25050P8054j3925M1765n1671
9298G5526L2184K1557q2542m1606N6753q866K9772J8390L119M7985n2442l6895
9286F2935n2398m1345P6329m2954k0853J38207J09776K2504J2633p7352k5270
9275A62212n6276q428k4513j32495j1937Q4278Q6582j8621J31816J7592k9639
$$ plain form
9357 35479 -5929 -40600 -3491 65920 103347 19371 54986 103804 1580 -52766 -85385 21907
9345 21907 155864 123522 124104 65297 -25403 -72545 -99251 -27005 -77642 -17824 58205 87542
9333 87542 105736 40213 38044 3204 -78793 -68190 -75851 -23514 -57410 -123150 -101433 -29489
9321 -29489 -97452 -185335 -82530 -14942 19848 -3530 -79722 -101149 -132820 -151576 -122196 -173911
9309 -173911 -155175 -102851 -185170 -254920 -269779 -103747 21303 99357 85432 127197 75526
9298 75526 107710 129267 46725 5119 61872 53006 82778 101168 104287 152272 99830 62935
9286 62935 10537 -30808 45521 2567 -18286 119921 229697 252201 264834 187482 162212
9275 162212 105936 97508 72995 -59500 -71437 12841 99423 80802 212618 230210 200571
9264B00571k2564N2565m5217q3148j15698p7397m0701N575O1862M7223j58567
9253a75496k6962O0813P257j3144M1252O2319P3812J9640r1867n2365L1824q20
9241f3737M9963J85783N4388O1604p6086q5872q6124O1853M0923k9019j01563
9230A2113k6174N930L8880m0607m1128K9429q427l585j5258m8770K4712j424K1830
9217e2479o6160o4768K27J26604L6349O2885R5321J08663R617j02989K5646j2501
9205A66415k0107N9398q4709M1596K5245M5965r0304p2618L3057R8157J44535
9194C46630k6691j94056o8073J4784J6937q6721j74986O902Q7019M6198m9226
9183h1283q7981M2524J13077k055J07492P7480J2647L185J03958k9653j36010
$$ plain form
9264 200571 178007 230572 185355 102207 -13491 -90888 -131589 -126014 -64152 -16929 -175496
9253 -175496 -202458 -141645 -134388 -147532 -106280 -43961 29851 49491 -42376 -94741 -62917 -63737
9241 -63737 -13774 172009 226397 288001 211915 126043 39919 101772 142695 113676 12113
9230 12113 -14061 -8131 30749 -9858 -50986 -21557 -29984 -33569 -48827 -97597 -72885 -74309 -52479
9217 -52479 -118639 -183407 -183180 -56576 -20227 42658 137979 246642 256259 153270 178916 166415
9205 166415 146308 205706 120997 162593 187838 233803 143499 70881 103938 202095 346630
9194 346630 319939 125883 57810 72594 89531 2810 -172176 -165274 -78255 -32057 -81283
9183 -81283 -169264 -126740 -13663 -15718 91774 169254 181901 185086 289044 259391 123381
9172A23381r2129r3288q4602K8094J91607M3587l5783L0757l36j45470J8877J15909
9160A00604L5398n4356k5453K6025k5492L1593P0088j26799m1797K2707k6865
9149a4347R8937J09097p6937j09491j16191J07556J63106O2316o873j53790j27143
9138f3760k0151o034J22432k0664l391n4232m4844o5009R8115J09395o0991j1579
9126b0713J39031J02787j48607j50147l9223p9223l3364O0840M1209k4799J12456
9115c9753o1838M8715j9704p6414p0550k4504J81107O2059m4503k8891L8693R0151
9103E4568L8246K7792K0798R930m8974j63711O4638J29494q1741r7442l9698R5483
9091I383k5372P5173N8526N1487J0786m2563m1058n7006r1337Q6514n719q6318
$$ plain form
9172 123381 31252 -62036 -146638 -118544 73063 116650 80867 111624 111288 -34182 -15305 100604
9160 100604 136002 81646 56193 82218 56726 88319 158407 31608 -10189 12518 -14347
9149 -14347 84590 193687 116750 7259 -108932 -1376 161730 224046 217173 63383 -63760
9138 -63760 -83911 -89945 32487 11823 8432 -45800 -90644 -155653 -57538 51857 -9134 -20713
9126 -20713 118318 221105 72498 -77649 -116872 -196095 -229459 -168619 -127410 -152209 -39753
9115 -39753 -101591 -52876 -72580 -148994 -219544 -244048 -62941 -882 -45385 -74276 -35583 54568
9103 54568 92814 120606 141404 151334 102360 -61351 3287 132781 51040 -46402 -86100 9383
9091 9383 -15989 59184 117710 169197 179983 137420 96362 39356 -51981 34533 28814 -57504
9079e7504J4923N7415O0792q462m7442p1646j26078N3159J01454N1879j8865N256
9067A4881j60333n7572O4459J8845k7892p6469L4728J42481Q2565O958j32126
9056h9475j50670r7016J61572J22447R3703K2933L583J1866o0941j9679K7744
9045B6067m3450j25717o0347K5770O8532J43064K0804n6384j34262j09631L3381
9034b12173l1678M3726J88888M8223m3424L7963J04467n9032j47410m3460J7885
9023i6025K2143P5003L7292l4305P2700j02189k1977m739N9999J1717n7889n7467
9011i5737j006m5569K8118J19773K016P6792k8559j80931K9204N100J92912k8280
8999G3833j49479l6924j514j9155O3749O1952p4948j5666k020l960J26405M5448
$$ plain form
9079 -57504 -42581 14834 75626 67164 19722 -51924 -178002 -124843 -23389 28490 9625 14881
9067 14881 -145452 -203024 -138565 -119720 -147612 -224081 -189353 -46872 35693 42651 -89475
9056 -89475 -240145 -337161 -175589 -53142 40561 63494 67077 78943 18002 -1677 26067
9045 26067 -17383 -143100 -203447 -177677 -109145 33919 54723 -1661 -135923 -245554 -212173
9034 -212173 -243851 -200125 -11237 36986 -6438 31525 135992 76960 -70450 -113910 -96025
9023 -96025 -73882 1121 38413 4108 76808 -25381 -47358 -52097 7902 19619 -38270 -95737
9011 -95737 -96743 -142312 -114194 5579 7595 84387 55828 -125103 -95899 -90799 102113 73833
8999 73833 -75646 -112570 -114084 -133239 -69490 -7538 -82486 -98152 -100172 -104132 22273 67721
8987F7721K7642P0970j69254k3452l222j454K7645j1420k4040n8444R858l4650
8975a22100n3843k5927N4864l8488l9432K18421M5854j36453j6888Q6585q3259
8964a10666K9936Q2138n692M755R864M8843L5135k7501p5233O6373M5943r5498
8952H397p9393P6535p877k4343p8695k358L3055m0438N9425j7392j24567O1754
8940a35897J30793n2759p7621J8915J06460N3216K4612o8625j4347J9123J07840
8929A11710o0613r8463r6437n0359k3795J04270J08236l6086n9623J40328J28041
8918A67209P4890k5597p5271j40605q686j30645j7958Q416q114Q9776L5606P5098
8906D4119J13823n5622k25410j6874J96701R1035l2329j35403n9742O5947m7819
$$ plain form
8987 67721 95363 166333 -2921 -26373 -29595 -31049 -3404 -14824 -38864 -97308 -87450 -122100
8975 -122100 -175943 -201870 -147006 -185494 -224926 -6505 39349 -97104 -113992 -27407 -110666
8964 -110666 -80730 1408 -4284 471 10335 59178 94313 66812 -8421 57952 103895 8397
8952 8397 -70996 5539 -2338 -26681 -105376 -107734 -74679 -115117 -55692 -73084 -197651 -135897
8940 -135897 -5104 -57863 -135484 -116569 -10109 43107 67719 -906 -15253 3870 111710
8929 111710 51097 -47366 -143803 -194162 -217957 -113687 -5451 -41537 -101160 39168 167209
8918 167209 242099 216502 141231 626 -8060 -138705 -156663 -148247 -156361 -66585 -30979 44119
8906 44119 157942 102320 -123090 -139964 56737 147772 115443 -19960 -79702 -13755 -61574
8895f1574r5270K910M9039p685R4913P3477l6894l1508o8575o6398q616J60187
8883D006J17426k9423M5593j05320p9930K7609L0602N6876J25459K259r7678n9457
8871C8022j1425K6154J4973r162n2256p2838q6886M789L3029J478L6585L8200
8859c9337k9652P6263O9506r5310p3258P9590O4981J15490p8423O3882L0234j80939
8847C027k7051K982j68969R573N2436J20655O6523Q7j08070p6525k1275K524Q2120
8834f1963P334N6760R194M9327o8194l841j9815M9495m940q2084q4198R4038M3739
8821a5148N2890l5092q1287o7368M6377R8716o8292j67995P9527J45175p1665
8810h4162Q3421o9717j49355P0410K3135n2688n1695J49784K38140J8437j05265
$$ plain form
8895 -61574 -156844 -153934 -104895 -112580 -17667 55810 18916 -12592 -81167 -147565 -156181 4006
8883 4006 121432 92009 137602 32282 -47648 -20039 10563 67439 192898 195157 97479 38022
8871 38022 26597 52751 67724 58562 6306 -66532 -153418 -148629 -115600 -114122 -77537 -39337
8859 -39337 -68989 7274 76780 -18530 -91788 -12198 52783 168273 89850 153732 183966 3027
8847 3027 -24024 -21042 -190011 -180438 -128002 -7347 59176 59263 -48807 -125332 -146607 -144083 -61963
8834 -61963 -54629 2131 11325 60652 -7542 -11383 -31198 18297 13357 -68727 -152925 -58887 -15148
8821 -15148 37742 2650 -78637 -146005 -99628 -912 -69204 -237199 -157672 -12497 -84162
8810 -84162 -741 -70458 -219813 -149403 -126268 -178956 -230651 -80867 157273 175710 70445
8799G0445o9825N6983O3243r2400q8595n931K8146p6981M9493L3251m6756j4911
8787i3838n1967L092R5130n8800m8941m0569n7040N6433M6625M1008r383m6721
8775a64971m0584J05921K308m874l7167n1001O7267m2419K265K0759p185j8955
8763a68636N356m0285J26784Q8817o7364L0033P5119N8627j13602q1521k6433
8752a13105R6411k1781m9632N5329O7420J1565o9190l7880l2467n4362j01015
8741b48707K6566l8801p0463M1141N6175J72468K9735J11597k0230o2475J3238
8730A0244J12545L9488K1506j71598j1842O8653l3077l7925J3300L8106j46742
8719i7342J11397M7811j26313o5410O7172l711l834K657o1761j05992J28294N0210
$$ plain form
8799 70445 620 57603 120846 28446 -60149 -66080 -37934 -114915 -65422 -32171 -78927 -93838
8787 -93838 -145805 -142713 -47583 -106383 -155324 -195893 -252933 -196500 -149875 -108867 -118250 -164971
8775 -164971 -205555 -99634 -97326 -102200 -139367 -190368 -123101 -165520 -163255 -142496 -149681 -168636
8763 -168636 -163280 -203565 -76781 12036 -55328 -25295 49824 108451 -5151 -86672 -113105
8752 -113105 -16694 -38475 -88107 -32778 34642 46207 -22983 -60863 -93330 -147692 -248707
8741 -248707 -222141 -260942 -331405 -290264 -234089 -61621 -31886 79711 59481 -2994 10244
8730 10244 122789 162277 183783 12185 343 68996 35919 -2006 11294 49400 -97342
8719 -97342 14055 61866 -64447 -129857 -62685 -66396 -70230 -67573 -129334 -235326 -107032 -56822
8707e6822r3604L2973Q8619N0923k9560o1379O0621J17337j13611j08290n7570
8696a70363P038M2419M9164L8436J37838K7391o9292n3834N8324Q2586r1846K2465
8684H0326O0450p466j26438j60584J2563r1149r618P0181L196Q4149p300P6831
8672a4859J11872j06603j03568n5607L1803K2210j519k1397K9487P9211J09685
8661H0715J35885r8238p6444O0377j2875r9084m228K2459k6564l6790k7957O0449
8649b2295k0816k7685p154j37590K6450j1107j9527J06280M1403p2706J34719
8638a0028R4034j5710k2863K5025j05732n41O2336j22062j18315J74995K6200
8627a2661r6441n1831J4814J78781n0968k6010O9679m3535m3839O2253k3576j5880
$$ plain form
8707 -56822 -150426 -117453 -28834 22089 -7471 -68850 -8229 109108 -4503 -112793 -170363
8696 -170363 -163325 -120906 -71742 -33306 104532 131923 62631 8797 67121 149707 57861 80326
8684 80326 140776 133310 6872 -153712 -141149 -232298 -241916 -171735 -168539 -84390 -91690 -14859
8672 -14859 97013 -9590 -113158 -168765 -136962 -114752 -116271 -137668 -108181 -28970 80715
8661 80715 216600 118362 41918 102295 89420 -9664 -13892 8567 -17997 -54787 -82744 -22295
8649 -22295 -43111 -70796 -77950 -215540 -189090 -200197 -219724 -113444 -72041 -144747 -10028
8638 -10028 84006 68296 45433 70458 -35274 -35815 26521 -95541 -213856 -38861 -12661
8627 -12661 -109102 -160933 -146119 32662 -18306 -44316 25363 -18172 -62011 242 -23334 -39214
8615c9214K3954L6061r8582m1733K0636Q5041M5083l2637Q3459j30456l1102P8657
8603h33L0031J10133m2986p8438P6262M9091k6707p7707j2252q3437L9747J99523
8591A82427J67865O9675m7861r7818o835k1873j25568k4920k234p9262m3286N5000
8579B5310R648K3556j5015J519r1671J0459p9375J59909J29298m1273q1053p4698
8567b3386n8881j31422Q5917P4109j0504R4594j133q5422J95404J4919J2655P3481
8555B40331o4333o1554q1516P8437n0671m1577O8669J33283O4799O297j67853
8544A24312m5457R1611J05466J07289N8702Q7745K8485J63334J64298o6150j12322
8533G07313o0794l3493j34066j85812r8677k2463k6908k1148R620m7572o478L0505
$$ plain form
8615 -39214 -15260 20801 -77781 -119514 -98878 -13837 31246 -1391 82068 -48388 -79490 -833
8603 -833 29198 139331 96345 17907 94169 143260 116553 38846 26594 -56843 -17096 182427
8591 182427 350292 419967 372106 274288 267453 245580 120012 95092 92858 13596 -29690 25310
8579 25310 34958 58514 43499 45018 -46653 -36194 -115569 44340 173638 132365 51312 -23386
8567 -23386 -82267 -213689 -127772 -53663 -64167 30427 29294 -56128 139276 154195 166850 240331
8555 240331 175998 114444 32928 111365 60694 19117 87786 221069 285868 292165 124312
8544 124312 78855 170466 275932 383221 441923 529668 558153 721487 885785 819635 707313
8533 707313 646519 613026 478960 293148 194471 172008 145100 123952 133572 86000 79522 110027
8521A10027O4754M0398r336r5021j19519K4217O466P6960j691j6030O6807P3288
8509B21320L084M3276j9483J7882j43302j5998J37472J06961j67979j43560J83059
8498B22732K20421J49500K03994J20795Q0821O0853J09149J97935J84694J0017
8488A560911n2504j94539l09033l34268l38722j22258L3297K6357O4538J9946
8478C53725n6023k7066p8314l2854j25632j6311k7587Q5557j0372K8235N0536
8467A43894o6427o2651M3893N8549O4400m6137r601J33385j8907q5754l5128J12608
8455B32124m538m6101j6912N6117K01527L5789J63935P7867O6509P1730N1128
8444H89175M4750P1427j47792m8965r6728j73583j25845q1448j08360q407J8040
$$ plain form
8521 110027 174781 215179 205843 110822 -8697 15520 21986 98946 97255 81225 148032 221320
8509 221320 224404 267680 248197 266079 122777 106779 244251 351212 183233 39673 222732
8498 222732 443153 592653 796647 917442 998263 1059116 1168265 1366200 1550894 1560911
8488 1560911 1508407 1313868 1004835 670567 331845 209587 242884 269241 333779 353725
8478 353725 297702 270636 192322 159468 33836 17525 -10062 75495 65123 93358 143894
8467 143894 77467 14816 58709 117258 181658 135521 125920 259305 240398 154644 119516 232124
8455 232124 227586 181485 164573 220690 422217 458006 621941 699808 766317 838047 889175
8444 889175 933925 1005352 857560 808595 711867 538284 412439 330991 222631 214224 232264
8433B32264K3397k596q9797o1068J994j44284m724k2293k2764J16087J01081J2990
8421A40287j69149q3377j9891K5851J13017L6007n0459m9253o7787p2641L6622
8410a60773J31886J9986J04470l4421k3853J30632Q1923o8101j47673j16792k2133
8399a04849J41828J19545j8495r6134p5790O2152Q7476o746q3037j3193P6742
8388H9499L7401j0799j19569l1218L245j09796n4402M5551N9730Q104O4514K7010
8376I270n4012N8277O3720M7112l0990O012J5488p368O6046n1500j20823n2543
8364e1311j8704N9657J13554O0415r3883o8282j98515o5036m5872k6349J54139
8353a80187Q3520P4226N3677j5288Q8650R5119q4850l7572N3970m897r1736q1001
$$ plain form
8433 232264 255661 253065 163268 102200 104194 -40090 -44814 -67107 -89871 26216 127297 140287
8421 140287 -28862 -112239 -132130 -106279 6738 42745 -7714 -56967 -124754 -197395 -160773
8410 -160773 -28887 -8901 95569 61148 37295 167927 249850 181749 34076 -82716 -104849
8399 -104849 36979 156524 138029 41895 -33895 28257 115733 108987 25950 12757 89499
8388 89499 126900 116101 -3468 -34686 -31441 -141237 -195639 -150088 -90358 -82254 -17740 9270
8376 9270 -44742 13535 77255 124367 93377 99389 114877 107509 173555 122055 1232 -51311
8364 -51311 -70015 -10358 103196 163611 69728 1446 -197069 -262105 -307977 -334326 -180187
8353 -180187 -96667 -22441 31236 15948 104598 199717 114867 77295 131265 126368 34632 -46369
8341d6369p6843K8666k8372j11178j3957j1001J82137J8932j16784J1116N4342
8330a09311J31867J07441J03974K4829q4467q6824p9486M7477P9529k8491n6954
8319D9584O594n1366l1917J4510j07562N8566O8669L6490J6969l2284l0329j0843
8307a2919L2292L5327J3574N3196n6013J9252l8884l7153q3679l9374m0459R4013
8295f0827Q5336j3439o401l0129p3457K4759O5510O7918K582j44801r4062M1097
8283a35914j3385K7351L0668l6322N9353J30780q170j24573L1607M5427j6212
8272i390O096O4577J4524o2206M2407m7227r9181n5736P4429J62945J6412j03324
8260D326j05233l0177J18536J1198j1798J9153J0539p4784r7049K1347K2440n6445
$$ plain form
8341 -46369 -123212 -94546 -122918 -234096 -248053 -259054 -76917 -57985 -174769 -163653 -109311
8330 -109311 22556 129997 233971 258800 174333 87509 8023 55500 135029 106538 49584
8319 49584 56178 4812 -27105 -12595 -120157 -61591 7078 43568 60537 28253 -2076 -12919
8307 -12919 19373 54700 68274 121470 65457 84709 45825 8672 -75007 -114381 -154840 -60827
8295 -60827 24509 11070 4669 -25460 -98917 -74158 -8648 59270 61852 -82949 -177011 -135914
8283 -135914 -149299 -121948 -91280 -127602 -68249 62531 54361 -70212 -38605 6822 -9390
8272 -9390 -3294 61283 75807 13601 56008 8781 -90400 -146136 -71707 91238 107650 4326
8260 4326 -100907 -131084 -12548 -1350 -13148 6005 16544 -58240 -155289 -133942 -111502 -167947
8248a67947J6466j5148J7571p189J0944J52297R5130r1675R1573l5937r4713k6776
8236e5404Q817R5766P8695m1558r6845m5330k9293J03557M2690L3213l1948j15967
8224e3607n4272j09232j2581K18275K09822M0232n9058j33567p1562m5202n7048
8213a27800R5953J23479n902K5338j29321j04407j666o9359k8064J7683M3507
8202a60559M8984K7687j12304r2798R7235L4118R0853J3383J4070k6527j02593
8191a68451o6648J9909m6837L5585J25169J24954N6271J14458l7359q0346o9070
8180G635p0839j26089J33523K06650q255j43061j37915N3406p55K7969J4737o7789
8168a10783j5500J926L6841M4543j6192j3223J17385l7920n7971J5337n3405l7228
$$ plain form
8248 -167947 -151481 -166629 -149058 -156247 -145303 6994 102124 10449 102022 66085 -28628 -55404
8236 -55404 -46587 49179 127874 86316 -10529 -55859 -85152 18405 61095 94308 62360 -53607
8224 -53607 -107879 -217111 -229692 -11417 198405 238637 179579 46012 -25550 -70752 -127800
8213 -127800 -31847 91632 85730 111068 -18253 -122660 -124326 -193685 -221749 -204066 -160559
8202 -160559 -111575 -83888 -196192 -288990 -191755 -157637 -66784 -53401 -39331 -65858 -168451
8191 -168451 -235099 -215190 -262027 -226442 -101273 23681 79952 194410 157051 76705 7635
8180 7635 -63204 -189293 -55770 150880 142625 -436 -138351 -84945 -85700 -57731 -42994 -110783
8168 -110783 -126283 -124357 -87516 -42973 -59165 -72388 44997 7077 -50894 -35557 -88962 -126190
8156a26190J32462J0636r1968m2241J3976N0585k7268l0302o111k5575R452K09267
8144G6723n121r5107p1686K0600J40581K9453q5712j08213o7358j0590L2817R1343
8132e2270J5206q7066q9426P9638N7192M8416o1652L8331p6032j2496L1426Q1133
8120b7600l8250Q0725J69567m3835L0583K4128o4872o0731j10737l815O3811R3573
8108A12547j6345j29069n5816Q5038J16122n9547j36224j19448J05771J39574
8098D2603m2507p5489j19993L931R6146L0913M4045N0549m1328k0831p121P720
8086c1362K6586r943l9050N9514k0271n3172K7697n8044o0167L1542O7626L9976
8074a9068l3378l3057q4108J31560P2058m0669j51457N5888K42296J83868o093
$$ plain form
8156 -126190 6272 16908 -75060 -117301 -103325 -52740 -80008 -110310 -116421 -141996 -132544 76723
8144 76723 71602 -23505 -95191 -74591 65990 95443 9731 -98482 -165840 -176430 -143613 -52270
8132 -52270 -37064 -124130 -213556 -133918 -76726 -28310 -89962 -51631 -127663 -140159 -108733 -27600
8120 -27600 -65850 14875 184442 140607 171190 195318 130446 69715 -41022 -44837 18974 112547
8108 112547 96202 -32867 -88683 -3645 112477 52930 -83294 -202742 -96971 42603
8098 42603 96 -75393 -195386 -191455 -95309 -64396 -20351 30198 -11130 -31961 -39082 -31362
8086 -31362 -4776 -14719 -53769 5745 -14526 -67698 -40001 -98045 -158212 -126670 -59044 -19068
8074 -19068 -52446 -85503 -169611 -38051 34007 -6662 -158119 -102231 140065 323933 317840
8063C17840j18889j14914r8759o9485N0819J02713m4014J8293M9911m7717P357
8052E3155L3953l6878l1731M6864k3107j7725p3154L9504K4678p8565l7487P3613
8040b6880l6060j54014k5101l3767J23602M5397J9851J6525p285m7047O6156R767
8028d8856k784l5808p3918n5621N6116R2399N8119N4466O8874N633j24759j5758
8016b1897M1096N340J66328o1020l4833K1430k4193l9640j6887j03337Q8845N6336
8004G7568Q3919r1142Q607j1053j47461j04420P6051J17721R5717r139m0059K0171
7992G6480l9702r6076m050M9999M8559L8158j03743p1118Q5392K20723p254p1118
7980A26250K6796o71j22647j065O4457O1198q0409j04013j26503k6425N4205J38904
$$ plain form
8063 317840 198951 84037 -14722 -84207 -33388 69325 25311 43604 93515 45798 53155
8052 53155 87108 50230 18499 65363 42256 24531 -48623 -9119 15559 -63006 -100493 -26880
8040 -26880 -62940 -216954 -242055 -275822 -152220 -106823 -86972 -70447 -77732 -124779 -58623 -48856
8028 -48856 -51640 -87448 -161366 -216987 -160871 -68472 -10353 44113 112987 118620 -6139 -21897
8016 -21897 19199 24539 190867 129847 95014 116444 92251 52611 35724 -67613 21232 77568
8004 77568 161487 70345 78952 67899 -79562 -183982 -107931 9790 105507 96368 56309 76480
7992 76480 36778 -59298 -63348 -13349 35210 73368 -30375 -101493 -16101 204622 197368 126250
7980 126250 153046 152375 29728 28663 93120 154318 73909 -30104 -156607 -183032 -128827 10077
7968A0077J10148n5128l5805m8358J9995L1903m701L6393k8105M644j04636O9511
7956E938N1262Q961o722j09018k7006N3332l8439j12628L7992O042l1165J69674
7944H223O9857q3957o6666p0795O761l8587P6796K9759J1730J7475O9446M556
7932C4598m4873o4113k0425J3406m1258Q4927Q9488L5489j27523r8122O6052R2735
7920B0381j472L5384m6715q957J7997L0954M4096J0019j81365m6023J2915j55484
7908b68270N4712Q1877Q5071K6176m5265j4172n6757J16490P3914o702p499o677
7896C2898k1361M364k7728N106k4199J9886p4302j386J7525nL1457p7598M6634
7883f8709L4504j06645Q0379l0953p2104J55776j4510j06399L6083Q2746L7286
$$ plain form
7968 10077 120225 65097 29292 -19066 929 32832 28131 64524 36419 41063 -63573 5938
7956 5938 57200 66161 59439 -49579 -76585 -23253 -61692 -174320 -136328 -130286 -161451 8223
7944 8223 78080 -5877 -72543 -143338 -136577 -175164 -98368 -68609 -56879 -39404 30042 34598
7932 34598 -10275 -74388 -94813 -81407 -122665 -37738 51750 87239 -40284 -138406 -72354 20381
7920 20381 18909 54293 7578 -1379 16618 47572 91668 101687 -79678 -125701 -112786 -268270
7908 -268270 -213558 -131681 -46610 -20434 -65699 -79871 -136628 -20138 53776 47074 39575 32898
7896 32898 11537 15901 -11827 -6721 -30920 -11034 -85336 -86722 -69197 -69202 -37745 -115343 -68709
7883 -68709 -34205 -140850 -60471 -91424 -163528 -7752 -22262 -128661 -92578 -9832 27454
7872B7454O8209P0413J7139k8516o4359p0899n720J20469M7162p6806o3931j8519
7860B2096j0388k4051L8424k3814p8188K7745k9034k6751q0324n3396J46397J39376
7848D8092l0246r674K7735L1356Q5155n5715j8636J9331j13794p9822j0336k4371
7836a30925m4157m8494J02020J22195J02582Q847m1398K5841J0500N180K97o3848
7824D8640M4703J07938j23603m2288p4767L6979O3063L8867l3707O2215O1291
7813A89331p8250n5663K6860k0838o852n7038r3166l0109L476K2446J3769M0657
7801d5377O0924m6496N401k3234k5474K0542m7054K2937l8688N6536j619p8057
7789a39659k9368n4982P524J19902J38925N8550M0172j309j35672q2718j2979
$$ plain form
7872 27454 95663 166076 183215 154699 90340 19441 13721 134190 181352 104546 40615 22096
7860 22096 11708 -12343 26081 2267 -75921 -48176 -77210 -103961 -184285 -237681 -91284 48092
7848 48092 17846 8172 35907 67263 152418 96703 78067 97398 -16396 -96218 -106554 -130925
7836 -130925 -175082 -223576 -121556 639 103221 112068 70670 96511 107011 112191 112488 48640
7824 48640 93343 201281 77678 35390 -39377 -2398 60665 99532 65825 128040 189331
7813 189331 111081 55418 82278 61440 54588 -2450 -95616 -125725 -122249 -99803 -86034 -45377
7801 -45377 15547 -30949 -25548 -48782 -74256 -53714 -100768 -77831 -116519 -59983 -61602 -139659
7789 -139659 -169027 -224009 -216485 -96583 42342 100892 141064 139755 4083 -78635 -91614
7778i1614n0959J27267Q4150P8373J0061P2952j08740l8815M5372n8116J8183
7767H8114k1103n3822j0237L7556R5821l6065j40726n726n724O3206J48661J8558
7755A78513j04900L0189m8947l7402p7569j6152k8513k0491k7605R8281K291M8795
7743c510J01490n3313q7556J46193J31786m2261r3876k32586p1663P4634M4296
7732h6366l7696o4517N960K2534J20175N5276j5956p5108j6469N4670L1821L0397
7720B4721J22156L751j25451j69159j27075J33784J02150L6435n7459j83173k154
7709b41474N5652M5423N6298K7292m6407l4794J1426P5466J7384p67q1979J4907
7697a01573N5601k3883r6494j5354R0997K8001k7371J01065J6716p3492m3433
$$ plain form
7778 -91614 -142573 -15306 68844 147217 157278 230230 121490 82675 128047 69931 88114
7767 88114 67011 13189 2952 40508 136329 100264 -40462 -46188 -51912 11294 159955 178513
7755 178513 73613 103802 54855 17453 -60116 -76268 -104781 -125272 -152877 -54596 -52305 -3510
7743 -3510 97980 44667 -42889 103304 235090 192829 98953 -133633 -205296 -130662 -86366
7732 -86366 -124062 -188579 -182619 -160085 -39910 15366 -590 -75698 -92167 -37497 -5676 24721
7720 24721 146877 150628 25177 -143982 -271057 -137273 -35123 1312 -56147 -239320 -241474
7709 -241474 -185822 -140399 -84101 -56809 -103216 -138010 -126584 -51118 -33734 -34501 -116480 -101573
7697 -101573 -45972 -69855 -166349 -181703 -90706 -62705 -90076 10989 27705 -45787 -89220
7686h9220l5225O2529J4386k7791L909K9457K6338N0595M2423q9759n1097J1439
7674e2016K5421o7076k4953N4321N829M9284l7198l17J0906L6490p8990k9531
7662a07830J59573M9799o5660L9753M9807j6314j16579J10890j05089p7908M2035
7651c7523K3702p114K3907K2434J6490q8266L779N004J4849N876P0991m869J0
7638D9270N349o946l5787n3919p044n3540L6718O142m1885R5237r7521m73J10308
7625E909K2549r0017R5014J1278l5585Q8969K9583K1934P0661k942q9749j78214
7613e0610j5131M8628N7886K091k0687j82102N2244J38721J20605O9739L081j02064
7601A22401j13649K6882l2985J4753L5676q4055m4804j11889k0800J59812J56437
$$ plain form
7686 -89220 -124445 -61916 -47530 -75321 -71412 -41955 -15617 34978 77401 -12358 -63455 -52016
7674 -52016 -26595 -93671 -118624 -64303 -58474 -9190 -46388 -46705 -35799 691 -78299 -107830
7662 -107830 51743 101542 35882 75635 125442 109128 -7451 103439 -1650 -79558 -37523
7651 -37523 -13821 -20935 2972 25406 41896 -46370 -42591 -37587 -22738 -16862 54129 49260 49270
7638 49270 54619 47673 11886 -42033 -49077 -102617 -65899 -59757 -101642 -6405 -103926 -104399 5909
7625 5909 28458 -61559 33455 44733 9148 98117 127700 149634 220295 217353 127604 -50610
7613 -50610 -65741 -17113 40773 42864 22177 -159925 -107681 31040 151645 221384 224465 122401
7601 122401 8752 35634 2649 17402 53078 -30977 -75781 -187670 -208470 -48658 107779
7590A07779J19422L7513L0224j14010k5650K5016l4625j4727P5852k0140M335
7579A90989r2810j03798P4458J5789l4933J7543M0075j01287j75617j03321l8760
7568c11672K2544M8056O1012Q3004J1845J7126M6619j00399k9660j9024k013j34697
7556c07259O4543l914r981J04578k419N6893O2416Q8930J42888N83j08624l0105
7544E8529J34808m4597j16166k3286Q239k9420j3966J1725n9539q1703L0281J81539
7532E6444J10018N743M1549m4572o5018o4945k5085m4493j8766P3554J58472m5269
7520A37632j12548j28017K447J08214J30270l6301n2440p9317k7263P7357J06047
7509A26081l3955j23262j11525n5717N5657N1086J2745l1378q8431P43M8698J01854
$$ plain form
7590 107779 227201 264714 294938 180928 155278 180294 145669 130942 206794 186654 190989
7579 190989 98179 -5619 68839 84628 49695 67238 107313 6026 -169591 -272912 -311672
7568 -311672 -289128 -241072 -180060 -97056 -85211 -68085 -21466 -121865 -151525 -170549 -172562 -307259
7556 -307259 -242716 -246630 -256611 -152033 -154452 -97559 -35143 53787 196675 197258 88634 58529
7544 58529 193337 148740 32574 9288 17527 -11893 -25859 -14134 -73673 -155376 -125095 56444
7532 56444 166462 172205 213754 169182 104164 39219 14134 -30359 -49125 24429 182901 137632
7520 137632 25084 -102933 -100486 7728 137998 101697 49257 -30060 -57323 20034 126081
7509 126081 92126 -31136 -142661 -198378 -142721 -91635 -78890 -110268 -198699 -197956 -149258 -47404
7497d7404m3735O1580Q820m2892l6957L4987j07275p933R0867J42323j318q4065
7485c3002K5402J5941q89j9217J0447j9841m3640p1381K5542J35521J28697q2711
7473G0869j64246q8476k1026R4022lO6828P9371K8997L9292J0302J03221l1265
7461A87886R379j02838n2787L000O3785P139m8055o0663L0998N95j8734N3006
7449G2711k9659l6186j44462J7642J2314J4750l013J77127n4896j47496L7647
7438h3521Q4970J0032r837O0882J56415K2028j19312o4668p4066n6110o4315J127
7426a36375o1867J8067J44576P1115O576P6592p5179r9021m8819J0063N8957P9640
7414D4325Q3510j19945k1380j2465j59359J04338J45816J1153N9783o0548r6251
$$ plain form
7497 -47404 -91139 -29559 -20739 -63631 -100588 -65601 -172876 -180809 -89942 52381 51063 -33002
7485 -33002 -7600 8341 7452 -11765 -1318 -21159 -64799 -136180 -110638 24883 153580 70869
7473 70869 -93377 -181853 -202879 -108857 -108860 -42032 37339 66336 105628 115930 219151 187886
7461 187886 197265 94427 41640 44640 108425 115564 67509 6846 37844 38439 19705 72711
7449 72711 43052 6866 -137596 -119954 -107640 -92890 -95903 81224 26328 -121168 -83521
7438 -83521 1449 11481 1644 62526 218941 240969 121657 56989 -17077 -73187 -137502 -136375
7426 -136375 -198242 -180175 -35599 35516 42092 118684 43505 -55516 -104335 -94272 -35315 44325
7414 44325 127835 7890 -13490 -25955 -185314 -80976 64840 75993 135776 75228 -21023
7403b1023l198M2206P8138k1360q9040k0248m6039n6997l4602Q0002q589q9139
7391a89889r335J05476J62996p0739r6718R1109N008M0032l8237j3998N7729n2049
7379h615k5123n4497n2458K2371J06431j0855j25530m7450Q226J12484J03443
7368B8427N4179j9142j30552R259O7230P187O026o648n5950r8127N1439K36095
7356A49423O3204M7304j8547j06589j40641n8726q6004Q0511L6425K6443j0634
7345a7831L379l3067k1057M9816J02183q5376k0220L4795m2863o8644M239P4678
7333a9968J52064r868k23929P4022Q8770r409l0461R1065O2415O9677o067j00941
7321A37370j28091j04030j4720o4025j11481J41255J34981l2389L0234M773Q5426
$$ plain form
7403 -21023 -24221 17985 96123 74763 -14277 -34525 -80564 -137561 -172163 -92161 -100750 -189889
7391 -189889 -199224 -93748 69248 -1491 -98209 -7100 -2092 37940 -297 -14295 43434 -8615
7379 -8615 -33738 -88235 -140693 -118322 -11891 -22746 -148276 -195726 -187500 -75016 28427
7368 28427 82606 63464 -67088 -57829 9401 16588 22614 15966 -39984 -138111 -86672 149423
7356 149423 212627 259931 241384 134795 -5846 -64572 -150576 -70065 -33640 -7197 -17831
7345 -17831 -14452 -47519 -68576 -18760 83423 -1953 -22173 12622 -30241 -98885 -94646 -19968
7333 -19968 132096 122228 -101701 -27679 61091 51682 21221 112286 174701 244378 238311 137370
7321 137370 9279 -94751 -109471 -173496 -284977 -143722 -8741 -41130 -10896 -6123 79303
7310G9303K3958q5250L1621j13911O9835R23l8528K3832j56369q1452J51112N4424
7298d0502Q3821l974q0373J8831L0057Q7823j06881n4270o2643K2128k932L9939
7286f8976n4106j11827l1799J61600J03779P7017J9799K2209M4637m3637J1079
7275A29775N7835q8944n4615L7096j81891m1449k0832J7142n2564O1417P2944
7264f4086r150j7558q8707J480J28871J18832l9425K2455l8505p0775l2235J12233
7252B3430L7398m7368O770K1223P209j8591j2714q4496j27444r3839J36908J82991
7240C1477M7812j24952L0339J6056J494q534K6254Q9380q9761M3697o0471N1338
7228E4129O7048j3614p977n4098M452j31482j30090j754J80226Q0413n5284l5990
$$ plain form
7310 79303 103261 18011 49632 -64279 5556 6479 -32049 -8217 -164586 -246038 -94926 -40502
7298 -40502 43319 39345 -41028 -22197 7860 95683 -11198 -65468 -128111 -105983 -108915 -68976
7286 -68976 -123082 -234909 -266708 -105108 -1329 75688 95487 117696 162333 118696 129775
7275 129775 187610 98666 44051 81147 -100744 -142193 -163025 -145883 -198447 -137030 -64086
7264 -64086 -73236 -90794 -179501 -178021 -49150 69682 30257 52712 14207 -56568 -88803 23430
7252 23430 60828 13460 20230 41453 48662 30071 17357 -67139 -194583 -288422 -151514 31477
7240 31477 79289 -45663 -15324 732 2226 -6308 19946 109326 19565 63262 2791 54129
7228 54129 121177 107563 99586 45488 49940 -81542 -211632 -213386 -33160 47253 -8031 -44021
7216d4021n7790O9183Q7645N5139k0542k1067l2197K5093Q7811R7988J0697j14368
7204A43571O6086q807J2042K8714o3060q0091K8955P1728l3277m9316j31037j18367
7192a32859L5597J06369p575P6974N9806j57313l5049N8396M8753l849j14720
7181f5470q6496P058J34568N474j12298m8134j3078M631L1219l152M7051N4917
7169d3710j9310L1503j5546J3586q1059j2550n5767L6230N6641J33100P8566j7202
7157A04482o1611j1608n0486O139J0162J19464N4559j40508p9868P903n2610l186
7145i7168p6811j78872M2842J08789K1705J37473N620O786K6023J4952j86492
7134a75153p7975J4769J77672O9124m3995l3610K5779Q5426j15563j7912R8360
$$ plain form
7216 -44021 -101811 -32628 55017 110156 89614 68547 36350 61443 149254 247242 257939 143571
7204 143571 209657 200850 212892 241606 178546 98455 127410 199138 165861 116545 -14492 -132859
7192 -132859 -97262 9107 1532 78506 138312 -19001 -54050 4346 53099 49250 -65470
7181 -65470 -151966 -144908 -10340 -4866 -117164 -165298 -178376 -173745 -142526 -145678 -98627 -43710
7169 -43710 -63020 -31517 -47063 -33477 -114536 -127086 -182853 -146623 -89982 43118 121684 104482
7157 104482 42871 31263 -19223 -13084 -2922 116542 171101 30593 -49275 -41372 -93982 -97168
7145 -97168 -173979 -352851 -310009 -201220 -179515 -42042 -36422 -29636 -3613 11339 -175153
7134 -175153 -253128 -238359 -60687 8437 -35558 -69168 -43389 42037 -73526 -91438 6922
7123F922j6202L4010P2277n115j08122l2682O2331K8808K3418o67j1123n7434
7111c579P1n350m7819l2923r4515J16125j1147m4811N6484Q7456p3581j21661
7099a75250M7932J32926P6076j21562M4956L4150p8151l6922j06305L5370J36579
7088a0201J9196M1346K0995Q5071K8550K8771Q2683m0947j52590K0329j0695q1725
7076C0783K9980N478j09478M3699K1070J48457j01331k4004o3974r9825J04787
7065a4358O565j25258j02820M5645Q1189L9846k1357J98739j5054j12266j4340
7054c3469P3473J21064N1610j17038j13873m5361J5446J17844N3657L8489m6493
7043A15349o8763m8498J4265O9027M720M3246J7674m0996n7850j28132m4700M9377
$$ plain form
7123 6922 -9280 24730 97007 91892 -16230 -48912 13419 42227 65645 64978 53855 -3579
7111 -3579 -3508 -8858 -56677 -89600 -184115 -67990 -79137 -123948 -67464 19992 -53589 -175250
7099 -175250 -127318 5608 81684 -39878 5078 39228 -38923 -75845 -182150 -146780 -10201
7088 -10201 8995 50341 71336 156407 184957 213728 296411 255464 102874 123203 112508 30783
7076 30783 60763 66241 -43237 462 21532 169989 68658 44654 -19320 -119145 -14358
7065 -14358 -7793 -133051 -235871 -190226 -109037 -69191 -90548 108191 93137 -19129 -33469
7054 -33469 40004 161068 212678 95640 -18233 -63594 -48148 69696 123353 161842 115349
7043 115349 46586 -1912 12353 81380 86100 129346 147020 106024 48174 -79958 -124658 -75281
7031g5281M1577L0645n1192p3270j19353O2961J17831m8858Q937M5026j9789m5564
7019a26330k007k16m1853Q4457J00368K9248j68001L415J23325r1382p7911M0024
7007a26863J41652j3503N884L5036n9725o4456Q2540Q3825J6210J0041P9298n051
6995A84888j28556K9090Q7360q138K387n5114l6987P2135P2713k5133l0817o9157
6983I4671l0822j03907j17096k9839O9817N0295n6163R663L2208n1727P7911O1512
6971F523m8387l854l4848L8494l4465L8007j9080q822J9388L9420J23483J2315
6959A28174j40268k1856Q195K9907J4837O0531J61557o2298j18009j76946R6418
6948a9758Q3148O1385n9774m5989K9634R0384M0118n1719N381l5796N5727K3034
$$ plain form
7031 -75281 -33704 -3059 -54251 -127521 -246874 -183913 -66082 -114940 -106003 -60977 -80766 -126330
7019 -126330 -128337 -128553 -170406 -85949 14419 43667 -124334 -120919 2406 -88976 -166887 -126863
7007 -126863 14789 1286 7170 42206 -17519 -81975 565 84390 100600 110641 189939 184888
6995 184888 56332 85422 172782 164644 167031 111917 74930 147065 219778 194645 163828 94671
6983 94671 63849 -40058 -157154 -186993 -117176 -66881 -123044 -113381 -81173 -132900 -54989 6523
6971 6523 -41864 -45718 -80566 -42072 -76537 -38530 -57610 -66432 -47044 -7624 115859 128174
6959 128174 -12094 -33950 -25755 4152 18989 79520 241077 178779 60770 -116176 -19758
6948 -19758 63390 124775 65001 19012 48646 139030 179148 127429 132810 97014 152741 175775
6936A75775m1153r9007o3477j37218L7670j2063l7924L1802N5960J03125Q0916
6925I4406o2400M2697P0120j03057o7772K8661J8605N3240O9622k9280l9694j53612
6913g8464j58147P4245J72904J76767L9625j26738j54750P6571j018m0333k960
6902b2298J0333m4149J03828O7454j3416J12107k832j53523m1130k4740p88J55631
6890A46477L9865q088k5430j65707q4385k3424M2805p7675J32105Q6094k324L3552
6878I3865N5685j41288j403P2593J6300k7220k8854J6774M0956j00787k9680Q7358
6866E4299j18458q7510p6385q8095k1040J6138P5122Q5815J507J13667j5538p7103
6854a37581q5489N6895Q3241N743R267K1577J2143J51674J35792j11019k44699
$$ plain form
6936 175775 134622 35615 -27862 -165080 -127410 -139473 -177397 -145595 -89635 13490 94406
6925 94406 32006 74703 144823 41766 -26006 2655 21260 74500 144122 114842 75148 -78464
6913 -78464 -236611 -162366 10538 187305 226930 100192 -54558 22013 20995 -19338 -22298
6902 -22298 -11965 -56114 47714 115168 101752 213859 211027 57504 16374 -8366 -9154 146477
6890 146477 186342 178254 152824 -12883 -97268 -120692 -77887 -155562 -23457 62637 60313 93865
6878 93865 149550 8262 6859 79452 95752 68532 39678 56452 97408 -3379 -33059 54299
6866 54299 -64159 -151669 -228054 -316149 -337189 -321051 -245929 -160114 -158607 -44940 -60478 -137581
6854 -137581 -223070 -166175 -82934 -77191 -67924 -46347 -34204 117470 253262 142243 -102456
6843a02456Q9980O7522k9260j07634q7629J1259L0035n6245J04948Q2196K5445
6832B8161q951L088m538p3948j0027M5153R1335O2403k4207l0599P3982J9513
6820A71365N0978j45768r1068m5897p7554k9036J4843J37029N3656o6714m77L3177
6808D534J2866P7014O461j28440j7563O6655p3040j08413L0474P1082K8515R081
6796b0774K3182o7740q0545K0335J33299p2919p7204M5136R4794O1500M8104j07263
6784i5J5013Q8433j4648J49131l82k1508j21016k00681k9316p5415M3213J48043
6772a9228o848m8000n4346J52541J34070j9314j00321q1690q4470P4072L2766
6761b0768l4407p5778J51373N8679k9605o2010M8978Q9841r2422n7977l3608m0088
$$ plain form
6843 -102456 -12476 55046 25786 -81848 -169477 -158218 -128183 -184428 -79480 2716 28161
6832 28161 19210 22298 17760 -56188 -66215 -21062 70273 132676 108469 77870 151852 171365
6820 171365 222343 76575 -14493 -60390 -137944 -166980 -152137 -15108 38548 -28166 -28643 4534
6808 4534 17400 94414 100875 -27565 -45128 21527 -51513 -159926 -129452 -58370 -29855 -20774
6796 -20774 2408 -65332 -145877 -125542 7757 -65162 -142366 -97230 -2436 59064 107168 -95
6784 -95 14918 103351 88703 237834 237452 215944 94928 -105753 -135069 -210484 -167271 -19228
6772 -19228 -26076 -74076 -128422 24119 158189 138875 38554 -43136 -127606 -53534 -20768
6761 -20768 -55175 -130953 20420 79099 49494 -12516 36462 126303 33881 -24096 -57704 -97792
6749i7792L1874J9509j41670p7021J848J8818Q4987N5505J3311P4972q4598j27990
6737b28247N9583N221k3902Q1668o739m3675J2643j0575p1971J52840R2858j03952
6725h4248p6073M3275J40592M4706n3940m4801J449J0313q0364L5445q428q8133
6713a60207m7631M2143l8685J10137J63808j1323P268k569M5348m4917j12067
6702d8695o2709o0419M5854N6334l1509j03987l0604J04479R419K0126J16524
6691A4813L5926n5500p0288j65899j4771J07248P9945l537q2209k8990Q0265p3193
6679a76190P6570O0224k6462k8390R9508n701p5305O0876q1003k6344m8473m2411
6667b13101R565k3886n9265Q7773P8000J9605L9682J8731k5407M3219M5391P42
$$ plain form
6749 -97792 -65918 -46409 -188079 -265100 -263252 -244434 -159447 -103942 -90631 -15659 -100257 -228247
6737 -228247 -168664 -163443 -187345 -105677 -112416 -156091 -143448 -154023 -225994 -73154 19704 -84248
6725 -84248 -160321 -117046 23546 68252 14312 -30489 -29040 -18727 -99091 -63646 -72074 -160207
6713 -160207 -207838 -165695 -204380 -94243 69565 58242 65510 62941 108289 63372 -48695
6702 -48695 -111404 -171823 -125969 -69635 -101144 -205131 -235735 -131256 -121837 -101711 14813
6691 14813 50739 -4761 -75049 -240948 -255719 -148471 -68526 -72063 -154272 -183262 -102997 -176190
6679 -176190 -99620 -39396 -65858 -94248 5260 -441 -75746 -14870 -95873 -122217 -170690 -213101
6667 -213101 -203536 -227422 -286687 -198914 -120914 -101309 -61627 -42896 -68303 -25084 20307 21049
6655B1049n5513l7413m5099j21519L5224m9196l9235N7744J35986L137r1733K9840
6643a56728O7635k1434P002k2767N9356J15590L7412k8321n2110j36408L0506
6632a00267j0006j4395J2269l2929L3366r485m5035J7967O6499M8631R4701O5052
6620A26368O3673l2176o1054m5312K010L3991k9950j4269M3395J7887k3240n5922
6608B5401k2215j9800j15310Q9170R6736M5718n4436l1994l8825K9255M5821r3697
6596d4176j15093j7764J01726m4845L2212o6060M5721K5276k5873N0318M5503
6585a3055j253J006n8401j01994N0593L0719J9159j05477o225L3816N0856j3469
6573a13725m9369R547N9123Q9180K7067m3831j2565K0267k2796p9628Q1861J40030
$$ plain form
6655 21049 -34464 -71877 -116976 -238495 -203271 -252467 -291702 -233958 -97972 -94835 -186568 -156728
6643 -156728 -89093 -110527 -103525 -126292 -66936 48654 86066 57745 5635 -130773 -100267
6632 -100267 -110273 -124668 -112399 -145328 -111962 -121447 -166482 -148515 -82016 -33385 61316 126368
6620 126368 190041 157865 96811 51499 53509 87500 57550 43281 86676 104563 81323 25401
6608 25401 3186 -16614 -131924 -42754 53982 99700 45264 13270 -25555 3700 49521 -44176
6596 -44176 -159269 -177033 -75307 -120152 -87940 -154000 -108279 -83003 -108876 -58558 -13055
6585 -13055 -14308 -13302 -71703 -173697 -123104 -92385 -73226 -178703 -184928 -151112 -100256 -113725
6573 -113725 -163094 -153547 -94424 -5244 21823 -22008 -34573 -14306 -37102 -116730 -34869 105161
6561A05161n7184j34589r9319j9971J56911J26818J04623m6815q3853l0410M6362
6550F7734J44646K2463P426j10859r6591j073N5378r2381k8292K135R1911L0558
6538I3055j44607p2159K1509P447J776K4172j2968n5169l6378r440P8902J19633
6526A5773M5078m6553N2856M8051j66953j990P6764q835L534k3779n5512J1591
6514d9975O0853k3923K364Q11R982Q9835N4726l8141o6597K2187k5137n5007J03372
6501H5350n2310n6118Q2599R2658K5367o9153J1306L5893N3378Q33p4191l2848
6489A02764j35764o954o3995j8115Q0837l682l5030q624Q8489K3233M0622O9763
6477A33544o892j76750m5897N0502J1613k965K531L6027j6912J6531N2489L7289
$$ plain form
6561 105161 47977 -86612 -185931 -205902 -48991 77827 182450 135635 51782 21372 67734
6550 67734 212380 234843 242269 131410 34819 33746 89124 -3257 -31549 -29414 62497 93055
6538 93055 -51552 -123711 -102202 -94755 -92979 -68807 -81775 -136944 -173322 -182762 -103860 15773
6526 15773 60851 14298 67154 115205 -51748 -53738 23026 14191 17725 -6054 -61566 -49975
6514 -49975 10878 -13045 -10681 -9870 112 89947 144673 106532 39935 62122 36985 -18022 85350
6501 85350 33040 -23078 59521 152179 177546 108393 119699 155592 208970 209803 135612 102764
6489 102764 -33000 -39954 -103949 -122064 -41227 -44909 -79939 -88563 -74 23159 63781 133544
6477 133544 126652 -50098 -95995 -45493 -33880 -36845 -34314 1713 -15199 1332 53821 91110
6465I1110n8731j14953K5378J20402l0664J759J3672p3811q037N2007k3645L127
6453b386n0209P4060J13264K3737q6254j4132K8788P91p898n1564Q4339l9133
$$ plain form
6465 91110 32379 -82574 -57196 63206 32542 34301 47973 -25838 -33875 18132 -5513 -2386
6453 -2386 -52595 21465 134729 158466 72212 58080 86868 87659 79761 28197 112536 73403
$$ [...]
##END NTUPLES=NMR SPECTRUM
##END=
