##TITLE=Analysis number 320637
Compound Code mo 07848
Book Reference 451/165
Project Code adrs
Chemist Name evam
##JCAMPDX= 6.0         $$ Bruker NMR JCAMP-DX V2.0
##DATA TYPE= NMR SPECTRUM
##DATA CLASS= NTUPLES
##ORIGIN= Bruker BioSpin GmbH
##OWNER= nmr
$$ XWIN-NMR		Version 3.5
$$ Tue Jul  4 10:11:28 2006 GMT Daylight Time (UT+1h)  MAYBRIDGE\nmr@NMR_250MHZ
##.OBSERVE FREQUENCY= 250.131544655141
##.OBSERVE NUCLEUS= ^1H
##.ACQUISITION MODE= SIMULTANEOUS (DQD)
##.ACQUISITION SCHEME= undefined
##.AVERAGES= 16
##.DIGITISER RES= 18
##SPECTROMETER/DATA SYSTEM= dpx250
##.PULSE SEQUENCE= zg30
##.SOLVENT NAME= DMSO
##.SHIFT REFERENCE= (INTERNAL, DMSO, 0, 16.522)
##AUDIT TRAIL= $$ (NUMBER, WHEN, WHO, WHERE, WHAT)
$$ ##TITLE= Audit trail, XWIN-NMR		Version 3.5
$$ ##JCAMPDX= 5.01
$$ ##ORIGIN= Bruker BioSpin GmbH
$$ ##OWNER= nmr
$$ C:\u/data/dgb/nmr/ADRS/2110/pdata/1/auditp.txt
$$ ##AUDIT TRAIL=  $$ (NUMBER, WHEN, WHO, WHERE, WHAT)
(   1,<2006-07-04 10:10:56.21 +100>,<MAYBRIDGE\nmr>,<NMR_250MHZ>,
      <created by zg, POWCHK disabled, PULCHK disabled
       configuration hash MD5:
       E2 DF 36 D8 04 B2 41 60 5A D7 A3 38 5A 4B D0 FE
       data hash MD5: 64K
       1D BF 81 10 E0 BA 50 3F 0D D7 14 C6 C5 B1 DE C9>)
(   2,<2006-07-04 10:11:15.38 +100>,<MAYBRIDGE\nmr>,<NMR_250MHZ>,
      <Start of raw data processing
       ef LB = 0.3 FT_mod = 6 PKNL = 1 SI = 32K 
       data hash MD5: 32K
       56 2E FE E2 B5 A7 2C BB E1 DC A0 E0 12 96 8E 7F>)
(   3,<2006-07-04 10:11:17.18 +100>,<MAYBRIDGE\nmr>,<NMR_250MHZ>,
      <apk 
       data hash MD5: 32K
       0B F1 2D 28 52 C1 9E 20 85 E2 93 CE 71 D9 F7 07>)
(   4,<2006-07-04 10:11:17.93 +100>,<MAYBRIDGE\nmr>,<NMR_250MHZ>,
      <abs ABSG = 5 
       data hash MD5: 32K
       D5 CC B3 54 B4 0B EE 40 47 D4 F9 B6 12 EF 68 28>)
$$ ##END=
$$ 
$$ hash MD5
$$ 6D 07 21 C3 C0 D6 C2 8A 87 C2 A2 37 32 77 42 36
##$RELAX= 
##$RELAX= 
##$RELAX= 
##$RELAX= 
##$RELAX= 
##$RELAX= 
##$RELAX= 
$$ Bruker specific parameters
$$ --------------------------
##$DU= <C:\u>
##$EXPNO= 2110
##$NAME= <ADRS>
##$PROCNO= 1
##$TYPE= <nmr>
##$USER= <dgb>
##$AMP= (0..31)
100 100 100 100 100 100 100 100 100 100 100 100 100 100 100 100 100 100 
100 100 100 100 100 100 100 100 100 100 100 100 100 100 
##$AQSEQ= 0
##$AQ_mod= 3
##$AUNM= <au_zg>
##$AUTOPOS= <9 >
##$BF1= 250.13
##$BF2= 250.13
##$BF3= 250.13
##$BF4= 250.13
##$BF5= 500.13
##$BF6= 500.13
##$BF7= 500.13
##$BF8= 500.13
##$BYTORDA= 1
##$CFDGTYP= 0
##$CFRGTYP= 5
##$CHEMSTR= <none>
##$CNST= (0..31)
1 1 145 1 1 1 1 1 1 1 1 1 1 1 1 1 1 1 1 1 1 1 1 1 1 1 1 1 1 1 1 1 
##$CPDPRG= <>
##$CPDPRG1= <>
##$CPDPRG2= <>
##$CPDPRG3= <>
##$CPDPRG4= <mlev>
##$CPDPRG5= <mlev>
##$CPDPRG6= <mlev>
##$CPDPRG7= <mlev>
##$CPDPRG8= <mlev>
##$CPDPRGB= <>
##$CPDPRGT= <>
##$D= (0..31)
0 1 0 0 0 0 0 0 0 0.06 0 0 0 0 0 0 0.0002 0 0 0 0 0 0 0 0 0 0 0 0 0 0 
0 
##$DATE= 1152004253
##$DBL= (0..7)
120 120 120 120 120 120 120 120 
##$DBP= (0..7)
150 150 150 150 150 150 150 150 
##$DBP07= 0
##$DBPNAM0= <>
##$DBPNAM1= <>
$$ [...]
##$SUBNAM6= <"">
##$SUBNAM7= <"">
##$SUBNAM8= <"">
##$SUBNAM9= <"">
##$SW= 20.6930455092707
##$SWIBOX= (0..15)
0 0 3 0 0 0 0 0 0 0 0 0 0 0 0 0 
##$SW_h= 5175.983436853
##$TD= 65536
##$TD0= 1
##$TE= 296.16
##$TE2= 300
##$TE3= 300
##$TEG= 300
##$TL= (0..7)
0 120 120 120 120 120 120 120 
##$TP= (0..7)
150 150 150 150 150 150 150 150 
##$TP07= 0
##$TPNAME0= <>
##$TPNAME1= <>
##$TPNAME2= <>
##$TPNAME3= <>
##$TPNAME4= <>
##$TPNAME5= <>
##$TPNAME6= <>
##$TPNAME7= <>
##$TPOAL= (0..7)
0.5 0.5 0.5 0.5 0.5 0.5 0.5 0.5 
##$TPOFFS= (0..7)
0 0 0 0 0 0 0 0 
##$TUNHIN= 0
##$TUNHOUT= 0
##$TUNXOUT= 0
##$USERA1= <user>
##$USERA2= <user>
##$USERA3= <user>
##$USERA4= <user>
##$USERA5= <user>
##$V9= 5
##$VALIST= <valist>
##$VCLIST= <CCCCCCCCCCCCCCC>
##$VD= 0
##$VDLIST= <DDDDDDDDDDDDDDD>
##$VPLIST= <PPPPPPPPPPPPPPP>
##$VTLIST= <TTTTTTTTTTTTTTT>
##$WBST= 1024
##$WBSW= 4
##$XGAIN= (0..3)
0 0 0 0 
##$XL= 0
##$YL= 0
##$YMAX_a= 366001
##$YMIN_a= -459691
##$ZGOPTNS= <>
##$ZL1= 120
##$ZL2= 120
##$ZL3= 120
##$ZL4= 120
##$ABSF1= 16.522
##$ABSF2= -4.171173
##$ABSG= 5
##$ABSL= 3
##$ALPHA= 0
##$AQORDER= 0
##$ASSFAC= 0
##$ASSFACI= 0
##$ASSFACX= 0
##$ASSWID= 0
##$AUNMP= <proc_1d>
##$AZFE= 0.1
##$AZFW= 0.1
##$BCFW= 0
##$BC_mod= 0
##$BYTORDP= 0
##$COROFFS= 0
##$CY= 12.5
##$DATMOD= 1
##$DC= 0
##$DFILT= <>
##$DTYPP= 0
##$F1P= 14.0000005364418
##$F2P= -0.99999901652339
##$FCOR= 0.5
##$FTSIZE= 32768
##$FT_mod= 6
##$GAMMA= 0
##$GB= 0
##$INTBC= 1
##$INTSCL= 1
##$ISEN= 128
##$LB= 0.3
##$LEV0= 0
##$LPBIN= 0
##$MAXI= 10000
##$MC2= 0
##$MEAN= 0
##$ME_mod= 0
##$MI= 0
##$NCOEF= 0
##$NC_proc= -3
##$NLEV= 6
##$NOISF1= 0
##$NOISF2= 0
##$NSP= 0
##$NTH_PI= 0
##$NZP= 0
##$OFFSET= 16.522
##$PC= 1
##$PHC0= 157.1964
##$PHC1= 9.12603
##$PH_mod= 1
##$PKNL= yes
##$PPARMOD= 0
##$PSCAL= 4
##$PSIGN= 0
##$REVERSE= no
##$SF= 250.13
##$SI= 32768
##$SIGF1= 0
##$SIGF2= 0
##$SINO= 400
##$SIOLD= 32768
##$SREGLST= <1H.DMSO>
##$SSB= 0
##$STSI= 32768
##$STSR= 0
##$SW_p= 5175.98343685301
##$SYMM= 0
##$S_DEV= 0
##$TDeff= 65536
##$TDoff= 0
##$TI= <Analysis number 999999
Compound Code 99
Book Reference 9
Project Code 9>
##$TILT= no
##$TM1= 0
##$TM2= 0
##$TOPLEV= 0
##$USERP1= <user>
##$USERP2= <user>
##$USERP3= <user>
##$USERP4= <user>
##$USERP5= <user>
##$WDW= 1
##$XDIM= 32768
##$YMAX_p= 283577963
##$YMIN_p= -163315
$$ End of Bruker specific parameters
$$ ---------------------------------
##NTUPLES= NMR SPECTRUM
##VAR_NAME=  FREQUENCY,     SPECTRUM/REAL,   SPECTRUM/IMAG
##SYMBOL=    X,             R,               I
##VAR_TYPE=  INDEPENDENT,   DEPENDENT,       DEPENDENT
##VAR_FORM=  AFFN,          ASDF,            ASDF
##VAR_DIM=   32768,         32768,           32768
##UNITS=     HZ,            ARBITRARY UNITS, ARBITRARY UNITS
##FACTOR=    0.157963299565203, 1,           1
##FIRST=     4132.6476996994, 0,             0
##LAST=      -1043.33573715361, 0,           0
##MIN=       -1043.33573715361, -163315,     0
##MAX=       4132.6476996994, 283577963,     0
$$ Real data points
##PAGE= N=1
##DATA TABLE= (X++(R..R)), XYDATA
$$ [...]
18043C43748n0276n7181q5169q4486m11J1388L6653L3693K0474Q184o1723l2229
18031H2665j4072q821O983o382j5771k9823K948K1339n7703N003M7539L4110J968
18018F9983l6624P655K4253J4272J2818j4766N857m2005j6241l040M164n0526
18006b4200N3237M4115L2372l1447l5167N559j7637l3155n891p209j810M721J0095
17993f417J6772O9647j8253k2330M7596J5163P594m03k284q579j2313J133K9353
17980A16679J0132l7716l8267j7504J6218J9948L1271K0684q887o606j3598O946
17968I9300Q002M612j9876K3820P762l0862l3915l9633j0421K7470m623K6487
17956E8123L5464N15m0166j1827q552O692j3580j7054j2536J9850M3666l5411
$$ y = [343748, 293472, 236291, 151122, 66636, 66225, 77613, 114266, 147959, 168433, 176617, 114894, 82665, 68593, 59772, 66755, 60373, 44602, 14779, 17727, 39066, -18637, -13634, 33905, 68015, 69983, 33359, 41014, 65267, 79539, 92357, 77591, 83448, 41443, 25202, 22162, 26326, -24200, 29037, 73152, 105524, 74077, 38910, 44469, 26832, -6323, -12214, -19423, -21233, -16512, -6417, 10355, 80002, 61749, 39419, 87015, 102178, 109772, 109369, 107085, 98506, 86193, 87326, 116679, 126811, 89095, 50828, 33324, 49542, 69490, 100761, 121445, 112558, 105952, 92354, 99300, 107302, 111914, 92038, 115858, 123620, 92758, 58843, 19210, 8789, 36259, 31636, 58123, 93587, 94102, 53936, 42109, 33557, 40249, 26669, 9615, -2921, 16929, 60595, 25184]
17944B5184l5772K4987J7973M270K3982j0115m1275m499L6462Q691k4271K918
17932B8535M4895R413l7570l6820K2538J4349J8748l5229j0366K7511R828p70
17920E5062J4143J5935L420j9255J8019J0761j3425l1182M330R203k2125n431
17908C9455K1842l0960n369K8776O3864K2432n7107j2308N722m0563j9838k1180
17896e234K0157o61K069j2878K1032J3052M508R915L3574J7214k2746m7812j4143
17883A8047r701J3824K8317N1695p894m6869k23Q640J2423K6711l2182m6864P871
17870B3795M8947k0905m1729K2164M0762M1960J3703p2216l2471J737N982J7927
17858D9656m9097k0636K0071K4910l0514K5233M4369J7919l2798j2217j0307L6494
$$ y = [25184, -10588, 14399, 32372, 36642, 60624, 50509, 9234, 4735, 41197, 49888, 25617, 28535, 73430, 82843, 45273, 8453, 30991, 45340, 64088, 28859, 18493, 46004, 55832, 55062, 69205, 85140, 88560, 69305, 87324, 98085, 84660, 53478, 57808, 67011, 44886, 39455, 61297, 30337, 24968, 53744, 117608, 140040, 82933, 70625, 76347, 35784, 15946, -5234, 14923, 14262, 16331, 3453, 24485, 37537, 42045, 51960, 85534, 102748, 80002, 32190, 18047, 8346, 22170, 50487, 102182, 94288, 47419, 47196, 55836, 68259, 94970, 62788, 15924, 23795, 72742, 51837, 10108, 32272, 73034, 114994, 128697, 56481, 24010, 25747, 31729, 49656, 559, -20077, -6, 24904, -5610, 19623, 63992, 81911, 49113, 36896, 26589, 63083]
17846F3083j8201k1359q152J3473j3054m379J0486o885J3846L4583n3910j8662
17834i131J5218J5796K6486J7801L710j1760L733k4190R642M449J0591J8902j2553
17821F8694P202L8809j0825m0261o3084P748O684k734J7102J363j8359P516K9292
17808D9147J9594j2219J4662J4220J2377j8217J1845M265m2004o1134m1018L9669
17796h813N6991o375j3707P652j476j5976j8447J6299M4911O847J4091r041l2237
17783D0719o821j0040M0493N6321o244l607k0413J2119j9163j2337J6182K0218
17771A07427N533j9489j8177Q802J720M4478k3737q492M7001L2950j6545m1722
17759A19749m0068Q866P756j1178j9792Q416K8976K7910j0788K8288J8596m9555
$$ y = [63083, 44882, 23523, 15371, 28844, 15790, 11411, 21897, 15012, 28858, 63441, 9531, -9131, 6087, 21883, 48369, 66170, 69880, 58120, 61853, 37663, 47305, 51754, 62345, 81247, 68694, 75896, 114705, 103880, 63619, 535, 8283, 14967, 12233, 29335, 30698, 12339, 19855, 49147, 68741, 56522, 71184, 85404, 97781, 79564, 91409, 95674, 53670, -7464, -48482, -8813, 48178, 41803, 28096, 35748, 34272, 18296, -151, 16148, 61059, 67906, 81997, 72956, 40719, 33898, 23858, 64351, 120672, 114428, 110821, 90408, 102527, 83364, 71027, 87209, 107427, 112960, 93471, 75294, 84096, 85816, 130294, 106557, 98065, 145066, 178016, 161471, 119749, 79681, 88547, 96303, 85125, 65333, 73749, 102725, 130635, 119847, 148135, 166731, 117176]
17747A17176j6534m8462k3086L1299J0316N495J5776q842O200O342k3088n9008
17735A3584K695L8236j942J8718K0175j5141K5581N7674n7118l9252N627L8607
17723A07444J3579N2689l403l4520k0230L102k7806k2304m3943K6725L3879k0645
17711F4567j0336L6716p297N511l048k7823r846L4568K2531M246k3210K3053J6476
17698A26108o873o823L0252K1124L4324l8285n4923R420j996M90N378k0018R298
17685A07476R418L2701J5649k5446m899r919l9558j6086M8023K9382m6532j872
17673I8337J064J0809K4226K1989k5473M2132j5326l3111M433j2738j2118R046
17661A13270K3032K5421M027k3750K6510P48J0326p717l5163k5249l2910j884
$$ y = [117176, 100642, 52180, 29094, 60393, 70709, 76204, 91980, 83138, 89338, 95680, 72592, 13584, 16279, 54515, 52573, 71291, 91466, 76325, 101906, 159580, 102462, 63210, 68837, 107444, 121023, 173712, 170309, 135789, 115559, 118661, 90855, 68551, 24608, 51333, 85212, 64567, 54231, 90947, 83650, 89161, 86113, 58290, 48444, 83012, 105543, 109789, 86579, 109632, 126108, 119235, 112412, 142664, 163788, 198112, 159827, 104904, 114324, 112328, 112818, 118196, 98178, 107476, 116894, 149595, 165244, 139798, 134899, 124980, 85422, 69336, 117359, 146741, 100209, 98337, 99401, 110210, 134436, 156425, 130952, 173084, 157758, 124647, 129080, 116342, 104224, 113270, 136302, 161723, 165750, 142000, 168510, 169258, 179584, 171867, 136704, 111455, 78545, 76661]
17649G6661M2882L9374J8110O213m6592m1198P476K8348K4422J3627l202J6953
17637A83074M6135j1796Q791k1398m5069q494L5621l1469q877N0639o728l8964
17625A51465L1051J5381q916J985j9098N283M443L123O583r87M8689m042j3688
17612B21272p636m827K0998j5272K791J3011m5226k5845n0127M9135K6166n681
17600A78759k382J272O2215K4204k7304o0805J2155M9602M7415O663l3173l4733
17588B23888M770N0915K1660J750K5634k6484K6463M4035M5429L8486M2885J4539
17576E13970K7187k1802q309j3643k1800N185k4414J1643l755K16k4547n4167
17564C85764k5437O185K9646J7569k6426J8074l9873J6053O246k5130k2620M7615
$$ y = [76661, 119543, 158917, 177027, 183240, 136648, 95450, 102926, 131274, 155696, 169323, 166121, 183074, 229209, 217413, 226204, 204806, 159737, 151243, 186864, 155395, 146518, 197157, 190429, 151465, 182516, 197897, 188981, 190966, 171868, 177151, 181594, 184717, 191300, 190313, 239002, 234960, 221272, 213636, 208809, 229807, 214535, 217326, 230337, 185111, 159266, 109139, 158274, 184440, 178759, 176377, 177649, 239864, 264068, 236764, 175959, 188114, 237716, 285131, 291794, 258621, 223888, 228658, 279573, 301233, 302983, 328617, 302133, 328596, 372631, 418060, 456546, 499431, 513970, 541157, 519355, 511046, 497403, 475603, 480788, 456374, 468017, 464262, 464478, 439931, 385764, 360327, 366512, 396158, 413727, 387301, 405375, 365502, 381555, 387801, 362671, 340051, 387666]
17552C87666j2199m8719m0924j1588K0736K4739L4663m887j4610M7374M7127l7381
17540C91997m1668P189n36j4419J6816k9925j7746M638K3284L3380N926j2940
17528C65996M4236l113J0712J4780j2840j2688J0592J9311O754k7103O165k941
17516D19861l7606o5770N4464N4783j1610j317j2271l48J9946J2879J0767N2379
17504D96157l2543o2656K5814k3445j468M4710m19J5231Q965k1410J0000K9664
17492D88600K2424K2361R678l5115m7246k0713N003L8355N2480J8492K1645q159
17480E67805l7110K0394R398k5927k0759M3011O2011J3186k8734m0180J4963M0946
17468F19004K6436k0244Q483J3418K0851k5061l6981J3007O6662J1479p979O920
$$ y = [387666, 375467, 326748, 285824, 274236, 294972, 319711, 354374, 349487, 334877, 382251, 429378, 391997, 350329, 357518, 356982, 342563, 359379, 329454, 311708, 316346, 339630, 373010, 378936, 365996, 410232, 407119, 417831, 432611, 419771, 407083, 417675, 436986, 443740, 416637, 422802, 419861, 382255, 316485, 370949, 425732, 414122, 412805, 400534, 400186, 420132, 433011, 443778, 496157, 463614, 400958, 426772, 403327, 401859, 446569, 446150, 461381, 470346, 448936, 458936, 488600, 511024, 533385, 543063, 507948, 460702, 439989, 444992, 483347, 535827, 554319, 575964, 567805, 530695, 551089, 560487, 534560, 513801, 556812, 618823, 632009, 603275, 563095, 578058, 619004, 645440, 625196, 633679, 647097, 667948, 642887, 605906, 618913, 685575, 697054, 689075, 695995]
17456F95995N869J7799K1191l367l8418J8558Q3485L5930j8531L1690p682O232
17444H48751k1751L624K967L8915K7299m320l976m092J5760L2762J2139j287Q8610
17431A035401K3122j5292K2215L9645M9534J2958k6610N573N791L1955L1369L6576
17419A252237J3672L630K1559R795O669M9577K1391M4791N036k9991k3058j3573
17407A361735O0923N6188N9496M1257K8788N0274K3783K7217N4539Q564J8400
17396A791164O6179N7015j5861M935P375K7293L9322M5452L2346N7944j8064J4791
17384B109891Q2533R1057Q2673j6487K7959R8219O4521P6516P1613O9084K5159
17373B782738K3264J04719Q2969N9305N6675N2450P4666J09452J30981N7351R2811
$$ y = [695995, 701864, 719663, 740854, 737487, 699069, 717627, 801112, 837042, 818511, 850201, 842519, 848751, 827000, 830624, 833591, 872506, 899805, 895485, 891509, 887417, 903177, 935939, 948078, 946791, 1035401, 1058523, 1043231, 1065446, 1105091, 1154625, 1167583, 1140973, 1146546, 1152337, 1184292, 1215661, 1252237, 1265909, 1269539, 1291098, 1300893, 1307562, 1357139, 1378530, 1423321, 1428357, 1398366, 1375308, 1361735, 1422658, 1478846, 1538342, 1579599, 1608387, 1658661, 1682444, 1709661, 1764200, 1772764, 1791164, 1857343, 1914358, 1898497, 1903432, 1910807, 1938100, 1977422, 2022874, 2055220, 2113164, 2095100, 2109891, 2192424, 2283481, 2366154, 2349667, 2377626, 2475845, 2540366, 2616882, 2688495, 2757579, 2782738, 2806002, 2910721, 2993690, 3052995, 3109670, 3162120, 3236786, 3346238, 3477219, 3534570, 3627381]
17362C627381P7719R4032J29540J44228J43070Q5300Q0708J14616J76384J57658
17352D830636J29840J29664J49685J09084J94923K00325K11813J94024K22658
17343F372652K28839K25791K23423K29641K86751K86852L01645L12659L07005
17334H775258L63295L94678M02323M15018M46129M64829M80703N24730N35269
17325A2802232O31785O38048O37309P00002P39676P80426Q12946Q14449R00079
17316A9456952R37041R85691R87811J033427J111734J174808J216541J226093
17308B8130098J242224J238676J268755J211142J184264J178583J153428J088788
17300C7695958R42664Q27454P55125O34711M90603L65079J42355J1183q9975k20329
$$ y = [3627381, 3705100, 3799132, 3928672, 4072900, 4215970, 4301270, 4381978, 4496594, 4672978, 4830636, 4960476, 5090140, 5239825, 5348909, 5543832, 5744157, 5955970, 6149994, 6372652, 6601491, 6827282, 7050705, 7280346, 7567097, 7853949, 8155594, 8468253, 8775258, 9138553, 9533231, 9935554, 10350572, 10796701, 11261530, 11742233, 12266963, 12802232, 13434017, 14072065, 14709374, 15409376, 16149052, 16929478, 17742424, 18556873, 19456952, 20393993, 21379684, 22367495, 23400922, 24512656, 25687464, 26904005, 28130098, 29372322, 30610998, 31879753, 33090895, 34275159, 35453742, 36607170, 37695958, 38638622, 39466076, 40221201, 40855912, 41346515, 41711594, 41853949, 41865132, 41775157, 41554828]
17290D1554828l76868n34342o68025p66082q88445r48130r83233j013256j037093
17281C4339354j093793j134509j072178j075847j094852j081771j002933r39879
17273B5843592r11543r47757r50279q35855q06698p91451p54073p32953o50307
17264A8462676p01164o25844n91796n72742n54753n51948m99958n04272m69641
17255A3390558m81729m59233l86604l62326l63538l39976l50817k84835l36222
17246A0025278k71437k48626k95278l11006k70362k31640j95563j72699k03577
17237G825090k49517k26070k39172k09586j92618j81787j31355j25410j89829
17228F079746j39159r9375j21249j36808j33554j40425j77098j23927j38402q3006
$$ y = [41554828, 41177960, 40643618, 39975593, 39209511, 38321066, 37372936, 36389703, 35376447, 34339354, 33245561, 32111052, 31038874, 29963027, 28868175, 27786404, 26783471, 25843592, 24932049, 23984292, 23034013, 22198158, 21391460, 20600009, 19845936, 19112983, 18462676, 17761512, 17135668, 16543872, 15971130, 15416377, 14864429, 14364471, 13860199, 13390558, 12908829, 12449596, 12062992, 11700666, 11337128, 10997152, 10646335, 10361500, 10025278, 9753841, 9505215, 9209937, 8898931, 8628569, 8396929, 8201366, 8028667, 7825090, 7575573, 7349503, 7110331, 6900745, 6708127, 6526340, 6394985, 6269575, 6079746, 5940587, 5841212, 5719963, 5583155, 5449601, 5309176, 5132078, 5008151, 4869749, 4786743]
17218D786743o7737q9400j27749j50573j32561j02393n9984r9276o3870r2000
17208C801200j14013r2638r5038j03498l5375o5900o6356m3438l6402l7286o7599
17197C043657p2398j01982m8064n8182l6768j8511p0764o5991p5040m5589k7223
17186B423145j5435n4315n7246l3098n7701k5458j3881j0109o5693o9317m6393
17175A974499o9258o3295j3438j3183m4814J5070J1956j9765k2567k3151j4864
17164A717190l0043p1017o1434j3833k9768n4474k1602l8893o5433l1898j8470
17153A280325o364K8700m4487l6971j3705j1345k6777J026M1993j2428l4854m3351
17141A121762j7006n6895l4086j020k2306R177K7850k1893m869J3315j3559Q398
$$ y = [4786743, 4719006, 4629606, 4501857, 4351284, 4218723, 4116330, 4056346, 3957070, 3893200, 3801200, 3687187, 3594549, 3499511, 3396013, 3360638, 3294738, 3228382, 3184944, 3148542, 3111256, 3043657, 2971259, 2869277, 2821213, 2763031, 2726263, 2707752, 2636988, 2570997, 2495957, 2450368, 2423145, 2407710, 2353395, 2296149, 2263051, 2205350, 2179892, 2166011, 2155902, 2090209, 2020892, 1974499, 1905241, 1841946, 1828508, 1815325, 1770511, 1785581, 1797537, 1777772, 1755205, 1732054, 1717190, 1687147, 1616130, 1554696, 1540863, 1511095, 1456621, 1435019, 1396126, 1330693, 1298795, 1280325, 1273961, 1302661, 1258174, 1221203, 1207498, 1196153, 1169376, 1170402, 1212395, 1199967, 1165113, 1121762, 1104756, 1047861, 1013775, 1012755, 990449, 999626, 1027476, 1005583, 1000714, 1014029, 1000470, 1008868]
17129A008868m3316n5576k4846N853r329J5104J5440m6556j292J4823k7062l1955
17117H20156Q028Q463P239j6902k6253k7836j5991r068K0385j8170l2424m5881
17105F71746k123j9568j1870K3884M5496j3621n7406l5344K2402J5421n35j6020
17093F22462k3268k2450k2186L6010K5322p611l836p555m7225j9125L3057J7282
17081E80877j8678n1030l4950l8911k6056k4698L7063M4286K0221J3481k132K231
17069E01704J590p070P833J1525k2005j4308K7747k6876m3665l736M2131o5001
17057D09869k5148J5680K8200M748k4385j4520m3913N9480J0546N3271q36l3367
17045D39625k1961n7581j4871l8074J8900K4239J9141L1696J3103j7641K9853
$$ y = [1008868, 965552, 909976, 885130, 890983, 881654, 896758, 912198, 865642, 864350, 879173, 852111, 820156, 828184, 836647, 843886, 826984, 800731, 772895, 756904, 747836, 768221, 750051, 717627, 671746, 669623, 650055, 638185, 662069, 707565, 693944, 636538, 601194, 623596, 639017, 638482, 622462, 599194, 576744, 554558, 590568, 615890, 608279, 604443, 596888, 549663, 530538, 563595, 580877, 562199, 511169, 476219, 437308, 411252, 386554, 423617, 467903, 488124, 501605, 499473, 501704, 503294, 496224, 504057, 515582, 493577, 479269, 507016, 480140, 436475, 432739, 474870, 409869, 384721, 400401, 428601, 433349, 408964, 394444, 350531, 410011, 420557, 473828, 472992, 439625, 417664, 360083, 345212, 307138, 326038, 350277, 369418, 401114, 414217, 396576, 426429]
17034D26429k7895j3349M658L1221l2548k0802k476K9220L5776k6286n118J0734
17022D09564J3226N732R893N7006M8087o6319k4704L8247M1781M2924L5657k0455
17010E90639k4782j7471n1308p0021o61k2020n9448L920m1763l3653l332L6422
16998C06522K2632j8603M777j8860k6436j6788K6956L0187K1106j8446m3223n680
16986B64144j2486J2171l07l5043j0826l063k6540l1503m24J1299k3433J8936
16974A62925P691M7138K6616q856l5677J3300k6337l9051k0005k3517n6652k464
16962D5111N4955N9369N9085K2954m5394m8699J7572M2270q700l2817p629j8969
16950A39108j9014J8567R452j7722J3381J135L105o046k4419M7179n747J0814
$$ y = [426429, 398534, 385185, 389843, 421064, 388516, 367714, 365238, 394458, 430234, 403948, 398830, 409564, 422790, 428522, 438415, 495421, 543508, 477189, 452485, 490732, 532513, 575437, 611094, 590639, 565857, 548386, 497078, 427057, 426396, 404376, 344928, 348848, 307085, 273432, 270100, 306522, 329154, 310551, 315328, 296468, 270032, 253244, 280200, 310387, 331493, 313047, 269824, 264144, 251658, 263829, 263522, 228479, 217653, 214590, 188050, 156547, 156123, 167422, 143989, 162925, 170616, 217754, 244370, 235514, 199837, 213137, 186800, 147749, 127744, 104227, 47575, 45111, 100066, 159435, 218520, 241474, 196080, 147381, 164953, 207223, 198523, 165706, 158077, 139108, 120094, 138661, 148113, 130391, 143772, 144907, 148012, 141966, 117547, 164726, 158979, 169793]
16938A69793K1530j5946l861j0452K272J7840J9788J0584L236J955k0442K9112
16926B25409j0742k9310j6328r456k6543q850K5730K9822n8454l2110J6181J5356
16914A20705K5224l9406l942j3821J5401O0263Q457K7840l496r026l0453m6038
16902A11708L229k1994j797L507J7538l7261M607J4275J5059J6366M6524K884
16890A74645k0776n6884L126j9337K7092L774p173m296p484k0254r71L2688j8198
16877H5952m1016m1885J6983K3488L2594J0470j321K825R685k4751p234N0282
16865A16072K5277K3734j5765n8708n9207K3185L6235Q308J1120n940j736m9427
16853E3148L0550j1831O366l6133m3393M4288M5674P669J276m7383k0646j0721
$$ y = [169793, 191323, 175377, 171516, 161064, 163336, 181176, 200964, 211548, 214784, 216739, 196297, 225409, 214667, 185357, 169029, 159573, 133030, 124180, 149910, 179732, 121278, 89168, 105349, 120705, 145929, 106523, 102581, 88760, 104161, 164424, 172881, 200721, 197225, 188199, 157746, 111708, 114937, 92943, 91146, 94653, 112191, 74930, 79537, 93812, 108871, 125237, 171761, 174645, 153869, 96985, 100111, 80774, 107866, 111640, 104467, 100171, 92687, 72433, 71462, 104150, 85952, 44936, 3051, 20034, 43522, 76116, 86586, 85265, 88090, 97775, 73024, 65790, 116072, 141349, 165083, 149318, 90610, 31403, 54588, 90823, 99131, 110251, 104311, 102575, 53148, 83698, 71867, 78233, 42100, -1293, 42995, 88669, 96338, 97614, 50231, 29585, 18864]
16841A8864P2749M0933j2522k7757k6604J9588j5593K0475L0295J5360l5409m4248
16829E6131m7422J0826O649j0923k8623Q429K0834J5468M626K2402J8912Q31O997
16816H5137k147n997j889K6492n894m4709j3703k6774j060K9527L2225L1324j5659
16803H6873K4068n4723M815R481P947M6416J3185j6169j3733j7026p267l8668
16791D5199l4660K0326K7930O007J0219j5496j6894l3314j3502J7480J812k494
16779A2613J2725J6638K883J9793J5810j3414R081K7044l241J743j3531k6346
16767F1798l5340J1376M0899j3477r534o284J5340O727k0780l4128j9127K3728
16755B1198N029j6358j0334L0933N9877l8765o1580j6473J0104K8152k1352K1709
$$ y = [18864, 91613, 132546, 120024, 92267, 65663, 85251, 69658, 90133, 120428, 135788, 100379, 56131, 8709, 19535, 26184, 15261, -13362, -4933, 15901, 31369, 35995, 58397, 77309, 78140, 85137, 82990, 76993, 75104, 101596, 95702, 50993, 37290, 10516, 9456, 38983, 71208, 102532, 86873, 110941, 56218, 61033, 70514, 78461, 124877, 138062, 121893, 108160, 91134, 83867, 45199, 10539, 30865, 58795, 64802, 75021, 59525, 42631, 9317, -4185, 13295, 15107, 12613, 25338, 41976, 44859, 64652, 80462, 67048, 76129, 103173, 99932, 101675, 88144, 61798, 26458, 37834, 78733, 65256, 55722, 49438, 64778, 71505, 50725, 16597, -2530, 21198, 26227, 9869, -465, 30468, 90345, 51580, -10000, -26473, -16369, 11783, -9569, 12140]
16743A2140m240K1472P022J7708k1253j8166j9073M0990m403O235L8514J8370
16731I5316j9978J892J3139m2800j6465L1290n146n3525J9498R783J8399k9559
16719B1844l1950q90Q119q547J612M9127L2745r492o823j4244p443K508K3915
16706F0481o067j7076j0712J4090N284K2516L1129J5034l3313o014p199j0332
16694E7821O743J7254j231k625j3860J6334J8031N346m424k8130q157J7386j2394
16681F8094j6376n338J1085K593J1756N976k8326j5614J808K4904L832J4430j1646
16668F7178j7587K5933j486L712q026k3568k6473k4807L1274L2579K4580K2211
16656A05520J4588J7040O580J5369l5515j9174J0294o1678p3337l8459O3212K671
$$ y = [12140, 7900, 29372, 36394, 54102, 32849, 14683, -4390, 36600, 32197, 38432, 76946, 95316, 75338, 77230, 90369, 47569, 31104, 62394, 57248, 3723, 23221, 33004, 51403, 21844, -10106, -10996, -2877, -11424, -9812, 39315, 72060, 62568, 55745, 41501, 34058, 36566, 60481, 54414, 37338, 26626, 40716, 46000, 68516, 99645, 114679, 81366, 75352, 68153, 57821, 64564, 81818, 80587, 77962, 64102, 80436, 98467, 103813, 99389, 71259, 63102, 80488, 68094, 51718, 46380, 57465, 60058, 71814, 77790, 49464, 33850, 35658, 60562, 64394, 78824, 67178, 49591, 75524, 74038, 77750, 69724, 46156, 19683, -5124, 26150, 58729, 83309, 105520, 120108, 137148, 143728, 159097, 123582, 104408, 114702, 53024, -20313, -58772, 4440, 7111]
16644G111m1360N5540Q414N844M3898j6068l0543K39J1215L5625J3996k6809l1906
16631C5196L111J2220k6657m5107k9009O0096L6388J7986K3436R086l163m4961
16619D8622k3346j9151o405j8863O201N8955m6586m3349J5958K2998l5939J9644
16607b1261M159j5680k0602J1172M0843K7451K3120N6429J9799m792k6866k9621
16595F4151j5353k1167J1006M1996j2788k2861J642j6303k1539l9336L9727k073
16583G102r079L1920M2605N695j6884l1468j8940J362l446k7300j052J7641k3400
16570b5244k1655k0961K4429K2304N6356r573k8388r96j6507N070K7107J1843
16558B3785l1178L760k0547j5159j8439j9175r08L1615O6504J3584q886N515k6843
$$ y = [7111, -34249, 21291, 29705, 35549, 79447, 63379, 32836, 33075, 44290, 79915, 93911, 67102, 35196, 38307, 50527, 23870, -21237, -50246, 9850, 46238, 64224, 87660, 96746, 93583, 48622, 25276, 6125, -280, -19143, -12942, 46013, -573, -43922, -27964, -4966, -40905, -21261, -17102, -32782, -53384, -42212, -1369, 26082, 49202, 105631, 125430, 120638, 93772, 64151, 48798, 27631, 38637, 80633, 67845, 44984, 46626, 30323, 8784, -30552, 9175, 7102, -1977, 29943, 72548, 78243, 61359, 29891, 10951, 12313, 8867, -18433, -19485, -1844, -25244, -46899, -67860, -43431, -21127, 35229, 25656, -2732, -3728, -20235, -15165, 11942, 23785, -7393, -3633, -24180, -39339, -57778, -76953, -77861, -46246, 20258, 33842, 24956, 30471, 3628]
16545C628o4468k2261l2648M110L3832k4314K0726l196N2400N3412K8893L415
16533E3529m1166j776K5553J7225J3852j6361j0250p692k2122m1774k7816l0559
16521h9357J580m804K8974K7899K2658j3449J2398j657Q848K623L3233O4006K0746
16508A13698J9013q902n4115m2146L1237k0354J4537J6647R961m615K0102O5m7484
16495D7644j8399j8220o869L1280K58l9724P408L5273l3763k8634L8765K893p575
16482A0337N6852J3940m1712l0057J4077J3031k3864l778p137M397L52k9866j2337
16469c5765P037K1703j300l0600k2185K1322K5511J8881j3676k1602K1994j0759
16457a9439n7618o562L4715Q144J9343k5625L3235j0589L1167K7768q600k7357
$$ y = [3628, -60840, -83101, -115749, -111639, -77807, -102121, -81395, -84591, -32191, 21221, 50114, 53529, 12363, 10587, 36140, 53365, 67217, 50856, 40606, 32914, 10792, -30982, -58798, -89357, -87777, -92581, -63607, -35708, -13050, -26499, -14101, -15758, -6910, -4287, 28946, 92952, 113698, 132711, 123809, 69694, 27548, 58785, 38431, 52968, 69615, 79576, 74961, 95063, 95128, 47644, 29245, 11025, 4156, 35436, 35694, -4030, 3378, 38651, 4888, -23746, 15019, 17912, 10337, 67189, 81129, 39417, 9360, 23437, 36468, 12604, 8826, 1689, 6086, 6438, -23428, -35765, -28728, -7025, -8325, -38925, -61110, -39788, -14277, 4604, -9072, -30674, -8680, -19439, -77057, -83619, -48904, -40760, -21417, -47042, -13807, -24396, 6771, 34539, 25939, -1418]
16445a418P979J4510j2336K5656L0701N853l2134q714k0828L141L2377l7259k2343
16432a4815l910j323n829K0342l6259j4041N1814M1619L431o592l07R190k0583
16419B2737r274k8083j7214M0442M8764l2868l1360o696J3968J36l248m2184M9957
16406E077J6004n174k3892j422L8205L501k5897j7333J4583M5765M1785j856k8985
16393F0361K0524J9066o0436o3970L713j785k9253j4375M019K2898J7784N369
16381a6085n534R383j0819K7545K3277j6881q221j1540Q58K1375N615k3236j7069
16368b1332o551K4255J5246q10J266O783j710l741L504l958k6522K7873K3975
16355C8278J6102k4877m9666J504M2830j1284o3940M089L7670L1710L3180q285
$$ y = [-1418, 6561, 21071, 8735, 34391, 65092, 70945, 38811, 30097, 9269, 12410, 44787, 7528, -14815, -18725, -20048, -25877, -5535, -41794, -55835, -4021, 37598, 41029, 34437, 34130, 43320, 22737, 13463, -14620, -31834, 8608, 57372, 24504, -6856, -13552, 416, 552, -2696, -44880, 5077, 21081, 15907, -7985, -9407, 28798, 32299, 6402, -10931, 3652, 49417, 91202, 89346, 60361, 80885, 99951, 39515, -24455, -20742, -22527, -51780, -66155, -62136, -39238, -21454, -16085, -21619, -12236, -23055, 4490, 27767, 10886, 2665, -8875, -8017, 13358, 18973, -4263, -21332, -27883, -3628, 11618, 10808, 12074, 18857, 17147, 13406, 16910, 12952, -13570, 14303, 38278, 54380, 29503, -20163, -18659, 24171, 12887, -51053, -46964, -9294, 22416, 55596, 47311]
16343D7311n0901r929k9714L514M5533M636j0512j4924J7953k0516k5313p35J1782
16330c1815k9746k7075J1819K8150N3203M5083R569n0508k632J6658K4947J1964
16318E9617l5837j3292m5592l1981L3749K7445l7675P128K945j7554K5052L3890
16306G895m529K9550K3188j9983o824J9144K3718l9387l5223K5351J5155p147
16294C0908J0183p134j7519N270J3117j6827k0248j4607J9719L3914l5977N474
16282F273p401K6928j525j4054l84l4609P827K6286j2967p780k3245J8844j2544
16269b8351j4182l956r562n860J1586L8304n808j2415L4046J1771n034j3374J9237
16256A6402m9926m7835j0612p828K9055J4395K3994j9672O002K3305J6663M187
$$ y = [47311, -3590, -13519, -43233, -39719, 5814, 10450, -62, -14986, 2967, -17549, -42862, -43597, -31815, -61561, -88636, -76817, -48667, 4536, 49619, 59188, 8680, 6048, 22706, 47653, 59617, 23780, 10488, -35104, -67085, -33336, -5891, -43566, -36438, -33493, -51047, -25995, 7895, 3366, 32916, 56104, 36121, 29297, 48441, 72159, 32772, -2451, 22900, 38055, 30908, 41091, 33957, 16438, 21708, 34825, 17998, -2250, -16857, 2862, 36776, 799, 6273, -1128, 25800, 24275, 10221, 9837, -24772, -16945, 9341, -3626, -11406, -34651, -15807, -28351, -42533, -46489, -56051, -61911, -50325, -12021, -17829, -30244, 3802, 15573, 10539, -2835, 16402, -33524, -81359, -91971, -99799, -70744, -56349, -32355, -52027, -46025, -22720, -6057, -1870]
16244a870L6172L6038m5883k7232j8753j2316p336r882L0322O0510J908j4500
16232B7178k1359j4140m1518j2154M1850M3162L2387j9805l0244J1717L9870j1184
16220D5760l2427K0843L975l9450k5253K8681j5812j5215L6871M4391M1923k9276
16208F5011n3528k5175J0155J6864p20J4445K5520J5935m0192l1886o577J4820
16196D672R349k2055L696L552l0403k5576J2999L7159m1733m649N0527K676r899
16183i685K3567K0415l2141l551j558j6845r877j8901R342K6770J7177K0903j453
16170B4163J2113P211K106j6171j5423k9273l36M864j4861q043P650L3972R528
16157A7500k8109J2343n361m0360k7353j7495J811j3169M0074P8718J2356l3111
$$ y = [-1870, 34302, 70340, 24457, -2775, -21528, -33844, -41180, -51062, -20740, 39770, 41678, 27178, 5819, -8321, -49839, -61993, -20143, 23019, 55406, 35601, 5357, 17074, 56944, 45760, 13333, 34176, 38151, -1299, -26552, 2129, -13683, -28898, 7973, 52364, 94287, 65011, 11483, -13692, -3537, 13327, 12607, 27052, 52572, 68507, 28315, -3571, -10148, 4672, 14021, -8034, -4338, -786, -31189, -56765, -43766, -6607, -48340, -52989, -2462, 214, -9685, 13882, 34297, 2156, -1395, -2953, -19798, -29675, -48576, -39234, -12464, 4713, 25616, 24163, 36276, 43487, 45593, 29422, 13999, -15274, -15610, -10746, -25607, -33650, -26000, 7972, 17500, -10609, 1734, -3627, -43987, -71340, -88835, -87024, -100193, -60119, 18599, 30955, -2156]
16145b156j7588l2159L1768k5100l2936M6145O3206l8443j98K5796J5931k382
16133C1884l9696O035J0200m0887J735O5744M1883o9994o4020l3508O460N9585
16121b4579k4311O019J467k8844L376R460K619P664k1596O88k0350J3220J1939
16108f3228m061J0878K2094K2316l744K0551l199o560J2037K1263l0542K1804
16096A9609J0779r822P791J8654j7816n6131J0474L9733K1058O265l8060o989
16084E545k9451n026q369N179L8337j4510k4403j2404J305K6155K0961K6486j9611
16071A0194m7329j8866O482K2396L9403M42k108j4865J2155M237n571l1482p208
16058c2120r8j0787m891K530j8861n161P038J3557K5428l4062K0808P1569N6398
$$ y = [-2156, -19744, -51903, -20135, -45235, -78171, -32026, 31180, -7263, -7461, 18335, 34266, 31884, -7812, -1777, 8423, -32464, -30729, 35015, 76898, 6904, -57116, -90624, -84164, -24579, -48890, -42871, -41404, -70248, -66872, -57412, -54793, -47129, -68725, -68037, -88387, -75167, -63228, -67289, -56411, -34317, -12001, -15745, 4806, 1607, -4953, 7084, 28347, -2195, 19609, 30388, 20566, 28357, 47011, 29195, -26936, -16462, 23271, 44329, 50594, 12534, 5545, -23906, -28932, -37301, -32122, 6215, -8295, -32698, -45102, -43797, -17642, 3319, 29805, 10194, -37135, -56001, -49519, -27123, 12280, 12722, 10614, -4251, 7904, 12141, 6570, -24912, -32120, -32218, -43005, -47896, -45366, -64227, -69388, -62350, -48793, -23365, -57427, -36619, 34950, 91348]
16045I1348K1465n9587l7649n688j1178K8768J5485m2402k5094J1109p850l8289
16033e9562k2722Q607P9108J9248k1150n5456j646K2279L1385N3588k986k4086
16021B6607p212j4446j20O0110L901p7716l7061L8007N4763N051n9348j7584N503
16008a9545J9325K7844Q246j9312m2461m2066J4461Q969j458P109M5605L3044
15996C9761j5708k253N653L8306K6588o0043l500r469m3827k6179K4286j4397
15984d0782P925K5255N1421j856l4040n2567Q090N1825L27j6203k8086J9424K3917
15971A4650K1482K182k2438j9335k210j060j4454m1263k227L1593L8491L10K1704
15958B7425k5239o272j4589j3867N83k370L4321M1181l544m0989J7078N612Q84
$$ y = [91348, 112813, 53226, 15577, 9889, -1289, 27479, 42964, 562, -24532, -13423, -21273, -59562, -82284, -73677, 5431, 24679, 3529, -51927, -53573, -31294, 91, 53679, 50693, 26607, 19395, 4949, 4829, 64939, 68840, -8876, -45937, -7930, 46833, 51884, -7464, -25048, -19545, -220, 27624, 35870, 16558, -25903, -67969, -53508, -44539, -45997, -38888, 6717, 39761, 24053, 21800, 27453, 65759, 92347, 32304, 28804, 19335, -24492, -50671, -26385, -40782, -32857, -7602, 43819, 41963, 7923, -44644, -36554, 15271, 15598, -605, -28691, -9267, 14650, 36132, 38314, 15876, -3459, -5669, -6729, -21183, -62446, -64673, -33080, 5411, 5721, 27425, 2186, -4086, -18675, -32542, -31959, -34329, -8, 41173, 37629, -3360, 13718, 19330, 20214]
15945B0214K7452l4565l7925J0495M2420K5405J2558l2952j7042J9939j0318l7247
15933a1566K163M3792J2527l9476j0111K2388K193m7635j7771J3279M2649K0407
15921C2839j0884p518m766k3938k9922J2600Q321K1428j3619j5038J4110m696
15909b1083j8729K721K8631N0863k6668l0786k8126Q037j3620L4347j7004j9176
15897e0593J8759j1285k0221M8427N1223l5943j4244K1736k1158M8580L1075j6096
15885E0260j098m0482k1227p188J9923J5834O4149N631k767Q329k2795J4j2983
15872E5600r809k7296k7651l4365M2067k9248j7650j4198K2541M1522K1910j7188
15860F235J485L0236j9998l1631J719J0670q703M2551P800k2431o595k6290l2714
$$ y = [20214, 47666, 13101, -24824, -14329, 28091, 53496, 66054, 33102, 16060, 35999, 25681, -11566, -9403, 34389, 46916, 7440, -2671, 19717, 21910, -25725, -43496, -30217, 12432, 32839, 21955, 14437, 9671, -14267, -44189, -31589, -23268, -1840, -15459, -30497, -16387, -21083, -39812, -37091, -8460, 42403, 15735, -15051, -43177, -35140, -48760, -14413, -31417, -50593, -31834, -43119, -63340, -14913, 36310, 367, -13877, 7859, -13299, 35281, 66356, 50260, 49162, 8680, -12547, -19735, 188, 16022, 80171, 85802, 83035, 91364, 68569, 68583, 55600, 45791, 18495, -9156, -43521, -1454, -30702, -48352, -62550, -40009, 1513, 23423, 6235, 7720, 37956, 17958, -13673, -11954, -1284, -9987, 32564, 40364, 17933, 11338, -14952, -47666]
15847d7666O536K585k3553R509L3548L8175R185K972k4880J0044Q553J1970p734
15834B9244K0051k6399j7482j730L536m606j6894n803K228J3510J3049l4516q293
15821c4105j2725M160N6344L170k5070J0975k8580r680j5000o838N176k6172K4031
15808e4314M7824Q978J8998L3389j7076P32J914k5497n342k169j1627K671N2171
15795E0652k5700o0582k8804J9249L0200K3533J3425n11L245n994m9252K283m0579
15782f8835j656K4056K2923L8228j282p2658l9911j9259P232J4072o392l49N7526
15769d6305K5941k7777L9888M1851J0205K0306R262l4571n6551k891J4057j8491
15757b5076M209K3190J2820k409K1249N820j2766M350o926k6364l5393l4428j6513
$$ y = [-47666, -41130, -38545, -62098, -52589, -19041, 19134, 28319, 31291, 6411, 16455, 25008, 36978, 29244, 49295, 22896, 5414, 3684, 7220, 2614, -14280, -20083, -17855, -4345, 8704, -25812, -34105, -46830, -42670, 13674, 16844, -8226, 2749, -25831, -35511, -50511, -57349, -52173, -78345, -54314, -6490, 2488, 21486, 54875, 37799, 38531, 40445, 14948, 9606, 7437, -4190, -1519, 50652, 24952, -35630, -64434, -45185, -14985, 8548, 21973, 21462, 24707, 18713, -30539, -28256, -68835, -70491, -46435, -23512, 14716, 13434, -59224, -99135, -118394, -111162, -97090, -103482, -103831, -46305, -20364, -48141, -8253, 33598, 43803, 64109, 73371, 38800, -17751, -20642, -6585, -25076, -20867, 2323, 15143, 12734, 33983, 39803, 27037, 31387, 24461, -1903, -37296, -71724, -88237]
15744h8237n572J5724M5400N321k7700l0996O6996M2652J909k8961k8590K962
15732b9092K0021N8056L2313N850m9007p851K7386Q165l1897q234L524j2288l1897
15719a4951K562j9285m9315j4298M8889J7320M506L1737M5190J1636m573n046
15707E4372k2424l2137J1628p872j4081k9075l7877R094N8225j933J6911K4775
15695B9606N596R342l3619l8173j6241L1709q331K3062q936K1824J8717l9218
15683d662j0137N251J18r190r875M8336M7495k4250k4666N834J6744m4846o8534
15670g2382O19M7701R341K1614N187k845j0378j6961o920l9625j2267N934L9977
15657c1005K7235l2297K3355j3863j2903Q096N504Q421N686j0780j7340n674P168
$$ y = [-88237, -93809, -78085, -32685, -27364, -55064, -86060, -19064, 23588, 25497, -3464, -32054, -29092, -9071, 48985, 81298, 87148, 38141, 30290, 57676, 65841, 33944, 25710, 29234, 16946, -14951, -12389, -31674, -80989, -95287, -46398, -29078, -24572, 7165, 52355, 63991, 59418, 54372, 31948, -189, 11439, 3567, -10514, -39589, -77466, -68372, -10147, -12080, 4831, 29606, 35202, 44544, 10925, -27248, -43489, -11780, -20111, 2951, -5985, 15839, 34556, -4662, -14799, -9548, -9430, -18620, -28495, 19841, 67336, 43086, 18420, 24254, 40998, -3848, -72382, -71763, -24062, -14721, 6893, 12080, 9235, -1143, -18104, -25024, -64649, -76916, -70982, -31005, -3770, -36067, -12712, -26575, -39478, -31382, -25878, -17457, -11771, -22551, -39891, -45565, -38397]
15644c8397J6408l2374k722M5906L0493L829J343j8755p996m144K8653j5237P182
15631A4189L5588j5809j2846j7946K0829N30l9930M320N5451O9212K770n8816
15619E7542n2706n744m6856j0584Q762j2593L8533K3012L3958P491J0463k643
15607D8635N676l0279o5035k29l804j2907L7515L2008j4075k761N9654k5229l5465
15594f296l2848K5885M4978K93k0540j3267R395J7142Q46K0058j5923j2968m472
15581A2283m64n7458j2660m928R883L3032K5413M794j5799J2886J1211m1350k4764
15568d7921R921k3988M389j1558J2929L3866J540n605N0108j6272j6277k9202
15556c8070L5257J0900N806k022J6307O346n5517k7943L8741L0259l079k0746
$$ y = [-38397, -21989, -54363, -57085, -11179, 19314, 23143, 24486, 5731, -2265, -6409, 22244, 7007, 14189, 49777, 33968, 21122, 3176, 24005, 24535, -15395, -11075, 44376, 113588, 116358, 57542, 4836, -908, -47764, -58348, -49586, -62179, -23646, -634, 33324, 40815, 51278, 48635, 54311, 24032, -41003, -41232, -45036, -57943, -20428, 11580, -2495, -5256, 54398, 29169, -6296, -39144, -13259, 31719, 32012, 11472, -1795, 7600, 24742, 25588, 45646, 29723, 16755, 12283, 11819, -45639, -58299, -63227, -53344, -20312, 5101, 9895, -5904, 6982, 18193, -23157, -47921, -38000, -61988, -57599, -69157, -56228, -22362, -20822, -26427, 23681, 7409, -8868, -38070, -2813, 8087, 13893, 11871, 28178, 34524, -20993, -48936, -10195, 20064, 16985, -3761]
15544c761Q778J4607m980m9503j3945k0429J6900K6611j7699M225J3540J4825
15532a0831r889j5287K4180J9266j1562R389K4252q710k5778j0562K6934M099
15520A5501K3696K6478J5748m4837j6863K0054Q227k4345m2677j945J770J7974
15508a219k4369k169O288L9802l811n074m5482K913L4811N0393J9907l1304l7274
15495C412j011n85q800K9250r01j163j2130Q602L1505J6123L084M996m2201m3878
15481a3697q971l5795r551K7241p524j5845M6547L6519M9986J6205j8874k5055
15469D1186r168K1084L893j2965l2153R680M511o011M287m0344k0216K9465M0045
15456C3294J48K3573L7936m886o3119n430L6170m0393n1138J0304l449J0505j5047
$$ y = [-3761, 5017, 19624, 14644, -34859, -48804, -69233, -52333, -25722, -43421, -39196, -25656, -10831, -20720, -36007, -11827, 7439, -4123, 5266, 29518, 20808, -4970, -15532, 11402, 15501, 39197, 65675, 81423, 36586, 19723, 39777, 48004, 23659, -19018, -20963, -19193, -1219, -25588, -27757, -21469, 18333, 14522, 9448, -36034, -33121, 1690, 52083, 71990, 40686, 3412, 2401, 1816, -6984, 22266, 21365, 20202, 8072, 16674, 48179, 64302, 67386, 72382, 30181, -13697, -22668, -58463, -68014, -40773, -48297, -64142, -17595, 18924, 68910, 85115, 66241, 41186, 32018, 53102, 56995, 44030, 11877, 21557, 26068, 20057, 24344, -16000, -36216, -6751, 33294, 33442, 57015, 94951, 90065, 26946, 21516, 57686, 17293, -33845, -23541, -26990, -16485, -31532]
15443c1532k5524M6636o326J4890k1829k2414K5443m0872L634K1467K1877J7517
15431B967K834j0385m370k0976j3338N441N0582q720o304m252J9370N9273k8333
15418D3789q3298n205l861N252M4923L2666r321l2014j0107L123J4943J4610l122
15405A2378P237J3903k1967R905M7165m587n1411n2545j2912J7995R091K5234
15393e14k5384l6608j2737P612K4719o991q238J6333j9081N78K490P877J0374
15380c9570O201J6215K635j5072n9334j6513M2524M2996M3936k875O108j9896
15368G355j7846L4014Q637k970N8288J5756l8470k3226l1676p465j4298P409R663
15355E171k0035J6037O1283j0385k6209m6986k2385K7322J9327j7768m1042m684
$$ y = [-31532, -57056, -10420, -16746, -1856, -23685, -46099, -20656, -61528, -57894, -36427, -14550, 2967, 5801, -4584, -8954, -29930, -43268, -37827, 12755, 4035, -2269, -6521, 12849, 72122, 43789, -39509, -44714, -48575, -43323, 1600, 34266, 24945, -7069, -17176, -14053, 890, 15500, 12378, 19615, 33518, 11551, 21456, 68621, 64034, 12623, -39922, -52834, -34839, -25748, -514, -25898, -62506, -75243, -67631, -42912, -49903, -58141, -41808, -60889, -60311, -57821, -49944, -39570, -33369, -17154, -14519, -29591, -88925, -105438, -62914, -19918, 24018, 21143, 27251, 7355, -10491, 23523, 32160, 29190, 87478, 103234, 64764, 41538, 9862, 2397, -11901, -4492, 5171, -14864, 1173, 62456, 52071, 25862, -21124, -43509, -16187, 3140, -14628, -55670, -60354]
15343f0354o867K0766j7165J0787O1788J9160k4336k5910L777m308j5361m0315
15331g8338q651k199L3489M545n90K3237k462J2137J9716p900O433n773k7589
15318c3945p759L2960n13j3612m2905N948K2157k8637j0508J0763j1585K88J3065
15305f4283K8700j1792J8901N9676M9583J6978n1974j1002q80k6347J299l0363
15293b1504j1770O600M7147L6311l8865N816K2735j3387k5608k4098L1719O6789
15281H1885k1677p359L43l048n1398l3859k4381K8177K2393K9279J6972k3188
15269A4139k0463L3902j4790N5135L4645n2161k2525O671j4587j5198l4441j1064
15257d0737K574L545P428K3283P900K0540J3535n706p996k7380j7963q244J9516
$$ y = [-60354, -67221, -46455, -63620, -52833, 8955, 28115, 3779, -22131, -18354, -22662, -38023, -78338, -86989, -89188, -55699, -51154, -51744, -28507, -30969, -18832, 884, -7016, -583, -6356, -33945, -41704, -8744, -9257, -22869, -65774, -59826, -37669, -66306, -76814, -66051, -77636, -77348, -64283, -35583, -47375, -28474, 31202, 80785, 97763, 45789, 34787, 33907, 7560, 8859, -21504, -33274, -26674, 20473, 56784, 17919, 23735, 46470, 33083, 7475, -16623, 15096, 81885, 60208, 52849, 53192, 50144, -1254, -35113, -59494, -31317, -8924, 20355, 37327, 14139, -6324, 27578, 12788, 67923, 102568, 50407, 27882, 34553, 19966, 4768, -29673, -40737, -38163, -34618, -27190, -3907, 3993, 24533, 38068, 32362, 24366, -3014, -20977, -29221, -9705]
15244i705k1391Q88K4296N150m346k5802l9357n450J1544O474L0420j9360l1247
15231g7886Q502K3086k2489k5112r574L0491j2902K8428M7230Q276j1830K1194
15219G414j849l8582L078K4076N487j0779j6247K8271Q854J9949K4459k5439m4713
15206a6021l8138r388L8115j4954l9722J3326J8979L3604L0232K5139p633L514
15194C7053J2736J8614k0025Q309o009r21J6207m6663l8198j7359K484M6508n281
15181G455j6183L9246M7464J5229l1566q4290l1560N162N7617j9519k5978K7520
15169i403O458j582Q510K899j2029k7571M7963J1335k7213j7085j1632L0409m9647
15156d8588l5432L5036K1181L7533Q715N820J0465k5760l7966q962k7789K5300
$$ y = [-9705, -31096, -30208, -5912, -762, -5108, -30910, -70267, -75717, -64173, -57699, -27279, -46639, -77886, -69384, -46298, -68787, -93899, -103473, -72982, -85884, -57456, -10226, -1950, -13780, 7414, 5565, -33017, -29939, -5863, -376, -11155, -27402, 869, 9723, 29672, 54131, 28692, -16021, -54159, -63547, -25432, -40386, -80108, -66782, -47803, -14199, 16033, 41172, 33539, 37053, 49789, 68403, 48378, 56687, 50678, 49757, 65964, 19301, -18897, -36256, -33772, 12736, 7455, -8728, 30518, 77982, 93211, 61645, -22645, -54205, -49043, 8574, -10945, -36923, -9403, -2945, -4527, 3983, 6882, -5147, -32718, 15245, 26580, -633, -17718, -29350, 1059, -48588, -84020, -48984, -27803, 9730, 18445, 24265, 34730, 8970, -28996, -37958, -65747, -40447]
15144d0447M1097L9622K2822m632m8563k1402R09q413M7652N3472K4127k0603
15132H5641q48m8127k6737J1917K1832j996j4535q096j0017O442j8781j2698p401
15119b3404J7071L1248J6261J1207R620m0521l9998l3176p073P40P980L6692K0190
15106F837K6345k0981m5326N759K7436k534l8039j543K1500l4856p982K5294n379
15093d3469J4148J3800J414j8701p80J1034M591N114k1309l9492K0841O044K5827
15080b0938K2279L9122r109k7384l5989l1579M3230K2971K8019k3711j2956j4972
15068b1017l2055r478L4206Q955L052r165r325k5351J5905J2241J5515r995k2469
15055d8981J1716J0749j5403J561L0344k2796K8748L5598j0608n7327k9646p131
$$ y = [-40447, 650, 40272, 63094, 58462, 9899, -11503, -10594, -19007, 28645, 82117, 106244, 85641, 84793, 36666, 9929, 21846, 43678, 41682, 27147, 19051, 9034, 15476, -3305, -16003, -23404, -6333, 24915, 41176, 52383, 62003, 21482, -18516, -51692, -58765, -58025, -50045, -13353, 6837, 33182, 12201, -33125, -27366, 70, -2464, -40503, -42046, -20546, -55402, -63384, -38090, -43469, -29321, -15521, -14107, -32808, -33588, -22554, -17963, -12849, -34158, -73650, -52809, -46765, -20938, 1341, 40463, 31354, 3970, -32019, -63598, -20368, 2603, 30622, 6911, -6045, -21017, -53072, -62550, -28344, -19389, -16337, -25502, -34827, -60178, -44273, -32032, -16517, -26512, -48981, -37265, -26516, -41919, -40358, -10014, -32810, -4062, 31536, 20928, -36399, -66045, -73176]
15043g3176K9777L8376O5607r617l2918k1987l0193K1479q310J1389J1869p30
15031A566K6075r864l3271l5766l0670J3464J4929L1305N7605k2232j7816J4128
15019I453K5563J9411p566j5748J1967k614Q09p489o43j4600l5125j1853K9636
15006A201l8149J1856j7993l8382L5328J2726M5279K5593j2848n4607o1859K9891
14994f1964Q225k0448L0123R860M977l1103N4853q954j7081L2862j2621K3083
14982A1812K3685L831k1161o6917o416j1580L8272k3300l3099k8791L7025l5592
14970a12231J9209L4098j8057J4722O0915K5354j839n3991k1158O327L2814J6307
14958B470q284q664p371j449L6046K005L680L784m5199K733K3875J8512J9065
$$ y = [-73176, -43399, -5023, 60584, 50967, 18049, -3938, -34131, -12652, -20962, -9573, 2296, 1566, 27641, 17777, -15494, -51260, -81930, -68466, -53537, -22232, 35373, 13141, -4675, 9453, 35016, 54427, 46861, 31113, 43080, 40466, 41275, 33786, 33143, 18543, -16582, -28435, 1201, -36948, -25092, -43085, -81467, -46139, -33413, 11866, 37459, 24611, -29996, -91855, -61964, -53739, -74187, -44064, -34204, -29227, -60330, -5477, -14431, -31512, 1350, -11271, 11812, 35497, 39328, 18167, -48750, -55166, -66746, -28474, -51774, -84873, -113664, -76639, -112231, -93022, -58924, -76981, -62259, -1344, 24010, 22171, -31820, -52978, -46651, -13837, 2470, -5814, -14478, -21849, -23298, 12748, 14753, 18433, 22217, -22982, -20249, 3626, 22138, 41203]
14945D1203n7338k2343K7383p413k841P306J0308K3410L9004J8690j9888o2569
14933e088J2862J143j4182n1711J3400M9938J9876k1995o986M186P09l8879K230
14920c4497J4192j4515J8914j0001j303K2929o157L3346O092N155L8354k4505
14908D8004m9710n4992l907j4660K5185q343m829J5180N655j4230j6649M9196
14896b4100N5470L9606r691m3611j2108j2478m098k1581j969k005o081K6612p145
14883b3179R545j2929k0634N2279K1467j7710r744j7292l4392j7406j4623l619
14871h8237m0922Q945L2593L3429o454J0446Q018K1128O5916J0257n4998n8935
14859e8814M107L7905l180j7261J6079O1226l249o906n30l18k1420j7180o7413
$$ y = [41203, -16135, -38478, -11095, -18508, -21349, -14043, -3735, 19675, 58679, 77369, 57481, -5088, 7774, 8917, -5265, -56976, -43576, 6362, 26238, 4243, -2743, 1443, 2152, -36727, -34497, -20305, -34820, -15906, -25907, -27210, -4281, -10438, 22908, 29000, 34155, 72509, 48004, -1706, -56698, -60605, -75265, -50080, -58423, -63252, -48072, -42417, -56647, -73296, -24100, 31370, 70976, 61285, 17674, 5566, -6912, -11010, -32591, -34560, -36565, -42646, -16034, -23179, -13634, -26563, -47197, 5082, 26549, 8839, -905, -18197, -52589, -69995, -84618, -88237, -129159, -120214, -87621, -54192, -60646, -50200, -42182, -21054, 44862, 55119, 121, -58814, -54707, -16802, -19982, -37243, -21164, 40062, 36813, 29907, 29377, 29059, 7639, -9541, -76954]
14846g6954N110M2733j3204j7666L2159N6158L849m5657M147k6259K2941l40L929
14833i054P71l969j2529Q52n364K0238K2858J5927j7217l319K7449l1588k1276
14820a6221j176j1642P630j4812l5463L2290K1386q11J6708L5010K1405m2384
14808A1920j2553q511n678K6927l7279J2321j0988O528j9316L8485L3722q635
14796B6943j2841k3502L8416j6920m9630k120j5483p648K3118K0197o84Q796J1875
14783E17K0992m256j3596m1308l5330j3182J6844L1230j2978k7336L8241J0058
14771c0104M266K5759j9936r827k6333R58O197j1338m739M603j796K8931L6186
14758B827r821k5503k2183K1838m92j4480K1430L620k109l171o393K9544J3704
$$ y = [-76954, -71844, -29111, -42315, -59981, -27822, 28336, 32185, -13472, -9325, -35584, -12643, -12983, -9054, -8283, -12252, -24781, -23929, -29293, -9055, 13803, 29730, 12513, 9194, 36643, 5055, -16221, -17397, -29039, -21409, -36221, -71684, -39394, -18008, -18819, -2111, 32899, 54304, 11920, -633, -9144, -14822, 12105, -25174, -12853, -23841, -17313, -36629, 1856, 35578, 26943, 14102, -9400, 29016, 12096, -37534, -39654, -55137, -62785, -39667, -19470, -20154, -11358, 517, 21509, 17253, 3657, -37651, -72981, -86163, -69319, -38089, -51067, -78403, -40162, -30104, -25838, -79, -20015, -29842, -56175, -55217, -49020, -60358, -65097, -60494, -62290, -33359, 2827, -6994, -32497, -54680, -32842, -33334, -47814, -26384, -22764, -24873, -28044, -34437, -4893, 8811]
14745H811j1101m4881Q601j5898O9876q853p0956R755P717M329J9810j4906m861
14732d2557M909l256O698k697q434l3767j2141M285J8155o793J0860K1957K1595
14719b1186k2136J5373J9937K0799j846n6077m3236N4548L0533j4298L433j0847
14707b5003k5651p089k2794m239K8222K0366Q411J4167k304m559M6710j4809o609
14694D819K986N905m9209l7566M424J7776O720Q284K0346j5167k8701L4412K1410
14681c561k0658l8527p477J1794K0132j7873k9079J8260L6981j8375J4232j6465
14669e0616l2328j2805L1162L7745n125L552k4475n8522r395L5495J4814j9701
14657i0199J8244K8250J1403K706J1973k4748N431J0345K5125l3225j9068o326
$$ y = [8811, -2290, -47171, -38570, -54468, 15408, 6555, -64401, -54646, -46929, -42600, -22790, -37696, -42557, -37648, -40904, -34206, -36903, -45337, -79104, -91245, -86960, -68805, -75598, -64738, -42781, -21186, -43322, -27949, -8012, 12787, 10941, -45136, -88372, -33824, -3291, -17589, -14156, -25003, -50654, -57743, -80537, -84776, -56554, -36188, -27777, -13610, -15914, -20473, 26237, 11428, 4819, 7805, 13710, -35499, -73065, -68641, -50865, -44145, -35861, -15515, -30682, -59383, -24971, -3561, -24219, -62746, -70223, -58429, -38297, -56170, -85249, -66989, -30008, -48383, -34151, -50616, -82944, -95749, -64587, -26842, -31967, -28415, -52890, -111412, -120807, -85312, -70498, -90199, -71955, -43705, -32302, -29596, -17623, -42371, -36940, -26595, -1470, -34695, -53763, -60089]
14645f0089k0095M1769M510j203J2854m2941l0197K7571l846J0842J2146j815
14633e0494K9656J2547J6139m279k479J2458m6538K2122r995J8662J5289K0669
14621C3757j2182l9115M6797k3693n922J2804N1530P330m5356q873J2669j0776
14609A8970P524k384K845J7415j113k8926o1296j4833L5780N9191l2297l0828
14597b9952k1178J3296n445J8170K6M0064j0457k069k0841j904L1077J9106N302
14584C5195m7336q0978K253J7375M7214J9108K0213J0378n4122M955n393R418
14572b1720J3028L704o1255L067K0493M742O1620M860m2760l1237L63K2118J0056
14559a2921K7885l5733M379P106j4078R289J9203J660r566Q034L0618L5073j1965
$$ y = [-60089, -80184, -38415, -33905, -35108, -22254, -65195, -95392, -67821, -71667, -60825, -48679, -50494, -20838, -8291, 7848, 3569, 1090, 13548, -32990, -10868, -20863, -2201, 13088, 33757, 21575, -17540, 29257, 5564, -358, 12446, 63976, 71306, 25950, 17077, 29746, 18970, 26494, 24110, 26955, 44370, 43257, 14331, -46965, -61798, -26018, 33173, 876, -29952, -51130, -37834, -43279, -25109, -25083, 14981, 4524, 2455, -18386, -20290, 10787, 29893, 35195, -12141, -93119, -90866, -73491, -26277, -7169, 13044, 23422, -30700, -25745, -31138, -21720, -8692, -4988, -66243, -63176, -42683, -37941, 23679, 28539, -14221, -45458, -45095, -22977, -12921, 14964, -20769, -16390, -9284, -23362, -14073, 5130, 6790, -2776, 5258, 35876, 70949, 58984]
14546E8984k3802j0307N1650k8683n7876j3673N420J7591K0665j8784j9277Q729
14534i363K499j0190q334j4584n4172J57N6105L8034L6986J6600r763k0956M523
14521B7542m3815N3680k1196n4074k9180K2104L7157M9630J794R400k0721l00
14509C2021m755p90k3198Q818l1266p1728N440L6112M8683L4907m801m0653K6990
14496A5780J9312K2876j4220l6122r069J5799j8530L597j6414J6223k3259j2970
14484c6997j1207J5682M3926J6364m179k318j7607l989J313K3058p8660l4181
14472h8795L7095J867j6604M921Q992j4671L1304J0625J1930K6169J4705n324
14460B2214M5071L1749j568l9141o1927k5354n996l5838J2158O5270J3831m4605
$$ y = [58984, 35182, 24875, 76525, 47842, -10034, -23707, -18287, -696, 19969, 1185, -18092, -9363, -6864, -17054, -25388, -39972, -94144, -93987, -37882, 152, 37138, 53738, 43975, 23019, 27542, -16273, 37407, 16211, -37863, -67043, -44939, -7782, 41848, 43642, 53042, 32321, 32021, 27266, 26476, 3278, 12096, -19170, -90898, -85458, -49346, -663, 34244, 29443, -11210, 15780, 35092, 57968, 43748, 7626, -1443, 14356, -4174, -577, -16991, -768, -24027, -36997, -48204, -32522, 11404, 27768, 23589, 21271, 3664, -325, 988, 24046, -54614, -88795, -51700, -49833, -66437, -61516, -52524, -67195, -35891, -25266, -13336, 12833, 27538, 22214, 67285, 99034, 97466, 58325, -3602, -28956, -34952, -70790, -58632, 6638, 20469, -24136]
14448b4136n204J4611J2918N065l4440l0930O4924N8098J8712k9116r295k1639
14436A9568Q03j030p72j7984j4032k9539K8058J4100J293q799P516M4427O564
14423E0173j3198p324l7425k3184l0786k160j8965J8000K5457J1750o304j62j1682
14410d5810K5924j5262n5000r730N2988M4372n168k1662k1485k1166L9015j8863
14398e1847J134M4980l6840k6787k095N874P259j4103k6965j9795L8212K1644
14386e9329L2001J3151J0116L4593l288J8564n402l7546k1658j0185J9189q868
14374a8662K1892M270l957o528l88K4842k6423l8350J2459L2650J469l4765j0619
14361d2110K3074L8780K897l8408J7154N281l0500l4447l94r525O295M5476K4080
$$ y = [-24136, -29340, -14729, -1811, 3254, -31186, -62116, 2808, 60906, 79618, 50502, 41207, 19568, 20371, 19341, 18569, 585, -13447, -42986, -14928, -828, 465, -8334, -818, 43609, 50173, 36975, 29651, -7774, -30958, -61744, -63904, -82869, -64869, -39412, -27662, -33966, -34128, -45810, -19886, -35148, -90148, -99878, -46890, -2518, -7686, -29348, -50833, -71999, -32984, -51847, -50713, -5733, -42573, -69360, -71455, -65581, -58322, -72425, -99390, -119185, -80973, -59329, -27328, -14177, -4061, 30532, 27244, 45808, 40406, 2860, -18798, -28983, -9794, -18662, 3230, 7500, 3543, -2985, -3373, 21469, -4954, -43304, -30845, 1805, 3274, -31491, -42110, -19036, 19744, 22641, -15767, 1387, 6668, -23832, -58279, -58673, -68198, -61903, -16427, 7653]
14348G653k7129j8361K9986j937l6781m838N2872j4280l4560j0278O031N2061
14336D39J1521n7100k2511o968K9744K6161L996l0246l7183J2100M9053k6074
14324d7068J5872K1823K4535j1060J0195j0675j1915L234l2147k8140j7625K4164
14312e8807K710m370j5273l4099k5528O6179L4198J1850J2210n045M240J9064
14300G329L1154m3820k0924k1438j168M407k0401L1028L0840r684j0787M157l615
14287b2922K5120Q284k1135r498K9207L0396l5992k3650R907N980j426O41l5748
14274d0836m9169j3516K5204K0627j4815l0800N0501N1302J0329k4847n7888J3939
14262e9969K5494N216j7134O775M0400j401o823J8599j6359J9945L1414j255l1433
$$ y = [7653, -19476, -37837, -7851, -9788, -46569, -51407, 1465, -12815, -47375, -57653, -51622, 439, 11960, -45140, -67651, -74619, -44875, -18714, -14718, -44964, -82147, -70047, -20994, -47068, -31196, -9373, 15162, 4102, 14297, 3622, -8293, -5059, -37206, -65346, -82971, -58807, -56097, -60467, -75740, -109839, -135367, -69188, -34990, -23140, -10930, -15975, -11735, 7329, 38483, -5337, -26261, -47699, -48867, -44460, -64861, -33833, -2993, -12677, -23464, -19307, -22922, 2198, 10482, -10653, -20151, 9056, 39452, 3460, -20190, -10283, -4303, -5729, -5088, -40836, -90005, -103521, -78317, -57690, -72505, -103305, -52804, -1502, 8827, -16020, -73908, -59969, -34475, -29259, -46393, -39618, 782, -619, -7442, 11157, -5202, 14743, 46157, 44902, 13469]
14249A3469q129K0544l6107J2734J4061r116Q314J9098j6377l8600P229J6733
14237C853L5383o589l5148l284J639N885M707j6761k2062J2744M2097O498k9049
14224h7N252P2531p283m5023J1892K5176j5527k1509k9320l776O881J4151j5067
14211a709k2483q86l9984k4090Q193M1262N8807J0609Q367j0378j2315k0949J847
14198c709K7209k5576k6872k1753m476Q453O650K2662L3800l7135l7935K6155
14186c2527J3498K2796j8768r975l7148J4241L6825L3661m693p3966k477M8972
14174i561K0235O700j5459l6447l67P194J7245K8643j5793l9237q559K3823N0616
14161B9033k3586l3733o3206j159N2253L0763J1288J0265K5118L2809k2459m4434
$$ y = [13469, 5340, 25884, -10223, 2511, 16572, 7456, 15770, 34868, 18491, -20109, -12880, 3853, 39236, 32647, -2501, -5785, -4146, 1739, 6446, -10315, -32377, -19633, 22464, 28962, -87, 5165, 77696, 70413, 25390, 37282, 62458, 46931, 25422, -3898, -7674, -793, 13358, -1709, -24192, -25078, -65062, -89152, -80959, -39697, 19110, 29719, 38086, 27708, 15393, -5556, -3709, 23500, -2076, -28948, -50701, -55177, -46724, -40074, -17412, 16388, -20747, -58682, -32527, -19029, 3767, -15001, -24976, -62124, -47883, -11058, 22603, 17910, -56056, -58533, -9561, 10674, 17374, 1915, -34532, -34899, -27705, -10460, 18183, 2390, -36847, -45406, -21583, 29033, 5447, -28286, -91492, -92651, -40398, -9635, 1653, 11918, 37036, 69845, 47386, 2952]
14149B952k6302J8253J7809n280N210L4064k5582n2442n8738K4983O8176Q938
14137A2041N726M1968J633o8631o3780L5244M9767j4743r936Q977j995k2859K890
14124b3698Q622l785J4436N30J424L182M4641J0173n5212m1621L56p862j9613
14111f8427K0699N857P317K4069j9727l0676j5781k0021K5495N5786J9865L0300
14099C4756J4197l2237j4753l3027m600k662k800M1969J3023p7820M36M2663K6382
14086E527Q314K58j6961j1997O188R53M4034O4684K5626k5623k3346m3356k7591
14073F710j4884j9029k5263k0244K1365l776R670M6263K9684l7695j6508J6441
14061g266J1370m778l3067n2717J2481N3085M61j5970J2888l6651J31K4081R642
$$ y = [2952, -23350, -5097, 12712, 7432, 12642, 46706, 21124, -31318, -90056, -65073, 3103, 12041, 17767, 59735, 61368, -7263, -71043, -35799, 13968, -775, -10711, -1734, -3729, -26588, -23698, -15076, -18861, -4425, -3895, -2471, 711, 45352, 55525, 313, -41308, -40952, -48814, -68427, -47728, -41871, -34554, -10485, -30212, -60888, -76669, -96690, -71195, -15409, 4456, 34756, 48953, 16716, 1963, -31064, -35664, -38326, -41126, 843, 13866, -63954, -63518, -20855, 5527, 13841, 14099, -2862, -14859, -8671, -7718, 36316, 101000, 126626, 101003, 77657, 34301, 6710, -8174, -27203, -52466, -72710, -51345, -55121, -45451, 812, 30496, -7199, -23707, -7266, 4104, -674, -33741, -86458, -73977, -20892, -20431, -36401, -23513, -60164, -60033, -35952, -26310]
14048b6310J6262J6332K5702j1886J3098k2132k3054k2370r696M476J3618M4813
14036A8853J9534J5545N123k1547r067o96J6359K0269M484M518K0926m9052K008
14023D7257j407K121n231m0837k7437M6852L1017m081q409l4351J3171L0419n0748
14010a664k1641p671K1118j9458k596m200N458J3268L4361k2939j0186j258j0558
13997b7966j1377R555l2909l0699j084K5261M7718J6589j1907j0777K9378o871
13985e089J0453l0742o4178k9054N414J1240J658M0504L0485j9414P723Q547j7629
13972e0082J3906P239l634K9538l114l1659j8600j3453k4000j3889J3933K828
13960i0987l815K8028j162K1723M136k250J3959R404K1415K8741J3176l1986m6547
$$ y = [-26310, -10048, 6284, 31986, 20100, 33198, 11066, -11988, -34358, -44054, -39578, -25960, 18853, 38387, 53932, 59055, 37508, 28441, 27745, 44104, 64373, 68857, 73375, 94301, 45249, 47257, 45850, 47971, 42740, 1903, -25534, 21318, 52335, 48254, 39845, 5494, 18665, 49084, -1664, -23305, -30976, -9858, -29316, -31912, -36112, -30654, -17386, 16975, -5964, -16150, -17408, -27966, -39343, -29788, -62697, -93396, -94480, -69219, -21501, -4912, -16819, -27596, 1782, -5089, 5364, -25378, -89556, -118610, -113196, -101956, -100298, -59794, -29309, -48723, -41000, -32453, -50082, -36176, -28937, -32571, -3033, -6147, -37806, -56406, -69859, -93859, -107748, -93815, -90987, -94802, -66774, -67936, -46213, -42077, -44327, -30368, -20964, 451, 29192, 42368, 10382, -36165]
13947c6165j645J7938j1630N9458q580n9202Q192m5442m8951J3375M4366N3525
13935a4761N7122O622j0537K6774j7004m5984j2772J566R552l2242K6317O717
13923A370k043J943K8011j1477j942l6495J9083M058K7833K2468j9395n174J1807
13910D0047j1523K9477Q684j6309j217K2814j2422J170K2221l3704N282K8362
13898H2882m3333m9736k5102J9854N695P388j8867l0641J8710M7141J1515k2245
13886C261k9567j8330J7860l2038K9936P0367m6190j4424M3836j925n7843J219
13874c3838K1657L5157k2586l6791o073j0365j9297R688J1305N9124j7633m1223
13862e0875J9828L3730R376K7394L267M630j3548k0155k6393m498j2334R787N9252
$$ y = [-36165, -37810, -19872, -31502, 27956, 19376, -39826, -31634, -77076, -126027, -112652, -68286, -14761, 42361, 48983, 38446, 65220, 48216, 2232, -10540, -8974, 578, -31664, -5347, 1370, -673, 1270, 29281, 17804, 15862, -20633, -1550, 2508, 30341, 52809, 33414, 28240, 40047, 28524, 58001, 66685, 50376, 49159, 71973, 59551, 60721, 82942, 49238, 54520, 82882, 39549, -10187, -35289, -15435, -9740, -2352, -21219, -51860, -33150, 13991, 25506, 3261, -26306, -44636, -26776, -58814, -28878, 41489, -4701, -19125, 24711, 22786, -35057, -33838, -12181, 22976, 390, -36401, -42474, -52839, -72136, -62448, -51143, 7981, -9652, -50875, -31047, 2683, 12059, 39453, 42720, 47350, 33802, 13647, -12746, -17244, -29578, -19791, 39461]
13849C9461m330k9082j5871K298J1853k973j993k1148J2047K9079r684k1817k270
13836a4430R228L3973m075m3407j5725J4974J41O696J2641j230K414j0979K1288
13823A1509J7458N475j3569k9387j4204J5688J0535R970k2542j0832N0300L1928
13811F2329K183n2453j3303k6861j69L2347L4305K9155j4187j242l2471k4884
13799e251j5860k0649R255l1242j3425M5832J1066j0276j3483k580m1549J5713
13787g2449M8519J2519J6891J0678m2107m583J2208M6465M9734N120m5158l3093
13775D744j2287o809j328J8337o341j5561j0433o737J6610K0886k7366j1104N401
13762c1988j6752J5395n527j202K9684J8456m1134k0327j5763q961o362K5586
$$ y = [39461, 35131, 6049, -9822, -7524, 4329, 1356, -637, -21785, -9738, 19341, 9657, -12160, -14430, -5202, 28771, 24696, -18711, -34436, -19462, -19321, -12625, 16, -1214, 1200, -9779, 11509, 28967, 34442, 20873, -8514, -22718, -7030, 3505, 13475, -9067, -19899, 30401, 62329, 64512, 12059, -1244, -28105, -28274, 4073, 38378, 67533, 53346, 52104, 19633, -5251, -21111, -41760, -32505, -63747, -77172, -31340, -20274, -30550, -44033, -46613, -88162, -72449, -23930, -11411, 5480, 16158, -25949, -30532, -18324, 28141, 77875, 82995, 37837, 4744, -7543, -14352, -15680, 2657, -3684, -19245, -29678, -36415, -19805, 1081, -26285, -37389, -31988, -48740, -33345, -38872, -40074, -10390, 8066, -33068, -53395, -69158, -78119, -84481, -58895]
13750e8895j2269R285O0123L7884N312l6448m8700j4071J0429n299m0827J0718
13738h2758M0301M142J502K3864M382j0230N742O8m2527J1764M5315j9634j0055
13725b8124J5051J0417n6396k162J9328J6647J0224n61k794p620J2298M756j6902
13712b5838J5891q356k3464l093k3851k1954J3551J0756J1141J3522J0766k1436
13700e2365l2383R452L9752K7056J0516J4859K2403m3258k3950K0099L0196Q793
13688C1170k7623l6518j681k2437N855M2070k1384j9718j4626J5522K7862k3971
13676d5479o723L7184K0062m678L5479k4200l3355q559K3456j1371m1563L4561
13664b5186R928r943J8334k6939j7449R005m8424J4200L0737M8000J1411J1409
$$ y = [-58895, -71164, -61879, -1756, 36128, 41440, 4992, -43708, -57779, -47350, -52649, -93476, -82758, -42457, -38315, -36813, -12949, -8567, -18797, -13055, -12987, -55514, -43750, 1565, -18069, -28124, -13073, -2656, -59052, -61214, -41886, -25239, -15015, -15576, -18370, -25990, -13692, -8936, -25838, -9947, -18303, -41767, -44860, -68711, -90665, -77114, -66358, -55217, -41695, -30929, -52365, -84748, -75296, -35544, -8488, 2028, 16887, 39290, -3968, -27918, -7819, 22377, 31170, 3547, -32971, -34652, -57089, -51234, -9164, -30548, -50266, -64892, -49370, -21508, -45479, -52202, -15018, 5044, 366, 35845, 11645, -21710, -30269, -6813, -18184, -59747, -25186, -15258, -25201, -6867, -33806, -51255, -42250, -90674, -76474, -45737, 2263, 13674, 25083]
13652B5083l106n247l4498J7507K1400j5350L1414Q102k2165k4817j5472p180
13640b4329N167k860m1364j3919O1197L7370k3201l3210j4874L3222J8864o71
13628A392K4214m377n1305j6460M0440L579j2299k3602k669Q079Q181r387O300
13615b7914N1446J278J5926m2757k7841J6289J0224l1965l9589j2164L435K468
13603h1164L3844K6135L6158k1334k7843l4410j4416p43M1906K8232l0091K4761
13591a8965K3045J6898P817j7494J3525p544m9621k2357J6829M176j9064L6744
13579a6011m3344R244M6867L4321m380k79p990l9585N335j1117M156J7262J5789
13566A0268k4797k1750K2221j0408J084L2788j275Q020r807j4796m7959l218M479
$$ y = [25083, 21977, 16730, -17768, -261, 21139, 5789, 37203, 45305, 23140, -1677, -17149, -24329, -19162, -22022, -63386, -77305, -16108, 21262, -1939, -35149, -50023, -16801, 2063, 1392, 25606, 21229, -30076, -46536, -6096, -2517, -14816, -38418, -41087, -33008, -24827, -34214, -27914, 23532, 24810, 40736, -2021, -29862, -13573, -3349, -35314, -74903, -87067, -83632, -81164, -47320, -21185, 14973, -6361, -34204, -68614, -83030, -83773, -41867, -13635, -43726, -18965, 4080, 20978, 28795, 11301, 24826, 17282, -32339, -54696, -37867, -33691, -52755, -16011, -59355, -50111, -3244, 31077, 26697, 26418, 18428, -21157, -15822, -26939, -22783, -5521, 10268, -14529, -36279, -14058, -24466, -23382, 9406, 8131, 16151, 6344, -8452, -56411, -59629, -55150]
13553e5150K5239P017J172R919o901Q107M6043L729o0158k6584J7022J6832l3054
13540d6767K497K8886M833L786k6296q217K2833j3635l268N122K4043J8403r00
13527A1320m7964n631k231m2217J4702M8956K637j0242l689K3357j8701J9141
13515a0562L2833J5147k0446J3012J1641M094J1239j3985o9541o3294p714J8628
13503g8948K346J0205k2454o195l536O7185K7934j1599n349n1166k0764J9341
13491g3000J3366J2497K687k2699J1640l514L6542L1869k1334J1946p436k7243
13479c4679j0934J3481K2893P028m797L9942k143k592J0687J5056j7512q584j8938
13466H908n9689k7478k766j0800j0793L0125L2476n178P604k7228Q572K3656k1185
$$ y = [-55150, -29911, -22894, -21722, -11803, -18704, -10597, 35446, 39175, -20983, -47567, -30545, -13713, -46767, -44270, -15384, -10551, -6765, -33061, -41278, -18445, -32080, -35348, -30226, -6183, 12220, 11320, -36644, -42275, -44506, -86723, -72021, -23065, -20428, -30670, -34359, -11002, -29703, -10562, 22271, 37418, 16972, 29984, 41625, 45719, 56958, 42973, -26568, -89862, -97576, -78948, -76602, -66397, -88851, -95046, -98582, -31397, -3463, -15062, -20411, -71577, -92341, -73000, -59634, -47137, -44450, -67149, -55509, -59023, -22481, 9388, -11946, 0, -7436, -34679, -45613, -32132, -9239, -2211, -7008, 32934, 30791, 28199, 38886, 53942, 36430, 27846, 8908, -50781, -78259, -81025, -91825, -102618, -72493, -40017, -45195, -37591, -64819, -56247, -32591, -53776]
13453e3776M1060O593l3353m095J206K5258j409K4885M3899J2649m3118m0929
13441b1130k5525M6141L2884n000J4404p181r2355n2131L7795N7276O528K3794
13429A5500k7856k9719Q154p340m6076J6630M6439L850k599J2838j5161m4868
13417g0208r655M0714M4639J9721Q862l7708l191N519k3739m9920J1258K6061
13405c7647l0688q664k1549j0815J8572J6642K8626P15K8097j1873k6409K7144
13393b7849L4141P242n734n687J4842l7892O452L4774m9273l4096Q609J2705l838
13380d5604l5648R83j2439J5252K0228J4645M4944j7550Q338Q028j6357j6690
13368c1870M919j2561l9679j1087j1426m673Q985Q987L0001J4238R329j7760j9404
$$ y = [-53776, -12716, -6123, -39476, -43571, -42365, -17107, -18516, 6369, 50268, 62917, 19799, -21130, -46655, -514, 32370, 27370, 41774, 34593, -57762, -109893, -72098, -14822, -8294, 15500, -12356, -42075, -33921, -41261, -87337, -70707, -24268, -20418, -23017, -10179, -25340, -70208, -79863, -39149, 5490, 25211, 34073, -3635, -6826, -1307, -25046, -74966, -63708, -37647, -68335, -76999, -98548, -109363, -90791, -74149, -45523, -44808, -16711, -28584, -54993, -27849, 6292, 13534, 7800, 2113, 16955, -20937, -14485, 20289, -28984, -63080, -54471, -41766, -45604, -81252, -80269, -92708, -77456, -57228, -42583, 2361, -15189, -6851, 1177, -15180, -31870, -26951, -39512, -79191, -90278, -101704, -106377, -97392, -88405, -58404, -44166, -34837, -52597, -72001]
13355g2001K9720j8717l2608l591Q127j811n690R161M7067j8111J3707p107L1216
13342b0638L8515R417J0286L7650M380k7328L931P079K879k2533j4434j141n934
13329B2129O062j2295k440m5439l5523P154l078J1093j9530K3230j645R109L2151
13316i022q344L7076r399k5719q402L7637r141l7737P706J2745l1830K641q228
13303e0017L920K9916K128l6283k8602L8816J0585n903n943J2243q794Q514j0509
13290c9929k2931K8259J1390J4271J3148J2123R938m2218o141L759J71k1494J414
13277c8240k405o937o438p870l318j2065K5812K0524K2234j0869n105L8816K5324
13264C9463m632k9312J503M5363M3083m4806r1029j3544K2617L7497J1214J3036
$$ y = [-72001, -42281, -60998, -93606, -97197, -89070, -90881, -96571, -87410, -40343, -58454, -44747, -51854, -20638, 17877, 27294, 37580, 75230, 79610, 52282, 56213, 63292, 66171, 43638, 29204, 28063, 22129, 28191, 15896, 13456, -31983, -67506, -60352, -63430, -52337, -71867, -48637, -50282, -41173, -9022, -17366, 19710, 10311, -15408, -23810, 13827, 4686, -33051, -25345, -12600, -44430, -41789, -50017, -46097, -16181, -14053, -50336, -78938, -40122, -29537, -35440, -41383, -29140, -37934, -29420, -39929, -62860, -34601, -23211, -8940, 4208, 16331, 26269, -15949, -22090, -18331, -18160, -39654, -38240, -40645, -47582, -54020, -61890, -65208, -77273, -51461, -30937, -8703, -19572, -24677, 14139, 39463, 34831, 5519, 7022, 52385, 95468, 50662, -40367, -53911, -31294, 6203, 17417, 30453]
13252C0453j3885m2242l8136J1972Q06j008J0752O519O519k8517L117O725p244
13239e4169j805J9160M6738k7926l4046J7037k4599R492m077m2729k1662K9451
13227h9135J3257l0809K9354K6385J3166K1098K9026r466Q181N053K4700j7224
13215B3586k4383l8495K1833N0424l3980j9996L48l24M536L3405K4251l5967n3210
13202d7972J8244l1590O793J1790J6831n093N8168O3019n380l745R084O34k9557
13189F1226j8206j1043j4891n1670n923O731L9018K6176N178l766k5459j6563
13177i192L0755R807j2332N828P729P015k2707J7394j6438l2542k3305L96M7975
13164A0383L1141O614j1630L859L7829K3413R0399K3659j7283J1384j6352l0517
$$ y = [30453, 16568, -25674, -63810, -51838, -51032, -52040, -41288, -34769, -28250, -56767, -53650, -46925, -54169, -55974, -36814, 9924, -18002, -52048, -35011, -59610, -50118, -54195, -96924, -118586, -89135, -75878, -106687, -77333, -50948, -37782, -16684, 12342, 2876, 11057, 16110, 40810, 23586, -797, -39292, -17459, 32965, -1015, -21011, -20663, -20987, -16451, 16954, 41205, 5238, -47972, -29728, -61318, -54525, -42735, -25904, -30997, 27171, 90190, 84810, 81065, 90149, 90783, 61226, 43020, 31977, 17086, -34584, -40507, -33776, 5242, 31418, 36596, 32830, 7371, -9192, 21563, 31370, 19038, 24866, 32595, 39610, 16903, 34297, 17859, -14683, -37988, -37592, 10383, 41524, 48138, 36508, 40367, 78196, 101609, 192008, 215667, 198384, 209768, 193416, 162899]
13152A62899l6858o5107j4187j6680m317M7569j4937k6326J8219j735Q546r359
13140D7727J3533N0725K0381l8567l0831q551m3678K205K7458M8877N1731K9992
13128A71002l8966j2347N715L2517k6108k6987k807K539O265Q582K9937j8198
13116A31144j7621j215r385P746j6381l3118J4394n754k9623n2597m2874L222
13104e2062P4720K5848m4778k581j8911j4592l0881J9920k0898j3157K9147Q7026
13092C8801M8343o525l1971j3915k66K6762J4848o959k7035k6261j8748P478M1370
13079D5922j5849j0032l61j3778K7021K6896J4667k0012n7235m2008M572M4957
13067D760j8172l5015K7345M7702j9143l0161L1025J6361m4229m4163j148L4610
$$ y = [162899, 126041, 60934, 46747, 30067, 25750, 73319, 58382, 32056, 50275, 48540, 57086, 47727, 61260, 111985, 132366, 93799, 62968, 54417, 10739, 12944, 40402, 89279, 141010, 171002, 132036, 119689, 125404, 157921, 131813, 104826, 102019, 104558, 110823, 119405, 149342, 131144, 113523, 112308, 102923, 110669, 94288, 61170, 75564, 69810, 40187, -12410, -55284, -52062, 22658, 48506, 3728, 1147, -17764, -32356, -63237, -43317, -64215, -77372, -48225, 38801, 87144, 80619, 48648, 34733, 34467, 61229, 76077, 69118, 42083, 15822, -2926, 4552, 45922, 30073, 20041, 19680, 5902, 32923, 59819, 74486, 54474, -2761, -44769, -40197, 4760, -13412, -48427, -21082, 26620, 7477, -22684, 8341, 24702, -19527, -63690, -64838, -30228]
13055c0228j735j6659J2522K5769m5966J1696K5073K769j3796k2812K0243L4408
13043A284j7688q339n133J0640L1090r060m1296k3400J5155J4156J9512r083l0812
13030e2974k3466J8838K1006k330p328m0010l488L1086N4424K7190m053m3876
13018b4981m711L9389o22o5056j8580L4303M1916J3765l2544J1619N913k1437
13006b1026j7579j5998j8896J1866J0806N692J5579K532l138n830J7959K3424
12994E391r145j2099r668K0848J622l929j2143K7158J570k9502J2834N0512k8523
12981A4926r173L829L525l420q089j9352j8759k5045K689K1873J5390M0218k4737
12968f125L4870L0860j130k2705J1623l4011j0999j1247l8671p083N5362J3449
$$ y = [-30228, -31963, -48622, -36100, -10331, -56297, -44601, -19528, -16759, -30555, -53367, -33124, 1284, -16404, -24743, -29876, -19236, 11854, 2794, -38502, -61902, -46747, -32591, -13079, -22162, -52974, -76440, -57602, -36596, -38926, -46254, -86264, -89752, -58666, -4242, 22948, 18895, -24981, -29692, 9697, 9075, -55981, -74561, -40258, 1658, 15423, -17121, -5502, 411, -21026, -38605, -54603, -73499, -61633, -50827, -45135, -29556, -27024, -30162, -35992, -18033, 5391, -3754, -15853, -25521, -4673, -3051, -6980, -19123, 8035, 9605, -19897, -7063, 43449, 14926, 5753, 9582, 13107, 9687, 1598, -17754, -36513, -61558, -58869, -36996, -21606, 18612, -6125, 28745, 59605, 58475, 35770, 47393, 13382, 2383, -8864, -47535, -54618, 744, 14193]
12956A4193n250p17N678p533j6202K2005q007j4966k1779M252M894N4682k049
12943B9201p1662k0799M7271M5539K947L32J8989N188J4464j3108n2640o1070
12931e5348J3273K1325J9398j4656Q819M0811n320l1709l4057M9364J6686j5887
12919A2699j6945k1580R23k9201J3000J7883K4758P029K3691K2703l8998l9269
12907b3307k725Q689J2365K0809l3800k649l264J0360N662J6551p122n412q127
12894a1970P2606J3571l3732L9757n554k0030m2711L5637p208l1998j034j5156
12882g822p117j0925R85o247j4244k36J9694N4284K1990n1878J1138N8911k2757
12869D5776M973q588j76l2276k6662k0598J2012J4638q853K415O998j4489l0838
$$ y = [14193, 8943, 8226, 13904, 6371, -9831, 12174, 4167, -10799, -32578, -28326, -23432, 31250, 29201, -42461, -63260, -15989, 29550, 32497, 32829, 51818, 57006, 71470, 58362, 5722, -55348, -42075, -20750, -1352, -16008, -7189, 33622, 28302, -3407, -37464, 11900, 28586, 12699, -4246, -25826, -24903, -54104, -41104, -23221, 1537, 8566, 32257, 54960, 15962, -23307, -26032, -17343, -4978, 15831, -17969, -20618, -23882, -13522, -7860, 8691, 1569, -3843, -11970, 60636, 74207, 40475, 80232, 74678, 54648, 11937, 47574, 40366, 8368, 7334, -7822, -14939, -25864, -24879, -31126, -45370, -45606, -25912, 28372, 50362, -1516, 9622, 68533, 45776, 50749, 42161, 41985, 9709, -16953, -37551, -25539, -10901, -19754, -17339, -10341, -24830, -55668]
12856e5668r377J6108O976k0186k6519L500K3507N055r219J5167K3704K0005N2882
12843D5935J7178j4675l254k9179j34R496o096l0673Q661j0940J6930k3873M0215
12830A9591K3181N943l5959j6970Q121K5187n0164k5576K371o96l4279r361K8543
12817f0068R223N0320L4839k7280n1103m232j3960o694L2336K0451M446j2003
12805b3725O17L9986J264m3267m3936o470j8311K3613P1655n84j2687m995K0087
12792C247J1467J3984k5634l8052M3077J8902N4125m991l5977m3586N400K7554
12780B9516o194R907p345m7675r144M660J0264N130m3047J8969L2509r603k8314
12767d0367j4535m798J7358J9130k6183k1315K0388J3184n765K9705l695o886
$$ y = [-55668, -65045, -48937, -41961, -62147, -88666, -85166, -61659, -56604, -65823, -50656, -26952, -6947, 45935, 63113, 48438, 45184, 16005, 15871, 25367, 19271, -11402, -2741, -13681, 3249, -20624, 19591, 42772, 48715, 12756, -4214, 3907, 29094, -21070, -46646, -44275, -44971, -79250, -88611, -60068, -50845, -525, 34314, 7034, -44069, -48301, -62261, -68955, -36619, -16168, -11722, -23725, -23108, 16878, 18142, -25125, -69061, -75531, -93842, -70229, 1426, 842, -11845, -16840, 3247, 14714, 28698, 3064, -34988, 8089, 26991, 81116, 76125, 40148, -3438, 1962, 29516, 23322, 33229, 25884, -21791, -30935, -26275, -16011, -10881, -53928, -34959, -2450, -12053, -40367, -54902, -59700, -42342, -23212, -49395, -70710, -50322, -37138, -42903, -13198, -16893, -23779]
12755b3779j4390K3628p10l8028k2520J264m465O75q804L5904L7792k4001k1155
12742e8589j8796J2178N354L6302L0109P926j5749j0262N737P5433k4522n0373
12730e252q799q14j7724P1898j2954o0078k565M0616K0436m8791k7800K2709p965
12717c7083l313l765M54K2701j5262K2798L7150J1798K9396L9435j0038J42P642
12704A02055K80l4777m7918r384J2854M055l6185k7833q353j002j2473K958Q187
12691d7536J1871l6840M7750L3397l1640p107L7268K0662k3968l703l0961K957
12679b7850j3289q647M4581r309K2311J0821J2529K9557k3910L7585J8378m3329
12667D9428M546k0502M649L0199k9174j8836K6254J4784L9826J8060J1709J5987
$$ y = [-23779, -38169, -14541, -15251, -53279, -75799, -74535, -79000, -78325, -87129, -51225, -13433, -37434, -58589, -77385, -65207, -59853, -23551, 6558, 14484, -1265, -11527, -5790, 69643, 45121, -5252, -14051, -14865, -32589, 39309, 26355, -33723, -36288, 4328, 24764, -24027, -51827, -29118, -37083, -40396, -44161, -43707, -21006, -36268, -13470, 23680, 35478, 64874, 104309, 94271, 94413, 102055, 102335, 67558, 19640, 10256, 23110, 27165, -9020, -36853, -45206, -46208, -58681, -55723, -47536, -35665, -72505, -24755, 8642, -22998, -30105, 7163, 27825, 3857, 154, -30807, -27850, -41139, -49786, -5205, -14514, 7797, 18618, 31147, 60704, 36794, 74379, 92757, 49428, 53974, 33472, 38121, 68320, 39146, 20310, 46564, 61348, 101174, 119234, 130943, 146930]
12655A46930O7968J09060J23342J59301J88287K26007J50939N7433j428j696Q9835
12644A315978Q4341L9949p9936k59699k76611j92471j07600q7987j11526j29821
12634A94617n5450j5946j2973K8240L4750r857j75J0681j8518J4953n924j0192
12622A54206J781k4981M262k8035j2303k246n4911K8883j3978j0933l2145K6353
12610C5953J6041L0312j3928l7379J4203M3430j7474k4768j9976N928M1581K9325
12598A03248k380j023l3752O449m578L8053K3658k8226j5033n593j6763j6602
12586D7458m0044K223L2801j402K0660K2348j7528m3980J5875j2945j0396l1004
12574a5934K783L0529J6782j3735k7242l766l3654j1931l453J6927l2734j662
$$ y = [146930, 214898, 323958, 447300, 606601, 794888, 1020895, 1171834, 1229267, 1227839, 1226143, 1315978, 1400319, 1440268, 1360332, 1100633, 824022, 631551, 523951, 435964, 324438, 194617, 139167, 123221, 110248, 138488, 173238, 163381, 163206, 173887, 155369, 170322, 164398, 154206, 155987, 131006, 135268, 107233, 94930, 92684, 37773, 66656, 52678, 41745, 9600, 35953, 51994, 82306, 68378, 30999, 45202, 88632, 71158, 46390, 26414, 32342, 73923, 103248, 100868, 99845, 66093, 72542, 67964, 106017, 129675, 101449, 86416, 80823, 64060, 47458, 7414, 9637, 42438, 41036, 61696, 84044, 66516, 22536, 38411, 25466, 15070, -15934, -13151, 17378, 34160, 20425, -6817, -10583, -44237, -56168, -59621, -42694, -75428, -77090]
12562g7090L2055K3066P887q31R306J8648J8945J7066J5811j9347j4601k7199
12550C716J6762J1740m0376J0032L8458k595k8622J4204M4484n492k721k384l338
12537E3868M640Q711l6900k4262N2226k8590j7936J0894J982J8462N825k389n507
12524D1024j7143j0779n420m3242Q179L6766j7733o2941j1342J7684M7173Q992
12512h782j3018j2978j6084K2812J5984k2803L9514J4152k5504q246L557K1556
12500A0160j9383N200J6743k4799l778R607O944J4478K9514J5328k4454k0148
12488A5412J7863M3799J3092J662l3265m0422M727k0726Q334j9258O13K611L1187
12475B5629N6922j7532n9571m8442N8036M2622M5955K5347l0151k1902M2016J0696
$$ y = [-77090, -45035, -21969, -14082, -14913, -5607, 13041, 31986, 49052, 64863, 45516, 30915, 3716, 20478, 32218, -8158, 1874, 40332, 37737, 9115, 23319, 67803, 62311, 59590, 57206, 53868, 58508, 67219, 30319, 6057, 58283, 29693, 11757, 22651, 24633, 43095, 48920, 46531, 41024, 23881, 13102, 7682, -35560, -27381, 9385, -8348, -71289, -82631, -64947, -17774, -8782, -21800, -34778, -50862, -28050, -12066, -34869, 4645, 18797, -6707, -14953, -11396, 10160, -9223, -4023, 12720, -12079, -15857, -6250, 694, 15172, 44686, 60014, 35560, 15412, 33275, 77074, 90166, 91828, 58563, 18141, 22868, 2142, 10476, -8782, -8169, -5558, 25629, 82551, 65019, 5448, -42994, 15042, 57664, 103619, 128966, 98815, 76913, 118929, 129625]
12463A29625k9784L0993L3691j0093O7297J285O258k4377m9154M6536j9648j9344
12451A63285l0698o2416j7011M199o177k882j8963j1912N2962K5452p934J9734
12439A07639J3913k9992o8384m4004n919K421R799K4252L0127M735j6205n070
12427B3312l93K2836o3392l0587L8331Q057J3301L1377K872l9722l1921j8378
12415d4307J4649R024M3174Q556m118j3644k6277l5621L0072J6284J7818K6133
12403D1743j7454k7742J9402N8554r794l5608j306K3610Q155O977m7799j7673
12391A065J1480k590j2577p1345q3249o099P5160M5773O627L3968J868p335j5286
12378b2540k6404K380J5737K738j2350L3491o406k0022k706K780q507P251J1413
$$ y = [129625, 99841, 130834, 164525, 154432, 221729, 223014, 229272, 204895, 155741, 202277, 182629, 163285, 132587, 70171, 53160, 57359, 51182, 48300, 29337, 17425, 70387, 95839, 87905, 107639, 121552, 91560, 23176, -20828, -26747, -24326, -14527, 9725, 39852, 44587, 28382, 23312, 22919, 45755, -17637, -48224, -9893, -1836, 11465, 42842, 45714, 5992, -25929, -44307, -29658, -20634, 22540, 31096, 26978, 13334, -12943, -48564, -18492, -2208, 15610, 41743, 24289, -3453, 15949, 74503, 64709, 29101, 27795, 51405, 59560, 66537, 18738, 1065, 12545, 9955, -2622, -73967, -157216, -163315, -88155, -42382, -35755, -1787, 81, -7254, -22540, -48944, -46564, -30827, -28089, -40439, -6948, -13354, -33376, -36082, -33302, -41809, -34558, -23145]
12365b3145O998o4583J0660P6526O8268l2954m0765l0366j6727N2900J9736k6194
12353C54l9611K3466K3413K1113Q972J5135R535k5742l7305o042M3295M1851L4232
12340A12666K8861K6093M8413L4306O3868L9623j8574J1440O1240P9846N6668
12329E44450k0157m8121q875N0036M840n2363j0314Q869J73k0093j6550O157q928
12316D29124o6531o733k447R063k2922J5057J6323K693K15k2733o2924l4526k3248
12303B30411N1288p496k52J6270j1036J0476J4530o144L514q494l1345j858L575
12290B63439K3296l4507M1141N1779k1291J7275P332O07j4519K0207M6929J432
12278D03120k2475k6755K304n6745j3954J818K4844N9707P4357P1281p1404l8657
$$ y = [-23145, -16147, -80730, -70070, 6456, 74724, 41770, 1005, -29361, -46088, 6812, 26548, 354, -39257, -15791, 7622, 28735, 37707, 52842, 62377, 36635, -670, -6712, 36583, 78434, 112666, 141527, 167620, 216033, 250339, 314207, 353830, 335256, 346696, 407936, 487782, 544450, 524293, 476172, 467297, 517333, 522173, 469810, 459496, 468365, 468538, 448445, 431895, 438052, 429124, 362593, 355860, 353413, 362476, 339554, 354611, 370934, 373627, 373842, 351109, 288185, 253659, 230411, 281699, 274203, 273951, 290221, 279185, 289661, 304191, 298047, 301561, 293067, 261722, 259864, 263439, 286735, 252228, 293369, 345148, 323857, 341132, 348464, 349071, 334552, 354759, 401688, 403120, 380645, 353890, 356194, 299449, 285495, 287313, 312157, 371864, 446221, 517502, 446098, 407441]
12266D07441M3054P8492M9809K330l2313L8999N2120K3017L6330J2654L1739K9790
12254G73462M4583P1604P9926O3212P0174Q1396J9349O6100J19442J30250R3603
12243A613101P9163J47512R1228P2302J56029J33936K05414K53836K16702K40178
12233C209401K34414K93737L69602M13710N13748N72139O16106O86133Q61024
12224G770014J048553J378926J709346K080072K582222L262345M305177N727824
12216B9864479P922139J1724390J8367320K9673364M4457965N1416251L6643363
12209B30069271J0473618P98891L923587R538847J5284820J3488929j4816631
12202B68761332n5853003o0934787m2300762k5932424j6061239j0499221p401307
$$ y = [407441, 450495, 528987, 578796, 581126, 548813, 587812, 639932, 662949, 699279, 711933, 743672, 773462, 818045, 889649, 969575, 1032787, 1102961, 1184357, 1203706, 1269806, 1389248, 1519498, 1613101, 1692264, 1839776, 1931004, 2003306, 2159335, 2293271, 2498685, 2752521, 2969223, 3209401, 3443815, 3737552, 4107154, 4520864, 5034612, 5606751, 6222857, 6908990, 7770014, 8818567, 10197493, 11906839, 13986911, 16569133, 19831478, 24136655, 29864479, 37786618, 49511008, 67878328, 97551692, 142009657, 193425908, 230069271, 240542889, 241341780, 245265367, 254804214, 270089034, 283577963, 268761332, 212908329, 151973542, 109672780, 83740356, 67679117, 57179896, 49778589]
12195D9778589n610663m438637l381651k593723k045418j703873j737887j691947
12187B6574790j631637j521471j325307j160001j102017j042844r78877r30451
12179A6882185q33572p68461o74870n96419n92113o29093n92795n11488n04485
12170A1178889m40961l65466l50733l02522k87352l07325l05131l00319k89364
12161H229716k60622k69698k40450k31946j93640j76788k01880k22121k19647
12152F212924k04178j94581j92145j88657j80355j16360j36844j34026j60490
12143D705288j42557p7720q6013o7254q8464j30290j05603q8975j12220j34010
12133C672182j46836j25527r1718n3306n8324o5944p2793j38532q8718n6518p6063
$$ y = [49778589, 44167926, 39729289, 36347638, 33753915, 31708497, 30004624, 28266737, 26574790, 24943153, 23421682, 22096375, 20936374, 19834357, 18791513, 17812636, 16882185, 16048613, 15280152, 14605282, 14008863, 13416750, 12787657, 12194862, 11683374, 11178889, 10737928, 10372462, 10021729, 9719207, 9431855, 9124530, 8819399, 8519080, 8229716, 7969094, 7699396, 7458946, 7227000, 7033360, 6856572, 6654692, 6432571, 6212924, 6008746, 5814165, 5622020, 5433363, 5253008, 5136648, 4999804, 4865778, 4705288, 4562731, 4485011, 4398998, 4331744, 4243280, 4112990, 4007387, 3918412, 3806192, 3672182, 3525346, 3399819, 3308101, 3254795, 3196471, 3130527, 3057734, 2919202, 2830484, 2773966, 2697903]
12122B697903m7805n5277j13046q2966j08555o8231l0328n7654n2865n0892p0597
12111A959687n2632p4904o0191n6900m9822m7070l741l4585l5917P272k8414m7092
12099A475691n6946m0315m3683m4334K219p212l6188j5373L276n4955m1461n4210
12087A086509k1583j5864k7877j1534m3740K437K8385k3007m0989K9676O736m7248
12075I21901k0878L6175j8142N816O871j5297o909J0330K8039p306o3843m083
12063H72674M11l1680j6267m2985l2076K611j3705Q632J3204L2196l4024m4263
12051G14728Q574o275K2633o439p9088N808K0106k7387J3635j7711q120J9200
12039F59664l1684l4047M5455N283j8366j6347k2957l0522O6475J8320l7739k4193
$$ y = [2697903, 2650098, 2594821, 2481775, 2398809, 2290254, 2222023, 2191695, 2134041, 2081176, 2030284, 1959687, 1907055, 1832151, 1771960, 1715060, 1665238, 1618168, 1614427, 1579842, 1543925, 1551197, 1522783, 1475691, 1418745, 1378430, 1334747, 1290413, 1292632, 1285420, 1249232, 1233859, 1237135, 1182180, 1140719, 1086509, 1064926, 1049062, 1021185, 1009651, 965911, 968348, 996733, 973726, 932737, 962413, 969149, 921901, 901023, 937198, 919056, 924872, 931743, 916446, 909537, 919867, 947906, 940600, 876757, 872674, 873085, 841405, 825138, 782153, 750077, 752688, 738983, 747615, 760819, 793015, 758991, 714728, 723302, 717027, 739660, 733221, 654133, 659941, 680047, 652660, 666295, 648584, 640464, 659664, 627980, 593933, 639388, 644671, 626305, 609958, 587001, 556479, 622954, 641274, 603535, 579342]
12027E79342J069k522k3689M722J5786K9054l3345k0197p319k8435n5663j2569
12015D46234K936J8857J0512L5441K670J3687M0346K5064m4753J1593M964J279
12003E68830j9184o5609P693J2485J0113j8061j5582L5238M873j447L1518J0145
11991E61012Q199L2516R624j8820K568K7859P9173o500k3300k2744K7704K5653
11979G02944L8000r674q411j7533o291J3586M5168L5678K4814M8581Q23L8482
11967I06167K7870L4582L8190K8124J9511N8547N2689J6558O4178L8400P0462
11956A355278R6793J15177J07754J15503O5066J37986J29408J11649J40491J35497
11946B510602J55169J63910K24537K73472L41807L60805L56760M05098M91210
$$ y = [579342, 580411, 577889, 554200, 558922, 574708, 603762, 570417, 550220, 542901, 514466, 458803, 446234, 449170, 468027, 478539, 513980, 516650, 530337, 570683, 595747, 550994, 562587, 567551, 568830, 549646, 484037, 491730, 504215, 514328, 496267, 480685, 515923, 520796, 519349, 550867, 561012, 569211, 601727, 611351, 592531, 595099, 622958, 702131, 695631, 672331, 649587, 677291, 702944, 740944, 731270, 722859, 705326, 699035, 712621, 757789, 793467, 818281, 866862, 867685, 906167, 934037, 968619, 1006809, 1034933, 1054444, 1112991, 1165680, 1182238, 1246416, 1284816, 1355278, 1452071, 1567248, 1675002, 1790505, 1855571, 1993557, 2122965, 2234614, 2375105, 2510602, 2665771, 2829681, 3054218, 3327690, 3669497, 4030302, 4387062, 4792160, 5283370]
11937E283370O22839O80989P95608R51652J175326J422338J729420K157997K749109
11928A7568648L580933M649711O085549P832223R532197J0493202R974564P970600
11920G7687627N499206L662209K641393J856299L88040k611945o774875j0344566
11912G2003388j1520520j0436493q446003o571426n013292l835312k950235k329858
11904B0900249j869916j492387j249579j115188j045908r37432p96088p05879
11896A1687872o35368n96146n64609n45974m95468m45591l92115l76164l85097
11887G251340l10602k91561l13697k24166k31026k25277k39280k04720j29419
11878E081592j99650k05428j55767j18811j54929j30936j11013j26197j18538
$$ y = [5283370, 5906209, 6587198, 7382806, 8334458, 9509784, 10932122, 12661542, 14819539, 17568648, 21149581, 25799292, 31884841, 39717064, 49249261, 59742463, 69717027, 77687627, 83186833, 86849042, 89490435, 91346734, 91734774, 89122829, 82347954, 72003388, 60482868, 50046375, 41600372, 35028946, 30015654, 26180342, 23230107, 20900249, 19030333, 17537946, 16288367, 15173179, 14127271, 13189839, 12393751, 11687872, 11052504, 10456358, 9891749, 9345775, 8850307, 8404716, 8012601, 7636437, 7251340, 6940738, 6649177, 6335480, 6111314, 5880288, 5655011, 5415731, 5211011, 5081592, 4881942, 4676514, 4520747, 4401936, 4247007, 4116071, 4005058, 3878861, 3760323]
11869C760323j13779j16966j37925r8158o0763r1075j16266j09384q1778j11244
11859B722985p8861n1098m3206q3268q5857o2489n5821o5172n1263j2424o2359
11848B071167m2092o3870q0181n5514n3389o9012n8940p3423j6872p818l1407
11837A518649k5331k3702L5055l9083q1148l2034q794o2975n8283k8560p2866
11826A120928l7287P063P82l0279n2077n1880o0201m3490j1073L1234K6998o2534
11814H38184m1495j0361k7108k0513k4918n3975m6255K4806k8110J0648l6300
11803E84603l9666R431M346L0302L0045j8503m7463n6126j446m0701K2148K3993
11791E00963j2434l8616N4038K0182m3393l1244j0237J9290K786j1649L9266M5662
$$ y = [3760323, 3646544, 3529578, 3391653, 3293495, 3232732, 3141657, 3025391, 2916007, 2834229, 2722985, 2644124, 2593026, 2549820, 2466552, 2380695, 2318206, 2262385, 2197213, 2145950, 2133526, 2071167, 2029075, 1965205, 1885024, 1829510, 1776121, 1707109, 1648169, 1574746, 1557874, 1550056, 1518649, 1493318, 1469616, 1504671, 1465588, 1384440, 1352406, 1343612, 1280637, 1222354, 1193794, 1120928, 1083641, 1090704, 1091486, 1061207, 1009130, 957250, 897049, 853559, 842486, 873720, 900718, 838184, 796689, 786328, 759220, 738707, 713789, 659814, 613559, 638365, 610255, 620903, 584603, 544937, 554368, 558714, 589016, 619061, 600558, 553095, 496969, 495523, 454822, 476970, 500963, 488529, 449913, 503951, 524133, 480740, 449496, 439259, 458549, 461335, 449686, 488952, 534614]
11779E34614k854j4195K2796N808m7148r74K732L0017J2338K6727Q4331J14281
11767G68473J13460J93423K26596J86458R8932p466M0120R0887P0368N4005o6081
11756A769175k42628k46348k60818j54848p3260j08862j13596j01491n3767N388
11746D18945O881m4793l5385L2017J6436K125J3700l3022k6516K871k9588l3625
11734B90046m0325J3357k4672m0086j5051P552J5634J8098L6033M646o6112l2541
11722A66579K1298m582N3045L5544J9390j7272J3421p4154k4549P383J9500j766
11710B13837q456l3817j0565q506k1935o59L0606K4697L5886k8618k1799k4847
11698A45824l730K433K4716J567l8667j5658M0708L5235L294J9187o21j3575j8589
$$ y = [534614, 531760, 517565, 540361, 546169, 499021, 498047, 500779, 530796, 543134, 569861, 654192, 768473, 881933, 1075356, 1301952, 1488410, 1587342, 1579876, 1619996, 1710883, 1781251, 1835256, 1769175, 1526547, 1280199, 1019381, 864533, 791273, 682411, 568815, 467324, 413557, 418945, 425826, 381033, 345648, 377665, 394101, 396226, 409926, 376904, 350388, 353259, 323671, 290046, 249721, 263078, 238406, 198320, 183269, 190821, 206455, 224553, 260586, 265232, 199120, 166579, 187877, 183295, 236340, 271884, 291274, 274002, 287423, 213269, 188720, 196103, 215603, 213837, 205381, 171564, 160999, 152493, 130558, 129899, 160505, 185202, 221088, 192470, 170671, 145824, 142094, 144527, 169243, 170810, 132143, 116485, 157193, 192428, 195722, 214909, 214288, 200713, 182124]
11685A82124m3178j9946Q898m024j7711J1426L1784L8152K3111K9482j0274J8671
11673B48515O5916k2031J5641N7087N3502L1198O1721Q2027M5429M5361P9983
11662G64349O8247J2094j7595l5555n3258n0512r0741q9691m8599l0719J22m5579
11650C82563l3522l9072j5556R516k6112n255N0280J5565k6513r166K645K3404
11638C28777Q2642P7096J8621L7461O0927J3564N7706O8156P724k0290l7380J2583
11626G07587m9845o1089q7154o0898n3249o9293j2411j4709L091k1479m1992j8276
11614B20283j1302j9571J8831K9648l8814M281j7631l0622J8262J1292J5358k7018
11602A72997l7579P841j6293k760J9444m4471m3348j7838N9777M6891k6246o3757
$$ y = [182124, 138946, 119000, 127898, 123874, 106163, 117589, 149373, 187525, 210636, 240118, 229844, 248515, 314431, 292400, 308041, 365128, 418630, 449828, 511549, 593576, 639005, 684366, 764349, 832596, 844690, 827095, 791540, 738282, 687770, 597029, 507338, 458739, 428020, 428142, 382563, 349041, 309969, 294413, 303929, 277817, 272562, 322842, 338407, 311894, 302728, 305373, 328777, 411419, 488515, 507136, 544597, 605524, 619088, 676794, 744950, 752674, 732384, 695004, 707587, 657742, 596653, 509499, 448601, 395352, 326059, 313648, 298939, 302030, 280551, 238559, 220283, 208981, 189410, 208241, 237889, 199075, 203356, 185725, 155103, 173365, 184657, 200015, 172997, 135418, 143259, 126966, 124206, 143650, 99179, 55831, 37993, 97770, 144661, 118415, 54658]
11590E4658K0080N4601j9529k0391l2075m9256M155M7723N0423m5956k704Q005
11578F9734r927j0694L4027l744l6551K341o484K8255J9644J6505o900J9087j4131
11565A01162m0024Q68M780l2610K3487O0210J9068m7002l5902k5174k2478q327
11553a942j7994M6612K7072l3862k4554j066J0229O6185j306k0401l225L3353
11541G9101O201L015K5444K0779j7648K7737K07l3478n1501j2598j2585L2283
11529F6957J6815k6971m7253k1527R384J7114N617J0466q35k9342k2859o0J6563
11516e931k3814K5223K6265n679K0761K3416r2R66j9301K5963J1503j9902K4131
11503H3509L1393j590j0145l1651m0687m9564K2533O1286L8179J6993m7005p1343
$$ y = [54658, 74738, 129339, 109810, 89419, 57344, 8088, 12243, 59966, 110389, 64433, 61729, 69734, 59807, 49113, 83140, 79396, 42845, 45186, 38702, 66957, 86601, 103106, 96206, 115293, 101162, 61138, 62006, 66786, 34176, 57663, 117873, 136941, 89939, 54037, 28863, 6385, -1942, -19936, 26676, 53748, 19886, -4668, -5734, 4495, 70680, 69374, 48973, 45748, 79101, 85302, 88317, 113761, 134540, 116892, 144629, 144836, 111358, 59857, 47259, 34674, 66957, 83772, 56801, 9548, -11979, -2595, 14519, 20136, 30602, 29767, 425, -22434, -22494, -5931, -29745, -4522, 21743, 16064, 36825, 60241, 60149, 61115, 41814, 67777, 79280, 59378, 83509, 114902, 113312, 103167, 71516, 30829, -18735, 3798, 65084, 103263, 120256, 73251, 1908]
11491A908J0090m922j655L4835K5314o022p488k2768o604L1263K3336j8283j7877
11478D1127O44L1545J151j5530l6699J3734J6380J0657m4808R152p008K1262k0887
11465B0720j4156P836j2566j1076j8176j7640J2834O42J6595O3709L5440n7663
11453B6499o8247K0036L1323K1230k4606j3876J610j1579j7475j6977M7313O992
11441B243J235K5714k2632M167J6570j9182r553o929O925M5483J5343K4578l5611
11428D8351m8915J0573O433M7697N5134l401n3618k0146L9912J757p5770j5859
11416g852N0510J8325o414k4549l0774K1463J1733J7304m456J4298Q934J2478
11404H1000L481k4416j8393J9228J6432n3412j9049k6714R381M7292J2049o0299
$$ y = [1908, 11998, 7076, 5421, 40256, 65570, 59548, 52060, 29292, 22688, 53951, 77287, 59004, 41127, 41771, 73316, 74467, 58937, 22238, 35972, 52352, 63009, 18201, 27353, 20345, 41607, 20720, 6564, 14400, 1834, -9242, -27418, -45058, -32224, -31582, -14987, 48722, 84162, 26499, -41748, -21712, 9611, 30841, 6235, -7641, -6031, -17610, -35085, -52062, -4749, 2243, 3478, 29192, 6560, 10727, 27297, 8115, -1438, -8367, -1442, 44041, 59384, 83962, 48351, -564, 10009, 16442, 64139, 119273, 115872, 62254, 42108, 82020, 83777, 8007, -7852, 42658, 60983, 54569, 30020, -754, 20709, 32442, 49746, 45290, 59588, 68522, 81000, 84481, 60065, 41672, 60900, 77332, 23920, 4871, -21843, -12462, 34830, 46879, -13420]
11392a3420l7423Q647L6346L9293J8259q545k9492l8748o631J6847L0651L0828
11380D6612K2139o449l9841K915J1854j1861R35r761K627K3760m058r870j8108
11367A0894M2175L2940k9676q3903m3050L9542M4899J020j8682m469J6116J7819
11355B5625j1294l4459k7905N3981J8146L8836k4485j8418k4388r698K3317K0062
11343B9320J4557l453k7460p226R434j8366n300J4852j8786l615M352N8732M8793
11330I5834j5612K9005l9191l9403P701j3507R325L0401j3034l4503n493K9619
11318D1142J1750J410q91k7855j4314L4237n535k1744l036k1705R469P1486K5870
11305A00284j1765m6062n6842N516L3003k7959Q54N7824L4561K1771j1814k7105
$$ y = [-13420, -50843, -42196, -5850, 33443, 51702, 43157, 13665, -25083, -31714, -14867, 15784, 46612, 68751, 62302, 22461, 25376, 37230, 25369, 26304, 16543, 19170, 42930, 38872, 29002, 10894, 53069, 86009, 56333, -27570, -70620, -31078, 13821, 14841, -3841, -8310, 7806, 25625, 14331, -20128, -48033, 5948, 24094, 62930, 38445, 20027, -4361, -14059, 9258, 29320, 43877, 40424, 12964, 5738, 15172, -3194, -8494, 6358, -12428, -16043, -11691, 47041, 95834, 80222, 109227, 70036, 30633, 38334, 24827, 34152, 64553, 51519, 17016, 11523, 41142, 52892, 54302, 53411, 25556, 11242, 45479, 39944, 18200, 15164, -6541, 2928, 74414, 100284, 88519, 42457, -14385, -8869, 24134, -3825, -2971, 54853, 89414, 111185, 99371, 72266]
11293G2266k3943o174J1794J1473m0609k2607K9246J9704K1236j918j0101L5928
11281I6295j310m2398m3597j281J7033o687L4130N3185p84m2286k2499J6714j0114
11268D6401k489q128l1724j749J5199L9036J2684l8074n6326j7006q51J0884N2695
11255B0552K338K338L1887j7756j8991j8168k0833L0326K8913J4472k4372l2276
11243a570L259R102N443m997L6965l068j3008p1451m3711M3423K5491k235n0764
11230f7121j5820L4979K6930O0510N615K14L819L083j7283K0588k4487P542k0500
11217A8069k3977M9963K3761l93j9268l5893Q187K6976M6910k5517J9830m780
11205H3868k8061l341l3111k9264l0400j9232n266J2596M3604J1203k0341j322
$$ y = [72266, 48323, 42149, 53943, 65416, 24807, 2200, 31446, 51150, 72386, 70468, 60367, 96295, 94985, 52587, 8990, 7709, 24742, 18055, 52185, 105370, 104586, 62300, 39801, 56515, 46401, 43912, 35784, 4060, 2311, 17510, 56546, 69230, 31156, -25170, -42176, -43027, -32143, 20552, 22890, 25228, 57115, 39359, 20368, 2200, -18633, 11693, 40606, 55078, 30706, -1570, 1689, 10791, 16234, 11237, 48202, 45134, 32126, -39325, -83036, -39613, -14122, -16357, -67121, -82941, -47962, -21032, 39478, 45093, 45307, 49126, 52209, 34926, 55514, 31027, 38569, 18069, -5908, 44055, 67816, 67423, 48155, 12262, 20449, 47425, 94335, 68818, 88648, 83868, 55807, 52466, 19355, -9909, -40309, -59541, -64807, -52211, -8607, 2596, -17745, -19067]
11193a9067j2143j9464k955Q537N3667J3318l4749j4269J8666M1729J6355J0271
11181E9896k7141m7634J5199J1211K3278J9764R200J0062k6809m1945l8987O938
11169b6968O954m413k6889J3600K8822N30l429O924J4318J4306j5367M578N345
11156A8311L4345k0134m2147l8557K9570K9665K4309K1339m951n2380J866O5538
11144F6774K7443n409J3902m4103m7654q077L414K205k5400k5056O1369J7952
11132C7360K2030j4999k028m7893m8347j1788N3100M4892j2784J1909K7047l7634
11120B0865K038l094j297Q51K3518n358j8215m5424j8999J963M7491k0133o481
11107b2275j2931r782P0173K7753K586k854M926J8886k4294q06K9258m8893q3277
$$ y = [-19067, -31210, -50674, -53629, -45092, 8575, 21893, -12856, -27125, -8459, 33270, 49625, 59896, 32755, -14879, 320, 11531, 34809, 54573, 63773, 73835, 47026, 5081, -33906, -26968, -20014, -24427, -51316, -37716, -8894, -8364, -11793, -4869, 9449, 23755, 8388, 12966, 18311, 52656, 32522, -9625, -48182, -18612, 11053, 35362, 56701, 51750, -630, 1236, 66774, 94217, 88808, 102710, 58607, 10953, 2876, 6290, 8495, -16905, -41961, 19408, 37360, 59390, 44391, 42363, -5530, -53877, -65665, -12565, 32327, 19543, 31452, 58499, 20865, 22903, 19809, 18512, 19363, 42881, 37523, 19308, -26116, -45115, -43152, 4339, -15794, -22275, -35206, -44988, 25185, 52938, 55524, 52670, 57596, 76482, 52188, 51382, 80640, 31747, -51530]
11094e1530m087j0648n992J8174N637J5954M3176M204J4931k444m4721l3267J0930
11081c9683L1390k3631j2964N243M95K3784J8627K2547M9124r234O364l6824j6584
11068A8654R272o875J5076l9861l261M6020j84o9854n1032K6110L3377K5535K9750
11055C2727l186K6902M2770n47m0363r98l4079l02N0291N5714K4462k817q502
11042A42072M5309O035j9337L6368K8260j7695Q398o178j4149Q0522N6475M03
11030C46483r355m0130j5836J7862K1367J9585l332N6307M3178l4056r784K3767
11018D16056j7597j1532j2680K2333R269p9779m9948J1790J050K7212K5090l1587
11006C09677l7164q995n0546l7696m3564J0500K026K3254O941J2129m8373m0811
$$ y = [-51530, -55617, -66265, -72257, -54083, -48446, -32492, 10684, 14888, 29819, 27375, -17346, -50613, -39683, -8293, -31924, -44888, -39645, -39150, -15366, 3261, 25808, 74932, 65698, 72062, 35238, 18654, 27926, 21051, 36127, -3734, -6995, 39025, 38841, -31013, -82045, -55935, -22558, 2977, 32727, 29541, 56443, 99213, 98666, 58303, 57305, 23226, 22924, 73215, 128929, 153391, 150574, 142072, 187381, 193416, 174079, 210447, 238707, 221012, 229410, 223232, 209083, 289605, 346080, 346483, 337128, 296998, 281162, 299024, 320391, 339976, 336644, 392951, 436129, 402073, 392289, 416056, 398459, 386927, 374247, 396580, 405849, 326070, 276122, 287912, 288962, 316174, 341264, 309677, 272513, 263518, 212972, 175276, 131712, 142212, 144238, 167492, 174433, 186562, 138189, 97378]
10994I7378L915j7692r713p5689l1790Q745M6070M3453M554K0818O809j1790O873
10981I1941j0551M352l1369l1152J8727J3713j0043m175j0228J2608j3155K1202
10969E1870j775N5773L715m4346j3183j2791q01k2396J0119p774K7449J4378J6058
10956G6296N609j7452k6937l7814J375L4056L3950j9858M42L352k7045m6277L0333
10943A0030L6209j2141J4804k455l603k808j4750j0219J7187J8939J5128P602
10931G3923k4418Q920M685l2976j0048L0016P86J2180l3823j7174p220J1101L1467
10918D7419k1970k0999m1781k4220J1966K0827k4000m5673J3304N4679K4308J9997
10906A3857J8727L3510J1587k0148l587J1971K7131n6267n6978j1529k7646Q173
$$ y = [97378, 101293, 83601, 73888, -1801, -33591, -24846, 21224, 64677, 69231, 90049, 96858, 85068, 91941, 81390, 85742, 54373, 23221, 41948, 55661, 45618, 41443, 31215, 43823, 30668, 51870, 50095, 105868, 109583, 65237, 52054, 39263, 38462, 16066, 26185, 18411, 45860, 60238, 76296, 81905, 64453, 37516, -298, 1077, 35133, 69083, 49225, 49667, 53019, 25974, -20303, 10030, 46239, 34098, 48902, 46447, 42844, 40036, 25286, 15067, 32254, 51193, 66321, 73923, 49505, 58425, 63110, 30134, 20086, 50102, 50888, 63068, 29245, 12071, 4851, 15952, 47419, 25449, 4450, -37331, -61551, -49585, -28758, -52758, -98431, -85127, -30448, -6140, 13857, 32584, 66094, 77681, 57533, 53946, 65917, 93048, 36781, -20197, -31726, -59372, -51199]
10894e1199N0333J0023N270m159N471r330K9104L2227j7317m5467Q921o395j2069
10881d587J9712J3624L3094m222n1613l8720J4889k4615J1813J2225j2795k788
10869c3983K8617K3848K3073l037O657O399M5758N8543l0557n0306p85M3409K0679
10856A38315k7412m4851m3603N4632L4203o718n3100n1951k0961j825J0626J3880
10844A235N4124q582l4156K0986n788j9262K0589L1081K8781k0291k963j1379
10832E4375J6922l7339k7866K7714O993N681k0269j1990j1318l7816l2324J2886
10820e4351J0524K1134K3969k2020J8341J7150L7559r922K642r90j0653J957p853
10807B7487j4043k1685K1365R908J3272k9645q909L0346j9241k3935j1361L9823
$$ y = [-51199, -866, 9157, 14427, 10268, 15739, 6409, 35513, 67740, 50423, 4956, 13877, 7482, -4587, 15125, 28749, 61843, 57621, 6008, -32712, -17823, -42438, -30625, -18400, -31195, -33983, -5366, 18482, 41555, 38518, 45175, 51574, 97332, 155875, 125318, 75012, 74227, 117636, 138315, 110903, 66052, 22449, 77081, 111284, 104566, 51466, -485, -21446, -23271, -12645, 1235, 55359, 46777, 12621, 33607, 27819, 8557, 29146, 60227, 89008, 68717, 65754, 54375, 71297, 33958, 6092, 33806, 40799, 46480, 26211, 14221, 2903, -34913, -67237, -54351, -43827, -22693, 1276, -20744, -2403, 14747, 52306, 42384, 45026, 44036, 33383, 35340, 27487, 13444, -8241, 13124, 23032, 36304, 6659, -2250, 28096, 8855, -15080, -26441, 13382]
10795A3382J7406J5721o716l0409l8244M53k0906J8172K1609K3287J1778K113
10783B7646l7558j613K7343j617P290J7730J1462M4817j8113n5401k6022j7590
10771b1626P066k1746l7381K3113K7788K2139m8929m3579L5897M145K9156J0335
10759a3622J780m2571R729o190k4472K0060L4331M4512j6723m8229m635L2781
10747a3249M168J6853K820J8969o1984l9249R130L0295J8628K8779Q693O975p550
10734B3278o964r548L3359r182j9976N516L2169L7983o305j52j0179N9755j5415
10721A14339l6440K997K808J7330L3512R305K1593n3368k6379q367J3674r274
10709H1730L0226K8618J7889L2413j5267M723J8248m045j5418j2236o474J5461
$$ y = [13382, 30788, 46509, 39793, 9384, -28860, -28407, -49313, -31141, -9532, 13755, 25533, 27646, -9912, -11525, 15818, 14201, 21491, 39221, 50683, 95500, 77387, 21986, -4036, -21626, -14560, -36306, -73687, -50574, -22786, -647, -49576, -93155, -57258, -53113, -23957, -13622, -11842, -54413, -44684, -50874, -75346, -55286, -20955, 23557, 6834, -41395, -46030, -13249, -9081, 7772, 10592, 29561, -32423, -71672, -62542, -32247, -13619, 15160, 23853, 30828, 23278, 16314, 6766, 40125, 30943, 10967, 16483, 48652, 86635, 80330, 80178, 69999, 129754, 114339, 77899, 80896, 83704, 101034, 134546, 143851, 165444, 112076, 85697, 77330, 91004, 81730, 111956, 140574, 158463, 190876, 175609, 180332, 198580, 194535, 179117, 166881, 160407, 175868]
10697A75868l536j3856n5607k4755n275N6699O852l3227J6029K187M4164O046
10685A71589j2090q6626j7410L4451M3881J5242J7573m1964K4718R827N727M5314
10673B10232J2281K0735K8320J2566k4807j7348m537j48k2386P629K3428K4684
10661B70649J5890J7299L6713R8954P929J8307O5389L7508J4536K5975M9161J1026
10649F69336j811j5389J7128N1802k8303K995J5328M1460J18981P4174J25358
10638A071059J82839K06593K04823J65259J65428K00617K50569K98691L01043
10629C046921K86278L42375M70555O71032R28383J196216J613774K082332K358710
10620A2996576K430651K187254J850123J613283J579520J670149J776728J720892
$$ y = [175868, 172332, 158476, 102869, 78114, 72839, 129538, 136390, 103163, 119192, 121379, 165543, 171589, 159499, 72873, 55463, 89914, 133795, 149037, 166610, 124646, 149364, 159191, 164918, 210232, 222513, 243248, 271568, 284134, 259327, 241979, 237442, 237294, 214908, 222537, 245965, 270649, 286539, 303838, 340551, 439505, 447434, 465741, 531130, 568638, 583174, 609149, 658310, 669336, 667525, 652136, 669264, 721066, 692763, 695758, 711086, 752546, 871527, 945701, 1071059, 1253898, 1460491, 1665314, 1830573, 1996001, 2196618, 2447187, 2745878, 3046921, 3333199, 3675574, 4146129, 4817161, 5745544, 6941760, 8555534, 10637866, 12996576, 15427227, 17614481, 19464604, 21077887, 22657407, 24327556, 26104284, 27825176]
10612B7825176J496840J713322K473018L288512L516423K983613K242366J846165
10604D7385435J880124K152683K144782J470926M79251L86778J481790K833233
10596F0215002L149265K335667J418190J048315J110908J193086N98022r42601
10588G0125854l023733l882352k984647j497484o41287o83430r36392q58376o65508
10579E4952645n98788j023783k234538l616623m056019l490261k534384j870493
10571C5527756j534913j382156j274040j176512j234050j520571k039209k570903
10563B2795402k769631k509005k142601j652718j272507j034615q06006o38767
10555I969552n69070n03785m20749l76077l29217l21473l16385k93246l00361
$$ y = [27825176, 29322016, 31035338, 33508356, 36796868, 40313291, 43296904, 45539270, 47385435, 49265559, 51418242, 53563024, 55033950, 55513201, 55899979, 57381769, 60215002, 63364267, 65699934, 67118124, 68166439, 69277347, 70470433, 71068455, 70125854, 67102121, 63219769, 60235122, 58737638, 58096351, 57412921, 56476529, 55618153, 54952645, 54353857, 53330074, 51095536, 47478913, 43422894, 39932633, 37398249, 35527756, 33992843, 32610687, 31336647, 30160135, 28926085, 27405514, 25366305, 22795402, 20025771, 17516766, 15374165, 13721447, 12448940, 11414325, 10608319, 9969552, 9400482, 8896697, 8475948, 8099871, 7770654, 7449181, 7132796, 6839550, 6539189]
10546F539189l06599k70152j97895k33239j75784j80918j79500j30826j49453
10537D714823j51259j83562j51132j40741j45945j56792j35580j16993p3225q6703
10527C372891q7344o4304q0520q5485p5828j22901m3017o2701n0139p5659o6704
10516B558289p4005o3699j08737o7848n6412p1061p4797l3151l9949k9012m8307
10505A891311o1048m8387j1251K432o5597m7900n7648n3113n3160k7560p9046
10494A389033l7512q1495n6009k2568k529N810l8931n9924l2918j8203o6529l0091
10482I48134l1037J6683j5701k1485J0869J5837j075k3551j8578p9100m9692p3383
10470F77921m55N5295J9948n6138j3946j0141r964K3232k1683j0594l410J6630
$$ y = [6539189, 6232590, 5962438, 5764543, 5531304, 5355520, 5174602, 4995102, 4864276, 4714823, 4563564, 4380002, 4228870, 4088129, 3942184, 3785392, 3649812, 3532819, 3459594, 3372891, 3285547, 3221243, 3140723, 3055238, 2979410, 2856509, 2813492, 2750791, 2700652, 2624993, 2558289, 2484284, 2420585, 2311848, 2244000, 2187588, 2116527, 2041730, 2008579, 1968630, 1939618, 1891311, 1830263, 1781876, 1770625, 1773057, 1707460, 1659560, 1601912, 1548799, 1495639, 1468079, 1389033, 1351521, 1270026, 1214017, 1191449, 1188920, 1194730, 1155799, 1095875, 1062957, 1044754, 978225, 948134, 917097, 933780, 918079, 896594, 907463, 923300, 922225, 898674, 880096, 800996, 751304, 677921, 677466, 732761, 752709, 696571, 682625, 672484, 662520, 685752, 664069, 653475, 650065, 666695]
10458F66695J8815n8401j9022n230J3689J9622k1221q1042m3676J3715j4924j1858
10446D77162o287L0207J1630K3188Q584j2750j3090j6456k9308O058j4064j8816
10434D46058k0430P117k2254l4103l1620K9587Q727k2617J1195M024j5565n365
10422C54754J4446J3415m4735o1569l1395r148L3559L6473J4304J0113O663k8284
10410C08596j5344M621J3978J170n8639m2081o989L1002J1935n0815j2235J1770
10398A96969N360J1578J9238N304p664l8761r1j9237K2425j037N0053J0267m0529
10385B13875j7333k5338N579K834K3035p322K420k1273j8487J6260L6975L5689
10373B46914l748m7159l8929N987J2034K3604K7017j683k1519n4615M8L4825l3919
$$ y = [666695, 685510, 627109, 608087, 602857, 616546, 636168, 614947, 533905, 490229, 503944, 489020, 477162, 470875, 501082, 512712, 535900, 544484, 531734, 518644, 502188, 472880, 478938, 464874, 446058, 425628, 432745, 410491, 376388, 344768, 374355, 383082, 360465, 371660, 375684, 360119, 354754, 369200, 382615, 337880, 276311, 244916, 235768, 269327, 305800, 320104, 330217, 336880, 308596, 293252, 297873, 311851, 313021, 254382, 212301, 205312, 236314, 248249, 197434, 185199, 196969, 202329, 213907, 233145, 238449, 230785, 192024, 191933, 172696, 195121, 194084, 244137, 254404, 213875, 196542, 171204, 176783, 179617, 202652, 195330, 197750, 176477, 157990, 174250, 211225, 246914, 243166, 196007, 157078, 163065, 175099, 198703, 225720, 224037, 202518, 147903, 147951, 182776, 148857]
10360A48857l4180K2954K8426M1456n142k2969o1296m68K6190N101J5469J4048
10348A78446m3907j9164m36N1030L3067l9581r146J4958L338k8740m5439K4825
10336A19251L102J3738N468K4068n466m3191k9767J8623K6050J4031l2161K791
10324A16537k0294j674M4707N974J4386K3934N2724L8081l9645p9381j4783k1031
10312A19535m7627K976K3655N711K7865L492l5648K3017M295n015k6603M219L351
10299A03223J9298J8472m2508l7428K0537K8849O716P931j4511j938Q345l3386
10287H3600r227r706J9794k5332P22l838k4926L8531K6118K8160m8585l4726l122
10274C7463L3163J2182k6578m5772k0052L875N278j9341n671J9179m400K492L868
$$ y = [148857, 114677, 137631, 166057, 207513, 202371, 179402, 118106, 117638, 143828, 148929, 164398, 178446, 134539, 115375, 114939, 165969, 199036, 159455, 150309, 165267, 168605, 139865, 94426, 119251, 122353, 136091, 141559, 165627, 160161, 116970, 87203, 105826, 131876, 145907, 113746, 116537, 96243, 94569, 139276, 145250, 159636, 183570, 236294, 274375, 234730, 155349, 140566, 119535, 71908, 74884, 98539, 104250, 132115, 135607, 99959, 122976, 127271, 122256, 95653, 99872, 103223, 122521, 140993, 98485, 61057, 81594, 110443, 117159, 125090, 110579, 108641, 116986, 83600, 74373, 64667, 84461, 59129, 59851, 56013, 31087, 69618, 95736, 123896, 75311, 40585, 37463, 70626, 82808, 56230, 10458, -9594, -5719, -441, -19782, -25453, -6274, -10674, -8182, -4314]
10261d314M0672M1000Q678K3420J8021l4041l1332n4M751j7419j3910j7868k5213
10248g609L8568J5811J465m5045L2734L2228o4958k4557N4143L8496q446P337
10236G0167o929m0263l07J3360K2536q502j2062k388K6227L8428n155l6835l3349
10223B4928j1865p617R890K8000k8052M521M5712L6038K4016j1290m842L779r371
10210A03847m7646Q868K8965M4967r423j9326k8408k8952m037o492q700l407p946
10197B2310j7152j875J9419K108J7193Q26q107r653K7008P1603j1931k6044K7199
10184A12904R520J3909j9962K3141K0397N306O0505l962l3157M7575J08j7016
10172B19268p436N0598L6391j2845k3878K1425L6891J5638j8456j8410O4847M3287
$$ y = [-4314, 36358, 77358, 86036, 109456, 127477, 93436, 62104, 62050, 66801, 49382, 35472, 17604, -7609, 30959, 46770, 48235, 3190, 35924, 68152, 3194, -21363, 32780, 71276, 62830, 70167, 63238, 22975, 22668, 36028, 58564, 50062, 38000, 35612, 61839, 100267, 95112, 58277, 24928, 13063, 5446, 15336, 43336, 15284, 19805, 65517, 101555, 125571, 114281, 109439, 113218, 103847, 56201, 65069, 94034, 139001, 129578, 110252, 81844, 52892, 48855, 42363, 33663, 30256, 22310, 5158, 3283, 22702, 24810, 42003, 42829, 34722, 25069, 52077, 123680, 111749, 85705, 112904, 122424, 136333, 116371, 139512, 159909, 165215, 225720, 221758, 188601, 236176, 236284, 219268, 211832, 262430, 298821, 285976, 262098, 283523, 320414, 336052, 317596, 299186, 364033, 407320]
10160D07320K3039L563M185M2679J0883K7644k5943l3777o2854k7888m9099R053
10148C28805N4322k8442l7958O059j0625J4533q709j1198J5584j8827l7682l7118
10136B28744J1374o506j8214j3368j0872k6227J9980p064P444j5652k9117k8617
10124A11905K229l9732j5377Q954O597k1174k9604j9179N0297K5315J3574n922
10112H7883k0464k1341j9243J9200L8978l030j1583M7667J4712j1180o6776k3189
10100C1634J7082r774k2083j4893j3320O077K4696l871K21o8207k6957K6840K6719
10087b5836L8871N3808L0520l8485n1795l60M437Q242k1754M33J841J0412M231
10074A4565j766r059J222J2332K1454L3545Q426l0233o056J7049J9854p942j65
$$ y = [407320, 430359, 433922, 438107, 480786, 491669, 519313, 493370, 459593, 396739, 368851, 319752, 328805, 383127, 354685, 316727, 322786, 312161, 326694, 317985, 306787, 322371, 303544, 265862, 228744, 240118, 233612, 215398, 202030, 191158, 164931, 184911, 177847, 185291, 169639, 140522, 111905, 114134, 74402, 59025, 67979, 74576, 53402, 23798, 4619, 54916, 80231, 93805, 87883, 67419, 46078, 26835, 46035, 85013, 81983, 70400, 118067, 132779, 121599, 54823, 31634, 48716, 38942, 16859, 1966, -11354, -5277, 19419, 15548, 15769, -52438, -79395, -52555, -25836, 13035, 66843, 97363, 58878, 7083, 6723, 11160, 19402, -2352, -1919, -78, 10334, 14565, 12799, 3740, 4962, 17294, 38748, 72293, 80719, 50486, 44430, 61479, 81333, 73391, 73226]
10061G3226J5862P04J1995K5766Q665J0744l7732l0454j9952k0717n8306K171
10049a8028O2470J8985M87L3526K9025l9191n3245Q601L7436N424o9390j5052
10037A048J0319J6711JK7140k4075K1492J2255j5510l8782j2710j4589M3496O3474
10024I0270l1151o9600l7807j7686K7750K9762M1491K053J0493k1822p434M371
10012B0690K135q798L0454l5364L782K7471K6010K7175M347q9533n0797R393L5605
9999B570K0786k1781k3027K3779J8805k2258N735K4904J8518k1742J5400N5273
9987I6962Q324j7200m0j3622l2113m2409q120k7288j4445N4807J4364k5655O145
9974b90K7445J7206K0023l429l0245J7978P403N733l2920k9036K3450L8630q264
$$ y = [73226, 89088, 89792, 101787, 127553, 136218, 146962, 109230, 78776, 58824, 38107, -20199, -18028, 44442, 63427, 63914, 97440, 126465, 87274, 34029, 42630, 80066, 85490, 16100, 1048, 11367, 28078, 28079, 55219, 31144, 52636, 64891, 49381, 10599, -2111, -16700, 26796, 90270, 59119, -10481, -48288, -65974, -38224, -8462, 33029, 35082, 45575, 23753, 16319, 20690, 22825, 14027, 44481, 9117, 12899, 40370, 66380, 93555, 97902, 8369, -42428, -33035, 2570, 23356, 1575, -21452, 2327, 21132, -1126, 4609, 29513, 48031, 26289, 41689, 96962, 105286, 88086, 88046, 74424, 42311, -98, -8218, -35506, -49951, 4856, 19220, -6435, -290, 27155, 44361, 64384, 60955, 30710, 48688, 56091, 61824, 28904, -132, 23318, 61948, 53684]
9961E3684M894m190k0838j8099l1986J2727J9561M055M2088K6656l1333j3109
9949D4110J5007J8256n052l468J1737%l2260k592k3800L5110J2114k4197l0299
9936A4666K80J2085N162L22p483N390p314N232k0533R984K0854n676l7519P433
9922B883K232L462M5918M2921N115m4392k5104K468J4377M5093R496k9538k1421
9909E3510k6944j741J5513m747M135O327L338j7468r482j3115j2653k7348K397
9896b8278K2844L761n73J559L0236J7536m754j8113j8378M7224K0706M738r299
9883F9209Q687o147k4123l723R34L3267k7721M4113m294J72N347O606r142m4266
9869D8919l9312k1875L0981o2k8246l6998n136K1439N292q994M5621L6623L8241
$$ y = [53684, 58578, 54388, 33550, 15451, -16535, -3808, 15753, 19808, 61896, 88552, 57219, 44110, 59117, 77373, 72321, 68853, 80590, 80590, 48330, 45738, 21938, 57048, 69162, 44965, 14666, 14946, 27031, 32193, 32515, 25032, 30422, 23108, 28340, 7807, 17791, 38645, 32969, -4550, 2883, 5115, 8577, 54495, 97416, 102531, 58139, 33035, 35503, 49880, 94973, 104469, 74931, 53510, 26566, 24825, 40338, 35591, 39726, 46053, 49391, 31923, 22441, 9326, -3327, -30675, -28278, -5434, -1673, -2246, -687, 29549, 47085, 42331, 24218, 5840, 53064, 73770, 78508, 69209, 77896, 71749, 47626, 43903, 44837, 78104, 50383, 94496, 90202, 90374, 95721, 102327, 93185, 48919, 9607, -12268, 18713, 18651, -9595, -46593, -51729, -30290, -24998, -33992, 11629, 48252, 86493]
9856H6493k8556n1560L9603J5340R799j2316k7504k2369Q645L035l4662J9742
9844E690M8130K7118k0810J5868J4643K060o0931k7908K5353K5159K2407l5510
9832D1269l65K1828K5631k5864o3345n0190J1116N034N7118J2210L732k0441n2460
9819c4727M0659L8169K8362L2724J278q399n4330K6789K9232q908k0293l6488
9807C4068k4781n06J5601m694L2122K0141l5171k628K9198k7654l8089k2j6741
9794a9156l7190M3106P2985k7721k3963l014k3128K2663K3341L6517j0133K099
9782E6406l9758m6453J6030K2018M3761J1957j3356n6261j1164J4540O2252j8662
9770D1310p3540j6853j1399Q787J7427L6469K4990k7824k6232J8532N4181j8500
$$ y = [86493, 57937, 6377, 45980, 61320, 71119, 58803, 31299, 8930, 17575, 20610, -14052, 5690, 53820, 80938, 60128, 75996, 90639, 92699, 31768, 3860, 29213, 54372, 76779, 41269, 40904, 62732, 88363, 62499, -846, -51036, -39920, -34886, 22232, 34442, 38174, 17733, -34727, 5932, 44101, 72463, 105187, 106465, 98066, 43736, 70525, 99757, 90849, 70556, 34068, 9287, 8781, 24382, 19688, 51810, 71951, 36780, 34152, 63350, 35696, -2393, -2415, -19156, -56346, -13240, 59745, 32024, 8061, 5047, -18081, 4582, 27923, 64440, 54307, 56406, 16648, -29805, -13775, 8243, 52004, 63961, 50605, -5656, -16820, -2280, 59972, 41310, -32230, -49083, -60482, -51695, -34268, 2201, 27191, -633, -26865, -8333, 45848, 27348]
9758B7348R782N1121J7053o3218l5760N054n60J4089k6208P425j3508j7912n9734
9745h5028J3593P7700M0116J6478j2504J2404m4346k8971L258l2195m944j4254
9733e8693Q913J4137L2428Q047j575k892l6697o015M0569K096L9046J9759l824
9720E5299j9157K776j1036p496n4455k2330l600K0196J2732k701J2093K8091K7588
9707C8000P267m509k0812k46M4608M1157o6609j3886J9058L3356J0359l783k3083
9694F0877n4532P119M5220j9339o8802m904J6917M019O1544M5629k5370k3015
9682D5363L084n955l828K934J9594p190l5449n844J1950k9428P626K432j8088
9669a2799O556j5533j0081M782J8833L1384N6320K0694m4477k2334n120l7598
$$ y = [27348, 37130, 88251, 105304, 42086, 6326, 11380, 10820, 24909, -1299, 6126, -7382, -25294, -85028, -71435, 6265, 46381, 62859, 50355, 62759, 18413, -10558, -7300, -39495, -44439, -58693, -49780, -35643, -3215, 4832, 3257, 365, -36332, -42347, -1778, 318, 39364, 59123, 55299, 36142, 38918, 27882, 20386, -34069, -56399, -59999, -39803, -27071, -29772, -17679, 10412, 38000, 45267, 40758, 19946, 19700, 64308, 105465, 38856, 24970, 44028, 77384, 87743, 83960, 60877, 6345, 13464, 58684, 39345, -29457, -34361, -17444, -13425, 48119, 93748, 68378, 45363, 48447, 42492, 38664, 41598, 61192, 54002, 18553, 12709, 24659, -4769, 2857, 5289, -12799, -6243, -21776, -31857, -27075, -8242, 23142, 79462, 100156, 55679, 33345, 28225, -9373]
9657i373Q893q120M555J1042k41K7164J2199p705o6132k0418L6406j800j6122
9644b9652L9086M5302M019K4816J8508m4030m6207j6816j4626k9747k372M1250
9632a0469p382L169J7551o776K1548M025k7603n884J2796L9526n28j1714R539
9619C7798J1442k2802J0075k7730k3595q22J5848j5270l8084k538r328L6981N1470
9606B3445L5237k099m6371l288Q089l1429m1953j6246J5311M1798M3670J7392
9594D3556n9109J809J1467j1694k2811K3486J5187p806p621L6466K4042J5506
9582F2478p4743m0078K1242J6178K8440j378K0194j009j4766L3162K6700k9342
9570D7078l5257k1524K631K2939o019o124M4473j2978p7338o0529R284P1227L8357
$$ y = [-9373, -480, -8600, -4045, 6997, 6756, 33920, 46119, 38414, -27718, -48136, -11730, -13530, -29652, 9434, 54736, 58755, 83571, 102079, 58049, 11842, -4974, -19600, -49347, -51719, -10469, -17851, -14682, 2869, -3907, 17641, 21666, -5937, -11821, 975, 40501, 39973, 28259, 37798, 49240, 26438, 36513, 8783, -14812, -15634, 214, -15056, -53140, -55678, -65006, -28025, 23445, 58682, 56583, 10212, 6924, 15013, -16416, -58369, -74615, -59304, -17506, 26164, 43556, -15553, -13744, -2277, -13971, -36782, -13296, 1891, -5915, -13536, 22930, 46972, 62478, -12265, -52343, -31101, -14923, 13517, 12139, 32333, 31324, 16558, 49720, 76420, 47078, 11821, -9703, -7072, 15867, 9848, 3724, 48197, 35219, -42119, -102648, -93364, -22137, 16220]
9557A6220R713J140K6679M4787q919k714J7951n98k4001j0658j3011k3076j1513
9544B2000L2209j1622l0667j2685j0541J4145j0460k6980j112K9169J4444N824
9532A3724n089l4493J1866J6004L620n83L0472J3769k5476l1168j0644J8820J1791
9519A2613K6109j1495k2022M834N2337L6121k0115m8704p082n141j3713N286M1084
9506E0112j8258l3045l5782P4823M6939j9185R393N3009j3363n9809j3168J5435
9494E7101J4831J8486N2770j7933l7423n730J2582J1171Q940j2228k5122r932
9482F7513p218n6749o497K1462M216j117j196J8004J9585K0002l355o5186j3613
9469d149N1756k5624j2812K4193L248P056l4051k0779j8146j8311q796K0768N7260
$$ y = [16220, 25933, 27073, 53752, 98539, 89620, 86906, 104857, 104259, 80258, 69600, 56589, 33513, 22000, 54209, 42587, 11920, -765, -11306, 2839, -7621, -34601, -35713, -6544, 7900, 13724, 8635, -25858, -13992, 2012, 5632, 5049, 35521, 49290, 23814, -7354, -17998, 822, 12613, 38722, 27227, 5205, 10039, 62376, 98497, 78382, 29678, 22596, 17455, 3742, 9028, 50112, 31854, -1191, -36973, 37850, 84789, 65604, 74997, 128006, 114643, 54834, 41666, 57101, 71932, 90418, 143188, 125255, 87832, 82102, 94684, 105855, 114795, 102567, 77445, 67513, 60295, 3546, -2951, 18511, 22727, 21610, 20414, 38418, 58003, 78005, 74650, 9464, -4149, 47607, 21983, 9171, 33364, 36612, 43668, 9617, -11162, -29308, -47619, -56415, -35647, 21613]
9456B1613P276J2238l6169k0282k7433J3681j2353J0899K8179j4369l0551L6307
9444a0964L1088P86J2141J9521j9739k0495k5624m8884J5563N7828J0403k8548
9432f924j1987k3901K1223K2016j7260K9421n738Q193J3978J8696k536j9790j6224
9419I167K043j4092L5642O8913j6705n7313l4453Q914J6056m1540m5641l4939
9407a03948J4052K1262L874K8170N3252J5328j3121j7601q198J0568l107l469
9395b938K1597J5028K6334j5544n551o455J5928Q784r720L3401J4636j9844l3382
9382D2274l4428l3304k9187L5745L5367j560P98j5309M352J5486j8553J3188O253
9369B1122j6969L9702l351p413K0836k885k1757k8720o893M4317M2076k092k3311
$$ y = [21613, 28889, 41127, 4958, -15324, -42757, -29076, -41429, -30530, -2351, -16720, -47271, -10964, 20124, 20910, 33051, 52572, 32833, 12338, -13286, -62170, -46607, 11221, 21624, -6924, -18911, -42812, -21589, 427, -16833, 12588, 6850, 15043, 29021, 47717, 45181, 25391, 9167, 11210, -2882, 32760, 101673, 84968, 27655, -6798, 2116, 18172, -23368, -69009, -103948, -89896, -68634, -64760, -36590, 16662, 31990, 18869, 1268, -6930, 3638, 531, -2938, 18659, 33687, 60021, 44477, 38926, 32471, 48399, 57183, 47463, 80864, 95500, 75656, 42274, 7846, -25458, -54645, -18900, 16467, 14907, 15705, 396, 4748, 20234, 1681, 14869, 21122, 4153, 43855, 40504, 33091, 53927, 51042, 29285, 565, -6328, 37989, 80065, 77973, 54662]
9356E4662j7331k6602k8796J6325J02K8210k6163k3897L21L9052K3365j760k8008
9343I480j9396K2554M0632L4757Q745J9946n2635k9546p321l763N1809k107o444
9330F6711k3118J3413m3342k5312K4608O3951M0871j7228l0243m6855N151K8398
9318E7005k793j9119k8359K2626K5279j1151o1522M35k0661K6338L5421L5566
9306E9065J109n0854K5485J4647l6233o2407m1518L3058N2740L6858M4448j0869
9294F5529o5140K127L7698M655k4305K6013P386n287k3407J3096J8545j0521p547
9281C8842p85k7688j9396L670n036m91k57n623m635K529M3692M9993k2233J4401
9267F6983k6420J2073L983j4291l7089j8826p833o0546k3337N1336J8059M3117
$$ y = [54662, 37331, 10729, -18067, -1742, -1640, 26570, 407, -23490, -23169, 15883, 39248, 37488, 9480, -9916, 12638, 53270, 88027, 96772, 116718, 64083, 34537, 27216, 23453, 75262, 73155, 66711, 43593, 57006, 13664, -11648, 12960, 76911, 117782, 100554, 70311, 23456, 28607, 57005, 54212, 35093, 6734, 29360, 54639, 43488, -18034, -17599, -38260, -11922, 23499, 59065, 60174, 9320, 34805, 49452, 13219, -49188, -90706, -57648, -4908, 31950, 76398, 65529, 389, 2516, 40214, 44869, 20564, 46577, 53963, 48676, 25269, 38365, 56910, 46389, 38842, 38057, 10369, -9027, -5357, -10393, -10884, -11141, -16764, -21399, -18870, 24822, 74815, 52582, 66983, 40563, 52636, 56619, 42328, 5239, -13587, -21420, -81966, -105303, -53967, -35908, 7209]
9255G209M6040j618J443p010k4085l4680k2536J3765M0500L2295j7743K931J6254
9242E2765M670j9109n7127l3857J6991j0394j0894o194L9168O0688K3850M459
9230F5016l0353m1433j325M115l0793J7674L0918n781M5900m121m3592k6318J1801
9217h292K2254K1552L5982o803k9749q5265o118M3729q321j3956o5517M6926K3691
9204b9887j5687j6492J3032Q32L41r468L0076P012k980M6904r660j2202M2009
9191D3830K5022k9916o6575l6052l057J2248L8228l1285k0593R616l2599J0078
9179h1055J9814N2430J5201j2792m1819k2086J7756N2871K4631o573R755K1368
9167D9501j0622r026l3650o007j5006k4682k0676j3482J0494J9464p385L8192
$$ y = [7209, 53249, 51631, 53074, 46064, 21979, -12701, -35237, -21472, 19028, 51323, 33580, 36511, 52765, 57435, 38326, -18801, -52658, -35667, -46061, -56955, -63149, -23981, 36707, 60557, 65016, 34663, -6770, -8095, -3980, -34773, -17099, 13819, 8038, 53938, 49817, 6225, -20093, -8292, 13962, 35514, 71496, 64693, 34944, -50321, -56439, -12710, -21031, -34987, -100504, -53578, -29887, -45574, -62066, -49034, -48202, -47861, -57329, -27253, -20241, -23221, 23683, 14023, 1821, 43830, 68852, 38936, -27639, -63691, -66748, -54500, -16272, -47557, -68150, -58534, -91133, -81055, -61241, -8811, 6390, -6402, -48221, -70307, -52551, 320, 24951, 18378, 28133, 49501, 38879, 29853, -3797, -9804, -24810, -49492, -70168, -83650, -73156, -53692, -61077, -22885]
9155b2885M5838Q93k192O033k7482n723j9575j4677l0885l94M416n392L6450M1414
9141E839K1676M697K3168J6869j9217l9041k9988J5822J576l2900p394P580r637
9128d0950J5568j0014Q431K845J3840L1487l5836m5739K3647q489l972K0156L8288
9115I262K0229N302p12L6744L1075l4161o2241q370p393K7802J2333p988L2291
9102E4173L977J3921r811n393J521n5193L515J8167l502k1330K6408L3999j3830
9089D6622k5846n323K6408K5278m0572Q879K0876N708K7363k7474k1705j1878
9077B8336j9520j9257J8552L2435j2708k0071j5769J5109Q817K597P83J4059k5012
9064H351k5760n623q93k133l5633j5084K5158J3726J6571L1712j5479k8857J4934
$$ y = [-22885, 22953, 23846, 21654, 27687, 205, -5518, -25093, -39770, -70655, -71049, -66633, -72025, -35575, 5839, 27515, 32212, 55380, 72249, 53032, 13991, -15997, -175, 1401, -31499, -38893, -31313, -40950, -25382, -35396, -26965, -24120, -10280, 21207, -14629, -60368, -36721, -45210, -49182, -29026, 9262, 29491, 34793, 34081, 70825, 101900, 67739, 5498, -2872, -10265, 17537, 29870, 21882, 54173, 58150, 72071, 62260, 56867, 58388, 3195, 6710, 24877, 21375, 45, 26453, 60452, 46622, 20776, 15453, 41861, 67139, 26567, 35446, 56322, 62030, 89393, 61919, 40214, 28336, 8816, -10441, 8111, 40546, 27838, 7767, -8002, 7107, 15924, 18521, 19304, 33363, 8351, -17409, -23032, -23925, -26058, -61691, -76775, -51617, -37891, -21320, 10392, -5087, -33944, -19010]
9051a9010j196M4439M2538l2929k1127j7196j2791M4906K6893J2105N4914k2935
9039I8611n1070K0178O967j1034K832J0186j6160l3463j9090o603j6424j2261
9027b7331j1835j1905L4672L40m943l535l2351o373M9815K1596k6573j9709L8786
9014F54J5140M043j1887j509j5957J4535j3531l5110j8442j9851J8101J7397J4850
9001c1567J4051K2773K6078j4835l5036o761j5406r554Q350Q432J8260J8635l1171
8988b7751Q207L1258m6897r257J8785P039L907J3956j4534J6288p895j2224P944
8975a1174n303L0014j1871j1146K1949K2940O129j1087J939K912K9098K6182o686
8962H3896k0791k8875q073M8822q905k1460Q432K6368m342l875j1715j1842k2635
$$ y = [-19010, -20206, 24233, 66771, 33842, 12715, -4481, -17272, 27634, 54527, 66632, 121546, 98611, 47541, 67719, 74686, 63652, 66484, 76670, 60510, 27047, 7957, 1354, -15070, -27331, -39166, -51071, -16399, -16059, -21002, -24537, -56888, -63261, -13446, 8150, -18423, -38132, 654, 15794, 19837, 7950, 6441, -9516, 5019, -8512, -43622, -62064, -81915, -63814, -46417, -31567, -17516, 5257, 31335, 16500, -18536, -25297, -40703, -50257, -41907, -33475, -15215, 3420, -27751, -19544, 11714, -35183, -44440, -25655, -18616, -14709, -753, -15287, 1001, -6894, -19118, -11174, -16477, 13537, 1666, -9480, 12469, 35409, 41538, 30451, 32390, 35302, 64400, 90582, 83896, 63105, 34230, 26157, 74979, 66074, 44614, 53046, 79414, 75072, 71197, 59482, 47640, 25005]
8949B5005k2366J3220j1213k5382j2989k2524N4568L1528J2907J4327k4549k3286
8937I246j7733o53N322K409L943K0119j144M078K1264K6598R745j9457l1597k0331
8923A1809p05K9592p770o1847r071j0919k8300M7525M7230N03k2407O672j3642
8910a1330m7379l2218J2088M4066k221J697K2697j5541J3376J1403l9215O007
8898c6570K6139q794q621J3644M243J888j0426J0376O236N61K6681m0808k3607
8885c9058K5260j2819R974k1556N246M3025Q124p272Q835J6909k2512j4211N247
8872E192n134k7438J7132L249p575j149J0277K4944J8758k804M303K29k1997j3192
8858D795J0566K3306N531j8571l6956j8038j4385J1729K0679J1442k7128J2461
$$ y = [25005, 2639, 15859, 4646, -20736, -33725, -56249, -1681, 29847, 42754, 57081, 32532, 9246, -8487, -9140, -3818, -1409, 2534, 22653, 21509, 25587, 46851, 73449, 83194, 63737, 32140, 11809, 11104, 40696, 32926, -28921, -37992, -48911, -77211, -29686, 17544, 18047, -4360, 2312, -11330, -58709, -90927, -78839, -34773, -36994, -35297, -12600, -28141, -14765, -3362, -42577, -36570, -10431, -19225, -27846, -14202, -9959, -8071, -18497, -8121, -1885, -1324, 25357, -15451, -39058, -13798, -26617, -16643, -38199, -32953, 10072, 18196, 10924, 19759, 36668, 14156, -55, 5192, 58, -27380, -10248, -6999, -14574, -15723, -5446, 19498, 38256, 35452, 39755, 39984, 17987, 4795, 15361, 38667, 44198, 25627, -11329, -29367, -43752, -32023, -11344, 98, -27030, -14569]
8846a4569J8014J0121J2935L0851O607o996j9202J8402l9740r581n019j8781M566
8833a2392J6963N9129l4639m9944K9383j5204l769q227J4278M963k6989k3602
8821e0050o648j4620M4421J7670j8030J4925k6397j1828l579K1655J0588L1593
8809I700j3183o877j4090Q3554j1419m9028K2640k0350N383M4453j231j8259j867
8796B9426K4588l0374j5111m759J2048K1145q070l029K0726M7146j5184m1695
8784C6857j2657J4418k9134k9433K8668K7360l0488k0538j4009k5614J1063R071
8772c4436K8563R165k9247k4491J6819L1729o971m1308n895K0870K6395l6098
8760d4905n174J0646n071o56j0324p555m0233J4030J1782N073j2439O480o913
$$ y = [-14569, 3445, 13566, 26501, 57352, 63959, 56963, 37761, 56163, 16423, 6842, 1823, -16958, -12392, 4571, 63700, 29061, -20883, 8500, -6704, -10473, -18700, -4422, 541, -26448, -50050, -56698, -71318, -26897, -9227, -27257, -12332, -38729, -50557, -54136, -32481, -21893, 9700, -3483, -10360, -24450, 59104, 47685, -1343, 21297, 947, 6330, 50783, 49552, 31293, 29426, 54014, 23640, 8529, 3770, 15818, 36963, 28893, 25864, 46590, 93736, 78552, 36857, 24200, 38618, 9484, -19949, 8719, 36079, 5591, -14947, -28956, -54570, -43507, -34436, -5873, 3292, -25955, -50446, -33627, -1898, -8869, -50177, -56072, -35202, -8807, -44905, -50079, -39433, -44504, -45160, -55484, -63039, -103272, -89242, -77460, -72387, -84826, -78346, -85259]
8747h5259j072J7844N97J5645N8021L5633j7759K038L783k0848m0567k4625M2827
8734a3742J5201k3463j838L220l834j5845J1007K8114j6302J730L8938k52n3817
8721c0883P342j2553l3200K0687O5083J2566L1965k5775k6483q194l0849j2763
8709d3057K6598M006r29k7509j6849J568K2727k2446l6294L7901N1414p57n223
8696h850O1234j542L748l9093l3760l994K0365K3925j9467L0767N5148j9708P270
8683G6043K947j0316m135J594m0487n151k0222k1846J0014r561N872P949m8096
8670e5395N095N2272N3l7856J6899R273J6464J0822l5338N062N925m7283j4519
8657f8526L3347N4782N945l539l826r408m5401M993M6119J379J1512K9020J3902
$$ y = [-85259, -86331, -68487, -67890, -52245, 5776, 41409, 23650, 25688, 29471, 8623, -31944, -56569, -13742, 1459, -22004, -23842, -20622, -24456, -40301, -29294, -1180, -17482, -15752, 23186, 22934, -30883, -23541, -36094, -69294, -48607, 16476, 29042, 61007, 35232, 8749, 555, -30294, -43057, -16459, -12453, -13382, -40891, -57740, -56172, -33445, -55891, -92185, -54284, -2870, -3627, -8850, 52384, 50842, 54590, 15497, -18263, -22257, -1892, 22033, 2566, 33333, 88481, 68773, 76043, 78990, 68674, 64539, 66133, 25646, 20495, 273, -21573, -11559, -21120, -15248, -7299, -55395, -50300, 1972, 2025, -35831, -18932, -9659, 6805, 17627, -17711, -12649, -6724, -54007, -68526, -35179, 19603, 25548, 22009, 18183, 8775, -36626, -31633, 14486, 15865, 27377, 56397, 70299]
8644G0299j652k2365m2557n279J870j8931k4642j5298J6784L4264r062k7727N8646
8631A4350N370p592l361o452j6847j4431L3052j8853K3993l901n918l1070j4335
8618d5995J122N0734K0602l1567P064k6415J7397m534K4742P086j815j4024l3733
8605b9336j4940K760M5743m2053P022j0767p380J148L3067N0667N581J5877m7820
8592I569k8049o2463m7214L962N5284M7932K0790m7932K8198N7386o148l3528
8580b213J0604l9018j4167j7295j4548N452K4075J3047O018o189l467J1866O033
8567a9802N228K2426j797M5942l9180k2689j3227N0519k4784m7202k686O373K3130
8554a7749N2044j8754j3278j7621L6880L0269K712l034j0010M1174J8348l2436
$$ y = [70299, 68647, 46282, 3725, -1554, 316, -18615, -43257, -58555, -41771, -7507, -16569, -44296, 14350, 19720, 12128, 8767, 2315, -14532, -28963, 4089, -14764, 9229, 5328, -590, -31660, -45995, -44873, 5861, 26463, -5104, 1960, -24455, -7058, -11592, 13150, 20236, 18421, 4397, -29336, -44276, -41516, 4227, -37826, -30804, -41571, -48951, -47803, -14736, 35931, 41512, 57389, 9569, -18480, -80943, -128157, -124195, -68911, -20979, -189, -48121, -19923, 37463, 31315, -2213, 8391, -30627, -44794, -62089, -76637, -71185, -47110, -34063, -28045, -34234, -37701, -25835, -19802, -14574, 7852, 6055, 51997, 12817, -9872, -23099, 27420, 2636, -44566, -47252, -40879, -17749, 34295, 15541, 2263, -15358, 21522, 51791, 54503, 51469, 41459, 82633, 100981, 68545]
8542F8545k2915p21M2420L0271J0882k3252l4195k9441Q310J181k4189l0750N747
8529A893p393k28j1932K007M3672N064m3123j7539k317R715j6251l3001L9866
8516b9567M4757r881j5753k7527J040K6894j7409K9473K9663m2094p248Q414j4050
8503b3288j417k599K3565K8244N173j9304J3937m7684M436K4123J7139K8832K5158
8490G6315j8371N303k8122N432L070l1690k1866K0332M5775j6847j5911k4307
8478h87j820M138J0070j7658P251L0019m610l0921j2175L7391J1766j9263k0709
8465g408o7876L3835P9234Q912m9010L8846J7752j4481K391J8684J3995n5660
8453A9214o616j5552M9390n723j6k6245k8038J4362p810R89J1915K8642k0048
$$ y = [68545, 45630, 44909, 87329, 117600, 128482, 105230, 71035, 41594, 49904, 51085, 26896, -3854, 1893, -5500, -5728, -17660, -15653, 28019, 33083, -10040, -27579, -29896, -20181, -36432, -69433, -29567, 15190, 5309, -10444, -37971, -36931, -10037, -27446, 2027, 31690, -10404, -17652, -9238, -23288, -24705, -27304, -3739, 24505, 29678, 10374, 24311, -23373, -18937, 5186, 22325, 51157, 76315, 57944, 63247, 35125, 40557, 43627, 11937, -9929, 10403, 56178, 39331, 23420, -887, -2707, 1431, 11501, -6157, 1094, 31113, 26503, -4418, -16593, 20798, 32564, 13301, -7408, -75284, -41449, 37785, 46697, -2313, 36533, 54285, 39804, 42195, 60879, 74874, 19214, 12598, -2954, 46436, 40713, 40697, 14452, -13586, 776, -7034, -6045, 5870, 34512, 14464]
8440A4464l8099l2223J2482J8295k2326Q678L1020j4493k0245R581J4136J6546
8428b184k2656m279o625K0184K0590k520m0473P2396J2526k0018j8874r959l6949
8415c8841K7382J899l2330J6581L4860O261Q102k8244k0276j7944R383J1604K8662
8402G099J1008q184M451J6124j9975m2517K5472k14J9777k8328n106K1803m544
8389c134m857J1837J899J9842J7173j0899j5785j1713J7644M6968N717K9766k0550
8376H3908m0559J1045m4195l8721k4307r19L9545n726k731j604J580l928L025
8363b3587j6864L8182m54J5051N0180J6711o298K5262j6739m134J5857l0303k8589
8350C4275K8171M692k5055J1056M9990j3308j1546j165J328n5655l9320j5258
$$ y = [14464, -23635, -55858, -43376, -25081, -47407, -38729, -7709, -22202, -42447, -32866, -18730, -2184, -24840, -29119, -35744, -15560, 5030, 2510, -37963, 34433, 46959, 26941, 8067, -1892, -38841, -11459, -9560, -41890, -25309, 9551, 15812, 23914, -4330, -24606, -42550, -33167, -21563, 7099, 18107, 9923, 14374, 30498, 10523, -31994, -6522, -6736, 13041, -15287, -20393, 1410, -3134, -7991, 3846, 5745, 25587, 42760, 31861, 16076, 4363, 22007, 68975, 74692, 104458, 83908, 43349, 54394, 10199, -28522, -52829, -53748, -14203, -19929, -22660, -24264, -22684, -26612, -23587, -40451, -2269, -2723, 12328, 62508, 79219, 72921, 98183, 81444, 77310, 93167, 62864, 34275, 62446, 67138, 42083, 53139, 103129, 89821, 78275, 77110, 78438, 22783, -16537, -31795]
8338c1795J4342k2878n6241L9886L1484j8003M252M0430j3904n2209J9390K8933
8326a6313J5324K4231M2690J8720l8897k3578J8073Q468M8007j7913m5015p638
8314B6159L2961j0932k5617j5113N588J1852k5377k0587k9812J3556N6127N3729
8302G2534l6549l8046L7039P978n1479l1973K7217J9065j8418K3673K7873L022
8290D1936L9130q151o8756j8198L12L9582O458k0948k1529j4025j6690L1806q14
8277i887k7679J1472L7738K1999r446l6929o793J7630O759O410K7428J9400M293
8264F2395j3571m2276j6331j274L9480K0874l336P951k6982k424j3540l1861N526
8251a5369K4561J3954k4189k7205K7132o66J6196L2284K2639n754j8056m2913
$$ y = [-31795, -17453, -40331, -96572, -56686, -25202, -43205, -38953, 1477, -12427, -64636, -45246, -16313, -989, 23242, 65932, 84652, 45755, 22177, 40250, 48718, 96725, 78812, 33797, 26159, 59120, 48188, 22571, 7458, 13046, 24898, -479, -21066, -50878, -37322, 18805, 72534, 35985, -2061, 34978, 42956, -8523, -40496, -13279, 5786, -12632, 11041, 38914, 41936, 81066, 72915, 4159, -14039, -13727, 25855, 32313, 11365, -10164, -24189, -40879, -9073, -9887, -37566, -26094, 11644, 33643, 24197, -12732, -19525, -1895, 4864, 11274, 38702, 58102, 62395, 48824, 6548, -9783, -11057, 28423, 49297, 45961, 53912, 26930, 24506, 10966, -20895, -15369, 9192, 23146, -1043, -28248, -1116, -1782, 14414, 46698, 69337, 63583, 45527, 2614]
8239B614p569K0120k6050Q432L4040j8686L870l850J1724O692k1825k7516q656
8226b6660j4112Q588j3150k4621r969M7155K179l7794o338j1209L3502K0850j2613
8213d4192N5476O1522K393p9021o5917K6489J5401j4966L304j0383L6632p742
8201b1004k0022N2302K0595l5623L444J477l9449n0384J1006N1002M0720N400
8189A9464l4769k0415K8683n89L1809L676m7688Q050K7190K4751k208m5774m8027
8176e5847J724Q464K3435J5894J4039J4103k3k5868p571O1153M1004j8591o0231
8163A1685o4579l4256k1950M4795K1058K0304k0961J6042M0222J2641q408M4890
8151F1483O880j1660k385l9965m6192K5522q537k8212j8625k8158J0490L0799
$$ y = [2614, -4955, 15165, -10885, -2453, 31587, 12901, 16771, 12921, 24645, 31337, 9512, -18004, -26660, -40772, -32184, -45334, -69955, -79924, -32769, -30590, -68384, -74722, -85931, -52429, -31579, -44192, 11284, 72806, 75199, -3822, -69739, -43250, -27849, -42815, -39511, -49894, -13262, -21004, -41026, 11276, 31871, -3752, -308, 1169, -38280, -88664, -77658, -26656, 14064, 19464, -15305, -35720, -7037, -7626, 24183, 27859, -19829, -11779, 15411, 40162, 37954, -7820, -55847, -54123, -45659, -22224, -6330, 7709, 21812, 21789, -4079, -11650, 49503, 90507, 71916, 11685, -52894, -87150, -109100, -64305, -43247, -22943, -43904, -27862, 12360, 25001, 16593, 61483, 68363, 56703, 54318, 14353, -31839, -6317, -14854, -43066, -61691, -89849, -79359, -48560]
8139d8560R251J2472j0611n241Lj0153K978K3321L8696l4761k2457l8314l27k0167
8125a03870K3459M8157K869J3676j1297k8549k5252K4688N1821L4564O515k3751
8113A3030k4747k7227l7618L4879K6619K8981k0793k3826J1393K2254j2394j756
8101a1205J7614M2856K2850l8252n3162J6497q316N127J569k0120k8091M0302
8089a2331l653j4541l615L0615L1849K5676K8115l0611k5247n659K2014J320p756
8076C6176M168J855j8982p5597m9233L2532O1385m904J3455Q539L904o014q712
8063a428J1071j6888q497R747J6419K341J1741j1970m3249J0297j4028j2127K2548
8050b4023j8980j1838O2437K0778J7100j0076j5345l4169l6721r043j0855q475
$$ y = [-48560, -39309, -26837, -37448, -42689, -42686, -52839, -49861, -26540, 12156, -22605, -45062, -83376, -83703, -103870, -80411, -32254, -29385, -15709, -27006, -55555, -80807, -56119, -4298, 30266, 36781, 13030, -11717, -38944, -76562, -41683, -15064, 13917, -6876, -30702, -19309, 2945, -9449, -11205, 6409, 49265, 72115, 33863, -19299, -2802, -11118, -5991, -4422, -24542, -52633, -12331, -15984, -30525, -34140, -3525, 28324, 54000, 82115, 51504, 26257, 20598, 42612, 43932, 36176, 40344, 42199, 23217, -52380, -101613, -69081, -7696, -12600, 855, 9394, 13298, 7284, -1428, 9643, -7245, -15742, -5995, 10424, 12765, 24506, 12536, -30713, -20416, -34444, -46571, -24023, -43003, -54841, 7596, 28374, 45474, 35398, 20053, -14116, -50837, -59880, -70735, -79210]
8038g9210L9437K8566M769K4131N7122k1265l4104m1930k1915O154R062J0722
8026a8461p0907l0965O2006M0130L683P155L4716j8322o7519L072J053J3759K6803
8013a3797m658J889q642P740M257P878J5067L6457n208j9485n9944k846M6363
8000E071J8052l5455J0291Q78j5943J9245K4173l387l027J0125j7387J396R373
7987B3405K2779m1331k5789J4596k5294K8175Q514j3587r528L0897K0310l7Q909
7974D2019J4494j3019o270K2675R838m5398j6897K5339o189j7239l9292o3673
7962i3612k574Q5674M7663j2962j9863j9939l9881m9032L2162O3424J1267n4408
7950e2081o2677M7250N8411N0348L4561j3454o862j1033K4166j3548m1650r496
$$ y = [-79210, -39773, -11207, -6438, 17693, 74815, 53550, 19446, -22484, -44399, -38245, -29183, -18461, -89368, -120333, -58327, -18197, -14514, -7359, 27357, 9035, -58484, -55412, -54359, -40600, -13797, -18455, -16566, -25208, -17468, -13211, -5333, 9734, 46191, 40983, 21498, -38446, -41292, 5071, 23123, -12332, -2041, -1163, -17106, 2139, 26312, 22925, 19898, 30023, 12636, 14032, 23405, 46184, 4853, -20936, -6340, -31634, -3459, 5055, -8532, -18060, 12837, 33147, 33110, 42019, 56513, 43494, 37224, 59899, 69737, 24339, 7442, 32781, 26592, 9353, -29939, -93612, -96186, -10512, 37151, 24189, 4326, -15613, -55494, -104526, -72364, -8940, 2327, -52081, -114758, -67508, -9097, 41251, 75812, 62358, 55496, 44463, 68629, 55081, 13431, 3935]
7938C935K2824J62j6159M0694k4589j5436m2133j9727j794L2494k2788l0025j1906
7925h4448N6588J5601l664p911L0993K4511K8974Q803l3691Q554N934L0694L131
7912H4069m8828p2944n549P811L7806J1687r930o736j343J2433J8750K2604J1661
7899F1491k9119l7495k7574L5781k8736m734K7437o352l9584N538J9543K7008
7887C204K1138l1728j8187o357l369n019m3848j5297K2121J884L0296j0526o198
7874f1886J7418q593M9221O9037n803l2561j1632j1452j8041O374J9075l6472
7862b5315K342K8654K5498N0722k5398n2031l0766O4287R905p7298J878J1189
7850a6333J415o312K2842L6250k1193k1112L6966J5107k8110j8482P264J7017
$$ y = [3935, 26759, 26921, 10762, 51456, 26867, 11431, -30702, -50429, -52223, -19729, -42517, -72542, -84448, -27860, -12259, -15923, -23834, 7159, 31670, 60644, 69447, 35756, 44310, 50244, 80938, 84069, 35241, -37703, -43252, -35441, 2365, 14052, 4122, -2614, -3957, 8476, 27226, 49830, 61491, 32372, -5123, -32697, 3084, -25652, -30386, -2949, -9301, -48885, -43347, -23804, 3204, 24342, -7386, -25573, -31930, -35299, -40318, -84166, -99463, -77342, -75458, -45162, -55688, -61886, -44468, -53061, -3840, 65197, 59394, 26833, 15201, 3749, -14292, -7918, 11157, -25315, -22973, 5681, 31179, 81901, 56503, 4472, -26294, 37993, 47898, -29400, -27522, -16333, -14918, -21230, 1612, 37862, 16669, -4443, 32523, 47630, 19520, 1038, 8302, 25319]
7838B5319k2338k1668J0145L694m3115J8188M2113j0356k4800J9324L3018R752
7826C9276j2190J7700j5892k6838k240m0678M343l399L349j9439K526K4526K1428
7813g528j7463J0208J7857J1568J6674P562K888n268J788l2407n0403N869k7024
7800f5679k6441J7738J6101N3120N9748j0325n77m6338k5538k1837N906L730K1556
7787a8836L725J867j2397k9559K7997k763k4290J3300O560k0733J0681J1818J1261
7774b1369L6079j5r370n259j3700l059p554j487j5773q973J5457M3829P505k4599
7760h288k0504j7257J9459J7762m28l3311J561J5728j1224K5532k80k4980K9456
7747f774j2381J0000p846k9712q01O591J5148k171J1K6971K2351r850k3190J4353
$$ y = [25319, 2981, -18687, -8542, -4848, -47963, -29775, 12338, 1982, -22818, -3494, 29524, 39276, 27086, 44786, 28894, 2056, -184, -40862, -36519, -39918, -36569, -56008, -53482, -28956, -7528, -24991, -14783, 3074, 14642, 31316, 38878, 41766, 36498, 38286, 5879, -44524, -38655, -65679, -92120, -74382, -58281, -5161, 54587, 44262, 43685, -2653, -28191, -50028, -44122, -40392, -18836, -15111, -13244, -25641, -55200, -27203, -29966, -54256, -40956, -34396, -55129, -44448, -32630, -21369, 14710, 14695, 5325, 66, -13634, -16693, -24247, -25734, -41507, -50480, -35023, 8806, 16311, -8288, -28792, -46049, -26590, -8828, -9256, -42567, -41006, -25278, -36502, -10970, -11250, -36230, -6774, -19155, -9155, -17001, -46713, -47514, -40923, -25775, -27946, -27935, -964, 21387, 11537, -11653, 2700]
7733B700m4597j0296L4528J7603o869M2897n624k5266j0410m7484k7562N541K9266
7720d5573J0913K5573l5819J6797J6391J0584J7314K1795j3369J7853J0008K4583
7708G7050N039O639l0962m5845k1302k8685N2472M4032o233M0607j8339n2856
7696B1617m5791j6597J8306K5608k827R740o678n0665m6335J4445N595j4834K5818
7683f2598L0574P298j418K7939M5766j1004m264l6145j4060k0827M0095K4254
7671B5610l8271j7428j6702n7646M6804N2727r307M848j0376l3498j7797m926
7659g5962j1360n29K4962O7329j481J1596M914j7076N032l7210k8411k6928L8912
7646d6212M9917J6292p937J1299l66l0950o372M5752J0624J571J2579p872m0317
$$ y = [2700, -41897, -52193, -17665, -62, -6931, 35966, 30342, 5076, -5334, -52818, -80380, -74839, -45573, -34660, -9087, -44906, -28109, -11718, -1134, 16180, 37975, 24606, 42459, 52467, 77050, 82089, 88728, 57766, 11921, -9381, -38066, 14406, 58438, 52205, 92812, 74473, 21617, -24174, -40771, -22465, 3143, 316, 10056, 3378, -47287, -93622, -79177, -73582, -88416, -62598, -32024, -24726, -26144, 1795, 47561, 36557, 32293, -3852, -17912, -38739, 1356, 25610, -12661, -30089, -46791, -104437, -57633, -4906, -14213, -9365, -19741, -53239, -71036, -75962, -87322, -87851, -62889, 4440, 2959, 14555, 19469, 2393, 7425, -29785, -58196, -85124, -46212, 3705, 19997, 12060, 23359, 22993, -7957, -14329, 31423, 42047, 43618, 56197, 48325, 8008]
7633H008R613L5902k952k1129j2286j1585k3740k0085j2183L1875K5149K2943
7621B9530j3899O452j6470j587L851m046r848L8640Q93K0386J3258K9576k1018
7608G5718k6363k4146l8053O028J4213k7819J8804q410K527L3921l8667L4057
7596B1810L3007J7163J3481J0039l5459m7111j6142R295j8677J8269O0843J3344
7584G9862m6267m6096K7710O992r89k3603M676p270J6337M8540m2681k2361n763
7571a0913l5987m5289n028J7807L2663M8747J1435m1298J3203K6331l1261q536
7559b8126k7255l2432K7332l818r938M4154N3436l534j3946K0055O078j0711O983
7546B8278L2616M0868n4631k0413j2623N134J0757K3707l9927N077N5685Q646
$$ y = [8008, 17621, 53523, 50571, 29442, 17156, 5571, -18169, -38254, -50437, -18562, 6587, 29530, 15631, 22083, 5613, 4026, 7877, 3831, -6017, 32623, 33516, 53902, 67160, 96736, 75718, 49355, 25209, -12844, -6816, 7397, -20422, -1618, -10028, -7501, 26420, -12247, 21810, 54817, 71980, 85461, 95500, 60041, 12930, -3212, 6083, -12594, 5675, 66518, 79862, 33595, -12501, 15209, 22201, 21212, -2391, 2285, -4985, 11352, 59892, 17211, -5150, -10913, -46900, -92189, -97217, -79410, -46747, 2000, 13435, -27863, -14660, 11671, -19590, -28126, -55381, -87813, -60481, -64299, -74237, -30083, 23353, 19819, 5873, 25928, 32006, 21295, 28278, 60894, 101762, 47131, 26718, 14095, 19229, 29986, 53693, 13766, 18843, 74528, 83174]
7534H3174n082M981j650r950q2126j7871K4735L039J124L6720k3775l3259L3482
7521A3542l3024N16k3283K213j640R547K5750M9764P547l2085j9690q45K4272
7508B2584j3618j680K339o203j2972j1558r655J316k3936O0368M9024J4179j8893
7495E1295m8211l914K2781O4757k1907n670n3015k9974j686M26j1315k1291k3892
7482h1616j6179J1297J2202O8005J5966k5577Q943J9613K9579l6157J054M4327
7470E1457k571K0638M088l5552k0351l3072N903J5623K2751K7321k1704l6780
7458b249m89j9819K20K667j7263M761m043L2076L1797J3232L035K6871j1986j8992
7444C9818k5649m4554K4540R278j2671j5150k8700r932N6406K0740p134j4506
$$ y = [83174, 78092, 83073, 81423, 71473, -10653, -28524, -3789, -750, 374, 37094, 13319, -19940, 13542, -19482, -18966, -42249, -40036, -41676, -32129, -6379, 43385, 50932, 18847, -843, -1688, 22584, 8966, 7286, 9625, 3422, -9550, -21108, -30763, -29447, -53383, 6985, 56009, 70188, 51295, 3084, -830, 21951, 86708, 64801, 59131, 6116, -23858, -25544, -25118, -36433, -57724, -81616, -97795, -86498, -74296, -6291, 9675, -15902, -6959, 12654, 42233, 6076, 7130, 51457, 48886, 69524, 73612, 38060, 17709, -15363, -9460, 6163, 28914, 56235, 34531, -2249, -2738, -22557, -22337, -19670, -36933, -32172, -36215, -4139, 27658, 40890, 43925, 70796, 58810, 39818, 14169, -30385, -5845, 3433, -9238, -24388, -53088, -63020, -6614, 14126, 6992, -7514]
7432g514L1780P802o136j9483J9195L4529R618o0006k8558q240L9601J9495K939
7419C5022q064k975J7120j2539j2871J039j5655l5788J268L1604j5243O382j240
7406a1940N264k26Q81p237j8211K0335J3661k8005j4478k2490K0743L8551O874
7393C722J2853J9248l6711L957Q978j1512Q829J6302l4455j1612L0674k378n743
7380B152j0571J0650l1695N254J0609J0124k446j4930N606N5021j7573l4069J8381
7367F513J5420J2481j0451j6314m9177J5614J4777L7280J963N802K5848j1966
7355D7790k7148M228Q630k4802k3201p921K1230K0156L229j7669j5457k670L4222
7342B0617k647K0977K8182N911n0964l0171j7401k5142p257L3205N5832L6273
$$ y = [-7514, 24266, 32068, 25932, 6449, 25644, 60173, 69791, 9785, -18773, -27013, 12588, 32083, 35022, 26958, 23983, 41103, 28564, 15693, 16732, 1077, -34711, -33443, -1839, -17082, -10700, -11940, -6676, -6902, -6021, -13258, -31469, -11134, 2527, -25478, -39956, -62446, -41703, -3152, 3722, 16575, 35823, -888, 3069, 12047, 535, 9364, 25666, -8789, -20401, 10273, 7895, 2152, -8419, 2231, -29464, -24210, -13601, -3477, -5923, -20853, -15247, 39774, 22201, -11868, 6513, 21933, 34414, 23963, 7649, -41528, -25914, -11137, 26143, 28106, 33908, 59756, 47790, 20642, 24870, 33500, 8698, -14503, -22424, -1194, 18962, 22191, 4522, -10935, -13605, 20617, 17970, 38947, 67129, 73040, 22076, -8095, -25496, -50638, -57895, -24690, 31142, 67415]
7330F7415n1616m0398m366n8471J2384N0463L4745K6498K9336n6242m1391J2032
7318a9611K495n8571J282L2903n951J6719L0924K9351k3097n1543N1488L9588
7306D5977J4955o440l415m1218k5249j2798J4537k3343L6285k124K779O174K8484
7293C4604J3425M82Q402j4688j0540L5142j3891n1635o0466O608J6895N5391P392
7280B7121J536K5120q657m2449l9264m8522J5202J8642J1627l4325K786L0062
7268d1121j5332n2673j1434N3113L3231J0191J6330k6830l63N744p450J2052K1196
7255c346L473j7658k4536L7299M7603L811k2590o824K2929k7308J462M0335k0943
7242C3707r25l3451k6023M1532L7968j140J9078J8161k9988q4424k5729K2287
$$ y = [67415, 15799, -24599, -28965, -87436, -75052, -24589, 10156, 36654, 65990, 9748, -31643, -19611, -17116, -75687, -74405, -41502, -47453, -30734, 190, 29541, 6444, -45099, 6389, 45977, 60932, 54492, 51077, 9859, -15390, -28188, -13651, -36994, -709, -2833, -54, 6120, 34604, 48029, 48511, 56913, 42225, 31685, 66827, 52936, 1301, -59165, -52557, -35662, 19729, 27121, 28657, 53777, 45120, 2671, -36593, -85115, -69913, -51271, -39644, -73969, -71183, -41121, -56453, -109126, -120560, -67447, -34216, -24025, -7695, -34525, -34888, -29144, -36594, -24542, -3346, 127, -17531, -42067, -4768, 42835, 46646, 24056, 17232, 40161, 12853, 14315, 54650, 33707, 32782, -669, -26692, 14840, 52808, 51668, 70746, 88907, 58919, -25505, -51234, -28947]
7230b8947k2869l064K8813o248l2266K8811J1720P745k891j372l84k7887j8456
7217f7295l227M0887Q194o771m149P9334N5588l3069o9552n6357k2924J2553L1696
7204c5092n0693J878K7459L923L3701O2400K5537l1233k3400K3966r238L957l3232
7191f7l7555j954k149p894k3627L4494J817M786K1026N410L5761L979j6894K5072
7177D2205j7300l626l1254p551j0405k7934J8127M2797J5168M023m9837n9877
7165h5464R825K9416L1628j1570J7524M3265j7839n6579l9648K527J2067J4589
7153e0259N0160q860o899j242J637Q893O710j9146j9322J460K1223K6216j5009
7140d438k9903Q046L3003O1966K1776k1754l2682l552j4776n429O708J5288Q694
$$ y = [-28947, -51816, -54880, -26067, -32315, -64581, -35770, -24050, -16305, -19196, -20568, -20952, -48839, -67295, -70522, -29635, -21441, -28212, -32361, 46973, 102561, 69492, -60, -56417, -79341, -66788, -35092, -85785, -83907, -56448, -52525, -18824, 43576, 69113, 37880, 14480, 38446, 29208, 33165, -67, -37622, -39576, -41725, -49619, -73246, -38752, -36935, -32149, -11123, -5713, 30048, 34027, 17133, 42205, 24905, 21279, -9975, -17526, -27931, -55865, -37738, 5059, 20227, 24250, -25587, -85464, -75639, -46223, -14595, -26165, -8641, 34624, 16785, -39794, -79442, -76915, -64848, -50259, -99, -8959, -15858, -17100, -15463, -6570, 140, -19006, -38328, -36868, -15645, 10571, -4438, -34341, -26295, 6708, 68674, 90450, 68696, 36014, 32462, 17686, 12257, 18965, 34253, 42947]
7127D2947J7015l7860J743k94p458K0332O630j6268m346l2745O802J9507J4435
7114C0440q333J6967L2596Q012l8388J1336r88l2817k3974j020j1216J3188J4921
7101A0724j706j9396J6643L8717n0672k6569K8592o108m0435K7023L2571J1364
7089B0748p624p827R908p44j7356P405q899k717J2448L064l613j2692K702Q750
7075C553L809l9674J8119p094K1852N3876J7554j2938k9427k3477K3901J4286
7063D4340n245L7374J2804m657k5978j3258m6393l2107J7873L9377j5095o237
7051B798j4178L806Q004j41M957j6602l9746j0254L3649Q261o0324j1952L2175
7038e9547M2254R003j577L1837J5640j194K6513l7030J326K1178k870j1038Q576
$$ y = [42947, 59962, 22102, 23845, 23551, 16093, 36425, 43055, 26787, 22441, -10304, -3502, 16005, 30440, 22107, 39074, 71670, 79682, 41294, 52630, 51642, 18825, -5149, -6169, -17385, -4197, 10724, 9018, -10378, 6265, 44982, -5690, -32259, -3667, -9775, -50210, -23187, 9384, 20748, 13124, 5297, 15205, 14461, -2895, 4510, -4389, -7106, 5342, 8406, 4793, -7899, -5197, 3553, 7362, -32312, -14193, -21287, 565, 54441, 71995, 59057, 29630, 6153, 30054, 44340, 39095, 76469, 89273, 84616, 58638, 45380, -1013, -33120, -15247, 24130, 9035, 2798, -11380, -7574, 430, 289, 5246, -11356, -51102, -61356, -27707, -19446, -79770, -91722, -59547, -17293, -8290, -9867, 21970, 37610, 36416, 62929, 25899, 27225, 48403, 45533, 34495, 43071]
7025D3071p887m367k7299P312M7921O644m885l1753j7644p331j0930j578K3131
7012A4405K3083j4811m887l1957J4392p237M8418N2262m2340m9699k0120K1773
7000C282P936p127k1266j1032J8609j5542j6790k99l5703k0212J9230K0053M7408
6987a1453M2679r427j4641j541N6456K6737k2266k3763P832M955k883l0450k1708
6974E27j9635K81k8635J5585J9647K7869J2310k0165J5949K2241n1670l9960K6549
6961a9107K77j0592j2959L102k2059j3056Q356L7402K7319q413N0441j72K230
6948D2769r977k1717q099L4463R527K262m0248q571M4145O918k5809K1709N131
6935E2503j4307o352J423P161q63l163p860q423K1151j346k6331k3386l0836J3901
$$ y = [43071, 35184, 30817, 3518, 10830, 58751, 65395, 60510, 28757, 11113, 3782, -7148, -8726, 14405, 37488, 22677, 17790, -14167, 225, -7012, 41406, 93668, 51328, 1629, -18491, 3282, 11218, 4091, -17175, -28207, -9598, -25140, -41930, -42229, -77932, -98144, -78914, -58861, -11453, 31226, 21799, 7158, 5617, 62073, 88810, 66544, 42781, 50613, 55568, 52685, 22235, 527, -19108, -18827, -47462, -31877, -12230, 15639, 27949, 7784, 23733, 45974, -5696, -45656, -19107, -18830, -29422, -42381, -39279, -61338, -74394, -66038, -28636, -1317, -9730, 40711, 40539, 42769, 32792, 11075, 2976, 37439, 46966, 49228, 8980, 409, 44554, 51472, 25663, 47372, 52503, 38196, 31844, 33267, 40428, 39565, 36402, 28542, 20119, 41270, 39924, 13593, -9793, -40629, -26728]
6921b6728J1052L1920K4589j1836m7965J1977K290L627J0023L2589j6020l5440
6909i922k0842K6196K9861p868k2028o235k5229l4962j4735K7834n385J2413K6397
6896b4505K8057K4610j1656J1031J5327K5103J6239l2951l8687m4307L2793J8017
6884A9071k5843O156K1032L175K288R613n7138k796K8588P5434M6832k3219o4227
6871C8966n4642l0562k8581p043J8604K6184j8281J5071K6934j7800l7090J7691
6859e0549L3769J8600j2109j4557m180L4703L2642j7250k3050k1268J7986M2506
6847C7243K5431r571p0768m47J8048J2277J086l5565j21q821J6585O922n561M416
6833h846m266P207J6848k6069k7029j3219L5502Q624M777K5981j1777m8525M762
$$ y = [-26728, -15676, 16244, 40833, 28997, -18968, -6991, -4701, -1074, 8949, 41538, 25518, -9922, -30764, -4568, 25293, 17425, -4603, -10838, -36067, -71029, -85764, -57930, -63315, -50902, -24505, 3552, 28162, 16506, 27537, 42864, 67967, 84206, 51255, 12568, -31739, 1054, 19071, -6772, -616, 20416, 23591, 25879, 35492, -21646, -24442, 4146, 79580, 126412, 103193, 38966, -15676, -46238, -74819, -81862, -63258, -37074, -55355, -40284, -13350, -31150, -68240, -50549, -16780, 1820, -10289, -24846, -29026, 5677, 38319, 21069, -1981, -23249, -5263, 37243, 62674, 53103, -17665, -18112, -64, 12213, 13299, -22266, -22387, -31208, -14623, -7701, -13262, -8846, -13112, -5905, 10943, -15126, -42155, -55374, -19872, -11248, -6471, 19510, 7733, -40792, -36030]
6820c6030L5737N9451J5832n073L4008j1051j2328j0136m8049m0295J7051q011
6808h894n7870J1965q158J524j7014P308R828K4863J4673k8831q367K6999N785
6795b6189j0990J2000M890j9850J9830N1964n3456P501K0102j0737M192l3899
6783c4642j0173J0315K3935K865k7802j83j7089M3623J4556J1634k3054n6316
6771f2331K7786K6525O370m0894j6529J7322J6092j8996O906K3655J8046k0639
6759a6687k6657l3905R311N1433j1588k8701L856K3051k9674Q861Q05k6936p063
6746h3894K1941J3009J5258o284OL0474K7275J8701o8859m2142p948J4129P1552
6733C218K2119j2871r057L801j1756m4298j1291O5280J0460k288j2356j2149k9680
$$ y = [-36030, -293, 59158, 74990, 69917, 103925, 92874, 80546, 70410, 22361, -17934, -883, -8894, -66764, -54799, -62957, -61433, -78447, -71139, -61311, -36448, -21775, -50606, -58973, -31974, -26189, -37179, -25179, -20289, -40139, -20309, 31655, -21801, -14300, 5802, -4935, -743, -34642, -44815, -34500, -10565, -7700, -35502, -35685, -52774, -9151, 5405, 17039, -6015, -62331, -34545, -8020, -1650, -42544, -59073, -41751, -25659, -44655, -37749, -14094, 3952, -16687, -43344, -77249, -67938, -16505, -28093, -56794, -52938, -29887, -59561, -50700, -49895, -76831, -83894, -61953, -48944, -33686, -39970, -39964, -9490, 17785, 36486, -32373, -74515, -82463, -68334, 3218, 25337, 12466, 3409, 7210, -4546, -48844, -60135, 5145, 15605, 13317, 961, -11188, -40868]
6720d0868J5198K564k2618L8466K1135L5545J8360j7215j481J0417j1394n931
6708D2178l0691m3463P84L568L7839M5210K0981l0198l3480M37j9327M0985q97
6695C3926k7609L4298p019l8683r027L6987j8018k3575J7875K6422L162j2710
6683A6029k9174j5888n625l65L1049K6603n0373K0337J0725p332m8058p774M8211
6670a1635l3763j9923j6284N910j9916M0758L1710O805L4042L2393R767l6400
6658B3464j4165R881J6649j4956R46K5472l4406k6881J0361J2377R206N596L7984
6645F1528l4194n0797J6888N0332N180m2777L428K7422n9942m3663K0389m281
6633e0487k1217L3961L0728Q669J013M707J4384M8763j9685l3370K059k1491k7558
$$ y = [-40868, -25670, -23106, -45724, -7258, 13877, 49422, 67782, 50567, 49086, 59503, 48109, 42178, 11487, -31976, -31192, -27624, 10215, 55425, 76406, 46208, 12728, 13165, -6162, 34823, 33926, 6317, 40615, 33596, -5087, -14114, 22873, 4855, -18720, -845, 25577, 28739, 16029, -13145, -29033, -34658, -35023, -3974, 22629, -27744, -7407, 3318, -4014, -52072, -59846, -11635, -45398, -65321, -81605, -75695, -95611, -54853, -23143, -16338, 17704, 50097, 59864, 23464, 9299, 19180, 35829, 20873, 21819, 47291, 12885, -13996, -3635, 8742, 17948, 23544, 61528, 27334, -23463, -6575, 43757, 48937, 6160, 9588, 37010, -22932, -66595, -46206, -50487, -71704, -37743, -7015, 1654, 2667, 7374, 21758, 70521, 50836, 17466, 19525, -1966, -29524]
6620b9524l3182K5173L1817L8085L512k5985L4312J6913q240r823j9728L75Q321
6607C2026l4343k3485l3008L8196J0158L0167K9035l5876j7421j2441k328Q009
6595a1311O47K2952j6958l765K1484k5039n3987K0701L6624L3857q46J8999o517
6582C6841n5786l8163q136K1491J8305p583K8925j2277K193M9318K4120n6838
6570B410j5887j2837k2806L1581P088K9890Q692k2166l9987J7271L0327k4004
6558a0428J8640K8384J3309P606J5667l353J4661O488r896l509k2564j7897M7672
6545H4780o165l9308J2010k8433m0072K2954J6990L000J3557m7355m4179j7181
6533f9402L6371J6010q608M5430K0447j8131m6705L824L3698j9814l380J0740
$$ y = [-29524, -62706, -37533, -5716, 32369, 35881, 9896, 44208, 61121, 52881, 43058, 23330, 23705, 32026, -2317, -25802, -58810, -20614, -10456, 19711, 48746, 12870, -4551, -16992, -19320, -11311, -10664, 12288, -4670, -8435, 13049, -11990, -65977, -45276, -8652, 25205, 24359, 43358, 36841, -18945, -57108, -65244, -43753, -25448, -33031, -4106, -16383, -14190, 35128, 59248, 2410, -13477, -26314, -49120, -17539, -10451, 19439, 28131, 5965, -34022, -16751, 13576, -10428, 8212, 36596, 49905, 57511, 73178, 69825, 84486, 90974, 81078, 77569, 55005, 37108, 84780, 78615, 39307, 51317, 22884, -17188, 5766, 22756, 25756, 39313, -8042, -52221, -69402, -33031, -17021, -25629, 19801, 40248, 22117, -24588, -20764, 12934, -6880, -10260, 480]
6521D80J88j0829n605J7404k1420j007l9529N458m083n175K8984J3463L6317J6349
6507C0995m4212j472K4495j1895M3341J5958m5579K6097L619K7303l90k3030J5836
6494F1066k3806J823k1180k8006k7399o471Q403j2514K733N7664J5291J62J8525
6481D6291j0073m8602Q806L6351k3641k3823m747j4420J348O462j6170k8793M7535
6468b3476L0500n452o118j1313j315k8983p080n252K8340L479J2378n152j9202
6455c8646L7166J927j2153L425O3232K350J7362L94j6892l9414l6397k2640m673
6442d4959M6457M5290l9384m5236K2071K8036q604N276K1980J282m910k7743j1329
6429a1773K362J9126M7149j8700j0448o673N66j1867K3040R357N2684l6071l5293
$$ y = [480, 668, -10161, -15766, 1638, -19782, -20789, -60318, -54860, -58943, -64118, -35134, -21671, 14646, 30995, -13217, -14689, 9806, -2089, 41252, 57210, 11631, 37728, 41347, 68650, 68260, 45230, 61066, 37260, 39083, 17903, -10103, -37502, -43973, -35570, -48084, -45351, 12313, 27604, 27766, 46291, 36218, -12384, -3578, 32773, 9132, -14691, -19438, -33858, -32510, -26048, -42218, -71011, -23476, 7024, 1572, -4546, -15859, -17174, -46157, -53237, -58489, -30149, -26670, -14292, -19444, -38646, -1480, 447, -11706, -8281, 54951, 57301, 74663, 75057, 58165, 18751, -17646, -40286, -44959, 1498, 46788, 7404, -37832, -15761, 12275, 3671, 8947, 30927, 32209, 27299, -444, -11773, -9411, 9715, 56864, 38164, 27716, 21043, 21609, 9742, 32782, 42139, 94823, 58752, 23459]
6416B3459j4801l0761L157J3674J1208k3753J0771K1658N3188Q378m2366k4352
6404I460o025o424j7214l3226j3838J118Q823J8001Q412O626J4643l2204J3620
6391b8228L3313J2581J2141L4890k1948o5850k6822j433K3903M7349N2928k3827
6379D8997p412K8737J3404m6234l8789k4585P485K3524l2904k4843p541L1341
6367b8820j351o21J0053l2662k0404m590N6582J6181P348R374L4016J3490j7583
6354D1013j6863L516M0609j2536m4984l3497j5553K8619K6688J0044k8629m3373
6342d4946L2760K3409N870K96n617R948K6163l4801j2289L7423J2556j8791J7024
$$ y = [23459, 8658, -22103, -18946, -5272, 5936, -17817, -7046, 14612, 67800, 76178, 33812, 9460, 3435, -2989, -20203, -53429, -67267, -66149, -57326, -39325, -30913, -24287, -9644, -41848, -28228, 5085, 17666, 29807, 64697, 42749, -23101, -49923, -51356, -27453, 19896, 72824, 48997, 41585, 70322, 83726, 37492, -1297, -25882, -18397, 5127, -27777, -52620, -60161, -28820, -30171, -30792, -20739, -53401, -73805, -78395, -21813, -5632, 1716, 11090, 45106, 58596, 41013, 24150, 27666, 68275, 55739, 10755, -22742, -38295, -9676, 17012, 27056, -1573, -44946, -12186, 11223, 17093, 17389, 11772, 21720, 47883, 13082, 793, 38216, 50772, 31981, 49005]
$$ [...]
##END NTUPLES=NMR SPECTRUM
##END=
