##TITLE=Analysis number 320715
Compound Code mo 07865
Book Reference 494/26
Project Code adrs
Chemist Name craigr
##JCAMPDX= 6.0         $$ Bruker NMR JCAMP-DX V2.0
##DATA TYPE= NMR SPECTRUM
##DATA CLASS= NTUPLES
##ORIGIN= Bruker BioSpin GmbH
##OWNER= nmr
$$ XWIN-NMR		Version 3.5
$$ Thu Jul  6 11:08:36 2006 GMT Daylight Time (UT+1h)  MAYBRIDGE\nmr@NMR_250MHZ
##.OBSERVE FREQUENCY= 250.131544655141
##.OBSERVE NUCLEUS= ^1H
##.ACQUISITION MODE= SIMULTANEOUS (DQD)
##.ACQUISITION SCHEME= undefined
##.AVERAGES= 16
##.DIGITISER RES= 18
##SPECTROMETER/DATA SYSTEM= dpx250
##.PULSE SEQUENCE= zg30
##.SOLVENT NAME= CDCl3
##.SHIFT REFERENCE= (INTERNAL, CDCl3, 0, 16.522)
##AUDIT TRAIL= $$ (NUMBER, WHEN, WHO, WHERE, WHAT)
$$ ##TITLE= Audit trail, XWIN-NMR		Version 3.5
$$ ##JCAMPDX= 5.01
$$ ##ORIGIN= Bruker BioSpin GmbH
$$ ##OWNER= nmr
$$ C:\u/data/dgb/nmr/ADRS/2420/pdata/1/auditp.txt
$$ ##AUDIT TRAIL=  $$ (NUMBER, WHEN, WHO, WHERE, WHAT)
(   1,<2006-07-06 11:08:14.67 +100>,<MAYBRIDGE\nmr>,<NMR_250MHZ>,
      <created by zg, POWCHK disabled, PULCHK disabled
       configuration hash MD5:
       E2 DF 36 D8 04 B2 41 60 5A D7 A3 38 5A 4B D0 FE
       data hash MD5: 64K
       0E 1A 6A 32 7F F9 24 F6 5E D8 12 98 45 25 52 A7>)
(   2,<2006-07-06 11:08:28.24 +100>,<MAYBRIDGE\nmr>,<NMR_250MHZ>,
      <Start of raw data processing
       ef LB = 0.3 FT_mod = 6 PKNL = 1 SI = 32K 
       data hash MD5: 32K
       06 C3 3A 59 D9 B9 2B 6E B5 72 98 C3 4D 6E AC CD>)
(   3,<2006-07-06 11:08:29.83 +100>,<MAYBRIDGE\nmr>,<NMR_250MHZ>,
      <apk 
       data hash MD5: 32K
       13 19 5B 22 86 09 C9 2E 9B 5C 97 D9 B3 C5 C1 90>)
(   4,<2006-07-06 11:08:30.63 +100>,<MAYBRIDGE\nmr>,<NMR_250MHZ>,
      <abs ABSG = 5 
       data hash MD5: 32K
       2C 95 A5 29 56 75 0B 18 DB 93 F9 8C 33 AF 4F F4>)
$$ ##END=
$$ 
$$ hash MD5
$$ 2D FD 3A B3 4B 28 D4 2B 33 81 59 C7 4C 64 D9 F7
##$RELAX= 
##$RELAX= 
##$RELAX= 
##$RELAX= 
##$RELAX= 
##$RELAX= 
##$RELAX= 
$$ Bruker specific parameters
$$ --------------------------
##$DU= <C:\u>
##$EXPNO= 2420
##$NAME= <ADRS>
##$PROCNO= 1
##$TYPE= <nmr>
##$USER= <dgb>
##$AMP= (0..31)
100 100 100 100 100 100 100 100 100 100 100 100 100 100 100 100 100 100 
100 100 100 100 100 100 100 100 100 100 100 100 100 100 
##$AQSEQ= 0
##$AQ_mod= 3
##$AUNM= <au_zg>
##$AUTOPOS= <18 >
##$BF1= 250.13
##$BF2= 250.13
##$BF3= 250.13
##$BF4= 250.13
##$BF5= 500.13
##$BF6= 500.13
##$BF7= 500.13
##$BF8= 500.13
##$BYTORDA= 1
##$CFDGTYP= 0
##$CFRGTYP= 5
##$CHEMSTR= <none>
##$CNST= (0..31)
1 1 145 1 1 1 1 1 1 1 1 1 1 1 1 1 1 1 1 1 1 1 1 1 1 1 1 1 1 1 1 1 
##$CPDPRG= <>
##$CPDPRG1= <>
##$CPDPRG2= <>
##$CPDPRG3= <>
##$CPDPRG4= <mlev>
##$CPDPRG5= <mlev>
##$CPDPRG6= <mlev>
##$CPDPRG7= <mlev>
##$CPDPRG8= <mlev>
##$CPDPRGB= <>
##$CPDPRGT= <>
##$D= (0..31)
0 1 0 0 0 0 0 0 0 0.06 0 0 0 0 0 0 0.0002 0 0 0 0 0 0 0 0 0 0 0 0 0 0 
0 
##$DATE= 1152180493
##$DBL= (0..7)
120 120 120 120 120 120 120 120 
##$DBP= (0..7)
150 150 150 150 150 150 150 150 
##$DBP07= 0
##$DBPNAM0= <>
##$DBPNAM1= <>
$$ [...]
##$SUBNAM7= <"">
##$SUBNAM8= <"">
##$SUBNAM9= <"">
##$SW= 20.6930455092707
##$SWIBOX= (0..15)
0 0 3 0 0 0 0 0 0 0 0 0 0 0 0 0 
##$SW_h= 5175.983436853
##$TD= 65536
##$TD0= 1
##$TE= 295.16
##$TE2= 300
##$TE3= 300
##$TEG= 300
##$TL= (0..7)
0 120 120 120 120 120 120 120 
##$TP= (0..7)
150 150 150 150 150 150 150 150 
##$TP07= 0
##$TPNAME0= <>
##$TPNAME1= <>
##$TPNAME2= <>
##$TPNAME3= <>
##$TPNAME4= <>
##$TPNAME5= <>
##$TPNAME6= <>
##$TPNAME7= <>
##$TPOAL= (0..7)
0.5 0.5 0.5 0.5 0.5 0.5 0.5 0.5 
##$TPOFFS= (0..7)
0 0 0 0 0 0 0 0 
##$TUNHIN= 0
##$TUNHOUT= 0
##$TUNXOUT= 0
##$USERA1= <user>
##$USERA2= <user>
##$USERA3= <user>
##$USERA4= <user>
##$USERA5= <user>
##$V9= 5
##$VALIST= <valist>
##$VCLIST= <CCCCCCCCCCCCCCC>
##$VD= 0
##$VDLIST= <DDDDDDDDDDDDDDD>
##$VPLIST= <PPPPPPPPPPPPPPP>
##$VTLIST= <TTTTTTTTTTTTTTT>
##$WBST= 1024
##$WBSW= 4
##$XGAIN= (0..3)
0 0 0 0 
##$XL= 0
##$YL= 0
##$YMAX_a= 415834
##$YMIN_a= -476030
##$ZGOPTNS= <>
##$ZL1= 120
##$ZL2= 120
##$ZL3= 120
##$ZL4= 120
##$ABSF1= 16.522
##$ABSF2= -4.171173
##$ABSG= 5
##$ABSL= 3
##$ALPHA= 0
##$AQORDER= 0
##$ASSFAC= 0
##$ASSFACI= 0
##$ASSFACX= 0
##$ASSWID= 0
##$AUNMP= <proc_1d>
##$AZFE= 0.1
##$AZFW= 0.1
##$BCFW= 0
##$BC_mod= 0
##$BYTORDP= 0
##$COROFFS= 0
##$CY= 12.5
##$DATMOD= 1
##$DC= 0
##$DFILT= <>
##$DTYPP= 0
##$F1P= 14.0000005364418
##$F2P= -0.99999901652339
##$FCOR= 0.5
##$FTSIZE= 32768
##$FT_mod= 6
##$GAMMA= 0
##$GB= 0
##$INTBC= 1
##$INTSCL= 1
##$ISEN= 128
##$LB= 0.3
##$LEV0= 0
##$LPBIN= 0
##$MAXI= 10000
##$MC2= 0
##$MEAN= 0
##$ME_mod= 0
##$MI= 0
##$NCOEF= 0
##$NC_proc= -3
##$NLEV= 6
##$NOISF1= 0
##$NOISF2= 0
##$NSP= 0
##$NTH_PI= 0
##$NZP= 0
##$OFFSET= 16.522
##$PC= 1
##$PHC0= 163.9269
##$PHC1= 4.174673
##$PH_mod= 1
##$PKNL= yes
##$PPARMOD= 0
##$PSCAL= 4
##$PSIGN= 0
##$REVERSE= no
##$SF= 250.13
##$SI= 32768
##$SIGF1= 0
##$SIGF2= 0
##$SINO= 400
##$SIOLD= 32768
##$SREGLST= <1H.CDCl3>
##$SSB= 0
##$STSI= 32768
##$STSR= 0
##$SW_p= 5175.98343685301
##$SYMM= 0
##$S_DEV= 0
##$TDeff= 65536
##$TDoff= 0
##$TI= <Analysis number 999999
Compound Code 99
Book Reference 9
Project Code 9>
##$TILT= no
##$TM1= 0
##$TM2= 0
##$TOPLEV= 0
##$USERP1= <user>
##$USERP2= <user>
##$USERP3= <user>
##$USERP4= <user>
##$USERP5= <user>
##$WDW= 1
##$XDIM= 32768
##$YMAX_p= 384043014
##$YMIN_p= -68203
$$ End of Bruker specific parameters
$$ ---------------------------------
##NTUPLES= NMR SPECTRUM
##VAR_NAME=  FREQUENCY,     SPECTRUM/REAL,   SPECTRUM/IMAG
##SYMBOL=    X,             R,               I
##VAR_TYPE=  INDEPENDENT,   DEPENDENT,       DEPENDENT
##VAR_FORM=  AFFN,          ASDF,            ASDF
##VAR_DIM=   32768,         32768,           32768
##UNITS=     HZ,            ARBITRARY UNITS, ARBITRARY UNITS
##FACTOR=    0.157963299565203, 1,           1
##FIRST=     4132.6476996994, 0,             0
##LAST=      -1043.33573715361, 0,           0
##MIN=       -1043.33573715361, -68203,      0
##MAX=       4132.6476996994, 384043014,     0
$$ Real data points
##PAGE= N=1
##DATA TABLE= (X++(R..R)), XYDATA
$$ [...]
16571b1482J82M171j2721J0968J7457K39p322j85j53m184k032J785Q285j0246
$$ -21482 -21300 -17129 -29850 -18882 -1425 -1186 -8508 -8693 -8846 -13030 -15062 -13277 -4992 -15238
16557a5238j0156m70K729P054j111l347R82L44M224p53O433J0561j933R88o968
$$ -15238 -25394 -25864 -23135 -16081 -17192 -20539 -19557 -19213 -14989 -15742 -9309 1252 -681 307 -6661
16542f661n573J1085P406j2128q850M75M3O15Q826P604j3140j3266j437J2357
$$ -6661 -12234 -1149 6257 -5871 -14721 -14246 -14203 -13588 -4762 2842 -10298 -23564 -25001 -12644
16528a2644J0333j0649O436n845m521L629p177p077M030L529R786Q121N566K541
$$ -12644 -2311 -12960 -6524 -12369 -16890 -13261 -20438 -27515 -23485 -19956 -10170 -2049 3517 6058
16514F058n022N784j1220L691j2471p632r316J2356N123J120k26k807p070J591
$$ 6058 1036 6820 -4400 -709 -13180 -20812 -30128 -17772 -12649 -11529 -11755 -14562 -21632 -20041
16500b0041L478j43r229K513o503j598r594k000K824R669Q423k45M883P604q636
$$ -20041 -16563 -16706 -25935 -23422 -29925 -31523 -41117 -43117 -40293 -30624 -22201 -22446 -17563 -9959 -18595
16485a8595j222j367p147M218p301k326j1737r443K412J6045M408m922O316L299
$$ -18595 -19817 -21184 -28331 -24113 -31414 -33740 -45477 -54920 -52508 -36463 -32055 -36977 -30661 -27362
16471b7362J0446J0242o377j2207Q969j4076N84M898j161o984Q414J5223j3156
$$ -27362 -16916 -6674 -13051 -25258 -16289 -30365 -29781 -24883 -26044 -33028 -24614 -9391 -22547
16458b2547P1Q124J5112P989j4751o170r158Q645j052L29k389k4288k478J6661
$$ -22547 -22476 -14352 760 8749 -6002 -12172 -21330 -12685 -13737 -13408 -15797 -40085 -42563 -25902
16444b5902N466O823j204q620J0239L267j3965J7124O446o533m060P12L688n972
$$ -25902 -20436 -13613 -14817 -23437 -13198 -9931 -23896 -6772 -326 -6859 -10919 -10207 -6519 -12491
16430a2491J2385J4878k927l734n900p928R488J578l318p22l940j0498n629M384
$$ -12491 -106 14772 11845 8111 2211 -5717 3771 5349 2031 1309 -2631 -13129 -18758 -14374
16416a4374J813j3715n177j563n222N37R191N149q465q96O530M454k30m375J1869
$$ -14374 -12561 -26276 -31453 -33016 -38238 -37701 -28510 -23361 -31826 -32722 -26192 -21738 -21968 -26343 -14474
16401a4474j747k661j975k369M07Q705M336J3712P172j092q984r242J1326K028
$$ -14474 -16221 -18882 -20857 -23226 -22819 -14114 -9778 3934 11106 10014 1030 -8212 3114 5142
16387E142K671N893j3594m428l063k06m183R460M493n790N457j3249j1918P836
$$ 5142 7813 13706 112 -4316 -7379 -7585 -11768 -2308 2185 -3605 1852 -11397 -23315 -15479
16373a5479L175q391q133K468K970P981r767p943j972J1541N259K2882J157j436
$$ -15479 -12304 -20695 -28828 -26360 -23390 -15409 -25176 -33119 -35091 -23550 -18291 4591 5748 4312
16359D312j1946j8019K590l641R113M261J292M352J4400J0350j0937j5928n839
$$ 4312 -7634 -25653 -23063 -26704 -17591 -13330 -12038 -7686 6714 17064 6127 -9801 -15640
16346a5640L397M85k853N231J1662o958N567o269j1830P327J4504j0689k428J7911
$$ -15640 -12243 -11758 -14611 -9380 2282 -4676 891 -5378 -17208 -9881 4623 -6066 -8494 9417
16332I417l894q852J2954j740p787l450j2873K618o9Q58R20N7j1998K368J4633
$$ 9417 5523 -3329 9625 7885 98 -3352 -16225 -13607 -13676 -12818 -11898 -11841 -23839 -21471 -6838
16317f838L914p443j6157l540R710J653J857j406L332Q832j885O810n327m367
$$ -6838 -2924 -10367 -26524 -30064 -20354 -18701 -16844 -18250 -14918 -6086 -7971 -1161 -6488 -10855
16303a0855o022N031J3377K09K369N744P008Q009m163P091j0102k3335j9526J1574
$$ -10855 -16877 -11846 1531 1740 4109 9853 16861 24870 20707 27798 17696 -5639 -25165 -13591
16289a3591R666J1064P672J95j5710j9512K161P136J0519k686n803L67l704J4887
$$ -13591 -3925 7139 14811 15006 -704 -20216 -18055 -10919 -400 -3086 -8889 -8522 -12226 2661
16275B661M823M098R009j1389j8212n185p511K362J1994L157k0215k1788J5629
$$ 2661 7484 11582 20591 9202 -9010 -14195 -21706 -19344 -7350 -4193 -24408 -46196 -30567
16262c0567J9857M179N448p60N651k230k4769j6569J6731J8016O526r243j1922
$$ -30567 -10710 -6531 -1083 -1843 3808 1578 -23191 -39760 -23029 -5013 1513 -7730 -19652
16249a9652j660R711J3750L937j043p272p777p765J1380R858J8616p814J721o242
$$ -19652 -21312 -11601 2149 6086 5043 -2229 -10006 -17771 -6391 3467 22083 14269 15990 9748
16235I748j2968j1421N701J7132p489m770k029K457m448R91N915N192m979l978
$$ 9748 -3220 -14641 -8940 8192 703 -4067 -6096 -3639 -8087 -7096 -1181 4011 -968 -4946
16221d946o232N110j0038q301O980n325j962J2086J3312J079j5062l956J4620
$$ -4946 -11178 -6068 -16106 -24407 -17427 -22752 -24714 -12628 684 1763 -13299 -17255 -2635
16208b635N371j9623N42k924l853P427p35j7169L343J0199P073P882l621p990
$$ -2635 2736 -16887 -16345 -19269 -23122 -15695 -16430 -33599 -30256 -20057 -12984 -5102 -8723 -16713
16194a6713Q28j179R188j513j349M470J0642J113p898q097P062m126l509n734
$$ -16713 -15885 -17064 -7876 -9389 -10738 -6268 4374 5487 -2411 -10508 -3446 -7572 -11081 -16815
16180a6815j810J7771L868j707m970l846j1656o587j478J4961J7653k0175r581
$$ -16815 -18625 -854 3014 1307 -3663 -7509 -19165 -25752 -27230 -12269 5384 -14791 -24372
16167b4372L63M011q906m873P386N835K0574L602p462q92J668O30m024n960J801
$$ -24372 -24009 -19998 -28904 -33777 -26391 -20556 18 3620 -3842 -4734 -3066 -2436 -6460 -12420 -10619
16152a0619J3494J14j3294O285n10j0888J980J1928r223k604N25K485N480j4962
$$ -10619 2875 2989 -10305 -4020 -4530 -15418 -13438 -1510 -10733 -13337 -12812 -10327 -4847 -19809
16138a9809L32J5265N703j928J2226M312q690j3716P756P430m358r361p143J179
$$ -19809 -19477 -4212 1491 -437 11789 16101 7411 -6305 1451 8881 4523 -4838 -11981 -10802
16124a0802q706j1247p909M350Q931L1483J1953l641k1297m436J1129k39p676
$$ -10802 -19508 -30755 -38664 -34314 -25383 6100 18053 14412 -6885 -11321 -192 -431 -8107
16111h107n567J011N209Q221j191R253j0038m792j220j3087P17O298N257K511
$$ -8107 -13674 -12663 -7454 767 -424 8829 -1209 -6001 -7221 -20308 -19591 -13293 -8036 -5525
16097e525Q094O565J023j926r625K3m535K215J684k469o688k389k114m631P642
$$ -5525 2569 9134 10157 8231 -1394 -1371 -5906 -3691 -2007 -4476 -11164 -13553 -15667 -20298 -12656
16082a2656O207j952K000M289l314L394J0307Q047j2663q817k401L834J074L00
$$ -12656 -6449 -8401 -6401 -2112 -5426 -2032 8275 16322 3659 -5158 -7559 -3725 -2651 -2351
16068b351J1626o266j0908k307O408P669k606O656J0053n063q965L515J984p778
$$ -2351 9275 3009 -7899 -10206 -3798 3871 1265 7921 17974 12911 3946 7461 9445 1667
16054A667n747n870N213Q28r555l514M456r934k060O658J0383R537j4556m849
$$ 1667 -4080 -9950 -4737 -3909 -13464 -16978 -12522 -22456 -24516 -17858 -7475 2062 -12494 -17343
16040a7343j545J1644J604N227J2678l63r711M281j0852l879J4012O770m113K22
$$ -17343 -18888 -7244 -5640 -413 12265 11902 2191 6472 -4380 -8259 5753 12523 8410 8632
16026H632j6350k815J383O426P442M486j616m562q704O567j6295n45J2241n744
$$ 8632 -7718 -10533 -9150 -2724 4718 9204 7588 3026 -5678 889 -15406 -15951 -3710 -9454
16012i454O14P48P446L103M338O148K816j0686j6035n917J1624J3573J641k86
$$ -9454 -8840 -8092 -646 2457 6795 12943 15759 5073 -10962 -16879 -5255 8318 9959 9673
15998I673j197j1380M753j0670P176l468J432n124K672O868l180n396j17P25M972
$$ 9673 8476 -2904 1849 -8821 -1645 -5113 -3681 -8805 -6133 735 -2445 -7841 -7958 -7233 -2261
15983b261P238p616o98l856o080n855j1415j327J2759J019J3864J1057Q08R470
$$ -2261 4977 -2639 -3337 -7193 -13273 -19128 -30543 -31870 -19111 -18092 -4228 6829 7637 17107
15969A7107k115j0516p251L43R890J5931L493q842k5109j3755N894R447O928r677
$$ 17107 14992 4476 -2775 -2432 7458 23389 26882 18040 -7069 -20824 -14930 -5483 1445 -8232
15955h232j7945K68J3862L816J3949L503M126M794j9639n359L225o028k029m59
$$ -8232 -26177 -25909 -12047 -8231 5718 9221 13347 18141 -1498 -6857 -3632 -9660 -11689 -12148
15941a2148n156p950q53J9081M895p022j1539l702R627J5756O096J6539Q708j6716
$$ -12148 -17304 -25254 -26107 -7026 -2131 -9153 -20692 -24394 -14767 989 7085 23624 32332 15616
15927A5616j2771P276j899j2086l071L792K778J923r360J339J4601m42N689q128
$$ 15616 2845 10121 8222 -3864 -6935 -3143 -365 1558 -7802 -6463 8138 7696 13385 5257
15913E257o333k404m742L145k148Q923M582n737M964M112l812k931o669p713N791
$$ 5257 -1076 -3480 -8222 -5077 -7225 1698 6280 543 5507 9619 5807 2876 -3793 -11506 -5715
15898e715n021k07N145M291L066J4191r43o58r526p254k008p116K0785J3780m792
$$ -5715 -10736 -10943 -5798 -1507 1559 15750 14807 14149 4623 -2631 -4639 -11755 9030 22810 18018
15883A8018j2447N378K4387r374k6211j4620P260Q203L215P227L878j5384o2n804
$$ 18018 5571 10949 35336 25962 -249 -14869 -7609 594 3809 11036 14914 -470 -532 -6336
15869f336L417R761L395k453l136q896m18P930j8126r389R998N248N763j151m162
$$ -6336 -2919 6842 10237 7784 4648 -4248 -4666 3264 -14862 -24251 -14253 -9005 -3242 -4393 -8555
15854h555N392J3237q462j8896o298R259O08K273L701j398n125j3158m055R133
$$ -8555 -3163 10074 1612 -17284 -23582 -14323 -13715 -11442 -7741 -9139 -14264 -27422 -31477 -22344
15840b2344Q152N548P380r45j0310o900J581k709m787O208K373M583M677J229
$$ -22344 -14192 -8644 -1264 -2209 -12519 -19419 -17838 -20547 -25334 -19126 -16753 -12170 -7493 -6264
15826f264L707K109p462k018K666J2992o45j473O271k720N086J4308O428j0924
$$ -6264 -2557 -448 -7910 -9928 -7262 5730 5085 3612 9883 7163 12249 26557 32985 22061
15812B2061k7246j1276P925J9238O36k531k225j6911n196N748j1761j0561M632
$$ 22061 -5185 -16461 -8536 10702 11338 8807 6582 -10329 -15525 -9777 -21538 -32099 -27467
15799b7467J6950J6129J2191l622j5972j6096p961J4668J7497r30o634Q200p259
$$ -27467 -10517 5612 17803 14181 -1791 -17887 -25848 -11180 6317 5387 -1247 6953 -306
15786c06j0016J0429M354n818N650P43L14r670J0572Q351k727n408J3754P817
$$ -306 -10322 107 4461 -1357 4293 5036 5350 -4320 6252 14603 11876 6468 20222 28039
15772B8039j0165l200r738j4348j1992L297J065p638l899J5384R873Q165j891
$$ 28039 17874 14674 4936 -9412 -21404 -18107 -17042 -24680 -28579 -13195 -3322 4843 2952
15759B952j1569M248J7239L52N044j3162j4345N805r967j3557J3884J2449l494
$$ 2952 -8617 -4369 12870 13222 18266 5104 -9241 -3436 -13403 -26960 -13076 -627 -4121
15746d121r59k518J1311J4120k092j619J593o602j5841k24P169M147L858J940
$$ -4121 -5080 -7598 3713 17833 15741 14122 15715 9113 -6728 -6952 217 4364 8222 10162
15732A0162o747n0m881O707k907J3174P468M863j034n697j0922o678j381L902
$$ 10162 3415 3365 -1516 5191 2284 15458 22926 27789 26755 21058 10136 3458 2077 5979
15718E979J5041j057j523j1526p387J0872k645m189J2865K446K433K078O515J2571
$$ 5979 21020 19963 18440 6914 -473 10399 7754 3565 16430 18876 21309 23387 29902 42473
15704D2473n310n063j8609J561K3419J3282M443j2526q098q099n647J520J6448
$$ 42473 37163 32100 13491 15052 38471 51753 56196 43670 35572 27473 21826 23346 39794
15691C9794K20o018j1780o434l441K824Q021J1125R83L282j5208n170o896j4022
$$ 39794 40014 33996 22216 15782 12341 15165 23186 34311 35294 38576 23368 18198 11302 -2720
15677b720M382N715O687K87j315P756J9869k438L314P379O197j6582l774O625
$$ -2720 1662 7377 14064 14351 13036 20792 40661 38223 41537 48916 55113 38531 34757 41382
15663D1382j0012R384P087Q7J19q765N453Q168j0320l311p157J883J360o547k347
$$ 41382 31370 40754 47841 47928 48047 39282 44735 52903 42583 39272 32115 33998 35358 28811 26464
15648B6464M066L985K868j17N444j3552k4602j0463J2216K0009J252K4N722R929
$$ 26464 30530 34515 37383 37266 42710 29158 4556 -5907 6309 26318 27570 27594 33316 43245
15634D3245p78j2364o746k159J4087N498Q468k442j4759L454O921l863K307M884
$$ 43245 42467 30103 23357 21198 35285 40783 49251 46809 32050 35504 42425 38562 40869 45753
15620D5753M335q757m095J5640L026j0012N060l372M914m67R25q270J769q885
$$ 45753 50088 41331 37236 52876 55902 45890 50950 47578 52492 52025 52950 44680 46449 37564
15606C7564P40J6028J2428k4673j1896j0238q739O600P368J9089q4j669K236N251
$$ 37564 38304 54332 66760 42087 30191 19953 11214 17814 25182 44271 44187 42518 44754 50005
15592E0005K276P380L375o975p13J0289N42k3483j1916J078p14O144J0646K983
$$ 50005 52281 59661 63036 56061 55348 65637 66179 42696 30780 31858 31144 37288 47934 50917
15578E0917J1054J482j7123j958L847K036r59L023J0944K399l598o521k616n414
$$ 50917 61971 63453 46330 44372 48219 50255 49296 52319 63263 65662 62064 55543 52927 47513
15564D7513n450J046P394J1167j002O735J1621J5373j1850j4513O334o729n562
$$ 47513 42063 43109 50503 61670 60668 67403 79024 94397 82547 68034 74368 67639 62077
15551F2077m356p052Q914O725o634j0190n33K274J444J645J2149K0084l943l459
$$ 62077 57721 50669 59583 66308 59674 49484 48951 51225 52669 54314 66463 86547 82604 79145
15537G9145n698r666K486R418j517p211R349j2296j1459n320j351l393n729L013
$$ 79145 73447 63781 66267 75685 74168 66957 76306 64010 52551 47231 45880 42487 36758 39771
15523C9771J2700L549j193q759Q463m571p112J4474K979p603n45k058L759O168
$$ 39771 52471 56020 54827 46068 54531 49960 42848 57322 60301 52698 52153 50095 53854 60022
15509F0022J3031m005o631j0796L437K110L116j0226k249N01k569k846n008l511
$$ 60022 73053 69048 62417 51621 55058 57168 60284 50058 47809 48310 45741 42895 37887 34376
15495C4376J672J4894O739N693q232O522N013l057m933j021J855N616n897n143
$$ 34376 36048 50942 57681 63374 55142 61664 66677 63620 58687 57666 59521 65137 59240 54097
15481E4097R328m560p735r396j395K605R793J3188p022K58r495o088J7274o79
$$ 54097 63425 58865 51130 41734 40339 42944 52737 65925 58903 59161 49666 43578 60852 60173
15467F0173j1388Q650K998j579j321K213o580o828l761j1088M567P955J1379N55
$$ 60173 48785 57435 60433 58854 57533 59746 53166 46338 42577 31489 36056 44011 55390 55945
15453E5945q400l848O953J2318j0071j5351K919n78j4725r203O516P687Q998Q717
$$ 55945 47545 43697 50650 62968 52897 37546 40465 39887 25162 15959 22475 30162 39160 47877
15439D7877m328o088k607R157j929p451k206P761J5462P371R908m308k0781k775
$$ 47877 43549 37461 34854 44011 42082 34631 32425 40186 55648 63019 72927 68619 47838 45063
15425D5063k900o168l481J551q292J657q417n809O340R881J203m09J8394J0281
$$ 45063 42163 35995 32514 34065 25773 27430 19013 13204 19544 29425 30628 30219 48613 58894
15411E8894j2322j7666r136J3300J406k511O871j1967j8324M093J0284j2678k164
$$ 58894 46572 28906 19770 33070 34476 31965 38836 26869 8545 12638 22922 10244 8080
15398H080j2038q042P429J181p144J4208L062K542o32J2827R202p553Q751m101
$$ 8080 -3958 -12000 -4571 -3390 -10534 3674 6736 9278 8646 21473 30675 23122 31873 27772
15384B7772k69R797j1858n196j1517j0452J2195P260r343q129j0929P851K677
$$ 27772 27503 37300 25442 20246 8729 -1723 10472 17732 8389 260 -10669 -2818 -141
15371a41M714J0055P301k349l899L156q948N70Q683R819N52j4837j2163J4510
$$ -141 4573 14628 21929 19580 15681 18837 9889 10459 19142 28961 29513 14676 2513 17023
15357A7023L0077J2103r502k3595j6176N594L995J3841J5537p485j9034j4085
$$ 17023 47100 59203 49701 26106 9930 15524 19519 33360 48897 41412 22378 8293
15345H293N401N067L2p851K490J6760k833Q354k677j6782j4084R646L086n116
$$ 8293 13694 18761 18793 10942 13432 30192 27359 35713 33036 16254 2170 11816 14902 9786
15331I786k462J0000O596L295j6511R16M413N881J0791j2025N514M39j1060P699
$$ 9786 7324 17324 23920 27215 10704 11620 16033 21914 32705 20680 26194 26633 15573 23272
15317B3272J5591j073j4055n334O85N981m645k961m259m417m146J0548J0896n594
$$ 23272 38863 37790 23735 18401 19086 25067 20422 17461 13202 8785 4639 15187 26083 20489
15303B0489Q153L804j373Q87O41o957j6818N8J2916j4024k2688K860K097O847
$$ 20489 28642 32446 31073 31960 32601 25644 8826 8884 21800 7776 -14912 -12052 -9955 -3108
15289c108K467k373P818J4673j713j2589N38L503j0989k150k577N25M463k326
$$ -3108 -641 -3014 4804 19477 17764 5175 5713 9216 -1773 -3923 -6500 -5975 -1512 -3838
15275c838K776R377o324K995Q406J2265m559o74j847n925P80K219O74k219j6379
$$ -3838 -1062 8315 1991 4986 13392 25657 21098 20424 18577 12652 13432 15651 16325 14106 -2273
15260b273j7595O447P260R681N070m32O465J8021P217p74j7605r571q401n186
$$ -2273 -19868 -13421 -6161 3520 8590 8158 14623 32644 39861 39087 21482 11911 3510 -1676
15246a676Q504O999J321r268j1248n698J203p623J1168M480K886L471n82j618
$$ -1676 6828 13827 15148 5880 -5368 -11066 -9863 -17486 -6318 -1838 1048 4519 3937 2319
15232B319n168m767Q58K874J4673J593K649J9233R050j5259j3522o663J0361J8153
$$ 2319 -2849 -7616 -6758 -3884 10789 12382 15031 34264 43314 28055 14533 7870 18231 36384
15218C6384N607j3588j8334j3357q094l540L710J2621Q649M751j6443k298J409
$$ 36384 41991 28403 10069 -3288 -11382 -14922 -11212 1409 10058 14809 -1634 -3932 -2523
15205b523m947J91Q732j0052q271J1923L590j1092N871K000q151l80J5327J1505
$$ -2523 -7470 -7279 1453 -8599 -16870 -4947 -1357 -12449 -6578 -4578 -12729 -13109 2218 13723
15191A3723k550J693l411n406j048L698j1305j7425L55J1953m325K836j728Q576
$$ 13723 11173 12866 9455 4049 3001 6699 -4606 -22031 -21676 -9723 -14048 -11212 -12940 -4364
15177d364P541K71j190L694k557M12l339j3527M69p278J7960K817M59L570k853
$$ -4364 3177 3448 2258 5952 3395 3807 468 -13059 -12590 -19868 -1908 909 1368 4938 2085
15162B085o764j3510M926J7108j3121P002J1901M240j180L82n075K647j6446j7913
$$ 2085 -4679 -18189 -13263 3845 -9276 -2274 9627 13867 12687 13069 7994 10641 -5805 -23718
15148b3718P253J7102J0003q324r333P066p75p690R212p11j552j3075j0784O987
$$ -23718 -16465 637 10640 2316 -7017 49 -726 -8416 796 85 -1467 -14542 -25326 -18339
15134a8339k002J8493J9674j00j2664M251J1680q743q223j6219M770K457M085
$$ -18339 -20341 -1848 17826 17726 5062 9313 20993 12250 4027 -12192 -7422 -4965 -880
15121h80k04J824N024j4572p310N612k964l337j051J2640M405O705M918l609J1092
$$ -880 -1084 740 5764 -8808 -16118 -10506 -13470 -16807 -17858 -5218 -813 5892 10810 7201 18293
15106A8293l387K619L797J4992l485j6571j3888K66J9272J643j0460j5296P996
$$ 18293 14906 17525 21322 36314 32829 16258 2370 2636 21908 23551 13091 -2205 5791
15093E791P629o182L930n20j59l161L844q825J57O151l894m738J0140J8829J0462
$$ 5791 13420 7238 11168 10648 10489 7328 11172 2347 2504 8655 4761 23 10163 28992 39454
15078C9454j3011p618J337K251q317j3265m544o215M07Q128m000j67Q803p269
$$ 39454 26443 18825 20162 22413 14096 831 -3713 -9928 -9521 -1393 -5393 -5560 3243 -4026
15064d026m500J122K722P777L444l689o048j1500O669J0339J6249J545M60K618
$$ -4026 -8526 -7404 -4682 3095 6539 2850 -3198 -14698 -8029 2310 18559 20104 20564 23182
15050B3182r992n647j335o658k203J1818m555m027N526O148K048m922j0793j1068
$$ 23182 13190 7543 6208 -450 -2653 9165 4610 583 6109 12257 14305 9383 -1410 -12478
15036a2478o562K2323R566O79L47O249j5493q258J0100j460q080k479J4596J2307
$$ -12478 -19040 3283 12849 13528 13875 20124 4631 -3627 6473 5013 -3067 -5546 9050 21357
15022B1357o588m438r283m460M032P202J1603l847j9247j506M618O43l112J3539
$$ 21357 14769 10331 1048 -3412 620 7822 19425 15578 -3669 -5175 -557 86 -3026 10513
15008A0513J2739m568j7913j1118R689J4194l34N123P921j3089m364R4N216m818
$$ 10513 23252 18684 771 -10347 -658 13536 13202 18325 26246 13157 8793 8887 14103 9285
14994I285q371r467p208N195K964K091K922N656N744j2152l779J1199J1706N012
$$ 9285 914 -8553 -15761 -10566 -7602 -5511 -2589 3067 8811 -3341 -7120 4079 15785 20797
14980B0797K496J4204J0426N671K6037N2029P5641M9180K8887K3262O772p9342
$$ 20797 23293 37497 47923 53594 79631 131660 207301 256481 285368 308630 315402 236060
14968B36060r8909n5008k2019r848m733j1952p606K7m236j0859L828l503l024
$$ 236060 137151 82143 60124 50276 45543 33591 25985 26012 21776 10917 14745 11242 8218
14955H218j0107l863p66J4349Q725L050J1219r137r794j4960P604j65o73j2448
$$ 8218 -1889 -5752 -6518 7831 16556 19606 30825 21688 11894 -3066 4538 4373 3700 -8748
14941h748N824P888M493l989p011K183O235R30p546j0206M863J0107o396q767
$$ -8748 -2924 4964 9457 5468 -1543 640 6875 7805 259 -9947 -5084 5023 -1373 -10140
14927a0140p67l87PJ1787J1566L746k23l910j2374q759J0814O731q42O300Q075
$$ -10140 -10907 -11294 -11287 500 12066 15812 15589 11679 -695 -9454 1360 8091 7249 13549 21624
14912B1624o410k796j5478q969M799J6865J8226j3407k0766O780J3572Q812J098
$$ 21624 15214 12418 -3060 -12029 -7230 9635 27861 14454 -6312 468 14040 22852 23950
14899B3950k3021j6360K022J4260P478l906l909o788o634N278m712r948J1564
$$ 23950 929 -15431 -13409 851 8329 4423 514 -6274 -12908 -7630 -12342 -22290 -10726
14886a0726P216M700m15J453n4p821M633Q882J1921k565n130L958J562n682J934
$$ -10726 -3510 1190 775 2228 2174 -5647 -1014 7868 19789 17224 12094 16052 17614 11932 13866
14871A3866p926l407O997R241L843j2654q269r295m753P426k59O824Q604M813
$$ 13866 5940 2533 9530 18771 22614 9960 1691 -7604 -12357 -4931 -5190 1634 10238 15051
14857A5051q142m819K628j9378J581J9444R933m892M440m858n544M920q366K325
$$ 15051 6909 2090 4718 -14660 -13079 6365 16298 11406 15846 10988 5444 10364 1998 4323
14843D323j060J79M83J1404m625j943O680k034m198n570Q020J8548N455k4030
$$ 4323 3263 3442 3925 15329 10704 8761 15441 13407 9209 3639 11659 30207 35662 11632
14829A1632k0539J5349J5346r508p833J0841M708l09j667J981M871N599j881j2650
$$ 11632 -8907 6442 21788 12280 4447 15288 19996 19687 18020 20001 24872 30471 28590 15940
14815A5940j4674j682J1900K2187r2k858l535j0986L836K305m325r823N661K481
$$ 15940 1266 -416 11484 33671 33579 30721 27186 16200 20036 22341 18016 8193 13854 16335
14801A6335Q048M06j494r360J538p368j1061n543M039M304J5281R315p338K427
$$ 16335 24383 24789 23295 13935 15473 8105 -2956 -8499 -4460 -156 15125 24440 17102 19529
14787A9529J4278K902l712p696j889J856O971p95N423Q612j1677j1165p377J2560
$$ 19529 33807 36709 32997 25301 23412 25268 32239 31444 36867 45479 33802 22637 15260 27820
14773B7820P371j1752q66r976O782K0680p702j4465n801J3921M413n391N735R593
$$ 27820 35191 23439 22573 12597 19379 40059 32357 17892 12091 26012 30425 25034 30769 40362
14759D0362Q206m157o292j904J2593L853l326j943j320p59K848k025P077O016
$$ 40362 48568 44411 38119 36215 48808 52661 49335 47392 46072 45313 48161 46136 53213 59229
14745E9229l899K078J2927k6521j8633J4637J4765k264o340m380j5160L790P073
$$ 59229 55330 57408 70335 43814 25181 39818 54583 52319 45979 41599 26439 30229 37302
14732C7302R856J243J4403p570p84J816m851p116J3487m020j317R34j027M846
$$ 37302 47158 48401 62804 55234 54450 56266 51415 44299 57786 53766 52449 53383 52356 57202
14718E7202M362J987q97k212j526o021k976N688P739J0607j1152m488r542r255
$$ 57202 61564 63551 62654 60442 58916 52895 49919 55607 63346 73953 62801 58313 48771 39516
14704C9516J174N356L071L119j2704R221M844O915m043n348R175M023r037l966
$$ 39516 40690 46046 49117 52236 39532 48753 53597 60512 56469 51121 60296 64319 55282 51316
14690E1316o092r702K754J4282K843J5940P512j0694j1102l147j3951J646J9917
$$ 51316 45224 35522 38276 52558 55401 71341 78853 68159 57057 53910 39959 41605 61522
14677F1522J1924j171q352m753j0776m590q503J6288O506o118Q441n124n682N389
$$ 61522 73446 72275 63923 59170 48394 43804 35301 51589 58095 51977 60418 55294 49612 55001
14663E5001k216j0392k438O097L470j233J8855p350j4304l079r988q326R493L880
$$ 55001 52785 42393 39955 46052 49522 48289 67144 59794 45490 42411 32423 24097 33590 37470
14649C7470J3951k061J767K807j296R044K472N956j8360j7075o525M544J8482
$$ 37470 51421 49360 51127 53934 52638 61682 64154 70110 51750 34675 28150 32694 51176
14636E1176O012M194k108M448P269N354o575j1423k1991O165L258j0028m249j0274
$$ 51176 57188 61382 59274 63722 70991 76345 69770 58347 36356 42521 45779 35751 31502 21228
14622B1228L51k736J5257k211N393J0555j890J727j559j1677q640o591m664N140
$$ 21228 21579 18843 34100 31889 37282 47837 45947 47674 46115 34438 25798 19207 14543 19683
14608A9683L028J406O371J7610q613j8981L87M443P271M212r004K302J6297k49
$$ 19683 22711 24117 30488 48098 39485 20504 20891 25334 32605 36817 27813 30115 46412 46163
14594D6163j4286p994j4020q3J692Q337k13r33r692o282j5582n613q677Q746J0964
$$ 46163 31877 23883 9863 9780 11472 19809 19596 18663 8971 2689 -12893 -18506 -27183 -18437 -7473
14579g473O437P864K072P578J936m802k0371k559N223R842J2351J013j1856k1418
$$ -7473 -1036 6828 8900 16478 18414 13612 -6759 -9318 -4095 5747 18098 19111 7255 -14163
14565a4163P414J7625Q341l503N758Q414j0802j0083m963O404J4220p327n167
$$ -14163 -6749 10876 19217 15714 21472 29886 19084 9001 4038 10442 24662 17335 12168
14552A2168O041j5629j4685M299m321R392O634J1087J3682j255m037p74k1113
$$ 12168 18209 2580 -12105 -7806 -12127 -2735 3899 14986 28668 27413 23376 22602 1489
14539A489j7850l771O803J906J3794J109m550K1P014o031p477p114m399L481l44
$$ 1489 -16361 -20132 -13329 -11423 2371 3480 -1070 -1049 5965 -66 -7543 -14657 -19056 -15575 -15919
14524a5919R753J6916M927P634K68n624O438N503r75J212j1976j2734j2302J427
$$ -15919 -6166 10750 15677 23311 23579 17955 24393 29896 28921 30133 18157 5423 -6879 -5452
14510e452R558P5p07J4306O064r38q980j2902p682k195Q352J0379n40j015M340
$$ -5452 4106 4181 3474 17780 23844 22906 13926 1024 -6658 -8853 -501 9878 9338 8323 12663
14495A2663M641L97k7921j429r64n848J1423L074N422P971K872M153m520k012
$$ 12663 17304 17701 -10220 -11649 -12613 -18461 -7038 -3964 1458 9429 12301 16454 11934 9922
14481I922P71K532l164p247j642N799J7443L524j6259p820J9712J5929N208q022
$$ 9922 10693 13225 10061 2814 1172 6971 24414 27938 11679 3859 23571 39500 44708 36686
14467C6686q438p429k570j1758n857L065J6799O803m510j0461K344r9Q59n401
$$ 36686 28248 20819 18249 6491 634 3699 20498 27301 22791 12330 14674 14575 15434 10033
14453A0033Q71J6562J1127j332N594j7898j0574r908o463j2327L406Q409M968
$$ 10033 10904 27466 38593 37261 42855 24957 14383 4475 -1988 -14315 -10909 -2500 2468
14440B468K142o570K467k754N481J5913j894n310j0004l894J7666J192n853P99
$$ 2468 4610 -1960 507 -2247 3234 19147 17253 11943 1939 -1955 15711 16903 11050 11849
14426A1849K504J3198q618j2408r737p094J9391J848q966j956L148N346J003Q592
$$ 11849 14353 27551 18933 6525 -3212 -10306 9085 10933 1967 11 3159 8505 9508 18100
14412A8100Q752r825N09R028j804K847l140l634j4171o47J6865L536p536k880
$$ 18100 26852 17027 17536 26564 24760 27607 24467 20833 6662 6015 22880 26416 18880 16000
14398A6000l277O143n141p05o486O078O232k955M741J0353j6718j7073J7663K328
$$ 16000 12723 18866 13725 13020 6534 12612 18844 15889 20630 30983 14265 -2808 14855 17183
14384A7183r027j1796O952Q04p499k690Q923J4814M351Q91J449P366O16m157m035
$$ 17183 8156 -3640 3312 4116 -3383 -6073 2850 17664 22015 22906 24355 31721 32337 28180 24145
14369B4145J5334Q237q339k722K14Kr377K024J8237p772k2311J2037J9918J5780
$$ 24145 39479 47716 39377 36655 36869 36871 27494 29518 47755 39983 17672 29709 49627 65407
14355F5407Q607J1093p60J049J2818K230M629N285k129O03O59j2478k386l521
$$ 65407 74014 85107 84347 85396 98214 100444 105073 110358 108229 108832 109491 97013 94627 91106
14341I1106p438J4550J4679M636J8469K4521L834R084K1547K5603M7742O1760
$$ 91106 83668 98218 112897 117533 136002 160523 164357 173441 194988 220591 268333 330093
14329C30093Q3238R3977Q9642J08685J15303J07028P4721O1390K6328j5593m8922
$$ 330093 413331 507308 596950 705635 820938 927966 1002687 1064077 1090405 1074812 1025890
14318A025890p3137r1702r4619r1827r1165o9767o7567n6791m7118k8204k9594
$$ 1025890 952753 861051 766432 674605 583440 513673 446106 389315 342197 313993 284399
14307B84399l6305k0699j9075j2130j7361j4666r519r268o442q817n367l04M280
$$ 284399 248094 227395 208320 196190 178829 164163 154644 145376 138934 130117 124750 124446 128726
14294A28726r852k961j1673o631Q31r685j3334j6396m934R319N742Q825j391j9297
$$ 128726 118874 115913 104240 97609 98440 88755 75421 59025 54091 63410 69152 77977 76586 57289
14280E7289j5208K803K8754j968j6676k0404j5788N243k668L46N793K017n142
$$ 57289 42081 44884 73638 71670 54994 34590 18802 24045 21377 21723 27516 29533 24391
14267B4391J1946P750j622j647J2099l413p265p156o360j2076k394M963N296J177
$$ 24391 36337 44087 42465 40818 52917 49504 42239 35083 28723 16647 14253 19216 24512 25689
14253B5689j696j3494l860J1299K3166N610j1690o287j65J224M671K661j5598
$$ 25689 23993 10499 6639 17938 41104 46714 35024 28737 28572 29796 34467 37128 21530
14240B1530M660J1414k3885k0056J309l267K2208J7397J0127k44O501J1540p118
$$ 21530 26190 37604 13719 -6337 -5028 -8295 13913 31310 41437 41193 47694 59234 52116
14227E2116n240j1053q516m700K730O541k528j6147K793O679R928m109J3999j2741
$$ 52116 46876 35823 27307 22607 25337 31878 29350 13203 15996 22675 32603 28494 42493 29752
14213B9752j7841R86M168N893J8574J451n167K645O99J1001j4445j3835N387p51
$$ 29752 11911 12897 17065 22958 41532 42983 37816 40461 41160 52161 37716 23881 29268 28517
14199B8517k794R425O177j3928q736J1365j1369j3203N406K630R209l295j0832
$$ 28517 25723 35148 41325 27397 18661 30026 18657 5454 10860 13490 22699 19404 8572
14186H572n109O206J1125Q201q612j4858q887P104M910R012J4243p356m789M595
$$ 8572 3463 9669 20794 28995 20383 5525 -3362 3742 8652 17664 31907 24551 19762 24357
14172B4357k159j5021p570R400J809j3737J3086J0444o776j904P082l951j0382
$$ 24357 22198 7177 -393 9007 10816 -2921 10165 20609 13833 11929 19011 15060 4678
14159D678M61Q043P16l011n872k763J1904J2676o269k463m974j2793j7133j2441
$$ 4678 5139 13182 13898 10887 5015 2252 14156 26832 20563 18100 13126 333 -16800 -29241
14145b9241J207K2934Q769L981N303m576j1744J0261l148M683J9864K491m001
$$ -29241 -28034 -5100 3669 7650 12953 8377 -3367 6894 3746 8429 28293 30784 26783
14132B6783M910j393r003j5314j2565J25J924q293K630Q312O131j118J6982P66
$$ 26783 31693 30300 21297 5983 -6582 -6457 -4533 -12826 -10196 -1884 4247 3129 20111 20877
14118B0877j3597N37M630j0723p769N493Q412l884p53J310J692M698L231K450
$$ 20877 7280 7817 12447 1724 -6045 -552 7860 3976 3223 4533 6225 10923 14154 16604
14104A6604J509O002o98j2574p02J6785J8729N65J529j9166k120n362j0718M257
$$ 16604 18113 24115 23417 10843 10141 26926 45655 46220 47749 28583 26463 21101 10383 14640
14090A4640k453r15j102j831N704J6078N807m37m249o057J0422p957p141J0589
$$ 14640 12187 11272 10170 8339 14043 30121 35928 35491 31242 25185 35607 27650 20509 31098
14076C1098j630n236N164Q342k72J85J78j4723r529K935J7377P761n666o926J5336
$$ 31098 29468 24232 29396 37738 37466 37651 37829 23106 13577 16512 33889 41650 35984 29058 44394
14061D4394j4347q434M61N977q74M029Q388N948j1162j06J4547N324K236q913
$$ 44394 30047 21613 22074 28051 27177 31206 39594 45542 34380 34274 48821 54145 56381 47468
14047D7468q218J1106J3921K609J0727L0825K6935L4047M2666K9409L6582K9333
$$ 47468 39250 50356 64277 66886 77613 108438 135373 169420 212086 241495 278077 307410
14035C07410K7055J2572j8975j6588r847l1172m6531l0268k6426k2624k7685k8571
$$ 307410 334465 347037 328062 311474 301627 270455 223924 193656 167230 144606 116921 88350
14023H8350j9876o91R897p525k102r276n966k475o07p205O623N502K054k864O470
$$ 88350 68474 67783 77680 70155 68053 58777 52811 50336 49729 42524 49147 54649 56703 53839 60309
14008F0309M36j1123j0323l893r994j6705K889J6466J5304J2623o922N3n996q526
$$ 60309 60745 49622 39299 35406 25412 8707 11596 28062 43366 55989 49067 49120 43124 34598
13994C4598k728M066K561q643j2046o948k11P898J6173J713p086k999p708j0852
$$ 34598 31870 35936 38497 29854 17808 10860 10649 18547 34720 36433 29347 26348 18640 7788
13980G788j0143J0013Q678m713O866P573N159l123j5874p492J0573J5347N824
$$ 7788 -2355 7658 16336 11623 18489 26062 31221 28098 12224 4732 15305 30652 36476
13967C6476k922j0490J224R73q57k052M801M671k940q576q284K992M876J2763
$$ 36476 33554 23064 24288 25261 24404 22352 27153 31824 28884 20308 12024 15016 19892 32655
13953C2655Q720j403k855j043n704q520P072N604n899J708O960j0286R19J8172
$$ 32655 41375 39972 37117 36074 30370 21850 28922 34526 28627 30335 37295 27009 27928 46100
13939D6100M068j665J28q827j453L213p201N245q084k625J5382M252n148M616
$$ 46100 50168 48503 48631 39804 38351 41564 34363 39608 31524 28899 44281 48533 43385 48001
13925D8001N282j738p473O48O385J208n067N59n027j3333j0979O288J8601K1711
$$ 48001 53283 51545 44072 44720 51105 52313 47246 47805 42778 29445 18466 24754 43355 65066
13911F5066J0103L559n783Q335J0102k763Q888K4859M0788N2539N5904O0509J08140
$$ 65066 75169 78728 72945 81280 91382 88619 97507 122366 163154 215693 271597 332106 440246
13898D40246J74834K48188L21280L14986K34469J51064N0702k32497m50548l64837
$$ 440246 615080 863268 1184548 1499534 1734003 1885067 1935769 1703272 1252724 887887
13888H87887k09400j43772j11002o5837m5418l1225k9129j5756k2151j8464j3416
$$ 887887 678487 534715 423713 357876 312458 281233 252104 236348 214197 195733 182317
13877A82317j4716m868o991j505R169j4753K708j2148o92K743l590j1921L76r024
$$ 182317 167601 162733 155742 154237 163406 148653 151361 139213 138521 141264 137674 125753 126129 117105
13863A17105j0264J1390O931k6987k1988r590O731m289Q438J0049k168m945m302
$$ 117105 106841 118231 125162 98175 76187 66597 73328 69039 77477 87526 85358 80413 76111
13850G6111P282n527o959j7518L739K1141P605q808m349k976P571o275o293o115
$$ 76111 83393 77866 70907 53389 57128 78269 85874 77066 72717 69741 77312 71037 64744 58629
13836E8629j3208n311Q396j0690r146j837Q340n764J343R595m571j1497J4484
$$ 58629 45421 40110 48506 37816 28670 26833 35173 29409 30752 40347 35776 24279 38763
13823C8763O989q079r169Q954J0776p028r426J2170L034o930n181j1562J57R801
$$ 38763 45752 37673 28504 37458 48234 41206 31780 43950 46984 40054 34873 23311 23468 33269
13809C3269R741O627M21q640o083j4296M829r943j2065J101K1569J6095n112k656
$$ 33269 43010 49637 50058 41418 35335 21039 25868 15925 3860 4961 26530 42625 37513 34857
13795C4857P217j214j9039j727q237m648o056J7902Q630M158R739q657k978J1313
$$ 34857 42074 40860 21821 20094 11857 7209 1153 19055 27685 31843 41582 32925 29947 41260
13781D1260O019o405q084r928J204P004l852j1980l546M347J0717q277q758J3019
$$ 41260 47279 40874 32790 22862 24066 31070 27218 15238 11692 16039 26756 18479 9721 22740
13767B2740M012k7030O066J5608J559j1545L388R036m866r520N320r245j457Q673
$$ 22740 26752 -278 5788 21396 22955 11410 14798 23834 18968 9448 14768 5523 4066 12739
13753A2739l153L637R460J4628J0079j6380r387K417J0659j649j8496R83N717
$$ 12739 9586 13223 22683 37311 47390 31010 21623 24040 34699 33050 14554 15537 21254
13740B1254N274O235k982k3335j0232n257k483Q559J4268J84J192o534R61j1075
$$ 21254 26528 32763 29781 6446 -3786 -9043 -11526 -2967 11301 11485 12677 6143 7104 -3971
13726c971K86R296J3355k21r417k841l650J583j1598o812N383n127J5152K6345
$$ -3971 -3685 5611 18966 18745 9328 6487 2837 4420 -7178 -13990 -8607 -13734 1418 27763
13712B7763J1225R046j0386k236m006m498J1202k939K145o792p689j3008p521
$$ 27763 38988 48034 37648 35412 31406 26908 38110 35171 37316 30524 22835 9827 2306
13699B306L957n568J7320N957j5118J0752P931l606j4492k865J1642k842m109
$$ 2306 6263 695 18015 23972 8854 19606 27537 23931 9439 6574 18216 15374 11265
13686A1265J3468L001j0650p503j557n686M032J1861O083l992k3894J373Q559
$$ 11265 24733 27734 17084 9581 8024 2338 6370 18231 24314 20322 -3572 -2199 6360
13673F360n17J5314l314R856M762n208O00L643P95K110j3615j1842j0804q645
$$ 6360 5843 21157 17843 27699 32461 27253 27853 31496 32291 34401 20786 8944 -1860 -10505
13659a0505J1680K4617j240l707J27j4301l268J418j886Q219J8308P64j7666k767
$$ -10505 1175 25792 24552 20845 20972 6671 3403 4821 2935 11154 29462 30226 12560 9793
13645I793R354R685j4594j1458J5790O599j447m839j2023J241Q130k592N012L365
$$ 9793 19147 28832 14238 2780 18570 25169 23722 18883 6860 8101 16231 13639 18651 22016
13631B2016k727o329J862n484q780j3746R089J7477L44l398k240P89P320k044
$$ 22016 19289 12960 14822 9338 558 -13188 -4099 13378 13722 10324 8084 8873 16193 14149
13617A4149P143j4664k5284j126J5884J3137Q865l025J4575J4749o960m789j0101
$$ 14149 21292 6628 -18656 -19782 -3898 9239 18104 15079 29654 44403 37443 32654 22553
13604B2553n47O27q144o47J77n499O112j960J7516R204k751k0113j231N086n894
$$ 22553 22006 22633 14489 13842 14019 8520 14632 12672 30188 39392 36641 16528 15297 20383 14489
13589A4489Q410P00r756Q280J9682J5030k2583k1557m559J3744Q326P66N55O734
$$ 14489 22899 23599 13843 22123 41805 56835 34252 12695 8136 21880 30206 30972 31527 38261
13575C8261q209m543J0548J148j3317p740P472K524j127l987j2922j2633K225
$$ 38261 30052 25509 36057 37205 23888 16148 23620 26144 25017 21030 8108 -4525 -2300
13562b300J3318J1649q578K181n235O904N937N839n68n086l486J939j382N925
$$ -2300 11018 22667 14089 16270 11035 17939 23876 29715 29147 24061 20575 22514 21132 27057
13548B7057o397l931J2708p756j6108K989n266O196K9933J2043Q301J1510m833
$$ 27057 20660 16729 29437 21681 5573 8562 3296 9492 39425 51468 59769 71279 66446
13535F6446k3987j0907j415J092K206J437M167m554p021p336n86L0080k696k0575
$$ 66446 42459 31552 30137 31229 33435 34872 39039 34485 27464 20128 19542 49622 46926 26351
13521B6351j0455n901L689R132K356P93L21k124M592O615j0321Q957n874o914
$$ 26351 15896 9995 13684 22816 25172 25965 26286 24162 28754 35369 25048 34005 28131 21217
13507B1217J0376J1451N856K712k630j5152k156j064L901j0581K381K755J63R914
$$ 21217 31593 43044 48900 51612 48982 33830 31674 30610 34511 23930 26311 29066 29229 39143
13493C9143m130O800m542J359M796j218k500j1675Q441L759j50J452j5721l35
$$ 39143 35013 41813 37271 38630 43426 42208 39708 28033 36474 40233 40083 41535 25814 25479
13479B5479O745q2J44J1060j071K525n701n392k729o423QK3099J1150j4822o433
$$ 25479 32224 32142 32286 43346 42275 44800 39099 33707 30978 24555 24563 47662 58812 43990 37557
13464C7557P440r272j3348j4312O039K0386M792K292n743q339j599K0608N046
$$ 37557 44997 35725 22377 8065 14104 34490 39282 41574 35831 27492 25893 46501 51547
13451E1547jm273J0478j1056l0383j0328K0955R999j2039K515n494q2J2234m605
$$ 51547 51546 47273 57751 46695 16312 5984 26939 36938 24899 27414 21920 21838 34072 29467
13437B9467o999M48P117N967M755N54k629j2002j0709m017J8471R920n793j855
$$ 29467 22468 22916 30033 36000 40755 41309 38680 26678 15969 11952 30423 40343 34550 32695
13423C2695K4112L55j0585m083J642k635o018o256J1524J7703k434r291j3607
$$ 32695 56807 57162 46577 42494 44136 41501 35483 29227 40751 58454 56020 46729 33122
13410C3122j2714j1159O088j660K227Q389L468J793N477O525M529j051P597K1433
$$ 33122 20408 9249 15337 13677 15904 24293 27761 29554 35031 41556 46085 45034 52631 74064
13396G4064M95j1354j752j1906P825r715j1458j0586J0441J5397N125O915J021
$$ 74064 74559 63205 61453 49547 57372 47657 36199 25613 36054 51451 56576 63491 64512
13383F4512M383j1379n277J821l389j3211p02p29P173L435q314j1388N042J6637
$$ 64512 68895 57516 52239 54060 50671 37460 36758 36029 43202 46637 38323 26935 31977 48614
13369D8614j549n77R571j716r106J240K697L050j0797J1521k150k463J866n103
$$ 48614 47065 46488 56059 54343 45237 46477 49174 52224 41427 52948 50798 48335 50201 45098
13355D5098l212J2514K988L306M007o28j820R61J6990n505j1733m708J961N538
$$ 45098 41886 54400 57388 60694 64701 64073 62253 63214 80204 74699 62966 58258 60219 65757
13341F5757M937J3324l082j4708j1616k043L353K774m972l658j363K503l259o210
$$ 65757 70694 84018 80936 66228 54612 52569 55922 58696 53724 50066 48703 51206 47947 41737
13327D1737M629O957O112K218o007M069o429J25K94J4430J2920P155J876p277
$$ 41737 46366 53323 59435 61653 55646 59715 53286 53411 53705 68135 81055 88210 90086 82809
13313H2809K374p495r788j3833q478K338p30J5886J4089p074j5308O442K0893
$$ 82809 85183 77688 67900 54067 45589 47927 47197 63083 77172 70098 54790 61232 82125
13300H2125N879j429j4315J652O632M629j0991n85o573p528J75K4289J6682J3364
$$ 82125 88004 86575 72260 73912 80544 85173 74182 73597 67024 59496 59671 83960 100642 114006
13286A14006L155Q595R261J5560R794J6571J3430J8339J1626L423m701l94j3276
$$ 114006 117161 125756 135017 150577 160371 176942 190372 208711 220337 223760 219059 218665 205389
13273B05389j8673n349o620j0813r749k9730j5297l225p134O74l57J231j1100
$$ 205389 186716 181367 174747 163934 154185 124455 109158 105933 98799 99473 99116 100347 89247
13260H9247l88Q739j2024R229M905p502k240k492j1102O230J5506q413o129K58
$$ 89247 88859 97598 85574 94803 99708 92206 89966 87474 76372 82602 98108 89695 83566 83824
13246H3824n137O33R461L693P917L813P006j98j6466k0724n134J134r243O24P766
$$ 83824 78687 79320 88781 92474 100391 104204 111210 111012 94546 73822 68688 69822 60579 61203 68969
13231F8969J2006L983P062R355n591j365l075l942R92P812N122J4421K1035Q518
$$ 68969 80975 84958 92020 101375 95784 94419 91344 87402 88394 96206 101328 115749 136784 145302
13217A45302K061Q993J6958K775J9215K2791J3728Q835l597k8482q436O927j7500
$$ 145302 147363 156356 173314 176089 195304 218095 231823 240658 237061 208579 200143 207070 189570
13204A89570k0965l1227o800j6234j2466L326J0777Q778O67l175R724n894L030
$$ 189570 168605 137378 130578 114344 101878 105204 115981 124759 125426 122251 131975 126081 129111
13191A29111K1469K64K504J8906K7538L930J0707P482J4437J3819M352j8889j4508
$$ 129111 150580 150844 153348 172254 199792 203722 214429 221911 236348 250167 254519 235630 221122
13178B21122o944j6791k6102j3120r378p736j9471j5983m410j330P268J947N272
$$ 221122 214178 197387 171285 158165 148787 141051 121580 105597 101187 99857 107125 109072 114344
13165A14344L537k412K50j259O861j3970o278J3726J0536j547L884L024k6174
$$ 114344 117881 115469 115719 114460 121321 107351 101073 114799 125335 123788 127672 130696 104522
13152A04522j4751J792J3303R054J4950K077l613p650p006Q318R551Q03J0118
$$ 104522 89771 91563 104866 113920 128870 130947 127334 119684 112678 120996 130547 131350 141468
13139A41468M689r503q581k210j4458n239O82K081J795O022K7941J7372L819j766
$$ 141468 146157 136654 128073 125863 111405 106166 106848 108929 110724 116746 144687 162059 165878 164112
13125A64112J2798J8469R744K4302L1349K4305J9439K1138J2108J7785J8100K385
$$ 164112 176910 195379 205123 229425 260774 285079 304518 325656 337764 355549 373649 376034
13113C76034J2627K5830J9319K9246O7474P8965Q9619J08249J14308J12139O6847
$$ 376034 388661 414491 433810 463056 530530 609495 699114 807363 921671 1033810 1100657
13102A100657K4642n454o5249r6725j14884j07300p7233o7079n8362k5915l127
$$ 1100657 1125299 1119845 1054596 957871 842987 735687 658454 591375 533013 507098 503971
13091E03971k1655m0350j0794r929j222j3307j4808k2334j6865k8287l6096j3998
$$ 503971 482316 441966 431172 421243 420021 406714 391906 369572 352707 324420 288324 274326
13079B74326r790k4049m616K051K594r405j7109j934j5544j4001p559J4611q920
$$ 274326 264536 240487 235871 237922 240516 231111 214002 212068 196524 182523 174964 189575 180655
13066A80655k4642j6333R453M948R237p371N106o062j4116J442Q52q161j76k851
$$ 180655 156013 139680 149133 154081 163318 155947 161053 154991 140875 142317 143169 135008 134832 131981
13052A31981o875l64J654K244Q632n991N12N98k589l786L641R488N172o366p072
$$ 131981 125106 124742 126396 128640 137272 131281 131793 132391 129802 126016 129657 139145 144317 137951 130879
13037A30879p162m408J142L91M750j0340J225m965J2446K950m421n192J1595m761
$$ 130879 123717 119309 120451 120842 125592 115252 116477 111512 123958 126908 122487 117295 128890 124129
13023A24129j5286J404m719l269R57l785M215N798J9653k750O830O335M692m007
$$ 124129 108843 110247 105528 102259 103216 99431 103646 109444 129097 126347 133177 139512 144204 140197
13009A40197r773j2259K990k225m728J833k940p140Q74M041P544j0569K125r75
$$ 140197 130424 118165 121155 118930 114202 116035 113095 105955 106829 110870 118414 107845 109970 108995
12995A08995O583J2330J9359J5578P004j0147j2487j4783r223j136R649J3318
$$ 108995 115578 127908 147267 162845 169849 159702 147215 132432 123209 122073 131722 145040
12983A45040L571Q382J4535Q216j893M348K211J152k347J612p570k862n731K264
$$ 145040 148611 156993 171528 179744 177851 182199 184410 185562 183215 184827 177257 174395 168664 170928
12969A70928j577j0666p011p275J690J0686J0835k940m626k0513l80N90K60M451
$$ 170928 169351 158685 151674 144399 146089 156775 167610 164670 160044 139531 139151 139741 140001 144452
12955A44452K662R474M875O58K371k408q368k910O418m769q30M953O999L995J1240
$$ 144452 147114 156588 161463 162121 164492 162084 153716 150806 157224 152455 151625 156578 163577 167572 178812
12940A78812m44Q400J7319J6560K8460m410m476n030j5488K064O022N479J4115
$$ 178812 178368 186768 204087 220647 249107 244697 240221 235191 219703 221767 227789 233268 247383
12927B47383L069n15N403l643J1023J0694J1041j0766j0608p25p674q797J17j3534
$$ 247383 250452 249937 255340 251697 262720 273414 284455 273689 263081 262356 254682 245885 246002 232468
12913B32468o36J1203r574j2134N461k745k636M659J217q265o331o503o795j1845
$$ 232468 231832 243035 233461 221327 226788 224043 221407 226066 227283 219018 212687 206184 199389 187544
12899A87544p640O504J4923K09J829M213j1914j0367p929J8194J5681j479j0081
$$ 187544 179904 186408 201331 201540 203369 207582 195668 185301 177372 195566 211247 209768 199687
12886A99687q782J5571k088n181M571Q344M198N946j2527O472O818j0580N782
$$ 199687 190905 206476 204388 199207 203778 212122 216320 222266 209739 216211 223029 212449 218231
12873B18231R997Q94m680o658k108p429j1881o108j5789j2455L968J4392N943
$$ 218231 228228 229122 224442 217784 215676 208247 196366 190258 174469 162014 165982 180374 186317
12860A86317O093q72j0090o025J2460K6775J9384k050m852J6080L393J2408Q481
$$ 186317 192410 191538 181448 175423 187883 214658 234042 231992 227140 243220 246613 259021 267502
12847B67502J4063J5484r453q761L503J3335j0066j790O144J230o225k1741n439
$$ 267502 281565 297049 287596 278835 282338 295673 285607 283817 289961 291191 284966 263225 257786
12834B57786l10K1081J9526P049l447l678l591O348K0709J3711j4462q066N604
$$ 257786 257476 278557 298083 305132 301685 298007 294416 300764 321473 335184 320722 312656 318260
12821C18260N331j260J4569M103M526J3393N823O775J2898R593J5191N52N537
$$ 318260 323591 322331 336900 341003 345529 358922 364745 371520 384418 394011 409202 409754 415291
12808D15291J3532L34J6870K4891J6528R728J3446K1143J8340R406Q682J5577
$$ 415291 428823 429157 446027 470918 487446 497174 510620 531763 550103 559509 568191 583768
12796E83768K9116J2493J1285J0784j06L808k895r880O823Q925p519j5564r023
$$ 583768 612884 625377 636662 647446 647340 651148 648253 638373 645196 654121 646602 631038 622015
12783F22015q671o064J0545J6504J4574M576M727q88L077n2l31p30l250o799J1876
$$ 622015 613344 607280 617825 634329 648903 653479 658206 657318 660395 660343 660012 659282 656032 649233 661109
12768F61109R514k763M160J0183m922j361l413l304L964J3387K0815K0059j283
$$ 661109 670623 667860 672020 682203 677281 675920 672507 669203 673167 686554 707369 727428 726145
12755G26145K1781J5544J1170L2741L2093L1555J5606K8755K9804K708J05J9214
$$ 726145 747926 763470 774640 807381 839474 871029 886635 915390 945194 947902 948007 967221
12743I67221K4595L8577L1073J0733K6345L0212K9806M1039K2505K6835L7730
$$ 967221 991816 1030393 1061466 1072199 1098544 1128756 1158562 1199601 1222106 1248941 1286671
12732A286671L8474M7454M7023M7702K8663K5432K6891L6654L4045K2942L3296
$$ 1286671 1325145 1372599 1419622 1467324 1495987 1521419 1548310 1584964 1619009 1641951 1675247
12721A675247L7216N1995N8758O4926Q3310J08286J16555J14066J04944J02570
$$ 1675247 1712463 1764458 1823216 1888142 1971452 2079738 2196293 2310359 2415303 2517873
12711B517873J32511J43557J58613J47269J74536K05041K22667K51820K73875
$$ 2517873 2650384 2793941 2952554 3099823 3274359 3479400 3702067 3953887 4227762
12702D227762L18624M01649M86497N90236O82165Q26222R56942J072791J192326
$$ 4227762 4546386 4948035 5434532 6024768 6706933 7533155 8490097 9562888 10755214
12693A0755214J344663J530695J804119K205529K831420L834283N468373P998900
$$ 10755214 12099877 13630572 15434691 17640220 20471640 24305923 29774296 37773196
12685C7773196J1475982J5296954J8812888K1880079K3857184K2691468J7464817
$$ 37773196 49249178 64546132 83359020 105239099 129096283 151787751 169252568
12678A69252568J0405507L371153m712360j3708564k0246088k2036815k1048674
$$ 169252568 179658075 183029228 178316868 164608304 144362216 122325401 101276727
12671A01276727j9478630j6736241j2457325q337989n530253l837060k833533
$$ 101276727 81798097 65061856 52604531 44266542 38736289 34899229 32065696
12664C2065696k221349j832486j556708j361838j232961j135621j032680r63518
$$ 32065696 29844347 28011861 26455153 25093315 23860354 22724733 21692053 20728535
12656B0728535q78362p98326p69568p46429p53732p91689p94067q07524p86292
$$ 20728535 19850173 19051847 18282279 17535850 16782118 15990429 15196362 14388838 13602546
12647A3602546p48024o91714o17104n55950m78396m13539l84916l63385l34409
$$ 13602546 12854522 12162808 11545704 10989754 10511358 10097819 9712903 9349518 9015109
12638I015109l34011l21796l00278l03705k93216k81067k58622k55779k51660
$$ 9015109 8681098 8359302 8059024 7755319 7462103 7181036 6922414 6666635 6414975
12629F414975k46016k22110k13910k15261k15300j89243j75262j67258j50417
$$ 6414975 6168959 5946849 5732939 5517678 5302378 5113135 4937873 4770615 4620198
12620D620198j48054j42787j06611j02973j19740j18480j21282j27991j25258
$$ 4620198 4472144 4329357 4222746 4119773 4000033 3881553 3760271 3632280 3507022
12611C507022j19059j06418r5924j00958q8078p7221o7273q7894o8823n6523p8810
$$ 3507022 3387963 3281545 3185621 3084663 2996585 2919364 2852091 2764197 2695374 2638851 2560041
12600B560041p0793o7271o9250o7333m4723n9855o6166n8896o1468l8299m0157
$$ 2560041 2489248 2421977 2352727 2285394 2240671 2180816 2114650 2055754 1994286 1955987 1915830
12589A915830n3440n4297n6560n8247l5398l0756k6048j8120l9451l4435k0099
$$ 1915830 1862390 1808093 1751533 1693286 1657888 1627132 1601084 1582964 1543513 1509078 1488979
12578A488979k5315k6164k1812j1985k2827r517K7165L5943L3066L1572K6511
$$ 1488979 1463664 1437500 1415688 1403703 1380876 1371359 1398524 1434467 1467533 1499105 1525616
12567A525616L1993N670K771o412m4415p0413o6919q8564j03653j08114j07990
$$ 1525616 1557609 1563279 1566050 1559638 1515223 1444810 1377891 1289327 1185674 1077560 969570
12556I69570q9816p2011o6492n3069l9247k1607j3628k2227j5356l2152k7899
$$ 969570 879754 807743 741251 688182 648935 627328 613700 591473 576117 543965 516066
12545E16066k5653l5374j7885k2894j3784p714j2150j1279j564j5332J2599K3620
$$ 516066 490413 455039 437154 414260 400476 392762 380612 369333 367769 352437 365036 388656
12533C88656K3463J5854J6924R526O072J425n378r949j7862k5129l8026k4410
$$ 388656 412119 427973 444897 454423 460495 461920 456542 446593 428731 403602 365576 341166
12521C41166k2645r759k8310j2315m644J0956K459K302O058J5421j040m428J9404
$$ 341166 318521 308762 280452 268137 263493 274449 276908 279210 285268 300689 299649 295221 314625
12508C14625J1219J235n613k3809j4943L289j293K466q619o057J578k025L420
$$ 314625 325844 327079 321466 297657 282714 286003 284710 287176 278557 272500 274078 272053 275473
12495B75473K0010l79j3869j0662j0372m525L025k914M387J3891J2963Q28N831
$$ 275473 295483 295104 281235 270573 260201 255676 258701 255787 260174 274065 287028 287856 293687
12482B93687K8874K5110J5029j189o30l780k0803k8166k4226j9660k9679j6438
$$ 293687 322561 347671 362700 361511 360881 357101 336298 308132 283906 264246 234567 218129
12470B18129q360j4986n405J920M197o721r555M115l827m438k506p735o909K200
$$ 218129 209769 194783 189378 191298 195495 188774 179219 183334 179507 175069 172563 164828 157919 160119
12456A60119j568q888q605l724j9584l889J3654M088p428O512J1755P419K710
$$ 160119 158551 149663 141058 137334 117750 113861 127515 131603 124175 130687 142442 149861 152571
12443A52571J6307L0043m09J4253K6513J1613M607K63P042K208r199p775j2812
$$ 152571 168878 198921 198512 212765 239278 250891 255498 255761 262803 265011 255812 248037 235225
12430B35225k4615j7226j7502j6963q123j1706j8284j259o756k161K271m60J5907
$$ 235225 210610 193384 175882 158919 150796 139090 120806 119547 112791 110630 112901 112441 128348
12417A28348J45j6695j0732m401J545j796k770j5597m560j3294n123q003J242
$$ 128348 128493 111798 101066 96665 98210 96414 93644 78047 73487 60193 55070 47067 48309
12404D8309N869j938J0472J112P199O708K211J693q38j4159P935J9015j252J1049
$$ 48309 54178 52240 62712 63824 71023 77731 79942 81635 80797 66638 74573 93588 92336 103385
12390A03385L0322K2664K3801J6398l630p998j0068p878j6693j1819K967j2014
$$ 103385 133707 156371 180172 196570 192940 184942 174874 166996 150303 138484 141451 129437
12378A29437m841J9489J9030K1167J0751O611o954j9183l4017k6151j9490k1522
$$ 129437 124596 144085 163115 184282 195033 201644 194690 175507 141490 115339 95849 74327
12366G4327k994k284L688k105o384J6428L703K682k730j0799M408J1046j3860
$$ 74327 71333 69049 72737 70632 64248 80676 84379 87061 84331 73532 77940 88986 75126
12353G5126J33L73J0156J2255q759j5021j7954j5683j3424R888J3069L944N69
$$ 75126 75259 75632 85788 98043 89284 74263 56309 40626 27202 37090 50159 54103 54672
12340E4672n59l662Q07m86j3959j5862J292n144R205K5359L178l287m133Q246
$$ 54672 54113 50451 51258 50772 36813 20951 22243 17099 26304 51663 54841 51554 47421 55667
12326E5667P35j860p503k020J112q378r01L359J7079J3126l937l191l020P29j344
$$ 55667 56402 54542 47039 45019 46131 37753 36852 40211 57290 70416 66479 63288 60268 60997 59653
12311E9653k566n637J2121J072Q756R99l732j4105L199N928j0070o189p43o139
$$ 59653 57087 51450 63571 64643 73399 74398 70666 56561 59760 65688 55618 49429 48686 42547
12297D2547O562R761R028K637m66Q140l843j8211n418j2573R865L329q895P933
$$ 42547 49109 58870 67898 70535 70069 78209 74366 56155 50737 38164 48029 51358 42463 50396
12283E0396O861N891k210J4892n284m796n209L361m208M349J4075J9064J7463
$$ 50396 57257 63148 60938 75830 70546 65750 60541 63902 59694 64043 78118 97182 114645
12270A14645j0615j6312k427J6821J5737J6790J309o980J8597K3034J6534Q503
$$ 114645 104030 87718 85291 102112 117849 134639 135948 128968 147565 170599 187133 195636
12258A95636J8010K1080L5209N4130Q6168R9073J20193J42130J46915J38523J10565
$$ 195636 213646 234726 269935 324065 410233 509306 629499 771629 918544 1057067 1167632
12247A167632R9674N1219L2033m109k1042K943P9236J54361K36942L54861M84284
$$ 1167632 1267306 1318525 1350558 1346449 1325407 1328350 1407586 1561947 1798889 2153750 2638034
12236B638034N61423N81321N68204M73081L26258J25456r9637k93337m48268n35139
$$ 2638034 3199457 3780778 4348982 4822063 5148321 5273777 5174140 4880803 4432535 3897396
12226C897396n78184n52105m88463l98627k95580k14713j75647j19176j09801
$$ 3897396 3319212 2767107 2278644 1880017 1584437 1369724 1194077 1074901 965100
12217I65100p1257m3835n3480n0066l1643l5466k6818k9290l4945l1481l8810
$$ 965100 893843 850008 796528 746462 714819 679353 652535 623245 588300 556819 518009
12206E18009k2672m216j9927k0550k7327k0651l2712l0387k4289m879m488Q211
$$ 518009 495337 491121 471194 450644 423317 402666 369954 339567 315278 310399 305911 314122
12194C14122L393j7583j8261j3654M64k1463j0130k303m5j601k042j1407o835
$$ 314122 317515 299932 281671 268017 268481 247018 236888 234585 234540 232939 230897 219490 212655
12181B12655k2228j0547L769M025j8548k1604j703l078N068j0508j6429j0181
$$ 212655 190427 179880 183649 187674 169126 147522 145819 142741 147809 137301 120872 110691
12169A10691O50O354P401J4265l995r895p112l78N844J146j0270o208p475k666
$$ 110691 111341 117695 125096 139361 135366 125471 118359 117981 123825 124971 114701 108493 101018 98352
12155I8352P214k652j1232J97m129q586j951k952J2770P01j4318n43Q066O850
$$ 98352 105566 102914 91682 91879 87750 79164 77213 74261 87031 87732 73414 72871 80937 87787
12141H7787M155M123j5342j7233m624K909Q810J0566J0582M714O590Q491R440
$$ 87787 91942 96065 80723 63490 58866 61775 70585 81151 91733 96447 103037 111528 120968
12128A20968J586r105m232k4128l209J4530k547m631j2225j2848J556j2624p622
$$ 120968 122554 113449 109217 85089 81880 96410 93863 89232 77007 64159 65715 53091 45469
12115D5469O0O552K918l083Q973j0101l049K558O324j4808m601q99l119n935l47
$$ 45469 45529 52081 54999 51916 60889 50788 47739 50297 56621 41813 37212 36313 33194 27259 26912
12100B6912r332k093j211J2867N398M091J2197k940j3905m344J9016l504m936
$$ 26912 17580 15487 14276 27143 32541 36632 48829 45889 31984 27640 46656 43152 38216
12087C8216Q325n823n095o285K835J4561L246l261k911l769K324n300q095p32
$$ 38216 46541 40718 35623 29338 32173 46734 49980 46719 43808 40039 42363 37063 28968 28236
12073B8236j2731P811m484P4j155M780j123j740J2798l549L244p826K445p719
$$ 28236 15505 23316 18832 18906 17751 22531 21408 19668 32466 28917 32161 24335 26780 19061
12059A9061L137j811m87J1545m285p912J0053r159q066l165M407o128n27J1218
$$ 19061 22198 20387 19900 31445 27160 19248 29301 20142 12076 8911 13318 7190 6663 17881
12045A7881r78J963j443l457M147K106M700J1150j745P413R355J2241k561k349
$$ 17881 16903 18866 17423 13966 18113 20219 24919 36069 34324 41737 51092 63333 60772 58423
12031E8423Q103L2168M2268M0178M5471M4672K1179K1134p016n3414n8896l9941
$$ 58423 66526 98694 140962 181140 226611 271283 292462 313596 306580 253166 194270 154329
12019A54329j8695k1971k0985k0575j8439j5008j2537J3732J088P306k030k961
$$ 154329 135634 113663 92678 72103 53664 38656 26119 39851 40939 48245 46215 43254
12007D3254J947J547J642J1908o541q738r516N617n641r788J1966Q218j604J731
$$ 43254 45201 46748 48390 60298 53757 45019 35503 41120 35479 25691 37657 45875 44271 46002
11993D6002K967q409j6232N535o093j3212k82M172N325R460N262N39j4165M840
$$ 46002 48969 40560 24328 29863 23770 10558 10276 14448 19773 29233 34495 35034 20869 25709
11979B5709M472N30n330N615r762M0j853M505J0226n351m594o475m007j3271k5441
$$ 25709 30181 30711 25381 30996 21234 21274 19421 23926 34152 28801 24207 17732 13725 454 -24987
11964b4987M669L0256J6137j8109m064Q438J0634J4556q96j7005N409J795o237
$$ -24987 -20318 9938 26075 7966 3902 12340 22974 37530 36634 19629 25038 26833 20596
11951B0596L515o114K009K289R482j7139Q826M385n333J1743p164k9165j2942
$$ 20596 24111 17997 20006 22295 31777 14638 23464 27849 22516 34259 27095 -2070 -15012
11938a5012n679k43K2598J3218J1091J9312J0626n352N46k072j0772L429p263
$$ -15012 -20691 -20934 1664 14882 25973 45285 55911 50559 51105 49033 38261 41690 34427
11925C4427J2234K0976L963p043j7284j2276M6j5732n654K1569K351K425O158
$$ 34427 46661 67637 71600 64557 47273 34997 35043 19311 13657 35226 37577 40002 46160
11912D6160N628N601j7710m360m029j0857j956k670N842Q123q475L69Q354m166
$$ 46160 51788 57389 39679 35319 31290 20433 18477 15807 21649 29772 21297 21666 30020 25854
11898B5854j40J844O939j4990j5633m263P923k060J2441O807l785q551q529N546
$$ 25854 25714 27558 34497 19507 3874 -389 7534 5474 17915 24722 20937 12386 3857 9403
11884I403K987L374J1009O327r470j7874J9385K0785K553l187l434n358L98P477
$$ 9403 12390 15764 26773 33100 23630 5756 25141 45926 48479 45292 41858 36500 36898 44375
11870D4375L624j0170j4553J564J121J2784L409N651j3125q907J2488J0305k123
$$ 44375 47999 37829 23276 24840 25961 38745 42154 47805 34680 25773 38261 48566 46443
11857D6443j9026j7025j386J878R031J0572M069j1062p381M659Q061n231q771
$$ 46443 27417 10392 9006 10884 19915 30487 34556 23494 16113 20772 28833 23602 14831
11844A4831R213N490r778P863J5894J0288J546o886m814m125J1315j0269j2145
$$ 14831 24044 29534 19756 27619 43513 53801 55347 48461 43647 39522 50837 40568 28423
11831B8423n557k536n930o536N386m430O413q031m721P365P091m238j1163J9829
$$ 28423 22866 20330 14400 7864 13250 8820 15233 7202 2481 9846 16937 12699 1536 21365
11817B1365J3734m846r462P656m821K4J5246M391O623R777R650p350O41p159N147
$$ 21365 35099 30253 20791 28447 23626 23650 38896 43287 49910 59687 69337 61987 62628 55469 60616
11802F0616n615r873m11o269m29N972n017p079k1540j5818Q432l150n443L1169
$$ 60616 55001 45128 44717 38448 38019 43991 38974 31895 10355 -5463 2969 -181 -5624 25545
11788B5545J2325n872o21J03k072n37n192L737q059L649J277L940j127p396o349
$$ 25545 37870 31998 31377 31480 29408 28871 23679 27416 19357 23006 24283 28223 27096 19700 13351
11773A3351J0380J3456J1867K205r85n591r178q725j152J5646K588m216n794j0757
$$ 13351 23731 37187 49054 51259 50274 44683 35505 26780 25628 41274 43862 39646 33852 23095
11759B3095r869Q348O8M52q486K754Q660N079J1788k453m725j1505j4200J3571
$$ 23095 13226 21574 21642 22094 13608 16362 25022 30101 41889 39436 34711 23206 9006 22577
11745B2577J1534k240r345L408Q379J6081j466K090K170l217o216p435P502L861
$$ 22577 34111 31871 22526 25934 34313 50394 48928 51018 53188 49971 43755 36320 43822 47683
11731D7683k913o981j587J057j1745J06J7987l616j8749O98N502l22l510k605
$$ 47683 44770 37789 36202 37259 25514 25620 43607 39991 21242 21940 27442 27120 23610 21005
11717B1005J1238R215J2274l953p938j930k3095k560J0318L839k705o55N627k665
$$ 21005 32243 41458 53732 49779 41841 39911 16816 14256 24574 28413 25708 25053 30680 28015
11703B8015J1023J708p020J6061l356j7569M214n915J973J8966N889L633r993
$$ 28015 39038 40746 33726 49787 46431 28862 33076 27161 29134 48100 53989 57622 47629
11690D7629q207q422Q117M153O442P544n481N566j156q030P92n71k071L761N549
$$ 47629 39422 31000 39117 43270 49712 57256 51775 57341 56185 48155 48947 48376 46305 50066 55615
11675E5615p213J2558M563k947n030j342J6696o843J737n587o448J304j448J6992
$$ 55615 48402 60960 65523 62576 57546 56204 72900 66057 67794 62207 55759 57063 55615 72607
11661G2607J8562k738p534k1365q834P105l584N559J0318O616k15P651J6898J4558
$$ 72607 91169 88431 80897 59532 50698 57803 54219 59778 70096 76712 76497 84148 101046 115604
11647A15604L234p937k0434j6890k2815m454J4843J5580j111N896l852j5683k626
$$ 115604 118838 110901 90467 73577 50762 46308 61151 76731 75620 81516 77664 61981 59355
11634E9355K0303R143m139k459j425k219NP609Q183L9J460O713K57J82O652Q878
$$ 59355 79658 88801 84662 82203 80778 78559 78564 86173 94356 94395 95855 102568 102825 103007 109659 118537
11618A18537p961q845l144J6927N252m510J3561K7502L3425J9222K7810L7709
$$ 118537 110576 101731 98587 115514 120766 116256 129817 157319 190744 209966 237776 275485
11606B75485M5759N9745P6428J10499J56601K14569L00025L72837L71378K76395
$$ 275485 321244 380989 457417 567916 724517 939086 1239111 1611948 1983326 2259721
11596B259721J66704K6351j90496l71891m06189l25432k27082j55493j10731p4687
$$ 2259721 2426425 2452776 2262280 1890389 1484200 1158768 931686 776193 665462 590775
11586E90775n2806m0715n3041l8889k7820j4012n458P229P505M599j2903o435
$$ 590775 537969 497254 444213 405324 377504 363492 358034 365263 372768 377367 364464 358029
11574C58029l10J0830L0769K6878L3044O3004O1579M6983J7260j6281m1456p5254
$$ 358029 357719 368549 399318 426196 459240 522244 583823 630806 648066 631785 590329 515075
11562E15075p9638o1880m0995k3050j4436k8122j3162j4487j0760K179J501l088
$$ 515075 435437 373557 332562 309512 295076 266954 253792 239305 228545 230724 232225 229137
11550B29137k1751r706j7888N248K1393J9383J3476K6956L1356J1653p255j8571
$$ 229137 207386 197680 179792 185040 206433 225816 239292 266248 297604 309257 302002 283431
11538B83431k4057k9101j8403j0974j6562j2690j9691J2305j1437j7463j090J1657
$$ 283431 259374 230273 211870 200896 184334 171644 151953 164258 152821 135358 134268 145925
11526A45925L859N533j4809o298P344N87j0199k180J409k311Q574J7941O778J4993
$$ 145925 149784 155317 140508 134210 141554 142141 131942 129762 131171 128860 137434 155375 162153 177146
11512A77146O500j3831j4969m138L883j8522m362l38j1290p334N105p506J864
$$ 177146 183646 169815 154846 150708 154591 136069 131707 131369 120079 112745 117850 110344 112208
11499A12208p670j764m83j1031O243m477j1983m579n601J9141K3084N370j4374
$$ 112208 104538 102774 102291 91260 97503 93026 81043 76464 70863 90004 113088 118458 104084
11486A04084M820k88j0946L358N189k936R83K270K262o335M010q582J4160J6157
$$ 104084 108904 108616 97670 101028 106217 103281 104264 106534 108796 102461 106471 97889 112049 128206
11472A28206r94l244J521N128Q827O148p565J7394J7448L0312J5039J0244n902
$$ 128206 127212 123968 125489 130617 139444 145592 138027 155421 172869 203181 218220 228464 222562
11459B22562j2237k3517k7368k8050p467j4615j6114m668J5234m39L271j819N652
$$ 222562 210325 186808 159440 131390 123923 109308 93194 88526 103760 103321 106592 104773 110425
11446A10425O684m490J52R728K618K17K222M414p863j0199j0467N695o982k1733
$$ 110425 117109 112619 112771 122499 125117 125334 127556 131970 124107 113908 103441 109136 102154 80421
11432H0421j3391R95J3848J9086o237N679j52q881J50o71O323J661O692J071m601
$$ 80421 67030 68025 81873 100959 94722 100401 100249 91368 91518 90847 97170 98831 105523 106594 101993
11417A01993n439k393k2117j2092J2363P163J0570R545m705P278J3020r467j2612
$$ 101993 96554 94161 72044 59952 72315 79478 90048 99593 94888 102166 115186 105719 93107
11404I3107K386n324O544L254l405p681K895O557J375n596J1060L776K817O825
$$ 93107 95493 90169 96713 99967 96562 88881 91776 98333 99708 94112 105172 108948 111765 118590
11390A18590m61j4943J0779J095j5540r865r748K386M10M47k145K467l001Q736
$$ 118590 118129 103186 113965 115060 99520 89655 79907 82293 82703 83150 81005 83472 80471 89207
11376H9207o990j4769P243N121N779N298m822R31J3733K737p574o985J843P374
$$ 89207 82217 67448 74691 79812 85591 90889 86067 86998 100731 103468 95894 88909 90752 98126
11362I8126m390j3255O76J0416J9015J0657j3167j2233l438J2170k979J60J1247
$$ 98126 93736 80481 81157 91573 110588 121245 108078 95845 92407 104577 101598 101758 113005
11349A13005j233l824p32P081l005r459J0571K87j112q063j0067J058L592J406
$$ 113005 111772 107948 107216 114297 111292 101833 112404 112691 111579 103516 93449 94507 98099 99505
11335I9505K545L123J3501J3357l693j3652j724L433Q789J434r798m718j7420
$$ 99505 102050 105173 118674 132031 128338 114686 112962 116395 125184 126618 116820 112102 94682
11322I4682o516j0728J242O034J3172J7160k370k431R6J805K841k654j7925J1420
$$ 94682 88166 77438 78680 84714 97886 115046 112676 110245 110341 112146 114987 112333 94408 105828
11308A05828j330l140n400L899Q687m177j218L750q877n094J3152m407k062K312
$$ 105828 104498 101358 95958 99857 108544 104367 103149 106899 98022 92928 106080 101673 99611 101923
11294A01923j0941k854R676l280Q25m799N05M436j0953Q171K5373Q971j0961k005
$$ 101923 90982 88128 97804 94524 95349 90550 91055 95491 84538 92709 118082 127053 116092 114087
11280A14087O510j765n833M001m65o693N34m807j964R230J3500P501o416J2179
$$ 114087 120597 118832 112999 117000 116535 109842 110376 105569 103605 112835 126335 133836 127420 139599
11266A39599M037M751j6407k025j45j330m222K146Q0J1329J2645q954K326K4451
$$ 139599 143636 148387 131980 129955 129810 128480 124258 126404 126484 137813 150458 141504 143830 168281
11252A68281P322j1721j4360k681M065K0521l972j8896l569J5800Q486n100k2890
$$ 168281 175603 163882 149522 146841 150906 171427 167455 148559 144990 160790 169276 164176 141286
11239A41286k829J2515j543j0476m167J014K731p918J784N1k268J2152N486J2979
$$ 141286 138457 150972 149429 138953 134786 135800 138531 130613 132397 132448 130180 142332 147818 160797
11225A60797J5592p488r954j5041Q839K373j101j3612k3325j706Q765J6445J0209
$$ 160797 176389 168901 158947 143906 152745 155118 154017 140405 117080 115374 124139 140584 150793
11212A50793J0723K43l880k227p050P659N637J4348O222o850Q406l716j8641j1565
$$ 150793 161516 161759 157879 155652 148602 156261 161898 176246 182468 175618 184024 180308 161667 150102
11198A50102K219J2916q687P25o826j5368K93R332J8075J1123O894Q783M658L937
$$ 150102 152321 165237 156550 157275 150449 135081 135374 144706 162781 173904 180798 189581 194239 198176
11184A98176j0264j6738n005k79N049R318J1193K50J118p965J389k265J5659R492
$$ 198176 187912 171174 166169 165890 170939 180257 191450 191700 192818 184853 186242 183977 199636 209128
11170B09128K958m264J3264J6976j1309l730L069L057k838K656K392j1791k667
$$ 209128 212086 207822 221086 238062 226753 223023 226092 229149 226311 228967 231359 219568 216901
11157B16901L257K679J8643R666O457R638L952l810j1511k2639n048q664L205
$$ 216901 220158 222837 241480 251146 257603 267241 271193 267383 255872 233233 228185 219521 222726
11144B22726k32p48K3899P037j4093k988K28j0419r773o125n583p43n99J181J3421
$$ 222726 222494 221746 245645 252682 238589 235601 235829 225410 215637 209512 203929 203186 202587 203768 217189
11129B17189k208K460k062p499J3370J9447J2327P246Q875R153J3013J2673R05
$$ 217189 214981 217441 215379 207880 221250 240697 253024 260270 269145 278298 291311 303984 304889
11116C04889j9920k7785m762m264j1371j0036k114J8162J460j1821Q15m786j846
$$ 304889 284969 257184 252422 248158 236787 226751 224637 242799 244259 232438 233253 228467 226621
11103B26621l112J3538Q256q033j5811M013j719l74K4388J1925q431p168j3243
$$ 226621 223509 237047 245303 237270 221459 225472 223753 223379 247767 259692 251261 244093 230850
11090B30850L949J2404m325k0551q044J2477J0271N319r092j878K767j4922N966
$$ 230850 234799 247203 242878 222327 214283 226760 237031 242350 233258 231380 234147 219225 225191
11077B25191q186j1527P462J5379K562Q862k558o926n781n184j5551k988R949
$$ 225191 217005 205478 212940 228319 230881 239743 237185 230259 224478 219294 203743 200755 210704
11064B10704J0447K3405l10q821K488j2304N221K794m262L388lj3753j220M309
$$ 210704 221151 244556 244246 235425 237913 225609 230830 233624 229362 232750 232747 218994 217774 222083
11050B22083J4828O092r176K99M824j0181K2139J9964k615p797o891N422N57J0990
$$ 222083 236911 243003 233827 234126 238950 228769 250908 270872 268257 260460 253569 258991 259548 270538
11036B70538n73j7322m565R89J3750K0319O757P799K100J8790K3312J0685P730
$$ 270538 269965 252643 248078 249067 262817 283136 289893 297692 299792 318582 341894 352579 360309
11023C60309k334J8175K3758M3715L4546L4009O3509R1797J28791J78311K39140
$$ 360309 357975 376150 399908 443623 478169 512178 575687 667484 796275 974586 1213726
11012A213726L41556M23014M58622M50022L81853K50234J5685k12519k69669m78922
$$ 1213726 1555282 1978296 2436918 2886940 3268793 3519027 3534712 3322193 3052524 2573602
11002B573602n05899l72085l15308k24852j40511p7697n6225n6915k8333r652
$$ 2573602 2067703 1695618 1380310 1155458 1014947 937250 881025 824110 795777 786125
10992G86125k5229j0226R833J7398J7959M2216O1936P7510J06941J69179K36291
$$ 786125 760896 750670 760503 777901 795860 838076 900012 977522 1084463 1253642 1489933
10981A489933L15558L92188M01533L48179K57618J37396r5019k44039l04002m26653
$$ 1489933 1805491 2197679 2599212 2947391 3205009 3342405 3247386 3003347 2699345 2272692
10971B272692m14984l22207k66403j89365j23121p2767p0281o2541l1235k5562
$$ 2272692 1857708 1535501 1269098 1079733 956612 883845 813564 751023 719788 694226
10961F94226j0966k5307j3334q772j3143j5628q928o181k5094k3221l8270l4975
$$ 694226 683260 657953 644619 635847 622704 607076 598148 591967 566873 543652 505382 470407
10949D70407p582n307l182J2929j0131p75J3334m18j6961r780o670j053j4231
$$ 470407 462825 457518 454336 467265 457134 456359 469693 469275 452314 442534 435864 434811 420580
10936D20580l599P037R39Q775J8747Q1j2816n692p902K4302J1233o51J2652J2503
$$ 420580 416981 424018 424957 433732 452479 452560 439744 434052 426150 450452 461685 461034 473686 486189
10922D86189J543K633K0079K5546L5452M7113N0552Q2236J42450K29871L20506
$$ 486189 487732 490365 510444 535990 571442 618555 669107 751343 893793 1123664 1444170
10911A444170L41837K68145J77747R0142q9901l48109m33482l16224j85922j13899
$$ 1444170 1786007 2054152 2231899 2322041 2232140 1884031 1450549 1134325 948403 834504
10901H34504p7658n1748m3327j9710k4645m2176p944k928j1942r565l263J077
$$ 834504 756846 705098 661771 642061 617416 575240 567296 564368 552426 542861 539598 540675
10889E40675j3268j6039n727j7882n841J0451j0282j3754j1236K910q936l841
$$ 540675 527407 511368 505641 487759 481918 492369 482087 468333 457097 460007 451071 447230
10877D47230q527m544j4168o193j806K735Q06L529N984r404p882J979r611m796
$$ 447230 438703 434159 419991 413798 411992 414727 415533 419062 425046 415642 407760 409739 400128 395332
10863C95332J3112N252o119r030j4068m805j734p609N748l404J2497R576j2350
$$ 395332 408444 413696 407577 398547 384479 379674 377940 370331 376079 372675 385172 394748 382398
10850C82398q822p808K3435J6021n714J904K240j765k89J894J0219k302r599j9502
$$ 382398 373576 365768 389203 405224 399510 401414 403654 401889 401600 403494 413713 411411 401812 382310
10836C82310q643Q920L818j347j007K356O649K1829J242R198j1905n77J0135R712
$$ 382310 373667 382587 386405 385058 384051 386407 393056 414885 416127 425325 413420 412843 422978 432690
10822D32690l767n654r629N48N559J4138N833P835P169R202k777Q197L531O493
$$ 432690 428923 423269 413640 414188 419747 433885 439718 447553 454722 463924 461147 469344 472875 479368
10808D79368J4100J5759j899q904n761o083j5690l228R567J30l50P635M061J9107
$$ 479368 493468 509227 507328 498424 492663 486580 470890 467662 477229 477359 477009 484644 488705 507812
10794E07812J2037o541p300j36N57J8244m8M271j847j7663p319J5078J1315J8183
$$ 507812 519849 513308 506008 505872 506429 524673 524625 528896 527049 509386 502067 517145 528460 546643
10780E46643M273P886l130K194J5059R000J0583J5113l226k0173j0917J0432k380
$$ 546643 550916 558802 555672 557866 572925 581925 592508 607621 604395 584222 573305 583737 581357
10767E81357J623j568r400K853r052o125n846o676k665J5702J5755k268j993P879
$$ 581357 582980 581412 572012 574865 565813 559688 553842 547166 544501 560203 575958 573690 571697 579576
10753E79576J1776K1027J168J5607J8455J2072J3217J5371N767J6599O820O913
$$ 579576 591352 612379 613547 629154 647609 659681 672898 688269 694036 710635 717455 724368
10741G24368J845Q102M982O916N019J2529j940l269k992k400O161K1988J9234
$$ 724368 726213 734315 739297 746213 751232 763761 761821 758552 755560 753160 759321 781309 800543
10728H00543N624o374j028m248j8037l2171j875R561J313J292n000j0620q694
$$ 800543 806167 799793 798765 794517 776480 744309 742434 751995 753308 754600 749600 738980 730286
10715G30286N103m447Q123Q382L947M920Q062L972p048o089M934n47J7364J2889
$$ 730286 735389 730942 739065 747447 751394 756314 764376 768348 761300 755211 760145 759598 776962 789851
10701G89851J2664n708O348L225n252r70R601J0851J5070K445O805J8649J2293
$$ 789851 802515 796807 803155 806380 801128 800158 809759 820610 835680 838125 844930 863579 875872
10688H75872O571J0470K2947P750k330J2858J1867m95o733n468r862j3645k4983
$$ 875872 882443 892913 915860 923610 921280 934138 946005 945510 938777 933309 923447 909802 884819
10675H84819l759J5023R491J3109P929J5278K4908J0605N632J5153J6612K4999
$$ 884819 881060 896083 905574 918683 926612 941890 966798 977403 983035 998188 1014800 1039799
10663A039799R652l767l038J6051J9417J655N879J0937J0616J6346L5397L3604
$$ 1039799 1049451 1045684 1042646 1058697 1078114 1079769 1085648 1096585 1107201 1123547 1158944 1192548
10651A192548K2257K5613L3306L1114L5263K0088N038N308r470j70j414J6876
$$ 1192548 1214805 1240418 1273724 1304838 1340101 1360189 1365227 1370535 1361065 1360895 1359481 1376357
10639A376357J3987K8122K7808M4585M5503M3805N2584N8522Q4195J20326J32399
$$ 1376357 1390344 1418466 1446274 1490859 1536362 1580167 1632751 1691273 1775468 1895794 2028193
10628B028193J51815J63973J58254J11964O3600K3666k0324q2756j02963j04764
$$ 2028193 2180008 2343981 2502235 2614199 2677799 2701465 2681141 2598385 2495422 2390658
10618B390658q6353o4657l1431K60j163j364L1740N2738M8017K5896L7255N6510
$$ 2390658 2304305 2239648 2208217 2208477 2207314 2205950 2237690 2290428 2338445 2364341 2401596 2458106
10606B458106Q1493Q4372J13954J51702J64837J68352J46916J01059M7325j7135
$$ 2458106 2539599 2623971 2737925 2889627 3054464 3222816 3369732 3470791 3518116 3500981
10596C500981o0698p1097k9888p611M1721R5089J11831R9884O3030M4860r84o4865
$$ 3500981 3440283 3369186 3339298 3331687 3373408 3468497 3580328 3680212 3743242 3788102 3787118 3722253
10584C722253r9848j12848p8916m5649m5042l7898j9644j2643N775M310Q977K8009
$$ 3722253 3622405 3509557 3430641 3384992 3339950 3302052 3282408 3269765 3275540 3279850 3288827 3316836
10572C316836L8956N2377N6813N8617O6561O3860O9899N6555M7082N0530N5798
$$ 3316836 3355792 3408169 3464982 3523599 3590160 3654020 3723919 3780474 3827556 3878086 3933884
10561C933884O0742R1683J04343J13556J16992R6499R4380Q8799J04376J01725
$$ 3933884 3994626 4086309 4190652 4304208 4421200 4517699 4612079 4700878 4805254 4906979
10551D906979R1215J00494J22717J64940K18534K82648L73961N01885N82999N22478
$$ 4906979 4998194 5098688 5221405 5386345 5604879 5887527 6261488 6763373 7346372 7868850
10541G868850M01288L04084J15842k27934m21868l16930j33275l6832L9396J05951
$$ 7868850 8270138 8574222 8690064 8462130 8040262 7723332 7590057 7553225 7592621 7698572
10531G698572J25182J40993J81312K31208K63479K93887L12933L23856L62182
$$ 7698572 7823754 7964747 8146059 8377267 8640746 8934633 9247566 9571422 9933604
10522I933604L45445L51635L86508M22496M56165N01440N12811N23245N68901
$$ 9933604 10279049 10630684 11017192 11439688 11895853 12397293 12910104 13433349 14002250
10513A4002250O78906P94553Q92706J055171J259942J429583J497368J552106
$$ 14002250 14681156 15475709 16368415 17423586 18683528 20113111 21610479 23162585
10505B3162585J637057J719156J750839J940995K500644L304653M275095N531841
$$ 23162585 24799642 26518798 28269637 30210632 32711276 36015929 40291024 45822865
10497D5822865P417277J0288817J4783576K2383530L5293969N3471894O6047409
$$ 45822865 53240142 63528959 78312535 100696065 135990034 189461928 255509337
10490B55509337N8392312M0391628K6594336L155401m6956210q4587772p1793898
$$ 255509337 313901649 354293277 380887613 384043014 337086804 252499032 180705134
10483A80705134m3946331k5770877j6100522j0824553p801344n839162m446138
$$ 180705134 136758803 110987926 94887404 84062851 76261507 70422345 65976207
10476F5976207l477675k873145k415288k011719j764446j606706j486247j526779
$$ 65976207 62498532 59625387 57210099 55198380 53433934 51827228 50340981 48814202
10468D8814202j739867j876796j727137j536014j448251j482113j585367j644659
$$ 48814202 47074335 45197539 43470402 41934388 40486137 39004024 37418657 35773998
10460C5773998j610548j449799j284796j163796j062359r85631r20723q47805
$$ 35773998 34163450 32713651 31428855 30265059 29202700 28217069 27296346 26448541
10452B6448541q04369p75556p51154p29058p28917p44053p22988o76171o66169
$$ 26448541 25644172 24868616 24117462 23388404 22659487 21915434 21192446 20516275 19850106
10443A9850106o28304n72752n68169o04395n93078n88023n52456n16349m68208
$$ 19850106 19221802 18649050 18080881 17476486 16883408 16295385 15742929 15226580 14758372
10434A4758372m49489m13472l54299l50828l55878l48663l44927l40519l17820
$$ 14758372 14308883 13895411 13541112 13190284 12834406 12485743 12140816 11800297 11482477
10425A1482477k97634l00017k89331k92053k98026k78991k60127k40684k28013
$$ 11482477 11184843 10884826 10595495 10303442 10005416 9726425 9466298 9225614 8997601
10416H997601k05974k06688k01345k03247k10905j99305j80321j79663j76356
$$ 8997601 8791627 8584939 8383594 8180347 7969442 7770137 7589816 7410153 7233797
10407G233797j82215j75748j64909j71575j59211j39902j33931j61955j55135
$$ 7233797 7051582 6875834 6710925 6539350 6380139 6240237 6106306 5944351 5789216
10398E789216j58978j44724j43888j35375j20082j01207r6291j16441j09163r6152
$$ 5789216 5630238 5485514 5341626 5206251 5086169 4984962 4888671 4772230 4663067 4566915
10388D566915r7895q0441o4827q6747r0316p6056p5997q5318p9743p8997j06529
$$ 4566915 4469020 4388579 4323752 4237005 4146689 4070633 3994636 3909318 3829575 3750578 3644049
10377C644049j25554j22029j20234j08826j12277p6469o0516q4934r7370r9916
$$ 3644049 3518495 3396466 3276232 3167406 3055129 2978660 2918144 2833210 2735840 2635924
10367B635924r5596o0348o3626m3632m1185l9742o1742n1452m3516m3446o5932
$$ 2635924 2540328 2479980 2416354 2372722 2331537 2291795 2230053 2178601 2135085 2091639 2025707
10356B025707o9992o4918o2128m9509m8736l7377l7039k9075m8069m4322j3853
$$ 2025707 1955715 1890797 1828669 1779160 1730424 1693047 1656008 1626933 1578864 1534542 1520689
10345A520689k1232l2642j8895k7480j8936l401j0717j5446n962j0927j7872k3874
$$ 1520689 1499457 1466815 1447920 1420440 1401504 1398103 1387386 1371940 1365978 1355051 1337179 1313305
10333A313305j4688l2947l5353k2463j8649l4062k6842r950O329O848j3209l657
$$ 1313305 1298617 1265670 1230317 1207854 1189205 1155143 1128301 1118351 1124680 1131528 1118319 1114662
10321A114662O306j0631r764k395q810j5351J959l645k9203m569J491J9080J9993
$$ 1114662 1120968 1110337 1100573 1098178 1089368 1074017 1075976 1072331 1043128 1038559 1040050 1059130 1079123
10308A079123J0330k218r819k4696K323N675o89j7222j7196p523o539m1698l4270
$$ 1079123 1089453 1087235 1077416 1052720 1055043 1060718 1060029 1042807 1025611 1018088 1011549 969851 935581
10295I35581k5105k8665j6536j7872j3499j6880j319J8811L5221K2253J7979J6533
$$ 935581 910476 881811 865275 847403 833904 817024 815705 834516 869737 891990 909969 926502
10283I26502J165k2694j9831j2923q613p753L759L572l04J4554J2918J1975K6502
$$ 926502 927667 904973 885142 872219 863606 855853 859612 863184 862880 877434 890352 902327 928829
10270I28829L1708J7428J1787L2306K637o753l2297n0137m8547m4666m5789k9315
$$ 928829 960537 977965 989752 1022058 1024695 1017942 985645 935508 886961 842295 796506 767191
10258G67191O5j3314m441r654m978o597M648J8207K7535J6416Q862k593m670k577
$$ 767191 767256 753942 749501 739847 734869 728272 732920 751127 778662 795078 803940 801347 796677 794100
10244G94100j7382L86Q081J3136J8005J5857J0614K201P920K1608K0292M129J4871
$$ 794100 776718 777104 785185 798321 816326 832183 842797 844998 852918 874526 894818 898947 913818
10231I13818K2485K2218J7612L2868O2181P1113P6872R9497J20914J53658J75223
$$ 913818 936303 958521 976133 1009001 1071182 1142295 1219167 1318664 1439578 1593236 1768459
10220A768459K11474K39578K73191K95005L25424L20194L70669M87872P44534
$$ 1768459 1979933 2219511 2492702 2787707 3113131 3433325 3803994 4291866 5036400
10211E036400J224079J989834K808884L328156L216039K517893J318769m45588
$$ 5036400 6260479 8250313 11059197 14387353 17603392 20121285 21440054 20994466
10203B0994466k544844l941456l799903k841269j801303j110285p22977n02390
$$ 20994466 18449622 14508166 10708263 7866994 6065691 4955406 4232429 3730039
10195C730039l64012k57373k13901j61526j06295j00192q2243j00811j09585r5764
$$ 3730039 3366027 3108654 2894753 2733227 2626932 2526740 2444497 2343686 2234101 2138337
10185B138337p9893p9108q6029q1749o9869o4328o1043o2485n9929o5334n8543
$$ 2138337 2058444 1979336 1893307 1811558 1741689 1677361 1616318 1553833 1493904 1428570 1370027
10174A370027n0233m2640l6772l5105k7924k8701m3866n1572k7112k3983l0539
$$ 1370027 1319794 1277154 1240382 1205277 1177353 1148652 1104786 1053214 1026102 1002119 971580
10163I71580l0342l1322l0778l5697k5703l0836k7258l1690o260o963j7539k0780
$$ 971580 941238 909916 879138 843441 817738 786902 759644 727954 721694 714731 697192 676412
10151F76412j8220j2656p174k1265n417k233k3052k9978k6302M880J186j8991
$$ 676412 658192 645536 638362 617097 611680 609447 586395 556417 530115 534995 536181 517190
10139E17190j8742k2044j6250j2129J601j970p049o24o695j2714j7184r083p073
$$ 517190 498448 476404 460154 448025 449626 447656 440607 439983 433288 420574 403390 394307 387234
10126C87234l2p130j4853o214l097J1756J0331j5694j2290j013o56k5187j3515
$$ 387234 387202 380072 365219 359005 355908 367664 377995 362301 350011 348998 348342 323155 309640
10113C09640j2690j347j20m636j5537r112m177J3221J3936K285K363j3740j3519
$$ 309640 296950 295603 295483 290847 275310 266198 262021 275242 289178 291463 293826 280086 266567
10100B66567p477R853p015J03N653n784j7440j3387m672j1718k0500j6155K918
$$ 266567 259090 268943 261928 262031 267684 261900 244460 231073 226401 214683 194183 178028 180946
10087A80946J6595J9495j6126j2888M842O430n735J159N762K2814J2013K440K267
$$ 180946 197541 217036 200910 188022 192864 199294 193559 194718 200480 223294 235307 237747 240014
10074B40014J7112L308J8453K9445M0627N4664Q7570J25232J94030K87660L38596
$$ 240014 257126 260434 278887 308332 348959 403623 491193 616425 810455 1098115 1436711
10063A436711K88088K03690J15265m5892l16354m39294l39212k11350j23829o8498
$$ 1436711 1724799 1928489 2043754 1997862 1681508 1242214 903002 691652 567823 499325
10053D99325o8214n1085j8765j2112j9145j3179j0882k3377j4706j4873j0146
$$ 499325 431111 380026 361261 349149 330004 316825 305943 282566 267860 252987 242841
10042B42841r003j0467j2515Q365o335j3763n293R078M551j0697j1908J1575m807
$$ 242841 233838 223371 210856 219221 212886 199123 193830 202908 207459 196762 184854 196429 191622
10029A91622j678J1171N179m679j5443r187q378j2682p95J2261L050J228j9123
$$ 191622 189944 201115 206294 201615 186172 176985 168607 155925 155130 167391 170441 171669 152546
10016A52546N443K6866J6686L9246K2206J0735n383m5440n4271j2575q710l266
$$ 152546 157989 184855 201541 240787 262993 273728 268345 222905 168634 156059 147349 144083
10004A44083k250j8257p741n328L618J2059j4292J0626K769j4238P158J0466m936
$$ 144083 141833 123576 115835 110507 114125 126184 111892 122518 125287 111049 118207 128673 123737
9991A23737q519p487j174o330K510K674j0815j3900m148K176j525J6458L273j8470
$$ 123737 115218 107731 106557 100227 102737 105411 94596 80696 76548 78724 77199 93657 96930 78460
9977G8460j3180O191R886j3429r294r123J3239L022j6862R036O768P410M159R
$$ 78460 65280 71471 81357 67928 58634 49511 62750 65772 48910 57946 64714 72124 76283 76292
9963G6292j039j0036j5243J2312j697N879J0307O294l054O00L939L357n800j1097
$$ 76292 75253 65217 49974 62286 60589 66468 76775 83069 80015 80615 84554 87911 82111 71014
9949G1014J228p078m800j0915M860M276o098J106O678O421K725r690l550Q855
$$ 71014 72242 65164 60364 49449 54309 58585 52487 53593 60271 66692 69417 59727 56177 65032
9935F5032K372m613p531l589P035J501j1020j5696J3620k961n204R723L256k73
$$ 65032 67404 62791 55260 51671 58706 60207 49187 33491 47111 44150 38946 48669 51925 51652
9921E1652o497M22m093M075J2653R593j1446k6480j2697n698M969K9315J3819
$$ 51652 45155 45577 41484 45559 58212 67805 56359 29879 17182 11484 16453 45768 59587
9908E9587M10L777j1194j522r444j8906j1889Q758J3918K728M703k312j9032p054
$$ 59587 59997 63774 52580 51058 41614 22708 10819 19577 33495 36223 40926 38614 19582 12528
9894A2528J4754P371M624K760k207O526o414j8918j3253J2431J936N01m41J0426
$$ 12528 27282 34653 39277 42037 39830 46356 39942 21024 7771 20202 22138 22639 22198 32624
9880C2624J535j180O043J088p045o466J77j0386J527M061M598K985L360R402J5945
$$ 32624 34159 32979 39022 40110 33065 26599 26776 16390 17917 21978 26576 29561 32921 42323 58268
9865E8268N710J509J056j1242o331O306l445n857j0100m911l448k67M648P47n657
$$ 58268 63978 65487 66543 55301 48970 55276 51831 45974 35874 30963 27515 27248 31896 32643 26986
9850B6986%J975M163K118O394N87p348j0591L180J0987o276L140o966j6787o782
$$ 26986 26986 28961 33124 35242 41636 42223 34875 24284 27464 38451 32175 35315 28349 11562 4780
9835D780N010J8586O2j1620r254N264O410p60l823m926J9303q86O16J4437J1292
$$ 4780 9790 28376 28438 16818 7564 12828 19238 18478 14655 9729 29032 28146 28762 43199 54491
9820E4491P797o23j2160l909O177K246Q3L455j2713j1581K545l017O831k650p763
$$ 54491 62288 61665 49505 45596 51773 54019 54102 57557 44844 33263 35808 32791 39622 36972 29209
9805B9209J1084J5494n326j6970R684J0953p197N921r74j5280Q094P627J462k013
$$ 29209 40293 55787 50461 33491 43175 54128 46931 52852 51878 36598 44692 52319 53781 51768
9791E1768R385P568l608k547L799J5432J9792Q830L914M0486M8340L2453K0731
$$ 51768 61153 68721 65113 62566 66365 81797 101589 110419 114333 154819 203159 235612 256343
9778B56343o354J2729k522k8606m0098l0766k3708l1801k5225j469o640r591j5211
$$ 256343 249989 262718 260196 231590 191492 160726 137018 105217 79992 78523 71883 62292 47081
9765D7081o799n13J2262K478k544N520r102j0553n986J343J9198j259r615o478
$$ 47081 40282 39769 52031 54509 51965 57485 48383 37830 31844 33187 52385 51126 41511 35033
9751C5033R715J0510j1060J1984J0876m168k362q6q206L019J4530j0966l465P045
$$ 35033 44748 55258 44198 56182 67058 62890 60528 60442 52236 55255 69785 58819 55354 62399
9737F2399l872o499L823k977n127J2623Q357P566Q474J1954J747j567J332m611
$$ 62399 58527 52028 55851 52874 47747 60370 68727 76293 84767 96721 98468 96901 98233 93622
9723I3622p499k418J9035K3754L587L322M285J5299K5265Q492n7J3399J5459K1556
$$ 93622 86123 83705 102740 126494 130081 133403 137688 152987 178252 186744 186687 200086 215545 237101
9709B37101M617J9963N7023M4863O3044P9701J10521J69845K72549L95081N21119
$$ 237101 241718 261681 318704 363567 426611 506312 616833 786678 1059227 1454308 1975427
9698A975427O82709P97094Q23581P50893N67157K28334j61038m61380o85793q08629
$$ 1975427 2658136 3455230 4278811 5029704 5596861 5825195 5664157 5202777 4516984 3708355
9688C708355q08209o62713n07677l44623k28920j59785j08064q8372n9660m1516
$$ 3708355 2900146 2237433 1729756 1385133 1156213 996428 888364 799992 740332 698816
9678F98816m8404m7942j5992L0n253j1876k6453l9117l2222m608k2478k8396k0833
$$ 698816 650412 602470 586478 586508 581255 569379 542926 503809 471587 466979 444501 416105 395272
9665C95272l4128k2326j5873k9438j4561K054m670M459n627j7072q630j4738j2546
$$ 395272 361144 338818 322945 293507 278946 281000 276330 280789 275162 258090 249460 234722 222176
9652B22176j0143m304j921j0224j2209k0062Q906J529m762m852j545o068j4390
$$ 222176 212033 207729 205808 195584 183375 163313 172219 173748 168986 164134 162589 156521 142131
9639A42131R812l845r247l091j776j8586j3883Q839J973j4881j3131K515M357
$$ 142131 151943 148098 138851 135760 133984 115398 101515 110354 112327 97446 84315 86830 91187
9626I1187k994j275M465O500j0867j2272p186n861J179M278j1947J42K252J1601
$$ 91187 88193 86918 91383 97883 87016 74744 67558 61697 62876 67154 55207 55349 57601 69202
9612F9202J6878n728j0341j2939j9102J9587J0854N66j640L487p92n581r470m739
$$ 69202 86080 80352 70011 57072 37970 57557 68411 68977 67337 70824 70032 64451 54981 50242
9598E0242J3772J1920J2697J9514L0685J5698O838p274j998J413j8089j2099j9283
$$ 50242 64014 75934 88631 108145 138830 154528 161366 154092 152094 153507 135418 123319 104036
9585A04036k1572r001j6935j0433L409P278p746j3323j5649M766J8033R115n26
$$ 104036 82464 73463 56528 46095 49504 56782 49036 35713 20064 24830 42863 51978 51452
9572E1452J136l122p686L136k206m165j094P041r41r395o220K295m134m861R639
$$ 51452 52588 49466 41780 44916 42710 38545 37451 44492 43551 34156 27936 30231 26097 21236 30875
9557C0875M836m486k90o791j1554L815m863K237l653P188J8076K032j0920j1165
$$ 30875 35711 31225 30935 24144 12590 16405 11542 13779 10126 17314 35390 37422 26502 15337
9543A5337r053J911O699m412O087J0233J1341m046j7072m945j0609J1379R464
$$ 15337 6284 8195 14894 10482 16569 26802 38143 34097 17025 12080 1471 12850 22314
9530B2314J934k0718l344R546J901O44M164J0800K574l914r155M086R072o263
$$ 22314 24248 3530 186 9732 11633 12277 16441 27241 29815 25901 16746 20832 29904 23641
9516B3641J173j3060N431O02p82J1790r316K329R065O812o53n271j235n200p382
$$ 23641 24814 11754 17185 17787 17005 28795 19479 21808 30873 37685 37032 31761 30526 25326 17944
9501A7944k339M746p81r86R451N19j2760P370J9477L130k4043r775n994k034M316
$$ 17944 15605 20351 19570 18584 28035 28554 15794 23164 42641 45771 21728 11953 5959 3925 8241
9486H241J525j941P298J1563J311o766R95M720k662j967o465J598M391k063K14
$$ 8241 9766 7825 15123 26686 27997 21231 22226 26946 24284 22317 15852 17450 21841 19778 19992
9471A9992n365r695n152J3715J2k27K465M432J2814N468n573j673j0656L882J920
$$ 19992 14627 4932 -220 13495 13507 13280 15745 20177 32991 38459 32886 31213 20557 24439 26359
9456B6359p73K482j494o293O16q686n217j2860n541o83M01J2876J6955J194k231
$$ 26359 25586 28068 26574 20281 20897 12211 6994 -5866 -11407 -12090 -11689 1187 18142 19336 17105
9441A7105P907o371R561K162n461P131R082LM87j0978j3860j0222j2083r825M969
$$ 17105 25012 18641 28202 30364 24903 32034 41116 41119 41606 30628 16768 6546 -5537 -15362 -10393
9426a0393K1878L142j5123N980R183n109RJ891q767q668k597O625P949M856r392
$$ -10393 11485 14627 -496 5484 14667 9558 9567 11458 2691 -5977 -8574 -1949 6000 10856 1464
9411A464Q43J9498r0o172m0l411k443j1629n407o28J2373Q50o98N885M883o442
$$ 1464 2307 21805 21715 15543 15503 12092 9649 -1980 -7387 -8015 4358 5208 4510 10395 15278 8836
9395H836L50J7024J6569M635m120j1838k599m961j337n296k0309k79K0634p213
$$ 8836 9186 26210 42779 47414 43294 31456 28857 23896 22559 17263 -3046 -3325 17309 10096
9381A0096K060P242q006J8933M885o526n730n883J3813k734l532K103o438J487
$$ 10096 12156 19398 11392 30325 35210 28684 22954 17071 30884 28150 24618 26721 20283 21770
9367B1770l481p063k800o10m383J2060J9408l430j2600j4045r715K001J0671Q408
$$ 21770 18289 11226 8426 7816 3433 15493 34901 31471 18871 4826 -4889 -2888 7783 16191
9353A6191O478j317L479O770M824J5j229M331l185n537K881k058J688j603l296
$$ 16191 22669 21352 24831 31601 36425 36440 35211 39542 36357 30820 33701 31643 33331 31728 28432
9338B8432r711L465r887j313J4942P971P97j1138o221M92L765J3949N696J0545
$$ 28432 18721 22186 12299 10986 25928 33899 34696 23558 17337 17829 21594 35543 41239 51784
9324E1784J02n56N662M475j9742j0679n051n270K278J263K130Q665J3394j3315
$$ 51784 51886 51330 56992 61467 41725 31046 25995 20725 23003 24266 26396 35061 48455 35140
9310C5140j0946M157J1406j2581j1419q106L79M217J6569J7870M358k404q170
$$ 35140 24194 28351 39757 27176 15757 7651 8030 12247 28816 46686 51044 48640 40470
9297D0470k709j0073Q034J8975P512j3567j5030J0998J0361K597j051R423R573
$$ 40470 37761 27688 35722 54697 62209 48642 33612 44610 54971 57568 56517 65940 75513
9284G5513j3046n39O390k3838j5222k283j75M754o201J7618M759m269j7472o509
$$ 75513 62467 61928 68318 44480 29258 26975 26800 31554 25353 42971 47730 43461 25989 19480
9270A9480j3388l006J0764K0771J0538o456l745M026O974Q962o469o136O97j3072
$$ 19480 6092 3086 13850 34621 45159 38703 34958 38984 45958 54920 48451 42315 43012 29940
9256B9940k111N773K371n174J40Q524k889P10m282q831P047L551J1173j0429n377
$$ 29940 27829 33602 35973 30799 30939 39463 36574 37284 33002 24171 31218 34769 45942 35513 30136
9241C0136R123q600j2323J0009L343q162m777k188O555K1482J1779r249n902m958
$$ 30136 39259 30659 18336 28345 31688 23526 18749 16561 23116 44598 56377 47128 41226 36268
9227C6268m582P60J226K829L777j357n119j58n849J687J9586L156J0659r061r255
$$ 36268 31686 32446 33672 36501 40278 38921 33802 33644 27795 29482 49068 52224 62883 53822 44567
9212D4567l909J3756J226j4404p15n47R475M673o996N773J0244m025J429r282
$$ 44567 40658 54414 55640 41236 40521 39974 49449 54122 47126 52899 63143 59118 60547 51265
9198E1265o682n676j0794J434L329k632O612K069k993L039N302J632P903r28J5189
$$ 51265 44583 38907 28113 29547 32876 30244 36856 38925 35932 38971 44273 45905 53808 52880 68069
9183F8069L31k0983o081p328j7274j37J3197M26J0889j174K255P197O035O430
$$ 68069 68400 47417 41336 34008 16734 16597 29794 30220 41109 39935 42190 49387 55422 61852
9169F1852n658M273J587j2046o821o730N061L799L942q08J490J5489J2817j1159
$$ 61852 56194 60467 62054 50008 43187 36457 41518 45317 49259 48451 49941 65430 78247 67088
9155F7088j1391r623n625N074L421m010q65m005k542N318j593r003r078P966L172
$$ 67088 55697 46074 40449 45523 48944 44934 44069 40064 37522 42840 41247 32244 23166 31132 34304
9140C4304m895j841n73k503M442j103J9342L733R83j4278j1317J057k850p68P283
$$ 34304 29409 27568 26995 24492 28934 27831 47173 50906 51889 37611 26294 27351 24501 23733 31016
9125C1016K783j921J4953K981p334P321l674m809j227N955o37j004j6178q149
$$ 31016 33799 31878 46831 49812 42478 49799 46125 41316 40089 46044 45407 44403 28225 20076
9111B0076n680J6032J7642R400L492n540J581j4954L226J2467P078J584M738L060
$$ 20076 14396 30428 48070 57470 60962 55422 57003 42049 45275 57742 64820 66404 71142 74202
9097G4202m755K593j0293m865j676J2879J0976j8038p741Q385J9415l060p722
$$ 74202 69447 72040 61747 56882 55206 68085 79061 61023 53282 61667 81082 78022 70300
9084G0300J367R932k866q9j2363l123Q054Q907K48K280K933K531q423l736r022
$$ 70300 71667 81599 78733 78644 66281 63158 71212 80119 80367 82647 85580 88111 79688 75952 66930
9069F6930o55L796J962j1689o367n582R849J6271R720p753M379r34r706r921P364
$$ 66930 66275 70071 72033 60344 53977 48395 58244 74515 84235 76482 80861 79927 70221 60300 67664
9054F7664P212q32j3282N724O162k90J492Q877J2494Q185m867N159N011j0537
$$ 67664 74876 74044 60762 66486 72648 72358 73850 82727 95221 103406 98539 103698 108709 98172
9040I8172k2788p417j5795M056R734P572P028o258j8770l531j038r48J7243K387
$$ 98172 75384 67967 52172 56228 65962 73534 80562 74304 55534 52003 50965 50017 67260 69647
9026F9647j108J116K684P124O090m775P121K062m883j1163r060M541J458j3636
$$ 69647 68539 69655 72339 79463 85553 80778 87899 89961 85078 73915 64855 69396 70854 57218
9012E7218M866l038J230J3703o299m021L55j5521L155M578J3999J0249r720J4837
$$ 57218 62084 59046 60276 73979 67680 63659 64014 48493 51648 56226 70225 80474 70754 85591
8998H5591O255k6678r580J0548J6425M739j1603k826Q163j6639j0602N006O818
$$ 85591 91846 65168 55588 66136 82561 87300 75697 72871 81034 64395 53793 58799 65617
8985F5617J6861N17j658K273p664M452j854n022j2143j7140J0236J0963l273J2817
$$ 65617 82478 82995 81337 83610 75946 80398 78544 73522 61379 44239 54475 65438 62165 74982
8971G4982N150l964O045o703Q784k994O537J0811l421k550m67m909j6733J771
$$ 74982 80132 76168 82213 75510 84294 81300 87837 98648 95227 92677 92210 87301 70568 72339
8957G2339m812J6056R59j5185P33L268N990J6970n765j2959p376l939Q550J7218
$$ 72339 67527 83583 84542 69357 70090 73358 79348 96318 90553 77594 70218 66279 74829 92047
8943I2047o613l267J2300m787j8790r722J8524J7078N718j1094j6536o186p57
$$ 92047 85434 82167 94467 89680 70890 61168 79692 96770 102488 91394 74858 68672 67915
8930F7915O134J2882J0777j363q095j2992o660o594l900K482p006q397O262Q234
$$ 67915 74049 86931 97708 96345 88250 75258 68598 62004 58104 60586 53580 45183 51445 59679
8916E9679j119J949R666M375m021o541J543J8991R537j1444j5723o261O426J3595
$$ 59679 58560 60509 70175 74550 70529 63988 65531 84522 94059 82615 66892 60631 67057 80652
8902H0652j285j7263L934K928l007N734p699j3981O138k724P016j436n823L298
$$ 80652 79367 62104 66038 68966 65959 71693 63994 50013 56151 53427 60443 59007 53184 56482
8888E6482J6764J3893J0714O625j4848j1576o749l145J2368J249Q222r283j1442
$$ 56482 73246 87139 97853 104478 89630 78054 71305 68160 80528 81777 89999 80716 69274
8875F9274L596j915r658P001m869q711J7572Q882k953n644r946L047J735m787
$$ 69274 72870 70955 61297 68298 63429 54718 72290 81172 78219 72575 62629 65676 67411 62624
8861F2624M266J0935q73N709m762m260N274p046n658P584J172m335j9761k408
$$ 62624 66890 77825 76952 82661 77899 73639 78913 71867 66209 73793 74965 70630 50869 48461
8847D8461J3782J8345Q445k038j1383q110M240k84l322J3629k887r050J090k208
$$ 48461 62243 80588 89033 86995 75612 67502 71742 71458 68136 81765 78878 69828 70918 68710
8833F8710p629J0232N921j4532j1431R792K102O784O403O257Q126J4238J1391
$$ 68710 61081 71313 77234 62702 51271 61063 63165 69949 76352 82609 90735 104973 116364
8820A16364M550j2565j6467o523n953J3782J428p574n408J0954R570J9310j6827
$$ 116364 120914 108349 91882 85359 79406 93188 94616 87042 81634 92588 102158 121468 104641
8807A04641k4312J1126R39r033J677N064n117n124l747J1040J509L482J6501N913
$$ 104641 80329 91455 92394 83361 85038 90102 84985 79861 76114 87154 88663 92145 108646 114559
8793A14559n172j8526M980J5354O409J792n843r8J621M504K910o403N862p164
$$ 114559 109387 90861 95841 111195 117604 119396 113553 113455 115076 119580 122490 116087 121949 114785
8779A14785k4227m011J4210R486K109n066l721j098P239J042O450M699j241m535
$$ 114785 90558 86547 100757 110243 112352 107286 103565 102467 109706 110748 117198 121897 120656 116121
8765A16121k9505j2207L0316K1027K98J2593O941r732k483N347J5388o75m709
$$ 116121 86616 74409 104725 125752 126050 138643 145584 135852 133369 138716 154104 153429 148720
8752A48720r568j1726j3868j1550R337L255O499J4362K317n166N588K1046N407
$$ 148720 139152 127426 113558 102008 111345 114600 121099 135461 137778 132612 138200 159246 164653
8739A64653j2177k172O571m027P71Q832o931k1470l974J2628J4781r800r359N069
$$ 164653 152476 150304 156875 152848 153619 162451 155520 134050 130076 142704 157485 147685 138326 143395
8725A43395Q349P05q597j2330k133J8988J7755N44N185M205n513P281k341o572
$$ 143395 151744 152449 143852 131522 129389 148377 166132 166676 171861 176066 170553 177834 175493 168921
8711A68921l869l640m84J0453J0464r131m79J689O496k965q02J0391K02m514l240
$$ 168921 165052 161412 160928 171381 181845 172714 172235 173924 180420 177455 176653 187044 187246 182732 179492
8696A79492K830o979N591J2890L069M948J68J144m230m315K1416K0554J6086j3118
$$ 179492 182322 175343 180934 193824 196893 201841 202009 203153 198923 194608 216024 236578 252664 239546
8682B39546k06j966j1302Q044J2488M45j010m552m7r535l539J3806k360j455O12
$$ 239546 239340 237374 226072 234116 246604 247049 246039 241487 241440 231905 228366 242172 239812 238357 238969
8667B38969o079M771Q741K526R302Q675J3110j2154k2257K436O257R818Q70j3571
$$ 238969 232890 237661 246402 248928 258230 266905 280015 267861 245604 248040 254297 264115 264985 251414
8653B51414N775N675J3583J5161R142J6754K2713K6817L4431K3844L1779M9103
$$ 251414 257189 262864 276447 291608 300750 317504 340217 367034 401465 425309 457088 506191
8641E06191K6288K3360Jk8874n6623n3792l3842j3575Q297O633N369P64n988l3521
$$ 506191 532479 555839 555840 526966 470343 416551 382709 369134 377431 384064 389433 390197 384209 350688
8627C50688j0201j87L00N886L314O599K705p216J8279L9835M1967N8482L9460
$$ 350688 340487 340300 340600 346486 349800 356399 359104 351888 370167 410002 451969 510451 549911
8614E49911Q578J0100q24m3347o8904n5702l9051j2836J413q846J4130R491O205
$$ 549911 558489 568589 567765 524418 455514 399812 360761 347925 349338 340492 354622 364113 370318
8601C70318m746j5771l922n323R73J546j0472m828r535o940j65N760J4105N612
$$ 370318 365572 349801 345879 340556 341529 343075 332603 327775 318240 311300 311135 316895 331000 336612
8587C36612j198r44j1324k9783L043J7470K246Q556J912J5449K087L406N179j1324
$$ 336612 335414 334470 323146 293363 296406 313876 316122 324678 326590 342039 344126 347532 352711 341387
8573C41387j1065m08r454J3041J7305J7063J3324J6842j100N016N719P905r542
$$ 341387 330322 329914 320460 333501 350806 367869 381193 398035 396935 401951 407670 415575 406033
8560D06033M965K0329Q311J8450P906n603j2631j7578k9669k2415k8988k3467
$$ 406033 410998 431327 439638 458088 465994 460391 447760 430182 400513 378098 349110 325643
8548C25643j3502L36J6499l65K875m608j1629L375j360J474J381J4898n374j0111
$$ 325643 312141 312477 328976 328611 331486 326878 315249 318624 317264 318738 320119 335017 329643 319532
8534C19532P635q202l3250k0925l403K707M762L49j7339p497l269j405m64K514
$$ 319532 327167 318965 285715 264790 261387 264094 268856 269205 251866 244369 241100 239695 239231 241745
8520B41745j2160j8146K120o92k367j2771M341R356l890P821j798J829J0895r57
$$ 241745 229585 211439 213559 212867 210500 197729 202070 211426 207536 215357 213559 215388 226283 225326
8506B25326J1175J931l072j164J2818m037k2837k5550l792K435m320j1119l986
$$ 225326 236501 238432 235360 234196 247014 242977 220140 194590 190798 193233 188913 177794 173808
8493A73808n515p94l781m791m484m315q958j3894j1289J5687K6803R265j3609
$$ 173808 168293 167499 163718 158927 154443 150128 141170 127276 115987 131674 158477 167742 154133
8480A54133r219P361m77m100m756O291J951l219L96p638L200m274N781l22l272
$$ 154133 144914 152275 151798 147698 142942 149233 151184 147965 148361 140723 143923 139649 145430 145108 141836
8465A41836n014j0652M152r71p921J1j92K208r949J0602o127m919j860m012k209
$$ 141836 136822 126170 130322 129351 121430 121441 121249 123457 113508 124110 117983 113064 111204 107192 104983
8450A04983L852L676l822M089J3949l589j0959k96L53J1430n733j3745J6891L967
$$ 104983 108835 112511 108689 112778 126727 123138 112179 111883 112236 123666 117933 104188 121079 125046
8436A25046j0049M12m795p080k898m740P275R110j7648k610Q869K933o46j2187
$$ 125046 114997 115409 110614 103534 100636 95896 103171 112281 94633 92023 100892 103825 103179 90992
8422I0992L971l618J0679K03j4439l66l29Q654k477j2334j1754L627Q543J2029
$$ 90992 94963 91345 102024 102227 87788 87422 87093 95747 93270 80936 69182 72809 81352 93381
8408I3381m2J692k032j736P359L590l696m321p173j0049N97l431r30M583J5878
$$ 93381 93339 95031 92999 91263 98622 102212 98516 94195 87022 76973 77570 74139 73209 77792 93670
8393I3670J804M059L920j3492r304j7450p549K310Q980M679l054q729l126P437
$$ 93670 95474 99533 103453 89961 80657 63207 55658 57968 66948 71627 68573 59844 56718 64155
8379F4155R085l378L761j9307n727L076q162l040o195K5432K332o986R932L170
$$ 64155 73240 69862 73623 54316 48589 51665 43503 40463 34268 59700 62032 55046 64978 68148
8365F8148m490j3889j0162J2810Q085J265j9053J607J350J1364o736j974L308
$$ 68148 63658 49769 39607 52417 60502 61767 42714 44321 45671 57035 50299 48325 51633
8352E1633O542l422j0160o321P989O148m75R501l939Q569m888J35M055P669J3381
$$ 51633 58175 54753 44593 38272 46261 52409 51934 61435 57496 66065 61177 61312 65367 73036 86417
8337H6417M767m166j1488o586J5515L850j1476j9416j587L400L360N376J345k777
$$ 86417 91184 87018 75530 68944 84459 88309 76833 57417 55830 59230 62590 67966 69311 66534
8323F6534m935j2279m600P834k502j1311P222L793N515J3955J026n025m363n054
$$ 66534 61599 49320 44720 52554 50052 38741 45963 49756 55271 69226 70252 65227 60864 55810
8309E5810o18K760R049K8243K404j4026J6720K3369J9063J8179q167j5557r083
$$ 55810 55192 57952 67001 95244 97648 83622 100342 123711 142774 160953 152786 137229 128146
8296A28146j2215j4874k5193j5778j1023m535J3809Q051O534J57j749r031o715
$$ 128146 115931 101057 75864 60086 49063 44528 58337 66388 72922 73079 71330 62299 55584
8283E5584J1691J5547L023k838k658J403q081n058o71k469j1583p119m351N739
$$ 55584 67275 82822 85845 83007 80349 81752 73671 68613 67942 65473 53890 46771 42420 48159
8269D8159M025J1983q628j1082Q33J958o641N444R343k675k41J6010o798j2726
$$ 48159 52184 64167 55539 44457 45290 47248 40607 46051 55394 52719 52478 68488 61690 48964
8255D8964p553l352P45K340n199j0018Q391J0354j196O124K11q632J1352K0094
$$ 48964 41411 38059 38804 41144 35945 25927 34318 44672 43476 49600 49811 41179 52531 72625
8241G2625l398J3158q670Q907J726j1158p182j1575j975K691m108L859J2370O622
$$ 72625 69227 82385 73715 82622 84348 73190 66008 54433 52458 55149 51041 54900 67270 73892
8227G3892k494j488j922p814j1198J406J2706j714O761j0155j6724M383k944O078
$$ 73892 71398 69910 67988 60174 48976 50382 63088 61374 68135 57980 41256 45639 42695 48773
8213D8773J933j567M91J931M803Q194K019r05R427P863j983k1883n859R199K0394
$$ 48773 50706 49139 49630 51561 56364 64558 66577 65672 75099 82962 80979 59096 53237 62436 82830
8198H2830L744j2894j2084L25j6094L983J0198K975k367J4607N473J658k712l976
$$ 82830 86574 73680 61596 61921 45827 49810 60008 62983 60616 75223 80696 82354 79642 75666
8184G5666k359j0282j031N466L74k203j1913m878J7258J4113o901l537Q124r248
$$ 75666 73307 63025 61994 67460 67834 65631 53718 48840 66098 80211 73310 69773 77897 68649
8170F8649j5248j260J5466J5339q383n245j7013j1643m222K300J1620J1003k006
$$ 68649 53401 52141 67607 82946 74563 69318 52305 40662 36440 38740 50360 61363 59357
8157E9357k728J0000P039j0678o181O241j0432o213M534r72O287l626J9537l371
$$ 59357 56629 66629 73668 62990 56809 63050 52618 46405 50939 49967 56254 52628 72165 68794
8143F8794m56L986l816O210L398P665j101P262P569L595J0950L393j4929k2940
$$ 68794 68338 72324 68508 74718 78116 85781 84680 91942 99511 103106 114056 117449 102520 79580
8129G9580m152R614J660j4746Q018J757M147k186J8140K3479L763j6048m67l651
$$ 79580 75428 85042 86702 71956 79974 81731 85878 83692 101832 125311 129074 113026 112559 108908
8115A08908J2227P633j6449n889r342K886K436P617J2927k991q103n010j2600
$$ 108908 121135 128768 112319 106430 97088 99974 102410 110027 122954 119963 111860 106850 94250
8102I4250N901J7447M673j2140J0376K096j5124J963N515O882J7655J3991j1312
$$ 94250 100151 117598 122271 110131 120507 122603 107479 109442 114957 121839 139494 153485 142173
8089A42173n951R811M568n918j6697l156p449J2378J1692m095m108m965R969J0240
$$ 142173 136222 146033 150601 144683 127986 124830 117381 129759 141451 137356 133248 128283 138252 148492
8075A48492J3456J4074m626j1448l498j1795P979L665o98m743n97Q14J6610J8107
$$ 148492 161948 176022 171396 159948 156450 144655 152634 156299 155601 150858 150261 151075 167685 185792
8061A85792K778j5477n079L203Q006L412m86K835m315L528O700L436M830O828
$$ 185792 188570 173093 168014 171217 179223 182635 182149 184984 180669 184197 190897 194333 199163 205991
8047B05991K55k460j256r881R32M594p780k167J4753m50J10J0772L043J238k654
$$ 205991 206246 203786 202530 192649 193581 198175 190395 188228 202981 202531 202641 213413 216456 217694 215040
8032B15040k889M266r26p778p990J367O248O952R691K0488R899m207j561o016
$$ 215040 212151 216417 215491 207713 199723 201090 207338 214290 223981 244469 254368 250161 248600 242584
8018B42584Q265r897k9405M481K3262L1113M1306K3879J995r003Q22K3500J7783
$$ 242584 250849 240952 211547 216028 239290 270403 311709 335588 337583 328580 329402 352902 370685
8005C70685l756P890r504j73q253K722J1489J0168K525m096M504n188J005J1898
$$ 370685 366929 374819 365315 365142 356889 359611 371100 381268 383793 379697 384201 379013 380018 391916
7991C91916l101j2108j8367j7502o342N315M661j6331n224M432J0267P800R450
$$ 391916 388815 376707 358340 340838 334496 339811 344472 328141 322917 327349 337616 345416 354866
7978C54866r824k938J7594L6227J7045j5280q189J9522R410k85P708Q073K4130
$$ 354866 345042 342104 359698 395925 412970 397690 389501 409023 418433 418148 425856 433929 458059
7965D58059K5064J8645J6650p743p383j3995J3635L2526P85k7866J526n831k0873
$$ 458059 483123 501768 518418 510675 503292 489297 502932 535458 536243 508377 509903 504072 483199
7952D83199j3704r747l0366j7302j1953r843j1655j5995J2041J0680l273k3304
$$ 483199 469495 459748 429382 412080 400127 390284 378629 362634 374675 385355 382082 358778
7940C58778o998K511J3969J0324j3372j2465m703o996Q898J3056J031j2588M55
$$ 358778 351780 354291 368260 378584 365212 352747 348044 341048 349946 363002 364033 351445 351900
7927C51900R519K145o807j425K566M374J406p549p112P339q424k8158l748J8618
$$ 351900 361419 363564 356757 355332 357898 362272 363678 356129 349017 356356 347932 319774 316026 334644
7913C34644p644j2242j5232p299j3397k0900j9593o878j1145l461K500o548k1227
$$ 334644 327000 314758 299526 292227 278830 257930 238337 231459 220314 216853 219353 212805 191578
7900A91578K224J0396N053l783k421j7920j4682R637R137l988j4371r287N8K391
$$ 191578 193802 204198 209251 205468 203047 185127 170445 180082 189219 185231 170860 161573 161631 164022
7886A64022l58p512j8363j2167L415K0452J00Q32o448k278o708q789O37l223j762
$$ 164022 163664 156152 137789 125622 129037 149489 149589 150421 143973 141695 134987 126198 126835 123612 121850
7871A21850j2462o533L814j3136j5026J020j1298K127r812r510J0193j200O7j4097
$$ 121850 109388 102855 106669 93533 78507 79527 68229 70356 60544 51034 61227 60027 60094 45997
7857D5997J844K0938m181j1154l591M435J786p060O972n48j4210o798J23N380
$$ 45997 47841 68779 64598 53444 49853 54288 56074 49014 55986 55438 41228 34430 34553 39933
7843C9933J830J478O100L220p561J4559L490m789k337O270r561j0878j1721O518
$$ 39933 41763 43241 49341 52561 45000 59559 63049 58260 55923 62193 52632 41754 30033 36551
7829C6551J956l350j0939J6082R872J0581k680j0733p866o686p121j794M611k89
$$ 36551 38507 35157 24218 40300 50172 60753 58073 47340 39474 32788 25667 23873 28484 28195
7815B8195K126p694k812J3535J73l72r898j5601N406J0299o862K728J0366j12
$$ 28195 30321 22627 19815 33350 33523 33151 23253 7652 13058 23357 16495 19223 29589 29477
7801B9477p619k554Q679Q812q461j6433J1896Q17n60M637j445l384k036J3629
$$ 29477 21858 19304 27983 36795 28334 11901 23797 24614 24054 28691 27246 23862 21826 35455
7787C5455J6546J3813m076j986l725p510r930j668o207P614m493q466J2132L539
$$ 35455 52001 65814 61738 59752 56027 48517 38587 36919 30712 38326 33833 25367 37499 41038
7773D1038M650J301K653l367q916q498j5990r718o059K079J8558O866M865j0610
$$ 41038 45688 46989 49642 46275 37359 28861 12871 3153 -2906 -827 17731 24597 29462 18852
7759A8852k615r439k921Q498J1186o74L665J6127N60j4763J953M171o286k4961
$$ 18852 16237 6798 3877 12375 23561 22887 26552 42679 43239 28476 30429 34600 28314 3353
7745C353q614M350O827M224M981K35k457J1562j631Q612J3956l387j0155Q915
$$ 3353 -5261 -911 5916 10140 15121 15356 12899 24461 22830 31442 45398 42011 31856 40771
7731D0771L914j1357m68L470L51l231m639p568j0817o731m75J6123J2703k640
$$ 40771 44685 33328 32860 36330 36681 33450 28811 21243 10426 3695 3220 19343 32046 29406
7717B9406j4147K636l724m515l365j2241j623K1362p644j4180o7p079k698q88
$$ 29406 15259 17895 14171 9656 6291 -5950 -7573 13789 6145 -8035 -8102 -15181 -17879 -18767
7703a8767J6869L914R2r270k998Q204K0040j965o932k574j256r801m740M071K1729
$$ -18767 -1898 2016 2108 -7162 -10160 -1956 18084 16119 9187 6613 5357 -4444 -9184 -5113 16616
7688A6616J1865J8574p202j8042k826M995J453r186l113L457j089r739K858J2048
$$ 16616 28481 47055 39853 21811 18985 23980 25433 16247 13134 16591 15502 5763 8621 20669
7674B0669l759r296k7179N473j147j8159l226J0655O008J5893J0170j5461n998
$$ 20669 16910 7614 -19565 -14092 -15239 -33398 -36624 -25969 -19961 -4068 6102 -9359 -15357
7661a5357j508Q462P999q302l155k298j004P483r382K025o609J489K561R391n78
$$ -15357 -16865 -8403 -404 -8706 -11861 -14159 -15163 -7680 -17062 -15037 -21646 -20157 -17596 -8205 -8783
7646h783K3400J4494j0310L190o813q594l832q251P218m925O675R791R226m706
$$ -8783 14617 29111 18801 21991 15178 6584 2752 -5499 1719 -3206 3469 13260 22486 17780
7632A7780l091r406j4476k471L231R714Q52r48M173q938n275q094R01r251L805
$$ 17780 14689 5283 -9193 -11664 -8433 1281 2133 1185 5358 -3580 -8855 -16949 -16048 -25299 -21494
7617b1494o4k500J2290N883J968r39j2543n479N252k874P043R661J1752K540J284
$$ -21494 -21558 -24058 -11768 -5885 -3917 -4856 -17399 -22878 -17626 -20500 -13457 -3796 7956 10496 11780
7602A1780m491l891k826O561k524n406m522j0571p417m58N545l451K039J0599
$$ 11780 7289 3398 572 7133 4609 -797 -5319 -15890 -23307 -23765 -18220 -21671 -19632 -9033
7588i033l724n806J522l95k3872J271J8575J2415K137L031q582P029k067j2022
$$ -9033 -12757 -18563 -17041 -17436 -41308 -40037 -21462 -9047 -6910 -3879 -12461 -5432 -7499 -19521
7574a9521j4995l486O806l50J8637J1021j3976o629J0885k132j1563J3J0489m069
$$ -19521 -34516 -38002 -31196 -31546 -12909 -1888 -15864 -22493 -11608 -13740 -25303 -25290 -14801 -18870
7560a8870J1871J0363j5439j4524r851O013m196M857N291J0545O064N353L072
$$ -18870 -6999 3364 -12075 -26599 -36450 -30437 -34633 -29776 -24485 -13940 -7876 -2523 549
7547E49j3746N543K694j1963o145K49L046L450J1392N665L014j6744o523j889
$$ 549 -13197 -7654 -4960 -16923 -23068 -22819 -19773 -16323 -4931 734 3748 -12996 -19519 -21408
7533b1408K370J8892M429m086J269J4333n809j3458J048R271N233q408N75N903
$$ -21408 -19038 -146 4283 197 1466 15799 9990 -3468 -2420 6851 12084 3676 4251 10154
7519A0154P484J308o579p326j5048j3106Q817M413J028j6459j4407q460N144J2328
$$ 10154 17638 18946 12367 5041 -10007 -23113 -14296 -9883 -8855 -25314 -39721 -48181 -43037 -30709
7505c0709J7152O969m308r153n972L901N507j1729j165j610j3364J3896J0756
$$ -30709 -13557 -6588 -10896 -20049 -26021 -22120 -16613 -28342 -29507 -31117 -44481 -30585 -19829
7492a9829O054J284l545m998J74o628J004J202l3o029l69l285J4006L306M319
$$ -19829 -13775 -12491 -16036 -21034 -20860 -27488 -26484 -25282 -25315 -31344 -31713 -34998 -20992 -17686 -13367
7477a3367O922o782m54k139j158K460O085j5442q223L988J0593p689k0027K440
$$ -13367 -6445 -13227 -13681 -15820 -16978 -14518 -8433 -23875 -32098 -28110 -17517 -25206 -45233 -42793
7463d2793J6175M601J089K880P688j9660L904J1800K301R123J972r149j7018n340
$$ -42793 -26618 -22017 -20928 -18048 -10360 -30020 -26116 -14316 -12015 -2892 -920 -10069 -27087 -32427
7449c2427K023K098j689P945J198J1155p639P03j618j0180J43Q051J0519J467
$$ -32427 -30404 -28306 -29995 -22050 -20852 -9697 -17336 -16633 -18251 -28431 -28288 -20237 -9718 -8251
7435h251J4957L792l774K396Q74k2405j0867O174l517l714m157j2253M113N469
$$ -8251 6706 10498 6724 9120 9994 -12411 -23278 -17104 -20621 -24335 -28492 -40745 -36632 -31163
7421c1163k944L737M352p241N559r544L419O532R627r959J4740J0154r667J940
$$ -31163 -34107 -30370 -26018 -33259 -27700 -37244 -33825 -27293 -17666 -27625 -12885 -2731 -12398 -10458
7407a0458J0940p51j0049j6212j0699n359o309O040J6319Q191N952J0715j0199
$$ -10458 482 -269 -10318 -26530 -37229 -42588 -48897 -42857 -26538 -18347 -12395 -1680 -11879
7394a1879j1691m022O087J0148k114K747R243M314j6596j5727j1404Q323J3327
$$ -11879 -23570 -27592 -21505 -11357 -13471 -10724 -1481 2833 -13763 -29490 -40894 -32571 -19244
7381a9244o117p662q105m54j635Q559P660j2592K481J2450J5406N061j9113j7463
$$ -19244 -25361 -33023 -41128 -41582 -43217 -34658 -26998 -39590 -37109 -24659 -9253 -4192 -23305 -40768
7367d0768j212K330J2653J0602J2450L07o752j4523n439R821J146O031Q104j7232
$$ -40768 -41980 -39650 -26997 -16395 -3945 -3638 -10390 -24913 -30352 -20531 -19385 -13354 -5250 -22482
7353b2482l558r945j1799J570l573J7075J6015k961m100M669P934L110M747P839
$$ -22482 -26040 -35985 -47784 -46214 -49787 -32712 -16697 -19658 -23758 -19089 -11155 -8045 -3298 4541
7339D541j2063o866J9593M576j4710p701l110J1412L765j4784j2878J0310L422
$$ 4541 -7522 -14388 5205 9781 -4929 -12630 -15740 -4328 -563 -15347 -28225 -17915 -14493
7326a4493m879M253J1172P319j0609L24Q445j912o040r360l733k523L616l250
$$ -14493 -19372 -15119 -3947 3372 -7237 -6913 1532 -380 -6420 -15780 -19513 -22036 -18420 -21670
7312b1670m169J6483P294M636j915j549k277q989m149M980L010l920k791K367
$$ -21670 -25839 -9356 -2062 2574 659 -890 -3167 -12156 -16305 -11325 -8315 -12235 -15026 -12659
7298a2659J1470j60N24q404r763j075l77J0569P33j0002j852J599P156R350O267
$$ -12659 -1189 -1349 -825 -9229 -18992 -20067 -20444 -9875 -9142 -19144 -20996 -19397 -12241 -2891 3376
7283C376r368m085l104l065l466j265o64m063j76k594o10L076R730Q07j5595N355
$$ 3376 -5992 -10077 -13181 -16246 -19712 -20977 -21641 -25704 -25880 -28474 -29084 -26008 -16278 -15471 -31066 -25711
7267b5711P203J64q176M673J5537n23n397p325n541q8K495r073J471L908o524
$$ -25711 -18508 -18344 -26520 -21847 -6310 -6833 -12230 -19555 -25096 -25184 -22689 -31762 -30291 -26383 -32907
7252c2907O06k279M938P740J2334Q533O414j175o853j5612j3591M022q315R295
$$ -32907 -32301 -34580 -29642 -21902 -9568 -1035 5379 4204 -2649 -18261 -31852 -27830 -36145 -26850
7238b6850J9353J282j1425o599j700M015N976n690j4568O006J4599j389p766j6724
$$ -26850 -7497 -6215 -17640 -24239 -25939 -21924 -15948 -21638 -36206 -30200 -15601 -16990 -24756 -41480
7224d1480J3318l058K420L648j369J1919J2287M2K47q535q862J7964Q14L110K114
$$ -41480 -28162 -31220 -28800 -25152 -26521 -14602 -2315 -2273 -2026 -10561 -19423 -1459 -645 2465 4579
7209D579j7230j2994J2808k099l060n257L455Q018K158q473r027Q852N089O02
$$ 4579 -12651 -25645 -12837 -14936 -17996 -23253 -19798 -11780 -9622 -18095 -27122 -18270 -13181 -12579
7195a2579R63j0503O747J443J0158n716k0716n904J4348Q243K209K001k171M872
$$ -12579 -11616 -22119 -15372 -13929 -3771 -9487 -30203 -36107 -21759 -13516 -11307 -9306 -11477 -6605
7181f605k253j0461p540m372J45J4276N95j2809n709J3832J7846k346j860k445
$$ -6605 -8858 -19319 -26859 -31231 -31086 -16810 -16215 -29024 -34733 -20901 -3055 -5401 -7261 -9706
7167i706l666N624L977n283q867P868N458o845j535o47m995o123M24j128J524
$$ -9706 -13372 -7748 -3771 -9054 -17921 -10053 -4595 -11440 -12975 -13622 -18617 -24740 -24316 -25444 -23920
7152b3920o098j34k75j740N224O126P242M582J838J0008K811q74k1173j4503M557
$$ -23920 -30018 -30152 -30427 -32167 -26943 -20817 -13575 -8993 -7155 2853 5664 4790 -16383 -30886 -26329
7137b6329L173M851P41M303j374j343q813j2968L719l599N042L959P846J2876
$$ -26329 -23156 -18305 -17564 -13261 -14635 -15978 -24791 -37759 -34040 -37639 -32597 -28638 -20792 -7916
7123g916Q64j1997Q23J049L371J0689j3405r010j363K617J2256j839L353O937
$$ -7916 -7052 -19049 -18226 -17177 -13806 -3117 -16522 -25532 -26895 -24278 -12022 -13861 -10508 -3571
7109c571O093m96j0007k102j3429L599L283j1322J54L005n212j3516M39L519N90
$$ -3571 2522 2026 -7981 -10083 -23512 -19913 -16630 -27952 -27798 -24793 -30005 -43521 -43082 -39563 -38973
7094c8973n040N517J20K4K270k962Q153Q579n958q946m954L578k27J1367O872
$$ -38973 -44013 -38496 -38376 -38352 -36082 -39044 -30891 -22312 -28270 -37216 -42170 -38592 -38819 -27452 -20580
7079b0580N535J273K139J040m007N919O78n966p403o780J0350N841m611K821J3608
$$ -20580 -15045 -13772 -11633 -10593 -14600 -8681 -8003 -13969 -21372 -28152 -17802 -11961 -16572 -13751 -143
7064a43l983j747Q524J1071k0263P786N032j7820j7133j004l95M542J3023M097
$$ -143 -4126 -5873 2651 13722 -6541 1245 6277 -11543 -28676 -29680 -30075 -25533 -12510 -8413
7050h413L40j0897j3933N088Q615M642M349l853O93j1242j427Q860J601m653L227
$$ -8413 -8073 -18970 -32903 -27815 -19200 -14558 -10209 -14062 -13369 -24611 -26038 -17178 -15577 -20230 -17003
7035a7003L658Q382m765p601q564r554N807M041O483J7951j0118J375J423M854
$$ -17003 -13345 -4963 -9728 -17329 -25893 -35447 -29640 -25599 -19116 -1165 -11283 -9908 -8485 -3631
7021c631M443L393k02N418J107o389j1591j1837Q128J1659n624k244j166l197
$$ -3631 812 4205 4003 9421 10528 4139 -7452 -19289 -11161 498 -5126 -7370 -8536 -11733
7007a1733M277n454Q722p506K111K654n923l406m492P086J2868K817J344k1493
$$ -11733 -7456 -12910 -4188 -11694 -9583 -6929 -12852 -16258 -20750 -13664 -796 2021 3365 -18128
6993a8128L351P188O390j0425K214K281n470O81l87j276j679M399P857l434j479
$$ -18128 -14777 -7589 -1199 -11624 -9410 -7129 -12599 -11918 -12305 -13581 -15260 -10861 -3004 -6438 -7917
6978g917O73n866r213L61j2468j3383N809J323N885M967l907P176L805J2271o996
$$ -7917 -7244 -13110 -22323 -21962 -34430 -47813 -42004 -40681 -34796 -29829 -33736 -26560 -22755 -10484 -17480
6963a7480j2400N146k085N676m032j8000J796J5511l026J1770O610J534N587J719
$$ -17480 -29880 -24734 -26819 -21143 -25175 -43175 -41379 -25868 -28894 -17124 -10514 -8980 -3393 -1674
6949a674k5763q722J8029J420k805o514R976J1066j23q378N954J0005Q53k540
$$ -1674 -27437 -36159 -18130 -16710 -19515 -26029 -16053 -4987 -5110 -13488 -7534 2471 3324 784
6935G84j0574j9l604k724m470L934J6303R136j3177j2198n569J1058k146n89J0893
$$ 784 -9790 -9809 -13413 -16137 -20607 -16673 -370 8766 -4411 -16609 -22178 -11120 -13266 -13855 -2962
6920b962p638j2779O187K850l113j848R106l03q716k2457k969J3196J832L539
$$ -2962 -10600 -23379 -17192 -14342 -17455 -19303 -10197 -10500 -19216 -41673 -44642 -31446 -29614 -26075
6906b6075Q992Q475J5579L021R524K523q453j0204j5369o79o463j129k913O537
$$ -26075 -17083 -8608 6971 9992 19516 22039 13586 3382 -11987 -12666 -19129 -20258 -23171 -16634
6892a6634J9340J4764N592p534m845K372l591m783r129j7596R008R792m742O098
$$ -16634 2706 17470 23062 15528 10683 13055 9464 4681 -4448 -22044 -13036 -3244 -7986 -1888
6878a888K3J351l275p474j0508O267L955r57l342l545K189P109J2828J154j578
$$ -1888 -1865 -514 -3789 -11263 -21771 -15504 -11549 -12506 -15848 -19393 -17204 -10095 2733 3887 2309
6863B309l835J129J941o750Q813R571n906j0957q902j1098p795O757R299Q234
$$ 2309 -1526 -397 1544 -5206 3607 13178 7272 -3685 -12587 -23685 -31480 -24723 -15424 -7190
6849g190K5406P886j3491J2366j5290l3705K788N391Q869Q65J3369j284j6576
$$ -7190 18216 26102 12611 24977 9687 -24018 -21230 -15839 -6970 -6105 7264 5980 -10596
6836a0596M095J1227o121j230K324j329k256K19O750q191R85J104j0855j238K899
$$ -10596 -6501 4726 -1395 -2625 -301 -1630 -3886 -3667 3083 -5108 -4123 -3019 -13874 -15112 -12213
6821a2213M877r513Q938k967n677K593j1083p854k600O210O841j40n973M057J9858
$$ -12213 -7336 -16849 -7911 -10878 -16555 -13962 -25045 -32899 -35499 -29289 -22448 -22588 -28561 -24504 -4646
6806d646Q726k284K84j0396j1815l766J809q855L214J2423J672r101j2869n890
$$ -4646 4080 1796 2080 -8316 -20131 -23897 -22088 -30943 -27729 -15306 -13634 -22735 -35604 -41494
6792d1494K3292J3711J3299n036q210J34q90k492r627j77M044K196j2698r29L442
$$ -41494 -18202 -4491 8808 3772 -4438 -4304 -5194 -7686 -17313 -17490 -13446 -11250 -23948 -24877 -21435
6777b1435J262N583Q90p110J801J925J1125J980n216j7252O209J2657K671J505
$$ -21435 -20173 -14590 -13700 -20810 -19009 -17084 -5959 -3979 -9195 -26447 -20238 -7581 -4910 -3405
6763c405m061q012K607K58L135l344K881o287o785m250L565R091P258k485j719
$$ -3405 -7466 -15478 -12871 -12613 -9478 -12822 -9941 -16228 -23013 -27263 -23698 -14607 -7349 -9834 -11553
6748a1553q152p213k510J1108J5629l967k604J300j720P061J963q367j103L880
$$ -11553 -19705 -26918 -29428 -18320 -2691 -6658 -9262 -7962 -9682 -2621 -658 -9025 -10128 -6248
6734f248r61Q988J0429j10q850j382r009j244m855J0327r655L480Q922k887K456
$$ -6248 -7209 1779 12208 12098 3248 1866 -7143 -8387 -13242 -2915 -12570 -9090 -168 -3055 -599
6719e99P560k026J0533O79j2575N14p404j3714J245J2651q351R343J2546l015
$$ -599 6961 4935 15468 16147 3572 4086 -3318 -17032 -15787 -3136 -11487 -2144 10402 7387
6705G387o581r435m40k7J5328J5956k84k179k575o096J328l503k854j8309o328
$$ 7387 806 -8629 -9069 -9096 6232 22188 21904 19725 17150 11054 12382 8879 6025 -12284 -18612
6690a8612N832P092K87m180j7307l551J2472L282j737J4691J4952L821r829J173
$$ -18612 -12780 -5688 -5401 -9581 -26888 -30439 -17967 -14685 -16422 -1731 13221 17042 7213 8386
6676H386j0398r01j4154j093M758R990q692K258J2540J0960l31r940j0236j3100
$$ 8386 -2012 -2913 -17067 -18160 -13402 -3412 -12104 -9846 2694 13654 13323 3383 -6853 -19953
6662a9953R992k273j3727N59K2197J8295J455q665k0387p645M283M707L262j7883
$$ -19953 -9961 -12234 -25961 -25402 -3205 15090 16545 7880 -12507 -20152 -15869 -11162 -7900 -25783
6648b5783M543O662j365J860k677O466O226L145j2646n542l362j1765J66J590
$$ -25783 -21240 -14578 -15943 -14083 -16760 -10294 -4068 -923 -13569 -19111 -22473 -34238 -34072 -32482
6634c2482Q691J2834m604n987J787N819m962M122rL225l877o561L473k178j439
$$ -32482 -23791 -10957 -15561 -21548 -19761 -13942 -18904 -14782 -14791 -11566 -15443 -22004 -18531 -20709 -22148
6619b2148J1515J1208K902k602r540p321J0207K625j1955K775p1j252K711q97
$$ -22148 -10633 575 3477 875 -8665 -15986 -5779 -3154 -15109 -12334 -12405 -13657 -10946 -11843
6605a1843j547N88J0801l839j8225p307K341J4976P842J140m468L839j0197p449
$$ -11843 -13390 -12802 -2001 -5840 -24065 -31372 -29031 -14055 -6213 -5073 -9541 -5702 -15899 -23348
6591b3348J5911P975N894r179J941p749j1964n074n302N263J5366J4354j0196
$$ -23348 -7437 538 6432 -2747 -806 -8555 -20519 -25593 -30895 -25632 -10266 4088 -6108
6578f108J957M252K85n788K665O687L657k4047l709J0092J518J0771k109j4957
$$ -6108 -4151 101 386 -5402 -2737 3950 7607 -16440 -20149 -10057 -8539 2232 123 -14834
6564a4834j345l666N176m165j2036O910J227o681n62k347P219j774O919K0168
$$ -14834 -16179 -19845 -14669 -18834 -30870 -23960 -22733 -29414 -29976 -32323 -25104 -26878 -19959 209
6550B09r38L77j238K585J1603n462l523O58J2577M521r029p188j0376N515n258
$$ 209 -729 -352 -1590 995 12598 7136 3613 4271 16848 21369 12340 5152 -5224 291 -4967
6535d967k869q58k769M889M080P009L000j4615n01N590R525M378j0985j641l620
$$ -4967 -7836 -8694 -11463 -6574 -2494 4515 7515 -7100 -7601 -2011 7514 11892 907 -734 -4354
6520d354r697r466P734J1977J74j0977J935J3483q777q181L480j3195O078J1299
$$ -4354 -14051 -23517 -15783 -3806 -3632 -14609 -12674 809 -7968 -16149 -12669 -25864 -19786 -8487
6506h487L909j7525r006k836K696N492J4576Q354j4083o0j2368M231O394P283
$$ -8487 -4578 -22103 -31109 -33945 -31249 -25757 -11181 -2827 -16910 -16970 -29338 -25107 -18713 -11430
6492a1430J498J1765J924J681k859N494L466K723j955q18Q020q18j2738j6586
$$ -11430 -9932 1833 3757 5438 2579 8073 11539 14262 12307 11489 19509 18691 5953 -10633
6478a0633N930M120j2659l137j1261P146L775o006J4514N470o093M88r765j1481
$$ -10633 -4703 -583 -13242 -16379 -27640 -20494 -16719 -22725 -8211 -2741 -8834 -8346 -18111 -29592
6464b9592J1729N024k667m981K295L6P988M679l599j0204n08P231N989j2374j4736
$$ -29592 -17863 -12839 -15506 -20487 -18192 -18156 -10168 -5489 -9088 -19292 -19800 -12569 -6580 -18954 -33690
6449c3690l828J986J0300n578R265P852j7624n521O05J0550Q480L024M815O336
$$ -33690 -37518 -35532 -25232 -30810 -21545 -13693 -31317 -36838 -36233 -25683 -17203 -14179 -9364 -3028
6435c028N086J4462l452O191m401j8255p921M098J085M639N56r040j72k1214N466
$$ -3028 2058 16520 13068 19259 14858 -3397 -11318 -7220 -6135 -1496 -940 -9980 -10152 -31366 -25900
6420b5900M917k320l055M713P942j505k229P110n57m250J010K143Q99j5840N860
$$ -25900 -20983 -23303 -26358 -21645 -13703 -15208 -17437 -10327 -10884 -15134 -14124 -11981 -11082 -26922 -21062
6405b1062l19M169P758o955k975q959K843J0540K015P53K892O76j0642j3083R707
$$ -21062 -21381 -17212 -9454 -16409 -19384 -28343 -25500 -14960 -12945 -12192 -9300 -8624 -19266 -32349 -22642
6390b2642J2338L190l670r48k722k985K453P673P029o372n993K964k180L490R433
$$ -22642 -10304 -7114 -10784 -11732 -14454 -17439 -14986 -7313 -284 -6656 -12649 -9685 -11865 -8375 1058
6375A058J0499k4943K357N980K296q371j837p315l564J8816k23j1989k706n534
$$ 1058 11557 -13386 -11029 -5049 -2753 -11124 -12961 -20276 -23840 -5024 -5247 -17236 -19942 -25476
6361b5476P506j2633n006Q577J2537L775J933K79j352n834k0734k972J5093L332
$$ -25476 -17970 -30603 -35609 -27032 -14495 -10720 -8787 -8508 -9860 -15694 -36428 -39400 -24307 -20975
6347b0975j3529N404O617J477M25M115J1544q80j0833N660o888m586k656J8797
$$ -20975 -34504 -29100 -22483 -21006 -20581 -16466 -4922 -5802 -16635 -10975 -17863 -22449 -25105 -6308
6333f308R56l040q954l912M520M232O943o786o169r182Q375J1132l714L467l093
$$ -6308 -5352 -8392 -17346 -21258 -16738 -12506 -5563 -12349 -18518 -27700 -19325 -8193 -11907 -8440 -11533
6318a1533N64j1542n689R583J2055j176P895k534q680o905M240k900j0489K263
$$ -11533 -10969 -22511 -28200 -18617 -6562 -7738 157 -2377 -11057 -17962 -13722 -16622 -27111 -24848
6304b4848P913K899N759j940n276J006P011P892n728m85j9030j4233k380N746
$$ -24848 -16935 -14036 -8277 -10217 -15493 -14487 -7476 416 -5312 -5797 -24827 -39060 -41440 -35694
6290c5694K2262J4333R333N200O530l367j8390p213N946j255j4097N926J051J751
$$ -35694 -13432 901 10234 15434 21964 18597 207 -7006 -1060 -2315 -16412 -10486 -9435 -7684
6276g684k457P450J0687n20r512j972J1446J0642J0754n800j0639j2471n611J902
$$ -7684 -10141 -2691 7996 7476 -2036 -4008 7438 18080 28834 23034 12395 -76 -5687 -3785
6262c785q922n026r27J0020j205J492Q738k190l110o011j0574L413N611o534n467
$$ -3785 -12707 -17733 -18660 -8640 -9845 -8353 385 -1805 -4915 -10926 -21500 -18087 -12476 -19010 -24477
6247b4477N725r359P539Q339j866l334m893L680J0632J72o622J0009L697O592
$$ -24477 -18752 -28111 -20572 -12233 -14099 -17433 -22326 -18646 -8014 -7842 -14464 -4455 -758 5834
6233E834j233q651q831o96j6234M68K0503P548J567O204N507n725k0746j4929
$$ 5834 4601 -4050 -12881 -13577 -29811 -29343 -8840 -1292 275 6479 11986 6261 -14485 -29414
6219b9414R309O248q23O614K0065l329k099J0112m374j5445Q00P321J460L955
$$ -29414 -20105 -13857 -14680 -8066 11999 8670 6571 16683 12309 -3136 -2336 4985 6445 10400
6205A0400L528l765K342j0149J658J1317O544j098O684Q44j5440r619j1085j109
$$ 10400 13928 10163 12505 2356 4014 15331 21875 20777 27461 28305 12865 3246 -7839 -8948
6191h948l746o736M067J0394N454R609k909m834k167O26M654R684J296k0231j8355
$$ -8948 -12694 -19430 -15363 -4969 485 10094 7185 2351 184 810 5464 15148 16444 -3787 -22142
6176b2142R31J5062J1670J920p936j2385J229l689P835J0800j3139j1829J6336
$$ -22142 -21211 -6149 5521 7441 -495 -12880 -11651 -15340 -7505 3295 -9844 -21673 -5337
6163e337J8730J6887q680q855L844J1315r793j3079o583k220o41J065Q746M426
$$ -5337 13393 30280 21600 12745 16589 27904 18111 5032 -1551 -3771 -4412 -3347 5399 9825
6149I825L336p060K384Q011p777j2539J4638J103k3247R502M272j705r913j1560
$$ 9825 13161 6101 8485 16496 8719 -3820 10818 11921 -11326 -1824 2448 743 -9170 -20730
6135b0730N011J641J547l607rJ380R448Q639p184o426p719J3704O475L248M873
$$ -20730 -15719 -14078 -12531 -16138 -16147 -14767 -5319 3320 -3864 -10290 -18009 -4305 2170 5418 10291
6120A0291O909N594j3214k7691M589M744m651j9444r386J5234J2003l73M614r794
$$ 10291 17200 22794 9580 -18111 -13522 -8778 -13429 -32873 -42259 -27025 -15022 -15395 -10781 -20575
6106b0575j4401Q225J5764q191j2584K043J3428Q681m034J1488J1322L897k850
$$ -20575 -34976 -26751 -10987 -19178 -31762 -29719 -16291 -7610 -11644 -156 11166 15063 12213
6093A2213j0558r205j9570j8643q235K3197J4520l800L996k251l423Q303l823
$$ 12213 1655 -7550 -27120 -45763 -53998 -30801 -16281 -20081 -16085 -18336 -21759 -13456 -17279
6080a7279j799N724J984M293J4126R48O172r783j8597o132J4208k180q387j771
$$ -17279 -19078 -13354 -11370 -7077 7049 7997 14169 4386 -14211 -20343 -6135 -8315 -16702 -18473
6066a8473J7401O838j1345M93k212J2896J0796j888j71k0827o55N623M048j2057
$$ -18473 -1072 5766 -5579 -5086 -7298 5598 16394 14506 14335 -6492 -7147 -1524 2524 -9533
6052i533O58j0805J029M623l560O857m386J0123L155q48o871J344K835m914M568
$$ -9533 -8875 -19680 -18651 -14028 -17588 -10731 -15117 -4994 -1839 -2687 -9558 -8214 -5379 -10293 -5725
6037e725M519J501J313J12j8053l898j402O947j294J9941K227o852M774m095q53
$$ -5725 -1206 295 1608 1720 -16333 -20231 -21633 -14686 -15980 3961 6188 -664 4110 15 -838
6022h38R97j062q413L993J3032Q922l675j094j0994j5207J984J109J1717o064
$$ -838 159 -903 -9316 -5323 7709 16631 12956 11862 868 -14339 -12355 -11246 471 -5593
6008e593j1503P960j1887J054J1069M093N737l097m62N115K466o433r586K26R2
$$ -5593 -17096 -9136 -21023 -19969 -8900 -4807 930 -2167 -2629 2486 4952 -1481 -11067 -10841 -10749
5993a0749n185N763J688o945K731J7606J3807k657m445m55r099Ll956J3621n403
$$ -10749 -15934 -10171 -8483 -15428 -12697 4909 18716 16059 11614 11159 2060 2063 -1893 11728 6325
5978F325j2234l693K993j2238q269J4349J2017Q12j0265K924k124L868N265k748
$$ 6325 -5909 -9602 -6609 -18847 -27116 -12767 -750 62 -10203 -7279 -9403 -5535 -270 -3018
5964c018J0562P699o649k746l155l357k924p57l513J0512n958M815J3719K088
$$ -3018 7544 15243 8594 5848 2693 -664 -3588 -4345 -7858 2654 -3304 1511 15230 17318
5950A7318j2274j038K984j5221o549J688k243N529J1050k333n375j8649J597L160
$$ 17318 5044 4006 6990 -8231 -14780 -13092 -15335 -9806 1244 -1089 -6464 -25113 -23516 -20356
5936b0356J200j108R575j402n601m82K974m945k18J1761R623r999P078R153j0458
$$ -20356 -19156 -20264 -10689 -12091 -17692 -18174 -15200 -20145 -20363 -8602 1021 -8978 -1900 7253 -3205
5921c205n192N971j582k958j3525n681J3352j498j009J0174o032j861J1790r475
$$ -3205 -8397 -2426 -4008 -6966 -20491 -26172 -12820 -14318 -15327 -5153 -11185 -13046 -1256 -10731
5907a0731k1372K089J6988K8707j001j9329N691M28k539n164m193K102O426j3624
$$ -10731 -32103 -30014 -13026 15681 14680 -4649 1042 1470 -1069 -6233 -10426 -8324 -1898 -15522
5893a5522l762K065P025n066l464J4289J948r82O129k050Q00q737r696o832J1333
$$ -15522 -19284 -17219 -10194 -15260 -18724 -4435 -2487 -3469 2660 610 1410 -7327 -17023 -23855 -12522
5878a2522O418O067J480K241L659j5420r551o41J1072J157q260n981O992J3764
$$ -12522 -6104 -37 1443 3684 7343 -8077 -17628 -18269 -7197 -6040 -14300 -20281 -13289 475
5864D75k588R907p219o740l31j1849m236J1761O379l660L395r450m832J640R906
$$ 475 -2113 7794 575 -6165 -6496 -18345 -22581 -10820 -4441 -8101 -4706 -14156 -18988 -17348 -7442
5849g442N683j2341J675Q228q357m67P52R225R310J209j956o937o916k376N712
$$ -7442 -1759 -14100 -12425 -4197 -12554 -13021 -12269 -3044 6266 7475 5519 -1418 -8334 -10710 -4998
5834d998M310k574N465N33r259o002l752L313Q349O222M815On907k792O905O615
$$ -4998 -688 -3262 2203 2736 -6523 -12525 -16277 -12964 -4615 1607 6422 6428 521 -2271 4634 11249
5818A1249j1095J776P128P949l490r905J783k114O42K844L339M588N230n259r381
$$ 11249 154 1930 9058 17007 13517 3612 5395 3281 3923 6767 10106 14694 19924 14665 5284
5803E284p626K7864j3913j6305j794R896L314o005M747J3031n641r728j7690j2496
$$ 5284 -2342 25522 11609 -4696 -6490 3406 6720 715 5462 18493 12852 3124 -14566 -27062
5789b7062l313K116J3449J0628J031K170o40o340m330j2999m890N403O993J2856
$$ -27062 -30375 -28259 -14810 -4182 -3151 -981 -1621 -7961 -12291 -25290 -30180 -24777 -17784 -4928
5775d928p949m141p16J9907k533o458j5213n498J4635P605N334O378n128q590
$$ -4928 -12877 -17018 -17734 2173 -360 -6818 -22031 -27529 -12894 -5289 45 6423 1295 -7295
5761g295P389j564n213m72J714m970K571J397j0548q021J258K3982r63O968j0542
$$ -7295 94 -1470 -6683 -7155 -5441 -10411 -7840 -6443 -16991 -25012 -23754 228 -735 6233 -4309
5746d309k358K394P36l195o291M708j0143r235K166P914O35n713l726J748J0627
$$ -4309 -6667 -4273 -3537 -6732 -13023 -8315 -18458 -27693 -25527 -17613 -16978 -22691 -26417 -24669 -14042
5731a4042p716j5496o832J0434J3785J0938M508P308q375m08P741r46j0947n177
$$ -14042 -21758 -37254 -44086 -33652 -19867 -8929 -4421 2887 -5488 -5896 1845 899 -10048 -15225
5717a5225Q260L9j0665K002j0471R897P743P395n079O436M260P43j9036j3800
$$ -15225 -6965 -6926 -17591 -15589 -26060 -16163 -8420 -1025 -6104 332 4592 5335 -13701 -27501
5703b7501k261j1587L438J6403J0679P170k100J1946N896j689n486p952Q395J939
$$ -27501 -29762 -41349 -37911 -21508 -10829 -3659 -5759 6187 12083 10394 4908 -3044 5351 7290
5689G290L942m488l160q817p249J1396M087j5824L650K736J9355K358j2811j0658
$$ 7290 11232 6744 3584 -5233 -12482 -1086 3001 -12823 -9173 -6437 12918 15276 2465 -8193
5675h193r034r844R891J7853L354j2713j1644j1535L575j120J4090l52j6358j0876
$$ -8193 -17227 -27071 -17180 673 4027 -8686 -20330 -31865 -28290 -29410 -15320 -15672 -32030 -42906
5661d2906L651J4231J9887J2693P669K601j827l821j1487j3916l062r751m827
$$ -42906 -39255 -25024 -5137 7556 15225 17826 15999 12178 691 -13225 -16287 -26038 -30865
5648c0865J6156J0653k386l66k252m14O302L810M934R70M726q787j2073L959j0366
$$ -30865 -14709 -4056 -6442 -6808 -9060 -9474 -3172 638 5572 6542 11268 2481 -9592 -5633 -15999
5633a5999N430N295J1180r99J589R547o178m569o046l257r263j2532J2092p61
$$ -15999 -10569 -5274 5906 4907 6496 16043 9865 5296 -750 -4007 -13270 -25802 -13710 -14471
5619a4471R135m436j1309o220k199J1835N020N37J5774l910j5150m874J24M380
$$ -14471 -5336 -9772 -21081 -27301 -29500 -17665 -12645 -12108 3666 -244 -15394 -20268 -20144 -15764
5605a5764R307N144k189n019j0378R412J2823j4350Q356R37J2324J537q507L797
$$ -15764 -6457 -1313 -3502 -8521 -18899 -9487 3336 -11014 -2658 -1721 10603 12140 3633 7430
5591G430p283j83j557j7939j094J9140J2948j2018n143M140j0762n417R300J839
$$ 7430 147 -36 -1593 -19532 -20626 -1486 11462 -556 -5699 -1559 -12321 -17738 -8438 -6599
5577f599q676n214J3628K7067l276o583j3621R87j696J146P628M859j3389j6017
$$ -6599 -15275 -20489 -6861 20206 16930 10347 -3274 -2287 -3983 -2837 4791 9650 -3739 -19756
5563a9756p002l939J2648J885K291q85R530J030K619N803m797k385Q826O849j3453
$$ -19756 -26758 -30697 -18049 -16164 -13873 -14758 -5228 -4198 -1579 4224 -573 -2958 5868 12717 -736
5548g36n423q588P598J2607q253M90L544m726q813n352l409J4648P898p10P041
$$ -736 -6159 -14747 -7149 5458 -2795 -2305 1239 -3487 -12300 -17652 -21061 -6413 1485 775 7816
5533G816Q5q546r018l29j986o669O579J1390j504K736J7965l049q267L222n447
$$ 7816 7901 -645 -9663 -9992 -11978 -18647 -12068 -678 -2182 554 18519 15470 7203 10425 4978
5518D978j2868J447l550J638m585o69J399L902J1349N726m448k949j1184J1593
$$ 4978 -7890 -6443 -9993 -8355 -12940 -13609 -12210 -8308 3041 8767 4319 1370 -9814 1779
5504A779R470J900k436p22q144j7171L049J3808K942l966P166q40r493Q862o990
$$ 1779 11249 13149 10713 9991 1847 -15324 -12275 1533 4475 509 7675 6835 -2658 6204 -786
5489g86q232L980j6838k0432P5K0792J3321Q782l474P10J2135J3269O307j0026
$$ -786 -9018 -5038 -21876 -42308 -42233 -21441 -8120 662 -2812 -2102 10033 23302 29609 19583
5475A9583k4349J377J1593R182K153k766J2636l315k429j2520j0995l443l669
$$ 19583 -4766 -3389 8204 17386 19539 16773 29409 26094 23665 11145 150 -3293 -6962
5462f962O16P683r237j1805J0219R748O289q012j2464j5807Q138M355J9361k29
$$ -6962 -6346 1337 -7900 -19705 -9486 262 6551 -1461 -13925 -29732 -21594 -17239 2122 1893
5448A893p072j568K863j0569m1J6718R100k288j0337O313n434n805J744M287l902
$$ 1893 -5179 -6747 -3884 -14453 -14494 2224 11324 9036 -1301 5012 -422 -6227 -4483 -196 -4098
5433d098P6r96L885L253k273N323P262j2148j3854n16J699J4328J0250j2053j9469
$$ -4098 -4022 -5018 -1133 2120 -153 5170 12432 284 -13570 -14086 -12387 1941 12191 138 -19331
5418a9331J8072J3809j1900r450j112O77L518M234J4165J001m974L689n643j3096
$$ -19331 -1259 12550 650 -8800 -9912 -9235 -5717 -1483 12682 13683 8709 12398 6755 -6341
5404f341m719J3309N451L228j2182p64K057P165l199m961o298J214O578q317J082
$$ -6341 -11060 2249 7700 10928 -1254 -2018 39 7204 4005 -956 -7254 -6040 538 -7779 -6697
5389f697N087n69j6269M325K3455J0695r3p79k672M35j425l078q216M379K564
$$ -6697 -1610 -2179 -18448 -14123 9332 20027 19934 19155 16483 16918 15493 12415 4199 8578 11142
5374A1142q233j7958q555K157J0227k502P147N954L898K232J1664l28r854j8910
$$ 11142 2909 -15049 -23604 -21447 -11220 -13722 -6575 -621 3277 5509 17173 16845 6991 -11919
5360a1919n607N449J0445l023p222r736l360K078r000M679n056k085J1735J1975
$$ -11919 -17526 -12077 -1632 -4655 -11877 -21613 -24973 -22895 -31895 -27216 -32272 -34357 -22622 -10647
5346a0647J6366J0241r869j5794q146J1755J9561Q317r548j0775r237J638k996
$$ -10647 5719 15960 6091 -9703 -17849 -6094 13467 21784 12236 1461 -7776 -6138 -9134
5333i134j0845k937J3567J630J417J115o873N52j810l128J4247O778o907J9541
$$ -9134 -19979 -22916 -9349 -7719 -6302 -5187 -12060 -11508 -13318 -16446 -2199 4579 -2328 17213
5319A7213O924q528j1651l042p144p180K342N577j837N247q414j569K282n331
$$ 17213 24137 15609 3958 916 -6228 -13408 -11066 -5489 -7326 -2079 -10493 -12062 -9780 -15111
5305a5111r80K549Q247J9667R140j0584J630Q789j635j6771j5538r601L600J6782
$$ -15111 -16091 -13542 -5295 14372 23512 12928 14558 23347 21712 4941 -10597 -20198 -16598 184
5291A84M037L705m486L400K093p005P131M179j0632j889J4280O720j6997q125
$$ 184 4221 7926 3440 6840 8933 1928 9059 13238 2606 717 14997 21717 4720 -3405
5277c405O172j0124K21O71R341Q540j0995k801j017p812r098j791R549J6729J302
$$ -3405 2767 -7357 -7136 -6465 2876 11416 421 -2380 -3397 -11209 -20307 -22098 -12549 4180 5482
5262E482N468N875o56k013M364Ok763O2j4635j848N063N893m788p524n115k886
$$ 5482 10950 16825 16169 14156 18520 18526 15763 15825 1190 -658 4405 10298 5510 -2014 -7129 -10015
5246a0015m81O405N230J1383K149J2287j6851o439N549P44l199J1346J5024k560
$$ -10015 -10496 -4091 1139 12522 14671 26958 10107 3668 9217 9961 6762 18108 33132 30572
5232C0572n995j3991j7514l755o846o223j631P738j181q051R475J4688k350r735
$$ 30572 24577 10586 -6928 -10683 -17529 -23752 -25383 -17645 -18826 -26877 -17402 -2714 -5064 -14799
5218a4799J2799P361j3349R926Q559M902R66j9675j6093Q706N584J32O948N033
$$ -14799 -2000 5361 -7988 1938 10497 15399 16365 -3310 -19403 -10697 -5113 -4981 1967 7000
5204G000j422L252J2085j259o18r864q69J282m291P894l966n349o569l004K764
$$ 7000 5578 8830 20915 19656 19038 9174 8305 9587 5296 13190 9224 3875 -2694 -5698 -2934
5189b934l844K763R974k950n248n079l826J2839j0081k983O106n118J4512K1607
$$ -2934 -6778 -4015 5959 3009 -2239 -7318 -11144 1695 -8386 -11369 -5263 -10381 4131 25738
5175B5738L616j5582N97J2985k054j9699j1589q616M097K730j659j676L114o411
$$ 25738 29354 13772 14369 27354 25300 5601 -5988 -14604 -10507 -7777 -9436 -11112 -7998 -14409
5161a4409L611M860l907k950k259R861J3346k507j2503R971Q711J56j1704Q368
$$ -14409 -10798 -5938 -9845 -12795 -15054 -5193 8153 5646 -6857 3114 11825 11981 277 8645
5147H645L633j2039p396Q185N55r35r272J5065P757o407L853K171n729O664l981
$$ 8645 12278 239 -7157 1028 1583 648 -8624 6441 14198 7791 11644 13815 8086 14750 10769
5132A0769N18q324j1040n72J559L525J908O974J9012o348k3903j1442o969J3336
$$ 10769 11287 2963 -8077 -8649 -7090 -3565 -1657 5317 24329 17981 -5922 -17364 -24333 -10997
5118a0997R758j3341q09J1354J273L699m211q00j130K687J9020M880j1374K100
$$ -10997 -1239 -14580 -15389 -4035 -2762 937 -3274 -4074 -5204 -2517 16503 21383 10009 12109
5104A2109m849k734j623m341M888O111j8355K511L994j544k23k670j771m575L687
$$ 12109 7260 4526 2903 -1438 3450 9561 -8794 -6283 -2289 -3833 -4056 -6726 -8497 -13072 -9385
5089i385o134P418j415j5517o110N910K1744N124j4476k168J6554o65j6757J576
$$ -9385 -15519 -8101 -9516 -25033 -31143 -25233 -3489 1635 -12841 -15009 1545 880 -15877 -14301
5075a4301J4901q885j0121k925o18Q708J1309J8375J723j1027n780m710J424l009
$$ -14301 600 -8285 -18406 -21331 -21949 -13241 -1932 16443 18166 7139 1359 -3351 -1927 -4936
5061d936l657l339J2655M787J546q756O56m944J2412N039O18m704O371J2474p711
$$ -4936 -8593 -11932 723 5510 7056 -1700 -1044 -5988 6424 11463 12081 7377 13748 26222 18511
5046A8511j1395j3836q008K137o76p65J5639J5426M739k251q534o602K1597J7809
$$ 18511 7116 -6720 -14728 -12591 -13267 -14032 1607 17033 21772 19521 10987 4385 25982 43791
5032D3791j3684j0280R07j985r477P078J6974j534j9222j714Q620j154p253q538
$$ 43791 30107 19827 20734 18749 9272 16350 33324 31790 12568 10854 19474 18320 11067 2529
5018B529j5083L815J0932Q287J4046j326m491m032q252O539Q305j648l178j2281
$$ 2529 -12554 -8739 2193 10480 24526 23200 18709 14677 6425 12964 21269 19621 16443 4162
5004D162K796K673L173j3810N93K246k004J5K118R18O701J0710j890j0672m475
$$ 4162 6958 9631 12804 -1006 -413 1833 -171 -156 1962 2880 9581 20291 18401 7729 3254
4989C254m567M505M856K622P59Q8k918k758J061Q450O854O138j0499M690k407
$$ 3254 -1313 3192 8048 10670 11429 11517 8599 5841 6902 15352 22206 28344 17845 22535 20128
4974B0128q933k593k5667p505R027J1505K333L315o045Q308J0208J592R459o118
$$ 20128 11195 8602 -17065 -24570 -15543 -4038 -1705 1610 -4435 3873 14081 15673 25132 19014
4960A9014o49j1301m933M226J648j0291j3697L171K096J5355M999j3486q73L415
$$ 19014 18365 7064 2131 6357 8005 -2286 -15983 -12812 -10716 4639 9638 -3848 -4721 -1306
4946a306J5271j212O23j3398p933m630J4447N129m255r622l963o539N405L333
$$ -1306 13965 12753 13376 -22 -7955 -12585 1862 6991 2736 -6886 -10849 -17388 -11983 -8650
4932h650J0522j116P003k70p030L6P498j013q333J849R190M795l351P64r434O050
$$ -8650 1872 756 7759 7489 459 495 7993 6980 -1353 496 9686 14481 11130 11894 2460 8510
4916H510l98j5383j1413q78k529K626J4725R89n014J506m69j0419k532J330N734
$$ 8510 8112 -7271 -18684 -19562 -22091 -19465 -4740 -3751 -8765 -7259 -7728 -18147 -20679 -19349 -13615
4901a3615O91M147L950O72K31J696L837J187q413o456L321o151j7511R952J6217
$$ -13615 -12924 -8777 -4827 -4155 -3924 -2228 1609 2796 -5617 -12073 -8752 -14903 -32414 -22462 -6245
4886f245J5018J0891Q534o210m277k314j5738o35K3648J0356r421p742N549K960
$$ -6245 8773 19664 28198 21988 17711 15397 -341 -976 22672 33028 23607 15865 21414 24374
4872B4374n662j437k005p893o696j0995j009J3728L658p964j700r31K727J9057
$$ 24374 18712 17275 15270 7377 681 -10314 -11323 2405 6063 -1901 -3601 -4532 -1805 17252
4858A7252q542l43j241j0010k0764j836P534N743k687J8386R590M28j3215j1473
$$ 17252 8710 8367 7126 -2884 -23648 -25484 -17950 -12207 -14894 3492 13082 13510 295 -11178
4844a1178n56L234L339K390L297N541r174m258m602K607J858l03m138k623N246
$$ -11178 -11734 -8500 -5161 -2771 526 6067 -3107 -7365 -11967 -9360 -7502 -7805 -11943 -14566 -9320
4829i320Q794j1674n569q772l088M804P157p444m127O898Q237k492O18n074J1988
$$ -9320 -526 -12200 -17769 -26541 -29629 -24825 -17668 -25112 -29239 -22341 -14104 -16596 -15978 -21052 -9064
4814i064R88j6820J3557J0182J985q343k999O445R734N267M583n306j1634o246
$$ -9064 -8076 -24896 -11339 -1157 828 -7515 -10514 -4069 5665 10932 15515 10209 -1425 -7671
4800g671n70l049J2798J2937K913j57o578m662P030p275j3481R053k195j6021
$$ -7671 -8241 -11290 1508 14445 17358 17201 10623 5961 12991 5716 -7765 1288 -907 -16928
4786a6928J314J6263j42O529p130r366J1460J0528o583n974m844j2813j9204J6163
$$ -16928 -15614 649 507 7036 -94 -9460 2000 12528 5945 -29 -4873 -17686 -36890 -20727
4772b0727K0417j528J0946j560j5688l51P168r12j3823j776J8677J6839k525m252
$$ -20727 -310 -1838 9108 7548 -8140 -8491 -1323 -2235 -16058 -17834 843 17682 15157 10905
4758A0905N176j625R767K45p681k554p221M00L49M255j7693q912M623p537n919
$$ 10905 16081 14456 24223 24468 16787 14233 7012 7412 7761 12016 -5677 -14589 -9966 -17503 -23422
4743b3422Q92J241J892Q066O845o296K425m909N447J5727j0147j4469j0374J6322
$$ -23422 -22530 -21289 -19397 -11331 -4486 -10782 -8357 -13266 -7819 7908 -2239 -16708 -27082 -10760
4729a0760K322j080k947k592q809J2496j282j6688M637L747p83P452Q70M984J3847
$$ -10760 -8438 -9518 -12465 -15057 -23866 -11370 -12652 -29340 -24703 -20956 -21739 -14287 -13417 -8433 5414
4714E414N219r278k995Q050N611K659j1816O763M310J5532J1738j0778r264j418
$$ 5414 10633 1355 -1640 6410 12021 14680 2864 9627 13937 29469 41207 30429 21165 19747
4700A9747j9780j5083J0774o556p676n787K0532l32j922J4556J1490N218j0715
$$ 19747 -33 -15116 -4342 -10898 -18574 -24361 -3829 -4161 -6083 8473 19963 25181 14466
4687A4466j5776j00l597K612n349n561k326m142R740o523M170O252J3574j2700
$$ 14466 -1310 -1410 -5007 -2395 -7744 -13305 -15631 -19773 -10033 -16556 -12386 -6134 7440 -5260
4673e260r119J3671M689j2192P302M61j631J1619j388L239p705q230J2756j804
$$ -5260 -14379 -708 3981 -8211 -909 -448 -2079 9540 8152 11391 3686 -4544 8212 6408
4659F408K846j0151j3926K1063p898r467n929Q731J2073l696K52N429n918j877
$$ 6408 9254 -897 -14823 6240 -1658 -11125 -17054 -8323 3750 54 306 5735 -183 -2060
4645b060J0423P5n291L458r793p747J3225J4019J690K431p670l306K0469J2948
$$ -2060 8363 8438 3147 6605 -3188 -10935 2290 16309 17999 20430 12760 9454 29923 42871
4631D2871k1407j2994J0243O380j3829N738o54m364o421J81j585l309O81j2835
$$ 42871 21464 8470 18713 25093 11264 17002 16348 11984 5563 5744 4159 850 1531 -11304
4617a1304M63J2977o118J2662L556J1957p005j1588J1709L187q386j301j0428
$$ -11304 -10841 2136 -3982 8680 12236 24193 17188 5600 17309 20496 12110 10809 381
4604C81j5438q550o571L456P387J5212O997L197L48J858j0674q670J896l820M976
$$ 381 -15057 -23607 -30178 -26722 -19335 -4123 2874 6071 6419 8277 -2397 -11067 -9171 -12991 -8015
4589h015L522n216K163l528p012L143J1850q723n137Q184Q373J3842q459j6750
$$ -8015 -4493 -9709 -7546 -11074 -18086 -14943 -3093 -11816 -16953 -8769 -396 13446 4987 -11763
4575a1763n548L41J6174O432j1395j053K280Q205o642n704M264M557M637j59K1288
$$ -11763 -17311 -16970 -796 5636 -5759 -6812 -4532 3673 -2969 -8673 -4409 148 4785 4626 25914
4560B5914p979j1706o519j1073N518J9754O867j3688l54M87m963J2120m701r403
$$ 25914 17935 6229 -290 -11363 -5845 13909 20776 7088 6734 7221 2258 14378 9677 274
4546B74p112m183n959R221Q26P521L036j4223K964J4234N194K044j0813J663k084
$$ 274 -6838 -11021 -16980 -7759 -6933 588 3624 -10599 -7635 6599 11793 13837 3024 4687 2603
4531B603k870J0275L417J2331m378o540r979j3571m358j167P157n838r787N055
$$ 2603 -267 10008 13425 25756 21378 14838 4859 -8712 -13070 -14237 -7080 -12918 -22705 -17650
4517a7650J2543k457K560m641M491J4902j0374j1300J814R460R478l109m776L588
$$ -17650 -5107 -7564 -5004 -9645 -5154 9748 -626 -11926 -10112 -652 8826 5717 941 4529
4503D529K752K568q094j0045m858j3473n360q013P745J4542J9362M042J172l345
$$ 4529 7281 9849 1755 -8290 -13148 -26621 -31981 -39994 -32249 -17707 1655 5697 6869 3524
4489C524n157L202L183j720p25l323M709L80j177p462j0117L693l237M889J4238
$$ 3524 -1633 1569 4752 3032 2307 -1016 3693 4073 2896 -4566 -14683 -10990 -14227 -9338 4900
4474D900k636o117j1571p308J7532J7024O541N054m085j2394r377l580N956k390
$$ 4900 2264 -3853 -15424 -22732 -5200 11824 18365 23419 19334 6940 -2437 -6017 -61 -2451
4460b451M8J0303O477k392j712k0734N663J9302o894p624O374j087k625m032M074
$$ -2451 -2403 7900 14377 11985 10273 -10461 -4798 14504 7610 -14 6360 5273 2648 -1384 2690
4445B690q951K193K639J0024q512j0712J2150J5466r700N12n566o777m46n389
$$ 2690 -6261 -4068 -1429 8595 83 -10629 1521 16987 7287 7799 2233 -4544 -4990 -10379
4431a0379k686m884Q886K983Q605J1039k423k2367K045J5039Q113q857R18m628
$$ -10379 -13065 -17949 -9063 -6080 2525 13564 11141 -11226 -9181 5858 13971 5114 6032 1404
4417A404p70M12R887o626n332q742M385r268N320o77M475J103j519J353J0075
$$ 1404 634 1046 10933 4307 -1025 -9767 -5382 -14650 -9330 -10007 -5532 -4429 -5948 -4595 5480
4402E480o271m51J4807M234J0438L421j4989k527P072n554J524L71l727P327K068
$$ 5480 -791 -1242 13565 17799 28237 31658 16669 14142 21214 15660 17184 17555 13828 21155 23223
4387B3223j5096k2874p494k095J6139l217J288J9019J7356j289q961R650k611
$$ 23223 8127 -14747 -22241 -24336 -8197 -11414 -10126 8893 26249 24960 15999 25649 23038
4374B3038j7480L137j1587l039M720P412O164J5192J5104j1355j5708n740m211
$$ 23038 5558 8695 -2892 -5931 -1211 6201 12365 27557 42661 31306 15598 9858 5647
4361E647J3178R947n642r632k2767l213K604M761K644l781o596P301O092l205
$$ 5647 18825 28772 23130 13498 -9269 -12482 -9878 -5117 -2473 -6254 -12850 -5549 543 -2662
4347b662n293p294K71j2857K378J6666J8012o906J633Q356j5636l608Q616M182
$$ -2662 -7955 -15249 -14978 -27835 -25457 -8791 9221 2315 3948 12304 -3332 -6940 1676 5858
4333E858M892R221k856R45o580L624j1305q547o300P36R811N151j2422L041J7007
$$ 5858 10750 19971 17115 18060 11480 15104 3799 -4748 -11048 -10312 -501 4650 -7772 -4731 12276
4318A2276J1562n486j2009k663m116M227J141J888o460p283P920R162l605J1690
$$ 12276 23838 18352 6343 3680 -436 3791 4932 6820 360 -6923 997 10159 6554 18244
4304A8244j306n374J195K429r053J0810O83o037k724l322K451K649J906P846j6191
$$ 18244 16938 11564 12759 15188 6135 16945 17628 11591 8867 5545 7996 10645 12551 20397 4206
4289D206n940q322q884J172J0093k016l186O245k033k075J0909N238L402R010
$$ 4206 -1734 -10056 -18940 -17768 -7675 -9691 -12877 -6632 -8665 -10740 169 5407 8809 17819
4275A7819l184J178l497j9271J855M720R321R950r705q028l003K307o363O39P160
$$ 17819 14635 15813 12316 -6955 -5100 -380 8941 18891 9186 1158 -1845 462 -5901 -5262 1898
4260A898M410m539K388p53K568r453p141J270K714J788Q166O583l411q165R931
$$ 1898 6308 1769 4157 3404 5972 -3481 -10622 -9352 -6638 -4850 3316 9899 6488 -1677 8254
4245H254L977j0576n424P045Q473J279l680j0576j2910j382n734J8878K2396o86
$$ 8254 12231 1655 -3769 3276 11749 13028 9348 -1228 -14138 -15520 -21254 -2376 20020 19334
4231A9334l218L362r284n292r028J275J4448J2640J819j4031k2008L151k896j4669
$$ 19334 16116 19478 10194 4902 -4126 -2851 11597 24237 26056 12025 -9983 -6832 -9728 -24397
4217b4397P772J5441M914O657R78l434r647o339L053k193p913J0929k880J482
$$ -24397 -16625 -1184 3730 10387 11365 7931 -1716 -8055 -5002 -7195 -15108 -4179 -7059 -5577
4203e577R567m738j1076K167M878K149j1390j2042O353J8078k33l895p903K359
$$ -5577 3990 -748 -11824 -9657 -4779 -2630 -14020 -26062 -19709 -1631 -1864 -5759 -13662 -11303
4189a1303m235J666k129J6133J1335R036n237l248j389p503J1244O470P30l308
$$ -11303 -15538 -13872 -16001 132 11467 20503 15266 12018 10629 3126 14370 20840 21570 18262
4175A8262j0286m179q249l026N290q333M61Q992L632o372q23Q299m28p243L98
$$ 18262 7976 3797 -4452 -7478 -2188 -10521 -10060 -1068 2564 -3808 -4631 3668 3240 -4003 -3605
4160c605j106m772o252j99k389O982J4196q117j1338M67J8490l204m903L199j653
$$ -3605 -4711 -9483 -15735 -15934 -18323 -11341 2855 -5262 -16600 -16133 2357 -847 -5750 -2551 -4204
4145d204N993q96r914O434J8556j2398L558P636n988r435K945J744K411L699L974
$$ -4204 1789 893 -9021 -2587 15969 3571 7129 14765 8777 -658 2287 4031 6442 10141 14115
4130A4115p567l329p161q149m715p34n061Q39l27j291j290q057p96J339R400r19
$$ 14115 6548 3219 -3942 -12091 -16806 -17540 -22601 -21762 -22089 -23380 -24670 -32727 -33523 -32184 -22784 -23703
4114b3703P446R50o41J940J0067p493J4521L457o644N083O069K464m530J885J379
$$ -23703 -16257 -15307 -15948 -14008 -3941 -11434 3087 6544 -100 4983 11052 13516 8986 10871 12250
$$ [...]
##END NTUPLES=NMR SPECTRUM
##END=
