##TITLE=Analysis number 319504
Compound Code cc 53705
Book Reference 458/120
Project Code adrs
Chemist Name stevem
##JCAMPDX= 6.0         $$ Bruker NMR JCAMP-DX V2.0
##DATA TYPE= NMR SPECTRUM
##DATA CLASS= NTUPLES
##ORIGIN= Bruker BioSpin GmbH
##OWNER= nmr
$$ XWIN-NMR		Version 3.5
$$ Wed May 17 11:41:35 2006 GMT Daylight Time (UT+1h)  MAYBRIDGE\nmr@NMR_250MHZ
##.OBSERVE FREQUENCY= 250.131544655141
##.OBSERVE NUCLEUS= ^1H
##.ACQUISITION MODE= SIMULTANEOUS (DQD)
##.ACQUISITION SCHEME= undefined
##.AVERAGES= 16
##.DIGITISER RES= 18
##SPECTROMETER/DATA SYSTEM= dpx250
##.PULSE SEQUENCE= zg30
##.SOLVENT NAME= CDCl3
##.SHIFT REFERENCE= (INTERNAL, CDCl3, 0, 16.522)
##AUDIT TRAIL= $$ (NUMBER, WHEN, WHO, WHERE, WHAT)
$$ ##TITLE= Audit trail, XWIN-NMR		Version 3.5
$$ ##JCAMPDX= 5.01
$$ ##ORIGIN= Bruker BioSpin GmbH
$$ ##OWNER= nmr
$$ C:\u/data/dgb/nmr/ADRS/4600/pdata/1/auditp.txt
$$ ##AUDIT TRAIL=  $$ (NUMBER, WHEN, WHO, WHERE, WHAT)
(   1,<2006-05-17 11:40:53.73 +100>,<MAYBRIDGE\nmr>,<NMR_250MHZ>,
      <created by zg, POWCHK disabled, PULCHK disabled
       configuration hash MD5:
       84 BC 41 DB A1 6E 1D 46 DA 25 12 A5 C1 ED C5 3A
       data hash MD5: 64K
       A4 E4 12 35 EE 95 58 30 0D D2 45 08 4D 79 A9 28>)
(   2,<2006-05-17 11:41:14.42 +100>,<MAYBRIDGE\nmr>,<NMR_250MHZ>,
      <Start of raw data processing
       ef LB = 0.3 FT_mod = 6 PKNL = 1 SI = 32K 
       data hash MD5: 32K
       D8 FA 53 D8 92 D9 30 98 91 59 2D D8 A6 53 32 6D>)
(   3,<2006-05-17 11:41:18.74 +100>,<MAYBRIDGE\nmr>,<NMR_250MHZ>,
      <apk 
       data hash MD5: 32K
       D3 1B E5 01 29 A2 D8 3B 57 4C A7 B2 7F 6A 07 A6>)
(   4,<2006-05-17 11:41:20.52 +100>,<MAYBRIDGE\nmr>,<NMR_250MHZ>,
      <abs ABSG = 5 
       data hash MD5: 32K
       80 C2 03 28 86 0F 86 3D 45 D9 FD E0 58 60 4E CB>)
$$ ##END=
$$ 
$$ hash MD5
$$ D0 A3 63 7F 22 82 06 54 B8 41 0F 46 25 FF E0 B3
##$RELAX= 
##$RELAX= 
##$RELAX= 
##$RELAX= 
##$RELAX= 
##$RELAX= 
##$RELAX= 
$$ Bruker specific parameters
$$ --------------------------
##$DU= <C:\u>
##$EXPNO= 4600
##$NAME= <ADRS>
##$PROCNO= 1
##$TYPE= <nmr>
##$USER= <dgb>
##$AMP= (0..31)
100 100 100 100 100 100 100 100 100 100 100 100 100 100 100 100 100 100 
100 100 100 100 100 100 100 100 100 100 100 100 100 100 
##$AQSEQ= 0
##$AQ_mod= 3
##$AUNM= <au_zg>
##$AUTOPOS= <20 >
##$BF1= 250.13
##$BF2= 250.13
##$BF3= 250.13
##$BF4= 250.13
##$BF5= 500.13
##$BF6= 500.13
##$BF7= 500.13
##$BF8= 500.13
##$BYTORDA= 1
##$CFDGTYP= 0
##$CFRGTYP= 5
##$CHEMSTR= <none>
##$CNST= (0..31)
1 1 145 1 1 1 1 1 1 1 1 1 1 1 1 1 1 1 1 1 1 1 1 1 1 1 1 1 1 1 1 1 
##$CPDPRG= <>
##$CPDPRG1= <>
##$CPDPRG2= <>
##$CPDPRG3= <>
##$CPDPRG4= <mlev>
##$CPDPRG5= <mlev>
##$CPDPRG6= <mlev>
##$CPDPRG7= <mlev>
##$CPDPRG8= <mlev>
##$CPDPRGB= <>
##$CPDPRGT= <>
##$D= (0..31)
0 1 0 0 0 0 0 0 0 0.06 0 0 0 0 0 0 0.0002 0 0 0 0 0 0 0 0 0 0 0 0 0 0 
0 
##$DATE= 1147862451
##$DBL= (0..7)
120 120 120 120 120 120 120 120 
##$DBP= (0..7)
150 150 150 150 150 150 150 150 
##$DBP07= 0
##$DBPNAM0= <>
##$DBPNAM1= <>
$$ [...]
##$SUBNAM7= <"">
##$SUBNAM8= <"">
##$SUBNAM9= <"">
##$SW= 20.6930455092707
##$SWIBOX= (0..15)
0 0 3 0 0 0 0 0 0 0 0 0 0 0 0 0 
##$SW_h= 5175.983436853
##$TD= 65536
##$TD0= 1
##$TE= 295.16
##$TE2= 300
##$TE3= 300
##$TEG= 300
##$TL= (0..7)
0 120 120 120 120 120 120 120 
##$TP= (0..7)
150 150 150 150 150 150 150 150 
##$TP07= 0
##$TPNAME0= <>
##$TPNAME1= <>
##$TPNAME2= <>
##$TPNAME3= <>
##$TPNAME4= <>
##$TPNAME5= <>
##$TPNAME6= <>
##$TPNAME7= <>
##$TPOAL= (0..7)
0.5 0.5 0.5 0.5 0.5 0.5 0.5 0.5 
##$TPOFFS= (0..7)
0 0 0 0 0 0 0 0 
##$TUNHIN= 0
##$TUNHOUT= 0
##$TUNXOUT= 0
##$USERA1= <user>
##$USERA2= <user>
##$USERA3= <user>
##$USERA4= <user>
##$USERA5= <user>
##$V9= 5
##$VALIST= <valist>
##$VCLIST= <CCCCCCCCCCCCCCC>
##$VD= 0
##$VDLIST= <DDDDDDDDDDDDDDD>
##$VPLIST= <PPPPPPPPPPPPPPP>
##$VTLIST= <TTTTTTTTTTTTTTT>
##$WBST= 1024
##$WBSW= 4
##$XGAIN= (0..3)
0 0 0 0 
##$XL= 0
##$YL= 0
##$YMAX_a= 352230
##$YMIN_a= -460161
##$ZGOPTNS= <>
##$ZL1= 120
##$ZL2= 120
##$ZL3= 120
##$ZL4= 120
##$ABSF1= 16.522
##$ABSF2= -4.171173
##$ABSG= 5
##$ABSL= 3
##$ALPHA= 0
##$AQORDER= 0
##$ASSFAC= 0
##$ASSFACI= 0
##$ASSFACX= 0
##$ASSWID= 0
##$AUNMP= <proc_1d>
##$AZFE= 0.1
##$AZFW= 0.1
##$BCFW= 0
##$BC_mod= 0
##$BYTORDP= 0
##$COROFFS= 0
##$CY= 12.5
##$DATMOD= 1
##$DC= 0
##$DFILT= <>
##$DTYPP= 0
##$F1P= 14.0000005364418
##$F2P= -0.99999901652339
##$FCOR= 0.5
##$FTSIZE= 32768
##$FT_mod= 6
##$GAMMA= 0
##$GB= 0
##$INTBC= 1
##$INTSCL= 1
##$ISEN= 128
##$LB= 0.3
##$LEV0= 0
##$LPBIN= 0
##$MAXI= 10000
##$MC2= 0
##$MEAN= 0
##$ME_mod= 0
##$MI= 0
##$NCOEF= 0
##$NC_proc= -4
##$NLEV= 6
##$NOISF1= 0
##$NOISF2= 0
##$NSP= 0
##$NTH_PI= 0
##$NZP= 0
##$OFFSET= 16.522
##$PC= 1
##$PHC0= 166.9331
##$PHC1= 5.343434
##$PH_mod= 1
##$PKNL= yes
##$PPARMOD= 0
##$PSCAL= 4
##$PSIGN= 0
##$REVERSE= no
##$SF= 250.13
##$SI= 32768
##$SIGF1= 0
##$SIGF2= 0
##$SINO= 400
##$SIOLD= 32768
##$SREGLST= <1H.CDCl3>
##$SSB= 0
##$STSI= 32768
##$STSR= 0
##$SW_p= 5175.98343685301
##$SYMM= 0
##$S_DEV= 0
##$TDeff= 65536
##$TDoff= 0
##$TI= <Analysis number 999999
Compound Code 99
Book Reference 9
Project Code 9>
##$TILT= no
##$TM1= 0
##$TM2= 0
##$TOPLEV= 0
##$USERP1= <user>
##$USERP2= <user>
##$USERP3= <user>
##$USERP4= <user>
##$USERP5= <user>
##$WDW= 1
##$XDIM= 32768
##$YMAX_p= 410592515
##$YMIN_p= -374343
$$ End of Bruker specific parameters
$$ ---------------------------------
##NTUPLES= NMR SPECTRUM
##VAR_NAME=  FREQUENCY,     SPECTRUM/REAL,   SPECTRUM/IMAG
##SYMBOL=    X,             R,               I
##VAR_TYPE=  INDEPENDENT,   DEPENDENT,       DEPENDENT
##VAR_FORM=  AFFN,          ASDF,            ASDF
##VAR_DIM=   32768,         32768,           32768
##UNITS=     HZ,            ARBITRARY UNITS, ARBITRARY UNITS
##FACTOR=    0.157963299565203, 1,           1
##FIRST=     4132.6476996994, 0,             0
##LAST=      -1043.33573715361, 0,           0
##MIN=       -1043.33573715361, -374343,     0
##MAX=       4132.6476996994, 410592515,     0
$$ Real data points
##PAGE= N=1
##DATA TABLE= (X++(R..R)), XYDATA
$$ [...]
$$ plain form
19010 468740 421608 340826 322257 294893 258637 247024 320422 323198 328054 330893 319337 356207
18998 356207 361329 357086 340479 339245 366345 312832 305151 299186 332952 329646 333639 309896 337204
18985 337204 332689 338265 317178 307396 301018 289691 374845 333932 294919 347478 375984 344958
18973 344958 248333 152602 142236 147543 155550 137719 219645 260785 255639 266452 252732 272452
18961 272452 243311 221170 273528 320203 286557 244099 250949 266212 225165 193183 270646 273800
18949 273800 233043 223340 188235 130956 164493 174685 146937 161537 248487 287800 252388 251020
18937 251020 205718 166716 189058 181650 199175 138992 138454 158674 169282 160066 101136 114858
18925 114858 108120 175965 235514 264477 250807 264218 283543 333821 434169 430327 422049 381843
$$ packed form
19010D68740m7132q0782j8569k7364l6256j1613P3398K776M856K839j1556L6870
18998C56207N122m243j6607j234K7100n3513p681n965L3766l306L993k3743K7308
18985C37204m515N576k1087r782o378j1327Q5154m0913l9013N2559K8506l1026
18973C44958r6625r5731j0366N307Q007j7831Q1926M1140n146J0813j3720J9720
18961B72452k9141k2141N2358M6675l3646m2458O850J5263m1047l1982P7463L154
18949B73800m0757r703l5105n7279L3537J0192k7748J4600Q6950L9313l5412j368
18937B51020m5302l9002K2342p408J7525o0183n38K0220J0608r216n8930J3722
18925A14858o738O7845N9549K8963j3670J3411J9325N0278J00348l842q278m0206
$$ plain form
18913 381843 354730 390770 344889 336649 393765 435855 468892 425555 441124 420075 340483 290449
18901 290449 356210 342953 322598 345699 288134 234222 237345 196970 195214 224342 240873 221938
18889 221938 218809 173862 128878 159311 179353 181266 160948 184129 304337 351184 354591 421177
18877 421177 384848 388347 446760 456735 465248 509583 536646 537144 531050 505485 479783 505887 452284
18864 452284 415225 393805 474598 580488 587359 503072 459863 428234 413714 422662 443639 476210
18852 476210 497438 554587 495801 450269 419142 390971 427991 411838 335988 346495 346973 270959
18840 270959 263954 292668 282911 323038 351547 266642 203717 193137 176317 258721 322303 333966
18828 333966 343656 294372 287227 298360 283810 241347 284028 325104 260185 276747 300363 287941
$$ packed form
18913C81843k7113L6040m5881q240N7116M2090L3037m3337J5569k1049p9592n0034
18901B90449O5761j3257k0355K3101n7565n3912L123m0375j756K9128J6531j8935
18889B21938l129m4947m4984L0433K0042J913k0318K3181J20208M6847L407O6586
18877D21177l6329L499N8413R975Q513M4335K7063M98o094k5565k5702K6104n3603
18864D52284l7059k1420Q0793J05890O871q4287m3209l1629j4520Q948K0977L2571
18852D76210K1228N7149n8786m5532l1127k8171L7020j6153p5850J0507M78p6014
18840B70959p005K8714r757M0127K8509q4905o2925j0580j6820Q2404O3582J1663
18828C33966R690m9284p145J1133j4550m2463M2681M1076o4919J6562K3616j2422
$$ plain form
18816 287941 366786 442944 436550 406778 373843 311759 306144 352250 345571 361494 410199 475184
18804 475184 480846 472836 436941 397479 379552 399624 416415 385114 354941 379870 296005 289525
18792 289525 300733 272005 273777 282925 285243 219096 237144 326666 353906 345897 330289 327713
18780 327713 318703 371151 349710 289773 240748 248711 298025 284081 270849 290199 301081 368529
18768 368529 480570 573870 590644 605822 508185 372388 323140 287034 353718 406390 400036
18757 400036 476436 442083 405622 385715 333738 341064 424783 472741 478971 501051 523813 501079
18745 501079 486487 538953 538081 546898 599726 647761 569117 514853 505026 432013 375688 366578
18733 366578 370714 302245 328011 315087 310599 376292 389427 306777 318044 360403 346042 288262
$$ packed form
18816B87941P8845P6158o394k9772l2935o2084n615M6106o679J5923M8705O4985
18804D75184N662q010l5895l9462j7927K0072J6791l1301l0173K4929q3865o480
18792B89525J1208k8728J772R148K318o6147J8048Q9522K7240q009j5608k576
18780C27713r010N2448k1441n9937m9025P963M9314j3944j3232J9350J0882O7448
18768C68529J12041R3300J6774J5178r7637j35797m9248l6106O6684N2672o354
18757D00036P6400l4353l6461j9907n1977P326Q3719M7958O230K2080K2762k2734
18745E01079j4592N2466q72Q817N2828M8035p8644n4264r827p3013n6325r110
18733C66578M136o8469K5766j2924m488O5693J3135q2650J1267M2359j4361n7780
$$ plain form
18721 288262 288397 300868 246985 164280 174993 220840 277861 272738 305156 354327 361120 323626
18709 323626 358722 410119 445115 466418 507382 522170 531458 600676 597028 564073 659769 783100
18697 783100 890487 904501 834785 721704 651731 545327 568266 572472 510767 504030 519268
18686 519268 581270 602284 582068 615604 700995 752054 710934 671272 612932 557040 477986
18675 477986 420875 408532 426543 460169 462259 429848 452894 450702 435186 369320 382878 379317
18663 379317 377539 397672 502231 581486 533372 467243 444752 490669 477003 424581 411709
18652 411709 420667 379608 394370 434066 485165 409332 429386 472988 555922 548649 494490 552312
18640 552312 536585 504907 446319 413696 411943 415160 396635 385495 373342 358062 270038 275412
$$ packed form
18721B88262J35J2471n3883q2705J0713M5847N7021n123L2418M9171O793l7494
18709C23626L5096N1397L4996K1303M0964J4788R288O9218l648l2955R5696J23331
18697G83100J07387J4014o9716j13081o9973j06404K2939M206o1705o737J5238
18686E19268O2002K1014k0216L3536Q5391N1059m1120l9662n8340n5892p9054
18675D77986n7111j2343J8011L3626K090l2411K3046k192j5516o5866J3558l561
18663C79317j778K0133J04559P9255m8114o6129k2491M5917j3666n2422j2872
18652D11709Q958m1059J4762L9696N1099p5833K0054M3602Q2934p273n4159N7822
18640E52312j5727l1678n8588l2623j753L217j8525j1140j2153j5280q8024N374
$$ plain form
18628 275412 302601 304242 327748 333220 360354 373479 402366 382298 378984 379006 387530 362677 331188
18615 331188 403979 470841 437175 371787 390307 440065 485904 560483 570008 461780 414853
18604 414853 362205 358989 328975 303380 265056 287983 317268 258564 202601 207445 273267 364359
18592 364359 371977 370682 357983 304468 305073 290558 254852 280738 361399 399582 390319 355349
18580 355349 333781 309805 343593 353126 391995 438747 492193 502586 542051 586611 560655 592914
18568 592914 581585 505367 434043 390027 385448 471140 475350 376082 346019 445609 501646 406766
18556 406766 371322 418870 433078 365210 305432 292693 270235 313665 332436 305923 343717
18545 343717 296740 259518 230183 197436 237134 281203 355700 399236 402831 441175 445349 489306
$$ packed form
18628B75412K7189J641K3506N472K7134J3125K8887k0068l314K2Q524k4853l1489
18615C31188P2791O6862l3666o5388J8520M9758M5839P4579R525j08228m6927
18604D14853n2648l216l0014k5595l8324K2927K9285n8704n5963M844O5822R1092
18592C64359P618j295j2699n3515O05j4515l5706K5886Q0661L8183r263l4970
18580C55349k1568k3976L3788R533L8869M6752N3446J0393L9465M4560k5956L2259
18568E92914j1329p6218p1324m4016m579Q5692M210r9268l0063R9590N6037r4880
18556D06766l5444M7548J4208o7868n9778j2739k2458M3430J8771k6513L7794
18545C43717m6977l7222k9335l2747L9698M4069P4497M3536L595L8344M174M3957
$$ plain form
18533 489306 464587 455114 443396 438952 353365 294242 393364 470874 534112 441029 410601 464043
18521 464043 455076 406016 395072 454150 455575 478186 462938 379173 403938 419834 364786 318201
18509 318201 344648 363384 435561 393224 362736 348286 330877 299302 312752 373847 385846
18498 385846 350699 313916 302710 376285 433572 415700 391351 463873 501709 525769 532386 555156
18486 555156 531147 530079 519688 491374 486653 429252 400136 484495 558797 512197 477660 512843
18474 512843 542412 552517 546304 505758 463652 463592 505055 470059 465344 509366 439765 442952 447597
18461 447597 441926 543891 579194 573039 633950 716102 767048 701926 665912 700281 687760 681378
18449 681378 731523 874810 977691 972367 961988 976017 1059739 1198208 1285033 1418487 1475408
$$ packed form
18533D89306k4719r473j1718m444q5587n9123R9122P7510O3238r3083l0428N3442
18521D64043q967m9060j0944N9078J425K2611j5248q3765K4765J5896n5048m6585
18509C18201K6447J8736P2177m2337l0488j4450j7409l1575J3450O1095J1999
18498C85846l5147l6783j1206P3575N7287j7872k4349P2522L7836K4060O617K2770
18486E55156k4009j068j0391k8314m721n7401k9116Q4359P4302m6600l4537L5183
18474E12843K9569J0105o213m0546m2106o0M1463l4996m715M4022o9601L187M645
18461D47597n671J01965L5303o155O0911Q2152N0946o5122l6014L4369j2521o382
18449F81378N0145J43287J02881n324j0379J4029Q3722J38469Q6825J33454N6921
$$ plain form
18438 1475408 1498025 1538337 1615035 1666217 1781399 1869444 1942073 2057037 2223391 2446594
18428 2446594 2755850 3123343 3622331 4392113 5346526 6461536 7554694 8423275 8775343
18419 8775343 8245150 7567702 7398363 7846969 9010595 11009257 14145882 18721066 24253563
18410 24253563 29975044 35761601 39568603 41312009 42573964 42937761 41702067 37317518
18402 37317518 32871018 29041474 24634289 21203611 19488504 19240836 20309704 22106593
18394 22106593 23722799 24618865 23882009 20829734 17537747 15253562 13845869 12929152
18386 12929152 12451133 12217463 12058150 11950144 12001066 12304581 12950599 14014769 15391775
18377 15391775 16826645 18054027 18861864 18846451 18735437 19396931 21201611 24285970 28035479
$$ packed form
18438A475408K2617M0312P6698N1182J15182Q8045P2629J14964J66354K23203
18428B446594L09256L67493M98988P69782R54413J115010J093158Q68581L52068
18419H775343n30193o77448j69339M48606J163626J998662L136625M575184N532497
18410B4253563N721481N786557L807002J743406J261955L63797j235694m384549
18402C7317518m446500l829544m407185l430678j715107k47668J068868J796889
18394B2106593J616206Q96066p36856l052275l291987k284185j407693r16717
18386A2929152m78019k33670j59313j08006N0922L03515O46018J064170J377006
18377A5391775J434870J227382Q07837j5413j11014O61494J804680L084359L749509
$$ plain form
18368 28035479 31993061 35946469 39272977 42558519 48720737 58250724 69901817 82193887
18360 82193887 90578048 94938817 96133221 94688589 92536104 91016773 89429389 84709944
18352 84709944 80811449 78322804 76514578 72653013 65675243 58375693 50303835 43241255
18344 43241255 38379838 35487943 33974618 33273036 32651948 31972806 30540848 28083829
18336 28083829 25965547 24490507 23333687 22412059 21789582 21340076 21008626 20900441 20882813
18327 20882813 20918931 21151234 21734775 22877248 24627402 27331835 31130820 35277608 38692384
18318 38692384 40814808 40032840 37183376 35824222 37186303 41172917 47001531 54518986
18310 54518986 63395534 71189136 78529425 85520389 87553488 82561542 74552011 64560426
$$ packed form
18368B8035479L957582L953408L326508L285542O162218R529987J1651093J2292070
18360H2193887Q384161M360769J194404j444632k152485j519331j587384m719445
18352H4709944l898495k488645j808226l861565o977770p299550q071858p062580
18344D3241255m861417k891895j513325p01582o21088o79142j431958k457019
18336B8083829k118282j475040j156820r21628o22477m49506l31450j08185j7628
18327B0882813L6118K32303N83541J142473J750154K704433L798985M146788L414776
18318C8692384K122424p81968k849464j359154J362081L986614N828614P517455
18310E4518986Q876548P793602P340289O990964K033099m991946q009531r991585
$$ plain form
18302 64560426 52260829 42170327 35500808 31140629 28173466 26112986 24845566 24169273
18294 24169273 24077800 24424261 24822776 24887330 24359660 22491641 20043438 18098169 16810233
18285 16810233 15893885 15196897 14655913 14211805 13862837 13486596 13072103 12674757 12284944
18276 12284944 11971435 11676584 11349029 11125445 10815629 10382264 9955962 9611302 9321314
18267 9321314 9044985 8839966 8588653 8371826 8118133 7925441 7793031 7586229 7390694
18258 7390694 7229493 6981277 6794351 6640243 6580734 6438734 6192235 6059221 5838563 5662699
18248 5662699 5549527 5517197 5424348 5201849 4953969 4753184 4581985 4471519 4321386 4283642
18238 4283642 4234326 4135398 4093771 4036104 3962678 3904675 3821317 3755052 3752791 3729211 3710710
$$ packed form
18302F4560426j2299597j0090502o669519m360179k967163k060480j267420o76293
18294B4169273r1473L46461L98515O4554n27670j868019k448203j945269j287936
18285A6810233r16348o96988n40984m44108l48968l76241m14493l97346l89813
18276A2284944l13509k94851l27555k23584l09816m33365m26302l44660k89988
18267I321314k76329k05019k51313k16827k53693j92692j32410k06802j95535
18258G390694j61201k48216j86926j54108n9509j42000k46499j33014k20658j75864
18248E662699j13172l2330r2849k22499k47880k00785j71199j10466j50133l7744
18238D283642m9316r8928m1627n7667p3426n8003q3358o6265k261k3580j8501
$$ plain form
18227 3710710 3705989 3631658 3588783 3544762 3382869 3320489 3264206 3224225 3181106 3155375 3141417
18216 3141417 3077633 3036538 2990032 2932439 2968230 2947587 2961865 2876884 2755111 2628134 2565486
18205 2565486 2451183 2429993 2436238 2429720 2394663 2344941 2373124 2355756 2335898 2331387 2320141 2195623
18193 2195623 2113355 2032156 1984484 1946051 1975142 1903994 1865490 1872353 1860031 1812708 1819464 1783765
18181 1783765 1771906 1730195 1655356 1676760 1728504 1758802 1681346 1567198 1483613 1417209 1410721
18170 1410721 1387095 1352472 1339286 1312324 1272002 1298984 1340791 1366667 1288816 1190734 1194572
18159 1194572 1261237 1272115 1328720 1327644 1319692 1327796 1366245 1365466 1328369 1339342 1366877 1321287
18147 1321287 1320658 1355427 1332306 1320185 1345127 1447894 1462620 1499903 1598083 1754456 1883432
$$ packed form
18227C710710m721p4331m2875m4021j61893o2380n6283l9981m3119k5731j3958
18216C141417o3784m1095m6506n7593L5791k0643J4278q4981j21773j26977o2648
18205B565486j14303k1190O245o518l5057m9722K8183j7368j9858m511j1246j24518
18193B195623q2268q1199m7672l8433K9091p1148l8504O863j2322m7323O756l5699
18181A783765j1859m1711p4839K1404N1744L0298p7456j14148q3585o6404o488
18170A410721k3626l4623j3186k6962m0322K6982M1807K5876p7851r8082L838
18159A194572O6665J0878N6605j076p952Q104L8449p79l7097J0973K7535m5590
18147A321287o29L4769k3121j2121K4942J02767J4726L7283R8180J56373J28976
$$ plain form
18136 1883432 1903370 2007008 2155401 2311177 2436582 2557426 2768772 2890344 3030355 3315330
18126 3315330 3604629 3887303 3990803 4113109 4287390 4627318 5275475 6102599 7156807
18117 7156807 8550888 10312890 12786446 16496072 22293640 31572148 45661091 63347133
18109 63347133 78515089 88621880 90374385 74398480 59428573 53953931 53379626 53917398
18101 53917398 53551599 48725931 41284659 36349663 34696669 35127164 35814605 35746828 33569874
18092 33569874 28574465 23787739 20415700 18176077 16635738 15436048 14548321 13851809
18084 13851809 13382945 13108450 12953475 12691678 12441987 12271803 12107946 11958206 11888699
18075 11888699 11880360 11864359 11904734 12170855 12786059 13834267 15591393 18113027 20787549
$$ packed form
18136A883432J9938J03638J48393J55776J25405J20844K11346J21572J40011K84975
18126C315330K89299K82674J03500J22306J74281L39928O48157Q27124J054208
18117G156807J394081J762002K473556L709626N797568R278508J4088943J7686042
18109F3347133J5167956J0106791J752505j5975905j4969907n474642n74305N37772
18101E3917398l65799m825668p441272m934996j652994M30495O87441o7777k176954
18092C3569874m995409m786726l372039k239623j540339j199690q87727o96512
18084A3851809m68864k74495j54975k61797k49691j70184j63857j49740o9507
18075A1888699q339j6001M0375K66121O15204J048208J757126K521634K674522
$$ plain form
18066 20787549 23142378 24844617 24867076 24348359 25431726 28514752 33236310 39380826
18058 39380826 46364225 52606149 57957716 61281041 61865599 58997299 53190725 46746639
18050 46746639 39908349 33280547 28842033 26627825 26119136 26510597 26892775 26670463 25010976
18041 25010976 21835195 18851556 16818018 15325187 14205773 13385609 12796902 12325673
18033 12325673 11951261 11585100 11339031 11075443 10814712 10632982 10437584 10322592 10192405
18024 10192405 10105277 10136098 10265993 10548600 11131352 12127116 13696094 15589217 17330733
18015 17330733 18650189 18935122 18026081 17826390 19145442 21727577 24412249 26273662
18007 26273662 26551583 23595309 20019673 18140509 17732298 18079176 18348974 18219056 16676454
$$ packed form
18066B0787549K354829J702239K2459n18717J083367L083026M721558O144516
18058C9380826O983399O241924N351567L323325N84558k868300n806574o444086
18050D6746639o838290o627802m438514k214208n08689L91461L82178k22312j659487
18041B5010976l175781k983639k033538j492831j119414q20164n88707m71229
18033A2325673l74412l66161k46069k63588k60731j81730j95398j14992j30187
18024A0192405q7128L0821J29895K82607N82752R95764J568978J893123J741516
18015A7330733J319456K84933r09041j99691J319052K582135K684672J861413
18007B6273662K77921k956274l575636j879164m08211L46878K69798j29918j542602
$$ plain form
17998 16676454 14073692 11908883 10482419 9504553 8812885 8221712 7776276 7370155 7080050
17989 7080050 6837941 6509218 6203814 6006364 5841603 5815628 5795522 5672861 5504239 5381111
17979 5381111 5270559 5150099 4968513 4783313 4717072 4655709 4548618 4381858 4265825 4201866
17969 4201866 4136085 4059145 3935796 3792830 3707324 3599091 3516214 3347981 3279978 3243782
17959 3243782 3137832 3060177 2992453 2996851 2933818 2873218 2758855 2718325 2722533 2717194 2757951
17948 2757951 2712145 2612216 2522741 2453391 2411011 2346673 2293131 2243119 2229809 2174155 2178524
17937 2178524 2145496 2147239 2224101 2237351 2239870 2174366 2114647 2121331 2136213 2128257 2174136 2237298
17925 2237298 2202860 2141704 2117466 2091910 2070198 2079475 2101460 2126709 2149755 2163609 2114882
$$ packed form
17998A6676454k602762k164809j426464r77866o91668n91173m45436m06121k90105
17989G080050k42109l28723l05404j97450j64761k5975k0106j22661j68622j23128
17979E381111j10552j20460j81586j85200o6241o1363j07091j66760j16033o3959
17969D201866o5781p6940j23349j42966q5506j08233q2877j68233o8003l6196
17959C243782j05950p7655o7724M398o3033o0600j14363m0530M208n339M0757
17948B757951m5806r9929q9475o9350m2380o4338n3542n0012j3310n5654M369
17937B178524l3028J743P6862J3250K519o5504n9719O684J4882p956M5879O3162
17925B237298l4438o1156k4238k5556k1712R277K1985K5249K3046J3854m8727
$$ plain form
17914 2114882 2073176 2088288 2050409 2013870 2007518 2015126 2085600 2098409 2158923 2143363 2148158 2161267
17902 2161267 2222229 2297345 2380537 2523384 2694570 2711334 2774393 2977899 3175373 3399308
17892 3399308 3672077 3993410 4291446 4535002 4843268 5264118 5767343 6541651 7449176
17883 7449176 8560562 10005557 11875905 14279109 17106152 20182090 22954176 24446140
17875 24446140 25029657 25490171 26562350 29631455 35514373 44424915 56073182 68349926
17867 68349926 77415464 82197747 80312013 73408789 70441505 75218093 86028644 98593291
17859 98593291 109500993 114390508 108486789 97592833 87477394 78121142 68056095
17852 68056095 58213573 50547718 45591827 42995030 42205920 42783354 43743769 44033499 42942131
$$ packed form
17914B114882m1706J5112l7879l6539o352P608P0474J2809O0514j5560M795J3109
17902B161267O0962P5116Q3192J42847J71186J6764O3059K03506J97474K23935
17892C399308K72769L21333K98036K43556L08266M20850N03225P74308R07525
17883G449176J111386J444995J870348K403204K827043L075938K772086J491964
17875B4446140N83517M60514J072179L069105N882918Q910542J1648267J2276744
17867F8349926R065538M782283j885734o903224k967284M776588J0810551J2564647
17859I8593291J0907702M889515n903719j0893956j0115439r356252j0065047
17852F8056095r842522p665855m955891k596797p89110N77434R60415K89730j091368
$$ plain form
17843 42942131 39675843 35410954 31932147 29330287 27444072 26113606 25103520 24390999
17835 24390999 23897575 23634255 23482217 23416028 23655350 24177076 25189168 26983917 29736919
17826 29736919 33272961 37066531 40826022 44169743 46611968 49352230 53045299 56650994
17818 56650994 58756379 58412191 57644241 60255598 67184055 75996421 84525036 90452315
17810 90452315 89218456 85417455 84094919 84904294 86353370 86109787 83415440 75859027
17802 75859027 64327336 54612677 47898299 42617537 38196376 34582049 31638234 29445336
17794 29445336 27838191 26658760 25789309 25263321 25035554 24973425 24822914 24432938 23407895
17785 23407895 21904464 20474074 19420162 18699770 18117594 17570488 17105929 16620710 16161977
$$ packed form
17843D2942131l266288m264889l478807k601860j886215j330466j010086p12521
17835B4390999m93424k63320j52038o6189K39322N21726J012092J794749K753002
17826B9736919L536042L793570L759491L343721K442225K740262L693069L605695
17818E6650994K105385l44188p67950K611357O928457Q812366Q528615N927279
17810I0452315j233859l801001j322536Q09375J449076k43583k694347p556413
17802G5859027j1531691r714659o714378n280762m421161l614327k943815k192898
17794B9445336j607145j179431q69451n25988k27767o2129j50511l89976j025043
17785B3407895j503431j430390j053912p20392n82176n47106m64559m85219m58733
$$ plain form
17776 16161977 15767921 15513380 15356664 15365561 15627164 16052678 16578127 17145499 17992177 19162403
17766 19162403 20866262 22947756 24838547 26112808 26006954 24193637 22306753 21253898
17758 21253898 21205522 22157766 23983828 26648171 29965117 34073729 39101822 45926188
17750 45926188 56572124 73088861 95609843 119882270 141078354 153478913 146443868
17743 146443868 126563770 105760907 86899655 71481012 61043165 54875811 51895190
17736 51895190 51588052 53723358 57310557 60536187 62124656 60377577 53942201 45775439
17728 45775439 39296563 34912082 32021245 29953650 28324966 26992589 25807527 24799136
17720 24799136 23968784 23237065 22528984 21969401 21556110 21421896 21526976 21820249 22236351
$$ packed form
17776A6161977l94056k54541j56716Q897K61603M25514N25449N67372Q46678J170226
17766A9162403J703859K081494J890791J274261j05854j813317j886884j052855
17758B1253898m8376R52244J826062K664343L316946M108612N028093O824366
17750D5926188J0645936J6516737K2520982K4272427K1196084J2400559p035045
17743A46443868j9880098k0802863j8861252j5418643j0437847o167354k980621
17736E1895190l07138K135306L587199L225630J588469j747079o435376q166762
17728D5775439o478876m384481k890837k067595j628684j332377j185062j008391
17720B4799136q30352p31719p08081n59583m13291j34214J05080K93273M16102
$$ plain form
17711 22236351 22761878 23325747 24039785 25160122 27076090 30292558 35195167 41386067
17703 41386067 47361166 51965764 53702346 51221230 47530848 45761027 46366006 49280192
17695 49280192 54771196 63557679 76389435 93258411 113227216 131335115 140992326
17688 140992326 140911810 128832639 103318251 78586086 61898628 51386663 44779972
17681 44779972 40422908 37332960 35003592 33206921 31782503 30654848 30052057 30111792
17673 30111792 30867359 31723312 32106988 31622589 29550954 26585580 24027451 22064178 20516953
17664 20516953 19303585 18173311 17285694 16488925 15801446 15250382 14706161 14166219 13666880
17655 13666880 13138624 12616295 12118269 11687620 11277664 10952296 10674056 10368829 10138282
$$ packed form
17711B2236351N25527N63869P14038J120337J915968L216468M902609O190900
17703D1386067N975099M604598J736582k481116l690382j769821O04979K914186
17695D9280192N491004Q786483J2831756J6868976J9968805J8107899R657211
17688A40992326q0516j2079171k5514388k4732165j6687458j0511965o606691
17681D4779972m357064l089948k329368j796671j424418j127655o02791N9735
17673C0111792P55567Q55953L83676m84399k071635k965374k558129j963273j547225
17664B0516953j213368j130274q87617p96769o87479n51064n44221n39942m99339
17655A3666880n28256n22329m98026m30649m09956l25368k78240l05227k30547
$$ plain form
17646 10138282 9889488 9591006 9308839 9069174 8805875 8535262 8264982 8009002 7762211
17637 7762211 7610531 7514923 7373116 7220229 7088155 6872020 6623498 6404524 6214396 6106536
17627 6106536 6004791 5929723 5692497 5537570 5475236 5402082 5239997 5059315 4913636 4728343
17617 4728343 4682696 4621960 4526423 4488212 4411114 4403247 4333067 4162039 4066954 4039396 3938911
17606 3938911 3842091 3743578 3671539 3650718 3563879 3464869 3380323 3283476 3226040 3178123 3102929
17595 3102929 3006005 2907341 2833862 2794300 2747021 2676478 2686232 2584407 2460473 2435637 2351811
17584 2351811 2310340 2299750 2258336 2257821 2218465 2167564 2123788 2045908 2023330 1923293 1884992
17573 1884992 1856508 1828982 1842814 1785500 1667500 1693002 1699807 1630495 1546741 1512938 1500227
$$ packed form
17646A0138282k48794k98482k82167k39665k63299k70613k70280k55980k46791
17637G762211j51680r5608j41807j52887j32074k16135k48522k18974j90128j07860
17627F106536j01745p5068k37226j54927o2334p3154j62085j80682j45679j85293
17617D728343m5647o0736r5537l8211p7098p867p0180j71028r5085k7558j00485
17606C938911r6820r8513p2039k0821q6839r9010q4546r6847n7436m7917p5194
17595C102929r6924r8664p3479l9562m7279p0543R754j01825j23934k4836q3826
17584B351811m1471j0590m1414n15l9356n0901m3776p7880k2578j00037l8301
17573A884992k8484k7526J3832n7314j18000K5502O805o9312q3754l3803j2711
$$ plain form
17562 1500227 1437737 1471435 1461338 1424857 1375050 1403835 1388449 1414321 1486642 1533553 1527214
17551 1527214 1459030 1371823 1314036 1354814 1348200 1320180 1383405 1484728 1461855 1397918 1362011
17540 1362011 1284233 1249795 1237786 1212777 1220715 1130914 1024809 986032 936190 964771 942722
17529 942722 917575 980537 953810 958922 929995 932330 915844 887144 868485 891089 877187 844627
17517 844627 825509 810313 847217 852530 921371 916932 772959 749275 752383 795331 772052 796329
17505 796329 810048 801308 781853 774529 753274 865384 972099 912640 841464 861701 889347
17494 889347 838439 768494 750533 763967 710060 663734 642889 623215 630995 668512 672972 764791
17482 764791 745262 679924 625113 598289 546693 572732 572082 535590 506534 473500 532789 586405
$$ packed form
17562A500227o2490L3698j0097l6481m9807K8785j5386K5872P2321M6911o339
17551A527214o8184q7207n7787M0778o614k8020O3225J01323k2873o3937l5907
17540A362011p7778l4438j2009k5009P938q9801j06105l8777m9842K8581k2049
17529I42722k5147O2962k6727N112k8927K335j6486k8700j8659K2604j3902l2560
17517H44627j9118j5196L6904N313O8841m439j43973k3684L108M2948k3279K4277
17505G96329J3719q740j9455p324k1255J12110J06715n9459p1176K0237K7646
17494H89347n0908o9945j7961J3434n3907m6326k0845j9674P780L7517M460R1819
17482G64791j9529o5338n4811k6824n1596K6039o50l6492k9056l3034N9289N3616
$$ plain form
17470 586405 564111 591256 593683 608816 534222 557217 572909 582157 555945 515928 517788 527040
17458 527040 521968 544954 519658 525862 481474 519228 491811 524378 491527 515167 485792 403665
17446 403665 404791 478008 590657 748184 886502 879632 779266 622157 542331 507606 510803
17435 510803 480858 465168 437451 498912 536598 501717 425293 386965 369723 370302 361567 367515
17423 367515 313179 307299 382838 375735 338373 318405 317294 297709 311541 371781 360518 383056
17411 383056 399035 431603 356201 334937 292686 193534 212800 276351 310851 365588 344293
17400 344293 279771 172321 155865 290466 372763 343997 321272 305604 269822 289256 276201
17389 276201 328282 318120 296805 274078 223730 175910 243364 280589 282981 276226 277802 286277
$$ packed form
17470E86405k2294K7145K427J5133p4594K2995J5692R248k6212m0017J860R252
17458E27040n072K2986k5296O204m4388L7754k7417L2567l2851K3640k9375q2127
17446D03665J126P3217J12649J57527J38318o870j00366j57109p9826l4725L197
17435E10803k9945j5690k7717O1461L7686l4881p6424l8328j7242N79q735N948
17423C67515n4336n880P5539p103l7362j9968j111j9585J3832O0240j1263K2538
17411C83056J5979L2568p5402k1264m2251r9152J9266O3551L4500N4737k1295
17400C44293o4522j07450j6456J34601Q2297k8766k2725j5668l5782J9434j3055
17389B76201N2081j0162k1315k2727n0348m7820O7454L7225K392o755J576Q475
$$ plain form
17377 286277 245614 319350 283815 257201 284328 240955 210712 164452 137888 214317 258759
17366 258759 245979 235892 268708 328970 385588 427557 393376 416442 542882 610024 580449
17355 580449 492721 490627 542100 491656 433279 492618 578434 578117 539526 581837 679292 753715
17343 753715 681085 678217 631337 679224 647823 666620 613579 564528 538198 517132 423960 384497
17331 384497 434309 427277 445408 408824 428905 393222 366069 362814 330822 275607 293446 356268
17319 356268 356489 416228 471566 446744 426491 412645 411633 405595 401451 454986 477538 468289 436862
17306 436862 408166 489093 520078 497310 509422 528292 521110 535199 489660 394559 326168 365839
17294 365839 396247 408901 463800 524256 501385 485919 494807 499051 472577 464119 395704 428349
$$ packed form
17377B86277m0663P3736l5535k6614K7127m3373l0243m6260k6564P6429M4442
17366B58759j2780j0087L2816O0262N6618M1969l4181K3066J26440O7142k9575
17355E80449q7728k094N1473n0444n8377N9339Q5816l17l8591M2311R7455P4423
17343G53715p2630k868m6880M7887l1401J8797n3041m9051k6330k1066r3172l9463
17331C84497M9812p032J8131l6584K0081l5683k7153l255l1992n5215J7839O2822
17319C56268K21N9739N5338k4822k0253j3846j012o038m144N3535K2552r249l1427
17306D36862k8696Q0927L0985k2768J2112J8870p182J4089m5539r5101o8391L9671
17294C65839L0408J2654N4899O0456k2871j5466Q888M244k6474q458o8415L2645
$$ plain form
17282 428349 519201 516603 438707 304903 208200 285308 257503 173381 169563 237339 305829 281557
17270 281557 284472 228609 248296 278512 265429 288390 274898 194236 117244 136382 171251 204577
17258 204577 227547 123325 127035 161878 213064 214750 209503 216140 245217 185268 114754 128196
17246 128196 145120 184052 153044 185035 230270 224304 199478 264010 397385 460222 536894
17235 536894 637067 560986 517637 507782 521020 502981 466638 505675 495973 520848 469629 461829
17223 461829 522047 436950 394908 421015 420400 465221 467170 435534 404839 358870 314016 251730
17211 251730 342450 388708 334710 258075 261822 354989 354314 405330 453810 482313 401951 381007
17199 381007 367724 319342 291371 297039 301068 282367 247834 289387 280838 288577 307505 371303
$$ packed form
17282D28349R0852k598p7896j33804r6703P7108k7805q4122l818O7776O8490k4272
17270B81557K915n5863J9687L0216j3083K2961j3492q0662p6992J9138L4869L3326
17258B04577K2970j04222L710L4843N1186J686n247O637K9077n9949p0514J3442
17246A28196J6924L8932l1008L1991M5235n966k4826O4532J33375O2837P6672
17235E36894J00173p6081m3349r855J3238j8039l6343L9037r702K4875n1219p800
17223D61829O0218q5097m2042K6107o15M4821J949l1636l0695m5969m4854o2286
17211B51730R0720M6258n3998p6635L747R3167o75N1016M8480K8503q0362k0944
17199C81007j3283m8382k7971N668M029j8701l4533M1553q549P739J8928O3798
$$ plain form
17187 371303 410047 398365 436037 476137 543177 528565 524573 537691 509312 504517 624494 682780
17175 682780 654646 626156 616594 593168 569883 527184 427757 415239 466342 496622 575146 562348
17163 562348 478126 463470 461150 417919 396662 421957 401512 306269 295885 341566 310213 309279
17151 309279 283583 289676 298258 246154 230196 243774 255149 288721 286166 271938 312896 369500
17139 369500 321355 351149 375164 390616 503568 549408 619726 816247 992211 1375049 1956977
17128 1956977 2631087 3090073 3369370 3175360 2467073 1782330 1259086 1011425 869611
17119 869611 734543 689933 597667 546369 571703 533053 434260 357428 400181 395146 321852
17108 321852 295064 326440 398530 397841 339126 296073 335353 385243 385228 351867 278626 256755
$$ packed form
17187C71303L8744j1682L7672M0100O7040j4612l992J3118k8379m795J19977N8286
17175F82780k8134k8490r562k3426k3285m2699r9427j2518N1103L0280P8524j2798
17163E62348q4222j4656k320m3231k1257K5295k0445r5243j0384M5681l1353r34
17151C09279k5696O093Q582n2104j5958J3578J1375L3572k555j4228M0958N6604
17139C69500m8145K9794K4015J5452J12952M5840P0318J96521J75964L82838N81928
17128A956977O74110M58986K79297j94010p08287o84743n23244k47661j41814
17119H69611j35068m4610r2266n1298K5334l8650r8793p6832M2753n035p3294
17108C21852k6788L1376P2090o89n8715m3053L9280M9890j5l3361p3241k1871
$$ plain form
17096 256755 275072 273118 249115 181441 172438 183255 239136 246585 181225 151028 163986 144677
17084 144677 148081 195479 173800 142746 106346 103490 130791 145265 162056 111694 144777 114029
17072 114029 96898 102369 99452 117685 97157 61673 85174 68243 23698 82077 53647 8005
17060 8005 -58192 -80452 22041 73242 53175 64230 68594 17571 56657 103454 144454 120106
17048 120106 128992 122043 62700 68654 97888 106338 82435 115507 129059 131539 88801 72722
17036 72722 90145 95907 164829 246882 201307 98435 75639 85074 53420 109508 80131 80939
17024 80939 74003 102619 138429 99015 103215 68693 69796 163965 155889 91710 149557 131194
17012 131194 46479 14806 -21537 -2383 93646 28858 40099 115684 121201 70493 7607 -11710
$$ packed form
17096B56755J8317j954k4003o7674r003J0817N5881P449o5360l0197J2958j9309
17084A44677L404M7398k1679l1054l6400k856K7301J4474J6791n0362L3083l0748
17072A14029j7131N471k917J8233k0528l5484K3501j6931m4545N8379k8430m5642
17060H005o6197k2260J02493N1201k0067J1055M364n1023L9086M6797M1000k4348
17048A20106Q886o949n9343N954K9234Q450k3903L3072J3552K480m2738j6079
17036G2722J7423N762O8922Q2053m5575j02872k2796R435l1654N6088k9377Q08
17024H0939o936K8616L5810l9414M200l4522J103R4169q076o4179N7847j8363
17012A31194q4715l1673l6343J9154R6029o4788J1241P5585N517n0708o2886j9317
$$ plain form
17000 -11710 49863 69444 55185 60783 61045 9615 -52353 -59831 -12589 12478 28198 23815 1830
16987 1830 -27150 -65064 -69641 -28749 38283 145301 178295 195248 179283 147039 99814 101985
16975 101985 66929 302 -22462 -45520 13796 15712 50548 82084 109581 110239 44351 20328
16963 20328 82410 79738 31472 29676 69941 70450 83469 69844 53904 23227 6173 46123
16951 46123 13402 12639 23358 90299 122757 135023 114445 122492 100946 30367 -3441 41882
16939 41882 77221 53129 9967 11259 61749 112689 91380 -9420 -30103 64664 130139 93405
16927 93405 88912 60421 12619 75443 86993 78356 -16834 -83671 -42532 -62043 7725 61742
16915 61742 3313 39333 96672 96829 78523 36713 2986 29845 292 -76426 -31837 36995
$$ packed form
17000a1710O1573J9581j4259N598K62n1430o1968p478M7242K5067J5720m383k1985
16987A830k8980l7914m577M0892O7032J07018L2994J6953j5965l2244m7225K171
16975A01985l5056o6627k2764k3058N9316J916L4836L1536K7497O58o5888k4023
16963B0328O2082k672m8266j796M0265N09J3019j3625j5940l0677j7054L9950
16951D6123l2721p63J0719O6941L2458J2266k0578Q047k1546p0579l3808M5323
16939D1882L5339k4092m3162J292N0490N0940k1309j00800k0683R4767O5475l6734
16927I3405m493k8491m7802O2824J1550q637r5190o6837M1139j9511O9768N4017
16915F1742n8429L6020N7339J57j8306m1810l3727K6859k9553p6718M4589O8832
$$ plain form
16903 36995 100093 142445 154789 155442 71780 29495 38816 35907 79714 94487 92954 137199 160745
16890 160745 110938 65191 92195 72894 42922 19790 -37316 -6785 59437 -1268 -57868
16879 -57868 -29634 -17887 14952 -11483 -45710 7340 53535 52058 67250 80723 31172 -51611
16867 -51611 -746 59931 84692 135568 131281 63763 -12930 -48362 -35507 -15217 48845 7392
16855 7392 49962 149833 138433 98573 110453 127117 75943 104566 63861 41961 20417 47457
16843 47457 66309 54612 62312 82405 19320 6532 -26332 -34333 -36084 -7276 -26520 -67284
16831 -67284 -14647 39251 66180 68450 82252 26139 35723 54806 17396 -10974 -2577 16125
16819 16125 -4029 18557 -22924 -59271 -108126 -109574 -45875 -18064 -15002 -18034 20876 30206
$$ packed form
16903C6995O3098M2352J2344O53q3662m2285R321k909M3807J4773j533M4245K3546
16890A60745m9807m5747K7004j9301k9972k3132n7106L0531O6222o0705n6600
16879e7868K8234J1747L2839k6435l4227N3050M6195j477J5192J3473m9551q2783
16867e1611N0865O0677K4761N0876m287o7518p6693l5432J2855K0290O4062m1453
16855G392M2570R9871j1400l9860J1880J6664n1174K8623m0705k1900k1544K7040
16843D7457J8852j1697P700K0093o3085j2788l2864q001j751K8808j9244m0764
16831f7284N2637N3898K6929K270J3802n6113R584J9083l7410k8370Q397J8702
16819A6125k0154K2586m1481l6347m8855j448O3699K7811L062l032L8910R330
$$ plain form
16807 30206 21593 63560 109078 152245 92631 34181 96355 116973 153902 78375 52162 40945
16795 40945 4314 11646 -10218 -68440 -119449 -86558 10517 67878 10408 1158 81826 87581
16783 87581 97929 62009 15083 -6785 34958 39628 32492 103875 123463 69917 15252 61175
16771 61175 144347 108619 41642 49935 50334 3758 16189 -7159 -32236 -56702 -62706 -30737
16759 -30737 42916 38725 57860 -761 11522 12708 -9013 84144 109480 152344 179785 111275
16747 111275 86703 70183 22943 15056 32830 66950 82253 42031 28844 -19995 -72617 -7989
16735 -7989 -3368 66112 106900 84601 14325 -5090 37974 105375 92836 63801 3601 -36847
16723 -36847 39932 65768 -17855 -50921 -93534 -93045 -58347 20540 89682 103350 98183 -40002
$$ packed form
16807C0206q613M1967M5518M3167n9614n8450O2174K0618L6929p5527k6213j1217
16795D0945l6631P332k1864n8222n1009L2891R7075N7361n7470r250Q0668N755
16783H7581J0348l5920m6926k1868M1743M670p136P1383J9588n3546n4665M5923
16771F1175Q3172l5728o6977Q293L99m6576J2431k3348k5077k4466o004L1969
16759c0737P3653m191J9135n8621J2283J186k1721R3157K5336M2864K7441o8510
16747A11275k4572j6520m7240p887J7774L4120J5303m0222j3187m8839n2622O4628
16735g989M621O9480M0788k2299p0276j9415M3064O7401j2539k9035o0200m0448
16723c6847P6779K5836q3623l3066m2613M89L4698P8887O9142J3668n167j38185
$$ plain form
16711 -40002 -84198 -62587 -34821 36343 45657 -43686 -80357 -8201 -40965 -18322 40542 124369
16699 124369 120456 11422 -31982 -31805 -32430 18146 33337 25394 -32277 26875 93594 165030
16687 165030 145044 59974 24960 70557 98857 59625 -380 -23340 5479 11373 44425 90569
16675 90569 122672 76409 -17547 -33209 -80853 -66265 -16466 -7301 -14701 16215 6091 -16750
16663 -16750 -40926 -94655 -81824 -66948 -60432 -95333 -58742 -61495 -104328 -122682 -81079 60221
16651 60221 71535 -4171 46245 41694 42568 70531 91004 133776 129269 119510 121635 126051 99604
16638 99604 64743 103459 58789 39754 114155 124859 82967 17672 52159 112652 99113 104580
16626 104580 94436 33958 -18843 -52231 -89006 -130396 -121504 -104988 -52620 -26343 33878 -43606
$$ packed form
16711d0002m4196K1611K7766P1164R314q9343l6671P2156l2764K2643N8864Q3827
16699A24369l913j09034m3404J77o25N0576J5191p943n7671N9152O6719P1436
16687A65030j9986q5070l5014M5597K8300l9232o0005k2960K8819N894L3052M6144
16675I0569L2103m6263r3956j5662m7644J4588M9799R165p400L0916j0124k2841
16663a6750k4176n3729J2831J4876O516l4901L6591k753m2833j8354M1603J41300
16651F0221J1314p5706N0416m551Q74K7963K0473M2772m507r759K125M416k6447
16638I9604l4861L8716m4670j9035P4401J0704m1892o5295L4487O0493j3539N467
16626A04580j0144o0478n2801l3388l6775m1390Q892J6516N2368K6277O0221p7484
$$ plain form
16614 -43606 -65935 45914 41279 -32084 -14887 3291 -34643 -68696 -17857 44376 83550 94601
16602 94601 73579 64188 54896 54990 58613 26059 16122 -1720 -5079 -121993 -139134 -44445 -7407
16589 -7407 28013 36350 22651 42250 71730 102260 33066 -69891 -55680 -60821 -35176 -44342
16577 -44342 34399 69005 37226 13707 -3970 -46295 -38410 -75169 -40247 -42087 -75264 -41277
16565 -41277 32438 22587 -11059 -13106 -7338 41360 -16592 19820 75508 90353 125963 90064
16553 90064 56985 43743 68843 37136 8685 -8221 17643 23806 -18851 -17280 -19056 -34039
16541 -34039 -5631 -2554 -34243 16289 31341 -94 30629 78680 20516 -38784 -37073 -88777
16529 -88777 -106128 -47219 -18366 -4695 57736 33066 106298 102253 98044 72706 70510 62881
$$ packed form
16614d3606k2329J11849m635p3363J7197J8178l7934l4053N0839O2233L9174J1051
16602I4601k1022r391r292R4L623l2554r937j7842l359j16914j7141R4689L7038
16589g407L5420Q337j3699J9599K9480L0530o9194j02957J4211n141K5645r166
16577d4342P8741L4606l1779k3519j7677m2325P885l6759L4922j840l3177L3987
16565d1277P3715r851l3646k047N768M8698n7952L6412N5688J4845L5610l5899
16553I0064l3079j3242K5100l1707k8451j6906K5864O163m2657J571j776j4983
16541c4039K8408L077l1689N0532J5052l1435L0723M8051n8164n9300J711n1704
16529h8777j7351N8909K8853J3671O2431k4670P3232m045m209k5338k196p629
$$ plain form
16517 62881 37192 43956 47904 -17656 -15588 -914 -15085 -17792 -5255 -2813 14615 15801 77311
16504 77311 96709 59279 28651 3810 -42175 -92604 -64602 -26199 13713 14834 -41636 -92955
16492 -92955 -133040 -93304 -26525 -53078 -76581 -23142 873 -27857 -5374 61967 122139 64434
16480 64434 -28289 -34583 -55907 -67913 -28584 -37029 -7583 28923 -5149 -11534 -44871 -89992
16468 -89992 -56654 -40896 -3678 42561 50962 75622 139521 211335 203091 117809 45327 27948
16456 27948 -42639 -57712 -5349 49504 29593 1477 33752 -23166 -33323 71157 103085
16445 103085 56739 9558 -115624 -123414 -79067 -27929 20861 62247 122961 171721 150322
16434 150322 42000 -26338 -24286 12526 -5635 3959 26685 38549 15214 52115 54738 37171
$$ packed form
16517F2881k5689O764L948o5560K068J4674j4171k707J2537K442J7428J186O1510
16504G7311J9398l7430l0628k4841m5985n0429K8002L8403L9912J121n6470n1319
16492i2955m0085L9736O6779k6553k3503N3439K4015k8730K2483O7341O0172n7705
16480F4434r2723o294k1324j2006L9329q445K9446L6506l4072o385l3337m5121
16468h9992L3338J5758L7218M6239Q401K4660O3899P1814q244q5282p2482j7379
16456B7948p0587j5073N2363N4853j9911k8116L2275n6918j0157J04480L1928
16445A03085m6346m7181j25182p790M4347N1138M8790M1386O0714M8760k1399
16434A50322j08322o8338K052L6812j8161R594K2726J1864k3335L6901K623j7567
$$ plain form
16422 37171 54665 124386 68586 28371 41818 55695 67875 58746 -36419 -99053 -129427 -88971
16410 -88971 -45887 -82172 -44684 -5423 53578 26390 -16465 -39786 -15125 -15437 -44727 -52035
16398 -52035 -98844 -152729 -69246 -47660 -14671 32193 -18552 -109874 -129085 -53754 -5988 -46841
16386 -46841 -35766 -48650 -54918 -60610 -29628 2612 -26465 -44304 486 -84612 -15290 -1807
16374 -1807 -19071 26975 43863 25822 40970 59474 63809 32656 58733 69269 115285 89420
16362 89420 134304 104777 77480 23868 226 31072 29525 -11538 -80902 -55205 -92829 -45095
16350 -45095 1228 18349 34372 35583 -9973 -15748 -19429 -62467 -80051 -77041 -50450 -40669 -56526
16337 -56526 -56011 48282 83665 47765 7647 11988 94559 94239 18415 -36732 -8661 38192
$$ packed form
16422C7171J7494O9721n5800m0215J3447J3877J2180r129r5165o2634l0374M0456
16410h8971M3084l6285L7488L9261N9001k7188m2855k3321K4661l12k9290p308
16398e2035m6809n3885Q3483K1586L2989M6864n0745r1322j9211P5331M7766m0853
16386d6841J1075j2884o268n692L0982L2240k9077j7839M4790q5098O9322J3483
16374a807j7264M6046J6888j8041J5148J8504M335l1153K6077J0536M6016k5865
16362H9420M4884k9527k7297n3612k3642L0846j547m1063o9364K5697l7624M7734
16350d5095M6323J7121J6023J211m5556n775l681m3038j7584L010K6591R781j5857
16337e6526N15J04293L5383l5900m0118M341Q2571l20p5824n5147K8071M6853
$$ plain form
16325 38192 36435 51485 5607 4517 95636 155558 149337 166787 118799 33896 52631 80356
16313 80356 14388 -1788 40129 40362 8316 -74485 -78664 -28113 -78848 -47997 19644 9571
16301 9571 -24929 5464 57190 47526 77164 57445 25044 -20723 -59194 -43576 -43511 -54300 -41429
16288 -41429 -17664 -23152 37543 66524 -14326 -30303 -61577 -63277 -5102 -34029 -58991 -90691
16276 -90691 -57393 -29539 -24867 67806 91075 66355 109194 104157 93167 -23359 -106665 -90394
16264 -90394 -72426 -86667 -86231 -119927 -167734 -172271 -153487 -108108 -100337 -95798 -160917 -144704 -97734
16251 -97734 -22373 -3396 -1124 44515 9251 -24952 -21580 -27722 -53275 -52487 -41781 18140 66892
16238 66892 63555 46375 -347 -54793 -88111 -108528 -52663 -8854 4331 30584 23593 10
$$ packed form
16325C8192j757J5050m5878j090R1119N9922o221J7450m7988q4903J8735K7725
16313H0356o5968j6176M1917K33l2046q2801m179N0551n0735L0851O7641j0073
16301I571l4500L0393N1726r664K9638j9719l2401m5767l8471J5618O5j0789J2871
16288d1429K3765n488O0695K8981q0850j5977l1274j700N8175k8927k4962l1700
16276i0691L3298K7854M672R2673K3269k4720M2839n037j0990j16526q3306J6271
16264i0394J7968j4241M36l3696m7807m537J8784M5379P771M539o5119J6213M6970
16251i7734P5361J8977K272M5639l5264l4203L372o142k5553P88J0706N9921M8752
16238F6892l337j7180m6722n4446l3318k0417N5865M3809J3185K6253o991k3583
$$ plain form
16226 10 -42988 -78961 -45728 2300 106725 152146 125290 153630 96753 107418 112472 156809
16214 156809 79551 32575 55342 55022 68319 50821 20210 -1512 -31853 -42476 -37621 -13483
16202 -13483 457 4205 -17665 18160 72700 26763 -76264 -98251 -125140 -90872 -45945 -41299
16190 -41299 -30807 -49246 -133308 -133781 -60196 -15833 -7690 -5620 -99712 -54915 -86977 -167596
16178 -167596 -110845 -104013 -102720 -73067 -30279 7260 13351 16527 -75429 -120697 -75184 -25258
16166 -25258 -23125 -27696 19481 51525 36359 59110 44080 -45040 -23233 19121 101121 120790
16154 120790 -35051 -145896 -127112 -141033 -93609 -57052 -43610 -106624 -44596 -26211 -51033
16143 -51033 8188 31760 79689 180035 167465 131617 76171 -48395 -59028 -106816 -34863
$$ packed form
16226A0m2998l5973L3233M8028J04425M5421k6856K8340n6877J0665N054M4337
16214A56809p7258m6976K2767l20J3297j7498l0611k1722l0341j0623M855K4138
16202a3483J3940L748k1870L5825N4540m5937j03027k1987k6889L4268M4927M646
16190d1299J0492j8439q4062m73P3585M4363Q143K070r4092M4797l2062q0619
16178a67596N6751O832J293K9653M2788L7539O091L176r1956m5268M5513M9926
16166b5258K133m571M7177L2044j5166K2751j5030q9120K1807M2354Q2000J9669
16154A20790j55841j10845J8784j3921M7424L6557J3442o3014O2028J8385k4822
16143e1033N9221K3572M7929J00346j2570l5848n5446j24566j0633m7788P1953
$$ plain form
16132 -34863 -27989 -65949 -93373 -93772 -43044 -83781 -98560 -59502 -52092 -71266 -122571 -145287
16120 -145287 -87210 -32300 -98756 -114286 -70716 -68245 -41994 26531 76919 67341 -19367 -9486
16108 -9486 20381 11410 62386 39276 -7834 -61878 -42395 -24269 -16411 -41892 7208 -31938
16096 -31938 -87693 -34527 -12555 25790 -1223 -41975 -34280 -36219 -21769 -7061 28499 98102
16084 98102 136177 131891 85430 15233 -3332 -12752 22526 23382 -23055 -31357 -25625 -71727 -50349
16071 -50349 -1476 -32353 -14131 -18467 49545 -17229 -66983 -20790 -14680 25471 -15938 -80360
16059 -80360 -142671 -77753 -7462 -16812 -3153 -65991 -45557 -13184 -6942 -77797 -106419 -30582
16047 -30582 -62788 -70849 55609 97771 86449 51680 24344 54511 34034 -43321 -52344 -38965
$$ packed form
16132c4863O874l7960k7424l99N0728m0737j4779L9058P410j9174n1305k2716
16120a45287N8077N4910o6456j5530M3570K471K6251O8525N0388r578q6708R881
16108i486K9867q971N0976k3110m7110n4044J9483J8126P858k5481M9100l9146
16096c1938n5755N3166K1972L8345k7013m0752P695j939J4450J4708L5560O9603
16084I8102L8075m286m6461p0197j8565r420L5278Q56m6437q302N732m6102K1378
16071e0349M8873l0877J8222m336O8012o6774m9754M6193O110M0151m1409o4422
16059h0360o2311O4918P0291r350J3659o2838K0434L2373O242p0855k8622P5837
16047c0582l2206q061J26458M2162j1322l4769k7336L0167k0477p7355r023J3379
$$ plain form
16035 -38965 18019 47996 33923 11059 -30764 -35333 -72483 -89757 -83979 -89763 -90164 -30845 360
16022 360 27720 -4832 -17612 -68030 -65378 -61872 -91357 -120392 -64495 -80764 -82301 -78687 -19962
16009 -19962 -543 -28403 11425 -19264 -73755 -42583 -46723 -7419 52238 74447 76252 43232
15997 43232 36067 23441 -67135 -97990 -21092 -110119 -111086 -43946 -47268 -98162 -60203 8348
15985 8348 34437 8544 -14132 -45956 -78524 -59120 -75757 -48519 -93378 -140294 -152513 -136926
15973 -136926 -90198 29142 64707 32487 27285 43431 26875 48245 88279 121889 48764
15962 48764 -12509 -66483 -23443 -60016 -15510 -30367 -37538 -6534 16795 35619 -13314 26295
15950 26295 11364 -28955 -21711 67459 24360 18372 44645 30837 -2850 -16616 -55283 -98533
$$ packed form
16035c8965N6984K9977j4073k2864m1823m569l7150j7274N778n784m01N9319L1205
16022C60K7360l2552j2780n0418K652L506k9485k9035N5897j6269j537L614N8725
16009a9962J9419k7860L9828l0689n4491L1172m140L9304N9657K2209J805l3020
15997D3232p165j2626r0576l0855P6898q9027r67O7140l322n0894L7959O8551
15985H348K6089k5893k2676l1824l2568J9404j6637K7238m4859m6916j2219J5587
15973a36926M6728J19340L5565l2220n202J6146j6556K1370M0034L3610p3125
15962D8764o1273n3974M3040l6573M4506j4857p171L1004K3329J8824m8933L9609
15950B6295j4931m0319P244Q9170m3099n988K6273j3808l3687j3766l8667m3250
$$ plain form
15938 -98533 -124349 -139979 -145336 -92752 -97564 -70866 -99817 -111758 -23114 28750 2961 2992 10753
15925 10753 -11569 -20225 -69217 -108315 -99742 -68828 -35959 14137 19563 -7237 16881 29558
15913 29558 48522 74598 52439 -34515 38913 19994 2192 65449 131270 109337 91833 155273
15901 155273 139733 128187 167639 158003 85222 56672 108331 87574 39395 -40991 -13849 4132
15889 4132 25718 74382 117957 67003 54155 20960 15242 -14119 -62563 -54971 25667 54078
15877 54078 53247 30213 4483 71728 171586 131076 38028 23807 -4160 -4960 107745 127702
15865 127702 137374 172547 169005 135269 54976 37160 52590 -5159 -47777 -56850 6367 17972
15853 17972 35832 -11177 -84882 -122722 -95034 -131482 -129070 -74501 30288 37091 -21305 -59043
$$ packed form
15938i8533k5816j5630n357N2584m812K6698k8951j1941Q8644N1864k5789L1P761
15925A0753k2322q656m8992l9098Q573L0914L2869N0096N426k6800K4118J2677
15913B9558J8964K6076k2159q6954P3428j8919j7802O3257O5821k1933j7504O3440
15901A55273j5540j1546L9452r636p2781k8550N1659k0757m8179q0386K7142J7981
15889D132K1586M8664M3575n0954j2848l3195n718k9361m8444P592Q0638K8411
15877E4078q31k3034k5730O7245R9858m0510r3048j4221k7967q00J12705J9957
15865A27702R672L5173l542l3736q0293j7816J5430n7749m2618r073O3217J1605
15853A7972J7860m7009p3705l7840K7688l6448K412N4569J04789O803n8396l7738
$$ plain form
15841 -59043 -41863 10793 88815 100697 103506 75203 -36022 -95968 -74241 -35593 -53955 -78403
15829 -78403 -30503 -9799 37663 38505 47990 63408 46399 -15289 -47823 -5473 4570 -17584
15817 -17584 5656 -1398 -49693 -104999 -73677 -1627 -8836 -46707 -55263 -90987 -123696 -55161
15805 -55161 7774 28918 -21814 -45248 -19888 -35537 -67815 -98979 -102132 -65306 -69198 -10953
15793 -10953 17382 -12710 -23938 -40840 -96357 -31316 48573 46219 50400 34871 33001 68535
15781 68535 71771 47884 6624 26743 45069 -18329 -37065 -40301 16429 39929 27259 38587
15769 38587 73752 68205 6306 -27070 38958 82186 92008 54719 -12027 -11400 77195 87817
15757 87817 110979 61749 -72053 -44268 -18418 -23502 14216 64690 125601 125800 24876 11258
$$ packed form
15841e9043J7180N2656P8022J1882K809k8303j11225n9946K1727L8648j8362k4448
15829g8403M7900K0704M7462Q42R485J5418j7009o1688l2534M2350J0043k2154
15817a7584K3240p054m8295n5306L1322P2050p209l7871q556l5724l2709O8535
15805e5161O2935K1144n0732k3434K5360j5649l2278l1164l153L6826l892N8245
15793a0953K8335l0092j1228j6902n5517O5041P9889k354M181j5529j870L5534
15781F8535L236k3887m1260K0119J8326o3398j8736l236N6730K3500j2670J1328
15769C8587L5165n547o1899l3376O6028M3228R822l7289o6746O27Q8595J0622
15757H7817K3162m9230j33802K7785K5850n084L7718N0474O0911J99j00924j3618
$$ plain form
15745 11258 25500 17607 2094 48231 20350 -743 -24495 12718 59906 365 -55559 -77063
15733 -77063 -55162 -62810 8699 53666 67914 15888 62 19404 11698 8610 -69800 -59588
15721 -59588 -1930 14071 -12799 -4855 -5391 -30497 -111420 -86410 -39041 -15001 -48544 -18314
15709 -18314 41391 37571 27796 39858 36171 31716 16856 -20060 -14529 35214 57621 92888 46414
15696 46414 12895 4827 -1097 -5843 27071 48764 83817 82324 -3938 -33830 -33550 -106901 -49172
15683 -49172 15287 64195 108555 126120 123051 94666 -34549 -42104 17472 -58620 -125716 -101582
15671 -101582 -49135 30639 106992 79127 30576 65902 92527 113378 43021 30060 16550
15660 16550 -50015 -47682 -85256 -71620 -80902 -104274 -112493 -127716 -74123 -62994 -105986 -126655
$$ packed form
15745A1258J4242p893j5513M6137k7881k1093k3752L7213M7188n9541n5924k1504
15733g7063K1901p648P1509M4967J4248n2026j5826J9342p706l088p8410J0212
15721e9588N7658J6001k6870P944n36k5106q0923K5010M7369K4040l3543L0230
15709a8314N9705l820r775J2062l687m455j4860l6916N531M9743K2407L5267m6474
15696D6414l3519q068n924m746L2914K1693L5053j493q6262k9892K80p3351N7729
15683d9172O4459M8908M4360J7565l069k8385j29215p555N9576p6092o7096K4134
15671a01582N2447P9774P6353k7865m8551L5326K6625K0851p0357j2961j3510
15660A6550o6565K333l7574J3636r282k3372q219j5223N3593J1129m2992k0669
$$ plain form
15648 -126655 -89461 22280 51361 59978 82409 118821 96628 52681 45666 73150 53258 -42902
15636 -42902 -131044 -153327 -98588 -113453 -89598 -61511 14994 103874 98353 35479 -24006 -758
15624 -758 8269 54949 52047 49122 5953 -8484 -50842 -37046 -7908 -41088 -70377 -25956 7188
15611 7188 -514 -61243 -47046 1644 -87180 -109710 -121863 -83624 -15852 -32773 -50007 -72178
15599 -72178 -128602 -146697 -50478 10146 -28294 -16276 -33628 -73521 -81246 -52655 -21858 18881
15587 18881 10099 -1540 17179 12300 -19140 1566 -18550 -63662 -72692 -47135 -36034 -89653
15575 -89653 -38622 17834 2339 -29491 -4836 -13546 -3012 36585 24428 -12074 102865 155737
15563 155737 170725 124845 92428 40914 -19110 20777 -1198 -1600 59156 78547 92992 39136
$$ packed form
15648a26655L7194J11741K9081Q617K2431L6412k2193m3947p015K7484j9892r6160
15636d2902q8142k2283N4739j4865K3855K8087P6505Q8880n521o2874n9485K3248
15624g58R027M6680k902k925m3169j4437m2358J3796K9138l3180k9289M4421L3144
15611G188p702o0729J4197M8690q8824k2530j2153L8239O7772j6921j7234k2171
15599g2178n6424j8095R6219O0624l8440J2018j7352l9893p725K8591L0797M0739
15587A8881q782j1639J8719m879l1440K0706k0116m5112r030K5557J1101n3619
15575h9653N1031N6456j5495l1830K4655q710J0534L9597j2157l6502J14939N2872
15563A55737J4988m5880l2417n1514o0024L9887k1975m02O0756J9391J4445n3856
$$ plain form
15551 39136 19034 -8644 -27006 -41660 -4199 -10670 -42799 7661 79171 96832 -39715 -102860
15539 -102860 -122481 -110330 -33711 -25196 -13167 -66900 -77374 -47727 -62483 4618 18921 -31035
15527 -31035 -19832 -26955 -65926 -44813 3568 7995 -11319 -61274 23201 46567 -32290 -32588
15515 -32588 -39874 -28938 26426 8296 63136 112637 57444 33355 26648 -45109 -61995 -47413
15503 -47413 -84646 -135208 -63729 44856 80977 102918 115652 151978 168704 115633 122193 76711
15491 76711 87721 94303 113818 117892 62711 21611 -19604 -32115 36789 45415 93171 72677
15479 72677 46340 -20390 -55315 -49746 -37307 -42248 -30391 16451 29436 39456 109564 41191
15467 41191 14814 22249 12423 1316 -66 -15604 2630 -15021 -9193 -8815 31824 67592 36262
$$ packed form
15551C9136k0102k7678j8362j4654L7461o471l2129N0460P1510J7661j36547o3145
15539a02860j9621J2151P6619Q515J2029n3733j0474K9647j4756O7101J4303m9956
15527c1035J1203p123l8971K1113M8381M427j9314m9955Q4475K3366p8857k98
15515c2588p286J0936N5364j8130N4840M9501n5193k4089o707p1757j6886J4582
15503d7413l7233n0562P1479J08585L6121K1941J2734L6326J6726n3071O560m5482
15491G6711J1010O582J9515M074n5181m1100m1215j2511O8904Q626M7756k0494
15479G2677k6337o6730l4925N569J2439m941J1857M6842J2985J0020P0108o8373
15467D1191k6377P435r826j1107j382j5538J8234j7651N828L78M0639L5768l1330
$$ plain form
15454 36262 56884 8908 -28987 -59758 -46745 -31315 5209 -10967 -29121 -3817 29726 27960
15442 27960 -36458 -71550 -106250 -37986 -73891 -29326 31231 40398 61792 34759 1854 4086
15430 4086 21062 3297 -1230 89002 71854 -34348 -11497 3663 21070 36155 11550 18164
15418 18164 21587 -1796 12733 6278 -39055 -80876 -58917 45918 84202 60737 169743 85727
15406 85727 7313 -65107 -96224 -86151 -37821 25718 -24655 -8396 15945 -11463 23398 -34970
15394 -34970 -55245 -45148 -31358 8808 42972 28 -23760 -61816 -38935 17519 -18455 -80608
15382 -80608 -37002 -26402 -18530 22194 32257 104938 159953 196874 172138 121598 117870 60849
15370 60849 -30008 -46561 -43464 28383 38453 29715 31752 -14795 -16286 -1775 -13300 -27603
$$ packed form
15454C6262K0622m7976l7895l0771J3013J5430L6524j6176j8154K5304L3543j766
15442B7960o4418l5092l4700O8264l5905M4565O0557R167K1394k7033l2905K232
15430D086J6976j7765m527R0232j7148j06202K2851J5160J7407J5085k4605O614
15418A8164L423k3383J4529o455m5333m1821K1959J04835L8284k3465J09006q4016
15406H5727p8414p2420l1117J0073M8330O3539n0373J6259K4341k7408L4861n8368
15394c4970k0275J0097J3790M0166L4164m2944k3788l8056K2881N6454l5974o2153
15382h0608M3606J0600P872M0724J0063P2681N5015L6921k4736n0540l728n7021
15370F0849r0857j6553L097P1847J0070q738K037m6547j491J4511j1525j4303
$$ plain form
15358 -27603 -23984 7027 -15210 -15010 -14460 -47367 -55953 -27938 -2003 38719 16015 -3915 -2003
15345 -2003 -13215 -34148 -30165 -15431 -19378 17363 46570 40035 66328 110546 96637 69490
15333 69490 28478 3888 -73195 -109299 -78992 -87791 -84957 -63057 -50881 -24957 550 -71322
15321 -71322 -125855 -96862 -94639 -81174 -9899 70457 28083 -70480 -164444 -134753 -85003 -27154
15309 -27154 -14114 59237 78022 16384 -24564 -13155 -25629 -30165 -49428 -18954 820 20337
15297 20337 101559 43655 -16863 -45089 -40819 -50184 9779 85943 106805 52375 24024 14968
15285 14968 44420 22190 46929 34763 76893 -19343 -66927 -77959 -143596 -172804 -109506 -88099
15273 -88099 -20590 47650 68916 71267 65058 98265 78797 -4104 9536 -97220 -56830 55762
$$ packed form
15358b7603L619L1011k2237K00N50l2907q586K8015K5935M0722k2704j9930J912
15345b003j1212k0933L983J4734l947L6741K9207o535K6293M4218j3909k7147
15333F9490m1012k4590p7083l6104L0307q799K834K1900J2176K5924K5507p1872
15321g1322n4533K8993K223J3465P1275Q0356m2374r8563r3964K9691M9750N7849
15309b7154J3040P3351J8785o1638m0948J1409j2474m536j9263L0474J9774J9517
15297B0337Q1222n7904o0518k8226M270r365N9963P6164K0862n4430k8351r056
15285A4968K9452k2230K4739j2166M2130r6236m7584j1032o5637k9208O3298K1407
15273h8099O7509O8240K1266K351o209L3207j9468q2901J3640j06756M0390J12592
$$ plain form
15261 55762 75559 81926 106839 39267 -39388 3532 27583 17882 38317 30702 23775 30191 35007
15248 35007 41305 67064 109977 65953 15183 10001 -53798 -55688 -60331 58201 35854 -27773
15236 -27773 -19600 -31983 -9745 -6508 -9883 32949 -24382 -55867 -16426 26032 56728 113518
15224 113518 137124 128516 94986 79705 83712 56144 -22722 -51306 -59472 -17407 -77177 -112423
15212 -112423 -80051 7250 12426 -72974 -113589 -56920 19010 -3437 32961 71959 54612 106
15200 106 -36109 -30602 -8635 68824 112711 126254 102557 79095 55857 -15902 6390 10806
15188 10806 7165 -61730 10274 108363 81565 11960 -18677 -23795 -23169 -14607 55235 82963 93194
15175 93194 103888 67319 9170 50095 34905 27447 3887 -43366 -81902 -101051 -76209 -95101
$$ packed form
15261E5762J9797O367K4913o7572p8655M2920K4051r701K0435p615o927O416M816
15248C5007O298K5759M2913m4024n0770n182o3799j890m643J18532k2347o3627
15236b7773Q173j2383K2238L237l375M2832n7331l1485L9441M2458L0696N6790
15224A13518K3606q608l3530j5281M007k7568p8866k8584q166M2065n9770l5246
15212a12423L2372Q7301N176q5400m0615N6669P5930k2447L6398L8998j7347n4506
15200A06l6215N507K1967P7459M3887J3543k3697k3462k3238p1759K2292M416
15188A0806l641o8895P2004R8089k6798o9605l0637n118O26Q562O9842K7728J0231
15175I3194J0694l6569n8149M0925j5190p458k3560m7253l8536j9149K4842j8892
$$ plain form
15163 -95101 -83026 -125675 -120638 -99050 -95611 -114465 -81409 -32039 -22989 -8604 -40688 -68201
15151 -68201 -92354 -160355 -146910 -70124 -74430 -91961 -60567 -63944 -22741 -36093 -48163 6429
15139 6429 15687 31541 2633 16597 -3257 -26535 -30203 -32055 -72935 -26397 -15484 -19806 16624
15126 16624 -4158 -57280 -116572 -99769 -80636 -13231 -6274 -65404 -64470 -70198 -18891 33676
15114 33676 50722 76447 47297 30407 15228 2474 61516 48045 12617 -575 -22490 -54835
15102 -54835 13176 11691 -5709 92407 113772 81741 3278 -21939 -23282 -26526 19262 60314
15090 60314 41033 41719 103533 85489 -1963 -6954 69259 86497 53566 56365 -7354 -63660
15078 -63660 -67012 -24837 -89056 -61172 19417 -6046 10651 11485 4052 -38093 -49156 -65519
$$ packed form
15163i5101J2075m2649N037K1588L439j8854L3056M9370R050J4385l2084k7513
15151f8201k4153o8001J3445P6786m306j7531L1394l377M1203j3352j2070N4592
15139F429R258J5854k8908J3964j9854k3278l668j852m0880M6538J0913m322L6430
15126A6624k0782n3122n9292J6803J9133O7405O957n9130R34n728N1307N2567
15114C3676J7046K5725k9150j6890j5179j2754N9042j3471l5428j3192k1915l2345
15102e4835O8011j485j7400R8116K1365l2031p8463k5217j343l244M5788M1052
15090F0314j9281O86O1814j8044q7452m991P6213J7238l2931K799o3719n6306
15078f3660l352M2175o4219K7884Q0589k5463J6697Q34p433m2145j1063j6363
$$ plain form
15066 -65519 -60186 -56142 -82648 -99530 -52843 167 46967 101492 49245 27326 13922 11632
15054 11632 64714 105373 75075 34632 -14177 6834 79262 94549 101234 88066 83735 69900
15042 69900 37022 80484 70562 46225 -44251 -39700 -5607 -26224 -9336 31663 8532 -27167
15030 -27167 -64164 35572 21878 -14272 6958 28174 -30784 1776 -10957 -36479 -72110 -48628
15018 -48628 4156 8811 1560 28366 114449 98107 62556 56832 152273 257150 307590 403547
15006 403547 491205 723002 902923 1074832 1259264 1446593 1285862 932332 705948 477804
14996 477804 323034 285321 274383 289660 307546 262804 134192 100103 119228 130703 90545
14985 90545 140275 212387 172067 169540 154695 81276 23211 25082 -5414 -14754 4965 17688
$$ packed form
15066f5519N333M044k6506j6882M6687N3010M6800N4525n2247k1919j3404k290
15054A1632N3082M0659l0298m0443m8809K1011P2428J5287O685j3168m331j3835
15042F9900l2878M3462r922k4337r0476M551L4093k0617J6888M0999k3131l5699
15030b7167l6997R9736j3694l6150K1230K1216n8958L2560j2733k5522l5631K3482
15018d8628N2784M655p251K6806Q6083j6342l5551n724R5441J04877N0440R5957
15006D03547Q7658K31797J79921J71909J84432J87329j60731l53530k26384k28144
14996D77804j54770l7713j0938J5277J7886m4742j28612l4089J9125J1475m0158
14985I0545M9730P2112m0320k527j4845p3419n8065J871l0496r340J9719J2723
$$ plain form
14973 17688 54619 32946 23092 -7256 -13449 73748 177794 200935 116078 92430 129588 172343
14961 172343 154142 179079 98836 32292 31658 95112 95193 46824 15573 51766 43245 85857 129239
14948 129239 111955 98795 147270 175571 123560 137404 152046 138555 107331 49789 3740
14937 3740 56340 100691 100717 27885 -39897 -8479 76868 143999 169440 179833 217043 176451
14925 176451 34108 -69216 -82828 -10267 60794 91211 87798 45704 -9257 -104670 -109741
14914 -109741 -15497 10432 -52490 -137218 -111587 -17252 -29991 -68419 12125 103677 38001
14903 38001 -1801 51666 80516 117292 138563 26470 -45403 -4423 40104 44124 -10818 800
14891 800 9592 30713 34138 -956 1631 3553 33725 24535 30567 75180 90544 51803 14502
$$ packed form
14973A7688L6931k1673r854l0348o193Q7197J04046K3141q4857k3648L7158M2755
14961A72343j8201K4937q0243o6544o34O3454Q1m8369l1251L6193q521M2612M3382
14948A29239j7284j3160M8475K8301n2011J3844J4642j3491l1224n7542m6049
14937C740N2600M4351K6p2832o7782L1418Q5347O7131K5441J0393L7210m0592
14925A76451j42343j03324j3612P2561P1061L0417l413m2094n4961r5413n071
14914a09741R4244K5929o2922q4728K5631R4335j2739l8428Q0544R1552o5676
14903C8001l9802N3467K8850L6776K1271j12093p1873M0980M4527M020n4942J1618
14891H00Q792K1121L425l5094K587J922L0172r190O032M4613J5364l8741l7301
$$ plain form
14878 14502 -28851 -24096 -34181 19816 16176 31613 50251 11203 64317 62743 17854 65644
14866 65644 92298 52368 70324 97011 58854 12883 17279 14695 -47349 -65663 9644 -18305
14854 -18305 -30754 12990 25931 -28724 -78203 -105206 -105232 -142121 -104893 -102500 -114137 -106747 -71546
14841 -71546 -70105 -82547 -95969 -94157 -77538 750 72519 109072 117446 74385 41223 58420
14829 58420 -6439 -35920 -57233 -62313 -48535 -52795 -29108 -29089 9239 55103 31680 85183 76029
14816 76029 112886 135423 76998 -27766 -47985 -58905 -11792 -39811 -60233 -15503 53168
14805 53168 43808 -36042 -82863 -38346 11771 8102 -11424 -19006 -104 7462 -7239 -16217 -27078
14792 -27078 15864 -18738 -62815 -90738 -104883 -100634 -59369 -69141 -55873 -7290 27861 13965
$$ packed form
14878A4502m3353M755j0085N3997l640J5437J8638l9048N3114j574m4889M7790
14866F5644K6654l9930J7956K6687l8157m5971M396k584o2044j8314P5307k7949
14854a8305j2449M3744J2941n4655m9479k7003k6l6889L7228K393j1637P390L5201
14841g1546J441j2442j3422J812J6619P8288P1769L6553Q374m3061l3162J7197
14829E8420o4859k9481k1313n080J3778m260K3687J9L8328M5864k3423N3503r154
14816G6029L6857K2537n8425j04764k0219j0920M7113k8019k0422M4730O8671
14805E3168r360p9850m6821M4517N0117l669j9526p582J8902P566j4701q978j0861
14792b7078M2942l4602m4077k7923j4145M249M1265r772J3268M8583L5151j3896
$$ plain form
14780 13965 66479 83282 -7342 -55681 -49698 -7802 40217 37127 10909 13110 -37936 -115626
14768 -115626 -90933 -41596 -55190 -26191 -16642 -29308 -57567 -30622 -52461 -53258 -34707 -23191
14756 -23191 -5974 10030 5122 6298 -21924 11390 42825 37638 38947 63913 10538 19717 -38127
14743 -38127 -52971 -55140 -66361 -62392 -69888 15037 41017 48266 51901 32164 46123 90365 138761
14730 138761 187770 137194 84168 73875 93057 103438 123755 107429 128028 97079 -19147
14719 -19147 14778 55686 49373 27215 -11779 17824 57730 80884 47223 -3973 40929 80867
14707 80867 133035 68724 -16492 -35254 25664 98589 89852 74540 76855 -2664 -19726 -50497
14695 -50497 -30662 37897 96018 66233 5920 14460 757 -47472 -90842 -24569 54297 -12128
$$ packed form
14780A3965N2514J6803r0624m8339N983M1896M8019l090k6218K201n1046p7690
14768a15626K4693M9337j3594K8999R549j2666k8259K6945k1839p97J8551J1516
14756b3191J7217J6004m908J176k8222L3314L1435n187J309K4966n3375R179n7844
14743c8127j4844k169j1221L969p496Q4925K5980P249L635j9737J3959M4242M8396
14730A38761M9009n0576n3026j0293J9182J0381K0317j6326K0599l0949j16226
14719a9147L3925M0908o313k2158l8994K9603L9906K3154l3661n1196M4902L9938
14707H0867N2168o4311q5216j8762O0918P2925q737j5312K315p9519j7062l0771
14695e0497J9835O8559N8121k9785o0313Q540j3703m8229m3370O6273P8866o6425
$$ plain form
14683 -12128 -68330 32939 42018 36566 107672 32961 -1075 7253 82181 98680 81750 83287
14671 83287 22903 -50080 -43411 -16821 -35461 -35540 25836 114584 150360 98001 70579 39481
14659 39481 12226 64463 43031 53600 7695 -9738 -20587 15150 -40335 -85511 -74818 -49907
14647 -49907 8162 33422 66447 23839 -54423 -13571 -18194 28014 28570 23142 40162 60354
14635 60354 56325 -14175 -10710 9806 223 75041 78060 102238 117896 159207 155850 90113 84816
14622 84816 62003 46129 -5089 -69523 -44973 -19231 35290 8533 24558 30352 12042 49340
14610 49340 1314 -25229 36622 28671 -5567 -38030 44565 100489 117148 79955 23714 -5987
14598 -5987 -15523 -41337 52524 68806 51257 5506 9970 40139 3449 21343 45896 19573
$$ packed form
14683a2128n6202J01269R079n452P1106p4711l4036Q328P4928J6499j6930J537
14671H3287o0384p2983O669K6590j8640p9O1376Q8748L5776n2359k7422l1098
14659C9481k7255N2237k1432J0569m5905j7433j0849L5737n5485m5176J0693K4911
14647d9907N8069K5260L3025m2608p8262M0852m623M6208N56n428J7020K0192
14635F0354m029p0500L465K0516r583P4818L019K4178J5658M1311l357o5737n297
14622H4816k2813j5874n1218o4434K4550K5742N4521k6757J6025N794j8310L7298
14610D9340m8026k6543O1851p951l4238l2463Q2595N5924J6659l7193n6241k9701
14598e987r536k5814R3861J6282j7549m5751M464L0169l6690J7894K4553k6323
$$ plain form
14586 19573 29566 51932 60196 76607 51983 21648 -11172 72510 108932 14657 25319 31210
14574 31210 52230 31043 -30971 -56871 -25275 41067 54114 54908 63225 52346 121 -30017
14562 -30017 -4589 39252 46548 41066 -29347 -32074 -22081 -10384 -37900 -24535 31861 50533
14550 50533 65433 83553 85397 25972 30345 47473 87528 93457 64358 50330 39328 39745 52541
14537 52541 8826 39546 19688 -47262 -128306 -90904 -66623 -59338 -30549 8014 29645 77491
14525 77491 79080 101654 62972 73677 5917 10764 -21414 -31881 18657 59837 18340 -7003
14513 -7003 48224 37349 -323 -14155 -44595 -37144 2603 -9267 33992 52200 81077 154890
14501 154890 161164 116166 60585 118531 168933 145225 125543 122015 137052 172103 114061 86873
$$ packed form
14586A9573R993K2366Q264J6411k4624l0335l2820Q3682L6422r4275J0662N891
14574C1210K1020k1187o2014k5900L1596O6342J3047P94Q317j0879n2225l0138
14562c0017K5428M3841P296n482p0413k727R993J1697k7516J3365N6396J8672
14550E0533J4900J8120J844n9425M373J7128M0055N929k9099j4028j1002M17J2796
14537E2541m3715L0720j9858o6950q1044L7402K4281P285K8789L8563K1631M7846
14525G7491J589K2574l8682J0705o7760M847l2178j0467N0538M1180m1497k5343
14513g003N5227j0875l7672j3832l0440P451L9747j1870M3259J8208K8877P3813
14501A54890O274m4998n5581N7946N0402k3708j9682l528J5037L5051n8042k7188
$$ plain form
14489 86873 58127 10592 7597 -50460 -66551 -16308 97912 98660 30826 23299 66930 85437
14477 85437 60635 57621 81838 19843 19104 -27212 -61535 -110251 -23352 47060 53749 8497
14465 8497 19498 -9952 -5185 70912 121361 95879 140540 179168 204971 122674 67801 85939
14453 85939 134802 104589 4888 -32901 -42518 5015 115986 117580 78974 86800 95630 -12137
14441 -12137 -61682 -2205 -47066 -80860 -73820 -53381 -72771 -59924 -28735 4817 63234 22383
14429 22383 83 64508 172480 157704 148496 102440 92039 157950 185480 113043 117524 108555
14417 108555 108182 250357 386186 483176 481847 480959 561297 573872 615269 594999 518771 383121
14405 383121 373854 374289 219894 124549 93829 151628 183366 192041 202489 208731 177400 150886
$$ packed form
14489H6873k8746m7535k995n8057j6091N0243J14220P48o7834p527M3631J8507
14477H5437k4802l014K4217o1995p39m6316l4323m8716Q6899P0412O689m5252
14465H497J1001k9450M767P6097N0449k5482M4661L8628K5803q2297n4873J8138
14453H5939M8863l0213r9701l7789r617M7533J10971J594l8606P826Q830j07767
14441a2137m9545N9477m4861l3794P040K0439j9390J2847L1189L3552N8417m0851
14429B2383k2300O4425J07972j4776r208m6056j0401O5911K7530p2437M481q969
14417A08555l73J42175J35829R6990j329q88Q0338J2575M1397k0270p6228j35650
14405C83121r267M35j54395r5345l0720N7799L1738Q675J0448O242l1331k6514
$$ plain form
14393 150886 149308 67447 6294 9152 19350 32068 85684 77868 91352 64851 30490 46182
14381 46182 -3271 26751 68699 65449 62765 72658 33999 -6127 29854 21979 6534 15568 -10574
14368 -10574 -25134 -56588 -5221 32282 66196 94183 30140 23334 3742 54700 71852 30966
14356 30966 56233 19383 -22337 44647 33925 47486 98681 69202 36986 -55054 -67943 -31749
14344 -31749 24763 146789 160827 99529 8707 -75418 -57272 -68215 -78094 -35252 -62 -34866
14332 -34866 -66710 -73985 -97381 -77426 -12160 2368 -11106 -64923 -90354 11295 10192 10191 21098
14319 21098 -45553 -6435 22385 -16687 -12727 3248 -1462 87664 40004 -57135 -75078 -24518
14307 -24518 39225 20143 47633 62471 -2260 25068 8202 16186 65934 64394 67941 59431
$$ packed form
14393A50886j578q1861o1153K858J0198J2718N3616p816J3484k6501l4361J5692
14381D6182m9453L0022M1948l250k684R893l8659m0126L5981p875j5445R034k6142
14368a0574j4560l1454N1367L7503L3914K7987o4043o806j9592N0958J7152m0886
14356C0966K5267l6850m1720O6984j0722J3561N1195k9479l2216r2040j2889L6194
14344c1749N6512J22026J4038o1298r0822q4125J8146j0943r879M2842L5190l4804
14332c4866l1844p275k3396J9955O5266J4528j3474n3817k5431J01649j103jJ0907
14319B1098o6651L9118K8820l9072L960J5975m710Q9126m7660r7139j7943N0560
14307b4518O3743j9082K7490J4838o4731K7328j6866P984M9748j540L547q510
$$ plain form
14295 59431 51040 108539 81758 65676 80095 87248 68551 18065 7946 32892 33900 49421
14283 49421 33309 30474 -31007 -48184 -81335 -105562 -164242 -119021 -67363 -62178 -40213 -83254
14271 -83254 -102554 -106712 -30359 2804 -459 47975 3163 -46933 -101124 -126091 -138758 -23991
14259 -23991 45741 18038 15283 8397 17239 -6613 6340 -36000 -15017 29425 -21392 12378
14247 12378 8256 31884 15653 -42887 14531 97350 63631 7495 -31049 -35399 -2833 -26634
14235 -26634 -42377 -9944 22676 52515 35166 31264 33364 -16508 -92511 -70809 -72707 -7083
14223 -7083 36710 -41910 18022 102656 125167 134362 93999 99122 82009 23762 24518 34709 26066
14210 26066 28267 37881 113904 80162 11822 17149 24620 52713 30908 90499 128864 149661
$$ packed form
14295E9431q391N7499k6781j6082J4419P153j8697n0486j0119K4946J008J5521
14283D9421j6112k835o1481j7177l3151k4227n8680M5221N1658N185K1965m3041
14271h3254j9300m158P6353L3163l263M8434m4812n0096n4191k4967j2667J14767
14259b3991O9732k7703k755o886Q842k3852J2953m2340K0983M4442n0817L3770
14247A2378m122K3628j6231n8540N7418Q2819l3719n6136l8544m350L2566k3801
14235b6634j5743L2433L2620K9839j7349l902K100m9872p6003K1702j898O5624
14223g083M3793p8620N9932Q4634K2511R195m0363N123j7113n8247P56J0191q643
14210B6066K201R614P6023l3742o8340N327P471K8093k1805N9591L8365K0797
$$ plain form
14198 149661 143352 128819 97976 100073 69709 11890 -13826 -3024 4355 23423 73057 56637
14186 56637 24192 10409 -31693 -83637 -91729 -84188 -53657 -1369 53633 47780 -11046 -31956
14174 -31956 -1230 -12964 4223 17536 81359 111524 25308 -9640 53925 43125 44680 63949
14162 63949 63588 11077 -22497 -5533 15139 14941 14430 -17383 -24890 24096 99261 80817 103207
14149 103207 88780 92161 49749 -50220 -82683 -57129 32914 87940 74883 123324 89021 49434
14137 49434 15695 -55220 -28625 21201 16897 11935 1092 68657 92171 80536 75266 98225
14125 98225 108817 67490 10165 -5239 56407 72377 57556 31700 17444 37790 30066 46182
14113 46182 5236 42544 31377 24185 -30974 -96904 -81282 12682 34516 -19438 31155 39970
$$ packed form
14198A49661o309j4533l0843K097l0364n7819k5716J0802P379J9068M9634j6420
14186E6637l2445j3783m2102n1944q092P541L0531N2288N5002n853n8826k0910
14174c1956L0726j1734J7187J3313O3823L0165q6216l4948O3565j0800J555J9269
14162F3949l61n2511l3574J6964K0672j98n11l1813p507M8986P5165j8444K2390
14149A03207j4427L381m2412r9969l2463K5554R0043N5026j3057M8441l4303l9587
14137D9434l3739p0915K6595M9826m304m962j0843O7565K3514j1635n270K2959
14125I8225J0592m1327n7325j5404O1646J5970j4821k5856j4256K0346p724J6116
14113D6182m0946L7308j1167p192n5159o5930J5622R3964K1834n3954N0593Q815
$$ plain form
14101 39970 -138 -5362 -41136 -11696 31462 3349 -17365 19657 -44285 -20564 59247 122737
14089 122737 170138 184029 176567 192421 156675 141131 76535 81767 97837 62720 130196 150585
14077 150585 124990 92426 81492 125934 151207 137957 130824 203612 248181 227057 206694 239843
14065 239843 287454 395102 508590 680609 913334 1195462 1661326 2049851 2193176 1941019
14055 1941019 1455056 1139810 899676 673896 585371 520439 464780 433618 376808 329702
14045 329702 326645 369960 408345 355930 302123 294757 249155 231064 308306 360281 345852 300842
14033 300842 286403 281943 253122 245843 207037 201389 231624 258242 257113 219098 234193 185771
14021 185771 183562 179602 164338 211418 204875 156902 163837 216867 221190 207738 262125 234992
$$ packed form
14101C9970m0108n224l5774K9440M3158k8113k0714L7022o3942K3721P9811O3490
14089A22737M7401J3891p462J5854l5746j5544o4596N232J6070l5117O7476K0389
14077A50585k5595l2564j0934M4442K5273j3250p133P2788M4569k1124k0363L3149
14065B39843M7611J07648J13488J72019K32725K82128M65864L88525J43325k52157
14055A941019m85963l15246k40134k25780q8525o4932n5659l1162n6810m7106
14045C29702l057M3315L8385n2415n3807p366m5602j8091P7242N1975j4429m5010
14033C00842j4439m460k8821p279l8806n648L0235K6618j129l8015J5095m8422
14021A85771k209l960j5264M7080o543m7973O935N3030M323j3452N4387k7133
$$ plain form
14009 234992 252638 279877 270110 275478 368029 448144 471036 539325 612123 760732 844422 1014382
13997 1014382 1159234 1332314 1588734 1933300 2499314 3369070 4707074 6899691 9920739
13988 9920739 13065499 15319884 16335062 14448558 10564810 7508705 5620126 4453023
13980 4453023 3687340 3126065 2796206 2598782 2439380 2278295 2128743 1961311 1786974
13971 1786974 1617074 1466534 1405265 1389224 1274915 1261541 1257821 1287234 1292944 1246385 1157884
13960 1157884 1014738 920965 929430 852497 797664 795079 811818 731308 692972 687887 669910 628531
13948 628531 569397 592329 619021 672221 656784 664649 596062 540064 531936 547874 521537 512735
13936 512735 493169 448611 430995 418672 483986 463124 410003 326809 321858 349710 365985 401126
$$ packed form
14009B34992J7646K7239r767N368R2551Q0115K2892O8289P2798J48609Q3690J69960
13997A014382J44852J73080K56420L44566N66014Q69756J338004K192617L021048
13988I920739L144760K254385J015178j886504l883748l056105j888579j167103
13980D453023p65683n61275l29859j97424j59402j61085j49552j67432j74337
13971A786974j69900j50540o1269j6041j14309j3374l720K9413N710m6559q8501
13960A157884j43146r3773Q465p6933n4833k585J6739q0510l8336n085j7977m1379
13948F28531n9134K2932K6692N3200j5437P865o8587n5998q128J5938k6337q802
13936E12735j9566m4558j7616j2323O5314k0862n3121q3194m951K7852J6275L5141
$$ plain form
13924 401126 423567 390731 347199 288614 262720 298189 310790 159576 120817 150522 187593
13913 187593 230684 222825 256814 195268 148968 152520 172202 216147 221212 226830 220422 233777
13901 233777 265889 276497 257547 290056 366060 333195 247262 271580 316495 229408 182512
13890 182512 169384 207967 279047 316218 271762 204322 126378 101871 136024 117981 155636
13879 155636 135890 108204 103283 65615 31414 55376 110608 120392 57645 45952 51265 89327
13867 89327 153288 154014 113024 73226 62255 53216 62226 60103 58583 111518 107394 105924 96114
13854 96114 125310 139089 120272 114572 100734 119927 131154 189969 179309 162491 157534 107641
13842 107641 60679 87888 152916 178195 200013 281987 275628 201471 219724 234801 195840 140176
$$ packed form
13924D01126K2441l2836m3532n8585k5894L5469J2601j51214l8759K9705L7071
13913A87593M3091p859L3989o1546m6300L552J9682M3945N065N618o408J3355
13901B33777L2112J0608j8950L2509P6004l2865q5933K4318M4915q7087m6896
13890A82512j3128L8583P1080L7171m4456o7440p7944k4507L4153j8043L7655
13879A55636j9746k7686m921l7668l4201K3962N5232R784o2747j1693N313L8062
13867H9327O3961P26m0990l9798j0971r039R010k123j520N2935m124j470r810
13854I6114K9196J3779j8817n700j3838J9193J1227N8815j0660j6818m957m9893
13842A07641m6962K7209O5028K5279K1818Q1974o359p4157J8253J5077l8961n5664
$$ plain form
13830 140176 150599 153209 98359 90367 186526 205917 197368 187480 136994 103136 70869 158097
13818 158097 192772 184897 140969 119601 125778 131876 133055 138737 115058 125044 92490 89960 66770
13805 66770 108866 162520 146550 165066 177834 221560 225090 204422 177337 198156 155704 154360
13793 154360 162032 221669 238055 154561 138852 134057 118095 113157 134014 158802 167800 154305
13781 154305 126040 117096 198168 193852 188330 121699 70175 104100 180385 139150 76746 70432
13769 70432 93866 62523 24276 7260 73 17947 29621 -11932 -37833 -65650 -26511 -26542
13757 -26542 -10094 52826 73606 84309 141830 207371 291816 299781 286072 269258 218776 174304
13745 174304 117070 129190 183708 216289 211564 173704 124340 160298 209684 154136 110606 126408
$$ packed form
13830A40176J0423K610n4850p992R6159J9391q549r888n0486l3858l2267Q7228
13818A58097L4675p875m3928k1368O177O098J179N682k3679R986l2554k530k3190
13805F6770M2096N3654j5970J8516J2768M3726L530k0668k7085K0819m2452j344
13793A54360P672N9637J6386q3494j5709m795j5962m938K0857K4788Q998j3495
13781A54305k8265q944Q1072m316n522o6631n1524L3925P6285m1235o2404o314
13769G0432K3434l1343l8247j7016p187J7874J1674m1553k5901k7817L9139l1
13757b6542J6448O2920K0780J0703N7521O5541Q4445P965j3709j6814n0482m4472
13745A74304n7234J2120N4518L2581m725l7860m9364L5958M9386n5548m3530J5802
$$ plain form
13733 126408 138847 216736 268416 287262 294262 220980 250181 347244 348283 270113 216987 179472
13721 179472 202253 209311 199489 211454 234692 205666 172226 255667 360118 438911 437444 515596
13709 515596 584858 569926 491888 453878 441879 377004 392709 358779 339147 383137 368184
13698 368184 360879 357750 363320 354105 389716 355751 357098 379030 357542 416272 436261 444341 468534
13685 468534 434220 441154 459406 476261 505484 538522 508560 482537 538320 515235 505583 477758
13673 477758 461850 474261 549081 568280 644952 557171 474302 431475 443289 530788 571074
13662 571074 584023 612671 595565 551192 537906 570962 682501 751424 722852 734884 708432
13651 708432 656723 630953 603549 608405 596508 634773 765823 891311 945030 967087 971557
$$ packed form
13733A26408J2439P7889N1680J8846P000p3282K9201R7063J039p8170n3126l7515
13721A79472K2781P058r822J1965K3238k9026l3440Q3441J04451P8793j467P8152
13709E15596O9262j4932p8038l8010j1999o4875J5705l3930j9632M3990j4953
13698C68184p305l129N570r215L5611l3965J347K1932k1488N8730J9989Q080K4193
13685D68534l4314O934J8252J6855K9223L3038k9962k6023N5783k3085r652k7825
13673D77758j5908J2411P4820J9199P6672q7781q2869m2827J1814Q7499M0286
13662E71074J2949K8648j7106m4373j3286L3056J11539O8923k8572J2032k6452
13651G08432n1709k5770k7404M856j1897L8265J31050J25488N3719K2057M470
$$ plain form
13640 971557 966359 980197 985625 1016049 1062331 1060325 1098247 1118428 1093942 1129790 1176428 1155876
13628 1155876 1182545 1269541 1329602 1406003 1495882 1560591 1619476 1685034 1735032 1779856 1857383
13617 1857383 2043664 2174987 2287094 2366178 2560066 2724699 2939424 3135218 3438500 3915898
13607 3915898 4438664 4978932 5635601 6228633 6838252 7535489 8297174 9126679 10112583
13598 10112583 11343634 12970228 15160888 18042927 21769595 26311316 31836121 38974205
13590 38974205 48895968 63712192 86293019 121611869 176188531 251457954 328708154
13583 328708154 384653311 410592515 364838743 269584305 193520261 145177723 114715849
13576 114715849 95087094 82001798 72998025 66337193 61170511 57016657 53452444 49892985
$$ packed form
13640I71557n198J3838N428L0424M6282k006L7922K0181k4486L5848M6638k0552
13628A155876K6669Q6996O0061P6401Q9879O4709N8885O5558M9998M4824P7527
13617A857383J86281J31323J12107P9084J93888J64633K14725J95794L03282M77398
13607C915898N22766N40268O56669N93032O09619O97237P61685Q29505R85904
13598A0112583J231051J626594K190660K882039L726668M541721N524805P138084
13590C8974205R921763J4816224K2580827L5318850N4576662P5269423P7250200
13583C28708154N5945157K5939204m5753772r5254438p6064044m8342538l0461874
13576A14715849j9628755j3085296r003773o660832n166682m153854l564213l559459
$$ plain form
13568 49892985 46312679 42760783 39402071 36598943 34391334 32567500 30905823 29465224
13560 29465224 28197885 27141773 26189962 25438170 24651685 23823346 22976868 22163778 21351349
13551 21351349 20540952 19834810 19172762 18378498 17644298 16923514 16253877 15686424 15146587
13542 15146587 14694767 14311538 13978589 13640953 13314685 12910720 12517216 12172178 11831752
13533 11831752 11485066 11166159 10835589 10522709 10231936 9952396 9748643 9400133 8991451
13524 8991451 8669007 8350712 8083671 7811863 7523836 7277469 7125630 6997839 6805840
13515 6805840 6637904 6450323 6260632 6069863 5880415 5791512 5775367 5689724 5568951 5462340
13505 5462340 5359833 5284413 5159365 5007937 4912857 4836047 4692783 4547325 4448753 4272097
$$ packed form
13568D9892985l580306l551896l358712k803128k207609j823834j661677j440599
13560B9465224j267339j056112r51811p51792p86485q28339q46478q13090q12429
13551B1351349q10397p06142o62048p94264p34200p20784o69637n67453n39837
13542A5146587m51820l83229l32949l37636l26268m03965l93504l45038l40426
13533A1831752l46686l18907l30570l12880k90773k79540k03753l48510m08682
13524H991451l22444l18295k67041k71808k88027k46367j51839j27791j91999
13515F805840j67936j87581j89691j90769j89448q8903j6145q5643j20773j06611
13505E462340j02507p5420j25048j51428r5080p6810j43264j45458r8572j76656
$$ plain form
13495 4272097 4169514 4057016 4056154 4037614 3964340 3846637 3739210 3612711 3464098 3286491
13485 3286491 3282344 3257989 3189526 3059415 2931504 2835831 2709980 2571670 2494918 2488779 2530485
13474 2530485 2528949 2451680 2360213 2223010 2156330 2177098 2172978 2120968 2014710 1881663 1882158
13463 1882158 1904218 1853693 1868495 1814699 1713004 1602717 1556700 1607217 1693781 1660432 1617874
13452 1617874 1563542 1561467 1603137 1593160 1563342 1514131 1446700 1438817 1358379 1217009 1076519
13441 1076519 976458 925770 900817 857674 841672 836401 844893 824066 849958 837092 801853
13430 801853 756312 762520 754262 693658 686958 625266 527247 559413 522428 520244 509760 478820
13418 478820 438473 428633 373573 361643 312144 329249 342448 362830 420864 389030 334349 382634
$$ packed form
13495D272097j02583j12498q62j8540p3274j17703j07427j26499j48613j77607
13485C286491m147k4355o8463j30111j27911r5673j25851j38310p6752o139M1706
13474B530485j536p7269r1467j37203o6680K0768m120n2010j06258j33047M95
13463A882158K2060n0525J4802n3796j01695j10287m6017N0517Q6564l3349m2558
13452A617874n4332k075M1670r977k9818m9211o7431p883q0438j41370j40490
13441A076519j00061n0688k4953m3143j6002n271Q492k0827K5892j2866l5239
13430H01853m5541O208q258o0604o700o1692r8019L2166l6985k184j0484l0940
13418D78820m0347r840n5060j1930m9499J7105J3199K0382N8034l1834n4681M8285
$$ plain form
13406 382634 466785 376179 323343 447121 473650 472371 469179 455901 432115 462249 440247 456546
13394 456546 413073 345374 349437 388962 385526 401554 413507 368369 317007 348886 312038 270744
13382 270744 255399 293715 310432 298639 310082 348219 308302 281883 263286 224988 175292
13371 175292 214772 220950 215467 267355 324038 309887 312965 293920 344777 306081 252499 224702
13359 224702 168325 102441 143259 205308 210263 184833 213125 216578 220096 205200 239876 240853
13347 240853 144375 92510 82005 149891 140546 166118 194027 228443 255061 219007 217785 259431
13335 259431 270340 260980 237825 154019 159115 142465 199784 233100 180555 74409 16703 20283
13323 20283 10487 54056 87251 122138 145958 170936 172078 229347 211996 169642 180154 144853
$$ packed form
13406C82634Q4151r0606n2836J23778K6529j279l192j3278k3786L0134k2002J6299
13394D56546m3473o7699M063L9525l436J6028J1953m5138n1362L1879l6848m1294
13382B70744j5345L8316J6717j1793J1443L8137l9917k6419j8597l8298m9696
13371A75292L9480O178n483N1888N6683j4151L078j9045N0857l8696n3582k7797
13359B24702n6377o5884M0818O2049M955k5430K8292L453L518j4896L4676R77
13347B40853r6478n1865j0505O7886r345K5572K7909L4416K6618l6054j222M1646
13335B59431J0909r360k3155q3806N096j6650N7319L3316n2545j06146n7706L580
13323B0283r796M3569L3195L4887K3820K4978J142N7269j7351m2354J0512l5301
$$ plain form
13311 144853 127769 129760 133922 124710 98692 113139 86968 67125 33647 17163 67860 87600
13299 87600 170474 191102 145769 182419 163778 121308 84170 141526 132042 115705 104845 74621
13287 74621 59957 -2452 31650 55390 25364 -24862 7275 14824 -3294 3066 8102 5033
13275 5033 -37353 -51230 -34360 4803 51458 83883 35797 12913 37268 90156 56358 43054
13263 43054 88819 98025 100268 25470 -26998 -11820 -35233 -16688 14059 6208 59965 85680
13251 85680 151357 175462 176973 145479 127468 39363 20008 -24567 42857 -7190 -80855 -86018
13239 -86018 -20124 7694 50573 10117 55951 54256 91940 16574 -16184 15636 -26988 -87457
13227 -87457 -78931 -59558 -11600 7411 -19112 35571 85370 74335 65858 32759 8291 44955
$$ packed form
13311A44853j7084J991M162r212k6018J4447k6171j9843l3478j6484N0697J9740
13299H7600Q2874K0628m5333L6650j8641m2470l7138N7356r484j6337j0860l0224
13287G4621j4664o2409L4102K3740l0026n0226L2137P549j8118O360N036l069
13275E033m2386j3877J6870L9163M6655L2425m8086k2884K4355N2888l3798j3304
13263D3054M5765R206K243p4798n2468J5178k3413J8545L0747p851N3757K5715
13251H5680O5677K4105J511l1494j8011q8105j9355m4575O7424n0047p3665n163
13239h6018O5894K7818M2879m0456M5834j695L7684p5366l2758L1820m2624o0469
13227h7457Q526J9373M7958J9011k6523N4683M9799j1035q477l3099k4468L6664
$$ plain form
13215 44955 44046 17194 -15371 -96764 -41369 -15667 -20952 628 53735 49100 -6185 33349
13203 33349 121824 125964 150343 192724 118664 27932 42442 24831 -8729 -42096 -37981 -5562
13191 -5562 9357 24997 4424 -18027 -21622 -12671 -12851 46462 69361 60737 73921 130613 113885
13178 113885 129753 63128 39505 -25227 -22989 57961 65652 116107 155741 141071 106666 93952
13166 93952 161999 181303 126715 99451 114385 124679 171234 146719 154374 153915 137709 27146
13154 27146 -2603 856 -18898 -9823 -59185 -118009 -56380 -18233 -13602 38797 33790 34301 53714
13141 53714 101297 93171 32052 -35114 -50824 31209 26621 64131 89440 117500 149461 199899
13129 199899 136658 135170 86383 115256 111471 130865 123873 155769 165630 148238 177696 181951
$$ packed form
13215D4955r09k6852l2565q1393N5395K5702n285K1580N3107m635n5285L9534
13203C3349Q8475M140K4379M2381p4060r0732J4510j7611l3560l3367M115L2419
13191e562J4919J5640k0573k2451l595Q951j80N9313K2899q624J3184N6692j6728
13178A13885J5868o6625k3623o4732K238Q0950P691N0455L9634j4670l4405j2714
13166I3952O8047J9304n4588k7264J4934J0294M6555k4515P655m59j6206j10563
13154B7146k9749L459j9754R075m9362n8824O1629L8147M631N2399n007N11J9413
13141E3714M7583q126o1119o7166j5710Q2033m588L7510K5309K8060L1961N0438
13129A99899o3241j488m8787K8873l785J9394o992L1896R861j7392K9458M255
$$ plain form
13117 181951 151649 146856 232166 227131 206947 198807 273143 298704 292816 377242 455783 574976
13105 574976 813275 1119972 1518236 1815587 2046564 2116214 1797019 1365038 1051280 819451
13095 819451 702395 632566 585620 545818 521461 424033 326715 255790 305990 345920 362426
13084 362426 369951 279463 189301 157385 138947 185065 236646 178155 120164 145720 196539 203032
13072 203032 139479 142033 97637 158488 207350 176173 168016 216110 205166 225158 214096 174450
13060 174450 138392 68556 115981 185508 188518 195162 210885 177026 125727 83973 74966 74959 102874
13047 102874 78957 29268 -107485 -92954 -16593 45055 74271 46910 39200 82449 114415
13036 114415 126949 158138 124282 127784 155431 119106 142527 134579 49615 -16527 -73012 -78343
$$ packed form
13117A81951l0302m793Q5310n035k0184q140P4336K5561n888Q4426P8541J19193
13105E74976K38299L06697L98264K97351K30977O9650l19195m31981l13758k31829
13095H19451j17056o9829m6946l9802k4357r7428r7318p0925N0200L9930J6506
13084C62426P525r0488r0162l1916j8438M6118N1581n8491n7991K5556N0819O493
13072B03032o3553K554m4396O0851M8862l1177q157M8094j0944J9992j1062l9646
13060A74450l6058o9836M7425O9527L010O644J5723l3859n1299m1754r007pK7915
13047A02874k3917m9689j36753J4531P6361O1648K9216k7361p710M3249L1966
13036A14415J2534L1189l3856L502K7647l6325K3421p948q4964o6142n6485n331
$$ plain form
13024 -78343 -14353 34492 41491 31942 35339 -6911 11013 49124 126273 111225 57758 62921
13012 62921 53798 27421 5431 103437 181986 142851 112407 104435 110751 101943 106697 57921 30455
12999 30455 -17863 -52412 -49057 17823 49340 114016 114973 92835 72353 26895 25971 39183 98214
12986 98214 81768 11241 -10334 56031 10882 -25681 -30989 -74977 -17492 94272 152698 180619
12974 180619 151749 98982 74988 62440 61635 79529 96499 56271 80303 32394 -31683 -81116
12962 -81116 -57711 -40103 -5107 -39203 -61212 3947 13073 -6157 -96617 -113279 -114062 -94891
12950 -94891 -5727 33825 103523 128158 92521 53610 64393 31037 55658 41335 36862 20312
12938 20312 -12582 85820 98350 50045 69194 16573 46149 126241 76982 -38399 -51694
$$ packed form
13024g8343O3990M8845O999r549L397m2250J7924L8111P7149j5048n3467N163
13012F2921r123k6377k1990R8006P8549l9135l0444p972O316q808M754m8776k7466
12999C0455m8318l4549L355O6880L1517O4676R57k2138k0482m5458r24J3212N9031
12986I8214j6446p0527k1575O6365m5149l6563n308m3988N7485J11764N8426K7921
12974A80619k8870n2767k3994j2548q05J7894J6970m0228K4032m7909o4077m9433
12962h1116K3405J7608L4996l4096k2009O5159R126j9230r0460j6662p83J9171
12950i4891Q9164L9552O9698K4635l5637l8911J0783l3356K4621j4323m473j6550
12938B0312l2894R8402J2530m8305J9149n2621K9576Q0092m9259j15381j3295
$$ plain form
12927 -51694 -24010 -68920 -67134 6027 29696 -6605 12530 2203 -11479 72146 64815 96347
12915 96347 106691 27282 -14387 16204 58967 34933 -5607 16993 5807 -59353 -54152 -5611
12903 -5611 33259 42241 30360 55209 16570 39211 70923 20930 58978 55648 -30811 -93415
12891 -93415 -88311 -64209 -95880 -157792 -112377 -116178 -117631 -39047 3587 63963 54961 37721
12879 37721 -16395 -87947 -49461 -17871 4653 -13484 -80134 -9279 61997 81210 -6430 -73142
12867 -73142 -75401 -41246 -43418 -52569 -66483 -45953 -40624 -9036 8692 61103 113628 114546 61193
12854 61193 471 -28272 -8145 -16754 -49896 -69115 13475 12926 -26334 -7329 -28306 -76188
12842 -76188 -86448 -102870 -115392 -103190 -126077 -66193 -28960 -52183 -50458 -3865 41765 106039
$$ packed form
12927e1694K7684m4910J786P3161K3669l6301J9135j0327j3682Q3625p331L1532
12915I6347J0344p9409m1669L0591M2763k4034m0540K2600j1186o5160N201M8541
12903e611L8870Q982j1881K4849l8639K2641L1712m9993L8048l330q6459o2604
12891i3415N104K4102l1671o1912M5415l801j453P8584M2634O0376r002j7240
12879C7721n4116p1552L8486L1590K2524j8137o6650P0855P1276J9213q7640o6712
12867g3142k259L4155k172r151j3914K0530N329L1588J7728N2411N2525R18n3353
12854F1193o0722k8743K0127q609l3142j9219Q2590n49l9260J9005k0977m7882
12842g6188j0260j6422j2522J2202k2887N9884L7233k3223J725M6593M5630O4274
$$ plain form
12830 106039 88615 63527 4237 -7323 -19614 -13299 -66189 -87964 -24618 55478 97117 81963
12818 81963 144988 166804 183743 227260 217718 179009 60574 59986 103218 68388 44946 51315
12806 51315 38136 62449 5356 -26997 -14678 -26609 -6551 76913 88354 100510 69906 53575
12794 53575 102304 47799 -22105 -61368 -12336 64744 24672 -38321 -24869 34531 13853 -36213
12782 -36213 -28765 11040 40027 -22216 33505 -22721 -31899 -30442 8923 57492 60169 66649 58232
12769 58232 49970 48718 63844 101018 47801 58382 54692 4771 -47996 -33113 34808 5103
12757 5103 -23631 2107 68052 91294 41938 13144 -19072 -29879 -60247 -39825 1650 -16145
12745 -16145 13470 69237 -5755 607 21120 29207 8400 -12909 -57654 -75707 -75454 -93171
$$ packed form
12830A06039j7424k5088n9290j1560j2291O315n2890k1775O3346Q0096M1639j5154
12818H1963O3025K1816J6939M3517r542l8709j18435n88M3232l4830k3442O369
12806E1315j3179K4313n7093l2353J2319j1931K0058Q3464J1441J2156l0604j6331
12794E3575M8729n4505o9904l9263M9032P7080m0072o2993J3452N9400k0678n0066
12782c6213P448L9805K8987o2243N5721n6226r178J457L9365M8569K677O480q417
12769E8232q262j252J5126L7174n3217J0581l690m9921n2767J4883O7921k9705
12757E103k8734K5738O5945K3242m9356k8794l2216j0807l0368K0422M1475j7795
12745a6145K9615N5767p4992O362K0513Q087k0807k1309m4745j8053K53j7717
$$ plain form
12733 -93171 -99815 -84670 -80754 -36589 -49727 -36419 44400 59729 77271 57405 27544 25272
12721 25272 1160 7954 2085 -16547 -15999 -3100 -8241 -32472 -20741 -12178 -61472 -35010 -57549
12708 -57549 -23876 6062 -28467 -24616 3289 1709 -48021 -36233 14676 -2552 -83240 -54755
12696 -54755 33538 37853 26736 63657 33631 -35521 -59422 -62683 -77201 -86510 -35456 14696
12684 14696 -38430 -45650 -83269 -81236 -23266 -29747 -78773 -75504 -62912 -21232 -1097 -35564
12672 -35564 -29923 33258 90008 90268 -6882 -64269 -28501 -77472 -112568 -9703 52829 73670
12660 73670 39970 -10841 -44768 -20647 32356 3817 8818 -43076 -28740 20866 19435 -22251
12648 -22251 24729 104084 120026 21776 -53289 -55068 -56103 17026 -11703 12487 -54856 -44630
$$ packed form
12733i3171o644J5145L916M4165j3138J3308Q0819J5329J7542j9866k9861k272
12721B5272k4112O794n869j8632N48J2899n141k4231J1731Q563m9294K6462k2539
12708e7549L3673K9938l4529L851K7905j580m9730J1788N0909j7228q0688K8485
12696e4755Q8293M315j1117L6921l0026o9152k3901l261j4518r309N1054N0152
12684A4696n3126p220l7619K033N7970o481m9026L269J2592M1680K0135l4467
12672c5564N641O3181N6750K60r7150n7387L5768m8971l5096J02865O2532K0841
12660G3670l3700n0811l3927K4121N3003k8539N001n1894J4336M9606j431m1686
12648b2251M6980P9355J5942r8250p5065j779j035P3129k8729K4190o7343J0226
$$ plain form
12636 -44630 -16748 2516 9989 1830 -32416 1696 33475 36802 56982 -13106 -41144 -5392
12624 -5392 31192 34043 56072 71629 60020 961 -43287 -46078 -70668 -43054 -18707 -18886 3542
12611 3542 -15718 4294 25242 -17672 -42393 -24048 -16676 2426 -9822 -1750 32414 79190
12599 79190 -1688 -34997 -81645 -87654 -27730 -23268 -24613 895 15081 -29586 -71471 -84600
12587 -84600 -52135 -88484 -78644 -16443 34225 59849 47013 -5596 33968 83797 135997 101211
12575 101211 76232 48933 81901 130234 91176 44720 4101 -78604 -93544 -69189 -85150
12564 -85150 -60000 3014 58791 44021 13719 19802 -26977 -14027 4452 -11437 -7056 -2910
12552 -2910 24279 11996 -36038 -57173 -69651 -136068 -113530 -13342 -19712 -44398 -39164 -14839
$$ packed form
12636d4630K7882J9264P473q159l4246L4112L1779L327K0180p0088k8038L5752
12624e392L6584K851K2029J5557j1609n9059m4248k791k4590K7614K4347j79K2428
12611C542j9260K0012K0948m2914k4721J8345P372J9102j2248Q072L4164M6776
12599G9190q0878l3309m6648o009N9924M462j345K5508J4186m4667m1885j3129
12587h4600L2465l6349R840O2201N0668K5624j2836n2609L9564M9829N2200l4786
12575A01211k4979k7299L2968M8333l9058m6456m0619q2705j4940K4355j5961
12564h5150K5150O3014N5777j4770l0302O083m6779J2950J8479j5889M381M146
12552b910K7189j2283m8034k1135j2478o6417K2538J00188o370k4686N234K4325
$$ plain form
12540 -14839 -61577 -35313 -21794 25075 32728 88331 38699 28854 38541 -11563 -13083 7582
12528 7582 -22948 -24009 61935 81723 65345 -10447 26890 102 -6834 25170 62477 -12666
12516 -12666 -37944 -29471 -7042 -15627 16079 15438 -15584 -54532 -101497 -99840 -78772 -127045 -53219
12503 -53219 -56887 -75366 -52409 -85782 -67957 -66744 -97207 -113941 -152447 -165947 -131468 -59391
12491 -59391 41763 86463 58809 29397 7731 -17826 -1164 36629 7147 -2134 31744 44322
12479 44322 31767 41023 27511 13642 52374 84636 50529 2335 -10753 -11613 -11177 -30711 1999
12466 1999 34326 2980 4642 525 -33296 -50750 -46025 -54475 -102379 -138220 -119523 -71633 -85890
12453 -85890 -47798 33007 2794 -29593 -6399 -274 -5424 -42819 -36783 -38365 10016 -6887
$$ packed form
12540a4839m6738K6264J3519M6869P653N5603m9632r845R687n0104j520K0665
12528G582l0530j061Q5944J9788j6378p5792L7337k6788o936L2004L7307p5143
12516a2666k5278Q473K2429q585L1706o41l1022l8948m6965J657K1068m8273P3826
12503e3219l668j8479K2957l3373J7825J213l0463j6734l8506j3500L4479P2077
12491e9391J01154M4700k7654k9412k1666k5557J6662L7793k9482r281L3878J2578
12479D4322j2555R256j3512j3869L8732L2262l4107m8194j3088q60M36j9534L2710
12466A999L2327l1346J662m117l3821j7454M725q450m7904l5841J8697M7890j4257
12453h5890L8092Q0805l0213l2387K3194O125n150l7395O036j582M8381j6903
$$ plain form
12441 -6887 -46841 -7501 20900 13258 77292 24992 -65605 -61440 -8840 -69384 -128148 -22248
12429 -22248 32909 69597 78523 48975 25773 8949 18819 -12350 -31840 -49608 -72685 -51028
12417 -51028 -41672 316 11960 69434 13191 -51032 -60961 4964 27074 -25894 -66954 -82491
12405 -82491 -63226 -54651 -73230 -113205 -75948 -71313 -75103 -40031 -24949 5322 -6853 -38780
12393 -38780 -23039 19787 17310 -16760 -27394 -22286 -12562 2305 -7575 37158 119447 124173 98446
12380 98446 40406 -3250 8080 -13876 -68991 -114205 -70996 34320 180308 213330 158225
12369 158225 113987 134563 133947 69704 74221 82404 48370 -27859 -1041 6939 -14033 -54399
12357 -54399 -92562 -56054 -30362 -37284 -1975 -29162 -32652 13018 19379 21998 18009 -17979 -55314
$$ packed form
12441f887l9954L9340K8401p642O4034n2300r0597M165N2600o0544n8764J05900
12429b2248N5157L6688Q926k9548k3202j6824R870l1169j9490j7768k3077K1657
12417e1028R356M1988J1644N7474n6243o4223r929O5925K2110n2968m1060j5537
12405h2491J9265Q575j8579l9975L7257M635l790L5072J5082L0271j2175l1927
12393c8780J5741M2826k477l4070j0634N108R724J4867r880M4733Q2289M726k5727
12380I8446n8040m3656J1330k1956n5115m5214M3209J05316J45988L3022n5105
12369A58225m4238K0576o16o4243M517Q183l4034p6229K6818P980k0972m0366
12357e4399l8163L6508K5692o922L5309k7187l490M5670O361K619l989l5988l7335
$$ plain form
12344 -55314 -14998 12766 -38590 -33264 -54781 -94821 -101153 -128188 -107143 -95870 -72155 -60221
12332 -60221 -144042 -175970 -172867 -92098 -53011 -119191 -80267 -54866 -34963 -27762 -32185 -83791
12320 -83791 -81966 -17186 -69842 -88150 -73063 -11913 9459 27927 21512 -11139 -92306 -166661
12308 -166661 -128148 -49205 -45845 -103032 -153057 -146384 -108393 -98788 -58255 -25247 -24512 -55769
12296 -55769 -87557 -112724 -97381 -81832 -100441 -29942 22411 -1805 -36406 -97387 -106680 -68361
12284 -68361 27042 22863 -28440 -72164 -51766 -40225 -20647 -16981 38837 73157 103260 124977
12272 124977 31279 -16041 -2113 66631 107856 5470 30358 63720 35041 -13407 -43065
12261 -43065 -76728 -67099 -20401 32756 29147 -75830 -64940 -25160 44004 86612 101164 110153
$$ packed form
12344e5314M0316K7764n1356N326k1517m0040o332k7035K1045J1273K3715J1934
12332f0221q3821l1928L103Q0769L9087o6180L8924K5401J9903P201m423n1606
12320h3791J825O4780n2656j8308J5087O1150K1372J8468o415l2651q1167p4355
12308a66661L8513P8943L360n7187n0025O673L7991R605M0533L3008P35l1257
12296e5769l1788k5167J5343J5549j8609P0499N2353k4216l4601o0981r293L8319
12284f8361R5403m179n1303m3724K0398J1541J9578L666N5818L4320L0103K1717
12272A24977r3698m7320J3928O8744M1225j02386K4888L3362k8679m8448k9658
12261d3065l3663R629M6698N3157l609j04977J0890L9780O9164M2608J4552Q989
$$ plain form
12249 110153 84708 52898 12456 -21971 27629 68224 14523 -59647 -25858 37892 53999
12238 53999 9531 -12524 42438 104970 52383 20225 32186 84532 60502 43681 -51540 -57533
12226 -57533 -49816 -51588 -70458 -65778 -66560 -14936 -18162 520 52794 33077 -54314 -49390 -35442
12213 -35442 -24468 -52565 -141487 -138940 -88058 -69524 -103851 -179065 -117479 -47502 -28574 -45789
12201 -45789 -24664 -479 -58668 -86045 -108772 -139476 -108001 -83867 -98286 2096 458 -31652
12189 -31652 -12338 88072 73417 81410 47986 -60510 -110840 -72100 -21279 -28573 -74827 -84196
12177 -84196 -72009 -38408 -46910 -91035 -70409 -76793 -98547 -100017 -33605 -3706 -4354 2410 36964
12164 36964 30906 -35221 5985 -2713 -18092 -20261 -325 17955 -1948 27008 43416 85958
$$ packed form
12249A10153k5445l1810m0442l4427M9600M0595n3701p4170L3789O3750J6107
12238E3999m4468k2055N4962O2532n2587l2158J1961N2346k4030j6821r5221n993
12226e7533P717j772j8870M680p82N1624l226J8682N2274j9717q7391M924J3948
12213c5442J0974k8097q8922K547N0882J8534l4327p5214O1586O9977J8928j7215
12201d5789K1125K4185n8189k7377k2727l0704L1475K4134j4419J00382j638l2110
12189c1652J9314J00410j4655P993l3424j08496n0330L8740N0821p294m6254r369
12177h4196J2187L3601q502m4125K0626o384k1754j470O6412K9899o48O764L4554
12164C6964o058o6127M1206q698j5379k169J9936J8280j9903K8956J6408M2542
$$ plain form
12152 85958 133188 46272 -4573 19655 -3270 4184 17671 102466 74841 60194 111877 105612
12140 105612 4389 -64548 -18439 -59282 -25106 24415 59430 83310 75225 22988 62721
12129 62721 88763 42432 36111 60234 90980 155975 204197 172241 32777 -80919 -61799
12118 -61799 -47822 -42821 -72529 -47549 39680 67887 7652 -13433 36716 28019 -50130 -49111
12106 -49111 -90988 -96747 -98245 -105436 -34735 12157 76381 33570 32349 42496 29679 -29555
12094 -29555 -51588 -55370 -22122 -36436 -22937 -22843 -46592 -30607 22426 1084 -21893 -5494
12082 -5494 44201 54700 1397 -19994 48538 4456 -37327 -15819 14587 55949 48478 47476
12070 47476 14010 28867 41084 15327 -15777 15336 28992 -36265 -83242 -55704 -42569 -94979
$$ packed form
12152H5958M7230q6916n0845K4228k2925P454J3487Q4795k7625j4647N1683o265
12140A05612j01223o8937M6109m0843L4176M9521L5015K3880q085n2237L9733
12129F2721K6042m6331o321K4123L0746O4995M8222l1956j39464j13696J9120
12118f1799J3977N001k9708K4980Q7229K8207o0235k1085N0149q697p8149J019
12106d9111m1877n759j498p191P0701M6892O4224m2811j221J0147j2817n9234
12094b9555k2033l782L3248j4314J3499R4k3749J5985N3033k1342k2977J6399
12082e494M9695J0499n3303k1391O8532m4082m1783K1508L0406M1362p471j002
12070D7476l3466J4857J2217k5757l1104L1113J3656o5257m6977K7538J3135n2410
$$ plain form
12058 -94979 -27123 27764 15708 22019 78161 64850 -36570 -142902 -108546 -65711 -108158
12047 -108158 -124047 -57591 -9616 52393 -43274 -57903 4343 15141 43279 5265 62793
12036 62793 124656 88490 28723 1503 -42537 -90807 -105757 -144138 -177782 -182529 -144673 -117049
12024 -117049 -49260 -364 -45631 -130451 -189758 -142930 -130908 -95361 -77313 -98607 -82651
12013 -82651 -41158 -77287 -85624 -98764 -76098 -63643 -2373 65917 105296 163602 157104 64275
12001 64275 34963 11564 -24308 -27587 -23326 -6524 42924 75621 -3684 22818 45076 78945
11989 78945 40244 4396 -81396 -138890 -174751 -114296 -52678 -51070 795 -46733 -63962 -39906
11977 -39906 26472 759 48898 -6594 -138881 -185501 -74682 -80450 -84539 -82963 -115647 -80361
$$ packed form
12058i4979O7856N4887j2056O311N6142j3311j01420j06332L4356M2835m2447
12047a08158j5889O6456M7975O2009r5667j4629O2246J0798K8138l8014N7528
12036F2793O1863l6166n9767k7220m4040m8270j4950l8381l3644m747L7856K7624
12024a17049O7789M8896m5267q4820n9307M6828J2022L5547J8048k1294J5956
12013h2651M1493l6129q337j3140K2666J2455O1270O8290L9379N8306o498r2829
12001F4275k9312k3399l5872l279M261J6802M9448L2697p9305K6502K2258L3869
11989G8945l8701l5848q5792n7494l5861O0455O1618J608N1865m7528j7229K4056
11977c9906O6378k5713M8139n5492j32287m6620J10819n768m089J576l2684L5286
$$ plain form
11965 -80361 28106 -35531 -92687 -78462 -47428 42577 42146 5300 3544 -28580 -10579 22108
11953 22108 7380 25512 67569 74537 23682 -46035 15244 18788 51241 27774 58027 85019
11941 85019 6905 -28460 32999 78604 117768 49450 -6069 -14683 -14378 -39415 -21873 -4997
11929 -4997 19373 27713 82654 61729 21346 -19935 28988 114764 77308 39662 47089 5305
11917 5305 5437 59685 80476 41526 -45710 -65234 -82518 -51352 -116647 -54005 -8454 50733
11905 50733 70735 83619 47341 -5544 -6972 -11829 -29752 -51697 -61189 -121050 -139536 -118238
11893 -118238 -116549 -86696 -104296 -118788 -117467 -105707 -94668 -72721 -18574 -27048 -34634 -66300
11881 -66300 -45511 -43666 -67348 -46347 1431 -12289 -52278 -73591 -77269 -67092 -108920 -119996
$$ packed form
11965h0361J08467o3637n7156J4225L1034R0005m31l6846j756l2124J8001L2687
11953B2108j4728J8132M2057O968n0855o9717O1279L544L2453k3467L0253K6992
11941H5019p8114l5365O1459M5605L9164o8318n5519q614L05k5037J7542J6876
11929d997K4370Q340N4941k0925m0383m1281M8923Q5776l7456l7646P427m1784
11917E305J32N4248K0791l8950q7236j9524j7284L1166o5295O2642M5551N9187
11905E0733K0002J2884l6278n2885j428m857j7923k1945r492n9861j8486K1298
11893a18238J689K9853j7600j4492J321J1760J1039K1947N4147q474p586l1666
11881f6300K0789J845k3682K1001M7778j3720l9989k1313l678J0177m1828j1076
$$ plain form
11869 -119996 -3747 65045 70349 17814 32401 45553 46945 69689 12317 -26956 -69523 -48391
11857 -48391 -77310 -74956 21679 37652 53122 30913 -10745 -42149 -83073 -100503 -124868 -140966
11845 -140966 -50773 -7692 -56265 -35676 -36337 -6382 -94211 -103426 -99842 -112128 -67887 -8089
11833 -8089 -54051 -92197 -80604 -103371 -50280 31407 51689 -310 -14895 9921 -37777 -56541
11821 -56541 -52193 -44832 -14649 -5502 -70676 -92470 -128612 -119093 -58303 -35967 1110 12962
11809 12962 35060 -7364 -30083 -36976 -34152 -16329 16497 18111 22751 52125 20459 41133
11797 41133 32783 -30616 -40432 -8314 -37200 -57575 -1453 90667 91140 7044 -73561 -129676
11785 -129676 -85178 17175 4827 -73596 -104461 -93071 -106460 -92565 -74953 -61684 -56211
$$ packed form
11869a19996J16249O8792N304n2535J4587J3152J392K2744n7372l9273m2567K1132
11857d8391k8919K354R6635J5973J5470k2209m1658l1404m0924j7430k4365j6098
11845a40966R0193M3081m8573K0589o61K9955q7829r215L584j2286M4241N9798
11833h089m5962l8146J1593k2767N3091Q1687K0282n1999j4585K4816m7698j8764
11821e6541M348P361L0183R147o5174k1794l6142R519O0790K2336L7077J1852
11809A2962K2098m2424k2719o893K824J7823L2826J614M640K9374l1666K0674
11797D1133q350o3399r816L2118k8886k0375N6122R2120M73q4096q0605n6115
11785a29676M4498J02353j2348p8423l0865J1390j3389J3895J7612J3269N473
$$ plain form
11774 -56211 -103147 -166536 -170747 -93300 -11749 41995 61712 97467 102436 54542 35158 -29753
11762 -29753 -75045 -65513 -84662 -54104 -13050 -22257 26871 38374 2647 -15980 -58400 -90748
11750 -90748 -114133 -59370 -35002 -48611 -45199 12437 77600 17518 14795 73630 45036 -24
11738 -24 -15254 -32561 -74235 -61576 -38255 25520 40600 31016 -6395 -5180 -25723 1735 11097
11725 11097 47896 85420 96202 63525 38945 1474 -39466 -20654 -12784 -16039 -22477 -7573
11713 -7573 -49927 -48567 -34055 713 -38815 18091 1781 15065 77077 86770 120484 104732
11701 104732 71412 46242 36652 11815 -60762 -130895 -183474 -138659 -39800 -2402 47299 3723
11689 3723 33547 61626 116234 107448 60957 106840 98079 42499 28312 26304 -44082 -48567 -25040
$$ packed form
11774e6211m6936o3389m211P7447Q1551N3744J9717L5755M969m7894j9384o4911
11762b9753m5292R532j9149L0558M1054r207M9128J1503l5727j8627m2420l2348
11750i0748k3385N4763K4368j3609L412N7636O5163o0082k723N8835k8594m5060
11738b4j5230j7307m1674J2659K3321O3775J5080r584l7411J215k0543K7458R362
11725A1097L6799L7524J0782l2677k4580l7471m0940J8812P870l255o438J4904
11713g573m2354J360J4512L4768l9528N6906j6310J3284O2012R693L3714j5752
11701A04732l3320k5170r590k4837p2577p0133n2579M4815R8859L7398M9701m3576
11689C723K9824K8079N4608q786m6491M5883q761n5580j4187k008p0386m485K3527
$$ plain form
11676 -25040 -45695 -52187 -116156 -66681 -63857 -142842 -176913 -189727 -165411 -119535 -29054 48604
11664 48604 39406 84760 89054 66336 9070 19285 -13338 -85163 -70190 33322 43417 63939
11652 63939 57423 5417 -46204 -4404 40269 35692 9740 3000 19761 49753 58337 -29579
11640 -29579 -92090 -141891 -92160 -22377 -5894 -26751 -55019 -69730 -88607 -94983 -82515 -34500
11628 -34500 23645 20735 4089 -7836 17198 -24450 -91893 -47272 29138 54152 1666 -11826
11616 -11826 -40652 -95891 -100916 -40024 18015 33551 69317 80458 37959 14285 -21553 -100945
11604 -100945 -97229 -75658 -59275 -104703 -44030 6298 -43752 -88482 -86477 -3773 31599 10504
11592 10504 -89053 -170167 -188289 -150045 -75447 -71301 -41608 28320 41328 19548 -29135 -74134
$$ packed form
11676b5040k0655o492o3969M9475K824p8985l4071j2814K4316M5876R0481P7658
11664D8604r198M5354M294k2718n7266J0215l2623p1825J4973J03512J0095K0522
11652F3939o516n2006n1621M1800M4673m577k5952o740J6761K9992Q584q7916
11640b9579o2511m9801M9731O9783J6483k0857k8268j4711j8877o376J2468M8015
11628c4500N8145k910j6646j1925K5034m1648o7443M4621P6410K5014n2486j3492
11616a1826k8826n5239n025O0892N8039J5536L5766J1141m2499k3674l5838p9392
11604a00945L716K1571J6383m5428O0673N0328n0050m4730K005Q2704L5372k1095
11592A0504r9557q1114j8122L8244P4598M146K9693O9928J3008k1780m8683m4999
$$ plain form
11580 -74134 -53015 -16809 -83450 -82043 335 20061 43887 64328 89652 82427 124810 67441
11568 67441 48051 -31358 -45756 -34035 19516 14391 -25626 10170 78562 41806 -23571 -18838
11556 -18838 -1164 19896 40688 54969 37224 20670 -36052 -26923 -47940 -116672 -122532 -90749
11544 -90749 -23944 38530 -31546 -11941 5357 32455 -39771 -88914 -48604 -12558 5490 52261
11532 52261 70529 96471 39479 14652 16542 -52656 -42912 -29997 35585 17077 -38930 -79500
11520 -79500 -103089 -60519 -69521 -53515 -23133 -7716 -3238 -26834 -33224 -29550 901 103754
11508 103754 49752 66220 40173 52082 33019 -3432 31386 115500 130025 129800 115881 129995
11496 129995 73031 -788 -54164 15023 58465 69142 35955 -90190 -109499 -1054 22694
$$ packed form
11580g4134K1119L6206o6641J407Q2378J9726K3826K0441K5324p225M2383n7369
11568F7441j9390p9409j4398J1721N3551n125m0017L5796O8392l6756o5377M733
11556a8838J7674K1060K0792J4281j7745j6554n6722R129k1017o8732n860L1783
11544i0749O6805O2474p0076J9605J7298K7098p2226m9143M0310L6046J8048M6771
11532E2261J8268K5942n6992k4827J890o9198R744J2915O5582j8508n6007m0570
11520g9500k3589M2570r002J6006L0382J5417M478k3596o390L674L0451J02853
11508A03754n4002J6468k6047J1909j9063l6451L4818Q4114J4525k25j3919J4114
11496A29995n6964p3819n3376O9187M3442J0677l3187j26145j9309J08445K3748
$$ plain form
11485 22694 -53476 -45931 10354 13902 13016 60527 66288 51348 21378 90181 103790 45161 130917
11472 130917 152556 116349 20079 -38168 -24719 -65204 -106896 -77810 14526 53382 106230
11461 106230 80740 84597 95655 123495 130879 69303 49003 64058 79354 41218 24520 -27850
11449 -27850 -49590 -13814 11688 -29479 27478 61307 17995 4948 -36529 -77517 -54776 -101539
11437 -101539 -64614 11090 14004 -69135 -42923 -101173 -147225 -156211 -147720 -109251 -61713 -66333
11425 -66333 -92651 -107631 -163235 -159220 -46022 -33701 -44392 -90066 -77198 -60549 -64745 -58897
11413 -58897 9957 28371 23646 -6148 19335 4899 -14880 -9927 -74871 -73445 -13698 -19276
11401 -19276 -45109 -52507 38390 63804 44479 70911 66379 26925 16537 36265 48156 -14131
$$ packed form
11485B2694p6170P545N6285L548q86M7511N761j4940k9970O8803J3609n8629Q5756
11472A30917K1639l6207r6270n8247J3449m0485m1692K9086R2336L8856N2848
11461A06230k5490L857J1058K7840P384o1576k0300J5055J5296l8136j6698n2370
11449b7850k1740L5776K5502m1167N6957L3829m3312j3047m1477m0988K2741m6763
11437a01539L6925P5704K914q3139K6212n8250m6052q986Q491L8469M7538m620
11425f6333k6318j4980n5604M015J13198J2321j0691m5674J2868J6649m196N848
11413e8897O8854J8414m725k9794K5483j4436j9779M953o4944J426N9747n578
11401a9276k5833p398R0897K5414j9325K6432m532l9454j0388J9728J1891o2287
$$ plain form
11389 -14131 25836 -7232 -22159 -20744 -44558 -120648 -129882 -76725 -52467 -104540 -161966 -141101
11377 -141101 -53057 29551 25951 -38726 -149287 -114509 -87010 -27882 -56530 -81019 -81418 2790
11365 2790 17920 12832 53884 57773 85778 70157 32587 36685 -38817 -52468 15039 33008
11353 33008 42977 19322 17756 -13337 -111467 -78280 28141 98827 92859 69275 25804 64144
11341 64144 79648 57598 -2703 -33446 12802 24076 28189 -24155 -40476 -10877 39207 45681
11329 45681 30969 -57823 -122943 -69570 -75174 -138276 -146032 -150973 -107752 -68568 -106531 -157411
11317 -157411 -173730 -202996 -158246 -86380 -64778 -99340 -123610 -64278 -88315 -38814 -5135
11306 -5135 -16680 -26443 21939 63679 107929 157346 139073 30670 -23826 -24260 -37977 -19870
$$ packed form
11389a4131L9967l3068j4927J415k3814p6090r234N3157K4258n2073n7426K0865
11377a41101Q8044Q2608l600o4677j10561L4778K7499N9128k8648k4489l99Q4208
11365B790J5130n088M1052L889K8005j5621l7570M098p5502j3651O7507J7969
11353C3008R969k3655j566l1093r8130L3187J06421P0686n968k3584m3471L8340
11341F4144J5504k2050o0301l0743M6248J1274M113n2344j6321K9599N0084O474
11329D5681j4712q8792o5120N3373n604o3102p756m941M3221L9184l7963n0880
11317a57411j6319k9266M4750P1866K1602l4562k4270N9332k4037M9501L3679
11306e135j1545r763M8382M1740M4250M9417j8273j08403n4496m34j3717J8107
$$ plain form
11294 -19870 -41304 -87825 -64187 6471 35914 16644 2513 -4768 8155 22375 25967 46837
11282 46837 81301 67793 58983 143891 93781 28098 61270 45231 -8255 -39766 -75338 -180413
11270 -180413 -136787 -105473 -123355 -48625 9784 32787 -9759 -15316 4340 29148 -4791 -67136
11258 -67136 -111231 -136068 -91165 23704 13610 -15704 25738 75175 41893 31042 58434
11247 58434 -10513 -7370 36410 -15290 -416 4798 -28600 -37770 6189 -2879 -54374 -99041
11235 -99041 -117860 -31850 -5246 -19456 -26762 35634 69353 -43045 -128514 -61749 -64406 -29980
11223 -29980 -20893 22021 18671 -56306 -102954 -98568 -64113 -35835 -41660 -55273 -29275 30207
11211 30207 58256 7285 31036 72954 96795 66454 32482 12501 15855 -20164 9336 30806
$$ packed form
11294a9870k1434m6521K3638P0658K9443j9270j4131p281J2923J4220L592K0870
11282D6837L4464j3508q810Q4908n0110o5683L3172j6039n3486l1511l5572j05075
11270a80413M3626L1314j7882P4730N8409K3003m2546n557J9656K4808l3939o2345
11258f7136m4095k4837M4903J14869j0094k9314M1442M9437l3282j0851K7392
11247E8434o8947L143M3780n1700J4874N214l3398r170M3959r068n1495m4667
11235i9041j8819Q6010K6604j4210p306O2396L3719j12398q5469O6765k657L4426
11223b9980R087M2914l350p4977m6648M386L4455K8278n825j3613K5998N9482
11211C0207K8049n0971K3751M1918K3841l0341l3972j9981L354l6019K9500K1470
$$ plain form
11199 30806 61485 44219 28313 -43424 -86250 -136677 -63849 4790 4038 -6034 -18427 -57238
11187 -57238 -62096 -39155 -76609 -91243 -90389 -93238 -79072 -67040 -78105 -13128 -17027 -46653 -80373
11174 -80373 -132434 -94442 -54795 -68531 -164776 -188480 -99521 -51506 -41863 -114764 -126348 -95169
11162 -95169 29742 104180 109345 80521 43282 34148 47096 11648 -4253 44030 -26531 -108477
11150 -108477 -153288 -133451 -112546 -56968 12939 80646 59447 -17806 -63709 458 10366 21515
11138 21515 -29207 -36875 2742 102554 156731 48044 -34691 -25417 -12567 24099 64128 40416
11126 40416 -32894 -22713 30447 45905 18377 63007 81302 25039 3290 -29550 -79214 -51376
11114 -51376 -32595 -94504 -57590 -59737 -76659 -75885 -34702 -43045 -40600 36319 35410 56725 111602
$$ packed form
11199C0806L0679j7266j5906p1737m2826n0427P2828O8639p52j0072j2393l8811
11187e7238m858K2941l7454j4634Q54k849J4166J2032j1065O4977l899k9626l3720
11174h0373n2061L7992L9647j3736r6245k3704Q8959M8015R643p2901j1584L1179
11162i5169J24911P4438N165k8824l7239r134J2948l5448j5901M8283p0561q1946
11150a08477m4811J9837K0905N5578O9907O7707k1199p7253m5903O4167R908J1149
11138B1515n0722p668L9617R9812N4177j08687q2735R274J2850L6666M0029k3712
11126D0416p3310J0181N3160J5458k7528M4630J8295n6263k1749l2840m9664K7838
11114e1376J8781o1909L6914k147j6922P74M1183q343K445P6919r09K1315N4877
$$ plain form
11101 111602 56404 55663 19657 14474 49813 37094 -26826 -46105 -39545 -17988 -19312 -57860
11089 -57860 -143189 -81677 3376 36139 -15757 -85882 -40650 -51133 -7040 -1900 -49746 19803
11077 19803 73007 51165 -7339 -562 22633 57341 24497 41321 60763 40771 20865 50519
11065 50519 79766 64927 41247 63240 71330 46550 38096 11424 -27114 -65889 -20921 12904
11053 12904 116 71342 8020 -60119 -38157 -83496 -141211 -131402 -18567 10499 -11300 17295
11041 17295 22064 -19807 -30621 -51163 3474 41071 5579 -54030 -78813 -121765 -123726 -69870
11029 -69870 -54380 -29696 -20220 -13402 17547 1200 10223 -636 -16885 -34606 874 22707
11017 22707 42826 38278 -61138 -39996 -7873 -56107 -47134 37645 23697 -18447 -11956 42747
$$ packed form
11101A11602n5198p41l6006n183L5339j2719o3920j9279O560K1557j324l8548
11089e7860q5329O1512Q5053L2763n1896p0125M5232j0483M4093N140m7846O9549
11077A9803N3204k1842n8504O777K3195L4708l2844J6824J9442j9992j9906K9654
11065E0519K9247j4839k3680K1993Q090k4780q454k6672l8538l8775M4968L3825
11053A2904j2788P1226o3322o8139K1962m5339n7715R809J12835K9066k1799K8595
11041A7295M769m1871j0814k0542N4637L7597l5492n9609k4783m2952j961N3856
11029f9870J5490K4684R476O818L0949j6347R023j0859j6249j7721L5480K1833
11017B2707K0119m548r9416K1142L2123m8234Q973Q4779j3948m2144O491N4703
$$ plain form
11005 42747 27440 40045 61590 44350 34562 60492 83683 110101 14756 -135571 -117294 -64729
10993 -64729 -63842 -93203 -95587 -55357 -113469 -168343 -127481 -78010 -113381 -90206 -58749 -26720
10981 -26720 -49277 -65767 -133477 -110455 -104861 -95347 -78128 -41886 -20155 -45701 46670 98707
10969 98707 79997 55200 58018 44028 41203 -47827 -16661 15573 -15357 -50395 -59853 -101253
10957 -101253 -96171 -129764 -110654 -75443 -106813 -89710 -87282 -81825 -6790 22719 -19240 -68490
10945 -68490 -75184 -67218 -14956 6384 -87948 -73796 -65364 -99697 -60887 -63350 4129 59353
10933 59353 29861 1018 167 48259 64205 55427 -29171 -75981 -7186 -15769 -16327 1477 -60809
10920 -60809 -11962 21925 11714 -60334 -117864 -127952 -152346 -110118 -77556 -45261 -44493 -42370
$$ packed form
11005D2747j5307J2605K1545j7240r788K5930K3191K6418r5345j50327J8277N2565
10993f4729Q87k9361k384M0230n8112n4874M0862M9471l5371K3175L1457L2029
10981b6720k2557j6490o7710K3022N594R514J7219L6242K1731k5546R2371N2037
10969I8707j8710k4797K818j3990k825q9030L1166L2234l0930l5038r458m1400
10957a01253N082l3593J9110L5211l1370J7103K428N457P5035K9509m1959m9250
10945f8490o694P966N2262K1340r4332J4152Q432l4333L8810k463O7479N5224
10933E9353k9492k8843q51M8092J5946q778q4598m6810O8795q583n58J7804o2286
10920f0809M8847L3887j0211p2048n7530j0088k4394M2228L2562L2295P68K123
$$ plain form
10908 -42370 -7408 26995 -13368 -44796 -87942 -69459 -4597 -68021 -14690 77734 130345 161175
10896 161175 150134 95322 142248 140101 79111 25815 11917 -14091 -14965 -17630 -37639 -33258
10884 -33258 11644 17025 -6381 -23185 -34479 -88034 -80145 -133368 -158265 -113352 -103848 -12815
10872 -12815 19332 -469 -12304 -30514 15264 23871 -75023 -45300 -8537 53214 75272 93423
10860 93423 93549 107737 153420 152803 131451 92102 17201 -16662 -40046 -88724 -78549 -48788
10848 -48788 -51797 -57363 76932 109955 59465 6816 57217 11463 12232 55364 25155 26036 26169
10835 26169 16262 77455 122118 9853 -26478 -14186 78177 46204 -39821 -74662 -96681 -52457
10823 -52457 -30035 -64420 -84954 -45307 -22330 -143154 -176754 -111245 -75459 -72568 -63816 -12454
$$ packed form
10908d2370L4962L4403m0363l1428m3146J8483O4862o3424N3331R2424N2611L0830
10896A61175j1041n4812M6926k147o0990n3296j3898k6008q74k665k0009M381
10884c3258M4902N381k3406j6804j1294n3555P889n3223k4897M4913R504R1033
10872a2815L2147j9801j1835j8210M5778Q607r8894K9723L6763O1751K2058J8151
10860I3423J26J4188M5683o17k1352l9349p4901l3863k3384m8678J0175K9761
10848d8788l009n566J34295L3023n0490n2649N0401m5754P69M3132l0209Q81J33
10835B6169r907O1193M4663j12265l6331J2292R2363l1973q6025l4841k2019M4224
10823e2457K2422l4385k0534L9647K2977j20824l3600O5509L5786K891Q752N1362
$$ plain form
10811 -12454 -55123 -87733 -112026 -148088 -140699 -37923 31776 -30008 -93595 -107230 -95471 -96089
10799 -96089 -114027 -95621 -123146 -120429 -93178 -77120 -101460 -47037 29554 14555 37196 8685
10787 8685 -31280 -3860 -47452 -100774 -158680 -133394 -107105 -100903 -45506 13905 -43405 -65819
10775 -65819 36186 53309 88921 122458 94276 30306 -23072 -59443 -94541 -61966 -30606
10764 -30606 -8380 -9044 -658 -13356 -48247 -71964 -47466 -48085 -213 -45703 -36091 -71457 -105358
10751 -105358 -77072 -77251 -20800 -39156 -31055 -18477 -1919 21375 -19837 -55116 -83435 -101701
10739 -101701 -63550 -34920 -17049 5198 -33772 -34945 50425 152289 183009 141414 105840
10728 105840 56785 101291 77196 30638 2024 49971 44353 11532 41754 86269 10653 -41281
$$ packed form
10811a2454m2669l2610k4293l6062P389J02776O9699o1784o3587j3635J1759o18
10799i6089j7938J8406k7525K717K7251J6058k4340N4423P6591j4999K2641k8511
10787H685l9965K7420m3592n3322n7906K5286K6289O202N5397N9411n7310k2414
10775f5819J02005J7123L5612L3537k8182o3970n3378l6371l5098L2575L1360
10764c0606K2226o64Q386j2698l4891k3717K4498o19M7872m5490R612l5366l3901
10751a05358K8286j79N6451j8356Q101J2578J6558K3294m1212l5279k8319j8266
10739a01701L8151K8630J7871K2247l8970j173Q5370J01864L0720m1595l5574
10728A05840m9055M4506k4095m6558k8614M7947n618l2821L0222M4515p5616n1934
$$ plain form
10716 -41281 -44091 -25096 56424 137493 136026 105956 88250 92873 130434 133216 131863 87474 170762
10703 170762 224587 233384 255299 268068 246426 253746 335606 561239 758674 947793 1278194
10692 1278194 1757979 2492167 3627193 4775953 5552850 5806388 4867727 3417831 2427437
10683 2427437 1843475 1473063 1258084 1083387 932266 797678 713566 689712 657514 569705
10673 569705 550449 467952 407628 473791 510385 495755 469449 413761 408287 361869 290295 227711
10661 227711 295106 313259 321835 295032 296208 338491 320209 279668 214192 190263 139872 222443
10649 222443 195783 179384 213287 303518 300424 211845 136826 75385 96888 167304 203774 203888
10637 203888 191606 168917 134342 102788 66161 49738 76773 177153 235307 185400 120112
$$ packed form
10716d1281k810J8995Q1520Q1069j467l0070j7706M623L7561K782j353m4389Q3288
10703A70762N3825Q797K1915J2769k1642P320Q1860K25633J97435J89119L30401
10692A278194M79785P34188J135026J148760P76897K53538r38661j449896r90394
10683B427437n83962l70412k14979j74697j51121j34588q4112k3854l2198q7809
10673E69705j9256q2497o0324O6163L6594j4630k6306n5688n474m6418p1574o2584
10661B27711O7395J8153Q576k6803J176M2283j8282m0541o5476k3929n0391Q2571
10649B22443k6660j6399L3903R0231l094q8579p5019o1441K1503P0416L6470J14
10637B03888j2282k2689l4575l1554l6627j6423K7035J00380N8154m9907o5288
$$ plain form
10626 120112 75539 57737 132651 202863 189650 83940 26474 38093 101713 106077 78365
10615 78365 76185 60558 40500 68316 109059 135657 128729 107551 63859 77132 64121 29519
10603 29519 -22946 -15508 1732 -831 53316 49968 5332 25904 87184 97613 174229 216669
10591 216669 127504 70991 131218 172600 193773 173584 76373 19062 26115 90475 104714 49415
10579 49415 -1512 -14671 35787 33843 16600 -17200 45144 67203 63571 1059 44992 131762
10567 131762 146449 99725 8720 1988 46323 -22018 -88971 -73030 -31085 -13056 -34696 -32211
10555 -32211 -33481 9884 31357 16371 66634 120109 80264 64775 79864 -12484 -44357 -32897
10543 -32897 -10865 23879 40871 68184 77039 123859 146373 131843 67882 34921 119804 138375
$$ packed form
10626A20112m4573j7802P4914P0212j3213j05710n7466J1619O3620M364k7712
10615G8365k180j5627k0058K7816M0743K6598o928k1178m3692J3273j3011l4602
10603B9519n2465P438J7240k563N4147l348m4636K0572O1280J0429P6616M2440
10591B16669q9165n6513O0227M1382K1173k0189r7211n7311P053O4360J4239n5299
10579D9415n0927j3159N0458j944j7243l3800O2344K2059l632o2512M3933Q6770
10567A31762J4687m6724r1005o732M4335o8341o6953J5941M1945J8029k1640K485
10555c2211j270M3365K1473j4986N0263N3475l9845j5489J5089r2348l1873J1460
10543c2897K2032L4744J6992K7313Q855M6820K2514j4530o3961l2961Q4883J8571
$$ plain form
10531 138375 100923 36328 1575 59764 65942 135481 113896 -8093 -31033 15974 55591
10520 55591 48977 -27458 -56633 -58310 -29893 37725 62124 20971 -27763 -63688 -33858 7115
10508 7115 31062 -9560 -118392 -205150 -113293 -51921 -9200 38471 -43206 -18620 18525 15698
10496 15698 37060 53672 63243 43816 56161 70913 47761 4669 -2907 40934 104274 87927
10484 87927 49553 -14827 26583 -26501 -46041 -27684 -46931 -30892 -98768 -103325 -71023 14098
10472 14098 60441 17375 28111 39519 18023 -10523 11008 24655 -14326 -26487 -17943 72141
10460 72141 81802 56862 66795 58988 39490 40103 74614 77985 87273 77893 -36861 -101542 -103850
10447 -103850 -91578 -87865 -72226 -48457 -12901 30932 84228 124035 97011 47508 13711 14703
$$ packed form
10531A38375l7452o4595l4753N8189O178O9539k1585j21989k2940M7007L9617
10520E5591o614p6435k9175j677K8417O7618K4399m1153m8734l5925K9830M0973
10508G115K3947m0622j08832q6758R1857O1372M2721M7671q1677K4586L7145k827
10496A5698K1362J6612R571j9427J2345J4752k3152m3092p576M3841O3340j6347
10484H7927l8374o4380M1410n3084j9540J8357j9247J6039o7876m557L2302Q5121
10472A4098M6343m3066J0736J1408k1496k8546K1531J3647l8981j2161Q544R0084
10460G2141R661k4940R933p807j9498O13L4511L371R288r380j14754o4681k308
10447a03850J2272L713J5639K3769L5556M3833N3296L9807k7024m9503l3797R92
$$ plain form
10435 14703 21929 19729 -23139 -9408 25185 40452 3550 -27430 -37481 -32766 7434 -19240
10423 -19240 -145337 -97585 -98427 -114243 -120042 -65872 2852 39895 34476 9650 8447 -12489
10411 -12489 -30376 -34598 942 17129 -5451 -35132 19866 89217 102241 62100 -22850 -142500
10399 -142500 -161139 -101541 -39126 13075 68237 103314 124611 86388 115931 71185 -28699
10388 -28699 -39706 -48789 -34091 -32901 29217 -35370 -85151 -19969 1961 -18394 -45062 -39159
10376 -39159 -28437 -14711 616 -34796 67805 25842 21448 126371 117426 156147 215389 130154
10364 130154 45028 55317 151226 222113 179149 104046 58912 58231 88638 72734 48460 43698
10352 43698 68947 100068 17193 -52829 -26982 35699 18531 -16916 -42906 -37797 -55120 -77981
$$ packed form
10435A4703P226k200m2868J3731L4593J5267l6902l0980j0051M715M0200k6674
10423a9240j26097M7752q42j5816n799N4170O8724L7043n419k4826j203k0936
10411a2489j7887m222L5540J6187k2580k9681N4998O9351J3024m0141q4950j19650
10399a42500j8639N9598O2415N2201N5162L5077K1297l8223K9543m4746r9884
10388b8699j1007r083J4698J190O2118o4587m9781O5182K1930k0355k6668N903
10376c9159J0722J3726J5327l5412J02601m1963m394J04923q945L8721N9242q5235
10364A30154q5126J0289R5909P0887m2964p5103m5134o81L0407j5904k4274m762
10352D3698K5249L1121q2875p0022K5847O2681j7168l5447k5990N109j7323k2861
$$ plain form
10340 -77981 -22320 60345 129540 60767 10807 -43089 -59776 -12277 17048 -12288 -70956 -125216
10328 -125216 -113390 -90564 -66747 -20851 -12428 38252 62081 -7109 -58283 -75923 -103862 -55319
10316 -55319 -65238 -53791 -58252 -78918 -13613 -49042 -40128 -45122 -72943 -77892 -72634 -14875 -91426
10303 -91426 -137794 -146372 -93038 22813 16785 -6 -10788 -35664 -39114 -46581 -45915 64330
10291 64330 69183 -2007 -61344 -23973 -20172 -42795 -55784 -9432 17444 3441 33224 44722
10279 44722 50413 -1565 -6584 -34018 -53242 -62196 -39148 -28174 -7288 -14818 -29796 -30738 -59578
10266 -59578 -19733 67687 45999 9922 -35066 -20829 -4207 72218 107661 35566 -49005 -108241
10254 -108241 -152444 -166212 -150450 -136213 -102786 -82837 -17970 -1499 8362 16296 45142 7545
$$ packed form
10340g7981N5661Q2665O9195o8773m9960n3896j6687M7499K9325k9336n8668n4260
10328a25216J1826K2826K3817M5896Q423N0680K3829o9190n1174j7640k7939M8543
10316e5319r919J1447m461k0666O5305l5429Q914m994k7821m949N258N7759p6551
10303i1426m6368q578N3334J15851o028j6791j0782k4876l450p467O66J10245
10291F4330M853p1190n9337L7371L801k2623j2989M6352K6876j4003K9783J1498
10279D4722N691n1978n019k7434j9224q954K3048J0974K0886p530j4978r42k8840
10266e9578L9845Q7420k1688l6077m4988J4237J6622P6425L5443p2095q4571n9236
10254a08241m4203j3768J5762J4237L3427J9949O4867J6471R861P934K8846l7597
$$ plain form
10242 7545 -22994 -16718 -58459 36389 -15192 -13815 -22023 -7590 30573 77841 83648 52813 15169
10229 15169 -11795 41752 38514 -21083 -16470 14943 30624 65076 104995 23813 6255 -7105
10217 -7105 -4186 9154 -13123 -12503 -43942 -22573 -24244 -79205 -103051 -150379 -200564 -155415 -167769
10204 -167769 -200430 -152449 -56886 -69299 -29266 15645 -10765 -21424 -11447 7526 -26990 -91211
10192 -91211 -84852 2608 -25062 -41722 -57509 -70853 19079 20504 23454 9929 -24839 -67555
10180 -67555 -62728 -46097 -40347 13544 40732 47876 43699 90706 91675 87092 -26123 -26942 -2716
10167 -2716 50487 79362 44744 21078 16217 97184 127687 87474 70936 13638 37351 126176
10155 126176 177741 167649 110363 75600 65917 43005 92103 141111 147082 150237 93915 5511
$$ packed form
10242G545l0539O276m1741R4848n1581J377q208J4433L8163M7268N807l0835l7644
10229A5169k6964N3547l238n9597M613L1413J5681L4452L9919q1182j7558j3360
10217g105K919J3340k2277O20l1439K1369j671n4961k3846m7328n0185M5149j2354
10204a67769l2661M7981R5563j2413M0033M4911k6410j0659R977J8973l4516o4221
10192i1211O359Q7460k7670j6660j5787j3344Q9932J425K950j3525l4768m2716
10180f7555M827J6631N750N3891K7188P144m177M7007R69m583j13215q19K4226
10167b716N3203K8875l4618k3666m861Q0967L0503m0213j6538n7298K3713Q8825
10155A26176N1565j0092n7286l4763r683k2912M9098M9008N971L155n6322q8404
$$ plain form
10143 5511 787 33353 15823 36224 45608 62560 65387 64787 41865 -28506 18299 41461 -14646
10130 -14646 -7844 24355 44360 12276 -2755 -19963 -1136 -15931 -5476 -63106 -103738 -69833
10118 -69833 -20684 79573 134772 123985 63581 69592 74663 44533 36590 56469 94775 43985
10106 43985 43554 24260 44804 35709 42055 -12980 -44877 -5267 20160 67828 93162 75700
10094 75700 19796 -2555 -33703 -70268 -35548 20311 6642 23185 12205 -29683 35853 2897
10082 2897 -20884 -52980 49577 122739 115815 68413 80392 11858 -23867 -63990 10167 3809
10070 3809 -116 -11346 48120 44378 -24062 -7178 26162 33814 46249 31056 58732 24917
10058 24917 8364 -31565 613 -761 -76631 -87106 -118799 -112093 3015 59971 80610 80975
$$ packed form
10143E511m724L2566j7530K0401R384J6952K827o00k2922p0371M6805K3162n6107
10130a4646O802L2199K0005l2084j5031j7208J8827j4795J0455n7630m0632L3905
10118f9833M9149J00257N5199j0787o0404O011N071l0130p943J9879L8306n0790
10106D3985m31j9294K0544r095O346n5035l1897L9610K5427M7668K5334j7462
10094G5700n5904k2351l1148l6565L4720N5859j3669J6543j0980m1888O5536l2956
10082B897k3781l2096J02557P3162o924m7402J1979o8534l5725m0123P4157o358
10070C809l925j1230N9466l742o8440J6884L3340P652J2435j5193K7676l3815
10058B4917j6553l9929L2178j374p5870j0475l1693O706J15108N6956K0639L65
$$ plain form
10046 80975 33577 12533 5230 -31419 -32641 -9592 56 -9658 -45758 -18282 823 39769
10034 39769 37513 -11953 -17362 41833 53656 -13299 -38135 -11890 53320 108673 92427 130345
10022 130345 183207 129368 100360 89938 96621 157002 110947 -10525 -34134 -67876 -156870
10011 -156870 -199339 -127937 -45588 -68482 -54968 13207 65460 89183 127852 155995 191738
10000 191738 174516 98193 60982 25088 51204 13921 66214 117982 107179 90579 30629
9989 30629 -19363 -61350 -75252 -69273 -33134 -9698 39190 11517 -3621 37579 75280 48462
9977 48462 27006 2930 -77420 -31758 71203 13680 16630 -37123 -36610 -23920 12147 63586
9965 63586 29368 5773 69204 69063 -11331 -13757 -22462 -60943 -80190 -84415 -78931 9869 108484
$$ packed form
10046H0975m7398k1044p303l6649j222K3049R648r714l6100K7476J9105L8946
10034C9769k256m9466n409N9195J1823o6955k4836K6245O5210N5353j6246L7918
10022A30345N2862n3839k9008j0422O683O0381m6055j21472k3609l3742q8994
10011a56870m2469P1402Q2349k2894J3514O8175N2253K3723L8669K8143L5743
10000A91738j7222p6323l7211l5894K6116l7283N2293N1768j0803j6600n9950
9989C0629m9992m1987j3902N979L6139K3436M8888k7673j5138M1200L7701k6818
9977D8462k1456k4076q0350M5662J02961n7523K950n3753N13J2690L6067N1439
9965F3586l4218k3595O3431j41q0394k426q705l8481j9247m225N484Q8800R8615
$$ plain form
9952 108484 110791 59457 17958 -7547 36049 32140 -3554 15622 14226 26962 44093 89756
9940 89756 80512 16595 9519 62663 47888 -3254 -34951 -56334 -110521 -109067 -100668 -33709 -15252
9927 -15252 -68751 -24571 18246 48904 89776 53012 -15730 10844 -15468 -8580 49864 -18568
9915 -18568 -62755 -74290 -143939 -158881 -154949 -135128 -112054 -106274 -51904 11126 59102 69003
9903 69003 18991 -39505 -4091 -31324 -35913 -28404 4373 -36479 -34407 -8685 -25403 -15338
9891 -15338 17023 25175 1971 -20019 43224 17181 -59250 -112105 -108443 -85421 -62143 -2484
9879 -2484 -52398 -89180 -57069 -78945 -94318 -110226 -104031 -81631 -42626 -32381 38353 50815
9867 50815 2954 43451 90140 98083 86051 2765 -29009 -60850 26462 97665 51977 53396
$$ packed form
9952A08484K307n1334m1499k5505M3596l909l5694J9176j396J2736J7131M5663
9940H9756r244o3917p076N3144j4775n1142l1697k1383n4187J454Q399O6959J8457
9927a5252n3499M4180M2817L0658M0872l6764o8742K6574k6312O888N8444o8432
9915a8568m4187j1535o9649j4942L932J9821K3074N780N4370O3030M7976R901
9903F9003n0012n8496L5414k7233m589P509L2777m0852K072K5722j6718J0065
9891a5338L2361Q152k3204k1990O3243k6043p6431n2855L662K3022K3278N9659
9879b484m9914l6782L2111k1876j5373j5908O195K2400L9005J0245P0734J2462
9867E0815m7861M0497M6689P943j2032q3286l1774l1841Q7312P1203m5688J419
$$ plain form
9855 53396 93061 63988 61984 96125 144996 113834 98786 131680 104155 73247 63346 117652
9843 117652 32692 -11913 -45037 -112691 -66675 -24896 73218 79590 77083 54394 106926 108759
9831 108759 59683 18785 -149 -23967 -13009 -9221 37313 38642 3161 -15582 -50050 -33451
9819 -33451 1398 -30110 8348 28141 -12453 7354 29244 -7727 31031 91571 78926 43261
9807 43261 8183 -8110 33758 -27937 -44761 29402 20923 -25779 -49865 -18738 44306 -21559
9795 -21559 -41603 -20008 27229 -18748 -31216 -75120 -178976 -223850 -93941 -68065 -60335 -68475
9783 -68475 -84077 -48706 -16124 67160 126408 102371 141880 73683 12180 -58717 -120280 -123135
9771 -123135 -72824 10912 -44514 -82941 -46943 -9658 -25462 -93500 -87304 30900 80299 37726
$$ packed form
9855E3396L9665k9073k004L4141M8871l1162j5048L2894k7525l0908r901N4306
9843A17652q4960m4605l3124o7654M6016M1779R8114O372k507k2689N2532J833
9831A08759m9076m0898j8934k3818J0958L788M6534J329l5481j8743l4468J6599
9819c3451L4849l1508L8458J9793m0594J9807K1890l6971L8758O0540j2645l5665
9807D3261l5078j6293M1868o1695j6824P4163q479m6702k4086L1127O3044o5865
9795b1559k0044K1595M7237m5977j2468m3904j03856m4874J29909K5876P730q140
9783f8475j5602L5371L2582Q3284N9248k4037L9509o8197o1503p0897o1563k855
9771a23135N0311Q3736n5426l8427L5998L7285j5804o8038O196J18204M9399m2573
$$ plain form
9759 37726 -62194 -122460 -113584 -117291 -11154 87318 21916 10236 8308 21058 58170 73987
9747 73987 22231 -29294 -20494 100695 125777 68458 90845 82616 22028 21395 65618 34488
9735 34488 21839 32985 9465 -20957 36766 -30289 -5909 -669 19479 34219 22989 667
9723 667 51365 47060 56743 81400 92282 50004 30485 23842 14737 48102 45246 53784 60581 55513
9709 55513 11277 -62840 -68560 -101257 -103228 -42306 7860 25757 58231 53856 83800 107431
9697 107431 84212 59956 24825 -26769 -50090 -71045 -94041 -26166 -9523 9638 -6993 -59662
9685 -59662 -63443 -59957 -41550 -16617 -17162 -22074 -6907 -6432 -11611 -23949 -3748 -41772 -73632
9672 -73632 -12546 -708 10238 7600 -31110 -65882 -29218 590 -34320 -10393 -63157 -83036
$$ packed form
9759C7726r9920o0266Q876l707J06137R8472o5402j1680j928J2750L7112J5817
9747G3987n1756n1525Q800J21189K5082n7319K2387q229o0588o33M4223l1130
9735C4488j2649J1146k3520l0422N7723o7055K4380N240K0148J4740j1230k2322
9723F67N0698m305R683K4657J0882m2278j9519o643r105L3365k856Q538O797n068
9709E5513m4236p4117n720l2697j971O0922N0166J7897L2474m375K9944K3631
9697A07431k3219k4256l5131n1594k3321k0955k2996O7875J6643J9161j6631n2669
9685e9662l781L486J8407K4933n45m912J5167M75n179j2338K0201l8024l1860
9672g3632O1086J1838J0946k638l8710l4772L6664K9808l4910K3927n2764j9879
$$ plain form
9660 -83036 -54934 -53945 -83620 -63252 -43386 -61358 -44748 58522 70826 -31675 -122002 -69110
9648 -69110 36601 44806 -9516 -51042 -50564 -15432 15045 -18168 -78810 -40112 -9720 750
9636 750 51460 82975 46047 58766 109378 109174 105985 21038 5037 -19656 -34550 -76475 -77389
9623 -77389 -43427 20542 1535 -23261 -7654 -8724 -6380 13833 68034 126112 105468 50738
9611 50738 42056 -4294 -52959 -75906 -31604 -64227 -86107 -43631 -14337 18948 -755 10845
9599 10845 20002 24437 24844 60944 82884 32675 -2618 -17477 49646 65201 55693 19778 19488
9586 19488 43273 114815 139054 54696 44884 72088 86097 76065 72546 44013 15494 75324
9574 75324 107121 -26523 -66675 -10399 -5598 14862 59879 1606 32947 53183 40320 37169
$$ packed form
9660h3036K8102R89k9675K0368J9866j7972J6610J03270J2304j02501r0327N2892
9648f9110J05711Q205n4322m1526M78L5132L0477l3213o0642L8698L0392J0470
9636G50N0710L1515l6928J2719N0612k04l189q4947j6001k4693j4894m1925r14
9623g7389L3962O3969j9007k4796J5607j070K344K0213N4201N8078k0644n4730
9611E0738q682m6350m8665k2947M4302l2623k1880M2476K9294L3285j9703J1600
9599A0845R157M435M07L6100K1940n0209l5293j4859O7123J5555r508l5915k90
9586A9488K3785P1542K4239q4358r812K7204J4009j0032l519k8533k8519N9830
9574G5324L1797j33644m0152N6276M801K0460M5017n8273L1341K0236j2863l151
$$ plain form
9562 37169 17421 -52819 -38372 21925 1475 -51859 -19849 -40107 -92366 -75653 25862 20729
9550 20729 -47576 -98343 -86546 2057 52913 51885 35993 81385 52850 -36520 7569 -34505
9538 -34505 -62825 -14976 19530 18315 -69808 -99478 -11957 5728 24657 43871 22304 19049
9526 19049 15897 38530 52322 28346 -13283 -29473 -3908 50680 65432 30934 -20150 -427
9514 -427 2103 4468 5542 -79795 -132144 -81695 -40167 -27402 68582 151246 130093 118410 74239
9501 74239 39336 -10723 50124 67726 10199 -12145 -16681 14518 65822 112158 38099 12110
9489 12110 -14757 -54594 -53826 -107817 -109862 -63809 -68979 8421 124383 194571 149425 73818
9477 73818 75401 68897 46812 43768 49390 -17348 -3095 -10809 74466 77667 56516 41577 16202
$$ packed form
9562C7169j9748p0240J4447O0297k0450n3334L2010k0258n2259J6713J01515n133
9550B0729o8305n0767J1797Q8603N0856j028j5892M5392k8535q9370M4089m2074
9538c4505k8320M7849L4506j215q8123k9670Q7521J7685J8929J9214k1567l255
9526A9049l152K2633J3792k3976m1629j6190K5565N4588J4752l4498n1084J9723
9514d27K530K365J074q5337n2349N0449M1528J2765R5984Q2664k1153j1683m4171
9501G4239l4903n0059O0847J7602n7527k2344m536L1199N1304M6336p4059k5989
9489A2110k6867l9837P68n3991k045M6053n170P7400J15962P0188m5146p5607
9477G3818J583o504k2085l044N622o6738J4253p714Q5275L201k1151j4939k5375
$$ plain form
9464 16202 -38549 -31071 -43648 -55723 -7730 36689 25834 73288 31223 -20130 -15715 46354
9452 46354 87252 104078 53436 21880 -16477 -46778 -45990 -67223 -106229 -77079 -72620 -49685
9440 -49685 -57728 -37180 26000 -37653 -10826 -31086 -27257 -49674 -52380 -2492 -12669 -33656
9428 -33656 -30283 -26859 -31052 -22611 -1464 -24527 36816 128647 136608 49004 -36592 -51992 -88598
9415 -88598 -57911 -26903 -42962 -55729 -63979 -62516 -50837 -11556 7578 46558 -4039 -67816
9403 -67816 3286 96665 108077 118601 131765 79722 57123 10085 -17816 -26619 -32791 -23552
9391 -23552 52998 74489 26433 28612 35124 -14983 -27734 -12450 43943 94348 125704 104900
9379 104900 111773 50180 72614 102129 71842 87412 115640 63265 30701 62620 65451 70065
$$ packed form
9464A6202n4751P478j2577j2075M7993M4419j0855M7454m2065n1353M415O2069
9452D6354M0898J6826n0642l1556l8357l0301P88k1233l9006K9150M459K2935
9440d9685q043K0548O3180o3653K6827k0260L829k2417k706M9888j0177k0987
9428c3656L373L424m193Q441K1147k3063O1343R1831P961q7604q5596j5400l6606
9415h8598L0687L1008j6059j2767q250J463J1679L9281J9134L8980n0597o3777
9403f7816P1102R3379J1412J0524J3164n2043k2599m7038k7901q803o172R239
9391b3552P6550K1491m8056K179O512n0107j2751J5284N6393N0405L1356k0804
9379A04900O873o1593K2434K9515l0287J5570K8228n2375l2564L1919K831M614
$$ plain form
9367 70065 58665 27445 39508 6684 54707 10632 9950 57572 42499 62578 82817 74402
9355 74402 45535 90805 153429 98438 11579 9000 31976 85067 88329 100249 45104 38379
9343 38379 61232 33878 78797 81161 62159 94252 113588 61456 26650 6109 -13566 -49287
9331 -49287 -62098 17733 85751 106276 135818 143146 130982 114080 142169 127048 105575 117469
9319 117469 172325 126002 95445 69380 101521 98476 83543 57793 68767 9244 47127 126725
9307 126725 177255 193757 200323 145175 65090 -35086 -37541 -18486 971 78853 71420 54070
9295 54070 79169 117057 84767 95897 149853 201808 236019 214055 160965 154996 140679 121249
9283 121249 140503 112399 175461 179186 111363 117194 204858 178956 48673 12895 17018 47996
$$ packed form
9367G0065j1400l1220J2063l2824M8023m4075o82M7622j5073K0079K0239q415
9355G4402k8867M5270O2624n4991q6859k579K2976N3091L262J1920n5145o725
9343C8379K2853k7354M4919K364j9002L2093J9336n2132l4806k0541j9675l5721
9331d9287j2811P9831O8018K0525K9542P328j2164j6902K8089j5121k1473J1894
9319A17469N4856m6323l0557k6065L2141l045j4933k5750J0974n9523L7883P9598
9307A26725N0530J6502O566n5148q0085j00176k455J9055J9457P7882p433j7350
9295E4070K5099L7888l2290J1130N3956N1955L4211k1964n3090n969j4317j9430
9283A21249J9254k8104O3062L725o7823N831Q7664k5902j30283l5778M123L0978
$$ plain form
9271 47996 10101 65368 91585 45169 37908 59151 70520 79821 57195 24502 -31447 16616
9259 16616 69307 77608 40734 88729 131496 75238 71178 93968 31345 104029 181773 112666
9247 112666 93140 152280 152653 164271 153017 153664 145614 174376 178209 100521 41938 -14402 14724
9234 14724 21679 18602 72111 70795 149071 205513 211907 202052 159956 74365 48735 96270 188048
9221 188048 179472 103759 79804 131053 190036 212027 162503 157582 124165 34958 60883 161346
9209 161346 212152 117483 37549 77345 185979 260807 216535 141283 180798 202443 166672
9198 166672 201414 228262 273495 330471 347313 311434 271598 252121 304310 286721 244046 216790
9186 216790 93809 89275 121986 159623 127113 143417 182416 211534 211475 271322 233353 224855
$$ packed form
9271D7996l7895N5267K6217m6416p261K1243J1369R301k2626l2693n5949M8063
9259A6616N2691Q301l6874M7995M2767n6258m060K2790o2623P2684P7744o9107
9247A12666j9526N9140L73J1618j1254O47q050K8762L833p7688n8583n6340K9126
9234A4724O955l077N3509j316P8276N6442O394r855m2096q5591k5630M7535R1778
9221A88048q576p5713k3955N1249N8983K1991m9524m921l3417q9207K5925J00463
9209A61346N0806r4669p9934L9796J08634P4828m4272p5252L9515K1645l5771
9198A66672L4742K6848M5233N6976J6842l5879l9836j9477N2189j7589m2675k7256
9186B16790j22981m534L2711L7637l2510J6304L8999K9118n9N9847l7969q498
$$ plain form
9174 224855 253672 286895 286819 276968 356786 376894 329849 253810 243824 322511 334923 426432 472542
9161 472542 469493 470844 481376 488616 483028 422021 441445 479341 496133 528598 622993 691046
9149 691046 676577 745046 751102 752081 753235 748321 720446 804881 959580 1095723 1198479 1181224
9137 1181224 1140939 1190119 1270674 1349982 1321582 1424596 1530258 1590242 1668944 1808833 1998539
9126 1998539 2148301 2345253 2558139 2745666 2941591 3073511 3377373 3672571 3981586 4374804
9116 4374804 4780486 5215685 5682289 6226816 6761532 7241187 7769963 8353583 8892039 9297585
9106 9297585 9646836 9885580 9998347 9963039 9787013 9433775 9063540 8721119 8402567 7974530
9096 7974530 7519486 7103504 6654304 6224546 5790334 5438947 5076121 4768373 4516508 4392491
$$ packed form
9174B24855K8817L3223p6r851P9818K0108m7045p6039r986P8687J2412R1509M6110
9161D72542l049J351J0532P240n588o1007J9424L7896J6792L2465R4395O8053
9149F91046j4469O8469O056R79J154m914k7875Q4435J54699J36143J02756j7255
9137A181224m0285M9180Q0555P9308k8400J03014J05662N9984P8702J39889J89706
9126A998539J49762J96952K12886J87527J95925J31920L03862K95198L09015L93218
9116D374804M05682M35199M66604N44527N34716M79655N28776N83620N38456M05546
9106I297585L49251K38744J12767l5308j76026l53238l70235l42421l18552m28037
9096G974530m55044m15982m49200m29758m34212l51387l62826l07748k51865j24017
$$ plain form
9086 4392491 4203927 4006300 3886776 3686413 3471589 3252783 3116090 3011876 2982454 2873412
9076 2873412 2723644 2571931 2569349 2508465 2395257 2328208 2292255 2177521 2034908 1967266 1959308
9065 1959308 1867446 1817702 1755484 1729249 1707988 1597461 1510411 1457726 1391035 1328319 1287113
9054 1287113 1136025 1058753 1082548 1155534 1173302 1077928 1092710 1100294 1093793 1106664 1074991 1072270
9042 1072270 1075607 1023043 1004378 980702 889431 846123 862051 807758 733404 718735 709635 667012
9030 667012 757885 836613 792228 741426 680943 646002 621595 618060 661387 717478 710505 651278
9018 651278 585722 499520 433795 432192 413977 424834 462891 475502 495107 482899 495167 415973
9006 415973 355670 355648 399356 399401 359201 384890 412598 389399 328486 335757 393034 351732 331440
$$ packed form
9086D392491j88564j97627j19524k00363k14824k18806j36693j04214k9422j09042
9076B873412j49768j51713k582o0884j13208o7049l5953j14734j42613o7642p958
9065A959308r1862m9744o2218k6235k1261j10527q7050n2685o6691o2716m1206
9054A287113j51088p7272K3795P2986J7768r5374J4782P584o501J2871l1673k721
9042A072270L337n2564j8665k3676r1271m3308J5928n4293p4354j4669r100m2623
9030F67012R0873P8728m4385n0802o0483l4941k4407l535M3327N6091o973n9227
9018F51278o5556q6202o5725j603j8215J0857L8057J2611J9605j2208J2268p9194
9006D15973o0303k2M3708M5m0200K5689K7708k3199o0913P271N7277m1302k0292
$$ plain form
8993 331440 382464 436764 405421 325047 249926 236436 292828 326710 322561 334255 368730 308625
8981 308625 235507 150252 115059 180086 193538 79292 71811 149992 175304 211434 289354 312980
8969 312980 298707 229023 201398 219583 313070 394789 328367 281466 257123 214524 221512 172595
8957 172595 193742 175739 137826 140917 150778 140970 180871 138906 115652 141507 132086 72250
8945 72250 79999 122646 157032 192158 262779 272574 188384 137922 146165 135725 84246 54254
8933 54254 118764 98786 125642 160345 140152 136934 187834 149155 138891 102426 152693 188656
8921 188656 231235 231628 194803 106828 49907 -1431 -35007 -9190 -17301 27789 44891 44735 98634
8908 98634 118018 199937 215843 159022 88483 84036 72360 9678 -2840 -21691 65281 157325
$$ packed form
8993C31440N1024N4300l1343q0374p5121j3490N6392L3882m149J1694L4475o0105
8981C08625p3118q5255l5193O5027J3452j14246p481P8181K5312L6130P7920K3626
8969C12980j4273o9684k7625J8185R3487Q1719o6422m6901k4343m2599O988m8917
8957A72595K1147j8003l7913L091R861r808L9901m1965k3254K5855r421n9836
8945G2250P749M2647L4386L5126P0621R795q4190n0462Q243j0440n1479k9992
8933E4254O4510j9978K6856L4703k0193l218N0900l8679j0264l6465N0267L5963
8921A88656M2579L93l6825q7975n6921n1338l3576K5817q111M5090J7102j56N3899
8908I8634J9384Q1919J5906n6821p0539m447j1676o2682j2518j8851Q6972R2044
$$ plain form
8896 157325 160646 106443 72496 99010 90885 71241 96191 88415 24694 87265 104370 97254
8884 97254 123124 126781 95808 96880 154731 193859 167007 163346 197129 281172 274486 281195 259963
8871 259963 249711 293193 306475 360531 324713 302135 337022 258183 226387 227066 226292 200297
8859 200297 202543 209603 253221 229247 171559 93137 89975 150728 217386 209427 155063 117245
8847 117245 101154 98494 149993 180753 129487 127803 79158 21976 -34237 -54121 -32545 43556
8835 43556 108507 70317 -15014 -17343 61531 58567 44008 -9001 15327 49376 69887 69246 54808
8822 54808 29206 31981 49475 65239 60571 59481 16262 6692 9732 -12669 27072 -3751 775
8809 775 -15339 -2956 54280 91672 82746 43518 73356 121522 137358 160297 138726 71969
$$ packed form
8896A57325L321n4203l3947K6514q125j9644K4950p776o3721O2571J7105p116
8884I7254K5870L657l0973J072N7851L9128k6852l661L3783Q4043o686O709k1232
8871B59963j0252M3482J3282N4056l5818k2578L4887p8839l1796O79p74k5995
8859B00297K246P060M3618k3974n7688p8422l162O0753O6658p959n4364l7818
8847A17245j6091k660N1499L0760n1266j684m8645n7182n6213j9884K1576P6101
8835D3556O4951l8190q5331k329P8874k964j4559n3009K4328L4049K0511o41j4438
8822E4808k5602K775J7494J5764m668j090m3219r570L040k2401L9741l0823M526
8809G75j6114J2383N7236L7392q926l9228K9838M8166J5836K2939k1571o6757
$$ plain form
8797 71969 55950 95945 132326 78784 38600 8038 -13425 34335 143512 155411 100272 125963
8785 125963 133586 64837 57984 67103 76321 71158 81482 38570 70387 71500 119620 114667 78459
8772 78459 37462 95194 104015 77521 78365 113056 165355 171499 196901 202305 219817 155926 83570
8759 83570 91657 27678 -34986 28271 -21552 -66482 -73365 -37894 -28489 29334 98575 106032 80855
8746 80855 120142 125722 96111 109457 85096 22514 -41561 -71091 -52946 -79063 -38373 -19593
8734 -19593 -42618 -64832 -71349 -24568 46195 61050 14590 31763 77006 66713 66534 101645
8722 101645 155937 146923 87117 53229 85198 62883 50401 85653 92542 41128 -14850 12667
8710 12667 25089 82303 172005 174497 185368 211833 158244 78535 -18065 -92851 -80169 -71475
$$ packed form
8797G1969j6019L9995L6381n3542m0184l0562k1463M7760J09177J1899n5139K5691
8785A25963P623o8749o853R119R218n163J0324m2912L1817J113M8120m953l6208
8772G8459m0997N7732Q821k6494Q44L4691N2299O144K5402N404J7512o3891p2356
8759H3570Q087o3979o2664O3257m9823m4930o883L5471R405N7823O9241P457k5177
8746H0855L9287N580k9611J3346k4361o2582o4075k9530J8145k6117M0690J8780
8734a9593k3025k2214o517M6781P0763J4855m6460J7173M5243j0293j79L5111
8722A01645N4292r014n9806l3888L1969k2315j2482L5252O889n1414n5978K7517
8710A2667J2422N7214Q9702K492J0871K6465n3589p9709r6600p4786J2682Q694
$$ plain form
8698 -71475 -72730 -6182 76851 51139 -31738 -71656 -14853 -5419 45921 15375 76071 111920
8686 111920 20297 -18240 12922 -16598 -1404 35880 54905 106072 115226 113997 126676 166695
8674 166695 125034 120557 122411 78339 28672 26730 49705 49616 62906 42453 -811 -59396 -71026
8661 -71026 -9698 -10381 -24090 28433 27850 14153 38607 60248 57788 69745 52947 34534 106657
8648 106657 132165 27557 5676 14636 67626 25689 21271 -21582 -35728 -10485 -38079 -53855
8636 -53855 -56232 -37456 -565 -28587 9748 9546 -32914 14477 103322 192760 206115 176861
8624 176861 203985 187935 137453 65399 68419 39820 98657 179685 200354 199298 173533 79495
8612 79495 73354 58300 74786 120914 178159 189530 218941 177293 122258 110191 212246 259914
$$ packed form
8698g1475j255O6548Q3033k5712q2877l9918N6803R434N1340l0546O0696L5849
8686A11920r1623l8537L1162k9520J5194L7284J9025N1167R154j229J2679M0019
8674A66695m1661m477J854m4072m9667j942K2975q9J3290k0453m3264n8585j1630
8661g1026O1328o83j3709N2523n83j3697K4454K1641k460J1957j6798j8413P2123
8648A06657K5508j04608k1881Q960N2990m1937m418m2853j4146K5243k7594j5776
8636e3855k377J8776L6891k8022L8335k02m2460M7391Q8845Q9438J3355k9254
8624A76861K7124j6050n0482p2054L020k8599N8837Q1028K0669j056k5765r4038
8612G9495o141j5054J6486M6128N7245J1371K9411m1648n5035j2067J02055M7668
$$ plain form
8600 259914 281413 267786 192141 165546 154202 159256 173578 199035 210793 217247 232135 202309
8588 202309 160790 85511 72902 87969 114292 109476 138199 117607 95485 59162 35599 49763
8576 49763 57245 41932 7766 11024 -1303 -27174 99833 157392 123211 38418 58520 37609
8564 37609 35338 51284 112045 164877 114197 143883 116248 123666 101484 56652 55906 49541 -16911
8551 -16911 -40477 -28237 15004 34730 37014 49977 5862 -76832 -26206 15190 41598 96292
8539 96292 132166 86619 89276 58548 60364 62431 29478 20280 59605 94946 36329 11560 24407
8526 24407 29194 50736 44854 104593 105632 46335 59012 101400 125139 98608 118309 75347
8514 75347 71918 66734 89183 123121 123772 142464 173211 195649 113640 31324 68236 95166 65845
$$ packed form
8600B59914K1499j3627p5645k6595j1344N054J4322K5457J1758O454J4888k9826
8588B02309m1519p5279j2609J5067K6323m816K8723k0592k2122l6323k3563J4164
8576D9763P482j5313l4166L258j2327k5871J27007N7559l4181q4793K0102k0911
8564C7609k271J5946O0761N2832n0680K9686k7635P418k2182m4832p46o365o6452
8551a6911k3566J2240M3241J9726K284J2963m4115q2694N0626M1396K6408N4694
8539I6292L5874m5547K657l0728J816K067l2953r198L9325L5341n8617k4769J2847
8526B4407M787K1542n882N9739J039n9297J2677M2388K3739k6531J9701m2962
8514G5347l429n184K2449L3938O51J8692L0747K2438q2009q2316L6912K6930k9321
$$ plain form
8501 65845 56840 44186 9432 -38465 -64609 -7473 -4944 12250 5179 40163 57024 21848
8489 21848 -5008 6007 10520 27306 86006 71721 24526 29523 70448 117119 60076 23918
8477 23918 41515 30536 60800 88237 162431 179189 105742 25742 24767 37673 -34415 1953
8465 1953 86221 106263 165493 153970 77397 39231 71793 34494 -13322 20756 -35396 25075
8453 25075 86236 54285 62767 71465 52178 28988 11140 5259 20038 69431 26173 -44098
8441 -44098 -91912 -79707 -58706 -76617 -50205 -86623 -44928 -58094 -97308 -101339 -87613 -57260
8429 -57260 68921 103166 55234 41672 55227 44676 92623 124680 41233 69150 104077 89692
8417 89692 126084 105905 136115 68848 44355 45256 74472 89814 83310 -4200 -43347 17233
$$ packed form
8501F5845r005j2654l4754m7897k6144N7136K529J7194p071L4984J6861l5176
8489B1848k6856J1015M513J6786N8700j4285m7195M997M0925M6671n7043l6158
8477B3918J7597j0979L0264K7437P4194J6758p3447q0000r75J2906p2088L6368
8465A953Q4268K0042N9230j1523p6573l8166L2562l7299m7816L4078n6152O0471
8453B5075O1161l1951Q482Q698j9287k3190j7848n881J4779M9393m3258p0271
8441d4098m7814J2205K1001j7911K6412l6418M1695j3166l9214m031J3726L0353
8429e7260J26181L4245m7932j3562J3555j0551M7947L2057q3447K7917L4927j4385
8417H9692L6392k0179L0210o7267k4493R01K9216J5342o504q7510l9147O0580
$$ plain form
8405 17233 75467 84925 53629 -18664 -715 28499 -15427 -89633 -66492 -69269 -47968 -35377
8393 -35377 -51047 -76978 -58102 -93170 -57719 -2608 -17083 -50320 -19820 22197 25941 7320
8381 7320 -30036 -66530 -70790 -23769 -23847 -5998 6047 -39397 -78721 -46989 5041 23308 30377
8368 30377 3079 10414 35041 7090 31943 48320 75507 125005 129893 62540 35368 45968
8356 45968 88848 57573 48057 48545 -1444 -92596 -80762 -52847 -65053 -61328 -490 95017 76100
8343 76100 45013 -14885 -37769 -65922 -106353 -54480 -75587 -78318 -24478 41100 117143 148697
8331 148697 94795 83669 43759 93295 106501 118129 85087 32425 -81 31439 34081 -4588
8319 -4588 27767 33918 -35174 -70588 -120433 -158436 -126878 -68503 -30697 -11547 33002 104205
$$ packed form
8405A7233N8234R458l1296p2293J7949K9214m3926p4206K3141k777K1301J2591
8393c5377j5670k5931J8876l5068L5451N5111j4475l3237L0500M2017L744j8621
8381G320l7356l6494m260M7021p8J7849J2045m5444l9324L1732N2030J8267P069
8368C0377k7298P335K4627k7951K4853J6377K7187M9498M888o7353k7172J0600
8356D5968M2880l1275r516M88m9989r1152J1834K7915j2206L725O0838R5507j8917
8343G6100l1087n9898k2884k8153m0431N1873k1107k731N3840O5578P6043L1554
8331A48697n3902j1126l9910M9536J3206J1628l3042n2662l2506L1520K642l8669
8319d588L2355O151o9092l5414m9845l8003L1558N8375L7806J9150M4549P1203
$$ plain form
8307 104205 81423 -4550 -46650 -48419 -42861 -41771 -40817 -10503 41098 21885 -16155 -71214 -119162
8294 -119162 -77934 -31304 49583 39489 -17135 49651 114162 145880 133588 79058 88420 107179
8282 107179 59286 1606 -30981 -10989 42099 121255 130063 63034 -7945 -51492 -24748 -45795
8270 -45795 -59758 -92741 -56579 -11737 -33083 -15338 15634 85549 14808 -65655 -17748 -8198
8258 -8198 6304 -45306 31630 122253 117302 87162 82230 61492 72400 99023 81160 7232
8246 7232 23742 57986 -14835 -40788 50893 63001 31951 12870 74709 72797 28176 12344
8234 12344 31484 101405 53765 -49420 -38443 -8233 -12505 -9832 9492 1911 31211 -38715
8222 -38715 -38627 54366 17959 31372 58466 80875 62332 53266 63601 67238 83889 58981 41521
$$ packed form
8307A04205k2782q5973m2100j769N558J090R54L0314N1601j9213l8040n5059m7948
8294a19162M1228M6630Q0887j0094n6624O6786O4511L1718j2292n4530R362J8759
8282A07179m7893n7680l2587J9992N3088P9156Q808o7029p0979m3547K6744k1047
8270d5795j3963l2983L6162M4842k1346J7745L0972O9915p0741q0463M7907R550
8258h198J4502n1610P6936R0623m951l0140m932k0738J0908K6623j7863p3928
8246G232J6510L4244p2821k5953R1681J2108l1050j9081O1839j912m4621j5832
8234A2344J9140O9921m7640j03185J0977L0210m272K673J9324p581K9300o9926
8222c8715Q8R2993l6407J3413K7094K2409j8543r066J0335L637J6651k4908j7460
$$ plain form
8209 41521 -39806 -61046 -47699 13853 45685 10748 22878 -6607 -31207 -47330 -53108 -2174
8197 -2174 69424 -15306 11985 18760 7095 -20666 31698 88497 111167 47865 -33745 -54609
8185 -54609 -36073 -33742 -68052 -46166 -42056 -34142 -17908 -7270 -29096 -50778 -32669 -36267 7320
8172 7320 -28776 -68382 -66297 25762 75048 87647 127050 59587 82638 52744 -44046 -48690
8160 -48690 -2464 32122 -9990 -22482 -79077 -131081 -100637 -29178 -23626 -67918 -117654 -88768
8148 -88768 -62664 -51690 8246 17386 -14432 28889 3236 -19727 -44440 -89566 19475 84676
8136 84676 45763 28711 8550 13548 5218 -22391 39715 -42111 -24594 94139 110638 82114
8124 82114 41257 18050 2932 -26486 -56748 -94872 -37763 64772 1260 -29338 -6288 17257
$$ packed form
8209D1521q1327k1240J3347O1552L1832l4937J2130k9485k4600j6123n778N0934
8197b174P1598q4730K7291O775j1665k7761N2364N6799K2670o3302q1610k0864
8185e4609J8536K331l4310K1886M110P914J6234J0638k1826k1682J8109l598M3587
8172G320l6096l9606K085R2059M9286J2599L9403o7463K3051k9894r6790m644
8160d8690M6226L4586m2112j2492n6595n2004L0444P1459N552m4292m9736K8886
8148h8768K6104J0974N9936R140l1818M3321k5653k2963k4713m5126J09041O5201
8136H4676l8913j7052k0161M998q330k7609O2106q1826J7517J18733J6499k8524
8124H2114m0857k3207j5118k9418l0262l8124N7109J02535o3512l0598K3050K3545
$$ plain form
8112 17257 52357 44995 25464 -8435 -13150 32931 7125 -68190 -119039 -5069 46409 15669
8100 15669 -98015 -99243 32168 112782 127064 65262 4855 -14911 -28525 -7361 86563 200801
8088 200801 228025 163965 101758 50585 27131 38974 85663 67927 76717 74108 19023 29187
8076 29187 -22584 -47014 -23210 69314 105178 107298 178724 214618 174117 140331 133388 49824
8064 49824 31227 33843 130105 184180 111448 72172 131732 206478 129505 49550 75603 57826
8052 57826 62521 106523 158910 116039 78998 110802 79905 71034 53332 52710 15703 -2935 -4765
8039 -4765 17590 50151 -2182 -35665 -8052 -34953 -5645 98144 80668 55242 3864 -45348
8027 -45348 -25826 24562 77250 136223 76591 103457 130853 113591 85229 78835 61042 15699
$$ packed form
8112A7257L5100p362j9531l3899m715M6081k5806p5315n0849J13970N1478l0740
8100A5669j13684j228J31411Q0614J4282o1802o0407j9766j3614K1164R3924J14238
8088B00801K7224o4060o2207n1173k3454J1843M6689j7736Q790k609n5085J0164
8076B9187n1771k4430K3804R2524L5864K120P1426L5894m0501l3786o943q3564
8064D9824j8597K616R6262N4075p2732l9276N9560P4746p6973p9955K6053j7777
8052E7826M695M4002N2387m2871l7041L1804l0897q871j7702o22l7007j8638j830
8039d765K2355L2561n2333l3483K7613k6901K9308J03789j7476k5426n1378m9212
8027d5348J9522N0388N2688N8973n9632K6866K7396j7262k8362o394j7793m5343
$$ plain form
8015 15699 49442 114817 137528 99235 59311 67096 101756 147697 133523 126959 152461 172146
8003 172146 124464 44705 -18257 29531 -12592 -1092 -3012 -23130 -50223 -38748 -34575 -7129
7991 -7129 -2884 40555 87484 135863 211246 200362 148283 110842 117613 88596 44454 153513
7979 153513 198179 208009 165057 94247 39182 19852 88488 107045 85532 98551 122987 135035
7967 135035 118119 121325 110200 89335 95467 104810 81513 40940 46277 89780 64485 61003 68881
7954 68881 114171 158626 89569 133483 120218 72443 95653 117470 82797 71584 62133 84327
7942 84327 158273 142503 129317 133919 151995 153436 54096 -4704 22879 72248 63558 48563
7930 48563 36937 48870 23776 -30105 -98592 -29763 -7029 47476 101143 29703 16448 32411
$$ packed form
8015A5699L3743O5375K2711l8293l9924P785L4660M5941j4174o564K5502J9685
8003A72146m7682p9759o2962M7788m2123J1500j920k0118k7093J1475M173K7446
7991g129M245M3439M6929M8379P5383j0884n2079l7441O771k9017m4142J09059
7979A53513M4666R830m2952p0810n5065j9330O8636J8557k1513J3019K4436J2048
7967A35035j6916L206j1125k0865O132R343k3297m0573N337M3503k5295l482P878
7954F8881M5290M4455o9057M3914j3265m7775K3210K1817l4673j1213r451K2194
7942H4327P3946j5770j3186M602J8076J441r9340n8800K7583M9369q690j4995
7930D8563j1626J1933k5094n3881o8487O8829K2734N4505N3667p1440j3255J5963
$$ plain form
7918 32411 88412 167328 115511 80547 66596 68944 -598 -46935 -52527 -4154 67607 82422
7906 82422 80349 22845 27181 21280 33261 63414 63978 4343 -34062 -50588 -15106 2593 -2695
7893 -2695 -1647 71938 87123 36968 -29327 -37913 -23740 11357 67696 86302 86041 66928 -5311
7880 -5311 -23494 46447 85824 41993 37113 92572 58332 -41670 -91238 -92312 -30161 -23305
7868 -23305 -13710 -74821 -53708 -1238 28672 16713 6940 17302 25436 53708 103656 124396
$$ packed form
7918C2411N6001P8916n1817l4964j3951K348o9542m6337n592M8373P1761J4815
7906H2422k073n7504M336n901J1981L0153N64n9635l8405j6526L5482J7699n288
7893b695J048P3585J5185n0155o6295q586J4173L5097N6339J8606k61j9113p2239
7880e311j8183O9941L9377m3831m880N5459l4240j00002m9568j074O2151O856
7868b3305R595o1111K1113N2470K9910j1959r773J0362Q134K8272M9948K0740
$$ [...]
##END NTUPLES=NMR SPECTRUM
##END=
