##TITLE=Analysis number 318626
Compound Code cc 53708
Book Reference 458/114
Project Code adrs
Chemist Name stevem
##JCAMPDX= 6.0         $$ Bruker NMR JCAMP-DX V2.0
##DATA TYPE= NMR SPECTRUM
##DATA CLASS= NTUPLES
##ORIGIN= Bruker BioSpin GmbH
##OWNER= nmr
$$ XWIN-NMR		Version 3.5
$$ Thu Apr  6 09:25:41 2006 GMT Daylight Time (UT+1h)  MAYBRIDGE\nmr@NMR_250MHZ
##.OBSERVE FREQUENCY= 250.131544655141
##.OBSERVE NUCLEUS= ^1H
##.ACQUISITION MODE= SIMULTANEOUS (DQD)
##.ACQUISITION SCHEME= undefined
##.AVERAGES= 16
##.DIGITISER RES= 18
##SPECTROMETER/DATA SYSTEM= dpx250
##.PULSE SEQUENCE= zg30
##.SOLVENT NAME= CDCl3
##.SHIFT REFERENCE= (INTERNAL, CDCl3, 0, 16.522)
##AUDIT TRAIL= $$ (NUMBER, WHEN, WHO, WHERE, WHAT)
$$ ##TITLE= Audit trail, XWIN-NMR		Version 3.5
$$ ##JCAMPDX= 5.01
$$ ##ORIGIN= Bruker BioSpin GmbH
$$ ##OWNER= nmr
$$ C:\u/data/dgb/nmr/ADRS/2270/pdata/1/auditp.txt
$$ ##AUDIT TRAIL=  $$ (NUMBER, WHEN, WHO, WHERE, WHAT)
(   1,<2006-04-06 09:25:12.09 +100>,<MAYBRIDGE\nmr>,<NMR_250MHZ>,
      <created by zg, POWCHK disabled, PULCHK disabled
       configuration hash MD5:
       84 BC 41 DB A1 6E 1D 46 DA 25 12 A5 C1 ED C5 3A
       data hash MD5: 64K
       3B 2A D4 9D 74 8D C3 35 CE 4A 44 9C AD 42 09 FD>)
(   2,<2006-04-06 09:25:30.92 +100>,<MAYBRIDGE\nmr>,<NMR_250MHZ>,
      <Start of raw data processing
       ef LB = 0.3 FT_mod = 6 PKNL = 1 SI = 32K 
       data hash MD5: 32K
       CB 99 54 AF 6F 9B 9A 18 1B 06 6B C8 41 33 A6 BF>)
(   3,<2006-04-06 09:25:32.44 +100>,<MAYBRIDGE\nmr>,<NMR_250MHZ>,
      <apk 
       data hash MD5: 32K
       92 8F 87 42 80 4D 47 B3 B4 1B 29 7F 57 74 D4 A9>)
(   4,<2006-04-06 09:25:33.17 +100>,<MAYBRIDGE\nmr>,<NMR_250MHZ>,
      <abs ABSG = 5 
       data hash MD5: 32K
       A6 F7 96 7F E0 29 F7 61 E9 27 92 3B 09 E1 52 D6>)
$$ ##END=
$$ 
$$ hash MD5
$$ 6F EF 58 49 98 87 E8 00 4A 4A 02 82 EE 1C 8B 8B
##$RELAX= 
##$RELAX= 
##$RELAX= 
##$RELAX= 
##$RELAX= 
##$RELAX= 
##$RELAX= 
$$ Bruker specific parameters
$$ --------------------------
##$DU= <C:\u>
##$EXPNO= 2270
##$NAME= <ADRS>
##$PROCNO= 1
##$TYPE= <nmr>
##$USER= <dgb>
##$AMP= (0..31)
100 100 100 100 100 100 100 100 100 100 100 100 100 100 100 100 100 100 
100 100 100 100 100 100 100 100 100 100 100 100 100 100 
##$AQSEQ= 0
##$AQ_mod= 3
##$AUNM= <au_zg>
##$AUTOPOS= <7 >
##$BF1= 250.13
##$BF2= 250.13
##$BF3= 250.13
##$BF4= 250.13
##$BF5= 500.13
##$BF6= 500.13
##$BF7= 500.13
##$BF8= 500.13
##$BYTORDA= 1
##$CFDGTYP= 0
##$CFRGTYP= 5
##$CHEMSTR= <none>
##$CNST= (0..31)
1 1 145 1 1 1 1 1 1 1 1 1 1 1 1 1 1 1 1 1 1 1 1 1 1 1 1 1 1 1 1 1 
##$CPDPRG= <>
##$CPDPRG1= <>
##$CPDPRG2= <>
##$CPDPRG3= <>
##$CPDPRG4= <mlev>
##$CPDPRG5= <mlev>
##$CPDPRG6= <mlev>
##$CPDPRG7= <mlev>
##$CPDPRG8= <mlev>
##$CPDPRGB= <>
##$CPDPRGT= <>
##$D= (0..31)
0 1 0 0 0 0 0 0 0 0.06 0 0 0 0 0 0 0.0002 0 0 0 0 0 0 0 0 0 0 0 0 0 0 
0 
##$DATE= 1144311909
##$DBL= (0..7)
120 120 120 120 120 120 120 120 
##$DBP= (0..7)
150 150 150 150 150 150 150 150 
##$DBP07= 0
##$DBPNAM0= <>
##$DBPNAM1= <>
$$ [...]
##$SUBNAM7= <"">
##$SUBNAM8= <"">
##$SUBNAM9= <"">
##$SW= 20.6930455092707
##$SWIBOX= (0..15)
0 0 3 0 0 0 0 0 0 0 0 0 0 0 0 0 
##$SW_h= 5175.983436853
##$TD= 65536
##$TD0= 1
##$TE= 294.16
##$TE2= 300
##$TE3= 300
##$TEG= 300
##$TL= (0..7)
0 120 120 120 120 120 120 120 
##$TP= (0..7)
150 150 150 150 150 150 150 150 
##$TP07= 0
##$TPNAME0= <>
##$TPNAME1= <>
##$TPNAME2= <>
##$TPNAME3= <>
##$TPNAME4= <>
##$TPNAME5= <>
##$TPNAME6= <>
##$TPNAME7= <>
##$TPOAL= (0..7)
0.5 0.5 0.5 0.5 0.5 0.5 0.5 0.5 
##$TPOFFS= (0..7)
0 0 0 0 0 0 0 0 
##$TUNHIN= 0
##$TUNHOUT= 0
##$TUNXOUT= 0
##$USERA1= <user>
##$USERA2= <user>
##$USERA3= <user>
##$USERA4= <user>
##$USERA5= <user>
##$V9= 5
##$VALIST= <valist>
##$VCLIST= <CCCCCCCCCCCCCCC>
##$VD= 0
##$VDLIST= <DDDDDDDDDDDDDDD>
##$VPLIST= <PPPPPPPPPPPPPPP>
##$VTLIST= <TTTTTTTTTTTTTTT>
##$WBST= 1024
##$WBSW= 4
##$XGAIN= (0..3)
0 0 0 0 
##$XL= 0
##$YL= 0
##$YMAX_a= 476087
##$YMIN_a= -489270
##$ZGOPTNS= <>
##$ZL1= 120
##$ZL2= 120
##$ZL3= 120
##$ZL4= 120
##$ABSF1= 16.522
##$ABSF2= -4.171173
##$ABSG= 5
##$ABSL= 3
##$ALPHA= 0
##$AQORDER= 0
##$ASSFAC= 0
##$ASSFACI= 0
##$ASSFACX= 0
##$ASSWID= 0
##$AUNMP= <proc_1d>
##$AZFE= 0.1
##$AZFW= 0.1
##$BCFW= 0
##$BC_mod= 0
##$BYTORDP= 0
##$COROFFS= 0
##$CY= 12.5
##$DATMOD= 1
##$DC= 0
##$DFILT= <>
##$DTYPP= 0
##$F1P= 14.0000005364418
##$F2P= -0.99999901652339
##$FCOR= 0.5
##$FTSIZE= 32768
##$FT_mod= 6
##$GAMMA= 0
##$GB= 0
##$INTBC= 1
##$INTSCL= 1
##$ISEN= 128
##$LB= 0.3
##$LEV0= 0
##$LPBIN= 0
##$MAXI= 10000
##$MC2= 0
##$MEAN= 0
##$ME_mod= 0
##$MI= 0
##$NCOEF= 0
##$NC_proc= -4
##$NLEV= 6
##$NOISF1= 0
##$NOISF2= 0
##$NSP= 0
##$NTH_PI= 0
##$NZP= 0
##$OFFSET= 16.522
##$PC= 1
##$PHC0= 172.4562
##$PHC1= 9.642554
##$PH_mod= 1
##$PKNL= yes
##$PPARMOD= 0
##$PSCAL= 4
##$PSIGN= 0
##$REVERSE= no
##$SF= 250.13
##$SI= 32768
##$SIGF1= 0
##$SIGF2= 0
##$SINO= 400
##$SIOLD= 32768
##$SREGLST= <1H.CDCl3>
##$SSB= 0
##$STSI= 32768
##$STSR= 0
##$SW_p= 5175.98343685301
##$SYMM= 0
##$S_DEV= 0
##$TDeff= 65536
##$TDoff= 0
##$TI= <Analysis number 999999
Compound Code 99
Book Reference 9
Project Code 9>
##$TILT= no
##$TM1= 0
##$TM2= 0
##$TOPLEV= 0
##$USERP1= <user>
##$USERP2= <user>
##$USERP3= <user>
##$USERP4= <user>
##$USERP5= <user>
##$WDW= 1
##$XDIM= 32768
##$YMAX_p= 404842412
##$YMIN_p= -218567
$$ End of Bruker specific parameters
$$ ---------------------------------
##NTUPLES= NMR SPECTRUM
##VAR_NAME=  FREQUENCY,     SPECTRUM/REAL,   SPECTRUM/IMAG
##SYMBOL=    X,             R,               I
##VAR_TYPE=  INDEPENDENT,   DEPENDENT,       DEPENDENT
##VAR_FORM=  AFFN,          ASDF,            ASDF
##VAR_DIM=   32768,         32768,           32768
##UNITS=     HZ,            ARBITRARY UNITS, ARBITRARY UNITS
##FACTOR=    0.157963299565203, 1,           1
##FIRST=     4132.6476996994, 0,             0
##LAST=      -1043.33573715361, 0,           0
##MIN=       -1043.33573715361, -218567,     0
##MAX=       4132.6476996994, 404842412,     0
$$ Real data points
##PAGE= N=1
##DATA TABLE= (X++(R..R)), XYDATA
$$ [...]
23534 -61959 -41546 -50176 -32298 13974 46577 37059 6670 33814 -7539 -33484 13210 -3402
23522 -3402 -57148 -55482 -9046 55985 83065 128711 46844 -8798 11178 -3900 -11407 -56262
23510 -56262 -134392 -66055 -49843 -17023 44434 1525 8854 99876 172309 147837 79192 56184
23498 56184 65386 48861 33176 -19283 -103738 -76261 -10732 51551 61648 12176 -6714 -50558
23486 -50558 -33364 -2109 89903 113145 24757 -36237 -50220 -123313 -144141 -113247 -69792 -29685
23474 -29685 -66876 -103167 -101778 -49346 -23925 12572 659 -53583 -45523 -39864 -25518 -35613
23462 -35613 -53607 9949 40238 21655 -10764 -37832 -38828 -28639 17120 -16372 -39447 -23135
23450 -23135 -49463 -41250 -65001 -71255 -44385 -36051 41417 23954 50336 65357 61632 65292 99428
23437 99428 116143 56169 52199 72224 129075 177965 143094 88732 4201 -41759 -19802 -10512
23425 -10512 -23423 27392 74446 73890 109186 167498 139303 78142 29317 43665 107748 77074
23413 77074 63680 29997 -26339 -3081 47004 40949 -35432 -101900 -129769 -24603 -10046 11998
23401 11998 54396 105333 61318 -18689 -1569 43610 53078 30752 -1013 11664 -12528 -52979
23389 -52979 -38131 -25432 -27990 -20958 -4158 -2325 -29287 -22277 -45908 -83964 -82614 -83092 -117428
23376 -117428 -106768 -53098 -31937 -64588 -72291 -18758 4683 13593 30647 51487 52119 -7277
23364 -7277 -69597 -82966 -116465 -145592 -129338 -92677 4704 -21230 -89142 -124518 -65791 -5122
23352 -5122 -1677 -4469 54630 33584 -49336 -66315 -8322 4051 -36569 -35805 10442 3245 -6764
23339 -6764 11667 19868 20431 24966 -30591 -52657 -58345 -52625 -8908 -10830 -20358 -19712 -35598 -41092
23325 -41092 -42105 -24819 12268 -9745 -24399 -1968 45918 74405 -156 -45797 -61983 -91085
23313 -91085 -84732 -137129 -150222 -80114 -34885 31572 59001 32644 8186 20705 -796 -40622
23301 -40622 -48679 -90500 -88855 -49493 -69583 -87367 -69159 -19125 28845 35778 35927 5736 -41284
23288 -41284 -38624 -23140 -13900 -72780 -56475 -13319 3025 -9133 19483 18696 -13771 -41430
23276 -41430 -35749 -21465 -30209 -30868 -8246 -62756 -111861 -110274 -74805 -45896 14253 61900 27743
23263 27743 -36957 -23514 -27284 28298 39209 -11021 -61678 -8475 -3347 -35713 -27815 10685
23251 10685 4253 -21175 52886 51697 -5930 17111 55504 85836 63761 54847 12894 -27122
23239 -27122 -13617 30955 56150 71518 103791 84798 -4747 23222 111525 119235 58574 46498
23227 46498 75852 87485 25612 -32537 -49567 -642 -4213 23734 -4762 -28725 -64970 -73721
23215 -73721 -85983 -19281 -49355 -84920 -76335 -57255 -94382 -149254 -115141 -107542 -163123 -152491
23203 -152491 -93226 -25778 5266 -24840 -67702 -100693 -84839 -106027 -140740 -152463 -141536
23192 -141536 -124098 -61997 -59786 -89346 -71914 -146322 -183823 -151059 -78793 -16884 -39822 -73804
23180 -73804 -100620 -100464 -76611 5737 2600 -37955 1603 23240 -8342 -13947 8101 -5367
23168 -5367 -55146 -86238 -128309 -70667 33340 46104 33546 -50719 -63346 -13905 36975 19316
23156 19316 -2032 8559 14422 29049 -622 -70255 -118473 -49817 35775 59608 53989 36368
23144 36368 -32194 6556 56982 78672 11470 522 34834 86184 152607 196747 120863 51312
23132 51312 38014 -13176 -45072 -83925 -50228 12306 16658 -68279 -68669 -23585 -24994 -71343
23120 -71343 -129324 -59840 -66218 -59186 -75681 -73533 -79910 -77708 -86057 -63186 -46929 -64551 -30917
23107 -30917 65895 106052 81446 9130 -55845 -45975 33229 59345 93429 106811 76457 93389
23095 93389 37855 -37724 -40024 -39120 24181 62079 115813 89441 88895 78964 39115 -34133 -58850
23082 -58850 -66484 -50081 -62137 -85236 -14266 65348 54999 64800 38631 49616 108468 78490
23070 78490 59112 53016 95765 61445 52106 41371 47634 62072 65010 56384 9735 -19466 -58420
23057 -58420 -100985 -102580 -16385 -28080 -69109 -46715 -26720 34791 57862 28800 -57313 -62344
23045 -62344 -6163 -46968 -94522 -113440 -107170 -113185 -142227 -164878 -134307 -127776 -192193 -144264
23033 -144264 -68391 -24078 -39806 -13704 70776 81030 13276 -20222 -43332 -49430 -19333 25524
23021 25524 8533 -24107 -4191 6600 -14481 -38334 -56643 -49836 1029 61310 37596 19802
23009 19802 51578 37315 -23207 -44424 -6952 15415 45277 19214 14985 -54623 -113363 -121018
22997 -121018 -48913 -13726 18845 15491 24744 9206 58545 18782 8810 50541 64616 64906
22985 64906 38529 38245 31986 40026 44641 633 8940 31597 -36332 -39052 -84620 -45130 -36512
22972 -36512 -124229 -131155 -113514 -106213 -86672 -81573 -56255 -68553 -40029 -15082 -87725 -130124
22960 -130124 -59101 50414 35916 12033 -23782 -36789 -54557 -82148 -45225 -51620 -51208 -1257
22948 -1257 4580 8233 60792 63959 -13583 -51824 -78162 -65222 -86125 -71077 -27639 -27503 6808
22935 6808 51619 45575 115 -56952 -57415 -24305 18728 16191 -8275 -19497 32600 67000 57213
22922 57213 45710 3910 28951 64408 5785 15159 38287 -17129 -80809 -70075 -92942 -105472
22910 -105472 -74733 -39467 -10791 -230 -8767 22666 70909 73892 58453 117867 96479 28924
22898 28924 30909 43307 -30254 -66531 -26983 38815 77029 60605 72661 98141 104577 67461
22886 67461 28159 -337 26678 52111 4073 22555 31692 26476 7144 -7765 -36773 -59864
22874 -59864 20300 12295 68766 40273 -11186 -6303 -12360 11644 -36081 -101957 -131576 -149692
22862 -149692 -86431 -47256 -65798 -8059 -20158 -72092 -25701 27004 41653 20595 -25461
22851 -25461 -86396 -67783 21763 86662 148713 122720 98770 93216 90533 105615 -18440 -126238
22839 -126238 -112193 -111779 -78681 -51080 3163 27572 -11577 -91567 -128201 -87208 -65271 -62195
22827 -62195 -13966 -20578 -49195 -51601 -14230 -26357 -15730 -45436 -5974 74690 48491 21634
22815 21634 -31454 -31590 -10059 28954 -13960 -33606 -29828 -40363 -30934 -41515 -53506 -18048
22803 -18048 24471 16258 2699 60091 58500 34698 14364 -587 10784 78663 104349 122073
22791 122073 42567 -17015 -67056 -56168 -76897 -66040 -30577 19700 -17557 -2274 18697
22780 18697 19042 32845 30207 -5342 -30034 -22478 -14019 -4042 48112 15942 -19605 -48344 -91951
22767 -91951 -36711 15933 -22835 -71566 -43980 -63322 -86185 -73258 -66549 -26048 8142 4136
22755 4136 2711 -7038 31079 56654 54609 -25436 -55648 -44702 -63461 -43290 -40214 -32960 -21373
22742 -21373 1620 6687 24092 57179 -11711 4251 95791 121876 53572 -32917 40793 60126
22730 60126 55103 88279 34063 -50683 -51162 -23744 -61339 -107952 -89549 -32219 -58251 -3212
22718 -3212 -24574 -44403 -26748 -26098 15725 28483 -6649 -16268 -29016 -26233 -20957 -108491 -84833
22705 -84833 -41037 -1578 428 35677 55768 25682 -52116 -41875 -7185 -28746 -57576 -39890
22693 -39890 7853 27396 69144 53152 45537 73710 93396 54161 -29366 1340 71362 114551
22681 114551 129618 133045 113617 61275 26312 -11765 -12779 -35081 -63016 -46496 -79498 -89861
22669 -89861 -101406 -150827 -110114 10046 -23735 -76645 -72424 -28564 -50854 -75467 -51311 -50418
22657 -50418 -42600 -4066 -13818 -33725 -33978 -13338 17439 13770 -112 61729 54750 28975 184
22644 184 -27662 -26796 9978 -45252 -96765 -89928 -34511 19490 36394 24514 25117 59123 55980
22631 55980 73806 64533 71758 47725 14973 -55395 -28574 -13949 -45620 -83069 17094 41822
22619 41822 65699 29051 -17376 -28366 -51958 -8806 55346 21226 -68538 -46786 -4166 21491
22607 21491 33579 20172 64645 38535 20800 383 -37108 -92778 -74197 -4126 -6083 48792
22595 48792 20155 47292 46298 31833 -56151 -102937 -55057 -28109 -33027 -59521 -20223 -15343
22583 -15343 -95494 -56704 -4841 66709 106712 118685 99786 20345 -28352 -28199 56215 102603
22571 102603 34938 40705 6927 -38779 26875 -12198 -32267 -18869 9187 -55 -20176 -14330
22559 -14330 -60807 -36551 10473 25980 -36079 -7658 -26286 5836 7703 -76 24989 1815
22547 1815 -22207 34632 70215 65070 1249 -37481 -51306 -78217 -66302 36516 58930 43057
22535 43057 23679 22540 54330 28065 5037 -7776 -5882 -2845 59234 56861 13371 46874
22523 46874 6372 -9629 4428 12494 -13333 -49000 -65932 -63692 -32958 -9553 -31068 -46309
22511 -46309 -84813 -62083 -37088 -35613 -31445 -77306 -37759 -60156 -45074 -6415 -11612 33084
22499 33084 26336 31028 42224 30153 37105 83611 143931 125951 66494 82665 45763 -7523
22487 -7523 319 42768 54045 97116 121717 153241 147602 71675 26496 31580 46697 50149 12301
22474 12301 11596 7551 30604 52874 68602 49986 5329 -15582 -10270 50500 -6563 -58625
22462 -58625 -76145 -60278 41855 75488 -18255 -46673 -30177 17193 -43929 -91339 -120031
22451 -120031 -111524 -31380 -22220 -62706 -99574 -57165 -65719 -48739 -79042 -101406 -69140 -35449
22439 -35449 -29223 -10912 8611 55479 94946 128968 97613 35458 -890 66335 101128 57634
22427 57634 -41519 -81757 -13367 -26733 7371 71660 82256 45601 52802 -18338 -69246 -61209
22415 -61209 -79047 -45092 6975 -17075 30398 25385 36039 27204 19580 29620 16010 7422
22403 7422 7343 -18511 5103 2161 43324 25341 -10633 -69635 -116141 -79119 -22615 -7194 -25754
22390 -25754 -18432 -44611 47954 51531 -3077 366 -10205 -45788 -40006 -11715 -8426 -519 45992
22377 45992 -3457 -16499 -2917 16062 -15804 24253 22295 -15581 -46734 -50797 -39669 -33367
22365 -33367 -737 -13247 -11034 -1246 20669 15809 -54434 -47564 6404 7514 -25950 -8820 14787
22352 14787 15987 -10327 -96354 -90099 -66047 -79427 -64438 -12140 -2895 -55384 -56581 -47313 -32983
22339 -32983 11983 58967 145612 135737 131637 192691 159459 37769 -6586 -14810 -34113 -36891
22327 -36891 -2438 30145 15363 -7458 50516 58491 10096 69818 48810 -15144 4984 -13043
22315 -13043 29345 68148 40937 -7563 -42059 -21106 -33714 -76601 -85320 -40846 -53571 -28527
22303 -28527 29466 28756 21989 84309 105891 83492 52961 22508 -49253 -110019 -77457 -48147
22291 -48147 -85885 -116435 -94281 3903 23583 11821 38161 76933 74457 10332 -33889 -41389
22279 -41389 -28509 -27263 -18684 -38972 -43662 -88432 -114536 -130420 -159552 -172450 -91000 -18373
22267 -18373 425 -2990 16782 -8722 7398 88528 110610 67958 56437 56031 47504 46993 62953
22254 62953 64654 49567 96221 90919 56512 10241 9109 -29087 4413 28098 10845 6947
22242 6947 14256 45139 44879 18352 25361 12753 28729 7431 -16176 27079 12234 -59876 -10675
22229 -10675 21085 43053 74093 84533 87963 89535 42268 -6780 57523 80512 55266 24269
22217 24269 23123 38622 13540 22332 -49 -21040 -3962 -46092 -75204 -107302 -81177 -7565
22205 -7565 14024 20468 -20109 -78470 -82649 -52324 -12325 67088 52598 -27128 -54241 -57511
22193 -57511 -49821 -30933 -43196 4161 -4574 -21538 22433 31043 18209 13682 30627 39360 7583
22180 7583 251 -12654 -7775 -4871 11652 -694 -55540 -105258 -133404 -95918 -31101 -41467
22168 -41467 -25343 -14036 10959 33533 23058 -44329 -50409 4806 14988 -33155 -53480 -27727
22156 -27727 -34077 -34076 -76147 -66132 -69746 -63924 -47022 -85244 -89442 -122255 -131596 -133131 -109422 -126304
22142 -126304 -65276 53009 115701 127047 103419 67361 76120 34655 -27207 -39231 -25076
22131 -25076 46734 48352 96987 90146 56078 -16625 -29564 9008 -28228 15066 71740 115242
22119 115242 157967 188326 147669 97633 30388 36884 66763 57123 8478 -11453 -13111 -12727
22107 -12727 -18933 19590 43928 28247 -17502 -27769 -10095 -49564 -69884 -16110 28856 39238
22095 39238 87699 5996 -53242 -98547 -69894 -15104 16088 1417 -14692 -9612 -15921 -35098
22083 -35098 29814 78786 49095 14873 8048 49784 77237 17751 6186 46561 54986 41555
22071 41555 39514 20541 -13395 508 -6334 -103396 -75050 -35796 -47022 -36545 19228 -197
22059 -197 -60473 -28200 10166 -383 -3783 -22475 -111165 -131164 -117650 -53685 -7045 165
22047 165 -74270 -99518 -7126 -22764 -44732 -30840 -19341 -13345 1147 -1986 34297 35294 46861
22034 46861 -22972 -50840 -6695 1456 958 -34004 -7199 33992 21384 -42708 4543 57225
22022 57225 79963 13468 31775 63341 101648 67018 35965 81209 44247 8811 22727 -1708
22010 -1708 -28931 -70053 -130861 -99875 -59279 -76576 -50640 -62966 -41240 -34769 -49506 -62955
21998 -62955 -79143 38519 115481 210384 155239 33500 32016 93571 70015 62662 -1098 -35017
21986 -35017 33651 22421 -382 3758 -9394 -20446 -38962 -20289 -38420 -28187 5424 7332
21974 7332 25002 61405 110004 104430 23496 15963 -10345 -32429 37790 38725 35366 24915 14050
21961 14050 46978 44624 20471 16489 -35600 -86179 -55592 -4519 -34193 -18751 3733 11359
21949 11359 -25794 -83232 -41115 -16666 2039 9874 29209 14970 5729 92755 110021 45682
21937 45682 18813 23288 -11347 -39266 3965 -31509 -93790 -118289 -135863 -49670 -30726 -44876
21925 -44876 -24560 -26680 25827 70506 62014 63880 957 -52922 -32551 20365 2667 -27266
21913 -27266 -36429 -14823 -20328 -57281 -56192 -68007 -15216 -27482 -30443 -71042 -35624 -15683
21901 -15683 7571 34353 11798 -13628 -63169 9244 -5301 -59756 -74123 -70548 -85570 -88892
21889 -88892 -67413 -68123 -27902 -34478 -91698 -130712 -109798 -20635 38932 76665 79711 9856
21877 9856 -53012 -41133 -37047 6602 16446 -16577 -21453 -36498 -52676 -60748 -35807 -28984 -70243
21864 -70243 -31592 16474 59427 52748 14325 5057 65936 127625 133084 48896 24965 3463
21852 3463 -31644 -40417 4217 73989 106549 76142 63603 9521 -37700 -18738 7319 1208
21840 1208 1935 9601 -53150 -75669 11377 51184 7246 -37748 -30467 -38094 -76773 -95202 -5493
21827 -5493 82374 55007 111002 178452 146789 117525 130316 171448 134119 81252 16481 7164
21815 7164 34944 33538 -70961 -96366 -105480 -119920 -42366 37281 16973 -14922 -61063 -52409
21803 -52409 -85754 -42444 51830 79971 55237 6233 -65000 -102842 -85649 -31951 -18052 -17316
21791 -17316 751 -1359 -49654 -129294 -152455 -150918 -103959 -75428 -87010 -67432 23785 34188
21779 34188 41483 98240 87735 78853 78891 58869 23437 -22153 -53131 6823 61396 106520 97645
21766 97645 42354 -19610 -29838 -33188 -4389 -14682 -41489 -51681 13 -27379 4655 53853
21754 53853 78834 102689 61545 14995 -14198 -91765 -56380 -64780 -96666 -56093 27182 45134
21742 45134 -43357 -28399 30562 23192 5110 -28434 -31904 -29318 -26430 -42551 -2850 -231 -35119
21729 -35119 -89040 -55093 19156 31251 12695 -1033 -22421 -37013 -78977 -104896 -80039 -53151
21717 -53151 -17731 -21777 -48523 -53444 -55848 -18345 11072 -27410 -29032 33931 40860 17245 6555
21704 6555 2244 51162 72013 17038 29496 24965 8722 -18608 -40771 -31245 1606 -8775
21692 -8775 -16819 9307 48996 24366 1104 26852 18341 -21624 6677 50324 -8285 -8836 16918
21679 16918 87211 54836 28801 28047 57423 80515 99767 100175 123695 98947 136116 56513
21667 56513 -30766 -80349 -56371 -66112 -17117 17361 46122 -17757 -42411 -30684 20276 55564
21655 55564 -10671 -52589 -50372 -49479 -91647 -67505 -50078 -12866 68397 17149 -44690 -72767
21643 -72767 -57084 -12279 -7553 -48762 -30381 33366 12812 51302 -2704 -19989 -45243 -79482
21631 -79482 -62008 -43112 -39420 -58164 -59222 31626 70234 70475 26644 37594 26019 99025
21619 99025 146038 94315 41811 24794 96911 35628 -10206 -17237 -77938 -91384 -75619 -25056
21607 -25056 24626 -24152 -55226 -52742 10098 56386 -22794 -10239 -18967 -21532 10696 12870
21595 12870 37064 29660 -22757 28107 15443 -24073 -69583 3446 22323 17777 1142 1035
21583 1035 -56178 -46835 14502 -15162 -73289 -116467 -104366 -116745 -60555 -46526 -96266 -115161
21571 -115161 -52449 -41945 -17398 13310 492 27493 44147 -12466 -44941 -59136 -41860
21560 -41860 48651 34576 -72792 -145952 -126616 -114375 -120028 -79170 -54436 -63548 -8329 -13340
21548 -13340 -86628 -96656 -17362 11254 -43563 -40345 12387 65056 4757 -18711 -22885 -35240
21536 -35240 -12102 -51081 -51753 -9515 -55880 47530 73182 68231 72096 44023 -32088 -123705
21524 -123705 -97402 -56891 -40385 -71376 -73280 -60932 -67113 -48229 -47452 -66048 -94167 -96920
21512 -96920 24333 43268 4238 27032 -353 -93839 -74745 -52987 -74608 -81306 -18408 62353
21500 62353 65921 18765 -40008 10219 13554 -4361 5779 -19719 -80515 -29909 36975 23098
21488 23098 -7703 -5969 65058 88943 47273 -10428 4897 -46162 -57766 -26190 -15064 21546
21476 21546 13125 -23916 -94390 -39915 -55841 -81327 -58794 -17673 -68478 -116687 -71224 -23853
21464 -23853 -39795 -55753 -25038 -1701 -12309 15388 -4779 -32301 -689 -11006 8676 37530
21452 37530 33532 -7422 -52349 17621 98983 47560 -17592 5811 33643 45333 36337 -13834
21440 -13834 -63283 -121159 -199787 -191707 -70850 6252 -15756 18383 17839 -1234 26289 63123
21428 63123 64927 77679 79959 54181 64739 49823 -37530 -95317 -112700 -15913 30631 27618
21416 27618 24068 -26972 -46284 -24355 -7711 40380 45394 24858 -34060 -1350 11647 -20759
21404 -20759 -51961 -52584 -74167 -65945 -19814 83358 91855 83723 -2778 -25171 -55490 -91467
21392 -91467 -98434 -61345 -9142 14091 -9117 -43939 -73856 -44707 -21819 -53280 -39925 10551
21380 10551 9293 7403 29569 92279 101309 63537 -13191 -31239 33492 41864 -2534 25308
21368 25308 35326 13465 10733 24028 -2881 -42280 -43831 -35436 -16850 9331 -56377 -68279
21356 -68279 -20307 34911 56082 45772 50062 12097 -31157 -65157 -33020 -21948 -493 -4457
21344 -4457 -16822 -14354 -71069 -92289 -108871 -100515 -113557 -42585 -15823 -33449 -36688 -14134
21332 -14134 -16795 -9928 6652 20279 33411 -13649 -46953 -42367 4894 6839 5089 65125 124953
21319 124953 83121 32081 -36541 -112887 -68574 -38309 -19764 -26076 21924 71018 30588 27734
21307 27734 19886 33270 15295 -16576 15287 -13740 8459 -31111 -125741 -134877 -50149 -21551
21295 -21551 812 4167 -15747 -79100 -126375 -169025 -151105 -75293 -12385 1028 28969 66248
21283 66248 64748 9745 22103 -40125 -60412 -75696 -54702 -44475 -34439 -77579 -105293 -33976
21271 -33976 -65121 -110423 -89006 -41645 -32249 11282 -11697 -26146 -45121 -32187 -59881 -36201
21259 -36201 59269 96224 -16755 -39657 -20172 -59217 -75111 -33162 -46008 -94570 -87894 -73916
21247 -73916 -113352 -125180 -66208 -64748 -69974 -44168 -39371 -75166 -49117 -39337 -56614 -86024
21235 -86024 -109095 -127904 -63336 -69451 -85295 2667 84825 40291 -40607 -138654 -128588 -39281
21223 -39281 -7841 2480 -41033 -52226 -48855 -65869 -6276 28655 50229 80827 -5544 -122034
21211 -122034 -121980 -134594 -125423 -63610 -29031 47847 8511 -33561 -66261 -9939 10290 -58632
21199 -58632 -100836 -182887 -163076 -110938 -73274 -37655 -19537 -1791 2311 53927 122676 153003
21187 153003 137239 87958 64628 37359 4520 8041 -10881 -4280 29562 -11495 -50356 -21768
21175 -21768 429 17358 55733 72698 75330 59383 14785 -64598 -38278 -3626 34094 9901
21163 9901 -29542 -58079 -75754 -43052 -40870 -29091 -14948 32468 40033 38096 55578 96534
21151 96534 91269 41295 23392 34934 71525 74670 89542 61954 58358 48642 52404 8484 8221
21138 8221 89235 138711 98780 74314 30934 -12322 -25443 9815 12424 -9258 -60119 -30355
21126 -30355 -12305 -21982 -67555 -93824 -76284 -99933 -143670 -160852 -155022 -88566 -42274 -8228
21114 -8228 -3006 -37691 -48779 -26718 -86055 -33275 3950 645 -28971 -73624 -43929 -3617
21102 -3617 -23276 311 173 -5565 -66659 -104666 -87050 -86995 -71880 -4918 53921 19444 -16099
21089 -16099 -12139 36295 68253 37521 14084 45854 38696 35814 -20101 -26330 11045 -20646
21077 -20646 -51211 -47856 -53860 -53622 -36524 -48728 -57223 -173638 -201799 -132845 -72165 -61905
21065 -61905 23481 35943 95461 71683 57628 43959 -10814 -1497 -14476 -19414 2201 14904
21053 14904 -11898 26022 68466 25068 3810 68675 110354 45381 -17126 -32605 -3862 -1689
21041 -1689 -81948 -140039 -141159 -187167 -125845 -101558 -92747 -93607 -122341 -126441 -84567 -32942 2837
21028 2837 -23060 -19121 -11597 -1127 -25523 -47078 -30390 -48244 -44705 -39935 -19838 14132 2951
21015 2951 44133 7261 16317 1121 -104444 -114808 -51705 -38505 -36275 -56772 -44164 -38263
21003 -38263 -15153 16514 -10541 4131 5047 6032 -4257 -24451 -20669 -52202 -57029 -2690 11096
20990 11096 33794 67207 59241 -3156 -77964 -160247 -156208 -77483 27408 94298 43480 -17528
20978 -17528 -54986 -100325 -94027 -45215 25495 -14899 -65111 -110219 -154793 -88506 -31343 2176
20966 2176 40933 62689 43114 -139 -21817 8762 -62468 -82106 -100019 -113638 -58797 -48696
20954 -48696 -60364 -48860 -3410 -69155 -47713 -113606 -131125 -66218 15616 30186 10988 -40677
20942 -40677 -27080 -26887 11374 52001 18967 84010 48519 -3041 -10554 -7312 -24991 -29489 -40728
20929 -40728 -2682 17107 -46393 -37339 -66598 -54153 -76935 -107002 -135604 -117885 -56766 -10126
20917 -10126 -34232 -31631 -34013 -8891 15097 17384 -48641 -70421 -73608 -26989 -4943 20929
20905 20929 16589 6049 7633 -51198 -82863 -46886 -41891 -57845 -54713 -51804 -5947 21413 2244
20892 2244 -5567 41414 49339 20948 45591 40446 37962 34675 21098 42978 47090 29354 27818
20879 27818 -48375 -56728 -25959 -40021 -65676 -54958 -11648 14707 -20493 -15772 -69097 -27989
20867 -27989 -13399 -42597 -57435 -79429 -81791 -119597 -46742 -8235 -130 3172 -18932 -9318
20855 -9318 -44836 -70275 -54752 -19551 -27079 -94521 -62358 -19967 7779 -6368 4190 11002
20843 11002 16064 -24372 -17528 38167 97090 10934 -52947 -49076 -7289 16902 13746 -42201
20831 -42201 -28403 -22470 -44903 -19811 63636 106231 60543 38209 -25269 -34299 -28342 9408
20819 9408 30643 43526 33713 6016 15847 26003 36602 21465 -25708 -79139 -74683 -41477
20807 -41477 -35506 -20839 2217 -6402 -61965 -55442 -30537 -46749 17764 57751 29168 41491
20795 41491 -14180 -66695 -111902 -137907 -127974 -145616 -72365 -1774 13928 4615 -30112 -20807
20783 -20807 -38648 -24481 -84335 -89782 -67417 -105630 -117477 -127509 -120930 -59522 -20453 -26951
20771 -26951 -42903 -80824 -99268 -107080 -64465 -24137 -77331 -103095 -77837 -53089 1459 30414
20759 30414 65624 57631 -11263 -32509 -8470 -63687 -138686 -117144 -107669 -86795 -28979 80123
20747 80123 148133 69577 -18130 -60649 -39860 -78000 -50179 -32860 -7059 -10670 -56805 -80663
20735 -80663 -97797 -73580 -65810 -64790 -30279 -54305 -11409 -9313 -69883 -87486 -78153 -57386
20723 -57386 -60495 -47416 -14741 -40240 -88112 -86375 -21261 19233 51251 46893 12212 -29890
20711 -29890 36109 15358 -2471 14242 39109 44793 -33652 -35443 -26191 -13327 -35991 5757
20699 5757 30889 13350 -15431 -25509 -3628 -11871 -21854 -13267 -63789 -48505 -27879 -45587
20687 -45587 -21615 -42909 -81973 -96199 -160231 -105571 -86887 -80741 -95675 -128531 -82479 -60832
20675 -60832 21266 42958 -48781 -117054 -118079 -67159 -54814 -1353 36980 -11439 -29176 -44751
20663 -44751 -58964 -28655 -12655 -16837 -8453 -10439 -41238 -37301 23505 77418 59803 45882
20651 45882 13091 -32061 12573 -979 -40131 -6677 51885 -4302 -9913 14718 37903 58880
20639 58880 42125 24074 20289 -369 -7771 -75245 -64876 -20196 48462 20226 10584 -23730
20627 -23730 -109936 -110860 -79971 2906 45297 -1321 -9023 -37581 -40095 1082 65679 77606
20615 77606 113755 112680 71845 56704 99728 96074 26980 25078 41287 33254 18640 11910 34032
20602 34032 61528 6005 12044 15058 -21827 -23383 -13984 10075 9749 -35164 -18462 -11926 -11517
20589 -11517 -15508 -52516 -41464 -3102 -44883 -102900 -76819 -122679 -52383 -70448 -85476 -59630
20577 -59630 -60926 -54040 -48841 -37863 -43626 -74758 -129878 -155378 -93678 -18556 2968 21831
20565 21831 -4646 -37756 -3551 -303 -4995 35319 -20163 -53985 5895 -121 32995 17423
20553 17423 -36598 -79014 -126540 -122485 -64905 -47727 -27518 -39991 -35699 -4838 -41430 -6863
20541 -6863 36474 29029 -2174 -36804 21024 23164 23670 17682 -23210 38680 75805 69113 28675
20528 28675 45546 47274 -15929 -10092 2701 -21261 -7587 -25300 -1056 37281 64085 30490
20516 30490 41020 82443 35433 6053 -4043 46821 86216 58796 26194 -3063 -21370 -28427
20504 -28427 -19745 -27297 -21767 -5833 -980 8184 -27401 -50242 -29214 -32205 -85072 -64084 -4093
20491 -4093 -18764 -33678 -14723 31497 39083 36479 61929 82401 79825 51489 56282 17989 -6668
20478 -6668 -13009 -2883 50392 54544 32527 33745 40009 46926 -25601 -71647 -41627 -45980 -49164
20465 -49164 -48161 -38867 -44710 21380 31661 -205 14552 55083 87677 24517 -47659 -62434
20453 -62434 -60793 -47290 -74159 -102288 -100947 -33982 -6256 -33632 21354 63308 46036 7438
20441 7438 -40351 3069 -19322 -20609 15836 53291 89618 41110 -33837 -82187 -62007 857
20429 857 24140 1746 3232 -39528 -44447 -108210 -111181 -105346 -151232 -132867 -90972 -33037 29608
20416 29608 70446 76359 88292 89995 57681 62909 40470 2881 5142 50091 37970 23322
20404 23322 30724 -58481 -115057 -94950 -95839 -67585 -56854 -2740 10121 -45895 -56903 -52455
20392 -52455 -63258 -16295 22504 -28870 -33881 -32200 -24981 17468 52428 71540 59121 31373
20380 31373 -26672 -29268 -41033 -42971 20237 -29061 -51325 -92642 -145598 -86205 -43089 4611
20368 4611 15704 -22447 -44741 -29449 -33504 -17672 -64868 -110591 -100606 -82128 -34503 -42383
20356 -42383 -37854 -35433 -26144 -24167 -46867 -95810 -31387 8522 -21385 -18316 -36525 -30775 -30077
20343 -30077 -44033 -84188 -123769 -84358 -62305 1680 11727 -7523 17200 -7137 -22286 13783
20331 13783 18780 -6157 9014 8149 49022 139088 134750 124669 101163 40468 54722 12752
20319 12752 -37892 -69258 -57587 -3628 -1300 -88093 -89564 -58894 -46042 -43069 -61242 -65047
20307 -65047 -31582 -46172 -55386 -14782 57844 66471 60411 17149 38488 18267 14208 19904 -27805
20294 -27805 -56891 -101467 -96257 -53010 -68171 -97263 -96420 -46096 -39648 8166 8594 33314 52075
20281 52075 6339 -8960 -33730 -44872 -20150 -9686 14003 38816 -5315 270 -13579 43997
20269 43997 29957 13056 54146 74141 1790 13922 32585 9776 2351 -30182 -18255 -76023
20257 -76023 -106644 -47837 -45086 -51984 -86282 -96326 -32505 -50203 -54219 -25952 1081 -20448
20245 -20448 -70952 -55135 12486 52945 -3964 -63515 -103331 -90403 -42761 29803 -25163 -44562
20233 -44562 -65652 -37993 -16456 -34768 -25886 -44363 -100254 -59428 -32070 -35753 -2379 49405
20221 49405 54683 50598 94236 110967 125756 74879 14768 -885 36326 30493 -7713 -35801
20209 -35801 2025 -29048 15545 73764 134790 104298 89040 100374 47367 75043 103277 94474
20197 94474 29693 -31165 -69430 -25296 -51189 -35969 -24320 -33249 -84875 -9367 7882 -37974
20185 -37974 -18020 12255 34910 -21450 -57311 -5086 6092 16863 -6961 -16360 -42631 -37190
20173 -37190 -63716 -39564 -9621 -31069 -4030 -20952 -70622 -86268 -94319 -69850 -37530 3018
20161 3018 52463 75541 86945 25306 43334 33081 -64679 -35808 41771 52666 13509 29678
20149 29678 -2890 -72154 -50438 -28474 -39361 -45108 1395 17248 17510 10847 -58954 -117804
20137 -117804 -146380 -83832 -34073 -57422 -32347 77049 77279 16655 -37435 10768 -10387 -36794
20125 -36794 -15356 40059 64753 86359 80618 42718 75000 104409 98168 55885 -14160 -21579
20113 -21579 -18190 26590 46099 67808 76434 -10757 18586 34667 31236 -3127 12697 25447
20101 25447 -377 -44830 -76046 -93691 -81753 -94222 -84364 -71255 -103944 -77140 -51587 -88777
20089 -88777 -109295 -128368 -161005 -146814 -137589 -124409 -145005 -142615 -92358 -29014 14137 30412
20077 30412 19487 41581 43588 6591 -13898 18263 39007 51518 40284 -28291 -97362 -86408
20065 -86408 -52186 2481 66934 72752 72456 63438 76757 41329 16766 19162 17928 -8218 -31895
20052 -31895 -44876 22041 44617 53837 76909 13773 53974 104560 81908 18246 -33331 -73148
20040 -73148 -44501 -8670 44605 76323 33437 41828 -2066 -69678 -18503 -50481 -55984 -18799
20028 -18799 -13988 12789 26685 12567 -27965 -13737 9004 -25506 -54686 -38274 4297 -42446
20016 -42446 -73176 -25565 -934 45743 66559 46037 -57110 -70324 -48142 -853 51831
20005 51831 33668 6883 19392 84761 51463 -26530 17924 17780 -22785 -41408 -36885 -9263
19993 -9263 11142 18439 829 -24705 -25529 4053 -21057 -69086 -111020 -129057 -86287 -62250
19981 -62250 -38304 -36634 -5695 35665 49215 27087 9197 34883 46943 -23227 -9804 7650
19969 7650 25109 728 -45389 -45661 -32626 -85972 -51091 -52213 -68089 -77854 -94637 -60837 -37528
19956 -37528 -17651 6065 -1554 18260 42705 19301 20095 29903 34167 -53302 -83835 -30527 16429
19943 16429 1317 46183 65423 -1696 -73155 -112168 -62832 -22237 9522 49908 47809 68978
19931 68978 75038 37254 49077 86995 23645 -25288 21180 -2967 -9729 52289 87494 72229
19919 72229 21564 -18337 -67086 40310 76647 31574 -17800 12189 68798 78890 93751
19908 93751 59478 66438 66550 -10257 -94222 -95931 -145653 -165739 -89495 -35116 -93320 -81459
19896 -81459 -11372 36763 74277 -32143 -35467 23903 1227 10680 40683 40223 7790 7206 -17422
19883 -17422 2055 -33026 -68556 -82856 -79489 -21404 -5541 719 39536 15676 -40053 -36011
19871 -36011 10664 -3692 9162 36856 64620 101819 110636 77213 89215 57321 18664 16331
19859 16331 -18811 -60981 -75615 -100053 -67105 -46916 -34389 -8556 -67577 -118081 -78834 -15895
19847 -15895 25896 -17174 -42593 -88327 -124746 -130706 -175263 -164405 -134818 -125675 -161644 -160557
19835 -160557 -88146 -65065 -106173 -143847 -63955 -95245 -143776 -129113 -107534 -47804 -36492
19824 -36492 -1468 9166 58460 107119 79631 98377 71648 -4781 -59001 -70701 -79401 -82804
19812 -82804 -110727 -115758 -91771 -34258 -7893 49481 10950 -41643 -98894 -102428 -107362 -59099
19800 -59099 -98480 -107952 -34341 -73811 -89627 -58849 -36906 4286 21694 55632 31152 -36811
19788 -36811 -30217 23495 42638 69926 59704 40780 11903 48040 64466 37266 34868 -2851
19776 -2851 -62136 -84969 -54586 -39042 -5886 18496 -15712 -18341 55 67105 80498 88482
19764 88482 49794 -3008 31840 132096 106559 54269 -43688 -47562 -65156 -78677 -44503 -34428
19752 -34428 -30153 15569 23500 -17836 -38346 -21834 9304 48191 51307 -1693 -29230 16280
19740 16280 40588 32895 86635 74829 66073 111396 32017 -11360 -6131 6783 71230 111277
19728 111277 30264 24934 -39688 -81093 -35261 -6554 -15929 -58268 -34828 -3115 -59236 -65894
19716 -65894 -65330 -87345 -158824 -134943 -87171 -48254 -54289 -90141 -99055 -83220 -15836 -21099 -53332
19703 -53332 -21865 -27999 2771 29993 21586 47874 34756 -20539 -38788 -81916 -93405 21733
19691 21733 21675 -18068 -65471 -56409 7718 -8393 -57663 -52147 -26679 19569 49189 80354 37277
19678 37277 68408 106099 71717 49709 24767 27759 -25138 -36555 -42944 -39409 16459 76905
19666 76905 112588 109318 38424 6584 -3438 -34554 -62120 -62877 -69813 -58450 13546 75014
19654 75014 8669 -43190 -48549 24361 84342 107049 58292 6224 25051 108894 122602 115917
19642 115917 74983 96325 138244 157806 124624 101959 76795 63116 60747 107523 128671 116550
19630 116550 81484 70703 98957 160771 175138 136244 110987 83282 71960 131564 199972
19619 199972 270876 335960 416816 598478 888405 1220387 1676697 2119013 2544043 2804666
19609 2804666 2800964 2613752 2308404 1835245 1396386 1048906 827387 611512 522444 498177
19599 498177 421237 431044 435137 424091 375123 361583 330896 214147 220348 201493 257968 301792
19587 301792 334431 375806 320074 284697 248892 247028 157607 108470 116719 145752 120662 105893
19575 105893 155414 184922 176800 173764 161316 127753 133214 112009 105447 57292 71477 103321
19563 103321 148186 146764 101608 104325 49731 -26414 5927 31262 30070 -15986 -36719 16816
19551 16816 48844 24304 -13120 -20619 -13447 -54987 4691 53347 22305 -8852 -77352 -46135
19539 -46135 23780 56540 64433 106844 73877 38630 61390 25731 -2571 69691 83804 112521
19527 112521 37489 21333 31268 32378 78960 115244 92473 89937 23070 31336 19012 -7490
19515 -7490 14212 65549 101715 62540 45155 51021 74040 74954 40723 21066 29620 -18026 -38018
19502 -38018 38233 71416 82339 36652 48922 107507 84180 14390 3145 20470 9776 30086
19490 30086 26482 10812 -19082 -12163 39670 93170 96677 66642 50973 22514 -16322 29067
19478 29067 72321 41683 21314 78869 17620 -17834 48334 64903 56678 3341 29608 18221
19466 18221 7519 2742 3219 -9243 -22289 -88115 -50160 -23558 -27543 26091 46794 -26340
19454 -26340 -10309 58635 28848 13822 22412 -35338 -31218 -30069 27083 -5616 -45338 -72106
19442 -72106 -74034 -25537 31713 -810 -60876 -118565 -91670 8206 65541 15118 -26939 -30539
19430 -30539 8323 28396 -3910 -8176 62520 -255 -28159 20102 6309 -49731 19280 39009
19418 39009 -2121 -75429 -100924 -50058 -107885 -137523 -133475 -125274 -128923 -88470 -26196 12169
19406 12169 -3079 -22546 33753 70980 45621 60240 9168 -22002 -52207 -30509 3495 -5767
19394 -5767 -71009 -28145 19355 -12497 -17677 40799 48607 61330 72969 18297 -8487 -15655
19382 -15655 -59008 -16950 -14232 -15172 45972 60246 38707 25175 23100 80080 47695 602
19370 602 -34469 -64953 -39057 16665 70769 72399 95066 126047 117751 49997 30233 37582 -61038
19357 -61038 -81111 -20822 6744 63055 87454 57431 51510 6974 -25204 29184 55172 33028
19345 33028 22801 70075 37644 -2061 16761 14607 29366 68246 58932 40806 17809 -4986
19333 -4986 25900 79267 105954 84010 25420 -227 -14379 24619 23246 -15703 -20833 -97414
19321 -97414 -116105 -52684 -36445 2862 44400 48741 84969 41714 90182 120440 48414 53370
19309 53370 29836 -11645 -36310 3208 -25146 -85488 -73927 -70201 -30014 -53450 -92123 -132866
19297 -132866 -52195 -48433 -53058 12598 80673 123592 88171 12051 3073 11397 1039 -74342
19285 -74342 -141424 -132480 -124064 -63763 5694 24373 59302 134580 160671 126225 103036 68941
19273 68941 68512 61835 40983 62728 21992 -18600 -35873 -61164 -22693 -37403 -36538 32461 47517
19260 47517 21738 -21009 6032 60237 67298 60412 98583 76329 77555 126036 104969 60144
19248 60144 4640 -33257 -12126 -25849 -78 -4559 72841 83962 44610 37105 91001 75977
19236 75977 46130 38741 69115 91577 127589 123303 99807 49951 24608 76333 27168 24443
19224 24443 -31573 -100110 -81696 -43134 38466 123589 159262 81122 60331 26213 -4295 -17760
19212 -17760 21596 -3859 -38158 -51562 -29250 -58762 -62261 -11404 14929 -1779 9110 2738
19200 2738 -48989 -107934 -159318 -53416 26844 57914 -14255 -60541 -37334 -34933 -33708 -80636
19188 -80636 -8233 -22681 -68623 -50500 -48536 -44252 8134 48630 11417 -2250 -41669 -60723
19176 -60723 -33569 -31785 28935 77993 63482 35135 42084 10245 18903 7157 -18126 -14296
19164 -14296 6524 59613 68984 27925 38684 -11624 -62376 -65073 -29269 23388 20142 -10884
19152 -10884 -32804 -29809 -67440 -32833 -23092 -18514 44962 9604 -26375 26335 -4711 -21513
19140 -21513 18893 67446 81006 44204 43761 46833 66359 52992 89448 63835 45463 11803
19128 11803 15093 -8082 -42671 -51103 -14766 -14840 6287 43129 10224 19190 -25966 -83138 -22889
19115 -22889 -8217 -26652 17308 54198 -2951 -34040 27118 41427 53871 91544 97083 103486
19103 103486 80547 76978 43740 29482 -26645 -14313 47491 64775 62764 12201 -9114 29235
19091 29235 61820 77371 80792 181239 193440 135879 66826 50488 79372 100293 130642 157499
19079 157499 108217 50816 49319 137138 187648 125945 77442 125457 84195 77918 77096 57593
19067 57593 33040 -27353 -6819 19526 33255 -4405 41395 41240 49861 62204 63816 52380
19055 52380 82121 77923 99046 43516 -4344 -24788 10607 9945 6514 -4802 -63017 -107040
19043 -107040 -89127 -68657 -11477 643 841 -47888 -66844 -41155 14171 43819 55249 49275
19031 49275 82905 81565 65618 -21016 -106438 -110168 -26379 919 -16684 -31662 333 80442
19019 80442 76335 72441 17545 -37434 -13479 31784 23883 -3895 36112 32163 26886 -14512 -2663
19006 -2663 16407 15740 43091 114329 190676 170986 122828 79580 -1803 -22963 -1363 36827
18994 36827 98485 123106 90559 68081 61999 75465 62906 83253 121976 99893 85355 112016
18982 112016 137860 84384 31850 60614 63651 4948 -6395 -41917 -29245 20410 44684 64571
18970 64571 64485 3636 27285 85792 126941 132058 170474 154502 118631 85353 57408 85724
18958 85724 127144 202760 177516 172203 150378 86125 68047 59776 -2295 905 22611 136741
18946 136741 137956 75512 86590 63616 15903 -7179 103368 175517 120079 76905 52716
18935 52716 33178 37018 28895 27338 35080 66350 38735 -17501 -39678 -31457 22895 51252 25776
18922 25776 -11194 46172 163792 212851 168780 105257 76909 59829 70549 4971 -45006
18911 -45006 276 45948 66270 75107 81500 47564 -4816 76730 127172 121796 152724 137480
18899 137480 106718 112845 88503 90645 118264 140085 169962 130914 122010 161582 112267 73467
18887 73467 134499 141053 159903 196239 230569 138321 92564 100327 129657 87270 74049 73889
18875 73889 85412 109455 108787 88895 54217 -11087 2598 -25670 -54809 -19414 37052 47168
18863 47168 18150 97348 169756 236607 204088 141983 98926 96312 72572 92932 116133 89056
18851 89056 82723 105065 82453 21773 41940 112168 120898 99279 98918 100101 77163 91996 128265
18838 128265 196372 196482 161063 105954 54327 47144 89233 96583 114588 127422 47545 28858
18826 28858 77447 207160 312359 311253 299315 269424 262940 249987 157557 173715 277101
18815 277101 341614 321483 305217 324452 321276 303575 269255 218210 269489 310508 271520 270828
18803 270828 288262 330436 357544 291510 327945 391299 443060 490815 463320 426856 351815
18792 351815 365768 383277 414013 453396 455625 430027 440649 547944 671251 704587 713469
18781 713469 728916 741700 752098 765065 810653 785933 676101 661552 657622 647113 647735 677937
18769 677937 808643 1039066 1220703 1378974 1343589 1140409 906863 748687 621617 605064
18759 605064 640839 708399 742771 734826 694515 611946 543623 565495 621652 572603 514644 520712
18747 520712 500845 477103 486847 451389 476485 598557 690258 696523 661878 681688 669103 693290
18735 693290 751881 796645 810001 798860 738275 661141 589804 553493 625829 700230 782411
18724 782411 799049 765745 675210 703890 768404 727526 681851 620779 530548 477415 493538
18713 493538 465408 442364 466918 472169 449518 395795 389273 350045 340566 334326 362445 365258
18701 365258 356371 377658 373896 323600 292881 393496 376653 314768 300397 280862 241515 204252
18689 204252 227502 191547 177853 191004 189947 206434 215047 176143 188749 120615 134136 207206
18677 207206 182110 183073 235537 223971 216099 209507 275891 258111 160930 172493 181922 179371 206170
18664 206170 223336 238666 190394 238816 220134 168207 100310 136033 158637 155551 82626 82360
18652 82360 69395 35014 44441 33614 46303 83754 124820 175760 203238 154658 76538 118021
18640 118021 177419 175754 175892 160179 131070 136239 157476 177470 174930 195992 220559 182283
18628 182283 127110 169841 216165 166724 152224 107790 55114 85706 72780 84786 107194
18617 107194 183959 158206 137431 182623 205149 160881 140195 191883 230852 132582 102489
18606 102489 99415 125386 125325 152945 133225 67705 45919 -20289 232 45696 35603 7769
18594 7769 28505 115137 80366 33649 65343 154616 179029 124320 121400 146713 103486 146363
18582 146363 177271 144814 131756 178507 195471 194376 204304 188540 120705 74132 138660 171668
18570 171668 188036 217264 262708 263740 234386 197764 266195 227938 201236 200638 196053 132977
18558 132977 115160 106646 137397 99381 46618 68728 106227 132954 152610 188605 224410 189420
18546 189420 193680 204977 115495 134442 198741 197721 225048 267335 300372 237423 194895 162014
18534 162014 165285 155146 105113 118587 127418 103040 148528 185962 229848 251804 280270 267461
18522 267461 330645 290453 249858 265341 297228 278570 290391 214398 204504 252129 239374 211475
18510 211475 184923 236866 256601 269392 246804 226875 228869 232920 231290 217883 207727 181661
18498 181661 224182 218738 178601 208579 181611 258418 283060 256486 252678 308224 355478 281103
18486 281103 275159 324613 291921 340520 375371 400079 372537 307955 321542 380261 412270 457642
18474 457642 450855 394542 352492 357245 401213 356564 385563 373950 331057 353504 384194 403005
18462 403005 306991 251269 249104 261444 295019 288550 307588 344955 368414 416545 356029 356985
18450 356985 430677 511800 534001 555058 618124 616773 604774 578620 593940 649707 658819 635921
18438 635921 588184 600435 595397 594168 589201 708366 758623 801558 856036 880619 862593 875435
18426 875435 820513 778011 739968 635643 647207 653919 702155 799994 877983 972986 1141251
18415 1141251 1267368 1307838 1332979 1311079 1283186 1233050 1197163 1110322 1024027 995027 1085738
18404 1085738 1165574 1223183 1284388 1301776 1259570 1263901 1302614 1337357 1323469 1337070 1369897
18393 1369897 1479228 1537157 1505923 1493060 1526467 1514688 1533104 1605988 1706595 1717654 1691122
18382 1691122 1610095 1510254 1470130 1472452 1533931 1640067 1649157 1604014 1623449 1618682 1580660 1551479
18370 1551479 1493361 1427706 1485627 1490810 1501510 1600453 1724909 1854025 1970524 2087989 2157508
18359 2157508 2175272 2164647 2141442 2098463 2074858 2024494 2025959 2091348 2206565 2329401 2415273
18348 2415273 2443959 2473458 2516373 2650258 2678948 2684431 2767222 2835826 2989488 3090848 3204707
18337 3204707 3406189 3579235 3695293 4065972 4822832 5994648 7572541 9294594 10592028
18328 10592028 10580751 9265609 8209250 7946139 8323617 9253582 10988756 13817222 18475464
18319 18475464 25729275 35191054 45292456 53234751 56333762 57792962 57438812 53805263
18311 53805263 47761220 44690860 43209296 39634615 35890309 34202566 33619272 33846560
18303 33846560 35772893 38235139 39815140 38538330 33785592 29820921 28455552 29494666
18295 29494666 32824882 39496741 50897538 67645758 89509880 113660372 133997745
18288 133997745 149038605 152336589 143360622 130506366 113550084 95418823 79594574
18281 79594574 68311301 62151072 61486376 65999423 74604671 84962342 93838931 98871237
18273 98871237 97714133 95746519 99975436 110158069 123340809 132412253 133158333 127551985
18265 127551985 120771956 119191389 120793778 123773644 121738288 116358084 113069908 109847869
18257 109847869 102929187 93208488 84477097 74464235 66338127 62734009 63369768 67567639
18249 67567639 74554448 82367513 88345763 90769029 86745619 78749440 71927520 67135961
18241 67135961 65891208 69522629 78441378 93157305 113286516 137321822 162898957
18234 162898957 183917107 194548160 194358984 181188953 156475094 134604088 116855158
18227 116855158 104332078 96498451 87879614 77444327 70392216 68387601 71029758 77595676
18219 77595676 86878965 97605492 108099607 121153733 135691394 144030531 138800803
18212 138800803 124922779 106514361 84543828 67885800 57786863 51540102 47441893
18205 47441893 44661309 42709108 41413566 40785470 41003416 41885969 42740947 42560017 40055522
18196 40055522 36106189 32962975 30850295 29277089 28003718 26962971 26112861 25340097
18188 25340097 24543260 23894693 23326270 22802069 22327982 21876276 21349877 20788012 20169385
18179 20169385 19528838 18980213 18515549 18197132 17944627 17644504 17255544 16851635 16429726
18170 16429726 15949837 15493095 15118200 14834036 14465104 14167889 13951517 13752535 13530080
18161 13530080 13320302 13101039 12980231 12863081 12717415 12470106 12138242 11831033 11515988
18152 11515988 11247609 11036978 10923469 10819188 10652602 10504290 10248829 9976113 9787540
18143 9787540 9661197 9499113 9339964 9206362 9059732 8866764 8692918 8541667 8407666
18134 8407666 8322563 8225362 8139262 8071536 8036765 7972688 7858654 7719652 7586756 7578540 7627295
18123 7627295 7628273 7692255 7845813 8139254 8457596 8749060 9200121 9945594 11143182 13025505
18113 13025505 16082543 21559303 31754657 49193091 70917167 88848706 92090618
18106 92090618 66287184 41427822 28851358 22392787 18729557 16457078 14935759 13782071
18098 13782071 12858885 12083828 11508622 11134326 10781871 10590736 10441402 10237149 10055941
18089 10055941 9804958 9521957 9228540 8864028 8503959 8220463 7942166 7729117 7559649
18080 7559649 7337358 7134390 6975940 6792514 6625613 6443198 6281185 6161865 6000401
18071 6000401 5877947 5794734 5696444 5469235 5293644 5213144 5086589 4963034 4863093 4769888
18061 4769888 4683770 4591056 4491037 4422118 4356357 4273376 4136353 4005304 3881432 3809753
18051 3809753 3748377 3733261 3677267 3626248 3595795 3572989 3574908 3531320 3571228 3557145 3461977
18040 3461977 3418044 3370161 3311875 3195005 3153060 3149168 3086506 3029404 3008351 2959264 2940725
18029 2940725 2912273 2838762 2769229 2753661 2702884 2662315 2717241 2766028 2709319 2630414 2630529 2616559
18017 2616559 2512917 2499842 2461825 2295572 2231924 2239059 2168830 2117306 2102984 2101969 2105702
18006 2105702 2179408 2167684 2162766 2123175 2059311 2035854 2000458 2019415 2062123 2030634 2059737
17995 2059737 2124043 2238494 2275755 2280528 2225829 2178040 2142703 2147954 2231858 2329744 2456191
17984 2456191 2563797 2590196 2623688 2668418 2771354 2899183 3009448 3177887 3421447 3777799
17974 3777799 4339664 5118728 6375632 8476187 11783498 16436775 21557135 25441987
17966 25441987 25716450 22877611 22114564 25296259 32332311 41390773 48774394 49773768
17958 49773768 41042029 31412940 27077490 27234022 30242994 33519227 34354320 29590682
17950 29590682 22256711 17148279 14161912 12342424 11141145 10409354 9857037 9481057
17942 9481057 9175128 8894761 8639791 8371135 8173671 8069996 8141127 8231745 8178835 8090999
17932 8090999 7996333 8102960 8421791 9039657 10085563 11845426 14795793 18759831 22878352
17923 22878352 25883134 25830695 24188628 25318154 29491683 35817710 43402146 51095443
17915 51095443 59745638 69235825 74296093 72726318 65541515 57082082 50013326 42783361
17907 42783361 34839723 30097321 28941265 30039617 31655936 31988127 29052729 23846760
17899 23846760 19915718 17580604 16124652 15155346 14460366 13875885 13362358 12883964 12386429
17890 12386429 11928904 11606326 11342501 11065851 10730809 10456730 10223975 10069303 10005306
17881 10005306 10051890 10197346 10560504 11254025 12464895 14614787 17620555 20572124 22233481
17872 22233481 20838373 18721975 18815821 21550591 26453014 31690848 34758584 32210748
17864 32210748 25249855 20680633 19280737 20035884 21742744 23014036 21967073 17953624
17856 17953624 14339702 12135124 10868951 10035279 9474636 9068295 8793252 8531675 8342647
17847 8342647 8133437 7891185 7662224 7422469 7300502 7265755 7235825 7028946 6788125 6592866
17837 6592866 6374519 6216533 6084394 5950379 5782238 5604763 5466915 5357573 5313498 5315667
17827 5315667 5213293 5056542 4977685 4840105 4748943 4647092 4628798 4569913 4455047 4347717
17817 4347717 4310842 4293312 4277290 4181632 4092446 4064154 4051072 4075465 4162859 4187030 4158436
17806 4158436 4160608 4203418 4254491 4289409 4437691 4665508 4933428 5255879 5562962 5814252
17796 5814252 6016179 6347495 6793348 7457603 8377396 9903639 12220120 15503084 19477940
17787 19477940 23387164 25830757 26208019 25925233 25367581 24996580 26803531 32231845 42375716
17778 42375716 58096145 78144988 96811401 106527625 101620404 85373973 74688978
17771 74688978 77221897 91838826 113552207 133645958 140299837 127557007 109900969
17764 109900969 97900048 88691414 76800990 62767268 51684489 45192763 42237179
17757 42237179 41994029 43953100 47052025 49362513 48619573 43570885 37227540 32499480
17749 32499480 29423743 27389043 25935082 24955911 24174670 23534668 23041178 22747474 22678368
17740 22678368 22901625 23420361 24337459 25879267 28626848 33044777 38713916 44370127
17732 44370127 48137036 49019194 50207012 55135870 62276546 67799111 67571812 62681230
17724 62681230 60957930 67294455 81056972 97706697 110441465 110051194 100214189 93426195
17716 93426195 91954335 95554907 100888725 101440467 92056987 73897959 58870639 50330137
17708 50330137 44958292 40056386 35491082 32178230 29976325 28519857 27455408 26697162
17700 26697162 26312105 26418027 26999535 27649595 27680743 26383834 23978612 21918026 20612993
17691 20612993 19768672 19161240 18616933 18169684 17836374 17627989 17675291 17906849 18286999
17682 18286999 18991165 20119558 21969584 24601864 27521694 29693862 30162536 28539010
17674 28539010 25666373 23103577 21515386 21074498 21433584 22302258 23588189 25613456
17666 25613456 28940918 34483011 43926815 59494341 83321306 115343835 150320234
17659 150320234 178133142 189299351 179330981 155699963 127423779 101460106 80834171
17652 80834171 66410601 57710570 53863603 53997985 57454589 63388026 69699084 73418106
17644 73418106 72219173 65603168 56179126 47329949 40652966 36074011 32938382 30765392
17636 30765392 29181140 28072043 27233207 26461836 25764910 25199331 24676888 24302084 24103740
17627 24103740 23902744 23738896 23724704 24050692 25149738 27381506 31148510 36950079 44684615
17618 44684615 52751782 58525827 59866385 56297653 50329883 45139798 42774165 44035449
17610 44035449 49337464 59238064 74263407 93979432 116849751 139571189 156731050
17603 156731050 161818815 151542463 127248911 98769412 74563572 57900180 47772289
17596 47772289 41708840 37824420 35191801 33330830 31992304 31045401 30524109 30640752
17588 30640752 31447212 32743518 34080860 34544124 33497096 30881105 27754609 25042484
17580 25042484 23077923 21699888 20627214 19626074 18693966 17943260 17289085 16646636 16116169
17571 16116169 15603722 15105338 14632233 14222241 13803972 13365718 12961806 12624903 12306425
17562 12306425 12020575 11732653 11430090 11213350 10943934 10706867 10422904 10128833 9868330
17553 9868330 9709044 9488114 9314846 9162033 8980540 8837790 8669085 8473450 8214532
17544 8214532 8010106 7780791 7605659 7498787 7443424 7269449 7160422 7081745 7027952 6960142
17534 6960142 6964855 6935822 6808210 6691091 6561684 6378150 6221830 6026560 5822461 5629997
17524 5629997 5506608 5463930 5382861 5353612 5329563 5320081 5301832 5170135 5041210 4934610 4833094
17513 4833094 4726474 4607306 4530970 4371574 4296286 4248808 4164916 4097753 4036009 4001700 3936601
17502 3936601 3837175 3737959 3666836 3599270 3535321 3437149 3347032 3294216 3198917 3186430 3308281
17491 3308281 3391396 3282130 3129351 3016914 2982111 2897374 2815887 2810155 2832647 2858081 2889733
17480 2889733 2925930 3045272 3044347 3001486 2937674 2875076 2834377 2803166 2730092 2647415 2551517
17469 2551517 2431714 2379977 2333504 2313909 2301996 2223685 2259944 2325329 2325617 2256361 2204500
17458 2204500 2191227 2256794 2261514 2255832 2212953 2160594 2127976 2029463 1993961 1998428 1995471 1959413
17446 1959413 1923454 1907681 1948294 2077729 2180026 2147761 1938272 1742884 1613998 1622025
17436 1622025 1626231 1589133 1530952 1454627 1377605 1337891 1364199 1300600 1221425 1228944 1245149 1214138
17424 1214138 1183718 1219793 1179367 1150377 1100401 1126138 1165257 1088338 987911 968180 966109
17413 966109 987349 969415 1040133 1122873 1155417 1205879 1212419 1215860 1229818 1304935 1366823 1308203
17401 1308203 1244412 1202582 1106589 1003709 950405 983037 969200 900989 836416 761676 771436
17390 771436 750883 803057 801081 796880 819184 784844 754314 759504 780133 729827 634170 591925
17378 591925 609623 578446 556725 589451 587281 576397 579102 574956 605889 614054 595210 611261
17366 611261 557031 569733 620290 635899 642962 616111 545704 503949 567135 566975 597493 600893
17354 600893 540872 526986 530186 445757 473441 538241 541893 440188 435058 434646 425960 428893 356279
17341 356279 286297 292116 302844 318700 350200 352890 305119 338211 417353 356968 286792 296429
17329 296429 367383 396658 366486 312596 284362 298575 266333 276332 287526 311485 331390 286810
17317 286810 166572 108980 153202 151852 177135 191248 201987 128620 100959 58434 88318
17306 88318 170733 209911 203719 157391 110118 110851 137716 157532 139298 228593 289968 290655 242677
17293 242677 210852 167074 132092 171358 234547 245219 184955 201963 201224 152882 197456 282538
17281 282538 349149 293985 261227 280491 303934 322630 346198 349169 411847 490949 533779 506607
17269 506607 502407 522734 521731 441503 396444 427691 426596 409615 382195 476427 546254 534816
17257 534816 495802 524592 624402 677922 638280 540525 515731 509728 491451 514165 471481 403777
17245 403777 347225 250563 217890 274302 303935 339215 298821 308471 301464 228883 194481 244297
17233 244297 273018 268191 193685 256638 265301 233878 187528 220573 301812 305657 287264 342630
17221 342630 305302 316333 333558 404486 460489 474772 460796 478395 432199 407239 469199
17210 469199 571565 494208 330245 275678 304000 335223 383203 449286 451531 453466 511558
17199 511558 497339 436101 352519 278305 310840 402206 394111 325236 298928 291436 286751 231076
17187 231076 213118 215611 191145 187436 140191 147656 172823 185698 213697 207706 219032 204213
17175 204213 148974 108402 132272 119206 102488 151245 166092 201652 237905 225281 156080
17164 156080 140735 124760 127762 178734 231642 229583 210959 210448 249174 360774 423809 510534
17152 510534 566129 502213 460865 500101 493391 538430 555407 550707 489383 387766 387187 427647
17140 427647 474091 533271 555925 544916 482653 412106 399113 416526 294197 245172 198066
17129 198066 224068 210987 218959 184032 146607 171416 214773 251919 264123 296134 265375 245232
17117 245232 169880 138434 134271 151292 173264 213891 244258 233883 230332 246454 271018 245995
17105 245995 295093 381403 498881 528747 515945 526704 501682 525106 613112 585347 480555
17094 480555 440977 379758 312422 288306 293955 311256 314865 294808 329681 337097 363127 397065
17082 397065 435030 474005 507375 542033 500996 463171 401668 374376 378605 333644 236691 167763
17070 167763 182744 201360 199852 227804 175894 167074 181158 185193 168220 98102 89656 71622
17058 71622 41454 67509 142939 163111 154354 103319 106735 113827 147800 164382 143277 166132
17046 166132 186919 148884 80348 33495 -4200 40029 100795 103601 103136 119908 56232 23978
17034 23978 58053 61566 59790 130541 125992 97113 47033 -51286 -25457 77791 90495 -8821
17022 -8821 5461 38964 52490 108095 124642 83563 -4785 -45853 18046 48396 54515 44011
17010 44011 41606 23435 34192 71968 95922 62040 67797 80632 101660 33506 -6663 7170
16998 7170 64442 100574 90847 59491 85126 129233 94845 131032 134233 69752 86284 103676
16986 103676 87844 64712 23298 12932 -12926 7909 23057 -53323 -76865 -45901 -2589
16975 -2589 37655 72419 56292 52241 21648 11418 -2826 -10554 -14135 -26843 -32075 -11330 -14209
16962 -14209 25188 27039 41776 41241 -3446 -13938 -36869 6722 12280 58265 105756 96024 67018
16949 67018 100213 82451 78612 75488 120198 144141 133567 87118 75975 73659 130494 162725
16937 162725 84605 52911 -17906 15648 54270 146131 94217 24843 -41113 -21576 96315
16926 96315 96212 62292 38716 51097 73379 -11047 -23309 66914 107649 109762 89484 47296
16914 47296 45661 35229 39331 75762 119852 66050 50485 41215 35876 23225 79892 192019
16902 192019 194642 66255 4749 -41209 9245 79072 47730 2961 -10643 -52524 -74581
16891 -74581 -26610 -19864 -2285 -11643 -10690 -50190 -112005 -111655 -64732 -15382 37945 52289 85987
16878 85987 110243 120676 108975 116162 84618 71272 84897 61048 20726 47317 37079 67275
16866 67275 115739 18761 -16946 -43303 -65478 -35174 22373 68638 28428 -52429 -54755 -51557
16854 -51557 -23707 -2763 -14969 -3906 46475 78077 125790 87624 13882 -49537 -79740 -67742
16842 -67742 -21273 73690 70387 87584 68351 42510 31094 -7564 -34702 14553 14288 -41728
16830 -41728 3478 36578 21509 -13071 -19403 4586 11300 -50195 -53502 -46778 -17052 -75141
16818 -75141 -86733 -76629 -68927 -44064 -21754 555 43155 75473 99984 110790 163248 99057
16806 99057 27975 11579 -1874 -9625 -46428 -31786 -14505 -21635 -66190 -95656 -93966 -54219
16794 -54219 -76019 -99612 -91500 -47116 -6377 39349 67984 93195 44239 -4982 8848 -18823
16782 -18823 -22584 -17837 44466 117999 123264 121261 57112 -15363 -2342 23023 15463 13253 -14875
16769 -14875 -26909 9821 89694 102715 39021 7948 -13605 -56090 -101429 -95393 -63490 10970
16757 10970 17836 20102 66461 55019 -21942 -12484 -4617 -31306 2021 25521 34950 -6171 -47683
16744 -47683 -117033 -97484 -36168 -5639 -47210 -10650 65076 -23382 -62776 -48384 3109 38508
16732 38508 43804 -5067 -41284 -65551 -8883 82290 66438 26858 -14082 -13125 -3556 -9257 -8409
16719 -8409 43431 -24005 -16000 70480 30012 31936 10121 39212 62080 -12368 -16742 24292
16707 24292 17267 -834 30607 3493 -5109 152 -18906 -43989 -50309 -7344 -11051 43798 39079
16694 39079 29034 77575 107884 35635 17756 58812 -4781 -11287 34779 27395 -9933 -39695
16682 -39695 -35716 10932 35724 24294 37548 2505 -5391 -17027 -21320 -14319 -18481 -39215 -23512
16669 -23512 -4948 218 -26373 -42417 -84216 -52510 -52125 -73772 -45413 -61852 34741 5072
16657 5072 -82365 -112087 -122651 -104868 -58357 -16162 -47999 -87110 -53452 -43385 -30178 53942
16645 53942 83886 60951 34649 31938 54476 32380 -7955 -34530 -47423 15248 91279 101496
16633 101496 106765 64902 48481 -29652 -50565 -55200 -92345 -118437 -116353 -77979 -61477 -102273
16621 -102273 -101212 -86794 -127874 -82867 -47095 -44941 -43582 -27198 -17183 61414 39037 26784
16609 26784 -59725 -63985 -38944 -50653 -94140 -108987 -124567 -113354 -79486 -32669 3293 38245
16597 38245 37171 2297 11316 -26780 -65843 -75189 4623 36944 21539 18375 58595 50986 27144
16584 27144 -9960 17712 68441 113116 110136 95237 93360 59055 61474 70784 104831 100168 50631
16571 50631 65996 58773 57454 39380 17298 -991 1465 29156 -1153 10142 8053 53322
16559 53322 45991 69019 128966 105180 22975 15285 7751 11678 -16126 -111258 -141142 -106179
16547 -106179 -26894 -17904 12330 -15970 -20208 -4266 -22584 -19617 -34607 -45885 15390 57220
16535 57220 111546 109335 57409 87356 70894 13488 -24560 -4124 6070 42095 39374 34462
16523 34462 26455 55253 45214 29513 -12780 -22876 28872 81562 55893 11274 24856 27262
16511 27262 51668 57860 65210 54214 -11421 -22286 -28244 -10681 -16179 18957 24895 -52508 -57979
16498 -57979 -12744 -19924 -42622 -55805 -17864 30429 38350 -3148 -39657 -8927 22684 51826
16486 51826 52823 6778 -32708 -53772 -39485 -1462 43538 76999 81114 60346 20354 -11513
16474 -11513 21414 13818 -8477 -15881 3548 -9333 -20391 -44859 -106167 -72166 17118 5571
16462 5571 -26966 -8958 42652 40214 53684 75013 77694 65507 52498 17090 -29964 -11225
16450 -11225 50128 90405 28143 -54859 -39948 29267 35893 4120 -28119 -47362 -9335 56173
16438 56173 40261 -1917 -28438 -12031 49435 119947 81656 -5389 -55742 -65622 -33870 32462
16426 32462 -14196 -33686 -52888 -28820 20268 -513 -17308 37052 60980 42682 49143 43293
16414 43293 6960 -43640 -53988 -75330 -23360 -23712 -42961 -39554 -9976 1896 18851 28989
16402 28989 49265 57325 22544 -19446 950 -45410 -1986 44058 85200 73258 18184 -49652
16390 -49652 -90919 -56672 -13558 -6180 -38725 21293 75711 99136 116300 136952 93722 4969
16378 4969 -15391 -7222 -28631 -72915 -73007 40220 77999 65671 69687 90697 36268 73072 74252
16365 74252 48292 20136 45635 33923 37076 52654 7479 52294 50339 10440 -24165 -63803
16353 -63803 -89379 -34510 46885 35483 -24889 -57151 -48908 -58364 -115312 -181261 -102756 -21112
16341 -21112 9249 -42965 -102281 -42129 34599 36129 23907 15870 -18592 -61679 -52199 -50427
16329 -50427 -69417 -38199 -38270 -43591 -50071 -43929 -51624 -54969 -97050 -108208 -6400 25434 20994
16316 20994 39844 58910 1237 9839 67280 34567 -27496 -76886 -13921 968 -5863 -38196
16304 -38196 -19334 45 -17173 -10408 54843 55538 1700 4087 3293 41027 33561 -18861 -8526
16291 -8526 -13576 -34293 -57388 -65861 -40278 16361 80936 42218 -1280 5846 24274 -1844
16279 -1844 31077 34575 33050 10225 -21394 14457 85503 100201 87881 41784 36671 20556
16267 20556 12727 40115 27497 -30599 -31266 29401 22948 44176 79070 38166 50161 63804
16255 63804 23842 -35211 -18906 -37676 -94047 -139104 -89878 -64928 -28591 15270 15198 -59267
16243 -59267 -78662 -34073 -6824 -7704 11523 60654 104872 78102 -11045 -20786 -38538 -76659
16231 -76659 -30564 -8872 -66107 -79486 -73188 -11614 4813 29704 29804 38467 53951 51383 54554
16218 54554 29016 -1810 4228 -48288 -48549 -80241 -98534 -3122 62739 78297 64996 -61
16206 -61 -13543 -14312 17296 34817 42068 62938 38154 -24788 -80265 -93254 -42397 -36971 19117
16193 19117 26954 8985 47896 -10392 -22960 1604 3494 24493 67244 49194 -20465 -48721
16181 -48721 -48617 -9587 37833 75947 9149 -32047 -4135 36160 20377 42098 120332 155282
16169 155282 91326 36324 9483 -46675 -79252 -43529 22545 38378 -15086 -35697 -38914 -20523
16157 -20523 -94264 -84539 -3678 53534 25319 -41737 -31361 4415 -101124 -113327 -69657 -89963
16145 -89963 -59915 17530 74754 57668 40828 -14947 -52842 -88648 -77846 -101535 -124900 -127771
16133 -127771 -80319 -9723 -6357 -5016 5127 -30561 -60862 -98423 -81886 -83764 -54941 81
16121 81 11297 7243 46615 64485 41977 -44824 -66225 -47040 -9368 -48361 -124901 -88219
16109 -88219 -45297 -59594 -60706 -90196 -59995 -12248 -39186 -65730 -96713 -111452 -95171 -84322
16097 -84322 -108702 -162326 -124405 -69476 -80356 -110205 -79135 -85187 -152085 -111752 -118515 -108214
16085 -108214 -59041 -25485 -11363 -6449 -45615 16011 44948 -33691 -77041 -49782 -25082 -105241
16073 -105241 -181833 -206531 -178242 -137557 -69870 -25522 6922 52270 76007 15035 -105
16062 -105 26636 1137 -18142 21615 50128 52633 42969 38785 -18506 -32489 -44148 -46063 -103422
16049 -103422 -118351 -101495 -78996 -58794 -17549 21153 46578 -24859 -62139 -23759 11235
16038 11235 5078 -24585 -41589 -88858 -110023 -91945 -4069 75308 14110 57543 112359 98031
16026 98031 76159 50423 39010 -3725 -78059 -44292 -1774 10780 -37147 -70650 -56923 -37952
16014 -37952 -64841 -22262 56070 -150 -40188 -13871 -26102 -63372 -29595 58612 91816 85250
16002 85250 7157 -36978 -47215 -78709 -112562 -125285 -99719 -120967 -129350 -55166 2576 10795
15990 10795 -14122 32915 34533 25021 29572 -4050 -44278 -53732 -5008 22046 -36172 -105034
15978 -105034 -96002 -40702 -15374 -11013 -68843 -138209 -123753 -989 20399 -31193 9912 85230
15966 85230 57201 -14097 -51029 -51063 -73596 -73715 -27421 -3575 -14077 29805 32263 -41962 -45183
15953 -45183 -11638 42256 50403 50975 19448 -1270 10773 4678 -21524 14957 -33436 -93979
15941 -93979 -91968 -15770 29266 47210 -6918 -28472 -18062 15851 -54949 -704 62675 58793
15929 58793 88703 139444 114632 81300 66859 28756 10997 64983 83514 -4164 -10239 -34398
15917 -34398 12895 25810 -2516 10958 -59812 -78483 -13418 -44189 -45617 -28447 20738 16357
15905 16357 -55280 -93341 -83743 -68498 -38503 -9007 42994 86989 -3998 -56385 13471 59651
15893 59651 85259 99985 14950 -40804 10769 45453 20714 -41363 -17348 26632 61018 55486
15881 55486 22128 -21873 -31602 8337 -23410 -61668 -19848 76309 2495 -54506 -49741 -63894
15869 -63894 -74316 -75708 -11273 44669 66482 77429 87426 78181 45558 -17490 -249 -11856
15857 -11856 -23796 18643 -9744 -2192 -18010 -80237 -92313 -160177 -142683 -64695 -9351 -91
15845 -91 -30378 -51397 -4647 -33313 -46753 2631 7550 -26810 -40071 -20997 -60483 -101073
15833 -101073 -21516 9170 52621 33696 37645 51081 13642 6846 12636 -13162 -5874 7816
15821 7816 25279 19266 -15181 -16741 -4682 -15696 -15309 -21647 -63638 -61551 -55378 -49964 -53441 -14700
15807 -14700 39793 36189 62609 69250 24861 -17302 -10481 -8438 -32669 8666 38049 90143
15795 90143 141221 68574 48510 63211 26301 -31044 -95361 -109664 -65877 -24607 -27529 -45617
15783 -45617 48193 18359 549 520 -11532 -56989 -61870 32005 75647 13777 -21639 -59700
15771 -59700 -28204 -13706 3594 -14923 -38031 -17782 14284 28092 -10268 -6354 55224 51516
15759 51516 47020 23115 18625 52006 47592 16016 -1351 -19844 -37010 -19407 10847 14206
15747 14206 -14181 -61536 -53371 -78925 -92132 -30553 -14232 -49546 -48081 -44365 -19151 -35414
15735 -35414 -63092 -83794 -90594 -89161 -57932 -85744 -56472 -65685 -125240 -95474 -48837 1738
15723 1738 34271 -15250 38663 39624 43329 11300 -73203 -98241 -72362 -58705 -63302 -55296 -23610
15710 -23610 -4074 32040 83111 128315 113883 67688 118013 82644 -12976 14105 53825 51104
15698 51104 35790 50048 105109 60451 33080 -3682 -4743 15197 66184 105501 92642 51336
15686 51336 15111 -10438 -69266 -38303 8368 -73217 -140438 -197607 -153556 -127040 -140047 -160538
15674 -160538 -151854 -127427 -100193 -81874 -45520 -8094 -12415 -38649 -101370 -88107 -79035 -31130
15662 -31130 13940 -24368 -82377 -81418 -34189 -8177 -26116 -49168 -83627 -79606 -25060 19842
15650 19842 -20756 -65327 -76855 -62346 -64437 -49460 -99634 -115923 -97175 -89212 -43728 -10938
15638 -10938 63832 107194 83020 -41898 -97208 -79746 -4010 6689 21178 27769 62268 51286
15626 51286 23253 -3925 -35010 -6280 3612 9665 -20415 -55579 -41136 -29738 -72269 -86944
15614 -86944 -72893 -37673 -11851 29971 51035 6322 -47371 618 33097 27666 -11795 -19027
15602 -19027 -24576 -28820 10070 43204 23242 46815 36016 -5580 61840 96138 40438 -26863
15590 -26863 -22489 -4977 -1839 -34976 959 23968 46477 -12683 10607 85251 86179 61278
15578 61278 458 -110473 -65762 52858 63474 47843 38813 38577 28713 36217 27425 39044
15566 39044 -7349 -23424 28414 52352 -13034 -63952 -58152 -68689 -56611 -807 15426 39638
15554 39638 30086 -31111 -104042 -72892 -8270 -18971 -40130 -32545 -13323 -9996 -2853 35875
15542 35875 77142 111492 137166 75687 -28174 -87924 -43916 52131 107666 137884 124121
15531 124121 40578 18561 79469 20162 -17219 1909 -5217 6644 80113 39098 4270 -90786
15519 -90786 -116385 -58889 29762 40914 2903 27062 51392 82414 75068 14033 -27898 -8690
15507 -8690 -3230 33778 36909 49215 53590 77448 22279 10420 27027 -19026 6014 14716 -18107
15494 -18107 -56665 -93990 -28223 45432 10519 -8651 -29810 -43657 -13543 37545 21528 11338
15482 11338 -19498 42428 42359 57300 42500 -16119 -24740 16644 -17082 -9789 -30106 -44381 -39608
15469 -39608 -22638 -36789 -115200 -210098 -167491 -83373 -21966 -7136 -7888 -27404 -83909 -135007
15457 -135007 -119521 -78462 -63221 -45138 -45307 -62330 -41285 -44287 -60095 -37991 -38327 -23416
15445 -23416 -55699 -35590 28801 81935 42649 64590 147416 129087 59081 51529 4974 -56654
15433 -56654 -127566 -131169 -82617 28182 66760 69192 10540 3142 -17306 -19766 23823 32875
15421 32875 20055 31029 28995 64155 39377 -30476 -46445 -49658 -32559 55884 58204 74863
15409 74863 6708 14525 11218 -6901 12351 29490 106889 79230 109703 152768 77833 21876
15397 21876 7458 -17563 23903 17873 9297 47415 90634 79150 56006 29989 13724 13488
15385 13488 65171 14035 -67523 -72567 -47576 -42332 -41817 -10537 15034 45997 71526 33531
15373 33531 -22506 -65082 -27012 -14190 -64093 -91147 -63357 -94995 -127083 -84082 -117257 -64395
15361 -64395 -87379 -109894 -131881 -127228 -20413 32437 12542 62221 46982 6846 -24097 25420
15349 25420 93542 63018 37602 -403 21 -5671 -72190 -71299 -4122 22737 -13932 -31354 -6686
15336 -6686 39128 41427 -8736 -45984 -32364 -26672 -63468 -42351 -54839 -34627 -3980 34045
15324 34045 12288 -16576 -25303 -63151 -48484 -36883 -43054 -51559 -35198 -7844 44090 54793
15312 54793 16072 -44499 -59122 -48385 -44236 -41580 -37133 5333 15546 21268 -2139 41561
15300 41561 53995 12387 25881 52444 22028 30395 -18106 -19317 -44295 -12922 6671 -24291
15288 -24291 -79354 -79451 -12436 49251 32246 -53636 -96627 -61104 -32865 -26266 -8294 16095
15276 16095 13983 2588 66311 132111 106998 13375 -46050 -57868 -31602 34254 52129 59471
15264 59471 59104 43113 32712 98037 108171 -28009 -65265 -65704 -1036 -10328 -18501 -22439 -29072
15251 -29072 -42327 -28282 929 22925 32256 2209 83431 124515 123791 136524 193252 169191
15239 169191 130772 155169 168692 159810 220603 282103 415490 614875 885794 1206475 1629705
15228 1629705 2126811 2556004 2791207 2911461 2751456 2332227 1796756 1319748 1008942
15219 1008942 757147 589752 512615 510520 491310 462398 408777 348207 297638 280457 323794
15208 323794 345808 330611 297883 277301 224945 235944 191649 146954 151941 158977 143759 102475
15196 102475 92404 150041 186147 181723 198111 217292 187065 197484 228983 219154 172214 126416
15184 126416 178107 183113 178180 191754 143864 99295 105658 129119 140919 123321 155132 154334
15172 154334 122476 97791 97184 86717 68295 67665 66830 100463 83676 51572 -19468 -47987 -42971
15159 -42971 3085 44344 6500 27346 14499 22489 84700 115972 112605 37842 48322 -2425
15147 -2425 -48731 19365 47486 44121 55763 79836 80985 2519 -85692 -57099 20403 2867
15135 2867 4578 30159 51834 40017 2462 45208 106906 14742 -38632 -21316 689 33642
15123 33642 74193 66518 32628 53355 70759 54600 -10776 44121 59681 800 -79525 -29348
15111 -29348 38391 39330 36149 16375 37670 -35156 -91927 -70942 -52810 -16992 41386 -12495
15099 -12495 11469 52783 36236 69089 100461 60167 31743 36905 56775 35793 11822 13817
15087 13817 65849 70858 99808 99704 106895 61301 24541 75034 76732 39252 27380 -24792 -45774
15074 -45774 -12150 14430 14563 -2570 -39306 -49896 -8983 19105 66828 100194 70025 72643
15062 72643 79918 110330 60817 34537 -15029 120 18053 -31335 -35547 -12735 46616 60343
15050 60343 76264 88018 89407 56904 1697 -10078 -16694 -54334 -15501 46140 78365 107765
15038 107765 105157 61837 15801 -9399 16259 -2108 24054 11463 -51961 -81721 -42134 -56942
15026 -56942 -6097 23839 6547 18361 21851 52323 55837 18933 40416 29159 8203 -22336
15014 -22336 8677 16585 677 -33676 -24694 -4477 24816 39370 56079 50397 56526 69681
15002 69681 44224 28809 31715 53716 39903 -37922 -32518 -55917 -23874 -11650 -24939 -16046
14990 -16046 -37776 -29687 -42514 -39436 -48021 -86455 -104235 -95039 -116171 -91590 -83793 -74950 -47898
14977 -47898 23840 46754 52269 24847 7425 -10708 2706 21217 19303 8007 -31817 -22327
14965 -22327 55901 106837 59247 -41705 -25388 4388 36913 30929 -3804 -21707 -75529 -118652
14953 -118652 -90148 -39238 -7294 75346 129244 72759 39886 26371 54386 10115 -34845
14942 -34845 -29404 -27817 -12212 4137 53433 32776 14197 51117 -14345 -49354 -39472 -28676
14930 -28676 23959 -3138 -49660 -22332 -32832 -93458 -111220 -83714 -32038 50230 72939 103301
14918 103301 109894 26482 -21766 -95051 -83230 -47269 17838 18152 -39360 -75967 -45489 -1718
14906 -1718 -23983 -59592 -28709 -21866 -10873 27951 42732 11153 -51831 -87912 -70239 -20127
14894 -20127 -5570 58072 82203 60148 24371 19532 20134 -4955 -8806 -76760 -61320 -29226
14882 -29226 4862 17444 33527 -4328 22620 -18573 6151 -25545 -34336 -22863 7294 -8909
14870 -8909 23367 17095 3216 28041 64470 16489 -10321 -63929 -132471 -115544 -68968 -110448
14858 -110448 -107002 -63928 -43571 -95144 -114211 -68694 -37113 -50156 -22284 20027 -1738 -35686
14846 -35686 -22713 41898 -37075 -75083 -35320 -29246 -16015 2735 38160 17004 -1560 39885
14834 39885 30804 -21393 -62659 41584 118603 102905 70150 72682 110637 36009 -7105 120516
14822 120516 82915 -6386 -24187 21666 2567 -23207 -14342 -15410 -36813 -52450 47022 38634
14810 38634 5024 47633 45175 -12880 5426 33160 20441 49911 11285 14935 97839 63016
14798 63016 3527 38690 30614 51407 101296 25702 -12561 -3825 12079 79460 124787 85666
14786 85666 80116 103032 73902 -1295 -26812 -38919 -17386 5749 -9332 40345 54039 -12210
14774 -12210 -55592 -46256 -69270 -58986 -25554 -50363 -117671 -76793 -2259 44044 22265 -18501
14762 -18501 -40337 14246 62732 84838 80353 47761 -17173 -14069 14776 63754 46763 22912
14750 22912 40907 97499 65885 4155 -46865 -73531 -47156 -12346 -19458 -69431 -92019 -74157
14738 -74157 -54519 27399 29016 15725 8761 -47227 -48855 -65903 -56773 48268 115012 105717
14726 105717 105733 53716 30277 43514 52998 31292 50871 43712 14035 47371 20136 868
14714 868 34866 15325 2013 -3652 12991 -28056 -45867 -32401 27794 18148 43444 24273
14702 24273 -29117 -66892 -70841 -63798 -55593 3048 3406 38204 88681 87432 83850 45221 32519
14689 32519 4939 21209 47643 34572 28926 34433 7482 -59564 14384 39959 39083 31447 51620
14676 51620 1762 -86316 -99603 -107047 -131314 -54720 -28999 -31224 -86372 -82450 -103352 -105935
14664 -105935 -68164 -30062 -34169 -81914 -46147 13208 -11592 35615 -20789 -18578 16137 5542
14652 5542 3718 -32642 -48448 -49624 -62172 -67039 -107679 -180813 -137437 -98746 -21384 42598
14640 42598 12364 -7563 -31541 -49634 -24027 23564 19661 -12338 -81712 -34188 46534 34766
14628 34766 -19788 -5210 -18950 40642 7256 -41279 11835 23409 35930 101719 96437 69416
14616 69416 2454 -38672 -39719 -41159 -68463 328 28365 67598 78698 106756 111302 96762
14604 96762 54331 -97 -57941 -23534 8276 23945 -12175 -12842 14464 37482 55249 80938
14592 80938 31187 9834 11554 25981 47288 64347 60417 19311 -42639 -74073 -71623 -18481
14580 -18481 -33755 -23426 -12884 11016 2096 36973 4031 36385 57191 80838 7412 12272
14568 12272 17027 -18222 -44862 -52240 -61223 5698 37455 44497 38096 69972 96843 101113 56015
14555 56015 37579 14806 44130 42448 49131 58030 6580 -1734 -3788 -21938 -14518 32341 -9367
14542 -9367 -130616 -112574 -74537 -39073 -38008 -38733 -12005 18843 33471 32094 4350 -4657 22618
14529 22618 33245 -4788 -77011 -84642 -45638 -30385 -27832 -11677 45132 -9945 -35749 -49171
14517 -49171 -32692 47690 40333 3428 -57573 -66359 -83048 -102368 -115317 -94963 -126033 -129981
14505 -129981 -79371 -41244 -73119 -53025 -4591 10052 -19592 -47184 -51825 -51564 2523 5479
14493 5479 12881 -24440 -14929 48979 106696 99136 19925 -15068 -42749 -47157 -23764 -53144 -69511
14480 -69511 -100323 -142608 -140987 -113531 -66735 -54556 -46313 -25718 -1257 -32301 10224 -17197
14468 -17197 -108149 -98240 -22248 10587 39600 39319 98779 104458 57348 -11352 -32542 -76942
14456 -76942 -112428 -71531 -48805 2658 22752 10978 19157 -45902 -40039 27584 64604 31921
14444 31921 30874 20306 -105827 -113338 -76109 -38592 -20457 22042 17869 12852 64123 109863
14432 109863 118178 77213 63576 68308 102157 69349 46559 -2129 1285 3495 31116 -7399
14420 -7399 -13751 3839 47269 -7858 -15779 4863 100639 144747 139396 100957 16341 33762
14408 33762 3172 -43621 -32828 -41503 -14921 -35042 -89757 -71197 -8418 -6830 35559 75681
14396 75681 107107 59918 47597 64573 23447 41634 18365 -9114 95383 73455 8353
14385 8353 -31519 -61565 -40910 -21053 -36928 -41095 -52661 -13404 -50663 -61457 -86074 -126830
14373 -126830 -49497 -10323 -3414 14937 41258 56319 82696 88996 46106 53141 56024 36324
14361 36324 36352 -25442 -16657 -153 361 -24726 -53885 -35240 -16113 33548 17654 -62798 -60988
14348 -60988 -79081 -25651 19951 7323 -11762 -23079 30409 -55 -51230 -67283 -61262 -96413
14336 -96413 -39602 -6200 42364 56280 32929 13579 -5639 -5666 -8956 53959 118431 123063 129662
14323 129662 83149 40822 80570 15834 10363 55140 58625 29720 -52255 -101899 -80094 -102306
14311 -102306 -71294 -59168 -55144 38268 55519 -5469 -89563 -97322 -102081 -92074 -98865 -77193
14299 -77193 -68532 -4469 76731 86943 37327 51608 95029 34288 37290 33666 -38638 -72364
14287 -72364 -71487 -64313 19435 60916 32553 41377 -1776 6323 35958 94392 98794 232 -45513
14274 -45513 2448 5779 9383 -19411 -18187 -42864 -3820 -715 -5092 26564 64233 105793 90771
14261 90771 89758 95894 98426 82644 85449 87369 119451 101831 78455 102637 153335 125760 149369
14248 149369 164155 133716 138388 151852 185020 256435 267524 319602 340520 418058 654182
14237 654182 1004751 1466112 1844302 2052984 2141486 2072029 1863459 1554671 1181249 846420
14227 846420 641506 536679 444585 424299 365836 317650 291390 324913 391754 380877 343647
14216 343647 327882 314921 310427 324526 260524 212518 225127 209503 139999 138376 121046 164953
14204 164953 183527 134956 102996 85944 99300 100059 78953 120759 128838 84907 103227 98016
14192 98016 78733 20696 -5720 3949 39442 11196 55260 12703 4476 59179 113270 107143
14180 107143 105564 83331 76606 98499 56765 71699 29071 16204 93192 122336 113392 32289
14168 32289 2255 -15933 -58609 -67194 -54446 -48972 8552 -6692 -39380 -34132 11912 37759
14156 37759 39535 21105 -42410 -89046 -42838 11252 39013 63220 59838 8383 16060 80299
14144 80299 163381 92022 25129 4789 -17590 -17895 -20093 2716 77185 84105 92002 111502 48665
14131 48665 20785 -2448 4430 34575 32570 -10095 6832 33722 67240 34426 -3582 43742
14119 43742 35948 23265 -28678 -83054 -57071 17457 38403 74433 71044 125641 116222 -18747
14107 -18747 -104825 -41336 22735 11948 -20537 -41874 1443 35809 11476 -91954 -68427
14096 -68427 40703 17683 34264 29642 11185 -40915 -33183 -49301 -25663 6979 77010 90024
14084 90024 43975 -30531 -63746 -104818 -73779 -85132 -72568 -42489 -26666 -26761 -58203 -62002
14072 -62002 -69781 -10080 -9978 -10503 281 11482 -29375 -5369 33655 -8344 -39702 -24549 -7710
14059 -7710 -29087 -58539 -43104 18094 33902 53989 55726 102802 130158 136779 164842 159616
14047 159616 67683 971 7526 4455 12819 -12594 3504 7844 -9568 -15857 4059 13029 -13218
14034 -13218 -68750 -103801 -97138 -40569 -55036 -77978 -27671 12249 -4134 36682 125506 164836
14022 164836 93766 23105 -24177 -24107 24764 91284 88107 28521 13156 7244 38027 72155
14010 72155 142078 205717 210804 216267 295371 329416 350795 298005 283897 280961 221747 162688
13998 162688 87667 113332 131835 120665 126798 149106 128619 85505 52019 47938 124835 100977
13986 100977 92269 119547 84343 41649 68908 76630 90961 116073 84310 64376 31297 31131
13974 31131 43148 71996 78255 78151 63768 93823 102642 88843 90597 102274 93119 45043 -4472
13961 -4472 35990 105749 60003 14007 -13084 -71353 5758 -24862 -51534 17690 95373 98280
13949 98280 37681 33950 27965 36988 -3773 -11943 21365 24468 19601 2864 13834 87167 138498
13936 138498 65155 21475 113090 139492 223434 208427 143613 108748 80759 53385 72693
13925 72693 71611 32187 -14456 -71368 -117147 -121799 -94060 -35026 34128 89894 69785 91259
13913 91259 130086 172040 126033 9020 -79847 -83471 -97968 -32236 -14878 -14153 -4231 -24077
13901 -24077 -13209 -46772 -91128 -105888 -79686 -38173 -24574 -11453 29404 61764 133451 199639
13889 199639 218731 295219 370617 522995 692627 849463 1052638 1306788 1542074 1795359
13879 1795359 1980476 2064748 1990832 1841194 1637781 1411522 1244031 1159532 1097438 1063911
13869 1063911 1016118 1043861 1073096 1024562 995506 991333 976694 951063 933003 882358 764245
13858 764245 748536 707786 627310 589779 571916 560363 548764 495303 527978 559509 605519
13847 605519 654736 640333 647458 619290 521429 489786 486958 543991 588130 563728 556676 532360
13835 532360 465490 460410 511415 578725 553077 522827 575551 555048 499761 504795 598256 581551
13823 581551 481105 489210 549661 623308 573632 537209 560979 641988 686156 763107 795288
13812 795288 789460 776042 826641 810560 804835 824244 772651 762641 827297 892176 923334 860860
13800 860860 887541 1012658 1123314 1198536 1231883 1196075 1185673 1209751 1270550 1342852 1369643
13789 1369643 1414306 1505570 1572188 1650502 1806667 2001270 2147391 2310169 2448347 2672839
13779 2672839 2919379 3243061 3619676 4093633 4757992 5670459 6803548 8022774 9320853
13770 9320853 10629638 11835890 13064272 14447769 15973609 17975739 20780344 24602716
13762 24602716 30098485 38441268 51737735 73229121 106746565 155104914 217213061
13755 217213061 285130719 348624787 391422245 404842412 385145059 337530450 276788385
13748 276788385 213863976 161677023 123107797 97944562 82417034 72468665 65781457
13741 65781457 61089652 57683015 55106918 53066589 51267766 49460281 47433525 45209422
13733 45209422 42692872 40121388 37674763 35434461 33467072 31853793 30472539 29204550
13725 29204550 28092252 27054339 26090822 25212782 24338515 23504711 22732927 21973910 21275821
13716 21275821 20610106 20003962 19453111 18845560 18281470 17801963 17331412 16940233 16607023
13707 16607023 16284714 15941100 15566556 15208474 14840339 14478066 14113495 13717298 13302674
13698 13302674 12897901 12510614 12169119 11873064 11560844 11217734 10848227 10597585 10424483
13689 10424483 10185472 9897291 9715319 9557691 9446056 9244722 9033863 8865898 8649066
13680 8649066 8485648 8314126 8122506 7879655 7644776 7444588 7248876 7096814 6973396
13671 6973396 6835427 6775201 6702533 6556899 6369999 6260021 6107321 5988289 5867528 5781971
13661 5781971 5697942 5510417 5323388 5227725 5147433 5053335 4960105 4875572 4844311 4738457 4638850
13650 4638850 4560817 4487935 4378541 4335074 4224700 4102214 4043168 3977385 3907271 3867474 3811923
13639 3811923 3780091 3780780 3779379 3684114 3632012 3609201 3638417 3735328 3841789 4000164 4210779
13628 4210779 4404104 4541149 4601469 4569171 4420115 4158821 4021218 3815464 3678308 3483527
13618 3483527 3295591 3197927 3172698 3245522 3238275 3274894 3292190 3281170 3259924 3224008 3129584
13607 3129584 3097324 3046003 2985551 2918293 2851869 2718258 2633619 2597806 2587105 2596247 2515052
13596 2515052 2388803 2269780 2206953 2125048 2115786 2157133 2164909 2115634 2060719 2002528 1966259
13585 1966259 1923049 1882404 1839463 1785968 1770914 1746730 1752899 1757710 1695830 1693647 1626886 1523894
13573 1523894 1526273 1513851 1442823 1388581 1367359 1338418 1349227 1322256 1299902 1310966 1310520 1323480
13561 1323480 1306049 1301642 1226137 1192886 1185598 1192579 1185067 1123353 1019382 1037027 1034531 995232
13549 995232 1026222 1088715 1154173 1163700 1182287 1122802 1108036 1089900 1091378 985826 926182 875506
13537 875506 896616 960975 1001685 960872 857818 830801 821377 747813 702724 744526 756599
13526 756599 712095 700357 717618 709280 698362 685227 711608 702900 615129 575389 562749 576807
13514 576807 617507 651078 619782 578362 573333 584864 624707 631565 610909 561794 575239 576855
13502 576855 543543 501764 479673 451274 479673 502957 526745 529648 512824 482220 444539 396069
13490 396069 376951 423196 461517 467353 412214 339283 347785 372216 390258 447853 407385 368284
13478 368284 384926 416993 415318 354930 294946 322019 362343 341936 320064 324988 322280 336205
13466 336205 350783 334811 364389 364227 295833 262927 239992 258637 290600 252937 258975 262433
13454 262433 277627 260378 280699 259599 278740 298179 289417 268556 281036 241957 198902 207013
13442 207013 190998 200211 218009 204699 151504 136309 200355 211058 186068 204260 255861 238804
13430 238804 259485 250904 236884 216305 201094 196439 212601 224341 223338 247450 269959 219278
13418 219278 210972 222292 150613 132104 185324 223231 232168 230415 194155 231189 226361 174151
13406 174151 197980 170342 144828 167348 165780 208023 202608 222443 182370 120302 156217 239784
13394 239784 230649 239352 207578 179154 218803 220935 183938 177092 226755 259020 253962 273052
13382 273052 198721 167042 157659 173237 195242 135708 72423 133681 203825 204554 209900 141222
13370 141222 190569 165956 105213 98055 102009 73444 84122 115040 99610 73126 45917 59608
13358 59608 53221 104990 119524 78510 74866 80514 63920 54138 93335 71321 15520 -3007
13346 -3007 -21004 5620 82720 90460 45308 60839 117168 152181 169450 207048 199344 198519 159464
13333 159464 157517 197372 178537 117411 143785 168237 150917 128008 53779 19064 6936 92176
13321 92176 198988 155510 128074 165780 238403 230748 152013 141870 198578 165452 118449 113809
13309 113809 100195 146774 188137 252773 299191 237069 237857 305991 368274 425520 467237 557919
13297 557919 788076 1062045 1321347 1559684 1657174 1580098 1333952 1029647 756853 605687
13287 605687 548813 499147 507951 543329 540775 471090 392923 343192 332740 355354 411534 415075
13275 415075 429142 429696 471085 526986 607243 771164 1029073 1332758 1641950 1984864 2179756
13264 2179756 2276411 2221397 2058237 1798100 1539582 1311803 1162810 1073222 1075973 1124463
13254 1124463 1314207 1695365 2359011 3242379 4229940 5105637 5412713 4974259 4100587
13245 4100587 3058360 2334440 1920447 1696504 1605876 1679919 1925588 2182242 2392332 2517507
13235 2517507 2404900 2120745 1783990 1555584 1380234 1257606 1093828 967586 861684
13226 861684 835720 815893 808061 799608 842658 812889 806227 787181 732692 743585 737692 713667
13214 713667 814148 889526 962391 1059936 1255312 1485871 1877308 2565902 3499312 4605170
13204 4605170 5527765 5750871 5061237 3850016 2820433 2221149 1991785 1993372 2219390
13195 2219390 2765459 3628347 4700712 5657216 6006816 5445591 4303423 3190057 2430940
13186 2430940 2012725 1747497 1599868 1469646 1383026 1323290 1249085 1150761 1027572 1079284
13176 1079284 1109342 1000134 917403 918560 937761 880063 869796 895357 953919 999406 1053634
13165 1053634 1091682 1097948 1246185 1528759 1875262 2255750 2555076 2530917 2178857 1733490
13155 1733490 1455688 1410196 1472516 1664014 1991803 2540396 3507939 4746784 5788015
13146 5788015 6033672 5225878 3879568 2833195 2160145 1844436 1586797 1466864 1355639
13137 1355639 1296731 1183331 1089788 1040410 1025070 1002301 959246 957458 988352 967238 896014
13126 896014 921061 859851 810654 828952 755717 773217 841662 783285 692603 649664 673500
13115 673500 652514 600445 606124 622780 582330 598594 685208 702832 746858 917023 1185478
13104 1185478 1532067 1937369 2221405 2179824 1804112 1426391 1088555 945561 862326 760419
13094 760419 675807 603027 550280 524513 507746 531626 580661 526292 480094 498526 501749 466978
13082 466978 502767 452047 447287 439549 435884 415144 397019 418060 416676 401985 395193 319423
13070 319423 309598 350426 353096 329219 356397 341157 364779 328956 267778 248842 229397 250257
13058 250257 223960 211461 182801 169889 245679 314489 287786 266961 252799 209712 198007
13047 198007 258729 277900 255328 271085 265436 259817 271829 217409 183665 161530 120335 144456
13035 144456 176254 157706 99142 122548 132257 107984 69875 128424 168157 144355 148352 169826
13023 169826 201628 232971 198044 148916 122475 90831 52372 49404 69107 72641 89315 145054
13011 145054 176646 152253 159783 185102 147066 71591 13528 148131 232205 203212 182963
13000 182963 136304 106640 138857 128174 180539 156172 61308 75656 176055 107769 102384
12989 102384 137978 203035 227545 139274 116182 113509 116300 135059 113384 87208 72209 84595
12977 84595 74990 66132 110746 98893 66831 78433 100741 70372 59448 90950 81011 55113
12965 55113 20729 46869 50028 55905 118940 147215 69545 70563 149915 207703 206639 169724
12953 169724 83131 32917 -8555 9838 13124 60911 93423 68536 88787 79142 133494 148260
12941 148260 122438 115414 105812 128093 76110 -4576 6817 86909 122134 130369 99672 120736
12929 120736 144646 134228 81362 108090 98092 53080 -14616 4179 20314 58550 131702 122585
12917 122585 82777 55156 16459 36582 24131 7165 44313 32308 7809 -27976 -87756
12906 -87756 -97572 -40429 92397 78782 62197 35721 -29633 -25939 -41202 -15752 -3478 -39730
12894 -39730 -50771 22279 34672 -1608 19739 27791 -49333 -93118 -102938 -99772 -39637 18513
12882 18513 -32306 -21531 26962 127 -26300 -45565 -23228 26160 39294 -12802 -1630 4904
12870 4904 -77209 -74181 1398 26865 70357 89707 94549 90235 22043 42926 79607 65273
12858 65273 38876 58742 83035 55599 14963 -45991 -33044 -16216 11585 -19184 5550 -26625
12846 -26625 -46997 45750 42790 -34771 -39871 -43501 -113941 -114025 -43125 -70861 -80442 -50149 -13699
12833 -13699 6021 -24211 -47303 -3667 -17808 -26273 13067 48462 49225 28665 39097 66700
12821 66700 33861 36000 80662 43579 36548 31586 23482 6819 4757 -11978 -33887 -27451 -25719
12808 -25719 -23260 -56202 -51343 8310 41325 -12070 16823 5514 -38311 -49933 -4408 -16560
12796 -16560 -3895 39117 29637 -27603 13020 52512 107748 99761 54187 45224 42699 9851
12784 9851 -38672 -79891 -881 32301 23676 -3610 11578 -19947 -25893 -13515 27279 49613
12772 49613 49432 30203 -5722 4164 -12277 -43181 -45810 -7198 18943 -42498 -49990 36749 35834
12759 35834 11151 -22024 25894 113381 128441 110675 70657 29537 37705 52627 31038 27978
12747 27978 28330 24335 40515 41492 67652 57237 58867 67215 49753 61610 53915 49585 -6568
12734 -6568 -36660 -32548 13103 71950 83124 108648 137054 41907 30877 -15846 -45070 -69361
12722 -69361 -32998 12550 12878 36891 57690 -2419 -33726 -30000 -27033 -106004 -149153 -109450
12710 -109450 -64473 -23119 -36597 -7494 -32163 -76091 -111683 -80535 -11528 21938 -21312
12699 -21312 2591 62500 64366 12420 14383 88079 134342 57203 -1420 42011 4781 -45706
12687 -45706 -55122 -71388 -28488 30460 100402 54437 34660 30732 -40538 2972 109004 72374
12675 72374 43773 30262 5284 -38929 -25378 -6621 28348 26729 7632 -15650 16448 -825
12663 -825 -30448 -50777 -57432 -67698 -82065 -76305 -127488 -122704 -136172 -134278 -94237 -17039 19054
12650 19054 4513 -4880 -16698 18211 68026 48306 6785 -48679 -43057 -13779 -68272 -76609
12638 -76609 -29512 -44383 -86335 1981 31388 8771 4049 47589 68705 78186 32250 -22751
12626 -22751 -28111 -24054 -7961 21163 -6706 -9929 15133 29173 43279 11279 -1226 -54932
12614 -54932 -64432 -46287 -53079 -75788 -79884 -82402 -91844 -79106 -18846 43616 59030 22226 -29190
12601 -29190 18322 57887 55328 8892 99595 100815 -1331 4666 -8442 -26950 -5645 18461
12589 18461 31757 38483 81523 92323 79401 23479 11124 -7458 52570 51840 65379 15940
12577 15940 16526 14703 -7280 -1641 -13455 9982 12873 29731 30859 33791 -19733 62524 109384
12564 109384 77085 65307 77311 108685 98549 74165 85983 150429 124263 -3692 -113374
12553 -113374 -161488 -129311 -35902 -27043 -80727 -44632 -20190 -41822 -76562 -41466 4485 -18747
12541 -18747 10407 77343 73134 64613 72358 121086 114117 25607 19507 -27228 -46523 -63946 -7727
12528 -7727 23112 34234 3119 -37212 -52272 -29575 -38956 -71542 -3929 40237 -32877 -18250
12516 -18250 27170 46522 40591 22030 48328 15702 7412 -5128 56919 126750 96412 36287
12504 36287 42277 46687 18176 5111 32559 32806 39866 86577 89750 16751 -3545 -15059 -36733
12491 -36733 -54582 -40184 21598 83211 61519 80713 85503 65692 48217 7639 24068 -41280
12479 -41280 -75005 -45878 -29676 -34361 11370 11948 25058 33897 71931 66682 54611 -10271 79263
12466 79263 110901 16042 -30063 -31005 -23029 15034 34587 28345 -18199 -19531 26248 -35313 -66572
12453 -66572 -24579 -7713 -31138 -27603 45799 38654 -10366 -31182 -42224 18613 17937 63083
12441 63083 31231 41730 27403 65334 34404 -30110 20625 69601 64358 61836 75943 63851
12429 63851 44005 6257 66126 76182 96295 78083 8496 -53413 -78991 -62342 11285 84801
12417 84801 141953 131785 78367 31179 -35710 -38238 -28877 -17836 11666 32820 21246 12262
12405 12262 19766 42014 -10050 -23650 -9696 -75491 -76588 -39436 -23876 -12714 -10921 -45405
12393 -45405 -64252 -23216 -22249 -26262 1739 -30659 -33627 -43926 -40614 -53458 -38876 21300 42048
12380 42048 39752 57178 45441 59830 50772 -4396 -25270 -47784 -44672 -46393 -6023 29591
12368 29591 19097 11072 -19598 -1248 33555 42275 61931 80764 83893 81542 118161 158264
12356 158264 136557 77650 31215 -25714 -6714 -28208 25259 53519 109265 133356 110984
12345 110984 68449 24724 15435 11837 33374 88225 41090 30104 65142 111518 73884 91485
12333 91485 88507 111553 73219 24850 52633 30151 -23221 -56891 -31516 -1058 3240 -23915
12321 -23915 7490 58509 79175 105352 92189 56118 135129 159356 162441 175092 160400 154736
12309 154736 141051 118109 83916 60481 56357 52798 68516 42279 -40029 17513 52770 17564
12297 17564 -15454 -32034 -11488 4941 -29475 -61704 -14925 4089 -49166 -57637 4309 34566
12285 34566 64618 9669 34330 28901 -13510 45046 21834 14727 29550 25973 4391 -11580
12273 -11580 83389 192494 260876 326249 367358 352569 299820 288015 293387 221252 151386 60613
12261 60613 26075 16380 31573 -7081 -19302 58366 44574 52625 65069 88731 103640 92226
12249 92226 38828 43019 125725 103136 -110 -28145 42439 75422 101363 79530 71884 57172
12237 57172 28180 32180 131117 157714 111509 103003 121409 80936 87357 134370 187950 188830 286186
12224 286186 355044 261036 164484 127076 185103 243621 196060 163429 163602 149617 151107 78149
12212 78149 8187 41999 73764 61886 58861 70835 48232 33945 13488 48941 32652 9765
12200 9765 409 -11207 8459 79619 28799 -54991 -102860 -108853 -83441 32432 143920 185414
12188 185414 144751 49408 44587 66826 41366 73457 119201 92595 96481 137377 87595 79402
12176 79402 126970 97906 165781 167184 115063 47373 14148 -2179 -25787 -3603 -8721 -31965
12164 -31965 29192 64038 -8995 -26086 29457 58118 54724 87197 39994 -13391 14049 36958
12152 36958 20099 75822 100166 24469 20646 -39999 -74902 -81523 -52772 -7160 25039 13151
12140 13151 12392 30211 41805 68179 34007 3580 -6226 43137 85361 88303 152235 97477
12128 97477 63966 58730 57438 13195 -45359 -29186 24182 32620 45387 83510 52712 14555
12116 14555 -48684 -13436 2351 31258 56300 42320 86570 83809 73418 117520 139824 144346
12104 144346 107123 75219 92169 78215 70904 67713 71039 76350 68005 39047 19569 47841
12092 47841 31701 16589 68931 70155 32882 60408 56887 17558 23907 45677 33348 -8562
12080 -8562 22700 62390 66666 93626 125364 52828 10107 -24996 -29232 -22449 35856 47397
12068 47397 46355 26783 -12087 -21120 -8494 85895 186911 217874 225706 194168 117180 65195
12056 65195 60575 60939 -9616 -21591 -34976 -25693 -6419 20977 113746 102429 80602 102963
12044 102963 39639 7493 2650 29597 -19376 -35472 41394 122051 101121 87484 93195 118433
12032 118433 53628 24616 5092 63849 95025 69391 5807 -40368 -19701 -50413 -14796
12021 -14796 70223 36330 11094 -61130 -98855 -51710 25216 113700 104164 41695 72086 80309
12009 80309 50397 80568 114219 77219 -10051 -950 37533 19063 11396 72469 159623 197524
11997 197524 207570 187586 96856 28826 -12634 29287 17024 38247 123489 79304 63328
11986 63328 54883 36857 17886 -11138 21049 -32861 -31413 -6453 64778 83797 131760 81842
11974 81842 27628 35452 117744 153941 154423 111957 129883 100074 88164 80778 -11805 42743
11962 42743 46284 -3618 -48227 -62740 -99288 -72487 -49411 -59473 40592 86366 -2678 -2893
11950 -2893 41134 7218 26852 -36407 -57289 -40934 -41800 -63915 -53904 -21244 -1645 -60568
11938 -60568 -99006 -8895 2370 3192 10037 25581 4442 -1945 -2694 6656 3191 16833 28541
11925 28541 13158 29319 40474 35231 6841 -29374 -67500 27664 93808 77314 41555 -18101
11913 -18101 -43699 -35623 -66276 -6756 38687 35351 -36475 -56813 -19152 50074 12307 57
11901 57 -18328 25320 -21130 -36145 9088 72188 1004 -85292 -113698 -95622 -60052 -86948
11889 -86948 -55866 13519 16001 -26020 -1508 56915 27020 26792 -9335 30267 58552 -12408
11877 -12408 -54256 -55172 -39131 -63784 -68588 -105343 -116506 -83017 -6731 22052 79454 84545
11865 84545 19230 53281 42623 -6593 38320 18825 -39100 -31597 1934 70775 60341 38420
11853 38420 66167 41986 19022 -58083 -39567 -10646 -30214 11901 100622 126188 113385 44396
11841 44396 -7981 -63546 -10363 515 -20335 -26372 -25073 -42602 -17544 -15123 -22153 -62086
11829 -62086 -47365 -11686 -22533 -55731 -2614 -3658 -5487 -10876 -1101 -23845 9925 16274 -54414
11816 -54414 -60853 -13138 7776 44453 121747 72216 48740 44346 -13725 -55258 145 -6362
11804 -6362 -69493 -44359 -72483 -123216 -107737 -87165 -96342 -99313 -44603 -13597 17664 -42398
11792 -42398 -77444 -35673 -21461 -6294 4668 617 -61044 -54278 -38372 -6432 -12107 -11954 -2814
11779 -2814 -10574 -16839 -18938 -27192 -97387 -49084 -53967 -75830 -61616 -56142 -108683 -118057 -48659
11766 -48659 22024 84216 89187 51253 32617 -13756 -27579 -38416 -25505 25199 70563 73679
11754 73679 53059 73736 95151 73778 18437 -6817 41509 22193 68460 103874 115654 77377
11742 77377 41262 41574 71964 32615 4481 -36005 -28329 53862 47708 36428 41989 22252 -38839
11729 -38839 -85842 -92483 -70310 -86140 -85006 -89144 -50285 -22374 36070 29110 -3423 6341 -20630
11716 -20630 -17220 -26694 19841 7809 -4194 -52465 -57374 -46534 -18316 39611 78950 62544
11704 62544 49502 39154 20923 12921 21359 20250 -3974 9326 667 -7546 -6037 -64686 -147084
11691 -147084 -111937 -79680 31756 79294 108234 125302 54463 33931 17064 -10335 -59259
11680 -59259 -39583 -4662 15433 26844 2042 1950 -37825 -43074 -99388 -72341 -15555 29057
11668 29057 -4338 -37332 -65349 -104418 -73447 -21573 5527 47060 34630 -6747 -41232 -36450
11656 -36450 23629 31832 -18642 71219 91042 20190 -26970 -82253 -91347 -86173 -48512 -29307
11644 -29307 40442 53510 31305 -69046 -75912 -118068 -18121 25252 3529 -39972 -20321 -12126
11632 -12126 -17747 3107 85651 110325 111413 92895 68892 73853 4889 -24642 22741 45465
11620 45465 38937 17667 11686 -14150 -19317 -30818 -85247 -96409 -29985 23632 18999 57204
11608 57204 94401 84215 89335 -45194 -59507 -22313 84606 90664 62974 41972 15963 12479
11596 12479 -15837 -50498 -26163 3215 -974 14214 -23989 -42804 -15754 -59428 -70617 -10780
11584 -10780 65613 47929 357 -50602 -71629 -57360 -54990 -5018 -8599 -11342 35172 20430
11572 20430 -12878 -56014 -49958 13010 -24670 -47510 -5306 18180 25012 -38058 -27707 18837
11560 18837 -41745 -29512 -29490 20895 63624 8093 -74736 -66409 -32375 16661 3216 -28638
11548 -28638 43198 102523 76102 54901 53536 73585 102255 84213 96639 77005 67776 10341
11536 10341 -56468 -91463 -147599 -133534 -92503 -26148 32763 12833 -17854 -7238 -16166 -22928
11524 -22928 11425 58448 -17159 -15803 54377 56511 36745 75285 41113 62535 59931 79615
11512 79615 23113 29976 28069 22165 -2312 -86649 -166777 -118141 -115851 -20425 72786 74089 24239
11499 24239 69360 117783 106098 110003 26777 -14941 39098 25487 37742 30489 10230 3959
11487 3959 21618 51812 24161 -1767 -31495 -46800 -34159 -15458 -30017 -32480 -45152 -36567
11475 -36567 33987 67109 72662 35346 21072 12533 6663 -3284 -61501 -127719 -88255 5799
11463 5799 10668 60303 92723 99672 2913 -48236 -46379 7516 -67917 -133521 -133197 -79195 -55786
11450 -55786 2091 18646 18521 -52924 -75328 -37659 -24817 1914 64879 60329 66199 60487 34571
11437 34571 36950 74526 49865 22426 56178 65820 22864 1350 17297 5924 -32887 16152
11425 16152 45775 -8518 -51447 -41538 8480 7012 -29639 -73929 -54606 -6890 54383 86896
11413 86896 52767 14549 29297 10009 -2153 -45748 -66540 -51885 -47806 -4385 1130 -32608
11401 -32608 -76511 -62548 -6326 -11103 -52030 -68911 -6172 -4491 -38096 19523 46304 68302
11389 68302 57859 8579 -46097 -20017 50019 41034 27633 20762 -48938 -106937 -80799 -68203
11377 -68203 -44214 -32751 6887 38159 29349 6271 7587 -56770 -64452 -84788 -77926 -45005
11365 -45005 -17968 13901 32353 -6856 11948 -2861 38521 101027 91867 42779 4897 -6175
11353 -6175 4515 4945 -6659 3121 28798 64473 80116 89377 53419 -12399 -423 -61752 -70630
11340 -70630 -30946 18696 6771 -54132 -26673 31725 -15866 -16031 -10531 -21385 6464 101203
11328 101203 90593 82310 -17752 -2113 3219 24716 12744 -15717 -61341 -34521 20787 14054
11316 14054 25805 -3088 8804 28107 19013 70994 98713 93908 131334 154091 119757 106437
11304 106437 45550 12900 18549 45081 38647 72238 145704 206548 207883 68334 47060 4093
11292 4093 -57645 -55491 -23406 -41984 -23989 513 25691 38396 14218 12751 38313 32456
11280 32456 57514 126377 120957 32017 -16973 -69527 -102122 -97004 -105640 -100594 -37530 32594
11268 32594 63616 17170 33884 25316 -30087 -42506 42070 42634 -32761 -83285 -44697 12155
11256 12155 84177 48679 63138 25788 38391 72137 83339 14307 -56517 -129281 -67419 -52931
11244 -52931 -50125 27158 47486 34812 34438 -19095 -53638 -67916 -84488 -61566 -18096 197
11232 197 -28313 -115731 -92648 -68432 -57335 -49551 -64341 -10582 -5902 -20909 -44903 22920
11220 22920 40321 32304 4585 -13992 -34821 -70838 -119643 -119495 -84020 -49108 -28647 -49395
11208 -49395 -65056 -76857 -37363 -14747 -1819 -24859 -24663 -45434 -3614 -19886 7198 -2446
11196 -2446 1641 -53696 -22236 -12193 -35532 -15136 -23947 -98043 -144630 -149755 -131247 -100772
11184 -100772 -77233 -32970 -18000 21294 3090 41519 67764 70231 66924 16164 -12650 -74846
11172 -74846 -50422 -16325 -49075 -43343 -52695 -38774 -34432 -45360 -52006 -49872 -36415 -104826 -162644
11159 -162644 -139472 -124362 -70564 46747 101249 153170 168282 144877 100793 103814 58190
11148 58190 9298 36442 39580 -5542 -30627 -79266 -35639 16170 -10349 9315 10569 45837
11136 45837 60110 44026 48365 59471 89633 82062 40287 61208 59540 102681 87683 53863
11124 53863 52353 -19274 -20185 -8680 12432 43924 42628 30394 -36496 6880 45284 97052
11112 97052 51839 55535 63743 -22041 -42755 2024 22503 40430 30046 -3273 16979 -25778
11100 -25778 -80816 -87933 -60857 -26218 24813 43514 -32734 -43456 -50 55853 79651 24206
11088 24206 -24156 -113508 -169690 -142547 -79830 -108378 -148720 -97075 -54339 -36287 -10820 40547
11076 40547 30279 23139 -717 26111 67758 29373 48702 59986 25624 19985 20123 76473
11064 76473 95596 37676 -3528 -13684 -38932 -65882 -54989 -24531 -13817 -49323 -20022 -30509
11052 -30509 -60730 -35211 -11079 29966 73746 91489 82043 54558 -10677 -29723 -25267 71845
11040 71845 109421 66933 -34038 -28726 3485 37328 41468 26054 45891 63508 99191 79608
11028 79608 45952 12299 33111 67040 -2960 -21138 -6718 -42670 -48954 -58496 -96701 -64305
11016 -64305 -59521 -30787 -26849 -67958 -70408 -158041 -157274 -104911 -63402 -137058 -140850 -90677 -47079
11003 -47079 -47529 -48544 -28855 -25353 -19497 54005 1505 -55431 -83148 -101556 -56903 -16828 19465
10990 19465 5230 -14933 -50889 -83526 -31925 -43252 -27977 9777 -4693 35820 34533 8091
10978 8091 -31254 -64976 3191 -18951 -21540 -60414 -53915 -36376 -36337 -32721 -60644 -91683 -87315
10965 -87315 -127897 -55932 -3956 -47373 -51412 49101 54629 -34532 -3581 2933 -35800 -32839
10953 -32839 45135 33842 -4201 10050 25905 -27076 -44527 -83568 -107520 -118023 -169193 -175035
10941 -175035 -130221 -83493 14625 90740 132966 115335 104411 55628 59584 125210 120947 31676
10929 31676 46005 55089 87083 79430 31989 -7801 -7640 -28784 -22912 -15137 -61089 -8571 -51071
10916 -51071 -125549 -196369 -169881 -136190 -103810 -60744 -73884 -81134 -72325 -75813 -96638 -93614
10904 -93614 -28385 -343 -15937 -14475 -18095 -36522 21233 37387 11118 -30203 -72401 -158615
10892 -158615 -182861 -111389 -93275 -173324 -120935 -22235 35105 36916 32679 96123 71661 47267
10880 47267 105295 161319 84409 29535 35113 21495 57255 59090 39567 49496 11910 -32657
10868 -32657 12250 22680 2947 -3962 -14197 -56607 -91052 -129447 -59738 -35363 -23458 -7490
10856 -7490 -86524 -89164 -1978 -20660 -31402 1638 7879 16975 -13658 -14503 15044 21235 6276
10843 6276 31068 13475 -59424 -48374 -59237 -63537 -68389 -23118 -9428 -14880 5158 1009 -22396
10830 -22396 -90351 -109458 -127062 -86188 -14508 9791 11739 24605 -8218 30270 75151 55799
10818 55799 7973 -66580 -79126 -22163 19772 -17788 -1938 -5523 -55484 -27732 4546 58169
10806 58169 22692 7684 21175 52627 80977 65704 89425 115692 89384 23930 -25675 37946
10794 37946 76475 56750 54334 37131 29371 46174 25408 -18696 -7369 46142 86687 28441
10782 28441 -58176 -100016 -86139 -34609 -71691 -44178 12243 41309 -3562 -12815 -37391 -36465
10770 -36465 -19177 52510 63871 -33119 -62957 -31723 -52454 -45226 -111385 -97634 -82166 -81019
10758 -81019 32155 104976 60571 -2347 -11854 -11605 38420 52984 93414 24880 -40132 -51544
10746 -51544 -37621 17494 -55908 -90096 -84133 -2071 -10975 -40377 21355 85674 32120 11308
10734 11308 15547 -42711 -75512 -105940 -150801 -215102 -215974 -186787 -154875 -121479 -133091 -120396
10722 -120396 -60280 -45484 -73665 -78161 -76903 -86646 -33055 -2571 -7749 -45622 -72042 -62974
10710 -62974 -49992 -43443 -92771 -102518 -7049 21030 -24377 -85857 -103599 -41443 -62927 -23834
10698 -23834 -85428 -121315 -20661 14622 -69177 -66239 -33344 3902 43693 36651 -20781 -44753
10686 -44753 -63873 -88834 -49232 16723 45386 8093 27068 8437 -53307 -44777 -36188 -75954
10674 -75954 -31744 -2059 -12622 -83894 -49839 25513 5236 -82538 -75202 -64137 -109091 -112140
10662 -112140 -50045 -23114 -32858 28279 86638 47858 44256 76891 29330 -53013 -29182 -3523
10650 -3523 -2347 -46486 -29822 -1742 -32885 -9887 23891 37274 -39441 -58771 -56654 18676
10638 18676 5915 1326 21724 -88656 -121732 -73344 -130074 -161931 -213639 -157221 -62467 -45360
10626 -45360 -55652 -61310 -86641 -67468 -21269 -14947 14236 43849 15858 -6852 43437 80438
10614 80438 59613 1744 -43915 -125914 -184399 -120537 -17361 7725 3951 60832 109789 57148
10602 57148 63445 117317 51525 -30049 -68653 -123560 -90671 -52283 -55411 -91198 -84812 -32683
10590 -32683 14261 29485 -9850 -73046 -83584 -168461 -184057 -87789 -16013 -69478 -73991 -21113
10578 -21113 -13953 -18022 -73314 -29283 23178 -26809 -70276 -124790 -89580 -58149 -95367 -50709
10566 -50709 20247 43509 43124 22972 -2312 -6226 37239 45749 23590 59241 -18619 -73412
10554 -73412 -64309 -30246 -20851 -7912 56904 36576 -36872 -75904 -108377 -100451 -99346 -108875 -36209
10541 -36209 1492 -12756 -17563 47553 97392 135228 167454 78785 14059 -66328 -110803 -111163
10529 -111163 -71141 -80573 -36002 -35048 -78675 -45116 -71578 -107331 -126947 -71066 -18651 46281
10517 46281 99915 66524 52076 25812 43635 87499 71892 25304 12039 6932 23608 22792
10505 22792 -12928 -29041 -69181 -57927 -97483 -149120 -102691 -71054 -59039 -35965 -49063 -37152
10493 -37152 -61801 -59107 -43092 -11819 -27715 -26092 -37548 -57024 -75769 -60875 -10094 -25168
10481 -25168 -48079 -82285 -62535 -31896 -80228 -100957 -84555 -75426 -37919 -18116 -30175 -119138
10469 -119138 -117318 -54126 -43549 33700 44986 13409 -7329 34087 21770 -55545 -63377 -35465
10457 -35465 7622 24668 799 -53453 -60924 -31989 -46572 14270 20011 21498 8575 39467
10445 39467 35156 20667 34557 75707 47983 26751 -21891 -37784 26984 102166 85257 5771
10433 5771 -5503 80111 117296 52066 -4813 -19073 34596 49798 9520 -42560 -12848 7936
10421 7936 -100291 -142271 -168470 -151467 -120115 -90736 -85938 -42690 -11635 -6557 37037 36867
10409 36867 15279 41358 1779 -9295 -42762 -110961 -61327 -52788 -68408 -54218 -14396 -11025
10397 -11025 31267 21717 -26308 -43660 -1802 -24077 -66193 -62100 -83382 -53525 -37654 -21362
10385 -21362 -12983 8784 20412 -22153 1506 2578 -38376 -46085 -96880 -120213 -46518 -96274
10373 -96274 -70746 1392 36031 37396 35950 6827 33846 -23794 -116619 -92138 -45436 -93482
10361 -93482 -76933 -37921 -2515 -70140 -46180 -70789 -90138 -23302 14522 99493 171077 140571
10349 140571 116897 24636 -79957 -89605 -84149 -99367 -82427 -7810 9029 23004 -10984 -17850
10337 -17850 -71474 -81796 -49347 -6587 -64052 -110904 -39396 18874 97482 59967 25275 3955
10325 3955 109930 193791 256254 257679 323494 429546 483844 551924 570425 543421 586597 601807
10313 601807 594655 495451 388128 311055 200076 149823 160319 189617 202764 131358 92806
10302 92806 92993 132060 124215 75849 92412 108388 126582 95546 51397 10125 36721 -10895
10290 -10895 1612 53218 40127 -57671 -85781 -26042 55819 123701 67233 37361 -11134 16407
10278 16407 45479 -15027 952 6354 -8451 -51213 -26411 423 74675 50485 61069 69631
10266 69631 22315 17341 36788 72461 63291 1012 -14658 -35483 -4625 29426 -22192 -30357
10254 -30357 -51282 -54154 -49049 -59850 -64871 -51150 -15474 873 -29627 -26087 -50867 -49454 -54076
10241 -54076 -120077 -124539 -73867 -13668 3761 -28056 -52153 -57693 15554 73434 55610 -4723
10229 -4723 -19216 -7670 -27004 -24911 -4355 -10923 -20200 -21794 10146 52247 14727 43142 60646
10216 60646 60683 98366 17495 -77068 -44490 -30445 -112154 -106084 -91613 -99604 -68782 -45606 -65560
10203 -65560 -38841 -43462 -90815 -104448 -88423 -109353 -107137 -88067 -124344 -134075 -82680 -24886
10191 -24886 -16949 -49109 -38713 -28795 -90492 -109779 -98973 -89804 -70610 -65766 -4798 25008
10179 25008 38223 25666 -11466 8023 18650 8195 -53070 -50177 -37454 -38645 45563 92342
10167 92342 103904 101862 122136 111210 7111 -56574 -114491 -63197 15951 48304 28248 6868
10155 6868 19780 65260 -15386 -79938 -82647 -10608 15953 -31751 -53010 -38588 -9731 -12132
10143 -12132 -27547 -1448 14245 25501 8962 -43341 -79098 -111059 -146416 -67228 -6859 -41363
10131 -41363 -89580 -23464 3920 -103868 -95195 -40527 -66275 -72258 23284 56596 -2722 3045
10119 3045 60996 39274 79783 51416 62165 67844 62937 50514 53706 48900 -10545 29421 17699
10106 17699 30181 65289 24950 -12542 -32522 2270 -13140 -40952 -58985 -135114 -107727 -59469
10094 -59469 -51639 -40066 -41334 -65560 -42083 -6721 14552 -30824 4702 -32518 -47622 -82721
10082 -82721 -57980 -71002 -41906 -43159 -66693 -50661 -82685 -133117 -69154 -36953 -31792 -22935
10070 -22935 49383 79082 -38073 -94474 -62746 36916 30840 -903 -399 83722 127948 117551
10058 117551 90036 28597 -18267 -44345 -22751 23064 34708 13797 34476 10092 -26209
10047 -26209 -61672 -50128 -18785 19466 11721 -38192 -70371 -16154 -29244 -92069 -101799 -87438
10035 -87438 -98629 -141436 -162638 -118941 -53378 -49850 -28256 482 -3620 -17990 -6686 5571
10023 5571 -14401 -36021 -62429 -55530 -6660 -22049 -94855 -101019 -59826 -244 39029 64647
10011 64647 16180 -21250 38369 95365 48141 -36484 -58315 -10754 -38554 -85771 -55798 -48302
9999 -48302 -26144 3491 -12095 -27395 -12845 -16516 -76025 -82617 -66799 -2131 -26509 -119224
9987 -119224 -154414 -95546 -37172 -11056 -44637 -69428 -88401 -26261 38018 68610 40083 9049
9975 9049 3550 -28129 -25844 -42448 -26473 -24319 -9845 46927 96193 128462 95448 -2691 -55482
9962 -55482 -62873 -107730 -9393 39539 8492 -11498 -30925 -32754 -48497 -49759 -18550 -49830
9950 -49830 -128640 -178184 -84924 14376 120777 207029 148366 83347 50167 20864 -36747 -59540
9938 -59540 -40518 -8204 -3975 -12036 -3140 21227 5737 -11231 -44774 -42968 -57366 -79943 -77203
9925 -77203 -10225 34435 8943 812 -15836 -32738 -27899 -24870 -28422 -19999 -30304 -11679 -56439
9912 -56439 -3533 17712 39496 17149 40993 22024 12378 4515 -14064 -37039 -25198 -60889
9900 -60889 -61593 -72976 -14153 8211 18216 -1658 -23764 -33330 -3138 46519 25205 7151
9888 7151 15821 -44522 -85919 -75625 -8168 -15713 -59717 -87741 -43299 -428 -52536 -51893 -66049
9875 -66049 -74340 -96517 -91647 -99052 -133422 -148403 -57848 68139 72664 96758 82743 63346
9863 63346 40011 -79294 -101807 -35143 -18963 -20367 1997 -34779 -38756 -69942 -63710 -82537
9851 -82537 -27197 12104 -11546 -522 7768 -48204 -9931 75592 130076 67426 23424 -3998
9839 -3998 14042 56857 46367 1470 -10573 4868 -20208 -8751 10034 6557 18723 18932 -11807
9826 -11807 58707 12292 -11671 34310 87301 71368 89633 77966 -17520 -55650 -42828 -45399
9814 -45399 -100745 -75181 5824 7420 18026 -29564 -22955 -19844 46576 145781 137582 65778 48374
9801 48374 59544 72997 123835 111931 63307 456 -22091 -33063 -23529 -34466 -47522 -22580
9789 -22580 6668 41433 92885 95070 88708 102710 54004 19196 -52181 -77346 -87734 -56900
9777 -56900 12877 52587 35450 4554 -31842 -66216 -101176 -113347 -96378 -40520 -2800 -20656
9765 -20656 -19880 -18021 16905 4904 3268 37831 35004 62884 39417 -6849 27594 80891 82777
9752 82777 69550 49232 66860 77076 117459 102335 45464 70948 95020 60587 16131 554
9740 554 49752 82724 62816 47604 20687 16700 59109 45857 43407 43930 29091 -35447 -28568
9727 -28568 44419 28737 -45899 -102201 -116975 -62868 -15345 -60120 -51990 22171 8673 8689 -9985
9714 -9985 31094 48665 64657 33350 -9686 -40516 -24312 -18058 -2398 50930 145113 143822
9702 143822 75563 -6547 -20129 -18303 -8632 -15488 -4287 33025 34752 53637 75207 34426
9690 34426 -37050 -39827 -26441 -10716 -37994 -85918 -151589 -125645 -73425 -40412 -12017 23959
9678 23959 23484 -26682 42196 34454 35248 47277 72689 52833 11318 -40002 -47264 -30760 -37219
9665 -37219 -102329 -78398 -27319 -75597 -58844 23324 64297 101689 108936 76187 88258 93182
9653 93182 69868 92872 55296 26743 43029 66366 102931 74594 3059 -63596 -73118 -54314
9641 -54314 -137023 -173619 -165375 -107476 -48900 -34870 7552 32854 32642 -24823 7161 33364
9629 33364 34143 -22444 4022 43670 32573 24620 46849 51156 56004 81009 86206 66337 17317
9616 17317 21869 22293 1372 -35562 -47440 7222 45298 54943 30105 79729 73975 82349 56352
9603 56352 -5564 -60315 -70029 -44662 14513 82261 142869 135075 62300 17374 13829 35696
9591 35696 34914 -45587 -60379 -7887 4459 -63913 -39145 19411 -5341 -24381 -24765 2079 -9093
9578 -9093 -18487 34188 117793 70376 38235 34676 44478 43689 8522 -39715 -41658 -54645 -59095
9565 -59095 -31971 -68062 -25146 -42819 -144410 -179918 -166499 -116055 -95248 -48054 -73729 -62516
9553 -62516 -549 -27813 -25448 2140 -6314 -48554 -4940 5158 -2797 6162 1805 5766 -3458
9540 -3458 13778 36914 4223 -27412 -57820 -31691 11337 29597 24459 18187 16190 59120 -9102
9527 -9102 -42138 -13458 30905 -11269 -7297 -7963 -8041 -10782 -24067 39745 103244 139426 151546
9514 151546 114022 81389 51957 20986 25747 -12307 -24448 22508 34915 15341 11 31351
9502 31351 39741 41403 -43002 -27629 -16319 -20682 15941 95522 38366 -42274 -33346 -29297 -28187
9489 -28187 40943 67513 38065 3708 18318 49817 398 -24041 -8903 -946 27174 65307
9477 65307 50677 48313 66051 63474 90627 41151 20439 -52378 -38136 -5208 -43042 -86536
9465 -86536 -47800 6072 91406 138302 98552 96541 101610 103069 23415 12812 10771 -9972 -80630
9452 -80630 -113207 -53198 -16412 -20077 -57259 -32768 37896 -438 -62652 -124362 -124745 -70948
9440 -70948 15195 31931 58207 48197 26568 26306 55763 110703 140921 97506 5522 -41364
9428 -41364 -84023 -684 58539 -1496 -61215 -22398 12657 11030 53738 5234 -26246 -4466
9416 -4466 41308 74258 64236 51487 8900 23438 -22272 -28866 -15972 18975 109343 120962
9404 120962 105762 105224 91438 117421 106903 77425 42902 91110 133174 92280 64519 101129
9392 101129 69961 15402 63417 104529 68496 44413 41733 -14354 -23645 -68554 -39930 -26034
9380 -26034 1182 -25756 -66332 -54605 -25329 29944 96825 58085 76159 142760 142227 119028
9368 119028 173309 189284 149246 69126 6889 2847 6571 29605 31562 91011 105223 65392
9356 65392 24260 -10354 -12852 40578 62033 84495 73284 119151 145316 164356 126120 112139
9344 112139 137489 121204 91425 76941 78351 96410 146104 61325 -35947 -26925 -20931 65711
9332 65711 100019 56840 45113 41905 88686 165318 184908 141629 130310 99942 92633 124345
9320 124345 191107 178167 182124 210827 226912 235314 180790 187611 248375 258216 281876 345086
9308 345086 433144 408347 411300 445319 485024 439560 470754 524507 536066 527803 561567 628449
9296 628449 640002 668326 710584 823086 949274 1027879 1056351 1099877 1244204 1347166 1460480
9285 1460480 1521836 1662978 1803671 1932644 2129417 2394827 2647132 2953054 3259075 3597791
9275 3597791 3951173 4259420 4485201 4652814 4848676 4971244 5035032 4984568 4826861 4598571
9265 4598571 4414384 4219796 3981726 3765182 3561231 3365189 3148749 2900001 2721962 2497181
9255 2497181 2382987 2283641 2195015 2044116 1903741 1824581 1744060 1671836 1574045 1478633 1373564
9244 1373564 1378425 1374866 1323995 1256681 1144845 1104521 1062761 1090692 1059200 994043 920347 934917
9232 934917 891515 836149 867271 865811 811546 783305 742358 689806 717629 756294 762756 728330
9220 728330 697527 648017 606295 589760 565355 525306 466919 483717 502102 532786 510219 472317
9208 472317 482261 460725 522114 517942 496525 466297 437209 428208 443775 422930 411568 457324
9196 457324 411770 346681 323745 300817 292345 246931 291442 376802 386298 453279 472839 467801
9184 467801 472794 500223 480021 448099 394996 373842 388498 326196 267967 216542 202303 216633
9172 216633 195874 236604 261749 240353 203781 262513 344502 322168 262153 206245 198975 209775
9160 209775 215440 239815 253538 201099 155422 209724 254911 220507 187544 213327 190138 218104
9148 218104 182882 170464 203451 269761 269414 284606 266315 227938 232360 284252 229660 145317
9136 145317 139123 198509 239270 210957 180433 80529 49465 78572 104487 115562 152718 127332
9124 127332 86100 63984 44091 74969 65207 -622 -9999 851 68524 72989 100701 103822
9112 103822 49379 14344 74171 71399 93677 40729 -12268 38928 116745 126114 146078 184986
9100 184986 144285 83421 30316 26827 51350 71116 40604 45158 83250 81899 84202 114922
9088 114922 148475 82994 3019 10001 87737 132096 132240 74430 101379 124552 81667 42765
9076 42765 18460 23456 60533 145209 153719 112792 126246 105490 86160 61073 60097 75443 133765
9063 133765 141309 172449 93017 42480 20151 -18343 14206 17324 43821 23882 -18992 -23488
9051 -23488 52534 119218 63627 9706 2032 18310 55182 82681 71150 115075 136898 100789
9039 100789 54186 78308 69162 39944 -4888 13239 -878 -55815 -44618 71759 108991 81960
9027 81960 83437 105824 137071 96327 -12014 -7681 33922 98203 123457 109208 28167 46835
9015 46835 62570 21456 -10238 -49626 -57054 -22899 17640 3261 -47052 -84364 -70357 9442
9003 9442 76848 101239 128806 129499 133714 120368 115207 101722 86010 56441 58751 114342 138200
8990 138200 150315 136852 63456 23148 -14826 -22168 37360 81594 76229 91720 97435 50394
8978 50394 -3300 -12696 7309 54410 80480 120362 73744 13144 20074 13363 18353 28577 35042
8965 35042 16843 -57585 -39586 2536 7533 -23836 -20792 -15673 -36750 -4670 60296 98829
8953 98829 76161 58395 58433 95836 62765 2743 37421 23435 13473 -420 58396 19108 58181
8940 58181 67604 24556 49448 62324 37847 89809 32262 57167 77540 80135 70663 32076
8928 32076 -21889 -118283 -108399 -72903 -82733 -94569 -59757 -48769 -45063 7869 48467 82630
8916 82630 101409 104557 93028 75149 77862 68976 71778 54852 23290 18083 -5449 -59562 -69804
8903 -69804 -76775 -59226 -5737 21072 60853 79572 79085 80154 45699 25198 33900 84179 117706
8890 117706 121257 109631 66472 17858 -392 3456 2368 -3027 -6884 -1233 70737 56420 53799
8877 53799 62518 137776 108595 72724 66921 92299 89455 92308 149911 173898 176923 160398 142600
8864 142600 161892 155591 111681 75701 156747 196198 204442 188180 171047 144440 77508 48341
8852 48341 51180 75032 90933 97447 127089 136638 185392 324032 339049 405483 422407 497662
8840 497662 605670 727152 937681 1217737 1731965 2656569 4111173 6012802 8100378
8831 8100378 9657621 10106343 9138255 7300486 5323068 3726060 2787810 2321266 1948901
8822 1948901 1703489 1513828 1428942 1342221 1259227 1237522 1190752 1225762 1178019 1084871 1021569
8811 1021569 1037079 1066413 989917 951660 957893 977365 961817 923064 875629 890644 987598 1093919
8799 1093919 1233440 1342970 1514846 1676565 1777324 2062687 2451350 3135195 4306618
8790 4306618 6333374 9340290 13235488 17249215 19704428 19975669 17405978 13659264
8782 13659264 9814012 6971759 5334623 4386355 3723255 3319328 3114217 2927024 2672441
8773 2672441 2559267 2484903 2433138 2384279 2247250 2153589 2062696 1918928 1785303 1777426 1781125
8762 1781125 1620000 1508831 1525615 1515536 1530631 1514253 1470355 1423449 1458211 1526940 1578973
8751 1578973 1627195 1766618 1946398 2100087 2381351 2982606 4033881 5620389 7545403
8742 7545403 9362873 10406728 10251821 8843652 6940581 5169523 3867269 3101572 2622152
8733 2622152 2317354 2090705 1913168 1814643 1751370 1710364 1635777 1550967 1468928 1334566 1279513
8722 1279513 1227493 1231636 1184196 1106437 1060991 1101623 1052901 1037528 1007858 952021 921563 876777
8710 876777 851931 836310 875417 872453 858760 824140 814706 808681 811668 755614 671109 628103
8698 628103 673379 659288 570270 531234 474478 500838 579447 619642 570209 557411 533045 535296
8686 535296 529507 498702 531716 575396 525117 492720 494678 488921 470997 345273 285386 337056
8674 337056 341321 328140 334822 370955 336225 305721 326833 356962 360248 363997 395251 397409 369783
8661 369783 425919 461194 447692 445858 439157 433787 442451 436155 451935 500212 585471 706198
8649 706198 705924 624900 549559 520839 463536 410631 367607 343118 305764 286161 302022 288202
8637 288202 303163 265619 268618 285373 301061 310963 272869 211148 242701 245972 266311 263589
8625 263589 235749 196649 174274 204560 248665 290982 284990 255048 287473 256487 286786 355111
8613 355111 358247 334548 375453 411943 442884 536403 702046 866431 982632 973278 803852
8602 803852 630735 496181 453160 431211 376173 277436 271483 287825 318231 334464 311116
8591 311116 315658 304580 270581 266946 221912 199498 220223 255884 301065 239121 150657 136123
8579 136123 181641 255374 249773 159937 167385 209272 183065 157484 190778 202746 144852 103817
8567 103817 116151 123833 179796 270155 350811 388221 381536 373433 322595 315255 264834 199021
8555 199021 119948 146170 211715 246625 214155 173471 125509 48514 98139 142929 115862 75761
8543 75761 19376 -4220 -27828 -9895 1164 27690 76837 68578 18855 19077 97236 176909
8531 176909 181295 202937 91600 57191 45001 -1322 6372 -606 -50049 -25245 -17461 15452
8519 15452 23904 98075 164981 125297 30557 -28785 -47400 -29108 21203 54498 144842 191051
8507 191051 177053 99226 108319 92706 72739 47528 81326 113959 109073 68081 85482 100211
8495 100211 123383 114060 63809 134446 214944 197384 98821 -1514 -4596 47485 -22679 -41989
8483 -41989 45781 85350 63692 52042 69037 113939 112810 102438 87029 57269 44256 86629
8471 86629 145364 180074 143926 74852 44941 34368 -20632 -77325 -65411 9665 13774 40607
8459 40607 44017 35360 33281 48936 114818 125495 54761 84503 102842 114261 96514 88494 43011
8446 43011 -1182 -11606 25322 -23387 -32719 1844 31621 28837 7285 7869 1496 33319 22015
8433 22015 31778 38033 7555 -48688 -63048 -2289 40556 59164 87549 79863 81446 42676 -9050
8420 -9050 -34213 -59090 -53286 -55571 -19887 19921 4943 -31232 -55413 -39655 -6239 59500
8408 59500 9374 -14328 30639 -9461 -16741 -14172 -24195 -9283 -16272 -13044 -18476 -26019 -14896
8395 -14896 -1506 -32454 -25616 -56159 -114702 -137438 -136353 -115030 -112003 -121855 -57945 31386 70242
8382 70242 79354 89784 70840 42976 -4020 -46044 -22394 -38187 -27930 -17922 19849 16339
8370 16339 -13476 -46905 -109855 -87561 -77148 -61766 -6372 -28176 -39474 -119723 -104042 -33452
8358 -33452 -6404 19235 81788 30185 14352 3418 -10358 -23785 -56423 -78601 -60589 -40223
8346 -40223 -648 -20270 8925 56641 109134 95362 83904 81007 91771 127759 66264 1971
8334 1971 -21299 5196 288 49630 87121 128097 170843 138269 116620 69303 78153 104231
8322 104231 117230 81839 59239 49042 58262 36006 46148 53528 25504 -3011 -5956 -15949
8310 -15949 -17192 -64785 -44931 9240 10149 39933 13770 -97321 -135015 -153985 -127484 -38352
8298 -38352 -51543 -84352 -64583 -43598 -17185 -27338 -38552 -42476 -12125 -8657 -4475 -7827 35823
8285 35823 77813 33522 29208 102661 102512 59719 26581 49362 8943 1870 25812 63411 111459
8272 111459 134115 113419 120488 80924 54462 53191 43453 51069 14442 -8025 -37322 -12887
8260 -12887 -14621 21690 65360 71562 71961 75004 86689 37596 640 1087 1773 17132 30021 -7219
8246 -7219 -51343 -16599 -37464 -65470 -66576 -58508 -40145 18219 66203 24797 24602 52882 20186
8233 20186 -12329 -3378 12937 17787 18417 72274 73388 16218 -4446 -6711 -28985 -5928 -29102
8220 -29102 -62163 -42008 -75630 -78891 -85146 -11992 -26213 -137274 -142315 -86618 -69369 -16606
8208 -16606 -44513 -95130 -120007 -54260 33830 13703 -37472 -43077 -46538 -16796 -18181 -33167
8196 -33167 14340 21528 5887 -12103 -13711 -60032 -20625 2928 5096 -15504 -14161 53358 112258
8183 112258 106589 92637 76401 95763 39985 -12963 -679 45005 86345 130827 135362 87128
8171 87128 88187 98538 131848 108789 107286 97931 26191 -15972 -7159 -24184 3460 1962 -79284
8158 -79284 -92507 -75593 -50954 -49993 -46411 -72672 -70959 -23376 2776 -51086 -64551 -28249 -11510
8145 -11510 14963 -35984 8854 40480 -637 -18118 -3478 31610 25951 15553 -8663 -47461
8133 -47461 -21774 11183 26099 13440 19561 29248 90896 110535 125866 80087 1129 9855
8121 9855 -50652 -93770 -59388 652 34650 28561 27777 -12876 -68612 -67782 -69531 -71787 -42270
8108 -42270 -70282 -119662 -96479 30137 68334 -32087 -110284 -73253 -39909 -15480 -35460
8097 -35460 -3492 62897 177693 206183 174454 109506 49599 -2426 -1190 -7453 54434 58976
8085 58976 51015 34260 -22543 -1595 -1837 -9982 -817 -5742 -875 3823 16759 38083 -23215
8072 -23215 14324 111614 62916 2821 -20897 -20749 43558 17168 72797 84365 89908 95728 60310
8059 60310 91311 52360 -27998 12399 68096 92021 87617 85646 72878 46075 8971 27110
8047 27110 80979 85583 97175 70543 48711 58842 67256 15075 -47599 -56634 -23478 -24556 10829
8034 10829 42784 86222 52583 -17244 -55245 -69356 -65055 -46913 -89720 -51502 -40048 14684
8022 14684 69448 67948 22061 -21609 -6748 -47745 -64457 -70187 -73799 -50623 -41533 -26923 -20109
8009 -20109 -50511 -67198 -1648 19117 -4221 -38915 -65973 -6911 75423 29722 17477 14215
7997 14215 19306 8668 -14393 4486 56605 7039 -27456 -11963 -22122 -16766 -19644 44514
7985 44514 -3287 14209 80661 76918 72643 77111 111564 143229 91954 39420 21984 52392
7973 52392 21268 -1967 -73696 -34016 11254 31464 41935 119596 144586 108514 104634 66095
7961 66095 98108 120338 31160 24972 39187 54310 103900 143957 106144 40961 -20908 -31680
7949 -31680 -64231 -82581 -82228 -80889 -36596 4121 105532 98981 24475 27677 45067 78951 65479
7936 65479 56953 73341 58607 52565 37865 51611 35119 -18079 -67082 -40149 -39979 -28149 -5884
7923 -5884 38756 23663 64498 73487 83616 61774 12891 17991 5970 -32764 -32198 15060 29329
7910 29329 17456 45780 78849 93569 57891 39616 84032 152437 203694 169100 68040 108924
7898 108924 93039 54715 10359 -17985 -14237 31788 14616 1946 -26243 62794 46489 1380
7886 1380 45138 58773 44501 40373 -35038 12471 58583 49005 47406 54673 95944 101399 26031
7873 26031 19118 31080 21270 15459 54869 23944 51514 149208 195148 166828 103957 61235
7861 61235 84217 85581 71632 87488 56153 25471 15588 12013 -53903 -71268 -1885 45567
7849 45567 56436 1503 -29265 1915 -10386 -44907 -46552 11154 54770 73565 104723 100260
7837 100260 65075 -30446 -52411 -45444 -64726 -17139 -36564 -41510 -74362 -43890 -15395 36058
7825 36058 90247 81317 47105 -40375 -86277 -77494 -61623 -11588 -13283 43809 58598 -22300
7813 -22300 -93451 -41872 -23350 -50491 -53599 -70535 -144460 -147796 -156498 -165657 -139599 -102278 -51953
7800 -51953 -32465 -24649 -38594 -22663 47072 82870 62636 5599 61673 47177 56836 44119
7788 44119 40601 38018 86539 96974 82124 57423 46374 53897 10416 -40789 -37955 5000 69392
7775 69392 68942 68494 56656 63936 54140 41016 4522 13560 79407 52052 36821 27728 40144
7762 40144 31830 51602 80913 2103 -10729 -1734 -56006 -43264 13016 5524 52043 43986 13999
7749 13999 -24405 -83167 -52255 -9829 48653 48729 28497 4323 -64660 -100450 -78158 -10410
7737 -10410 40996 48995 52224 676 46599 101825 104162 35885 11986 25522 -51490 -52995 4188
7724 4188 346 3293 34670 39381 34049 51940 48747 5967 51911 29514 45972 28544 22012
7711 22012 -31827 -21509 -3200 -1382 6223 -16337 -15730 -10501 -41508 -20606 12049 88869 35660
7698 35660 -60764 -33174 11787 -4300 -21415 32134 -9612 -48566 -32946 -62400 -75042 -46091
7686 -46091 -3372 -2387 55598 47777 55414 19387 996 21894 78939 61958 56263 78501 36426
7673 36426 -24958 -54492 -51753 31620 77092 84575 117310 126079 67818 22889 4691 11146 -11142
7660 -11142 -79222 -52582 -7501 40401 56667 41186 9575 -29246 -39309 7119 6174 -56643
7648 -56643 -40010 687 24243 28576 44912 34768 20350 -8528 30364 90234 84694 78308
7636 78308 -19756 -5138 5297 -13646 -70378 -111772 -89469 -61680 -103043 -112280 -93692 -66011
7624 -66011 -36835 -86513 -60773 -17219 16587 61587 -17713 -52890 -41390 -4512 -26609 -64022
7612 -64022 -122323 -141136 -76021 -6229 -57327 -68624 -24752 -22842 -67012 -102455 -79993 -65348
7600 -65348 -69953 -102442 -38816 -8894 -31765 -62073 -63381 -26338 -59508 -21543 15111 36283
7588 36283 24232 32440 125145 172367 178080 195607 136953 62653 -13025 3869 40743 33577
7576 33577 -20476 -59935 -55963 -7456 -15880 -41048 10753 859 6195 -28853 -78792 -100214 -76273
7563 -76273 -11359 4159 67657 71237 49099 51439 -4872 -221 2392 -31730 -9334 24970 -11208
7550 -11208 -55062 -86394 -31843 -70187 -72084 -60841 -11410 22839 16739 -32023 -105302 -160147
7538 -160147 -150298 -118504 -63883 -12981 -74703 -72487 -113171 -115044 -113771 -43705 57887 50866
7526 50866 10397 44375 19931 10722 48485 6373 10742 40880 17319 -4408 43901 75444
7514 75444 71040 76657 35547 -11017 -49086 -15870 -5731 -7985 -2504 2447 -15548 -358 9038
7501 9038 -8950 -112293 -103907 -76161 -69145 -66351 -73851 -90922 -61790 -23384 17428 118 -28180
7488 -28180 -40720 1857 -871 -29032 -77711 -80266 -50148 -44120 144 72757 77250 1986 -105852
7475 -105852 -84926 -34903 -57134 -60743 -60482 -1502 -405 -20148 -10471 -6794 -70531 -42049 25398
7462 25398 22536 52662 111505 101903 35670 -35586 -59760 -11692 -40046 -7668 7801 10726
7450 10726 -20048 -55623 -50487 -19354 23201 86998 79406 85278 45829 -31533 -79615 -90944
7438 -90944 -77181 -20588 49955 76350 358 -47575 -6974 30227 47136 60196 79282 28897
7426 28897 12246 -27311 -46142 -76593 -128960 -139867 -54390 -8687 19015 58989 52846 51867
7414 51867 8256 16427 -628 -18666 -45555 21073 29246 -11401 -40040 -38947 -96242 -70736
7402 -70736 -23781 -77579 -135109 -70773 -72046 -54174 -39636 -2897 7671 42166 84546 67675
7390 67675 57732 51459 25789 -14551 11922 72200 53929 -4564 -67211 -73248 -36619 -23363
7378 -23363 -84439 -92986 -107058 -65377 -23249 -66776 -100929 -79052 -67329 -66578 -8094 -46756
7366 -46756 -126547 -159004 -130549 -148718 -157915 -115112 -89027 -6671 68716 149729 145576 111234
7354 111234 120992 101388 114086 95006 5705 -12247 -9007 -35817 -37222 -18018 -51585 -121813
7342 -121813 -96740 -72280 -76550 -47481 -96816 -167464 -133627 -36409 12785 42772 49038 -13331
7330 -13331 -66476 -39989 -32177 954 41901 49801 37005 24297 31173 9111 -317 22502 -12426
7317 -12426 -29196 19424 -3041 -26341 28589 17675 -10181 -19190 -48390 4267 49377 20655
7305 20655 -25561 -31225 -63303 -153582 -101496 -22504 47894 40540 -8226 -63143 -59309 -38100
7293 -38100 4134 -28168 -54805 -68029 -73960 -32467 -62946 -116441 -97912 -13984 -614 6424
7281 6424 -66235 -80740 -59063 -106279 -133695 -83905 -92763 -69788 -2723 10312 -71344 -24764
7269 -24764 53182 88422 85555 42687 69130 34212 53977 53897 36391 18530 36954 34804 20046
7256 20046 23453 58903 40040 27762 31943 68418 59002 100032 126155 82121 30817 -50404
7244 -50404 -54439 -49147 10634 51307 114163 92272 23047 -6224 33514 94439 85439 46893
7232 46893 7231 17434 38842 77725 23144 -87603 -150810 -125055 -80000 -30995 -18479 265
7220 265 78344 49316 -12203 -38901 5399 51858 9802 -39771 -71534 -41119 -30184 -63316
7208 -63316 -40567 -21547 -15289 20468 24235 -33399 -92481 -40224 798 3260 68090 43724
7196 43724 43294 48174 49988 14427 -20322 -29836 -8410 12183 15936 30766 64689 25174 30766
7183 30766 941 10413 19194 -11203 -31537 -32519 -16293 -15314 -37241 -55963 -26353 -89868 -31805
7170 -31805 13139 48020 121092 92941 -44571 -49172 -21984 -46569 -34624 -43998 -48577 -60143
7158 -60143 -42563 5034 6346 17024 67176 -11747 -115568 -81043 -75849 -85900 -35037 4599
7146 4599 7991 -24023 -27345 -11114 -46269 -82742 -34427 20283 35271 34542 6549 1955 -32476
7133 -32476 -88681 -104785 -105141 -53561 -15486 -81176 -112656 -110670 -93207 -59742 -76877 -44197
7121 -44197 25178 -18807 -11630 31950 26347 58695 45091 -32189 -36993 -70854 -66518 -24592 -22987
7108 -22987 -48736 -11700 36422 -23445 -99626 -107088 -20786 -10717 -37170 -69645 -54672 -39177
7096 -39177 -48344 -35745 -11397 22479 -30535 -33618 17934 11718 916 -54116 -102351 -114575
7084 -114575 -133873 -136328 -69875 -5212 -23291 -11488 -53390 -52036 33024 42558 52185 47750 33437
7071 33437 -43007 -58161 -60936 -55646 -58820 -13073 50507 34327 12672 -15635 -10108 21861 -25700
7058 -25700 -56614 -33256 20747 36833 32610 30210 18007 -10523 14698 192 -57978 -60481
7046 -60481 1992 1233 14030 -12937 -1932 9582 4606 -6469 -10561 -67168 -15904 53139 5094
7033 5094 -40901 -67484 -104040 -80817 -50335 -38942 -61540 -73895 -46471 7591 23856 25313
7021 25313 -1244 14238 32970 93380 74360 171 -39520 -54053 -93599 -71262 -44884 36275
7009 36275 114685 112455 127878 134912 120866 43489 29248 35040 8577 49005 91116 81138 61525
6996 61525 95439 60264 73221 51845 52866 122291 98985 66558 -10690 -1001 -10802 -32945
6984 -32945 6799 18709 31880 20451 -54957 -84993 -1978 58044 23450 -42301 -24469 -43162
6972 -43162 -68968 -40174 -38927 -81210 -106356 -78529 -44947 -64728 -71599 -22170 -4123 -54942
6960 -54942 -15682 -616 -23802 -26895 -47114 -61492 -50497 -56389 -85870 -59993 -99704 -70965
6948 -70965 -6780 -11177 -49339 -45628 -66983 -79138 -130551 -143224 -96419 -42536 -56657 -61514
6936 -61514 -68404 943 48176 20034 -17625 -53495 -108848 -96275 -837 26246 -10361 -65973
6924 -65973 -42401 -9840 -45250 -86304 -46638 -17870 -26076 -51288 -50950 -66150 2549 -3593 -52327
6911 -52327 -88519 -87716 -30713 -20548 -39440 -25861 -67453 -57849 -5990 34300 -12635 2374
6899 2374 -15653 -8877 19435 75585 94146 57670 -38033 -67529 -25087 5016 -61653 -52328
6887 -52328 -70437 -55790 -15111 36554 43549 128674 127750 97540 35547 -59983 28853 46351
6875 46351 -14739 -40159 -71433 -78162 -91008 -3697 58989 84874 20220 10689 -1668 -39338
6863 -39338 -30378 14830 129850 84860 2776 -28609 -38423 -33599 -18263 -16622 -50891 -6146
6851 -6146 28080 -9025 17094 43396 38426 41840 40521 19496 5117 -32616 -21464 8779 36121
6838 36121 49836 33816 54001 65835 4811 13302 33656 32549 14539 24988 38665 -32083
6826 -32083 -69538 -68346 -33409 -11507 -42229 -41785 -57244 -60244 -99273 -73206 -28260 -13885 26498
6813 26498 75553 24661 8923 -27512 -54349 -1180 41981 35466 -2782 -16504 -34560 -75294
6801 -75294 -119825 -100709 17344 10859 -24878 -18877 44913 32194 5057 49290 39136 17305
6789 17305 -88172 -104051 -98206 -62201 12282 94632 115475 97558 65499 4768 6488 -41286
6777 -41286 -58380 -101733 -10221 78792 101564 89180 57246 33929 44534 51100 72775 60458
6765 60458 10727 -2117 -83708 -62307 14828 40347 -185 -37229 -36998 2848 18129 10146
6753 10146 8577 13838 51758 50074 91425 71690 43816 33009 22445 60254 89000 95423 109245
6740 109245 90393 16459 49505 85599 75557 18273 -42476 7854 93748 53344 50258 57407
6728 57407 97047 51702 -21145 25049 54443 44510 38491 22420 6004 -45820 -101482 -99245
6716 -99245 -82745 -22274 -57340 -45736 -28622 3020 25567 46322 25685 -1176 -40338 -39946
6704 -39946 -59421 -72675 -72696 -25208 -30721 -36983 -65724 -61797 -34409 -30003 -63727 -69003 -59894 -30431
6690 -30431 -2841 -7277 -31642 37241 148696 114300 26118 29762 -22393 -49309 -173 -29852
6678 -29852 -100896 -62584 -63813 -117205 -120951 -55022 -11347 -29824 -26677 -9402 -26562 -6763
6666 -6763 -14996 -22781 -16227 2283 -33569 -100045 -159168 -78715 -54529 -109530 -112923 -53468 -29412
6653 -29412 -24777 45219 44294 42185 13839 -20988 8283 14734 55298 57690 55372 14163 -6496
6640 -6496 2557 -7462 -19565 -18251 -22880 -17780 -4811 35995 59545 104303 130897 94982 100900
6627 100900 62564 9573 -34960 -10135 -4988 35419 84049 54833 89045 83767 76340 23436
6615 23436 -61086 -75453 -53587 17854 57565 40222 43597 27804 21842 54296 27640 28545 1148
6602 1148 30361 52046 42387 37500 28051 32782 6064 -46983 -22903 -4186 -39160 -27167 22410
6589 22410 27436 -26251 -72319 -11775 33669 1280 -35626 -9288 21848 74942 63590 -11249
6577 -11249 -33524 -25518 -42113 -43515 -57115 -88845 -58929 -89456 -44431 13450 -36397 -67011
6565 -67011 -51833 -38593 303 2056 10773 -18021 -63310 -37685 56245 41005 39629 -5859
6553 -5859 27397 35103 18289 -3846 -65293 -64327 -23926 -16389 -56770 -125157 -42745 48289 43435
6540 43435 -14937 -18699 -28475 -91898 -126867 -75932 -13168 -79547 -68213 -26411 -23423 -27528 -6063
6527 -6063 -45975 -74337 -55637 -19260 31738 9339 -120609 -140139 -112726 -131956 -135087 -151716
6515 -151716 -111147 -89290 -78099 -62531 -23972 -28536 -44927 -82748 -54672 35068 34385 6430
6503 6430 -48680 -79406 -81147 -75806 -26554 -24374 -60382 -59045 -40621 -102718 -128317 -65857 83393
6490 83393 172664 80995 -52336 -77874 -34357 23257 -25041 -64592 -96083 -152330 -97386 -15616
6478 -15616 6945 -21414 -71427 -80666 -12639 14861 -28365 -40278 5502 -21429 -69226 -22495
6466 -22495 -23614 -27851 26511 -41576 -71236 179 70147 52229 -13381 -51288 -34663 -43954
6454 -43954 -36192 -33329 -4528 -31664 -56009 -27531 -27059 -47415 -79491 -137127 -61571 12305 -14253
6441 -14253 -28481 -28945 -6045 -2436 -25540 -59552 -27596 11782 20447 2098 -33219 -16833 -36409
6428 -36409 -39193 2072 -4033 -43410 -10051 60537 79118 -5735 7323 1851 -31092 -67735
6416 -67735 -54347 -43783 -20559 -36201 -34690 30181 24132 -40649 -40987 -23031 -67138 -85769 -70980
6403 -70980 -19548 34131 27680 73811 33899 -22069 -16712 -5070 23918 8905 -9135 4429
6391 4429 -10437 -8247 -57761 -54704 9496 1529 -62735 -62729 1392 -14351 3455 61689 28852
6378 28852 -15633 18191 20661 -13058 -101163 -160623 -142642 -88138 -59532 5041 -18609 -60218
6366 -60218 -27778 -7366 11326 30475 39270 27842 -38011 -128318 -84449 -34573 -122626 -201842
6354 -201842 -79909 -1935 28364 40969 -19232 -61140 -33538 -658 -14141 -19269 34067 58844
6342 58844 45995 -1334 24897 4967 11127 47265 33044 29254 68960 110115 81061 56148
6330 56148 35496 18648 -34798 -42799 -6391 -21423 -17311 -57313 -35554 -1637 14143 42518
6318 42518 49127 -24513 -66618 -14170 -11204 902 284 26121 21061 -16557 -63084 -1613 62810
6305 62810 -9054 -36401 24127 -26757 464 34431 41520 4889 -56721 -38581 31458 11515
6293 11515 -15797 -57196 -13913 13650 -17981 -41415 -31224 3345 16517 -28473 -16850 -29902
6281 -29902 -41931 43286 33012 7455 -39083 -62946 -45289 -81821 -47552 -39186 -39042 -26122
6269 -26122 -16305 -22087 -62166 -73480 -1653 -10017 -29029 -35033 13895 17411 -45605 -42692 4510
6256 4510 286 9641 46477 -1651 22802 35610 -8391 -83963 -81295 -101223 -110120 -84321 -30564
6243 -30564 -12528 -10329 -13050 155 22406 109314 120189 17671 -28617 -35838 -17262 -20340
6231 -20340 -37503 -32769 -24165 17266 15547 -25487 20526 28002 -7327 -92516 -90136 -96005 -137044
6218 -137044 -144851 -111405 -76443 -24291 -7856 24667 41360 31594 -37436 6764 15070 -6284
6206 -6284 -1467 -69345 -53103 -37912 -49030 -80695 -93803 -78317 6899 26695 26854 6103 -40026
6193 -40026 -44186 -10732 7388 13141 32811 15845 13658 56228 45713 65023 117750 87539
6181 87539 65705 21103 2236 -86451 -78653 -16981 -19910 -19079 -11649 -12223 -84022 -59091 11669
6168 11669 72106 26317 -8372 -5273 34598 81457 43717 71393 99530 -6887 -80716 6331
6156 6331 44599 -3797 -25744 -11712 10184 33966 75159 93806 50221 -19133 -14493 46733
6144 46733 -19320 -20401 -13315 -21220 -16803 16939 15816 39978 96677 119925 150618 125218 102455
6131 102455 104202 100991 17761 26078 70709 102852 80816 67356 39721 77729 63145 7149
6119 7149 -58677 -6858 23128 -41286 -50114 -28635 -36998 -45440 -2714 6499 -53221 -34232 -26030
6106 -26030 -28571 54605 82294 78843 40748 43357 16189 -278 -38558 -51960 -25712 -25550 -6071
6093 -6071 -8724 25190 28228 60205 16631 -57778 -9919 54902 66953 55735 63117 62796 60054
6080 60054 16767 8256 16973 -4693 -48259 15118 64004 64341 21633 -78846 -117752 -103460
6068 -103460 -138182 -105645 -40517 22893 26830 -51088 -87103 -66337 -82133 -98402 -95352 -39058
6056 -39058 -59308 -57434 -17773 1574 27760 30914 14953 -19457 -17068 -57507 -91797 -75775
6044 -75775 -42206 1412 5337 35092 54304 86954 73932 33161 12395 51385 122674 50689
6032 50689 13224 4753 -8006 -10194 28933 89312 19491 -29160 -73426 -25214 11899 21670
6020 21670 54934 24168 25229 -34129 -62392 -50273 -34556 16529 50439 292 -23772 -25538
6008 -25538 -15577 3772 56090 56298 16718 68365 142441 117120 66356 -37401 -55671 -51337
5996 -51337 -9038 36478 -39329 -136568 -140233 -92134 -73145 -95665 -128714 -131445 -151140 -131580
5984 -131580 -69980 -33990 -34043 -37989 -37046 -15975 318 -24870 -9551 -29192 -89354 -57772 -32597
5971 -32597 20988 57706 36494 3029 -53286 -81449 -28345 12987 22330 5198 -14693 -55210
5959 -55210 5306 109978 77330 55063 49833 37369 33547 -3332 -62255 -83098 -74586 -8632
5947 -8632 20918 -15600 -73034 -128588 -87526 -42552 -40868 -25417 -75450 -134257 -68036 -31558
5935 -31558 -13364 -21810 11408 -9079 -76613 -50427 -37941 -42030 -49419 -65209 13559 36963
5923 36963 11679 4354 24611 -12608 -89905 -1452 -14789 -106756 -120380 -77970 -34462 -21382
5911 -21382 5130 -26086 -62227 -45530 -14834 12067 80265 83782 29423 539 50142 11357
5899 11357 -63547 -79155 -51374 4414 57336 25778 13631 20826 40071 18132 32918 45121
5887 45121 56544 74858 40797 -27164 -40035 -64544 -34131 -27432 -14348 -14619 -53965 -64207
5875 -64207 -7725 -20674 -27895 -56163 -17205 42456 52914 26830 -16031 -98414 -73023 -31370
5863 -31370 -13681 -20308 -9581 26785 -19728 -26518 -37492 -49167 -62680 -58765 -105756 -86950
5851 -86950 -32017 -40090 -54051 -51623 -53307 25871 -426 -98859 -165483 -104775 -24544 24086
5839 24086 10834 26802 18049 79179 61960 -15708 -32045 -20999 37970 35360 83922 73768
5827 73768 -32099 -98311 -44661 -82584 -65189 -60698 -37597 -44878 -54680 -28900 -54788 -106163
5815 -106163 -117141 -74180 12376 68634 70503 49684 59794 39431 911 3681 -3145 25445
5803 25445 39261 -2046 -2462 -35056 -84095 -69147 19790 33814 82736 72124 -39141 -75320
5791 -75320 -92346 -79760 -18793 20937 -23168 -9226 -9710 -17975 28349 71752 94135 82301
5779 82301 65201 -25063 -41224 25403 24845 7541 3895 44959 49003 47620 42431 22456 -45971
5766 -45971 -74088 -49760 -41352 -17534 -26276 -51806 -58786 -86398 -68996 -38669 -29870 16638 143037
5753 143037 96268 70083 74364 47171 22041 893 -44816 -48777 -27780 -45837 -11409 -6283
5741 -6283 -56983 -47503 -9594 48043 25049 -24043 -47429 -32720 -10387 -13241 20141 -2519
5729 -2519 -7110 15827 -28456 524 45140 -28324 -26932 -4372 -18779 -64760 -72241 -80572 -116804
5716 -116804 -102634 -54307 -17679 2801 -19431 -20276 -3977 62240 105574 95076 108437 93552
5704 93552 91986 89981 33791 -89154 -110162 -38777 23073 62757 96026 117831 115277 80947
5692 80947 -15245 -55214 -89543 -75565 -47299 -25297 -16849 -34930 -60589 -35284 -33253 -87328
5680 -87328 -74857 -88735 -65293 -59670 -39664 -64303 -79156 -74075 -45928 -68055 -49662 -21145
5668 -21145 -23055 -71968 -89321 -37096 -7551 -12067 -68181 -75174 -68589 -72658 -149891 -139150 -120856
5655 -120856 -48117 -6893 -19707 -21327 -79911 -109606 -75662 -43756 -4825 -16542 -70649 -103804
5643 -103804 -28487 45761 -35589 -77099 -73759 -35616 -122 -36920 -38159 -52889 -12949 -9738
5631 -9738 -34807 -52879 -17129 -57857 -62840 4582 -10947 -61241 -65792 -5104 7952 -25576
5619 -25576 -62945 -25877 -9387 -7461 19887 55610 48627 38326 23929 14613 66481 59767 32302
5606 32302 17229 12080 16697 25665 5772 3490 20458 65353 91188 105656 100643 99132 53960
5593 53960 13824 9576 31318 81896 78338 -6284 -85724 -103369 -30408 15445 8074 -22871
5581 -22871 501 -8143 -63133 -10924 -10895 -18387 56840 100857 88752 35792 4774 -26092 -44670
5568 -44670 -18424 -5352 -4404 -50 -39350 -16536 -7805 -21614 25456 54189 48751 18903 -8842
5555 -8842 3877 37504 33932 78084 68015 41955 29277 24585 33569 42394 3325 4490 28985
5542 28985 85338 83056 76495 59593 50529 -23272 10486 63486 72409 23527 -23181 -108496 -122083
5529 -122083 -100156 -63072 -54116 -30068 -10554 41087 -6204 -4580 -25073 -29497 29992 11274
5517 11274 -30992 -53773 -22367 -2120 -33534 -22059 -11895 40953 59647 52915 -7449 -21054
5505 -21054 -33956 -28263 16092 2157 27642 117405 77598 -13770 -95928 -32710 -44864 -75130
5493 -75130 -2124 103287 69260 -6988 -33865 -37470 -42417 -57333 -75705 -73396 -60832 -69501
5481 -69501 -14239 61029 71883 47486 13455 7913 -2402 -5697 10147 68443 93862 71371
5469 71371 43780 32239 -9877 -56063 -60427 -34564 30591 74662 3258 -17918 59648 59689 97265
5456 97265 62242 31942 54105 40689 -23278 -35804 13137 22887 18057 19224 -69952 -105281
5444 -105281 -87143 -59150 -33381 21818 51011 34933 -13525 -38765 21305 41750 20499 17720
5432 17720 51665 68880 40110 34521 63475 96442 92434 40847 57083 40176 -39749 -7047
5420 -7047 -10944 17719 49654 61327 33481 17953 32248 28452 14291 22230 1381 3808 -125108
5407 -125108 -134230 -94336 -77097 -21222 -7948 -23827 -56727 -24481 -197 34870 28023 -44893
5395 -44893 -424 -6150 -3706 40473 72036 46677 70055 19061 -5298 45883 48959 -34655
5383 -34655 -67954 10468 24511 14103 35235 56517 29468 61508 65704 32229 -36097 -29973
5371 -29973 -7322 -34222 -92110 -24948 27107 -575 -14857 23402 -14399 -16228 -6090 7923
5359 7923 -28537 -65109 -34831 -30355 -89987 -129604 -105585 -51445 -33100 -80511 -99411 -127177
5347 -127177 -131897 -45864 -60229 -56992 -45812 -48382 -34433 -23914 -38604 -61877 -60841 -21787
5335 -21787 -1200 40039 39446 32626 23743 -25200 6321 50518 15119 34939 -242 12447 25437
5322 25437 -9739 -4761 12906 10666 -34999 -47729 -96201 -84043 -23965 15722 -26484 -32223
5310 -32223 -18042 -62422 -9960 86682 48115 -15792 -50522 -23253 22931 14574 51233 16657
5298 16657 -24849 -2604 -65457 -22236 1918 -71789 -118208 -48277 -12841 -15084 -35321 -34104
5286 -34104 31032 81303 2599 -50054 -24112 -21813 5792 -8478 -48413 -49995 -52714 -4465
5274 -4465 37263 61211 61480 51452 87687 36026 -12227 4211 39433 95455 59412 42146
5262 42146 57128 37947 21277 9013 -73387 -87056 -70682 -62821 -106333 -116227 -99271 -42851
5250 -42851 -28379 -118695 -130072 -97264 -91869 -69859 -51623 -16727 23141 -36252 -33265 -25897
5238 -25897 35257 33413 -937 -68288 -58414 -49785 -7041 32344 67654 73720 40221 16475 -10048
5225 -10048 22527 46455 38957 41426 59192 110538 116229 119352 97271 70799 83307 46273 43817
5212 43817 71651 29088 51591 37509 -52107 -33034 66939 71364 8775 -40261 -12209 28778
5200 28778 50445 4023 -43487 -51488 11238 9532 -10778 2686 -15917 -47709 -13100 4105
5188 4105 16626 11950 41639 54680 49599 76147 42766 -15339 -18522 -51797 -121995 -157981 -85923
5175 -85923 -76198 -100131 -149916 -76136 -16136 -45119 -43853 -43741 -42655 -95741 -147996 -73626 -35567
5162 -35567 -4271 -5895 -31116 -43526 -62351 -37721 -17285 -63204 -46535 -70717 -92621 -72155
5150 -72155 -48506 25331 25166 -52163 -43625 -43698 -31548 -24850 -54922 -119660 -140891 -112472 -30724
5137 -30724 26055 59515 87060 46679 -10466 -73338 -79202 -56638 -37049 2491 59685 -20406
5125 -20406 -94040 -104850 -101140 -50983 -35138 -5200 15408 28446 24246 87581 160244 160331 85540
5112 85540 36675 -24140 -44367 -46994 -65725 -61331 -101134 -104692 -79447 -72828 -52784 -64605 -34077
5099 -34077 39650 63168 66330 96252 95489 395 -92621 -81274 -62802 -52657 -23528 -33813
5087 -33813 -53779 -14959 17819 76706 62299 -4777 -52564 -7246 40072 4139 12465 14202
5075 14202 -18729 -2169 -35156 -25750 -33108 -13841 -26792 -16255 3112 -935 -8052 -89109 -156236
5062 -156236 -133602 -110708 -36278 -44101 -12447 15078 16848 17447 -6690 -17298 -29262 -42666
5050 -42666 -25336 -33837 7169 50200 34044 -15695 -104001 -43966 -39280 -79745 -104178 -54334
5038 -54334 33291 55900 73605 57581 9871 -81987 -123252 -111606 -63391 -65220 -69018 -53509
5026 -53509 -33357 -42180 -70807 -62002 -85120 -40843 -71638 -115167 -57541 -21336 -55044 -67745
5014 -67745 -55306 -35843 32047 54287 -4764 14619 32536 44964 57857 82843 136957 46443
5002 46443 27168 14749 25755 -8144 -52007 -62086 -17552 -17135 -63876 -58200 -38986 -28341
4990 -28341 16648 48362 43712 -4845 -17033 10451 14307 -10829 8515 30353 -8509 -10700
4978 -10700 295 28526 46440 -14103 -31585 -7385 81169 82282 -13240 150 26062 50702
4966 50702 37770 50159 43349 -60082 -68983 -75604 -79581 -118581 -82222 -39263 9649 -1954
4954 -1954 -17171 -16496 10520 -63955 -76057 -35987 -50962 -66035 -28991 -5193 15428 32986
4942 32986 78389 52659 28547 -7843 -59232 -45881 -58844 -54101 -6203 26347 39092 -75777
4930 -75777 -82369 19326 56862 55608 -13643 -17703 -30526 -87977 -93974 -79311 -63942 -25801
4918 -25801 38816 25620 -35764 -33706 -4946 26755 86765 103086 70304 23948 21285 -7888
4906 -7888 -29515 38125 40846 63031 36798 47668 -44325 -98780 -59552 29331 92721 122933
4894 122933 39343 65786 63370 95601 118729 96432 63083 19489 58432 19093 10124 16958
4882 16958 16312 66458 100938 107781 104556 51774 33990 21634 -14123 29168 27251 -8819 -35723
4869 -35723 -5542 8505 -3358 -41097 -67354 -51313 -7756 30319 25803 -24758 -95341 -88284
4857 -88284 -72841 -69208 -55661 -3510 -47091 -35837 -22106 -22715 31905 18530 3432 -9521
4845 -9521 -48043 -49911 -25759 -8539 6843 38619 23544 57905 91035 84938 149040 149012 109090
4832 109090 13702 -28164 -23003 -7400 -31346 -38954 -24390 -14714 -223 -6488 42204 58303
4820 58303 118443 57097 60272 38975 -28136 -31229 -43542 -7041 60597 42993 -65504 -120934
4808 -120934 -89514 -64654 -95270 -113923 -67168 -69104 -93481 -60411 16034 4250 -31640 -62169
4796 -62169 -71998 -58990 -128836 -116061 -38341 -17759 -28660 -55435 -78823 -117196 -162643 -117236
4784 -117236 -119838 -110633 -96586 -10305 77345 36839 30603 -50297 -128078 -44039 1208 -47905
4772 -47905 -71152 -49561 -58282 2113 3179 -38126 -17902 30788 13223 -17180 14292 30509
4760 30509 33417 16229 18545 -27748 -81581 -16620 72554 -18732 -31181 23278 -28855 -56933
4748 -56933 -28726 -13161 -78335 -143744 -202754 -144013 -29806 -6498 -29239 -69548 -87807 -94356
4736 -94356 -88355 -124216 -124254 -84386 -47265 -19118 -52981 -80539 -65299 -18613 -28844 53592 104152
4723 104152 59498 63569 130163 120522 33826 -57868 -51383 11070 22463 5639 39168 -277
4711 -277 -27231 -54912 -66026 -70020 -81004 -101864 -74677 -44574 -78201 -90985 -73648 3087
4699 3087 27639 58978 87405 117909 97754 36168 -32269 -94835 -68066 -37911 -13557 77856
4687 77856 82431 34193 15603 42179 33783 -2902 -4914 -44468 -48816 -75778 -12173 39826 67973
4674 67973 54413 80372 96030 64355 58851 74143 26384 -4204 -30876 -13317 19418 2613
4662 2613 -26424 5371 -14941 -23547 -58464 -60986 -34779 44442 16241 -40315 -50208 4100 27423
4649 27423 57205 23910 17751 65098 43056 -347 -63320 -98495 -57301 -78504 -84370 -26108
4637 -26108 -9553 25786 28654 -6820 -2444 59478 99908 128341 129821 112084 54319 44641 76010
4624 76010 65105 79747 94242 106367 97305 101730 66648 59361 67638 11609 -11604 8825 45498
4611 45498 71875 101323 49183 -6907 -48221 10873 -18521 -67671 -47802 -54717 -24502 21566
4599 21566 34432 23579 15018 10318 78294 61114 8824 51356 55957 2460 -52721 -26055
4587 -26055 -81690 -99207 -68901 -25770 -2182 -22188 41156 97444 116326 74266 36053 21673
4575 21673 27309 -68109 -126837 -74035 -17310 -30743 -52087 -1819 30927 95990 112058 88144
4563 88144 46943 2900 -34109 -53911 18966 11683 40312 36118 22805 -13674 -65480 -85352
4551 -85352 -69854 39 57485 12409 16165 49828 37038 15826 -18477 16047 13035 -10366
4539 -10366 -62658 -53961 20731 36011 53859 53803 -28216 -64382 -97824 -102539 -25032 16254 22437
4526 22437 68924 37852 -17964 -33374 -39246 -11487 -62816 -68668 -79032 -77639 -33789 -5930
4514 -5930 32951 34208 12173 3474 26596 28253 22038 13866 6793 46738 17060 -3616 9266
4501 9266 19685 9662 32105 36770 21293 42178 113385 84860 89446 41837 -71227 -47756
4489 -47756 10520 5197 -24952 13702 16372 5632 19302 51349 72745 116996 100248 73098
4477 73098 74041 86637 81015 49453 47510 48733 669 -37192 -96085 -110685 -21738 28635 4197
4464 4197 -42943 -7264 -5072 -35925 -18267 -40600 -108741 -55869 -51074 -41711 -4425 8014 7172
4451 7172 20154 18222 22417 -3734 -1114 6184 29842 9829 -93819 -58378 302 -28408 20234
4438 20234 104998 85488 35094 50182 43835 56359 83865 48118 58559 121775 135022 106117
4426 106117 84026 78098 85584 6555 -83031 -15484 -13417 -87886 -118134 -137158 -122830 -78520
4414 -78520 -31205 3866 34188 60900 48536 32154 70393 19545 -20396 3537 -29219 -40663
4402 -40663 -87798 -91990 -21870 -8662 -35902 -51776 -62937 -69027 -72601 -44922 -8086 28906
4390 28906 14436 16593 59818 61528 17105 -7573 -36938 -76632 -101036 -92767 -84800 -13403 84886
4377 84886 103003 32019 15188 82216 99397 67441 34887 29087 34874 -35546 -50440 431
4365 431 41254 74502 77165 32325 5152 14791 -57940 -64255 -52908 -21453 -42285 -49577 -38647
4352 -38647 -15349 -26610 -88250 -78629 -34350 -52055 -61289 -103662 -118254 -112433 -154728 -159964 -98272
4339 -98272 -46595 20983 -28930 -108604 -94035 -77873 -40011 -16157 -6088 -11707 14921 30781
4327 30781 23109 14284 52154 49262 32345 -11334 -9569 -32321 -23867 -124349 -163386 -105717 -134749
4314 -134749 -157497 -71079 -53015 -68826 -27544 -52402 -118825 -106120 -35224 -72047 -50065 -6592
4302 -6592 5465 2665 13131 84120 58461 63312 86459 105950 48217 21416 9828 -37509
4290 -37509 -73343 -90138 -75823 -47659 -1139 -83 5814 86056 94162 10454 -37718 -69128
4278 -69128 -80596 -58333 20063 87521 53225 32214 19970 4896 24533 75185 23907 -6845
4266 -6845 26319 31470 35465 7262 -69388 -52355 -32260 -24629 54850 125730 101101 24695 46490
4253 46490 11997 -40190 -45689 -38804 -34400 -4103 -10347 5332 72991 61348 -6347 -30798 -41762
4240 -41762 -50035 -32784 -35168 6933 -48455 -34376 26441 -3575 -48426 -49683 -39649 6984
4228 6984 -8198 -28341 -23236 -22000 -5549 -9506 -169 2420 8399 81966 96253 -1743 -38181
4215 -38181 -257 5665 21190 52517 48236 -36763 -77712 -21714 34693 77358 38637 9086
4203 9086 3862 5912 -8948 13322 12263 57986 64896 107272 101503 50996 11304 11142 40776
4190 40776 58699 141 -39392 -37098 -83977 -26282 -1718 -33612 12239 50810 27523 -27459
4178 -27459 -103930 -156765 -119167 -109887 -88439 -60505 -64810 -37725 -24057 1314 -24497 -2646
4166 -2646 -20703 -63334 -107506 -53488 -9930 -3642 -10141 -38261 -48785 -62587 -132845 -165935
4154 -165935 -130372 -95108 -27258 -36440 -104220 -79570 -18482 -66694 -99069 -79483 -72874 -99986
4142 -99986 -111358 -119023 -84851 -12780 -30200 -58363 -12743 -35236 -9708 -4304 62347 126929
4130 126929 43138 13544 13537 -34259 -25871 -35908 16518 2611 57725 12513 -12384 -16336 -44943
4117 -44943 -79346 -56310 -37019 4844 29831 10422 -70476 -3972 11686 -33806 -56090 -88869
4105 -88869 -50225 -18249 53505 12021 -35485 -8133 -501 37934 18870 34618 50254 -10187
4093 -10187 -63810 -60609 -11921 -2871 8396 -5298 6998 -22209 -1959 -34142 -93207 -146036
4081 -146036 -80979 -21787 13568 12705 51326 75208 72078 17250 45616 52127 59353 92983 96121
4068 96121 116934 97922 86104 149946 127894 68814 -18649 -19253 11749 21765 64162 46318
4056 46318 -12878 -15837 -13413 -13369 -18173 -13098 15832 110604 169365 121133 92719 65817 53734
4043 53734 70598 27731 -29812 -15066 -9785 -12223 -41878 -95444 -92748 -93439 -83547 -38986 22521
4030 22521 61746 4665 -7082 -47540 10898 128923 131692 82887 18905 24210 51704 -6180
4018 -6180 12341 41121 59575 23849 -9428 2628 78709 95124 45367 76044 67055 37863
4006 37863 -2714 -1657 -8319 36625 19081 -56707 -59612 -1120 39876 76782 143158 120641
3994 120641 72843 27083 -31007 -76940 -66293 -37594 -101898 -92020 -36494 -47416 -37198 -12924
3982 -12924 -35807 -44494 -34527 -8197 -21003 18991 -28201 -51972 -11768 11563 8605 -44888
3970 -44888 -45822 -34642 -40724 8342 -9132 -49269 -109851 -128781 -78243 -25000 -9070 -52756
3958 -52756 -5204 -15515 -79009 -31934 -13176 -24342 -4210 11473 31481 52642 -7745 -41701
3946 -41701 -52309 -47933 -51026 -76142 -107570 -72742 -59282 -114197 -148628 -140272 -40823 20205
3934 20205 52850 92409 112569 126881 67992 78117 134317 102995 39066 2249 32203 51160
3922 51160 97668 79474 56266 36838 30739 4733 9621 27024 125681 195149 85542 3771
3910 3771 -32863 1364 -34096 -40410 20851 103534 79295 41767 69071 103089 111290 71362
3898 71362 23226 -44853 -72490 -98357 -55063 -86336 -35716 41645 45018 70905 87564 47322
3886 47322 52477 51176 -13763 -38650 12776 34803 23736 -15449 -38340 9253 28313 -13902
3874 -13902 -11118 -24885 80875 76317 7873 -55501 -61906 -39919 -1118 61827 9283 -19628
3862 -19628 -23143 -11170 -11652 -49698 -68296 -31791 6383 11533 11467 -66962 -102158 -92201 -73884
3849 -73884 -60946 61153 177560 171167 104404 63033 79903 94258 80840 86149 84931 25612
3837 25612 19631 35729 17587 -27162 -22249 7195 6040 -36063 -62186 -119 104086 133684
3825 133684 115130 83565 92971 51625 46774 52693 68935 107954 123904 118366 121789 40787 -4328
3812 -4328 -3749 -35734 -39058 -3214 -8228 21218 58492 62552 50775 30990 12877 -5416 7946
3799 7946 8700 65414 147080 139859 141137 122402 29305 483 48176 97443 48897 -25536 -55063
3786 -55063 -50098 15212 33948 68828 70591 65070 43660 -16307 -19402 -9214 69592 102801 129052
3773 129052 92611 73811 99049 87276 91213 47065 39498 82621 84937 74628 115474 106531
3761 106531 116804 97055 68721 61585 -16999 -59205 -22059 -17025 -57182 -45637 -10336 56370
3749 56370 73639 54828 48439 -1103 -57912 -62394 -46216 -24745 -23886 -51922 -20678 -45137 -37665
3736 -37665 -42298 -45857 1203 48082 66975 14873 -72359 -61117 26404 28551 -3564 -68567
3724 -68567 -97050 -50467 -41669 -1102 46765 43698 -9056 16490 60544 105233 45538 7602
3712 7602 60718 105345 119962 52947 -14097 -1017 20420 8941 -38051 3422 5673 7743
3700 7743 15039 -61418 -54459 -32562 32159 112366 133136 116908 65292 46509 55592 -35611 -101322
3687 -101322 -111946 -97347 -25828 40612 78953 77206 36951 54835 104071 136174 122271 17893
3675 17893 -82785 -75486 -22945 45684 110866 126588 99451 83026 47051 -21629 -43999 -21528
3663 -21528 -44217 23393 25400 -19364 11557 33676 -39432 -9662 7796 15595 35223 59179
3651 59179 43927 36930 12084 -7158 19404 -9993 19809 56584 18019 -29581 -78632 1957
3639 1957 -2744 -21183 3951 29523 29879 11379 57683 4667 -10354 59077 128556 118315 75797
3626 75797 73394 29125 -16776 -21811 -61016 -27476 8216 13722 12448 30754 21518 85653 53218
3613 53218 -19628 33454 25698 4875 -23010 -41646 -18718 17750 -29298 -67757 -65192 4143
3601 4143 55827 29612 -2768 16537 52034 28475 19473 48958 19497 16673 -25443 -96021
3589 -96021 -60774 -12617 9325 -3937 -56488 -98919 -90949 -81838 -77842 -43422 66909 42727
$$ [...]
##END NTUPLES=NMR SPECTRUM
##END=
