##TITLE=Analysis number 319756
Compound Code cc 53716
Book Reference 458/134
Project Code adrs
Chemist Name stevem
##JCAMPDX= 6.0         $$ Bruker NMR JCAMP-DX V2.0
##DATA TYPE= NMR SPECTRUM
##DATA CLASS= NTUPLES
##ORIGIN= Bruker BioSpin GmbH
##OWNER= nmr
$$ XWIN-NMR		Version 3.5
$$ Thu May 25 13:45:25 2006 GMT Daylight Time (UT+1h)  MAYBRIDGE\nmr@NMR_250MHZ
##.OBSERVE FREQUENCY= 250.131544655141
##.OBSERVE NUCLEUS= ^1H
##.ACQUISITION MODE= SIMULTANEOUS (DQD)
##.ACQUISITION SCHEME= undefined
##.AVERAGES= 16
##.DIGITISER RES= 18
##SPECTROMETER/DATA SYSTEM= dpx250
##.PULSE SEQUENCE= zg30
##.SOLVENT NAME= CDCl3
##.SHIFT REFERENCE= (INTERNAL, CDCl3, 0, 16.522)
##AUDIT TRAIL= $$ (NUMBER, WHEN, WHO, WHERE, WHAT)
$$ ##TITLE= Audit trail, XWIN-NMR		Version 3.5
$$ ##JCAMPDX= 5.01
$$ ##ORIGIN= Bruker BioSpin GmbH
$$ ##OWNER= nmr
$$ C:\u/data/dgb/nmr/ADRS/5190/pdata/1/auditp.txt
$$ ##AUDIT TRAIL=  $$ (NUMBER, WHEN, WHO, WHERE, WHAT)
(   1,<2006-05-25 13:44:47.63 +100>,<MAYBRIDGE\nmr>,<NMR_250MHZ>,
      <created by zg, POWCHK disabled, PULCHK disabled
       configuration hash MD5:
       84 BC 41 DB A1 6E 1D 46 DA 25 12 A5 C1 ED C5 3A
       data hash MD5: 64K
       19 EA BA 56 87 0D 7B 36 20 81 44 6B 83 A2 E3 40>)
(   2,<2006-05-25 13:45:07.32 +100>,<MAYBRIDGE\nmr>,<NMR_250MHZ>,
      <Start of raw data processing
       ef LB = 0.3 FT_mod = 6 PKNL = 1 SI = 32K 
       data hash MD5: 32K
       07 86 97 7E BB FE DB F9 69 28 2C 51 ED 3D BD FC>)
(   3,<2006-05-25 13:45:11.52 +100>,<MAYBRIDGE\nmr>,<NMR_250MHZ>,
      <apk 
       data hash MD5: 32K
       4C BE B1 6A 46 C5 28 D7 29 26 90 31 7E CA 7A 1C>)
(   4,<2006-05-25 13:45:13.13 +100>,<MAYBRIDGE\nmr>,<NMR_250MHZ>,
      <abs ABSG = 5 
       data hash MD5: 32K
       CC 46 9B 13 6A 5E F9 48 5C EC 26 DA DA 30 81 53>)
$$ ##END=
$$ 
$$ hash MD5
$$ 9F AD 74 F9 5D F3 AD 9E DB 81 F1 08 CB 26 44 91
##$RELAX= 
##$RELAX= 
##$RELAX= 
##$RELAX= 
##$RELAX= 
##$RELAX= 
##$RELAX= 
$$ Bruker specific parameters
$$ --------------------------
##$DU= <C:\u>
##$EXPNO= 5190
##$NAME= <ADRS>
##$PROCNO= 1
##$TYPE= <nmr>
##$USER= <dgb>
##$AMP= (0..31)
100 100 100 100 100 100 100 100 100 100 100 100 100 100 100 100 100 100 
100 100 100 100 100 100 100 100 100 100 100 100 100 100 
##$AQSEQ= 0
##$AQ_mod= 3
##$AUNM= <au_zg>
##$AUTOPOS= <60 >
##$BF1= 250.13
##$BF2= 250.13
##$BF3= 250.13
##$BF4= 250.13
##$BF5= 500.13
##$BF6= 500.13
##$BF7= 500.13
##$BF8= 500.13
##$BYTORDA= 1
##$CFDGTYP= 0
##$CFRGTYP= 5
##$CHEMSTR= <none>
##$CNST= (0..31)
1 1 145 1 1 1 1 1 1 1 1 1 1 1 1 1 1 1 1 1 1 1 1 1 1 1 1 1 1 1 1 1 
##$CPDPRG= <>
##$CPDPRG1= <>
##$CPDPRG2= <>
##$CPDPRG3= <>
##$CPDPRG4= <mlev>
##$CPDPRG5= <mlev>
##$CPDPRG6= <mlev>
##$CPDPRG7= <mlev>
##$CPDPRG8= <mlev>
##$CPDPRGB= <>
##$CPDPRGT= <>
##$D= (0..31)
0 1 0 0 0 0 0 0 0 0.06 0 0 0 0 0 0 0.0002 0 0 0 0 0 0 0 0 0 0 0 0 0 0 
0 
##$DATE= 1148561085
##$DBL= (0..7)
120 120 120 120 120 120 120 120 
##$DBP= (0..7)
150 150 150 150 150 150 150 150 
##$DBP07= 0
##$DBPNAM0= <>
##$DBPNAM1= <>
$$ [...]
##$SUBNAM7= <"">
##$SUBNAM8= <"">
##$SUBNAM9= <"">
##$SW= 20.6930455092707
##$SWIBOX= (0..15)
0 0 3 0 0 0 0 0 0 0 0 0 0 0 0 0 
##$SW_h= 5175.983436853
##$TD= 65536
##$TD0= 1
##$TE= 295.16
##$TE2= 300
##$TE3= 300
##$TEG= 300
##$TL= (0..7)
0 120 120 120 120 120 120 120 
##$TP= (0..7)
150 150 150 150 150 150 150 150 
##$TP07= 0
##$TPNAME0= <>
##$TPNAME1= <>
##$TPNAME2= <>
##$TPNAME3= <>
##$TPNAME4= <>
##$TPNAME5= <>
##$TPNAME6= <>
##$TPNAME7= <>
##$TPOAL= (0..7)
0.5 0.5 0.5 0.5 0.5 0.5 0.5 0.5 
##$TPOFFS= (0..7)
0 0 0 0 0 0 0 0 
##$TUNHIN= 0
##$TUNHOUT= 0
##$TUNXOUT= 0
##$USERA1= <user>
##$USERA2= <user>
##$USERA3= <user>
##$USERA4= <user>
##$USERA5= <user>
##$V9= 5
##$VALIST= <valist>
##$VCLIST= <CCCCCCCCCCCCCCC>
##$VD= 0
##$VDLIST= <DDDDDDDDDDDDDDD>
##$VPLIST= <PPPPPPPPPPPPPPP>
##$VTLIST= <TTTTTTTTTTTTTTT>
##$WBST= 1024
##$WBSW= 4
##$XGAIN= (0..3)
0 0 0 0 
##$XL= 0
##$YL= 0
##$YMAX_a= 439351
##$YMIN_a= -506010
##$ZGOPTNS= <>
##$ZL1= 120
##$ZL2= 120
##$ZL3= 120
##$ZL4= 120
##$ABSF1= 16.522
##$ABSF2= -4.171173
##$ABSG= 5
##$ABSL= 3
##$ALPHA= 0
##$AQORDER= 0
##$ASSFAC= 0
##$ASSFACI= 0
##$ASSFACX= 0
##$ASSWID= 0
##$AUNMP= <proc_1d>
##$AZFE= 0.1
##$AZFW= 0.1
##$BCFW= 0
##$BC_mod= 0
##$BYTORDP= 0
##$COROFFS= 0
##$CY= 12.5
##$DATMOD= 1
##$DC= 0
##$DFILT= <>
##$DTYPP= 0
##$F1P= 14.0000005364418
##$F2P= -0.99999901652339
##$FCOR= 0.5
##$FTSIZE= 32768
##$FT_mod= 6
##$GAMMA= 0
##$GB= 0
##$INTBC= 1
##$INTSCL= 1
##$ISEN= 128
##$LB= 0.3
##$LEV0= 0
##$LPBIN= 0
##$MAXI= 10000
##$MC2= 0
##$MEAN= 0
##$ME_mod= 0
##$MI= 0
##$NCOEF= 0
##$NC_proc= -5
##$NLEV= 6
##$NOISF1= 0
##$NOISF2= 0
##$NSP= 0
##$NTH_PI= 0
##$NZP= 0
##$OFFSET= 16.522
##$PC= 1
##$PHC0= 174.9812
##$PHC1= 6.101202
##$PH_mod= 1
##$PKNL= yes
##$PPARMOD= 0
##$PSCAL= 4
##$PSIGN= 0
##$REVERSE= no
##$SF= 250.13
##$SI= 32768
##$SIGF1= 0
##$SIGF2= 0
##$SINO= 400
##$SIOLD= 32768
##$SREGLST= <1H.CDCl3>
##$SSB= 0
##$STSI= 32768
##$STSR= 0
##$SW_p= 5175.98343685301
##$SYMM= 0
##$S_DEV= 0
##$TDeff= 65536
##$TDoff= 0
##$TI= <Analysis number 999999
Compound Code 99
Book Reference 9
Project Code 9>
##$TILT= no
##$TM1= 0
##$TM2= 0
##$TOPLEV= 0
##$USERP1= <user>
##$USERP2= <user>
##$USERP3= <user>
##$USERP4= <user>
##$USERP5= <user>
##$WDW= 1
##$XDIM= 32768
##$YMAX_p= 417128236
##$YMIN_p= -616403
$$ End of Bruker specific parameters
$$ ---------------------------------
##NTUPLES= NMR SPECTRUM
##VAR_NAME=  FREQUENCY,     SPECTRUM/REAL,   SPECTRUM/IMAG
##SYMBOL=    X,             R,               I
##VAR_TYPE=  INDEPENDENT,   DEPENDENT,       DEPENDENT
##VAR_FORM=  AFFN,          ASDF,            ASDF
##VAR_DIM=   32768,         32768,           32768
##UNITS=     HZ,            ARBITRARY UNITS, ARBITRARY UNITS
##FACTOR=    0.157963299565203, 1,           1
##FIRST=     4132.6476996994, 0,             0
##LAST=      -1043.33573715361, 0,           0
##MIN=       -1043.33573715361, -616403,     0
##MAX=       4132.6476996994, 417128236,     0
$$ Real data points
##PAGE= N=1
##DATA TABLE= (X++(R..R)), XYDATA
$$ [...]
23846A85119k4122N2268n6159k5525j50915p3361M5088q665j18250J30317K21888
$$ 185119 160997 213265 157106 131581 -19334 -92695 -47607 -56272 -174522 -44205 177683
23835A77683k7902K1961j27039O9451J48348m8203j10064r1523O0194J54934p5923
$$ 177683 149781 171742 44703 114154 262502 214299 104235 12712 72906 227840 151917
23824A51917r7612p0203Q7598K585j04523k15173P6901J63061J34716J51466k05596
$$ 151917 54305 -15898 71700 74285 -30238 -245411 -168510 -5449 129267 280733 75137
23813G5137l563P7304L1766P5203o4706k9153K021K1169P3306k59555K1434o423
$$ 75137 71574 148878 180644 255847 191141 161988 164009 185178 258484 -1071 20363 13940
23801A3940o7514j75780o9628J21876j3489p1912O6979Q1297L3381j0601O8910
$$ 13940 -53574 -229354 -298982 -177106 -190595 -262507 -195528 -114231 -80850 -91451 -22541
23790b2541J7793L5244l7490q6395L0485J85551o3714J17145k00574n3961K4012
$$ -22541 -4748 30496 -6994 -93389 -62904 122647 58933 176078 -24496 -78457 -54445
23779e4445r926Q0848j85136M1780J84864J0706p918q7084j67024j9445K18098
$$ -54445 -64371 16477 -168659 -126879 57985 68691 60773 -26311 -193335 -212780 5318
23768E318M0339n1572K5095Q0375j08296o0838M685k3575j81747M6064Q8917J22256
$$ 5318 45657 -5915 19180 99555 -8741 -69579 -64894 -88469 -270216 -224152 -135235 -12979
23756a2979j27105r2028o2040J42444k4008j07920J06167M8179J26588j54509
$$ -12979 -140084 -232112 -294152 -151708 -175716 -283636 -177469 -129290 -2702 -157211
23746a57211j00464J17895J02162M9153j48646j5608N3826o4872m8715J60846
$$ -157211 -257675 -139780 -37618 11535 -137111 -152719 -98893 -163765 -212480 -51634
23736e1634J69871k9251k19787j99925N2061J67752O6482Q1060J23305n2063j80682
$$ -51634 118237 88986 -130801 -330726 -278665 -110913 -44431 36629 159934 107871 -72811
23725g2811j08352k6135J15312J44867K53629q3543k06434k7038J39993J12660
$$ -72811 -181163 -207298 -91986 52881 306510 222967 16533 -10505 129488 242148
23715B42148Q2997J52702j01405q0388k12004J01347O5186j78444n3476J7753
$$ 242148 325145 477847 376442 296054 84050 185397 250583 72139 18663 36416
23705C6416R0390Q7841j26364k06609j39787J45196R0209Q0326j4415Q2729r5032
$$ 36416 126806 214647 88283 -118326 -258113 -112917 -22708 57618 43203 125932 30900
23694C0900k5057P0776p4522o0611K0069N84k7434k3389p1020N9556P8503J60615
$$ 30900 5843 76619 2097 -58514 -38445 -37861 -65295 -88684 -159704 -100148 -21645 138970
23682A38970q5025k16464q8114L5552O2579L7637J80610L135j21813m2332M3746
$$ 138970 53945 -162519 -250633 -215081 -152502 -114865 65745 68880 -52933 -95265 -51519
23671e1519n37J10893m0015K2909q290r3483K9711P0154J63282k7679J20394M6220
$$ -51519 -52056 58837 18822 41731 33441 -60042 -30331 39823 203105 175426 295820 342040
23659C42040m6309j53531j72838o2833N6886J99197Q6844n2463j0667M7612N0117
$$ 342040 295731 142200 -30638 -93471 -36585 162612 249456 196993 186326 233938 284055
23648B84055o0253O2841J4236j52757p396q2180l5711R1730n0405j28032j01399
$$ 284055 223802 286643 300879 148122 140726 58546 22835 114565 64160 -63872 -165271
23637a65271n0867k4014M5711m602q2123P1655K07259o2259n0988j33162l5453
$$ -165271 -216138 -240152 -194441 -199043 -281166 -209511 -2252 -64511 -115499 -248661 -284114
23626b84114J61309r434k5810L9602o7972l1187p2617J63032Q3324J32835l531
$$ -284114 -122805 -132239 -158049 -118447 -186419 -217606 -290223 -127191 -43867 88968 85437
23615H5437p0610j32034l9036M8J85960R3550p3444j15865L9256Q5312L4197k14
$$ 85437 14827 -117207 -156243 -156195 29765 123315 49871 -65994 -26738 58574 92771 92557
23603I2557q3790q4357P2622M8183r0626m4857R0143m6437j04686J31224Q7400
$$ 92557 8767 -75590 -2968 45215 -45411 -90268 -125 -46562 -151248 -20024 67376
23592F7376N7048j6080j47363L4842o6038J285J16865K32247j9531j21108k6013
$$ 67376 124424 108344 -39019 -4177 -70215 -68930 47935 280182 260651 139543 113530
23581A13530J4421l3196L6410p9636j20210l4352J04666J3290q7049J368j10204
$$ 113530 127951 94755 131165 51529 -68681 -103033 1633 14923 -72126 -70758 -180962
23570a80962j04429q8834J12955L01757J68836j4361M0476o7521j94523P8858
$$ -180962 -285391 -374225 -261270 40487 209323 194962 235438 167917 -26606 52252
23560E2252l6264l1804j4884j39045J30599N432J27119M3351k3607q4450Q2639
$$ 52252 15988 -15816 -30700 -169745 -39146 -33714 93405 136756 113149 28699 111338
23549A11338N0251J49884m7295j59737k35422J05562J54774N2734j34031L5060
$$ 111338 161589 311473 264178 104441 -130981 -25419 129355 182089 48058 83118
23539H3118j25664q0022J04539P8923J280j10842M8764n9212r5045n525k4705
$$ 83118 -42546 -122568 -18029 60894 62174 -48668 96 -59116 -154161 -159686 -184391
23528a84391K27903N7241r9397j52861k20231M5400J66443J3494n102R9435p4670
$$ -184391 43512 100753 1356 -151505 -371736 -326336 -159893 -146399 -151501 -52066 -126736
23517a26736O9868M8540J45598K3004r9809j00292m7089Q6248K13439r621j42790
$$ -126736 -56868 -8328 137270 160274 60465 -39827 -86916 -668 212771 203150 60360
23506F0360k40510q7462J51490Q623M1901J43979o1529R862Q1994J23862j38001
$$ 60360 -180150 -267612 -116122 -107499 -65598 78381 16852 26714 108708 232570 94569
23495I4569j21023M86j25521l0938J15495N0174j5509R4899k9594j13588j28289
$$ 94569 -26454 -25968 -151489 -182427 -66932 -16758 -32267 62632 33038 -80550 -208839
23484b08839R0790p9056P9351j6874j00953J15088N2032m744J6275N2625m7051
$$ -208839 -118049 -197105 -117754 -134628 -235581 -120493 -68461 -73205 -56930 -4305 -51356
23473e1356O3211J78082l523k06398q8879J35287J57400M2451o7213n5857Q0378
$$ -51356 11855 189937 186414 -19984 -108863 26424 183824 226275 159062 103205 183583
23462A83583q6681M6893N8910M0474r3856l6479J02465P5531K3203j0035p1268
$$ 183583 96902 143795 202705 243179 149323 112844 215309 290840 314043 304008 232740
23451B32740j95661k67120j8363R4730O9046P169K1189J27048j36312p7994M527
$$ 232740 37079 -230041 -248404 -153674 -84628 -77459 -56270 70778 -65534 -143528 -139001
23440a39001K05250J03343j28034j6303m982P5483K58325k1870j78871q9162k9468
$$ -139001 66249 169592 41558 25255 20273 95756 354081 332211 153340 64178 34710
23429C4710K5982l7389J1463K2224J52116m5527k40692K5581O4151j52624j68364
$$ 34710 60692 23303 34766 56990 209106 163579 -77113 -51532 12619 -140005 -308369
23418c08369M760J06145j1750K7030N6639m8128O7256J59838N7096R7074K0481
$$ -308369 -303609 -197464 -209214 -182184 -125545 -173673 -106417 53421 110517 207591 228072
23407B28072k8392q4272l8796M2777J5556j11076j21781O7349N0392m7189p8826
$$ 228072 199680 115408 76612 119389 134945 23869 -97912 -30563 19829 -27360 -106186
23396a06186j06933j59290R976R4472r797J43854L31697P6249k24750k12605o7564
$$ -106186 -213119 -372409 -362433 -267961 -277758 -133904 197793 274042 49292 -163313 -230877
23385b30877j7552n0584M6470J28522O2843O9997j85322K83292J95669K05740
$$ -230877 -248429 -299013 -252543 -124021 -61178 8819 -176503 106789 302458 508198
23375E08198m2578m39215m4086N4748m5199J4937N6459n3224p4022l4871K3467
$$ 508198 465620 26405 -17681 37067 -8132 6805 63264 10040 -63982 -98853 -75386
23364g5386j641k6472j85186n1190J06227L454J16798J12004O4387k6515l77796
$$ -75386 -77027 -103499 -288685 -339875 -233648 -230194 -113396 -1392 62995 36480 -341316
23353c41316p8007k1396j3678J11745L1988J12390p042p7353J50230J02910o8362
$$ -341316 -419323 -440719 -454397 -342652 -310664 -198274 -205316 -282669 -132439 -29529 -97891
23342i7891j04J16882j1978k433N3521K323K5972K4873n8663J5271q7131o9259
$$ -97891 -97995 18887 6909 4476 57997 60320 86292 111165 52502 67773 -19358 -88617
23330h8617m5532J29543M9604M419j08463k0951q4563K8607K5006N2869l2256
$$ -88617 -134149 -4606 44998 49417 -59046 -79997 -164560 -135953 -110947 -58078 -90334
23319i0334J6303l8424j16331J66966J85568r8704j95856J0188J93429o5621K1709
$$ -90334 -74031 -112455 -228786 -61820 123748 25044 -170812 -160624 32805 -32816 -11107
23308a1107J05753p5740n4846M6912o7761k10405J59435J11924j05759n340J00372
$$ -11107 94646 18906 -35940 10972 -56789 -267194 -107759 4165 -101594 -106934 -6562
23297f562P4455m0156q1285j81429m7123n354j15518Q0417J00781Q3824j42323
$$ -6562 67893 27737 -53548 -234977 -282100 -287454 -402972 -322555 -221774 -137950 -280273
23286b80273r5357J52670L0868j2323K07700J23316q9508O0570r9004p1625j21328
$$ -280273 -375630 -222960 -192092 -204415 3285 126601 37093 97663 -1341 -72966 -194294
23275a94294o9762Q1603K7456M4479K33812j4021k04246l1127J0322L5253k09986
$$ -194294 -264056 -182453 -154997 -110518 123294 109273 -94973 -126100 -115778 -80525 -290511
23264b90511l782J98648O0099P7348O8667k02002l02402J23855J87496k142J17390
$$ -290511 -294293 -95645 -35546 41802 110469 -91533 -393935 -270080 -82584 -84726 32664
23253C2664M3828K8160p2176m2800J02925j88068j57542J10858J12385N5504l9195
$$ 32664 76492 104652 32476 -10324 92601 -95467 -253009 -142151 -29766 25738 -13457
23242a3457r7849p4403j23878R5583J09631J4188k04L4304N4755k5898Q0543j79534
$$ -13457 -111306 -185709 -309587 -214004 -104373 -90185 -90389 -56085 -1330 -27228 53315 -126219
23230a26219p4614K60164J03871J283J44403N1541n1300l74688j8782j06460l9674
$$ -126219 -200833 59331 163202 164485 308888 360429 309129 -65559 -84341 -190801 -230475
23219b30475n8231K7353K34443M483k9641r037k2429J87643K6911r3418m6890
$$ -230475 -288706 -261353 -26910 -22427 -52068 -61105 -83534 104109 131020 37602 -9288
23208i288J77988L0373p703k1723k12836j44911L189l1468o593o0236J67473O5407
$$ -9288 168700 199073 191370 169647 -43189 -188100 -184911 -216379 -222972 -283208 -115735 -50328
23196e0328P8895j56560k85707n7903J50240M34708J84962m0904j22516p9755
$$ -50328 28567 -127993 -413700 -471603 -321363 113345 298307 257403 134887 55132
23186E5132j25860o4482o5996p7988M0844q8004R0685P0771K15453K57061J33470
$$ 55132 -70728 -135210 -201206 -279194 -238350 -326354 -235669 -164898 50555 307616 441086
23175D41086q7995m1893j10980j10712n4880O5069j59201L6841O0060J07472j30548
$$ 441086 353091 311198 200218 89506 34626 99695 -59506 -22665 37395 144867 14319
23164A4319J18951J03211n6053k13674j14884j5998J3961N8765J29835n1118J1462
$$ 14319 133270 236481 180428 -33246 -148130 -164128 -150167 -91402 38433 -12685 -1223
23153a223J1473J0359l9941j01654K42581K98666r0683k0963m3135J04402K6661
$$ -1223 10250 20609 -19332 -120986 121595 420261 329578 308615 265480 369882 396543
23142C96543j68589m7017q408J35236R2035k33485o2193K5237J19190p2297j0552
$$ 396543 227954 180937 172529 307765 399800 166315 104122 129359 248549 176252 165700
23131A65700J14816j72018j96738J5593K01016J05073j04087k38081O5636J0404
$$ 165700 280516 108498 -88240 -72647 128369 233442 129355 -108726 -43090 -32686
23121c2686J13906L1643j21545k5680N1999R2788j14066m2607O2926j73572j07970
$$ -32686 81220 112863 -8682 -34362 17637 110425 -3641 -46248 16678 -156894 -264864
23110b64864L2251m6950J11853K39563O9058r6922o8848M1730o2214J0488K53871
$$ -264864 -232613 -279563 -167710 71853 140911 43989 -24859 16871 -45343 -34855 219016
23099B19016n3118J7798l0060M6965o0747M726n833r0739j73056L6510K21326
$$ 219016 165898 183696 153636 200601 139854 144580 138747 48008 -125048 -88538 132788
23088A32788J09038j77105j09629O019Q015j68358k26550L2793J98717R4139k9129
$$ 132788 241826 64721 -44908 -38889 -30874 -199232 -425782 -392989 -194272 -100133 -129262
23077a29262J09990J33875J70461m6813o8558j03980j46353j74738n8701J97394
$$ -129262 -19272 114603 285064 238251 169693 65713 -80640 -255378 -314079 -116685
23067a16685O373m666l8477j49804P8148J71941J1260j23839O4343q4159j26737
$$ -116685 -110312 -114978 -153455 -303259 -225111 -53170 -41910 -165749 -101406 -185565 -312302
23056c12302L6441K51422J31502P09M1686k24824L0557q1786p3014P5597J42905
$$ -312302 -275861 -24439 107063 107772 149458 -75366 -44809 -126595 -199609 -124012 18893
23045A8893J00042j21972j40048j20587J66349j7008J87001M3986K482J10728
$$ 18893 118935 -3037 -143085 -263672 -97323 -114331 72670 116656 119138 229866
23035B29866j15416j56404j7951l2778n8533j07565n7562p8768J09416K80501
$$ 229866 114450 -41954 -59905 -92683 -151216 -258781 -316343 -395111 -285695 -5194
23025e194J24661K6966k5537K8059j35265j59478q5932P9232M8769q6708k7513
$$ -5194 119467 146433 120896 148955 13690 -145788 -231720 -152488 -103719 -190427 -217940
23014b17940J80324R1958j48672j35110m2541K82452K23384N5004m7835o3155
$$ -217940 -37616 54342 -94330 -229440 -271981 10471 233855 288859 241024 177869
23004A77869N2727k6350j71486j03690q7176J20942j9290p9039n4024J1267K300
$$ 177869 230596 204246 32760 -70930 -158106 -37164 -56454 -135493 -189517 -178250 -175950
22993a75950l932R0403R7381j00412K5245J03607j268k17993l3382J62038k5045
$$ -175950 -179882 -89479 7902 -92510 -67265 36342 35074 -182919 -216301 -54263 -79308
22982g9308j97130r4657J88463N448q458O8702K193k6832J1731J99592K73871
$$ -79308 -276438 -371095 -182632 -177184 -185642 -116940 -114747 -141579 -129848 69744 343615
22971C43615N2720j00223j78451K7228j0135P3311j39792n9178p6238j37532N6263
$$ 343615 396335 296112 117661 144889 134754 208065 68273 9095 -67143 -204675 -148412
22960a48412O5929j20534J8411O563l2843k5504L0443p7529J66506r0990J35478
$$ -148412 -82483 -203017 -184606 -178043 -210886 -236390 -205947 -283476 -116970 -207960 -72482
22949g2482K33588J07821n5539k07894l4777r3781k58058J1645P6233M6529M4864
$$ -72482 161106 268927 213388 5494 -29283 -123064 -381122 -369477 -293244 -246715 -201851
22938b01851P7157P4017n72Q7601O6916J45823k4317k35684k52571p2826K804
$$ -201851 -124694 -50677 -51249 36352 103268 249091 224774 -10910 -263481 -336307 -333503
22927c33503J47911J33352k9093k8225j58505m2782J22188K64208J04479k37174
$$ -333503 -185592 -52240 -81333 -109558 -268063 -310845 -188657 75551 180030 -57144
22917e7144l3589K33596M9390l2625J28858k39860j53212j2226J71136R9326j9454
$$ -57144 -90733 142863 192253 159628 288486 48626 -104586 -116812 54324 153650 134196
22906A34196Q700L1602j55357p3330J09444q763l3881j22261j33024l7685K35737
$$ 134196 142896 174498 19141 -54189 55255 46492 12611 -109650 -242674 -280359 -44622
22895d4622n8136j31582n03L2556k3732P9010J02751N8480Q3352j26438m4998
$$ -44622 -102758 -234340 -234843 -202287 -226019 -147009 -44258 14222 97574 -28864 -73862
22884g3862J13576O8464p0201j34924Q2313j01775N9247J57432n8613q8108P9196
$$ -73862 39714 108178 37977 -96947 -14634 -116409 -57162 100270 41657 -46451 32745
22873C2745J50159J01589j03398j23098k6860M2788k20674r123J18363Q3624o039
$$ 32745 182904 284493 181095 57997 31137 73925 -146749 -155872 -37509 46115 40076
22862D0076R6400j43191k5348p1067o593j7092j42857J69062K00139k38607r4815
$$ 40076 136476 -6715 -32063 -103130 -109723 -126815 -269672 -100610 99529 -139078 -233893
22851b33893J14412m226p1696J31435k8825q6128J3157R8639j9662j11013l7927
$$ -233893 -119481 -123707 -195403 -63968 -92793 -178921 -165764 -67125 -86787 -197800 -235727
22840b35727J42198K9933Q5883J08682L9265P903n9630m6757j16973m9408J43597
$$ -235727 -93529 -63596 22287 130969 170234 178137 118507 71750 -45223 -94631 48966
22829D8966P1511J25690P1326j82146j12375l7995k08303P8405J42215K21874
$$ 48966 120477 246167 317493 135347 22972 -15023 -223326 -144921 -2706 219168
22819B19168J0777J0868L052N6219J7451J1302o5747n3533p8608j9130j21506
$$ 219168 229945 240813 243865 300084 317535 328837 263090 209557 130949 111819 -9687
22808i687N055J86556N1801q5629j40320J44463q893k0394P9142R9579j02188
$$ -9687 -4632 181924 233725 148096 7776 152239 143346 122952 202094 301673 199485
22797A99485j19562q0624j37112J87807q8335l4426J32267Q5152o5261j33042
$$ 199485 79923 -701 -137813 49994 -38341 -72767 59500 144652 79391 -53651
22787e3651J7832O9751j2863J6810M6350J23786j16186j9876P6934k53451k15184
$$ -53651 -35819 33932 21069 37879 84229 208015 91829 71953 148887 -104564 -319748
22776c19748J7317J11856o4489J38858J94058Q1096K7487j01860J00688J7243
$$ -319748 -302431 -190575 -255064 -116206 77852 158948 186435 84575 185263 202506
22766B02506P1948j48066j53615p3345j51613J54007J27901M7106m808k12484
$$ 202506 274454 126388 -27227 -100572 -252185 -98178 29723 76829 72021 -140463
22756a40463r6781J87104O5202N748J3121m8906K0221L5036M7454J299K1875o8859
$$ -140463 -237244 -50140 15062 20810 33931 -14975 5246 40282 87736 89035 110910 42051
22744D2051l4514o5167J27301J55291j78825j1599R8008R1408m1337l1857j47474
$$ 42051 7537 -57630 69671 224962 46137 34538 132546 223954 182617 150760 3286
22733C286j99571k2379J67587M1625l3881J61N4247j44764k5797J18753O3831
$$ 3286 -196285 -218664 -51077 -9452 -43333 -43172 11075 -133689 -159486 -40733 23098
22722B3098j15060p1766K16586J25692J50046J422j90849k27218R8225n759J06336
$$ 23098 -91962 -163728 52858 178550 328596 330018 139169 -88049 10176 4417 110753
22711A10753o0215m9052N3693J3718o2416N2921K4142n9692l9047l4856J5766
$$ 110753 50538 1486 55179 68897 6481 59402 83544 23852 -15195 -50051 -34285
22700c4285l9062j3609q1040M7864m1092o7428l8190n8656P4589P8296m942L9572
$$ -34285 -73347 -86956 -167996 -120132 -161224 -228652 -266842 -325498 -250909 -172613 -177555 -137983
22688a37983L0865P7082p8660J34851l7250M4537L5858m7003m5755j7235j57742
$$ -137983 -107118 -30036 -108696 26155 -11095 33442 69300 22297 -23458 -40693 -198435
22677a98435M9968R6583M0499J26667q5323k34416J4885P4386K44829R1286k02231
$$ -198435 -148467 -51884 -11385 115282 29959 -204457 -189572 -115186 129643 220929 18698
22666A8698j61673J36835J38837J4997K3607m1120q5824r6071l6676K3526j59773
$$ 18698 -142975 -6140 132697 147694 171301 130181 44357 -51714 -88390 -64864 -224637
22655b24637p5567m1485j19732l3577L39744K55731j2565k49904r5293r7155Q1478
$$ -224637 -300204 -341689 -461421 -494998 -155254 100477 87912 -161992 -257285 -354440 -272962
22644b72962J19904k7996p5777j21366J19357J23329l8507J59394j80366k3531
$$ -272962 -153058 -181054 -256831 -378197 -258840 -135511 -174018 -14624 -194990 -218521
22634b18521P9503J32536n6289j29192P0960r161j0120K67475J17904j30726q8188
$$ -218521 -139018 -6482 -62771 -191963 -121003 -130164 -140284 127191 245095 114369 26181
22623B6181L5214N5603J34890j03367l0674N3327o6076j31437j12574K22638J21063
$$ 26181 61395 116998 251888 148521 117847 171174 105098 -26339 -138913 83725 204788
22612B04788m3424j001k0869K4167k61267p9250N5850k48270j20064J00431K53723
$$ 204788 161364 160363 139494 163661 -97606 -176856 -121006 -369276 -489340 -388909 -135186
22601a35186O3649p1885j8509r7330j37810O0895J17098O9940L2310m7196n126
$$ -135186 -71537 -143422 -161931 -259261 -397071 -336176 -219078 -149138 -116828 -164024 -169150
22590a69150K9916J1115J71061j21485l1060M2437J91000N3109m5469r1201k6247
$$ -169150 -139234 -128119 42942 -78543 -109603 -67166 123834 176943 131474 40273 14026
22579A4026q3363k6247J54115p8324P4701k8036p9602O1447j9359J66468k076
$$ 14026 -69337 -95584 58531 -19793 54908 26872 -52730 8717 -10642 155826 153750
22568A53750R8359q6616r1376o5674M104L088j12424J53725Q8278J9608m4201
$$ 153750 252109 165493 74117 8443 12547 15635 -96789 56936 145214 164822 120621
22557A20621j285J3695l6862j56077K9332K23983M630j55073j28261j20059M4018
$$ 120621 119336 133031 96169 -59908 -30576 193407 198037 42964 -85297 -205356 -161338
22546a61338J12025o4597L4408p0090j48168R1453J17564L1429M3086j5163j08033
$$ -161338 -49313 -113910 -79502 -149592 -297760 -206307 -88743 -57314 -14228 -29391 -137424
22535a37424J37612M2604J20149J15305j35399m5978j03209R8031K03k2116Q5528
$$ -137424 188 42792 162941 278246 142847 96869 -6340 91691 91894 69778 155306
22524A55306N1991J5913j72774l35309l600J57674O0648o4230M1242L6625k0221
$$ 155306 207297 223210 50436 -284873 -288473 -130799 -70151 -134381 -93139 -56514 -76735
22513g6735m3474P7950J79348k3308l4308q2106O9180k5410j38998K5247N0997
$$ -76735 -120209 -42259 137089 113781 79473 -2633 66547 41137 -97861 -72614 -21617
22502b1617J7633J77100k063l0979Q5476j9185j31806k87908j29563L10604J65321
$$ -21617 -3984 173116 171053 140074 225550 206365 74559 -213349 -342912 -32308 133013
22491A33013o1252p2132j04010r1311M5395q2212R9982r9478k5026k9475K32652
$$ 133013 71761 -371 -104381 -195692 -150297 -232509 -132527 -232005 -257031 -286506 -53854
22480e3854J17941L3845j44521M1753l0412k06383j13210J32671J25140J92135
$$ -53854 64087 97932 -46589 -4836 -35248 -241631 -354841 -222170 -97030 95105
22470I5105K6947p5392k0783o1924L142Q0846m7762l129J963J57077p0083J1713
$$ 95105 122052 46660 25877 -36047 -32905 47941 179 -2950 -987 156090 86007 97720
22458I7720N6114Q8724r5130j04824r9676l4087J5204L4931J16905o0622J34362
$$ 97720 153834 242558 147428 42604 -57072 -91159 -75955 -41024 75881 15259 149621
22447A49621k6015j06151k02264N2457J14688O3490j71723j70290L9189r9710
$$ 149621 123606 17455 -184809 -132352 -17664 45826 -125897 -296187 -256998 -356708
22437c56708j37428J10064L3193N0837M383J4319J53426k9425M9167N5023m1673
$$ -356708 -494136 -384072 -350879 -300042 -295659 -281340 -127914 -157339 -108172 -53149 -94822
22426i4822p6669M577R3413o5500R1177J50243L8905L7957M1920j41813M934J33451
$$ -94822 -171491 -166914 -73501 -139001 -47824 102419 141324 179281 221201 79388 84322 217773
22414B17773O7145l70160k89114O7022J02370p0158m9402o9887J3373J2617M3333
$$ 217773 284918 -85242 -374356 -307334 -204964 -275122 -324524 -394411 -381038 -368421 -325088
22403c25088j82650J67549J77933q97p7387k38423n015R7240J55224q9696j53521
$$ -325088 -507738 -340189 -162256 -163153 -240540 -478963 -483978 -386738 -231514 -321210 -474731
22392d74731L6019K9250J80469J98776J3379M2727J08230r6725n4209j42141j0896
$$ -474731 -438712 -409462 -228993 -30217 -16838 25889 134119 37394 -16815 -158956 -169852
22381a69852J03227K6934L1084R5984R7745j32831k30696L0004o9326M4306r1229
$$ -169852 -66625 -39691 -8607 87377 185122 52291 -178405 -148401 -217727 -173421 -264650
22370b64650L6585K34242q2572r709P1203j59589L4117k2080L12367K83522j71995
$$ -264650 -228065 6177 -76395 -86104 -14901 -174490 -140373 -162453 149914 433436 261441
22359B61441k6864q1518J17887M974N0791O9349k8133k28399j4316m7097j82485
$$ 261441 234577 153059 270946 275920 326711 396060 367927 139528 125212 78115 -104370
22348a04370j8496M4026K5927J51760R1754n4405k7905k2309k07457M8479P5757
$$ -104370 -122866 -78840 -52913 98847 190601 136196 108291 85982 -121475 -72996 2761
22337B761l6396m9196j53344m0742J05832J44173j52490p9154J6872J87364L4375
$$ 2761 -33635 -82831 -236175 -276917 -171085 -26912 -179402 -258556 -241684 -54320 -19945
22326a9945J49187m9717r0693j53698q6022J9987l498P4149J56921J33243r0939
$$ -19945 129242 79525 -11168 -164866 -250888 -230901 -234399 -160250 -3329 129914 38975
22315C8975K9585M3177L9375N8065j08819p3196k3890p1054q5901m577J0520P0687
$$ 38975 68560 111737 151112 209177 100358 27162 3272 -67782 -153683 -158260 -147740 -77053
22303g7053p5659j22719K1495K24560k0999L3390r0986O1918P0990J98036o9691
$$ -77053 -152712 -275431 -253936 -29376 -50375 -16985 -107971 -46053 24937 222973 153282
22292A53282j2994J11763J1676q4296k53675p3964J62620p1748j02198K10599
$$ 153282 140288 252051 263727 179431 -74244 -148208 14412 -57336 -159534 51065
22282E1065L2286j14514M3999J35229L2872J91516j86447k29444j17463J42224
$$ 51065 83351 -31163 12836 148065 180937 372453 186006 -43438 -160901 -18677
22272a8677K16396Q4937k685P3822l6205L210L9918n5187N9583j58552k19293
$$ -18677 197719 282656 279971 353793 317588 320798 360716 305529 365112 206560 -12733
22261a2733j93256q7802L6451J23135R9421l6060J60773J38724j24915P6939J37779
$$ -12733 -205989 -293791 -257340 -134205 -34784 -70844 89929 228653 103738 180677 318456
22250C18456P1751m2480k10333L5165P0859J95470j94574k32214L775P7039J56040
$$ 318456 390207 347727 137394 172559 243418 438888 244314 12100 15875 92914 248954
22239B48954ol30757o2769K16913O5798j64314p0287J08528N1296j43700M5090
$$ 248954 248948 -81809 -144578 72335 138133 -26181 -96468 12060 63356 -80344 -35254
22228c5254P1327O1903m3761P1568j57602q9557J77810P2664n7949m9042J31627
$$ -35254 36073 97976 54215 125783 -31819 -121376 56434 129098 71149 22107 153734
22217A53734P2052o9047M9057R0688J14897k11791j23566m8197p5157O1972K5662
$$ 153734 225786 156739 205796 296484 411381 199590 76024 27827 -47330 14642 40304
22206D0304p089J20454o4746j500j59864j73529n8837M6868Q5378P8820J13673
$$ 40304 33215 153669 88923 87423 -72441 -245970 -304807 -257939 -172561 -93741 19932
22195A9932K0514j83308l0197L8334Q3463L2189m3140J4540p0858P136K32957
$$ 19932 40446 -142862 -173059 -134725 -51262 -19073 -62213 -47673 -118531 -111395 121562
22184A21562J10604j73073r56N4838j5369P4m9076j91991l9128J25760Q0316R0956
$$ 121562 232166 59093 58137 112975 97606 97680 48604 -143387 -182515 -56755 23561 114517
22172A14517J34660O6111n0506j68550p4453J6888m6276j45650o4361p0631j38438
$$ 114517 249177 315288 264782 96232 21779 38667 -7609 -153259 -217620 -288251 -426689
22161d26689J09933K61720N5965j83693j98451J07267J3326j21100j1522K94314
$$ -426689 -316756 -55036 929 -182764 -381215 -273948 -260622 -381722 -393244 -98930
22151i8930K53641J49081r8459j39966j07140o249J0125R1980P8805P9168k13732
$$ -98930 154711 303792 205333 65367 -41773 -48022 -37897 54083 132888 212056 -1676
22140a676k0919L3984L2758L0396J1991J45269J01030j16028J06902K7830j15026
$$ -1676 -22595 11389 44147 74543 86534 231803 332833 216805 323707 351537 236511
22129B36511j29416j81641l09263m4382J72100L6511n9490P1690J00263m2612
$$ 236511 107095 -74546 -383809 -428191 -256091 -219580 -279070 -207380 -107117 -149729
22119a49729L7931L1546j8824O3448k5764R381N2406j363p7799p7044n0356m1273
$$ -149729 -111798 -80252 -99076 -35628 -61392 -52011 395 -968 -78767 -155811 -206167 -247440
22107b47440K8784J20267o6826J0937O5899N3408O511j69027j38453R4103Q0450
$$ -247440 -218656 -98389 -165215 -154278 -88379 -34971 -28460 -197487 -335940 -241837 -161387
22096a61387O2273P4768j91217n132J25905p0850r3188J26746J46695J47806k8173
$$ -161387 -99114 -24346 -215563 -220695 -94790 -165640 -258828 -132082 14613 162419 134246
22085A34246J8696j0506j28237j20784j18881L4636l9284O8152N9320M5681p0815
$$ 134246 152942 142436 14199 -106585 -225466 -190830 -230114 -161962 -102642 -56961 -127776
22074a27776j88366J36696J35696J35709p997o8016O7347j51480n171J6092j49182
$$ -127776 -316142 -179446 -43750 91959 83962 15946 83293 -68187 -73358 -57266 -206448
22063b06448m8357J5072J56884Q6005L2909L081Q1313r380J12140N8557O1103
$$ -206448 -254805 -239733 -82849 3156 36065 39146 120459 111079 223219 281776 342879
22052C42879m5917k55076j79329m2974J01417j11358p2345k9967J37726L43841
$$ 342879 296962 41886 -137443 -180417 -79000 -190358 -262703 -292670 -154944 188897
22042A88897J14612r3434p5681p7354l9582O975j16408P2277O3136l9418J35550
$$ 188897 303509 210075 134394 57040 17458 24433 -91975 -19698 43438 4020 139570
22031A39570O6700q411k3611N1508q0230j29753q659q1557k3505p5066j1824O6836
$$ 139570 206270 197859 174248 225756 145526 15773 7114 -74443 -97948 -173014 -184838 -118002
22019a18002j4737J0702J34569q5702o4260j4605R1623J17318M1684o2752j45029
$$ -118002 -132739 -122037 12532 -73170 -137430 -152035 -60412 56906 98590 35838 -109191
22008a09191j12573J03589n253k0873O5264p350L5960K8770r3774j34606J87928
$$ -109191 -221764 -118175 -123428 -144301 -79037 -86387 -50427 -21657 -115431 -250037 -62109
21997f2109Q1574n7244j25250J33450O7263R3374R829j01544k5758J0356j57614
$$ -62109 19465 -37779 -163029 -29579 37684 131058 140887 39343 13585 23941 -133673
21986a33673l7581N4606R6441K4672o8853j00983l2870m437J14100l2176J9693
$$ -133673 -171254 -116648 -20207 4465 -64388 -165371 -198241 -202678 -88578 -120754 -101061
21975a01061R3361n7888n0519l6966p5692N816O209P9865R3712Q6271Q0248J22425
$$ -101061 -7700 -65588 -116107 -153073 -228765 -222949 -216740 -136875 -43163 43108 123356 245781
21963B45781o2235j20811k9560k7492o7069j24269m3193P8243J9278j78560J0490
$$ 245781 183546 62735 33175 5683 -61386 -185655 -228848 -150605 -131327 -309887 -299397
21952b99397m602L0538K6813J43582K0312m9170j4652J69557Q248j83593R297
$$ -299397 -303999 -273461 -246648 -103066 -82754 -131924 -146576 22981 31229 -152364 -143067
21941a43067p3227L0949K9216M2365r0937O6419j1517M8514m906k4280r9593J63559
$$ -143067 -216294 -185345 -156129 -113764 -204701 -138282 -149799 -101285 -106191 -130471 -230064 -66505
21929f6505J59133N3464j03151p5100J28033J21498r6298l8181k07045k5718J39616
$$ -66505 92628 146092 42941 -32159 95874 217372 121074 82893 -124152 -149870 -10254
21918a0254K21340p603J3459j15979j66280o4978R5464P5468l0982j0743J5840
$$ -10254 211086 203483 216942 100963 -65317 -130295 -34831 40637 9655 -1088 14752
21907A4752L3628q9966k4372k1611p4198J49190J12950L1739J36317o2189J21174
$$ 14752 48380 -41586 -65958 -87569 -161767 -12577 100373 132112 268429 206240 327414
21896C27414K23237j60053j89941k02850j50317M2333k8999k10671R1982K83293
$$ 327414 550651 390598 200657 -2193 -152510 -110177 -139176 -349847 -257865 25428
21886B5428L9505m4507j05621J0167Q465j7324p9217R3470K1826r0869j6046P3466
$$ 25428 64933 20426 -85195 -75028 -66563 -83887 -163104 -69634 -47808 -138677 -154723 -81257
21874h1257M5208J71523K7548r9779m0567q4624j22290k7541J79197j78188J89614
$$ -81257 -36049 135474 163022 63243 22676 -61948 -184238 -211779 -32582 -210770 -21156
21863b1156Q5897q8392l3694o7207r4569R0954p3204o5709J13446K86724O2667
$$ -21156 64741 -23651 -57345 -124552 -219121 -128167 -201371 -267080 -153634 133090 195757
21852A95757j28497O5088k5908P4053o0211J06240J13698p4044q5548q4244n3921
$$ 195757 67260 132348 106440 180493 120282 226522 340220 266176 180628 96384 42463
21841D2463q9838k927J17773J43827j42116k77218l2350L6975J05633o2039o9367
$$ 42463 -47375 -50302 67471 211298 69182 -208036 -240386 -203411 -97778 -159817 -229184
21830b29184K81915J60076j1436j94462p0630l9301J2958k50709m6835K24465
$$ -229184 52731 212807 201371 6909 -63721 -103022 -90064 -340773 -387608 -163143
21820a63143j10228k6892M1507K26794o4428J6805j44561J27538J71418j47427
$$ -163143 -273371 -300263 -258756 -31962 -96390 -79585 -224146 -96608 74810 -72617
21810g2617m8794q9084j55331R4514J81284N5045O094K3319J2853N4093J95305
$$ -72617 -121411 -210495 -365826 -271312 -90028 -34983 -28889 -5570 7283 61376 256681
21799B56681q0734k00435o4214q107m099Q9801J2730j39926p9423M433N8740J11969
$$ 256681 175947 -24488 -88702 -96809 -100908 -11107 1623 -138303 -217726 -213293 -154553 -42584
21787d2584K29989K5400k93804j36664J26127P285p38l4681j45117o5503P5131
$$ -42584 187405 212805 -80999 -217663 -91536 -84251 -84989 -119670 -264787 -330290 -255159
21776b55159L7721m066k4147k7581L5319o4282J40934J17329j26035Q37K62146
$$ -255159 -217438 -221504 -245651 -273232 -237913 -302195 -161261 -43932 -169967 -169130 93016
21765I3016J79933o2273j41286l4940J35599j3717L8934M1721j41599n5003J16750
$$ 93016 272949 210676 69390 34450 170049 156332 195266 236987 95388 40385 157135
21754A57135M325J5059j35399n4296o951J08945K6175j5313j5220k84187p1301
$$ 157135 161460 176519 41120 -13176 -20127 88818 114993 99680 84460 -199727 -271028
21743b71028p5437k5144Q0923Q3435N9557M691J11128K14455n5876j62562L733
$$ -271028 -346465 -371609 -290686 -207251 -147694 -143003 -31875 182580 126704 -35858 -32125
21732c2125M3715N2543r9226K7613n722q920j06866j97198l3335K23351O1675
$$ -32125 11590 64133 -35093 -7480 -13202 -22122 -128988 -326186 -359521 -136170 -74495
21721g4495O8010j3342j61648k3194J87257r58k6002O8052Q6419m1604N0925J75631
$$ -74495 -6485 -19827 -181475 -204669 -17412 -18370 -44372 23680 110099 68495 119420 295051
21709B95051k7842J1835k20333j17073k7167L6726O434k6141L8601L5246o5883
$$ 295051 267209 279044 58711 -58362 -85529 -48803 -42369 -68510 -29909 5337 -60546
21698f0546j77833L3791J27996K35109P7976r8509l8039Q7613k7088m902P6469
$$ -60546 -238379 -204588 -76592 158517 236493 137984 99945 187558 160470 155568 232037
21687B32037j20794p6576r0936k6514J17698P9179N5511j65911j00148k6415J3222
$$ 232037 111243 34667 -56269 -82783 34915 114094 169605 3694 -96454 -122869 -109647
21676a09647p8662J50736R9280j31263p354J3236j4815l9627J43135n2258J45778
$$ -109647 -188309 -37573 61707 -69556 -76910 -63674 -78489 -118116 25019 -27239 118539
21665A18539N1116j70877r4227N4041N5276R8426l3336q4569K51754J5004j88296
$$ 118539 169655 -1222 -95449 -41408 13868 112294 78958 -5611 246143 261147 72851
21654G2851j32702O2993K4587L1105R057j97897Q6460N4621j72745L3653K97548
$$ 72851 -59851 3142 27729 58834 67891 -130006 -43546 11075 -161670 -128017 169531
21643A69531p0063j05062j62101m7512J17516m1458j5774R4546j4437j45575p540
$$ 169531 99468 -5594 -167695 -215207 -97691 -139149 -154923 -60377 -74814 -220389 -227929
21632b27929R9995J19811J04718l9356K5491k00570j01581n0121J07983Q5585
$$ -227929 -127934 -8123 96595 57239 82730 -117840 -219421 -269542 -161559 -75974
21622g5974Q1648n8028k9625K516M2291P8507j44594o9923M2300J60783J4819
$$ -75974 5674 -52354 -81979 -79463 -37172 41335 -103259 -173182 -130882 29901 44720
21611D4720j18848k4095J8119k7533n995M3430P9298J50023m4609j49563r6205
$$ 44720 -74128 -98223 -80104 -107637 -113632 -70202 9096 159119 114510 -35053 -131258
21600a31258J4098J22631P6522j45350l3179l7380Q0330J00270J15549J79729
$$ -131258 -117160 5471 81993 -63357 -96536 -133916 -53586 46684 162233 341962
21590C41962O8728j05814k02934o9753J51618p060k1086j21850K9387M8938J82295
$$ 341962 410690 304876 101942 32189 183807 176747 155661 33811 63198 112136 294431
21579B94431r6876j62696n0149O9160O7101Q297O1872N9606j98442q9012j09769
$$ 294431 197555 34859 -15290 53870 120971 129268 191140 250746 52304 -36708 -146477
21568a46477r3940k13309m4439J67484J20197N1446J70122M1244N9184j03680
$$ -146477 -240417 -453726 -498165 -330681 -210484 -159038 11084 52328 111512 7832
21558G832k05710N6926J51964q505q2938k28822L5507J82911L23465j68318j11100
$$ 7832 -197878 -140952 11012 2507 -80431 -309253 -273746 -90835 232630 64312 -46788
21547d6788L9100Q8416K07939R109j71734j44236k04314M9549P8490J07251k7638
$$ -46788 -7688 80728 288667 297776 126042 -18194 -222508 -172959 -94469 12782 -14856
21536a4856J68837J81677n4197n0284K72m5323M0786j90233N3606R9120j2390
$$ -14856 153981 335658 281461 231177 231449 186126 226912 36679 90285 189405 177015
21525A77015j3957m1666j12659j43768m7669M8537j03244R0836M7759q2791l2403
$$ 177015 163058 121392 8733 -135035 -182704 -134167 -237411 -146575 -98816 -181607 -214010
21514b14010J941p8396Q6577J11613O0733J08993K1927q188k1422J15210p5814
$$ -214010 -212069 -290465 -203888 -92275 -31542 77451 99378 91190 69768 184978 109164
21503A09164j24414n5201N8763J17712R2764n8867P7516r7744L8939J3477j13984
$$ 109164 -15250 -70451 -11688 106024 198788 139921 217437 119693 158632 172109 58125
21492E8125j1368o3410j34077O141Q5645Q4503r7805j33202q7395P1092L7063
$$ 58125 46757 -16653 -150730 -144589 -58944 25559 -72246 -205448 -292843 -221751 -184688
21481a84688j38854j01564P2516R4734R1417K15537m4158l6771O360J12637o5775
$$ -184688 -323542 -425106 -352590 -257856 -166439 49098 4940 -31831 -25471 87166 21391
21470B1391o1711K12061J30355l59552k80258j0299l7177K446J2230K65724J97147
$$ 21391 -40320 171741 302096 -57456 -337714 -348013 -385190 -382744 -370514 -104790 92357
21459I2357K6053j97211k14888j30367J49786J07433J86077P7878J14313M3852
$$ 92357 118410 -78801 -293689 -424056 -274270 -166837 19240 97118 211431 255283
21449B55283q5130o6417K3600J8743l1900p4453k6003O412K7702m2066j24441
$$ 255283 170153 103736 127336 146079 114179 39726 13723 20135 47837 5771 -118670
21438a18670n3797J43618M8350J10826J03938p1312q5193R1790l9035k03771m5645
$$ -118670 -172467 -28849 19501 130327 234265 162953 77760 169550 130515 -73256 -118901
21427a18901j35947l836P4633O7356j21328q4632r2569N0941K2232J87773J10192
$$ -118901 -254848 -258684 -184051 -116695 -238023 -322655 -415224 -364283 -342051 -154278 -44086
21416d4086l0906J34467L5039k22309k04729k2357Q9572J73368m5226J6787j17880
$$ -44086 -74992 59475 94514 -127795 -332524 -354881 -265309 -91941 -137167 -120380 -238260
21405b38260j28995R6137K03409J11598j23213j62562P4978P9045J29212l2247
$$ -238260 -367255 -271118 -67709 43889 -79324 -241886 -166908 -87863 41349 9102
21395I102j28467m1935J45528J45004P3911r3914p8371j54013r5275R50P1402
$$ 9102 -119365 -161300 -15772 129232 203143 109229 30858 -123155 -218430 -217480 -146078
21384a46078J11550q5072o2222r758N6736J42851R1810R6715J17822r5622j99734
$$ -146078 -34528 -119600 -181822 -191580 -134844 8007 99817 196532 314354 218732 18998
21373A8998j81187o7234J99078J28544j54662n5071J0408k3235O3620J46469Q1368
$$ 18998 -162189 -229423 -30345 98199 -56463 -111534 -101126 -124361 -60741 85728 167096
21362A67096L8623m6025q0444j25974K3974K72346J71168j19890j02211j00127
$$ 167096 205719 159694 79250 -46724 -22750 249596 420764 300874 198663 98536
21352I8536j33365K88J3478l5284r585L3776N1748R9970J80930L6630m9326r8571
$$ 98536 -34829 -34541 -21063 -56347 -65932 -32156 19592 119562 300492 337122 287796 189225
21340A89225j14403o5414o8633o9581N2890j776n1865J10760K41629K28385p2889
$$ 189225 74822 9408 -59225 -128806 -75916 -77692 -129557 -18797 222832 451217 378328
21329C78328k51606o9330j10557p3132j62888J29250J01377J05255K0294M95n5310
$$ 378328 126722 57392 -53165 -126297 -289185 -159935 -58558 46697 66991 67486 12176
21318A2176q783k7100p1034q1991j19629P3667J91352R9504p9700J82501R1031
$$ 12176 3393 -23707 -94741 -176732 -296361 -222694 -31342 68162 -11538 170963 261994
21307B61994r3995n8759k16826j09231p7976L2098J24640j3712p1574J10555J87585
$$ 261994 167999 109240 -107586 -216817 -294793 -262695 -138055 -151767 -223341 -112786 74799
21296G4799l2274j78226l8031m2643p338R1763O5754L6833k443J8481l0679J5518
$$ 74799 42525 -135701 -173732 -216375 -223713 -131950 -66196 -29363 -31806 -13325 -44004 -28486
21284b8486N0692k2684k9100K18788m4271j74390j97304j31299K3921J69823L5574
$$ -28486 22206 -478 -29578 189210 144939 -29451 -226755 -358054 -334133 -164310 -128736
21273a28736K1330N5770j1776j4224n9154l212P953j3508j2791n986Q9097J06776
$$ -128736 -107406 -51636 -63412 -77636 -136790 -140002 -132049 -145557 -158348 -164334 -75237 31539
21261C1539O1991m0952p1516K9737J93578O1669j54974l3969j80629p2837J12056
$$ 31539 93530 52578 -18938 10799 204377 266046 111072 77103 -103526 -176363 -64307
21250f4307m3565o6744Q0551M4545J77461J15385j14636j64222l5612P2474P2213
$$ -64307 -107872 -174616 -94065 -49520 127941 243326 128690 -35532 -71144 1330 73543
21239G3543J86123P6799P582p2780j39872j75986q0430K18687M2920Q3638L1602
$$ 73543 259666 336465 344047 271267 131395 -44591 -125021 93666 136586 220224 251826
21228B51826k7353m3225j19721n284J1937L4364Q055r7021j47854k4373K8749
$$ 251826 224473 181248 61527 56243 68180 102544 110599 13578 -134276 -158649 -129900
21217a29900o9464m566K37726K14150j19075j25017R5708m5991q6081q3140Q9952
$$ -129900 -199364 -203930 33796 247946 128871 3854 99562 53571 -32510 -115650 -25698
21206b5698N4834J01878P8059l0510p9186n2657M6740Q4045p257j4368o6906j98540
$$ -25698 29136 131014 209073 178563 99377 46720 93460 177505 170248 155880 88974 -109566
21194a09566r6933k9213J12128R2006J5867K1393l0946J45265J09049k6030k6608
$$ -109566 -206499 -235712 -123584 -31578 -15711 5682 -25264 120001 229050 203020 176412
21183A76412j18589J34839J69797J0174j97673j33439m9327q0820M5624N8202
$$ 176412 57823 192662 362459 372633 174960 41521 -7806 -88626 -43002 15200
21173A5200j27084j48278q2268J63332J56245Q0157j9970j34611J666L0813k3873
$$ 15200 -111884 -260162 -342430 -179098 -22853 57304 37334 -97277 -95611 -64798 -88671
21162h8671k1380J50053L3542q7543j3390p6808j24199P9490j1044J11851j11089
$$ -88671 -110051 40002 73544 -13999 -27389 -104197 -228396 -148906 -159950 -48099 -159188
21151a59188q3861Q1562j06281j7412M7729R7818Q9481J6416k3909M2981N5155
$$ -159188 -243049 -161487 -267768 -285180 -237451 -139633 -50152 -33736 -57645 -14664 40491
21140D0491Q9487M2345k5050j07488j28007m1369j4227k4277O0993o1753m7724
$$ 40491 129978 172323 147273 39785 -88222 -129591 -143818 -168095 -107102 -168855 -216579
21129b16579j19318l0323p2940J43300J70225P6625k2991O4190P909N6035m8385
$$ -216579 -335897 -366220 -439160 -295860 -125635 -49010 -72001 -7811 98 56133 7748
21118G748p9077l69J38928J71883N9062M0581j04277o4183l4544j72318O0579
$$ 7748 -71329 -71698 67230 239113 298175 338756 234479 170296 135752 -36566 24013
21107B4013R9216K178K8423n2960l6102q8025l4779l74J8956j7780O1133m0455
$$ 24013 123229 125407 153830 100870 64768 -23257 -58036 -58410 -39454 -57234 3899 -36556
21095c6556j53455L28j1584J50255j51368q4319J54778M3664n9567k9406J63332
$$ -36556 -190011 -189683 -201267 -51012 -202380 -286699 -131921 -88257 -147824 -177230 -13898
21084a3898N1529j9151m795j2813N4902K8809j07113M547J59385J02183j26313
$$ -13898 37631 18480 13685 872 55774 84583 -22530 -17983 141402 243585 117272
21073A17272k84372p5790j2508o751K17256K40860k5815r8644N3104L2361J6755
$$ 117272 -167100 -242890 -255398 -262149 -44893 195967 170152 71508 124612 156973 173728
21062A73728j13547j10169m2124R4985K3693P1941M8326J41579P9271o0167k17521
$$ 173728 60181 -49988 -92112 2873 26566 98507 146833 288412 367683 307516 89995
21051H9995l01842J46899K6491L8501j17748J2830J09907O0517o4513j11162k27239
$$ 89995 -211847 -64948 -38457 44 -117704 -104874 5033 65550 1037 -110125 -337364
21040c37364J01475J57158J32501M3864j6988n6953j30554n7379o8282J36628
$$ -337364 -235889 -78731 53770 97634 80646 23693 -106861 -164240 -232522 -95894
21030i5894P7958J38615K5946j94364L8046J69915J11286j17725p2390o472j10622
$$ -95894 -17936 120679 146625 -47739 -9693 160222 271508 153783 81393 74921 -35701
21019c5701J28025l9312j66887J5853j10401J8417M8675p4666M9832J86444K08133
$$ -35701 92324 53012 -113875 -98022 -208423 -190006 -141331 -215997 -166165 20279 228412
21008B28412J88032l2311j29894j87903O5221l2353j11839j01149m5828J41845
$$ 228412 416444 384133 254239 66336 131557 99204 -12635 -113784 -159612 -17767
20998a7767L6897N6631J79244J16531j52830n8137j00300p8289p7418j133R4505
$$ -17767 19130 75761 255005 371536 218706 160569 60269 -18020 -95438 -96571 -2066
20987b066k2665l6595j79909j42567P2675J73008N0373r5015J10133O6220n9130
$$ -2066 -24731 -61326 -241235 -383802 -311127 -138119 -87746 -182761 -72628 -6408 -65538
20976f5538m6002p2649J2165O7648P0979j34533O9233N6309j68281q1983K06480
$$ -65538 -111540 -184189 -172024 -104376 -33397 -167930 -98697 -42388 -210669 -292652 -86172
20965h6172j5823m9066R5833Q0477q4818k9059j9378o6871J22024p9675N1832
$$ -86172 -101995 -151061 -55228 25249 -59569 -88628 -108006 -174877 -52853 -132528 -80696
20954h0696J12578J56291m2194k6678O7744N8358J22867J2418j38773j30437j43581
$$ -80696 31882 188173 145979 119301 187045 245403 368270 380688 241915 111478 -32103
20943c2103j16252j5668J26239N915P92n2024J47349K586j42809o2024r707r586
$$ -32103 -148355 -164023 -37784 -31869 -31077 -83101 64248 66834 -75975 -137999 -147706 -157292
20931a57292M6108n1785j44950J4440K43238J40447M532l1270Q3834o7270j62171
$$ -157292 -111184 -162969 -307919 -293479 -50241 90206 94738 63468 147302 80032 -82139
20920h2139o8659n0791J03519J11181P6014r4293m2863j27533J41241K4570j55605
$$ -82139 -150798 -201589 -98070 13111 89125 -5168 -48031 -175564 -34323 -9753 -165358
20909a65358L5994J96255L72616J50628j39830j19418m5366R5361j39338j17356
$$ -165358 -129364 66891 439507 590135 450305 330887 285521 380882 241544 124188
20899A24188j03166r169L3508P8763J80466N3606N6136k07179k93287j31217K19508
$$ 124188 21022 11853 45361 124124 304590 358196 414332 207153 -86134 -217351 2157
20888B157L037k193L1861m1913O8200j06517j18576K49656J23800k11426r6215
$$ 2157 5194 3001 34862 -7051 61149 -45368 -163944 85712 209512 -1914 -98129
20877i8129R6518K11058K8305J6480J25616k6567j38679q4473O9523O3633r5390
$$ -98129 -1611 209447 237752 254232 379848 353281 214602 130129 199652 263285 167895
20866A67895m4411m3062r5417J05640l0574o3101q0813J33308J10875K3943P0154
$$ 167895 123484 80422 -14995 90645 60071 -3030 -83843 49465 160340 184283 254437
20855B54437j62234j6697J53252L7315l6669l2349j29834j03185J50897m4697
$$ 254437 92203 75506 228758 266073 229404 197055 67221 -35964 114933 70236
20845G0236l1393k33638l1503m7396J09334J7810K2611J67241O4666J3596j6774
$$ 70236 38843 -194795 -226298 -273694 -164360 -146550 -123939 43302 107968 121564 104790
20834A04790q0420r1665j10715J6738N4642J17648J9056k0603k34813j07433R6758
$$ 104790 24370 -67295 -178010 -161272 -106630 11018 30074 9471 -225342 -332775 -236017
20823b36017R2602r7533n4169L5797P1045p3206j00779J83704J48217r9499K8185
$$ -236017 -143415 -240948 -295117 -259320 -188275 -261481 -362260 -178556 -30339 -129838 -101653
20812a01653Q3449P6413j8384J07549J7896n5290j76455J12233K2293Q8314l9883
$$ -101653 -18204 58209 39825 147374 165270 109980 -66475 45758 68051 156365 116482
20801A16482j3943n1544l4237J86279K9016j47350O1864J7459O9149N1697J3040
$$ 116482 102539 50995 16758 203037 232053 84703 146567 164026 233175 284872 297912
20790B97912K6062L8064j95517j89096k13542R3803O7388m3089M9880n866J10792
$$ 297912 323974 362038 166521 -22575 -236117 -142314 -74926 -118015 -68135 -74001 36791
20779C6791K07020j97680L5169J0035k99787N8011P6919k634J20952j40327J0054
$$ 36791 243811 46131 81300 91335 -208452 -150441 -73522 -76156 44796 -95531 -85477
20768h5477O9128N7034R1334j92314j35613k05045j49189J19169K36534J10536
$$ -85477 -16349 40685 132019 -60295 -195908 -400953 -550142 -430973 -194439 -83903
20758h3903j34491q7560o9982J82314K97778N5544k24144j27492J001J01771j2315
$$ -83903 -218394 -305954 -375936 -193622 104156 159700 -64444 -191936 -190935 -89164 -101479
20747a01479J57168R7075Q6561j36093j51809q5848N2381q4191L2324n9166l0474
$$ -101479 55689 152764 239325 103232 -48577 -134425 -82044 -166235 -133911 -193077 -223551
20736b23551J02885K26493J08704m5117j26665j27319j1805j05859O6811J67637
$$ -223551 -120666 105827 214531 169414 42749 -84570 -96375 -202234 -135423 32214
20726C2214J27573K0869p7944j6145L2994j6245J10646J53705q1966k08127n2713
$$ 32214 159787 180656 102712 86567 119561 103316 213962 367667 285701 77574 24861
20715B4861j59317j84832r9083J7914J97157P6952J743P4089M4600P7j39604j5892
$$ 24861 -134456 -319288 -418371 -400457 -203300 -126348 -124605 -50516 -5916 -5839 -145443 -161335
20703a61335O0465K02698O0060M5981m7870L549l8602l87443O7040J48706M3943
$$ -161335 -100870 101828 161888 207869 159999 163548 124946 -262497 -195457 -46751 -2808
20692b808N0283Q8588k56462q8078J19346N958o2591J02079J35398k5031j19305
$$ -2808 47475 136063 -120399 -208477 -89131 -83173 -145764 -43685 91713 66682 -52623
20681e2623j86242J8189J76255O781l5691j31636O4675j14012o2821J02170J88750
$$ -52623 -238865 -220676 -44421 -37640 -73331 -204967 -140292 -254304 -317125 -214955 -26205
20670b6205R6051j13893P3253J36115j32469p0073j15098K27405l2171m9259j39566
$$ -26205 69846 -44047 29206 165321 32852 -37221 -152319 75086 42915 -6344 -145910
20659a45910l4588K1126P0046j19271J52863J54432p2310O0086p9653q8641J08046
$$ -145910 -180498 -159372 -89326 -208597 -55734 98698 26388 86474 6821 -81820 26226
20648B6226k1544M1434j32569L2118J56291n4882J08677L753k25132p3816j10593
$$ 26226 4682 46116 -86453 -54335 101956 47074 155751 159504 -65628 -139444 -250037
20637b50037R226j2857J7410j62895K3292J92062L65253o3987j23158l3057J4194
$$ -250037 -240811 -253668 -236258 -399153 -375861 -183799 181454 117467 -5691 -38748 -24554
20626b4554j78852j86673J12604l8342p4041K4136O7401K25880p1443J05740J51010
$$ -24554 -203406 -390079 -277475 -315817 -389858 -365722 -298321 -72441 -143884 -38144 112866
20615A12866j88493j3604N8608M4690n1233k5149O4717J16063K14220M2848k51472
$$ 112866 -75627 -89231 -30623 14067 -37166 -62315 2402 118465 332685 375533 124061
20604A24061p204K0286j24190l9234N4879K13682J06362N3937j38621k34118N716
$$ 124061 116857 137143 12953 -26281 28598 242280 348642 402579 263958 29840 35556
20593C5556J46204j0277j65272j16426J68344R2452k8183q5363j17978j16533
$$ 35556 181760 171483 6211 -110215 58129 150581 122398 37035 -80943 -197476
20583a97476M4123K6779m8248K51904J44137j05037p1882L6169R8103M647j62243
$$ -197476 -153353 -126574 -174822 77082 221219 116182 44300 80469 178572 183219 20976
20572B0976j02420k5567J5865m469l7981l1972j14107R5484P1688J9746K2714
$$ 20976 -81444 -107011 -91146 -95615 -133596 -165568 -279675 -184191 -112503 -92757 -70043
20561g0043j00402j9693j09461n3072J33523L23563Q6985j63595q7944m5284r659
$$ -70043 -170445 -190138 -299599 -352671 -219148 104415 191400 27805 -60139 -105423 -115082
20550a15082J55800Q8299K906O7666j54167k7666o3954k25667j11874K1118j1741
$$ -115082 40718 129017 131923 199589 45422 17756 -46198 -271865 -383739 -362621 -374362
20539c74362l993J44098L2874P2468J51159R2944p4628j47175M9872J01875l5267
$$ -374362 -378355 -234257 -201383 -128915 22244 115188 40560 -106615 -56743 45132 9865
20528I865R3234J11032j07471k32319q4528J41797j08736k36817p9225K3430J9669
$$ 9865 103099 214131 106660 -125659 -210187 -68390 -177126 -413943 -493168 -469738 -450069
20517d50069L7496K13933Q7041P5207q4987n6395M8572J64248J6658j31694J33566
$$ -450069 -412573 -198640 -111599 -36392 -121379 -177774 -129202 35046 51704 -79990 53576
20506E3576J31557l6876j76457N0461J09991J1195r8637L5767N8672J27243j47615
$$ 53576 185133 148257 -28200 22261 132252 143447 44810 80577 139249 266492 118877
20495A18877r9928m1178J70094K30608m2494k86973p3516J3330O4437L6636L750
$$ 118877 18949 -22229 147865 378473 335979 49006 -24510 -11180 53257 89893 93643
20484I3643p8853q3102n8720K49587J35467k5068k45239r2919q625J09832J38366
$$ 93643 14790 -68312 -127032 122555 258022 232954 -12285 -105204 -113829 -3997 134369
20473A34369j01930r0852N9259q8387Q6054Q4413N4018j1173j77229j71614K5099
$$ 134369 32439 -58413 846 -87541 -1487 82926 136944 125771 -51458 -223072 -197973
20462a97973k9620n079l6135j4365J79958M2370Q0965J55176k7512o5825L0082
$$ -197973 -227593 -232672 -268807 -283172 -103214 -60844 20121 175297 147785 81960 112042
20451A12042K9423r9399Q2k2968K314r2047j3888j03265o0027K6434q2317J05818
$$ 112042 141465 42066 42148 19180 21494 -70553 -84441 -187706 -247733 -221299 -303616 -197798
20439a97798J71499l0498J11480N9380q7979k07798q7543K12979J28036q8164
$$ -197798 -26299 -56797 54683 114063 26084 -181714 -269257 -56278 71758 -16406
20429a6406J0094l9168O8643J27430N2359L8096N665j28704R590k25480k24918
$$ -16406 -6312 -45480 23163 150593 202952 241048 246713 118009 127599 -97881 -322799
20418c22799P72J68121l4602j50123l7561J17834R1905j1791L2800J67530P4870
$$ -322799 -322027 -153906 -188508 -338631 -376192 -258358 -166453 -178244 -145444 22086 96956
20407I6956N942L2714o8628p9922J80097O3020O529j48855q1119N1887j04877
$$ 96956 102898 135612 66984 -12938 167159 230179 236708 87853 6734 58621 -46256
20396d6256j55796o4278j27816J10130K08732J15755k9718j70932o0437l8793
$$ -46256 -202052 -266330 -394146 -284016 -75284 40471 10753 -160179 -220616 -259409
20386b59409N9000l5359J37813J39475j9107j16706m293L3853n1382k7289J18144
$$ -259409 -200409 -235768 -97955 41520 22413 -94293 -98586 -64733 -116115 -143404 -25260
20375b5260K09745K1142j57892M4733P4698n7006O8004o8060M8704j6826j10593
$$ -25260 184485 205627 47735 92468 167166 110160 178164 110104 158808 141982 31389
20364C1389r2845J8435k2841J71006l9053L0480J3268j49107n0980O6893K14961
$$ 31389 -61456 -43021 -65862 105144 66091 96571 109839 -39268 -90248 -23355 191606
20353A91606k8975R5641j49752j98207L8722L3421r1933m2970l0950K09505J16626
$$ 191606 162631 258272 108520 -89687 -50965 -17544 -109477 -152447 -183397 26108 142734
20342A42734R8431O6359p359j19249r6346J49379j09871l2524r5904j88033j73242
$$ 142734 241165 307524 300165 180916 84570 233949 124078 91554 -4350 -192383 -365625
20331c65625j04830J35783J82975J20092n3837O0030J44432k31541j69423p6034
$$ -365625 -470455 -334672 -151697 -31605 -85442 -25412 119020 -112521 -281944 -357978
20321c57978P1264J14218J8258P0231J1970j68058J0892L1389k45J6334O5364
$$ -357978 -286714 -172496 -154238 -84007 -72037 -240095 -229203 -197814 -198059 -181725 -116361
20310a16361R705J86573R7779j03272p2399L2276Q3424J3309o7366J636j31195
$$ -116361 -106656 79917 177696 74424 2025 34301 117725 131034 63668 65304 -65891
20299f5891j06949J8225R2405r0677J2003n094N1483j64486J04866K25962J52511
$$ -65891 -172840 -154615 -62210 -152887 -140884 -145978 -94495 -258981 -154115 71847 224358
20288B24358j54040L068j36847m2254n7220P1218K72790o2361k19707l5398J34197
$$ 224358 70318 73386 -63461 -105715 -162935 -91717 181073 118712 -100995 -136393 -2196
20277b196K0925L5918R8751O8849k7976p5486j97024q8796R3483O1139o9983n4892
$$ -2196 18729 54647 153398 222247 194271 118785 -78239 -167035 -73552 -12413 -82396 -137288
20265a37288J06732n1890j28877K45396K01584r6191q1822j16067j7662p1421
$$ -137288 -30556 -82446 -211323 34073 235657 139466 57644 -58423 -76085 -147506
20255a47506K25217K84650p2280j06611j18776k3895R4254j14654m3175j08004
$$ -147506 77711 362361 290081 183470 64694 40799 135053 20399 -22776 -130780
20245a30780M948K09934m3411N4992j365Q4445P8215j58814l4543K0730o8117
$$ -130780 -125832 84102 40691 95683 94318 178763 256978 98164 63621 84351 16234
20234A6234j42N9899l2448K7078P7165j8164k56866l2667J44054K07666L1099
$$ 16234 16092 75991 43543 70621 147786 129622 -127244 -159911 -15857 191809 222908
20223B22908k9768p7343r4528j23834J11504m1037J2632o702o5475J33065l0631
$$ 222908 193140 115797 21269 -102565 8939 -32098 -19466 -26168 -91643 41422 10791
20212A0791m8485Q892j8991p8432J14517J08006o8468K7778P5059r7894k6844
$$ 10791 -37694 -28802 -47793 -126225 -11708 96298 27830 55608 130667 32773 5929
20201E929J02836j29185n7621k623m939K0841J54421K77301J76866k30587k26685
$$ 5929 108765 -20420 -78041 -80664 -85603 -64762 89659 366960 543826 313239 86554
20190H6554p5744M4588l8285j4908J44426N1829k7344r0671r7216r0270J03621
$$ 86554 10810 55398 17113 2205 146631 198460 171116 80445 -16771 -107041 -3420
20179c420K1472j51747q9734Q8009K03926k07222j49395R0195K55240J85092q661
$$ -3420 18052 -133695 -223429 -135420 68506 -138716 -288111 -197916 57324 242416 233755
20168B33755J46941r9602j72554L0992Q5647r8173n7835k71170j03493J26581
$$ 233755 380696 281094 108540 139532 225179 127006 69171 -201999 -305492 -178911
20158a78911N9678n5793l9315J10662P2274J91162J06870j54925p0526o8633n1797
$$ -178911 -119233 -175026 -214341 -103679 -31405 159757 266627 111702 41176 -27457 -79254
20147g9254M6180k2052J67675J07066M06j54608r3406Q9479m2333J05954P1421
$$ -79254 -33074 -55126 112549 219615 220021 65413 -27993 61486 19153 125107 196528
20136A96528o1240K1766j00019j08618j5952J59772k0868j34232k7403m5328J23062
$$ 196528 135288 157054 57035 -51583 -67535 92237 71369 -62863 -90266 -135594 -12532
20125a2532J52067J46514j16491j47811k45676k6101J69567O1355L3802L0283
$$ -12532 139535 286049 169558 21747 -223929 -250030 -80463 -19108 14694 44977
20115D4977n0241p9234j2716N8722n4414Q1736J11362o3808m6368L9774m6842
$$ 44977 -5264 -84498 -97214 -38492 -92906 -11170 100192 36384 -9984 29790 -17052
20104a7052J47321q4651j05611O341j65683l1413M0049P7619o770l7706K30884
$$ -17052 130269 45618 -59993 -53652 -219335 -250748 -210699 -133080 -139850 -177556 53328
20093E3328J48030j48847k27642M618O3028K83958J22133m7262j26098m4839o3981
$$ 53328 201358 52511 -175131 -170513 -107485 176473 298606 251344 125246 80407 16426
20082A6426O1805p0258J1915J26266j43327k8494Q8700j0044r4799q1133K61964
$$ 16426 78231 7973 19888 146154 2827 -25667 63033 52989 -41810 -122943 139021
20071A39021n9582m9595R1441P5048p7313k751J9135N641l5167N0727j91103q3977
$$ 139021 79439 29844 121285 196333 119020 116269 135404 141045 105878 156605 -34498 -118475
20059a18475l8103j41370p9326J06598J56411J62752M0885M714r2515n98L8103
$$ -118475 -156578 -297948 -377274 -270676 -114265 48487 89372 94086 1571 973 39076
20048C9076Q004Q9566J5536j13733j45210j08489r6037J04895L11240j11892j45405
$$ 39076 47080 136646 152182 38449 -106761 -215250 -311287 -206392 104848 -7044 -152449
20037a52449N0536J31484P7998l4835q193J30900r884p3738j51825K6006O3236
$$ -152449 -101913 29571 107569 72734 64541 195441 185557 111819 -40006 -14000 49236
20026D9236p7969J36321l3740j49625o873M97R2913J1635N4200K4149j07153M3372
$$ 49236 -28733 107588 73848 -75777 -82650 -82153 10760 22395 76595 100744 -6409 36963
20014C6963P265o1963P5889n2041j73750p1792P7091j9807L3276J04913Q3348
$$ 36963 44228 -17735 58154 6113 -167637 -239429 -162338 -182145 -148869 -43956 39392
20003C9392N2056j05724R0908j4952n6612j01333j12854j1965J88804K31509j07345
$$ 39392 91448 -14276 76632 61680 5068 -96265 -209119 -221084 -32280 199229 91884
19992I1884p0602j3813n9936N3169P3084j3914M1706q8084j95263o8118K01685
$$ 91884 21282 7469 -52467 702 73786 59872 101578 13494 -181769 -249887 -48202
19981d8202J12190J31166j58080j37839p360j65745j05671J2265J85158K1134
$$ -48202 63988 195154 37074 -100765 -108125 -273870 -379541 -367276 -182118 -160984
19971a60984q08m9964n6704J07752J42603j4046n2375o4564J6952p878R4353M6784
$$ -160984 -161792 -211756 -268460 -160708 -18105 -32151 -84526 -149090 -132138 -140016 -45663 1121
19959A121O4294j25792l1477J41765J63302q4219j51377r8503J91107K1360l3715
$$ 1121 65415 -60377 -91854 49911 213213 128994 -22383 -120886 70221 91581 57866
19948E7866k1952o2680j03211L4326O4829r6837j49864K150J95944J06814j89145
$$ 57866 35914 -26766 -129977 -95651 -30822 -127659 -277523 -275373 -79429 27385 -161760
19937a61760R3523J14228j01122j83675j24069j10630J09232l404o9159K51427
$$ -161760 -68237 45991 -55131 -238806 -362875 -473505 -364273 -367677 -436836 -185409
19927a85409J11742Q0913L4205p1785K4588j17373j21878J38684N7533N466j1405
$$ -185409 -73667 7246 41451 -30334 -5746 -123119 -244997 -106313 -48780 -43314 -54719
19916e4719j52670N2115K69305m7561Q407k8809o5080J21116j2516r2557k0474
$$ -54719 -207389 -155274 114031 66470 74877 46068 -19012 102104 89588 -2969 -23443
19905b3443P454J815p681k2539r8663L9572k1848j9266k5041J32191J71188j20124
$$ -23443 -15989 -14174 -21855 -44394 -143057 -103485 -125333 -144599 -169640 -37449 133739 13615
19893A3615j63369j14148j19027K62984J87358j44261k1177J18828M0100J25830
$$ 13615 -149754 -263902 -382929 -119945 67413 -76848 -98025 20803 60903 186733
19883A86733J09888J1509N7784O9177L6535J2358j42570j21231Q9741q8351k54282
$$ 186733 296621 308130 365914 435091 471626 483984 341414 220183 309924 221573 -32709
19872c2709k34885P4074O7265P105J76533K3504l0558k15143R010J10317j4960
$$ -32709 -267594 -193520 -126255 -119150 57383 80887 50329 -164814 -155804 -45487 -60447
19861f0447N3504J04883j41382j11365J18501n336m4990R5970j39662K2764J12084
$$ -60447 -6943 97940 -43442 -154807 -36306 -41642 -86632 9338 -130324 -107560 4524
19850D524j20750Q1365O9236J01450n7129q0455m4324N3218N0958r1238o6801
$$ 4524 -116226 -34861 34375 135825 78696 -1759 -46083 7135 58093 -33145 -99946
19839i9946p2002P9278J40219N6960O6562J1842j17350o7158K8577N3239k3478
$$ -99946 -171948 -92670 47549 104509 171071 182913 65563 -1595 26982 80221 56743
19828E6743J6684l4741j16239q1891J03587J56142j62795k1322J09665J39238
$$ 56743 73427 38686 -77553 -159444 -55857 100285 -62510 -83832 25833 165071
19818A65071J47942p7573j30237l8872J32652O1971j66553o6441M7560q5820P2290
$$ 165071 313013 235440 105203 66331 198983 260954 94401 27960 75520 -10300 61990
19807F1990K2103j06597O6073l8721K45308J98904o5545k36167j49215j8882J83663
$$ 61990 84093 -22504 43569 4848 250156 449060 383515 147348 -1867 -20749 162914
19796A62914K9727j90099n7233L0431J38461P4180o9794p9951r9756J63498M8112
$$ 162914 192641 2542 -54691 -24260 114201 188381 118587 38636 -61120 102378 150490
19785A50490Q8862J78411j51819k49891J0373K03833o3819k69063J7716K5510
$$ 150490 239352 417763 265944 16053 26426 230259 166440 -102623 -84907 -59397
19775e9397K47766J9966r0233K6837J40939N8082L0239l0812j65121k03369k2471
$$ -59397 188369 208335 118102 144939 285878 343960 374199 343387 178266 -25103 -47574
19764d7574q3807k9790j8212J07188P0263m7631m8421M9757K574Q6583k8877l1976
$$ -47574 -131381 -161171 -179383 -72195 -1932 -49563 -97984 -48227 -45653 40930 12053 -19923
19752a9923L875j70330N4296Q7872J12174R3786j66989q0274L3076N2948j665
$$ -19923 -16048 -186378 -132082 -44210 67964 161750 -5239 -85513 -52437 511 -1154
19741a154q0342r5219J3073J82840J50407L180r5295Q9532L3171j31353k7542
$$ -1154 -81496 -176715 -163642 19198 169605 172785 77490 167022 200193 68840 41298
19730D1298m1783J26138J13076k0381L4535r7863j40709j28956j31640P1277o111
$$ 41298 -485 125653 238729 218348 252883 155020 14311 -114645 -246285 -175008 -181119
19719a81119L2293J8361k6790J7889L2292N6228R381J2121P9903j5297L4270P7832
$$ -181119 -148826 -130465 -157255 -139366 -107074 -50846 -41465 -29344 50559 35262 69532 147364
19707A47364J42927J07266J6415m0904j41532r087j24576q9513J4756P2804L3740
$$ 147364 290291 397557 413972 373068 231536 222449 97873 8360 23116 95920 129660
19696A29660k06752J10930K25358K5081n3677o4369j4384P1502j18385j40858
$$ 129660 -77092 33838 259196 284277 230600 166231 151847 223349 104964 -35894
19686c5894M9022J34095R3048o2988j65611k2653J6819J24742j38293q8332l6495
$$ -35894 13128 147223 240271 177283 11672 -10981 5838 130580 -7713 -96045 -132540
19675a32540J5250J76010M5536K5286m5687L9027J4007j05190J78377p0131m8053
$$ -132540 -117290 58720 104256 129542 83855 122882 136889 31699 210076 139945 91892
19664I1892K5168N7352J481l9337j22765q2542J8697Q1309N9569n3586j73650
$$ 91892 117060 174412 175893 136556 13791 -68751 -50054 31255 90824 37238 -136412
19653a36412l541J63973J70349o720k25129m2636P5181P0766Q4625n7971j23465
$$ -136412 -139953 24020 194369 187649 -37480 -80116 -4935 65831 150456 92485 -30980
19642c0980j22646r1759J60579K19570q3562J0705p9102J31621o0405l5722j72515
$$ -30980 -153626 -245385 -84806 134764 51202 61907 -17195 114426 54021 18299 -154216
19631a54216K29506J34711j23750m7248O4615r7618J5039J33391l7668q3771o8410
$$ -154216 75290 210001 86251 39003 103618 6000 21039 154430 116762 32991 -35419
19620c5419J60042J68635r0475j25419r9886J41647l8927o2384k01660q4698J29185
$$ -35419 124623 293258 202783 77364 -22522 119125 80198 17814 -183846 -268544 -139359
19609a39359R3171o4576l5794J09357j49570j22927J66486J511N5213J12595L2549
$$ -139359 -46188 -110764 -146558 -37201 -186771 -309698 -143212 -141701 -86488 26107 58656
19598E8656j4431l3686J19737Q1627j25727j85886R6891K3605L9708L8199o185
$$ 58656 44225 10539 130276 211903 86176 -99710 -2819 20786 60494 98693 92508
19587I2508P2790o6910q6007j80273J25188K00572O8150P1961J0451p8796j52647
$$ 92508 165298 98388 12381 -167892 -42704 157868 226018 297979 308430 229634 76987
19576G6987j82277O9679n3604M2421R7218m7786k7070r5718j73983k1424J62807
$$ 76987 -105290 -35611 -89215 -46794 50424 2638 -24432 -120150 -294133 -315557 -152750
19565a52750J80450J68230o8994k18474j20523R1488N5750K0069R0449m8770j15096
$$ -152750 27700 195930 126936 -91538 -212061 -120573 -64823 -44754 45695 -3075 -118171
19554a18171N5461l7474J5794J96136J66171j18161k41078l886K37901J24309
$$ -118171 -62710 -100184 -84390 111746 277917 159756 -81322 -85208 152693 277002
19544B77002l618k22026K7468O2408K440J46464L5096p2566j07064m4863O1721
$$ 277002 273384 51358 78826 141234 143674 290138 325234 252668 145604 100741 162462
19533A62462J02048p9252k5625n3538p2130R44j70878J42210J4176M8494j4350
$$ 162462 264510 185258 159633 106095 33965 34909 -135969 6241 20417 68911 54561
19522E4561r6234j02229N026k6797J26518J17223K8746j2057j182r4243n4637
$$ 54561 -41673 -143902 -138876 -165673 -39155 78068 106814 94757 93575 -668 -55305
19511e5305J78380m4597k0285j21403o0118p5647o4880J15620M6250N848K01735
$$ -55305 123075 78478 58193 -63210 -123328 -198975 -263855 -148235 -101985 -96137 105598
19500A05598J18862j2675j25512R7109K11541K8365j73406k49133k66517P973
$$ 105598 224460 211785 86273 183382 394923 423288 249882 749 -265768 -257795
19490b57795J32526Q0788m1259j3739K41963J9349m9426q4654q8089j07674l286
$$ -257795 -125269 -44481 -85740 -99479 142484 161833 112407 27753 -60336 -168010 -171296
19479a71296J42657P7711q908P1251n9222l1504J43553J47397J30841k05170k40604
$$ -171296 -28639 49072 40164 111415 52193 20689 164242 311639 442480 237310 -3294
19468c294k3387J29609M8224J6654o4381J30380p8881j72693l4700l2181R369
$$ -3294 -26681 102928 151152 167806 103425 233805 154924 -17769 -52469 -84650 -75281
19457g5281L489J80471Q3216R9444J9939r736O2217J10216k41740j58257j39295
$$ -75281 -71792 108679 191895 291339 311278 301542 363759 473975 232235 73978 -65317
19446f5317L5049n0453j49846Q7200K00795J8545m1324j25398m793k02314J24508
$$ -65317 -30268 -80721 -230567 -143367 57428 75973 34649 -90749 -95542 -297856 -173348
19435a73348J62171O6552j29454Q796J80959j5384Q7344L3319j68987r7408J61023
$$ -173348 -11177 55375 -74079 -65283 115676 100292 187636 220955 51968 -45440 115583
19424A15583o8435p946k0960k12007O3094R0719J9953Q1424O6024o0206k22985
$$ 115583 47148 39202 18242 -193765 -130671 -39952 -19999 61425 127449 67243 -155742
19413a55742O5993K48038o4406j21177q5526K4435R3422P6230J36316Q8194j28371
$$ -155742 -89749 158289 93883 -27294 -112820 -88385 5037 81267 217583 305777 177406
19402A77406o8783p6148j31826r8815L5857q200J08361N9965J06963J49396k20360
$$ 177406 108623 32475 -99351 -198166 -162309 -170509 -62148 -2183 104780 254176 33816
19391C3816n9307L9718K7381J7308n3392n3696j01518R3043J49961J79035O5132
$$ 33816 -25491 14227 41608 58916 5524 -48172 -149690 -56647 93314 272349 337481
19380C37481j38202r9586M0348N3243j38023L6477k0937j33352J09736K25115
$$ 337481 199279 99693 140041 193284 55261 91738 70801 -62551 47185 272300
19370B72300N6291o2431P3795P6276Q3334R6063j71955k34279j4514m3629k9010
$$ 272300 328591 266160 339955 416231 499565 595628 423673 189394 174880 131251 102241
19359A02241M1720O7143Q5966J8681r8643p3604m4946o7518l399J23803j25736
$$ 102241 143961 211104 297070 315751 217108 143504 98558 31040 27641 151444 25708
19348B5708l900j24595R007J80847J41558k4915l1224j03537r6232R9802J49707
$$ 25708 21808 -102787 -93780 87067 228625 203710 172486 68949 -27283 72519 222226
19337B22226O972j92841l0942J3945J43980Q1795n1204J62727k3839j11991n2667
$$ 222226 229198 36357 5415 19360 163340 245135 193931 356658 332819 220828 168161
19326A68161l399P3502o6653J49267k5280r0309k3450j78565n2261P3038J55489
$$ 168161 164762 238264 171611 320878 295598 205289 181839 3274 -48987 24051 179540
19315A79540j50699j2452J26373j11711R376k3017J57095J95005q009k71645q5742
$$ 179540 28841 16389 142762 31051 40427 17410 174505 369510 361501 89856 4114
19304D114J14727J44073j2130o090m4167J29159j6205o6529j35997M4085p4109
$$ 4114 118841 262914 250784 244694 200527 329686 313481 246952 110955 155040 80931
19293H0931l4789K02937O0509j06092q2666J75494J47581o091k13678n8620J00242
$$ 80931 46142 249079 309588 203496 120830 296324 443905 437814 224136 165516 265758
19282B65758m7726p9677m3392j62114j1965O6424J14256R2096n3883j60482o6575
$$ 265758 218032 138355 94963 -67151 -79116 -12692 101564 193660 139777 -20705 -87280
19271h7280j3206J32159J12090O4865p5692P8613J48924k0128K0836j86j11767
$$ -87280 -100486 31673 143763 208628 132936 211549 360473 340345 361181 360995 249228
19260B49228j78739j92741Q6656R8234J85302J354j8563O7198r8957p6236P818
$$ 249228 70489 -122252 -35596 62638 247940 249294 230731 297929 198972 122736 130554
19249A30554k6930J00898j08776n26N0765m1423n1946L7762o7618O965J18246
$$ 130554 103624 204522 95746 95220 145985 104562 52616 90378 22760 29725 147971
19238A47971J95487P1667k22956j31569L4444o2105R4737K26160p8784n6870j38907
$$ 147971 343458 415125 192169 60600 95044 32939 127676 353836 275052 218182 79275
19227G9275j19849J2836R0497K0213K7142N116N6918N4670J92175K5691J28061
$$ 79275 -40574 -27738 62759 82972 110114 115230 172148 226818 418993 444684 572745
19216E72745N8146j27695j52514r3487m8488j79598P1950J20250J30897L30559
$$ 572745 630891 503196 350682 257195 208707 29109 101059 221309 352206 682765
19206F82765P8605j15449l9391P4002J60545K07701K33590R234j05126j65301
$$ 682765 761370 645921 606530 680532 841077 1048778 1282368 1291602 1186476 1021175
19196A021175j34390j3855j05039j43013K906R6061J53510J75463J92572J51798
$$ 1021175 886785 872930 767891 624878 627784 723845 877355 1052818 1245390 1397188
19186A397188O471j05897o0221O1410j07328k37703j8918J49653K30963j24960
$$ 1397188 1403659 1297762 1237541 1298951 1191623 953920 935002 1084655 1315618 1190658
19176A190658r8627J9099J0364j16352l5264M6437j47174j95360j01214Q3241
$$ 1190658 1092031 1111130 1121494 1005142 969878 1016315 869141 673781 572567 655808
19166F55808R8870P5499J11981q6746k73176q4414r716N3603L1540R2716n7198
$$ 655808 754678 830177 942158 855412 582236 497822 488106 541709 573249 665965 608767
19155F08767j7290q1106J59002J84595R8360J19671j67891r2285K7170R423p9032
$$ 608767 591477 510371 669373 853968 952328 1071999 904108 811823 838993 848416 769384
19144G69384K08604J98260K28729N7943j8754n718j8691N2123j58154p4811j15374
$$ 769384 977988 1176248 1404977 1462920 1444166 1438448 1419757 1471880 1313726 1238915 1123541
19133A123541o2024M4694j74546P6541L8491J67931K07207k31215l49136j65799
$$ 1123541 1061517 1106211 931665 1008206 1046697 1214628 1421835 1190620 841484 675685
19123F75685K8523Q9079o4549m879m11J35532Q4711k38063k00151J262m0690K8338
$$ 675685 704208 793287 728738 723859 723448 858980 943691 705628 505477 506739 466049 494387
19111D94387o5064r9032R4580o461o6579q4786j42661R0111J6505l3902L9829
$$ 494387 429323 330291 424871 418410 351831 267045 124384 214495 231000 197098 236927
19100B36927J60075J56746k35375j42355Q0016m9125K1546J60034J7202O0733
$$ 236927 397002 553748 318373 176018 256034 206909 228455 388489 405691 466424
19090D66424m4361p2165j12434O2174M8707j49317m3518J08749P6559J54507N5602
$$ 466424 422063 349898 237464 299638 348345 199028 155510 264259 340818 495325 550927
19079E50927p5766j1560j48283m0970P0422j2254K388k16140L7560K28271j751
$$ 550927 475161 463601 315318 274348 344770 332516 334904 118764 156324 384595 382844
19068C82844P68J07777L8167o1562K8278r8651p0136j06601K2595M4742J1979
$$ 382844 383612 491389 529556 467994 496272 397621 327485 220884 243479 288221 300200
19057C00200j06545K4984J32740n003J41770r1031j40570J3330J7829J2701j8242
$$ 300200 193655 218639 351379 346376 488146 397115 256545 269875 287704 300405 282163
19046B82163j23239Q25R3041Q9927J09449J8569j0046o9555J49703L9365j30659
$$ 282163 158924 159749 252790 342717 452166 470735 460689 391134 540837 580202 449543
19035D49543o5490r7352p9940P8083K2641P796L0904O1737j6897o6081r7642r3012
$$ 449543 384053 286701 206761 284844 307485 315281 346185 407922 391025 324944 227302 134290
19023A34290J61705J53421m772m1083L9465j42311j23693q227J7228R8414J23806
$$ 134290 295995 449416 444644 403561 443026 300715 177022 168795 186023 284437 408243
19012D08243J0803k157j31046j28313p518M9009l9035K3515J36327n8103J3999
$$ 408243 419046 416889 285843 157530 150012 199021 159986 183501 319828 261725 275724
19001B75724n8210l1888M0139L4067Q1651l0004n2942r241r2959q2089J60932
$$ 275724 217514 185626 225765 259832 341483 311479 258537 249296 156337 74248 235180
18990B35180k235J07864J69475O3890l9037j17717j75919j48871K5553J49076
$$ 235180 232945 340809 510284 574174 535137 417420 241501 92630 118183 267259
18980B67259m760m4309l9357j21892p488J10246K50801J34098j24367l5120o6972
$$ 267259 262499 218190 178833 56941 49453 159699 410500 544598 420231 385111 318139
18969C18139O8235J4642r481P472R5748J06029p6940r930j48245j95223j8103
$$ 318139 386374 401016 391535 399007 494755 600784 523844 513914 365669 170446 152343
18958A52343Q9452L2634r1038J9644N5248J1854O1292R7537J03622j89277M3942
$$ 152343 241795 274429 183391 203035 258283 270137 331429 428966 532588 343311 387253
18947C87253P7917l1911j93040P4165K72064q6686j48392J18345K60193o5369
$$ 387253 465170 433259 240219 314384 586448 499762 351370 469715 729908 664539
18937F64539o5197q3846q9230J70077K1536r73p7716k8104R8493J48339J51330
$$ 664539 599342 515496 426266 596343 617879 616906 539190 511086 609579 757918 909248
18926I09248L9191j7267l8234k1257r7974K47017J74623K5569Q0497M2919r3897
$$ 909248 948439 931172 892938 871681 773707 1020724 1195347 1220916 1301413 1344332 1250435
18915A250435L7920j25123j42413n9920q9278j43200m1599l373J70739K59429
$$ 1250435 1288355 1163232 1020819 960899 871621 728421 686822 683449 854188 1113617
18905A113617L5565n687n2774r8713M1839k3137q2134M2360o3457n2672J78589
$$ 1113617 1149182 1143495 1090721 992008 1033847 1010710 928576 970936 907479 854807 1033396
18894A033396Q6900k7199q5206n5164j24649n7640q6145L8293k1760L7900P6430
$$ 1033396 1120296 1093097 1007891 952727 828078 770438 684293 722586 700826 738726 815156
18883H15156m4520k3565j50756N901J49187j117p720J47443K58932r0536K354
$$ 815156 770636 747071 596315 602216 751403 750286 742566 890009 1148941 1058405 1060759
18872A060759R4252J4471J08698K42363K68169K837j06855r3014O789K03036L11001
$$ 1060759 1155011 1169482 1278180 1520543 1788712 1791549 1684694 1591680 1598469 1801505 2112506
18861B112506J1017L0139R3474j12914j84874j23932m9711k11863q7619L6685
$$ 2112506 2123523 2153662 2247136 2134222 1949348 1825416 1775705 1563842 1476223 1512908
18851A512908p2225r1432J76314R0299j15470k25443m5193r4730j13990j72j5031
$$ 1512908 1440683 1349251 1525565 1615864 1500394 1274951 1229758 1135028 1021038 1020866 1005835
18840A005835j68257J96017j5966k48619O173k0398j61857j9871Q9948J44253
$$ 1005835 837578 1033595 1017629 769010 775183 754785 592928 573057 663005 807258
18830H07258J38695J60855j08232k33264J19139J02100R456P9237M3125j94782
$$ 807258 945953 1106808 998576 765312 884451 986551 996007 1075244 1118369 923587
18820I23587j82026N7330Q4498K46039P9064K36269K71356m5059M2347m3615K7399
$$ 923587 741561 798891 883389 1129428 1208492 1444761 1716117 1671058 1713405 1669790 1697189
18809A697189j04259R071N0772M5103K706p3301j49187j32253q9458l4282j03667
$$ 1697189 1592930 1602001 1652773 1697876 1700582 1627281 1478094 1345841 1256383 1222101 1118434
18798A118434k4495J84815J27092p0921K3628j2165K2683R4142l0724k77688J02265
$$ 1118434 1093939 1278754 1405846 1334925 1358553 1346388 1369071 1463213 1432489 1154801 1257066
18787A257066J94715k2352J41852K07690o3068j18873j49674o9762j34111k03014
$$ 1257066 1451781 1429429 1571281 1778971 1715903 1597030 1447356 1377594 1243483 1040469
18777A040469K0812n8496J28089N9583L5912Q8145L39124J45603K4748J5474J26709
$$ 1040469 1061281 1002785 1130874 1190457 1226369 1314514 1653638 1799241 1823989 1839463 1966172
18766A966172J84259J14685Q5836J59380p808j67873k08222j36139M1512l2347
$$ 1966172 2150431 2265116 2350952 2510332 2502524 2334651 2126429 1990290 2031802 1999455
18756A999455j91721K5493J46372J07195m4973q0106o6958P5570J3719n5295m5914
$$ 1999455 1807734 1833227 1979599 2086794 2041821 1961715 1894757 1970327 1984046 1928751 1882837
18745A882837M4792N6319l9652Q9884J17535R4454j14378J29027L48609R543O7752
$$ 1882837 1927629 1983948 1944296 2034180 2151715 2246169 2131791 2260818 2609427 2618970 2686722
18734B686722Q8683m1454j20287K0683m8303k2554j8358L9823J16248J36918J13384
$$ 2686722 2775405 2733951 2613664 2634347 2586044 2563490 2545132 2584955 2701203 2838121 2951505
18723B951505N6216P6062J02993J02722K17276Q2206K30712K02713J25899K41768
$$ 2951505 3007721 3083783 3186776 3289498 3506774 3588980 3819692 4022405 4148304 4390072
18713D390072K08944K32979J98571J74791K36336K38064K43165K88988L44539
$$ 4390072 4599016 4831995 5030566 5205357 5441693 5679757 5922922 6211910 6556449
18704F556449N71303O85379O24050P21772O90565J22645J58185M98357Q35459
$$ 6556449 7127752 7813131 8437181 9158953 9849518 9972163 10130348 10628705 11464164
18695A1464164J330225J840559K418688L439066N039700O646170O346619M648188
$$ 11464164 12794389 14634948 17053636 20492702 25532402 32178572 38525191 43173379
18687D3173379L743905J982324k620212n099476l109930n70230J719993L490739
$$ 43173379 46917284 48899608 46279396 41179920 38069990 37499760 39219753 42710492
18679D2710492N914346Q901848J3256530K0998893L4460673N3384014O2302064
$$ 42710492 48624838 57526686 70783216 91782109 126242782 179626796 241928860
18672B41928860M8692570L8379977L0206795k941395m9315089n5013188l9890478
$$ 241928860 290621430 329001407 359208202 356266807 306951718 251938530 212048052
18665B12048052l0240697k9500865k1711229r895784L19749P718287Q701788M515949
$$ 212048052 181807355 152306490 130595261 120699477 121019226 128737513 137439301 141955250
18657A41955250J900144l407080j5154943k1807453j7944601j2164751q284398
$$ 141955250 143855394 140448314 125293371 103485918 85541317 73376566 65092168
18650F5092168n961693m240375l090213j984681j330540j002231o83179n08014
$$ 65092168 59130475 54890100 51799887 49815206 48484666 47482435 46799256 46291242
18642D6291242p40889p66172m89579j29514J31918P36969J804419K930097M354069
$$ 46291242 45550353 44784181 44294602 44165088 44297006 45033975 46838394 49768491 54122560
18633E4122560O663627J0130908J5391603J9162392J6715752J1599449Q535547
$$ 54122560 60786187 70917095 86308698 105471090 122186842 133786291 142321838
18626A42321838J354265j0597913j2988495n243356M988496J6273376K6502565
$$ 142321838 143676103 133078190 120089695 114846339 119834835 136108211 162610776
18619A62610776L2951931M4783716O1560740O1083218L0260891J0039435P8371
$$ 162610776 195562707 240346423 301907163 362990381 393251272 403290707 403369078
18612D03369078l3024886p8296464p6664693n0155901l0885419k0123544j3810132
$$ 403369078 370344192 292047728 215383035 165227134 134341715 114218171 100408039
18605A00408039r387239o228429m108067k038042R55674L362470K326429M51806
$$ 100408039 91020800 84792371 80684304 78646262 79601936 82964406 85290835 85742641
18597H5742641m14027l300629q726211j0300416p889033n334548l746675k902716
$$ 85742641 85328614 82027985 73301774 63001358 55112325 49777777 46031102 43128386
18589D3128386k436032j922071j482610j412153j208434j281992j183048j107056
$$ 43128386 40692354 38770283 37287673 35875520 34667086 33385094 32202046 31094990
18581C1094990j259357j345299j296130r60193p09951o20149q25725p52898o32440
$$ 31094990 29835633 28490334 27194204 26234011 25524060 24903911 24078186 23325288 22692848
18572B2692848o32585q35899o26808o40587p45117o84130n86002n71660n34299
$$ 22692848 22060263 21224364 20597556 19956969 19211852 18527722 17941720 17370060 16835761
18563A6835761m39970n18837m28282m58212m03146m96453m33617m64387m88843
$$ 16835761 16395791 15876954 15448672 14990460 14587314 14090861 13657244 13192857 12704014
18554A2704014l35343m72937m51179l28712m33552m65551k21918j37465k37169
$$ 12704014 12368671 11895734 11444555 11115843 10682291 10216740 9994822 9857357 9620188
18545I620188j76650j58738k70037l84636l56412k09471p9055p7686j95276k04937
$$ 9620188 9443538 9284800 9014763 8630127 8273715 8064244 7985189 7907503 7712227 7507290
18535G507290k46710j05488N2324J07336J03448k41009l59318l94009k33560k02953
$$ 7507290 7260580 7155092 7207416 7314752 7418200 7177191 6817873 6423864 6190304 5987351
18525E987351j56032j31530p2303o6504k12678l8891j98305k63270l05232j15591
$$ 5987351 5831319 5699789 5627486 5560982 5348304 5309413 5111108 4847838 4542606 4427015
18515D427015j62148k9746r2905O1850n5322j52260k30490k64950K7288R0779
$$ 4427015 4264867 4235121 4142216 4204066 4148744 3996484 3765994 3501044 3528332 3619111
18505C619111j4899q1752j23822r9328L545k1884K1779q5004j32971k57349r3336
$$ 3619111 3604212 3522460 3398638 3299310 3302855 3280971 3302750 3217746 3084775 2827426 2734090
18494B734090K14580P3301M5454Q767K7904K8151j40342m2202M6955j37582J1556
$$ 2734090 2948670 3021971 3067425 3076192 3104096 3132247 2991905 2949703 2996658 2859076 2870632
18483B870632r1677K845j97704r0789J70073K08745O5747j69341L3218n684O0934
$$ 2870632 2778955 2781800 2584096 2493307 2663380 2872125 2937872 2768531 2801749 2796065 2856999
18472B856999J09111J09186K72063M38916M19600L61559K97669L81439J32289
$$ 2856999 2966110 3075296 3347359 3786275 4205875 4567434 4865103 5246542 5378831
18463E378831k90366k97223j80890k36551j88710q7727p7480K4563P7500J84888
$$ 5378831 5088465 4791242 4610352 4373801 4185091 4097364 4019884 4044447 4121947 4306835
18453D306835J20357q1895j30257M1558M066q4589q3807J82794L70089J23327
$$ 4306835 4427192 4345297 4215040 4256598 4260664 4176075 4092268 4275062 4645151 4768478
18443D768478o7836J33252J89334K0098J47129K12722K53704J27742j05154K99550
$$ 4768478 4700642 4833894 5023228 5043326 5190455 5403177 5656881 5784623 5679469 5979019
18433E979019L00204K92700J69813O6934L60269N52178P78653Q92020J244640
$$ 5979019 6279223 6571923 6741736 6808670 7168939 7721117 8499770 9391790 10636430
18424A0636430J685019K554767L019790K697348K069155J668171J066728m88036
$$ 10636430 12321449 14876216 17896006 20593354 22662509 24330680 25397408 24909372
18416B4909372o37497N65580K234784M348682P533173J1480070J3808711J3425451
$$ 24909372 24271875 24837455 27072239 31420921 38954094 50434164 64242875 77668326
18408G7668326J4246840J5024157J0670281K851825m1768m26153m346589j1563215
$$ 77668326 91915166 106939323 117609604 120461429 120419661 119993508 115646919 104083704
18400A04083704j3081653j0896015j1146699r171173m208278L17865L101348L183596
$$ 104083704 91002051 80106036 68959337 59788164 55579886 55897751 58999099 62182695
18392F2182695J747658P97925j776058o851904q417862o448216m193557k555160
$$ 62182695 63930353 64728278 62952220 56100316 47682454 41234238 37040681 34485521
18384C4485521j524383j315884p11775r5506N07715J342110J878628K840773L129235
$$ 34485521 32961138 31645254 30933479 30837973 31345688 32687798 34566426 37407199 40536434
18375D0536434K718267K557537K304236J294292Q90760L374355O898246R279896
$$ 40536434 43254701 45812238 48116474 49410766 50301526 53675881 60574127 69854023
18367F9854023Q993251R230796J1116622J2723613J5002876K0440752K5929759
$$ 69854023 78847274 88078070 99194692 111918305 126921181 147361933 173291692
18360A73291692L0279339K8795554K0821887J1627933N810326n350971j0640406
$$ 173291692 203571031 232366585 253188472 264816405 270626731 265275760 254635354
18353B54635354p923410n641605j0453491j2387829r196128q244081j1926222
$$ 254635354 246711944 241070339 230616848 218229019 209032891 200788810 188862588
18346A88862588j8631462k0758760k1290918j8939078j3193034p906977m225884
$$ 188862588 170231126 149472366 128181448 109242370 96049336 88142359 83916475
18339H3916475l010034k805732k657965l888567o182033o033322m169881k891248
$$ 83916475 80906441 78100709 75442744 71554177 65372144 59338822 55168941 52277693
18331E2277693k024284j454587q32249k34471P4676L17373Q61452J788490K756344
$$ 52277693 50253409 48798822 47966573 47732102 47806778 48124151 48985603 50774093 53530437
18322E3530437M216334O579768R698622J1120870Q688946O607155M736934J37330
$$ 53530437 57746771 64326539 74025161 85146031 93834977 100442132 105179066 105316396
18314A05316396m423094j148345O174323J1421354J5582585K2579532K5903174
$$ 105316396 100893302 99744957 105919280 117340634 132923219 155502751 181405925
18307A81405925J9582299J4926177J3685347J238169j5813170k2897238k5615532
$$ 181405925 200988224 215914401 229599748 230837917 215024747 192127509 166511977
18300A66511977l0175037k7310703j9291336j2827106q662585n962666l699035
$$ 166511977 136336940 109026237 89734901 76907795 68245210 62282544 58583509
18293E8583509j718920N331O05828j43317p08488j510640l728015n812986n077414
$$ 58583509 56864589 56869920 57475748 57332431 56623943 55113303 51385288 45572302 40494888
18284D0494888l820068k824022k017992j589353j384634j220768j118916p97955
$$ 40494888 36674820 33850798 31832806 30243453 28858819 27638051 26519135 25721180
18276B5721180p12959r57708r30471p20158p13177p13899q18700q16854q98542
$$ 25721180 25008221 24050513 23120042 22399884 21686707 20972808 20154108 19337254 18438712
18267A8438712r06955n64972l61293l41422l55265l70621l99126j30834k61259
$$ 18438712 17531757 16966785 16605492 16264070 15908805 15538184 15139058 15008224 14746965
18258A4746965l26705j57892j16847l54304m37139k70743m22559m69190n17758
$$ 14746965 14420260 14262368 14145521 13791217 13354078 13083335 12660776 12191586 11673828
18249A1673828l49649l85290m38324l64029j65134k64868l13705j03026k07188
$$ 11673828 11324179 10938889 10500565 10136536 9971402 9706534 9392829 9289803 9082615
18240I082615k41825j27253J2749P7327l11377m01762l71292j58324q4689k69730
$$ 9082615 8840790 8713537 8726286 8803613 8492236 8090474 7719182 7560858 7476169 7206439
18230G206439k76502l55970l69133k86935j56360j29411P5315n7956k35785j64365
$$ 7206439 6929937 6573967 6204834 5917899 5761539 5632128 5707443 5649487 5413702 5249337
18220E249337j04653j67023p7765l5860J4405L5795k68375k01918J77749q706
$$ 5249337 5144684 4977661 4899896 4864036 4878441 4914236 4645861 4443943 4621692 4612986
18210D612986M2409k12481k75444j98382j77998k33756k9766p1392M1470J25455
$$ 4612986 4655395 4442914 4167470 3969088 3791090 3557334 3527568 3456176 3497646 3623101
18200C623101J47390L1529J00346O6885l3493m2309O1112k0423k37930k87008
$$ 3623101 3770491 3802020 3902366 3969251 3935758 3893449 3954561 3934138 3696208 3409200
18190C409200p4172k9615L7044K8194L767N9101O1174l2162K15747J27064k4362
$$ 3409200 3335028 3305413 3342457 3370651 3374418 3433519 3494693 3462531 3678278 3805342 3780980
18179C780980j43393l46374k64170l1120K0325J2476P5336r2731q7540R734J87231
$$ 3780980 3637587 3291213 3027043 2995923 3016248 3028724 3104060 3011329 2923789 2933523 3120754
18168C120754K37j42774J9154k31139q0123q884J24781M8791L5000J03374K62960
$$ 3120754 3120991 2978217 2997371 2766232 2686109 2677225 2802006 2850797 2885797 2989171 3252131
18157C252131K72071M5359J75828K73384P0372K5922J18636L1558Q6982J7431
$$ 3252131 3524202 3569561 3745389 4018773 4089145 4115067 4233703 4265261 4352243 4369674
18147D369674K00871J67022L39860J50181K07523L43501L04495K44162K10859
$$ 4369674 4570545 4737567 5077427 5227608 5435131 5778632 6083127 6327289 6538148
18138F538148m1169k9972K38916J26027R9311K04097L96964N40144M06181O94296
$$ 6538148 6496979 6467007 6705923 6831950 6931261 7135358 7532322 8072466 8478647 9172943
18128I172943O84486O69366J196662J182436J426457J622774K084049K551958
$$ 9172943 9857429 10526795 11723457 12905893 14332350 15955124 18039173 20591131
18120B0591131L734747N536798P897813R630825Q809108P943465Q184029O528288
$$ 20591131 24325878 29862676 37760489 47391314 56200422 64143887 72327916 78856204
18112G8856204M378271R639200J9126614K5707626L1495043M0292517L0514475
$$ 78856204 83234475 92873675 112000289 137707915 169202958 209495475 240009950
18105B40009950O977638j024052n202709l1709292m2345161k8012571j6858612
$$ 240009950 246987588 245963536 240760827 209051535 166706374 138693803 121835191
18098A21835191j5154759j7908658j5473913j0625297p230927n296172m167062
$$ 121835191 106680432 88771774 73297861 62672564 55441637 50145465 45978403
18091D5978403l457910k867756k124509j850294j547965j119591j039151o82411
$$ 45978403 42520493 39652737 37528228 35677934 34129969 33010378 31971227 31288816
18083C1288816k09385J09999J51350J38676L34252Q75502J377708K734246M457848
$$ 31288816 31079431 31189430 31340780 31479456 31813708 32689210 34066918 36801164 41259012
18074D1259012O270760O237767M929219M555518L648544J135164J416139O052069
$$ 41259012 47529772 53767539 58696758 63252276 66900820 68035984 69452123 75504192
18066G5504192J0777714J4688373J7930214J8642904J5332870J0297439M984501
$$ 75504192 86281906 100970279 118900493 137543397 152876267 163173706 168158207
18059A68158207k452744j1255368j6820872j7852114j8221747j6170805j0158365
$$ 168158207 165705463 154450095 137629223 119777109 101555362 85384557 75226192
18052G5226192m363301j039187j025530j606490j811408m225830p748236p521878
$$ 75226192 70862891 69823704 68798174 67191684 65380276 61154446 53406210 45884332
18044D5884332n544271l905409k867026k348421j882671j567184r52435p26329
$$ 45884332 40340061 36434652 33567626 31219205 29336534 27769350 26816915 26090586
18036B6090586p08058n68249p36767q62079n89711k83638k46364K01544M71655
$$ 26090586 25382528 24814279 24077512 23215433 22625722 22342084 22095720 22297264 22768919
18027B2768919O44707J344032K610848M139577M890152L761912L216941K959007
$$ 22768919 23413626 24757658 27368506 31508083 36398235 40160147 43377088 46336095
18019D6336095J177976m34947K076707N701999N458602L283747K567726k24577
$$ 46336095 47514071 47079124 49155831 54857830 60316432 63600179 66167905 65943328
18011F5943328o683299q146993l848392j040475r88641j066508j525883m370169
$$ 65943328 59260029 51113036 47264644 46224169 45235528 44169020 42643137 38272968
18003C8272968o450199n507240l685378k309946j561216j347672j127450j213415
$$ 38272968 31822769 26315529 22630151 20320205 18758989 17411317 16283867 15070452
17995A5070452p46878o53579p18315n66873k85075l39781o03692n70278k39864
$$ 15070452 14323574 13669995 12951680 12384807 12099732 11759951 11156259 10585981 10346117
17986A0346117k66509m22428l09254o8915j39358j40981m41035l52133k14878
$$ 10346117 10079608 9657180 9347926 9279011 9139653 8998672 8557637 8205504 7990626
17977G990626k13328k65703l90135k32298k07544j35531p4541j49874j69464k04655
$$ 7990626 7777298 7511595 7121460 6889162 6681618 6546087 6471546 6321672 6152208 5947553
17967E947553l46911j30240R0760J4331Q8143j80240j44820k17930j81601j14221
$$ 5947553 5600642 5470402 5561162 5575493 5663636 5483396 5338576 5120646 4939045 4824824
17957D824824j61041R5355J5423n0256k26490j42178k12246j99579j15919l1852
$$ 4824824 4663783 4759138 4774561 4724305 4497815 4355637 4143391 3943812 3827893 3796041
17947C796041N3692R12j55796j20079k8373l5940m1049M518k29441o8098K0337
$$ 3796041 3849733 3850645 3694849 3574770 3546397 3510457 3469408 3473926 3244485 3176387 3196724
17936C196724j16904p8983q693K9687J16131n8350J21688Q1740j02704r658J13132
$$ 3196724 3079820 3000837 2992144 3021831 3137962 3079612 3201300 3283040 3180336 3170678 3283810
17925C283810j02415k15879R9976J46479P0929J1368j08987j1512n0864j65167
$$ 3283810 3181395 2965516 3065492 3211971 3282900 3294268 3185281 3173769 3122905 2957738
17915B957738L3369l5109l578P5377n9518k20264j07192J19729K86559Q6487l0757
$$ 2957738 2991107 2955998 2952420 3027797 2968279 2748015 2640823 2760552 3047111 3133598 3102841
17904C102841K18236J89851j08458j80634j48345J16146L7443N6203J13429K10650
$$ 3102841 3321077 3510928 3402470 3221836 3073491 3189637 3227080 3283283 3396712 3607362
17894C607362L16037R8826k44713k98397k38955M7668K24408J60638K802Q9475
$$ 3607362 3923399 4022225 3777512 3479115 3240160 3287828 3512236 3672874 3675676 3765151
17884C765151J2623j33794j48643K8397J18384L28916L46667K15497k82O2899
$$ 3765151 3777774 3643980 3495337 3523734 3642118 3971034 4317701 4533198 4532916 4595815
17874D595815J45632J03937N1216J75292L0342K65478L23491J37505J80865K76306
$$ 4595815 4741447 4845384 4896600 5071892 5102234 5367712 5691203 5828708 6009573 6285879
17864F285879M31751L39265K60525L49300N15432O17347N11544N50519R42356
$$ 6285879 6717630 7056895 7317420 7666720 8182152 8799499 9311043 9861562 10803918
17855A0803918R65880J069490J007547J052845J112948J344507J821939K131500
$$ 10803918 11769798 12839288 13846835 14899680 16012628 17357135 19179074 21310574
17847B1310574K711456L835468N538355P174977P716269P621747O942225N580052
$$ 21310574 24022030 27857498 33395853 40570830 48287099 55908846 62851071 68431123
17839F8431123K823823K065599L692610Q635812J6107033K4116957L1007642K9720098
$$ 68431123 71254946 73320545 77013155 85648967 101756000 125872957 156880599 186600697
17831A86600697K0871155J3556976N356461p738750r356502Q048427K3300337
$$ 186600697 207471852 221028828 226385289 218646539 209290037 217338464 240638801
17824B40638801K4921536K2975563J8601400k78625k6345809l4932212l1135411
$$ 240638801 265560337 288535900 307137300 306858675 280512866 245580654 214445243
17817B14445243k8808679k8170440k3571927j5625779q026153j903414J299114
$$ 214445243 185636564 157466124 133894197 118268418 110242265 108338851 109637965
17810A09637965R54601m39748k153253n832190j0278006j1003604q458580n877934
$$ 109637965 110592566 110152818 107999565 102167375 91889369 80885765 72427185 66549251
17802F6549251l980714k700174k072789j351342q43013o48198l24125N21471J641780
$$ 66549251 62568537 59868363 57795574 56444232 55601219 54953021 54628896 55150367 56792147
17793E6792147L099823N110620Q165384J0167979R813319J0079867J1391225J1373775
$$ 56792147 59891970 65002590 73167974 83335953 93149272 103229139 114620364 125994139
17785A25994139Q487717O592022O360400O469728M358693K406559Q047461J6649860
$$ 125994139 134481856 141073878 147434278 153904006 158262699 160669258 168716719 185366579
17777A85366579J8265530J8682597J8598408R165921n314347n766071L79790j357121
$$ 185366579 203632109 222314706 240913114 250079035 244764688 238998617 239378407 238021286
17769B38021286o944360q996709j3683669k5708675l0989048k4253505j7274395
$$ 238021286 231076926 222080217 208396548 182687873 151698825 127445320 110170925
17762A10170925j3671474j0641325p655553n221945l728145k629781j489939l35177
$$ 110170925 96499451 85858126 78202573 72980628 69252483 66622702 65132763 64797586
17754F4797586M15873N28496L45199N05633N58703K72905J008580L376647M618033
$$ 64797586 65213459 65741955 66087154 66592787 67151490 67424395 68432975 71809622 76427655
17745G6427655L617000K578445J161026k620887n952632m714277j734838Q41806
$$ 76427655 80044655 82623100 83784126 81163239 75210607 70496330 68761492 69603298
17737F9603298L506660N933579R135425J4277949K2737744L6989897N6881897
$$ 69603298 73109958 79043537 88178962 102456911 125194655 162184552 219066449
17730B19066449O7370059N6274463M2914750L1502515k334236m9846410o2740509
$$ 219066449 286436508 342710971 385625721 417128236 414794000 364947590 302207081
17723C02207081m8632355l7103941l2598430k3972098j2451583k230720N723066
$$ 302207081 253574726 216470785 183872355 159900257 147448674 145217954 150941020
17716A50941020Q086585M811661J183288l958186j4071437k2060170k0340513
$$ 150941020 159027605 163839266 165022554 161064368 146992931 124932761 104592248
17709A04592248j4616430j0270358p264897n138367l740367k740994k078143j500503
$$ 104592248 89975818 79705460 72440563 67302196 63561829 60820835 58742692 57242189
17701E7242189j126841j324320j109677r73691j056657q39657l23083K45198R53852
$$ 57242189 56115348 54791028 53681351 52707660 51651003 50811346 50488263 50733461 51687313
17692E1687313J939535L136002N259608Q175295J2693526J6705184J6328439J2117553
$$ 51687313 53626848 56762850 62022458 70197753 82891279 99596463 115924902 128042455
17684A28042455Q852824L910625n727139j0877212n935960L342889J2961481K1204909
$$ 128042455 136895279 140805904 135078765 124201553 118265593 121608482 134569963 155774872
17676A55774872K8037428L8255355N0548883M9734345K8896903J0683017j902252
$$ 155774872 183812300 222067655 272616538 322350883 351247786 361930803 360028551
17669C60028551k8581763o2933503o6413805m6097987k9124017j8705093j2348252
$$ 360028551 331446788 268513285 202099480 156001493 126877476 108172383 95824131
17662I5824131q825455o523741m269774k571199m44672J431650J166879J928r65481
$$ 95824131 86998676 80474935 76205161 73633962 73189290 74620940 75787819 75789747 74824266
17653G4824266k539368o031635q050542o756260m763475l343238k527059k197831
$$ 74824266 72284898 66253263 58202721 51446461 46682986 43339748 40812689 38614858
17645C8614858j750684j479840j619458j524038j433269j347770j243717j231381
$$ 38614858 36864174 35384334 33764876 32240838 30807569 29459799 28216082 26984701
17637B6984701j122329j002072r52032o61402p21573n31347l23335n71885o73610
$$ 26984701 25862372 24860300 23908268 23246866 22525293 21993946 21670611 21098726 20425116
17628B0425116m08527n46579o24855p48354n16676m08138m98038n63178m42840
$$ 20425116 20016589 19470010 18845155 18096801 17580125 17171987 16673949 16110771 15667931
17619A5667931m10571m54522n46848n02929m03974m35110l21871n29627m72055
$$ 15667931 15257360 14802838 14255990 13753061 13349087 12913977 12592106 12062479 11590424
17610A1590424j63187m30775m75063m07133m76475j94434N7753j95388k41362
$$ 11590424 11427237 10996462 10521399 10114266 9637791 9443357 9501110 9305722 9064360
17601I064360j65356k61065k21097k96649j85930k3596k35275l49275m70311m9447
$$ 9064360 8899004 8637939 8416842 8120193 7934263 7910667 7675392 7326117 6855806 6806359
17591F806359k14423j32037j23723l52910k40142j28076j40593k9468j87995j27637
$$ 6806359 6591936 6459899 6336176 5983266 5743124 5615048 5474455 5444987 5256992 5129355
17581E129355p4666j81203j23724j3328j22229j08932j10092j20121j82941j83094
$$ 5129355 5054689 4873486 4749762 4736434 4614205 4505273 4395181 4275060 4092119 3909025
17571C909025P0269j4080j21100k46915j50527R638j11223r4472j39676l149j26239
$$ 3909025 3979294 3965214 3844114 3597199 3446672 3456310 3345087 3250615 3110939 3107790 2981551
17560B981551k23051j39501J20159J25058j21317j41758J35982J02863M5069k21002
$$ 2981551 2758500 2618999 2739158 2864216 2742899 2601141 2737123 2839986 2885055 2664053
17550B664053q9861P8405j31218n9457K7613j33547o2873j92211j18014j25043
$$ 2664053 2574192 2652597 2521379 2461922 2489535 2355988 2293115 2100904 1982890 1857847
17540A857847l6072q4144o7972j37341n5773J14315M6801j33611l8728L9428K9956
$$ 1857847 1821775 1737631 1669659 1532318 1476545 1590860 1637661 1504050 1465322 1504750 1534706
17529A534706Q7656j09028j34959m1590n5171N6748N1866Q7940J8675j24017j25637
$$ 1534706 1622362 1513334 1378375 1336785 1281614 1338362 1390228 1478168 1496843 1372826 1247189
17518A247189o69O9403k7491L0041n6537R578j744K6351N7243J16048R0284R5090
$$ 1247189 1246520 1315923 1288432 1318473 1261936 1271514 1269770 1296121 1353364 1469412 1559696 1654786
17506A654786o9098j29922J3093j03220J17719o9322o8287m0365N3140o6304p9026
$$ 1654786 1585688 1455766 1468859 1365639 1483358 1414036 1345749 1305384 1358524 1292220 1213194
17495A213194j46003N6069k697l7004Q8921l0581r5179r5192N8715R2991o4913
$$ 1213194 1067191 1123260 1120563 1083559 1172480 1141899 1046720 951528 1010243 1103234 1038321
17484A038321j17689q4233J4812o6155J2176n1348J8284Q8194n6108j07773L4702
$$ 1038321 920632 836399 851211 785056 797232 745884 764168 852362 796254 688481 723183
17473G23183M4540N9239j51307O1421K6559L8649p8548j28207r0015L5538M5510
$$ 723183 767723 826962 675655 737076 763635 802284 723736 595529 505514 541052 586562
17462E86562J2406L1256M4750K0059j67917o8339R4320P8833J01201l0387L7816
$$ 586562 598968 630224 674974 695033 527116 458777 553097 631930 733131 702744 740560
17451G40560K7613P7826j8379j05842l2167p1264p1469J44796J07416K9779O9490
$$ 740560 768173 845999 827620 721778 689611 618347 546878 691674 799090 828869 898359
17440H98359K88589O9094m3670q1139n7725j9982o5714k05990j1390j52190N881
$$ 898359 1186948 1256042 1212372 1131233 1073508 1053526 987812 781822 770432 618242 624123
17429F24123j7015j4977l8835j39308j98567j09999N3469K36909o1143n4547N7797
$$ 624123 607108 592131 553296 413988 215421 105422 158891 395800 334657 280110 337907
17418C37907N0812Q9363K792k47034k72824n7558M9731M7429J59253J44026K7008
$$ 337907 388719 478082 480874 233840 -38984 -96542 -46811 618 159871 303897 330905
17407C30905K2295Q3075j04089k00897J11278K23650j29256k08176M9347J00691
$$ 330905 353200 436275 332186 131289 242567 466217 336961 128785 178132 278823
17397B78823j2989j22183J23135J53642J2526N8069j43293k99751o7248J74260
$$ 278823 265834 143651 266786 420428 432954 491023 347730 47979 -19269 154991
17387A54991O4100J15375N3532m1910K8505k027j0400J44827l4224j10632o4308
$$ 154991 219091 334466 387998 346088 374593 372566 362166 506993 472769 362137 297829
17376B97829j04880q8194k2917J73243Q4747J5792j21343M0308j25662N1679j32484
$$ 297829 192949 104755 81838 255081 339828 355620 234277 274585 148923 200602 68118
17365F8118l9252q692J15781J25323J0185R4521M2027r4979j6903N6813J7988
$$ 68118 28866 20174 135955 261278 271463 365984 408011 313032 296129 352942 370930
17354C70930j00668l4651m0100j26498Q4451O630J72809r879j79292q330L9505
$$ 370930 270262 235611 195511 69013 153464 160094 332903 323024 143732 135402 174907
17343A74907o443J15555L1276q7525R6858Q8552l8847p3088q1636J36158O3974
$$ 174907 168464 284019 315295 227770 324628 413180 374333 301245 219609 355767 419741
17332D19741o086O038J46406J34197Q5688p0772m271K854J5289J21493K45875
$$ 419741 413655 419693 566099 700296 785984 715212 710941 713795 729084 850577 1096452
17321A096452J27901O6444j39321k94358J63076o3494L2208K26251J30069j93563
$$ 1096452 1224353 1290797 1151476 857118 1020194 956700 988908 1215159 1345228 1151665
17311A151665p3923J55686J56084j34954k6521K8798k31688j54780l2240j66400
$$ 1151665 1077742 1233428 1389512 1254558 1228037 1256835 1025147 870367 838127 671727
17301F71727l5126j24313R1499q7590n7200J53790N7769L3082K2421l9112j03603
$$ 671727 636601 512288 603787 516197 458997 612787 670556 703638 726059 686947 583344
17290E83344j15064k22938j29295J25880K66767J91625l15l3679j21619r9495
$$ 583344 468280 245342 116047 241927 508694 700319 700004 666325 544706 445211
17280D45211j6710J36359Q6504k2476J37003J87400O3500J95329j48549p6757
$$ 445211 428501 564860 651364 628888 765891 953291 1016791 1212120 1063571 986814
17270I86814J3154O9738N7810j40406M832n8758p1759J00700j4452J01382k67197
$$ 986814 999968 1069706 1127516 987110 991942 933184 861425 962125 947673 1049055 781858
17259G81858n5709J21078k0323j16492k5755M6696j0702j97415j9534L6113P9849
$$ 781858 726149 847227 826904 710412 684657 731353 720651 523236 503702 539815 619664
17248F19664J53069j20700L5817J34397K0277p6222m3067j86164m4106K4035J7417
$$ 619664 772733 652033 687850 822247 842524 766302 723235 537071 492965 517000 534417
17237E34417J6024k01K8828j04959j6712j13600j45735k3751k8367j60020K17034
$$ 534417 550441 550240 579068 474109 457397 343797 198062 174311 145944 -14076 202958
17226B02958J72718l7166N5523Q8672M8569k32729k01190J6605K45053J37324
$$ 202958 375676 338510 394033 482705 531274 298545 97355 113960 359013 496337
17216D96337l6062J26592R7431J76335N8588J57382p4234j51937r6806K04616
$$ 496337 460275 586867 684298 860633 919221 1076603 1002369 850432 753626 958242
17206I58242J04008J60293j41979q1286P0451N1612K7201K59877K0046n076N8464
$$ 958242 1062250 1222543 1080564 999278 1069729 1121341 1148542 1408419 1428465 1423389 1481853
17195A481853p0953k93240r0718L7896k3157j07460j19809j84929l45683K196
$$ 1481853 1410900 1117660 1026942 1064838 1041681 934221 814412 629483 283800 285996
17185B85996Q8256J46560O0239m9455j7434p9661j62084j9448l6545P0296j21455
$$ 285996 374252 520812 581051 531596 514162 434501 272417 252969 216424 286720 165265
17174A65265j40591J83257J55256L862J69555L49732J0682K8066N3593j3004L2761
$$ 165265 24674 207931 363187 367049 536604 886336 897018 925084 978677 965673 998434
17163I98434J20230m2995J25100Q3296R5363K09464K60821q60J22155L00430L35801
$$ 998434 1118664 1075669 1200769 1284065 1379428 1588892 1849713 1848853 1971008 2271438 2607239
17152B607239J95269K26463K53091J75846q2141k33399k60432j55338k55184Q7418
$$ 2607239 2802508 3028971 3282062 3457908 3375767 3142368 2881936 2726598 2471414 2558832
17142B558832P939K4551M8461j50864j83630J90802N6970k35350l04176m55411
$$ 2558832 2566771 2591322 2639783 2488919 2305289 2496091 2553061 2317711 2013535 1558124
17132A558124l09205k57182j25507p5850J09353O8632m5172j20639k0124O1486
$$ 1558124 1248919 991737 866230 790380 899733 968365 923193 802554 782430 843916
17122H43916j44664k43611j11138J02720o110M6200J6598j5717P9838j4788P6207
$$ 843916 699252 455641 344503 447223 441113 487313 503911 488194 568032 553244 629451
17111F29451K02739J14021J11885P7235l1803p4571q2057J50676K5373n6700j96615
$$ 629451 832190 946211 1058096 1135331 1103528 1028957 946900 1097576 1122949 1066249 869634
17100H69634Q7627K32345J74043R0715K16074M89985N16056K50700J74324k50
$$ 869634 957261 1189606 1363649 1454364 1670438 2160423 2676479 2927179 3101503 3101253
17090C101253k07341n14641m05047l49861j61906j76047k46562m7573k2298k87914
$$ 3101253 2893912 2379271 1974224 1624363 1462457 1286410 1039848 992275 969977 682063
17080F82063k93753J965J16286K76032k3657j14434L8502K8767k6839j93583p5397
$$ 682063 388310 390275 506561 782593 758936 644502 683004 711771 684932 491349 415952
17069D15952j81609Q6205K4298m992P7650M0224n5497N1232J22240o6223q0290
$$ 415952 234343 320548 344846 339854 417504 457728 402231 453463 575703 509480 429190
17058D29190O1786n0439k4715r6489l0599p5743P5402K47755R7552q6532j10675
$$ 429190 490976 440537 415822 319333 288734 212991 288393 536148 633700 547168 436493
17047D36493j86502m013M948N0342L1181m5107j25585j56072o6102l2749Q6868
$$ 436493 249991 245978 250926 301268 332449 287342 161757 5685 -60417 -93166 -6298
17036f298j4236J03264J91637J26659j1022k30472j04432j43648o320P8603J03654
$$ -6298 -20534 82730 274367 401026 390004 159532 55100 -88548 -94868 -16265 87389
17025H7389m0466j19307K1849K25348m4737k3937K156R3512q9436j34085o0057
$$ 87389 46923 -72384 -50535 174813 130076 106139 108295 201807 112371 -21714 -81771
17014h1771n5383J00224K2748Q1170l7642j01753r9601O2775Q3964M075j47780
$$ -81771 -137154 -36930 -14182 66988 29346 -72407 -172008 -109233 -25269 -21194 -168974
17003a68974m6378J44134J24868O7463L8537o193j746m0854J21476n5627j26728
$$ -168974 -215352 -71218 53650 121113 159650 153457 151711 110857 232333 176706 49978
16992D9978m2856K6383M7495K31467M3127k09278j10952P7649k13416R242N1865
$$ 49978 7122 33505 81000 312467 355594 146316 35364 113013 -100403 -91161 -39296
16981c9296j49247Q4854q6844P7985J23733j57917J93808K08256J32167j04390
$$ -39296 -188543 -103689 -190533 -112548 11185 -146732 47076 255332 387499 283109
16971B83109j74490M131J1058j44698m4453O6186J2552r435p7998P0074Q7073
$$ 283109 108619 112750 123808 -20890 -65343 843 13395 3960 -74038 -3964 83109
16960H3109N1476l9794k49638L451J48225N1095M7350P6442N7750q5903j83844
$$ 83109 134585 94791 -154847 -151396 -3171 47924 95274 171716 229466 143563 -40281
16949d0281K5305m8399J37508J28392j13879l28312k5769J29797J63252J09977
$$ -40281 -14976 -63375 74133 202525 88646 -239666 -265435 -135638 27614 137591
16939A37591j35494L5654O5276j40856j12714J97914J0144j45100M2560m5141
$$ 137591 2097 37751 103027 -37829 -150543 47371 57515 -87585 -45025 -90166
16929i0166q2038J51072Q5813o1827m8119O202J14756P2277J3490J1576M523q7314
$$ -90166 -172204 -21132 64681 2854 -45265 -39063 75693 147970 161460 173036 177559 90245
16917I0245j33540O601M5257j09444j03015J01800J26570K1209M3688J0037Q5383
$$ 90245 -43295 -36694 8563 -100881 -203896 -102096 24474 45683 89371 99408 184791
16906A84791k8889M3587O3837k03488j58059j24485j4842J21412J79257K9154
$$ 184791 155902 199489 263326 59838 -98221 -222706 -237548 -116136 63121 92275
16896I2275N6939N2671k45646n1238K29764J26265J73472k8897k67105k25771
$$ 92275 149214 201885 -43761 -94999 134765 261030 434502 405605 138500 -87271
16886h7271l3492N6875N0187J67571Q836J05163j62316j25844j94221J01846p799
$$ -87271 -120763 -63888 -13701 153870 162706 267869 105553 -20291 -214512 -112666 -120465
16875a20465M1872p3725J44174J912q8061r8634R3341r642P9051l7462J76584
$$ -120465 -78593 -152318 -8144 -6232 -94293 -192927 -99586 -109228 -30177 -67639 108945
16864A08945j05501m4401J62065l8597j75467m8512L0131Q5551N6918J16381M493
$$ 108945 3444 -40957 121108 82511 -92956 -141468 -111337 -25786 31132 147513 152006
16853A52006j9791j29855j51599J00817J77734j34392P0127L2506l3346o4261
$$ 152006 132215 2360 -149239 -48422 129312 -5080 65047 97553 64207 -54
16843e4j65607K9830j62913l3285P0118K58914J70147M429l773p6881l5805O2776
$$ -54 -165661 -135831 -298744 -332029 -261911 -2997 167150 171579 167806 90925 55120 117896
16831A17896j4455j54103j13296p848Q4710K0766m4318p3136k2587Q9336R9588
$$ 117896 103441 -50662 -163958 -171806 -87096 -66330 -110648 -183784 -206371 -117035 -17447
16820a7447j42897j06998j0032p7768J57940L4993O9904K37r0888Q4396J04194
$$ -17447 -160344 -267342 -277374 -355142 -197202 -162209 -92305 -92068 -182956 -98560 5634
16809E634L2767j21971j68789J4617J16521J43138M9029l0624l24442j82974K02097
$$ 5634 38401 -83570 -252359 -237742 -121221 21917 70946 40322 -284120 -467094 -264997
16798b64997J27725J66803k209j16579l9429J26881l3409L1068P907j37206k0566
$$ -264997 -137272 29531 27322 -89257 -128686 -1805 -35214 -4146 3761 -133445 -154011
16787a54011N3052Q3606J72057J05087p8729r8366j29550p3946j0057j42077p1585
$$ -154011 -100959 -17353 154704 259791 181062 82696 -46854 -120800 -130857 -272934 -344519
16776c44519l4133n9999J69782K02019P1831O9362J34251q8818k53033j37636
$$ -344519 -378652 -438651 -268869 -66850 4981 74343 208594 119776 -133257 -270893
16766b70893k1547K44174J49303l6407j23320j01629p1969p2928K8770M6198q0473
$$ -270893 -292440 -48266 101037 64630 -58690 -160319 -232288 -305216 -276446 -230248 -310721
16755c10721O79j0204K02226Q1309q8519R83K0432K0491J37501M448J66515k2882
$$ -310721 -310042 -320246 -118020 -36711 -125230 -124247 -103815 -83324 54177 58625 225140 202258
16743B02258j59905r635j32061J77977N0993R0836Q6232l54728o0210j09933j03611
$$ 202258 42353 32718 -99343 78634 129627 220463 306695 -48033 -108243 -218176 -321787
16732c21787K29720K18915M9997M1418R0434o8248o0789K2216l4124P3731N062
$$ -321787 -92067 126848 176845 218263 308697 240449 179660 201876 167752 241483 246545
16721B46545j36858Q9747L8666k9293l2719M2930L8463j48709j32021L0441O2921
$$ 246545 109687 199434 238100 208807 176088 219018 257481 108772 -23249 7192 70113
16710G0113Q1319L4195r4119P768j08019J65358K8310j2963o9088k88404n2091
$$ 70113 151432 185627 91508 99276 -8743 156615 184925 171962 102874 -185530 -237621
16699b37621J60273M0357j3315j58757m4189k2329J95097J71700j21786j02953
$$ -237621 -77348 -36991 -50306 -209063 -253252 -275581 -80484 91216 -30570 -133523
16689a33523J10171P9164k6720j54866r7261P4413J75875N7824n1893P1739L7371
$$ -133523 -23352 55812 29092 -125774 -223035 -148622 27253 85077 33184 104923 142294
16678A42294r9227o3129K5247N8699k1059L4943M7477L8948P5157Q4954K878j52797
$$ 142294 43067 -20062 5185 63884 42825 77768 125245 164193 239350 324304 327182 174385
16666A74385j77063j1328J3628j62557j6460J01713j1580K09924Q353j12020j71187
$$ 174385 -2678 -14006 -378 -162935 -179395 -77682 -89262 120662 129015 16995 -154192
16655a54192m3460l908K9140J5350Q0504m18P8259J57696p9593j06907N398L0563
$$ -154192 -197652 -201560 -172420 -157070 -76566 -76984 1275 158971 79378 -27529 -22131 8432
16643H432K27382j24294q5251M8519O7798n074J02670P4620n6141j88394m1422
$$ 8432 235814 111520 26269 74788 142586 137512 240182 314802 258661 70267 28845
16632B8845J7261J08402L5029r9358l28453j72554m3886R9225o8254K8700J44220
$$ 28845 46106 154508 189537 90179 -238274 -410828 -454714 -355489 -423743 -395043 -250823
16621b50823q0459J5619J24577o3576K4980Q1532k2816L4174j05392r6566J43371
$$ -250823 -331282 -315663 -191086 -254662 -229682 -148150 -170966 -136792 -242184 -338750 -195379
16610a95379J54685K13488j67555r5254N6418O0819N9804r6206J18879J44595
$$ -195379 -40694 172794 5239 -90015 -33597 27222 87026 -9180 109699 254294
16600B54294q5642m1149J48558J18244l28083l32840j0506M3485R5158J4883M1562
$$ 254294 168652 127503 276061 394305 66222 -266618 -277124 -233639 -138481 -123598 -82036
16589h2036K1894j7792N6762O5718j51721M6529J05205j35796N1548O9145q1210
$$ -82036 -60142 -77934 -21172 44546 -107175 -60646 44559 -91237 -39689 29456 -51754
16578e1754J066k097K14849M6158j17888m8503k6165N4424P817m4983N7966N8594
$$ -51754 -50688 -52785 162064 208222 90334 41831 15666 70090 77907 32924 90890 149484
16566A49484L5986q0117r5218o2131l4470N6112J79438q4077j94729j31194l0686
$$ 149484 185470 105353 10135 -51996 -86466 -30354 149084 65007 -129722 -260916 -291602
16555b91602J04943J4450j9613j9179J54532J72225j49356k0341K22809K9401
$$ -291602 -186659 -172209 -191822 -211001 -56469 115756 -33600 -53941 168868 198269
16545A98269m9870J0504r4167l8790l8155Q9388m5811p0912M7222P5267r1439
$$ 198269 148399 158903 64736 25946 -12209 77179 31368 -39544 7678 82945 -8494
16534h494J5622j03817o3617n8060R9089J3877J12036k691l8802o2292Q8762j98857
$$ -8494 7128 -96689 -160306 -218366 -119277 -105400 6636 3945 -34857 -97149 -8387 -207244
16522b07244K453P6262J03610q5788j24110n2506K12217j9302o2352j49474N5468
$$ -207244 -204791 -128529 -24919 -110707 -234817 -287323 -75106 -94408 -156760 -306234 -250766
16511b50766n1170m5299l0310j56592J79007K30633O9284q2791k05727K16750
$$ -250766 -301936 -347235 -377545 -534137 -355130 -124497 -55213 -138004 -343731 -126981
16501a26981L33796J77255Q121j47614k29937N9213N3330N5816j18654j63765
$$ -126981 206815 384070 392191 244577 14640 73853 127183 182999 64345 -99420
16491i9420Q724l0551j36706m2564J70503K90343o7868j0726K25501q0782j61417
$$ -99420 -90696 -121247 -257953 -300517 -130014 160329 92461 81735 307236 226454 65037
16480F5037J54622j37822j23325Q8195R5957P210k7096j63581k9328K9534M2995
$$ 65037 219659 81837 -41488 46707 142664 149874 122778 -40803 -70131 -40597 2398
16469B398J21024J81082k3745k11679j47015m488J9290j18722j29968J75351J43306
$$ 2398 123422 304504 280759 69080 -77935 -82423 -63133 -181855 -311823 -136472 6834
16458F834J53424k7608j37117k5821J01945Q8916M8724r6504o1116O949n3080
$$ 6834 160258 132650 -4467 -30288 71657 160573 209297 112793 51677 58626 5546
16447E546M93O4206j5901R319j3161P0103r2715m3167O7530j55840j6749K0399
$$ 5546 6039 70245 54344 63663 50502 120605 27890 -15277 52253 -103587 -120336 -99937
16435i9937j7051O0098O2424o2054k5542p0803j57364J09282K38869J72466P5102
$$ -99937 -116988 -56890 5534 -56520 -82062 -152865 -310229 -200947 37922 210388 285490
16424B85490o0681k45987j62003J13796J51959p3915n0523O2340k56957j05134
$$ 285490 224809 -21178 -183181 -69385 82574 8659 -41864 20476 -236481 -341615
16414c41615J9345O4135J77660P3945k1000K0995m3995j20427l6356N9261R0035
$$ -341615 -322270 -258135 -80475 -6530 -27530 -6535 -50530 -170957 -207313 -148052 -58017
16403e8017N0597j02598r9252K5474N9231J64880J5625q2054j90930M2623K25724
$$ -58017 -7420 -110018 -209270 -183796 -124565 40315 55940 -26114 -217044 -174421 51303
16392E1303P0094R6378j42868j24313j09824R0503J14704J15063O4481M415k2579
$$ 51303 121397 217775 74907 -49406 -159230 -68727 45977 161040 225521 229936 207357
16381B07357K2104j10368j30688j2188J34516J10666o3618k02504M044k332N3896
$$ 207357 229461 119093 -11595 -23783 110733 221399 157781 -44723 -40679 -43011 10885
16370A0885L9154q4261p9779j3532J48229L8758m1945j12938R7207J68073p8148
$$ 10885 50039 -34222 -114001 -127533 20696 59454 17509 -95429 1778 169851 91703
16359I1703m7240O5253K5440m7860R028j66114j985O9509j62538j21K32838K23981
$$ 91703 44463 109716 135156 87296 96324 -69790 -71775 -2266 -164804 -164925 67913 291894
16347B91894K4434k7108j4661j77815p9211N5199j88836m0947O1163M6636Q6224
$$ 291894 316328 289220 274559 96744 17533 72732 -116104 -157051 -95888 -49252 36972
16336C6972k05757N1895o7360j64114J91058J67491j07481R3586K81750p096k83518
$$ 36972 -168785 -116890 -184250 -348364 -157306 10185 -97296 -3710 278040 270944 -12574
16325a2574o0361J82969P6104j47622k04378j00353K46651o8781p523J48791L4052
$$ -12574 -72935 110034 186138 38516 -165862 -266215 -19564 -88345 -95868 52923 86975
16314H6975j17514m8437J09064J61298M958n2972j63312j17447k1945m4947O4634
$$ 86975 -30539 -78976 30088 191386 196344 143372 -19940 -137387 -159332 -204279 -139645
16303a39645r8916j5965o5789O9714M4509J17762j25373K6947J67349P8517O5442
$$ -139645 -238561 -254526 -320315 -250601 -206092 -88330 -213703 -186756 -19407 59110 124552
16292A24552L0057J35378j26371k34138J40852O6879j1834m2127k9916M1432J22871
$$ 124552 154609 289987 163616 -70522 70330 137209 125375 83248 53332 94764 217635
16281B17635O7730p9513m9487J1924P7494k02768k25430K0078N2150n8459n1767
$$ 217635 285365 205852 156365 168289 245783 43015 -182415 -162337 -110187 -168646 -220413
16270b20413Q5619q6144O908K51035J45522N4233n5020p4465L2400j9112l485
$$ -220413 -134794 -220938 -214030 37005 182527 236760 181740 107275 139675 120563 117078
16259A17078o8230Q6104J78913J1319j15581j03436O4871J730J6389J73177o9344
$$ 117078 48848 134952 313865 325184 209603 106167 171038 172768 189157 362334 292990
16248B92990j67953k1347k24260j31676K6342P8437J77927m5509j70811o0062
$$ 292990 125037 103690 -120570 -252246 -225904 -147467 30460 -15049 -185860 -245922
16238b45922O4530K13251J11084K5719k5664j11544n644L1898j02671j4087J2705
$$ -245922 -181392 31859 142943 168662 142998 31454 25810 57708 -44963 -59050 -46345
16227d6345J40692j24158j18826K12849N2586l36039n1458J82624J64766J49923
$$ -46345 94347 -29811 -148637 64212 116798 -219241 -270699 -88075 76691 226614
16217B26614n8264j354M1987m4081j71565o5205q6216O4595J16364p70P351k0880
$$ 226614 168350 166996 208983 164902 -6663 -71868 -158084 -93489 22875 22105 29456 8576
16205H576K2307K7900j49895m248J40666N2668j35841j20377J2307N8053j5954
$$ 8576 30883 58783 -91112 -95360 45306 97974 -37867 -158244 -145937 -87884 -103838
16194a03838k5184J83894N4896k1728J6566o902n4835j3239J79319j22835j30844
$$ -103838 -129022 54872 109768 88040 104606 97704 42869 29630 208949 86114 -44730
16183d4730p9218N0072K7336M8664J15845O1930j19865J18446O7818j68292k09995
$$ -44730 -123948 -73876 -46540 2124 117969 179899 60034 178480 246298 78006 -131989
16172a31989j76946P8799M2542K1341p9655j39842J08039L31932J60907K1427
$$ -131989 -308935 -230136 -187594 -166253 -245908 -385750 -277711 54221 215128 236555
16162B36555k27317k13756J8194R3660J58722J73917N0562j72035j45067j03904
$$ 236555 9238 -204518 -186324 -92664 66058 239975 290537 118502 -26565 -130469
16152a30469j71793j4375J35550K01186M4717m6117k0463R7311q6144R4907K35554
$$ -130469 -302262 -316637 -181087 20099 64816 18699 -1764 95547 9403 104310 339864
16141C39864k5720N6553l0316j15344r6259J3597J04519N2022J17049J15535k30096
$$ 339864 314144 370697 340381 225037 128778 142375 246894 298916 415965 531500 301404
16130C01404k18594n8004j1948j29127j06020k5481J72905l546O9908k3954k02311
$$ 301404 82810 24806 12858 -116269 -222289 -247770 -74865 -78411 -8503 -32457 -234768
16119b34768k9595R3587P3034o8371P5596q13p3000O8644L4229J05400j21215
$$ -234768 -264363 -170776 -97742 -166113 -90517 -91330 -164330 -95686 -61457 43943 -77272
16108g7272l5946L03837L14299j29689r2926j05166q2951j56741j49982K2385
$$ -77272 -113218 190619 504918 375229 282303 177137 94186 -62555 -212537 -190152
16098a90152J03363N4832m5582J60041K8414j25680J2870l9315o4153K6351k0436
$$ -190152 -86789 -31957 -77539 82502 110916 -14764 -1894 -41209 -105362 -79011 -99447
16087i9447j14525N2795J35754k5617k24659J96024J14570o8275J15705p996M7493
$$ -99447 -213972 -161177 -25423 -51040 -275699 -79675 34895 -33380 82325 74329 121822
16076A21822j20908m2772N2378M203K9331j04567N7882L8067j54874Q0360O7951
$$ 121822 914 -41858 10520 14723 44054 -60513 -2631 35436 -119438 -39078 28873
16065B8873J8642o0314J9371L5838j65320j38420n7513J5666J36878J61615l8761
$$ 28873 47515 -12799 6572 42410 -122910 -261330 -318843 -303177 -166299 -4684 -43445
16054d3445j72796j74274j8490P1807J12577j68156j22814J42011J33351K8074
$$ -43445 -216241 -390515 -409005 -337198 -224621 -392777 -515591 -373580 -240229 -212155
16044b12155L2198p8905J1118R1506N8960J41311J48049n0323J16015M5729N1338
$$ -212155 -179957 -258862 -247744 -156238 -97278 44033 192082 141759 257774 303503 354841
16033C54841m8717k19010l4683K5661m0298J59312n6657l6681O1383o9852K0248
$$ 354841 306124 87114 52431 78092 37794 197106 140449 103768 165151 95299 115547
16022A15547o3848o9914p1743P569p0353J15049Q4107O4321j4810j53136o3711
$$ 115547 51699 -18215 -89958 -82389 -152742 -37693 46414 110735 95925 -57211 -120922
16011a20922O4714k5579J51911l7310j17760R1929P4075M5080N4652j12787j42659
$$ -120922 -56208 -81787 70124 32814 -84946 6983 81058 126138 180790 68003 -74656
16000g4656J32581N175l797l2261k3981N716n724n6720q0852j16188q6622J55259
$$ -74656 57925 63100 59303 27042 3061 8777 3053 -53667 -134519 -250707 -337329 -182070
15988a82070K0938K4803p5929O1003N8321o5909J24021R7039M0182r1616r550
$$ -182070 -161132 -136329 -212258 -151255 -92934 -158843 -34822 62217 102399 10783 1233
15977A233r3972j64280o9193J69671P0725P5105K2406n0691J06894O825L5386
$$ 1233 -92739 -257019 -326212 -156541 -85816 -10711 11695 -38996 67898 74723 110109
15966A10109J08282N2269j46668N4477q2923N276L1941L7781m4154j87380l003
$$ 110109 218391 270660 123992 178469 95546 100822 132763 170544 126390 -60990 -63993
15955f3993J79781M5900j21199O7287p0117j40373P805o052j10834J16364Q500
$$ -63993 115788 161688 40489 107776 37659 -102714 -94909 -100961 -211795 -95431 -86931
15944h6931R6310O567o7670m6535o1528M4775J26069J92060J44063l3389p7316
$$ -86931 9379 15946 -51724 -98259 -159787 -115012 11057 203117 347180 313791 236475
15933B36475j00281J3359P0749N6688j01262r0076q6269p5517j01666J8606j03997
$$ 236475 136194 149553 220302 276990 175728 85652 -617 -76134 -177800 -159194 -263191
15922b63191O9381m7965M6125J00995J34825N0229N2877j2154k5320J47434J86819
$$ -263191 -193810 -241775 -195650 -94655 40170 90399 143276 131122 105802 253236 440055
15911D40055j53475k24659M7264K153j19470j22743P320J86956p2295O368j34591
$$ 440055 286580 61921 109185 111338 -8132 -130875 -123555 63401 -8894 -2526 -137117
15900a37117L3462r1407k4181M240K20231J45907L4143j40505K8414M6107j06807
$$ -137117 -103655 -195062 -219243 -215003 5228 151135 185278 44773 73187 119294 12487
15889A2487R6435l649p3745q7378p1900J44970o2854P6423J04520n4907Q7293
$$ 12487 108922 105273 31528 -55850 -127750 17220 -45634 30789 135309 80402 167695
15878A67695P07j64598q7260J05654j6276M8728j52808m8901Q5341Q8905j13116
$$ 167695 168402 3804 -83456 22198 5922 54650 -98158 -147059 -61718 27187 -85929
15867h5929p8118j23840O9349R8157j5497O1951L0146o006l8228j48358q2789
$$ -85929 -164047 -287887 -218538 -120381 -135878 -73927 -43781 -49787 -88015 -236373 -319162
15856c19162L8784L4594J15519J08599j43382o6325l5292J86434J07216p3610
$$ -319162 -280378 -245784 -130265 -21666 -165048 -231373 -266665 -80231 26985 -46625
15846d6625k0132l0618o9858K8931P4213J58206J32454k5628q5668J28682k8787
$$ -46625 -66757 -97375 -167233 -138302 -64089 94117 226571 200943 115275 243957 215170
15835B15170j41020l9225k52823m0729J51871r5314N1729O8706P1545L4452q912
$$ 215170 74150 34925 -217898 -258627 -106756 -202070 -150341 -81635 -10090 24362 15450
15824A5450J42509R9612l9068L3375r887j21615p8794J3333o4067K07829j11599
$$ 15450 157959 257571 218503 251878 241991 120376 41582 54915 -9152 198677 87078
15813H7078j11068K5195J79656M9705j00018j72008k52208K5009J89941J50471
$$ 87078 -23990 1205 180861 230566 130548 -41460 -293668 -268659 -78718 71753
15803G1753k7114j12416p1730n471J07m5547k8830J35815L4898j1424m0988p5064
$$ 71753 44639 -67777 -139507 -144978 -144871 -190418 -219248 -83433 -48535 -59959 -100947 -176011
15791a76011q708J57322K3082j33751J79089P513M9300j08562m9427J93241J87823
$$ -176011 -184719 -27397 -4315 -138066 41023 48536 97836 -10726 -60153 133088 320911
15780C20911j35943r7802j40432q0940J18355O6208O6743M6215n3236r0665M0874
$$ 320911 184968 87166 -53266 -134206 -15851 50357 117100 163315 110079 19414 60288
15769F0288j5921M0633J73804Q0487P8760o3738k31052j74185k211K13002o9277
$$ 60288 44367 85000 258804 339291 418051 354313 123261 -50924 -53135 159867 90590
15758I0590m3286P1021P767p5687Q7025K63061N3143j71288j36914r020O9389
$$ 90590 47304 118325 126092 50405 137430 400491 453634 282346 145432 136412 205801
15747B05801p9054p6284J01810n5335r710j38421l3865P8326k03249j02660P0658
$$ 205801 126747 50463 152273 96938 87228 -51193 -85058 -6732 -209981 -312641 -241983
15736b41983J09550N1658L2699k4911j8570k03507J645J71896K47986N7039j40600
$$ -241983 -132433 -80775 -48076 -72987 -91557 -295064 -293419 -121523 126463 183502 42902
15725D2902o5863N6966J5454j43077J73246L3249q1170N3151K34872O0606j57966
$$ 42902 -22961 34005 49459 -93618 79628 112877 31707 84858 319730 380336 222370
15714B22370q8679r8054l9267k1864K5746O2894n6104J39115m7188j15812K843
$$ 222370 133691 35637 -3630 -25494 252 63146 7042 146157 98969 -16843 -14000
15703a4000k1548l6913m0574L1524J85652K1337n884j6126j01092r0249J44628
$$ -14000 -35548 -72461 -113035 -81511 104141 125478 119594 103468 2376 -87873 56755
15692E6755j9919m7645L409o8218O2594M1263q1733j61008J20136l128R2805J99548
$$ 56755 36836 -10809 -7400 -75618 -13024 28239 -53494 -214502 -94366 -97494 -4689 194859
15680A94859J9284p1798l9211p226N2955j25099j0569M1144L6483J3857R1360
$$ 194859 214143 142345 103134 95908 148863 23764 13195 54339 90822 104679 196039
15669A96039K856j1558o2962N6552n15j1209J9890o2956l7989J3882P9869n1470
$$ 196039 198895 187337 124375 180927 180412 169203 189093 126137 88148 102030 181899 130429
15657A30429j443P586j08215l5673m0884J4383J07788Q0686P2323j3139k00730
$$ 130429 128986 136572 28357 -7316 -48200 -33817 73971 154657 226980 213841 13111
15646A3111j29721J1768M6070j6890j2178J00940m553j07313M5218R750O95J65192
$$ 13111 -116610 -104842 -58772 -75662 -87840 13100 8547 -98766 -53548 -43798 -43103 122089
15634A22089J21829n1408p6394j05917j554o7629j76478O8743J34793m7902o0480
$$ 122089 243918 192510 116116 10199 8645 -58984 -235462 -166719 -31926 -79828 -140308
15623a40308L3819J4470j47184j44208P0231K8052j5704J42951P2114J25713K7454
$$ -140308 -106489 -92019 -239203 -383411 -313180 -285128 -300832 -157881 -85767 39946 67400
15612F7400P9998J5171j82948j78961k5320L6592l9520M7321p626N9611m558J23667
$$ 67400 147398 162569 -20379 -199340 -224660 -188068 -227588 -180267 -187893 -128282 -132840 -9173
15600i173J03415J00467P4513m3383j77378J8838j61638j2735j79963J51440J92223
$$ -9173 94242 194709 269222 225839 48461 67299 -94339 -107074 -287037 -135597 56626
15589E6626J5559n0146K480M8691o081R312J3758O5317K4526J2719p096j0309
$$ 56626 72185 22039 24519 73210 67129 76441 90199 155516 180042 192761 185665 175356
15577A75356L0917p7540r2737L2721l9829n6533J3691o6211O3290Q9592J11666
$$ 175356 206273 128733 35996 68717 28888 -27645 -13954 -80165 -16875 72717 184383
15566A84383k418K7628j9166J9555j64182n0346J4016o3808J61482J79148l303
$$ 184383 181965 209593 190427 209982 45800 -4546 9470 -54338 107144 286292 282989
15555B82989k04104j48793Q5763p0276r850p686J76618J23519K1930j68953k07888
$$ 282989 78885 -69908 15855 -54421 -64271 -71957 104661 228180 250110 81157 -126731
15544a26731J046k2280l7028N2103o9950K50042L1494k3136o4858K5935M7894
$$ -126731 -125685 -147965 -184993 -132890 -202840 47202 78696 55560 -9298 16637 64531
15533F4531N0960q8691J01098j24673k7583M2798R3886o5456l9146j4138Q1204
$$ 64531 115491 26800 127898 3225 -24358 18440 112326 46870 7724 -6414 74790
15522G4790l7463J5481K1092j53998l39N1075K1944L3088j6280o7589n9307r7072
$$ 74790 37327 52808 73900 -80098 -80437 -29362 -7418 25670 9390 -58199 -117506 -214578
15510b14578j63633q3623K41228J08266J3321L3035Q5416K0241M1379j28730r2337
$$ -214578 -378211 -461834 -220606 -112340 -99019 -65984 19432 39673 81052 -47678 -140015
15499a40015P9908m9179L1222O9226j86314j04614P080J25338m5964j09608J73705
$$ -140015 -60107 -109286 -78064 -8838 -195152 -299766 -292686 -167348 -213312 -322920 -149215
15488a49215K1522k3090l1015J60367J19949K5668N5641Q4617p7272k98222j34103
$$ -149215 -127693 -150783 -181798 -21431 98518 124186 179827 264444 187172 -111050 -245153
15477b45153q5619o911P9729L513o597R120J02882J96284p1761j79687Q077p8193
$$ -245153 -330772 -337683 -257954 -254441 -261038 -251918 -149036 47248 -24513 -204200 -196123 -274316
15465b74316m7423J14139J88585l2356j13730m714R6610R356p1294J05125m4177
$$ -274316 -321739 -207600 -19015 -51371 -165101 -169815 -73205 -63849 -135143 -30018 -74195
15454g4195O6136n0055R6591k6007j13756k7943L0737J02854M0722q4283o3648
$$ -74195 -8059 -58114 38477 12470 -101286 -129229 -98492 4362 45084 -39199 -102847
15443a02847J21507l7229j73230r5054L7019O4695J6505J37590J59896m8691k0498
$$ -102847 18660 -18569 -191799 -286853 -249834 -185139 -168634 -31044 128852 80161 59663
15432E9663L08J41901N35n1660j12406n4940P3672M3167L3418R2104j48694j30416
$$ 59663 59971 201872 202407 150747 38341 -16599 57073 100240 133658 225762 77068 -53348
15420e3348l890K1848J17037k21515n8393M178M1004J56518N0074q4770r514O2577
$$ -53348 -57238 -35390 81647 -139868 -198261 -194083 -153079 3439 53513 -31257 -40771 21806
15408B1806J2844j6136r8941R569K1483r2731L6835K02822L4843j06173j08764
$$ 21806 34650 18514 -80427 -70858 -49375 -142106 -105271 97551 132394 26221 -82543
15397h2543k5612J45784M8695o780N9394k4085K3700P2105j07605k2696J15037
$$ -82543 -108155 37629 86324 79544 138938 114853 138553 210658 103053 80357 195394
15386A95394M7610R7983j83747n5778K0893l9306j52500l4017R9942m3397J07035
$$ 195394 243004 340987 157240 101462 122355 83049 -69451 -103468 -3526 -46923 60112
15375F0112J0376q0424N0864N2260J19863J18509q9832j62308j83712K24904O2504
$$ 60112 70488 -9936 40928 93188 213051 331560 241728 79420 -104292 120612 183116
15364A83116j71511p158j632L300k36670j28900N0068L8861J95495O1338r7968
$$ 183116 11605 4447 2815 6115 -230555 -359455 -309387 -270526 -75031 -13693 -111661
15353a11661L9363J48154K27036J40377j26436k05775O1299P1606j07029k4217
$$ -111661 -72298 75856 302892 443269 316833 111058 172357 243963 136934 112717
15343A12717M103K44365r719k85554j86499J16697r2641p0560J55750K4099J38101
$$ 112717 116820 361185 351466 65912 -120587 -3890 -96531 -167091 -11341 12758 150859
15332A50859m7219j12209Q7056J31379j08719j30167r1493m0099P8878J83385
$$ 150859 103640 -8569 78487 209866 101147 -29020 -120513 -160612 -81734 101651
15322A01651j53405k31538l8596J6237K4085j21884J4985J8277J27279J89227
$$ 101651 -51754 -283292 -321888 -305651 -281566 -403450 -388465 -370188 -242909 -53682
15312e3682Q8921J22478R4487j68202k1648K27226q1914j63116J06734K2823j77824
$$ -53682 35239 157717 252204 84002 62354 289580 207666 44550 151284 174107 -3717
15301c717N6617m9057q4381J8242L0451r2495J1171P0122J23087N8954j15306
$$ -3717 52900 3843 -80538 -62296 -31845 -124340 -113169 -43047 80040 138994 23688
15290B3688l0568L215m5509j2771L5228M6453Q6919j03675j55449Q5894J6017
$$ 23688 -6880 -3665 -49174 -61945 -26717 19736 106655 2980 -152469 -66575 -50558
15279e0558O553j14128N7402J58336M4189R2304J30698O0557j65210q3738o7420
$$ -50558 -44005 -158133 -100731 57605 101794 194098 324796 385353 220143 136405 68985
15268F8985k5087M2604r1242J8410M794j39035J43605k614j95524n9990q3584
$$ 68985 43898 86502 -4740 13670 18464 -120571 23034 20420 -175104 -235094 -318678
15257c18678M6193J75532O9946l787J24672K7929O5906Q1810k4611k85706p6205
$$ -318678 -272485 -96953 -27007 -30794 93878 121807 187713 269523 244912 -40794 -116999
15246a16999J25762J9042k1253R9252m4593j90840j10506J28586L6720j9912p6551
$$ -116999 8763 27805 6552 105804 61211 -129629 -240135 -111549 -74829 -94741 -171292
15235a71292Q0655K07430J24241K9089j20689q1097Q8540J1315j42401O3035j03825
$$ -171292 -90637 116793 241034 270123 149434 68337 156877 168192 25791 88826 -14999
15224a4999M9121K9046n9085L9786K7632J6633j6100k65717j45508K28722P5181
$$ -14999 34122 63168 4083 43869 71501 88134 72034 -193683 -339191 -110469 -35288
15213c5288J91975o7990p2014M4202q8947j71757L7018J22306M8732m7j57795
$$ -35288 156687 88697 16683 60885 -28062 -199819 -162801 -40495 8237 8190 -149605
15202a49605J7587P1570J6816l1257J34544j20412j75194J6314J98043r895m5216
$$ -149605 -132018 -60448 -43632 -74889 59655 -60757 -235951 -219637 -21594 -31489 -76705
15191g6705J06161m5432Q0274q9302o3576R1195L4852J31210j37336k17789J22
$$ -76705 29456 -15976 64298 -25004 -88580 2615 37467 168677 31341 -186448 -186326
15180a86326P0644N220j58524k04394Q9252J18227K10947N8678J15411n1657m8919
$$ -186326 -115682 -110462 -268986 -473380 -384128 -265901 -54954 3724 119135 67478 18559
15169A8559j0968O9467j36573r8262J37p2184M5166K9233K00390r5909j00730
$$ 18559 7591 77058 -59515 -157777 -157640 -229824 -184658 -155425 44965 -50944 -151674
15158a51674J04941j16886m1451J21092J23587J26807K6341j43495j15012q6843
$$ -151674 -46733 -163619 -205070 -83978 39609 166416 192757 49262 -65750 -152593
15148a52593J3993j5346j6034o0961r090Q7928K0561J57927n8866Q70q188j14279
$$ -152593 -138600 -153946 -169980 -230941 -240031 -152103 -131542 26385 -32481 -31611 -39799 -154078
15136a54078R3442P2257j55074m9011P2736Q9657l7226J63062L2694O7715n0980
$$ -154078 -60636 11621 -143453 -192464 -119728 -30071 -67297 95765 128459 196174 145194
15125A45194Q4548Q5038j76287j64973o7315m3412O3317L2789L2028j21610J45081
$$ 145194 229742 314780 138493 -26480 -93795 -137207 -73890 -41101 -9073 -130683 14398
15114A4398J34253j17373k06201Q6147L7388J7802J17555m3751P9699J42738m2575
$$ 14398 148651 31278 -174923 -88776 -51388 -33586 83969 40218 119917 262655 220080
15103B20080j54974n2158o6074k3379k1333j0744j12730j6571N9592Q5046J18465
$$ 220080 65106 12948 -53126 -76505 -97838 -108582 -221312 -237883 -178291 -93245 25220
15092B5220N3485p6038j78572M7295R5787L5966j00396J06437p5623k5388J77889
$$ 25220 78705 2667 -175905 -128610 -32823 3143 -97253 9184 -66439 -91827 86062
15081H6062J05081r2347j82051l7725J70249N4440j03953k7914j18625k1437O3911
$$ 86062 191143 98796 -83255 -120980 49269 103709 -244 -28158 -146783 -168220 -104309
15070a04309K55617J2549q9889q7684K3309K6586J28107j9125j33623K8072J65735
$$ -104309 151308 163857 73968 -13716 9593 36179 164286 145161 11538 39610 205345
15059B05345Q9471l1550j41048J27030q0108j4640o4036K36698R8289M0341J3054
$$ 205345 294816 263266 122218 249248 169140 154500 90464 327162 425451 465792 478846
15048D78846j57322r0479P988j08332k0002J66893L5661o8338J30251N1446k77002
$$ 478846 321524 231045 239033 130701 110699 277592 313253 244915 375166 426612 149610
15037A49610j08111K3962j7863m4071m0335Q5248o1822j52778J23368p158L321
$$ 149610 41499 65461 47598 3527 -36808 48440 -13382 -166160 -42792 -49950 -46629
15026d6629j3335J16901N4337j16013L4619O2430J48075Q9550q260j91257j66206
$$ -46629 -59964 56937 111274 -4739 29880 92310 240385 329935 321675 130418 -35788
15015c5788l8636M3065p6683m7970J49335K4392k43523M4866J06310J89090j4262
$$ -35788 -74424 -31359 -108042 -156012 -6677 17715 -225808 -180942 -74632 114458 100196
15004A00196j61305l0688J23558J12972k54271j20595J77755L8824J82313N4356
$$ 100196 -61109 -91797 31761 144733 -109538 -230133 -52378 -13554 168759 223115
14994B23115j56727k16401k9504N861l3367p1419K55946K01200q468j50717L9904
$$ 223115 66388 -150013 -179517 -173656 -207023 -278442 -22496 178704 170236 19519 59423
14983E9423o1345o4360j12435J07941J89165q4091M2268R6291k5787j9254J10989
$$ 59423 -1922 -66282 -178717 -70776 118389 34298 76566 172857 147070 127816 238805
14972B38805j38541j38669O0236J75559O2416j44192p5416Q1065M7777q5351j03411
$$ 238805 100264 -38405 21831 197390 259806 115614 40198 121263 169040 83689 -19722
14961a9722q2575O9356J89626o9183l9248k0690M8653P5118o420j54966M345j50476
$$ -19722 -102297 -32941 156685 87502 48254 27564 76217 151335 144915 -10051 -5706 -156182
14949a56182j70877J19481J80904N3744n082J24462l0991O774o8360j46833J68432
$$ -156182 -327059 -207578 -26674 27070 21988 146450 115459 122233 53873 -92960 75472
14938G5472J72959j1155r1297L842j309p2392j07872o0908q9575Q6053O8822N4680
$$ 75472 248431 237276 145979 149821 148512 76120 -31752 -92660 -182235 -96182 -27360 27320
14926B7320J8387o9322J793O6181N575K04231J04110K9080k6501p8322j08684
$$ 27320 45707 -23615 -21822 44359 49934 254165 358275 387355 360854 282532 173848
14915A73848m0986N1534j33364o5063j21073o3970J8823J16048j192k35930J49994
$$ 173848 132862 184396 51032 -14031 -135104 -199074 -180251 -64203 -65395 -301325 -151331
14904a51331P490J38239K44866n8657j94955l1288J6857j288N3661J7833o6438
$$ -151331 -143841 -5602 239264 180607 -14348 -45636 -28779 -30067 23594 41427 -25011
14893b5011j38610J20965j13349j89324J43326K7504L5811j1044P3453K9948j09612
$$ -25011 -163621 -42656 -156005 -345329 -202003 -174499 -138688 -149732 -76279 -46331 -155943
14882a55943m1160j0237o3606M1677J25877Q5790R1816j20927k24916q0994R5723
$$ -155943 -197103 -207340 -270946 -229269 -103392 -17602 74214 -46713 -271629 -352623 -256900
14871b56900K20728K17466r7277n3216j2304m9436q3608K1241J09166j1366O572
$$ -256900 -36172 181294 84017 30801 18497 -30939 -114547 -93306 15860 4494 11066
14860A1066j43027m8964P132K6958M6287J22081Q7215N6298J11383Q7632j2920
$$ 11066 -131961 -180925 -173793 -146835 -100548 21533 108748 165046 276429 364061 351141
14849C51141r6168L140l6789j15162Q6849o4602k4304J6448J3068k9372j13443
$$ 351141 254973 258113 221324 106162 193011 128409 104105 120553 133621 104249 -9194
14838i194L3181l1116L5169J8698j40330m9551n0957J3942l0641J83513R5540
$$ -9194 23987 -7129 28040 46738 -93592 -143143 -194100 -180158 -210799 -27286 68254
14827F8254l0522m3458k40280j23268K17297J6698n6461j29384l0936J39549J94597
$$ 68254 37732 -5726 -246006 -369274 -151977 -135279 -191740 -321124 -352060 -212511 -17914
14816a7914J35727R6478N5160k20754l2300R8241O9790j87504J63461j33677j28829
$$ -17914 117813 214291 269451 48697 16397 114638 184428 -3076 160385 26708 -102121
14805a02121k5522J76978J9209o5055p1952j08787m9764N9905j05382K46473j9362
$$ -102121 -127643 49335 68544 3489 -68463 -177250 -227014 -167109 -272491 -26018 -45380
14794d5380M5098k2839l8413K2912N9229L5044p5499j31231P2694R5357N1276
$$ -45380 -282 -23121 -61534 -38622 20607 55651 -19848 -151079 -78385 16972 68248
14783F8248J92391q8581j72340k20276M8833J80550k4793j0722j1520O4375O2239
$$ 68248 260639 172058 -282 -220558 -171725 8825 -15968 -26690 -38210 26165 88404
14772H8404j57364j01779J41009J67231p1191k51072j7564J15126R1135k1145
$$ 88404 -68960 -170739 -29730 137501 66310 -184762 -202326 -87200 3935 -17210
14762a7210q6134p1249J07123K06904J56987o6306j07641M0425L2914J594p7820
$$ -17210 -103344 -174593 -67470 139434 296421 230115 122474 162899 195813 197407 119587
14751A19587j37169n5819O5985J71266R9301j58522p8107P5193J57623j72074
$$ 119587 -17582 -73401 -7416 163850 263151 104629 26522 101715 259338 87264
14741H7264o2128K1502j62321j56165O6863M3685J19280K41652R5050k16135j1162
$$ 87264 25136 46638 -115683 -271848 -204985 -161300 -42020 199632 294682 78547 67385
14730F7385J49172K6043m556Q251L0931J39565J21050J63183k616j32071j49347
$$ 67385 216557 242600 238044 246295 277226 416791 537841 701024 698408 566337 416990
14719D16990j24135r4680k14349J40293n2001j67201q9713K5087Q1920R9858O4424
$$ 416990 292855 198175 -16174 124119 72118 -95083 -184796 -159709 -77789 22069 86493
14708H6493P0887R3440j48202j01633o5948m1384r1168J45209L3994k458J2541
$$ 86493 157380 250820 102618 985 -64963 -106347 -197515 -52306 -18312 -20770 -8229
14697h229M8280l1670M4596R2180m7495J07821J37223K2421j32087o5823r414
$$ -8229 40051 8381 52977 145157 97662 205483 342706 365127 233040 167217 157803
14686A57803l1530j44613k4801j8868O0715l3760L4434n7862j1631J4484J31187
$$ 157803 126273 -18340 -43141 -62009 -1294 -35054 -620 -58482 -70113 -55629 75558
14675G5558J37467l9063N2885l8253o4541k70039j57081K5857N5504N9212K50433
$$ 75558 213025 173962 226847 188594 124053 -145986 -303067 -277210 -221706 -162494 87939
14664H7939O8123Q0198r5110M4348j54680o203J3380m8167m3292j74669j653N6921
$$ 87939 156062 236260 141150 185498 30818 24615 37995 -10172 -53464 -228133 -229786 -172865
14652a72865L6696n3886l3060J79641j0608q4777L3903L539l6324N339J40194
$$ -172865 -136169 -190055 -223115 -43474 -54082 -138859 -104956 -101417 -137741 -132402 7792
14641G792J66992k4395R3811o4942k34671n5490J27291J07634j9371k5932N2540
$$ 7792 174784 150389 244200 179258 -55413 -110903 16388 124022 104651 78719 131259
14630A31259n5152j42008o0062k03893p9538Q2356J59678M873r6890K2906K98746
$$ 131259 76107 -65901 -125963 -329856 -409394 -327038 -167360 -162487 -259377 -236471 62275
14619F2275K12927p9246j88628j21066q5135n2765Q8425K33638J19860m5945o6354
$$ 62275 275202 195956 7328 -113738 -198873 -251638 -163213 70425 190285 144340 77986
14608G7986M6615m8545j35772p6298n1980J12518J54360m2588L6372n8597j23467
$$ 77986 124601 76056 -59716 -136014 -187994 -75476 78884 36296 72668 14071 -109396
14597a09396O118J34206j40168p6483J40978R7950r1075K456J71171r8459n8976
$$ -109396 -103278 30928 -109240 -185723 -44745 53205 -37870 -35414 135757 37298 -21678
14586b1678M9515J8633K8072N1917J18138Q3979J7670j5359p8726R9753j27060
$$ -21678 27837 46470 74542 126459 244597 328576 346246 330887 252161 351914 224854
14575B24854m6922M0735Q7682j54695O2372L5550O9444j6178j54241j12118j20530
$$ 224854 177932 218667 306349 151654 214026 249576 319020 302842 148601 36483 -84047
14564h4047j43587k8278J1623K5756m8469K0844P7375N6653J68998J44768K7413
$$ -84047 -227634 -255912 -244289 -218533 -267002 -246158 -168783 -112130 56868 201636 229049
14553B29049r2445p7872j19384J8809j17549l966r3470k0027K54845L0946R8309
$$ 229049 136604 58732 -60652 -41843 -159392 -163358 -256828 -276855 -22010 8936 107245
14542A07245k6748l9576N7028j5459k6656q6184J14073m5992L0401j29868l2701
$$ 107245 80497 40921 97949 82490 55834 -30350 83723 37731 68132 -61736 -94437
14531i4437J37846J1023K0607J20602O4616r8907m169N0776m3483L4455J65625
$$ -94437 43409 54432 75039 195641 260257 161350 157181 207957 164474 198929 364554
14520C64554l2414o6083j50540O011R837J2536M1104o3654o7062J15463J17539
$$ 364554 332140 266057 115517 121528 131365 143901 185005 121351 54289 169752 287291
14509B87291p4275r5020j11693m774k906l7316q5191N7561k825J4745l9737o6523
$$ 287291 213016 117996 6303 1529 -1377 -38693 -123884 -66323 -69148 -54403 -94140 -160663
14497a60663J30139J37868N9712n7675m085p4202P4894N6338j9002O3565j01046
$$ -160663 -30524 107344 167056 109381 105296 31094 105988 162326 143324 206889 105843
14486A05843J45615q5319j74790k7409r1243o0914N9866j68815M9040J59541O1282
$$ 105843 251458 166139 -8651 -36060 -127303 -188217 -128351 -297166 -248126 -88585 -27303
14475b7303J49728m3922l3209K48038J62209Q4218j70962j39929j59344q4431
$$ -27303 122425 78503 45294 293332 455541 539759 368797 228868 69524 -14907
14465a4907L8535R8458n6745k1289N8582K130q0827J0361K1769j89149O763R7088
$$ -14907 23628 122086 65341 44052 102634 104764 23937 34298 56067 -133082 -126319 -29231
14453b9231M8074q2018J53497J00714M8559q2773j97393j86590O3538n8700J22464
$$ -29231 18843 -63175 90322 191036 239595 156822 -40571 -227161 -163623 -222323 -99859
14442i9859M5883m2733P4761p5575L5403p4404M2259l346N5079n233j26055P3769
$$ -99859 -53976 -96709 -21948 -97523 -62120 -136524 -94265 -97611 -42532 -47765 -173820 -100051
14430a00051j01105J3607J20324L5832R5959J29377j26861p3027J09326M3633
$$ -100051 -201156 -187549 -67225 -31393 64566 193943 67082 -5945 103381 147014
14420A47014R5987M1238p5794j14810J54194K9511q3319j24682p3704q0175J67048
$$ 147014 243001 284239 208445 93635 247829 277340 194021 69339 -4365 -84540 82508
14409H2508K38615j00283j10745m7957J18130p6438m5753O601l6726j24558J3359
$$ 82508 321123 220840 110095 62138 180268 103830 58077 64678 27952 -96606 -83247
14398h3247J01175J76090p9101p1192L7576o0685n7672J04156J15883j71297j1635
$$ -83247 17928 194018 114917 43725 81301 20616 -37056 67100 182983 11686 51
14387E1n176J19293o1758j67669m8345P9781O6369J7708J2264P0755J8225P6768
$$ 51 -5125 114168 52410 -115259 -163604 -83823 -17454 254 12518 83273 101498 178266
14375A78266K3375q1254j10493J4110K23481k51872j46579J0489j5674M9434N8950
$$ 178266 201641 120387 9894 24004 247485 -4387 -150966 -140477 -156151 -106717 -47767
14364d7767R9664m8619N9416R7438m0481k45205q6692j0230R9919J91882L545
$$ -47767 51897 3278 62694 160132 119651 -125554 -212246 -222476 -122557 69325 72870
14353G2870j34103O7128J8976O0633j43592L919K38334J06837j10549k50192r6001
$$ 72870 -61233 5895 24871 85504 -58088 -54169 184165 291002 180453 -69739 -165740
14342a65740J2151K9039R7723N8482l9547Q9303L6971j56941m3411J06280m942
$$ -165740 -153589 -124550 -26827 31655 -7892 81411 118382 -38559 -81970 24310 19368
14331A9368j22097m338n0167Q547o1385L0831n8475R5533J24210R6608N6500n4603
$$ 19368 -102729 -107067 -157234 -148687 -210072 -179241 -237716 -142183 -17973 78635 135135 80532
14319H0532j32116p3394j3639J09651K1480k09047O0798J82612L3805j76055P1977
$$ 80532 -51584 -124978 -138617 -28966 -7486 -216533 -155735 26877 60682 -115373 -43396
14308d3396K4652j41413P3921J30227K7207j46563J1901j46455p179J09495J64062
$$ -43396 -18744 -160157 -86236 43991 71198 -75365 -63464 -209919 -217098 -107603 56459
14297E6459J30979Q2886L0130j9184j67270Q0785k6997j40735M3282l5654n7282
$$ 56459 187438 270324 300454 281270 114000 194785 167788 27053 70335 34681 -22601
14286b2601o5215J20442J01605j53064k01605q1610J47084o9898M4575J02424
$$ -22601 -87816 32626 134231 -18833 -220438 -302048 -154964 -224862 -180287 -77863
14276g7863O7211R6478m1271N5439m5809j55273N2930J70509n8411o4575J21902
$$ -77863 -10652 85826 44555 99994 54185 -101088 -48158 122351 63940 -635 121267
14265A21267J0898K4248l3919J9592J14337j85286n1085Q1803q5367l23151q2848
$$ 121267 132165 156413 122494 142086 256423 71137 20052 101855 16488 -306663 -389511
14254c89511j8018l5085L818N6894K39197N9936J03449k1810r1009Q1585p0855
$$ -389511 -407529 -442614 -438796 -381902 -142705 -82769 20680 -1130 -92139 -10554 -81409
14243h1409K38881J66129J13240j7269l40184M5043J5010l9217k6951r036K977
$$ -81409 157472 323601 436841 419572 79388 124431 139441 100224 73273 64237 67214
14232F7214m4636J06952P1266j14605j46214l3403R5990q8185P9002R4773r6701
$$ 67214 22578 129530 200796 86191 -60023 -93426 2564 -85621 -6619 88154 -8547
14221h547j26604q10N0626J17847J46084J22804J5403j8148J11507P9287q3467
$$ -8547 -135151 -135961 -85335 32512 178596 301400 316803 298655 410162 489449 405982
14210D05982k44278L6799M430n2331R1298k3501l5593j18882J32478J52324q1103
$$ 405982 161704 198503 202933 150602 241900 218399 182806 63924 196402 348726 267623
14199B67623l50375j90912l8710J53736l0907k07279J98031J66537m912k6722
$$ 267623 -82752 -273664 -312374 -158638 -189545 -396824 -198793 -32256 -37168 -63890
14189f3890k8185K2842r8422j05263P9172J09810k5656o5461J3031J07567m1843
$$ -63890 -92075 -69233 -167655 -272918 -193746 -83936 -109592 -175053 -162022 -54455 -96298
14178i6298j15746J05871J70128k4617k33512j13415J46665K6697J90960K98416
$$ -96298 -212044 -106173 63955 39338 -194174 -307589 -160924 -134227 56733 355149
14168C55149q412k32389j3395R0811L9642l6006n8093q9703M0808j658L236r0704
$$ 355149 346737 114348 100953 191764 231406 195400 137307 47604 88412 86754 89990 -714
14156g14J67489l3278j72632L9742L9739r002O7168K35254J21252p6605l2101
$$ -714 166775 133497 -39135 607 40346 31344 98512 333766 455018 378413 346312
14145C46312j34099J7960N6789j99678q1338J26316J40734J9044N2625M1416k56789
$$ 346312 212213 230173 286962 87284 5946 132262 272996 292040 344665 386081 129292
14134A29292j3855J58587L744q3397O3843J69515j11536k37569q5476J96590M2962
$$ 129292 115437 274024 277768 194371 258214 427729 316193 78624 -6852 189738 232700
14123B32700J1556J001m3852k30827j75624J14303l808j9434j91555K32267J21856
$$ 232700 244256 245257 201405 -29422 -205046 -90743 -94551 -113985 -305540 -73273 48583
14112D8583p6742o7153M8262Q6805J3106N5817j5347j32575l4179J49349J56590
$$ 48583 -28159 -95312 -47050 39755 52861 108678 93331 -39244 -73423 75926 232516
14101B32516k86294k88434J1270M2502J47354K71720J69905j63349r2115n8126
$$ 232516 -53778 -342212 -330942 -288440 -141086 130634 300539 137190 45075 -13051
14091a3051j21921n7995L4335Q0012R9108J15281p2138R5993R3615O8274j29620
$$ -13051 -134972 -192967 -158632 -78620 20488 135769 63631 159624 253239 321513 191893
14080A91893j16892M3856L4754l0468k1753r3115J7746j09745k345j30646N1112
$$ 191893 75001 118857 153611 123143 101390 8275 26021 -83724 -86069 -216715 -165603
14069a65603L9633p1217K19529O9797J1413p7906n6270p3929N2733o3465J6957
$$ -165603 -125970 -197187 22342 92139 103552 25646 -30624 -104553 -51820 -115285 -98328
14058i8328Q4498K8095j4116j69415m743J63150N6162J7685n3733L8007j24117
$$ -98328 -13830 14265 149 -169266 -174009 -10859 45303 62988 9255 47262 -76855
14047g6855K5673J35705K2593j24698m0917K3095K0692J20553o7186j68569j22328
$$ -76855 -51182 84523 107116 -17582 -58499 -35404 -14712 105841 38655 -129914 -252242
14036b52242J27563J99552j8247N5606j01312J42038O4759l2091L3409l3515r0194
$$ -252242 -124679 74873 56626 112232 10920 152958 217717 185626 219035 185520 95326
14025I5326m3231n4012N7321J59940K35517j35580k87076j71670M3443J81952
$$ 95326 52095 -1917 55404 215344 450861 315281 28205 -143465 -100022 81930
14015H1930k9478k15690r3900K0308L40367m2247k48690j5785P3128P2538Q937
$$ 81930 52452 -163238 -257138 -236830 103537 61290 -187400 -203185 -130057 -57519 -48582
14004d8582n6595K0259J31084j37126r3377J2386J80239J62391K5822j13697k00188
$$ -48582 -105177 -84918 46166 -90960 -184337 -171951 8288 170679 196501 82804 -117384
13993a17384J04363M8224k5947j09335j21079Q3709M5868J0830M8216K51587p0330
$$ -117384 -13021 35203 9256 -100079 -221158 -137449 -91581 -80751 -32535 219052 148722
13982A48722j44634j81381l5936j4702M693L4209P9876N6870M2450r4327r2461
$$ 148722 4088 -177293 -213229 -227931 -223238 -189029 -109153 -52283 -9833 -104160 -196621
13971a96621K143K02332K61297p6508n1098l322O1306n1887L9623o8378j59934
$$ -196621 -194478 7854 269151 192643 141545 138223 199529 147642 187265 118887 -41047
13960d1047N1698l2944j17072p4959O0961R7790J82253P4758m1205k4360j5821
$$ -41047 10651 -22293 -139365 -214324 -153363 -55573 126680 201438 160233 135873 120052
13949A20052n2526J54587o2789j13259j00749o565P3575O9733P429k15912j18546
$$ 120052 67526 222113 159324 46065 -54684 -61249 12326 82059 89488 -126424 -244970
13938b44970P5187j9041J81129P9375P4001n8706O189P6577p9493r7705O7984
$$ -244970 -169783 -188824 -7695 71680 145681 86975 93164 169741 90248 -7457 60527
13927F0527P9644P58p8441N969J41220k7236q6490J1333j73861J4956P9385J4632
$$ 60527 140171 140929 62488 68457 209677 182441 95951 107284 -66577 -51621 27764 42396
13915D2396k03351p8617J28348N7058M6363J04572J54214Q8384j75300p0024N3193
$$ 42396 -160955 -239572 -111224 -54166 -7803 96769 250983 339367 164067 94043 147236
13904A47236m3864L1169k48528j09678R1713j3292j08533N9574J19596M4777M91
$$ 147236 103372 134541 -113987 -223665 -131952 -145244 -253777 -194203 -74607 -29830 -29339
13893b9339j4339J93037m9124p9802j04809L9673M376k5575m9674o815P7240J33452
$$ -29339 -43678 149359 100235 20433 -84376 -44703 -40327 -65902 -115576 -122391 -45151 88301
13881H8301M326m3930o8583n3230N5077O6280K3220j58067j1164J89972j37906
$$ 88301 92627 48697 -19886 -73116 -18039 48241 71461 -86606 -97770 92202 -45704
13870d5704k2061J23020q7166M7561J0509J05713o8050q7868k5901m4023J04351
$$ -45704 -67765 55255 -31911 15650 26159 131872 63822 -24046 -49947 -93970 10381
13859A0381k428N7808n1687l4643J15413l5049R5267m5170j37047J03296O502
$$ 10381 7953 65761 14074 -20569 94844 59795 155062 109892 -27155 76141 82643
13848H2643j2677K4949m0169o7271j3325j44319N0878J71032j7025M4516O3316
$$ 82643 69966 94915 54746 -12525 -25850 -170169 -119291 51741 34716 79232 142548
13837A42548Q2175M8739p8858o4905j02758q9042j7747L6207J38111R5817o4609
$$ 142548 224723 273462 194604 129699 26941 -62101 -79848 -43641 94470 190287 125678
13826A25678R8727P7396j60705j11547j39810q7746k3514P6669J41201R6037J3713
$$ 125678 224405 301801 141096 29549 -110261 -198007 -221521 -144852 -3651 92386 106099
13815A06099j67638R2128J2354p4738r2900N9624K40094J00633p0888O5720J13468
$$ 106099 -61539 30589 42943 -31795 -124695 -65071 175023 275656 204768 270488 383956
13804C83956l43116l18984O6125K68128K44320r9883Q5318K02113l482q4397j97113
$$ 383956 40840 -278144 -212019 56109 300429 200546 285864 487977 484495 400098 202985
13793B02985r4598o1223o0831M0373k2768J62846J34149j64183j03849l9406j24186
$$ 202985 108387 47164 -13667 26706 3938 166784 300933 136750 32901 -6505 -130691
13782a30691j2590R2671M5721K9143n5074K85981J09846j8244r9257j43148O6559
$$ -130691 -143281 -50610 -4889 24254 -30820 255161 365007 346763 247506 104358 170917
13771A70917P532m1069m5324J98028n0800J00717k10344k39175k8431J02999R1919
$$ 170917 178449 137380 92056 290084 239284 340001 129657 -109518 -137949 -34950 56969
13760E6969l5125m7874N0514M2038J11862K2986j38997L3643j7224j06405n2942
$$ 56969 21844 -26030 24484 66522 178384 201370 62373 96016 78792 -27613 -80555
13749h0555M3950L1109J8997J03044K2600k13185r0403P2166R114L9521M5021
$$ -80555 -36605 -5496 13501 116545 139145 -74040 -164443 -92277 -83163 -43642 1379
13738A379m4273N0089m7755k1418q4529J61209M6476j10985k2465l068K2566l5676
$$ 1379 -42894 7195 -40560 -61978 -146507 14702 61178 -49807 -72272 -75340 -52774 -88450
13726h8450Q7855J79529m3280j20425m7033q091L9863P4278R5028M297O0144n9696
$$ -88450 -595 178934 135654 15229 -31804 -39895 -32 74246 169274 173571 233715 174019
13714A74019k66742j14132J08883J48793O309K02612p5130k37317K4678J34958
$$ 174019 -92723 -206855 -97972 50821 57130 259742 184612 -52705 -28027 106931
13704A06931M1658j38660l1358J82124J5631l4587L8883P6401J12574r1444q3905
$$ 106931 148589 9929 -21429 160695 176326 141739 180622 257023 369597 278153 194248
13693A94248R8669j9869J593J43202M2819p9287j08257J18190k01295q7688k2385
$$ 194248 292917 273048 274641 417843 460662 381375 273118 391308 190013 102325 79940
13682G9940O7312K00917j26393l0228Q15k1451P4375j8804j28155l6162l2815
$$ 79940 147252 348169 221776 191548 192363 170912 245287 226483 98328 62166 29351
13671B9351L039j15032N6024J5601o7517n7399Q7311j43722j98739O6381J29298
$$ 29351 32390 -82642 -26618 -11017 -78534 -135933 -48622 -192344 -391083 -324702 -195404
13660a95404J70510J9701K2099r0782k0608J24522j19038j9814P1679M8568m5764
$$ -195404 -24894 -5193 16906 -73876 -94484 30038 -89000 -108814 -37135 11433 -34331
13649c4331p9258j22312k06049p0900J32202J17777O0326Q9384L3074m0020j38451
$$ -34331 -113589 -235901 -441950 -512850 -380648 -262871 -202545 -113161 -80087 -120107 -258558
13638b58558j24742J42154J52446L1363M9415r0946j74498l8918J04668K2049
$$ -258558 -383300 -241146 -88700 -57337 -7922 -98868 -273366 -312284 -207616 -185567
13628a85567r6592J31972K5468R8719K58021J85836j85788r0605p5466j35672
$$ -185567 -282159 -150187 -124719 -26000 232021 417857 232069 141464 65998 -69674
13618f9674M2423J41150n3812p2877J33087J48327j70798o7831o1855O2213P3803
$$ -69674 -27251 113899 60087 -12790 120297 268624 97826 29995 -31860 30353 104156
13607A04156k8685j42850j00919K6898L2476K0139j8305m5618M9004Q9156J44205
$$ 104156 75471 -67379 -168298 -141400 -108924 -88785 -107090 -152708 -103704 -14548 129657
13596A29657M8908O7881j03313j99763L0895N6346J09849m8894j17561m5289j12333
$$ 129657 178565 246446 143133 -56630 -25735 30611 140460 91566 -25995 -71284 -183617
$$ [...]
##END NTUPLES=NMR SPECTRUM
##END=
