##TITLE=Analysis number 318331
Compound Code cc 53746
Book Reference 458/112
Project Code adrs
Chemist Name stevem
##JCAMPDX= 6.0         $$ Bruker NMR JCAMP-DX V2.0
##DATA TYPE= NMR SPECTRUM
##DATA CLASS= NTUPLES
##ORIGIN= Bruker BioSpin GmbH
##OWNER= nmr
$$ XWIN-NMR		Version 3.5
$$ Thu Mar 23 14:32:17 2006 GMT Standard Time (UT+0h)  MAYBRIDGE\nmr@NMR_250MHZ
##.OBSERVE FREQUENCY= 250.131544655141
##.OBSERVE NUCLEUS= ^1H
##.ACQUISITION MODE= SIMULTANEOUS (DQD)
##.ACQUISITION SCHEME= undefined
##.AVERAGES= 16
##.DIGITISER RES= 18
##SPECTROMETER/DATA SYSTEM= dpx250
##.PULSE SEQUENCE= zg30
##.SOLVENT NAME= CDCl3
##.SHIFT REFERENCE= (INTERNAL, CDCl3, 0, 16.522)
##AUDIT TRAIL= $$ (NUMBER, WHEN, WHO, WHERE, WHAT)
$$ ##TITLE= Audit trail, XWIN-NMR		Version 3.5
$$ ##JCAMPDX= 5.01
$$ ##ORIGIN= Bruker BioSpin GmbH
$$ ##OWNER= nmr
$$ C:\u/data/dgb/nmr/ADRS/1370/pdata/1/auditp.txt
$$ ##AUDIT TRAIL=  $$ (NUMBER, WHEN, WHO, WHERE, WHAT)
(   1,<2006-03-23 14:31:54.17 +000>,<MAYBRIDGE\nmr>,<NMR_250MHZ>,
      <created by zg, POWCHK disabled, PULCHK disabled
       configuration hash MD5:
       84 BC 41 DB A1 6E 1D 46 DA 25 12 A5 C1 ED C5 3A
       data hash MD5: 64K
       1A FF 06 23 3D 90 1A 08 18 E4 EB 26 4B F5 6E 6C>)
(   2,<2006-03-23 14:32:07.31 +000>,<MAYBRIDGE\nmr>,<NMR_250MHZ>,
      <Start of raw data processing
       ef LB = 0.3 FT_mod = 6 PKNL = 1 SI = 32K 
       data hash MD5: 32K
       F4 D0 6D CC F3 28 B0 1C 17 7D 7C 4F 15 FD 38 90>)
(   3,<2006-03-23 14:32:08.94 +000>,<MAYBRIDGE\nmr>,<NMR_250MHZ>,
      <apk 
       data hash MD5: 32K
       F5 C0 91 FD 8E E5 4B 7D BA 50 E6 22 DA 51 BE FC>)
(   4,<2006-03-23 14:32:09.77 +000>,<MAYBRIDGE\nmr>,<NMR_250MHZ>,
      <abs ABSG = 5 
       data hash MD5: 32K
       3D 1E 07 07 33 86 97 0E 40 58 2B 3C B9 F2 D8 C7>)
$$ ##END=
$$ 
$$ hash MD5
$$ 91 0D D8 F6 D3 F4 52 7D FF 6D 02 0A 39 F7 A2 E6
##$RELAX= 
##$RELAX= 
##$RELAX= 
##$RELAX= 
##$RELAX= 
##$RELAX= 
##$RELAX= 
$$ Bruker specific parameters
$$ --------------------------
##$DU= <C:\u>
##$EXPNO= 1370
##$NAME= <ADRS>
##$PROCNO= 1
##$TYPE= <nmr>
##$USER= <dgb>
##$AMP= (0..31)
100 100 100 100 100 100 100 100 100 100 100 100 100 100 100 100 100 100 
100 100 100 100 100 100 100 100 100 100 100 100 100 100 
##$AQSEQ= 0
##$AQ_mod= 3
##$AUNM= <au_zg>
##$AUTOPOS= <33 >
##$BF1= 250.13
##$BF2= 250.13
##$BF3= 250.13
##$BF4= 250.13
##$BF5= 500.13
##$BF6= 500.13
##$BF7= 500.13
##$BF8= 500.13
##$BYTORDA= 1
##$CFDGTYP= 0
##$CFRGTYP= 5
##$CHEMSTR= <none>
##$CNST= (0..31)
1 1 145 1 1 1 1 1 1 1 1 1 1 1 1 1 1 1 1 1 1 1 1 1 1 1 1 1 1 1 1 1 
##$CPDPRG= <>
##$CPDPRG1= <>
##$CPDPRG2= <>
##$CPDPRG3= <>
##$CPDPRG4= <mlev>
##$CPDPRG5= <mlev>
##$CPDPRG6= <mlev>
##$CPDPRG7= <mlev>
##$CPDPRG8= <mlev>
##$CPDPRGB= <>
##$CPDPRGT= <>
##$D= (0..31)
0 1 0 0 0 0 0 0 0 0.06 0 0 0 0 0 0 0.0002 0 0 0 0 0 0 0 0 0 0 0 0 0 0 
0 
##$DATE= 1143124313
##$DBL= (0..7)
120 120 120 120 120 120 120 120 
##$DBP= (0..7)
150 150 150 150 150 150 150 150 
##$DBP07= 0
##$DBPNAM0= <>
##$DBPNAM1= <>
$$ [...]
##$SUBNAM7= <"">
##$SUBNAM8= <"">
##$SUBNAM9= <"">
##$SW= 20.6930455092707
##$SWIBOX= (0..15)
0 0 3 0 0 0 0 0 0 0 0 0 0 0 0 0 
##$SW_h= 5175.983436853
##$TD= 65536
##$TD0= 1
##$TE= 293.16
##$TE2= 300
##$TE3= 300
##$TEG= 300
##$TL= (0..7)
0 120 120 120 120 120 120 120 
##$TP= (0..7)
150 150 150 150 150 150 150 150 
##$TP07= 0
##$TPNAME0= <>
##$TPNAME1= <>
##$TPNAME2= <>
##$TPNAME3= <>
##$TPNAME4= <>
##$TPNAME5= <>
##$TPNAME6= <>
##$TPNAME7= <>
##$TPOAL= (0..7)
0.5 0.5 0.5 0.5 0.5 0.5 0.5 0.5 
##$TPOFFS= (0..7)
0 0 0 0 0 0 0 0 
##$TUNHIN= 0
##$TUNHOUT= 0
##$TUNXOUT= 0
##$USERA1= <user>
##$USERA2= <user>
##$USERA3= <user>
##$USERA4= <user>
##$USERA5= <user>
##$V9= 5
##$VALIST= <valist>
##$VCLIST= <CCCCCCCCCCCCCCC>
##$VD= 0
##$VDLIST= <DDDDDDDDDDDDDDD>
##$VPLIST= <PPPPPPPPPPPPPPP>
##$VTLIST= <TTTTTTTTTTTTTTT>
##$WBST= 1024
##$WBSW= 4
##$XGAIN= (0..3)
0 0 0 0 
##$XL= 0
##$YL= 0
##$YMAX_a= 397995
##$YMIN_a= -541361
##$ZGOPTNS= <>
##$ZL1= 120
##$ZL2= 120
##$ZL3= 120
##$ZL4= 120
##$ABSF1= 16.522
##$ABSF2= -4.171173
##$ABSG= 5
##$ABSL= 3
##$ALPHA= 0
##$AQORDER= 0
##$ASSFAC= 0
##$ASSFACI= 0
##$ASSFACX= 0
##$ASSWID= 0
##$AUNMP= <proc_1d>
##$AZFE= 0.1
##$AZFW= 0.1
##$BCFW= 0
##$BC_mod= 0
##$BYTORDP= 0
##$COROFFS= 0
##$CY= 12.5
##$DATMOD= 1
##$DC= 0
##$DFILT= <>
##$DTYPP= 0
##$F1P= 14.0000005364418
##$F2P= -0.99999901652339
##$FCOR= 0.5
##$FTSIZE= 32768
##$FT_mod= 6
##$GAMMA= 0
##$GB= 0
##$INTBC= 1
##$INTSCL= 1
##$ISEN= 128
##$LB= 0.3
##$LEV0= 0
##$LPBIN= 0
##$MAXI= 10000
##$MC2= 0
##$MEAN= 0
##$ME_mod= 0
##$MI= 0
##$NCOEF= 0
##$NC_proc= -3
##$NLEV= 6
##$NOISF1= 0
##$NOISF2= 0
##$NSP= 0
##$NTH_PI= 0
##$NZP= 0
##$OFFSET= 16.522
##$PC= 1
##$PHC0= 174.3019
##$PHC1= 5.511393
##$PH_mod= 1
##$PKNL= yes
##$PPARMOD= 0
##$PSCAL= 4
##$PSIGN= 0
##$REVERSE= no
##$SF= 250.13
##$SI= 32768
##$SIGF1= 0
##$SIGF2= 0
##$SINO= 400
##$SIOLD= 32768
##$SREGLST= <1H.CDCl3>
##$SSB= 0
##$STSI= 32768
##$STSR= 0
##$SW_p= 5175.98343685301
##$SYMM= 0
##$S_DEV= 0
##$TDeff= 65536
##$TDoff= 0
##$TI= <Analysis number 999999
Compound Code 99
Book Reference 9
Project Code 9>
##$TILT= no
##$TM1= 0
##$TM2= 0
##$TOPLEV= 0
##$USERP1= <user>
##$USERP2= <user>
##$USERP3= <user>
##$USERP4= <user>
##$USERP5= <user>
##$WDW= 1
##$XDIM= 32768
##$YMAX_p= 344161980
##$YMIN_p= -161289
$$ End of Bruker specific parameters
$$ ---------------------------------
##NTUPLES= NMR SPECTRUM
##VAR_NAME=  FREQUENCY,     SPECTRUM/REAL,   SPECTRUM/IMAG
##SYMBOL=    X,             R,               I
##VAR_TYPE=  INDEPENDENT,   DEPENDENT,       DEPENDENT
##VAR_FORM=  AFFN,          ASDF,            ASDF
##VAR_DIM=   32768,         32768,           32768
##UNITS=     HZ,            ARBITRARY UNITS, ARBITRARY UNITS
##FACTOR=    0.157963299565203, 1,           1
##FIRST=     4132.6476996994, 0,             0
##LAST=      -1043.33573715361, 0,           0
##MIN=       -1043.33573715361, -161289,     0
##MAX=       4132.6476996994, 344161980,     0
$$ Real data points
##PAGE= N=1
##DATA TABLE= (X++(R..R)), XYDATA
$$ [...]
20973 21739 26535 1996 4414 22291 34573 42442 40827 20627 7439 3070 8333 -5464 -10806
20960 -10806 -10630 10683 31130 31556 6304 -24450 -369 10983 18340 28340 34799 15258 10311
20947 10311 9063 7832 -9515 -22920 -9154 1050 17365 12212 7040 -735 1992 6038 10514
20934 10514 23435 30401 34632 23229 9332 1243 3526 14416 25923 14597 299 -2111 94
20921 94 -10002 -11971 2410 5179 -1742 -4102 13620 24756 36082 33869 2816 -18832 -29894
20908 -29894 -38573 -35048 -30565 -27419 -19589 1801 1156 -13167 -26879 -54961 -44475 -20162 5188
20895 5188 11895 -510 -1008 468 -554 -20751 -34792 -21219 2761 -8466 -17362 -11915 6118
20882 6118 25127 26261 16529 1489 -13060 -6544 -17760 -22551 -18801 -12825 12835 6020 -8448
20869 -8448 -17438 -17870 -25044 -10808 -7316 -27396 -28193 -23493 -20152 -25445 -12283 -7688 538 4424
20855 4424 8820 11681 -2621 -19094 -19704 -15542 9438 15905 -12771 -17476 1989 7606 829 -1091
20841 -1091 -4946 -16288 -21897 -26393 -26115 -44980 -42298 -27912 -19127 -23723 -27207 -31724 -41239 -26886
20827 -26886 -7320 6352 -396 -3883 419 -18084 -5462 7207 20623 12322 -3503 9462
20815 9462 12732 6394 7830 10774 21730 15660 4179 -14125 -25462 -24017 -21660 -21046 -11349 -11937
20801 -11937 -12214 9087 23309 12015 10799 30786 36933 15216 -19011 -36914 -18652 -20452 -18829
20788 -18829 -2463 -624 -25726 -37845 -20787 -14466 -8377 10047 22616 32620 27129 9448
20776 9448 -13067 -17071 -8794 23 8477 12962 33629 48317 48455 28541 19662 30976 21794 22482
20762 22482 15921 11606 2615 -7181 -6228 -16197 -29271 -27597 -13996 -10256 -4047 7689 -2558 -10895
20748 -10895 -9026 -21129 -35900 -55730 -49725 -32158 -25616 -33091 -28798 -15960 -14955 -23092 -29712
20735 -29712 -23077 2442 10637 -11006 -22051 -29475 -43378 -34668 -27914 -42594 -42712 -29875 -672
20722 -672 -6754 -3843 24403 27414 3584 -360 6632 16006 22483 36631 41120 14193 -4015 -4503
20708 -4503 -10388 -457 -15298 -6112 -11726 -20899 -18446 -20226 -22488 -32323 -22898 -28252 -18624 -24618
20694 -24618 -34328 -32605 -14541 -13423 -9945 -18680 -10070 -19072 -28476 -35720 -35918 -43589 -31542 -37034
20680 -37034 -43358 -32985 -16071 -30129 -50590 -59512 -56615 -36186 -24360 -12313 175 -11854
20668 -11854 -26933 -31308 -19511 -11642 3964 7347 -11680 -2279 3228 -1891 -895 -4197 -4691 -2107
20654 -2107 1024 18755 24554 15805 4590 2476 9313 9637 17741 14611 10581 -4647 -15875 -24109
20640 -24109 -23257 4021 21240 33786 13021 1200 10557 -7069 -27151 -13978 -8448 -9130 -4326
20627 -4326 -14218 -17063 -18448 -1831 5170 -22809 -28190 -25703 -32200 -35513 -28099 -8154 9075 13927
20613 13927 14075 14193 4075 27233 39465 43258 21134 6211 -21087 -46665 -45370 -21154 -11511
20600 -11511 -8274 7282 11295 17156 11131 -4804 -5256 -12819 -15880 -24499 -24853 -35104 -25437 -9796
20586 -9796 -1450 12373 7544 9920 6262 194 -3436 -12861 6152 12748 6207 -3629 7366 17692
20572 17692 16735 1243 -26258 -33549 -40436 -45462 -25608 -14135 -5051 6767 -7044 -28217 -26840
20559 -26840 -9664 -6468 -2415 -876 -7805 -6562 -398 710 3802 25813 27956 19546 -30036 -30959
20545 -30959 1937 38025 49623 56295 48876 28114 17371 -6487 -17875 -28343 -39392 -28224
20533 -28224 -15632 612 11440 -2865 -548 -11524 -3659 21681 30846 7348 -130 -16972
20521 -16972 -35342 -36260 -29033 -29376 -26121 -20674 -26687 -17321 -16696 -23098 -34607 -44875 -47490 -35845
20507 -35845 -36227 -44111 -29129 -13106 -4467 1706 8590 -4348 -14760 7847 18507 -2899 3388
20494 3388 11494 20643 17423 13990 24842 34365 19068 9481 18918 23990 26648 34026 15879 -4565
20480 -4565 -10631 4175 12944 9109 -5826 -4419 3503 -5772 843 5326 -3735 -93 -10011 -17378
20466 -17378 -9622 -17447 -14936 -626 -3777 6857 15292 8806 4171 1559 -7253 -7433 8681 3585
20452 3585 3190 31846 47146 33739 25863 2947 -21694 -23268 -3402 -7512 -17805 -29032 -21407
20439 -21407 -19196 -22278 -17158 -28605 -20550 261 2774 -18674 -28192 -27093 -23371 -17363 -26314 -22029
20425 -22029 -9250 2014 -7443 -6965 -5426 -16444 -15211 -8899 -1317 -12750 -20918 -7332 2454
20412 2454 -3772 -13399 -4885 30939 46275 38016 15300 15610 -11167 -15540 -16646 -11101 2843 -15749
20398 -15749 -25667 -21080 -1070 28548 32998 28345 21719 -5865 -5249 -18906 -25952 -12791 2354
20385 2354 -5931 1882 27794 23388 5261 -1854 -8669 -15790 -14275 -934 -2828 8308 11363 -2413
20371 -2413 -12361 -10342 -7954 -15264 8496 14276 3535 -17574 -16984 -2431 6383 -12272 -16525 -2128
20357 -2128 5949 4918 -16375 -17169 -1047 18195 272 -12596 -12797 -2097 -4732 -14787 451
20344 451 -14537 -1749 2134 6426 6267 -6595 -5520 -4290 -3417 4254 17268 6712 -3651 11136
20330 11136 24119 9471 3525 7236 1929 -6315 -9194 -7035 -2006 -17405 -17611 -1236 -3849 -9855
20316 -9855 -7644 -16916 -20357 -29971 -23464 -11631 -22697 -32489 -30793 -21649 -16171 -17081 -19725 1441
20302 1441 2110 -7602 3363 -4304 285 -6302 -12857 -2171 8947 -14257 -43884 -49479 -47857 -50934
20288 -50934 -54822 -54447 -44607 -49942 -50506 -38430 -32678 -26301 -10420 -2429 1683 -1985 -16708 -17084
20274 -17084 -11381 -12016 -30437 -44614 -34912 -52802 -61784 -25898 1471 22370 28658 13625 11880
20261 11880 -1112 12267 680 -1093 6065 -4901 -753 5083 -7244 -30325 -26930 -38793 -45733
20248 -45733 -29701 -6426 3336 7194 10900 567 1913 5254 18294 16637 5237 -1623 -4081
20235 -4081 -19084 -20029 -26903 -11338 1237 4486 12832 46 -11321 -18523 -42368 -45323 -32494
20222 -32494 -12610 6636 -3348 -18379 -20048 -3427 20970 29918 30102 37159 28825 6687 4538
20209 4538 2848 -36218 -58396 -33463 -20071 -17725 -9295 -11080 255 -5428 -8500 -9633 -14923
20196 -14923 -23332 -31791 -51208 -51193 -43475 -38215 -24854 -16529 -20523 -17257 -19082 -12561 -18655 -23766
20182 -23766 -16577 -29073 -35406 -26885 -2288 10770 18977 20451 1233 -3454 -1809 -2549 -6224 -12310
20168 -12310 -24945 -4978 -520 -10528 -2244 -10136 11 3702 -393 -11823 1188 8832 759
20155 759 2845 -7164 6080 -1055 -22840 -3358 15339 8117 -1417 2648 17298 4920 -1873
20142 -1873 -3551 -5222 -20156 -35015 -33678 -27183 -2021 -3942 -1133 2584 -1582 -9577 -15651 -21610
20128 -21610 -17201 -20010 -12187 5292 13032 12081 -5444 3708 6166 -1190 -4122 -14716 -19861 -18267
20114 -18267 -11586 -4177 -13154 -10301 24828 30727 19450 17164 -3253 -6844 -11980 -12860 -9514 -6898
20100 -6898 -3569 1167 -15711 -38065 -34842 -12183 3758 -4704 -28327 -29600 -23106 -11532 12213
20087 12213 19618 22954 23240 15530 10313 1272 -10538 -18572 -19157 -16684 -8976 947 -7691 4455
20073 4455 16800 17585 13910 14025 24008 39054 20859 1086 -3692 -15477 -17259 -10091 -17043 -19610
20059 -19610 -20315 -2327 14815 6492 -5836 -1691 1832 -9568 -5807 22544 23711 14571 -13498
20046 -13498 -2915 -2723 -7673 -21178 -17372 1218 28612 33015 5226 10996 18169 1971 -3772
20033 -3772 4099 12690 12995 4473 -4965 -12197 -14961 -23849 -29817 -14656 8800 13565 -18310 -31329
20019 -31329 -27198 -24347 -25914 -12871 878 1224 -6161 8134 -5173 -16242 -11100 -14877 -23132
20006 -23132 -35664 -38831 -26479 -25770 -24464 -11114 13334 27332 19876 -116 15461 14423 -4351
19993 -4351 -8753 10341 10016 682 1635 1148 8565 10829 21292 20416 24560 27833 11772 -10193 -8334
19978 -8334 -1347 -10005 -32567 -25607 -23060 -25709 -22127 -13381 -16306 -14050 -5213 -21922 -34543 -27488
19964 -27488 -9751 -7863 14569 27551 23744 18297 3539 -14332 -26755 -29734 -17063 -14824 -8740
19951 -8740 -2486 7416 -2521 -5350 4675 5684 -13263 -16644 -8493 -31029 -42951 -33275 -15210
19938 -15210 -9367 -9625 2774 21001 17021 -4362 -25195 -14379 4252 1668 -1679 -11727 7280
19925 7280 12109 12288 15217 12358 18248 13760 12676 9459 1833 -19212 -22658 -29975 -24315 -13701
19911 -13701 -17647 -30287 -22540 -10960 -16275 -8873 -1127 -3695 1833 3087 15040 20344 3427
19898 3427 -428 428 -17674 -25917 -12102 -9189 -1759 -325 -10378 -16415 -24796 -23676 -29290 -34833
19884 -34833 -15429 728 30754 19559 13287 7133 -9773 -4485 -12184 62 -2641 -17910 -22462
19871 -22462 -9070 -13328 -19676 1229 -4171 -4125 -181 -13405 -12804 -5640 -11463 -18867 -7251 -1855
19857 -1855 -16725 -10004 -19488 -25958 -18190 -6196 -3336 -7656 -133 -13551 -15617 -22308 -5580 30773
19843 30773 33320 27268 5177 -2993 -9030 -12911 -3952 -23726 -12624 -14807 -30027 -20897 -24857
19830 -24857 -9094 -851 -12788 -9106 -7865 -5718 -2879 -17568 -15393 -9556 -20169 -26181 -3978
19817 -3978 -7429 -12002 -20140 -20016 -14136 -16679 -29343 -31943 -7892 7581 3565 -4293 -4412 -8816
19803 -8816 -27216 -34194 -14244 -14272 -26995 -15547 4370 -6058 -20698 -16378 3840 14226 -461
19790 -461 -9813 11883 24256 32405 18781 3320 -5260 -20705 -34377 -23968 -1662 13384 -469
19777 -469 -2524 -20452 -11242 -1835 11342 24566 6302 2402 -1953 7373 13659 4852 -19262 -43887
19763 -43887 -39145 -23112 -18071 -21131 -25218 -19821 -13820 -21919 -22697 -24750 -19522 1597 13522 5657
19749 5657 21141 39271 45821 24960 -2363 -17033 -13879 -8445 -20362 -19367 -12482 -566 9980
19736 9980 2635 8431 5773 -12120 -34260 -23776 -7639 -9491 -23076 -19375 -35670 -25632 -26757
19723 -26757 -7092 10032 28434 10123 -15277 -27692 -19732 11337 21030 25493 25196 4235 -20941
19710 -20941 -3337 18255 -7078 -16272 -10932 9204 22375 1580 -15123 -12418 -24178 -27610
19698 -27610 -35161 -14136 -3411 -2949 -14904 -14318 -430 31113 44464 31765 -3511 -29988 -25416
19685 -25416 -29999 -31726 -22966 -18101 -4173 2337 3912 1048 -2064 6764 6089 -10468 -8238 -13626
19671 -13626 3309 3806 17490 36703 25881 21668 -5210 -25338 -23947 -12863 -311 2999 9626
19658 9626 -12070 -4476 -8370 -8457 3955 8430 5868 -2059 -11552 -20346 -6980 6006 1955 -14342
19644 -14342 -17913 -15495 -2920 3364 23116 28686 30659 18313 -3244 -6657 -5804 -12569 -2368
19631 -2368 -2502 -3757 7348 280 766 -1634 6728 10161 9777 22871 31016 9473 -10220 -3749
19617 -3749 1708 -13361 -13888 -4048 -3435 -20874 -21634 -23780 -17835 -15178 -37925 -36117 -29450 -25957 -4268
19602 -4268 5495 -5230 -15428 -25444 -29885 -30290 -23843 -40078 -34469 -10261 -6465 -13100 -14174 -11894
19588 -11894 -2439 9570 4637 -6719 -330 -14303 -9554 6469 9000 4676 3432 -14097 -9589
19575 -9589 -6888 11472 17719 -11803 -27194 -22722 -30150 -11502 -20365 -18385 -3482 5698 -16236
19562 -16236 -35960 -23096 -24535 -43524 -43430 -43106 -46647 -52388 -59325 -57224 -45856 -62826 -67475 -40319
19548 -40319 -11804 -8138 -27513 -37625 -41093 -23220 -14810 -5258 -14973 -25516 -26136 -11231 -11094
19535 -11094 -8566 17601 25046 22900 13801 -10939 -188 21288 36102 36016 14692 -75 -8893
19522 -8893 -9533 1638 13309 25066 7042 -6636 -8474 -15270 -15833 -4572 -2633 3967 2892 1292
19508 1292 10897 11820 19860 16916 7884 -5808 -15866 -29059 -16541 -199 8658 4746 13639 17532
19494 17532 6836 1813 761 3969 7721 22276 20938 3909 -15447 -11406 -10482 -782 2475 8624
19480 8624 6166 128 -7971 -27340 -40101 -26928 -12682 -1456 4842 -6363 5301 -5903 -3159
19467 -3159 -12761 -27513 -28631 -20131 -5809 2240 -585 14427 34491 30088 24445 21985 9004
19454 9004 263 -6486 -7277 -33314 -63603 -45754 -26940 -15849 -1405 -8399 -9839 -734 15479
19441 15479 13278 4883 30 4232 1051 -19800 -31152 -27229 -21056 -12290 -31385 -25534 -5017
19428 -5017 -1768 -10265 -11202 -23122 -27479 -29760 -18499 6015 9187 -8495 -8254 -7971 -18599 -26785
19414 -26785 -19387 -3355 4761 12166 21694 26667 16074 -1540 -15144 -8304 18528 29383 24170
19401 24170 19076 6933 -8996 -11258 -12007 -4680 -7213 2278 -1405 106 -6124 -7063 1256 14287
19387 14287 36531 36279 28598 23293 19305 6668 6187 8117 -6863 -18808 -5269 5345 -8079
19374 -8079 -11590 7619 4283 -6415 -3275 9994 5479 15235 27660 13268 -13411 -10071 8808
19361 8808 25245 19376 1332 -12897 -22420 -14853 643 8771 16376 3925 10696 12294 8100
19348 8100 4378 -324 4643 16832 25584 19925 -25 7695 28363 28299 13661 7956 -701 -1040
19334 -1040 -1397 -9369 -28815 -34454 -43981 -44515 -39126 -20803 -9871 9259 8601 -10468 -15120 -22914
19320 -22914 -7845 22902 30567 29438 28837 38136 51028 32341 13465 22584 36017 32136 -33
19307 -33 -6291 18493 20483 23705 39942 29522 -5288 -1129 12616 31503 29712 29268 43962 24711
19293 24711 386 3304 22711 27374 11437 -7976 -1629 11073 13871 18285 21141 12604 19493
19280 19493 12115 11356 15396 16269 6397 -8703 706 542 1956 2063 -6016 -18018 -19925 -22025 -7191
19265 -7191 15655 13295 -4587 -697 25226 24650 13579 17757 26315 22477 9768 -10495 -35860
19252 -35860 -22026 532 -7550 -2173 24069 29750 26697 15728 21595 9153 -16944 -25479 -10475
19239 -10475 -7180 8238 -1948 -11104 -10149 -14536 7486 1071 -5864 15337 24642 27544 36873 34815
19225 34815 18042 17092 20973 13235 14320 9534 14293 12666 6130 16360 3334 -12598 -7614 -2191
19211 -2191 -2421 -9896 -5143 -9645 -2226 8093 5372 13036 19128 16989 9466 -2847 997 4030
19197 4030 -11735 -3969 9018 -512 3574 8065 1822 -7143 -11865 6267 9321 -5197 -7699 -59
19183 -59 16655 29978 11925 3756 -376 -5152 135 9103 -11922 -24550 -14693 151 -1570 -1502
19169 -1502 -3401 -5874 -22154 -21816 -32293 -37291 -11008 -14405 10250 -7308 -21188 -26808 -7011
19156 -7011 12414 -3165 -24083 -27603 -16444 -19988 -33188 -30321 -18716 13352 14303 3977 -3360
19143 -3360 -14261 -6419 -5672 -4125 4974 8965 13557 19919 10004 -13480 -5298 -671 646 -1507
19129 -1507 -2681 -7950 -5753 -22961 -29880 -10223 -10260 -22619 -19248 -4318 -5380 4959 -13629 -17143
19115 -17143 -12809 -7278 -28028 -29324 -21675 -23061 -14168 -8466 988 956 2813 -14382 -27017 -38412
19101 -38412 -40914 -26589 -24499 -33082 -41134 -26127 -429 1503 -2747 -12414 -13356 -23010 -4449 10950
19087 10950 33605 41739 31967 33643 18936 6737 -10171 -19179 -3590 1383 -4409 12543 -2874
19074 -2874 -17489 -26286 -31123 -28119 -2803 21202 5319 -5863 -10375 -8428 -1827 19349 15072
19061 15072 9896 -5176 -6330 3736 9267 -5650 -21765 -23312 -21685 -22189 -2455 11939 30715
19048 30715 34255 25942 20334 19247 23333 24221 11005 -5734 -13064 1309 -1160 -7284 -4292 -2005
19034 -2005 1743 25550 40770 31822 24834 34189 34859 16438 14130 -625 7690 12843 10225 2368
19020 2368 -8371 -13993 -13424 1218 4098 -2070 6203 9156 10202 24494 15597 -4757 -21026 -6457
19006 -6457 -18605 -9981 -21346 -29628 -545 24325 19435 14434 -4732 -10864 -8400 -15681 -12168
18993 -12168 5509 12816 13452 20106 22963 36673 30472 20971 -4830 -2950 7674 6880 11182 12282
18979 12282 6966 -13667 -12394 -4306 -4584 -8335 -7111 5379 -1882 -10456 -3413 -9508 -361 12383
18965 12383 9992 3723 10135 -9822 -18007 -4934 -4482 -3432 -10487 -15939 -20108 -15435 -11523 -4763
18951 -4763 10241 3253 -10459 -8035 -10189 -3656 -5453 -12328 -7441 -5189 -4430 1232 -6108 -26363
18937 -26363 -24462 -12055 -3661 -3226 -2421 -6248 -14409 -17551 -21297 -33355 -26716 -16232 -3187 4042
18923 4042 2818 6500 18160 41140 48995 32758 14854 15134 13909 403 11888 18277 6348
18910 6348 17369 16688 2666 9013 23301 11957 12094 -2634 -10551 -4979 -2330 7786 15642 22746
18896 22746 10313 -4503 -2053 6311 28864 30750 20654 5064 2532 107 80 11201 16639
18883 16639 13182 14708 25586 31039 3389 -15217 -1882 9411 21334 19315 20759 15016 13648
18870 13648 14927 17589 576 18324 18474 18783 7464 -8445 7505 17556 27643 48858 48088
18857 48088 46088 28006 37384 38723 27275 14783 12263 9077 5768 7571 4099 -179 -6670 4002
18843 4002 26015 37531 41592 20191 -3694 -17557 -12187 7810 32328 39049 34759 44175 47442
18830 47442 44821 48906 49172 15119 19886 20212 18551 22872 33707 24762 4777 -6073 5252 27673
18816 27673 42898 57041 45066 36302 40384 28047 34689 48104 35861 17401 11126 11468 12863
18803 12863 15271 16198 10057 -5484 -2548 7195 19223 20397 11288 12175 18157 24663 37589 24977
18789 24977 19829 19077 23398 25242 25244 29383 58241 63433 38318 28148 38503 36766 30534 48805
18775 48805 53517 44144 57311 97371 127334 143299 140943 127268 148782 160438 204948 269612
18763 269612 292036 259746 214718 186177 199543 208440 185488 149043 124891 107487 96776 95039
18751 95039 95643 93677 89040 91879 89760 86417 74992 65331 51525 48170 32342 25119 38477 49125
18737 49125 54282 49729 53532 36415 26076 19319 31288 75474 120770 125095 137584 167055 184404
18724 184404 200469 204451 211420 199121 173657 158387 159633 181093 227480 266683 301583 339521
18712 339521 365220 356841 304449 249452 216551 194718 180791 191357 229654 278294 277480 243637
18700 243637 191214 145056 118469 120660 103631 97454 76243 54096 63614 87004 75985 93227
18688 93227 95907 97947 113683 113713 107082 98527 113564 163052 186878 219452 232059 232357 232940 229316
18674 229316 232604 221132 234872 241365 264331 310261 341269 376486 388025 384426 368001 338822
18662 338822 340068 340691 331432 342289 360469 372444 358259 335888 304517 255189 244615 244517 253704
18649 253704 252238 226546 187000 170947 180895 164157 152136 126712 84364 78269 88814 110266
18637 110266 123137 121821 119580 134799 131389 119801 118010 137709 164430 178231 170573 170303 166651
18624 166651 156919 153029 154272 154902 160734 177734 205706 238612 254746 255855 260781 264574 286195
18611 286195 282712 294063 300480 287278 262228 245957 234508 233494 224153 220727 223341 201780 178234
18598 178234 172531 180088 170163 153211 138958 136825 117010 82671 84241 90165 83805 77104 77620
18585 77620 68466 58480 73466 84939 96312 98562 87758 80586 59762 46496 36396 44607 43467
18572 43467 39030 31914 32639 43544 56701 79118 89389 89528 76905 67359 74251 62902 62827 54521
18558 54521 51654 60897 54925 55544 76257 91093 86511 62202 60525 69419 69828 65320 63878 36485
18544 36485 28660 44234 55421 71723 61689 61830 74030 90899 69624 69260 66916 84534 83651
18531 83651 85834 79013 81735 95476 66275 85107 80615 53974 42685 59993 75001 85676
18519 85676 83837 76718 72369 83500 91860 108165 113756 101757 78617 75114 86117 82740 91356
18506 91356 90636 84499 83487 85536 77228 61813 47108 60495 93429 107384 97400 106930 105471
18493 105471 61519 43065 49272 59675 64805 69871 67769 60695 60270 50579 59549 82309 99444
18480 99444 121972 126641 127902 123927 102127 93253 98238 111196 107300 99027 94152 107712 118415
18467 118415 113296 129054 126287 107478 109380 117940 100924 103173 113651 102764 99285 106575 122610
18454 122610 137987 136594 141711 149505 127009 122370 107840 103623 101338 74714 86862 111407 116805
18441 116805 104864 99364 82412 78939 82402 77584 67487 68350 73472 69340 79968 103023 104246
18428 104246 102553 98950 118210 135328 147318 159890 161702 166600 153416 137666 129189 137334 126659
18415 126659 121509 133128 150991 162514 157082 135015 152992 153600 148953 146128 166279 176889 164550
18402 164550 132078 117165 136235 147032 139723 155723 161585 159278 139894 119657 113357 109428
18390 109428 115568 115932 118117 124404 126698 112865 122252 141567 157976 139762 131419 143214 146186
18377 146186 149785 151494 133542 121839 114726 114088 132575 147687 163863 157901 152164 164656 167306
18364 167306 162995 159696 159011 158406 152202 141371 158983 170512 167325 177533 198630 221611 239477
18351 239477 266169 273531 270656 251696 219922 202718 179673 162065 163828 165557 179370 183986
18339 183986 169670 184994 201746 234697 244151 242316 235081 226015 219442 216264 205823 190767 180304
18326 180304 167527 164466 156148 166406 182026 209265 237086 236018 236800 238895 235656 277322 314908
18313 314908 330867 337060 334566 355360 370753 404039 440354 471513 499565 507840 482153 448505
18301 448505 423082 421364 441886 485369 568370 672702 711262 716633 708741 695861 712428 709809
18289 709809 723961 752480 800029 883135 957448 1017034 1093827 1234870 1453033 1767177 2347083
18278 2347083 3355382 4527958 4967348 4678672 4010570 3508548 3372031 3521617 3937175
18269 3937175 4670965 5847922 7885559 11492345 17234496 23025927 27159306 29762393
18261 29762393 30629977 28506831 24886294 21930410 19919819 17402895 14396076 11581278
18253 11581278 9864656 9303373 9838480 11608424 14057795 14912734 13585470 11026703
18245 11026703 8574954 6950106 5967680 5398695 5058309 4831366 4674115 4573778 4494189
18236 4494189 4511951 4675010 5094917 5929978 7220509 8256720 8410881 7949204 7432066
18227 7432066 7427711 8098700 9540461 12001601 15719356 19369884 21303804 22262924 24241961
18218 24241961 30051673 39985063 50166141 56465423 56218604 53171558 49692518 49541975
18210 49541975 51973103 53493371 53222410 52290129 50597842 46984510 42830434 37788911
18202 37788911 32013950 26111833 20950503 17409512 15228728 14037194 13724148 14409033
18194 14409033 15493900 15653375 14987700 13929648 13106347 12800751 12911723 13187708 13249781
18185 13249781 13081868 12811940 12574719 12407554 12486182 13007175 14126754 16122115 19437135
18176 19437135 24900263 33587742 44510581 53476681 59635492 65013527 70585846 74423756
18168 74423756 76392823 78065704 78538143 76323937 74118625 75446387 78859868 80626353
18160 80626353 79043204 71924259 61958427 52308182 44731344 39122824 34529448 30603047
18152 30603047 27189991 24122921 21459634 19411252 18299270 18314033 18856314 18452577 17002775
18143 17002775 15084022 13466322 12356116 11637718 11204973 11001413 11057101 11392944 12109754
18134 12109754 13330884 15149486 17350130 19660392 22070481 24461373 26145268 26686593
18126 26686593 26456122 26141847 26268850 27261012 29528767 33438634 39515726 47943887 57127312
18117 57127312 65065568 71926989 77741605 79747068 76219380 69047172 60702328 52461210
18109 52461210 44956197 39699303 39511086 47118133 52277445 48056722 38473239 28544126
18101 28544126 22841739 19870524 18323399 17530661 16830466 15806150 14531918 13236223
18093 13236223 11952859 10708340 9513670 8472828 7677280 7096159 6632333 6249164 5924430
18084 5924430 5606263 5280828 4937817 4600630 4273892 3962036 3645878 3382300 3167513
18075 3167513 2981916 2797385 2627943 2473972 2333202 2207986 2091680 1956576 1875028 1817680
18065 1817680 1733744 1641632 1565216 1508682 1461426 1398696 1323706 1269235 1234621 1177798 1132007
18054 1132007 1086944 1056381 1024281 1007908 977887 939789 929271 898203 865856 845732 803675
18043 803675 794912 765786 736190 715274 710962 692680 676798 687113 679488 656065 644856 650384
18031 650384 641195 625607 624967 625879 611259 602552 599014 571838 544279 536161 523609 528702 544605
18018 544605 540440 524404 517814 513027 530786 527072 511106 517984 503832 478904 467797 467358 459405
18005 459405 454072 465653 432310 425611 411739 408990 403589 414110 413416 413217 403164 403674 420109
17992 420109 427822 430078 391557 384600 391223 379665 382139 366070 379540 393141 408397 416573 416453
17979 416453 428362 412707 400210 384184 388024 392342 393985 384144 360612 344525 328505 313324
17967 313324 318282 328389 328145 345464 365380 368846 366405 371240 367735 370373 337520 313781 326583
17954 326583 335336 331493 341898 330047 348256 328624 306731 323920 332736 322158 310850 327570
17942 327570 350990 379817 381582 365931 380719 394278 391283 410331 400050 385064 399420 389424
17930 389424 385730 394653 416115 429692 430324 430430 430907 451273 448536 446964 447862 439946 433593 465580
17916 465580 497232 502880 507162 520386 549912 547401 553146 574024 585684 596670 636689 660280
17904 660280 670877 660748 669749 703392 750625 822894 920286 1041676 1209336 1408111 1682996
17893 1682996 2075456 2592588 3374822 4699006 7009604 10429260 12816778 13018703 11904076
17884 11904076 10943246 11616792 14605498 20347607 25558079 25766883 21986641 16945138
17876 16945138 13670702 12929386 14592776 17083598 17061685 14590318 10960421 7999174
17868 7999174 6180972 5067621 4326855 3788026 3422695 3216027 3080466 2966764 2872663
17859 2872663 2758954 2647816 2575259 2560575 2625340 2674075 2702667 2730336 2800495 2959628 3215429
17848 3215429 3641173 4320183 5480610 7466796 10351150 12393289 12748326 12288229 12448749
17839 12448749 14414111 17389090 20144728 23722398 29158287 35203626 38789514 37594609
17831 37594609 33425873 29427153 25859760 21842363 17779954 14614301 13394936 14033193
17823 14033193 15025524 14332451 12164002 9491266 7391412 6044868 5176044 4577169 4126080
17814 4126080 3805722 3604995 3460680 3317679 3198556 3125895 3065323 2978837 2860038 2752494
17804 2752494 2708358 2668950 2680594 2724174 2828272 3007563 3327467 3905134 4955744 6904450
17794 6904450 9031376 9656256 9044270 7986365 7687076 8732444 11586444 15565257 16975379
17785 16975379 15314157 12027125 9254171 8049470 8334235 9760402 10421388 9451410
17777 9451410 7464840 5478919 4186159 3421277 2948528 2617678 2383142 2237889 2139106
17768 2139106 2053883 1970097 1884289 1799063 1737533 1718145 1716155 1705073 1681102 1632877 1578786
17757 1578786 1562494 1543483 1536711 1560689 1576335 1589947 1635147 1696026 1790440 1944358 2118626
17746 2118626 2278850 2396086 2515283 2671813 2903915 3250696 3743128 4457089 5599481
17737 5599481 7457200 9724114 11363946 12279729 12808011 12918022 12693854 12602614 13330537
17728 13330537 15537094 20057325 28003185 39574502 52133135 58001275 54664802 46598043
17720 46598043 39907988 39106446 45940915 59416801 70557967 71716225 64678459 56045823
17712 56045823 50379439 45718787 39564194 32442024 26248261 22203992 20237405 20054443
17704 20054443 21541939 24397405 27106560 27974884 27025548 24986546 22605453 20160982
17696 20160982 17937236 16242776 15253956 14923237 15099529 15739296 16906607 18818971 21792959
17687 21792959 26480480 34041386 46045562 63273013 84026685 102826598 112654520
17680 112654520 110402621 99576313 86356170 75988483 69950540 65332139 59764695
17673 59764695 54201225 51327939 53867364 63378908 76988389 85292670 84689901 76891234
17665 76891234 67192185 60749069 59262052 61372642 60683033 54005105 44187763 35353538
17657 35353538 29910394 26502482 23631990 20976644 18704578 17062478 16008975 15414446
17649 15414446 15115106 15092216 15475491 16573235 18392285 20551606 22985789 25852485 28761431
17640 28761431 30630009 30589773 28818454 26373240 24387138 23614881 24540449 27502373 32690120
17631 32690120 39998946 49154780 59786264 70273289 77163280 76507407 67928804 54653559
17623 54653559 41240453 30594986 23273612 18593851 15599690 13592020 12195892 11212505
17615 11212505 10535627 10148170 10056827 10310040 10829127 11366891 11547557 11062622 10033550
17606 10033550 8776796 7637563 6743984 6053351 5492118 5006877 4568933 4193613 3890295
17597 3890295 3597729 3342968 3097310 2871694 2667017 2507446 2377786 2260315 2142485
17588 2142485 2043326 1947271 1844283 1750061 1662205 1572292 1471279 1374696 1300426 1248732 1213399
17577 1213399 1162892 1120642 1068436 1006235 973003 931518 920445 925467 906226 878019 831640
17566 831640 803721 783400 781666 770950 752549 734496 712997 682772 661239 628231 611409 612034
17554 612034 603346 573006 524069 524768 548657 553804 542488 537985 532588 504701 502154 489527 487261
17541 487261 487477 469062 453563 430705 417448 422612 425140 419484 401455 396232 391205 414720 461175
17528 461175 486691 510439 499473 459445 415684 378446 345100 338132 332409 314600 324103 340402
17516 340402 349894 386322 395895 397925 393617 367877 351078 336454 332802 334484 329747 323324 321012
17503 321012 299284 286108 307990 327691 348711 336428 321336 333349 349370 363724 367631 348224
17491 348224 320396 305859 278441 272658 286144 287424 266517 254709 233812 216191 203078 197338
17479 197338 222233 232032 210749 189597 196420 224850 230436 229175 206622 195924 183835 168746
17467 168746 174380 171879 137143 133390 153191 152173 147785 155969 155528 163532 171765 182773 175396 173172
17453 173172 175195 168815 145051 114189 104272 124614 137728 143351 153602 163165 185814 189959 206187
17440 206187 272338 339386 339550 286285 214861 171179 154808 137096 115095 102802 85102 79590
17428 79590 85629 112809 122035 108453 108596 124508 114463 116751 117484 102146 102386 105218 82958 85921
17414 85921 95452 57494 53175 78131 96616 95211 80949 81134 72374 75498 78168 79973 81249 66834
17400 66834 78299 86549 86312 84442 87877 84086 93739 89691 90484 119892 136585 132569 116816 105322
17386 105322 97251 109873 118879 109222 117618 105736 100698 104558 86973 93843 107569 107277 116115
17373 116115 119018 117726 133970 130323 138305 148908 138442 137304 137717 126586 114433 110718 118054
17360 118054 105800 87154 84233 69956 62212 66893 88338 98410 98864 96288 98521 85716 66774
17347 66774 69311 84374 85131 76870 78541 88651 79875 94670 111329 109502 106996 108437 110443 111394
17333 111394 107700 111329 115415 117871 112776 133753 148517 166983 164392 194030 246174 262305 228600
17320 228600 192816 153023 136873 131627 126535 124309 128887 122255 103920 78425 94964 99476 85037
17307 85037 68544 72547 77691 79268 75628 75542 72554 59288 64596 74609 67176 43472 31893 52637
17293 52637 47988 45183 52036 54116 56191 77811 92312 76926 61731 60055 75806 85716 93588
17280 93588 94691 92242 89007 109721 142904 147861 125000 90606 47650 46263 66359 94798 98185
17267 98185 103551 73379 42056 33833 23622 12089 23168 34545 58707 63742 68972 79317
17255 79317 69547 74311 84244 67469 68701 58824 31660 9454 1717 3648 23538 26081 8504
17242 8504 23316 48706 50070 63972 46164 40428 47683 54141 40899 43675 38049 39715 51720
17229 51720 63754 73018 77781 96230 105373 115213 143757 165078 175643 179865 192514 217605 235170
17216 235170 227239 223908 224708 216465 219649 212565 199154 216704 237477 234199 242733 236590 268268
17203 268268 276458 258914 229514 206582 212580 213762 232503 231707 187986 133831 117675 109439 102464
17190 102464 101443 106813 107113 110486 142695 167272 173094 187516 227284 265629 272230 280971 289219
17177 289219 301139 289618 273818 286330 293097 280825 288385 290015 319284 350597 399971 464270
17165 464270 500636 498773 461939 415718 363526 331455 333205 319964 271674 227871 196562 186693
17153 186693 197992 211355 251593 294226 291537 274612 244646 210720 194783 178129 196708 215701
17141 215701 208303 187320 187690 168131 146355 141371 151116 153583 127681 149393 185656 221471 240682
17128 240682 252480 255602 270661 271869 268750 249850 224782 215178 164258 136675 136141 113085 111842
17115 111842 126938 128596 140287 148023 155144 166915 189522 224627 270864 282703 252432 215084
17103 215084 192826 158698 116657 97859 72734 77160 67405 54266 53197 46199 49630 66571
17091 66571 77437 78169 76694 68590 38925 34315 41012 46588 53354 35377 15510 21177 24896 21417
17077 21417 25722 31972 35566 20098 10696 12138 9811 9655 1141 -13719 -19577 -9662 -5309 -6611
17063 -6611 2810 16554 27470 25456 17142 2754 10079 22971 32865 28822 31491 33649 26625 30258
17049 30258 20566 15198 17510 17035 25861 37666 58275 68249 66806 49531 30740 22682 18696 23120
17035 23120 21347 24091 22729 21485 21973 23591 17892 17409 25335 38448 33673 2504 -18792 -44117
17021 -44117 -40756 -5209 5142 -11209 -5165 -1573 4515 24584 28290 16758 14364 12314 5014
17008 5014 10859 -7241 191 38978 61819 69058 63173 36429 22023 -18990 -6708 -3429 4734
16995 4734 20757 15513 4777 25031 24509 31483 14915 7924 -6265 -6706 -17825 -10058 2896
16982 2896 -7893 -8272 4100 6933 1615 -8198 -1503 7311 4167 12684 9843 19905 28186 22140
16968 22140 28071 22168 26094 12121 -1286 -7015 859 12500 34891 23363 -1105 -17298 -17519
16955 -17519 -6532 6395 10251 20548 22740 23493 2166 -12442 -11281 2764 7061 4525 -20289
16942 -20289 3528 -825 -25618 -27133 -25341 -23765 5014 19763 8447 3415 7534 28444 4426
16929 4426 -16809 -3060 22394 18942 29705 20084 3633 5722 21823 19660 4018 -2408 6103
16916 6103 2531 -15158 -2657 20214 20498 14351 306 13909 16941 10825 -9445 -22220 -7824
16903 -7824 -587 -11501 -27265 -19696 5740 17529 10086 4319 10648 5901 16640 25570 27464
16890 27464 23334 2088 11741 24623 24171 11452 22478 30841 24752 21475 23482 20867 23993 29652
16876 29652 11485 -407 -3780 -472 21280 31598 11168 -4337 -2335 6033 -8734 -1934 4951
16863 4951 905 6394 3470 -24496 -29706 -14631 -10173 -13005 -2651 -3151 -14138 -28146 -14587
16850 -14587 -11151 1330 -9843 -3875 18898 23700 9494 -5873 -5923 -2335 -20699 -9892 -6657
16837 -6657 -835 -11664 -28198 -15788 306 11928 17033 1097 -10440 -8186 -6904 -9209 -14498
16824 -14498 -1871 10930 8810 15069 18057 23122 20347 14646 28028 37820 37743 24300 12128 35152
16810 35152 16736 16467 29441 38729 16806 7152 11468 14881 12532 19438 30715 23374 -7640
16797 -7640 -12767 -228 9033 30274 32842 23813 5836 -11941 -26624 -22373 -19445 -1372 11934
16784 11934 12290 6765 22410 42585 34399 24076 32098 22270 23314 31291 8036 32791 56520
16771 56520 56815 36281 19550 13789 -14341 -2423 5452 -7107 -14416 -3109 10923 2698 5292
16758 5292 39822 28446 7848 4916 15555 13356 1957 773 18150 15284 -1756 -3893 -5343
16745 -5343 1397 8177 23651 22521 -3164 -5640 5910 8289 15801 -6013 -7569 12284 21892
16732 21892 17688 15592 23728 17076 15993 9631 -5134 -9012 5843 6058 2120 2257 10234 5853
16718 5853 -11971 -15176 -15416 -7107 -26690 -36726 -19159 7239 8319 27946 33803 37517 21852
16705 21852 22505 29610 30183 39613 64735 53423 34538 12853 4342 27080 25112 17571 6029
16692 6029 -15172 -16554 -9481 -15068 -18892 -1316 8507 -1244 12894 20625 14201 14702 11382 -4588
16678 -4588 -712 -8641 2590 23782 15261 5776 2776 4787 14547 -4762 -23085 -32265 -20149
16665 -20149 -7174 -14301 -27853 -48428 -51414 -47476 -50268 -42542 -34330 -14458 5096 33255 39951
16652 39951 44977 48525 22400 21086 10522 4873 8346 19777 26865 21624 25611 12370 -15167
16639 -15167 -21597 -8325 -23304 -26320 -16526 -14068 -10156 -12006 -23743 -28451 -32687 -28865 -23388 -15028
16625 -15028 -69 63 -9755 -25634 -10344 7150 -1663 -6356 -9153 -3289 -12538 -7810 -5601 -4856
16611 -4856 11700 26765 21741 14686 -10854 -15208 -2862 8078 6983 6037 17196 16789 4215
16598 4215 -15052 -7088 184 13086 15646 28471 32007 27668 19259 28265 29547 24318 2556 -4255
16584 -4255 -18051 -22159 -18245 -6137 2120 -5504 6822 2142 -21319 -35061 -34679 -27594 -18518 -13277
16570 -13277 -12745 -7656 -7612 -17366 -13037 -24508 -18428 -20151 -26072 -14410 -2466 15309 24097 26598
16556 26598 18777 21643 2458 -31151 -35881 -27115 -8269 18369 30431 23104 12813 1101 -1440
16543 -1440 11926 -6303 7465 22209 24391 30875 30862 24227 10523 -4809 -21230 -28425 4870
16530 4870 11394 7711 -5766 -2214 5152 2578 -16323 -2821 -14867 -688 5969 9148 -575
16517 -575 -14624 -1441 20287 770 -16962 -6963 5786 5831 6858 25345 30129 27067 10701
16504 10701 811 -14564 -17001 -14046 -14435 -24398 -30206 -13356 -19224 -20927 -12944 -621 17051 42172
16490 42172 23605 5752 5499 -1189 -6978 -13480 -666 19889 28370 27941 25135 -6515 -24591
16477 -24591 -10339 -6206 1047 -4042 -14555 -15226 -3471 -10070 -14693 -2991 15007 7832 -198
16464 -198 -997 6848 13704 -19823 -13486 -4537 17708 38389 35970 23392 -162 -19288 -14680 -16232
16450 -16232 -29465 -34712 -41310 -36050 -23243 -22315 -12349 18453 13424 -625 19356 41465 46645
16437 46645 54287 29912 -838 -11532 -27652 -38725 -51431 -46530 -46050 -45259 -46267 -32700 -6167
16424 -6167 -3850 -10098 -4494 17421 20545 15163 -11654 -3069 -11909 -11900 -4251 -17535 -22836 -6704
16410 -6704 9426 22081 21462 15696 25342 19155 9894 -10297 424 17574 17866 18313 17967 21413
16396 21413 20163 -6625 -24080 -20789 -18405 -35256 -41105 -24439 -16349 -8962 -9186 -21378 -23444
16383 -23444 -14490 -6254 754 16020 21819 24563 17534 24398 12652 1419 3827 9852 -16972
16370 -16972 -18132 675 15530 27578 24180 17070 2590 -1197 12733 -2583 -21957 -26855 -23816
16357 -23816 1757 19752 24063 30310 16969 8353 -3723 -24385 -17514 3376 3644 -14557 -13807
16344 -13807 -7397 -10492 9212 20946 2985 -5010 1056 5356 -3882 9460 23393 13167 11531
16331 11531 6910 -231 -13486 216 8763 10709 13092 26256 14753 10236 27427 19788 7975
16318 7975 18098 34140 22987 32556 34971 37096 42341 19681 -5885 -11704 -19509 -2208 2681
16305 2681 10068 28362 13989 -2041 -3104 468 6349 8442 15439 3918 -3215 -2816 -1598 -3722
16291 -3722 -17909 -13308 -13695 -37529 -50531 -24905 -3910 -13024 -13089 -17707 -22403 -26407 -28166 245
16277 245 7919 19763 19726 -2052 762 -8953 3600 6207 2272 -8487 -36231 -30083 -12774 -4123
16263 -4123 10251 19659 40224 31915 28539 28446 29095 20397 16287 6426 -189 706 -5948 17660 20570
16248 20570 3583 11766 10076 16097 12046 3169 6483 10926 21488 14485 -15977 -10403 -17672 -11819
16234 -11819 7174 12720 7319 -1993 202 -1389 15814 13228 -10319 -4194 8003 14633 5323
16221 5323 -3735 10071 25450 47543 26496 19450 21903 30178 27001 29059 23728 30551 39949 22654
16207 22654 24146 9984 -7640 -13387 -18568 2500 27168 15900 -6005 -9442 -4387 3190 3476
16194 3476 18212 23442 27335 18106 18313 17680 30110 34305 25159 -2057 -6658 -11434 -20801 -21484 -11839
16179 -11839 4856 7172 15631 21182 24196 30353 19408 19009 16610 6683 7093 20473 -3779 -12038
16165 -12038 -6548 849 -3617 1343 -1668 -3892 -7539 -8055 -14252 -30142 -30602 -17510 -7505 -3268
16151 -3268 -15788 -10950 204 2580 -8552 -12945 -5730 14718 13728 534 -6568 -14587 -20611 -21091
16137 -21091 -31602 -30153 -23588 -14457 -16562 -33714 -39504 -19228 -4058 -18046 -28741 -38147 -16076
16124 -16076 929 2783 -4187 -5665 -23519 -31897 -27132 -20935 -35576 -45290 -20792 -359 8815
16111 8815 -6105 -35029 -28666 -22628 -14927 9263 24898 14731 -5556 -31866 -21210 -8344
16099 -8344 -10362 5616 3287 934 -8021 -24209 -24590 -24019 -33451 -23607 -10870 1831 6668 -11052
16085 -11052 -22234 -24686 -23776 -40823 -26849 -9483 -27565 -27096 -14130 1820 5191 25120 22544
16072 22544 21393 23401 14511 2133 23816 33625 19324 17532 12732 24538 18615 -777 7481
16059 7481 5681 2226 2828 -8870 -18852 -26683 -19336 -1120 6967 19438 19631 16675 4067 -9054
16045 -9054 -11997 -17568 -13872 18401 17439 2672 -18348 -7981 955 -12157 -35908 -50252 -28405
16032 -28405 -15302 -33577 -40168 -22429 -15189 4395 -11065 3230 3923 -4869 -1748 -251 -15377
16019 -15377 -27792 -34156 -49927 -46252 -6803 10908 10117 16864 22057 26344 16404 -691 -985 3611
16005 3611 10775 14465 16295 8207 6205 -3672 -5130 13809 -1842 1530 -3973 -4504 -18789 -25083
15991 -25083 -33610 -18462 -4309 10693 14269 5903 3245 21528 22015 16920 2157 1246 -7271 -8108
15977 -8108 3950 -671 -2337 -16446 -14823 -11028 -28596 -9573 21473 18534 13712 5707 266
15964 266 4324 -16008 1407 15227 26746 20083 -8998 -18299 -13029 5175 8174 -20618 -25254
15951 -25254 -28147 -20682 -12889 2875 21127 29537 28218 23916 37892 34944 25290 13958 30748
15938 30748 42206 26267 21105 34076 26472 12820 5837 3140 2648 5344 18699 5601 -10293
15925 -10293 -15527 -1314 8606 9743 8864 -600 -16147 2184 -7172 -15136 -5535 -11894 -376 -4050
15911 -4050 -16036 14881 15403 14212 19209 35502 25500 5331 7068 27747 28726 9485 -25044
15898 -25044 -32529 -26463 -6975 9220 19747 47222 44195 23854 7198 -1910 -5695 -24119 -28340
15885 -28340 -23953 -5803 9594 8709 1506 11914 -8480 -17860 11402 11408 17557 16278 10062 -2993
15871 -2993 -6595 3371 -897 -18422 -19396 -13880 239 3582 -7332 -18904 -24031 -34897 -21485
15858 -21485 -6133 -7354 3576 12712 264 -7600 -17828 -21564 -33747 -29041 -30828 -41905 -19991
15845 -19991 -5572 -2963 789 -12074 -15077 -12898 -5131 -2815 -8030 -4600 -16581 -11827 -13609 -17082
15831 -17082 -19318 -34226 -34529 -23480 -33750 -47440 -25611 884 -1876 8361 13520 7550 8875
15818 8875 4756 -8983 -7586 1863 6539 -3538 -18762 -12046 -1452 -4796 7374 24738 24216
15805 24216 16369 3912 -3250 -20439 -24172 -24620 -13090 -13736 -42856 -34189 -28510 -12307 9719
15792 9719 16510 14600 4521 1622 -4386 -8090 -198 -830 -20806 -27575 -17637 -17201 -16866 9468 24657
15777 24657 15171 2752 1249 -18193 -29392 -23111 -12304 2197 26367 -9057 -26007 -7274
15765 -7274 16198 -6195 -45393 -38457 -33345 -30647 -31482 -25230 -23009 -22489 -7856 -3468 -5666 -19705
15751 -19705 4706 16978 2707 -3968 -6506 -9134 -5139 -17203 -38238 -40287 -31503 -14804 -2837
15738 -2837 -4107 3152 2681 14054 12645 24986 42596 31282 15398 20048 25891 31288 16334
15725 16334 10027 12655 20040 45232 54190 39044 19756 20037 21596 18378 25970 7564 -6483
15712 -6483 -3794 8355 7488 12932 8939 -1264 -2439 -11484 -10488 -8344 -7263 -4467 -664 2289 5585
15697 5585 5350 -12188 -17919 8898 1508 -20387 -22677 -17783 23108 24346 9218 6133 -4946
15684 -4946 -4004 12157 16158 10978 -4921 13852 21063 10616 6027 3922 -6157 21234 38716
15671 38716 18254 8227 -3331 -2545 -2508 -7794 -4912 -5638 -2125 6988 -5710 -5775 -26065 -9329
15657 -9329 -1329 -8911 -67 30838 21780 11 -24607 -27651 -18706 -9064 17590 6388 -19564
15644 -19564 -19334 -19030 -13087 -8411 -20678 -24302 2398 8097 -592 -9212 -1991 -20718 -1245 -2304
15630 -2304 2155 1754 9632 17858 13084 -4364 -30651 -40417 -34875 -29940 -8113 -14019 -24820 -13747
15616 -13747 -14443 -11031 -19071 -27298 -44316 -26054 -17137 -8636 -10025 -6883 460 9872 16018 3648
15602 3648 -660 -7358 5745 -13463 -20408 -23854 -12068 -28515 -39735 -22363 -12465 -27857 -29732
15589 -29732 -32915 -14223 -20851 -19195 -37610 -48281 -38669 -15416 -13663 -26438 -6086 9812 9538
15576 9538 -2298 -5487 -258 -13016 4243 9896 -7080 -12933 -11221 -9795 2337 8952 17639
15563 17639 20677 7392 -17824 -35080 -30889 -22422 -15620 -4060 19239 26070 6234 -13689 -18476
15550 -18476 -29471 -26779 7687 8393 -3778 -631 3556 118 -8304 -6469 23477 43069 27931
15537 27931 16145 3957 -10073 -25563 -39070 -50184 -33054 -31513 -47410 -56000 -30062 2982
15525 2982 24254 18963 8910 3048 -20629 -28413 -11727 6511 10865 -2679 -17940 -15807 -15358
15512 -15358 -25175 -21877 -12988 1081 8202 11632 12875 661 -25275 -26977 -24806 -24508 -16636 470
15498 470 -12550 -27750 -27398 -36614 -38802 -32945 -20190 -9044 -3199 6601 4609 5161 21068 16206
15484 16206 22994 30898 33469 27887 18832 15970 7773 17392 21237 26974 15982 16440 23420 19489
15470 19489 526 -17617 -16367 1634 1701 -290 7272 23133 3361 -6160 1408 -6500 -13253 -12676
15456 -12676 13168 20505 11107 7807 14569 14654 6267 11395 20772 -2365 -13805 -4829 8487 20080
15442 20080 13552 23429 6868 -12788 -14772 -25631 -21323 -17317 -14166 -10268 -9565 -8949 -12083 -23357
15428 -23357 -44996 -28330 -13081 -10143 -29261 -30350 -29900 -26257 -19065 -24030 -18673 -17184 -11989 -9637
15414 -9637 -9422 -24471 -22324 -585 1358 -16196 -21162 -23057 -21235 -21779 -12829 1426 18007 32810
15400 32810 15985 4287 2918 -437 -17755 -17469 -20690 -24443 -23077 407 6457 29598 -1322
15387 -1322 -19853 1151 -13466 -14586 -21863 -15391 -2517 10236 -4296 -10402 -6277 -10831 13867
15374 13867 23959 6900 -7374 -11566 -1125 23335 19094 795 -12924 -27463 -13278 4364
15362 4364 12802 9680 665 -14762 -27548 -35529 -17219 4925 4502 -1910 -12425 2364 8141
15349 8141 31766 12854 -15191 -19074 -15365 -28736 -28478 -21600 -1221 20887 16101 25857 23109
15336 23109 21432 11837 -20300 -24231 -13425 -27953 -27003 -21287 -8929 -5561 10701 17024 -10743
15323 -10743 10151 23663 13115 21960 14348 8183 16587 -666 -12612 -19945 -16511 -1020 -9800
15310 -9800 -22307 -7350 7577 5394 7046 6374 10107 11229 4614 13099 2342 1432 6599 -2423
15296 -2423 -8620 -4615 -10008 -17608 -14515 -8918 8651 8684 -6327 -10913 -20789 -41388 -52033 -48633
15282 -48633 -35494 -15396 -12084 -24264 -15266 -9978 -26962 -31188 -23142 -6265 10423 7576 -14225
15269 -14225 -13846 11871 19244 9652 -2174 -12991 -4470 -16245 -1551 21570 12933 -681 420
15256 420 6218 -15216 -17408 5018 10664 -3279 -17683 -29992 -23084 -23687 -14338 15701 6120 1086
15242 1086 7240 11660 13093 24703 18098 21946 5153 -9267 -4152 1854 -5333 10494 8560 25238
15228 25238 22697 -3100 -26384 -34946 -26294 -26448 -30227 -33721 -19743 -28767 -25952 -26967 -17251 -10976
15214 -10976 -7601 -21854 -9113 -8598 -19208 -42574 -55342 -39029 -24354 -26139 -36592 -31933 -7006
15201 -7006 20587 47109 43876 12169 -5694 -24428 -24420 7757 18427 14851 15441 18426 16111 10198
15187 10198 2285 21894 24690 9339 40095 33637 27684 21780 12725 6235 -3328 18963 33954
15174 33954 4889 -23677 -23652 -31743 -16240 -14072 -8537 -2651 8286 17868 30284 37503 32066 26445
15160 26445 17985 4821 -10366 2858 916 -20398 -42926 -48906 -57247 -33935 -31321 -38562 -32665
15147 -32665 -25061 -36372 -25878 -8389 -1923 3482 7094 7965 -13778 -16746 -10482 -6158 -15046 -14753
15133 -14753 -21894 -19891 -4697 -12455 -29263 -37858 -28080 -20991 -19545 -396 -180 11002 13591 4557
15119 4557 13735 5723 42 -2337 -1372 6787 13330 20769 752 -5126 13662 8453 -626 -13513
15105 -13513 -11230 -28981 -27153 -5222 -12294 -8107 -45 -565 -5837 -7236 -8074 -23009 3703 -3267
15091 -3267 -15176 -1809 13744 556 5539 -43 -10198 -6859 5478 19346 12662 -726 -6921
15078 -6921 1538 3497 6214 9980 -5241 742 22041 30202 18879 5422 13509 23944 17631
15065 17631 13382 -10834 -26978 -18148 -2167 9327 2231 -2833 6996 23001 20554 23651 12837
15052 12837 10023 9691 3380 -6421 -8007 605 12846 14246 10639 25921 37456 24731 6996
15039 6996 24444 24236 1764 -15235 -3874 -1162 -194 8141 18117 17384 6503 9187 12695 16591
15025 16591 -3814 -357 10813 937 -3881 -532 -4910 -22895 -24981 -22034 -22042 -29120 -37845 -35367
15011 -35367 -43120 -41327 -27486 -16478 -4427 -955 -7875 -8367 342 2333 7331 10330 2975 3777
14997 3777 16792 11286 -1602 -3904 624 -8283 -3327 -11405 -31933 -21926 -7145 -14062 388
14984 388 3920 10298 971 -6012 -20693 -12966 -3224 7847 224 -16812 -33198 -50485 -34215
14971 -34215 -17501 -35817 -8261 24118 26630 12354 6824 -4691 -13970 -26236 -28095 -14815
14959 -14815 -8396 6321 -1953 2849 7458 9522 7179 4564 -35925 -42138 -2034 4635 -10749
14946 -10749 -19063 -37119 -33372 -22169 -10033 6622 4808 -27972 -47139 -30165 -9721 -3273
14934 -3273 23312 4513 -11828 -4942 -25321 -50350 -43553 -11062 2790 12239 11776 5654 15119
14921 15119 17425 11019 -26430 -22592 -11006 -12089 -1067 2266 -6400 -19286 17532 26351 2100
14908 2100 2935 18936 8833 -22843 -31211 -38618 -39744 -1893 29564 30125 22643 20092 -2913 -22302
14894 -22302 -7825 -12381 -15030 -12291 -20838 -28591 -40775 -38124 -27732 -40894 -27000 -11039 -6701
14881 -6701 -8369 -9405 -9558 -7216 -18328 -14633 -20196 -32126 -39133 -51953 -52485 -38447 -10172 5209
14867 5209 3118 15668 18663 26240 19200 5533 -2623 17200 17174 -705 -5019 4358 -2545 -10178
14853 -10178 -12693 -589 11482 16691 31578 9947 -21053 -27619 -19913 -29013 -41051 -24308 -15260
14840 -15260 -16171 -13152 -21367 -33949 -46311 -34638 -12077 -11982 -18128 -9423 -8718 13116 23116 8641
14826 8641 9017 7461 -12160 -22188 -8959 -21459 -17863 672 -19147 -36262 -28295 -20158 -9824
14813 -9824 2091 5770 22139 32503 30739 36404 16726 5704 8119 -5415 970 -15859 -5511
14800 -5511 5638 10415 5477 -667 2313 1189 -4997 -19732 -34292 -33652 -17169 -11385 6273 26979
14786 26979 28105 24404 12272 10939 3301 18886 22081 19713 25743 19046 3135 -5243 13916
14773 13916 231 6914 -3292 -26931 -40702 -39411 -24677 -17360 -1987 -2702 8028 17150 -770
14760 -770 -13512 -6843 -1877 4985 12236 31120 37664 42723 37691 38366 23118 29443 17796 2922
14746 2922 13461 1839 -25530 -9544 -4855 -13789 -14223 508 -954 -8414 -16545 -14551 -6939 1574
14732 1574 -1551 -20204 -2902 13873 26151 17994 -6982 -23540 -22431 -19588 -24301 -17520 -6701
14719 -6701 7419 -3815 5014 8453 -9013 -31831 -30358 -31676 -39309 -52854 -27987 -323 -1273
14706 -1273 -7961 -16834 -20901 -25846 -11283 -1599 9088 4451 -269 -5016 -226 16557 13708 1352
14692 1352 -4240 -14044 -27736 -31573 -38357 -36769 -40026 -14178 -6356 -2887 -2132 -695 5105 -1991
14678 -1991 1548 11280 -5309 -4733 4580 -8377 -12225 2794 1240 -4517 -7453 -10243 -1112 8308
14664 8308 2010 -1549 -8237 -10109 -590 16094 39617 41480 16841 12728 18608 9097 -11856 -35910
14650 -35910 -42918 -29481 -6517 -22506 -32777 -23338 -21551 -19789 -5824 -4513 369 -14069 -20053
14637 -20053 -12385 -9691 -18352 -33312 -35886 -25415 -13747 -10394 -8806 -15076 -20217 -15220 1814
14624 1814 -4677 -17219 -28698 -39467 -25139 -25717 -34138 -24043 -21760 -33209 -38105 -36215 -44800
14611 -44800 -27137 -4494 10982 5376 4073 -4499 -16058 -20592 -3972 13961 11176 -3544 -19926
14598 -19926 -10937 1584 316 -9086 -16502 -22311 -19742 -9167 5519 10545 13948 -778 -11043
14585 -11043 17610 19644 -6496 -22085 -10839 -6210 2934 12214 23301 24622 12623 2731 -1561
14572 -1561 -2218 -16693 -35532 -30217 -28632 -29174 -36773 -32366 -23706 -8243 -11708 -9797 -3934 -4246 -619
14557 -619 5033 8624 13743 -12574 -29014 -27270 -8682 -9567 -23951 -33806 -30565 -22845 -24331 -27499
14543 -27499 -8915 14917 23178 37491 54699 69109 43863 8771 -15696 3052 10923 24477
14531 24477 29595 7415 -4340 -10319 -7015 8315 8985 9518 -7971 -12134 -28397 -34469 -15585
14518 -15585 3470 -11910 -22873 -18015 -20237 -19540 -17524 -3823 19037 26468 15225 1312 11405
14505 11405 6372 20672 13967 4564 4503 23091 32456 32180 26847 373 -32903 -40401 -32229 -10889
14491 -10889 -16624 -21754 -21002 -16334 -636 13282 4738 1675 401 -2460 -4008 -8925 -20520 -25560
14477 -25560 -26100 -34045 -35067 -25858 -23383 -8404 8159 -1564 -21146 -17483 -4854 4519 -1170 -10371
14463 -10371 -21147 -11541 -13732 -15918 -10894 -1969 9454 9601 17509 7041 -3067 -1486 5098 11932
14449 11932 -1152 -9359 -14872 -2819 3500 17221 23035 2720 -9166 -20136 -21088 -29392 -35328
14436 -35328 -21845 -11962 -17303 -12823 -1072 -28085 -27833 -10508 -10659 -10383 -4235 -13590 1035 7543
14422 7543 1382 -19899 -32341 -35105 -14304 6773 -7461 -17810 -25179 -21891 -28320 -20477 -7857
14409 -7857 -15223 -35573 -34019 -22626 -2468 -2567 -3879 15372 20096 11081 -1160 11940 15496 11172
14395 11172 -6254 -16992 -4568 -6062 -15387 -13114 -5436 -11136 -23683 -16136 -1858 18951 32954
14382 32954 6707 820 15012 17708 -4713 -14189 -14433 -20485 -538 -39 16634 21759 16996 7809
14368 7809 6889 18316 25964 6623 12995 22514 16246 1817 -5863 -2629 18076 29713 22774 -5771
14354 -5771 -20593 -16892 1341 5583 -14385 -22440 -11729 -9976 -7909 -14216 -23159 -9548 -13728
14341 -13728 -14216 -16272 -10505 -16290 -40014 -20432 7318 8241 8119 10782 14208 4744 5762 21228
14327 21228 19943 5493 2154 10841 20694 39465 40829 19609 32005 22857 18808 13008 9784
14314 9784 -13930 -31566 -24172 8020 6818 -7982 -3333 -8516 2581 -346 3653 -10873 -8175
14301 -8175 -5447 -14446 -16930 -16507 -26527 -20179 -13602 -8506 -4441 -9677 1644 10690 10030 3871 -13865
14286 -13865 -22087 -8150 -10630 -1284 16503 6351 -4312 12336 35807 41255 26329 13998
14274 13998 -7154 -812 1581 2838 12366 20019 22299 4670 -5050 -12956 -17832 21165 34658
14261 34658 12784 -16970 -10605 4600 3479 -6658 -3268 -1303 -3906 -8308 -648 14854 17113
14248 17113 -11442 -1963 -75 -10357 -12152 -20636 -29853 -12367 -2596 5135 1103 -231 -5289 -26416
14234 -26416 -23773 -17153 -2481 4198 -21009 -48936 -38507 -24791 -12025 -3903 -13595 -9910 -14671
14221 -14671 5208 2379 469 -6324 -22301 -15392 5255 -1575 -15399 477 13535 31375 45821
14208 45821 27917 -6665 -5002 -20782 -9321 3045 25822 17820 10926 14149 15601 -736 1853
14195 1853 1901 -1729 -9599 -12061 -11101 7509 4996 -6201 -4522 6550 26 19909 10045 -5289
14181 -5289 -24384 -27405 -38057 -25759 -14073 -11756 2901 -16775 -37901 -30179 -30338 -33268 -22091
14168 -22091 -8276 4548 17151 242 -6945 2757 9682 10706 -1300 -13778 4738 2186 -10767
14155 -10767 -19038 -36534 -39530 -23797 -15903 -13376 -26389 -16072 -2625 6546 -1975 2843 8169
14142 8169 -9060 -3331 -16183 -10391 -19007 -10424 4283 7335 -1722 -2128 9059 -1208 -9985 2034
14128 2034 3002 20249 3227 -23754 -27986 -13283 4752 -582 -1897 3183 9907 -10850 -33849
14115 -33849 -49756 -27334 14945 21712 10479 -5571 -1486 25785 27519 9045 -5534 10578
14103 10578 35851 22113 17692 31120 19420 -11059 1444 12283 -2492 -11588 -27973 -24629
14091 -24629 -22592 -27073 -42465 -29363 -28608 -12428 1639 1654 -16437 -619 23947 15591 -4282
14078 -4282 -25771 -18061 2802 29211 29604 18016 4460 -6298 7217 22095 9322 9390 10263
14065 10263 13291 32320 21991 12037 9800 -3938 -11287 -3210 -13151 -14643 -14061 -10490 -3159 7448
14051 7448 4969 8390 13993 15447 -4617 -30611 -46277 -19962 -1214 2462 16011 17488 13357
14038 13357 11233 7849 -12554 -16890 -149 -8611 -12702 -2746 6710 12169 11617 34153 18951 -1231
14024 -1231 -10309 -4080 -6180 -187 1042 -2262 7474 12357 -2738 -10436 -6185 5534 -6427 -24860
14010 -24860 -15588 -5649 -12725 -696 -5677 7930 5858 46 -8285 6397 18365 10395 -1897
13997 -1897 6377 -8451 -30037 -17635 -2674 16026 23645 8090 12212 -83 1901 939 -24005
13984 -24005 -32630 -40525 -12087 10069 36044 65234 80711 82893 117618 157167 178320 194905
13972 194905 221298 245269 258339 233374 197274 185716 148332 109229 95815 89773 83237 71954
13960 71954 64901 33272 27638 16554 -879 -2850 -1135 1900 3466 7855 -6193 7408 12180
13947 12180 43247 42204 30892 23122 30568 18602 -3601 -31349 -39640 -30360 -22549 -17299 3573
13934 3573 -2071 -27525 -29478 -29658 -28993 -27921 855 -286 -7902 -4700 18262 25883 20172 -346
13920 -346 -10602 -22843 -25802 -8755 7163 -57 -20734 -8400 12551 22297 23353 18013 30034
13907 30034 37790 38061 35878 40255 20169 20552 21781 12957 1343 674 5552 17252 17130 9684 3649
13892 3649 -6044 -8462 11803 20491 10821 548 -6515 -15486 -32582 -42087 -33243 -51308 -58489 -50454
13878 -50454 -25045 -17463 -14920 -13583 -26278 -17229 5936 -5017 3984 3884 -5895 -633 -16754
13865 -16754 -7638 -4212 -5376 -19045 -17273 6437 17975 26859 20584 20798 35263 43242 25528
13852 25528 8406 13582 28157 25038 12395 699 -7840 -28019 -26074 -18974 -8035 -26039 -40363
13839 -40363 -29784 -19319 -9737 -23789 -14928 -406 -11289 -10158 -11914 -20801 -21087 -8254 4960
13826 4960 1908 5647 6687 -8763 -11064 -6259 -623 3731 4724 8839 17482 26285 15913 15641 31202
13811 31202 38121 21195 -22167 -26956 -7600 23089 39331 17635 19524 17591 -4590 3193 1527
13798 1527 3692 -8049 -20688 -12135 5563 10496 9612 26303 34401 39240 13942 10525 28599
13785 28599 37104 29539 18290 8797 -5758 2113 5769 9875 -10733 -14867 -14726 -8815 4915 19532
13771 19532 12834 8059 3070 20793 30314 23612 25043 15695 -16655 -35075 -35600 -26746 -21555 2849
13757 2849 -14317 5107 9328 19672 24724 17931 24854 25052 16366 -478 -16128 -11744 -96
13744 -96 -4876 6181 6863 6443 22510 12058 21328 29832 26003 19996 35477 30304 17101 9570
13730 9570 14869 15024 18894 24880 18102 8757 -15017 -1481 12020 24788 29408 13452 7286 20453
13716 20453 31205 37098 40508 48592 47106 31950 34990 42191 23722 28392 16661 851 4912
13703 4912 25516 47058 55986 43216 41679 39087 39571 17545 6566 6576 15883 16973 13566 20920
13689 20920 29975 28167 20928 14359 11317 11273 40223 52699 34209 30488 36787 59225 55149 42603
13675 42603 40894 47377 47376 40952 37104 42403 71966 89510 69474 43755 30185 19841 42477
13662 42477 50995 64585 70159 54046 56331 74229 49320 39298 63748 75685 69056 62009 67038
13649 67038 70697 63149 70838 66640 61978 53112 58940 54425 31243 53426 62833 66701 57245 64475
13635 64475 47877 44812 43634 54556 67769 93426 91899 71337 67562 66705 58469 30786 17958
13622 17958 29615 30268 13927 15780 38285 31521 15174 41164 52617 35149 15441 19053 18201
13609 18201 29838 37094 43189 50575 35562 12912 106 9106 663 -11780 -11724 -9895 -8851 5676
13595 5676 18281 22963 8614 -14015 -26586 -25102 -20349 -12234 663 30687 44087 39084 28347
13582 28347 36130 25826 17449 19809 -2234 -24244 -17815 -22861 -31982 -28415 -50493 -51679 -27330
13569 -27330 -19776 442 28110 33660 31834 37758 21005 -27 496 689 3784 6947 24498 25812
13555 25812 21627 9943 -4480 -14083 -17648 -15865 -2748 15722 11521 11492 1560 538 11443 5881
13541 5881 5021 0 -484 502 -2367 -15695 -15623 -27359 -19532 12149 9834 -1991 10306 8642 1286
13526 1286 -1335 -3267 -1517 -2169 -17221 -3027 19420 24023 24246 23779 11140 -2908 -4588 10582
13512 10582 30650 26923 19222 19583 9057 2273 17053 22066 18310 15674 9790 11646 19782 8842
13498 8842 5766 -738 -341 5320 19329 15557 12308 1956 -1275 2968 3511 9239 43775 41545
13484 41545 29622 30152 49769 47162 36905 40815 15513 -1868 -21544 -15129 -6741 -4892 -10984
13471 -10984 -10450 -6643 -536 5210 9065 10032 -5045 -9290 1972 -2072 -7036 -3377 -27167 -20835
13457 -20835 -19137 -9014 9503 15261 25969 17135 15934 23316 23895 -2300 -4104 -14421 -21203
13444 -21203 -12793 -4633 5499 316 -13200 16703 22141 3081 -224 -9749 -3419 3164 -8371
13431 -8371 -8492 -20535 -2546 2784 -2163 17399 30050 21883 -6512 -796 14433 12545 -10142
13418 -10142 -17320 -14696 -3095 2028 -9848 6069 9932 -11064 -14463 -7168 2943 -26 6684
13405 6684 9719 6248 4859 -1327 -2441 -2405 -9522 -20640 -28710 -4720 13387 20090 29721 32446
13391 32446 21265 -1115 -21305 -29488 -18720 -29318 -29018 -7242 14085 -6464 -10312 9217
13379 9217 19756 18199 10377 19292 30479 27964 20584 4868 2975 24348 20551 19143 15545 4747
13365 4747 6782 2337 -2580 -10516 -13957 -29407 -34594 -24450 -35592 -26985 4517 19620 20817
13352 20817 11104 -15056 -27265 -29636 -9441 13121 24316 16045 7249 -1110 -6977 -15898 -6619
13339 -6619 -17101 -26968 -27681 -38135 -12162 7464 6591 22637 28492 23013 16541 9525 -2113 -6975
13325 -6975 -14502 -9129 -13788 -5756 4619 -4763 -24843 -42584 -41779 -28362 -11322 -10808 -1561 504
13311 504 -2107 -1507 2745 -16863 -15730 -553 3614 12043 -832 10160 24277 7121 -21546
13298 -21546 -35996 -17900 -5299 -9347 -16305 4078 13753 13598 18210 13974 -1675 -2013 -16533
13285 -16533 -26143 -19023 -7099 560 13275 683 -14099 -2701 -1439 -16998 -28389 -21394 -12823
13272 -12823 -11226 -8775 10383 13329 11518 3121 15093 30717 27710 19307 24133 12375 -2752
13259 -2752 7317 25113 28410 28380 18372 220 -9945 -11581 -14644 -5034 1262 -3209 -7757 3485
13245 3485 2900 5316 19188 30816 42266 53617 49738 17429 5145 8528 6550 27973 31248
13232 31248 36620 43242 22863 5676 6742 6565 2232 -4884 4578 23980 20208 3477 12361 8215
13218 8215 8990 11411 9957 9419 14784 29678 16325 23938 25914 30765 32031 53997 84254 91748
13204 91748 92670 97114 86441 65151 64661 47520 34864 39525 36839 41240 37970 30265 14152 -448
13190 -448 25134 49375 51694 33062 24551 34946 23937 13882 29988 20755 16276 6989 437
13177 437 -4056 6737 6855 6994 567 -7642 7044 19585 -1128 -10436 -10231 7999 28760 61918
13163 61918 80682 113630 176900 249873 300009 276571 233699 177796 114853 80505 65777 36157
13151 36157 44774 61554 49635 47391 44182 27127 -18251 -25462 -12084 9636 15672 21539 15634
13138 15634 16979 26391 26497 44394 53395 44332 32705 22965 7415 14699 7546 12479 32547 40121
13124 40121 45684 34932 28704 32848 47750 64748 71245 104163 153070 228549 293672 320764
13112 320764 257336 185815 143788 98430 61714 40246 43494 58323 52757 39653 47921 49832
13100 49832 40062 44161 39867 22021 -1753 5809 12933 13990 16876 -1712 -6607 11343 6327
13087 6327 -12235 -15903 -18740 -13552 -86 11064 16008 15404 12041 19098 31140 39752 46893 51097
13073 51097 60755 63722 55444 93728 110638 100988 81225 59891 32615 2931 -19265 -15912 27735
13060 27735 31025 15644 21769 22609 29742 36387 44155 30063 24439 22558 32123 28883 29900 21022
13046 21022 37581 50857 36635 22616 13219 -4872 2691 17644 35627 26503 10815 6284
13034 6284 7308 10773 -893 7251 -1529 -2424 -9692 -17174 -3389 -9983 -24312 -25153 -19066 -4422
13020 -4422 28632 47006 13620 8055 11072 1289 -5463 -6905 2718 -7454 -13139 -6827 -7634 -8293
13006 -8293 -1270 -4738 22335 22530 21428 5390 -7131 11433 10939 18207 14841 7832 -8331 -14378
12992 -14378 4024 3554 276 16172 21290 41139 46220 19889 11907 2039 5462 24222 39651
12979 39651 63659 69840 64327 50425 28923 21023 44645 63846 40875 28532 32554 15855
12967 15855 -8666 -21491 -19509 395 3262 3120 22553 -3149 -18291 -18390 -13691 8224 17549
12954 17549 18450 29474 23523 16436 19611 25131 43296 72131 76019 92985 89340 107582 97502
12941 97502 107503 147221 171223 211004 258605 335856 408130 494599 579369 647733 720689 758039
12929 758039 762059 739739 693620 634853 563980 475086 395605 340579 296475 245521 221277 208379
12917 208379 176589 160734 144017 138717 128319 124768 112414 117014 106516 85293 60998 61765
12905 61765 65145 65361 69306 72853 60282 37512 32230 52278 50213 33891 28095 14357 18886
12892 18886 26327 24012 14657 20086 27136 32395 36427 34593 13608 -10734 5464 1938 1254 18945
12878 18945 33411 43853 28768 13371 17261 12242 13599 20025 13926 -1827 4561 18828 13388
12865 13388 14284 5766 13925 28116 26550 19378 37882 24520 6196 5573 7222 8146 25272 50315
12851 50315 26277 14226 23826 22679 29976 48890 60936 71468 51004 31996 32244 28243 19642
12838 19642 14689 19010 54573 74625 52594 41704 33178 44809 45647 51781 59821 49437 56838
12825 56838 72626 66830 69738 83194 84341 90234 100150 99380 85021 83789 83189 68145 55809 46916
12811 46916 49788 36958 39666 43870 19260 7069 259 -15413 2139 13793 14155 15501 5936
12798 5936 17721 45482 27721 12717 16743 24400 33607 31474 20876 17810 11621 37050 36313
12785 36313 33944 50196 67073 85038 91191 78456 84216 88706 78218 86386 98554 100163 75013
12772 75013 61383 69880 75180 68712 94938 85962 66968 67097 48505 49481 68096 88411 89180 78307
12758 78307 87274 89675 114848 146653 129365 109484 120837 130693 122715 116135 128729 123198 113195
12745 113195 105407 104197 112349 112981 111073 97806 88720 83668 95089 87724 60718 63304 87778
12732 87778 87081 72596 65022 79858 93577 86121 96805 100580 70299 53499 44418 65759 95654
12719 95654 120584 123407 108495 114321 103970 108680 126249 132552 115471 111119 106738 114437 129971
12706 129971 136374 128778 101189 76557 58646 48697 38631 20116 -2698 -7605 -5672 -31416
12694 -31416 -27574 -32813 -26030 -3526 5213 8000 29024 42172 33872 47615 75467 76355 66898
12681 66898 61122 53501 77747 89435 78730 74162 66152 75363 51095 44831 48507 39693 10815
12668 10815 -6766 -22585 -38618 -36981 -56591 -55818 -35530 -25388 -35402 -45732 -20451 3355
12656 3355 28185 44230 40684 41416 50629 53584 72728 93651 101412 76219 66411 72991 84242
12643 84242 90222 101995 106677 104201 97106 106396 106797 108255 114481 135940 141927 137830 147780 146083
12629 146083 142885 152399 151084 144561 125291 113734 124875 147683 156963 161927 171821 164153 159418
12616 159418 164140 157994 164383 170490 150805 163863 193920 189980 192371 203055 219936 235588 250729
12603 250729 242234 246815 270442 302352 309646 289046 273672 278445 280350 295612 321795 325112 327712
12590 327712 349359 391876 407943 416867 412701 437250 452873 470420 487158 495934 495720 505694 540149
12577 540149 558470 546441 536659 556201 583390 600122 619296 657759 661953 682678 701862 710277
12565 710277 718217 736659 756179 762276 816148 839383 842093 866877 911790 966035 1008213 1046684
12553 1046684 1094984 1140256 1187596 1259786 1312456 1355625 1431446 1533194 1628486 1733886 1847468
12542 1847468 1969043 2110572 2253010 2425945 2624942 2821115 3055111 3330975 3639999
12533 3639999 4026126 4517342 5121625 5831310 6674733 7674177 8837622 10135130 11612576
12524 11612576 13271168 15208179 17551009 20504396 24412322 29741566 37097158 47134630
12516 47134630 60124780 75702857 92932534 110465600 126651687 139646255 147665922
12509 147665922 149450111 144853206 134786034 120797207 104558951 87819549 72121559
12502 72121559 58660408 47997216 40016573 34199372 29972300 26818241 24322121 22258698
12494 22258698 20459844 18841657 17333520 15908106 14564790 13388413 12360409 11424895
12486 11424895 10601057 9875940 9219172 8592071 8008623 7471691 6980310 6510433 6058780
12477 6058780 5622828 5253879 4916579 4608577 4320947 4067522 3813989 3567416 3326576
12468 3326576 3124292 2929024 2756633 2605438 2467465 2324510 2208500 2080803 1969639
12459 1969639 1861314 1737907 1636999 1559488 1478910 1408421 1353519 1292242 1222752 1169948 1139451
12448 1139451 1095747 1031721 969083 943822 916540 890677 856885 822119 796084 769501 720567
12437 720567 679541 664732 638831 626411 613688 606329 598462 598558 592463 574188 566692 578427 593834
12424 593834 575445 565329 550560 536013 546366 536943 524018 531482 544619 553313 544316 535074
12412 535074 525078 518705 513890 520263 529050 543256 533867 530924 526541 526365 535756 530795 537647 537360
12398 537360 544660 549443 547603 537594 524723 540986 562497 587798 612891 659569 698823 729210
12386 729210 719378 666911 572231 499519 445618 406626 373037 343271 335931 317980 338499 344049
12374 344049 321248 325499 328541 305988 269305 278167 296008 310153 320236 311169 318274 345885
12362 345885 354042 363679 359721 347490 361341 379473 371427 345428 337916 333626 345130 344744 334661
12349 334661 307463 288141 277731 264958 250201 261781 259615 244955 223030 219868 209205 190640
12337 190640 178143 188967 220530 213530 179815 183958 201787 222992 237955 247001 261413 278269
12325 278269 299220 301176 296480 289565 281750 270670 260257 278417 272521 267899 265720 274048 305602
12312 305602 323218 359088 399491 425202 436627 449727 457777 422786 386127 356647 339320 293744
12300 293744 242842 213110 208450 218267 214646 203398 199476 184763 165559 138728 112778 118784
12288 118784 148471 145970 140738 137753 109016 89562 101519 106341 90573 95262 96943 105006 100687
12275 100687 106202 90192 79800 67407 55563 58310 65113 72637 78166 68405 62143 64107 58522
12262 58522 36759 23759 22495 44669 45223 25473 29800 48282 45056 43601 53967 54525 29794
12249 29794 49713 39948 36029 23138 14375 21232 35741 39386 43474 50690 42110 45131 41649 47456
12235 47456 64799 69402 77982 90874 76038 49896 31102 30206 37880 43794 61851 58260 38202
12222 38202 30433 46682 68422 66888 55955 46004 29430 27817 19300 23490 32752 44169 57361
12209 57361 56084 56463 69938 51670 49460 50900 36884 10833 8819 -4446 -10020 -31026 -25423
12196 -25423 -10146 -9391 712 5677 15059 34724 60307 53429 27371 4913 4433 15031 18723
12183 18723 37161 35822 40447 39489 20369 28901 38924 43659 25619 12906 10740 19864 24618
12170 24618 29300 44709 51953 50696 54010 34584 25786 19605 28366 33508 24852 9076 24856
12157 24856 26249 23328 47969 70250 66668 62245 57056 27366 7910 29000 52746 69612 80492
12144 80492 82079 93113 100476 108530 116694 112207 100294 81959 61390 48893 53488 46343 57336
12131 57336 52200 45308 62354 61819 52900 47875 47073 58425 67022 65502 65837 66766 60463 69333 88556
12116 88556 110149 106397 122139 152790 152810 159277 150205 139106 133712 112309 106227 98016 94010 103317
12102 103317 120791 123683 116719 134045 130060 114301 121675 115444 128786 172998 222925 278988
12090 278988 344093 421798 497268 579839 665926 739752 776374 801369 797488 757602 691101 606001
12078 606001 510135 420420 347938 312724 265645 218110 192166 171459 177566 177681 153312 138506
12066 138506 114381 96729 88448 91667 97301 90900 78618 80684 88783 81217 51830 48699 55619
12053 55619 52904 46258 48015 25518 19425 31710 43490 25171 -2356 -19198 -12872 -9852 -2999
12040 -2999 7313 -10013 -17904 981 8841 12756 12107 16595 17654 20955 8122 18852 22808 30383
12026 30383 19314 11808 6284 16899 18198 23954 5331 -841 21337 39471 36719 32833 36436
12013 36436 33785 23825 17719 17825 39952 38258 19080 27227 23787 2610 10086 -2813 -20641
12000 -20641 -19724 17133 29914 35792 29526 21442 16771 44394 50623 65530 74205 71863 84349
11987 84349 126195 166933 197686 244640 317782 344290 393696 449668 452239 431062 408689 380140
11975 380140 327562 260095 200968 161178 122208 96738 95484 76910 42742 50270 57908 27681
11963 27681 26243 12462 18712 35349 41489 61600 53545 41024 23086 -3440 -17655 -19496 -13506
11950 -13506 -20589 -27326 -22589 -5153 9294 20574 31951 24746 21689 14532 13538 9646 -2550
11937 -2550 -2420 4644 -5190 1939 5815 -3425 -7113 -11067 10827 23715 18629 14205 -5661 -7801
11923 -7801 -210 17528 19683 14918 17549 3467 -3627 -7632 -2114 8176 2542 8291 20411 27544
11909 27544 27446 27287 15704 3218 30031 41723 38624 19041 2955 29750 37603 28190 27104
11896 27104 12809 8171 25579 41958 28619 22227 19371 21750 17176 24950 44551 18275 23922
11883 23922 26025 -10418 -25020 -22778 -27471 -31314 -24892 -16348 -1716 16843 22035 16564 -6555
11870 -6555 -8648 13329 42666 23636 4817 15014 15031 -1821 -4836 -1178 -6466 -1585 -1545 8588
11856 8588 19798 10459 -8052 -7002 8493 10753 4761 -1608 -2620 6432 11004 -3853 -6077 5082
11842 5082 26198 20421 -5220 12085 9989 13675 22500 29987 32416 27333 7378 6064 -2310 -1715
11828 -1715 -1785 -12669 -20486 -18258 -10733 -24975 -16943 -5202 -11036 -3450 -12846 -32363 -43760 -32370
11814 -32370 -29293 -21734 -20039 -27156 -16515 -351 -4296 -25227 -11952 -4101 -12286 -23805 -1718
11801 -1718 -3980 -2027 10761 9053 1091 -7333 9410 20289 6466 590 3703 -3440 -18085
11788 -18085 -19205 -4269 -512 4004 2399 -1892 -5731 -7455 -16389 -2095 5247 -7957 -919 -2147
11774 -2147 8393 8614 19779 10235 -18689 -30757 -24057 -21235 -5791 17451 24270 10296 -12494
11761 -12494 -10804 -4003 44 -7384 2440 10217 -1716 -19630 -16442 -7267 -11105 -15547 13716 15935
11747 15935 -9297 -16090 -22917 -32759 -50633 -49658 -30828 -15007 -14280 -3648 2428 -8528 -13469
11734 -13469 -2360 -9167 -27083 -37225 -22369 -7362 20259 31777 19728 -10088 -28470 -31473
11722 -31473 -21506 -19436 -37801 -36756 -23523 -9316 683 -124 9248 29916 28855 19595 7919
11709 7919 2782 -147 -912 5300 9241 14279 6356 -10444 -21274 235 27100 17303 2215 -2626
11695 -2626 10963 13455 2211 7358 22387 21065 32270 28087 14994 9609 1309 -4191 -6815
11682 -6815 5771 11588 19478 11982 18823 21289 9735 2489 4154 1329 3505 1103 -7985 -20712
11668 -20712 -19596 -21891 -25747 -12306 -3947 -16088 2869 20342 13373 14096 24341 16773 -2924
11655 -2924 3470 2390 1400 11662 10618 9108 19389 17965 2932 -15174 -16079 -11560 -5135 424
11641 424 -20869 -25764 -32154 -38565 -20688 -20245 -33791 -15668 -2258 -12065 -15133 4941 8821 6298
11627 6298 -9825 -10540 -18188 -22716 -11203 -9754 -11148 -1684 2936 -8738 -18478 -33089 -36503 -22925
11613 -22925 -15706 -7673 -13344 -13352 -12410 10118 17607 7608 -1842 -6069 4843 8416 9765 11265 17288
11598 17288 13025 13027 15138 19636 24572 14449 -1872 -11713 -22844 -20172 -21095 -12134 -11170 -17546 -15703
11583 -15703 -24044 -37846 -1951 -2683 -6174 -11016 -16203 -23022 -6817 4581 26023 24741 22709
11570 22709 18792 -3304 -17005 -21517 -9432 -1998 13467 20725 14223 4148 -1616 -8297 -14598
11557 -14598 -16986 -15393 -13141 -9632 1371 3005 -1315 -9077 -20588 -18931 -38714 -36116 -15484
11544 -15484 10587 17684 3722 -6638 -8127 -5395 -8474 -26665 -33614 -14827 -6997 -7375 12024
11531 12024 18208 1496 -5370 -4057 15981 21740 21215 15095 -390 -11852 -24807 -23484 -21261
11518 -21261 -12537 -5139 -2237 2566 13624 5319 -1236 7368 14216 2371 13879 22551 21631 29707
11504 29707 29215 12792 10542 14463 14385 21916 9096 -6692 -4940 -936 -14470 -7548 -7536 -16599 -25101
11489 -25101 -18439 -16701 -8107 3086 24712 20631 -18139 -40430 -9863 -7307 -15240 -8385 1949
11476 1949 166 -5502 -19648 -3994 13003 18753 -530 -6235 5232 25921 13190 7355 3388
11463 3388 1699 -2315 -4635 17013 20749 6883 -718 6692 22389 34466 29259 2573 -9363
11450 -9363 -15903 3085 15440 -3623 3018 5882 6302 -24315 -27435 -16421 -13402 -16276 -19700 -20281
11436 -20281 8053 23145 49485 38025 33383 17396 -395 -6341 3326 14450 19364 31018
11424 31018 42492 34947 41154 54581 82465 96868 110526 104599 106682 154185 187566 216641
11412 216641 218799 199823 185107 184116 158566 138831 102287 82022 72939 66567 44168 24671
11400 24671 24007 34161 47159 44088 16275 909 16579 19378 8710 5594 20557 42447 56519
11387 56519 51054 28321 51207 51577 41555 30436 13420 864 16389 13142 2713 -7039 -3998
11374 -3998 19167 22888 4753 -4848 1585 15812 17828 23276 12474 19578 15188 9935 17320 46929
11360 46929 55726 52665 45980 49707 63058 76880 83658 74033 43363 4073 9817 15194 20994
11347 20994 6557 -10601 -10768 -10515 -11025 8517 16346 806 3110 -705 -4215 -8985 -2697 11509
11333 11509 20545 30111 32621 34976 8040 -1766 -1890 -2661 -4754 8625 22807 16690 16274 9329
11319 9329 316 14533 7954 -659 6283 20812 32768 12863 -4946 -9677 -7566 -18651 -15579
11306 -15579 -15534 -9755 -1158 6367 17316 14406 28915 47146 53295 48513 36913 37126 33317 31126
11292 31126 12167 1220 -10365 21300 54542 60505 52317 50103 51558 57417 38231 24639 40268
11279 40268 36283 29756 32623 38025 22239 24371 33043 32110 27832 7924 3491 22594 43345 37683
11265 37683 9367 -12361 15681 36252 40477 47862 41472 29428 18164 17680 9594 3761 29296
11252 29296 46157 30564 17291 29508 43930 46589 42050 41668 48472 62989 74156 82254 56761
11239 56761 55516 55498 46370 27999 12651 20175 28257 47721 60448 43546 23382 13576 3652
11226 3652 214 -2309 10496 6360 991 18378 20387 14129 8114 -12606 -25980 -13887 12001
11213 12001 39475 57547 54370 45598 49914 55269 42276 37837 29549 38641 34370 23782 24664 25792
11199 25792 26825 31047 34100 26416 35106 21587 16714 1861 10651 36764 36190 27795 19514 35338
11185 35338 38009 37485 43719 37578 25079 39112 60535 56264 54617 43732 62618 79748 76989
11172 76989 78631 60089 73646 96192 87419 81228 66918 57147 48993 61393 92637 100915 93664
11159 93664 80543 66294 58651 55450 55698 44256 61767 71648 53716 50620 71210 101615 112449
11146 112449 108173 95821 100001 129524 141662 161421 171812 156209 145647 128484 106751 123221
11134 123221 111812 104510 114599 118136 130526 120960 119985 139710 140237 145261 124366 123156 102130
11121 102130 96005 111019 111715 114138 115643 135536 149991 152603 133920 128466 119835 96589 86199
11108 86199 77779 76475 65148 64154 82547 78776 70987 101334 93912 73596 87581 86763 73363
11095 73363 70868 74606 75277 82819 82440 78272 79712 55455 32382 43075 41929 32864 16787 2941
11081 2941 1914 -2044 -5253 3074 12090 17720 12856 24122 41934 38464 38286 38098 57435 55025
11067 55025 50415 54263 64290 56900 56095 60224 67532 61769 58150 35877 19369 22387 23360 35657
11053 35657 48926 56694 72599 75095 70362 49421 40520 38951 12227 -3923 4003 20966 39363
11040 39363 50284 28424 -6264 -10833 13687 19931 23131 7210 15051 25255 35750 42075 27253
11027 27253 30263 48554 55109 39762 34637 42315 37327 5726 -9327 8818 29826 44300 59867
11014 59867 65845 53142 45302 28585 27920 38826 52162 55208 59908 63461 50818 42556 27498
11001 27498 24144 22163 29787 24074 14053 19192 27458 40460 62124 46480 39769 27879 15225
10988 15225 17587 29446 15098 2411 8402 51423 80048 85026 90857 76010 40149 21964
10976 21964 38001 36262 22832 36006 49917 37535 38332 45291 54289 56453 53986 43302 42159
10963 42159 37379 14999 12898 22117 35400 34616 25748 24154 38197 50176 63829 88919 114857
10950 114857 112624 119135 114168 120872 148077 173587 201089 222780 251645 298860 387965 493821
10938 493821 651372 874474 1163582 1491548 1716690 1728710 1533539 1233624 943316 718828
10928 718828 559092 430708 360515 321848 276929 247221 232271 213664 185950 159633 145155
10917 145155 137852 138225 139016 155275 170692 176338 155369 153672 155536 157005 141217 119582 103218
10904 103218 84153 63726 60636 51674 58715 50624 64862 73689 70403 66183 52943 42017 46587
10891 46587 57091 61149 66181 57022 45901 58510 45165 31033 43922 51219 45279 42749 36420
10878 36420 9057 7873 47012 74196 86657 102506 78733 64223 75658 79424 67542 49133
10866 49133 51698 40509 20108 4123 2544 2520 17650 35744 42521 31372 28309 28257 46814 73389
10852 73389 85671 77628 86712 82893 75440 63080 57965 63952 67765 58934 39946 29703 25231
10839 25231 26659 47227 47394 51187 67055 88832 98336 92357 87067 115679 148117 153921 158773
10826 158773 137712 137448 123884 106645 108377 100549 74081 75618 56567 51496 65550 51414 56583
10813 56583 63343 48474 42811 63749 71297 58868 36035 22907 21541 38639 28803 21966 -582
10800 -582 2167 -16169 -16296 12879 56321 74955 74603 71106 79022 53239 53245 66987 70181 75979 90377
10785 90377 69346 63904 84950 78426 80831 90077 102898 119868 122505 109451 93589 83543 71204
10772 71204 93468 125585 138954 144857 150874 149441 130594 136783 164206 170187 140340 117314 118621
10759 118621 124758 129780 133714 140262 163103 172879 173597 186547 186387 185101 171158 153760 123862
10746 123862 107965 97925 100017 97540 91507 78716 77349 89483 91355 105308 128982 153318
10734 153318 158420 153245 147389 137054 107282 118854 140419 141177 136840 139794 137380 146066 137695
10721 137695 143759 164869 165442 171111 200716 216549 210211 209740 223381 237173 244471 222545 217237
10708 217237 190161 131041 56674 -19288 -96839 -123456 -133468 -108198 -74624 -47452 -30321
10697 -30321 -11915 27736 45614 79325 94189 99998 107276 110478 110022 101175 108531 112346 114899
10684 114899 115708 104260 118566 138174 145474 135307 143078 138536 134687 122047 117839 91727 22423
10671 22423 -67265 -121119 -149382 -161289 -147747 -117443 -83188 -33072 14645 43796 73714 91751
10659 91751 112320 126197 152229 160023 137427 144392 149820 139701 140684 128766 111229 93758 88130
10646 88130 118922 125834 116726 138483 148254 159175 185772 203852 182038 168292 177860 201466
10634 201466 206704 207128 201669 192941 178419 178146 178773 203419 249044 250518 233364 224268 212870 215282
10620 215282 249970 280951 295779 308714 319341 320769 320654 317265 313886 310190 307054 330222 341237
10607 341237 361971 378766 385201 413046 407049 395807 406177 423672 451496 463900 477499 464655
10595 464655 482680 543345 583593 607190 658095 704557 740761 766933 770559 761007 768490 780501
10583 780501 793284 815682 815172 821900 850100 889244 901981 932474 969645 987541 997751 1031075
10571 1031075 1063196 1084515 1119107 1130602 1135895 1189591 1249860 1277756 1311825 1357972 1397482
10560 1397482 1450213 1508230 1561665 1634770 1709213 1787376 1857596 1935707 2022465 2159677 2327093
10549 2327093 2478392 2623283 2765729 2895746 3074901 3305952 3529000 3780928 4067108
10540 4067108 4380813 4772057 5282386 5911746 6659684 7554136 8599053 9727594 10821126
10531 10821126 11898615 13114731 14693577 16888550 19822771 23675871 28645661 35099408
10523 35099408 43625353 55161040 71265575 94537717 129151838 180164326 247878530
10516 247878530 313900646 344161980 324395216 269344356 205947590 153524861 116023711
10509 116023711 90207635 72267333 59493407 50186194 43267605 38016470 34002025
10502 34002025 30821682 28255895 26164545 24483400 23095784 21812445 20490433 19155092
10494 19155092 17885784 16727882 15641829 14571805 13545954 12577167 11682284 10852603
10486 10852603 10102385 9436929 8810238 8213099 7644486 7147407 6713097 6286164 5911235
10477 5911235 5571367 5259667 4949120 4657658 4382449 4109879 3835889 3574428 3364988
10468 3364988 3196867 3032322 2876275 2724261 2582349 2446329 2332252 2238254 2126284 2025139
10458 2025139 1928593 1801666 1710295 1642538 1572660 1515448 1469386 1441030 1382814 1314584 1255736
10447 1255736 1205726 1130888 1068367 1012642 962706 911567 900345 890338 881390 867437 855300
10436 855300 838659 814934 809210 808150 773680 753946 725719 717362 702652 692609 673814 656410
10424 656410 626510 603574 597029 589886 597669 608005 589201 570959 554700 549185 525637 491954
10412 491954 485175 475036 465916 470819 466848 462462 481487 483281 492808 512752 510725 511198 510805 496078
10398 496078 483378 457588 451411 431501 420856 406846 402586 389924 378871 390415 401905 396967
10386 396967 378348 362031 350444 339673 349370 369620 357419 347120 328148 307972 297618 308827
10374 308827 301879 294894 289385 298381 319063 347058 374038 408065 439999 484994 520970 554881
10362 554881 569920 603127 597848 545473 466606 369375 310107 284750 268090 250468 242377 245026
10350 245026 242070 242052 244911 251682 250815 237626 236590 253289 270045 275138 268985 258591 276800 273290
10336 273290 265473 258088 284011 316389 334165 363709 397783 435360 461152 460728 437527 375180
10324 375180 257133 161531 129528 107583 92585 92158 93551 75506 46356 38690 58081 92127
10312 92127 103262 106464 127449 118899 105085 115293 131429 137860 145317 151704 122001 120387 134246
10299 134246 136102 135234 118225 110389 102394 101521 120570 139462 134029 138832 126671 91044 82875
10286 82875 103699 108846 100173 86150 66601 67088 58963 69527 78409 67871 76418 76247 77574 77792
10272 77792 69823 63331 65497 76966 62739 61092 62771 74304 92991 74237 71227 76088 70387
10259 70387 62802 73744 55543 70740 60721 54345 58315 41788 33993 54298 72071 56568
10247 56568 65191 68071 69953 66967 70967 80052 76739 69819 72628 66127 56441 48746 47923 47403 58221
10232 58221 61897 74719 78070 89471 92592 114804 114701 98940 106316 109753 123713 143379 125867
10219 125867 92228 59719 48535 56302 63370 77447 87441 86124 83824 71054 70777 55016 42433
10206 42433 42223 16854 -13445 -10559 2009 20521 41804 46919 53438 54924 58963 70846 73563
10193 73563 79932 88516 102801 126145 144617 158799 163431 157895 152046 156036 163006 159341 148974
10180 148974 144986 152509 166957 149403 165247 183666 220406 267071 353879 475619 656971
10169 656971 909137 1272370 1718621 2044047 2074586 1825185 1447857 1069742 795245 639601
10159 639601 538277 470036 425291 379649 369303 393409 424276 444751 482307 544107 648246
10148 648246 763307 866635 901215 879277 787665 675562 550329 442631 356330 299417
10138 299417 259283 232032 215724 196447 184090 176329 153891 138222 125640 125392 124874 139030
10126 139030 135528 116410 110996 96201 98665 102035 83419 68884 60310 78972 107499 110347 99343
10113 99343 113696 108126 107700 104459 74250 81233 98758 109668 106703 128476 153555 169955 198365
10100 198365 225961 256501 300779 342220 434301 588132 779666 1060183 1398622 1712457
10090 1712457 1848416 1737078 1462250 1164064 896173 696056 548050 440984 362917 316787
10080 316787 276919 260812 232923 210713 187725 193180 182615 189539 203881 180455 162209 161086
10068 161086 147366 127958 123380 140104 138745 109623 75953 88901 79479 46019 40494 48988
10056 48988 57807 70293 92972 92678 67699 47909 38863 35185 33210 46476 46193 81365 79512
10043 79512 99455 110135 93519 81392 84578 97665 86189 87687 80046 57404 58869 85422
10031 85422 106572 122986 154771 199353 228034 212010 197799 192498 160933 131788 98305 56801
10019 56801 35309 32840 27399 40820 51353 35646 17213 23246 49603 45111 32487 39914 47816
10006 47816 33750 34795 24816 13121 25159 27611 16354 6159 590 14788 35776 34096 22219
9993 22219 8550 8670 24388 19972 -4785 -2696 3048 3952 13709 12465 13950 14974 9467 -376
9979 -376 6353 24858 41256 49447 61172 59921 36071 32058 15637 13248 23727 43213 52586
9966 52586 45595 35679 20069 16875 7305 -4665 7123 11543 11292 16434 19828 15061 -6557 -4235
9952 -4235 -4629 -4750 19491 33087 4812 21469 34572 34161 41156 38310 29946 5526 7766 27270
9938 27270 22715 14312 11531 20963 31105 36734 28242 24717 19822 29136 38275 39444 35579 20030
9924 20030 3752 100 -9483 -974 1497 7003 12673 23108 19477 9153 18697 5623 -7536
9911 -7536 -7556 -8917 4365 3160 12959 27190 1052 -31118 -25921 -20593 -25859 -12436 -3402 -4131
9897 -4131 -19150 -18095 -4034 -2689 17690 46251 44703 36997 21468 23073 25592 31536 24817 3760
9883 3760 4761 27212 38064 41445 28932 4643 2478 7759 27089 19259 28113 24702 17999 19725
9869 19725 33415 45605 45423 50841 35236 30576 45392 72724 76527 77656 107324 111836 127769
9856 127769 188520 301074 468034 750409 1107573 1341108 1301045 1037936 721231 457972
9846 457972 298197 216095 178430 147069 116335 114439 101571 84792 73669 65420 50775 75259
9834 75259 92188 89093 83616 83805 76955 64958 73180 81061 80995 80325 67855 56311 41682 24850
9820 24850 30790 31215 34207 20611 -1114 10414 14137 10911 22221 29398 37599 40853 41180 32765
9806 32765 31497 20520 34070 19229 26023 22437 13352 8449 8335 12634 28681 34856 31683 21079
9792 21079 -7761 -24316 -8139 13603 15401 25781 19328 15683 29029 25489 28556 6121 -4896
9779 -4896 -21046 -12442 -9763 283 10546 919 7465 17152 12262 7395 -9957 -8303 -2751 12107
9765 12107 42305 45314 36731 32615 20851 5772 23825 27880 10289 -2052 13867 23181 37214
9752 37214 51555 70276 71958 78943 77209 58151 53245 57278 63741 67019 51072 31162 14862
9739 14862 30759 40865 18471 10167 34684 26243 14863 7922 -10769 -15919 1030 7976 23502
9726 23502 26827 20941 27310 24762 27619 19200 27143 19109 33395 29170 10488 19074 38637 38869
9712 38869 21561 13166 11648 18016 22041 31989 30804 41832 30405 29047 32135 31108 20848 24149
9698 24149 36021 20939 12649 22313 17210 -367 -12627 -20220 -3485 880 -17308 -24089 -12028
9685 -12028 -6206 -22822 -27334 -964 15702 28252 31483 26633 27862 27266 46827 33796 43955
9672 43955 34254 25021 12988 16397 21040 9881 14849 6333 -4166 -17250 -16779 -13329 -13546 13391
9658 13391 21465 34407 28128 11043 -4936 -4159 7184 19591 -205 -14542 -1389 2550 8733
9645 8733 12373 18932 19141 10957 20721 33484 44945 35644 44439 40810 42065 29578 15532 11567
9631 11567 7463 10727 20876 26223 34593 3711 -27133 -23479 -3287 12445 8722 24106 34160
9618 34160 22690 359 -4749 -5857 -2535 -16607 -18074 3018 15828 24458 27930 32428 21758
9605 21758 12785 23371 20895 -187 -10046 -9593 -13738 1523 -6619 -12692 -5273 15981 13584 17664
9591 17664 12496 1782 9824 -431 1374 -3971 -16446 -14268 4958 11519 2579 14862 24316
9578 24316 41944 37647 24557 28750 26004 17389 10455 7169 11703 -17274 -21122 -9969 -10580 -9847
9564 -9847 -11341 711 17076 29285 17660 17630 23775 47904 19409 8856 16518 27250 31429
9551 31429 35707 43099 35654 29442 24875 44007 60879 50330 9196 13596 4493 34 27476
9538 27476 36928 28751 29862 30981 20800 13770 -1329 642 21870 30265 13101 17300 15809 30545
9524 30545 37315 2167 -26964 -15681 -1694 15426 9363 -20235 -20902 -6074 2618 -4412 3180
9511 3180 9067 6107 -1674 1140 10274 9460 5953 23552 30920 39388 43938 27225 18515 -2963
9497 -2963 -8308 8086 35379 21943 4128 14503 6125 9002 8378 4136 2698 -11653 -4802 -1240
9483 -1240 5053 1628 -7593 -10798 15038 18869 24213 18115 13011 13997 2991 17130 1206 -4711
9469 -4711 -2800 5975 179 13725 18252 14466 5746 -10919 -18429 -9607 2168 -6474 -9432 660
9455 660 34629 30252 18600 10778 24668 48097 55574 56449 32932 32820 36662 55116 65653 62641
9441 62641 46172 46465 20869 23731 50292 48049 38919 33213 37189 43599 47348 22964 26756 32885
9427 32885 27808 25124 22512 32718 60268 62807 56967 54352 36903 25307 6203 -1746 14497
9414 14497 31367 49436 31804 39402 45514 38850 28752 25642 14295 28112 33055 52856 62890
9401 62890 60313 63554 78086 83104 74717 58541 57509 57075 46668 46297 64278 73063 47717 33682
9387 33682 41150 23410 17722 21586 798 -10725 -8000 8707 35895 43424 31384 31968 34592
9374 34592 41396 45439 26859 35762 38963 37631 46137 59156 60790 58912 40803 20592 21724 10009
9360 10009 7344 16059 30324 40216 47704 32293 29249 27988 15929 29775 53012 68973 58484
9347 58484 47038 41944 52751 58080 48879 39965 47616 53913 46763 53957 50263 42519 34728 30212
9333 30212 25014 46978 61738 77925 68429 55842 38472 35696 59049 68100 62688 71887 71576
9320 71576 56191 47312 53522 59323 57305 37623 33699 34011 44927 41105 40832 53790 53455 48903
9306 48903 30144 22400 32653 32144 39053 42973 53481 56649 60015 54970 66356 75127 69019 71869
9292 71869 60149 51721 31568 22586 29209 51435 53173 67083 78215 82531 75820 74720 80467
9279 80467 91694 82723 69231 70864 60532 38892 44675 51052 70904 67513 68345 76181 60214
9266 60214 61621 68753 62792 56994 74713 98484 100669 85548 78699 62531 75655 73131 88352
9253 88352 96342 87424 89553 77980 55763 57574 58098 63152 64159 70973 81721 74605 76050 75232
9239 75232 93889 101667 85306 85218 78288 69334 59202 65393 87949 78536 79637 89294 84131 83514
9225 83514 101670 99183 79100 81161 93763 109928 121167 111029 105711 97447 96176 100043 103382
9212 103382 103483 96941 100963 102740 110765 110031 118735 116213 95786 96755 89447 83104 94787 99275 102337
9197 102337 97537 115843 120343 125046 126874 108343 82559 85915 97250 121813 121034 105725 110016
9184 110016 120257 146975 143087 120517 119260 131489 121975 101896 106435 109879 117441 127479 115457
9171 115457 122756 123229 122965 105539 107095 88370 86051 110067 130203 142752 127440 122314 127520
9158 127520 126762 115123 123316 126209 112538 108733 133829 146427 142895 137845 136590 121693 121268 111013
9144 111013 110628 117426 125025 111810 92322 93096 108239 109491 132514 150514 142309 151695 165019
9131 165019 168099 165752 138834 128260 139196 146606 130910 140493 149939 160310 164252 159922 151049
9118 151049 139085 130170 140043 154274 180023 198065 190626 169534 159944 151613 189128 212704 191183
9105 191183 188457 191164 183269 187672 220724 222084 218143 221894 221622 227688 217850 211910 219900 222358
9091 222358 219420 201599 183085 175093 188165 190294 209165 214213 216750 223963 224537 220790 220662 220906
9077 220906 208845 189458 200786 221970 212234 209778 220468 227312 230756 249050 249090 247000 263589
9064 263589 276259 280750 260790 264151 258299 257005 264909 275399 287091 284246 275558 296774 298900
9051 298900 285143 280910 277080 272031 269837 270568 269204 265273 253636 268947 280809 287970 279603 273595
9037 273595 270237 289649 300645 306602 322160 321377 322031 334905 349052 361265 360913 335984 310489
9024 310489 328154 342326 343006 376172 383988 359929 363300 374354 379211 394922 394865 392677 385361 392727
9010 392727 402738 402352 401411 421693 413966 423026 435483 441862 464358 470645 482752 483993 478925 475127
8996 475127 503825 535470 528232 540081 544281 555548 561566 559699 559673 580812 579176 564965 568338
8983 568338 579773 583356 586824 620654 646630 664204 663344 675740 695653 695204 687373 703371 728445
8970 728445 742255 741922 758977 798227 813639 829215 829154 838503 859898 867161 872163 911330 933657
8957 933657 943417 964582 1003081 1014304 1025305 1043734 1064696 1093213 1110184 1130106 1173874 1210398
8945 1210398 1236523 1256765 1272107 1283069 1302986 1343791 1378309 1429999 1468589 1505273 1537476
8934 1537476 1585543 1623996 1651181 1706894 1755162 1799274 1854453 1913025 1965580 2025485 2079311
8923 2079311 2119930 2156390 2210666 2276305 2342173 2409834 2471278 2542309 2620459 2694525 2775295
8912 2775295 2887660 3003750 3100398 3199564 3304800 3394638 3502574 3616801 3748491 3897001
8902 3897001 4053525 4208922 4340741 4506084 4711058 4922380 5121190 5313794 5535612 5778447
8892 5778447 6006017 6260883 6556953 6834446 7134328 7448160 7782703 8133906 8507401 8898304
8882 8898304 9307476 9740786 10199996 10688163 11173215 11671969 12193517 12731258 13296716 13895269
8872 13895269 14491584 15082155 15661107 16222435 16773244 17294898 17792478 18247727 18660818
8863 18660818 18977586 19263453 19517646 19678901 19770962 19767077 19699188 19558985 19327665 19060109
8853 19060109 18734404 18353337 17915576 17452913 16968078 16468575 15939630 15416240 14894905
8844 14894905 14364321 13829494 13304852 12817835 12340566 11874730 11404346 10947476 10518896
8835 10518896 10096157 9691201 9310352 8956965 8594913 8243503 7904299 7598686 7321912
8826 7321912 7054914 6788736 6519442 6277517 6043829 5822776 5610382 5411864 5215773 5025961
8816 5025961 4852695 4695176 4535720 4375617 4217931 4070008 3941141 3803605 3679308 3560705
8806 3560705 3460277 3354680 3261496 3157884 3063615 2971842 2868663 2774667 2689976 2612394 2563880
8795 2563880 2489071 2428381 2359710 2274830 2210815 2152725 2102656 2036169 1967611 1907646 1881757
8784 1881757 1835925 1790746 1750981 1710569 1654910 1627697 1601222 1548660 1494722 1466569 1443568
8773 1443568 1423422 1386189 1339965 1303955 1290129 1260956 1217192 1188691 1168204 1159539 1141397 1131412
8761 1131412 1127009 1107283 1084894 1066082 1054005 1026366 979143 948272 930325 914963 914980 907832
8749 907832 869981 849239 849582 855701 833388 806571 802006 794548 787377 794535 793514 775491 757964
8736 757964 732391 704480 693444 697944 695276 668364 663127 665869 666826 667233 648641 633742 631582
8723 631582 626568 625681 621506 614567 596992 587294 594298 586472 590803 575811 568352 557811 535852 530272
8709 530272 521421 520757 497582 487827 488589 489741 496755 518652 533989 529539 505837 491551 476618
8696 476618 466200 475566 455017 449727 431454 412835 419642 440612 432892 417720 404876 391146
8684 391146 399155 414838 404227 393638 395999 398914 407178 395051 384581 374443 377788 376567 366785
8671 366785 360876 366095 371753 382948 373645 356163 351252 331335 327097 341351 342609 316505 310958
8658 310958 304687 315562 319039 322336 348117 397074 474618 589114 667108 638903 549335 446776
8646 446776 393316 369906 351363 349093 356343 363148 351884 327010 323093 312127 314767 317898 303633
8633 303633 308440 320300 309810 305153 305056 298731 296279 287222 298505 304711 297878 296621 316346 325619
8619 325619 336962 346636 347749 353088 361613 397921 427565 443217 447172 470927 512717 586283 728728
8606 728728 962975 1174176 1207821 1080665 914577 798175 720238 690974 658628 614905 573879
8595 573879 536135 501461 500756 473476 426974 377490 351874 343337 337208 334833 308009 297120 292550
8582 292550 290759 273497 251047 250528 243558 220122 217130 211100 213762 220248 230169 230441 225381 211108
8568 211108 216313 207347 228575 231496 238051 269238 291174 357081 463282 515233 466430 393015
8556 393015 337044 290656 256122 228501 220693 218287 222005 197053 174380 174444 158681 146697 132109
8543 132109 134976 170925 194820 168069 161304 174866 176677 158601 149134 152803 141300 136840 143650
8530 143650 139201 118803 106071 114814 139827 148924 163020 170721 173685 165265 157594 172262 158861
8517 158861 139281 157613 160780 155787 146191 124311 142296 164976 168770 170333 145158 132288 122981
8504 122981 130603 121494 108799 117841 115355 99492 101584 101369 91021 99902 78582 87065 77549 65325
8490 65325 79232 84796 90471 99448 85165 78650 74429 72369 95664 92337 81794 88337 92946 108335
8476 108335 118564 116761 100514 86787 67617 69995 83787 88120 80903 104273 108782 105847 101575
8463 101575 89895 97864 108556 113777 126468 120681 114300 104645 95366 90186 69961 59756 71968
8450 71968 65639 81681 92062 95535 97262 115455 100378 86652 92048 94613 102686 108376 100756
8437 100756 77595 57842 54657 42701 45158 54673 52251 64402 60989 53991 78533 58790 69122
8424 69122 74585 67025 76567 63023 49576 65218 82011 78509 67810 79485 63364 47442 41503
8411 41503 33430 46306 51642 57302 53652 49190 46513 38687 39871 57527 59939 49527 46944 50922
8397 50922 35832 23613 39455 50948 50003 52179 28949 24033 20862 33419 39184 30766 26564
8384 26564 54072 65438 81469 76878 75661 54628 38718 23138 23993 19674 7321 2750 8464
8371 8464 -171 19513 35630 50667 35907 63987 65778 43713 26516 44415 67702 73166 53858
8358 53858 45583 43943 53925 75328 73200 55293 56903 65957 59771 63938 73550 62781 50434 39785
8344 39785 34822 58957 84052 85305 80264 84126 88438 102552 97364 126567 155803 181499 215294
8331 215294 255442 248905 221227 178162 144277 115308 93145 86738 90139 88753 55954 50604 48158
8318 48158 35195 24886 39043 47627 46504 53485 66222 73871 72393 78264 56637 33822 40996
8305 40996 67321 83035 67871 60411 55617 59604 61536 70969 67905 85429 92282 92947 106137 149283
8291 149283 179286 217540 236227 192436 135871 98306 78631 53568 54687 57026 70021 63078
8279 63078 51552 48141 39801 33787 26826 11278 18570 36250 34060 37541 36871 31283 39091 39787
8265 39787 38331 14547 18949 12065 12307 13634 9946 18100 20040 27318 30933 45023 42904 32982
8251 32982 33721 41841 38920 13859 -2186 11095 23850 33371 30577 19833 -4198 -3951 4666 12450
8237 12450 11268 15831 28656 29951 48592 56963 58984 34429 17642 10186 34422 58499 55620
8224 55620 44675 40744 38389 33975 43303 34917 32660 18352 6640 6283 23796 20485 -1468 6238
8210 6238 26672 37196 27524 31464 25042 8525 3763 6864 22180 30682 3827 -28719 -19618
8197 -19618 19265 22222 40126 38810 35615 34075 33125 24280 9520 22687 18942 11123 27254 29894
8183 29894 37820 28401 32988 48386 52137 33134 11992 4399 11956 12983 10989 23467 45894
8170 45894 33693 28104 29583 34497 34023 33889 17383 21219 42244 59933 64781 53010 42484 34176
8156 34176 52701 52986 55365 56115 17469 3957 20742 40628 41979 46071 33342 29106 27390 24440
8142 24440 17844 16465 16174 25329 23345 7206 -325 11362 30934 34677 26422 29384 14545 10472
8128 10472 10664 11304 13214 13420 25369 30485 17208 16899 30239 48910 44837 43898 32479 20723
8114 20723 336 -7882 -17342 -16554 -3407 5012 -11111 -3142 5577 12280 22540 42829 41816 39029
8100 39029 23115 13165 8539 20137 39702 41544 31241 34505 30447 30951 24414 17347 16976 38863
8086 38863 44015 56308 38486 25296 31585 31212 18666 34555 47026 43040 34485 35136 38318 28980
8072 28980 24063 38119 39793 25835 16118 20220 19450 29832 33329 38482 48542 49116 39541 41319
8058 41319 48019 38843 43136 30605 39608 54900 42577 37385 48256 55945 55077 53807 55363 33460
8044 33460 10997 13560 4716 -661 21989 41099 48146 48089 42641 38326 38837 50812 51775 35837
8030 35837 27887 29487 50194 50710 21926 26125 30850 39325 50308 77911 84873 61616 34892
8017 34892 51618 77915 80907 81761 71842 55682 56037 45173 65441 78743 71937 99346 119561
8004 119561 123926 99696 62836 57812 71471 67577 34441 9888 -7391 578 23773 38957
7992 38957 40313 34684 46536 56185 59105 47908 48700 58725 55308 57471 50935 67453 57696 44873
7978 44873 40842 40539 56704 64402 58870 61488 46678 53847 66831 69820 86451 87299 95772 103570
7964 103570 89159 75705 55359 63911 67533 50539 42691 53046 45309 25383 21820 33809 52337
7951 52337 51688 55847 45551 32411 44799 27704 8816 6859 24035 46005 43851 38204 45039
7938 45039 59203 63180 66963 72458 95351 90763 69274 41067 27089 22232 44672 69012 66694
7925 66694 66452 84931 96932 78103 62857 46138 53827 53276 41859 42034 42605 45816 40744 46792
7911 46792 32465 32346 31414 11649 -1747 9882 29738 29665 21629 19368 23106 40276 46717 66140
7897 66140 36732 5393 5555 5317 4749 -716 17449 33772 24501 17282 24678 29792 23807 865
7883 865 -12756 3635 21672 34163 34751 17055 9579 4382 19626 21355 9541 16958 15591 16453
7869 16453 22233 18512 18083 9155 29996 45092 52164 43376 46013 38952 34603 33846 34025 15557 13964
7854 13964 34970 34847 45534 44397 38619 34529 14502 7970 7128 4246 6068 1346 2086 17632
7840 17632 -11018 -8073 787 -1970 5488 8567 11311 7468 14050 5162 6537 11759 19812 28943
7826 28943 12721 12452 4661 10583 2580 -83 5565 -2321 13008 13555 -639 4730 31085 36075
7812 36075 15953 10112 18916 44578 54346 50175 48224 36806 21032 27242 18075 18683 14130 609
7798 609 -17686 -13598 -3397 -14049 -363 12814 14106 -10884 -29559 -24413 -5470 -4250 -26790
7785 -26790 -40155 -27907 -28097 -22439 -21343 -20360 -6706 10123 24003 24714 29599 31763 21921 16967
7771 16967 5231 -132 -17717 -19821 -8019 10792 13091 -5835 -40261 -51635 -55837 -42355 -32458
7758 -32458 -20872 -21128 -14644 -27124 -17522 -15691 -15342 -23092 -27303 -5653 -1241 10134 155 -31207
7744 -31207 -17510 -14237 -12578 -5380 -6054 -26167 -27897 -26456 -22747 -932 -2879 -9153 -8530 3324
7730 3324 -340 4733 -12183 -18930 -22049 -29774 -14585 -17994 -22262 -3786 28470 59868 37586
7717 37586 12954 3238 1450 4884 6592 7819 -14964 -23852 -10693 -13450 -27756 -17374 7403
7704 7403 15235 25207 17406 -550 -2714 8336 -13907 -19270 -8052 21172 28752 28370 30049 30431
7690 30431 12039 -20726 -26505 -7589 5292 14505 21478 16709 5144 -7064 -31857 -20236 -4887
7677 -4887 -7265 -12938 -22135 -13644 -18762 -27513 -15732 -8079 -3350 19990 17642 9698 -4148 -22515
7663 -22515 -9258 -6918 -12272 -20227 -23273 -24835 -21167 -2614 2722 14738 18777 10363 -7323 -20696
7649 -20696 -25186 -9548 2847 20625 32910 17135 9656 -938 -3400 4853 -14725 -23834 -22224
7636 -22224 -46800 -35341 -16549 -28442 -41521 -56651 -44754 -16322 -6047 -3325 -5078 -15878
7624 -15878 6758 44999 27597 2288 -1974 -3730 -18228 -7621 14774 19521 9375 2518 1732
7611 1732 7982 13765 17590 4627 3886 23285 34626 17150 -3881 -9818 -5016 9401 22614
7598 22614 2897 -20715 -33337 -28344 -18863 -15895 -13717 -16069 -27717 -23117 -19603 -11234 332
7585 332 11254 27772 10879 9948 -13112 -28572 -28049 -23358 -28482 -32580 -36257 -23198 -6978 -4787
7571 -4787 -3950 -522 -12882 -19511 -5590 -4465 -20452 -23951 -47558 -38768 -20469 -4542 2618 3858
7557 3858 16118 8720 -13036 -22029 -11149 -20833 -27329 -18494 -17764 -16502 -9418 -7003 5310 3817
7543 3817 8671 -11729 -18743 -6143 -24700 -32152 -17965 1953 4109 -4686 774 -11435 -29530
7530 -29530 -25994 -21590 -23297 -17256 -12149 -12862 -18687 -18213 -38773 -42751 -7541 17593 10422 -1680
7516 -1680 -3984 -16258 -24666 -14946 -22104 -33695 -23629 -14425 -18482 -22469 891 -11679 -5286 29688
7502 29688 26260 18417 18729 14256 -170 -1441 -7698 -19709 -19140 -4862 16870 28617 31488 21085
7488 21085 20907 15518 -262 -3892 -20718 -18456 -1184 -4128 -23995 -24309 -21792 -24544 -44965 -32857
7474 -32857 -21922 -15584 -28956 -33096 -23129 -20508 -19777 -35668 -47713 -44745 -41954 -49374 -48851 -28432
7460 -28432 -12185 -12842 -11826 -26027 -17866 -6174 18979 38233 32488 15247 -996 2626 9471
7447 9471 1565 -16931 -11597 -4361 -11066 -25158 -40228 -38995 -17033 -10507 -3298 10673 13026 -810
7433 -810 -21118 -10457 -3152 -21225 -24178 3997 13637 -28786 -40127 -24339 3075 17851 4537
7420 4537 -9858 6628 -3185 -15626 -41864 -31102 -28951 -16172 -12063 -8254 1693 -18960 -19042 -1932
7406 -1932 -15661 -22507 -30033 -34919 -34940 -16563 -673 -2915 3287 16680 -669 -11125 -12411 -26359
7392 -26359 -41254 -44874 -25817 -27083 -32354 -23922 -38604 -56082 -38517 -26078 -21913 -8998 2739
7379 2739 -6593 -3569 -2336 -32988 -57658 -55010 -34829 -39883 -44832 -29671 -39740 -47812 -24111
7366 -24111 -14204 1814 7772 4312 -3598 -13346 -19594 -16707 -9480 -8269 -11150 -1955 -6094 12570
7352 12570 10602 -2714 9608 10950 11695 9036 -22728 -21983 -8096 -19706 -11492 -14907 -36191 -43374
7338 -43374 -41645 -39065 -36380 -45967 -42936 -27831 -7779 1130 -15385 -16781 1244 -4654 -12204 -15043
7324 -15043 4807 9576 7329 -8784 5985 4824 -10711 2027 19153 29695 27063 22292 34150
7311 34150 9622 -2644 -2701 8797 14518 8428 28886 31202 16112 18654 30590 23369 14964 32163
7297 32163 10727 4536 7902 7756 25211 7548 -630 3359 6454 -6442 -18193 -16632 -17302 -10115
7283 -10115 -3882 -552 -8726 -7742 -18023 -4067 5366 13199 12637 -3090 -21543 -42842 -33100 -19044
7269 -19044 -5034 -12930 -30614 -22277 -1440 6 -4598 -3301 4546 7820 -244 -17888 -17713 -17695
7255 -17695 -1241 1358 -17253 -31600 -24866 -15515 3614 -5500 6405 12860 3651 -15033 -16965
7242 -16965 -16499 -15576 -20275 -10724 -4252 -20020 -28064 -21950 -7659 -2620 -6651 -20603 -29109 -20495
7228 -20495 -6636 -23089 -29921 -18307 -14599 -18747 -38097 -43547 -24421 -15999 -30695 -10720 2018
7215 2018 -17138 -17629 -46909 -39946 -20493 -18063 -15076 -22738 -16152 16193 1109 -12941 2773
7202 2773 -15408 -30629 -29270 -29782 -16690 -3924 19061 20702 5638 -4310 -20557 -36940 -26773
7189 -26773 -22448 -24717 -13164 -11308 -21357 -27389 -26528 -20248 -22642 -24056 -8987 -11586 -6997 -13498
7175 -13498 -17577 -21362 -7038 -21428 -16371 -29165 -29325 -25933 -9270 -10775 -30543 -28404 -22507 -20605
7161 -20605 -22906 -29527 -40768 -29181 -14215 -418 679 6232 124 -826 4145 9772 32816 32702
7147 32702 23528 4113 -24064 -34191 -20790 -10816 -10308 -3386 -10473 -40456 -37835 -10850 4800
7134 4800 6039 -8850 -28898 -22015 2361 4924 1529 -699 5386 899 -11019 -21545 -2662
7121 -2662 21033 31184 13720 8982 5566 5313 -10665 -5676 1892 13312 12406 1077 -17155 -25129
7107 -25129 -18836 -28763 -26169 -9152 -13156 -13610 -12048 10877 7416 -9913 -8212 103 1149 -10577
7093 -10577 3104 11012 7604 -5820 -5504 -25707 -41978 -45444 -35744 -33594 -31608 -6131 4968
7080 4968 10209 -4824 -10668 -22359 -14190 471 -14917 -11031 4767 -15466 -30269 -35154 -18991
7067 -18991 -9323 -27461 -33939 -32541 -13647 -15526 -15921 -12585 -19660 -12857 -3832 -8506 -22209 -21924
7053 -21924 -23257 -16276 13135 13550 12193 7354 24220 35835 41365 39367 38917 19611 8624 17166
7039 17166 20187 23534 -3081 -10406 -13355 -3842 1489 2087 14891 17466 -9648 -12075 2790 12440
7025 12440 -4156 -9953 -13448 -21036 -11229 -21438 -24899 -12391 2809 -10209 -20644 -23890 -11257
7012 -11257 -8138 -18308 -13450 -11904 -2259 -4926 -7372 -13880 -8598 -524 13148 9840 -2881 -1043
6998 -1043 -10103 -15819 -20392 -7247 3967 3227 -6525 -1407 -10794 -27530 -30585 -13141 -3839 -12402
6984 -12402 -29720 -2185 15352 20208 -6315 -10269 -7563 -17831 -21884 -25512 -32150 -29889 -17099
6971 -17099 -4512 -8991 -14563 -17104 -26763 -20566 -11278 15021 22888 26583 3570 -2341 -13806 -25019
6957 -25019 -22700 -24132 -15147 -21505 -5432 19014 1075 -15266 -17802 -36631 -23874 -12507 1241
6944 1241 20928 17918 -2027 -12221 -14572 -11057 -33956 -20516 -9549 -18712 -2371 21 -16183
6931 -16183 -18945 -18876 -25589 -25344 -23335 -28013 -15167 -12049 -2952 -10398 -11319 -3666 -22819 -48672 -43451
6916 -43451 -17413 1828 9318 6165 -4349 4884 19858 17751 -2463 -13409 6289 -584 -5666
6903 -5666 -24662 -30898 -21612 -15236 -11995 -32035 -21965 -5043 -10265 -29656 -21783 2355 27050
6890 27050 25431 19608 16634 7189 5274 2445 2975 3942 7449 -13291 4800 14975 13636 6111
6876 6111 -9206 -16926 -21650 -14400 -10425 11417 10752 -7734 -1514 5229 6243 7607 19186 8029
6862 8029 -13203 -9214 595 -1695 -8165 -15572 -19066 -3460 10941 4373 -4816 -674 18774 1398
6848 1398 -4821 -879 -4570 -16950 -4034 -7616 -21300 -32377 -22662 -4770 81 -1408 -11602
6835 -11602 -30121 -50323 -52452 -40706 -36135 -34638 -47590 -43308 -31042 -26278 -21320 -8144 -16673
6822 -16673 -11378 2338 7682 13530 23592 14924 -4390 -14427 -19902 -18448 -15928 -14256 -7446 -7010
6808 -7010 -32722 -58478 -35444 -29128 -33352 -40501 -48582 -46553 -18837 -3203 19555 44388 44871
6795 44871 24329 -4185 2100 3642 -7211 -5516 27403 29789 19403 12921 -6697 -10036 -5089
6782 -5089 -1529 24508 39394 13915 -5480 -7828 -8301 -19962 -24103 -11076 6703 8166 -2347
6769 -2347 11272 12301 5483 -10235 -14989 -22292 -25269 -20885 -32239 -17245 1070 2121 279 2227
6755 2227 11911 3204 6772 24277 25687 26821 23767 35316 23762 17007 9399 4375 -2870 7720
6741 7720 30370 35876 32270 13671 24002 23472 30324 38070 23086 50739 84307 78698 70033 48739
6727 48739 24739 1689 -6334 15907 20331 15702 557 -10204 3327 -6310 -17380 2064 -9178
6714 -9178 -20955 -15585 -24416 -20703 1741 8418 15569 31255 23394 4747 -18484 -17433 -4129
6701 -4129 2151 3198 6581 13523 24109 3128 -3098 -3754 -9293 -2131 -21426 -29012 -31586 -11544
6687 -11544 1133 -19185 -31436 -29826 -11642 -2295 -984 12484 30174 31437 24092 -2941 -8602
6674 -8602 8233 9393 13756 13409 22905 8026 -4105 -22800 -23165 -20615 -26741 -25826 -6549 -8718
6660 -8718 -6085 1231 -16345 -22975 -15196 -2509 4391 3064 17163 7014 -5734 -22791 -33358
6647 -33358 -29983 -23160 -11176 -23255 -20881 -22545 -22012 -26414 -17133 -16614 -19656 -13985 -17604 -29875
6633 -29875 -41225 -31696 1398 13321 17230 16758 15632 29650 25238 -11530 -23592 -24656 -18533
6620 -18533 -13277 -16982 -40255 -28469 -3425 -11824 -24065 -19800 -10268 -2179 4393 4734 3734 2651
6606 2651 -4584 -15373 -15197 -12638 3920 6993 -9636 -17578 -31189 -35285 -20761 -7501 8171
6593 8171 24533 22334 17260 3105 -8702 1562 -8278 -15531 637 1673 -2998 -506 6808 25056
6579 25056 31549 34249 32315 26195 19657 15789 12917 15805 32130 30201 33557 36402 23875 31057
6565 31057 14323 8780 3895 8169 -5620 -13475 -18125 -7319 12462 32958 49196 36911 4824
6552 4824 -9531 -6662 1042 1677 13414 25331 16452 -12256 -26376 -34634 -27083 676 10068 1852
6538 1852 -6322 -9199 -380 -11003 -17067 -3381 -34039 -46320 -39582 -24335 694 -3499 -24823
6525 -24823 -34362 -26959 -57364 -63052 -47286 -36668 -40791 -29497 -15304 -10004 -2690 8951 4932
6512 4932 -10988 -8770 -6958 -26347 -35088 -10912 8170 -8516 -24837 -21289 -33394 -39375 -3265
6499 -3265 9319 23460 17346 7418 18011 22143 28381 39046 23359 -14962 -29660 -18755 -12287
6486 -12287 13288 19286 6966 -1846 -6532 -27272 -29694 -35177 -39489 -49134 -48482 -34421 -13454 -14651
6472 -14651 -2587 32614 33352 36675 39584 26997 -1111 -34238 -35750 -25502 -23880 -26449 -16600
6459 -16600 -16067 -16276 -14614 -9257 -32851 -26911 -25232 -16282 -18446 -17636 -21874 -35548 -33942 -16190 -183
6444 -183 -3612 -4531 -2875 -4878 1315 -4973 -10115 -1822 -215 -1021 -2117 4439 -12411 -19408 -17533
6429 -17533 -7682 6152 29123 16914 13130 29192 42752 44940 38812 20814 -11230 -11190 3286
6416 3286 8290 471 -17137 -22662 -12379 -3607 15084 -2663 -22259 -9334 812 -7691 7042
6403 7042 28840 29577 6320 16396 33802 4217 -2450 -9168 -10445 -14370 -8518 -19435 -23185 -32451
6389 -32451 -33631 -31618 -26873 -6705 4661 -14557 -34124 -35010 -27040 -13181 -10477 -5485 -10414 -870
6375 -870 -9506 -24632 -11422 13626 31417 26447 22808 22409 20634 29464 12433 20765 1297 -13093
6361 -13093 -8386 -12459 -934 24132 33960 13112 -7622 -5534 735 -5916 -4779 5283 3677
6348 3677 -14834 -5561 -11332 -27322 -24988 -21370 -14024 1436 6426 -3360 -17699 -22058 -24789 -14947
6334 -14947 -14078 -20917 -34291 -9961 -9841 3059 11322 2290 445 -3894 -2597 -11691 -26137 -10278
6320 -10278 5165 15536 7026 1877 6028 10820 3881 -3830 -10012 -18247 6711 29529 23458 5161
6306 5161 -17771 -31499 -33459 -22961 2003 16344 4443 -4663 -15676 -4681 40069 32826 2045
6293 2045 4136 8889 -9528 -14437 -22469 -22165 -15323 3074 14731 15363 6211 2027 5621 4848 4831
6278 4831 10999 21724 20435 2203 1365 10417 -2821 -19060 -43760 -39327 -25244 -18180 11441
6265 11441 8066 -1976 -1967 5209 -9082 -13685 -31404 -18690 -6534 -1782 -6886 -15568 -20198 -31498
6251 -31498 -40530 -21152 1652 10073 -488 -20057 402 5099 -3066 -10722 -4147 -192 -1753
6238 -1753 8050 1643 -518 5992 11179 4347 -11450 129 465 1523 -2869 95 -8222 -16043 -30416
6223 -30416 -28598 -31827 -17342 -318 -2048 -11082 -17071 -32518 -30794 -24739 -34194 -29200 -6379 -6480
6209 -6480 -15608 -41684 -47541 -32032 9028 27752 1732 -17848 -9513 580 1157 6746 19240
6196 19240 9314 2127 -17249 -36303 -26499 -17625 -27849 -22753 -25702 -13951 -18524 -7615 13814
6183 13814 21543 8814 -9811 -7075 2637 -3955 -18299 -33118 -49415 -59182 -53536 -40012 -21202
6170 -21202 -29980 -31907 -26953 -16028 -9809 -10411 -9508 -25517 -30693 -27191 -21572 -6966 -3291 -7424
6156 -7424 -18578 -7775 4613 -4506 -12544 2095 17074 2817 -4584 -2951 12344 25648 1935
6143 1935 -15596 -6416 -1052 -6455 -14882 10674 -4568 -32505 -48169 -43657 -16083 22854 36201
6130 36201 9052 -23315 -47496 -48903 -27148 -38420 -48613 -37050 -43236 -22765 548 3478
6118 3478 -19322 -4240 21406 34429 16635 2833 8536 9300 -2847 -21013 -17721 -9446 -13139
6105 -13139 3068 21420 13706 -931 -4046 -9264 -18651 -15578 -25451 -36308 -35607 -26899 -19011 -34419
6091 -34419 -49114 -46282 -36149 -30927 -14357 -4670 -13832 -1443 1796 -21583 -34457 -12800 -14179
6078 -14179 -17016 -15074 -9242 -24917 -4014 8327 4624 1250 -9231 -42286 -47766 -29455 -39381
6065 -39381 -28838 -5466 1381 -5682 3883 9607 8822 2471 3671 -8280 -5628 -1873 8660 28638
6051 28638 15675 -4532 -27256 -22473 -15243 -22582 -14236 -24021 -22023 -20933 -22249 -1603 13394
6038 13394 7517 13174 10579 -3429 -18822 -16356 -2170 -7646 -19561 -26570 -33631 -22996 -19668
6025 -19668 -30345 -30205 -32447 -25431 -4845 -478 3408 20686 28910 31498 13296 -6629 2895 14312
6011 14312 15543 10816 -1073 8387 1204 4700 11750 10538 1058 -1262 -3460 18019 13208 -19561
5997 -19561 -10174 -17685 -36108 -40613 -23714 -31229 -36695 -22859 -17333 -28933 -40743 -40704 -34328 -8233
5983 -8233 -13660 -28412 -16350 -12697 3855 5718 -24555 -29559 -17208 -9737 -9381 17291 22477 6051
5969 6051 -1835 -18736 -20780 7087 24427 9946 4476 -6360 -14483 -12996 13349 16899 -704
5956 -704 -14251 1110 -331 -19761 -33372 -24553 -12381 -9011 -24591 -32004 -12778 5930 -4952
5943 -4952 -25711 -54005 -55096 -39020 -30043 -28844 -23186 -19263 -22399 -19124 -2515 10299 21526
5930 21526 9507 -6013 1120 26030 27722 4436 -1418 -2647 6212 2365 5870 22097 15644
5917 15644 4207 4581 -20934 -52807 -53048 -34256 -23354 -11729 -16993 -24235 -11133 -15066 -10803
5904 -10803 6338 -151 -417 -2370 -3540 -12789 -27289 -21151 -25011 -22212 -16525 -2616 -118 5444
5890 5444 10323 19684 18574 33693 31677 26832 17419 -54 -28556 -30850 -21023 -16199 -18294 -27340
5876 -27340 -35898 -35096 -27438 -1291 4824 3259 -9759 -31163 -33526 -27365 -2363 3719 -6822 -6788
5862 -6788 -5773 -18803 -31218 -18554 -24304 -2930 13086 6523 -12738 -22012 -27584 -19246 -16686
5849 -16686 -31309 -42504 -54850 -45431 -11676 -1841 -8238 -19230 -5791 -27220 -41176 -45897 -62720
5836 -62720 -30872 -19397 -29595 -15170 1269 -10573 -13832 -9448 -15684 -18703 -14478 -16704 -50019
5823 -50019 -55263 -36495 -20524 -25870 -27310 -24292 -35493 -33841 -37053 -37850 -26395 -20943 -546 8863
5809 8863 -3848 -19084 -11869 -4060 -1903 3108 -5605 -6151 -9096 -5999 -13012 504 16449 16677
5795 16677 15854 2671 13900 25981 20545 16177 27661 21283 25741 39663 35965 25359 32022
5782 32022 19940 8131 1096 -6294 -19136 -28773 -25968 -7673 11116 2455 -11342 -28404 -28551
5769 -28551 -20417 -24065 -22454 -3633 22934 13827 -2132 -5916 -18546 -26178 -17302 -18022 -23442 -17734
5755 -17734 -29184 -27543 11774 23115 13538 18650 25615 42609 43703 31145 21162 5087 1115
5742 1115 -29677 -28449 -4602 13478 8574 19052 25951 15122 4439 -6706 -21384 -19520 -25342
5729 -25342 -22245 -4304 6150 -17391 -18925 -5019 10646 17564 6742 -2587 -4425 -15147 -21193
5716 -21193 -15331 -37866 -39418 -42427 -35122 -24227 -15731 -12640 -169 8852 19618 -4765 -30224
5703 -30224 -30446 -17097 -16977 -5757 11514 7672 -9315 -2944 11705 3884 -6560 2778 -16728
5690 -16728 3161 15861 -8542 -31167 -27617 -15193 -4608 -7318 -20544 -25487 -38170 -27718
5678 -27718 -11664 -924 -8121 2740 -57 21513 41082 31029 1709 -31184 -50326 -37891
5666 -37891 -5786 2597 -9106 -28165 -9160 18149 26755 31405 36032 23224 5718 -2572 -30416
5653 -30416 -48437 -33319 -14011 9659 21548 3304 -6983 9597 3497 2897 -3679 850 13050
5640 13050 3160 -17865 -21576 4700 3987 348 17097 10646 7351 7078 -12786 -3018 2384 3380
5626 3380 -10496 3702 1461 -2843 4358 20428 12973 27454 21751 12753 13822 19224 20173 20345
5612 20345 9032 -16618 -33779 -22558 -2763 -20707 -30658 -20574 -26702 -36726 -40131 -18158
5600 -18158 -11707 6268 12435 9775 16924 11502 11439 8550 9917 -21741 -32020 -36998 -32134 -19456
5586 -19456 -6756 -8721 -8921 5800 9160 -6336 -6567 -9475 -9161 -12650 -12430 3382 12112 -1498
5572 -1498 -9863 -21473 -24845 -8166 -16926 -15247 -8361 -10981 -18816 -12929 -7728 3335 21231 31548
5558 31548 39233 32978 24245 11458 4826 -4402 7402 27327 21416 10735 5075 13518 14603 16218
5544 16218 6713 3777 21131 9509 -20269 -10498 2842 38 7869 -5526 -3255 13815 37995
5531 37995 56427 60808 37464 7839 -8406 8531 29581 38048 32927 25287 14837 13909 11037
5518 11037 4846 -8300 -28132 -28066 -19231 -19619 -350 -3807 -12995 -12949 -21106 -38303 -7757 20988
5504 20988 10140 7027 12717 6080 -15751 -11638 -7170 -6677 -18158 -17688 -5763 9215 -2040 -22323
5490 -22323 -21254 4930 23225 17716 12636 2575 144 18885 23466 32348 27065 17927 13713 14875
5476 14875 8723 -19838 -18154 -7912 -12344 -12551 -12158 17541 15960 -1414 12175 33419 26082 3719
5462 3719 -13877 -30744 -28232 -30511 -37759 -32614 -19311 -8165 -21973 -21734 3980 15924 1070
5449 1070 4608 -656 -12626 -35786 -50380 -25815 -15062 -22017 -21362 -29306 -30419 -20030 -21073 -28486
5435 -28486 -20393 -15380 -20864 -13836 -15457 -12278 3444 -10760 -3319 7904 5001 19376 14735 -7055
5421 -7055 -27079 -11804 76 12920 22188 15057 9608 13317 16889 21490 16048 11427 17112 8564
5407 8564 13212 15346 23649 46402 40287 41065 32103 38364 19425 14697 23380 7562 -16493 -30601
5393 -30601 -35599 -13671 -3569 -8906 1876 5200 5976 -6273 -9068 5958 20671 29453 17025
5380 17025 -3157 -8294 -24537 -45468 -50788 -40396 -40909 -45415 -29204 -19241 -2398 -3765 -5341
5367 -5341 17358 12064 13588 1456 -5568 -172 -7553 -10334 -12790 3234 12754 37189 31078 13689
5353 13689 16099 27660 20999 23825 20753 6201 3715 5794 1413 14474 17964 10159 26282 17058
5339 17058 -9403 -27454 -15786 7694 19750 20343 1319 -1755 -9061 -7037 -4465 -662 8195
5326 8195 -9141 -10396 6476 14151 3133 4688 -7241 -2598 9855 20713 29484 9105 12243
5313 12243 8249 -1376 -2076 -2228 -604 -2796 -2554 1100 30575 22609 10242 -753 2157 5628 15011
5298 15011 6375 -18036 -38028 -20594 1057 3550 -5017 16580 45248 38795 20596 1394 -15383
5285 -15383 -22250 -25401 -36815 -46272 -43384 -38199 -20990 7422 33545 35245 24071 15978 5212
5272 5212 13659 19480 27982 16854 -1560 -16314 11519 24936 12818 4330 -3010 -909 7867
5259 7867 9581 12801 -960 -8954 -5993 -16070 -35504 -27356 -23909 -21103 -31445 -15288 -16033 -30353
5245 -30353 -33789 -28448 -29214 -37569 -24996 1800 -6141 -8104 -24505 -20813 -16994 -3220 10995 16575
5231 16575 20960 13528 20107 21165 9455 12365 46531 29680 -738 -5525 3916 14585 21612
5218 21612 28875 26005 18546 9504 12675 36081 29949 15861 -3739 -17810 -54835 -59915 -37395
5205 -37395 -3486 7321 -7362 -24666 8652 11952 -3118 -7080 -8742 -9473 -13873 5342 399
5192 399 -17411 -6621 -2935 -10848 -6908 -10130 -19060 -25880 -18498 -17550 -17294 -15441 -29025 -34592 -12285
5177 -12285 8002 -3010 -6649 613 21524 14923 20976 10437 -8478 -24938 -7535 3316 -13313
5164 -13313 -15101 -9489 -3642 4938 2196 -8569 -21838 19103 43207 21685 -13876 -8135 -5757
5151 -5757 -85 3310 5624 20092 26502 22129 3445 44 -9056 -24949 -25221 -11712 -171 17047
5137 17047 28474 15427 18695 6771 -5163 -2841 493 7908 13784 18415 8925 4232 -9601
5124 -9601 -18154 9154 25055 26836 22688 16980 9200 10066 11658 9328 8030 4671 3003 6213 -12387
5109 -12387 -20965 -1409 8298 -1357 -2218 -7884 8051 20184 14694 8990 -1149 2118 -1877 -16044
5095 -16044 -14270 -16297 -21952 -7823 -13289 -20727 -13956 -12106 -29623 -28537 -5171 24724 40474
5082 40474 29624 15478 -10927 -7848 8173 7907 7805 -10740 -35955 -44518 -35742 -30201 -42918
5069 -42918 -39288 -41377 -46062 -62861 -67236 -54404 -37410 -20223 -15342 -19373 -25621 -26768 -24294 -3659
5055 -3659 -8624 -4012 -1713 9366 9180 10830 1481 -12025 -12153 9259 -5432 2594 1047 -21905
5041 -21905 -20758 -12800 -2722 -2205 10403 15668 7896 -5601 -1600 9818 7567 -7300 -1512 2129
5027 2129 2167 11543 33948 34597 6927 14376 19254 9449 -19187 -38301 -26135 -12531 -5813 2914
5013 2914 3723 7488 7337 8236 10557 1531 -5257 -8714 -21544 -15796 -15190 -18499 -13506 -13583 -1188 4697
4997 4697 6037 622 -17885 -11403 -3916 -12726 -6143 -5015 -13700 -23372 -20765 -17743 -20435 -14609 -18331
4982 -18331 -4193 990 7860 6629 -8942 -6804 4824 894 -1573 4045 7503 7830 91 -23537
4968 -23537 -17041 1377 1784 9976 -1038 -963 -15131 -20907 -5830 -1472 -9206 -10101 -14546 -26148
4954 -26148 -18830 -9251 -10017 -19102 927 18586 9301 -810 -7324 -9706 -1493 -5357 -3476 -12096
4940 -12096 -27501 -5828 8201 6151 5040 -12207 -9360 8212 4306 331 -7657 -11697 4174
4927 4174 3403 -979 -3749 -6993 -17202 -19933 -10740 2350 -21959 -41940 -47751 -10585 7467 8994
4913 8994 14140 7746 4606 -1783 -189 -16885 -24452 -12372 -7835 -14423 -19598 -26927 -21690 -13715
4899 -13715 -9515 -15779 -11500 -10082 -15928 -14356 -9451 -8316 -28249 -32207 -25205 -30121 -37485 -24848
4885 -24848 5322 19138 17651 25359 18757 3680 4744 20814 36256 31099 21095 20769 20887 29728
4871 29728 35547 18650 25764 14219 -1994 -4511 -16118 -1931 6848 -11948 -4655 9257 9189
4858 9189 15386 4861 -20556 -17396 -13926 -9675 -10664 -12941 -161 20062 19714 12773 23804 -1706
4844 -1706 -17552 -20739 -16499 -16010 -17880 -7733 -5900 -12729 -9566 -8744 -760 -4290 -8853 -5387 -8142
4829 -8142 2892 7571 -13880 -31717 -17497 -3103 -19746 -25291 -9957 -3682 3201 8703 -5659
4816 -5659 -4890 -8201 -19281 -32185 -50222 -57825 -40838 -38102 -43832 -38095 -19664 2275 20478
4803 20478 25188 25267 22201 4459 -5465 -5793 -19275 -18945 -34163 -35147 -11918 -1098 -20485 -29583
4789 -29583 -22557 -8107 -18724 -27079 -18808 -30094 -22552 -19928 -21492 -5411 5123 4328 568 -638
4775 -638 -12363 -14805 -17194 -32133 -9246 -7898 -18223 -17234 -16060 -18578 4912 20453 21703 17600
4761 17600 6665 16537 12794 8841 15931 26319 28437 20556 7511 3991 2063 -5253 -18783 -11490
4747 -11490 -21012 -16279 -7038 -8436 -21875 -25340 -18643 -30530 -40151 -41689 -39629 -31252 -37116 -11984
4733 -11984 -11042 -12722 1865 4314 19406 5172 -8931 8625 8839 -9045 -7421 -3406 -11644 -356
4719 -356 -21271 -34680 -30939 -13798 -2439 -5196 346 4873 3006 -12658 -24343 -19673 -16656 -7508
4705 -7508 670 -2878 -1293 2038 15854 20420 9581 -5499 -9172 -24080 -17017 -6856 -917 -1570
4691 -1570 -16617 -31949 -31080 -17040 -10892 -3367 10062 21086 15588 -4395 -1889 7267 -1472 -26608
4677 -26608 -28836 -12444 -1821 -25736 -18305 -2821 -6705 -3253 14666 19551 1873 -25880 -27326
4664 -27326 -9772 4788 -3561 -9482 -7488 -5231 -4861 18929 9242 1955 1544 -4481 -2512 -4622
4650 -4622 7163 19649 25241 10423 2198 -8534 -35499 -52612 -39994 -18695 -4371 2995 -7489
4637 -7489 -24525 -14000 -16901 -16848 -18099 -25744 -31250 -37864 -32052 -1647 26657 16433 -6974 -16866
4623 -16866 -17331 -6786 -8563 -10435 -21566 -27117 -20536 -66 3938 2748 8844 24010 28612 8669
4609 8669 -19201 -25260 -9816 4711 3141 11532 15402 26967 13541 6308 4087 6533 11409 -2737
4595 -2737 -17334 -6714 -16668 -17506 -19671 -11480 -14156 -26026 -31711 -2795 -6704 -11645 -35188 -25854
4581 -25854 -584 23326 7736 -26930 -32440 -27225 -16884 -10711 -2561 12498 -9809 -12281 -3441
4568 -3441 10597 10521 20432 18717 10375 -10198 -4793 -13789 1405 8077 2267 -1620 -14129 -7564
4554 -7564 9306 1170 -18267 -6656 15970 40111 50043 47437 19886 6801 8506 -6956 -15503
4541 -15503 715 -8662 -9908 -15963 -11007 7057 14178 12799 -3607 -6184 -9034 -8647 -27008 -28959
4527 -28959 -28381 -20337 2658 21962 22866 7033 15419 35884 17771 3120 -3847 -3973 2404 14724
4513 14724 11999 -17117 -24637 -7178 -11231 -4916 7129 -10303 -18896 -20744 -11277 -9883 -4606 -4034
4499 -4034 -12019 -8188 -3347 10823 12151 6843 -10140 -20926 -16959 -15447 -18659 -21051 -10763 -18581
4485 -18581 -26169 -7215 207 278 -4012 3545 14583 29178 41888 46328 31419 -3724 -10469 -2701
4471 -2701 4636 1995 21570 16320 -3425 -21876 -30200 -33353 -26439 -13955 -18796 -23388 -10594 -20918
4457 -20918 -13136 3689 8551 -2132 -1026 5506 -7556 -5809 -6990 -30604 -20667 4928 -2642
4444 -2642 21088 27369 4226 -1396 282 -12866 -14851 -6826 750 -1339 -2473 291 -17038 -13267
4430 -13267 -367 7684 6535 -17230 -14637 -3226 13937 17154 22527 15410 15820 365 -6409 1623
4416 1623 17510 16775 3966 -14668 -6350 769 -143 -12748 -92 26841 27498 11251 -13804 -21241
4402 -21241 -36396 -40304 -20741 1216 -1763 -29257 -30286 -22067 -15997 -10425 -28893 -29683 -11329
4389 -11329 4238 4890 5629 14143 9637 12598 23897 14836 4693 -4725 -259 1765 -9191 -33505
4375 -33505 -45807 -18761 471 6236 9222 8233 1753 -1671 -2764 25236 39376 14840 7934
4362 7934 12372 15693 13343 1442 4901 -6640 1645 -2415 16500 28820 31312 18551 -4678
4349 -4678 -8677 -16356 -17072 -17876 -13121 4230 13765 6889 -5159 -8050 -3230 -2828 -3516 9619 3258
4334 3258 -3453 2162 -7703 -13319 -13051 -6591 -9681 -9310 -15913 -24620 -26281 -19688 -722 13702 11365
4319 11365 21971 27451 11863 7073 6774 13496 -11113 -34163 -39106 -28297 -24621 -14423 -573
4306 -573 -5303 -21056 2614 12654 2059 -13032 -11176 -6916 853 -11702 2587 4569 6193
4293 6193 37902 26648 19455 18531 188 -4545 -8132 -18209 -20617 -17320 6155 1618 -10532 3610
4279 3610 1895 -3719 -11455 -25047 -19507 -23726 -15106 3736 13333 25731 21029 10057 -25154 -49726
4265 -49726 -59009 -36779 -377 16630 4197 3524 1768 434 15755 21335 16969 18960 28379 19226
4251 19226 8422 1728 -2751 -588 -9239 -15849 -6856 13893 16269 -8122 -21165 -21639 -21676 1780
4237 1780 -730 3025 -4365 -12378 4355 3074 -5579 -4000 -10531 -9035 4020 2825 -2913 -10334
4223 -10334 -3690 -7471 -13727 -22494 -21150 -23683 -7578 1377 6932 -2942 -6815 -24711 -36240 -36623
4209 -36623 -31739 -411 20492 16780 7361 -3216 5209 15022 2537 15957 18679 35180 22539
4196 22539 9663 -3407 -29340 -15560 3631 12604 4964 15525 26817 22548 7473 9332 5250
4183 5250 -35437 -38220 -16712 -9437 7976 11439 -7684 -16065 -17033 -20095 -21421 -6320 -840 -15257
4169 -15257 -28690 -22629 -22960 -32560 -6784 18021 28680 36890 28969 19221 18422 14655 4212 1879
4155 1879 25262 28409 10834 2729 -11660 -13345 10316 5664 -11367 -17851 -2350 26570 35920
4142 35920 30288 14561 13224 14436 26457 29706 15410 5925 5858 9627 6303 3585 -18967 -7844
4128 -7844 -5480 -20505 -19584 -16133 -18642 -20889 -14741 -19581 -20546 -14218 707 10256 1164 5293 15616
4113 15616 9494 16712 5502 624 4059 -19512 -26077 -17764 -16579 -24461 -21180 -3637 -3391 -16078
4099 -16078 -14334 -1866 19397 18832 25625 31623 26231 36255 26506 -7569 8223 12191 3823 8376
4085 8376 8185 -2384 -14209 -18099 -29665 -28851 -11423 -8406 -37931 -34533 -16559 1724 14791
4072 14791 24920 12302 -3543 13509 24188 -2787 -19692 -24759 -20751 -38211 -44464 -30128
4060 -30128 -24249 -28190 -11393 -1760 -5929 -6866 -6042 -10686 -21592 -5121 15177 -4025 -28651 -17983
4046 -17983 -33905 -27749 -2546 -9329 -6449 10006 3973 -8224 -22201 -12798 10602 7653 4614
4033 4614 12567 -418 -2683 1783 -6147 -10565 -6551 7395 12165 4211 -5907 236 -447 23262
4019 23262 40670 45558 26989 -3274 -24795 -10734 951 5609 18581 -18203 -27899 -12390
4007 -12390 -6317 -7936 -8211 11216 18359 8497 -110 -4269 -27630 -32189 -30318 -28613 -28462 -32732 -7252
3992 -7252 4341 -20716 -16283 -945 1671 -281 4274 4772 11707 8657 4113 8566 13436 7284
3978 7284 3564 -6572 -17039 -17340 -28948 -36652 -34119 -25968 -31433 -32291 -25230 -27328 -21811 -3391
3964 -3391 -3429 -4181 -1673 6552 1224 -15630 -18621 -16980 -16604 -8529 -10020 -13116 -27265 -15666 2917
3949 2917 -4559 -1204 -1644 -5308 -11717 -1254 6310 -2265 -3716 -2184 4227 12077 7288 -9960 -13688
3934 -13688 -5015 2237 -2997 -26185 -30202 9 10764 4301 -7899 12920 35897 46363 37087
3921 37087 36422 11307 -7888 3401 -7620 -23162 -13283 -6573 -17192 -37551 -13707 -9266 -11104
3908 -11104 -478 1618 12552 26511 3283 -3848 -7268 -7940 -4387 1667 4101 13400 15028 12325
3894 12325 -9529 -21423 -29950 -20757 -20588 -14496 -18024 -21607 -10030 -9600 -15163 -8588 -6057 -1643
3880 -1643 15930 23198 26053 32534 20430 -989 -1936 1746 -6965 -21685 -17427 -28310 -24009 -7457
3866 -7457 -394 -6098 -7659 -4749 6984 1872 12521 20071 29146 59421 85286 66780 23476
3853 23476 27838 34675 17515 21118 608 -13655 -1668 19945 30396 30196 27735 11788 12604
3840 12604 -1639 6378 28256 31132 17692 5871 11890 -3456 -17472 -17188 -823 24005 21189
3827 21189 28383 44412 39148 27112 24704 17641 20330 10015 15553 22780 25522 15615 4633 -748
3813 -748 9971 4286 -13929 -13964 -13293 -5235 -507 3054 -20171 -30010 -15308 -7106 1917 -8316 -7781
3798 -7781 5912 39146 14962 686 303 10321 18286 25628 25146 599 -17236 -6162 -1706
3785 -1706 6104 18792 13061 -66 -2608 -7884 -19627 -12109 -4612 -28679 -40212 -46218 -44620 -30629
3771 -30629 -29289 -30281 6356 17533 -11583 -26150 -27915 -17537 10992 4937 4673 13046 27037
3758 27037 16693 -10358 -17875 -4027 6467 -1259 -6649 -234 -2722 7564 24366 29778 15472
3745 15472 2063 -12084 -30408 -50237 -22259 -9408 -10084 -11999 -9101 7583 19735 15017 11405
3732 11405 606 -9325 -21874 -30087 -20463 -7249 -19235 -12509 -4125 -17102 110 6452 -8155
3719 -8155 -5330 -33039 -50701 -38213 -25136 -23382 -22721 -4794 8573 4013 -1837 -10835 -8536 -4166
3705 -4166 -15261 -16350 -9951 -2081 7465 19405 18244 31132 33368 13742 9230 11449 1733 9564
3691 9564 20491 8563 13760 22087 4381 -5777 -7693 -1735 17190 15886 2314 -4901 -4398 4860
3677 4860 6013 12235 27570 12595 12214 16169 15394 18949 21807 12144 17037 11852 7814 3796 -6999
3662 -6999 -2024 -9363 -16952 428 233 -3248 471 16912 17127 18843 9523 22255 26717 25587 12941
3647 12941 411 2092 20652 32467 11570 -20083 -27328 -18552 -15610 -30018 -39997 -35234 -24711
3634 -24711 -17384 -8159 -5777 -5597 911 8702 -4578 4284 17650 4050 -18380 -11968 -6117 13769
3620 13769 19324 7417 4016 -460 9390 20372 22075 -36 -1466 -6513 -16320 -25229 -22628 -15420
3606 -15420 5677 3925 6069 17131 1181 -10585 -15081 84 9946 7625 428 6369 1805
3593 1805 7555 6497 8880 14126 9805 3531 -1474 -21793 -14944 1227 -7828 -9881 4812 15003
3579 15003 17577 11853 7137 -922 -10205 6050 21795 37123 40867 30136 34130 26478 20601 -691
3565 -691 -25760 -23471 -18001 -22073 -30419 -24663 -13329 2982 14982 12129 10056 3460 -7422 -16165
3551 -16165 -12859 2745 24246 43941 38499 22534 5210 -14895 -9869 -7623 -3862 -15315 -33673
3538 -33673 -19387 2236 2862 8660 -620 -15981 -10394 -1603 3408 21157 9163 3049 10457 12973
3524 12973 13308 -28696 -37959 -39713 -41266 -32137 -9997 4511 37872 22944 8259 6103 -3466
3511 -3466 -13512 -3902 10413 7768 -4656 -6673 -16966 -17705 2237 11380 12664 6524 -1331 -11679
3497 -11679 -6062 -7093 -8257 -27677 -14483 -6146 1012 2782 -2912 21261 23321 6514 6658 -13163
3483 -13163 -31146 -21147 -13251 -12187 -11995 -20193 -26477 -28578 -29891 -38786 -53107 -39946 -35657 -28127
3469 -28127 -37255 -20861 -24616 -15931 -7782 -9699 -24160 -20119 -9054 -6156 2289 -24057 -20089 -4408
3455 -4408 24617 12164 4827 -1869 2296 -5426 -10440 -4664 -18876 -27424 -27778 -13781 -7870 2134
3441 2134 12136 21734 26753 5903 -6985 -7948 -2685 6449 27478 20097 13241 27280 28466 11456
3427 11456 1302 -3680 5758 31890 28276 13959 -1212 -11849 -14896 -7134 -6010 -11493 -24959
3414 -24959 808 20590 12861 -14167 -33459 -16813 -8713 -22483 -32215 -33692 -24607 -13076 -1696
3401 -1696 -11506 -20503 -22270 1959 -2782 -22992 -20344 -369 30731 14274 8844 3620 -23369
3388 -23369 -26471 -20900 -25649 -22727 -23818 -30265 -40983 -38829 -1548 16715 24801 -436 -17017
3375 -17017 -24134 -23765 -15893 -11935 -7282 -10356 -11620 -16186 -22994 -24514 -19462 -9062 602 11947
3361 11947 5571 -18842 -33646 -26260 -23657 -26365 -20622 -9641 5011 17938 17287 41642 71919
3348 71919 63605 42668 21767 8007 -7333 -18743 -15629 -23109 -30708 -22909 -21715 -14940 -5412
3335 -5412 2107 18644 23264 20310 27579 31808 29912 9230 -431 -399 -11921 -3478 -93 976 1307
3320 1307 -1390 -9131 3338 28042 21137 14259 426 -14072 -21907 -26460 -30958 -19491 -4438
3307 -4438 4820 -4581 -5335 3410 1033 -3615 779 18213 16791 17921 5130 -8239 1469 17991
3293 17991 17299 3251 1257 16060 27342 23972 17866 -31 3088 -895 -4488 17277 28115
3280 28115 8427 -2440 -10615 -12266 -16114 -15553 -8588 8282 2476 6703 10014 10080 -1767 3774
3266 3774 12401 -749 34303 28313 -3756 7689 12413 303 -3859 12731 -2538 3062 13155
3253 13155 23243 18113 7824 -20179 -35377 -32650 -9731 -15802 -41019 -24767 -418 8935 21807
3240 21807 1389 -8422 6717 22373 27474 9978 11750 9004 213 13586 6133 -12843 -12589
3227 -12589 -31276 -34161 -6169 3736 14263 12438 -4591 2057 4054 -2766 12665 14675 -2450
3214 -2450 -6299 -16865 -21739 -30130 -28281 -26537 -20987 -17012 -38790 -31856 -46130 -32830 492 7281
3200 7281 18384 29510 14152 21399 23613 20674 12960 14363 -18936 -49156 -48452 -47938 -15142 16821
3186 16821 16925 6198 15981 17160 11765 23025 39879 13846 -23110 -33687 -31445 -43203 -68255
3173 -68255 -58354 -41108 -35570 -42799 -24460 1068 16337 39368 24452 -4009 -2908 -15240 -22529
3160 -22529 -14165 -5860 1525 1118 -2464 1956 3746 -6040 -34445 -29196 -7768 -575 -12512 -7181
3146 -7181 -7275 -748 6678 27777 21064 -9442 -23498 -15284 -4356 -15672 -27976 -14626 -13913 -3389
3132 -3389 1004 2330 -2360 -1388 1988 -7490 -14256 -23162 -33266 -22502 -23200 -20974 -14947 4508 -1388
3117 -1388 -20615 -28772 -20026 -9661 2890 12282 9249 14458 22187 34553 28861 22197 23163 1883
3103 1883 -6756 -2181 17558 30424 7176 1030 7448 3505 19459 21835 14411 7904 -15979 -13730
3089 -13730 -14298 -8863 -14320 -40118 -56047 -44207 -21559 -4071 -14881 -5238 12162 4874 5302
3076 5302 -4475 1464 426 4198 -167 -11196 -10180 -5396 -9865 -6590 -18809 -15528 -1836 -8098
3062 -8098 -15713 -18640 -17423 -10804 5492 14324 19079 23195 26135 26285 11265 8841 -1159 8706
3048 8706 18480 14808 23451 38980 37695 40841 43921 37078 37577 20633 6178 10658 -14964 -42649
3034 -42649 -18813 -1087 -13594 -23047 -2932 3526 11646 19818 26368 18565 19078 15096 16574 11898
3020 11898 -3281 -4667 -827 -8784 -3368 -8385 -6351 -10409 -6727 -23827 -29496 -12972 -3684 -7738
3006 -7738 -12772 -6930 461 9617 4723 10835 33700 30924 25615 16271 21016 36152 33140 17653
2992 17653 1 -2462 1299 -5139 1971 10846 26733 49010 47532 37126 28004 13380 -835
2979 -835 1523 -2227 1344 7230 12743 13624 6078 4929 -2518 2442 24069 16461 12291 6890 409
2964 409 -13263 -10008 7765 17288 12716 -2637 6338 3691 -19915 -41289 -19458 -11220 -6263 -14190
2950 -14190 12467 17767 1312 -27280 -27740 -17521 663 4819 -7647 12717 19890 -2680 -26225
2937 -26225 -26603 -29435 -18768 -5865 -9100 -18045 -23888 -5789 -4454 848 8905 20571 19422 27
2923 27 -11390 -25003 -25223 -21827 -13824 12618 -4520 -19100 -17021 2053 8362 19580 19850 2406
2909 2406 1853 11910 11941 22585 9302 -1809 16544 22235 14306 -13542 -15169 -12608 1160 22637
2895 22637 31868 32658 15357 7453 1972 3718 18759 14375 15061 11399 310 2567 -6071 -5817 737
2880 737 8471 16282 10313 -7002 -10938 9050 612 -13521 -23476 12602 26839 26248 27867 12632
2866 12632 7617 664 -14930 -26967 -28722 -31768 -16339 8372 -6768 -24184 -42936 -51496 -32188
2853 -32188 -20804 -18348 -4938 1543 5057 12443 23228 8698 34124 46034 46268 9405 -13810
2840 -13810 -989 8975 21535 21727 10798 7349 10158 25557 40610 31693 28986 9023 -1184
2827 -1184 7113 8134 19546 12215 -13067 -33151 -33922 -29983 -12762 13669 17491 -313 -682 10560
2813 10560 -640 -3289 -2244 -1847 -14349 -24130 -27325 -15083 12901 12365 17783 26705 25223 5473
2799 5473 -2385 -9852 -3260 9326 3594 6898 402 -21432 -26611 -7236 1139 -17258 -36208 -35918
2785 -35918 -18968 -18191 -8793 17018 6623 -2332 7813 475 -351 6677 17583 22574 20294 -3119
2771 -3119 17634 31845 40544 31052 6028 -16656 -20543 -14440 -11687 -24439 -31510 -22467 -5213
2758 -5213 -4092 -11918 -16592 -8168 -2312 -11353 -8187 -11840 -4918 12057 24783 35485 50664 41136
2744 41136 27610 50233 52418 23977 12337 31088 13542 3338 13643 5463 -1100 25144
2732 25144 34174 31110 19374 1967 9484 31015 16211 10611 23401 33320 26842 9798 2086
2719 2086 20479 29523 15264 10209 21524 15481 2535 -10056 -10017 -15537 -27451 -16225 9607
2706 9607 16227 13161 13379 -3375 2212 12908 18916 24708 10425 -4021 3800 19407 18209 17211
2692 17211 -5280 -24920 -25906 -15397 6201 -8526 -21534 -27876 -21236 -24510 -23134 3734 5103
2679 5103 -14932 -32681 -34884 -31976 -40802 -24417 2744 8787 18266 15097 6804 -6483 8999
2666 8999 13007 5979 -5973 -15076 -3394 -5319 -8801 -12147 -25849 -4958 -2883 -23371 -13922 -2816
2652 -2816 3029 232 9203 12346 18088 2130 8433 9275 8698 10220 19786 13651 3583 3702 19836
2637 19836 23556 30652 10093 -17345 -3955 -2770 -18432 -25105 -12621 -13596 -2985 -9358 -30983
2624 -30983 -19007 -22818 -28800 -20914 -1505 -4999 -7138 -18426 -4333 8235 21876 32467 35067
2611 35067 12927 1290 16101 10874 9793 5828 8261 13358 10860 12908 14774 23342 26702 22518
2597 22518 1638 -18563 -11181 24521 20885 27495 29946 9421 -10089 -17726 -17374 -23345 -26183 -23734
2583 -23734 -6866 28157 32586 19728 21161 10403 6651 4269 -1978 -23039 -10156 8116 12884
2570 12884 23398 10048 12598 19685 3280 15243 15153 5968 -5004 -8924 -21394 -25246 -10530
2557 -10530 2505 7099 -685 920 12232 5634 6219 22414 3193 -4895 581 3781 -779 -14662
2543 -14662 -3905 -5193 -16586 -26478 -12071 -9021 -17465 -22925 -8280 -20664 -16966 -18756 -44092
2530 -44092 -40314 -23298 -17735 -3335 -6095 1492 931 7474 -987 4087 -14142 -28365 -29449 -4196
2516 -4196 10230 6402 8295 108 10733 24698 4285 2385 5750 6424 -1571 -783 18179 16682
2502 16682 -15256 -16853 -22452 -14133 -4127 -3304 16526 15239 22378 14659 24806 40158 27761
2489 27761 35140 34021 24559 -4679 -26289 -35382 -16819 -1168 -12426 -35414 -23821 6288 10728
2476 10728 -394 -9996 6016 29121 27959 20464 -13199 -24588 -20005 -19745 -13446 -7574 12160
2463 12160 9856 20157 27926 10156 -6025 -774 -10025 3335 12339 3184 -5738 -11697 -3340 10565
2449 10565 -1179 -18964 -20483 -19923 -23142 -6996 9498 16743 15418 24583 31354 53529 47348 9973
2435 9973 -1718 -7609 10739 19739 22822 12600 16152 21641 23998 23368 24380 26459 334 687
2421 687 -13709 -11398 1214 1357 14189 11621 5815 -4993 -33618 -24770 -13553 -13235 -17273 -18705
2407 -18705 -7354 -19853 -27627 -6274 2088 14088 16505 4583 15364 3932 -4036 4074 16757
2394 16757 14036 17750 7892 -6916 8114 19361 21549 27809 34160 31237 20016 17271 24414 11175
2380 11175 -619 8277 22217 18288 4380 -9478 -6826 4606 18345 11644 18478 30020 28997
2367 28997 9762 2806 11501 14512 11385 291 -14848 -37893 -49950 -31280 -6894 5953 -3404
2354 -3404 13830 17677 8952 19075 26062 16350 14197 6734 -6250 -18355 -20289 -16593 -12751 -4669
2340 -4669 8217 4565 -7003 -26564 -16486 1025 41364 35967 18575 1183 -15086 -22613 -2697
2327 -2697 16344 5638 -13663 -20101 -11358 -10024 -10803 -13522 -8539 9167 15685 13632 6206 -4305
2313 -4305 -500 16394 20982 36372 33152 9245 25288 37318 31155 23640 36868 50264 38272
2300 38272 51067 40602 29378 29533 34759 31780 28532 12901 2430 -9473 1994 6991 87
2287 87 -5270 -2114 4021 18069 21183 18747 41680 55782 29375 485 -18328 -18436 -20618 -12415
2273 -12415 -12265 2850 7239 -15945 -24174 -14499 -11701 -2519 1601 2102 -4655 -36925 -30945 -19207
2259 -19207 -6961 12122 9271 6519 4711 12667 10686 3629 -14931 -13784 -17123 -16944 -36218 -31545
2245 -31545 -32455 -33560 -14719 -22271 -26402 -25884 -18722 -10943 5177 9686 3149 -7500 -594 1383
2231 1383 4958 1585 1590 -8326 -3393 6829 709 -4423 -9852 -28955 -31407 -10740 4616 11195 11206
2216 11206 3814 -6654 -9434 -7905 -7725 965 -4369 -5063 -2502 -7064 -12368 5557 25081 21377
2202 21377 339 -14021 -8961 -9434 -13676 463 5351 -12745 -4622 -8745 -1142 -1195 9631 11306
2188 11306 6720 14629 25409 26207 19436 12764 -639 -2900 19847 13405 -3375 -16726 -17453 -18993
2174 -18993 -20416 -22590 -17514 -22109 -29612 -43325 -35180 -12071 4304 -4098 -28803 -49454 -56739
2161 -56739 -53745 -9692 17390 9598 -10282 -16576 -12703 -37118 -25318 -1108 5244 -3143 504
2148 504 -11465 -14802 -19761 -22598 -19897 -6416 6705 14188 -1258 5737 6246 17020 20121 17665
2134 17665 4990 -6965 -28403 -39174 -27361 -20125 -6036 11382 -2883 -29205 -9701 -2665
2122 -2665 -21875 -22146 -20434 -17486 -12515 -21929 -26938 -34425 -14411 1303 -12617 -21615 -19891 -32974
2108 -32974 -33150 -2706 21936 17830 -5239 -12164 2240 26778 42354 42007 10579 15987 7435
2095 7435 1585 1058 12009 7737 2538 9496 8768 8834 9713 10121 31846 25682 20167 20469 9593 -9076
2079 -9076 -8184 -132 1069 13028 16183 10313 373 98 -13560 -5477 -959 11657 25526 23650
2065 23650 37492 45706 43893 48548 42125 21940 11331 -7181 -21626 -10670 -12912 -11370 12942
2052 12942 31182 18357 13749 18999 13913 4201 -18402 -37663 -28360 -13344 3987 11722 7264
2039 7264 3276 -11043 -3858 11339 18240 18705 17338 12876 17997 14469 9337 8874 11854 6962 662
2024 662 -2677 -9741 -14752 -10012 3906 14215 18329 16995 -10274 -34435 -18749 -17178 -21049 -11592
2010 -11592 -4401 -844 984 1291 7058 11691 -5562 2996 23065 35591 12129 13241 31402 40769
1996 40769 27786 23835 10069 7573 21372 -10111 -12038 1018 17046 12945 -12085 -19803 -3294
1983 -3294 -142 -6968 -3684 2439 12059 20846 -1405 20864 18963 7669 8876 -3640 -13253 -4143
1969 -4143 3985 12901 -4131 -17250 -24906 -17255 9462 2545 -14943 -12617 6523 23373 27718
1956 27718 5869 4109 5364 12386 1962 4694 24337 12063 -1680 -6508 -9115 -39115 -30573
1943 -30573 -28858 -30156 -19997 -13908 -17962 -20667 -18138 -10975 -15109 -10868 -3482 -3133 3908 -5328 -13327
1928 -13327 -3433 6109 23943 20160 13098 2452 1401 7020 -14552 -21364 -35628 -28104 -12098
1915 -12098 -14120 -23493 -19256 913 18663 24095 10032 -25280 -28436 -25455 -36119 -21445 1971
1902 1971 -743 -11031 -12009 -2145 -1629 -3071 -5439 -6299 -2611 6700 10403 -658 3872 177 -16206
1887 -16206 -20831 -19746 -19563 -17907 1237 -8237 -18212 -8021 -5930 1074 9638 6843 16184 15326 -1149
1872 -1149 -19964 -9400 -439 -4583 -12019 -12419 2882 -1733 -12481 -8248 31530 40294 23652 2199
1858 2199 -7236 -11067 3362 24243 7382 -14280 -19178 -4189 1869 13985 22852 18336 22693
1845 22693 5292 -9828 -2424 1077 2957 7516 27657 29667 12239 2377 -7719 -16442 -10218
1832 -10218 -9969 -14388 -4127 18137 35931 46238 33846 670 -27129 -18935 14320 27456 5774
1819 5774 -6954 -42700 -48467 -40988 -29298 -26819 -16188 1257 4216 10677 6402 -5486 16421
1806 16421 7700 -12129 -21236 -15572 10699 13268 3151 -1437 -18194 -20937 -22605 4823 37476
1793 37476 35429 17045 13692 13648 20567 21438 8431 20012 28877 19543 21783 35958 39945 1759
1779 1759 -13225 -21362 -7876 1565 -412 2779 4042 16828 16095 -1527 -5988 -21228 -29131 -11783
1765 -11783 -7088 6627 1867 2708 11684 15337 9273 -9812 -7928 -7221 -19119 -11540 11889 25212
1751 25212 15540 -238 -13102 -10994 4937 10224 1152 12195 20901 15720 -862 29766 22880
1738 22880 10073 5918 24152 16169 5787 9836 -5038 6627 36148 46301 34671 44313 52375
1725 52375 55412 55046 36591 -5222 -9694 8537 5656 13064 17726 15269 12359 10278 10028 8161
1711 8161 5847 -472 12175 19764 20616 20033 11703 19612 14778 -2651 -3823 -7492 -6419 2779 4214
1696 4214 5736 7173 1187 2009 -1274 -9570 -19973 -30793 -29503 -7212 -16275 -44587 -45775 -38204
1682 -38204 -23115 -12966 -3859 15643 32092 34284 19020 14715 27659 15822 -1651 -5899 2879
1669 2879 29837 29019 18556 18101 6750 -10401 -15163 -12608 -17160 -4270 56 5144 5201 18619
1655 18619 31634 24864 9850 18377 14100 18845 912 8980 34215 29626 17338 12795 11537
1642 11537 12725 1769 2705 15388 20544 6843 -11100 -885 -12306 -12595 2064 682 5438
1629 5438 14503 2065 12042 9323 -20 -12244 -24402 -27008 -18109 -17713 -11978 1917 6063 15837
1615 15837 28688 31469 13074 6034 -9334 -16750 -5028 4097 21653 34774 14000 -13924 -25587
1602 -25587 -10438 11844 -2216 -13451 -5770 8760 843 2726 4061 6784 355 -10117 -16955
1589 -16955 -4844 19412 7704 5438 7097 16887 7415 -9437 -1114 27065 24030 18106 11925
1576 11925 19317 24519 22805 17231 17300 10261 24164 33024 16187 -11753 -13590 3295 16063 6151
1562 6151 735 7414 18630 -10555 -10716 -6513 -10337 -11078 -5999 1276 -20098 -12756 -4178 -7263 -10002
1547 -10002 -9188 -23850 -12631 -7963 -17542 -18774 3148 6359 11943 19165 20430 7082 8026 -3164
1533 -3164 50 18386 13054 -10402 -1657 18440 -1879 -12723 16631 34140 30501 28834 33607
1520 33607 31909 12992 -4325 743 -4230 -392 17368 33792 29010 34714 20123 9830 13545
1507 13545 10255 8232 15775 -4661 -5448 -14609 -18629 2115 -3400 -12063 743 2412 9834 20404
1493 20404 -4933 -8940 449 9023 16538 26570 23823 11098 8053 16878 21007 14576 19706 15117
1479 15117 27024 31717 22174 1239 -5740 -3440 -353 18202 25318 25504 -5021 -42424 -38959 -11939
1465 -11939 836 12446 8822 13326 15148 15200 17088 11457 9829 21138 26137 35227 23608 -6384
1451 -6384 -20707 -3332 -4740 -28205 -41892 -37249 -28334 -35672 -19332 12179 13303 18346 10098
1438 10098 5846 7590 15627 30420 22721 -1249 -34096 -38697 -26415 -33633 -27249 -22995 -17014 -7251
1424 -7251 13826 7208 13202 18202 2957 -7952 -8389 -3040 21544 32769 37009 42864 31831 8855
1410 8855 -19148 -20738 -16785 -23500 -18825 -9223 -1362 6380 7747 -959 1487 5516 26168 15999
1396 15999 -4739 -25688 -19952 3766 22374 34901 28195 13446 -10423 -8421 6732 8732 17269
1383 17269 20808 9485 10860 20786 18490 1658 -3249 682 3829 21174 13658 719 -10077
1370 -10077 3430 10410 16633 22128 33758 8939 1273 15475 16773 -327 -8571 -15958 -11521
1357 -11521 -3761 -2118 2779 -9581 -15052 -24394 1015 24357 31193 33307 36881 27045 26567 30943
1343 30943 34665 45092 29891 14621 4836 14588 -5904 -2615 -1597 2692 -3731 -26253 -20846
1330 -20846 -10409 -13777 -7734 1515 -8170 -5549 4853 20347 19593 5931 19794 42001 55260
1317 55260 63433 60774 59517 48478 22310 2365 -11849 -15818 9170 22910 18023 11404 13493
1304 13493 29087 27932 18186 14580 -4604 -36668 -24889 5022 9039 -865 449 -7555 -18073
1291 -18073 -19693 -8172 -3818 -6802 -8646 3884 699 5021 9114 5897 1159 2605 -3091 796
1277 796 -390 10021 15196 15465 7841 17208 24834 13491 13447 12278 22097 19893 -4332 -15269 -12731
1262 -12731 -2355 -3480 -7300 -2245 2285 7689 5226 7633 17315 10659 19485 27604 35028 21653
1248 21653 10444 32696 -7621 -49849 -35604 -22492 3087 22590 5689 7280 24101 27415
1236 27415 20768 -864 -10501 -31448 -17919 1448 2575 -20302 -43259 -42231 -13377 4523 4180
1223 4180 -7299 -13851 -27219 -2185 -1192 -14291 -13255 -14885 1706 23344 31046 13985 -14365
1210 -14365 -14289 1713 12500 -9679 -18359 6029 33437 24002 5890 -975 5179 11596 4562 225
1196 225 -2090 20891 31220 24410 34655 48825 34283 19808 19068 21829 11933 2487 -708 -11850
1182 -11850 -5148 -10475 -19928 -20476 -18298 -21523 -14693 -6833 -347 -12306 -27733 -39963 -26663 -769
1168 -769 17277 10637 -1460 518 16521 14196 4441 11001 10740 5220 15089 14579 6970 -3919 -2304
1153 -2304 8518 7455 4575 -16344 -18561 -15946 -8226 1094 8681 -97 -11616 -2733 -6793 2676
1139 2676 15402 32353 20714 6737 -6500 3344 -930 -228 4984 11301 4473 -19937 -22490 -22959
1125 -22959 -14065 3838 14492 17519 1591 -5788 -5234 17602 34971 47317 30627 11331 -7503
1112 -7503 1398 24670 19054 8105 2869 3658 578 4430 3436 1163 7010 34795 40354 22599
1098 22599 26668 28760 19102 6378 -2905 1273 452 17926 19361 6885 2621 -3070 -21059 -22888
1084 -22888 -4667 21604 44175 35889 14915 3961 24296 26648 13164 -14988 -40068 -47642
1072 -47642 -44770 -18514 -90 12548 4910 -18279 -21727 -25979 -12781 -2631 619 -18966 -38071
1059 -38071 -13556 -13370 -16464 -18908 -34497 -18440 -1462 7777 18835 28221 27436 25911 46863 33485
1045 33485 8509 -4566 -6178 -11370 -22963 -18835 -11656 -17207 -18571 -1646 -505 -6012 1083 19543
1031 19543 23016 32867 31697 39054 33587 15268 22518 15337 20539 -796 -12274 -4108 -5302 2434
1017 2434 14092 15940 -4307 -7729 -11221 -22956 -19867 -15639 -31757 -32755 -25905 -4529 8825 9368
1003 9368 10447 12828 15293 14505 3221 3510 -6410 -9899 -3654 4421 17900 13938 21534 9726 4033
988 4033 8585 16586 23246 21890 15893 40977 34934 30997 21193 17572 11190 15808 19589 34049 36264
973 36264 12230 2806 -5655 7717 25353 31161 19187 7710 5065 -15513 -14262 -11921 -9837
960 -9837 1371 16530 5301 -18038 -16230 -5925 -4873 -744 -4010 -6754 -4521 2432 1615 15704
946 15704 13744 14430 13085 5464 -11973 -26780 -1600 15334 -5071 -4191 -3091 8289 22808 10982
932 10982 19025 21458 34222 14982 1405 -5197 -12110 -22358 -35385 -35077 -25971 -36049 -24611
919 -24611 7432 15809 5220 -11656 -7974 23286 36951 14557 3608 14295 10743 1068 12742
906 12742 15408 3826 -1307 2831 17967 22138 4271 -15199 -12501 -4928 10538 11103 17115 4139
892 4139 -21233 -4940 4464 1304 -5098 -16033 -23026 -3804 9015 5271 -14182 -25698 -21176
879 -21176 -12688 -17130 -5099 -9834 -13254 -21609 -20819 -13589 -24234 -13212 902 4315 -7778 -27351
865 -27351 -14044 341 -16189 -16343 311 9663 -1806 -12501 -23031 -9961 1475 -4313 -6449
852 -6449 -9044 -10830 -10469 -4471 -10583 328 5495 3185 22598 23158 22921 33697 29391 33913 43750
837 43750 40342 30487 11426 4746 28047 38512 19664 5808 -1330 -14283 -6985 8332 15234
824 15234 6930 -12598 -23160 -24961 -20994 -3099 -7012 612 14095 28761 29752 17068 17679 -9264
810 -9264 3581 13914 108 -1862 4517 15050 33625 28120 23186 21466 19223 16880 4292 -16693
796 -16693 -20447 -13679 8020 10799 22943 20136 -5905 -19359 -7336 -19905 -12847 8588 3598
783 3598 1264 8032 7720 5219 6913 8538 8210 22008 42171 40905 23619 18580 26719 27920 6999
768 6999 -9705 -11243 -8544 -20416 -28036 -47215 -39928 -32556 -30706 -13500 -8375 -19783 -19773 -24510
754 -24510 -10403 3859 11280 16376 14885 21411 33045 24295 4754 -1487 -6404 -3498 16645 35843
740 35843 47354 32761 16385 10611 22737 30169 36364 18168 1313 19489 20552 26787 15232
727 15232 12464 11236 17906 18024 -9577 -19300 -5450 11390 8886 -3477 -7406 11182 12008 4159
713 4159 18615 13690 3352 -18386 -28639 -23891 -26899 -34477 -18460 14147 12939 -693 -11777
700 -11777 -22874 -16558 -15311 -11650 -13827 10279 28535 24910 19347 27613 26507 26141 26406 34221 47861
685 47861 42679 22619 149 -4358 141 17158 22692 10271 13534 19307 35100 36786 30882 36167
671 36167 32064 32827 30345 26320 18737 -1555 -14132 -10774 -5569 9886 25909 4063 -8018 -1629
657 -1629 9035 11834 9901 -397 7792 3926 6999 -2360 -6076 12005 23487 2293 -13714 -7489
643 -7489 -6732 -24071 -33376 -37767 -30329 433 14228 -2314 -10624 -2732 -7291 7041 8808 2617
629 2617 2904 5410 19997 12317 14486 -175 -3032 2776 8019 -7301 -14179 255 4141 -11423
615 -11423 -2831 6929 12133 3959 1608 13966 26747 36046 36231 33864 46216 42698 24350 41621
601 41621 34108 22233 -5214 -33914 -36953 -35241 -21758 -44 20736 16449 12222 11793 11177 9866
587 9866 -190 -2165 -10076 7052 14196 3602 -3815 10238 1642 -15621 -21346 4421 26698
574 26698 7959 12302 30760 35324 27376 14797 3220 4323 -8811 -6260 7197 10075 -993
561 -993 -1312 11904 31554 22986 32709 28375 14134 6908 -18644 -23549 -4998 14679 18010 20179
547 20179 7571 1293 15248 17135 9771 6432 -1816 -11476 -27717 -37576 -29416 -17339 -10902 -10262
533 -10262 -14465 -22674 -15337 -13146 -10697 -2999 -1267 -3779 -21343 -20272 -24701 -23681 -20600 -29751 -25754
518 -25754 -2858 -3775 -3951 3130 -11034 -2793 4935 5223 2858 -4212 -12818 12086 13461 7626 9496
503 9496 8776 6223 -6003 -7690 10183 3301 8541 13298 13833 9058 35763 42757 33028 35587 33579
488 33579 33254 24990 17078 21467 31126 39907 23965 3454 -3814 -16796 -28281 -10842 8094 22896
474 22896 17327 10930 18915 11794 -5235 -4073 -12562 -1964 2797 5289 20032 25344 5425 -10578
460 -10578 -32928 -17878 3121 1019 -11648 -24631 -26839 -7790 -11836 10256 27504 6651 7789
447 7789 8104 -3222 6290 15873 15430 22882 10985 -1768 -2436 6108 16902 18736 22910 19290 4208
432 4208 -12959 -7072 14616 27287 17085 6160 6820 -5186 -1792 20225 18541 15436 7519 7321
418 7321 15001 25864 31638 47493 39494 37454 52332 46483 33321 5754 -2632 -2992 -3178 4084
404 4084 12493 -1410 -578 -3035 1089 -13140 -16747 -25125 -15604 3336 -595 -9360 -16504 -14486 689
389 689 7792 17578 29567 22387 12607 29532 18990 3496 -9390 -5959 -619 -4013 -7396 180
375 180 -7570 -18626 -22573 3519 24865 12644 -237 -7409 11121 15456 18818 30110 22861 34251
361 34251 47513 26981 22991 7364 1347 1961 -443 3560 13334 31076 28841 7067 -4693 11053
347 11053 17643 29842 31642 40563 35987 28206 18525 15491 6562 13590 10238 8660 -2154 -735
333 -735 -12588 -21303 -21169 -29358 -8313 5306 8363 -3109 -15228 -15844 -20036 -21644 -13776 4741
319 4741 25313 21739 19747 14455 -5423 -12103 -583 11379 16399 16969 20840 18032 -9557 -15830
305 -15830 -11757 -3264 -926 8598 22582 15955 4771 16559 35741 29287 3972 -18063 -6209
292 -6209 15583 10655 -5958 -3505 -6348 -14623 -17660 -8402 -7101 -8912 -6987 -11157 -38 12441
278 12441 19080 12081 -7173 -479 1016 -4184 6687 9161 7826 -2008 -4408 -4178 -8524 4018
264 4018 30999 25437 -1157 -7047 -5213 -3111 -2621 -10420 238 22381 10117 545 6672 -3126
250 -3126 -4601 -2325 -1309 -5083 -1165 18992 9365 184 1889 8087 3457 2776 -10148 -16791 -9904
235 -9904 -6339 -26756 -21035 -9362 -9681 -588 2649 -3729 -10413 -483 -7336 -14040 -4036 2618 -20094
220 -20094 -6697 4849 -502 -2145 2690 16531 18785 19629 12645 19374 11946 2261 -3283 2897
206 2897 13255 19585 33111 29220 13185 -7221 -11009 2761 11606 10033 2690 -2497 -10192 -13141
192 -13141 -10789 4827 274 -10401 3172 17878 22516 33629 42291 34507 17742 5797 -3553
179 -3553 11263 25177 23495 -66 -11364 -16359 -32992 -24483 -22338 -10899 -900 -3792 -10591 -11010
165 -11010 2711 6037 -12939 -14206 -7319 -11608 -9737 -19782 -27837 -15890 9194 38358 29639
152 29639 -2551 -17816 -22293 -13638 -29758 -29971 -17284 3820 5251 -2058 7788 17755 21409 13933
138 13933 12042 2034 692 2669 8377 13526 23331 19971 20775 17750 1137 -3465 -6993 -12383 -5808
123 -5808 -1360 1859 16905 19922 20345 21780 19855 16798 12553 14247 20952 11499 10110 8753 16117
108 16117 11660 2936 -9944 2922 24311 20220 29392 17686 -151 -19169 -22293 -17691 -14474
95 -14474 5283 16501 7449 6614 8726 14097 12682 24103 30002 26773 14852 16744 10197 10475 5578
80 5578 633 9887 19708 20294 21067 25326 17108 8811 322 -7958 9669 13978 4226 3680 4331 5815
64 5815 12899 15789 11974 7570 11530 11590 -1192 -10545 -25320 -27977 -11008 -7111 -5088 -7034 2477
49 2477 6052 1614 -9768 -4522 6077 4170 136 -2394 8627 16487 12316 11609 5415 -7563 -12176
34 -12176 -24486 -18618 -4062 -5815 -8453 3361 13563 15980 21895 29470 37623 28135 14111 16002
20 16002 7746 -1593 -4195 6269 12809 4156 -18669 -27867 -23997 -7304 -3681 -11432 -14905 -677
6 -677 3903 -14031 -6638 5500 7686 4836
0 4836
$$ Imaginary data points
##PAGE= N=2
##DATA TABLE= (X++(I..I)), XYDATA
32767 96685 85503 90358 113729 124064 136688 144402 142019 136511 135194 142533 140232 138399 145230
32754 145230 138974 125908 113834 105370 107788 112678 124591 126857 129971 132834 124698 120011 112622
32741 112622 112558 109728 105569 116247 115876 117018 117159 130997 126075 128250 135700 146212 140101 137561
32727 137561 146793 150466 146840 146518 150974 151600 146785 150722 147660 154776 153665 155070 155977 145192 146987
32712 146987 156252 156644 149270 144388 147716 159263 171898 183217 168497 159265 149651 162465 181426
32699 181426 171976 146643 163932 175080 182978 174035 170241 188027 187244 169147 182864 190261 173710
32686 173710 175319 176132 184385 185661 191933 187850 191984 195975 190615 186781 176563 180891 178293 173931
32672 173931 168144 176298 185485 187705 191558 205460 198426 187074 192104 197015 192651 183959 174045 183253
32658 183253 208650 218023 222941 222666 209145 205550 196925 198385 202858 211016 233982 249582 232882
32645 232882 218843 225372 226740 233138 232105 209162 215831 209545 214249 231085 221312 215312 228573
32632 228573 221579 221872 229241 229182 212223 208089 223200 233064 229089 216824 216986 216301 235961 250705
32618 250705 253471 241057 242644 239720 242121 243503 239557 244072 246027 258760 275476 261336 261453
32605 261453 255515 268432 264460 263673 262644 260451 258116 263094 262733 259265 255461 270968 265196 261795
32591 261795 260840 252505 244009 237134 246641 246228 234771 253253 270435 266527 274454 281011 289556 299951
32577 299951 308310 292969 292006 284761 290341 285226 291840 291333 281836 271255 276565 281241 285341 287020
32563 287020 291022 288553 272584 262656 257525 269962 280790 276682 273688 266845 259630 252463 262055
32550 262055 277048 291853 294779 281889 276846 272461 266871 293573 301779 298876 303126 292679 276937
32537 276937 277269 279620 282598 278176 307947 317179 314937 310473 307372 308062 307861 298806 296366 282841
32523 282841 277240 276315 290596 317087 338451 332378 322454 310446 304094 323983 329750 331549 330072
32510 330072 313368 312188 315827 311979 324130 332506 339018 345016 353230 344816 335660 322539 339782
32497 339782 347757 343675 349220 349613 346064 318782 321162 332683 329917 303328 300160 296094 296594 291331
32483 291331 292796 309013 323947 328430 336502 335787 332931 339824 330298 317006 316401 321402 327035 335560
32469 335560 320397 312926 334021 345601 345347 347426 343744 349116 346175 345840 361490 361296 368238 365306
32455 365306 370847 380120 388390 376708 362677 344504 367210 368143 365146 366224 361843 354686 355960
32442 355960 369395 362365 359859 367152 363683 370120 371559 361486 349530 335742 330358 334980 345631
32429 345631 351097 363070 353193 343068 348528 354077 369003 382606 377134 368026 356951 343785 333085
32416 333085 338973 365272 368329 352167 352307 364960 375878 360284 341704 326316 319416 315641 320344
32403 320344 341587 355473 368608 379328 377606 385324 385082 373570 361947 357707 357198 375137 384816
32390 384816 391509 379850 367860 365112 358843 354311 371203 372418 382481 405702 416355 394400
32378 394400 392786 383553 384554 384036 379891 392540 408789 402960 389700 373047 370262 374979 372568
32365 372568 374400 381760 389250 378873 372827 379296 402914 399428 387199 376946 373896 379105 385878
$$ [...]
##END NTUPLES=NMR SPECTRUM
##END=
