##TITLE=Analysis number 319308
Compound Code cc 55601
Book Reference 481/46
Project Code adrs
Chemist Name bruced
##JCAMPDX= 6.0         $$ Bruker NMR JCAMP-DX V2.0
##DATA TYPE= NMR SPECTRUM
##DATA CLASS= NTUPLES
##ORIGIN= Bruker BioSpin GmbH
##OWNER= nmr
$$ XWIN-NMR		Version 3.5
$$ Tue May  9 16:09:25 2006 GMT Daylight Time (UT+1h)  MAYBRIDGE\nmr@NMR_250MHZ
##.OBSERVE FREQUENCY= 250.131544655141
##.OBSERVE NUCLEUS= ^1H
##.ACQUISITION MODE= SIMULTANEOUS (DQD)
##.ACQUISITION SCHEME= undefined
##.AVERAGES= 16
##.DIGITISER RES= 18
##SPECTROMETER/DATA SYSTEM= dpx250
##.PULSE SEQUENCE= zg30
##.SOLVENT NAME= DMSO
##.SHIFT REFERENCE= (INTERNAL, DMSO, 0, 16.522)
##AUDIT TRAIL= $$ (NUMBER, WHEN, WHO, WHERE, WHAT)
$$ ##TITLE= Audit trail, XWIN-NMR		Version 3.5
$$ ##JCAMPDX= 5.01
$$ ##ORIGIN= Bruker BioSpin GmbH
$$ ##OWNER= nmr
$$ C:\u/data/dgb/nmr/ADRS/4030/pdata/1/auditp.txt
$$ ##AUDIT TRAIL=  $$ (NUMBER, WHEN, WHO, WHERE, WHAT)
(   1,<2006-05-09 16:08:50.67 +100>,<MAYBRIDGE\nmr>,<NMR_250MHZ>,
      <created by zg, POWCHK disabled, PULCHK disabled
       configuration hash MD5:
       84 BC 41 DB A1 6E 1D 46 DA 25 12 A5 C1 ED C5 3A
       data hash MD5: 64K
       AC 6B 35 C3 33 F0 4B A6 01 3C 36 8A 3D F1 A0 60>)
(   2,<2006-05-09 16:09:13.31 +100>,<MAYBRIDGE\nmr>,<NMR_250MHZ>,
      <Start of raw data processing
       ef LB = 0.3 FT_mod = 6 PKNL = 1 SI = 32K 
       data hash MD5: 32K
       98 85 CA 70 D2 98 A1 FE C9 F3 7D BF BD 93 65 7B>)
(   3,<2006-05-09 16:09:15.52 +100>,<MAYBRIDGE\nmr>,<NMR_250MHZ>,
      <apk 
       data hash MD5: 32K
       FE 6F 84 EA 76 EA A5 35 61 6A 04 4A 5B C4 A3 73>)
(   4,<2006-05-09 16:09:16.49 +100>,<MAYBRIDGE\nmr>,<NMR_250MHZ>,
      <abs ABSG = 5 
       data hash MD5: 32K
       E5 29 69 E5 02 E9 E7 D1 F2 98 A4 29 05 0F A3 A4>)
$$ ##END=
$$ 
$$ hash MD5
$$ A2 7D 99 81 CE ED A5 20 2C 37 5A CA 78 05 CD C9
##$RELAX= 
##$RELAX= 
##$RELAX= 
##$RELAX= 
##$RELAX= 
##$RELAX= 
##$RELAX= 
$$ Bruker specific parameters
$$ --------------------------
##$DU= <C:\u>
##$EXPNO= 4030
##$NAME= <ADRS>
##$PROCNO= 1
##$TYPE= <nmr>
##$USER= <dgb>
##$AMP= (0..31)
100 100 100 100 100 100 100 100 100 100 100 100 100 100 100 100 100 100 
100 100 100 100 100 100 100 100 100 100 100 100 100 100 
##$AQSEQ= 0
##$AQ_mod= 3
##$AUNM= <au_zg>
##$AUTOPOS= <57 >
##$BF1= 250.13
##$BF2= 250.13
##$BF3= 250.13
##$BF4= 250.13
##$BF5= 500.13
##$BF6= 500.13
##$BF7= 500.13
##$BF8= 500.13
##$BYTORDA= 1
##$CFDGTYP= 0
##$CFRGTYP= 5
##$CHEMSTR= <none>
##$CNST= (0..31)
1 1 145 1 1 1 1 1 1 1 1 1 1 1 1 1 1 1 1 1 1 1 1 1 1 1 1 1 1 1 1 1 
##$CPDPRG= <>
##$CPDPRG1= <>
##$CPDPRG2= <>
##$CPDPRG3= <>
##$CPDPRG4= <mlev>
##$CPDPRG5= <mlev>
##$CPDPRG6= <mlev>
##$CPDPRG7= <mlev>
##$CPDPRG8= <mlev>
##$CPDPRGB= <>
##$CPDPRGT= <>
##$D= (0..31)
0 1 0 0 0 0 0 0 0 0.06 0 0 0 0 0 0 0.0002 0 0 0 0 0 0 0 0 0 0 0 0 0 0 
0 
##$DATE= 1147187328
##$DBL= (0..7)
120 120 120 120 120 120 120 120 
##$DBP= (0..7)
150 150 150 150 150 150 150 150 
##$DBP07= 0
##$DBPNAM0= <>
##$DBPNAM1= <>
$$ [...]
##$SUBNAM7= <"">
##$SUBNAM8= <"">
##$SUBNAM9= <"">
##$SW= 20.6930455092707
##$SWIBOX= (0..15)
0 0 3 0 0 0 0 0 0 0 0 0 0 0 0 0 
##$SW_h= 5175.983436853
##$TD= 65536
##$TD0= 1
##$TE= 296.16
##$TE2= 300
##$TE3= 300
##$TEG= 300
##$TL= (0..7)
0 120 120 120 120 120 120 120 
##$TP= (0..7)
150 150 150 150 150 150 150 150 
##$TP07= 0
##$TPNAME0= <>
##$TPNAME1= <>
##$TPNAME2= <>
##$TPNAME3= <>
##$TPNAME4= <>
##$TPNAME5= <>
##$TPNAME6= <>
##$TPNAME7= <>
##$TPOAL= (0..7)
0.5 0.5 0.5 0.5 0.5 0.5 0.5 0.5 
##$TPOFFS= (0..7)
0 0 0 0 0 0 0 0 
##$TUNHIN= 0
##$TUNHOUT= 0
##$TUNXOUT= 0
##$USERA1= <user>
##$USERA2= <user>
##$USERA3= <user>
##$USERA4= <user>
##$USERA5= <user>
##$V9= 5
##$VALIST= <valist>
##$VCLIST= <CCCCCCCCCCCCCCC>
##$VD= 0
##$VDLIST= <DDDDDDDDDDDDDDD>
##$VPLIST= <PPPPPPPPPPPPPPP>
##$VTLIST= <TTTTTTTTTTTTTTT>
##$WBST= 1024
##$WBSW= 4
##$XGAIN= (0..3)
0 0 0 0 
##$XL= 0
##$YL= 0
##$YMAX_a= 293600
##$YMIN_a= -470358
##$ZGOPTNS= <>
##$ZL1= 120
##$ZL2= 120
##$ZL3= 120
##$ZL4= 120
##$ABSF1= 16.522
##$ABSF2= -4.171173
##$ABSG= 5
##$ABSL= 3
##$ALPHA= 0
##$AQORDER= 0
##$ASSFAC= 0
##$ASSFACI= 0
##$ASSFACX= 0
##$ASSWID= 0
##$AUNMP= <proc_1d>
##$AZFE= 0.1
##$AZFW= 0.1
##$BCFW= 0
##$BC_mod= 0
##$BYTORDP= 0
##$COROFFS= 0
##$CY= 12.5
##$DATMOD= 1
##$DC= 0
##$DFILT= <>
##$DTYPP= 0
##$F1P= 14.0000005364418
##$F2P= -0.99999901652339
##$FCOR= 0.5
##$FTSIZE= 32768
##$FT_mod= 6
##$GAMMA= 0
##$GB= 0
##$INTBC= 1
##$INTSCL= 1
##$ISEN= 128
##$LB= 0.3
##$LEV0= 0
##$LPBIN= 0
##$MAXI= 10000
##$MC2= 0
##$MEAN= 0
##$ME_mod= 0
##$MI= 0
##$NCOEF= 0
##$NC_proc= -6
##$NLEV= 6
##$NOISF1= 0
##$NOISF2= 0
##$NSP= 0
##$NTH_PI= 0
##$NZP= 0
##$OFFSET= 16.522
##$PC= 1
##$PHC0= 127.2678
##$PHC1= 72.42535
##$PH_mod= 1
##$PKNL= yes
##$PPARMOD= 0
##$PSCAL= 4
##$PSIGN= 0
##$REVERSE= no
##$SF= 250.13
##$SI= 32768
##$SIGF1= 0
##$SIGF2= 0
##$SINO= 400
##$SIOLD= 32768
##$SREGLST= <1H.DMSO>
##$SSB= 0
##$STSI= 32768
##$STSR= 0
##$SW_p= 5175.98343685301
##$SYMM= 0
##$S_DEV= 0
##$TDeff= 65536
##$TDoff= 0
##$TI= <Analysis number 999999
Compound Code 99
Book Reference 9
Project Code 9>
##$TILT= no
##$TM1= 0
##$TM2= 0
##$TOPLEV= 0
##$USERP1= <user>
##$USERP2= <user>
##$USERP3= <user>
##$USERP4= <user>
##$USERP5= <user>
##$WDW= 1
##$XDIM= 32768
##$YMAX_p= 509858363
##$YMIN_p= -46651041
$$ End of Bruker specific parameters
$$ ---------------------------------
##NTUPLES= NMR SPECTRUM
##VAR_NAME=  FREQUENCY,     SPECTRUM/REAL,   SPECTRUM/IMAG
##SYMBOL=    X,             R,               I
##VAR_TYPE=  INDEPENDENT,   DEPENDENT,       DEPENDENT
##VAR_FORM=  AFFN,          ASDF,            ASDF
##VAR_DIM=   32768,         32768,           32768
##UNITS=     HZ,            ARBITRARY UNITS, ARBITRARY UNITS
##FACTOR=    0.157963299565203, 1,           1
##FIRST=     4132.6476996994, 0,             0
##LAST=      -1043.33573715361, 0,           0
##MIN=       -1043.33573715361, -46651041,   0
##MAX=       4132.6476996994, 509858363,     0
$$ Real data points
##PAGE= N=1
##DATA TABLE= (X++(R..R)), XYDATA
$$ [...]
17140a00685o2739m3719L23377q1698j55342J04348p6391k834K9175J26892K24337
17129B84721n4010n8600k35899K8261l2450j18138K88186j8692Q0659J47769K08809
17118E20616o8740k96240j69867o0953L3868R297J98292J92787J09664J43056
17108F11780K4078j39843j14093k6396j80037l049j27809j28010J5269M2540j97105
17097b22675j48702L51731o889K7618j79262j18129o6208K30091j42084P0488
17087b04021K52699J62880o1309J93079J7905j60498j7108j58075n4611L2981
17077C922j33407j1623J21801J71015L51651j40096k47206r6220K7151m2021p1974
17066f7007O2244K003j42340J77405j90182j6214J07452o3981l10926J90991J38983
$$ plain form
17140 -100685 -163424 -207143 116234 34536 -120806 -16458 -92849 -95683 -66508 60384 284721
17129 284721 230711 172111 -63788 -35527 -67977 -186115 102071 83379 164038 311807 520616
17118 520616 451876 155636 -14231 -75184 -41316 -32019 166273 359060 468724 611780
17108 611780 635858 496015 381922 355526 175489 172440 44631 -83379 -68110 -25570 -222675
17097 -222675 -371377 -19646 -26535 1083 -178179 -296308 -362516 -132425 -274509 -204021
17087 -204021 48678 211558 150249 343328 361233 200735 183627 25552 -29059 3922
17077 3922 -129485 -141108 -19307 151708 503359 363263 116057 19837 46988 4967 -67007
17066 -67007 -4763 -2760 -145100 32305 -157877 -174091 -66639 -130620 -441546 -250555 -111572
17055a11572Q9965R341J53361j99418j59797J27565K90493k42052k26480k8822
17045b97416K81057J97356O8317j44809l1348J61834j55178L9571m263n4712J80142
17034B40551L60011j03976k74437m13665j71096K95153J24938M7513K89438J61209
17024E55639j57549L0920K88665n9031j20580j51117k00693k29902l9329L2601
17014e0376M4471k9365L80494J35939l54088j81J65056r7417k91005j53959K04486
17003d5945J27265k1616R0132J11437p4827l3770J87372r3628k10906q017J66442
16992A93939J2621j34593l5568J67412K48017M6522K6219j22054r3248l29664
16982b0397L5056J51368Q6869j67706j49887R6874l576j4842j45066R5877J58667
$$ plain form
17055 -111572 -21607 -12266 141095 -58323 -218120 -90555 199938 -42114 -268594 -297416
17045 -297416 -16359 180997 249314 104505 73157 234991 79813 119384 115121 60409 240551
17034 240551 600562 496586 222149 -191516 -362612 -67459 57479 104992 394430 555639
17024 555639 398090 429010 717675 658644 538064 386947 186254 -43648 -82977 -50376
17014 -50376 -5905 -35270 345224 481163 127075 126894 291950 194533 -96472 -250431 -45945
17003 -45945 81320 59704 149836 261273 186446 152676 340048 246420 35514 27497 193939
16992 193939 206560 71967 36399 203811 451828 498350 524569 402515 309267 -20397
16982 -20397 14659 166027 252896 85190 -64697 32177 28601 13759 -131307 -35430 123237
16971A23237j18435k56406J1907M5504K90491J44579o8413J53735J3801j77493
16961A62507j68751j85383J5938J11902Q6082K18854p6555k71713K93512K87209
16951D73602J02471k37879K02846N4318n21737q9513Q2301K35413K12626N6964
16941E71412o542K6776j41922m1708L14533k24793k32976J68639N8343k88625
16931B03137k48671K20092K49087P5582J19933J641k81149j49051K2892l3519
16921A79974P0257N572R7522n0822l90637m5054M54265J60879l70250k86593j67539
16910c42426K03788m7747J61327L8010K75611m5323o5930Q7921J48677k55428
16900A58480o33844J33204K66094R3318m6053j60031K09365K36590M974k14286
$$ plain form
16971 123237 4802 -251604 -239697 -194193 96298 240877 172464 326199 340000 162507
16961 162507 -6244 -191627 -175689 -63787 22295 241149 164594 -107119 186393 473602
16951 473602 576073 338194 541040 595358 73621 -15892 66409 301822 514448 571412
16941 571412 564870 591646 449724 408016 722549 497756 264780 433419 491762 203137
16931 203137 -45534 174558 423645 499227 619160 620801 339652 190601 213493 179974
16921 179974 250231 255803 353325 302503 -88134 -133188 321077 481956 111706 -174887 -342426
16910 -342426 -138638 -186385 -25058 12952 288563 243240 177310 265231 413908 158480
16900 158480 -475364 -342160 -76066 17252 -28801 -188832 20533 257123 262097 47811
16890D7811o9295K56792K76667r79Q226K24979n6689k49482k2516j5440K3267
16879D23341j70050K4659r4293l08216j02810N9905M04091J13342j74272J53409
16869C29106J04722k86132o9497J07713K03284J7933l32859q7029N932k61167
16859b67994J4085K63347J3750K26803o030J00964J84754p4535l92986k8190K02835
16848B36803j29431j81474j08412P4566M40293K44648q596Q572J03031r3757m58845
16837A27398M8000O3645J62484J93385K24186k64143n02022K1768J76488J28334
16827C79523q34L36091q6409k54815J09597J35961M0384r9747j52251K55413J31701
16816G94614j53884k13996j96163j52985L6792Q4305J49738J60170l0204k84005
$$ plain form
16890 47811 -21484 235308 511975 510996 519222 744201 687512 438030 415514 400074 423341
16879 423341 253291 277950 183657 -124559 -227369 -167464 236627 349969 175697 329106
16869 329106 433828 147696 78199 185912 389196 407129 74270 -12759 -6827 -267994
16859 -267994 -253909 9438 23188 249991 243961 344925 529679 455144 62158 33968 236803
16848 236803 107372 -74102 -182514 -107948 332345 576993 568397 576969 680000 586243 127398
16837 127398 175398 239043 401527 594912 819098 554955 52933 74701 251189 379523
16827 379523 378689 714780 628371 373556 483153 619114 659498 559751 407500 662913 794614
16816 794614 640730 426734 230571 77586 114378 198683 348421 508591 478387 194382
16806A94382l3488o9981j92670L5803L19345l941j93800J48063J4553p6311J85644
16795C27599Q1463q7043m5223j30846K2720J56336J15731J46459L7551k01896
16785D22851j8844R4803r3301k0299j42949l5113n3795J1884J82666L13916k52355
16774D09464L0784L681j47531Q3701Q4780J48107j44742m0309K9992K4742P0395
16763E53064k20411p2769R8527J95985J84228j13041j33002k3538M8001j13230
16753D03814m990J80253M0792K9955j39771l3038J47174k43224R8583m0951k32466
16742B06131k81926j73050K49962J89730j4099j84893Q3835J47836J5727Q1641
16732C20894k62502j9193K67825K03888k22717j93039J38520L02888L2531K8450
$$ plain form
16806 194382 160894 90913 -101757 -65954 253391 249450 55650 203713 218266 141955 327599
16795 327599 409062 322019 276796 145950 168670 325006 440737 587196 624747 422851
16785 422851 404007 498810 405509 385210 242261 207148 153353 165237 347903 661819 409464
16774 409464 440248 443929 296398 380099 464879 612986 468244 427935 457927 482669 553064
16763 553064 332653 259884 358411 554396 738624 625583 492581 469043 517044 403814
16753 403814 398824 579077 619869 649824 510053 477015 624189 380965 479548 438597 206131
16742 206131 -75795 -248845 1117 190847 176748 -8145 75690 223526 239253 320894
16732 320894 58392 39199 307024 510912 288195 95156 233676 536564 569095 597545
16722E97545m9811M5327J40183k17430J19146L6008o9213q6998j683j47053l4325
16711C31696l4154k28620J32365K08518J96151K8762K22368m71832l14835J86052
16701B56471P3128O0752q2145l98236q520L26579K20391J01186j41120R8010J13742
16690F20238J61762p7808j44262k04252J250Q8134L0903J1378o5601j69274J29038
16679C81506m0615j69761K38710N340l04752k3710L15685J86974o661k42807l75943
16668c6034p6496Q8478J01853J8946l5903J87428J31333J44157l3860M2439l6264
16657D96077J1846k63409K58956P8565m89005r6691J76373J76760J5092o3636
16647C00928Q8721j74729j58678M99041p0454J47513J37709O1863L7494J5759
$$ plain form
16722 597545 547734 593061 733244 515814 634960 670968 601755 514757 513074 366021 331696
16711 331696 297542 68922 201287 409805 605956 634718 857086 385254 70419 256471
16701 256471 329599 390351 308206 -90030 -98550 228029 448420 549606 408486 506496 620238
16690 620238 782000 704192 559930 355678 356928 445062 475965 487343 421742 252468 381506
16679 381506 340891 171130 409840 415180 110428 86718 402403 589377 582716 339909 -36034
16668 -36034 -112530 -24052 77801 96747 60844 248272 379605 523762 489902 532341 496077
16657 496077 507923 244514 503470 582035 93030 -3661 172712 349472 364564 300928
16647 300928 389649 214920 56242 555283 484829 632342 770051 831914 869408 885167
16637H85167M32q4303j6993j34938j75587J08242K79226j36658j64326J15518
16627F75780P9644k94665j64198k83450J1973L27281P3444m00372o9634K16396
16617A72199l25616j43834K86815R7970N35802L07256j82789K3900r7834j130
16607F72739j96167k11670J23800k5723l77205Q7892K25259L210O3803K36507
16597F02445k3790p5458J13678K347J50166k6132J94042j53406j37245J50334
16587G96981Q4413j21001j24214M8383j13208J55832Q1935j63589J14073J77609
16577I37214k00614o9330L0750J57466P9332k99443n1646j93236r8476Q1806J29138
16566E02961L73895j19906n8636O8350l7630o0292L0830l16408o5471l943L88436
$$ plain form
16637 885167 885599 801296 784303 649365 473778 582020 861246 724588 560262 675780
16627 675780 755424 460759 296561 13111 25084 352365 425809 25437 -44197 172199
16617 172199 -153417 -297251 -10436 87534 623336 930592 747803 771703 673869 672739
16607 672739 476572 264902 388702 362979 -14226 73666 298925 302135 365938 602445
16597 602445 578655 503197 616875 619222 769388 743256 937298 783892 646647 796981
16587 796981 881394 760393 636179 684562 571354 727186 809121 645532 759605 937214
16577 937214 736600 667270 698020 855486 934818 635375 583729 390493 292017 373823 502961
16566 502961 876856 756950 698314 766664 729034 668742 699572 383164 317693 313750 702186
16555G02186M70119L7727k09220j97954j63178j76743k87906j92139q2624K45874
16545A46142M49132j3644j36265j01774J02677L74453Q2271j27304o8568l4845
16535F72275j13652r2118k42263j70272N2175L11124j0827k38293P664J58709
16525C34522J10379j5039J07324R2435Q7339J16599j81190j59767J1861J37958
16515F42421j7132q9662J20094K53730O6263r7161j41017O938k5167J2978K36059
16504I68344M0376l00845N8587J61129l69812m5645p407l40457L1496J08032J71378
16493D75176j63461r9863J66558K21731J1146j75312o2246k01542O7172M9781
16483B89140J47339J46804j04031q8476Q0830J47346J94687Q5661l19389n659
$$ plain form
16555 702186 1172305 1210032 1000812 802858 639680 462937 175031 -17108 -99732 146142
16545 146142 595274 581630 445365 343591 446268 820721 902992 775688 707120 672275
16535 672275 558623 466505 224242 53970 106145 417269 406442 168149 175813 334522
16525 334522 444901 429862 537186 629621 716960 833559 652369 492602 504463 642421
16515 642421 625289 535627 655721 909451 975714 878553 737536 744474 719307 732285 968344
16504 968344 1008720 707875 766462 927591 557779 512134 504727 164270 195766 303798 475176
16493 475176 311715 211852 378410 600141 611287 435975 373729 172187 239359 289140
16483 289140 436479 583283 479252 390776 471606 618952 813639 899300 579911 574252
16473E74252J04666L1025K90436J58838j41296l8869j26707l70013j28463Q6217
16463D40086L25812k8468m4119P4958N8144k32997r0734J16315q8631l8940J52227
16452F43653L80495j9434j5568j69773k63670k49072l31341p5974L33098J49646
16442C82060K24905O4439K3636n175M4313J89728p1433j95381k02110j63127q200
16431B83655L26806K34331K56695K88566J5850k84280j2682o2002j59713l8820
16421H48406r2799n7459j52679k6303L01100L04005P8696r6565m03905k32941
16411D69556J41287J93767K37866l3908m37499n266J73019n6033o246R8074P8663
16400H53280j14758m4851L4529k18711j49447L21827J26946J54361J7875j53039
$$ plain form
16473 574252 678918 709943 1000379 1159217 1017921 979052 852345 482332 353869 440086
16463 440086 765898 737430 693311 768269 826413 593416 502682 618997 530366 491426 643653
16452 643653 1024148 1004714 989146 819373 555703 306631 -24710 -100684 232414 382060
16442 382060 606965 671404 695040 689865 734178 923906 852473 657092 454982 291855 283655
16431 283655 610461 844792 1101487 1390053 1405903 1121623 1108941 1046939 887226 848406
16421 848406 755607 698148 545469 519166 820266 1124271 1202967 1106402 702497 469556
16411 469556 610843 804610 1042476 1008568 571069 565803 738822 682789 676543 774617 853280
16400 853280 738522 693671 728200 509489 360042 681869 808815 963176 981051 828012
16390H28012j09775o8186j21634j00282N870J16827M326n7952R9811j03790p8758
16379D14469L50076K32531R1628J45025Q0243o4180m31022j18972K15181K9563
16369I44542j66241p3069r2887m2149K35926J88875k8395k09718j33386N9038
16359F82536K74885K49164j10920l3988j40654k09891j64096L10075K20233Q9699
16349A167043L5149J69124k45698j89153o8649j34858j07153L03115J08668L4636
16339A072224K34081o2583l37192q1882J20325o9328j40371j00335R5085J00791
16329H30815J73555k37569J2237P9622P304L9676n3830P589J25549K4290k76745
16318G32493L501N385J91720K9905k18872J23783Q0185k47187J63192P4111q0763
$$ plain form
16390 828012 718237 650051 528417 428135 434005 550832 555158 497206 597017 493227 414469
16379 414469 764545 997076 1088704 1233729 1313972 1249792 818770 699798 914979 944542
16369 944542 778301 705232 612345 570196 806122 994997 966602 756884 623498 682536
16359 682536 957421 1206585 1095665 1061677 921023 711132 547036 857111 1077344 1167043
16349 1167043 1202192 1371316 1125618 936465 867816 732958 625805 928920 1037588 1072224
16339 1072224 1306305 1243722 906530 824648 944973 875645 735274 634939 730024 830815
16329 830815 1004370 766801 779038 858660 865964 905640 851810 859399 984948 1009238 732493
16318 732493 735994 741379 933099 963004 744132 867915 948100 700913 864105 938216 857453
16307H57453j02476Q9644M6609o1846o9559k41332Q8607L16173J91035l38060
16297G76248K8816K86331J00713N4673r8845j53861l24960j59153m9249k6923
16287D33790R9426k52027r2481K63903R4178P5164l13313j28530K72895J40926
16277E93931k2480K00640L77545J86118k98408k07319N5289j28539J44516n263
16267H96030K66013l23107K1115J60496K44536J34357j22064j98151j80619k46110
16257F52496J18632J92656J15672k52453k8067n1390J35098Q302j9822j01809
16247G69315L0912k4648k40366J24157M29482K9089l2324N7558j64240m6299j1641
16236I20995O4041M6149l9740k13252J25027K52105j1681l32335j06360k958K87467
$$ plain form
16307 857453 754977 844621 891230 829384 759825 518493 607100 923273 1114308 776248
16297 776248 805064 1091395 1192108 1246781 1147936 994075 669115 509962 460713 433790
16287 433790 533216 281189 188708 452611 546789 621953 308640 180110 453005 593931
16277 593931 571451 772091 1149636 1335754 1037346 830027 885316 756777 901293 896030
16267 896030 1162043 838936 860051 1020547 1265083 1399440 1277376 1079225 898606 652496
16257 652496 771128 963784 1079456 827003 798936 747546 882644 890946 871124 769315
16247 769315 800227 775579 535213 659370 1088852 1117941 1085617 1143175 978935 932636 920995
16236 920995 985036 1031185 991445 778193 903220 1155325 1143644 811309 704949 701991 989458
16225I89458L51020K65910p8221j74066j29582j37530p3088m5562k0993j87801
16215G59545j41830J67962K24943K03349R6616K48054m301l64639k78339O931
16205I18291J47938J00007q7587J3842q1214J5940K587N837j32583K37200Q2350
16194A222608n2890k92760o9914J21731L4425J86540J52375N7083J0873k11411
16184A158660k52943J0280P1001j103j38257K66270L7392j49097j14339j01475
16174G86389L01117m4055j72068r6598J54093J49333N9776k54466r2824p5305
16164G15392k62648L6941K61583M7404q8692J1151R4155J955P9129n1537J037
16153H45870J34558m1855l93617k13753K47213M25901J50630k05863j1840P4801
$$ plain form
16225 989458 1340478 1606388 1528167 1354101 1224519 1086989 1013901 968339 947346 759545
16215 759545 617715 785677 1010620 1213969 1310585 1558639 1554338 1189699 911360 918291
16205 918291 1066229 1166236 1078649 1092491 1011277 1027217 1029804 1035641 903058 1140258 1222608
16194 1222608 1169718 876958 807044 928775 963200 1149740 1302115 1359198 1370071 1158660
16184 1158660 905717 915997 986998 985895 847638 1113908 1151300 1002203 887864 786389
16174 786389 1087506 1043451 871383 774785 928878 1078211 1137987 883521 790697 715392
16164 715392 452744 489685 751268 798672 709980 721131 815286 817241 896370 844833 845870
16153 845870 980428 938573 544956 331203 578416 1004317 1154947 949084 937244 1012045
16143A012045j25329j82974o5434j9103J89551J20283j73854R1708J78882J11044
16133A136819J62046p5062n1951L18320q8894M984k3865m09257j87612Q1984K5186
16122H92698J05073l7372J04674p7496q6488J52621N4008K31750K34855j02305
16112A472018o7175m6173j13908o6549J35936r8435o0258l4301K55396k36263
16102A140288r2365J07797m7288q1456j61711o0163q2652r285P8013J90933j77056
16091H05055l44239L28631M12987M2163r4662n5312j84491j29252L1831J3289
16081H26000m1741J94698J4655P9686K05959k00966j43632J53669N31244K23148
16071A842720l44840l54784k51144O4736J45364J00297M7001l6106j92346m066
$$ plain form
16143 1012045 886716 703742 638308 619205 808756 929039 755185 846893 1025775 1136819
16133 1136819 1298865 1223803 1171852 1490172 1401278 1406262 1382397 973140 785528 867512 892698
16122 892698 997771 960399 1065073 987577 901089 1053710 1107718 1339468 1574323 1472018
16112 1472018 1404843 1358670 1244762 1178213 1314149 1215714 1155456 1121155 1376551 1140288
16102 1140288 1047923 1155720 1108432 1026976 865265 805102 722450 713165 791178 982111 805055
16091 805055 460816 789447 1202434 1244597 1149935 1094623 910132 780880 812711 826000
16081 826000 784259 978957 993612 1073298 1279257 1078291 934659 1088328 1619572 1842720
16071 1842720 1497880 1143096 891952 956688 1102052 1202349 1249350 1213244 1020898 1016832
16061A016832J28034j52124n0299K89349K73241j43416l43624o2150k5194o1227
16051H69422L8382l62J20404p1863k84231o392j72614N1179O7004J60870J74165
16040I45964o5794k62907k1638j3788N9454J34722J55233k14229m4156J91620
16030H64481L36714J07192j9976N0211M2665j034k13857o9906j6936J44501J40907
16019A364962j27760j53669P915J35672J41595j77901k86484k0480K06721M6111
16009A136682k49712J92137L96400j00687m3395K72050j68609m02026j36235J03565
15999A000170J98270p3065R1223K07867k3591R459O5054M245j48733k62335o8518
15988A000046P7917N8322J34887q5046j08327P4946J17912K9935K46917j753k49810
$$ plain form
16061 1016832 1144866 992742 942443 1231792 1505033 1361617 1017993 955843 930649 869422
16051 869422 907804 907442 1027846 955983 671752 665360 492746 543925 610929 771799 945964
16040 945964 880170 617263 595625 581837 641291 776013 931246 717017 672861 864481
16030 864481 1201195 1308387 1288411 1338622 1381287 1380253 1166396 1096490 1079554 1224055 1364962
16019 1364962 1237202 1083533 1091448 1227120 1368715 1190814 904330 883850 1090571 1136682
16009 1136682 886970 1079107 1475507 1374820 1331425 1603475 1434866 1032840 896605 1000170
15999 1000170 1198440 1125375 1216598 1424465 1400874 1410333 1475387 1479632 1330899 1068564 1000046
15988 1000046 1077963 1136285 1271172 1186126 1077799 1152745 1270657 1300592 1547509 1545756 1295946
15977A295946m46524j34934M0866J12648R0745J16023J40246K40300K01371J11347
15967A768034p6382q5595M2642l0200k12859l093j01697m3676n8569q4589P0511
15956A184527p2348j75157o269P5471p4969L61513L72871L9119m9934P6090j50473
15945A580441l64779l5508J52891J21080j4286j28366j09501k41337J65756J841
15935A128232J26079J21286j09202n3317o7354M1280N4527J45876l4471O6396
15925A419332k2737k5109K4943J9758j22929j80052P9069K36843N92844L0569
15915B052531k09220k04212j50021k35288L5514o1341n5694P789J92780p0985
15905A301853l2973J50607p6544O7504j3377q1085K70468o1359J11442J4013o7594
$$ plain form
15977 1295946 849422 714488 755354 868002 958747 1074770 1215016 1455316 1656687 1768034
15967 1768034 1691652 1606057 1648699 1618499 1405640 1402547 1300850 1257174 1198605 1114016 1184527
15956 1184527 1112179 937022 930753 1006224 931255 1292768 1665639 1704758 1654824 1730914 1580441
15945 1580441 1215662 1180154 1333045 1454125 1439839 1311473 1201972 960635 1126391 1128232
15935 1128232 1254311 1375597 1266395 1213078 1145724 1187004 1241531 1387407 1352936 1419332
15925 1419332 1396595 1371486 1396429 1416187 1293258 1113206 1192275 1429118 2021962 2052531
15915 2052531 1843311 1639099 1489078 1253790 1289304 1227963 1172269 1180058 1372838 1301853
15905 1301853 1268880 1419487 1342943 1410447 1397070 1315985 1586453 1525094 1636536 1650549 1582955
15894A582955N1962j45900k04476P9279k08731j89026L7240K31495K52808L3548
15884A521154p742k83951J09814N5464J1829j39053N2517L14017O7274M2537q9826
15873A654034j75630j94536o2852j53721L8928J41115O8797K03891Q333r2431
15863A435928j91929k2504L10447O1471R752K9580l42998l15980M10453P6761
15853A460981k53141N254L08278P2438j57281j75819p3294K91910J09679j96911
15843A392094K03860l53766M2091L25606L3171n0072j19823J8128k5986O4121
15833A529424M5937N5917O3423j38844j28242M9552M243P7438N6329q6995l7552
15822A490630j45915J6110j6896k68712L10276K94766J70227k17820k40736M8642
$$ plain form
15894 1582955 1634917 1489017 1284541 1363820 1155089 966063 1003303 1234798 1487606 1521154
15884 1521154 1513412 1229461 1339275 1394739 1406568 1267515 1320032 1634049 1701323 1743860 1654034
15873 1654034 1478404 1283868 1221016 1067295 1106223 1247338 1316135 1520026 1528359 1435928
15863 1435928 1243999 1221495 1531942 1593413 1603165 1632745 1289747 973767 1384220 1460981
15853 1460981 1207840 1213094 1521372 1593810 1436529 1260710 1187416 1479326 1589005 1392094
15843 1392094 1595954 1242188 1284279 1609885 1643056 1592984 1473161 1491289 1465303 1529424
15833 1529424 1575361 1631278 1694701 1555857 1427615 1477167 1481410 1558848 1615177 1528182 1490630
15822 1490630 1344715 1360825 1343929 1075217 1385493 1680259 1850486 1632666 1391930 1440572
15812A440572l4891j60414j41025M9524K60865J88894J41055n2812j70584J81254
15802A702438p3154k54844j43808K12324J31412J41611k15801k65739m39509K17498
15792A012428P9246J31342K19670R3430Q1660p0646k47488j03122R2061J53534
15782A442115m7029L8269O3510m9237j32469K25068k08399O1338J90082O5636
15772A648884J5067J35763o0793L9328K79079j01754k56456q9011J55372j1749
15762A753730k88J71844l15798l38423P2421L01470J81344j02750m8007l618Q2197
15751A754122O6857K68581N6809k29805k68074k21851j88451K94184M91479k12652
15741A811199l12345k58056R7588J62076O4082n8006K63585L25984j57719q2355
$$ plain form
15812 1440572 1405681 1245267 1104242 1153766 1414631 1603525 1744580 1691768 1521184 1702438
15802 1702438 1629284 1374440 1230632 1442956 1574368 1715979 1500178 1234439 794930 1012428
15792 1012428 1091674 1223016 1442686 1536116 1617776 1547130 1299642 1196520 1288581 1442115
15782 1442115 1395086 1433355 1496865 1447628 1315159 1540227 1331828 1393166 1583248 1648884
15772 1648884 1663951 1799714 1738921 1778249 2057328 1955574 1699118 1610107 1765479 1753730
15762 1753730 1753442 1925286 1609488 1271065 1343486 1644956 1826300 1723550 1675543 1671925 1754122
15751 1754122 1820979 2089560 2146369 1916564 1648490 1426639 1238188 1532372 2023851 1811199
15741 1811199 1498854 1240798 1338386 1500462 1564544 1506538 1770123 2096107 1938388 1856033
15731A856033Q6639P2419j81318m37984p7291k35915K77646M38745R4710k61786
15721A631898l0790J03443j43803k34337j6220l3556R1491K96595K087j37420
15711A529388R2499O0295k80728n3316q1036O0776K52054K54707r0172K4838J20239
15700A889544j6523j33054j07311l0554j2009K5818R6687p738K1468j02876K42490
15689A865942K49719j4167l47251o1975k5286j58624J53989J85066p064m9761
15679A790588Q5262p5116k0626o2762j88015Q1950r349m42947j23303L18345K82055
15668A636082N4832J28131r161O2496j37101J13674j59585k11368J4250K48032
15658A740282P5097J70949p6722l1460Q5939j56223j19091K88735L1382J1088
$$ plain form
15731 1856033 1942672 2015091 1833773 1395789 1318498 1082583 1360229 1798974 1893684 1631898
15721 1631898 1601108 1704551 1560748 1326411 1310191 1276635 1368126 1664721 1666808 1529388
15711 1529388 1621887 1682182 1401454 1348138 1267102 1327878 1579932 1834639 1744467 1769305 1889544
15700 1889544 1873021 1739967 1632656 1602102 1590093 1615911 1712598 1704860 1726328 1623452 1865942
15689 1865942 2115661 2101494 1754243 1692268 1666982 1508358 1662347 1847413 1840349 1790588
15679 1790588 1875850 1800734 1780108 1717346 1529331 1611281 1601932 1158985 1035682 1354027 1636082
15668 1636082 1690914 1819045 1809884 1872380 1735279 1848953 1689368 1478000 1492250 1740282
15658 1740282 1815379 1986328 1909606 1878146 1964085 1807862 1688771 1977506 2008888 2019976
15648B019976j29951k06642Q189q1176K29224M47508J14718Q3510j72875m93057
15638A819424j40793m494K39591M7287J41735J36703R5198j30414j29780r4098
15628A980359j90064l07j85852r0984J02929j0234o8288K40953M39768n8845l2952
15617B126483j46700l30705p4056j39246J56346L05473R4850k71325j70428P9765
15607A630457J9933j84728n9957K31123J26576Q4188l7156o0195J42895o0295
15597A832841l4249J77670J18411k7687o1561j0518J71973r731m08599j84897
15587A563653Q5464Q6740J0426J52380O1456k06923k69286k1904K82423L22297
15577B066726p4627k79400j08463O9042K33797N6621j13349l3446J02464J88472
$$ plain form
15648 2019976 1890025 1683383 1691572 1610396 1839620 2287128 2401846 2485356 2312481 1819424
15638 1819424 1678631 1674137 1913728 1961015 2102750 2239453 2334651 2204237 2074457 1980359
15628 1980359 1790295 1789988 1604136 1513152 1616081 1605847 1537559 1778512 2218280 2159435 2126483
15617 2126483 1979783 1649078 1575022 1435776 1592122 1897595 1992445 1721120 1550692 1630457
15607 1630457 1650390 1465662 1405705 1636828 1763404 1847592 1810436 1750241 1893136 1832841
15597 1832841 1798592 1976262 2094673 2066986 2005425 1994907 2166880 2157149 1748550 1563653
15587 1563653 1649117 1735857 1746283 1898663 1960119 1753196 1483910 1462006 1744429 2066726
15577 2066726 1992099 1712699 1604236 1673278 1907075 1963696 1850347 1816901 1919365 2107837
15567B107837j71270N3752N5908L2108o9519P3899J53392j20348j54896q1984
15557A878879K33046n9097P0137j33453q5279K09925k05670k57323q1221K92150
15547A862094K41724m3110q8817L15952o6954n23399o0707R4905n3809P9679J67323
15536A924881j23605q2285J08648j3713k38205k04420K60616K45399K14426p2212
15526B019530m3803J61983r0503n4350r5763R2280O3104k83296n812k28566J09657
15515A644461L84380J18528j68532k03645J73662J89738J31229J73890L8662l31537
15505B150836l57029J63811J05142K10719L6850r5182q2405j5580J28042J32418
15495B377622O1927j04509j81819J20896J76373j65079m5185j87014P3304J26896
$$ plain form
15567 2107837 1936567 1990319 2046227 2078335 2008816 2082715 2236107 2115759 1960863 1878879
15557 1878879 2111925 2052828 2122965 1989512 1904233 2114158 1908488 1651165 1569944 1862094
15547 1862094 2103818 2060708 1971891 2287843 2220889 1697490 1636783 1731688 1677879 1757558 1924881
15536 1924881 1801276 1718991 1827639 1813926 1575721 1371301 1631917 1877316 2091742 2019530
15526 2019530 1975727 2137710 2047207 1992857 1897094 1989374 2052478 1769182 1763370 1534804 1644461
15515 1644461 2028841 2147369 1978837 1775192 1948854 2138592 2269821 2443711 2482373 2150836
15505 2150836 1793807 1957618 2062760 2273479 2310329 2215147 2132742 2117162 2245204 2377622
15495 2377622 2439549 2335040 2153221 2274117 2450490 2285411 2240226 2053212 2126516 2253412
15485B253412J41894K07480j96810k35678O7119k56498l23647L8050K93432K34758
15475B223512o8065L0880J60269P0942k58768k18893p7747K45690K09259K7845
15465B344924r8784j53189J23917k7710Q8115O5216j18652j25466R3932m9410
15455B142893k4935L81210P9128j28465l9691N1708j9655N3226n2481k4478j81500
15444B236960l27677O7854K32976N7194k758p9503r2315j57275O7803L28756J37788
15433B469803J19996o9284k82931O2780N8346n1757l0623j20367j20852j53455
15423A881656l5322L00386J85264j72204J93245N7496k17825p9966M7152q1611
15413B078271K520Q0364O6249m1487P337n2241k28658j10001J99027L07963K60092
$$ plain form
15485 2253412 2395306 2602786 2405976 2170298 2237417 1980919 1657272 1695322 1988754 2223512
15475 2223512 2155447 2186327 2346596 2417538 2158770 1939877 1862130 2107820 2317079 2344924
15465 2344924 2246140 2092951 2216868 2189158 2277273 2342489 2223837 2098371 2192303 2142893
15455 2142893 2117958 2499168 2578296 2449831 2410140 2461848 2442193 2495419 2442938 2418460 2236960
15444 2236960 1909283 1977137 2210113 2267307 2264549 2185046 2092731 1935456 2003259 2332015 2469803
15433 2469803 2589799 2520515 2237584 2300364 2358710 2306953 2276330 2155963 2035111 1881656
15423 1881656 1846334 2146720 2331984 2159780 2353025 2410521 2192696 2112730 2159882 2078271
15413 2078271 2080791 2161155 2227404 2185917 2193254 2141013 1912355 1802354 2001381 2309344 2569436
15402B569436R7620q7399J23432n6146j20138j97317j00927k41958O1542K48922
15392B297067K09183m14504j56825K16927K01919J32956j80515j69521M6787K04163
15382B387637Q864j16175j83842k68718P5294K74591n754l27862P0861J45892
15372B060788j6288J14497K04485J02491J8808l0577j02435R2201R5211K28699
15362B767880j31787k70345l140l7043l05289p1854M9033K86358L81374O9271
15352B734458k81363k61349M8538k11710m9117J43070O5112J9319p7776J51214
15342B280396P8523K27504l0107j78011K01325J74852j30511j30845o7099m7235
15332B378792n9603n3095p1552J3863j16917n336J06987N9420r0793J99288J59562
$$ plain form
15402 2569436 2667056 2579657 2703089 2646943 2526805 2329488 2228561 1986603 2048145 2297067
15392 2297067 2506250 2091746 1934921 2151848 2353767 2486723 2306208 2136687 2183474 2387637
15382 2387637 2396501 2280326 2096484 1827766 1903060 2177651 2171897 1844035 1914896 2060788
15372 2060788 2044500 2158997 2363482 2465973 2484781 2454204 2351769 2443970 2539181 2767880
15362 2767880 2636093 2365748 2362608 2325565 2020276 1948422 1997455 2283813 2665187 2734458
15352 2734458 2453095 2191746 2240284 2028574 1979457 2122527 2187639 2206958 2129182 2280396
15342 2280396 2358919 2586423 2556316 2378305 2579630 2754482 2623971 2493126 2426027 2378792
15332 2378792 2319189 2266094 2194542 2208405 2091488 2086152 2193139 2252559 2161766 2361054 2520616
15321B520616j34949j51065k83945O5440J45467K68905L13693j6586l69023J08412
15311B466965r100j7335l305o3279k30917m9845K80070j3794p3404n2816J01690
15300B334930R7919J41383j24852q9976j54186J50493L726O9549k939j47519J16147
15289B394675J49520q1921l00166P5960P0616R0347p818P1853j12030o2421k2986
15278B265629K70517R7806J32842k73815l44584J36156K44894J51459o2713k69228
15268B348963j36639J44316O9264R5812l24966r5035K28848J13579J34415K66823
15258B845380l75364l97772J37024L5409J54039r732j53526k4333K67224N5142
15248B533491k1119n2458L41591L9072m47528l48693k81632J63154K11667K81165
$$ plain form
15321 2520616 2385667 2234602 1950657 2016097 2161564 2430469 2744162 2727576 2358553 2466965
15311 2466965 2457865 2440530 2437225 2373946 2143029 2093184 2373254 2359460 2286056 2233240 2334930
15300 2334930 2432849 2574232 2449380 2359404 2205218 2355711 2359437 2428986 2426047 2278528 2394675
15289 2394675 2544195 2462274 2162108 2238068 2308684 2399031 2391213 2463066 2351036 2288615 2265629
15278 2265629 2536146 2633952 2766794 2492979 2148395 2284551 2529445 2680904 2618191 2348963
15268 2348963 2212324 2356640 2425904 2521716 2196750 2101715 2330563 2444142 2578557 2845380
15258 2845380 2470016 2072244 2209268 2244677 2398716 2388984 2235458 2211125 2478349 2533491
15248 2533491 2512372 2459914 2801505 2840577 2393049 2044356 1762724 1925878 2137545 2418710
15238B418710J93266m09690l20338K53248J98278R1841m9104k1264J24804J28156
15228B607907j76989k294p4087k79707r5141j04020L8895N2008l7964K19504M9652
15217B197764L5897J34024J22946N0405O155N301k88815j60716M25252K22612
15207B750825q8583M8358N4693j33953q3685R4669L9365m8908j26475K5494J63811
15196B695611R8767j22998P3664K51251o4110k23027j71067k29432N2817O8785
15186B430261J4565l2537K21783j01271o7398K28170K52663J67083O144j25134
15176B994329q5417p2633j60377l4111j70775j49125q2183J49193l3255j95183
15166B160463J91075o7949n3216l5949l40492J65652J63967q6932O9131L28029
$$ plain form
15238 2418710 2611976 2202286 1881948 2135196 2333474 2425315 2376211 2354947 2479751 2607907
15228 2607907 2430918 2428624 2354537 2074830 1979689 1875669 1914564 1966572 1928608 2148112 2197764
15217 2197764 2233661 2367685 2490631 2541036 2547191 2552492 2263677 2102961 2528213 2750825
15207 2750825 2662242 2710600 2765293 2631340 2547655 2642324 2681689 2632781 2506306 2531800 2695611
15196 2695611 2794378 2671380 2745044 2996295 2932185 2709158 2538091 2308659 2361476 2430261
15186 2430261 2444826 2412289 2634072 2532801 2465403 2693573 2946236 3113319 3119463 2994329
15176 2994329 2908912 2836279 2675902 2641791 2471016 2321891 2239708 2388901 2355646 2160463
15166 2160463 2351538 2283589 2230373 2194424 1853932 2019584 2183551 2096619 2165750 2493779
15156B493779J43487n943j3748L11262j0305k29374l41456j00869K96571k61352
15146B282052K57279j24214k38034j36004J66525J01334M8943Q1236P8271K4192
15136B541580J0340q4204K04872l6380o9705n5673l8425J36095k5566j13076K3160
15125B493018r0546K22269r7590l55465P3414K33648K92268J20314J70569p5208
15115B986691J01155J01199J86345j55430k42772n45190k63026K64851m1286k1816
15105B370721K69176o3381o0575L2727J97180K27806p9496n1255k2270n2169j67291
15094B601173J54825q0430k03856k33032L47211L12502M0960J6241j31557n9596
15084B764441l51216p5038M20226L13260r14q6872j72379k3646l8698k62708n3086
$$ plain form
15156 2493779 2637266 2631323 2617575 2928837 2918532 2689158 2347702 2246833 2543404 2282052
15146 2282052 2539331 2415117 2177083 2041079 2207604 2308938 2357881 2439117 2517388 2541580
15136 2541580 2551920 2467716 2672588 2636208 2566503 2510830 2472405 2608500 2582934 2469858 2493018
15125 2493018 2402472 2624741 2527151 2171686 2245100 2478748 2771016 2891330 3061899 2986691
15115 2986691 3087846 3189045 3375390 3219960 2977188 2431998 2168972 2433823 2392537 2370721
15105 2370721 2639897 2576516 2515941 2548668 2745848 2973654 2894158 2842903 2820633 2768464 2601173
15094 2601173 2755998 2675568 2471712 2238680 2585891 2898393 2939353 2955594 2824037 2764441
15084 2764441 2413225 2338187 2758413 3071673 3070759 2983887 2811508 2787862 2749164 2486456 2433370
15073B433370O6232J65251P2740R5517J06707Q0018J00790k20511j86275K37971
15063B951810P2550l36501Q1073N3020j06403L648J3345J97955K79266l19485
15053B890278j12205N3461L1915J81155j6255k90856o800j54988K11226j60036
15043B626895k06055j73556J08228K74448K53804J51023J29628k44719n6878J38602
15033C001420O4424J01973j9499k89760j46420j40782P4211J03095r6118l1314
15023B621230J83116J99284M1371q4626J64516J05716j86720Q349n6410K1781
15013C017607J70695J46181o9388k31717j23395K10541k02607k06848r432J10863
15003B812500q5858Q9640K72014j40945k36749r6564K40j03442K06047R7066j64147
$$ plain form
15073 2433370 2499602 2664853 2737593 2833110 2939817 3019835 3120625 2900114 2713839 2951810
15063 2951810 3024360 2687859 2768932 2821952 2715549 2719197 2732542 2930497 3209763 2890278
15053 2890278 2778073 2831534 2863449 3044604 3028349 2737493 2730693 2575705 2786931 2626895
15043 2626895 2420840 2247284 2355512 2629960 2883764 3034787 3164415 2919696 2862818 3001420
15033 3001420 3065844 3167817 3148318 2858558 2712138 2571356 2645567 2748662 2652544 2621230
15023 2621230 2804346 3003630 3045001 2960375 3124891 3230607 3043887 3052236 2995826 3017607
15013 3017607 3188302 3334483 3265095 3033378 2909983 3120524 2917917 2711069 2701637 2812500
15003 2812500 2726642 2816282 3088296 2947351 2710602 2614038 2614278 2510836 2716883 2813949 2649802
14992B649802j17314k17517n7832N7389L04057L44271J23170Q8204j21403r434
14982C043393n3212j48607j00125l1244l24365j2000L49144P8361J31870J70691
14972C103906k18763j10254J1918J87998O2452Q7354j43469p115j66680j19724
14962B687623J81462L7559q453l4108Q4595o9507R5074j75541j36900J40606J44910
14951B947320k07965l29246j51599K049K63218J49686J7459L6404q7628j58949
14941B480749K21967J60289j11424P5705J38408j43034j92811q4435K4973L1119
14931B601506j403O5088J62886R5239R8738j19614j77683r5468P5046K71429O2993
14920C038757l76476K3759K96226J89478J8844j69378J16722K3364k19660l19721
$$ plain form
14992 2649802 2532488 2314971 2257139 2314528 2618585 2962856 3086026 3174230 3052827 3043393
14982 3043393 2990181 2841574 2741449 2710205 2385840 2373840 2722984 2801345 2933215 3103906
14972 3103906 2885143 2774889 2786807 2974805 3037257 3124611 2981142 2974027 2807347 2687623
14962 2687623 2869085 2906644 2898191 2864083 2948678 2879171 2974245 2798704 2661804 2802410 2947320
14951 2947320 2739355 2410109 2258510 2260559 2523777 2673463 2690922 2727326 2639698 2480749
14941 2480749 2702716 2863005 2751581 2827286 2965694 2822660 2629849 2545414 2570387 2601506
14931 2601506 2600103 2665191 2828077 2923316 3022054 2902440 2724757 2629289 2704335 2975764 3038757
14920 3038757 2662281 2686040 2982266 3171744 3190588 3021210 3137932 3161296 2941636 2621915
14910B621915k10661k6438J21353K43977J22738j69486J18921j77106j1196K25769
14900B859786M76387J1572j81155j66835j67831j6321p3501l1784p5150J00534
14890B735702K50559J18896m4519j66202n9303J1948K13463M0277q1662l0938
14880B988221j20436k33262J35979m7953J38580k7324J18550k12533P3762K03802
14870C017386n4950j33347n8656L0609O3588p0197j7632K41336N0998j53650L5793
14859B951278O4908M2005J09866j73688j17561K73777K13526n3647r9852J30552
14849C341164N2660l68621j86260Q4786K48079J58083n8204r5403l6639j65594
14839B974051j59457K34815J04781j47659k4234l0504O5527P7771J90570Q7732
$$ plain form
14910 2621915 2411254 2384816 2506169 2750146 2872884 2703398 2822319 2645213 2634017 2859786
14900 2859786 3336173 3347745 3166590 2999755 2831924 2815603 2742102 2710318 2635168 2735702
14890 2735702 2986261 3105157 3060638 2894436 2835133 2847081 3060544 3100821 3019159 2988221
14880 2988221 2867785 2634523 2770502 2722549 2861129 2833805 2952355 2739822 2813584 3017386
14870 3017386 2962436 2829089 2770433 2801042 2864630 2794433 2776801 3018137 3069135 2915485 2951278
14859 2951278 3016186 3058191 3168057 2994369 2876808 3150585 3364111 3310464 3210612 3341164
14849 3341164 3393824 3025203 2838943 2923729 3171808 3329891 3271687 3176284 3139645 2974051
14839 2974051 2814594 3049409 3154190 3006531 2982297 2951793 3017320 3095091 3285661 3373393
14829C373393l34476j13615O0287j13779l3016J12802k6517J09632p0113N847
14819B970445k94636p6075l5900r1772K9091J45084N8448J19203R2248J25756
14809C041892j80530J2070J45096K8145j66891o6720Q6637k00680J43225R0071
14799B932315j16018l18201R7699L03373j05244P0260J76878k653l21514r9470
14789B617425J46866K36106R0892k8954J689j74074j31691J9299m8451r6765n668
14778B626674K24141P2548K24827K5158q2400M8449J8102r0544J57650l965J40896
14767C361536j42127k6177j02437L17659M4839j2640K00648O9808k50203j47857
14757C313049j21159P718n6071j16258j19107l15357J39210K28499J45484q7703
$$ plain form
14829 3373393 3038917 2925302 2985589 2871810 2838794 2951596 2925079 3034711 2964598 2970445
14819 2970445 2675809 2599734 2563834 2472062 2501153 2646237 2704685 2823888 2916136 3041892
14809 3041892 2861362 2873432 3018528 3046673 2879782 2813062 2899699 2699019 2842244 2932315
14799 2932315 2816297 2498096 2595795 2899168 2793924 2864184 3041062 3038409 2716895 2617425
14789 2617425 2764291 3000397 3091289 3062335 3064024 2889950 2758259 2777558 2729107 2632342 2626674
14778 2626674 2850815 2923363 3148190 3173348 3090948 3139397 3157499 3066955 3224605 3220640 3361536
14767 3361536 3219409 3193232 3090795 3408454 3453293 3440653 3641301 3711109 3460906 3313049
14757 3313049 3191890 3199608 3143537 3027279 2908172 2592815 2732025 2960524 3106008 3018305
14747C018305q3210j35475K1915J7751K04364j03648j67447n2375j45344K53584
14737B828420m5586p2736J05501L2470j46232J58744J03601J11797j34419m7079
14727B894481j63275j01500K10790Q3061P6719k26877j48464J73025K4896m1106
14717B781750J3736Q9689K66623N0190j45669O8524Q0665m604q0425m1155k76404
14706B802920j39934J48183j5536J20048J79443n0448l62168j96385J44282J66991
14696B797396J57766K49721q4287k17385J8612j10116M5114N3980k5746j79027
14686B706028L5879J2715J24049J0948j7609r3671l5065p0076j19599K38733J45161
14675B937493k11590J88413L76767J1270k01374j3080l5674j36176o8997K61518
$$ plain form
14747 3018305 2935095 2799620 2821535 2839286 3043650 2940002 2772555 2720180 2574836 2828420
14737 2828420 2782834 2710098 2815599 2848069 2701837 2860581 2964182 3075979 2941560 2894481
14727 2894481 2731206 2629706 2840496 2923557 3000276 2773399 2624935 2797960 2822856 2781750
14717 2781750 2795486 2885175 3151798 3201988 3056319 3124843 3205508 3200904 3120479 3079324 2802920
14706 2802920 2662986 2811169 2795633 2915681 3095124 3044676 2682508 2486123 2630405 2797396
14696 2797396 2955162 3204883 3120596 2903211 2921823 2811707 2856821 2910801 2885055 2706028
14686 2706028 2741907 2754622 2878671 2889619 2872010 2778339 2743274 2673198 2553599 2792332 2937493
14675 2937493 2725903 2914316 3291083 3302353 3100979 3087899 3052225 2916049 2847052 3108570
14665C108570q3540n9728R3934R247j68865J68203J09486j45471k4603j66093
14655B841140q8863p7726J23305L2702R4926j09857k00241N1889L01209p6372
14645B892112j66437R1328O0875J17269K06648j81920l67993R1941M1046J02540
14635B887409K50616K38802J23377m5168Q8129j62578j79097j89116l8535r6606
14625B877233K24423J6749j28581P4918p9385l7619q4127r2496R3770P1620N1478
14614B987983L0531j95555J35015J17609k010j34737N174j10494p7551o9788N7503
14603B743680K11534M4758O1230j22716n0658k29731o0158J47462J08605k2005
14593B832001j29891j23806n8061J43833O6018J89754J42018k21473k66618J46997
$$ plain form
14665 3108570 3025030 2965302 3059236 3068483 2899618 3067821 3177307 3031836 3007233 2841140
14655 2841140 2752277 2674551 2797856 2830558 2925484 2815627 2615386 2667275 2968484 2892112
14645 2892112 2725675 2817003 2877878 2995147 3201795 3019875 2651882 2743823 2784869 2887409
14635 2887409 3138025 3376827 3500204 3455036 3543165 3380587 3201490 3012374 2973839 2877233
14625 2877233 3101656 3118405 2989824 3064742 2985357 2947738 2863611 2771115 2864885 2936505 2987983
14614 2987983 3018514 2822959 2957974 3075583 3073573 2938836 2944010 2833516 2755965 2686177 2743680
14603 2743680 2955214 2999972 3061202 2938486 2887828 2658097 2597939 2745401 2854006 2832001
14593 2832001 2702110 2578304 2520243 2664076 2730094 2919848 3061866 2840393 2573775 2720772
14583B720772L81924J12518l96883j60031L88559O6452K70838J3088M7839j90575
14573C254501k55996j01519J1927J66364J67251r8777l7832l4821O0953p1456
14563C060595l0652k50818j94475J37256R7426j28184J68085K7039J6558J44830
14553C047660q504j16411n648J11201J21570l14931j93516o6349K16678o1630
14543B730120j02679j0984J96126J2219k1786K81897J51098l2685k16129j77624
14533B809573j85621j39232J77877K58496k29393K02919K01338j53826R4278n1601
14523B984808o3808J24907Q0043L9392l2706P9609q272j07571j92802l5888L2691
14512B900403j00420r6697J88792K2943j07773j14175r7761J09842J25174J87605
$$ plain form
14583 2720772 3102696 3215214 2818331 2658300 3046859 3113311 3384149 3397237 3445076 3254501
14573 3254501 2998505 2896986 2908913 3075277 3242528 3143751 3105919 3071098 3132051 3060595
14563 3060595 3029943 2779125 2584650 2721906 2819332 2691148 2859233 2886272 2902830 3047660
14553 3047660 3039156 2922745 2917097 3028298 3149868 2834937 2641421 2575072 2791750 2730120
14543 2730120 2627441 2616457 2812583 2824802 2803016 3084913 3236011 3203326 2987197 2809573
14533 2809573 2623952 2484720 2662597 2921093 2691700 2894619 3095957 2942131 3036409 2984808
14523 2984808 2921000 3045907 3125950 3165342 3132636 3212245 3203973 3096402 2903600 2867712 2900403
14512 2900403 2799983 2703286 2892078 2915021 2807248 2693073 2595312 2705154 2830328 3017933
14502C017933K18105j05816m1650J65350J74344o2335j87736k35743K1945j31295
14492B833102j26243p7401Q3465L17769K88071K12528J52296l81218j23198q3323
14482C095848j15861k11360j03977k57002j76826J44627R8915J68950K8253L0975
14472B702542j38377o3779L44430P603j19292j8516j44910Q8310J58747K9376
14462B846134N7685J27321K44998p8664O3500J608j86188N9674m7128R449k95946
14451B802443M5404J93763k64778j31373L91449Q4302L442J04064j68523k14261
14441B845932n7977R326j47574j69071J89163K42122m9654j58605L9996K35252
14431B978910L355r7480j22988m914o215J89560j2403n2048o529J78786J7865
$$ plain form
14502 3017933 3236038 3130222 3088572 3253922 3428266 3365931 3178195 2942452 2964397 2833102
14492 2833102 2706859 2629458 2712923 3030692 3318763 3531291 3683587 3302369 3179171 3095848
14482 3095848 2979987 2768627 2664650 2407648 2230822 2375449 2474364 2643314 2671567 2702542
14472 2702542 2564165 2500386 2844816 2852419 2733127 2714611 2569701 2658011 2816758 2846134
14462 2846134 2903819 3031140 3276138 3197474 3260974 3262582 3076394 3136068 3088940 3098389 2802443
14451 2802443 2847847 3041610 2776832 2645459 3036908 3121210 3124652 3228716 3060193 2845932
14441 2845932 2787955 2797281 2649707 2480636 2669799 2911921 2862267 2703662 2743658 2978910
14431 2978910 2982265 2884785 2761797 2756883 2750668 2940228 2927825 2875777 2869248 3048034 3065899
14420C065899j49241j03895N3412M7701j3621k06861q7203j75106Q3206O3398
14410B577689L22667J75231j29279r5346J37756R4212J8214L07813l09673m84248
14400B615036N5938K87592p7563j44389L0484J1114J93089j8565R0357J58141
14390C201234o3941j45803J41960Q3971Q830l57521k7784J84907l5182j94060
14380B796611J84441K27642j20836k81244R2382r642j78058l3164k03198P8225
14370B553159J58568J9451K9125J10064R560L7600R1328O4083J20040j61583N0929
14359C082324r3259k07165j67631J58696j99047j50865K56120J1358J21674L12162
14349C124367j54871j97190K04953j31788k21833J02255O7990L14209j64753l7598
$$ plain form
14420 3065899 2916658 2812763 2866175 2913876 2900255 2693394 2606191 2431085 2514291 2577689
14410 2577689 2900356 3075587 2946308 2850962 2988718 3082930 3101144 3408957 3099284 2615036
14400 2615036 2670974 2958566 2881003 2736614 2767098 2778212 2971301 2952736 3043093 3201234
14390 3201234 3137293 2991490 3133450 3217421 3226251 2868730 2840946 3025853 2990671 2796611
14380 2796611 2981052 3208694 3087858 2806614 2898996 2889354 2711296 2678132 2474934 2553159
14370 2553159 2711727 2731178 2760303 2870367 2879927 2917527 3008855 3072938 3192978 3031395 3082324
14359 3082324 2989065 2781900 2614269 2772965 2573918 2423053 2679173 2690531 2812205 3124367
14349 3124367 2969496 2772306 2977259 2845471 2623638 2725893 2793883 3108092 2943339 2905741
14339B905741j57728l02116l4744O8188j32284J13011L67166j3794q9153P4819
14329B799106K15295n0593q4333l81275N8089K37274L2749k0712m3213j99129
14319B563258m5566J79329Q8252J13002p5644k15834J56349K19468m2210l45775
14309B594629L122J46100R7774J78018j91987k36023k5088p800L15249l5715K20802
14298C059081R1243j60387j28571j33430j37347l78893l9375L90740L38068k21921
14288B679208m5838J30112R6208n70023o8103K31344J92837p6385r6599p1819
14278B400942K57282j28955j77361k02104J17380J68596L51957J13814k82235
14269B619316j18301M1312j64954j78635J76298J34308J4157p2517j21852J299
$$ plain form
14339 2905741 2748013 2445897 2411153 2479341 2347057 2460068 2827234 2813440 2724287 2799106
14329 2799106 3014401 2963808 2879475 2498200 2556289 2793563 2826312 2805600 2762387 2563258
14319 2563258 2517692 2697021 2785273 2898275 2822631 2606797 2763146 2982614 2940404 2594629
14309 2594629 2597751 2743851 2841625 3019643 2827656 2591633 2566545 2558745 2873994 2838279 3059081
14298 3059081 3150324 2989937 2861366 2727936 2590589 2211696 2172321 2563061 2901129 2679208
14288 2679208 2633370 2763482 2859690 2289667 2221564 2452908 2645745 2569360 2472761 2400942
14278 2400942 2658224 2529269 2351908 2149804 2267184 2435780 2787737 2901551 2619316
14269 2619316 2501015 2542327 2377373 2198738 2375036 2509344 2523501 2450984 2329132 2330431
14259B330431K61852r6452N5387k77043k01649j01301L29742M70979k4848L8921
14249B786019K5521J99355L06583k52446J5192N402p322j00428l7904p9891q0791
14238B779290J93576q0184k82823j78077j04260o1366J12380R4116J13432o9380
14228B516704r924P1336L15919p1907j12291L7636j33993P3523L0255m1150K3605
14217B699713J86646N247k00610k16867k52325j5426R2318j07874L84507j92844
14207B382485n1425m44j8824K86850J18170o3472m1427J32317J15095q8962L8592
14196B808955o1594j8988m63l23285j98304K3250J87951J36422J42898l2781j79657
14185B484404j66762Q2859J45505j00913J89842P5082j22972n7443j06959j79231
$$ plain form
14259 2330431 2592283 2495831 2551218 2274175 2072526 1971225 2300967 2771946 2747098 2786019
14249 2786019 2811540 3010895 3317478 3065032 3080224 3085626 3078304 2977876 2939972 2860081 2779290
14238 2779290 2972866 2892682 2609859 2431782 2327522 2266156 2378536 2472652 2586084 2516704
14228 2516704 2506780 2578116 2894035 2822128 2709837 2747473 2613480 2687003 2717258 2676108 2699713
14217 2699713 2886359 2891606 2690996 2474129 2221804 2206378 2298696 2190822 2575329 2382485
14207 2382485 2331060 2330616 2311792 2598642 2716812 2653340 2611913 2744230 2859325 2770363 2808955
14196 2808955 2747361 2728373 2727910 2404625 2206321 2229571 2417522 2553944 2696842 2664061 2484404
14185 2484404 2317642 2400501 2546006 2445093 2634935 2710017 2587045 2529602 2422643 2243412
14175B243412q3480p3905K11753J26653l0696m7774K73809Q4270j06784j03861
14165B493397K8917r6712J05636P1493m4761k65096P974L14590J12454k12050
14155B515842l32252Q0544J37564Q2687q6251j00084K8683J29914J55117J80945
14145B792709l30846r7064J44170j21602m2944r0800M5555k5721o8876j0413J0591
14134B204759o5819J22031J57966P5916j24224o9272r1780j05563K55891o376
14124B353529k40023J62734J39099l00558k72600K13999J26528j34965R1410Q4121
14114B223274J60131o8377k04414R5442O5376k72710k72613M19296J25459O6128
14104B336992k38382K24523r7444j03552o0503K90498J52831P3649K44062J25782
$$ plain form
14175 2243412 2159932 2086027 2297780 2424433 2393737 2345963 2619772 2704042 2597258 2493397
14165 2493397 2522314 2425602 2531238 2602731 2557970 2292874 2300848 2615438 2727892 2515842
14155 2515842 2183590 2264134 2401698 2484385 2398134 2298050 2326733 2456647 2611764 2792709
14145 2792709 2461863 2364799 2508969 2387367 2344423 2253623 2299178 2273457 2204581 2194168 2204759
14134 2204759 2138940 2260971 2418937 2494853 2370629 2301357 2209577 2104014 2359905 2353529
14124 2353529 2113506 2276240 2415339 2114781 1842181 2056180 2182708 2047743 2139153 2223274
14114 2223274 2383405 2315028 2110614 2206056 2271432 1998722 1726109 2145405 2270864 2336992
14104 2336992 2098610 2323133 2225689 2122137 2061634 2352132 2504963 2578612 2822674 2948456
14094B948456j84751j97377j8956j1809l55691j74099Q4019Q2597L3620L23525
14084B529534Q48J1091k58618m03076j87535K82051L49798q4504N0706J7713J00976
14073B408984J46268J33550p7534j414j57500j98979J4026K03846q4151j04670
14063B282426O5044L8067k8447R5382J39197K9034J18292k95831p6094Q0961Q9589
14052B537620j21690l06117j12802N9583N3956K06144M4453q5886J5878j34293
14042B156846N9812N3208j11811j77479J16567k77786J05879K45060N3769q7441
14032B136624K10661q9683k30112J05626k28110J20276N5661j41191O4153L28248
14022B332153J80852Q0878l59380j39481K69461N1882J23262J92214l52233k63129
$$ plain form
14094 2948456 2763705 2566328 2547372 2535563 2179872 2005773 2089792 2172389 2206009 2529534
14084 2529534 2530382 2541473 2282855 1879779 1692244 1974295 2324093 2239589 2290295 2308008 2408984
14073 2408984 2555252 2688802 2611268 2609854 2452354 2253375 2267401 2471247 2387096 2282426
14063 2282426 2347470 2385537 2357090 2452472 2591669 2620703 2738995 2443164 2367070 2448031 2537620
14052 2537620 2415930 2109813 1997011 2056594 2110550 2316694 2361147 2275261 2291139 2156846
14042 2156846 2216658 2269866 2158055 1980576 2097143 1819357 1925236 2170296 2224065 2136624
14032 2136624 2347285 2257602 2027490 2133116 1905006 2025282 2080943 1939752 2003905 2332153
14022 2332153 2513005 2593883 2234503 2095022 2364483 2416365 2539627 2731841 2379608 2116479
14012B116479n9157k0933J12941J10663p8458j24405m02829K65800N4304j74193
14002A800212j31063K09340J62648n5163O8886M9951o5645j44503O5307J30939
13992B090909K32447l39498k34435K69808L14121L80227j20947l54782j21476
13983B116374J25840K55836j26391j07522p1167Q8896l18801k31998K03452L76328
13973B310847r4162k24982k25194K9307O8525J3544J63794L7553K3227j16838
13963A985621k83294R0654R6780j45337J40589J65039k14509J50643J17747q6178
13953B017755J55565J44270n5493l05763j06848J8814L1178J17340j47900j75894
13943A693024j6566K1218N790K21185L07515m7016k09272l80133L9276j64762
$$ plain form
14012 2116479 2057322 2036389 2149330 2259993 2181535 2057130 1654301 1920101 1974405 1800212
14002 1800212 1669149 1878489 2041137 1985974 2054860 2104811 2039166 1894663 1959970 2090909
13992 2090909 2323356 1983858 1749423 2019231 2333352 2713579 2592632 2237850 2116374
13983 2116374 2242214 2498050 2371659 2264137 2192970 2281866 1963065 1731067 1934519 2310847
13973 2310847 2216685 1991703 1766509 1795816 1864341 1877885 2041679 2079232 2102459 1985621
13963 1985621 1702327 1792981 1889761 1744424 1885013 2050052 1835543 1986186 2103933 2017755
13953 2017755 2173320 2317590 2262097 1956334 1849486 1868300 1899478 2016818 1868918 1693024
13943 1693024 1676458 1697676 1703466 1924651 2232166 2185150 1975878 1595745 1635021 1470259
13933A470259o7804K45101j3622Q3254r5178l116J70539n690j29982n7631J1780
13922A607910j4731k8510p2407L76961L32737J68870J26249j16932j10379k53904
13912B015864j03530O7092j20184j96693j04273k55576r5507o5124L27119r4939
13902A374249Q7729J63622l0328j30239M1166J43948J37772P6082N3053k8665
13892A888389j12901j16754N3953L27796K01630n3481j87759k41085J63013j03339
13882A819462k90927K08033J98405j62499j82503j1609K40919N7667k36692K7350
13872A667606K90021L52392K9242l4315O7599j32360l67979P8079J75733n357
13862B120661k1220J42111M05862L71138K10989L92208N13402N27122P07311P72488
$$ plain form
13933 1470259 1402455 1647556 1633934 1717188 1622010 1618894 1789433 1783743 1653761 1596130 1607910
13922 1607910 1593179 1564669 1492262 1869223 2201960 2370830 2497079 2380147 2269768 2015864
13912 2015864 1912334 1979426 1859242 1662549 1558276 1302700 1207193 1142069 1469188 1374249
13902 1374249 1461978 1625600 1595272 1465033 1506199 1650147 1787919 1864001 1917054 1888389
13892 1888389 1775488 1658734 1712687 2040483 2242113 2188632 2000873 1759788 1922801 1819462
13882 1819462 1528535 1736568 1934973 1772474 1589971 1578362 1819281 1876948 1640256 1667606
13872 1667606 1957627 2310019 2339261 2304946 2372545 2240185 1872206 1950285 2126018 2120661
13862 2120661 2099441 2241552 2647414 3018552 3229541 3621749 4135151 4662273 5369584 6142072
13852F142072L41023R0725K00419J33540j64620l46313k06182j9794j94455l86759
13842E589656n56078m19776k17608k38665j54593j84159j83786p5431l7710j67579
13832C354271l23839k09970j00833k57584q7556O0040M3125J24021k34760j52430
13822B214485k34970r411R6655m7590j92484k7572O8865J61071O8681J38931O0672
13811B297333j64679k32197j08748J81234L47399P1182j25347j95439j6283j35371
13801A919084P1360J56646k8277l97894j06167j3988o3938K07990J60211O2898
13791A967925R5918m983k15382j40569K7395q3864q0760q396k8121j1966p8537
13780A438660L089J8039J7245n4640p9271J81888j06935L19004P3078O1796J9864
$$ plain form
13852 6142072 6483095 6573820 6774239 6907779 6743159 6396846 6190664 6170870 5976415 5589656
13842 5589656 5033578 4613802 4396194 4157529 4002936 3818777 3634991 3559560 3521850 3354271
13832 3354271 3030432 2820462 2719629 2462045 2374489 2434529 2477654 2601675 2366915 2214485
13822 2214485 1979515 1970104 2066759 2019169 1826685 1799113 1867978 2029049 2097730 2236661 2297333
13811 2297333 2132654 1900457 1791709 1972943 2320342 2391524 2266177 2070738 2054455 1919084
13801 1919084 1990444 2147090 2118813 1720919 1614752 1600764 1536826 1744816 1905027 1967925
13791 1967925 2063843 2058860 1843478 1702909 1730304 1646440 1565680 1557284 1529163 1517197 1438660
13780 1438660 1441749 1459788 1477033 1422393 1343122 1525010 1418075 1737079 1810157 1871953 1891817
13769A891817j48315k98453l7297J80724K31083Q3767k07838l28984n3198M0355
13759A353661j42314Q7974K56129m3176l1937M4515M5893l74613o2476L14433
13749A448089j27718j52964K40226K9753k8002j32000R0521K36271J7643j35275
13739A486544J438o7694K982J46030n2213m463K94962J60775l05030r6654j69685
13728A396992O4982o9337J26883L18624J40240j44742J909J49061k52354k44526
13718A487732J7816j06649l5151l48692K6565l0050J8158J18188J88619O6521
13708A403057J35752J51241M463k04959n03716k13878K38965L68580M0650n2437
13698A367718j67089m470P8487R7306m4992q9443j16478j34392o6963J92588k32973
$$ plain form
13769 1891817 1743502 1445049 1407752 1588476 1819559 1903326 1695488 1366504 1313306 1353661
13759 1353661 1211347 1299321 1555450 1512274 1480337 1524852 1570745 1196132 1133656 1448089
13749 1448089 1320371 1167407 1407633 1437386 1409384 1277384 1367905 1604176 1621819 1486544
13739 1486544 1487982 1420288 1423270 1569300 1517087 1512624 1807586 1968361 1663331 1566677 1396992
13728 1396992 1461974 1392637 1519520 1838144 1978384 1833642 1835551 1984612 1732258 1487732
13718 1487732 1505548 1398899 1363748 1015056 1041621 1011571 1029729 1147917 1336536 1403057
13708 1403057 1538809 1690050 1694513 1489554 985838 771960 1010925 1379505 1420155 1367718
13698 1367718 1200629 1196159 1274646 1371952 1326960 1237517 1121039 986647 919684 1112272 879299
13687H79299j16528J84773M9050L33382J84623j54863j77842l5413J14922J1288
13677A272691j16013O279n6537j8624q6903J50573J88233J0554r2099K4088j34478
13666A147764l56790J20414L24474K75940j46722K0745k15877j28279J87650L3213
13656A262532k5219q0846k52677j64063N5604N1519J81656l6304P0320K22881
13646A285403M50077K36855j68916l95448k25062j36012K1318J97753Q3578L707
13636A353253J7167L6193J2173j61992K4218N7817M8310l7318j90972J25686j20778
13625A163757l0408J81852J63866P9564p61705p9829J9645P2251K01904J13220
13615A124117L3397j31114j97898m1499k51712M3646Q0801J44835J71222M9735
$$ plain form
13687 879299 762771 947544 996594 1329976 1514599 1359736 1181894 1146481 1261403 1272691
13677 1272691 1156678 1162957 1106420 1087796 1000893 1151466 1339699 1350253 1258154 1282242 1147764
13666 1147764 790974 911388 1235862 1511802 1365080 1385825 1169948 1041669 1229319 1262532
13656 1262532 1237313 1156467 903790 739727 795331 846850 1028506 992202 1062522 1285403
13646 1285403 1735480 1972335 1803419 1407971 1182909 1046897 1068215 1265968 1349546 1353253
13636 1353253 1370420 1406613 1418786 1256794 1281012 1338829 1387139 1349821 1158849 1284535 1163757
13625 1163757 1133349 1315201 1479067 1558631 796926 717097 736742 808993 1010897 1124117
13615 1124117 1157514 1026400 828502 787003 535291 578937 659738 804573 975795 1025530
13605A025530m26311Q6209m3409L66970P6134k29717j47417k10866J56904L19115
13595I73142J10247k16055k33031L53946K34946R7630k11441l11523K6960r690
13585H15131j36097p4099J77286Q9472o4736R8412R6099j45956j16063J56004
13575H95453j20297n0467R9702K666N4946O725k49777m5457J74J60191k0239K99159
13563A032779J81475l76955k89200j32202q524J37618R2418P7021L953k5436J70306
13552H63253J12586k2453j03017j71965l7179K36122r9646r5440L8520R9573J24564
13541I44918k31235l30497R7072N5595r296J62860k62250n4822R913n1512j21634
13530B09112J52731J63835p2832K71436Q2589K6256o8230j09160j876j52365K17982
$$ plain form
13605 1025530 599219 685428 642019 1008989 1085123 855406 707989 497123 654027 973142
13595 973142 1083389 867334 634303 988249 1223195 1320825 1109384 797861 824821 815131
13585 815131 679034 604935 782221 871693 806957 905369 1001468 855512 739449 895453
13575 895453 775156 724689 824391 827057 882003 888728 638951 593494 593668 753859 733620 1032779
13563 1032779 1214254 837299 548099 415897 407373 544991 637409 714430 718383 692947 863253
13552 863253 975839 953386 850369 678404 641225 877347 777701 682261 720781 820354 944918
13541 944918 713683 383186 480258 535853 526557 689417 427167 372345 382258 330746 209112
13530 209112 361843 525678 452846 724282 806871 833127 764897 655737 653861 501496 719478
13519G19478J04230o5542J1256J6408l44510J15234K07109L69353K33767k82370
13509A084413m21741p0885j01084K18806j00930k60241Q8807L11970j17430p48
13499F30937K63305k23000P9303J76689O1971k9040m5753J19916M6426j84580
13489H96174m1578o1777p2009k6179K2926N5452N2867k07504l52589j89404J70658
13478B47037M82732K09042l035j79026j66846m8705Q6460R0794P3364j8331r9432
13467F74054J22143j5229l543N4132j66255l28802j51815J29134J32825P5348
13457E21992J74789j2449N7723r6996p1338r1277j0527M2609J60119k57333j26156
13446B91156K51203K61766j04772n1126k95183j80824j66324k43813L0015K42442
$$ plain form
13519 719478 823708 758166 769422 785830 441320 556554 763663 1133016 1366783 1084413
13509 1084413 662672 591787 490703 709509 608579 348338 437145 749115 631685 630937
13499 630937 894242 671242 750545 927234 989205 960165 914412 1034328 1080754 896174
13489 896174 854596 792819 720810 694631 717557 773009 825876 618372 265783 76379 247037
13478 247037 729769 938811 935776 756750 589904 541199 627659 718453 791817 773486 674054
13467 674054 796197 780968 777425 831557 665302 336500 184685 313819 446644 521992
13457 521992 696781 684332 742055 645059 573721 482444 471917 514526 674645 417312 291156
13446 291156 542359 804125 699353 648227 353044 172220 5896 -237917 -207902 34540
13436C4540K84975K19150k07336j56417J01880O3245p3533m1021j79220j14622
13426f8359J26979R7561J27382J36921O1791O3249L3556j47492j8580n1347l52045
13415I616Q1955N7501J15941Q0144m1001J69885K66350j27549l47272J51033J69114
13404E85717k732k55574j1950J29410K96796K809k08306n9862K6962j2306M2322
13393E33286K5697O488o3578j20015q4179L9691L5060J41673r4842r1178j72137
13382A55966J92260L65453j560r4945J59382R9051l15480k72858J37416M91048
13372I15733k54429l10013J24218q4108k76780j44311k68578j20720Q7054K43549
13362h8385r692j37598K89189J09793j1772M6545J70081j94625k80115m5430M10134
$$ plain form
13436 34540 319515 538665 331329 174912 276792 340037 266504 225483 46263 -68359
13426 -68359 58620 156181 283563 420484 482275 545524 579080 431588 413008 361661 9616
13415 9616 91571 149072 265013 345157 304156 474041 740391 612842 265570 416603 585717
13404 585717 582985 327411 315461 444871 741667 744476 536170 476308 503270 490964 533286
13393 533286 558983 565471 501893 381878 297699 337390 372450 514123 419281 328103 155966
13382 155966 348226 713679 712119 617174 776556 875607 560127 287269 424685 915733
13372 915733 661304 351291 475509 391401 114621 -29690 -298268 -418988 -331934 -88385
13362 -88385 -98077 -235675 53514 163307 151535 198080 368161 173536 -106579 -152009 258125
13351B58125L59580p0292l0903M5449m10552l90123n222L7351J38506j97899Q633
13340b57347q4354L8694K18635J7636k37103m9755K1480J3245J72578Q6545k003
13329f1749P8563n1175K32533J0209K242j59027j82381j7064k73249J90686L38234
13318A07822N0657J55166k18234k77070K17891j70527k89656k15359n8047J09704
13308e87653M8272O2498K08051J87208l77247r5733k65824j19764K22877K50760
13298d66555L11168K87378R2003l06651k61995L53006J29406k15379k34948o0661
13288c73228j5570j45574Q8402J06275j7788O9928J82886q4830l31566J92896
13278c28169L47347l619j34940K46659R5763j18403Q8327N2260j26805j55757
$$ plain form
13351 258125 617705 547413 516510 561959 151407 -238716 -243938 -206587 -68081 -265980 -257347
13340 -257347 -341701 -303007 -84372 -66736 -303839 -353594 -332114 -318869 -146291 -59746 -61749
13329 -61749 16814 -34361 198172 208381 210623 51596 -130785 -147849 -421098 -230412 107822
13318 107822 158479 313645 95411 -181659 36232 -134295 -423951 -639310 -697357 -587653
13308 -587653 -539381 -476883 -268832 -81624 -458871 -554604 -820428 -940192 -717315 -466555
13298 -466555 -155387 131991 223994 -82657 -344652 8354 137760 -77619 -312567 -373228
13288 -373228 -388798 -534372 -445970 -339695 -357483 -287555 -104669 -189499 -521065 -328169
13278 -328169 19178 15559 -119381 127278 223041 104638 192965 245225 118420 -37337
13268c7337j39255N4798K14182q8536j22477j77731k47634N199P6789J37913j11389
13257d35478N1068L3976o2705L6784K197j01647J84332R734L2545J83689J0481
13246e5024K384l4909m2498Q1354r1129J21871J90238P8278q3626j72882Q9120
13235H3177j76011m8603O2535k4486j93660N9804K1570p7826K77724k2567j33592
13224a71935k35866O1104K0458k30365J54665M1090j53321n32J28437L97980p1520
13213e9805l17246l35106J78767K97159j91788m2785J1796k02593n6877L47325
13203c71153L52452P1029j66023k24390N2513j90728j82027j780o7898P0342q0951
13192g38614n3730L20366L35912N6614l38146k70820J00404R4035j6845Q6923
$$ plain form
13268 -37337 -176592 -121794 92388 3852 -118625 -296356 -543990 -538791 -462002 -324089 -435478
13257 -435478 -384410 -350434 -413139 -376355 -374158 -475805 -291473 -281739 -249194 -65505 -55024
13246 -55024 -52640 -87549 -130047 -48693 -139822 -17951 172287 250565 166939 -5943 83177
13235 83177 -92834 -141437 -78902 -103388 -297048 -237244 -215674 -293500 -15776 -38343 -171935
13224 -171935 -407801 -346697 -326239 -556604 -401939 -360849 -514170 -514702 -386265 11715 -59805
13213 -59805 -377051 -712157 -533390 -236231 -428019 -470804 -459008 -661601 -718478 -371153
13203 -371153 -18701 52328 -113695 -338085 -285572 -476300 -658327 -660107 -728005 -657663 -738614
13192 -738614 -792344 -471978 -136066 -79452 -417598 -688418 -588014 -493979 -510824 -423901
13182d23901q1542l2478K7411p36J47520L810j72135J46439J07605k35318j4493
13171e27818J36790J50235l89113j56907l9340K30308k3011P4146k7521j7813
13161e90044J85790K27150N9909J9870k94023l14004Q1207L8434j54011o9889
13151h09611m7358L20618o4826l201L45288L74761j55786k03639R028k26897l4999
13140d96622K3825m17093M534J42506j59298j04984N2070k35597l021J14401m0187
13129a119466j715M2411J83687m7507j01408o4798j75428P3330K87258O0692J4666
13118h48278P5152J03016j41056r4453j33598J40918J38690K3566k56803l2867
13108a025713k80427k4753p5689K55877K05937J27579q2397q3599j40179R0129
$$ plain form
13182 -423901 -505443 -537921 -510510 -511246 -363726 -359916 -532051 -385612 -278007 -513325 -527818
13171 -527818 -391028 -240793 -629906 -786813 -826153 -595845 -618856 -544710 -572231 -590044
13161 -590044 -404254 -177104 -117195 -97325 -391348 -705352 -624145 -585711 -739722 -809611
13151 -809611 -856969 -536351 -601177 -604378 -259090 115671 -40115 -243754 -234726 -461623 -496622
13140 -496622 -472797 -889890 -885356 -742850 -902148 -1007132 -955062 -1190659 -1193680 -1079279 -1119466
13129 -1119466 -1121181 -1078770 -895083 -942590 -1043998 -1108796 -1284224 -1210894 -923636 -862944 -848278
13118 -848278 -773126 -670110 -811166 -905619 -1039217 -898299 -759609 -736043 -992846 -1025713
13108 -1025713 -1306140 -1330893 -1406582 -1150705 -944768 -817189 -899586 -983185 -1123364 -1033235
13098a033235k4939M4748k43287j49179M9218k5593K07719J43463J77301k38724
13088a092508o9344J15820J07767j60402M5854J55231L40913N341Q9698j67773
13078f29403k32691j81656K31624J29343j6571q9127k94783k90494J32951Q6076
13068a154731J95057r3644j68057o8703J36329J2204L13422J22816k14208Q8145
13058h31370j35246j21964k3357q6037j4145j02702J03931K62456m0679r1497
13048a080610P3280l53078M6638n5380j70669M4587m1487J07196J56802J6697
13038a256024J81893K28970k48229k24280J09572L8645r448K11477j92281k97916
13028a457621R7012L36741P3977j37096k95735j7333k76047N1595J34403k23584
$$ plain form
13098 -1033235 -1058174 -1013426 -1256713 -1405892 -1356674 -1382267 -1174548 -1031085 -853784 -1092508
13088 -1092508 -1161852 -1046032 -938265 -1098667 -1052813 -897582 -556669 -551328 -461630 -629403
13078 -629403 -862094 -1043750 -812126 -682783 -699354 -788481 -1083264 -1373758 -1240807 -1154731
13068 -1154731 -959674 -1053318 -1221375 -1290078 -1153749 -1141545 -828123 -705307 -919515 -831370
13058 -831370 -966616 -1088580 -1111937 -1197974 -1212119 -1314821 -1210890 -948434 -989113 -1080610
13048 -1080610 -1007330 -1360408 -1313770 -1369150 -1539819 -1495232 -1536719 -1429523 -1272721 -1256024
13038 -1256024 -1074131 -845161 -1093390 -1317670 -1208098 -1169453 -1178901 -967424 -1159705 -1457621
13028 -1457621 -1360609 -1023868 -949891 -1086987 -1382722 -1400055 -1676102 -1624507 -1490104 -1713688
13018a713688N9307l1049K3580p1507j15817M21752K11849K1152j02176K8003
13008a268594q2980j20004M8354l990K00056p4058j48268J01648n6144o7417P6415
12997a394982o295l5672k00934N6542K02234K62646j46448k52257l79750j04933
12987a999849J18898K86983J02134r2884L980K37636L59226l6138m23259k59544
12977a702817j3865L32847K5879j8070K2402K3521k02621M4891K08779j11479
12967a390533j94082p6654R6257N0538k28941J83232K08773Q411p597l30558j21365
12956a802519J13789K53482k01148Q7534j03571k55426O582O4635o5669K15217
12946a687094K42494K28341k19343r4072O7655k65212K9240Q9190J10317P0110
$$ plain form
13018 -1713688 -1654381 -1685430 -1661850 -1733357 -1849174 -1427422 -1215573 -1194421 -1296597 -1268594
13008 -1268594 -1351574 -1471578 -1423224 -1427214 -1227158 -1301216 -1449484 -1347836 -1403980 -1471397 -1394982
12997 -1394982 -1401277 -1436949 -1637883 -1581341 -1379107 -1116461 -1262909 -1515166 -1894916 -1999849
12987 -1999849 -1880951 -1593968 -1491834 -1584718 -1580738 -1343102 -983876 -1020014 -1443273 -1702817
12977 -1702817 -1716682 -1383835 -1357956 -1376026 -1353624 -1330103 -1532724 -1487833 -1279054 -1390533
12967 -1390533 -1584615 -1661269 -1565012 -1514474 -1743415 -1560183 -1351410 -1342999 -1350596 -1681154 -1802519
12956 -1802519 -1688730 -1435248 -1636396 -1548862 -1652433 -1907859 -1901277 -1836642 -1902311 -1687094
12946 -1687094 -1444600 -1216259 -1435602 -1529674 -1462019 -1727231 -1697991 -1608801 -1498484 -1428374
12936a428374k31464l585M6009j24896j12410O321q8697J9864M8425k73206J70908
12925a971105K9639K56909k0382r5069O1559j28999r0472o5825j56646J57942
12915b022449J70399k363l13919j16039R7681J14350k28989j43469q3521q6247
12905b614566j2431J79101N13768J53507k4902j06071o2650J22321r047j12215
12895a973185J2910k40888j19620J5821J16090P0401r7255n8901j00633r577n9255
12884b444092N1682L35599j40971k84577J1393M1553J29594J38585N4471J06382
12874b000381J46986p5606L3288q0902j59170k28421p4378K5913L097K43748J72292
12863a993534Q5970j47927j67967O5784l4551J27126j04388j18479P2063j73968
$$ plain form
12936 -1428374 -1659838 -1663423 -1617414 -1742310 -1854720 -1848399 -1937096 -1917232 -1868807 -2142013 -1971105
12925 -1971105 -1941466 -1684557 -1704939 -1800008 -1738449 -1867448 -1957920 -2023745 -2180391 -2022449
12915 -2022449 -1852050 -1854413 -2168332 -2284371 -2186690 -2072340 -2301329 -2444798 -2528319 -2614566
12905 -2614566 -2626997 -2447896 -1934128 -1780621 -1805523 -1911594 -1974244 -1851923 -1860970 -1973185
12895 -1973185 -1960275 -2201163 -2320783 -2304962 -2188872 -2118471 -2215726 -2274627 -2375260 -2384837 -2444092
12884 -2444092 -2392410 -2056811 -2197782 -2482359 -2470966 -2429413 -2299819 -2161234 -2106763 -2000381
12874 -2000381 -1853395 -1929001 -1895713 -1976615 -2135785 -2364206 -2438584 -2412671 -2409574 -2165826 -1993534
12863 -1993534 -1907564 -2055491 -2223458 -2157674 -2192225 -2065099 -2169487 -2287966 -2215903 -2389871
12853b389871m5640P7992Q5194p6608j31316J67824J07097J63396m392j06521
12843b152845L9337J45656Q4929R2509K26776o1671k20403p9536K25584L42149
12833a357515K00034J24300K71275K67693K62841J63413j80415J41307K33729
12824A26662K08561m2052K2248j21201j85636l62917l84900m2138j49898j29429
12814a060700j82858j00775j34416j50679M4904J41637R2129l00038r0796k4399
12804a765991j16339K21809j62184k2235o0212o7953N0628L3602R3788k63546
12794b058633k10069L8355J50990J31846M5479k81365r9977Q2441J60206q2442
12784b123169j82940k26796l12156k87467K65752p2326j43052J26180K32776K48415
$$ plain form
12853 -2389871 -2435511 -2357519 -2272325 -2348933 -2480249 -2312425 -2205328 -2041932 -2046324 -2152845
12843 -2152845 -2113508 -1967852 -1882923 -1790414 -1563638 -1625309 -1845712 -1925248 -1699664 -1357515
12833 -1357515 -1157481 -1033181 -761906 -494213 -231372 -67959 -248374 -107067 126662
12824 126662 335223 293171 315419 194218 8582 -354335 -739235 -781373 -931271 -1060700
12814 -1060700 -1243558 -1344333 -1478749 -1629428 -1584524 -1442887 -1350758 -1650796 -1741592 -1765991
12804 -1765991 -1882330 -1660521 -1822705 -1844940 -1905152 -1973105 -1922477 -1888875 -1795087 -2058633
12794 -2058633 -2268702 -2230347 -2079357 -1947511 -1902032 -2183397 -2283374 -2200933 -2040727 -2123169
12784 -2123169 -2306109 -2532905 -2845061 -3132528 -2866776 -2939102 -3082154 -2955974 -2723198 -2474783
12774b474783K97010K05380L3839m0732k69398R2076k13711k18613J27612j68910
12764b630230J39211J15403r4941m3479j41343k43543r4521J64278K18297q5988
12754b696856k07460m5585K3842K7046J37025o8562p4833k0224Q2997l1409R5070
12743b778949j33402J0482M4109J13536L935j41867J68974R862l6444j52010k33435
12732c125209j5381N4199J4942M4990q9929J62252k4791J58940O2178j64210k51738
12721c173757N6046K19534k10221m35154j34754R0448N2875J14393L22612L10058
12711b787920N5884J16562O9712l08939l03298K34314j03142k13071m1024k95605
12701c576527n7536L8544J35135K01792J39954m1139k26169k06013Q0438J04821
$$ plain form
12774 -2474783 -2177773 -1972393 -1938554 -1979286 -2248684 -2156608 -2370319 -2588932 -2461320 -2630230
12764 -2630230 -2491019 -2375616 -2470557 -2514036 -2655379 -2898922 -2993443 -2829165 -2610868 -2696856
12754 -2696856 -2904316 -2949901 -2926059 -2899013 -2761988 -2830550 -2905383 -2925607 -2842610 -2874019 -2778949
12743 -2778949 -2912351 -2901869 -2857760 -2744224 -2740289 -2882156 -2713182 -2703320 -2739764 -2891774 -3125209
12732 -3125209 -3140590 -3086391 -3071449 -3026459 -3116388 -2954136 -2978927 -2819987 -2757809 -2922019 -3173757
12721 -3173757 -3117711 -2898177 -3108398 -3543552 -3678306 -3587858 -3534983 -3420590 -3097978 -2787920
12711 -2787920 -2732036 -2615474 -2545762 -2854701 -3157999 -2923685 -3026827 -3239898 -3280922 -3576527
12701 -3576527 -3634063 -3595519 -3460384 -3258592 -3118638 -3159777 -3385946 -3591959 -3511521 -3406700
12691c406700J44694Q247j97738j35720j56761n8683k11361J10594K0344J39821
12681c743263K68542P3646l4615j15684j80550J32520j23789J04330J46840J63124
12671c308899j59654n0608K8670J65558J13424j64744q4431o706J58898Q5588
12661c222904j26679l29728J72226J80588l17012l08954J10423P9076O7660j9061
12651c714365j63860j38631K16911L74786K1561k46304K2835o157j24346j57866
12641c915436j42498j69498l19399j6756n3736J7351P326M1610j8280q4046m4520
12630d697882N3683J92889J59130k20383j35928K587M3496M190K54259J67876
12620d176083r6304j94705k23134j66380n5445O7735J3350m2504J84162P2806
$$ plain form
12691 -3406700 -3262006 -3253759 -3451497 -3587217 -3743978 -3802661 -4014022 -3903428 -3883084 -3743263
12681 -3743263 -3474721 -3401075 -3435690 -3551374 -3731924 -3599404 -3723193 -3618863 -3472023 -3308899
12671 -3308899 -3468553 -3519161 -3490491 -3324933 -3211509 -3376253 -3460684 -3467390 -3308492 -3222904
12661 -3222904 -3349583 -3679311 -3507085 -3326497 -3643509 -3952463 -3842040 -3762964 -3695304 -3714365
12651 -3714365 -3878225 -4016856 -3799945 -3425159 -3403598 -3649902 -3627067 -3633224 -3757570 -3915436
12641 -3915436 -4057934 -4227432 -4546831 -4563587 -4617323 -4599972 -4592646 -4551036 -4569316 -4653362 -4697882
12630 -4697882 -4644199 -4451310 -4292180 -4512563 -4648491 -4645904 -4602408 -4598218 -4343959 -4176083
12620 -4176083 -4272387 -4467092 -4690226 -4856606 -4912051 -4844316 -4830966 -4873470 -4689308 -4616502
12610d616502j64466j25780k2188J63240k0276J10870l812J48457r6591J1101
12600d615947q465O7743j32785j67519l50219j72523r476M6530k3470J56328J87957
12589e021846k28625K8881L0120J40013K20037k6723m8233j54980j76986J15179
12579e123163j20262J05727n2434k18518K2747M7022J71313R3635j96991l69980
12569e640904m1312k0974j42325J25681j30932j04794Q4497M5699j3211n0600
12559e889175j34839j79127k76075J64154P2060j34459o6385n6178J9388j60169
12549f640805n082L84720L62579k02888r5210K46522P2328j05540q0724k32077
12539f296177K09706P4150J49498k7639J07747J35238K60110j23436m91293j19400
$$ plain form
12610 -4616502 -4780968 -4906748 -4928936 -4765696 -4785972 -4675102 -4678914 -4530457 -4627048 -4615947
12600 -4615947 -4624412 -4556669 -4689454 -4856973 -5207192 -5379715 -5389191 -5342661 -5366131 -5209803 -5021846
12589 -5021846 -5250471 -5221590 -5191470 -5051457 -4831420 -4858143 -4906376 -5061356 -5238342 -5123163
12579 -5123163 -5243425 -5137698 -5190132 -5408650 -5385903 -5338881 -5167568 -5073933 -5270924 -5640904
12569 -5640904 -5682216 -5703190 -5845515 -5719834 -5850766 -5955560 -5871063 -5825364 -5838575 -5889175
12559 -5889175 -6024014 -6203141 -6479216 -6315062 -6243002 -6377461 -6443846 -6500024 -6480636 -6640805
12549 -6640805 -6645887 -6261167 -5898588 -6101476 -6196686 -5950164 -5877836 -5983376 -6064100 -6296177
12539 -6296177 -6086471 -6012321 -5862823 -5890462 -5782715 -5647477 -5387367 -5510803 -6002096 -6121496
12529f121496J258m4175J303p5031k21601k28281L4511q1367k4190J98033J06647
12518f454389m13189j45958R7575L8880k71310r7644k68717j84273k1702J7527
12508g703200O5560n331o0150k12335N6938l1245n5781j9109O3058j38658j08912
12497h149165j85635j52815m9943J54791j77732k77683q7428O9631J47884j70637
12487h878732l32047k36862J13403j4135J00707J49092L5134k13308o1368m60628
12477i798744n283O0026k41415O6122m958r2072j33141K0588j64714j51301J13244
12466a0331648m5040m7617j26952p9446k14313j87812O2951r8237j14618j53386
12456a1336118k3414m32701m61048j95691k47336k05344L4048O7242k05585j19114
$$ plain form
12529 -6121496 -6120238 -6164413 -6163110 -6238141 -6459742 -6688023 -6653512 -6734879 -6759069 -6561036 -6454389
12518 -6454389 -6867578 -7013536 -6915961 -6877081 -7148391 -7246035 -7514752 -7699025 -7720727 -7703200
12508 -7703200 -7637640 -7642971 -7703121 -7915456 -7858518 -7889763 -7945544 -7964653 -7901595 -8040253 -8149165
12497 -8149165 -8334800 -8487615 -8537558 -8382767 -8560499 -8838182 -8925610 -8855979 -8708095 -8878732
12487 -8878732 -9210779 -9447641 -9334238 -9348373 -9247666 -9098574 -9063440 -9276748 -9338116 -9798744
12477 -9798744 -9804027 -9744001 -9985416 -9919294 -9924252 -10016324 -10149465 -10128877 -10293591 -10444892 -10331648
12466 -10331648 -10376688 -10424305 -10551257 -10630703 -10845016 -11032828 -10969877 -11068114 -11182732 -11336118
12456 -11336118 -11359532 -11792233 -12253281 -12448972 -12696308 -12901652 -12867604 -12800362 -13005947 -13125061
12446a3125061r194o285K36834j1305k09046n100J90359J82303L51953K64104
12436a2140438L02195K30147N93541J036002J047564J194031J360154J980911
12428d395893K392160K609266L529860M227999N099776O162739P424798R157696
12420C6208401J2464255J6368573K1705179K7629794L4776339M1396691M7726004
12413B38275236N2075542N3340894N1518280M5616028L5712158K3712703R607522
12406E09858363m223420j7021626k7894785l5181172l9228583l9831340l8305599
12399C08171838l4441673k9870520k5310226k0515208j6451456j3481164j1464379
12392A56637212j0095038r212823q107743p420091o753528n868447n126158n172952
$$ plain form
12446 -13125061 -13134255 -13140540 -12903706 -12915011 -13124057 -13129157 -12938798 -12756495 -12404542 -12140438
12436 -12140438 -11838243 -11608096 -11014555 -9978553 -8930989 -7736958 -6376804 -4395893
12428 -4395893 -2003733 605533 4135393 8363392 13463168 19625907 27050705 36208401
12420 36208401 48672656 65041229 86746408 114376202 149152541 190549232 238275236
12413 238275236 290350778 343691672 395209952 440825980 476538138 500250841 509858363
12406 509858363 505634943 488613317 460718532 425537360 386308777 346477437 308171838
12399 308171838 273730165 243859645 218549419 198034211 181582755 168101591 156637212
12392 156637212 146542174 137329351 129221608 121801517 115047989 109179542 104053384 98880432
12384I8880432m910149l887427l683726l736974l336714l024994k802975k478334
12376G1019139k347771k374136k130634j793468j635926j609305j708028j813815
12368E5606056j468956j251028j468449j223404j194042j185319j251775j232100
12360D5330983r36887q02636r25614q62693r50699j132184q90826r63665p99082
12351C7066697p66483o73927p79883q06881k54655m19929p25744r36445q12022
12342C0890728l36392m76549n21896p50010q71808o38845n07353n42415l20669
12333B5924791l33870k71390o27020o11765m55418o42544o46137k66236k83135
12324B1787276l86604k52896n32481k85328j17234J05269J50812l96016q19421
$$ plain form
12384 98880432 93970283 90082856 86399130 82662156 79325442 76300448 73497473 71019139
12376 71019139 68671368 66297232 64166598 62373130 60737204 59127899 57419871 55606056
12368 55606056 54137100 52886072 51417623 50194219 49000177 47814858 46563083 45330983
12360 45330983 44394096 43591460 42665846 41803153 40852454 39720270 38829444 37865779 37066697
12351 37066697 36300214 35626287 34846404 34039523 33784868 33364939 32639195 31702750 30890728
12342 30890728 30554336 30077787 29555891 28805881 27934073 27295228 26787875 26245460 25924791
12333 25924791 25590921 25319531 24692511 24080746 23625328 22982784 22336647 22070411 21787276
12324 21787276 21400672 21147776 20615295 20329967 20212733 20318002 20468814 20072798 19253377
12315A9253377m40427n2916k70640n52337m15932r7290j02916k92356m25008l67918
12305A6235637k92670m04031k11200O8528m7707k74817l83049m10707n00418m42608
12295A3336958j64475K9975p9463n9638k4169l52863k28008k69303k79567n26331
12285A1383116O003j50639n75835k24818j18230k3677j27908j27391k36233o2050
12275I742338o351j49493k06238m6844k47010j49141J653j65040j49004J82956
12265H807826l00915m41783k61757q1737j83549m2071M3339p3564J38114Q5179
12255G689082q0660l0200k54446k60482r3779M7840o6622k76025k11356J13686
12245F577038J88968k14644k3202J80402k4513l04725j34762j65710j54158o0109
$$ plain form
12315 19253377 18812950 18760034 18489394 17937057 17521125 17423835 17320919 17028563 16603555 16235637
12305 16235637 15942967 15538936 15327736 15396264 15348557 15073740 14690691 14279984 13779566 13336958
12295 13336958 13172483 13202458 13122995 13063357 13039188 12686325 12458317 12189014 11909447 11383116
12285 11383116 11389119 11238480 10662645 10437827 10319597 10295920 10168012 10040621 9804388 9742338
12275 9742338 9735987 9586494 9380256 9333412 9086402 8937261 8938914 8773874 8624870 8807826
12265 8807826 8506911 8065128 7803371 7721634 7538085 7496014 7539353 7465789 7603903 7689082
12255 7689082 7608422 7578222 7323776 7063294 6969515 7017355 6950733 6674708 6463352 6577038
12245 6577038 6766006 6551362 6528160 6708562 6684049 6379324 6244562 6078852 5924694 5864585
12235E864585L3916L9894q6676j96298r0806r1469j98019N9321q6814k03324k42814
12224D801496j28791J71840p8863k5393l0144j96099j55156J1643J1794k81834
12214D100493j69940r5286J43647J91468p5708k11398k4978J43702O7327J75349
12204D244676K75926k71958k67870l85J370q6206j39606l46047J72874k438j78902
12193C401434l14280q7894J31787J91786L54196j47132l83223k37697J44810j68941
12183B884846j60162n6833k49489J25303M0996Q0748J35860j7083N3479l287l77371
12172B457007l11183J44346O8658l8649m4889j3388Q7323q228M8107L1846j45527
12161B275423J02147R4138j58373j61926J90879O961L1958j05822q7764M338j76791
$$ plain form
12235 5864585 5898501 5938395 5851719 5655421 5564615 5473146 5275127 5334448 5247634 5044310 4801496
12224 4801496 4672705 4844545 4765682 4740289 4710145 4514046 4358890 4370533 4382327 4100493
12214 4100493 3930553 3835267 3978914 4170382 4094674 3883276 3858298 4002000 4069327 4244676
12204 4244676 4520602 4248644 3980774 3980389 3981759 3895553 3755947 3409900 3582774 3580336 3401434
12193 3401434 3087154 2999260 3131047 3322833 3677029 3529897 3146674 2908977 3053787 2884846
12183 2884846 2724684 2667851 2418362 2543665 2584661 2665409 2801269 2784186 2837665 2834378 2457007
12172 2457007 2145824 2290170 2358828 2320179 2275290 2261902 2349225 2340997 2389104 2420950 2275423
12161 2275423 2377570 2471708 2313335 2151409 2342288 2349249 2381207 2275385 2187621 2191959 2015168
12150B015168o3626J69050J01071j8848K94297k316j66790j0659O7254R1101j09049
12139B366653k46862q487k05131r2259J89145J42855n56146l67545R3366K83682
12129A599271p8101O8061o9996m547J86820k24183l35747k68718Q9058M7542l1368
12118I78092L9276J02137P0439l2077J40461k97003j71551P418L03308p8346k91378
12107G70776J15J8339M3994K02973k03922l4455L84534k45983k12425r7191J97736
12096H24491m1081P8138j80426m0051J69700O5947l52890k15230R2166J69591
12086E70355R6695k50099k14904k44216N8874J55112j67234p1867o8058N5417
12076g9925J1441N27057K20852M0794k03367j43539n5698n6467m4174j71939r2637
$$ plain form
12150 2015168 1951542 2120592 2221663 2202815 2497112 2494796 2328006 2317347 2384601 2475702 2366653
12139 2366653 2119791 2111304 1906173 1813914 2003059 2145914 1589768 1222223 1315589 1599271
12129 1599271 1521170 1589231 1519235 1514688 1701508 1477325 1141578 872860 961918 1009460 978092
12118 978092 1017368 1119505 1189944 1157867 1298328 1001325 829774 837192 1140500 1062154 770776
12107 770776 770891 789230 833224 1036197 832275 797820 1182354 936371 723946 626755 824491
12096 824491 783410 861548 681122 641071 810771 876718 523828 308598 400764 570355
12086 570355 667050 416951 202047 -42169 16705 171817 4583 -67284 -135342 -79925
12076 -79925 -68484 458573 679425 720219 516852 373313 317615 261148 216974 45035 -47602
12065d7602J64485J59428j10289k7426n2941q8932J86241O3446R6857Q8416j04619
12054C27064l55467J16656R4395k87127J81080K17127k47694k16514k00558j41169
12044e12207N8944L11727L12957p7731p0828j55963k9276j95358j42073l9979
12034e39787K72537J67604Q5999N1914j45233K5852L04200J15335j54933j03884
12024G9604j88561J4175J89090Q3305J65308n3379j95607K9268J47260o2473l4562
12013A73428p9425n1271n6644k8482q0806J38262j45211o2077l49756k25047L28117
12002d38912K66712j49141l9359M629O6583J24738J5499K10854O9331r1222J8835
11991E8547L68096M29416L51158M15923L3662l34945m852J20616K44620J23196
$$ plain form
12065 -47602 116883 276311 166022 138596 85655 -3277 182964 246410 343267 431683 327064
12054 327064 -28403 88253 182648 -104479 76601 293728 46034 -170480 -371038 -512207
12044 -512207 -453263 -141536 171421 93690 22862 -133101 -162377 -357735 -499808 -539787
12034 -539787 -267250 -99646 -13647 38267 -106966 -81114 223086 338421 183488 79604
12024 79604 -108957 -94782 94308 177613 342921 289542 93935 123203 270463 207990 173428
12013 173428 94003 42732 -13912 -42394 -123200 15062 -130149 -192226 -541982 -767029 -438912
12002 -438912 -172200 -321341 -360700 -356071 -289488 -164750 -149251 61603 130934 39712 58547
11991 58547 426643 856059 1207217 1623140 1656802 1321857 1317005 1437621 1682241 1805437
11981A805437N1002M0976q2399k10714j81984k64558l46322k18920r9724o6304
11971D26490j81516k13384k25708j59427j25772P865K94036j21237M1736k1492
11961b78409p0588Q6256j26566j1631k66587R633k9118K03522K8616k43204J04332
11950e93744J82653J28644j88313n0438l08483l72839J82748L00021j00855O1384
11940g59222R2194k03477k90654J58788K03633J74491Q0937j61224J84995J51239
11930c68300p1055k48414j66575p186J01747k50749l1350q8154L6855k835L6493
11919a059523M29678K933l13633l13025J04977K44413q8561r1021L23866J70946
11909e88950j35628k85649j82560l30240J7235K34628J88873N385J33799J72165
$$ plain form
11981 1805437 1856439 1897415 1815016 1604302 1422318 1157760 811438 592518 492794 426490
11971 426490 244974 31590 -194118 -353545 -479317 -471452 -177416 -298653 -256917 -278409
11961 -278409 -348997 -262741 -389307 -400938 -667525 -657892 -687010 -483488 -454872 -698076 -593744
11950 -593744 -411091 -282447 -470760 -521198 -829681 -1202520 -1019772 -719751 -820606 -759222
11940 -759222 -667028 -870505 -1161159 -1002371 -798738 -624247 -543310 -704534 -519539 -368300
11930 -368300 -439355 -687769 -854344 -861530 -759783 -1010532 -1041882 -1130036 -1093181 -1096016 -1059523
11919 -1059523 -629845 -626912 -940545 -1253570 -1148593 -904180 -992741 -1083762 -759896 -588950
11909 -588950 -724578 -1010227 -1192787 -1523027 -1505792 -1271164 -1082291 -1076906 -943107 -770942
11899g70942k09724r6255j51030k95886j2552J66778r963J57605R5489m1316j76524
11888a344320K532l0174j54116K6671j0991N4941k40319l7069O1385j880l6936
11877a710276o0857q363q8939J23726L97373L10931n0951J26541l43708k53593
11867a558116j47560Q1313q4099j81611r246M59585n3277o1431L1911k42852k00549
11856a965932J17245N1711j21205m8619J62841r5870K08253M9383m6633j4165
11846a702991M9489L1074m8832j9675j95161k2495J3406q5113N4793J40581k17111
11835b002035j57755l8822k22369K84572Q256j02093k91761M3409J30760J20008
11825b227830J79627J54930j52885j67291J17830K10258p3966P3216j00795j97795
$$ plain form
11899 -770942 -980666 -1076921 -1227951 -1523837 -1536389 -1369611 -1379574 -1221969 -1126480 -1167796 -1344320
11888 -1344320 -1341788 -1371962 -1526078 -1499407 -1510398 -1455457 -1695776 -1732845 -1671460 -1673340 -1710276
11877 -1710276 -1771133 -1779496 -1868435 -1744709 -1347336 -1036405 -1087356 -960815 -1304523 -1558116
11867 -1558116 -1705676 -1624363 -1708462 -1890073 -1899319 -1439734 -1493011 -1554442 -1522531 -1765383 -1965932
11856 -1965932 -1848687 -1796976 -1918181 -1966800 -1803959 -1899829 -1691576 -1642193 -1688826 -1702991
11846 -1702991 -1653502 -1622428 -1671260 -1690935 -1886096 -1908591 -1895185 -1980298 -1925505 -1784924 -2002035
11835 -2002035 -2159790 -2198612 -2420981 -2136409 -2128153 -2230246 -2522007 -2478598 -2347838 -2227830
11825 -2227830 -2048203 -1893273 -2046158 -2213449 -2095619 -1885361 -1959327 -1886111 -1986906 -2184701
11815b184701k88952L1369R7361M1560Q565J54953j1083j45994P8593K20087j33638
11804b131880K79778j6309n8147L3032J08619o7565R4144K5845J11671k30417
11794a851229j94728L31697q4646l52707L379J02372j99095M1015K33064j18682
11784b089560j67894j26213K56662J86333J56452j50495r3021k06103n8652L3814
11774b258677j70265n0384J63797J33113J13794n5687l7782K4007j18512Q0912
11764b175684M8024m8161n2586n2095n6746j69804j83413J24200L98467J37245
11754b030553k9039k06975J47891K3891k01667k09786j45428L3086J11489p2057
11744b579148R0476k56263o1057M5396J05938q0822J35610K45461q7282k05262
$$ plain form
11815 -2184701 -2473653 -2442284 -2344923 -2303363 -2294798 -2139845 -2150928 -2296922 -2218329 -1998242 -2131880
11804 -2131880 -1852102 -1868411 -1926558 -1893526 -1784907 -1852472 -1758328 -1732483 -1620812 -1851229
11794 -1851229 -2045957 -1714260 -1798906 -2151613 -2148234 -2045862 -2244957 -2203942 -1970878 -2089560
11784 -2089560 -2257454 -2383667 -2127005 -1940672 -1784220 -1934715 -2027736 -2233839 -2292491 -2258677
11774 -2258677 -2428942 -2479326 -2315529 -2182416 -2068622 -2124309 -2162091 -2138084 -2256596 -2175684
11764 -2175684 -2127660 -2175821 -2228407 -2280502 -2337248 -2507052 -2690465 -2566265 -2167798 -2030553
11754 -2030553 -2059592 -2266567 -2118676 -2094785 -2296452 -2506238 -2651666 -2618580 -2507091 -2579148
11744 -2579148 -2488672 -2744935 -2805992 -2760596 -2654658 -2735480 -2599870 -2354409 -2441691 -2646953
11734b646953m5497m8519q7988j04245k31487k53215J02094M88692K69908N1881
11724b505329j80930p3730R8203p6591j80900o2766l2757K20937J75971n5758
11714b673650O4208q4554k49015J09329N9058M1812J5621J71618K74897j34192
11704b404868k01835j74181l21411K65220m5074K40215J9395O1813n9719j48850
11694b769295j28782P9630k1184k40694k58622l3322K21695K74530o471J09870
11684b772645j668n6148k44637k50578j64550J42987K27004M60314m0635j08340
11674b808896O2573L9291k06566j73345m0541J45431P3767j96899N4355q6093
11664c136923r9855J94768K07959l8240j83490M1173j07830j00595L26144P5212
$$ plain form
11734 -2646953 -2692450 -2740969 -2828957 -2933202 -3164689 -3417904 -3315810 -2827118 -2557210 -2505329
11724 -2505329 -2686259 -2759989 -2661786 -2738377 -2919277 -2982043 -3014800 -2793863 -2617892 -2673650
11714 -2673650 -2609442 -2693996 -2943011 -2833682 -2774624 -2732812 -2717191 -2545573 -2270676 -2404868
11704 -2404868 -2606703 -2780884 -3102295 -2837075 -2882149 -2641934 -2622539 -2560726 -2620445 -2769295
11694 -2769295 -2898077 -2818447 -2839631 -3080325 -3338947 -3372269 -3150574 -2876044 -2882515 -2772645
11684 -2772645 -2774313 -2830461 -3075098 -3325676 -3490226 -3347239 -3120235 -2659921 -2700556 -2808896
11674 -2808896 -2746323 -2707032 -2913598 -3086943 -3127484 -2982053 -2908286 -3105185 -3050830 -3136923
11664 -3136923 -3236778 -3042010 -2834051 -2872291 -3055781 -3014608 -3122438 -3223033 -2896889 -2821677
11654b821677j26314j47264j18744j28359q7925k5594j90527k1224m831j15048
11644c787507p1774M39348L52022j12318k74914k79904L4091K34686J77310J31797
11634c157163L20679N36361R88174J735491K276642J759865J411090Q39650K46632
11625F957421m65613j464373j924274j748396j108575m07918m98370k93460o8329
11616a021887l79532n19398L4834M23431j1060Q480n3231m82589k11189k66492
11606b478633j74293j31401j9192J42903J17144j36425j3887L98490K01524k09192
11596b302962J33376Q2335J29967L16621M24140J051070J921438K251126K011964
11587F019075J206973Q22918M36499n39237j797329k207090j799015j129719n16991
$$ plain form
11654 -2821677 -2947991 -3095255 -3213999 -3342358 -3430283 -3455877 -3646404 -3667628 -3672459 -3787507
11644 -3787507 -3859281 -3419933 -3067911 -3180229 -3455143 -3735047 -3700956 -3466270 -3288960 -3157163
11634 -3157163 -2836484 -2300123 -1311949 423542 2700184 4460049 5871139 6710789 6957421
11625 6957421 6491808 5027435 3103161 1354765 246190 -161728 -660098 -953558 -1021887
11616 -1021887 -1401419 -1920817 -1885983 -1462552 -1473612 -1465132 -1518363 -2000952 -2212141 -2478633
11606 -2478633 -2652926 -2784327 -2803519 -2660616 -2543472 -2679897 -2693784 -2295294 -2093770 -2302962
11596 -2302962 -2169586 -2087251 -1957284 -1640663 -1216523 -165453 1755985 4007111 6019075
11587 6019075 7226048 8048966 8485465 7946228 6148899 3941809 2142794 1013075 496084
11578D96084k64193l81392j71847k41673l74939k36755l40888l51178N8247J66710
11568a641824l61641K741j06631p6480J0152P2708J13749J9654j01191j41003
11558b209766j88827j93628j70122l842j66797j2139O3150R0481J09683J09074
11548b572733k25596l6184K1446J38154O3784K4438M2596q6826j99987L02000
11538b528908N8060j69900j15960K6542k65773k46049l4035L0661k23801J12420
11528c356743K45601K98245r356q2248j19719o92l4644J43778J45007k6813k23887
11517c021471o8050m1401p0658k85801l88249j17521J48653J13124n98l3555J85385
11506c580142l8652q4789J50746J07773l8918J01113L8070j50736p5075l1951
$$ plain form
11578 496084 231891 -149501 -321348 -563021 -937960 -1174715 -1515603 -1866781 -1808534 -1641824
11568 -1641824 -2003465 -2000724 -2107355 -2183835 -2173683 -2100975 -1987226 -1967572 -2068763 -2209766
11558 -2209766 -2398593 -2592221 -2762343 -2766185 -2932982 -2945121 -2881971 -2791490 -2681807 -2572733
11548 -2572733 -2798329 -2834513 -2813067 -2674913 -2611129 -2586691 -2544095 -2630921 -2830908 -2528908
11538 -2528908 -2470848 -2640748 -2756708 -2730166 -2995939 -3241988 -3276023 -3245362 -3469163 -3356743
11528 -3356743 -3111142 -2812897 -2822253 -2904501 -3024220 -3024912 -3059556 -2915778 -2770771 -2797584 -3021471
11517 -3021471 -3089521 -3130922 -3201580 -3487381 -3875630 -3993151 -3844498 -3731374 -3731972 -3765527 -3580142
11506 -3580142 -3618794 -3703583 -3552837 -3445064 -3483982 -3382869 -3344799 -3495535 -3570610 -3602561
11496c602561K20521j64607k68240p8575K03025R1778k9897p1241o0827J70360
11486c590264J4158J82307m04226Q9122K46144p201k34238j67091O720L42932
11476c521637j5070O537l40812l29562m1449R1166O2061J30963k32617l00492
11466d490912k05375L02412M85897K92337j8290r5407J19327P9497j17481N6995
11456c591000p2563q4044k9944L3449o7647j26145k77105k50119M00535R9722
11446c964861k80238k88473j51478J48661J53904P2494r4208R93k4817r4732k31478
11435d754233J95535J90519J92588o436j27487O0663N5121J08770j44773l85120
11425d614853k93332J14015L64818K19820R1506j20077Q2761R7753j93831l2554
$$ plain form
11496 -3602561 -3382040 -3546647 -3814887 -3893462 -3690437 -3598659 -3628556 -3699797 -3760624 -3590264
11486 -3590264 -3576106 -3393799 -3798025 -3708903 -3462759 -3469960 -3704198 -3871289 -3864569 -3521637
11476 -3521637 -3536707 -3530170 -3870982 -4200544 -4241993 -4150827 -4088766 -3957803 -4190420 -4490912
11466 -4490912 -4696287 -4393875 -3907978 -3615641 -3633931 -3729338 -3610011 -3530514 -3647995 -3591000
11456 -3591000 -3663563 -3747607 -3777551 -3744102 -3811749 -3937894 -4214999 -4465118 -4064583 -3964861
11446 -3964861 -4245099 -4533572 -4685050 -4536389 -4382485 -4309991 -4404199 -4403206 -4428023 -4522755 -4754233
11435 -4754233 -4558698 -4368179 -4175591 -4182027 -4309514 -4248851 -4193730 -4084960 -4229733 -4614853
11425 -4614853 -4908185 -4794170 -4429352 -4209532 -4118026 -4238103 -4155342 -4057589 -4251420 -4283974
11415d283974n70j53287r4643o7582j99536j256K18479K55962j01003k05377j81691
11404d814478r2212K88177J445L0009L25677r332k03437m5227J79711l7634l79985
11393d757286m87363K08590K37321K7509j4203l3266P579M40443J67873O2219
11383d140584l7690k59841O2660J88657J39921k45562k09257L6864j95174M7110
11373d612896O7690M7974J60504k13773M3695J15322j51833k49058L2873K0330
11363d739172J48588j13867j26366K23200j70927l22077K4056O1849J77246j65388
11353e002858R6535M4473n497k23081k13127L6619J77676R7449l0155M0695J99139
11342d782132K26639j71804j02903J56892k50877j22768k46599m2218J35826K99379
$$ plain form
11415 -4283974 -4284544 -4437831 -4532474 -4600056 -4799592 -4800848 -4582369 -4326407 -4427410 -4632787 -4814478
11404 -4814478 -4906690 -4618513 -4617068 -4587059 -4261382 -4270714 -4474151 -4519378 -4339667 -4377301 -4757286
11393 -4757286 -5244649 -5036059 -4798738 -4771229 -4785432 -4818698 -4811119 -4370676 -4202803 -4140584
11383 -4140584 -4178274 -4438115 -4375455 -4186798 -4046877 -4292439 -4501696 -4464832 -4660006 -4612896
11373 -4612896 -4545206 -4497232 -4336728 -4550501 -4506806 -4391484 -4543317 -4792375 -4759502 -4739172
11363 -4739172 -4590584 -4704451 -4830817 -4607617 -4778544 -5100621 -5076565 -5014716 -4837470 -5002858
11353 -5002858 -4906323 -4861850 -4867347 -5090428 -5303555 -5266936 -5089260 -4991811 -5021966 -4981271 -4782132
11342 -4782132 -4555493 -4727297 -4830200 -4673308 -4924185 -5046953 -5293552 -5335770 -5199944 -4900565
11332d900565K56250j18203k15716P2727J59697k98752k91417J26257M00379j0996
11322d820339o9416o0840j86673P261j32411J73940L03108k59730l45477n6231
11312e446808K76993K14249p3029J52686J1561L0258j33178k3155O5267k61352
11302e186508n6562J61177k7409j40310k2718K2816K8477R9135k82993o0005K57968
11291e206932J69160k17955k9514J3152j00279j41408J25446O2672p2812j27291
11281e525761j58129K06531r3098k27788l57462K74845N48060K35684m59634j15215
11271e671967K03o8724K3570j1755P476J47509k03669j70433j7104Q9219J59350
11260e716325o9851L33789P2222K5315J01102j75570k16047o0372r7417j6804
$$ plain form
11332 -4900565 -4644315 -4762518 -4978234 -4905507 -4745810 -5044562 -5335979 -5209722 -4809343 -4820339
11322 -4820339 -4889755 -4950595 -5137268 -5130007 -5262418 -5088478 -4785370 -5045100 -5390577 -5446808
11312 -5446808 -5169815 -4955566 -5028595 -4875909 -4864348 -4834090 -4967268 -4990423 -4925156 -5186508
11302 -5186508 -5243070 -5081893 -5109302 -5249612 -5272330 -5249514 -5221037 -5121902 -5404895 -5464900 -5206932
11291 -5206932 -5037772 -5255727 -5285241 -5272089 -5372368 -5513776 -5388330 -5325658 -5398470 -5525761
11281 -5525761 -5683890 -5477359 -5570457 -5798245 -6155707 -5880862 -5332802 -5097118 -5556752 -5671967
11271 -5671967 -5671764 -5740488 -5716918 -5728673 -5721197 -5573688 -5777357 -5947790 -5964894 -5875675 -5716325
11260 -5716325 -5786176 -5452387 -5380165 -5354850 -5253748 -5429318 -5645365 -5705737 -5803154 -5819958
11250e819958j29779J29458Q2894l2774J31786k7359L8001J16534L10526P5157
11240e125514k74780j86741p6057J94039J70826l16227k46622n8566Q8387k2969
11230e854224j64086j10698o0083J03043O0517O5171k721N6712j78734j29720
11220f214823m7642J5153j43161m5330R9797k8770K06912l9880m2380o3688j13673
11209f417485j35260L926J53799J41075J95591Q1376k2932j73295J89251j4424
11199e998378q6501p9376j90153j00906R527O2246K01005n4364k3916l36963O3742
11188f534037J4176j77170Q3454n9980K63166J68099j60710J3933L0981j61626
11178f519714l4547O9236K0322R7115p4483p4744n7514J33601J95168j61592K9520
$$ plain form
11250 -5819958 -5949737 -5820279 -5737385 -5770159 -5638373 -5665732 -5627731 -5511197 -5200671 -5125514
11240 -5125514 -5400294 -5587035 -5663092 -5469053 -5298227 -5614454 -5861076 -5919642 -5831255 -5854224
11230 -5854224 -6018310 -6129008 -6189091 -6086048 -6025531 -5960360 -5963081 -5906369 -6085103 -6214823
11220 -6214823 -6262465 -6247312 -6390473 -6435803 -6336006 -6364776 -6157864 -6197744 -6240124 -6303812 -6417485
11209 -6417485 -6552745 -6548819 -6395020 -6253945 -6058354 -5976978 -5999910 -6173205 -5983954 -5998378
11199 -5998378 -6084879 -6164255 -6354408 -6455314 -6445787 -6383541 -6182536 -6236900 -6260816 -6597779 -6534037
11188 -6534037 -6519861 -6697031 -6613577 -6673557 -6410391 -6242292 -6403002 -6389069 -6358088 -6519714
11178 -6519714 -6554261 -6485025 -6464703 -6367588 -6442071 -6516815 -6574329 -6440728 -6245560 -6407152 -6377632
11167f377632m7117J09880j29042j42070j97568L327l266k17709j01084O0130
11157g042151M0514R9837K6567p46q8217j04462n3901J14967j2781m7634l14893
11146g382900Q2859L96220J57752J88016Q0659j4218k01365m00159M1927J68317
11136f882892J4114J43300j15950N9486M5925R0750j13680k68512q8586l29602
11126g445647j71893q9075L9024R0799J79457K50287M2817k7940K318j11578k3800
11115g265231o6078n6164j25111j27180K15955J11356q6542l1450k19927L23361
11105g327011N0606J0935m3j94206l15156L1772L05775j00939j4099K57613K2524
11094g272229Q7027j64220j69057J05043j2587j05487P4891m3922l8081p2489
$$ plain form
11167 -6377632 -6424749 -6314869 -6443911 -6585981 -6783549 -6780222 -6783488 -7001197 -7102281 -7042151
11157 -7042151 -7001637 -6901800 -6875233 -6875979 -6964196 -7068658 -7122559 -7007592 -7020373 -7068007 -7382900
11146 -7382900 -7300041 -6903821 -6746069 -6558053 -6477394 -6491612 -6692977 -7093136 -7051209 -6882892
11136 -6882892 -6868778 -6725478 -6841428 -6781942 -6736017 -6645267 -6758947 -7027459 -7116045 -7445647
11126 -7445647 -7617540 -7706615 -7667591 -7576792 -7397335 -7147048 -7104231 -7132171 -7129853 -7241431 -7265231
11115 -7265231 -7331309 -7387473 -7512584 -7639764 -7423809 -7312453 -7398995 -7430445 -7650372 -7327011
11105 -7327011 -7276405 -7265470 -7265513 -7459719 -7774875 -7743103 -7437328 -7538267 -7552366 -7294753 -7272229
11094 -7272229 -7185202 -7349422 -7518479 -7413436 -7426023 -7531510 -7456619 -7500541 -7538622 -7611111
11084g611111k569m5452j31002j35737K5647J38658K24942l35098l63733N1921
11074h183534n2305m8138k30696J1455L47839k00287J75567J55742j36686j85833
11064h346876L7531M4441r1657k54466J59758k424j42598P699j31616N1938m7526
11053h715796J05833P1208J97478K32061n7569k78357k9408J62413J33155l66834
11043h545816k83921l3018J03321J94914L01981J38265K8800j02843j10913k26214
11033h535444Q6619J37859n8545J54037K27244J2984J26365M00389J88965P3855
11023g185672L863k07568q9895j4180P6884M3789J96396k8849N76353K32416j67738
11012f564201l57755R3736k9449j06152l7724O0205k21702j5709j03314K3055
$$ plain form
11084 -7611111 -7613680 -7659132 -7790134 -7925871 -7900224 -7761566 -7536624 -7871722 -8235455 -8183534
11074 -8183534 -8235839 -8283977 -8514673 -8503218 -8155379 -8355666 -8180099 -8024357 -8161043 -8346876
11064 -8346876 -8309345 -8264904 -8356561 -8611027 -8451269 -8453693 -8596291 -8588592 -8720208 -8668270 -8715796
11053 -8715796 -8609963 -8538755 -8341277 -8109216 -8166785 -8445142 -8474550 -8312137 -8178982 -8545816
11043 -8545816 -8829737 -8862755 -8759434 -8564520 -8262539 -8124274 -8095474 -8198317 -8309230 -8535444
11033 -8535444 -8448825 -8310966 -8369511 -8215474 -7988230 -7975246 -7848881 -7448492 -7259527 -7185672
11023 -7185672 -7181809 -7389377 -7479272 -7493452 -7416568 -7372779 -7176383 -7205232 -6628879 -6396463 -6564201
11012 -6564201 -6921956 -6828220 -6857669 -6963821 -7001545 -6941340 -7163042 -7178751 -7282065 -7259010
11002g259010Q3523K6573J7641k31505l37974k00854J74847r797o9781N7054j36845
10991g886128j03745J26835K10238k4471m68056Q7597o5480k75438K3174J84142
10981h191332J809k59383m3894j35911J97944K34950j27164j26749j80093k62440
10971h892263j37035P0897m6275R673j10832N111j91590l8957j61697M8562R7986
10960i346420L32651m9010l1440k6185q5371O0576j80917j25551m3111M0881R9976
10949i353921J08729K25307j17292j12001J02549O9670k9973p6306J22065J21992
10939h939181j0969J27082J88040j8667m2196j72028P7611j27542K2132K54351
10929h641367p0742l06465k43970o1804K4819l23369k14611O4339N876l39254
$$ plain form
11002 -7259010 -7175487 -7148914 -7131273 -7362778 -7700752 -7901606 -7726759 -7736556 -7806337 -7749283 -7886128
10991 -7886128 -7989873 -7863038 -7652800 -7677271 -8145327 -8057730 -8123210 -8398648 -8375474 -8191332
10981 -8191332 -8189523 -8448906 -8492800 -8628711 -8430767 -8195817 -8322981 -8449730 -8629823 -8892263
10971 -8892263 -9029298 -8958401 -9004676 -8995003 -9105835 -9100724 -9292314 -9331271 -9492968 -9444406 -9346420
10960 -9346420 -9013769 -9062779 -9094219 -9120404 -9205775 -9145199 -9326116 -9451667 -9494778 -9453897 -9353921
10949 -9353921 -9245192 -9019885 -9137177 -9249178 -9146629 -9076959 -9106932 -9183238 -9061173 -8939181
10939 -8939181 -8950150 -8823068 -8635028 -8653695 -8695891 -8867919 -8790308 -8917850 -8895718 -8641367
10929 -8641367 -8712109 -9018574 -9262544 -9324348 -9299529 -9622898 -9837509 -9773170 -9767294 -10106548
10919a0106548K7068N44748O7490m3097k27063k35231k27804m5108k65312k65403
10909a0776260R1838q9117J76435O7465R5703j26948k20222L38925j15586j22362
10899a0680129J58048K41147M7083k84376k53599K0287l5036j09159j53291j08280
10889a1157305k18579O9432L8512O8788p3664k64281N7084L7748k146p5168j83548
10878a1703127j25803o5595n2920P5863Q5104l173l30362k14192N1702J52583
10868a2129920J4085j74645P8658k4224l6873j33410N3022k30712M3132l17761
10858a2858648j15547J15158P3356L6660R6988j76174m06128L1470J17038R0656
10848a2995171J32016l3184l5402r2072j20395P3874N8245r5899j31552o7817
$$ plain form
10919 -10106548 -10079480 -9534732 -9467242 -9510339 -9737402 -9972633 -10200437 -10245545 -10510857 -10776260
10909 -10776260 -10684422 -10773539 -10597104 -10529639 -10433936 -10560884 -10781106 -10442181 -10557767 -10680129
10899 -10680129 -10522081 -10280934 -10233851 -10518227 -10771826 -10751539 -10786575 -10895734 -11049025 -11157305
10889 -11157305 -11375884 -11306452 -11267940 -11199152 -11272816 -11537097 -11480013 -11442265 -11444411 -11519579 -11703127
10878 -11703127 -11828930 -11894525 -11947445 -11871582 -11786478 -11789651 -12120013 -12334205 -12282503 -12129920
10868 -12129920 -12115835 -12290480 -12211822 -12236046 -12272919 -12406329 -12353307 -12584019 -12540887 -12858648
10858 -12858648 -12974195 -12859037 -12785681 -12749021 -12652033 -12828207 -13234335 -13202865 -13085827 -12995171
10848 -12995171 -12863155 -12896339 -12931741 -13023813 -13144208 -13070334 -13012089 -13107988 -13239540 -13307357
10838a3307357k8929m2473l33687J46894j4594K98890j23112l45569j24293k51695
10828a4125925q4238K7365J90018M7496J21924m8600L2247k20473k46812l51582
10818a4658580k53980n6853O630J50759K93822R9471l19081l17591K7871l6108
10808a5063640J47108k5012j48312O4499k09698j51472J13500n9899m0255J37129
10798a5236052n9186k58006R08J30696j22935m05450j89651q700O1517P8422J8668
10787a5989769N3057M7900p4345K4005r9008l01699q7186K5262k24554j28652
10777a6754989k04908k51195j05767j47637m5172J87252J35365Q0409k31582k07089
10767a7545313j24658J97479j7794m55025j97703J9165L0547K4094M6395O2132
$$ plain form
10838 -13307357 -13336286 -13378759 -13712446 -13565552 -13580146 -13281256 -13404368 -13749937 -13874230 -14125925
10828 -14125925 -14210163 -14182798 -13992780 -13945284 -13823360 -13871960 -13839713 -14060186 -14306998 -14658580
10818 -14658580 -14912560 -14969413 -14962783 -14812024 -14518202 -14418731 -14737812 -15055403 -15027532 -15063640
10808 -15063640 -14916532 -14941544 -15089856 -15025357 -15235055 -15386527 -15273027 -15332926 -15373181 -15236052
10798 -15236052 -15295238 -15553244 -15552336 -15421640 -15544575 -15950025 -16139676 -16148376 -16086859 -16008437 -15989769
10787 -15989769 -15936712 -15888812 -15963157 -15939152 -16038160 -16339859 -16427045 -16401783 -16626337 -16754989
10777 -16754989 -16959897 -17211092 -17316859 -17464496 -17509668 -17322416 -17187051 -17106642 -17338224 -17545313
10767 -17545313 -17669971 -17472492 -17490286 -17945311 -18143014 -18123849 -18093302 -18069208 -18022813 -17960681
10757a7960681k87527m35801k97354J98261J25678j31543p4257o4354p1090j82084
10747a9180752j77026r6843o5700j95120k34956j47204K01332J10602k42180l96336
10737b0424183m6519j24622J7928K82028l01540l18822q6046q4329n2137M7476
10727b1090766J939j75359M6802k4783j1615n7924k98077k39346j97309j17065
10717b2163503N5694L84032j94932n64969k78515l84766k63995k17718N0192K20963
10707b3357517j06785n2092m7116k23759k26661k93081k44951k9370j00199r0437
10697b4771968K7627r3921j86221j31628k75997n41655k33800l75205j30607j39495
10687b6852870q9405j38502m2399j32037r5438j82250m25660l15701q7744j89302
$$ plain form
10757 -17960681 -18248208 -18684009 -18981363 -18783102 -18657424 -18788967 -18863224 -18927578 -18998668 -19180752
10747 -19180752 -19357778 -19454621 -19520321 -19715441 -19950397 -20097601 -19896269 -19785667 -20027847 -20424183
10737 -20424183 -20470702 -20595324 -20577396 -20295368 -20596908 -20915730 -21001776 -21086105 -21138242 -21090766
10727 -21090766 -21088827 -21264186 -21217384 -21242167 -21253782 -21311706 -21609783 -21849129 -22046438 -22163503
10717 -22163503 -22107809 -21723777 -21918709 -22483678 -22762193 -23146959 -23410954 -23628672 -23578480 -23357517
10707 -23357517 -23464302 -23516394 -23563510 -23787269 -24013930 -24307011 -24551962 -24581332 -24681531 -24771968
10697 -24771968 -24744341 -24838262 -25024483 -25156111 -25432108 -25973763 -26207563 -26582768 -26713375 -26852870
10687 -26852870 -26942275 -27080777 -27123176 -27255213 -27350651 -27532901 -27958561 -28274262 -28362006 -28551308
10677b8551308k64231m38425m18181k28723l64010P9406j83432k76903m27706
10668c1073513j62184l19430l50828k64908l23617j29457j6026m22308l21226
10659c3383497m60410l20903l60053m95645p68848j30604p5514m73429l57293
10650c6826196j07905k99713m07731J6461J67500J49386k9971l06408k46224j60960
10640c8051761j14459k56793p67570j272720q68154p99494p44024n31653p27623
10631d4134251n35366j48684j20056k2698M67257M24246J10629J89092j7147n58833
10621d4345811p53550q00716o66205q4759O33932J631866L133681N023825P442811
10612b8784926J0197634J3800448J6279102J6752597J5488286J3052101R441769
$$ plain form
10677 -28551308 -28815539 -29253964 -29672145 -29900868 -30264878 -30185472 -30368904 -30645807 -31073513
10668 -31073513 -31235697 -31555127 -31905955 -32170863 -32494480 -32623937 -32639963 -33062271 -33383497
10659 -33383497 -33843907 -34164810 -34524863 -35020508 -35789356 -35919960 -35995474 -36468903 -36826196
10650 -36826196 -36934101 -37233814 -37641545 -37625084 -37457584 -37308198 -37338169 -37644577 -37890801 -38051761
10640 -38051761 -38166220 -38423013 -39190583 -40463303 -41331457 -42130951 -42874975 -43406628 -44134251
10631 -44134251 -44669617 -44818301 -44938357 -44961055 -44493798 -44069552 -43958923 -43769831 -43786978 -44345811
10621 -44345811 -45099361 -45900077 -46566282 -46651041 -46017109 -44385243 -41251562 -36227737 -28784926
10612 -28784926 -18587292 -4786844 11492258 28244855 43733141 56785242 66227011
10605F6227011M970493J261175l15568J382855P643301J6412183K5563461L2094663
10597A55239574L3209211K9938645K3776457J4450610K464846q107767j2680856
10590B38290720q589422K767631J7847160L2434668M2032373M2257658L5714658
10583D02755446K4957051J0145759q223964k4801370l2320238k8309187j7349625
10576C26853872l460804R328472J6721302J7512857J2856778N464390m419967
10569C80856900j6433139k6602084l0009780k5773313j7524180q542033l31342
10562B55641029N580001Q373901Q553543O717520L403291j978183p104232j0846692
10554B68340178j1990568j1780322r899360q454738o764106m229746k929974k258471
$$ plain form
10605 66227011 71197504 72458679 72143111 73525966 81169267 97581450 123144911 155239574
10597 155239574 188448785 218387430 242163887 256614497 259079343 250971576 238290720
10590 238290720 229701298 232468929 250316089 282750757 324783130 367040788 402755446
10583 402755446 427712497 437858256 429634292 404832922 372512684 344203497 326853872
10576 326853872 323393068 332721540 349442842 366955699 379812477 385276867 380856900
10569 380856900 364423761 337821677 307811897 282038584 264514404 255972371 255641029
10562 255641029 261221030 269594931 278148474 284865994 288269285 286291102 279186870 268340178
10554 268340178 256349610 244569288 234669928 226215190 219451084 215221338 212291364 210032893
10546B10032893j775084j861304k111892k581437k517895k076063j540386r02890
10538A94665942o13334N5260Q61863K126885L604405M462471N142770M939409
10530B15245671M555734M042970L196785K367806J923375K431422L760723N199927
10522B42724413O036309P126205R565240J2025652J5079408J8013809K0051345
10515C30622381K0223556J7739706J3192508P824099J644621n064964r722505
10508C76459402j1699024j0690092q636300p072852n651265m581995l581372k660460
10500C21886042k700189k975623l572802m169645n003516n955211o985021p359072
10492B83164963o935956o348383n420520m623063l755110k646108k066664j354514
$$ plain form
10546 210032893 208257809 206396505 204284613 201703176 199185281 197109218 195568832 194665942
10538 194665942 194052608 194107868 194969731 197096616 200701021 205163492 210306262 215245671
10530 215245671 219801405 223844375 227041160 229408966 231332341 233763763 237524486 242724413
10522 242724413 248760722 255886927 265452167 277477819 292557227 310571036 330622381
10515 330622381 350845937 368585643 381778151 389602250 391246871 386181907 376459402
10508 376459402 364760378 354070286 345433986 338361134 332709869 328127874 324546502 321886042
10500 321886042 319185853 316210230 312637428 308467783 303464267 297509056 290524035 283164963
10492 283164963 276229007 269880624 264460104 259837041 256081931 253435823 251369159 250014645
10484B50014645o28963n95886k72260M34723Q25997N17408J16217p9646j50777
10475B50181458O99335J281537J775517J472960K52735k236072n643068q661183
10467B39123219j1652212j3010643j3503579j2499974j0954643r167372p417053
10460A60917743o175428n123323m262527l695435l125800k095658k102096j565059
10452A32772417j652190j675912k015565k329289k236146j970683j908003k032136
10444A16952493k329969k251137k121540k225451k341232k811657k333412k005656
10436I8532439k262491j853818j856145k017494j822184j565787j487933j656539
10428H4010048j795408j723970j401829j290893j253798j212279j325640j406969
$$ plain form
10484 250014645 249385682 248789796 248517536 248952259 249778256 250295664 250411881 250332235 250181458
10475 250181458 250880793 252162330 253937847 255410807 255663542 253427470 247784402 239123219
10467 239123219 227471007 214460364 200956785 188456811 177502168 168334796 160917743
10460 160917743 154742315 149618992 145356465 141661030 138535230 136439572 134337476 132772417
10452 132772417 131120227 129444315 127428750 125099461 122863315 120892632 118984629 116952493
10444 116952493 114622524 112371387 110249847 108024396 105683164 102871507 100538095 98532439
10436 98532439 96269948 94416130 92559985 90542491 88720307 87154520 85666587 84010048
10428 84010048 82214640 80490670 79088841 77797948 76544150 75331871 74006231 72599262
10420G2599262j358918r60946j025541j103533j258889j275260j212598j039090
10412F3364487m75425m99122q27196q06209p01527o80209p78891p04742j032005
10403E6859161n85885n05998q31209q04481o94377n18319j012832r18880l50448
10394E0636732j91790p26972m43741j26174m03517l21774l34677n81111r37026
10385D6569950q43323o70026m86248o68770o79054m91669m39010o18270n99760
10376D1073820l70571o36126m48105n23458j91666n4702k60969n36537j71668
10367C7880018j19189k94176o09787n09837m94964j74698k97574m23713n23374
10358C4432706l61487m57405n92301n74892m72807p21212l56305J0781l85320
$$ plain form
10420 72599262 71240344 70279398 69253857 68150324 66891435 65616175 64403577 63364487
10412 63364487 62889062 62389940 61562744 60756535 60055008 59374799 58595908 57891166 56859161
10403 56859161 56273276 55767278 54936069 54131588 53437211 52918892 51906060 50987180 50636732
10394 50636732 50444942 49717970 49274229 49148055 48744538 48422764 48088087 47506976 46569950
10385 46569950 45726627 45056601 44570353 43901583 43222529 42730860 42291850 41673580 41073820
10376 41073820 40703249 40067123 39619018 39095560 38903894 38849192 38588223 38051686 37880018
10367 37880018 37760829 37466653 36856866 36347029 35852065 35677367 35379793 34956080 34432706
10358 34432706 34071219 33613814 33021513 32446621 31973814 31252602 30896297 30907078 30521758
10349C0521758m27553r3132n2585k99082n26077m27365k18306j83743k38675k30450
10339B7824790k51471j42201m99455k20471n18922l97933j66852k85808k7274
10330B5314403j25600r6920l56531n3137m65502m14303k4038K28171k83348l29354
10320B3393841j20701k03755k21645l82148l94390r4746J16066j28886l30409
10311B1633227k02813r7748k3033n9886k08046m77952j50748k64152j96010j60927
10301A9791912k34480j1724k2942K7932j5099n49718r3024k61611J95422J28962
10291A8955630m51901l30363J67404k5244k90208k07561j59866p4961l3412k38344
10281A7311174j49741N6672k73842j79709M2004j34580j91191k40539m6410M0437
$$ plain form
10349 30521758 30094205 30001073 29948488 29649406 29123329 28695964 28477658 28293915 28055240 27824790
10339 27824790 27573319 27431118 26931663 26711192 26192270 25794337 25627485 25341677 25314403
10330 25314403 25188803 25091883 24735352 24682215 24216713 23802410 23778372 24006543 23723195 23393841
10320 23393841 23273140 23069385 22847740 22465592 22071202 21976456 22092522 21963636 21633227
10311 21633227 21430414 21332666 21309633 21249747 21041701 20563749 20413001 20148849 19952839 19791912
10301 19791912 19557432 19545708 19522766 19550698 19535599 18985881 18892857 18631246 18826668 18955630
10291 18955630 18503729 18173366 18340770 18315526 18025318 17817757 17657891 17582930 17549518 17311174
10281 17311174 17161433 17218105 16944263 16764554 16806558 16671978 16480787 16240248 16193838 16234275
10271A6234275q2028o3905p5215r60l23364l62193k9585J13892j8730J2229k06616
10260A5197800N6357o2278j44352k60641j31431j94083k45294m3535K7081k48041
10250A3951583J48689J73992p2526l86819q1090j70039j77134k21320j09958j9802
10240A3035576K00199o4550k6187k24606l77911p7663j59503m4529o579j9669
10230A2234578K23493K12146j19591l23658k67368o0496k28865k1119K60538J46881
10220A2056539j75810k84596j74337K28053m5927l22096k97613k05336J49230
10211A0928107n4430q308k71817J3945L09743j29439r9599l98637k57952j30184
10201I901429J4944J20920J35090m070j86746j80442Q9319O9637L78835L8791
$$ plain form
10271 16234275 16152247 16088342 16013127 16012167 15688803 15326610 15297025 15410917 15392187 15404416 15197800
10260 15197800 15254157 15191879 15047527 14786886 14655455 14461372 14216078 14172543 14199624 13951583
10250 13951583 14100272 14274264 14201738 13814919 13733829 13563790 13386656 13165336 13055378 13035576
10240 13035576 13235775 13171225 13145038 12920432 12542521 12464858 12305355 12260826 12254247 12234578
10230 12234578 12458071 12670217 12550626 12226968 11959600 11899104 11670239 11649120 11909658 12056539
10220 12056539 11880729 11596133 11421796 11649849 11603922 11281826 10984213 10778877 10928107
10211 10928107 10873677 10865369 10593552 10607497 10917240 10787801 10688202 10289565 10031613 9901429
10201 9901429 9916373 10037293 10172383 10168313 9981567 9801125 9890444 9960081 10338916 10377707
10191A0377707k14026j10697Q8647K36341k67804l14027k21501j39875J40437
10182I575202K07625k24029q2422k9751J22053k59128k7668P9910K37603N6204
10172I655599N8381K5562k41081J02085p8731k44532J45285J02593q7747l66010
10162I071404J13827P5667J33074J85508J21075K62937O1764j86752l11262j13800
10152I413442J44450J60523J89081K32735M00978J94047n052k47889m12665j32449
10142I937201j47072O4461j366j18834L5139l81512k61229J26637K54765K53649
10132I761839j98271q1602p8501m24380J3123J52934r6849j67472k473P3959J20196
10121I072503J72200O7640k11792l56244p9698J19397j8409j60135p7919k00966
$$ plain form
10191 10377707 10163681 10052984 10141631 10377972 10110168 9796141 9574640 9434765 9575202
10182 9575202 9782827 9558798 9476376 9446625 9568678 9309550 9281882 9361792 9599395 9655599
10172 9655599 9713980 9739542 9498461 9600546 9521815 9277283 9422568 9525161 9437414 9071404
10162 9071404 9185231 9260898 9393972 9579480 9700555 9963492 10025256 9838504 9527242 9413442
10152 9413442 9557892 9718415 9907496 10140231 10541209 10735256 10730204 10482315 10069650 9937201
10142 9937201 9790129 9854590 9853224 9734390 9769529 9388017 9126788 9253425 9508190 9761839
10132 9761839 9563568 9481966 9403465 8979085 8992208 9145142 9048293 8880821 8878348 8952307 9072503
10121 9072503 9244703 9312343 9100551 8744307 8664609 8784006 8765597 8605462 8527543 8326577
10111H326577j23454m5135j34426j42576K3463O984j07255k66631k06673M0120
10101G370994L4122j197Q4330p0447J00028J41925m6778J44061K3420k44448l8298
10090G497712K5150l6637j00755p1445J6478M9770R6082N9888J64656j09642J83899
10079G775156M98455p257k2316j23433k78365l93841j31142R8848p2071k7019
10069G317015P4594k08372j63194J98966P5443K8089o0821j80861j92922k04761
10059F683176j3374j95591K9732K24032J94927o2049j88124k97516j47710J45499
10049F373002J82679M407k42577p9681J9230K12035K17612j30096r7471N4462
10039F513602K36176n6795m68163m63326Q2639K04413o8810m0328j66470k04933
$$ plain form
10111 8326577 8203123 8157988 8023562 7880986 7904449 7911433 7804178 7537547 7330874 7370994
10101 7370994 7405116 7403919 7488249 7417802 7517830 7659755 7612977 7757038 7780458 7536010 7497712
10090 7497712 7522862 7486225 7385470 7314025 7330503 7380273 7476355 7536243 7700899 7591257 7775156
10079 7775156 8273611 8266354 8244038 8120605 7842240 7448399 7317257 7416105 7344034 7317015
10069 7317015 7391609 7183237 7020043 7219009 7294452 7322541 7261720 7080859 6887937 6683176
10059 6683176 6669802 6474211 6503943 6727975 6922902 6860853 6672729 6375213 6227503 6373002
10049 6373002 6555681 6560088 6317511 6237830 6257060 6469095 6686707 6556611 6459140 6513602
10039 6513602 6749778 6692983 6224820 5761494 5844133 6048546 5979736 5939408 5772938 5568005
10029E568005J70143K36534k80893k72619j38894m3825N6123m4039j32260o2413
10019E055862m6312J33737j60352l61840j18445N22353p3113N1257L4585o5737
10009D971995k59015l79852R880J03182J95933k46980Q5543L8419m9567p8533
9999D391005l558k03341l5195r3043k15999m0477L3343l4060O987N878k3405q3233
9987C704902l0647j1351r1164J92370O6962J68623L0985j74312J56291j36605
9977C876054O5386n9782k81830P808M5292J18187o7049j61193k89718j64098J62383
9966C251440J91546j04480k10024j9652j02006L6843J18226J93853J43946k13232
9956C286460J8569k10651j15219J64967N3872m05249R2993j17863K06155K56375
$$ plain form
10029 5568005 5738148 5974682 5693789 5421170 5282276 5238451 5294574 5250535 5118275 5055862
10019 5055862 5009550 5143287 4982935 4621095 4502650 5025003 4951890 5003147 5037732 4971995
10009 4971995 4712980 4333128 4343008 4446190 4642123 4395143 4480686 4519105 4469538 4391005
9999 4391005 4387447 4184106 4148911 4055868 3839869 3799392 3832735 3798675 3805662 3811540 3788135 3704902
9987 3704902 3674255 3662904 3571740 3764110 3831072 3999695 4030680 3856368 4012659 3876054
9977 3876054 3941440 3881658 3599828 3607636 3652928 3771115 3704066 3542873 3253155 3089057 3251440
9966 3251440 3442986 3338506 3128482 3108830 3006824 3043667 3161893 3355746 3499692 3286460
9956 3286460 3305029 3094378 2979159 3144126 3197998 2792749 2885742 2767879 2974034 3230409
9946C230409P6960K3338k01219l32960n6316N482j0138j12254P7811p3828M3881
9935B671166K3198o9138j22443K2964K0666j2573J57536o6846K7869J39497o9453
9924B722443j02557j76134J51074n9636k04988j88253J19467P4099K2211k16230
9914B141496l0718q7191J29768j74666R2062K3873k53519q0248L25030J12030
9904B197917n9840j87383Q2076k3090j24677j00514J67027j76465l27974K34672
9894A681749K96669r5206k61262j04886K58761R6802k4516M0408q7812k36206
9884A564501R2070M8415j54242r2097o1986K07742j41874j68787R6922J46971
9874A537635k78566j10473J12237J5312L85247K40815q9743l54024m18458J8284
$$ plain form
9946 3230409 3307369 3330707 3129488 2796528 2740212 2745694 2735556 2623302 2701113 2627285 2671166
9935 2671166 2694364 2625226 2502783 2525747 2546413 2533840 2691376 2624530 2652399 2791896 2722443
9924 2722443 2619886 2443752 2594826 2535190 2330202 2141949 2261416 2335515 2357726 2141496
9914 2141496 2110778 2023587 2153355 1978689 2070751 2094624 1841105 1760857 2085887 2197917
9904 2197917 2138077 1950694 2032770 2009680 1885003 1784489 1951516 1775051 1447077 1681749
9894 1681749 1978418 1883212 1621950 1517064 1775825 1872627 1848111 1888519 1800707 1564501
9884 1564501 1656571 1704986 1550744 1458647 1396661 1604403 1462529 1293742 1390664 1537635
9874 1537635 1259069 1148596 1260833 1276145 1661392 1902207 1812464 1458440 1039982 1058266
9864A058266J34471J43210j11239O1284P0383j49433K0640m8949n8868j9047L0213
9853A130931K00128j3535J40047j3210l42144l3592l3804J09089J38786L2387
9843A315083L16930n9522l6045k90839r3042K7006r6517M7270k51190k79956K78936
9832H78114K75719o4231q51J13165M4303j82640k03635p6445k5250Q1720k9501
9821H10468k7392j10982r2826p6770J02994k26414J62706J74190j15788j94953
9811D05233o0014L00481m1738n11694r469O5449j94839p5122K28099q0935L7870
9800F3321J05857r1175l9029J6889k83651J04862K43456m7033q478J20039n6951
9789A28107K73648P0110J73900J12182j97715l90525L6548R5550P1401J99028
$$ plain form
9864 1058266 1192737 1335947 1224708 1285992 1356375 1206942 1227582 1178633 1119765 1100718 1130931
9853 1130931 1331059 1317524 1457571 1444361 1102217 1068625 1034821 1143910 1282696 1315083
9843 1315083 1632013 1572491 1536446 1245607 1152565 1179571 1083054 1130324 879134 599178 878114
9832 878114 1153833 1089602 1088751 1201916 1246219 1063579 859944 783499 758249 839969 810468
9821 810468 783076 672094 579268 502498 605492 379078 541784 715974 600186 405233
9811 405233 345219 645700 603962 92268 82799 148248 -46591 -121713 106386 25451 63321
9800 63321 169178 78003 38974 55863 -227788 -122926 120530 73497 65019 185058 128107
9789 128107 401755 471865 645765 757947 560232 169707 206255 301805 373206 572234
9779E72234j99105j01315J87406M422J43615r576k15009l29228m26898j51709
9769e25163J46915M3568K01895L627k98654k30377r9819J07323k1032J102K40350
9758d30265N3680j67292j81446o9352K99793R8335j4141r8875j07300M9830L8399
9747e28634J49808J85599J57145j26930q2402J18532K36722n3155l47900j48777
9737d39992J96056P5338K26298K16032j56322l363m4685p7303j79306m48519L253
9726f32513N0193O4562j12622L3236l2555k34275j80772j14740K90828r6738l05890
9715a271286j54350J06963O3244J43527K51189O6435k33810k22990j88229j11923
9705a551230J62053J94546j8026J05284O2882J1681j85886q5531j72478Q863L1391
$$ plain form
9779 572234 373129 271814 459220 463642 607257 597681 382672 53444 -373454 -525163
9769 -525163 -378248 -334680 -132785 -129158 -427812 -658189 -758008 -650685 -671717 -670615 -430265
9758 -430265 -376585 -543877 -725323 -794675 -494882 -396547 -410688 -509563 -616863 -567033 -528634
9747 -528634 -378826 -193227 -36082 -163012 -245414 -126882 109840 56685 -291215 -439992
9737 -439992 -243936 -168598 57700 273732 117410 114047 69362 -7941 -187247 -635766 -632513
9726 -632513 -582320 -517758 -630380 -597144 -629699 -863974 -1044746 -1159486 -868658 -965396 -1271286
9715 -1271286 -1425636 -1318673 -1255429 -1111902 -860713 -794278 -1028088 -1251078 -1439307 -1551230
9705 -1551230 -1389177 -1194631 -1212657 -1107373 -1044491 -1032810 -1218696 -1304227 -1476705 -1467842 -1436451
9694a436451n6321o9407R339J04733J12413l6590k99772j21499K36528L10982
9684a246045J34468j31269J2673l9749l24605j17223M0418j76287K3517J40161
9674a683941q9540k78309j6793L0848p4370k11671q6556M8458J09749p6815k09551
9663b538491r6112J18608K58936q8009l96027J28377k1510j10590J43792J29221
9653b471805N6338j25808j84218R5020k3161k51611M9011K76380J61066J21971
9643b296817M5822P3688j39154k60444J37218j3459l49726j07543K43068O8660
9633b598687O4419j2485m11297l54424J30113q1683j37957M9349N6891j26531
9623c422292j69413j95557O1755J04595m2463K3750J18938L4221k0296l92931
$$ plain form
9694 -1436451 -1492772 -1562179 -1552840 -1448107 -1335694 -1372284 -1672056 -1793555 -1557027 -1246045
9684 -1246045 -1111577 -1242846 -1230173 -1269922 -1594527 -1711750 -1671332 -1847619 -1824102 -1683941
9674 -1683941 -1773481 -2051790 -2068583 -2037735 -2112105 -2323776 -2410332 -2361874 -2252125 -2328940 -2538491
9663 -2538491 -2634603 -2515995 -2257059 -2345068 -2741095 -2612718 -2634228 -2744818 -2601026 -2471805
9653 -2471805 -2415467 -2541275 -2725493 -2630473 -2653634 -2905245 -2856234 -2579854 -2418788 -2296817
9643 -2296817 -2250995 -2177307 -2316461 -2576905 -2439687 -2453146 -2802872 -2910415 -2667347 -2598687
9633 -2598687 -2534268 -2546753 -2958050 -3312474 -3182361 -3264044 -3402001 -3352652 -3295761 -3422292
9623 -3422292 -3591705 -3787262 -3725507 -3620912 -3663375 -3639625 -3520687 -3486466 -3506762 -3899693
9613c899693l26557N8902L25420k4996l37092J41584L84278o5008n1610m44157
9603d238929l80557J03824L01390J06486K68517n698k83584j44658k05366j28580
9593d607155o4167l55032q854Q1902K2233K53377j57115l27688j59500K14402
9583e107597r1311j36273J58157K22258q5511o2374j1198j28445k79907j34703
9573e656904P6627J42008J9864k0771N0628j88289j15956J73690J55767l2988
9563e396324n132l83284m13085K6195N3758j53110q0183J47657r579J02983k58530
9552f368634j09372K74272k90694l20969k43310J40589J97338j82756m7093j45016
9542g095645l01701j79196m3980J81525K15504n2382j77674J33414J8927j95336
$$ plain form
9613 -3899693 -4226250 -4167348 -3841928 -3866924 -4204016 -4062432 -3678154 -3743162 -3794772 -4238929
9603 -4238929 -4619486 -4515662 -4214272 -4107786 -3839269 -3844967 -4128551 -4273209 -4478575 -4607155
9593 -4607155 -4671322 -5026354 -5035208 -4953306 -4931073 -4677696 -4834811 -5162499 -5321999 -5107597
9583 -5107597 -5198908 -5335181 -5177024 -4954766 -5040277 -5102651 -5113849 -5242294 -5522201 -5656904
9573 -5656904 -5580277 -5438269 -5418405 -5439176 -5388548 -5576837 -5692793 -5519103 -5363336 -5396324
9563 -5396324 -5401456 -5784740 -6197825 -6171630 -6117872 -6270982 -6351165 -6203508 -6213087 -6110104 -6368634
9552 -6368634 -6478006 -6203734 -6494428 -6815397 -7058707 -6918118 -6720780 -6903536 -6950629 -7095645
9542 -7095645 -7397346 -7576542 -7620522 -7438997 -7223493 -7275875 -7453549 -7320135 -7301208 -7496544
9532g496544l45233L9932K43948O6172R0816M2952l37058R3324P0241K6812k61151
9521g765789k22241n5880N7805M3961M6595L4877j69539j61820k53325k56475
9511h701831M0121J32407k83956J97691J53426l19124l29794k04840j03593o269
9501i425762Q141j20771m9454n9999O3891k39033R046j04863l72108l5356K5338
9490a0300930j80737l57538J49585j22007j38160P3236j05238j94315k12300k25630
9480a1614034l6341Q3987k2344L5122j20957Q4044Q666m7364q6573l11133l36632
9469a2363559J22274r8409l10207R8591m5391r8745M6134j97651k02094n1625
9459a3100682j14778p6630n8408j70011k25927k51100J39859J53699J87977M4208
$$ plain form
9532 -7496544 -7841777 -7801845 -7557897 -7491725 -7400909 -7357957 -7695015 -7601691 -7531450 -7504638 -7765789
9521 -7765789 -7988030 -8043910 -7986105 -7942144 -7895549 -7860672 -8030211 -8192031 -8445356 -8701831
9511 -8701831 -8661710 -8529303 -8813259 -8615568 -8462142 -8781266 -9111060 -9315900 -9419493 -9425762
9501 -9425762 -9417621 -9538392 -9587846 -9647845 -9583954 -9822987 -9813941 -9918804 -10290912 -10326268 -10300930
9490 -10300930 -10481667 -10839205 -10689620 -10811627 -10949787 -10876551 -10981789 -11176104 -11388404 -11614034
9480 -11614034 -11650375 -11566388 -11588732 -11553610 -11674567 -11590523 -11581857 -11629221 -11715794 -12026927 -12363559
9469 -12363559 -12241285 -12339694 -12649901 -12551310 -12596701 -12695446 -12649312 -12846963 -13049057 -13100682
9459 -13100682 -13215460 -13292090 -13350498 -13520509 -13746436 -13997536 -13857677 -13703978 -13516001 -13471793
9449a3471793J59524r4053J55981n3705k831K11975J21239L13981J61338Q4655
9439a2413689q7269K52977L43489L53666J05132k83833l23087k41875l24710p32220
9429a3351419n39712m26651l60221k94033l03362j45131k70770j37083P6550R3356
9419a5658476J75305M18651K63626M15413P31426Q07881J097009R92030O30452
9410a0126683M68785M70763L1046k6817n32238n02615r63275q88413m55726o91363
9400a3216536q04392r12108p24675n17495m07716k66936m18708j89280p3452J25689
9390a7405609J33347Q8431L17568M88804P81544J146527J379941J640529R03736
9381a0525182J82035O0016n76044q52686q36945p86571q12049k78854L30053Q55191
$$ plain form
9449 -13471793 -13312269 -13406322 -13250341 -13304046 -13306877 -13094902 -12973663 -12659682 -12498344 -12413689
9439 -12413689 -12500958 -12247981 -11904492 -11550826 -11445694 -11729527 -12052614 -12294489 -12619199 -13351419
9429 -13351419 -13891131 -14317782 -14678003 -14972036 -15275398 -15420529 -15691299 -15828382 -15751832 -15658476
9419 -15658476 -15483171 -15064520 -14800894 -14385481 -13654055 -12846174 -11749165 -10757135 -10126683
9410 -10126683 -9657898 -9187135 -9156089 -9182906 -9715144 -10217759 -11181034 -12069447 -12525173 -13216536
9400 -13216536 -14020928 -14933036 -15657711 -16175206 -16582922 -16849858 -17268566 -17457846 -17531298 -17405609
9390 -17405609 -17272262 -17183831 -16866263 -16377459 -15595915 -14449388 -13069447 -11428918 -10525182
9381 -10525182 -10343147 -10283131 -10859175 -11711861 -12548806 -13335377 -14147426 -14426280 -14096227 -13241036
9371a3241036J881388K583991M420350O498346Q368350J0454219J2362170J2831827
9363D6159605J2273942J0904787Q423229N525281K725196Q3137j837313k214497
9355H2043367j323478Q9034J015863K251767L503140M253550M851300N917297
9347A02601840P715214Q978366R743055J0223263J0006522Q509746O534546M114889
9339A68427441J769274l447j323935k322334k327819j980497j033205j34446J215611
9330A62286643L153684M885916P230540R782724J3160266J7245511K2027348K7087890
9322B66860522L0790400L0937233K7760779K1540236J2904975K050152q797528
9315C84046769j7003104k1632281k2097562j9607584j6928406j3533213j0070465
$$ plain form
9371 -13241036 -11359648 -8775657 -4355307 2143039 10511389 20965608 33327778 46159605
9363 46159605 58433547 69338334 77761563 83286844 86012040 86095177 84257864 82043367
9355 82043367 80719889 80808923 81824786 84076553 87579693 91833243 96684543 102601840
9347 102601840 110317054 119295420 129038475 139261738 149268260 157778006 164312552 168427441
9339 168427441 170196715 170193268 168869333 166546999 164219180 162238683 161205478 161071032 162286643
9330 162286643 165440327 170326243 177556783 187339507 200499773 217745284 239772632 266860522
9322 266860522 297650922 328588155 356348934 377889170 390794145 392844297 384046769
9315 384046769 367043665 345411384 323313822 303706238 286777832 273244619 263174154
9308B63174154p364502n671244m281437l161972j631789O4295K559956M306427
9300B47993888N438686O197799N791423M240231J952001q33533l814534o357758
9292B60608203q474871r236033q980632q053216o881805n622466m323471l279792
9284B05755917k303806j569228n65703J086528K319148L285603L087645J999702
9276B13095806j34865l241161o027887q637137j0440900j1023625j0710424j0014831
9268A52864976q644417p164872o172245n090935m239876l431012k872455k090988
9260A13158176j602602j884972j232112j637807j600990j962473k171892k194989
9252I8870339k435895k596678k590836k411188k322023k057751j658184j932624
$$ plain form
9308 263174154 255809652 250138408 245856971 242694999 241063210 241127505 243687461 247993888
9300 247993888 253432574 259630373 265421796 269662027 271614028 270780495 266965961 260608203
9292 260608203 252133332 242897299 233916667 225863451 218981646 213359180 209035709 205755917
9284 205755917 203452111 201882883 201317180 202403708 204722856 208008459 211096104 213095806
9276 213095806 212960941 209719780 203691893 195054756 184613856 173590231 162879807 152864976
9268 152864976 144220559 137055687 130883442 125792507 121552631 118121619 115249164 113158176
9260 113158176 111555574 109670602 108438490 106800683 105199693 103237220 101065328 98870339
9252 98870339 96434444 93837766 91246930 88835742 86513719 84455968 82797784 80865160
9244H0865160k009489j712050j011526r08566r01496j261856r13238o22107m45816
9235G1079016n62201o27266l94682k82300k44456m60677p12822l40655o34620
9226F6819337j421773j522435j549648j297092j211649j402115j267946j264354
9218E5882325j003850j024362j118216o64006o69681q67126o49004q49882p14694
9209D8321504p02847m90397n02155k70504k31437k09721j08764j59193k70957
9200D5375529k94384q74515p40591m30937r1489l14315m95666k21708n08929o33619
9190D0769376o27872p60885o66247p94740o13519n09403k91197p34207n46691
9181C5224615m84159n68912l76994j93692k06325n31700m60307k90384q7544l04643
$$ plain form
9244 80865160 78855671 77143621 76132095 75223529 74322033 73060177 72146939 71524832 71079016
9235 71079016 70516815 69889549 69494867 69212567 68968111 68507434 67794612 67453957 66819337
9226 66819337 65397564 63875129 62325481 61028389 59816740 58414625 57146679 55882325
9218 55882325 54878475 53854113 52735897 52071891 51402210 50535084 49886080 49036198 48321504
9209 48321504 47618657 47128260 46626105 46355601 46124164 45914443 45805679 45646486 45375529
9200 45375529 45081145 44206630 43466039 43035102 42943613 42629298 42133632 41911924 41402995 40769376
9190 40769376 40141504 39380619 38714372 37919632 37306113 36796710 36505513 35771306 35224615
9181 35224615 34740456 34171544 33794550 33600858 33394533 32862833 32402526 32112142 32024598 31719955
9171C1719955l33772k68634l27581n91805n58121l70044j63260k82653l06432
9162B8517653j55974p373m32270j01753j92541j61611K02139K54126j08556r0797
9152B7723043l09128K23221J27097j77915m05175m01649m67189o90146n09892
9143B5112267k50709j10257l02723j31176l96597m44474j48606k42470j90933
9134B2894322j72251j75014J8819k13723k40958k03705r9572l93125m94038j5656
9124B0905099J0098k32839k12486k31748K21523Q614j92666j40563K5488l8776
9114B0121744K32913J13726K26719K77718J41271p096K38208J9557q04251p68906
9104A9791603l72584k30732r7107l92180k76605l6592n0541K00165j90289l28926
$$ plain form
9171 31719955 31386183 31117549 30789968 30198163 29640042 29269998 29106738 28824085 28517653
9162 28517653 28361679 28354306 27922036 27820283 27627742 27466131 27668270 27922396 27813840 27723043
9152 27723043 27413915 27637136 27764233 27586318 27181143 26779494 26312305 25622159 25112267
9143 25112267 24861558 24751301 24448578 24317402 23920805 23476331 23327725 23085255 22894322
9134 22894322 22722071 22547057 22565876 22352153 22111195 21907490 21807918 21414793 20920755 20905099
9124 20905099 20915197 20682358 20469872 20238124 20459647 20468261 20275595 20135032 20160520 20121744
9114 20121744 20354657 20468383 20695102 20972820 21114091 21106995 21345203 21364760 20560509 19791603
9104 19791603 19419019 19188287 19091180 18699000 18422395 18385803 18335262 18535427 18345138 18016212
9094A8016212j62361L5943l1820l16354j66176j87290L8061O2082l52600j3488
9084A6922209j80472l13768j09272q9892R0675n2397l640Q9408k92342j43687
9074A5916822J69214J25748q4401M6924J00802j93552n6939K11885J61369l50200
9064A6047672m15254k94121K2193j4563O4226j13081k42887l5908j92009n20657
9054A4305611k48464m0392M3222j65931j1126r461L917K87784j35659j85493j20358
9043A3723650k18901j65096K7695O6166k8864j87148m0195M7594m0876j65019
9033A3019006J16514R4063j24897r7866o5695p2052M6515M5385R6653j81288r2566
9022A2783772J04137j46383j39788k07556l58238m9010l5733K31482P6484j47398
$$ plain form
9094 18016212 17853851 17889794 17857974 17541620 17375444 17188154 17226215 17288297 16935697 16922209
9084 16922209 16741737 16427969 16318697 16228805 16319480 16267083 16263443 16352851 16060509 15916822
9074 15916822 16086036 16211784 16127383 16174307 16275109 16081557 16024618 16236503 16397872 16047672
9064 16047672 15632418 15338297 15360490 15345927 15410153 15297072 15054185 15018277 14826268 14305611
9054 14305611 14057147 14016755 14059977 13894046 13882920 13873459 13877376 14165160 14029501 13844008 13723650
9043 13723650 13504749 13339653 13367348 13433514 13404650 13217502 13177307 13224901 13184025 13019006
9033 13019006 13135520 13229583 13104686 13006820 12941125 12869073 12915588 12960973 13057626 12876338 12783772
9022 12783772 12887909 12741526 12601738 12394182 12035944 11986934 11951201 12182683 12259167 12111769
9012A2111769L8604p4013j27775l36569q4084o1644L9175j32263L0633j8247P5239
9001A1460825L4637j22989o437j49298l7955j3628J45478o4517r414l3505N9569
8990A1262766l8454j6856l9699l4701n285k38194L299R8700J0476j74635J85619
8979A1013036j02974K5741l04487l69210k63725J25689K24554K9871l29579K09010
8969A0257926Q360j94617P5291J16977J61608R8228K02592k70915j67997j68083
8959A0119370l23629k53091q4806J94299K18567K78397K88028N0730l14761J91752
8949A0364856Q1916J09754j03538R8494J9673j51674K7026r5452L31516O6405
8939A0748976p4847m47253M3368M04130l5874k41241l11690j83348j23651j52534
$$ plain form
9012 12111769 12150373 12076360 11948585 11612016 11527932 11466288 11505463 11373200 11403833 11385586 11460825
9001 11460825 11495462 11372473 11366036 11216738 11178783 11165155 11310633 11246116 11236702 11203197 11262766
8990 11262766 11224312 11207456 11167757 11133056 11127771 10889577 10892876 10991576 11002052 10827417 11013036
8979 11013036 10910062 10935803 10631316 10262106 9998381 10124070 10348624 10378495 10048916 10257926
8969 10257926 10266286 10071669 10146960 10263937 10425545 10523773 10726365 10455450 10287453 10119370
8959 10119370 9795741 9542650 9457844 9652143 9870710 10149107 10437135 10487865 10173104 10364856
8949 10364856 10446772 10556526 10452988 10551482 10571155 10419481 10446507 10351055 10682571 10748976
8939 10748976 10674129 10226876 10270244 10674374 10638500 10397259 10085569 9902221 9778570 9626036
8929I626036L64106k9789q4655K8128j26593k17537l2904j79147n8406Q6845j14948
8918I261136J8711J5440J0772j05014O3845j46064l9676L16869L41513k36719
8908I500813j64534q2135L6915m8973m4007J75767J5728q6661J5951k3114K56467
8897I552217J01492J03564J03732j63081J68001k4135j31168L1543o4303j92491
8887I485371l08260k2716J9737J16928R434j49855M4071m39056k66360K74935
8877H764229K44856q2940j07731o0611K34291J56745j21414k44936j26427R8970
8867H755032j17261j92711k50296J17073p5773M07064J03324l06766l7505k12769
8857H189412l9977L15900J91510O1002j2432J53257r3832J53446j00111k18922
$$ plain form
8929 9626036 9990142 9960353 9875698 9903826 9777233 9559696 9526792 9347645 9289239 9376084 9261136
8918 9261136 9279847 9295287 9306059 9201045 9264890 9118826 9079150 9396019 9737532 9500813
8908 9500813 9336279 9254144 9291059 9242086 9198079 9373846 9389574 9302913 9318864 9295750 9552217
8897 9552217 9653709 9757273 9861005 9697924 9865925 9841790 9710622 9742165 9677862 9485371
8887 9485371 9177111 9154395 9174132 9291060 9300494 9150639 9194710 8755654 8489294 8764229
8877 8764229 9009085 8926145 8818414 8757803 8992094 9148839 9027425 8782489 8656062 8755032
8867 8755032 8637771 8445060 8194764 8311837 8236064 8643128 8746452 8439686 8402181 8189412
8857 8189412 8149435 8465335 8656845 8717847 8705415 8858672 8764840 8918286 8818175 8599253
8847H599253M8888K8287l56509j64283K71367J36993j28792l93314p1331K3465
8837G994024J54969p4925j53173L4091k92531j59355R8389L9320r7670j8843L12159
8826G836455l9429K7903M2908j02822k09767j90706J00891J36510N5809j54152
8816G503600k87693j7125J00744O1350J48344K25787J2046j20283k83723j97836
8806G145211J63575m1760j15925M6049l50049m8714O0363Q2397J12021J33526
8796G186694Q1760j53694q1356m4495j10905M0490k7559k87078L5283o0064j21694
8785F457382J69846L8165J25412J54227J22871J24187J11561j72994l87291j76178
8775F567188k1989j7029K64706M8117m03302J59590O6562P8940o609j60133j76410
$$ plain form
8847 8599253 8648141 8676428 8319919 8155636 8427003 8563996 8435204 8041890 7970559 7994024
8837 7994024 8148993 8074068 7920895 7954986 7662455 7503100 7601489 7640809 7543139 7524296 7836455
8826 7836455 7797026 7824929 7867837 7765015 7555248 7364542 7465433 7601943 7657752 7503600
8816 7503600 7215907 7198782 7299526 7360876 7509220 7735007 7747053 7626770 7343047 7145211
8806 7145211 7308786 7267026 7151101 7197150 6847101 6798387 6858750 6941147 7053168 7186694
8796 7186694 7268454 7114760 7033404 6988909 6878004 6918494 6890935 6603857 6639140 6579076 6457382
8785 6457382 6627228 6665393 6790805 6945032 7067903 7192090 7303651 7130657 6743366 6567188
8775 6567188 6545199 6528170 6792876 6840993 6437691 6597281 6663843 6742783 6736174 6576041 6399631
8764F399631j35387J52956L39125k61663k84348K08780P794J03265J82610j36606
8754F576157M547l5600n3523K99988k5637l68803q310j79025M277J95524J62529
8743F572124k06113Q2188o9514k21330l51164L4082J28585K6041J58582k13594
8733E939887Q5110J75913Q1321N5294r9710M1954P8578k6451k09946j77708M8834
8722E993076J13707K96679k03k87560p5894O2940p3777j13421n9508M1352K06391
8711F103782j24263L2590J0495j6997o8651J7474j30289p7278P5219K16517J94653
8700F233252j43111l54706q1969K90060l2510P0703j33206q7549l6156j54532
8690E570276J63465J36165J57871J00774k19716l34619j40863Q3928l1265k51857
$$ plain form
8764 6399631 6264244 6417200 6756325 6494662 6210314 6419094 6426888 6530153 6712763 6576157
8754 6576157 6580704 6545104 6491581 6791569 6765932 6397129 6388819 6209794 6214071 6409595 6572124
8743 6572124 6366011 6448199 6378685 6157355 5806191 5840273 5968858 5994899 6153481 5939887
8733 5939887 6024997 6200910 6282231 6337525 6237815 6279769 6358347 6331896 6121950 5944242 5993076
8722 5993076 6106783 6403462 6403259 6115699 6039805 6102745 6028968 5915547 5856039 5897391 6103782
8711 6103782 5979519 6012109 6022604 6005607 5936956 5954430 5824141 5746863 5822082 6038599 6233252
8700 6233252 6090141 5735435 5653466 5943526 5911016 5981719 5848513 5760964 5724808 5570276
8690 5570276 5733741 5869906 6027777 6128551 5908835 5574216 5433353 5517281 5486016 5234159
8680E234159p6479K22329N0481r3193q2085J56332J1297L04721J10312k35051
8670E602823m6968O2056J2384p3387J18935K20942j83944l0119l00301k65232
8660E117189P3508L30155K93971k09182m53457k15929j00529J74095J00931M49019
8650E559771J61140k84940j97030M7548q2786J84954j7021K5174k5566k69807
8640E101437j69469j06740K48335O3497j1118j32647J8992j82349J70750M97529
8630E498217k5697k67767l1619j43796L7359J9263m770P9586O39r0881R7593L57806
8618E525933J76115r1940n00448l40236J74668L58912N0231k5006k49220J90198
8608E269207L26459k44743j88756k86541k96582j02280P2630L78380K55911k15460
$$ plain form
8680 5234159 5157680 5380009 5430490 5337297 5255212 5411544 5422841 5727562 5837874 5602823
8670 5602823 5555855 5617911 5630295 5556908 5675843 5896785 5712841 5682722 5382421 5117189
8660 5117189 5190697 5520852 5814823 5605641 5152184 4936255 4835726 5009821 5110752 5559771
8650 5559771 5720911 5435971 5238941 5286489 5203703 5388657 5371636 5396810 5371244 5101437
8640 5101437 4931968 4825228 5073563 5137060 5125942 4993295 5012287 4829938 5000688 5498217
8630 5498217 5472520 5204753 5173134 5029338 5066697 5085960 5081190 5160776 5161415 5070534 5168127 5525933
8618 5525933 5702048 5610108 5109660 4769424 4944092 5303004 5353235 5328229 5079009 5269207
8608 5269207 5595666 5350923 5162167 4875626 4579044 4476764 4549394 4927774 5183685 4968225
8598D968225O3775m66320j79470K43166L24234L09572l6731j01927M1536j1409
8588E154651K2516k66244k52849p8797K06641J65646m3692k48576k03156L20712
8578D776852O2339j06209j10779R0548J10058L7448o9093P0713J19327j75993
8568D805211J00556L12106P69j89344n9795P8360O1969j41650j66767j37978P4514
8557D737951j59746j0334l8675N4936j4778K12968Q3567l22207j80318j10591
8547D252773r1999O0096K82477k4629J12551L3608l20079q8131q6407P2271P0919
8536D273450r0792l8239L29201J73250o8235o6846K47184J90664N1998l92789
8526D608846l3711j90522m479J18345j43976J91874K60615k24962j78498n2107
$$ plain form
8598 4968225 5032000 4565680 4386210 4629376 4953610 5263182 5226451 5124524 5166060 5154651
8588 5154651 5177167 4910923 4658074 4579277 4785918 4951564 4907872 4659296 4456140 4776852
8578 4776852 4839191 4732982 4622203 4712751 4822809 4860257 4791164 4861877 4981204 4805211
8568 4805211 4905767 5217873 5218642 5029298 4969503 5047863 5109832 4968182 4801415 4663437 4737951
8557 4737951 4578205 4567871 4529196 4584132 4569354 4782322 4865889 4543682 4363364 4252773
8547 4252773 4160774 4220870 4503347 4478718 4591269 4624877 4304798 4216667 4130260 4202531 4273450
8536 4273450 4182658 4144419 4473620 4646870 4578635 4511789 4758973 4949637 5001635 4608846
8526 4608846 4575135 4384613 4380134 4498479 4354503 4546377 4806992 4582030 4403532 4351425
8516D351425k8676j07045P7965K15923J92667P0540j87373j06717j48375j02953
8506D227381O4891K90489N8346J13230J22678j05154L03087j44809k03795k52998
8496D473346o579j95482o722j17672p9959K84325j25904M1111O4741k84061k02587
8485C844557J32448J54506K57525J08500R7703l3895l86108j89811o717l7520
8475C941188R1714J70038L2841J32080j39395l04954j05545O4249L28686P0204
8465D281106o6127L7430K15697j95322p6777M8924k47818p7510K24204K7453J4668
8454D185928J52940L2263Q4053o8257q7025l34165L4337J35542l12001l02527
8444C521088K9037L62511Q3841j71556P2110L06129J41566l9293k83264J50911
$$ plain form
8516 4351425 4322749 4215704 4293669 4509592 4702259 4772799 4585426 4478709 4330334 4227381
8506 4227381 4292272 4582761 4641107 4754337 4877015 4771861 5074948 4930139 4726344 4473346
8496 4473346 4466767 4271285 4264563 4146891 4066932 4351257 4225353 4266464 4331205 4047144 3844557
8485 3844557 3977005 4131511 4389036 4497536 4595239 4561344 4175236 3985425 3978708 3941188
8475 3941188 4032902 4202940 4235781 4367861 4228466 3923512 3817967 3882216 4210902 4281106
8465 4281106 4214979 4252409 4468106 4272784 4196007 4244931 3997113 3919603 4143807 4171260 4185928
8454 4185928 4338868 4371131 4455184 4386927 4299902 3965737 4000074 4135616 3823615 3521088
8444 3521088 3550125 3912636 3996477 3824921 3897031 4203160 4344726 4305433 4022169 4173080
8434D173080K22036m1526K0544l848k1299L0071j54693M2580k88860k09560p1082
8423C697443o1684N8287L21008K89337k52797l20925O8390j39676M228j09492
8413C554119Q4913J50801k5916l0888L3008L68642k8060r9339L1493r6878p6721
8402C865174n724P0968L9478j6277K6490R6514j35053L5850J9229j68191J02087
8391C930545j80947k4284J33029r3913j25498J37766J13186q0202j64360k59325
8381C385997J16634K1628l0275r0329K72014J03843M1909K92443K15326n5013
8371D274177m9491k1159k96180l25803j78403J6931J47141j23829k25570J87649
8361C405463J97450j13408k06266J63794k2351M2757o0171K5428j24987Q7677
$$ plain form
8434 4173080 4395116 4353590 4374134 4370286 4348987 4379058 4224365 4266945 3978085 3768525 3697443
8423 3697443 3635759 3694046 4015054 4304391 4051594 3730669 3799059 3659383 3663611 3554119
8413 3554119 3639032 3789833 3763917 3733029 3766037 4134679 4106619 4007280 4038773 3941895 3865174
8402 3865174 3859450 3930418 3969896 3953619 3980109 4076623 3941570 3977420 3996649 3828458 3930545
8391 3930545 3749598 3725314 3858343 3764430 3638932 3776698 3889884 3809682 3645322 3385997
8381 3385997 3502631 3524259 3493984 3403655 3675669 3779512 3821421 4113864 4329190 4274177
8371 4274177 4224686 4203527 3907347 3581544 3403141 3420072 3567213 3443384 3217814 3405463
8361 3405463 3602913 3489505 3283239 3447033 3424682 3467439 3407268 3432696 3307709 3395386
8351C395386L6238q2504j40186L32141K05627R4035P6241L68j48732j25079m4852
8340C598683L1168k11840J490r996J29053M9524j19736Q8490L8841p7823Q6023
8329C603877K4578j52724P5549j0040P8828j39996j06433k7589P446j1152K33365
8318C575709L27719j44536l93953j97496m5947K49102J61822J63332p7477l40090
8308C278185l80984J99527J3899r2975M50921J09699N910k30735l6890P7504k52659
8297C141402Q5247L71445K34757l86745j93373j63170n3651J62641M082J25552
8287C328187J58554L5038K10541J11767q6041j96276j28894p5152L0138J39148
8277C527010J41560p0599J08506k0143m3580r6587L6689j97097k54455j05957
$$ plain form
8351 3395386 3431624 3349120 3208934 3541075 3746702 3840737 3916978 3917346 3768614 3643535 3598683
8340 3598683 3629851 3418011 3419501 3409505 3538558 3588082 3468346 3556836 3595677 3517854 3603877
8329 3603877 3628455 3475731 3551280 3541240 3620068 3480072 3373639 3346050 3353496 3342344 3575709
8318 3575709 3903428 3758892 3364939 3167443 3121496 3370598 3532420 3695752 3618275 3278185
8308 3278185 2897201 3096728 3110627 3017652 3468573 3578272 3584182 3353447 3316557 3394061 3141402
8297 3141402 3226649 3598094 3832851 3446106 3252733 3089563 3035912 3198553 3202635 3328187
8287 3328187 3486741 3521779 3732320 3844087 3758046 3561770 3432876 3357724 3387862 3527010
8277 3527010 3668570 3597971 3706477 3686334 3642754 3546167 3582856 3385759 3131304 3025347
8267C025347M8697R8654J08907l02K26507k67720N1310J56939L6105l41364l638
8256C139442j58723J20012K35629J52786J31386J4700j58734k41127l09944k16554
8246B708873k94k4500J18093l3146J10593J62978J6853n629p7766l22061L7284
8235B691278M4502k58085J25920L28179Q0409O2917J3208Q4919J568l506J21371
8224C292680j11283M199J79084l083r6405j45525l36203n354j26943K67115k5112
8213B893170p1508j42033J8082J47078J64856R8355r0474k55743j93744K03907
8203B771946J53059K9706j96580k51648P3061L68573q3353j34547J2421j06288
8193B636350P252R362P2490j3109L24436j12654j91528k04679K26438K2295J03663
$$ plain form
8267 3025347 3074044 3172698 3281605 3281303 3507810 3240090 3291400 3448339 3484444 3143080 3139442
8256 3139442 2980719 3100731 3336360 3489146 3620532 3635232 3476498 3235371 2925427 2708873
8246 2708873 2708579 2684079 2802172 2769026 2879619 3042597 3059450 3053821 2976055 2653994 2691278
8235 2691278 2735780 2477695 2603615 2931794 3012203 3075120 3088328 3173247 3174815 3171309 3292680
8224 3292680 3181397 3185596 3364680 3361597 3265192 3119667 2783464 2778110 2651167 2918282 2893170
8213 2893170 2821662 2679629 2697711 2844789 3009645 3108000 3017526 2761783 2568039 2771946
8203 2771946 2925005 2954711 2758131 2506483 2579544 2948117 2864764 2730217 2742638 2636350
8193 2636350 2643602 2652964 2725454 2712345 3036781 2924127 2732599 2527920 2754358 2776653 2880316
8182B880316J87270p8192j33989J63461k2437j30403m0814j09106l93047M6976
8172B370035M64966J53904k37010l55942J3661J29264l78356m7733j72591K44274
8162B184472J65738P6678K59642J55273J6309M6184N5592p5769l63685j93186
8152B327248J8271Q053J23741j03598K99389J36934o3492M0058n5397r4958K64583
8141B900832n5625k04239l55238q1308L00263M10218N698j86277J28972K32911
8131C096207k89100j06932k99839K4098J71846L23742K4401p4148M2258k25600
8121B686933m76377R9776K69777P4760k25738o2824J11659J1575q1850k3251l11614
8110B072826l56442O6050K96840L0672Q2447L53069p5613J36690k1552k15440
$$ plain form
8182 2880316 3067586 2989394 2855405 3018866 2996429 2866026 2825212 2716106 2323059 2370035
8172 2370035 2835001 2988905 2751895 2395953 2409614 2538878 2160522 2112789 1940198 2184472
8162 2184472 2350210 2426888 2686530 2841803 2858112 2904296 2959888 2884119 2520434 2327248
8152 2327248 2345519 2353572 2477313 2373715 2673104 2810038 2746546 2786604 2731207 2636249 2900832
8141 2900832 2845207 2640968 2285730 2204422 2504685 2914903 2920601 2734324 2863296 3096207
8131 3096207 2807107 2700175 2400336 2424434 2596280 2920022 2944423 2870275 2912533 2686933
8121 2686933 2210556 2310332 2580109 2654869 2429131 2366307 2477966 2489541 2407691 2384440 2072826
8110 2072826 1716384 1782434 2079274 2109946 2192393 2545462 2469849 2606539 2584987 2369547
8100B369547K53203m3203K92k65059k02204o5832J78278L2958o743j32533l2034
8089B086670m4311J1071l0931K32309J71145o6241j42689k45464J548p9407J38384
8078B032084K57148K5776J2366Q255n0380J31152l8231k80574k06142K30056J18389
8067B239899k90178J25824O6107N6383M08708O9405j76808k31828q058k73682
8057A985772j69239K0560m0603K89705l26249r4543K42913j68695p4732j42621
8047A522268k57054J43127R4463j13637M15331J78698R9769L3222k62800j55421
8037A697966L03314O0726j6065J63926j74229j49923r189L9011o7749j84087o4069
8026A599632J51936J14859O6857K40035J8474j86573k96934K05395M3961k68408
$$ plain form
8100 2369547 2622750 2579547 2579839 2314780 2112576 2046744 2225022 2257980 2251237 2118704 2086670
8089 2086670 2042359 2053430 2022499 2254808 2425953 2359712 2217023 1971559 1973107 1893700 2032084
8078 2032084 2289232 2315008 2327374 2335629 2285249 2416401 2378170 2097596 1891454 2121510 2239899
8067 2239899 1949721 2075545 2141652 2198035 2606743 2676148 2499340 2267512 2259454 1985772
8057 1985772 1816533 1837093 1796490 2086195 1759946 1665403 1908316 1739621 1664889 1522268
8047 1522268 1265214 1408341 1502804 1389167 1804498 1983196 2082965 2116187 1853387 1697966
8037 1697966 2001280 2062006 2045941 2209867 2035638 1885715 1876526 1915537 1847788 1663701 1599632
8026 1599632 1751568 1866427 1933284 2173319 2191793 2005220 1708286 1913681 1957642 1689234
8016A689234j85573J2134K24657k9752j45143k0266q0177J78044J51556m1686
8006A753028k12466J26246K2034m4587j41080r409p2240k41985K49927K48118
7996A677586k89670k0676l5662r6459m9372k41180K9810m6535J44774J51124j76036
7985A047704k16604n3731L23082J62396q3909j35662j61053J45769K08516J60636
7975A397144k30779m8150j17575j23168N7358L7986k33288k81440k48634k1165
7965A88289j49782l28790j7691j5983M8195J36222L49125O5637P9998j51029j26054
7954G8137P1495K8485O6913k28726m96775j12355K20193P61289J504230L009478
7944D902364M796885O429664O673709N349889M179272K876247j13324l692067
$$ plain form
8016 1689234 1503661 1515795 1740452 1710700 1565557 1545291 1465114 1643158 1794714 1753028
8006 1753028 1540562 1666808 1688842 1644255 1503175 1493766 1421526 1179541 1429468 1677586
7996 1677586 1387916 1367240 1331578 1235119 1185747 944567 974377 927842 1072616 1223740 1047704
7985 1047704 831100 777369 1100451 1262847 1178938 1043276 882223 1027992 1236508 1397144
7975 1397144 1166365 1118215 1000640 877472 934830 972816 739528 458088 209454 188289
7965 188289 38507 -290283 -307974 -323957 -275762 -139540 209585 275222 355220 204191 78137
7954 78137 149632 178117 245030 16304 -480471 -592826 -372633 388656 1892886 4902364
7944 4902364 9699249 16128913 22802622 28152511 32331783 35208030 35094706 31402639
7936C1402639n444163n466959m245119k797662j934008j272868r76322o56317
7928H609221o37708m60948l12337j88374j98879n43620j77343j40420k16078k18450
7918E515064j95894k88138n31258l49911p5404L1579r0595j31533Q472k13462
7908C678920q9504n0962L3405K87606J184020K275960M038415N969805O531467
7899B3859132N148557L879569K759176M45056k620865m836247n174942l948749
7891A9510687k971888k037276j174716r76572p39381n66519n07603q5523k69673
7882A0181536n17229j93886j01880m55109m77453j79895J73596m33926l90375
7873G605379K188J45445J77046k6698l39500m40179k81638k85651j99251k2828
$$ plain form
7936 31402639 25958476 20491517 16246398 13448736 11514728 10241860 9265538 8609221
7928 8609221 7971513 7510565 7198228 7009854 6810975 6267355 6090012 5949592 5733514 5515064
7918 5515064 5319170 5031032 4499774 4149863 4074459 4106038 4015443 3883910 3892382 3678920
7908 3678920 3589416 3538454 3571859 3859465 5043485 7319445 11357860 17327665 23859132
7899 23859132 29007689 32887258 35646434 36091490 33470625 28634378 23459436 19510687
7891 19510687 16538799 14501523 13326807 12350235 11610854 11044335 10536732 10451209 10181536
7882 10181536 9664307 9470421 9368541 8913432 8435979 8256084 8429680 7995754 7605379
7873 7605379 7607567 7753012 7930058 7903360 7563860 7123681 6842043 6556392 6357141 6334313
7863F334313J6259k8882l6076l01015j68534l1138j09016j07177K07534q5743
7853E690525r5047j61586j77925k8977O1917K23129m5327j67642J29984j63664
7843E265387j17515l5181j33659j91096j41005k5266O729J11127r950o7136N4352
7832D716787j68471k07739j9263J23948j57483j47579j17832J17183J13960k06354
$$ plain form
7863 6334313 6350572 6321690 6285614 5984599 5816065 5784927 5675911 5568734 5776268 5690525
7853 5690525 5595478 5433892 5255967 5226990 5288907 5512036 5466709 5299067 5429051 5265387
7843 5265387 5147872 5112691 4979032 4787936 4646931 4621665 4628394 4739521 4729571 4662435 4716787
7832 4716787 4548316 4340577 4321314 4445262 4287779 4140200 4022368 4139551 4253511 4047157
$$ [...]
##END NTUPLES=NMR SPECTRUM
##END=
