##TITLE=Analysis number 318919
Compound Code cc 55611
Book Reference 481/30
Project Code adrs
Chemist Name bruced
##JCAMPDX= 6.0         $$ Bruker NMR JCAMP-DX V2.0
##DATA TYPE= NMR SPECTRUM
##DATA CLASS= NTUPLES
##ORIGIN= Bruker BioSpin GmbH
##OWNER= nmr
$$ XWIN-NMR		Version 3.5
$$ Tue Apr 25 08:32:35 2006 GMT Daylight Time (UT+1h)  MAYBRIDGE\nmr@NMR_250MHZ
##.OBSERVE FREQUENCY= 250.131544655141
##.OBSERVE NUCLEUS= ^1H
##.ACQUISITION MODE= SIMULTANEOUS (DQD)
##.ACQUISITION SCHEME= undefined
##.AVERAGES= 16
##.DIGITISER RES= 18
##SPECTROMETER/DATA SYSTEM= dpx250
##.PULSE SEQUENCE= zg30
##.SOLVENT NAME= CDCl3
##.SHIFT REFERENCE= (INTERNAL, CDCl3, 0, 16.522)
##AUDIT TRAIL= $$ (NUMBER, WHEN, WHO, WHERE, WHAT)
$$ ##TITLE= Audit trail, XWIN-NMR		Version 3.5
$$ ##JCAMPDX= 5.01
$$ ##ORIGIN= Bruker BioSpin GmbH
$$ ##OWNER= nmr
$$ C:\u/data/dgb/nmr/ADRS/2880/pdata/1/auditp.txt
$$ ##AUDIT TRAIL=  $$ (NUMBER, WHEN, WHO, WHERE, WHAT)
(   1,<2006-04-25 08:32:10.04 +100>,<MAYBRIDGE\nmr>,<NMR_250MHZ>,
      <created by zg, POWCHK disabled, PULCHK disabled
       configuration hash MD5:
       84 BC 41 DB A1 6E 1D 46 DA 25 12 A5 C1 ED C5 3A
       data hash MD5: 64K
       A3 50 E4 4C EA 77 41 E5 AE 21 CF 5D 5E 82 18 63>)
(   2,<2006-04-25 08:32:22.01 +100>,<MAYBRIDGE\nmr>,<NMR_250MHZ>,
      <Start of raw data processing
       ef LB = 0.3 FT_mod = 6 PKNL = 1 SI = 32K 
       data hash MD5: 32K
       9F 52 AA E3 86 0D AC 14 C3 8E 6A 67 12 94 0A FC>)
(   3,<2006-04-25 08:32:23.68 +100>,<MAYBRIDGE\nmr>,<NMR_250MHZ>,
      <apk 
       data hash MD5: 32K
       C9 C4 FD 13 B5 A7 BF A8 C0 EA 0A 9E 60 A9 09 09>)
(   4,<2006-04-25 08:32:24.43 +100>,<MAYBRIDGE\nmr>,<NMR_250MHZ>,
      <abs ABSG = 5 
       data hash MD5: 32K
       AC 39 7A AF AC 95 04 B1 7C 1F 7F 65 80 82 E4 64>)
$$ ##END=
$$ 
$$ hash MD5
$$ 23 BC 0E 01 93 D6 73 1E 7A 42 69 FE 8A 8D CD ED
##$RELAX= 
##$RELAX= 
##$RELAX= 
##$RELAX= 
##$RELAX= 
##$RELAX= 
##$RELAX= 
$$ Bruker specific parameters
$$ --------------------------
##$DU= <C:\u>
##$EXPNO= 2880
##$NAME= <ADRS>
##$PROCNO= 1
##$TYPE= <nmr>
##$USER= <dgb>
##$AMP= (0..31)
100 100 100 100 100 100 100 100 100 100 100 100 100 100 100 100 100 100 
100 100 100 100 100 100 100 100 100 100 100 100 100 100 
##$AQSEQ= 0
##$AQ_mod= 3
##$AUNM= <au_zg>
##$AUTOPOS= <1 >
##$BF1= 250.13
##$BF2= 250.13
##$BF3= 250.13
##$BF4= 250.13
##$BF5= 500.13
##$BF6= 500.13
##$BF7= 500.13
##$BF8= 500.13
##$BYTORDA= 1
##$CFDGTYP= 0
##$CFRGTYP= 5
##$CHEMSTR= <none>
##$CNST= (0..31)
1 1 145 1 1 1 1 1 1 1 1 1 1 1 1 1 1 1 1 1 1 1 1 1 1 1 1 1 1 1 1 1 
##$CPDPRG= <>
##$CPDPRG1= <>
##$CPDPRG2= <>
##$CPDPRG3= <>
##$CPDPRG4= <mlev>
##$CPDPRG5= <mlev>
##$CPDPRG6= <mlev>
##$CPDPRG7= <mlev>
##$CPDPRG8= <mlev>
##$CPDPRGB= <>
##$CPDPRGT= <>
##$D= (0..31)
0 1 0 0 0 0 0 0 0 0.06 0 0 0 0 0 0 0.0002 0 0 0 0 0 0 0 0 0 0 0 0 0 0 
0 
##$DATE= 1145950328
##$DBL= (0..7)
120 120 120 120 120 120 120 120 
##$DBP= (0..7)
150 150 150 150 150 150 150 150 
##$DBP07= 0
##$DBPNAM0= <>
##$DBPNAM1= <>
$$ [...]
##$SUBNAM6= <"">
##$SUBNAM7= <"">
##$SUBNAM8= <"">
##$SUBNAM9= <"">
##$SW= 20.6930455092707
##$SWIBOX= (0..15)
0 0 3 0 0 0 0 0 0 0 0 0 0 0 0 0 
##$SW_h= 5175.983436853
##$TD= 65536
##$TD0= 1
##$TE= 295.16
##$TE2= 300
##$TE3= 300
##$TEG= 300
##$TL= (0..7)
0 120 120 120 120 120 120 120 
##$TP= (0..7)
150 150 150 150 150 150 150 150 
##$TP07= 0
##$TPNAME0= <>
##$TPNAME1= <>
##$TPNAME2= <>
##$TPNAME3= <>
##$TPNAME4= <>
##$TPNAME5= <>
##$TPNAME6= <>
##$TPNAME7= <>
##$TPOAL= (0..7)
0.5 0.5 0.5 0.5 0.5 0.5 0.5 0.5 
##$TPOFFS= (0..7)
0 0 0 0 0 0 0 0 
##$TUNHIN= 0
##$TUNHOUT= 0
##$TUNXOUT= 0
##$USERA1= <user>
##$USERA2= <user>
##$USERA3= <user>
##$USERA4= <user>
##$USERA5= <user>
##$V9= 5
##$VALIST= <valist>
##$VCLIST= <CCCCCCCCCCCCCCC>
##$VD= 0
##$VDLIST= <DDDDDDDDDDDDDDD>
##$VPLIST= <PPPPPPPPPPPPPPP>
##$VTLIST= <TTTTTTTTTTTTTTT>
##$WBST= 1024
##$WBSW= 4
##$XGAIN= (0..3)
0 0 0 0 
##$XL= 0
##$YL= 0
##$YMAX_a= 633747
##$YMIN_a= -744685
##$ZGOPTNS= <>
##$ZL1= 120
##$ZL2= 120
##$ZL3= 120
##$ZL4= 120
##$ABSF1= 16.522
##$ABSF2= -4.171173
##$ABSG= 5
##$ABSL= 3
##$ALPHA= 0
##$AQORDER= 0
##$ASSFAC= 0
##$ASSFACI= 0
##$ASSFACX= 0
##$ASSWID= 0
##$AUNMP= <proc_1d>
##$AZFE= 0.1
##$AZFW= 0.1
##$BCFW= 0
##$BC_mod= 0
##$BYTORDP= 0
##$COROFFS= 0
##$CY= 12.5
##$DATMOD= 1
##$DC= 0
##$DFILT= <>
##$DTYPP= 0
##$F1P= 14.0000005364418
##$F2P= -0.99999901652339
##$FCOR= 0.5
##$FTSIZE= 32768
##$FT_mod= 6
##$GAMMA= 0
##$GB= 0
##$INTBC= 1
##$INTSCL= 1
##$ISEN= 128
##$LB= 0.3
##$LEV0= 0
##$LPBIN= 0
##$MAXI= 10000
##$MC2= 0
##$MEAN= 0
##$ME_mod= 0
##$MI= 0
##$NCOEF= 0
##$NC_proc= -4
##$NLEV= 6
##$NOISF1= 0
##$NOISF2= 0
##$NSP= 0
##$NTH_PI= 0
##$NZP= 0
##$OFFSET= 16.522
##$PC= 1
##$PHC0= 165.203
##$PHC1= 4.46631
##$PH_mod= 1
##$PKNL= yes
##$PPARMOD= 0
##$PSCAL= 4
##$PSIGN= 0
##$REVERSE= no
##$SF= 250.13
##$SI= 32768
##$SIGF1= 0
##$SIGF2= 0
##$SINO= 400
##$SIOLD= 32768
##$SREGLST= <1H.CDCl3>
##$SSB= 0
##$STSI= 32768
##$STSR= 0
##$SW_p= 5175.98343685301
##$SYMM= 0
##$S_DEV= 0
##$TDeff= 65536
##$TDoff= 0
##$TI= <Analysis number 999999
Compound Code 99
Book Reference 9
Project Code 9>
##$TILT= no
##$TM1= 0
##$TM2= 0
##$TOPLEV= 0
##$USERP1= <user>
##$USERP2= <user>
##$USERP3= <user>
##$USERP4= <user>
##$USERP5= <user>
##$WDW= 1
##$XDIM= 32768
##$YMAX_p= 392745508
##$YMIN_p= -128861
$$ End of Bruker specific parameters
$$ ---------------------------------
##NTUPLES= NMR SPECTRUM
##VAR_NAME=  FREQUENCY,     SPECTRUM/REAL,   SPECTRUM/IMAG
##SYMBOL=    X,             R,               I
##VAR_TYPE=  INDEPENDENT,   DEPENDENT,       DEPENDENT
##VAR_FORM=  AFFN,          ASDF,            ASDF
##VAR_DIM=   32768,         32768,           32768
##UNITS=     HZ,            ARBITRARY UNITS, ARBITRARY UNITS
##FACTOR=    0.157963299565203, 1,           1
##FIRST=     4132.6476996994, 0,             0
##LAST=      -1043.33573715361, 0,           0
##MIN=       -1043.33573715361, -128861,     0
##MAX=       4132.6476996994, 392745508,     0
$$ Real data points
##PAGE= N=1
##DATA TABLE= (X++(R..R)), XYDATA
$$ [...]
18033B807305k77736j89834q7764k8964l2174l2621l8098r0373j80736j81045
$$ 2807305 2529569 2339735 2251971 2223007 2190833 2158212 2120114 2029741 1849005 1667960
18023A667960j63627j32908j25408r4771q4722p6326k8422O142j0824m000l0354
$$ 1667960 1504333 1371425 1246017 1151246 1066524 990198 961776 967918 957094 953094 922740
18012I22740J0670k3967j2489Q026K0968M2217N4302M6070P6446J13342J10514
$$ 922740 933410 909443 896954 904980 925948 968165 1022467 1068537 1144983 1258325 1368839
18001A368839P9611M9485P0155Q8794K9942L5430R0170J62156K05808K79710L11559
$$ 1368839 1448450 1497935 1568090 1656884 1686826 1722256 1812426 1974582 2180390 2460100 2771659
17990B771659L60542L50756K26007P4037r535j60365l80207l80749k94493k81566
$$ 2771659 3132201 3482957 3708964 3783001 3773466 3613101 3232894 2852145 2557652 2276086
17980B276086k55984j74021r4599j6013L2377O8409Q6028J03463R6929O0109j5089
$$ 2276086 2020102 1846081 1751482 1735469 1767846 1836255 1922283 2025746 2122675 2182784 2167695
17969B167695r5005p6800q5742r6042q5551p0378n1680m7241k7594n9060l5550
$$ 2167695 2072690 1995890 1910148 1814106 1728555 1658177 1606497 1559256 1531662 1472602 1437052
17958A437052p511k5413k2841n1911m1062k7187n0204k8223j6081P27k8872l3480
$$ 1437052 1429541 1404128 1381287 1329376 1288314 1261127 1210923 1182700 1166619 1167346 1138474 1104994
17946A104994j0600l1389j8953k4003k1325l761K683J0924l481k4894K2903L2267
$$ 1104994 1094394 1063005 1044052 1020049 998724 994963 997646 1008570 1005089 980195 1003098 1035365
17934A035365K8511N219K4418L0429N0044J0156J1100K2711J7447M0638O2997
$$ 1035365 1063876 1069095 1093513 1123942 1173986 1184142 1195242 1217953 1235400 1276038 1339035
17923A339035Q5085J28075R4746P8682N6285J9322L0325l3353n1586m9484n1228
$$ 1339035 1424120 1552195 1646941 1725623 1781908 1801230 1831555 1798202 1746616 1697132 1645904
17912A645904o4231m5166m5868l5786l3164n795J1190p739q90n287k4258j5450
$$ 1645904 1581673 1536507 1490639 1454853 1421689 1415894 1427084 1419345 1418455 1413168 1388910 1373460
17900A373460j6717k0104K4492J8971l099K0482K1431O645j736p576Q946M2935
$$ 1373460 1356743 1336639 1361131 1380102 1377003 1397485 1418916 1425561 1423825 1416249 1425195 1468130
17888A468130M9489R1672J10422J08069J67323J90297J63804K29550K39276K12253
$$ 1468130 1517619 1609291 1719713 1827782 1995105 2185402 2349206 2578756 2818032 3030285
17878C030285J77997J27504J45279J49627J23983J41953K17019L09852L96629
$$ 3030285 3208282 3335786 3481065 3630692 3754675 3896628 4113647 4423499 4820128
17869D820128N56478P87611J107955J574621K034126K387912K618112K592027
$$ 4820128 5376606 6164217 7272172 8846793 10880919 13268831 15886943 18478970
17861A8478970K303291K150726J836294O93063p1896O34891J830545L273637N927691
$$ 18478970 20782261 22932987 24769281 25462344 25390448 26025339 27855884 31129521 37057212
17852C7057212J0132740J4762902J8624715K1660009K2016144J9517928J7126308
$$ 37057212 47189952 61952854 80577569 102237578 124253722 143771650 160897958
17845A60897958J3099207Q08758j1159886j2992016j3017958j6418905j6811723
$$ 160897958 173997165 174805923 163646037 150654021 137636063 121217158 104405435
17838A04405435j2386306p837901m789157k846742j602755j056878k294877n265693
$$ 104405435 92019129 84181228 79392071 76545329 74942574 73885696 71590819 66325126
17830F6325126o452108n691877n467861n802658n210582l914202k841228k091286
$$ 66325126 59873018 54181141 48713280 42910622 37700040 33785838 30944610 28853324
17822B8853324j564548j200653r70934p23967m84017k61535n3017K08987N05892
$$ 28853324 27288776 26088123 25117189 24393222 23909205 23647670 23594653 23803640 24309532
17813B4309532J002732J733388K721741L785992M646127N295901N502708N040394
$$ 24309532 25312264 27045652 29767393 33553385 38199512 43495413 48998121 54038515
17805E4038515M533156M216716K701292Q90131K025735N202687Q273773J1169668
$$ 54038515 58571671 62788387 65489679 66379810 68405545 73608232 81882005 93051673
17797I3051673J3981431J6005393J6544812J3007934P341960L244734k404330
$$ 93051673 107033104 123038497 139583309 152591243 159933203 163177937 160773607
17790A60773607j3607849k0066616j7256982j5221279j5974816j4094615r325609
$$ 160773607 147165758 127099142 109842160 94620881 78646065 64551450 55225841
17783E5225841n403955l050696j661210r82984q45902q76868j077013k030321
$$ 55225841 49821886 46771190 45109980 44126996 43281094 42404226 41327213 39296892
17775C9296892k840918k638594k364664k468714k402175j908917j441589j150306
$$ 39296892 36455974 33817380 31452716 28984002 26581827 24672910 23231321 22081015
17767B2081015r42725q01677p08720o23608n53180n06040m61858m73274m75904
$$ 22081015 21138290 20336613 19627893 19004285 18451105 17945065 17483207 17009933 16534029
17758A6534029m41759m75635n18447n03740m48496m41153m43868m10288l94381
$$ 16534029 16092270 15616635 15098188 14594448 14145952 13704799 13260931 12850643 12456262
17749A2456262l56430l32536k98351k68682k43445k94898k75540k52814k38819
$$ 12456262 12099832 11767296 11468945 11200263 10956818 10661920 10386380 10133566 9894747
17740I894747k23038k33096k28609k19081j99166j89531j96583j93854j80129
$$ 9894747 9671709 9438613 9210004 8990923 8791757 8602226 8405643 8211789 8031660
17731H031660j31734j56514j81254j55375q4137p1630p5710j00978j9703J2339
$$ 8031660 7899926 7743412 7562158 7406783 7322646 7251016 7175306 7074328 7054625 7066964
17721G066964l0667m8360m8340o9068j61305j58906j58160j28622r9838j37107
$$ 7066964 7036297 6987937 6939597 6870529 6709224 6550318 6392158 6263536 6163698 6026591
17711F026591j20534j01353j12225r1742p9091p3008q9436q3420j17467j27402
$$ 6026591 5906057 5804704 5692479 5600737 5521646 5448638 5359202 5275782 5158315 5030913
17701E030913r8832j40837j22028j26516j25722p8740j07509j12140p2222n1553
$$ 5030913 4932081 4791244 4669216 4542700 4416978 4338238 4230729 4118589 4046367 3994814
17691C994814o4938r2945j08730n3798m4378q6669l9170l9691o6203m8357l4656
$$ 3994814 3929876 3836931 3728201 3674403 3630025 3543356 3504186 3464495 3398292 3349935 3315279
17680C315279j100j8978j5276j0755o667n621j2658J0505K8538M4665M6581P4236
$$ 3315279 3314179 3295201 3279925 3269170 3262503 3256882 3244224 3254729 3283267 3327932 3374513 3448749
17668C448749Q7923K0800P384l6439n8307q2704r1904j25521p0358n4637p4924
$$ 3448749 3536672 3557472 3564856 3528417 3470110 3387406 3295502 3169981 3099623 3044986 2970062
17657B970062r0689n8590l5979J0621m1713p6781o3611n4202n1867p3070m5388
$$ 2970062 2879373 2820783 2784804 2795425 2753712 2676931 2613320 2559118 2507251 2434181 2388793
17646B388793o7594o6212n8359l5587m9519m0511m3187k4666m1951n2911m6880
$$ 2388793 2321199 2254987 2196628 2161041 2111522 2071011 2027824 2003158 1961207 1908296 1861416
17635A861416j5905Q463j9971n7454n4847l8801k3501l3804o6475l8936R870N175
$$ 1861416 1845511 1853974 1834003 1776549 1721702 1682901 1659400 1625596 1559121 1520185 1530055 1535230
17623A535230k3385k5415j2225l3086j3878r977J9166l7590m13R008k2341r814
$$ 1535230 1511845 1486430 1474205 1441119 1427241 1417264 1436430 1398840 1398427 1407435 1385094 1375280
17611A375280j619j6799L986q156j8951n742R15n725p779J0293Q266M388N1676
$$ 1375280 1373661 1356862 1360848 1352692 1333741 1327999 1328914 1323189 1315410 1325703 1333969 1338357 1390033
17598A390033L6625J4515J9565O9678P6844K2801k9867p626l3767k5360k3381
$$ 1390033 1426658 1441173 1460738 1530416 1607260 1630061 1600194 1592568 1558801 1533441 1510060
17587A510060p8280j44634j36965j11317j03390o0079m1282n3235k3167L1460
$$ 1510060 1431780 1287146 1150181 1038864 935474 875395 834113 780878 757711 789171
17577G89171j5593j7513k9088n921n277n6131k6807j8310k9609j6752n550J8158
$$ 789171 773578 756065 726977 721056 715779 659648 632841 614531 584922 568170 562620 580778
17565E80778R421m218N064J5567k0307K5948M1387j3856k2334P983M5862K6188
$$ 580778 590199 585981 591045 606612 586305 612253 653640 639784 617450 625433 671295 697483
17553F97483Q533J0791K1543Q768R325J1451m346n131J0788M5430N3754J1362
$$ 697483 706016 716807 738350 747118 756443 767894 763548 758417 769205 814635 868389 879751
17541H79751K0186P237J2935j7401j1924n3911r2796q2809r2935n4659n8849j03024
$$ 879751 899937 907174 920109 902708 890784 836873 744077 661268 568333 513674 454825 351801
17529C51801q9021j8663K3435j2437k4427j8879K4747L0653L7526q41k3694J5012
$$ 351801 262780 244117 267552 255115 230688 211809 236556 267209 304735 303894 280200 295212
17517B95212o37l3821l6623L542K54j8502P819j7990O042K2315j1528k8187J8476
$$ 295212 294575 260754 224131 227673 227927 209425 217244 199254 205296 227611 216083 187896 206372
17504B06372K1555J643j0519J7871n056k0923l4093j8650j7200K2308K4675J433
$$ 206372 227927 229570 219051 236922 231866 210943 176850 158200 141000 163308 187983 189416
17492A89416Q367j8922j5676J0242N409J505K1343m871j4123P17n463R895O196
$$ 189416 197783 178861 163185 173427 178836 180341 201684 196813 182690 183407 177944 187839 194035
17479A94035j4604l1043J7589Q371k8825J034o31q782j9559r38k5926j1078J0854
$$ 194035 179431 148388 165977 174348 145523 146557 145926 137144 117585 116647 90721 79643 90497
17466I0497L2953K9913j4389L066j5827k817j0926j2459R094L1552r690j8050
$$ 90497 123450 153363 138974 142040 126213 123396 112470 100011 109105 140657 130967 112917
17454A12917j1027J7168p988k2917j3690J2701J1273J0743K2178L1665k5705j3408
$$ 112917 101890 119058 111070 88153 74463 87164 98437 109180 131358 163023 137318 123910
17442A23910J4735M8973K6502K4330J4122k7513n0418l9216k7592j7908j3514
$$ 123910 138645 187618 214120 238450 252572 225059 174641 135425 107833 89925 76411
17431G6411M860j0925K100o820j5685j3011J9320K4616p939j565J3332o709k7182
$$ 76411 81271 70346 72446 65626 49941 36930 56250 80866 72927 71362 84694 77985 50803
17418E0803k3964J8294K6344j6311R762m529R727J3541J0337j3331j332K412n925
$$ 50803 26839 45133 71477 55166 64928 60399 70126 83667 94004 80673 79341 81753 75828
17405G5828K157J3709K1604k034k2400k0695L525K7986j3198k0537M707L504r210
$$ 75828 77985 91694 113298 111264 88864 68169 71694 99680 86482 65945 70652 74156 64946
17392F4946Q538K8631j8215q590J1391J3850Q256J1494j7463k5409k7425j2455
$$ 64946 73484 102115 83900 75310 86701 100551 108807 120301 102838 77429 50004 37549
17380C7549K22m337J8324L073l314j2677J5860J4703m927J3220j5345k099J6926
$$ 37549 37771 33434 51758 54831 51517 38840 54700 69403 64476 77696 62351 60252 77178
17367G7178j8915L182K012j5588J2227K1883k6236k9004K4402K4982j748J0742
$$ 77178 58263 61445 63457 47869 60096 81979 55743 26739 51141 76123 74375 85117
17355H5117K5519L4440N598L0700O4958M2462Q772L5523N4922L7957K6727K8946
$$ 85117 110636 145076 150674 181374 246332 288794 297566 333089 388011 425968 452695 481641
17343D81641L9355J4371p819J7865j4254j7630j0425K5327L6855K1071K0631P00
$$ 481641 520996 535367 527548 545413 531159 513529 503104 528431 565286 586357 606988 607688
17331F07688n785k3095k6703m4892k8358o5419o9877n6230j7953p460J7263L303
$$ 607688 601903 578808 552105 507213 478855 413436 343559 287329 269376 261916 279179 282482
17319B82482j3546J5269M610k4831l191j5610l1365l0448j9291j950j605j4914
$$ 282482 268936 284205 288815 263984 260793 245183 213818 183370 164079 162129 160524 145610
17307A45610K4577j9080j2163N739J9078P8475O5258J6576K4731L3355K0618O2559
$$ 145610 170187 151107 138944 144683 163761 242236 307494 324070 348801 382156 402774 465333
17295D65333N3660L7882K5766M8088J4646k213k6246o6379n5779k8107l8298j9468
$$ 465333 518993 556875 582641 630729 645375 643162 616916 550537 494758 466651 428353 408885
17283D08885j9033K520N1585L3583J3788K1306M4949J9335P23k6265o6837n8204
$$ 408885 389852 392372 443957 477540 491328 512634 557583 576918 577641 551376 484539 426335
17271D26335q2383n4849l1240j4059l5553m6445j1393r819l3457o583Q323m853
$$ 426335 343952 289103 257863 243804 208251 161806 150413 140594 107137 100554 108877 104024
17259A04024M128n662j8372J4198J1611J837n044j8057l5797J1584L4897j876
$$ 104024 108152 102490 84118 98316 109927 111764 106720 88663 52866 64450 99347 97471
17247I7471q740J1524k110k4669j4910K3691j0404R366j6131K217O241K764p924
$$ 97471 88731 100255 98145 73476 58566 82257 71853 81219 65088 67305 73546 76310 68386
17234F8386m701L068p582L1617J2526j1712j7728q117n854p549l7053J5838P676
$$ 68386 63685 66753 59171 90788 103314 91602 73874 65757 59903 52354 15301 31139 38815
17221C8815k6545n098k73J4568L0630l764j1710k66j1286P259K2241o772j9258
$$ 38815 12270 7172 6899 21467 52097 48333 36623 36357 25071 32330 54571 47799 28541
17208B8541L761J7705o303O61K405j1599m643K0220J9523K0266j2531o265l3608
$$ 28541 32302 50007 43704 44365 46770 35171 30528 50748 70271 90537 78006 71741 38133
17195C8133k7173J0098K311j3590j0953J5908J708K5171O910j8059o145j0957
$$ 38133 10960 21058 23369 9779 -1174 14734 16442 41613 48523 30464 24319 13362
17183A3362k8995N465L430L126J0003L1952K687O080R813k8257j0401K3992q63
$$ 13362 -15633 -10168 -6738 -3612 6391 38343 41030 47110 56923 28666 18265 42257 41394
17170D1394k1828J3689P29J1102m67j5163p729j4913O999J865k5070j3394o196
$$ 41394 19566 33255 33984 45086 44619 29456 21727 6814 13813 15678 -9392 -22786 -28982
17157b8982k050r893K2528J5124k760J0900J8633m177q606n454J354j7397l70
$$ -28982 -31032 -40925 -18397 -3273 -6033 4867 23500 19323 10717 5263 6617 -10780 -11150
17144a1150L2159J0529j0973j553m1387j1642K4978J6997K1229J1944L658k4029
$$ -11150 21009 31538 20565 19012 -22375 -34017 -9039 7958 29187 41131 44789 20760
17132B0760k0714k3789K028Q790J5558K4866k1975K322m1618j5381o394l451O38
$$ 20760 46 -23743 -21715 -12925 2633 27499 5524 7846 -33772 -49153 -55547 -58998 -58360
17119e8360L1207J0362J6402K2356n31j1321J1294r081j3945M017l610O652k631
$$ -58360 -27153 -16791 -389 21967 21436 10115 21409 12328 -1617 2400 -1210 5442 2811
17106B811J9048J3639j1441l5256K698K6472P263O339j7275o433j3393K3522K0958
$$ 2811 21859 35498 24057 -11199 -8501 17971 25234 31573 14298 7865 -5528 17994 38952
17093C8952K3186Q802k2441j5412o911k7579j0774R447L6422R433k8314k1726
$$ 38952 62138 70940 48499 33087 26176 -1403 -12177 -2730 33692 43125 14811 -6915
17081f915k313p703M801O74N690L604K4071K5625j622j8425p107o007j1135o357
$$ -6915 -9228 -16931 -12130 -11456 -5766 -2162 21909 47534 45912 27487 20380 14373 3238 -3119
17067c119K6625j2709R053L629O522q170j7835l3756k2613O789J7456J5455j4017
$$ -3119 23506 10797 19850 23479 30001 21831 3996 -29760 -52373 -45584 -28128 -12673 -26690
17054b6690j5016q132l3603l696K0011L1766K2997p073j9562k1845J9492J0735
$$ -26690 -41706 -49838 -83441 -87137 -67126 -35360 -12363 -19436 -38998 -60843 -41351 -30616
17042c0616J3189l833M655l657k0453j7520J8092J6695K1668J7526K146j6278
$$ -30616 -17427 -21260 -16605 -20262 -40715 -58235 -40143 -23448 -1780 15746 17892 1614
17030A614m8967K4332L5008q077n625K1146j3417k7626L2221L6322n6j8506K5231
$$ 1614 -47353 -23021 11987 3910 -1715 19431 6014 -21612 10609 46931 46875 28369 53600
17017E3600n382j6091J1147K074k9395l8659p227J7958K1825R685O580j8765j5943
$$ 53600 48218 32127 43274 45348 15953 -22706 -29933 -11975 9850 19535 26115 7350 -8593
17004h593l1789LJ856J2386J5876M0031k0072r599J8299K1657J05j1245p096m170
$$ -8593 -40382 -40379 -38523 -26137 -10261 29770 9698 99 18398 40055 40160 28915 21819 17649
16990A7649J1184r677n700j2214J1017o871K3445L7423J451k1582j4916m4019
$$ 17649 28833 19156 13456 1242 12259 5388 28833 66256 67707 46125 31209 -12810
16978a2810k2583J4517j3662j868L6785m049l2189J0254O64q428j872K0673M5728
$$ -12810 -35393 -20876 -34538 -36406 379 -3670 -35859 -25605 -24941 -33369 -35241 -14568 31160
16965C1160K5299l1343l0125L099j3022j1160R845q015m90p523j2879K4851O029
$$ 31160 56459 25116 -5009 -1910 -14932 -26092 -16247 -24262 -24752 -32275 -45154 -20303 -14274
16952a4274j0252n869M046R558l680j4528o529K2306J4282J12K69o313n268K8291
$$ -14274 -24526 -30395 -26349 -16791 -20471 -34999 -41528 -19222 -4940 -4828 -4559 -10872 -16140 12151
16938A2151o75n096o975J379o859k434J5651K6910j0146k1401j2973N076J8428
$$ 12151 11476 6380 -595 784 -6075 -8509 7142 34052 23906 2505 -10468 -5392 13036
16925A3036J0585k628m3962L050j0620l8242N4K1499L770O280P968M273K0590
$$ 13036 23621 20993 -22969 -19919 -30539 -68781 -68727 -47228 -43458 -37178 -29210 -24937 -4347
16912d347K9628K4550k1359k4221j1419j9160m634N510O097N336m984Q375m104
$$ -4347 25281 49831 28472 4251 -7168 -26328 -30962 -25452 -19355 -14019 -19003 -10628 -14732
16899a4732j0538q610R821J3417j316J2312r591j6192o807N24Q615J5560k4225
$$ -14732 -25270 -33880 -24059 -10642 -11958 354 -9237 -25429 -32236 -31712 -23097 -7537 -31762
16886c1762R544J6269J9051m476L43k3076Q400j0825k8802J1946M1996M872J471
$$ -31762 -22218 -5949 13102 8626 8969 -14107 -5707 -16532 -45334 -33388 8608 13480 14951
16873A4951Q864k182l1756M260J922K1347j3425j8095L2492N134M97j0057R68
$$ 14951 23815 21633 -10123 -5863 -3941 17406 3981 -14114 18378 23512 24009 13952 14920
16860A4920j2842j3956m039K8598j4147q074J6551o680m4095o905K5000K0915
$$ 14920 2078 -11878 -15917 12681 -1466 -9540 7011 331 -43764 -50669 -25669 -4754
16848d754m878J9947J9360J966k4149l2419J061J3938l086Q825K3115q797l4051
$$ -4754 -9632 10315 29675 31641 7492 -24927 -23866 -9928 -13014 -4189 18926 10129 -23922
16835b3922J272m344j3591r653K7000L9828N255p824P827j4215j6780k6807m997
$$ -23922 -22650 -26994 -40585 -50238 -23238 16590 21845 14021 21848 7633 -9147 -35954 -40951
16822d0951J9090O541J9711K2532J601j7456j4341R080k3926j1630L397K8698
$$ -40951 -21861 -15320 4391 26923 28524 11068 -3273 5807 -18119 -29749 -26352 2346
16810B346l547K547J0509M533L675P225r986k7446k7406K776q694q375P414J5419
$$ 2346 -1201 1346 11855 16388 20063 27288 17302 -10144 -37550 -34774 -43468 -51843 -44429 -29010
16796b9010r978J6510J6231n51L607N345j6078k4085K4661J7194m621J3455k5027
$$ -29010 -38988 -22478 -6247 -6798 -3191 2154 -13924 -38009 -13348 3846 -775 12680 -12347
16783a2347N374K3976J2554l2496m454K6808l278j2391K5724J2765J5919M295
$$ -12347 -6973 17003 29557 -2939 -7393 19415 16137 3746 29470 42235 58154 62449
16771F2449k1414j4437k6822j8339K4436L980k6378J402L0856j3814j2768K1604
$$ 62449 41035 26598 -224 -18563 5873 9853 -16525 -15123 15733 1919 -10849 10755
16759A0755j7351j4837P52J240M646J0948K6569K06l0772l089K8796L634j7505
$$ 10755 -6596 -21433 -20681 -19441 -14795 -3847 22722 22928 -7844 -10933 17863 21497 3992
16746C992K1936j6030p979N917J5905J083j0480J516k2843j9134j1932M4338J3774
$$ 3992 25928 9898 1919 7836 23741 24824 14344 15860 -6983 -26117 -38049 6289 20063
16733B0063R700o572M20J2349j996k2923m8005J288L3614N642o012m109p806R070
$$ 20063 29763 23191 23611 35960 33964 11041 -36964 -35676 -2062 3580 -2432 -6541 -14347 -5277
16719e277J0956k1754j798J8169J119m572N692K2668J4942m1460n8286l6444J5066
$$ -5277 5679 -16075 -17873 296 1415 -3157 2535 25203 40145 -1315 -59601 -96045 -80979
16706h0979K2571K4727L4403K2414m336l0063l5305K65J1218R569K4621J8744
$$ -80979 -58408 -33681 722 23136 18800 -11263 -46568 -46303 -35085 -25516 -895 17849
16694A7849j9367k2301j4233j9702J6807J0542K1213O467j6939j9720K1167q265
$$ 17849 -1518 -23819 -38052 -57754 -40947 -30405 -9192 -2725 -19664 -39384 -18217 -26482
16682b6482p625m034j3173K6797M1082J1528k9720j3095K4079O386j9927l1410
$$ -26482 -34107 -38141 -51314 -24517 16565 28093 -1627 -14722 9357 15743 -4184 -35594
16670c5594o447J9431P145J9037J5647j2114l576K120p567p869m1743N439N1611
$$ -35594 -42041 -22610 -15465 3572 19219 7105 3529 5649 -1918 -9787 -51530 -46091 5520
16657E520M374k6287p214J1550L2086l1640l07K3318J6275J4045j4701k6357j5735
$$ 5520 9894 -16393 -23607 -12057 20029 -11611 -11918 11400 27675 41720 27019 662 -15073
16644a5073R119K2580J0340j9433J3054j2414J0757j7275k1047J8663J8660j1753
$$ -15073 -5954 16626 26966 7533 20587 8173 18930 1655 -19392 -729 17931 6178
16632F178J5634K1769j6934j5537j9564r330k244M540p679M279K5839J5073l9377
$$ 6178 21812 43581 26647 11110 -8454 -17784 -20028 -15488 -23167 -18888 6951 22024 -17353
16619a7353R67K082j1393K3646K3446J3278m155Q944j7596j4438j3952q359j8669
$$ -17353 -16386 -14304 -25697 -2051 21395 34673 30518 39462 21866 7428 -6524 -14883 -33552
16606c3552k7380j0429M2465p347j1562J249R432K8094J9416l29k5943M540j656
$$ -33552 -60932 -71361 -28896 -36243 -47805 -46556 -37124 -9030 10386 10057 -15886 -11346 -13002
16593a3002p321J149R938P210K5307k018j1201n288K159j1694j3119k26j0590
$$ -13002 -20323 -19174 -9236 -2026 23281 21263 10062 4774 6933 -4761 -17880 -18106 -28696
16580b8696M821r720O98J4210J5339J5067j7647j3661n34K5833J8193q607n31
$$ -28696 -23875 -33595 -32897 -18687 -3348 11719 -5928 -19589 -20123 5710 23903 15296 14765
16567A4765J260m5494m925J9014J6911R506p549j105O221J8408k5437R637J7369
$$ 14765 16025 -29469 -34394 -15380 1531 11037 3488 2383 8604 27012 1575 11212 28581
16554B8581J1005j9615k1577o058l51r662R99o812M155K3549K865J9946P361l5958
$$ 28581 39586 19971 -1606 -7664 -8015 -17677 -16678 -23490 -19335 4214 7079 27025 34386 -1572
16540a572J0238M7864j8045m0071r282j4799r552J746J2880J0918k2980j7383
$$ -1572 8666 56530 38485 -1586 -10868 -25667 -35219 -33473 -20593 -9675 -32655 -50038
16528e0038q121K7858J7573j5496j6885j0398K1543J6159L105j0932N939k2579
$$ -50038 -58159 -30301 -12728 -28224 -45109 -55507 -33964 -17805 -14700 -25632 -19693 -42272
16516d2272J029K0453P60k8787j6876o232K0067K9141J2368M521n459J5984K064
$$ -42272 -41243 -20790 -20030 -48817 -65693 -71925 -51858 -22717 -10349 -5828 -11287 4697 6761
16503F761L9475l064j476j8510M943K3255J550j5983m2159j3103l009K1787l586
$$ 6761 46236 43172 41696 23186 28129 51384 52934 36951 -5208 -18311 -21320 467 -3119
16490c119Q626j9871o781k6899K855M2242p856l506j498j1346o407p354J0428
$$ -3119 5507 -14364 -21145 -48044 -45189 -2947 -10803 -14309 -15807 -27153 -33560 -40914 -30486
16477c0486O780K8054J2301k7556k398l2739j9274K0539K6654j3844J9394J9231
$$ -30486 -23706 4348 16649 -10907 -13305 -46044 -65318 -44779 -18125 -31969 -12575 6656
16465F656J967k1944j1407J187J657J2728J5239Q055m2842n901M873J9705j2859
$$ 6656 8623 -13321 -24728 -23541 -21884 -9156 6083 14138 -28704 -34605 -29732 -10027 -22886
16452b2886m4416R426L5387K4791j1187N829K1270n002m2008j7848J1147j0068
$$ -22886 -67302 -57876 -22489 2302 -8885 -3056 18214 13212 -28796 -46644 -35497 -45565
16440d5565N289M4122J2120n452j3742j0258M966J0704j203j9321j2225j7953
$$ -45565 -40276 3846 15966 10514 -3228 -13486 -8520 2184 981 -18340 -30565 -48518
16428d8518r084J771J9693J0518J8918J5335j0302o569Q16J6544j0141q545M703
$$ -48518 -57602 -55831 -36138 -25620 -6702 8633 -1669 -8238 -7422 9122 -1019 -9564 -4861
16415d861j4901k1443K9302R914m0543k5894Q854L3521K0051l4051l0699k3129
$$ -4861 -19762 -41205 -11903 -1989 -42532 -68426 -59572 -26051 -6000 -40051 -70750 -93879
16403i3879J0124K3238Q619j1814q9K2274J7957R431J3267J3620O405L249J9326
$$ -93879 -83755 -60517 -51898 -63712 -63801 -41527 -23570 -14139 -872 12748 19153 22402 41728
16390D1728J303J0462k7601q432o623K0042j1790l8902j69L0092m848k6301j0561
$$ 41728 43031 53493 25892 17460 10837 30879 19089 -19813 -19982 10110 5262 -21039 -31600
16377c1600j3274N146L243J5234K6715p525K5021Q274m232N626L784J35M940q525
$$ -31600 -44874 -39728 -36485 -21251 5464 -2061 22960 31234 27002 32628 36412 36547 41487 32962
16363C2962J4461j5370j501l0740r228O483l090j8882Q734k8086N194P238J5032
$$ 32962 47423 32053 30552 -188 -9416 -2933 -6023 -24905 -16171 -44257 -39063 -31825 -16793
16350a6793K2433J1098M835n552J4892O148p065j6555q951j7388K6186K8245n183
$$ -16793 5640 16738 21573 16021 30913 37061 29996 13441 4490 -12898 13288 41533 36350
16337C6350j6003k635M954P6l3293N009J8627o942o005p039j5845j1575K8228
$$ 36350 20347 17712 22666 22742 -10551 -5542 13085 6143 138 -6901 -22746 -34321 -6093
16324f093P882k4153P324K1201O623k2772N913Q035p1k2213j5572J4054r639L586
$$ -6093 1789 -22364 -15040 6161 12784 -9988 -4075 3960 3889 -18324 -33896 -19842 -29481 -25895
16310b5895L480j9768R046R917R979K3096r087l4592k1181N616j0426n35P54R430
$$ -25895 -22415 -42183 -33137 -23220 -13241 9855 768 -33824 -55005 -49389 -59815 -60350 -59596 -50166
16296e0166J7676J6863K3332n161m4930k9202l910M0672K1150Q302l0239j1123
$$ -50166 -32490 -15627 7705 2544 -42386 -71588 -75498 -34826 -13676 -5374 -35613 -46736
16284d6736N836K8824P950K671K337R122j4308j3476q998j6172m117q16J6398
$$ -46736 -40900 -12076 -4126 -1455 882 10004 -4304 -17780 -26778 -42950 -47067 -47883 -31485
16271c1485N8912J8871k6670j5562k0505K2184J849j6312J5351K1103R205j4392
$$ -31485 27427 46298 19628 4066 -16439 5745 7594 -8718 6633 27736 36941 22549
16259B2549N253n785j1735N273N20K301j0080q794N878J1360L112l0071l3113
$$ 22549 27802 22017 10282 15555 16075 18376 8296 -498 5380 16740 19852 -10219 -43332
16246d3332L9149M3434j0628q414m23K281l039j5047j2664j438J5654J2921n897
$$ -43332 -4183 39251 28623 20209 19786 22067 19028 3981 -8683 -10121 5533 18454 12557
16233A2557k5440J3526k2453j579o025n659m822j972p273l058j0753J4879K8593
$$ 12557 -12883 643 -21810 -23389 -29414 -35073 -39895 -41867 -49140 -52198 -62951 -48072 -19479
16220a9479r657j2002Q430K2938L08l373j4663J8951k269k1941K5876J5643j3260
$$ -19479 -29136 -41138 -32708 -9770 -9462 -12835 -27498 -8547 -10816 -32757 -6881 8762 -4498
16207d498j6216q740K0119K8010p851q497k2412k0091j581p959J5497J0998J0794
$$ -4498 -20714 -29454 -9335 18675 10824 2327 -20085 -40176 -41757 -49716 -34219 -23221 -12427
16194a2427k789L89O072j8929l573J5125j7294k2538M1142L8381j240j0123k5901
$$ -12427 -15216 -14827 -8755 -27684 -31257 -16132 -33426 -55964 -14822 23559 22319 12196 -13705
16181a3705K079J5479R050p112K223l5223l2625j1740K8536K180k0942J1324J4682
$$ -13705 -11626 3853 12903 5791 8014 -27209 -59834 -71574 -43038 -40858 -61800 -50476 -35794
16168c5794J3304j4726Q320K1583k241j3534j7010K1137M8143K4052j3387Q18
$$ -35794 -22490 -37216 -28896 -7313 -9554 -23088 -40098 -18961 29182 53234 39847 40665
16156D0665N976J602l9700k6017k1153P215j2944j8830M916K79K5822O067j7911
$$ 40665 46641 48243 8543 -17474 -38627 -31412 -44356 -63186 -58270 -57991 -32169 -26102 -44013
16143d4013j5174k0046j6842m377L1384K5840K721K6804q862j4340q122r698Q598
$$ -44013 -59187 -79233 -96075 -100452 -69068 -43228 -40507 -13703 -22565 -36905 -45027 -54725 -46127
16130d6127K1649n393K3833R86K245Q76l735l0722J6451L482l93n457Q354J7005
$$ -46127 -24478 -29871 -6038 -5052 -2807 -1931 -5666 -36388 -19937 -16455 -16848 -22305 -13951 3054
16116C054p706r698N75K1240Q051k1045p450o956l3007J2565M9885R892l9703
$$ 3054 -4652 -14350 -13775 7465 15516 -5529 -12979 -19935 -52942 -40377 9508 19400 -20303
16103b0303M162J1923k1596J2760K0243N757p656l090K2377q867q359J5650k493
$$ -20303 -16141 -4218 -25814 -13054 7189 12946 5290 2200 24577 15710 7351 23001 20508
16090B0508k1252m997k7492k3677J3262N846L29j941n602l367M919J2680N569
$$ 20508 -744 -5741 -33233 -56910 -43648 -37802 -37473 -39414 -45016 -48383 -43464 -30784 -25215
16077b5215Q778Q564R966l4389L697N770J4160J8463P391k1017m891J2433J3522
$$ -25215 -16437 -7873 2093 -32296 -28599 -22829 -8669 9794 17185 -3832 -8723 3710 17232
16064A7232l6209J8101j2197J0949j7867j7136N315J7814K0395P313j7403k0214
$$ 17232 -18977 -876 -13073 -2124 -19991 -37127 -31812 -13998 6397 13710 -3693 -23907
16052b3907J995L628n316j3289r654Q448m850N461J5205j0840r334J6482J1424
$$ -23907 -21912 -18284 -23600 -36889 -46543 -38095 -42945 -37484 -22279 -33119 -42453 -25971 -14547
16039a4547J1444N062j6533j2276k410n270L6693K1803k9868j7793q32J775J0431
$$ -14547 -3103 1959 -14574 -26850 -29260 -34530 2163 23966 -5902 -23695 -24527 -22752 -12321
16026a2321K1814k5042k3137L690J7949K4826J0154j5316M38J9313j6483j1165
$$ -12321 9493 -15549 -38686 -34996 -17047 7779 17933 2617 3055 22368 5885 -5280
16014e280J2719k4185k8462J7543o271k2615j5154J1910N094K3654M1409Q636
$$ -5280 7439 -16746 -45208 -27665 -33936 -56551 -71705 -59795 -54701 -31047 10362 18998
16002A8998R685n706m9685m469K3698l2536R339L5024j777k969p865q551P842
$$ 18998 28683 22977 -26708 -31177 -7479 -40015 -30676 4348 2571 -398 -8263 -16814 -8972
15989h972J4879J9586j2422j994R740l627j9417l415J6955K1880J081m5310l0112
$$ -8972 5907 25493 13071 11077 20817 17190 -2227 -5642 11313 33193 34274 -11036 -41148
15976d1148k8132K6154M6937O492j4037p857J3248k13L688O091q722j5281k0771
$$ -41148 -69280 -43126 3811 10303 -3734 -11591 1657 1444 5132 11223 2501 -12780 -33551
15963c3551J3821R921O039K0683J489j6602j2155N739J815K065r194O888Q58p228
$$ -33551 -19730 -9809 -3770 16913 18402 1800 -10355 -4616 -2801 -736 -9930 -3042 -2184 -9412
15949i412J9558J7187j0552j9532J2455N884j9666r543K3352L420j5748j2999
$$ -9412 10146 27333 16781 -2751 9704 15588 -4078 -13621 9731 13151 -2597 -15596
15937a5596q365K445P292K5013n696L441J9378Q794J737q839j0800j3850q060
$$ -15596 -23961 -21516 -14224 10789 5093 8534 27912 36706 38443 29604 18804 4954 -3106
15924c106K3940J7040j9026n831k6630J3250k1382k3864j7555M1675L4495K366
$$ -3106 20834 37874 18848 13017 -13613 -363 -21745 -45609 -63164 -21489 13006 15372
15912A5372k3705J0968L3115m3979j8659N912L228l790L5826J6795k3152j2921
$$ 15372 -8333 2635 35750 -8229 -26888 -20976 -17748 -21538 14288 31083 7931 -4990
15900d990K3752K399l7702j3518K2496J0350k0681l168K456L477J0729N900j799
$$ -4990 18762 21161 -16541 -30059 -7563 2787 -17894 -21062 -18606 -15129 -4400 1500 -299
15887b99l4431k1872n341K3780K1531M806k037O889p33J1066j1184o533j4470
$$ -299 -34730 -56602 -61943 -38163 -16632 -11826 -13863 -6974 -7707 3359 -7825 -14358 -28828
15874b8828l0767K4888J0119K866k5843J6806M1643J4387L4999j7436k0139N924
$$ -28828 -59595 -34707 -24588 -21722 -47565 -30759 10884 25271 60270 42834 22695 28619
15862B8619j8765r706j3558M66J43J5806K0110K3192l5620k8759J4003L225p621
$$ 28619 9854 148 -13410 -12944 -12801 3005 23115 46307 10687 -18072 -4069 -844 -8465
15849h465m2059j6768J1514J6822J7723K8219j6784o184K967q760o955p108K3394
$$ -8465 -50524 -67292 -55778 -38956 -21233 6986 -9798 -15982 -13015 -21775 -28730 -35838 -12444
15836a2444J3513J6059P077o215k812L3532K3600m2516l4349j4418j7821k2503
$$ -12444 1069 17128 24205 17990 15178 48710 72310 29794 -4555 -18973 -36794 -59297
15824e9297K22K7272O4840J9083q062j9979k1102N763m11m172r123R028j476o534
$$ -59297 -59075 -31803 33037 52120 44058 24079 2977 8740 8329 4157 -4966 4062 2586 -3948
15810c948r340l143K030j986k9952L5535J3877j0478R638p585j982K0810p844
$$ -3948 -13288 -16431 -14401 -16387 -46339 -10804 3073 -7405 2233 -5352 -7334 13476 5632
15797E632m1152j0023K0008L778N933J2280K8843R778j4817k7466o159J4368O628
$$ 5632 -35520 -45543 -25535 -21757 -15824 -3544 25299 35077 20260 -7206 -13365 1003 7631
15784G631m225m073k5704j5152J9673L4525j1736j3295j0444J2947R807N125n184
$$ 7631 3406 -667 -26371 -41523 -21850 12675 939 -12356 -22800 -9853 -46 5079 -105
15771a05O723J7453L427k3741l151o348L409J2985j4697r6q772m229j3400l0693
$$ -105 6618 24071 27498 3757 606 -5742 -2333 10652 -4045 -4141 -12913 -17142 -30542 -61235
15757f1235Q783J5410J3032J1942l334k2889J6769J4439K246L858Q398R310k683
$$ -61235 -52452 -37042 -24010 -12068 -15402 -38291 -21522 -7083 -4837 -979 7419 16729 14046
15744A4046j6797j9692J6180J8707k1816q708J6102J1884j451q094j6828K5022
$$ 14046 -2751 -22443 -6263 12444 -9372 -18080 -1978 9906 8455 361 -16467 8555
15732H555j9439l3116J745K4089J2701k4648K3760K7462j9081k6273J6403L5379
$$ 8555 -10884 -44000 -42255 -18166 -5465 -30113 -6353 21109 2028 -24245 -7842 27537
15720B7537Q091K0891l893m0761l1104M724k0834r118j259K5349K9623K696P455
$$ 27537 35628 56519 52626 11865 -19239 -14515 -35349 -44467 -45726 -20377 9246 11942 19397
15707A9397M82m4784j1983J6793M055j015J7940k1874O762J784M054J8671J4195
$$ 19397 19879 -24905 -36888 -20095 -16040 -17055 885 -20989 -14227 -12443 -8389 10282 24477
15694B4477k0957q023L957K0945R7J1618j5405p024j8146M946L6679q924j7091
$$ 24477 3520 -4503 -546 20399 20496 32114 16709 9685 -8461 -3515 33164 24240 7149
15681G149N160q799k0650O281r902L2243K4438j0902m0760k6268J2382K3669k696
$$ 7149 12309 3510 -17140 -10859 -20761 11482 35920 25018 -15742 -42010 -29628 -5959 -8655
15668h655j0996q446q426k422P251J7567N246O777L305L512k623r765k2227o749
$$ -8655 -19651 -28097 -36523 -38945 -31694 -14127 -8881 -2104 1201 4713 2090 -7675 -29902 -36651
15654c6651J1310L847r853K803R730P181O66N420m200j1251N698K1959q58j3889
$$ -36651 -25341 -21494 -31347 -28544 -18814 -11633 -10967 -5547 -9747 -20998 -15300 6659 5801 -8088
15640h088j9859l220J5085M7311j423l4559j0335K8723j1918j0848O137k6822
$$ -8088 -27947 -31167 -16082 31229 29806 -4753 -15088 13635 1717 -9131 -2994 -29816
15628b9816j9475p279J2778M7798L89p82r911O611p580K1570Q109j017j6025O983
$$ -29816 -49291 -56570 -43792 4006 4395 3613 -6298 313 -7267 14303 22412 21395 5370 12353
15614A2353j0890j8434K0504k0227l2880O360K9237N315J1466j2692j1540j8397
$$ 12353 1463 -16971 3533 -16694 -49574 -43214 -13977 -8662 2804 -9888 -21428 -39825
15602c9825M7350J9261l2610k1835J1833J3657j5581j6568k0619J5917l08r199
$$ -39825 7525 26786 -5824 -27659 -15826 -2169 -17750 -34318 -54937 -39020 -39328 -48527
15590d8527M465L0403J097J4719r740j891J5088j4386Q773j7697J583J7145k0289
$$ -48527 -44062 -13659 -12562 2157 -7583 -9474 5614 -8772 1 -17696 -16113 1032 -19257
15577a9257J198k2K6244K3859N681j8447J1711m31R201r489p993j9170k5406K7331
$$ -19257 -18059 -18081 8163 32022 37703 19256 30967 30536 39737 30248 22255 3085 -22321 5010
15563E010J3165j6249l898p20M817j2904L691J4251J8501Q890m365p795j7512
$$ 5010 18175 1926 -1972 -2692 2125 -10779 -7088 7163 25664 34554 30189 22394 4882
15550D882j05L0723J0301k8221k5117k4992J421L5196j6192k1977l387j0890j9752
$$ 4882 4777 35500 45801 17580 -7537 -32529 -31108 4088 -12104 -34081 -37468 -48358 -68110
15537f8110P165L1261L0519j0868J561J5046J2514n557Q20J70J5081J9609k1818
$$ -68110 -60945 -29684 835 -10033 -8472 6574 19088 13531 14351 14521 29602 49211 27393
15524B7393l75J843r933o160k3583l4753j2425L2316P215q272m873N811L4005
$$ 27393 27018 28861 18928 12768 -10815 -45568 -57993 -25677 -18462 -26734 -31607 -25796 8209
15511H209m768l4242M201K8067J120k4164j1045J4529K3211p317q910k9907j0030
$$ 8209 3441 -30801 -26600 1467 2587 -21577 -32622 -18093 5118 -2199 -11109 -41016 -51046
15498e1046K0888J6625j7791J0728J4948m0098k0080K7177P098O580j3008J5022
$$ -51046 -30158 -13533 -31324 -20596 -5648 -45746 -65826 -38649 -31551 -24971 -37979 -22957
15486b2957j194p695K0448M23M643m158n394j1052j2368P065M29m727j678j4798
$$ -22957 -24151 -31846 -11398 -10975 -6332 -10490 -15884 -26936 -39304 -32239 -31810 -36537 -38215 -53013
15472e3013J7036J660j3734R177m594K030J7112J9453J1367N604J4152j3798o219
$$ -53013 -35977 -34317 -48051 -38874 -43468 -41438 -24326 -4873 6494 12098 26250 12452 6233
15459F233m430K29n231j5929m4099j4396L0031K9011P643n04M306K608K253j2221
$$ 6233 1803 2032 -3199 -19128 -63227 -77623 -47592 -18581 -10938 -11442 -7136 -4528 -2275 -14496
15445a4496m90J4552K3960J6043j2538l0429m895O367J6901k041j6513J9366J240
$$ -14496 -14986 -434 23526 39569 27031 -3398 -8293 -1926 14975 12934 -3579 15787 17027
15432A7027m982j8008k8515q127K0381m753m982o505N278L4738q221k2132j3280
$$ 17027 12045 -5963 -34478 -42605 -22224 -26977 -31959 -38464 -33186 1552 -6669 -28801 -42081
15419d2081N769L1085K8214k9477j2702k0483J6691J9574Q584N269k7134l848
$$ -42081 -36312 -5227 22987 -6490 -19192 -39675 -22984 -3410 5174 10443 -16691 -20539
15407b0539r559j4039r410m31N809J8133L517k2122K420K2461K2373j0112l6287
$$ -20539 -30098 -44137 -53547 -53978 -48169 -30036 -26519 -48641 -46221 -23760 -1387 -11499 -47786
15394d7786K5250M2021k0327m1283J5313J1150Q817k3298j4084J635K6842K1067
$$ -47786 -22536 19485 -842 -42125 -26812 -15662 -6845 -30143 -44227 -42592 -15750 5317
15382E317j2644k0188m230P274K8880J2196q266l9801j0007J2933Q953p104n020
$$ 5317 -7327 -27515 -31745 -24471 4409 16605 8339 -31462 -41469 -28536 -19583 -26687 -31707
15369c1707j9798r968J018m264K2723J3873O701p892O361j4199P78O021K6583
$$ -31707 -51505 -61473 -60455 -64719 -41996 -28123 -21422 -29314 -22953 -37152 -36374 -30353 -3770
15356c770J7865J068k8603j98j9659j2840J3169k90o099K4099N814J3246j0855
$$ -3770 14095 15163 -13440 -13638 -33297 -46137 -32968 -33258 -39357 -15258 -9444 3802 -7053
15343g053k6746K4398J0244J7945n073m8030j6365K78J9949L1708K0440k5789
$$ -7053 -33799 -9401 843 18788 13715 -34315 -50680 -50402 -30453 1255 21695 -4094
15331d094j6252O334k3070r840q556L968P651K9107L0674O915m408P84k583q986
$$ -4094 -20346 -14012 -37082 -46922 -55478 -51510 -43859 -14752 15922 22837 18429 19213 16630 7644
15317G644q616O895L145k8749J043P420J3767K2210J0272j9621J5317k8944j5230
$$ 7644 -972 5923 9068 -19681 -18638 -11218 2549 24759 35031 15410 30727 1783 -13447
15304a3447J3069K0587j2677j1368q952j9404n348r987K3599J4882J7057J1529
$$ -13447 -378 20209 7532 -3836 -12788 -32192 -37540 -47527 -23928 -9046 8011 19540
15292A9540J9988k4186j8311o909K7680J0811m0391j6983O192M87J0001K1095
$$ 19540 39528 15342 -2969 -9878 17802 28613 -11778 -28761 -22569 -22082 -12081 9014
15280I014j4606j5783q458j0107m919q436k89J1121L1750J8038k6668l2438K0787
$$ 9014 -5592 -21375 -29833 -39940 -44859 -53295 -53584 -42463 -10713 7325 -19343 -51781 -30994
15267c0994J8474K0257J6807k5725j0395O822K0616Q556K7817k1333k8421N92
$$ -30994 -12520 7737 24544 -1181 -11576 -4754 15862 24418 52235 30902 2481 3073
15255C073p510k751O659j2532M0412j2646j1462p869k1158r599M854O238J1765
$$ 3073 -4437 -7188 -529 -13061 27351 14705 3243 -4626 -25784 -35383 -30529 -24291 -12526
15242a2526l169J1108q606r877J9920J4603j955J164j3866j3281n384j2744k3944
$$ -12526 -15695 -4587 -13193 -23070 -3150 11453 9498 10662 -3204 -16485 -21869 -34613 -58557
15229e8557j07M2793L5523j498l3357M145l986m080k7890j82O246q879j8206N063
$$ -58557 -58664 -15871 19652 18154 -15203 -11058 -15044 -19124 -47014 -47196 -40950 -49829 -68035 -62972
15215f2972J3221j0020Q845K7379J3504l010j4940o509j4463q520N93J1856K3330
$$ -62972 -49751 -59771 -50926 -23547 -10043 -13053 -27993 -34502 -48965 -57485 -56892 -45036 -21706
15202b1706j7175j3325O343R657R746J8657O098K2964Q263j9200l2693K2260J0128
$$ -21706 -38881 -52206 -45863 -36206 -26460 -7803 -1705 21259 29522 10322 -22371 -111 10017
15189A0017j3308K5415j2319J418j5905k6898l445J5599J229l154N230O393l0777
$$ 10017 -3291 22124 9805 11223 -4682 -31580 -35025 -19426 -18197 -21351 -16121 -9728 -40505
15176d0505k4171J0641K2651K1787p723l0549j5020J01J0810K4764j352j0675
$$ -40505 -64676 -54035 -31384 -9597 -17320 -47869 -62889 -62788 -51978 -27214 -28566 -39241
15164c9241n823Q868J727J3387m415J6490J6909k3468k206j990q763j851M6413
$$ -39241 -45064 -36196 -34469 -21082 -25497 -9007 7902 -15566 -17772 -19762 -28525 -30376 16037
15151A6037J9950Q14k5928j8341j7795j9402j2989J0062K383J9303R686J1472
$$ 16037 35987 36801 10873 -7468 -25263 -44665 -57654 -47592 -45209 -25906 -16220 -4748
15139d748j0826k5588k4828J6670M1472L0060j1846j0856m48Q690j6737j7218
$$ -4748 -15574 -41162 -65990 -49320 -7848 22212 10366 -490 -938 7752 -8985 -26203
15127b6203J7380o375l6248M117J4704M2865J4201L222j0189j4891j0090j1603
$$ -26203 -8823 -15198 -51446 -47329 -32625 10240 24441 27663 17474 2583 -7507 -19110
15115a9110J8936R256Q618m0194k0891K994q518J7186L5651Q105o282J6012j071
$$ -19110 -174 9082 17700 -22494 -43385 -40391 -48909 -31723 3928 12033 5751 21763 20692
15102B0692l3156j0352N94K4620k3105k1072r261O516J2291O089L9232J6811o748
$$ 20692 -12464 -22816 -22222 2398 -20707 -41779 -51040 -44524 -32233 -26144 13088 29899 23151
15089B3151P04j7258j4854j0112m058q415k7084J3880M935N561K6982j9723j4153
$$ 23151 23855 6597 -8257 -18369 -22427 -30842 -57926 -44046 -39111 -33550 -6568 -26291 -40444
15076d0444M420J0431j6890r347R324n611q045j1279K482J4033j794j643J3282
$$ -40444 -36024 -25593 -42483 -51830 -42506 -48117 -56162 -67441 -64959 -50926 -52720 -54363 -41081
15063d1081rj1795M078Q612j2934K705o598Q570J6695q348J3107L4809p107m1521
$$ -41081 -41090 -52885 -48807 -40195 -53129 -50424 -57022 -48452 -31757 -40105 -26998 7811 704 -40817
15049d0817j6857M846K9503L5806J1121n530j2576l1507K675K1697l251J507l060
$$ -40817 -57674 -52828 -23325 12481 23602 18072 5496 -26011 -23336 -1639 -4890 -3383 -6443
15036f443j8227j824k0455j1840O811Q022J0174l271J590M618O89M5118o768j9809
$$ -6443 -24670 -26494 -46949 -58789 -51978 -43956 -33782 -37053 -35463 -30845 -30156 14962 8194 -11615
15022a1615K6102j3794k4112J0193N536R229K8002J7234j0790J8570r4j8729k1928
$$ -11615 14487 693 -23419 -13226 -7690 1539 29541 46775 35985 54555 54461 35732 13804
15009A3804k226j3176m576J2663k926R978K2177J7842k3653j7864j8153n261j5733
$$ 13804 11578 -1598 -6174 6489 3563 13541 35718 53560 29907 12043 -6110 -11371 -27104
14996b7104J7534J791j2177J7693L168R137Q013k8717M403M483j596j3291N70
$$ -27104 -9570 -7779 -19956 -2263 905 10042 18055 -10662 -6259 -1776 -3372 -16663 -16093
14983a6093n130m215K173J447k2906j7101J0789P605J1646r720q087r031R62j5307
$$ -16093 -21223 -25438 -23265 -21818 -44724 -61825 -51036 -43431 -31785 -41505 -49592 -58623 -57661 -72968
14969g2968q413K060Q4o608J1632L4308P545j7388K7337k488o337Q929M154J8503
$$ -72968 -81381 -79321 -79237 -85845 -74213 -39905 -32360 -49748 -22411 -24899 -31236 -22307 -18153 350
14955C50Q445k0081o636n898K3856j3384k4437r166o313J057j8473Q392K4884
$$ 350 8795 -11286 -17922 -23820 36 -13348 -37785 -46951 -53264 -52207 -70680 -62288 -37404
14942c7404r121J356J6229l527o955k1668J311J7293j3603N274K1721n118k3202
$$ -37404 -46525 -45169 -28940 -32467 -39422 -61090 -59779 -42486 -56089 -50815 -29094 -34212 -57414
14929e7414J6295K6348K5909p797m369N037j8321l913J1563K9298j6j6258J2055
$$ -57414 -41119 -14771 11138 3341 -1028 4009 -14312 -18225 -6662 22636 22620 6362 18417
14916A8417q436j3893j3025L2286k7175n2244k0915Q179J6986k684J8058J1883
$$ 18417 9981 -3912 -16937 15349 -11826 -64070 -84985 -76806 -59820 -62504 -44446 -32563
14904c2563K4137R586K7727l279n1021k4528Q441L7552R381l0985j0384l261Q434
$$ -32563 -8426 1160 28887 25608 -25413 -49941 -41500 -3948 5433 -25552 -35936 -39197 -30763
14891c0763R128L0251R38j479j4641q608N957J729j2367o857k6561q102J5858
$$ -30763 -21635 8616 9554 8075 -6566 -15174 -9217 -7488 -19855 -26712 -53273 -61375 -45517
14878d5517O69J6568M2226Q00l960j6082L87p613k2302n064J8993J4327r345q226
$$ -45517 -44848 -28280 13946 14746 10786 -5296 -4909 -12522 -34824 -39888 -20895 -6568 -15913 -24139
14864b4139K0663j3450k0896k8008J5583L8293j9412k5624P905K2046j1794j7248
$$ -24139 -3476 -16926 -37822 -65830 -50247 -11954 -31366 -56990 -49085 -27039 -38833 -56081
14852e6081Q612M6597K0353K809k0022n79J6049O38L221j9216j6900j7113J967
$$ -56081 -47469 -872 19481 22290 2268 1689 17738 18376 21597 2381 -14519 -31632 -29665
14839b9665M4399J4192P134j8238j8115Q529o406k3307j19K5472J8424l189j771
$$ -29665 14734 28926 36060 17822 -293 8236 1830 -21477 -21596 3876 22300 19111 17340
14826A7340n997J4541L3202l163l8967m0357J0645p817j330K212K8059n421o873
$$ 17340 11343 25884 59086 55923 16956 -23401 -12756 -20573 -21903 -19691 8368 2947 -3926
14813c926m870K557j2981J3576m618p084p905N333j0703k486J65r199J7438j4791
$$ -3926 -8796 -6239 -19220 -5644 -10262 -17346 -25251 -19918 -30621 -33107 -32942 -42141 -24703 -39494
14799c9494j2000J0650J8416J35K099j5626j5306Q778L0650J0953l211m5809j3023
$$ -39494 -51494 -40844 -22428 -22293 -20194 -35820 -51126 -42348 -11698 -745 -3956 -49765 -62788
14786f2788K0897K2146J2756j3903j9450l694P239q502k0911M358K9683Q128j0450
$$ -62788 -41891 -19745 -6989 -20892 -40342 -44036 -36797 -45299 -66210 -61852 -32169 -24041 -34491
14773c4491J1203k0554J6250L7924Q329Q798p494l5130k0151M5P618L7563j9027
$$ -34491 -23288 -43842 -27592 10332 18661 27459 19965 -15165 -35316 -35271 -27653 9910 -9117
14760i117r25K2455K3933l5232j5535K253l3906j3556L0695j0745M441P012j7711
$$ -9117 -10042 12413 36346 1114 -14421 -12168 -46074 -59630 -28935 -39680 -35239 -28227 -45938
14747d5938j4902J0955p670k6386K3512L2331Q249n77K7797n676P910j5323n122
$$ -45938 -60840 -49885 -57555 -83941 -60429 -28098 -19849 -20426 7371 1695 9605 -5718 -10840
14734a0840J7024k4400M745J8592j7519P95J1069j2578j5525L0251P436n137J7358
$$ -10840 6184 -18216 -13471 5121 -12398 -11603 -534 -13112 -28637 1614 9050 3913 21271
14721B1271k9948M645M454j6924J2958K1828l043p586J0881M865m606q759o715
$$ 21271 -8677 -4032 422 -16502 -3544 18284 15241 7655 18536 23401 18795 10036 3321
14708C321K9280q284o490M056K1241P365M697j0004j8810j2334m90j9662k9146
$$ 3321 32601 24317 17827 21883 43124 50489 55186 45182 26372 14038 13548 -6114 -35260
14695c5260K105j871j7546L297J8342K0140J5904J8580o201m2027k0250K3596
$$ -35260 -33155 -35026 -52572 -49275 -30933 -10793 5111 23691 17490 -24537 -44787 -21191
14683b1191K5106J232k7719m748j3655p336K4443J4326K1174k5785p974K380j786
$$ -21191 3915 5147 -22572 -27320 -40975 -48311 -23868 -9542 11632 -14153 -22127 -19747 -21533
14670b1533K1443k877j963L1214j9773m4095m402J1543J8809K409J8932N237l5870
$$ -21533 -90 -2967 -4930 26284 6511 -37584 -41986 -30443 -11634 -9225 9707 14944 -20926
14657b0926k5024m919J2135K8001L2657J4271l4828m4932j0813o896J0356K3567
$$ -20926 -45950 -50869 -38734 -10733 21924 36195 1367 -43565 -54378 -61274 -50918 -27351
14645b7351K8756J1821j3015n787j5197l1290k990K1681j500J3178K3797n294
$$ -27351 1405 13226 211 -5576 -20773 -52063 -55053 -33372 -34872 -21694 2103 -3191
14633c191q434j656k2418J8176J3319K8822j4636m0604J3925L2014j1398j816
$$ -3191 -11625 -13281 -35699 -17523 -4204 24618 9982 -30622 -16697 15317 3919 2103
14621B103P171k3833k4919l3469J9646K6193j1546k8298j6851J0546K1016k971
$$ 2103 9274 -14559 -39478 -72947 -53301 -27108 -38654 -66952 -83803 -73257 -52241 -55212
14609e5212l347j3041L2814M5387Q201j878o693R218K787j7511j9625J4872N224
$$ -55212 -58559 -71600 -38786 6601 14802 12924 6231 15449 18236 725 -18900 -4028 1196
14596A196J5839N714m3655p285L2624N476n339l3092j996P101R730j2463p843
$$ 1196 17035 22749 -20906 -28191 4433 9909 4570 -28522 -30518 -23417 -13687 -26150 -33993
14583c3993p011Q639L2694k362j5665Q940L2607j3392j0020M635M417j2909k4840
$$ -33993 -41004 -32365 329 -2033 -17698 -8758 23849 10457 437 5072 9489 -3420 -28260
14570b8260k2071K296R078J1899j523L704L4288J9336j9119m942O85q102J6965
$$ -28260 -50331 -48035 -38957 -27058 -28581 -24877 9411 28747 9628 4686 5371 -2731 14234
14557A4234j3676q587j2777P702O917m208j202r036J2215Q866m0325l630J5364
$$ 14234 558 -8029 -20806 -13104 -6187 -10395 -11597 -20633 -8418 448 -39877 -43507 -28143
14544b8143L406J1451J2151q832j3799K5424p203k5266N902L3179L686p826p423
$$ -28143 -24737 -13286 -1135 -9967 -23766 1658 -5545 -30811 -24909 8270 11956 4130 -3293
14531c293l3521K140n40L1157K6559J0797n625k9143j4211K1979m37l4907N275
$$ -3293 -36814 -34674 -35214 -4057 22502 33299 27674 -1469 -15680 6299 5862 -29045 -23770
14518b3770j4923K3060J6351J0983Q786k0909Q042j2483n334M690K365o346m457
$$ -23770 -38693 -15633 718 11701 20487 -422 7620 -4863 -10197 -5507 -3142 -9488 -13945
14505a3945R435j254j5336J5105K3062J0787j0973j0800k0044r239K5458k326
$$ -13945 -4510 -5764 -21100 -5995 17067 27854 16881 6081 -13963 -23202 2256 -70
14493g0R304J1821k7439k5280J2427K06k2637L1497K3816J0195K026J333j9448
$$ -70 9234 21055 -6384 -31664 -19237 -19031 -41668 -10171 13645 23840 25866 27199 7751
14480G751k104j966l2294J0663L999J6126J9643L919P343J254l990k4139k0403
$$ 7751 5647 3681 -28613 -17950 -13951 2175 21818 25737 33080 34334 30344 6205 -14198
14467a4198M381k785J5045k041l1557j2352P152k8370J2718K8559L9775p967J935
$$ -14198 -9817 -12602 2443 402 -31155 -43507 -36355 -64725 -52007 -23448 16327 8360 10295
14454A0295R605R457R8J8818m223r713j3822J1937m112r979l3775J4228k920j080
$$ 10295 19900 29357 29455 48273 44050 34337 20515 32452 28340 18361 -15414 -1186 -4106 -5186
14440e186K273K4824O272P805n259j8113O057k2219k6338M133o776L0224J9300
$$ -5186 -2913 21911 28183 35988 30729 12616 18673 -3546 -29884 -25751 -32527 -2303 16997
14427A6997r645l5924J5125K6025k4561k4774P741j024J0473O522K419o146J5223
$$ 16997 7352 -28572 -13447 12578 -11983 -36757 -29016 -30040 -19567 -13045 -10626 -16772 -1549
14414a549n197R324M8853j591j5412l3108k3305k8997r989N604n05K772J8197
$$ -1549 -6746 2578 51431 49840 34428 1320 -21985 -50982 -60971 -55367 -55872 -53100 -34903
14401c4903K7707K1504J7350k531m801q326R25k0210j4888L242J2387O175J9214
$$ -34903 -7196 14308 31658 29127 24326 16000 16925 -3285 -18173 -14931 -2544 3631 22845
14388B2845j0396N996L617j0408n052r618J7610J3920k6112k2745K8159L0699
$$ 22845 12449 18445 22062 11654 6602 -3016 14594 28514 2402 -20343 7816 38515
14376C8515M824j2236k499K8433j8239l1105k968k5823L135K3755K5822l1310
$$ 38515 43339 31103 28604 57037 38798 7693 4725 -21098 -17963 5792 31614 304
14364C04j0807L290J5312O418J7617j451m6320l8335j1856j7259L233L8285K3038
$$ 304 -10503 -7213 8099 14517 32134 30683 -15637 -53972 -65828 -83087 -79854 -41569 -18531
14351a8531O695p399J9893J1895q776k0340M184n96K96n497L0501K3337k063l6805
$$ -18531 -11836 -19235 658 12553 3777 -16563 -12379 -12975 -12679 -18176 12325 35662 33599 -3206
14337c206j4920j1597K224j4589Q483O913J4183r254k5704j1043J5139J5662K066
$$ -3206 -18126 -29723 -27499 -42088 -33605 -26692 -12509 -21763 -47467 -58510 -43371 -27709 -25643
14324b5643k538j309K1690J6449J2957j688J0803j5719k5319k026M128J002J9651
$$ -25643 -28181 -29490 -7800 8649 21606 19918 30721 15002 -10317 -12343 -8215 -7213 12438
14311A2438L63k6180k2911N987L6488K133k4243r136k087j0428m032L88K3620
$$ 12438 12801 -13379 -36290 -30303 6185 8318 -15925 -25061 -27148 -37576 -41608 -41220 -17600
14298a7600J2108O087j2532N50J1874N275J1783j789k1116j0414J3344J9252o36
$$ -17600 -5492 595 -11937 -11387 487 5762 17545 15756 -5360 -15774 -2430 16822 16186
14285A6186J4674j2452j7584P114j6589j757k2413J2060J0133K010j9028m132
$$ 16186 30860 18408 824 7938 -8651 -10408 -32821 -20761 -10628 -8618 -27646 -31778
14273c1778N168p68r879l6501K676L0156L4363M5670m696l0042J0542K3668l0018
$$ -31778 -26610 -27378 -37257 -73758 -71082 -40926 -6563 39107 34411 4369 14911 38579 8561
14260H561j8664l437m021q772J2888n839k5387N823L4003R349P91j4456k1869
$$ 8561 -10103 -13540 -17561 -26333 -13445 -19284 -44671 -38848 -4845 4504 5295 -9161 -31030
14247c1030r584r102k4521o936K6289O02J296r599J0088J3881J0482j6801k1170
$$ -31030 -40614 -49716 -74237 -81173 -54884 -54282 -52986 -62585 -52497 -38616 -28134 -44935 -66105
14234f6105L4277L7199j2969q859M2498j2064M988k472k5565r501J6278L2521
$$ -66105 -31828 5371 -7598 -16457 26041 13977 18965 16493 -9072 -18573 -2295 30226
14222C0226r248j4635p744J1307P906P72j3863l9129J7167J2027l0385j8752J3284
$$ 30226 20978 6343 -1401 9906 17812 18584 4721 -34408 -17241 -5214 -35599 -54351 -41067
14209d1067L452K9393j376j2538j4816L0521J7561k146q083L1432K6101K1114
$$ -41067 -37615 -8222 -9598 -22136 -36952 -6431 11130 8984 901 32333 58434 79548
14197G9548r643j0345n3095m6027J2387j4976J0155Q477M0018L0155L146P36k6544
$$ 79548 69905 59560 6465 -39562 -27175 -42151 -31996 -23519 16499 46654 49800 50536 23992
14184B3992M732J42m4432j4610J5687M644O346J4661O97l4142o131L0665O558
$$ 23992 28724 28866 -15566 -30176 -14489 -9845 -3499 11162 11859 -22283 -28414 2251 8809
14171H809j1107K925r056j7228j5513J3453K062j6299j5950J1774q189J8216L2668
$$ 8809 -2298 627 -8429 -25657 -41170 -27717 -25655 -41954 -57904 -46130 -54319 -36103 -3435
14158c435K9523J2379j812j4802l0082P628K0151k2191O082l5772k4390K2398
$$ -3435 26088 38467 36655 21853 -8229 -601 19550 -2641 3441 -32331 -56721 -34323
14146c4323L2150K8385M621k3270k2701j3416J4518J7091k857r751o170m413M845
$$ -34323 -2173 26212 30833 7563 -15138 -28554 -14036 3055 198 -9553 -15723 -20136 -15291
14133a5291m448K145M835k8406l7146o543n58K5033J3320o000K0225K0220n379
$$ -15291 -19739 -17594 -12759 -41165 -78311 -84854 -85412 -60379 -47059 -53059 -32834 -12614 -17993
14120a7993M923k025N765J4428K6407n829j5683j2724j7508k1489P495J6111K0752
$$ -17993 -13070 -15095 -9330 5098 31505 25676 9993 -2731 -20239 -41728 -34233 -18122 2630
14107B630J8266n782J5387J9613J9745M787o540j4258n505K6392l949j6649j2928
$$ 2630 20896 15114 30501 50114 69859 74646 68106 53848 48343 74735 70786 54137 41209
14094D1209k4149j0157q680q259l581R035R206k0516j6775J6037M752Q70k7056
$$ 41209 17060 6903 -1777 -10036 -13617 -4582 4624 -15892 -32667 -16630 -11878 -11008 -38064
14081c8064j551J5530J1667q268j3579m043K9828K5142K0414k5425k2754N530
$$ -38064 -39615 -24085 -12418 -20686 -34265 -38308 -8480 16662 37076 11651 -11103 -5573
14069e573K2487K6075P765j3550j1490L985r248j6383O34o910r962r89J6700l075
$$ -5573 16914 42989 50754 37204 25714 29699 20451 4068 4702 -2208 -12170 -13159 3541 466
14055D66m7641j132M4420r462n537L3181J6185J4871j4719l4878k037J9773P210
$$ 466 -47175 -48307 -3887 -13349 -18886 14295 30480 45351 30632 -4246 -6283 13490 20700
14042B0700j6547n342k74j5839j9224m125L8035K287l5502k0521J925j523m96
$$ 20700 4153 -1189 -1463 -17302 -36526 -40651 -2616 -329 -35831 -56352 -54427 -55950 -56446
14029e6446L8066J0479j7431l1559K1308J7425l113N904J6115P686P721J3112
$$ -56446 -18380 -7901 -25332 -56891 -35583 -18158 -21271 -15367 748 8434 16155 29267
14017B9267j0583n613J0367K814j57p009j1613j8030Q08O397K1434l6447j8065
$$ 29267 18684 13071 23438 26252 26095 19086 7473 -10557 -9749 -3352 18082 -18365 -36430
14004c6430K3686L16m0273k3338J8258L4276L5303L1759j4247k0171K1048J5323
$$ -36430 -12744 -12428 -52701 -76039 -57781 -23505 11798 43557 29310 9139 30187 45510
13992D5510j7828j1195q299l2122J7247Q785j2011l4937k944K6620O460J6261
$$ 45510 27682 16487 8188 -23934 -6687 2098 -9913 -44850 -47794 -21174 -14714 1547
13980A547J2476j6342k0354k1220j3032j3175J7033J9904M395n962P040j2051
$$ 1547 14023 -2319 -22673 -43893 -56925 -70100 -53067 -33163 -28768 -34730 -27690 -39741
13968c9741n212j0168N685K1354P365J5488m051k4670J4327J6398j4979J466j0878
$$ -39741 -44953 -55121 -49436 -28082 -20717 -5229 -9280 -33950 -19623 -3225 -18204 -16738 -27616
13955b7616J1600K3173k0008m0636k8368O585J2793N7466L6705j0941k5725k1493
$$ -27616 -16016 7157 -12851 -53487 -81855 -75270 -62477 -5011 31694 20753 -4972 -26465
13943b6465K869L0491K3946j1494k3256m647j5317m675N5099K9896k2382J7753
$$ -26465 -23596 6895 30841 19347 -3909 -8556 -23873 -28548 26551 56447 34065 51818
13931E1818P95j7655j3243m501p215j0763k8297k3766o910J67J3438O917R782
$$ 51818 52613 34958 21715 17214 9999 -764 -29061 -52827 -59737 -59570 -46132 -39215 -29433
13918b9433L4844K0447k6854Q46L898k009J7074j7151k0231o747J2451K8874J5875
$$ -29433 5411 25858 -996 -150 3748 1739 18813 1662 -18569 -25316 -12865 16009 31884
13905C1884J7555k147j8769k239l8615m2955l011K900K1744K5025J9778K574j09
$$ 31884 49439 47292 28523 26284 -12331 -55286 -58297 -55397 -33653 -8628 11150 13724 13615
13892A3615o593J458k274L590J8406J5136k5806J5845K9175N892k5963k363L3296
$$ 13615 7022 8480 6206 9796 28202 43338 17532 33377 62552 68444 42481 40118 73414
13879G3414J455j5101j9513j7463J384K6845K4776j0210j5823k0785j1883L375
$$ 73414 74869 59768 40255 22792 24176 51021 75797 65587 49764 28979 17096 20471
13867B0471k4490k5766J0401J3945K8512M1279j0027j3417o685j896k354o087
$$ 20471 -4019 -29785 -19384 -5439 23073 64352 54325 40908 34223 32327 29973 23886
13855B3886n283r567n184J3717k1893O656Q597J2041j5040j0127q065R525K1382
$$ 23886 18603 9036 3852 17569 -4324 2332 10929 22970 7930 -2197 -10262 -737 20645
13842B0645J582k1283j1162J2488O429q683L942L2128K8541j7639l0740r929R246
$$ 20645 22227 944 -10218 2270 8699 16 3958 36086 64627 46988 16248 6319 15565
13829A5565k8678N445L4941j5467L275o926j9546P857m070l4390m345J8106K4068
$$ 15565 -13113 -7668 27273 11806 15081 8155 -11391 -3534 -7604 -41994 -46339 -28233 -4165
13816d165J18J0336J89K1088K3332Q489m433M589j4089j1800k1331j5921J267
$$ -4165 -4047 6289 6478 27566 50898 59387 54954 59543 45454 33654 12323 -3598 -2331
13803b331k28j8651N6J9510L1854L1420J1298j9195j6391o542k1853O622j0785
$$ -2331 -2559 -21210 -21154 -1644 30210 61630 72928 53733 37342 30800 8947 15569 4784
13790D784j5987K237M8792j5830j4295M918n41L240M253j9372N884J3043m575
$$ 4784 -11203 -8966 39826 23996 9701 14619 14078 17318 21571 2199 8083 21126 16551
13777A6551Q70Q554j7904N016r388R93R372J037j3169o557P212K9670m309r935
$$ 16551 17421 25975 8071 13087 3699 4692 14064 15101 1932 -4625 2587 32257 27948 18013
13763A8013j2100K7480r682m5656k9596J9099L1607L1612K1252j9084r110K156
$$ 18013 5913 33393 23711 -21945 -51541 -32442 -835 30777 52029 32945 23835 25991
13751B5991J6904q01o367m0975K001Q414P47K9055j1072j0419q407j7014j1794
$$ 25991 42895 42094 35727 -5248 -3247 5167 5914 34969 23897 13478 5071 -11943 -23737
13738b3737q684J1944n224M273m488n603R661J8862j7522J8001K0564Q526Q394
$$ -23737 -32421 -20477 -25701 -21428 -25916 -31519 -21858 -2996 -20518 -2517 18047 26573 34967
13725C4967J8136j8461j7538j0598k963O133m510j3945J9464J3510k2636o018
$$ 34967 53103 34642 17104 6506 3543 9676 5166 -8779 10685 24195 1559 -4459
13713d459l740j2036K2563J308L391j7456j6403k219J9833K1775n836j1971q973
$$ -4459 -8199 -20235 2328 3636 7027 -10429 -26832 -29051 -9218 12557 6721 -5250 -14223
13700a4223n685l8524J3522J3894k070n335k505J7610L921K0020j6093k3842J9675
$$ -14223 -19908 -58432 -44910 -31016 -33086 -38421 -40926 -23316 -19395 625 -15468 -39310 -19635
13687a9635K0441j3701r634J8025J6124J63j2481l8529j5163J3012K4716L7106
$$ -19635 806 -12895 -22529 -4504 11620 11783 -698 -39227 -54390 -41378 -16662 20444
13675B0444N17p693L149K4950J1098j2250l0787k1495k4945j531K6828J2527M257
$$ 20444 20961 13268 16417 41367 52465 40215 9428 -12067 -37012 -38543 -11715 812 5069
13662E069m594J1309r59p850r568J0855J7805m583l160L455L2489M3162J1262
$$ 5069 475 11784 10825 2975 -6593 4262 22067 17484 14324 17779 50268 93430 104692
13649A04692p985n803L0379M6960K5175M9513N9685L6898M5043L5500O6008N9789
$$ 104692 96707 90904 121283 168243 193418 242931 302616 339514 384557 420057 486065 545854
13637E45854M0293O572k2398p2131m9834o6762o2970n1657o2523k7963p205k1076
$$ 545854 586147 592719 570321 498190 448356 381594 318624 266967 204444 176481 169276 148200
13625A48200m5334j8574k5979K910L3647o055k2881q111j3435n845j8657o651
$$ 148200 102866 84292 58313 61223 94870 88815 65934 57823 44388 38543 19886 13235
13613A3235L6235L988M070K2394l661m971j1104K4322K3184M001l4433m5702j7577
$$ 13235 49470 53458 57528 79922 76261 71290 60186 84508 107692 111693 77260 31558 13981
13600A3981Q243J4401L75J1807j7347k4296Q058J3269P932J7402k4200K756j9080
$$ 13981 22224 36625 37000 48807 31460 7164 15222 28491 36423 53825 29625 32381 13301
13587A3301k729K956o568L665R098r245k5848m55K860O927N0440J4052N222K338
$$ 13301 10572 13528 6960 10625 19723 10478 -15370 -15825 -12965 -6038 44402 58454 63676 66014
13573F6014j6489n899O261O851j0847k5424J2624K7664o635r992M151j5963j519
$$ 66014 49525 43626 49887 56738 45891 20467 33091 60755 54120 44128 48279 32316 30797
13560C0797k20j0052n661K057k8351M599N500r849j2870j858p504J0043R494K5752
$$ 30797 30577 20525 14864 16921 -11430 -6831 -1331 -11180 -24050 -25908 -33412 -23369 -13875 11877
13546A1877K0706J4822N474j1722Q566L178j6039q215r161j5610Q711j3815j3369
$$ 11877 32583 47405 52879 41157 49723 52901 36862 28647 19486 3876 12587 -1228 -14597
13533a4597o652J7743n177J2644J0392J0172L6854o679j6812j6190j6994J0625
$$ -14597 -21249 -3506 -8683 3961 14353 24525 61379 54700 37888 21698 4704 15329
13521A5329l54m647l1109p237O413M1132K1404J9890j1139j8992j7728k4420K1449
$$ 15329 14975 10328 -20781 -28018 -21605 19527 40931 60821 49682 30690 12962 -11458 9991
13508I991J3971l7115k9440o147J6631J5477K3023J5321j9651j5468J6866J3462
$$ 9991 23962 -13153 -42593 -48740 -32109 -16632 6391 21712 2061 -13407 3459 16921
13496A6921m851j8818o811J3699K2672j0531Q582R47J4647j8375j6117n359k139
$$ 16921 12070 -6748 -13559 140 22812 12281 20863 21810 36457 18082 1965 -3394 -5533
13483e533k707J8164j6881k0676R386L1294J1350K3673K265m6120k3937J9049
$$ -5533 -8240 9924 -6957 -27633 -18247 13047 24397 48070 50335 4215 -19722 -673
13471f73j2527k8256o824M5179K2274J5189P916j1989k1679P821J669J434P416
$$ -673 -13200 -41456 -48280 -3101 19173 34362 42278 30289 8610 16431 18100 19534 26950
13458B6950k1529j9587n26j9357n737o310J6677k131J6384N891J4781P494K2080
$$ 26950 5421 -14166 -14692 -34049 -39786 -46096 -29419 -31550 -15166 -9275 5506 13000 35080
13445C5080K0989j3056Q740r833j7640k2499l5243j2952M183J9792J926k7366
$$ 35080 56069 43013 51753 41920 24280 1781 -33462 -46414 -42231 -22439 -20513 -47879
13433d7879O055K7334J6768l085M2738J538m4866k3840K2273O690J16j9515n516
$$ -47879 -41824 -14490 2278 -807 41931 43469 -1397 -25237 -2964 3726 3842 -15673 -21189
13420b1189O414L4727l0271J369J2991l897K2858J5432Rl5661j9553L5766L2746
$$ -21189 -14775 19952 -10319 -8950 4041 144 23002 38434 38443 2782 -16771 18995 51741
13407E1741j5551j6748k8310j3391J9077J7470J9005k8948j7297K217p443Q588
$$ 51741 36190 19442 -8868 -22259 -3182 14288 33293 4345 -12952 -10735 -18178 -9590
13395i590P064J074J2778l656N008P419r160l963j3534J192Q944k42J841p683
$$ -9590 -2526 -1452 11326 7670 12678 20097 10937 6974 -6560 -5368 3576 3334 5175 -2508
13381b508J0167R004M28j2548j5806J1343j2331q807L880K0390L3628K6291j446
$$ -2508 7659 16663 17091 4543 -11263 80 -12251 -21058 -17178 3212 36840 63131 61685
13368F1685j615k0121k8743J314n408J0862k1514j3141j2869K7531J4611j4260
$$ 61685 60070 39949 11206 12520 7112 17974 -3540 -16681 -29550 -2019 12592 -1668
13356a668Q44o481J4248K138j5050j2257K6096J5876R498q422r073j0587o82J0645
$$ -1668 -824 -7305 6943 9081 -5969 -18226 7870 23746 33244 24822 15749 5162 4480 15125
13342A5125n300J1950m15k6638n553J684J4743J6611J006p961j9116j7152K7311
$$ 15125 9825 21775 21360 -5278 -10831 -9147 5596 22207 23213 15252 -3864 -21016 6295
13329F295j2870j4879J746M818L4641L5372q436j6646r70J325K935P95j9204l479
$$ 6295 -6575 -21454 -19708 -14890 19751 55123 46687 30041 29071 30396 33331 34126 14922 11443
13315A1443M69L486J1925q639k6217R872K0346l633j0243j3232M604p63J8469
$$ 11443 11912 15398 27323 18684 -7533 2339 22685 19052 8809 -4423 181 -582 17887
13302A7887l2613n5226j2378J5759K7438K5761j2563R790J3482L4114R232p437
$$ 17887 -14726 -69952 -82330 -66571 -39133 -13372 -25935 -16145 -2663 31451 40683 33246
13290C3246k9338K6019k4017l137j7l424R690m748J1001n447k077L977p081j9057
$$ 33246 3908 29927 5910 2773 2756 -668 9022 4274 15275 9828 7751 11728 4647 -14410
13276a4410J0123P655l146n1735j1810J8940J1069R501j071L3161Q695J9859M2024
$$ -14410 -4287 3368 222 -51513 -63323 -44383 -33314 -23813 -24884 8277 16972 36831 78855
13263G8855j8190j0244o635k5365n177l799P877Q806J1913p754o836m418j0934
$$ 78855 60665 50421 43786 18421 13244 9445 17322 26128 38041 30287 23451 19033 8099
13250H099r732P995j2425r37j9022J3843P498j9794k680L284l849J6851J7425
$$ 8099 -1633 6362 -6063 -7000 -26022 -12179 -4681 -24475 -27155 -23871 -27720 -10869 6556
13237F556k435M094k876j7517n460J3691j8694K4004L626q355O270K294l910J2830
$$ 6556 4121 8215 5339 -12178 -17638 -3947 -22641 1363 4989 -3366 2904 5198 1288 14118
13223A4118Q290J6874Q389q385l7259p668M081j7013L567p627J5091Q829j5815
$$ 14118 22408 39282 47671 39286 2027 -5641 -1560 -18573 -15006 -22633 -7542 1287 -14528
13210a4528n581o405M1157K440p399J0876j26J1410L4384J010j3948k2274k0409
$$ -14528 -20109 -26514 14643 17083 9684 20560 20434 31844 66228 67238 53290 31016 10607
13197A0607N095P833K2905Q599j8911j3773L2868j5329j448J4795O069o834l3126
$$ 10607 15702 23535 46440 55039 36128 22355 55223 39894 38446 53241 59310 52476 19350
13184A9350k9995K5653P665n385K2441P32k3743l5934l835L9672m756m950J768
$$ 19350 -10645 15008 22673 17288 39729 40461 16718 -19216 -23051 16621 11865 6915 8683
13171H683m387j6627o178M4554j1436o972j347O724p472n529N954L401J0239J715
$$ 8683 4296 -12331 -18509 26045 14609 7637 6290 13014 5542 13 5967 9368 19607 21322
13157B1322K1610J884k1115j9782J857j4927M905J3966L0760r92R111j9630m0678
$$ 21322 42932 44816 23701 3919 5776 -9151 -4246 9720 40480 39488 48599 28969 -11709
13144a1709J1425K1613Q739j1413r084L9664L0099K3543j2239m2986j3617q835
$$ -11709 -284 21329 30068 18655 9571 49235 79334 102877 90638 47652 34035 25200
13132B5200j1776Q401j8510j4127K4123O681k1547j9289j2385J2857j9580k2765
$$ 25200 13424 21825 3315 -10812 13311 19992 -1555 -20844 -33229 -20372 -39952 -62717
13120f2717m52O731K3288O994P22r165J1815J4167Q372j0033J3667K7481K2483
$$ -62717 -63169 -56438 -33150 -26156 -25434 -34599 -22784 -8617 -245 -10278 3389 30870 53353
13107E3353j9273k4328P298M461l2602m655K1273J5896J7572j0181k1897J089
$$ 53353 34080 9752 17050 21511 -11091 -15746 5527 21423 38995 28814 6917 8006
13095H006J5072L9058j1242k3915j406p702j07j8351m305P249l4427j7039L1448
$$ 8006 23078 62136 50894 26979 25573 17871 17764 -587 -4892 2357 -32070 -49109 -17661
13082a7661K1651K7929K3957k2220P381k879J7322o449r362n7k2130Q363l950
$$ -17661 3990 31919 55876 33656 41037 38158 55480 49031 39669 39612 17482 25845 21895
13069B1895j6160l3247J6633L345J2537l90j3392K0103J6828P51l786l41k9430
$$ 21895 5735 -27512 -10879 -7534 5003 4613 -8779 11324 28152 28903 25117 24776 -4654
13056d654J2105M6382J5847k6719m0150K341M2559j2726j5538j0687Q675r797
$$ -4654 7451 53833 69680 42961 2811 5152 47711 34985 19447 8760 17435 7638
13044G638m1388J5858L3878j2276j8744P491N654k4987j9916L8827K8847J1888
$$ 7638 -33750 -17892 15986 3710 -15034 -7543 -1889 -26876 -46792 -7965 20882 32770
13032C2770o47j0718L767K1685m5L991K0650l390k3524q240J1201j9981l3546
$$ 32770 32123 21405 25172 46857 46812 50803 71453 68063 44539 36299 47500 27519 -6027
13019f027j5113L587j662j0110n483k2691L9221N763K240J3063o999j937Q951
$$ -6027 -21140 -17553 -19215 -29325 -34808 -57499 -18278 -12515 -10275 2788 -4211 -6148 2803
13006B803J583P769J9648K407p558M294j2752J6280r746k4507J218O644J2059
$$ 2803 4386 12155 31803 34210 26652 30946 18194 34474 24728 221 1439 8083 20142
12993B0142n050r202k559K1201K3869r048O087K539K8370o722j8321l9778m5206
$$ 20142 15092 5890 3331 24532 48401 39353 45440 47979 76349 69627 51306 11528 -33678
12980c3678q739J5882J9900J9088J7728J1485L2268K0261k4640n8994j8178n484
$$ -33678 -42417 -26535 -6635 12453 30181 41666 73934 94195 69555 10561 -7617 -13101
12968a3101J1506K7050J9384k1937j5903q614L067K6749k837p804N346k653N535
$$ -13101 -1595 25455 44839 22902 6999 -1615 1452 28201 25364 17560 22906 20253 25788
12955B5788K0302j0837j0928K3748Q683J4508J1767L254J3195k9155l2514j2450
$$ 25788 46090 35253 24325 48073 56756 71264 83031 86285 99480 70325 37811 25361
12943B5361K7093M0124j8236l3397k9322o258J312P931J4162k4528j057K6190
$$ 25361 52454 92578 74342 40945 11623 5365 6677 14608 28770 4242 3185 29375
12931B9375J5746j1217l4267j3022M4852J2909n911n642J6628K4379l2674k1904
$$ 29375 45121 33904 -363 -13385 31467 44376 38465 32823 49451 73830 41156 19252
12919A9252p215J2070K5767q145j6862j4442l547p447M90l227J8596J3562j8161
$$ 19252 12037 24107 49874 41729 24867 10425 6878 -569 -79 -3306 15290 28852 10691
12906A0691K3643J6613j826l351q722j1265q501J1947o301m928M08l4901j0447
$$ 10691 34334 50947 49121 45770 37048 25783 17282 29229 22928 18000 18408 -16493 -26940
12893b6940K4847J5086o149L399J1653P384K6148k871J680q714j1208J4420o507
$$ -26940 -2093 12993 6844 10243 21896 29280 55428 52557 54237 45523 34315 48735 42228
12880D2228r042J0149k1735r600N963Q660L5148m081N299N420L256L118q496m96
$$ 42228 33186 43335 21600 12000 17963 26623 61771 57690 62989 68409 71665 74783 66287 65791
12866F5791R256j5460j0857J2547J5053n062k0366j2608J0217r95m2183k2730
$$ 65791 75047 59587 48730 61277 76330 71268 50902 38294 48511 47516 5333 -17397
12854a7397l132K0346m333R417J4021K0338N529k334l558j4493L148K8567J6650
$$ -17397 -20529 -183 -4516 4901 18922 39260 44789 42455 38897 24404 27552 56119 72769
12841G2769j5189Q162J8843k6074m978m846k1236K3727J3804p414P49R820j1576
$$ 72769 57580 65742 84585 58511 53533 48687 27451 51178 64982 57568 58317 68137 56561
12828E6561M314L382J0367j0257k3639o201K3126J4744M826k176j259j0784k0634
$$ 56561 60875 64257 74624 64367 40728 34527 57653 72397 77223 75047 73788 63004 42370
12815D2370k470l400K1494k933N439L8504j361k7427k2874P667m934r303J8076
$$ 42370 39900 36500 57994 55061 60500 99004 97643 70216 47342 55009 50075 40772 58848
12802E8848n797L495O055j8722j7017J5293m091J6994J8085p215K6851K201K8043
$$ 58848 53051 56546 62601 43879 26862 42155 38064 55058 73143 65928 92779 94980 123023
12789A23023o873l5827l073k1722l6803O11J8636Q969p405Q448K688j5615P960
$$ 123023 116150 80323 77250 55528 18725 19336 37972 46941 39536 47984 50672 35057 43017
12776D3017J3291k408L673J4112l952K029l585L183j0540j7786q948n124K2584
$$ 43017 56308 53900 57573 71685 67733 69762 66177 69360 58820 41034 32086 26962 49546
12763D9546K8790O040R898k5849o440J3931q31R555J3270P327j5281l9650j907
$$ 49546 78336 84376 94274 68425 61985 75916 75085 84640 97910 105237 89956 50306 48399
12750D8399J1660L506R396k8128N352J7972N176J8756L0921j1151n227k4178j1107
$$ 48399 60059 63565 72961 44833 50185 68157 73333 92089 123010 111859 106632 82454 71347
12737G1347K4146L4964K379k8303l4523K20K9526J294j6501j4440k0198K6343
$$ 71347 95493 130457 132836 104533 70010 70230 99756 101050 84549 70109 49911 76254
12725G6254L3352N093J7337j9430N516k0318k1601O060J8714N763J2855P857j1651
$$ 76254 109606 114699 132036 112606 118122 97804 76203 82263 100977 106740 119595 127452 115801
12712A15801j9037j5669L184M0809j0072j8250J3759J0776k8665j0802j1125l947
$$ 115801 96764 81095 84279 125088 115016 96766 110525 121301 92636 81834 70709 66762
12700F6762j9332J6407K3262j6826P201J3676K5653M430l891Q39n167k2227l9765
$$ 66762 47430 63837 87099 70273 77474 91150 116803 121233 117342 118181 113014 90787 51022
12687E1022q998J7336J5231k903J7732L5113n827J532J1043k0902J5890K6338
$$ 51022 42024 59360 74591 71688 89420 124533 118706 120238 131281 110379 126269 152607
12675A52607O835p069j654J1655M227j9240j3962O217j7994q855J3807K4752k338
$$ 152607 159442 152373 150719 162374 166601 147361 133399 139616 121622 112767 126574 151326 148988
12662A48988j8827J1191k831L0571K6643J6546K2328j4745l9367j4253q884L572
$$ 148988 130161 141352 138521 169092 195735 212281 234609 219864 180497 166244 157360 160932
12650A60932K0871J2111J5809L8390M1556M6460Q082K668L4099L4202L9767P1636
$$ 160932 181803 193914 209723 248113 289669 336129 344211 346879 380978 415180 454947 526583
12638E26583J19140J34010J66569K11035K50094K60373K28777J70819J02802K7304
$$ 526583 645723 779733 946302 1157337 1407431 1667804 1896581 2067400 2170202 2197506
12628B197506j09221j96084j99852k27647k29411k08970j40705j11858r6845m7294
$$ 2197506 2088285 1892201 1692349 1464702 1235291 1026321 885616 773758 676913 629619
12618F29619m2045l3941j1728l7223l5839l4394k1935k9463p362j4036k4944j5428
$$ 629619 587574 553633 541905 504682 468843 434449 412514 383051 375689 361653 336709 321281
12606C21281l8186j4424J3623j1659K177m399n696j1430J6504L4773P505j4576
$$ 321281 283095 268671 282294 270635 272812 268413 262717 251287 267791 302564 310069 295493
12594B95493j9433J3948r969k7732j0066J0475j5418j3824N079P06j8085R206
$$ 295493 276060 290008 280039 252307 242241 252716 237298 223474 228553 229259 211174 220380
12582B20380j1221k872Q744J077k8916k5020J698K0302m826j2349k1410M2174
$$ 220380 209159 206287 215031 216108 187192 162172 163870 184172 179346 166997 145587 187761
12570A87761K3941k6358k8153j6126J87j7187l852J3319K0037K433l0255J023
$$ 187761 211702 185344 157191 141065 141252 124065 120213 133532 153569 156002 125747 126770
12558A26770J2366p522o377j5382j7410r178K4072K7438J1072j762Q763k4517
$$ 126770 139136 131614 125237 109855 92445 83267 107339 134777 145849 144087 152850 128333
12546A28333K06J9831M785Q98m012L10k9376M6674K1709n1343k8219K1969J1247
$$ 128333 128539 148370 153155 154053 150041 150351 120975 167649 189358 138015 109796 131765 143012
12533A43012J2030o975J074K4492K8558K8869j4658K507K1902o886l6012j3242
$$ 143012 155042 148067 149141 173633 202191 231060 216402 218909 240811 233925 197913 184671
12521A84671O561j9447K0986J2019K5142p8k4757k1591K1358O253J2630j0359
$$ 184671 191232 171785 192771 204790 229932 229854 205097 183506 204864 211117 223747 213388
12509B13388m6246k9543L1121L9747K100J3700J2822K2931O898J7994P131J9457
$$ 213388 167142 137599 168720 208467 210567 224267 237089 260020 266918 284912 292043 311500
12497C11500Q045M009N0652M9725K414N224P745K028J9358k482M0461J4446N6565
$$ 311500 319545 323554 374206 423931 426345 431569 439314 441342 460700 458218 498679 513125 569690
12484E69690Q2923P1554L4984L0502M3487O3196M8529j6113o2228q4752n2844
$$ 569690 652613 724167 759151 789653 833140 896336 944865 928752 866524 781772 728928
12473G28928o8607p5687q5307o6306p0594l8357m1978j9251K1051j2082k6624
$$ 728928 660321 584634 499327 433021 362427 324070 282092 262841 283892 271810 245186
12462B45186l0522m2551m3339o968j3474k8818n4800J1476L5809K235k1029k3982
$$ 245186 214664 172113 128774 121806 108332 79514 24714 36190 71999 74234 53205 29223
12450B9223J4122P674l1950j4442J2780j4070J058K6469J5233K0429m57k2201
$$ 29223 43345 51019 19069 4627 17407 3337 4395 30864 46097 66526 66069 43868
12438D3868l0150J1183r156n80J4382K8864j686J9166L3148n824j7274j3766J509
$$ 43868 13718 24901 15745 15165 29547 58411 56725 75891 109039 103215 85941 72175 73684
12425G3684R341J6431K4027J2299m719k6168j8992k7733j6306q382j4637j0578
$$ 73684 83025 99456 123483 135782 131063 104895 85903 58170 41864 33482 18845 8267
12413H267j3031j8867m145K791r952j7298k6244O305J6139J994j4564K3812J7725
$$ 8267 -4764 -23631 -27776 -24985 -34937 -52235 -78479 -72174 -56035 -54041 -68605 -44793 -27068
12400b7068J6936K2764K3526K8943L2056K4298J2582K977k509j2153m848N092
$$ -27068 -10132 12632 36158 65101 97157 121455 134037 137014 134505 122352 117504 122596
12388A22596P182m396J395Q393k006L2965J2268J847l1240L133L7695k4487q766
$$ 122596 129778 125382 126777 135170 133164 166129 178397 180244 149004 152137 189832 165345 156579
12375A56579J1130o410q769P447J1536J8281L2938K3309J7665L5378j7670O117
$$ 156579 167709 161299 152530 159977 171513 189794 222732 246041 263706 299084 281414 287531
12363B87531O730P067M903M377n263L2298M1120L0880K4339L4000L8669N2399
$$ 287531 294261 301328 306231 310608 305345 337643 378763 409643 433982 467982 506651 559050
12351E59050N8623J00409J24649J56925K18059K53948K49980K70453K57840K05708
$$ 559050 617673 718082 842731 999656 1217715 1471663 1721643 1992096 2249936 2455644
12341B455644J39993P3884n90m1424q5404j17841j36377j70680j62263p8782q3451
$$ 2455644 2595637 2669521 2668931 2627507 2542103 2424262 2287885 2117205 1954942 1876160 1792709
12330A792709p3474l8542j8619j0458q484o7006m7265j3553o83n76J2823l1596
$$ 1792709 1719235 1680693 1662074 1651616 1643132 1576126 1528861 1515308 1514625 1514049 1526872 1495276
12318A495276o6582j1829j7317n0822l9474k5358l0273k5223m311J8510l7621
$$ 1495276 1428694 1416865 1399548 1348726 1309252 1283894 1253621 1228398 1224087 1242597 1204976
12307A204976k5514l0389m8531m896J8468K2929J4996j1684J1153N351J0034J2659
$$ 1204976 1179462 1149073 1100542 1095646 1114114 1137043 1152039 1140355 1151508 1156859 1166893 1179552
12295A179552R138Q621K7417K1686j5104Q075r836r490N45L6069L2990l518j6002
$$ 1179552 1188690 1197311 1224728 1246414 1231310 1239385 1229549 1220059 1220604 1256673 1289663 1286145 1270143
12282A270143J5964L7780K3406j4522Q926L5938K7686K9310J1711L2300M0624
$$ 1270143 1286107 1323887 1347293 1332771 1341697 1377635 1405321 1434631 1446342 1478642 1519266
12271A519266J287m205J9930J9537J0856R943J123J4812L7203N0447O8968P9007
$$ 1519266 1520553 1516348 1536278 1555815 1566671 1576614 1577737 1592549 1629752 1680199 1749167 1828174
12259A828174P4905J01236J05333J11096J47102J61967J77248K02096K26468K12824
$$ 1828174 1903079 2004315 2109648 2220744 2367846 2529813 2707061 2909157 3135625 3348449
12249C348449K48940L07179L32401L47148L78025M26151M88984N80519O91640
$$ 3348449 3597389 3904568 4236969 4584117 4962142 5388293 5877277 6457796 7149436
12240G149436Q22336J073089J444125J870243K330777K831853L237291L452998
$$ 7149436 7971772 9044861 10488986 12359229 14690006 17521859 20759150 24212148
12232B4212148L555243L490677L305888L134334L160198L666441M927137P449897
$$ 24212148 27767391 31258068 34563956 37698290 40858488 44524929 49452066 56901963
12224E6901963J1694263J8038228K6163245L5132565M3179512M7680199M7874186
$$ 56901963 68596226 86634454 112797699 147930264 191109776 238789975 286664161
12217B86664161M3732074L5029335K1870388N449550j2259397k7569871l7565120
$$ 286664161 330396235 365425570 387295958 392745508 380486111 352916240 315351120
12210C15351120m2696199m3562542m0870628l5117202k7421693j9233341j2863558
$$ 315351120 272654921 229092379 188221751 153104549 125682856 106449515 93585957
12203I3585957q815099o393948n056781m396902m074575l914594l841778l703519
$$ 93585957 84770858 78376910 73320129 68923227 64848652 60934058 57092280 53388761
12195E3388761l516082l266760k977068k605976k263229j939669j705952j497989
$$ 53388761 49872679 46605919 43628851 41022875 38759646 36819977 35114025 33616036
12187C3616036j352467j231129j159023j072815r67429q64796q33331q03952p39783
$$ 33616036 32263569 31032440 29873417 28800602 27833173 26968377 26135046 25331094 24591311
12178B4591311p01169o52764o48431o29857o02540n87448n66684n44100n18238
$$ 24591311 23890142 23237378 22588947 21959090 21356550 20769102 20202418 19658318 19140080
12169A9140080m65054m50816m23497l78686l39568l65888l77984m26074m65519
$$ 19140080 18675026 18224210 17800713 17422027 17082459 16716571 16338587 15912513 15446994
12160A5446994m58204m15603m07953l81313l63334l56815l23174l24668l32008
$$ 15446994 14988790 14573187 14165234 13783921 13420587 13063772 12740598 12415930 12083922
12151A2083922l01456k68938k63632k53507l06821k81642k59475k44576k65688
$$ 12083922 11782466 11513528 11249896 10996389 10689568 10407926 10148451 9903875 9638187
12142I638187k54562k33587k08030k10720k26264k15700j91903j85986j87604
$$ 9638187 9383625 9150038 8942008 8731288 8505024 8289324 8097421 7911435 7723831
12133G723831j83619j15747j28405j45819j50230j53044j32606j11439j27033
$$ 7723831 7540212 7424465 7296060 7150241 7000011 6846967 6714361 6602922 6475889
12124F475889j08691j09754p4375r3142j11616j33454j43968j53011j35903j32859
$$ 6475889 6367198 6257444 6183069 6089927 5978311 5844857 5700889 5547878 5411975 5279116
12114E279116j47517j03663j12042j03274o5175o6791n4560p7554o6031q3210
$$ 5279116 5131599 5027936 4915894 4812620 4747445 4680654 4626094 4548540 4482509 4399299
12104D399299o0202k6663k2800m2614l0258J8517J6883P4995J05964J35042J70908
$$ 4399299 4339097 4312434 4289634 4247020 4216762 4235279 4252162 4327157 4433121 4568163 4739071
12093D739071J69180J89344K18993J89477R1843O5990J9017p0071j26372j68458
$$ 4739071 4908251 5097595 5316588 5506065 5597908 5663898 5682915 5612844 5486472 5318014
12083E318014j60107j65457j70831j60968j28209j00512q8988r4047j12895r7590
$$ 5318014 5157907 4992450 4821619 4660651 4532442 4431930 4342942 4248895 4136000 4038410
12073D038410p6285j02165j19727q9521r1349r7593j03975r6106j10439n8683
$$ 4038410 3962125 3859960 3740233 3650712 3559363 3461770 3357795 3261689 3151250 3092567
12063C092567m5859p9969n8106o9995n7924n6818n2074l7920m1650l2173o1633
$$ 3092567 3046708 2966739 2908633 2838638 2780714 2723896 2671822 2633902 2592252 2560079 2498446
12052B498446o2902q4730o9165k3268k9145k7972m104l2012n3120p615j6437n6966
$$ 2498446 2435544 2350814 2281649 2258381 2229236 2201264 2197160 2165148 2112028 2104413 2087976 2031010
12040B031010j7862k5111m6734j5746P222j0189n7912o4618j0197L4719J4486
$$ 2031010 2013148 1988037 1941303 1925557 1932779 1922590 1864678 1800060 1789863 1824582 1839068
12029A839068j9284l7221m7015j7926J4359J7173J589k7387n2657m7990o1716
$$ 1839068 1819784 1782563 1735548 1717622 1731981 1749154 1750743 1723356 1670699 1622709 1560993
12018A560993o3421k7607o49k3105m2487J237l1678m0195n8596n8796k5548m1515
$$ 1560993 1497572 1469965 1469316 1446211 1403724 1404961 1373283 1333088 1274492 1215696 1190148 1148633
12006A148633l7442m497O400M158n428k1104l5540m25N059j2524j3863k4022J3971
$$ 1148633 1111191 1106694 1113094 1117252 1111824 1090720 1055180 1054755 1059814 1047290 1033427 1009405 1023376
11993A023376J1563l0500j7957J3054J490j678J7135k328o774k7217n2920j3090
$$ 1023376 1034939 1004439 986482 999536 1001026 999348 1016483 1014155 1007381 980164 927244 914154
11981I14154L658K1274M310j1784K469J4924J2461k0421j511n0123n1328l3382
$$ 914154 917812 939086 943396 931612 934081 949005 961466 941045 939534 889411 838083 804701
11969H04701J3694L0007k3300k7460k2551J7993K2058J2541j057m7917l9056q3840
$$ 804701 818395 848402 825102 797642 775091 793084 815142 827683 826626 778709 739653 655813
11957F55813j14835j28091j37159j30899j43224r7815l0259k392L0909J9280J8069
$$ 655813 540978 412887 275728 144829 1605 -96210 -126469 -128861 -97952 -78672 -60603
11946f0603K0764M1869N5374K8795R896K2339K0949k468n98M262P417J188J0533
$$ -60603 -39839 2030 57404 86199 96095 118434 139383 136915 136317 140579 147996 149184 159717
11933A59717J6869J8085n344k8559K2192J4919J7629L4290r509k6019N853m784
$$ 159717 176586 194671 189327 160768 182960 197879 215508 249798 240289 214270 220123 215339
11921B15339J2195n126q356l1190j5297O848J070O019p852J0437k3523j4894N103
$$ 215339 227534 222408 214052 182862 167565 174413 175483 181502 173650 184087 160564 145670 150773
11908A50773J865R366l1950j4326K6368j263J700J9010J5762k910L6194N896l8319
$$ 150773 152638 162004 130054 115728 142096 140833 142533 161543 177305 174395 210589 216485 178166
11895A78166k8909j1458K4612K9164Q25p950K381j7937J0587K8167j8198o266
$$ 178166 149257 137799 162411 191575 192400 184450 186831 168894 179481 207648 189450 183184
11883A83184R871m2054k6278L1L6203L4105j4553j627J238n828J1527j5423o352
$$ 183184 193055 151001 124723 124754 160957 195062 180509 178882 180120 174292 185819 170396 164044
11870A64044l9086l0640P50K2763J9086P676K6371m269k6262j5474j9389m867
$$ 164044 124958 94318 95068 117831 136917 144593 170964 166695 140433 124959 105570 100703
11858A00703l299J1922l1385k2751J4131M3958J9404j1215k3147J3119k937O514
$$ 100703 97404 109326 77941 55190 69321 113279 132683 121468 98321 111440 108503 115017
11846A15017J0829M017k6134k9900l5817L683J8434R264m853r077K794k456L719
$$ 115017 125846 129863 103729 73829 38012 41695 60129 69393 64540 55463 58257 55801 59520
11833E9520K6797R12J836K1900R98j0459k5897j5136J5539M1364K5737j6729l0644
$$ 59520 86317 87229 89065 110965 111963 101504 75607 60471 76010 117374 143111 126382 95738
11820I5738J35o249J2653N1830O514j4930j0415K8378M5685K7181K1524o525p448
$$ 95738 95873 89624 102277 154107 160621 145691 135276 163654 209339 236520 258044 251519 244071
11807B44071M1737J6866l240N7867L3200L1645J01054J33295K24957K52779K49124
$$ 244071 285808 302674 299434 357301 390501 422146 523200 656495 881452 1134231 1383355
11796A383355K31873J96593J64712Q1420n429p5881j39277k03015k10911k19354
$$ 1383355 1615228 1811821 1976533 2057953 2052524 1976643 1837366 1634351 1423440 1204086
11786A204086j79356j75188j21839r1124p3771m5061k7382o0812l5764m820k5424
$$ 1204086 1024730 849542 727703 636579 562808 517747 490365 429553 393789 388969 363545
11775C63545k8302k3717M50Q264j9570n3014l5734j8311Q527K5648O811k5421
$$ 363545 335243 311526 311976 320240 300670 247656 211922 193611 202138 227786 234597 209176
11763B09176k090L324j5607k1099l844p771p556O973k1465K5444k166j7797J306
$$ 209176 207086 210410 194803 173704 169860 162089 154533 161506 140041 165485 163319 145522 146828
11750A46828L444K193j7601R948K9766J7212J4979J7874k1085o928k2753k8607
$$ 146828 150272 152465 134864 144812 174578 191790 206769 224643 203558 196630 173877 145270
11738A45270n647k5204j8010p995j0909R826N145L7799o29K1990q615j6767k6603
$$ 145270 139623 114419 96409 88414 77505 87331 92476 130275 129646 151636 143021 126254 99651
11725I9651O540L136q823j0943K562L4998J1515q713K978J416j1292j5669j6157
$$ 99651 106191 109327 100504 89561 92123 127121 138636 129923 132901 134317 123025 107356 91199
11712I1199K2173J0621j6055J0791j1744m528J1012j1710J2261J3674r906k3876
$$ 91199 113372 123993 107938 118729 106985 102457 113469 101759 114020 127694 117788 93912
11700I3912l0523j2734J326j3664Q094J1402M496J7375j3129J1335K5600j4416
$$ 93912 63389 50655 51981 38317 46411 57813 62309 79684 66555 77890 103490 89074
11688H9074j7109M466J4837n411j6689j8683K8185m247o129j4161K572j8099R056
$$ 89074 71965 76431 91268 85857 69168 50485 78670 74423 68294 54133 56705 38606 47662
11675D7662K3740J3837R836m6742k2852K4608J4912K8554j0419n21j3446k6482
$$ 47662 71402 85239 95075 48333 25481 50089 65001 93555 83136 82615 69169 42687
11663D2687P213L1429J4072Q545n917K992J7347q537m9696k7168K5809J6945k3460
$$ 42687 49900 81329 95401 103946 98029 101021 118368 109831 60135 32967 58776 75721 52261
11650E2261m2157j2660r60L479m267K6839N181J4821r815J2185N68R423j861n142
$$ 52261 10104 -2556 -3516 -37 -4304 22535 27716 42537 32722 44907 45475 54898 53037 47895
11636D7895j5082j4703J0362J9057J0499M297l689J3208q701k8307M231o823m936
$$ 47895 32813 18110 28472 47529 58028 62325 58636 71844 63143 34836 39067 32244 27308
11623B7308J8192j5321q530p834r581p896o704R610L6402k413m841O637K969m146
$$ 27308 45500 30179 21649 13815 4234 -3662 -10366 -756 35646 33233 28392 35029 37998 33852
11609C3852K550J5330j2394J7971q97j3295J415J8980K9577k8871m7841K659J9286
$$ 33852 36402 51732 39338 57309 56412 43117 44532 63512 93089 64218 16377 19036 38322
11596C8322K2188p516O984J6441k8472j0228j476K525J4261l757N66m086M629
$$ 38322 60510 52994 59978 76419 47947 37719 36243 38768 53029 49272 49838 45752 50381
11583E0381R697Q773q767l7316Q797K7083J8621J625k1016J0042j2200k9913n256
$$ 50381 60078 68851 60084 22768 31565 58648 77269 78894 57878 67920 55720 25807 20551
11570B0551J6816Q329l0823J744Q755J639M2516J0830j9147k5852l6037j4811
$$ 20551 37367 45696 14873 16617 25372 27011 69527 80357 61210 35358 -679 -15490
11558a5490M560K4364K1074n398r050J2116n917j4685M383K8718J2551p667j5956
$$ -15490 -10930 13434 34508 29110 20060 32176 26259 11574 15957 44675 57226 49559 33603
11545C3603J9510K5457k1467l1555k1205J1164J8591K382J4357J388J1316J9829
$$ 33603 53113 78570 57103 25548 4343 15507 34098 36480 50837 52225 63541 83370
11533H3370j1628m5033k3792p881k4030J715M5489L0634Q235k6n250L168J9211
$$ 83370 71742 26709 2917 -4964 -28994 -27279 18210 48844 57079 57053 51803 54971 74182
11520G4182q987k328N681O385l5778j9788L256K2223J9572N261l3996j7677O878
$$ 74182 65195 62867 68548 74933 39155 19367 22623 44846 64418 69679 35683 18006 24884
11507B4884O065N439j6094J1172K374j0782j0868K9268j6474j6138J3501J0434
$$ 24884 30949 36388 20294 31466 33840 23058 12190 41458 24984 8846 22347 32781
11495C2781R08N36J1514J9313k2468q927r081o760p379P303N257K2505J9421K9628
$$ 32781 33689 34225 45739 65052 42584 33657 24576 17816 10437 17740 22997 45502 64923 94551
11481I4551O151l1342r345j3650n153J7092O137K2361N925k8710n087j2572K445
$$ 94551 100702 69360 60015 46365 41212 58304 64441 86802 92727 64017 58930 46358 48803
11468D8803j0916j2383j8651j598J0990J4519j3681j8064j841N1578K5067L161
$$ 48803 37887 25504 6853 5255 16245 30764 17083 -981 -2822 48756 73823 76984
11456G6984j6729p995l656j0018k600r864L745P781k4659j3408l422L239j2052
$$ 76984 60255 52260 48604 38586 35986 26122 29867 37648 12989 -419 -3841 -602 -12654
11443a2654J3379J0040p880j9915K1978O3712J3358p093r08m629j1864j4550n390
$$ -12654 725 10765 2885 -17030 4948 68660 82018 74925 74017 69388 57524 42974 37584
11430C7584Q480k662p356j405j1541k750L2463K1563K4718l274j3230l454j4941
$$ 37584 46064 43402 36046 34641 23100 20350 52813 74376 99094 95820 82590 79136 64195
11417F4195J3874N33K2161j3025j6998L101J0287k253J7244N201k2130n894Q984
$$ 64195 78069 78602 100763 87738 70740 73841 84128 81875 99119 104320 82190 76296 85280
11404H5280K2239j8046K604O194N873j4120r525j619j7711j3508J516K50J4823
$$ 85280 107519 89473 92077 98271 104144 90024 80499 78880 61169 47661 49177 49427 64250
11391F4250J0119J6428m060k2306k30P552O210O547L358J8263L316j8649k2526
$$ 64250 74369 90797 86737 64431 64201 71753 77963 84510 87868 106131 109447 90798 68272
11378F8272n8179n2346K1485N1968J9039m880l840k5878K2897K1563K2069J4538
$$ 68272 10093 -42253 -20768 31200 50239 45359 41519 15641 38538 60101 82170 96708
11366I6708l223j2375M945j9364j1132k5123m9J8561M6285M0064l3270k9918L7225
$$ 96708 93485 81110 86055 66691 55559 30436 30387 48948 95233 135297 102027 72109 109334
11353A09334L9215k1069k6946k0831J1369J1810j194n71q618j6936K0266J9616
$$ 109334 148549 127480 100534 79703 91072 102882 101688 101117 92499 75563 95829 115445
11341A15445j6201o237R513K149M466J3300j1857m2850k2124K5803L3715L156
$$ 115445 99244 93007 102520 104669 109135 122435 110578 67728 45604 71407 105122 108278
11329A08278j4150p038k0643j1986L210P985j7130j9534J3590J0010K3399L9918
$$ 108278 94128 87090 66447 54461 57671 65656 48526 28992 42582 52592 75991 115909
11317A15909m757n81J3630K691m1344l6086j3905l671J6528K7790P130l461O164
$$ 115909 111152 110571 124201 126892 85548 49462 35557 31886 48414 76204 83334 79873 86037
11304H6037K072j656j4315J0931J9045J1232L67o544k3595j4222j6624R034j1560
$$ 86037 88109 86453 72138 83069 102114 113346 113713 107169 83574 69352 52728 61762 50202
11291E0202Q584M0225l336p740q874j0881J766J5567k580j0973J36P019L4416
$$ 50202 58786 99011 95675 87935 79061 68180 69946 85513 82933 71960 72096 79115 113531
11278A13531q426j6708O723J477J133R20j149n335p462K0399Q498p834l4142j3936
$$ 113531 105105 88397 95120 96597 97730 98650 97501 92166 84704 105103 113601 105767 71625 57689
11264E7689K5733J7013r17J5408O561O778j4494k628K953J4516J1175k2241j4446
$$ 57689 83422 100435 99518 114926 121487 128265 113771 111143 114096 128612 139787 117546 103100
11251A03100n448K3435J5129j780J3017o446O682r153K825R204j8686m553O53
$$ 103100 97652 121087 136216 134436 147453 141007 147689 138536 141361 150565 131879 127326 127979
11238A27979l215N151K7420R836k3891j8520k3027k1423k9332q924K3181O777
$$ 127979 124764 129915 157335 167171 143280 124760 101733 80310 50978 42054 65235 72012
11226G2012L442K9685J3282m902l1712N69p833r442k511j0902K0848L7612L2396
$$ 72012 75454 105139 118421 113519 81807 82376 74543 65101 62590 51688 72536 110148 142544
11213A42544J1714q269m917K2988p262k5943m4600P031M3811Q976J410P317L008
$$ 142544 154258 145989 141072 164060 156798 130855 86255 93286 137097 146073 147483 154800 157808
11200A57808j3359Q538O519j594j2478k0169n671J9909J2890K7988r937l0920
$$ 157808 144449 152987 159506 157912 145434 125265 119594 139503 152393 180381 170444 139524
11188A39524j1740j4264J2537K487j8839r470M453K103R129j0356r389O49R348
$$ 139524 127784 113520 126057 128544 109705 100235 104688 106791 115920 105564 96175 96824 106172
11175A06172L1166J083m194L6349L4933o118k0169j1261k9205K0147N4023r823
$$ 106172 137338 138421 134227 170576 205509 199391 179222 167961 138756 158903 212926 203103
11163B03103q148K546j2848m479k2795J2834Q910J1464K466k3330p168J9140L2681
$$ 203103 194955 197501 184653 180174 157379 170213 179123 190587 193053 169723 162555 181695 214376
11150B14376L76p757j8914q87l527J6410n483J1651R995K475j6748J8135Q891
$$ 214376 214752 206995 188081 187194 183667 200077 194594 206245 216240 218715 201967 220102 228993
11137B28993M196j573k2559j4601j6305P289N020r922J3806K1591L057Q141j255
$$ 228993 233189 231616 209057 194456 178151 185440 190460 180538 194344 215935 218992 227133 225878
11124B25878N080J1542m3569n671P737R774j2718L1998N3q181m755o89n739J0306
$$ 225878 230958 242500 198931 193260 200997 210771 198053 230051 230104 221923 217168 216479 210740 221046
11110B21046m96N142L1431j9980j7383j8994M229J0830J7159K1437k6405m0345
$$ 221046 220550 225692 257123 237143 219760 200766 204995 215825 232984 254421 228016 187671
11098A87671k0145L203J9314L6094Q388j6990j2745M553q183k8792Q962J7047
$$ 187671 167526 170729 190043 226137 234525 217535 204790 209343 201160 172368 181330 198377
11086A98377k0154K153k144k5381j150K1896L9318l67j7593j8901j2915N315J9376
$$ 198377 178223 180376 178232 152851 151701 173597 212915 212548 194955 176054 163139 168454 187830
11073A87830N0541j709q894j6039O480J114j4680M677l7560j4906k416K5743J9709
$$ 187830 238371 236662 227768 211729 218209 219323 204643 209320 171760 156854 154438 180181 199890
11060A99890O796j8052j956m273J0626K6860j2774j4189j4661n24K7393K5641
$$ 199890 206686 188634 186678 182405 193031 219891 207117 192928 178267 177743 205136 230777
11048B30777k2349K7738J4687j9235q010J2808N091J5735j0012j7193j086K7216
$$ 230777 208428 236166 250853 231618 223608 236416 241507 257242 247230 230037 228951 256167
11036B56167j2709m5820n174J3365L0302K3392K0638J0135j6684K4169p959m5040
$$ 256167 243458 197638 192464 205829 236131 259523 280161 290296 273612 297781 289822 244782
11024B44782j7326J4011L7247j3187k3241Q56L7532K1593N364J2961k7153o112
$$ 244782 227456 241467 278714 265527 242286 243142 280674 302267 307631 320592 293439 287327
11012B87327J8168K0212Q431j5352j5686L812K407Q590K0398r491O863L6427O0146
$$ 287327 305495 325707 334138 318786 303100 306912 309319 317909 338307 328816 335679 372106 432252
10999D32252Q4993P6322L8526M1225N1856O470k3104k9551j9276R057m030j5537
$$ 432252 517245 593567 632093 673318 725174 731644 708540 678989 659713 668770 664740 649203
10987F49203J6686Q203N157M925K2632k584j9568L8713m962K4566L2961j0994
$$ 649203 665889 674092 679249 684174 706806 704222 684654 723367 718405 742971 775932 764938
10975G64938j9507L81K2943j4547J0564l453K290o934j5065k5839K6457L0528
$$ 764938 745431 745812 768755 754208 764772 761319 763609 756675 741610 715771 742228 772756
10963G72756J3555J5043M3242O6398O4418R2711J05496J09311J15173J24281M0947
$$ 772756 786311 801354 844596 910994 975412 1068123 1173619 1282930 1398103 1522384 1563331
10952A563331k2996p4005q4092o1733o4837o9349n6440m6286k7595l3564j9224
$$ 1563331 1540335 1466330 1382238 1320505 1255668 1186319 1129879 1083593 1055998 1022434 1003210
10941A003210J5344L6573l187j9415j9650j3260j6043k1939o503j4530m0372p779
$$ 1003210 1018554 1055127 1051940 1032525 1012875 999615 983572 961633 955130 940600 900228 892449
10929H92449r193k5416l9159m4439J2099K2865j0174l2067J460J0744R193J1091
$$ 892449 883256 857840 818681 774242 786341 809206 799032 766965 768425 779169 788362 799453
10917G99453M080K2978M5298P8728O3305K8290P853l6839n6777o9013j05390m7972
$$ 799453 803533 826511 871809 950537 1013842 1042132 1049985 1013146 956369 887356 781966 733994
10905G33994o045n1270m0123k1938k0293j7716k587l729k9873j4236J3061J1161
$$ 733994 727949 676679 636556 614618 594325 576609 574022 570293 540420 526184 539245 550406
10893E50406j7629l5915k4114O390J0791K172k434J944k2087k2085O606J2050
$$ 550406 532777 496862 472748 479138 489929 492101 489667 491611 469524 447439 454045 466095
10881D66095J3400N014M631J8818j8900k6574J793k4989k4215M635p815o838m129
$$ 466095 479495 484509 489140 507958 489058 462484 464277 439288 415073 419708 411893 405055 400926
10868D00926K048r734J4062K261k2453j9436J0679R500N925J0252J5620L0894
$$ 400926 402974 393240 407302 409563 387110 367674 378353 387853 393778 404030 419650 450544
10856D50544m525j5303O772N028j4142N961l296k5405N051J9589K4186r050q61
$$ 450544 446019 430716 437488 442516 428374 434335 431039 405634 410685 430274 454460 445410 444549
10843D44549j1553K1726K0081L9122Q428m0950j5632j489L5326K2757J5963N4061
$$ 444549 432996 454722 474803 513925 522353 481403 465771 464282 499608 522365 538328 592389
10831E92389M3725l0949k4351J5372M1886k2910l8499p862L4874Q682j477J1204
$$ 592389 636114 605165 580814 596186 638072 615162 576663 568801 603675 612357 610880 622084
10819F22084p402J9180J1851K4052J942j1444k2023Q137J1921L0361J7996l0846
$$ 622084 614682 633862 645713 669765 671707 660263 638240 646377 658298 688659 706655 675809
10807F75809l3739o827j2908J1818K6562J0912L2315K8503Q988J7542P720j2283
$$ 675809 642070 635243 622335 634153 660715 671627 703942 732445 741433 758975 766695 754412
10795G54412N60J8300Q547j4469O414J0454P515j8097k9434l0768k9882j6793
$$ 754412 754972 773272 781819 767350 773764 784218 791733 773636 744202 713434 683552 666759
10783F66759l20Q616Q539J1892k0836M126k079L204j4025l345r17l409j799J1565
$$ 666759 666439 675055 683594 695486 674650 678776 676697 679901 665876 662531 661614 658205 656406 667971
10769F67971j2815n285l0477l5216j8786k6209q657j987j8712l9427l685J4527
$$ 667971 655156 649871 619394 584178 565392 539183 530526 528539 509827 470400 466715 481242
10757D81242Q136J0879j0367K614m170j7794j3375j0490k510q539r687M524m5402
$$ 481242 489378 500257 489890 492504 488334 470540 457165 446675 444165 435626 425939 430463 385061
10744C85061j7995j6315J4230j0964l6818k065J6783O537k1540k0722j0982j7905
$$ 385061 367066 350751 364981 354017 317199 315134 331917 338454 316914 296192 285210 267305
10732B67305k2270j5981P784N6738K6550l97l505j8184m222L4323J5203R241q136
$$ 267305 245035 229054 236838 293576 320126 319729 316224 298040 293818 328141 343344 352585 344449
10719C44449J9676J2556q615J630k4026k688J7694K3016L1045K4827J0230K432
$$ 344449 364125 376681 368066 369696 345670 342982 360676 383692 414737 439564 449794 452226
10707D52226J4962K1214K8424J8181K6194J3740L7613K7802O3041R0615P5807
$$ 452226 467188 488402 516826 535007 561201 574941 612554 640356 703397 794012 869819
10696H69819M3947K1032N474J1900M6465L1937L8579L0494K1170M2674L8390K8214
$$ 869819 913766 934798 940272 952172 998637 1030574 1069153 1099647 1120817 1163491 1201881 1230095
10684A230095J166R24M0711L8958K3354L7716N7502M2801N5386O6150P9516R7792
$$ 1230095 1231261 1232185 1272896 1311854 1335208 1372924 1430426 1473227 1528613 1594763 1674279 1772071
10672A772071O3293N0050M8850K5814K0593L2271R4999Q3958Q3356R1085R0208
$$ 1772071 1835364 1885414 1934264 1960078 1980671 2012942 2107941 2191899 2275255 2366340 2456548
10661B456548P8808J24156J56542K26792K68455K78727K62899J74802J8059o1324
$$ 2456548 2535356 2659512 2816054 3042846 3311301 3590028 3852927 4027729 4045788 3984464
10651C984464j06685p9594n7900o923J358J5527N9046M4934L5215q571k4966k522
$$ 3984464 3877779 3798185 3740285 3733362 3734720 3750247 3809293 3854227 3889442 3880871 3855905 3853383
10639C853383O4000R5306J08630P2450O6652N0130k2940j5476L6537l877l8970
$$ 3853383 3917383 4012689 4121319 4193769 4260421 4310551 4287611 4272135 4308672 4304795 4265825
10628D265825n2838n7382j5178K8193N0041P0357R3544J13780J19094J46438J62888
$$ 4265825 4212987 4155605 4140427 4168620 4218661 4289018 4382562 4496342 4615436 4761874 4924762
10617D924762K01506K64158L51235L85244L46135K98599J88632J50389Q4682J06459
$$ 4924762 5126268 5390426 5741661 6126905 6473040 6771639 6960271 7110660 7195342 7301801
10607G301801J46344J93809K86005L74237N66644P67359R13471R81780Q64386
$$ 7301801 7448145 7641954 7927959 8302196 8868840 9636199 10549670 11531450 12395836
10598A2395836O96032N26987M69348M20611M12437L88804L58510L44684K67646
$$ 12395836 13091868 13618855 14088203 14508814 14921251 15310055 15668565 16013249 16280895
10589A6280895J43806l5042k87264n62223n17743j89596J67993N00246Q28361
$$ 16280895 16424701 16389659 16102395 15540172 15022429 14832833 15000826 15501072 16329433
10580A6329433J197336J700154K305940L223072M619343O629449R071519J1387713
$$ 16329433 17526769 19226923 21532863 24755935 29375278 36004727 45076246 56463959
10572E6463959J2504533J1271336O959618Q38577l961654n547274l926638o16117
$$ 56463959 68968492 80239828 87199446 88038023 84076369 78529095 74602457 73986340
10564G3986340K494878M343460M471037K959897P93453j048523j877577j162686
$$ 73986340 76481218 80824678 85295715 88255612 89049065 88000542 86122965 84960279
10556H4960279O63100K068890K046157P77865l36124L3632J823872L919685N651236
$$ 84960279 85623379 87692269 89738426 90516291 90180167 90213799 92037671 95957356 101608592
10547A01608592O552069O278571M739875K341891j33164j343141n99331J323384
$$ 101608592 108160661 114439232 119179107 121520998 121387834 120044693 119445362 120768746
10539A20768746L361551M913186N538940N296826M974468M966657N594433P974762
$$ 120768746 124130297 129043483 134582423 139879249 144853717 149820374 155414807 163389569
10531A63389569J2459719J7042796J8857469J5996661Q538470k701411j3682672
$$ 163389569 175849288 192892084 211749553 227746214 236284684 233583273 219900601
10524B19900601j7232129j3827814q910339n399942l514231k603809k077405j923075
$$ 219900601 202668472 188840658 179930319 174530377 171016146 168412337 166334932 164411857
10516A64411857k090434k150803j476921m57582l54696j895578m703236o619368
$$ 164411857 162321423 160170620 158693699 158236117 157881421 155985843 151282607 144663239
10508A44663239o779611o192342n232180m024792k578318r68788K34493K34948
$$ 144663239 137883628 131691286 126459106 122434314 119855996 118887208 119121701 119356649
10500A19356649q94045k267721k394402o65721J673488L153972K837918J066201
$$ 119356649 118462604 116194883 113800481 113134760 114808248 117962220 120800138 121866339
10492A21866339j023766k867094l546768j887470J836522N681516P558786N969899
$$ 121866339 120842573 117975479 114428711 112541241 114377763 120059279 127618065 133587964
10484A33587964J91688q474530j5388113j6645025j3625388r788813o821543m830802
$$ 133587964 133779652 125305122 109917009 93271984 79646596 69857783 63036240 58205438
10476E8205438l558843k759098k205977j734138j326501r98966o83292l97010
$$ 58205438 54646595 51887497 49681520 47947382 46620881 45621915 44938623 44541613
10468D4541613k10734r7417j72360m13318n07446n53270o93159p91994q73927
$$ 44541613 44330879 44233462 44061102 43647784 43140338 42587068 41893909 41101915 40227988
10459D0227988j023894j153198j131488j092745j166390j401490j466573j344986
$$ 40227988 39204094 38050896 36919408 35826663 34660273 33258783 31792210 30447224
10451C0447224j148977r46874q70250p97740p25553o04945n12804m70585n65145
$$ 30447224 29298247 28351373 27481123 26683383 25957830 25352885 24840081 24369496 23804351
10442B3804351o95899p63036p92720p17739o25832n74063n30257n04561m70059
$$ 23804351 23108452 22345416 21552696 20834957 20209125 19635062 19104805 18600244 18130185
10433A8130185m21503m00717l46236l28607l03235k54184k46354k09875j88362
$$ 18130185 17708682 17307965 16961729 16633122 16329887 16075703 15829349 15619474 15431112
10424A5431112k03252j80923j87062k03653j94857j74178j88933k91520k77601
$$ 15431112 15227860 15046937 14859875 14656222 14461365 14287187 14098254 13806734 13529133
10415A3529133j94631j64114j26045j21334j21926k11913k16273j44537r5301
$$ 13529133 13334502 13170388 13044343 12923009 12801083 12589170 12372897 12228360 12133059
10406A2133059Q806J08513J20962N9972L5033r1556j97405l19708m09799m47226
$$ 12133059 12141865 12250378 12371340 12431312 12466345 12374789 12177384 11857676 11447877 11000651
10396A1000651l98599l02784k12985j73665j70469j93544k01074j77184j91123
$$ 11000651 10602052 10299268 10086283 9912618 9742149 9548605 9347531 9170347 8979224
10387H979224j93303j05221r7022j16271q7627j30910j59473j89162j49814j59546
$$ 8979224 8785921 8680700 8583678 8467407 8379780 8248870 8089397 7900235 7750421 7590875
10377G590875j69922j51331j16410j32400j20280j06439q2807p6933q3943p5296
$$ 7590875 7420953 7269622 7153212 7020812 6900532 6794093 6711286 6634353 6550410 6475114
10367F475114r0321o7449r9945j29028r6708m6022n1430n5362n7068m4457r7291
$$ 6475114 6384793 6317344 6217399 6088371 5991663 5945641 5894211 5838849 5781781 5737324 5640033
10356E640033r9604j02798j28892j30037j01103j02677j33631j21903j03927q0756
$$ 5640033 5540429 5437631 5308739 5178702 5077599 4974922 4841291 4719388 4615461 4534705
10346D534705o6839r1139p5859o7983n0654n7237p6059p3199n7937p0854l4744
$$ 4534705 4467866 4376727 4300868 4232885 4182231 4124994 4048935 3975736 3917799 3846945 3812201
10335C812201n2257q1984o7998j9692n8502o9017l6955m6117n0256m4582n2776
$$ 3812201 3759944 3677960 3609962 3590270 3531768 3462751 3425796 3379679 3329423 3284841 3232065
10324C232065o8328o6304q2477m7085j3365m0986n7413n9394k6810m9343m1989
$$ 3232065 3163737 3097433 3014956 2967871 2954506 2913520 2856107 2796713 2769903 2720560 2678571
10313B678571l5266m8963o3911m3591o3345o0157m2195j4160k8700o0060l7948
$$ 2678571 2643305 2594342 2530431 2486840 2423495 2363338 2321143 2306983 2278283 2218223 2180275
10302B180275n151l8275m1987j3262k7754m2033j4830k2161o6343o3249n9071
$$ 2180275 2175124 2136849 2094862 2081600 2053846 2011813 1996983 1974822 1908479 1845230 1786159
10291A786159J9345j0211l5353j5993l3293l7961l8479j4889n7570m2084L922
$$ 1786159 1805504 1795293 1759940 1743947 1710654 1672693 1634214 1619325 1561755 1519671 1523593
10280A523593q111k6473j3912Q993j3610m7197l9264k3250m6478k1878l7555m2620
$$ 1523593 1515482 1489009 1475097 1484090 1470480 1423283 1384019 1360769 1314291 1292413 1254858 1212238
10268A212238n0921o9111o8885m0910j6318o271K998J4527m1617k6689j4123j1080
$$ 1212238 1161317 1092206 1023321 982411 966093 959822 962820 977347 935730 909041 894918 883838
10256H83838k3668Q972M917J0961j3142k8475j4222k5870j4877J5616j3252K4548
$$ 883838 860170 869142 874059 885020 871878 843403 829181 803311 788434 804050 790798 815346
10244H15346L6887L0902Q488J6036K6351M9522R0197J55288K23825K63282K60669
$$ 815346 852233 883135 891623 907659 934010 983532 1073729 1229017 1452842 1716124 1976793
10233A976793K55426K16175K07166J84207Q1819J8880j23177k36886k60898k25788
$$ 1976793 2232219 2448394 2655560 2839767 2921586 2940466 2817289 2580403 2319505 2093717
10223B093717k92768l13178j86912j49267j33793j15639r3423j8573k286p808
$$ 2093717 1800949 1487771 1300859 1151592 1017799 902160 808737 790164 787878 780070
10213G80070K275o716J837l4766m4702L1324J9219l2145j7082k8784r120k5057
$$ 780070 782345 775629 777466 742700 697998 729322 748541 716396 699314 670530 661410 636353
10201F36353O81L234j8259o310k2211K52n716l890J9741o803k1775M1764J2046
$$ 636353 637034 640268 622009 615699 593488 593740 588024 584134 603875 597072 575297 617061 629107
10188F29107m2994o363M5018K3548l6278m8665K487l932k8459j1720j3516k1991
$$ 629107 586113 579750 624768 648316 612038 563373 565860 561928 533469 521749 508233 486242
10176D86242J7157q54J8044J1665j5376K4496o942m0115k7047J5688K3453N251
$$ 486242 503399 502545 520589 532254 516878 541374 534432 494317 467270 482958 506411 511662
10164E11662p817k0256o637l5400J2467m21J0221K0220J7025K3680j5278k5161
$$ 511662 503845 483589 476952 441552 454019 453598 463819 484039 501064 524744 509466 484305
10152D84305l004K2860M3138j2574k9329l788J1031L6158M3977K3179N5314P3851
$$ 484305 481301 504161 547299 534725 505396 501608 512639 548797 592774 615953 671267 745118
10140G45118L3397L322J4192K6800J1639J4810K0557J0890J2328p773o8848k3092
$$ 745118 778515 781837 796029 822829 834468 849278 869835 880725 893053 885280 816432 793340
10128G93340J3451K9631K858q084L6835M0012K1282K6552K0773j997N139J6293
$$ 793340 806791 836422 839280 831196 868031 908043 929325 955877 976650 974653 979792 996085
10116I96085L154J5207L0818K4499M2526L3475J7271L8095O970P057j5059m397
$$ 996085 999239 1014446 1045264 1069763 1112289 1145764 1163035 1201130 1208100 1215157 1200098 1195701
10104A195701J5860K3779N1999M2531N6519Q1989J04702J15142N9807Q2192L7508
$$ 1195701 1211561 1235340 1287339 1329870 1386389 1468378 1573080 1688222 1748029 1830221 1867729
10093A867729K0921k1792o6181q0981r2626o9737m6846l0049k9062O251q963j456
$$ 1867729 1888650 1866858 1800677 1719696 1627070 1557333 1510487 1480438 1451376 1457627 1448664 1447208
10081A447208O490j085J9653J6006l839l25k0849l874J3158N043J1976J9468L1627
$$ 1447208 1453698 1452613 1472266 1488272 1484433 1484108 1463259 1459385 1472543 1477586 1489562 1509030 1540657
10068A540657K6854L6973K4746J1295L7947O53n559J2759N2777J8425L4188P4474
$$ 1540657 1567511 1604484 1629230 1640525 1678472 1679125 1673566 1686325 1739102 1757527 1791715 1866189
10056A866189Q2164O8389Q6538J06796P7966L9104K0157j6970j6840k864j3557
$$ 1866189 1948353 2016742 2103280 2210076 2288042 2327146 2347303 2330333 2313493 2310629 2297072
10045B297072j8233K3814N2190P8005J27221J15218Q0115j3782q4465o3526j6429
$$ 2297072 2278839 2302653 2354843 2432848 2560069 2675287 2755402 2741620 2657155 2593629 2577200
10034B577200J3456L1061J2983K3066L6964M6771P302J939l3862l947K119N912
$$ 2577200 2590656 2621717 2634700 2657766 2694730 2741501 2748803 2750742 2716880 2712933 2715052 2720964
10022B720964k6237j4000Q014n039k6397o9964n5630l3816m5677j7420K9852k6770
$$ 2720964 2694727 2680727 2688741 2683702 2657305 2587341 2531711 2497895 2452218 2434798 2464650 2437880
10010B437880m7205l4214m0340m1859n4313k1313Q93k9344k3772j6484j2822p9915
$$ 2437880 2390675 2356461 2316121 2274262 2219949 2198636 2199529 2170185 2146413 2129929 2117107 2037192
9998B037192q9420q2683o7840n9578m3733q863l8029n3646j4950j2827k2562k3904
$$ 2037192 1947772 1865089 1797249 1737671 1693938 1685075 1647046 1593400 1578450 1565623 1543061 1519157
9986A519157l0222k7297m0359m4823l3737j4523N927l0326m6657n5849l2820j5030
$$ 1519157 1488935 1461638 1421279 1376456 1342719 1328196 1334123 1303797 1257140 1201291 1168471 1153441
9974A153441j6632l5251k1692P641j4489n206P710r943j4553m0408l6004l2569
$$ 1153441 1136809 1101558 1079866 1087507 1073018 1067812 1075522 1065579 1051026 1010618 974614 942045
9962I42045j485r569k2190L078j4515k5704j7203j7552l1785j3222R576J511j6250
$$ 942045 940560 930991 908801 911879 897364 871660 854457 836905 805120 791898 801474 802985 786735
9949G86735N716K049r200q683n257k8410o809l1131m553M107J2570l4752k4836
$$ 786735 792451 794500 785300 776617 771360 742950 736141 705010 700457 704564 717134 682382 657546
9936F57546j4821J8947Q847N496j858j4419j6654K8600M4577K7655Q942K5317
$$ 657546 642725 661672 670519 676015 674157 659738 643084 671684 716261 743916 752858 778175
9924G78175M0836J8056m775j7458n6998o2200o0398l7292j0035K3422J6482j4939
$$ 778175 819011 837067 832292 814834 757836 695636 635238 597946 587911 611333 627815 612876
9912F12876j0670J1685k4091l2967q454J3292J7888J1785n434J2036j7068m0216
$$ 612876 602206 613891 589800 556833 548379 561671 579559 591344 585910 597946 580878 540662
9900E40662l7238j99j1134N817P14j4923J4678M1023K2342L2447L9696L6236L8913
$$ 540662 503424 503225 492091 497908 498622 483699 498377 539400 561742 594189 633885 670121 709034
9887G09034N5446N0420L8259K5238K5224O072L65J2711J1371N2525L4323M3412
$$ 709034 764480 814900 853159 878397 903621 909693 910058 922769 934140 986665 1020988 1064400
9875A064400N09l8397l5743m2201p5451j04613n6070l0073l5676l2842o141j6566
$$ 1064400 1064909 1026512 990769 948568 873117 768504 712434 682361 646685 613843 607702 591136
9863E91136l51j0618J0374K0109P100L9761J8227p60K9210J2228Q100J9191j6745
$$ 591136 590785 580167 590541 610650 617750 657511 675738 674978 704188 716416 724516 743707 726962
9850G26962k0413j6764j3373j1952M0096L5936K1290L5963O4364P8867M5961j7118
$$ 726962 706549 689785 676412 664460 704556 740492 761782 797745 862109 940976 986937 969819
9838I69819m0437K488J2594J6065N910L2723N860J2015L5439Q6428P1984J7720
$$ 969819 929382 931870 944464 960529 966439 999162 1005022 1017037 1052476 1138904 1210888 1228608
9826A228608j3944n1723q0650o5461m6381k5468j6053k9097l8371m9625l2096
$$ 1228608 1214664 1162941 1082291 1016830 970449 944981 928928 899831 861460 811835 779739
9815G79739J4345L5487K9919L9103k0044m1774k4243l7271o4438n2988q883P153
$$ 779739 794084 829571 859490 898593 878549 836775 812532 775261 710823 657835 648952 656105
9803F56105J6247O248M3566L0701L8979L4707K8659J3882O181k2211k2101m5326
$$ 656105 672352 678600 722166 752867 791846 826553 855212 869094 875275 853064 830963 785637
9791G85637l1324O415J9558M013Q128J9999N6510R3212M9536P6380J05545P0745
$$ 785637 754313 760728 780286 784299 792427 812426 868936 962148 1011684 1088064 1193609 1264354
9779A264354L412o3770q7472j02655q8871o6954o4011o2025l7952l386J2818J9975
$$ 1264354 1267766 1203996 1116524 1013869 924998 858044 794033 732008 694056 690670 703488 723463
9767G23463L3678L127m1013l1585m3563k6181k0306j3344J5321R863j0380o997
$$ 723463 757141 760268 719255 687670 644107 617926 597620 584276 599597 609460 599080 592083
9755E92083J163j4532L344l3523l1473j7567O028K0652O765j577Q875j658j458
$$ 592083 593246 578714 582058 548535 517062 499495 505523 526175 532940 531363 540238 538580 537122
9742E37122K1239K8426N6621N7098K6081P2670O2990j4106j3701n3667m4498m0800
$$ 537122 558361 586787 643408 700506 726587 799257 862247 848141 834440 780773 736275 695475
9730F95475o2560j4699R246j6043J45L9514M7021J8251K2469J8241P076O836j4185
$$ 695475 632915 618216 627462 611419 611564 651078 698099 716350 738819 757060 764136 770972 756787
9717G56787l0791k0164l8269m2220J8392K8713J7612L2004K085p962O676K2886
$$ 756787 725996 705832 667563 625343 643735 672448 690060 722064 724149 716187 722863 745749
9705G45749j1831j2361L1862J4867J4113J0612l1797o570o464r211J8875n224
$$ 745749 733918 721557 753419 768286 782399 793011 761214 754644 748180 738969 757844 752620
9693G52620j8701K5293J4170R660k0116j3809J8640L619J7263K7486J0925j4010
$$ 752620 733919 759212 773382 783042 762926 749117 767757 771376 788639 816125 827050 813040
9681H13040o350O4505M7191K2910K0205L0505j9366p2739p3862o5683l2081l582
$$ 813040 806690 871195 918386 941296 961501 992006 972640 899901 826039 760356 728275 724693
9669G24693J27Q600M802j168L154k4571l2273l0557j6435m1129J7906K9692O262
$$ 724693 724820 733420 738222 737054 740208 715637 683364 652807 636372 595243 613149 642841 649103
9656F49103j4137L585q632k7890k1202k0488j9017j9446k974j9321J3962J6608
$$ 649103 634966 638551 629919 602029 580827 560339 541322 521876 518902 499581 513543 530151
9644E30151L969l851p905K633j199n183p39j8145j0321J5740J4386p412j7357
$$ 530151 534120 530269 522364 524997 523798 518615 517876 499731 489410 505150 519536 512124 494767
9631D94767j7505j6765p135J7227o396k5476k806K8389J3955Q268Q4k6983k4083
$$ 494767 477262 460497 453362 470589 464193 438717 435911 464300 478255 486523 486607 459624 435541
9618D35541j164k3471m4735p428K8740r711J4762l0175l3769j5807N5331M3142
$$ 435541 434377 410906 366171 358743 387483 377772 392534 362359 328590 312783 368114 411256
9606D11256J8490J742J9941N518N624J693J6554L7534j8372p459J3457K2288M6273
$$ 411256 429746 431488 451429 456947 462571 464264 480818 518352 499980 492521 505978 528266 574539
9593E74539K7796j1212J8789K3105L0290O0888P9828Q0829R3801P4918L9951M0521
$$ 574539 602335 591123 609912 633017 663307 724195 804023 884852 978653 1053571 1093522 1134043
9581A134043O5589M7645N2636O969J748o565l6585R059k3R29L0481N5326M6189
$$ 1134043 1199632 1247277 1299913 1306882 1308630 1302065 1265480 1274539 1274516 1275445 1305926 1361252 1407441
9568A407441R7349R6821O0359J05187J14567Q5823P8014O3513M3894R303k4012
$$ 1407441 1504790 1601611 1661970 1767157 1881724 1967547 2045561 2109074 2152968 2162271 2138259
9557B138259j3477o665K0404L6131P1775J06990J08554J50265J81961J69598J61817
$$ 2138259 2124782 2118117 2138521 2174652 2246427 2353417 2461971 2612236 2794197 2963795 3125612
9546C125612J61699J80096J93680K77586L08006L14022K61538J70160J11434J33353
$$ 3125612 3287311 3467407 3661087 3938673 4246679 4560701 4822239 4992399 5103833 5237186
9536E237186K13271K63026K76198K08184Q3136q8717k56962l04252k70392j97475
$$ 5237186 5450457 5713483 5989681 6197865 6281001 6192284 5935322 5631070 5360678 5163203
9526E163203j14522j38106p7651J2084J7493O2363P5764P5406J13904J26943J58590
$$ 5163203 5048681 4910575 4832924 4845008 4862501 4924864 5000628 5076034 5189938 5316881 5475471
9515E475471K01019L11488M68114O56375Q96237J100181J235366J112433Q05920
$$ 5475471 5676490 5987978 6456092 7112467 8008704 9108885 10344251 11456684 12262604
9506A2262604L63920k6920k97528m95606n87360n78969m87380m19075m31280l96664
$$ 12262604 12626524 12599604 12302076 11806470 11219110 10640141 10152761 9733686 9302406 8905742
9496H905742l18957k39710j82259j20856o1268M5080J29908K30454K91300L73430
$$ 8905742 8586785 8347075 8164816 8043960 7982692 8027772 8157680 8388134 8679434 9052864
9486I052864M99126O35807P51055R53118J195568J488848J607471J398553Q70616
$$ 9052864 9551990 10187797 10938852 11891970 13087538 14576386 16183857 17582410 18453026
9477A8453026J21481n09849p88177q21936o71397l60460q5162K38915O67843J202612
$$ 18453026 18574507 18064658 17276481 16454545 15783148 15422688 15337526 15576441 16244284 17446896
9467A7446896J832178K586452L496247M716998O331566Q326083J0562188J2492313
$$ 17446896 19279074 21865526 25361773 30078771 36410337 44736420 55298608 67790921
9459F7790921J3118017J1473964O825819j82571o511074q787744p269751m516925
$$ 67790921 80908938 92382902 99208721 99026150 92515076 83727332 76457581 71940656
9451G1940656j908054M05480K324016L627641L954316L436122K995577L561539
$$ 71940656 70032602 70438082 72762098 76389739 80344055 83780177 86775754 90337293
9443I0337293N226693O894734Q131687Q850317Q535310O747639L328050p02894
$$ 90337293 95563986 102458720 110590407 119440724 127976034 134723673 138051723 137348829
9435A37348829l159784l458120l043375l265267l991152m066121l002473j042757
$$ 137348829 134189045 130730925 127687550 124422283 120431131 116365010 113362537 112319780
9427A12319780J278716L359063M731387N089448N035449N808686P683129J0820021
$$ 112319780 113598496 116957559 121688946 126778394 131813843 137622529 145305658 156125679
9419A56125679J5361090K0500668K5156170K7574409K4397733J3117428n189688
$$ 156125679 171486769 191987437 217143607 244718016 269115749 282233177 277043489
9412B77043489k2822030l0316775k8493971k3154647j6862176j0494326n094507
$$ 277043489 254221459 223904684 195410713 172256066 155393890 144899564 139805057
9405A39805057j892858j053165j925605l591877m149570k498599L01535L068019
$$ 139805057 137912199 136859034 134933429 131341552 127191982 124693383 124994918 128062937
9397A28062937M896760N610120N649695N574643N131446L611853O54209l681551
$$ 128062937 132959697 138569817 144219512 149794155 154925601 158537454 159191663 155510112
9389A55510112q138506j0749857j1089749r813614p465804m834731k722613j734652
$$ 155510112 147371606 136621749 125532000 115718386 108252582 103417851 100695238 98960586
9381I8960586j981187k626083k675382j566803M94484K802131M931422O481293
$$ 98960586 96979399 94353316 91677934 90111131 90605615 93407746 98339168 104820461
9373A04820461O526281M318980l72887o574827j1480392j2705768j0985780q547567
$$ 104820461 111346742 115665722 115292835 108718008 97237616 84531848 73546068 64998501
9365F4998501o472098m984432l901629l088858k403303j865520j428582j043149
$$ 64998501 58526403 53541971 49640342 46551484 44148181 42282661 40854079 39810930
9357C9810930p17008m48658k26548p6254m40j25299n05428r36634j369525j653933
$$ 39810930 39093922 38645264 38418716 38342462 38342022 38216723 37711295 36774661 35405136 33751203
9347C3751203j707578j538387j246788j034864r20836r06857q75767p84114o59807
$$ 33751203 32043625 30505238 29258450 28223586 27302750 26395893 25520126 24736012 24076205
9338B4076205n94499m76053l86298l40726l01192k18111j12104o3619L1254N4917
$$ 24076205 23481706 23005653 22619355 22278629 21977437 21759326 21647222 21583603 21614857 21669774
9328B1669774R5610J47791K18261K76593J55277j22155n43440r40898j181035
$$ 21669774 21765384 21913175 22131436 22408029 22563306 22441151 21897711 20956813 19775778
9319A9775778j197828j078588q53258o26037n00908m35380l70025l05164k78438
$$ 19775778 18577950 17499362 16646104 16020067 15519159 15083779 14713754 14408590 14130152
9310A4130152k64487k79859k40258k25298k35434k25547j82515j27506o0853l1296
$$ 14130152 13865665 13585806 13345548 13120250 12884816 12659269 12476754 12349248 12288395 12257099
9300A2257099k4480M0047O8589P4128P9675l5718j52649k60331k76875k54134
$$ 12257099 12232619 12272666 12341255 12415383 12495058 12459340 12306691 12046360 11769485 11515351
9290A1515351k23954j90621j34805j65257k14421k69368k52305k37339k16640
$$ 11515351 11291397 11100776 10965971 10800714 10586293 10316925 10064620 9827281 9610641
9281I610641k10763k02133k22629k09930k13246k01869j62442j80312j07514q2315
$$ 9610641 9399878 9197745 8975116 8765186 8551940 8350071 8187629 8007317 7899803 7817488
9271G817488q4231j13946j18228r3862r5163j07907j42172j16313j15005j27223
$$ 7817488 7733257 7619311 7501083 7407221 7312058 7204151 7061979 6945666 6830661 6703438
9261F703438r7908j14378j02976r6103q4102r8414j14240j03980r7112j14465
$$ 6703438 6605530 6491152 6388176 6292073 6207971 6109557 5995317 5891337 5794225 5679760
9251E679760j18798r0640m3176j3672n8705o6140q5805r8484j05499r0717j17756
$$ 5679760 5560962 5470322 5427146 5413474 5354769 5288629 5202824 5104340 4998841 4908124 4790368
9240D790368j14661q5769q0914q3027q5945r6270o6771o9092p6593p8435m4137
$$ 4790368 4675707 4589938 4509024 4425997 4340052 4243782 4177011 4107919 4031326 3952891 3908754
9229C908754j1338m2271r9400q5095o2959n8796m4221o7165m7779o1437m4195
$$ 3908754 3897416 3855145 3755745 3670650 3607691 3548895 3504674 3437509 3389730 3328293 3284098
9218C284098k8915n9833o5110o8535p7336o0097k385m3437p4105p3155p4776m7066
$$ 3284098 3255183 3195350 3130240 3061705 2984369 2924272 2921887 2878450 2804345 2731190 2656414 2609348
9206B609348l2425J1962j2350P36J866l8114o6536p6168o5490m7223q5548n2526
$$ 2609348 2576923 2588885 2576535 2577271 2579137 2541023 2474487 2398319 2332829 2285606 2200058 2147532
9194B147532m99k5622o275n4761k2289j2466l4030m5994j3994k7722l8989j8435
$$ 2147532 2147033 2121411 2115136 2060375 2038086 2025620 1991590 1945596 1931602 1903880 1864891 1846456
9182A846456j3077m9660n1618m3899l3553l1846o4926n8011m1127j1367j6998
$$ 1846456 1833379 1783719 1732101 1688202 1654649 1622803 1557877 1499866 1458739 1447372 1430374
9171A430374j2330k4069k4941r211l7493l3343j1627o237j3944j4912k7152k7569
$$ 1430374 1418044 1393975 1369034 1359823 1322330 1288987 1277360 1271123 1257179 1242267 1215115 1187546
9159A187546q677k5317l7545q2014o3490q1019r8456o0229j3630k7461l0694r253
$$ 1187546 1178869 1153552 1116007 1033993 970503 889484 791028 730799 717169 689708 659014 649761
9147F49761K5909M9708J0514J706j5738j0667j9724m226p688k1972l0377n9254
$$ 649761 675670 725378 735892 737598 721860 711193 691469 687243 679555 657583 627206 567952
9135E67952l1119K7768J9269p629j6884l3484n2507m5936K4858J0389k3554j1813
$$ 567952 536833 564601 583870 576241 559357 525873 473366 427430 452288 462677 439123 427310
9123D27310Q543Q305l8112m0337j1981P209J6158k647K6437l2543m4236j2897
$$ 427310 435853 444158 406046 365709 353728 360937 377095 374448 400885 368342 324106 311209
9111C11209j7885m692R700p103p961J9904J2938R707M737p45K5566n630m3642
$$ 311209 293324 288632 298332 291229 283268 303172 316110 325817 330554 329809 355375 349745 306103
9098C06103j3282J407J6811K9928K4552L7832N1958M4770Q178O989M4402L6594
$$ 306103 292821 294228 311039 340967 365519 403351 455309 500079 508257 515246 559648 596242
9086E96242m784m3139l3708o379n3728k1679k3199l2623k3289J8176k869M03j9499
$$ 596242 591458 548319 514611 508232 454504 432825 409626 377003 353714 371890 369021 369424 349925
9073C49925p590j1196k261Q586q449J716M334j3623N53p796j8896j4372J6189
$$ 349925 342335 331139 328878 337464 329015 330731 335065 321442 321995 314199 295303 280931 297120
9060B97120K1472L7553L0908K0554n230k232l398J0818J3942P810J1512M7478
$$ 297120 318592 356145 387053 407607 402377 400145 396747 407565 421507 429317 440829 488307
9048D88307O4830P4325R7628J14360Q3383M9437K274l6432o7208m7255m3593n6854
$$ 488307 553137 627462 725090 839450 922833 972270 974544 938112 870904 823649 780056 723202
9036G23202j6340l9327m0969l1363k3888j8209k1595m366j219j608j9998k1816
$$ 723202 706862 667535 626566 595203 571315 553106 531511 527145 525926 524318 504320 482504
9024D82504o412J247j665m1926j444j6714N220R929j2421L4926N3342J2532R335
$$ 482504 476092 477339 475674 433748 432304 415590 420810 430739 418318 453244 506586 519118 528453
9011E28453N199J9394m488j5411P891k4110M260L1877M7451J8967K9166L9560
$$ 528453 533652 553046 548558 533147 541038 516928 521188 553065 600516 619483 648649 688209
8999F88209M1667N0548L7238K5908M032K755l1850m3183L5557J2945j5885j2352
$$ 688209 729876 780424 817662 843570 847602 850357 818507 775324 810881 823826 807941 795589
8987G95589J1813n140r149j2939j7708j5165k6656m6667p2598o8171m4452m3818
$$ 795589 807402 802262 793113 780174 762466 747301 720645 673978 601380 533209 488757 444939
8975D44939k5205m5064j4085Q896N513J6594K3497K2593J9250m32k1818m1791
$$ 444939 419734 374670 360585 369481 374994 391588 415085 437678 456928 456496 434678 392887
8963C92887l0634n726l4169l7811P134L9618K3910p773K4805J7762J4876J6088
$$ 392887 362253 356527 322358 284547 291681 331299 355209 347436 372241 390003 404879 420967
8951D20967M5084P7639M7778k972P328l709K364J8366k861J7263R988K982k9285
$$ 420967 466051 543690 591468 588496 595824 592115 594479 612845 609984 627247 637235 640217 610932
8938F10932m3122n3170p5860n9274k7450q051l3213l8810l4075j0607J6625l142
$$ 610932 567810 514640 438780 379506 352056 344005 310792 271982 237907 227300 243925 240783
8926B40783j9697j6197j4554L348L9409j7362k4170k4042j5754j8068P467J7211
$$ 240783 221086 204889 190335 193683 233092 215730 191560 167518 151764 133696 141163 158374
8914A58374p848N266P319j19n751m557O253j2406J876K3474K323M0497L6354j1143
$$ 158374 150526 155792 163111 162992 157241 152684 158937 146531 148407 171881 174204 214701 251055 239912
8900B39912j6804K9002N390o140J90j9732m1604l3330j8130k1778n218J564L222
$$ 239912 223108 252110 257500 251360 251550 231818 190214 156884 138754 116976 111758 113322 116544
8887A16544j0176J9087J9931L409l4502j3179K0148J1579l3051j8356j9584j8503
$$ 116544 106368 125455 145386 148795 114293 101114 121262 132841 99790 81434 61850 43347
8875D3347o549L2148K1734q746n586J871l1504j641L5570J7855J3513r505o146
$$ 43347 36798 68946 90680 81934 76348 78219 46715 45074 80644 98499 112012 102507 96361
8862I6361M920m4589j1400k7588k9363K4552K5346j3989n550r953O764m519M45
$$ 96361 101281 56692 45292 17704 -11659 12893 38239 24250 18700 8747 15511 10992 11437
8849A1437R905L7536M6655j0609k1281l7291j2926J255K1J6409K609l1416J2725
$$ 11437 21342 58878 105533 94924 73643 36352 23426 24681 24702 41111 43720 12304 25029
8836B5029N526Q233r702j5857M067L520r61J7885p823q891Q386K3476O689j7103
$$ 25029 30555 38788 29086 13229 17296 20816 19855 37740 29917 21026 29412 52888 59577 42474
8822D2474K5497l740n330j1836j0278k2645k1810Q243O89K4422L75k486M119p079
$$ 42474 67971 64231 58901 47065 36787 14142 -7668 575 1264 25686 26061 23575 27694 20615
8808B0615J6157j032j8407j8751K1886J8296K7767J019k4207k6418k539k600m0060
$$ 20615 36772 35740 17333 -1418 20468 38764 66531 67550 43343 16925 14386 11786 -28274
8795b8274M08J7973k308p919J4725N155j3475J4167Q678n835m437j8685j5478
$$ -28274 -27866 -9893 -12201 -20120 -5395 -240 -13715 452 9130 3295 -1142 -19827 -35305
8782c5305j4399R180O576O86K2163K4098j72r990k933L926j8616j251R122J3816
$$ -35305 -49704 -40524 -33948 -33262 -11099 12999 12827 2837 -96 3830 -14786 -16037 -6915 6901
8768F901J2227J1185l6318M708r856J4135N579J1691j390m0324k4482K9463J6808
$$ 6901 19128 30313 -6005 -1297 -11153 2982 8561 20252 18862 -21462 -45944 -16481 327
8755C27k75P313k917L808K0880k368J060K956P452J7534k1352j1324p927K581
$$ 327 52 7365 4448 8256 29136 26768 27828 30784 38236 55770 34418 23094 15167 17748
8741A7748P814R756O188J660l2526k0981J317K1050Q642P244Q238J4247K73k685
$$ 17748 25562 35318 41506 43166 10640 -10341 -9024 12026 20668 27912 36150 50397 50670 47985
8727D7985k8031l8286j7094K1774L2550J6293r875J772j2834J1829p356k2984
$$ 47985 19954 -18332 -35426 -13652 18898 35191 25316 27088 14254 26083 18727 -4257
8715d257q941N268J5491q095n351J7841j3786j455O122n469K4589K3291j8363
$$ -4257 -13198 -7930 7561 -534 -5885 11956 -1830 -3285 2837 -2632 21957 45248 26885
8702B6885P229n382j097L256l98K4577K3891j3117k3770J3564J0160k9085k1835
$$ 26885 34114 28732 27635 30891 30493 55070 78961 65844 42074 55638 65798 36713 14878
8689A4878K2278Q038k3844l3196j3615k540R159J0165R726O827j1784K0391j9266
$$ 14878 37156 45194 21350 -11846 -25461 -28001 -18842 -8677 1049 7876 -3908 16483 -2783
8676b783j1901J7009M03K0221j1037k3578k3795K1955O234j6818j4566j0010J6741
$$ -2783 -14684 2325 2728 22949 11912 -11666 -35461 -13506 -7272 -24090 -38656 -48666 -31925
8663c1925j825j0785J7956K80P969J6368L552J0155J2843j1283J759J7398K3517
$$ -31925 -33750 -44535 -26579 -26299 -18330 -1962 1590 11745 24588 13305 15064 32462 55979
8650E5979k2350k1894R790J5662K0743j8868K817p812M060K2027J0077j5796k9761
$$ 55979 33629 11735 21525 37187 57930 39062 41879 34067 38127 60154 70231 54435 24674
8637B4674k6526o238o786j1992L908J0087j5913J3347L865O171M7475J1226l1528
$$ 24674 -1852 -8090 -14876 -26868 -22960 -12873 -28786 -15439 -11574 -5403 42072 53298 21770
8624B1770O929K0740L1975J3163J1182q908l0510M45N7033L0007Q735L9591P4632
$$ 21770 28699 49439 81414 94577 105759 96851 66341 66786 123819 153826 162561 202152 276784
8611B76784O9608N6451L7832L6942k8687o1398l2676j6420j382O8379Q5952N1151
$$ 276784 346392 402843 440675 477617 448930 387532 354856 338436 337054 405433 491385 542536
8599E42536M0971Q0778R2362P5576O5011O8326M6488k5629r3802j13968j33893
$$ 542536 583507 664285 756647 832223 897234 965560 1012048 986419 892617 778649 644756
8588F44756j24055j18463o5569o8154n3316N420P257J2831l5220l6474K041J8065
$$ 644756 520701 402238 336669 268515 215199 220619 227876 240707 205487 169013 171054 189119
8576A89119J3108n460p543K903L3545L1469M8253L2813N7918J31625J48787J10583
$$ 189119 202227 196767 189224 192127 225672 257141 305394 338207 396125 527750 676537 787120
8564G87120K8371j16881j73970j13432p5842l5729m0484k7509m197q375k9311
$$ 787120 815491 698610 524640 411208 335366 299637 259153 231644 227447 219072 189761
8553A89761k0622k362k8952O30j3698k1831j2787N01M730m259j6770j4597k377
$$ 189761 169139 166777 137825 138455 124757 102926 90139 90640 95370 91111 74341 59744 57367
8540E7367L2052J2947j052j1962j3929K4693O2962N038k2054j6042j7566P125
$$ 57367 89419 102366 101314 89352 75423 100116 163078 168116 146062 130020 112454 119579
8528A19579J6802L8462J1703L033K3440N8514O4190N2208J2085n7397o7856q9439
$$ 119579 136381 174843 186546 189579 213019 271533 335723 387931 400016 342619 274763 185324
8516A85324l6129k8611j3520k0195j2920m0066J8123L5140K038L998M514j2174
$$ 185324 149195 120584 107064 86869 73949 33883 52006 87146 89184 93182 97696 85522
8504H5522k0939O178j4422j5009J3786J884o779k4480p011L5938j167k996L495
$$ 85522 64583 70761 56339 41330 55116 57000 50221 25741 18730 54668 53501 50505 54000
8491E4000Q545R170j7457j8245p746K8651K8579J478l3034j0980M3013j7854K7378
$$ 54000 62545 71715 54258 36013 28267 56918 85497 86975 53941 42961 85974 68120 95498
8478I5498o546k1347r565J0556k764l4341j6054K2008K0793L269J497J2186j7924
$$ 95498 88952 67605 58040 68596 65832 31491 15437 37445 58238 61507 63004 75190 57266
8465E7266J6585K2916k5262r372k133K10r785j4125K0426K8043J4225j833j0696
$$ 57266 73851 96767 71505 62133 60000 60210 50425 36300 56726 84769 98994 97161 86465
8452H6465r272k654n64k1802j8940K933M731K142K3137M141k7477r237k859K8043
$$ 86465 77193 74539 73975 52173 33233 36166 40897 43039 66176 70317 42840 33603 30744 58787
8438E8787O941J2665M576j0100k7159J4027k2353J2555J5183K78q139p756k055
$$ 58787 65728 78393 82969 72869 45710 59737 37384 49939 65122 65400 57261 49505 47450
8425D7450N26o319j696j2567j3274j8319r174P041K9405j3110j3866J740J2805
$$ 47450 47976 41657 39961 27394 14120 -4199 -13373 -6332 23073 9963 -3903 -2163 10642
8412A0642r168J2781L0192k085J6935L6145L9044K8410l414q881l4710m4317m1179
$$ 10642 1474 14255 44447 42362 59297 95442 134486 162896 159482 150601 115891 71574 30395
8399C0395k5461j581l827R309m047K5843J5593r010j8166j0227N80P523l415l0137
$$ 30395 4934 3353 -474 8835 4788 30631 46224 37214 19048 8821 9401 16924 13509 -16628
8385a6628J6795J9279l44k6416m170L189j70J0724J7674L7074J8505p659K238
$$ -16628 167 19446 19102 -7314 -11484 -8295 -8465 2259 19933 57007 75512 67853 70091
8372G0091j4769m1678J2645M4570L6495L5312J1494J0613o209j7779m708k1528
$$ 70091 55322 13644 26289 70859 107354 142666 154160 164773 158564 140785 136077 114549
8360A14549l7460n1939k7531j6601L979K8766K4301J1187k9971j2118p577O420
$$ 114549 77089 25150 -2381 -18982 -15003 13763 38064 49251 19280 7162 -415 6005
8348F005n040J1716Q173K9106j068L088J2840j065m2093l4773K118J8292j4090
$$ 6005 965 12681 20854 49960 48892 51980 64820 63755 21662 -13111 -10993 7299 -6791
8335f791q022J9396L0674n384l556K5331J7527j6307k2042Q567L16J380J9459
$$ -6791 -14813 4583 35257 29873 26317 51648 69175 52868 30826 39393 39709 41089 60548
8322F0548j7370j4509k1487l4783l442M708L80J0076K0804j458M123p897j2803
$$ 60548 43178 28669 7182 -27601 -31043 -26335 -25955 -15879 4925 3467 7590 -307 -13110
8309a3110k828J8629L4672J6352k5252k6454j6633K850j5681l170J7839P822j7967
$$ -13110 -15938 2691 37363 53715 28463 2009 -14624 -11774 -27455 -30625 -12786 -4964 -22931
8296b2931J3001L4800K2632o457j7075m516r150M247j8366l3321P432M3304j398
$$ -22931 -9930 24870 47502 41045 23970 19454 10304 14551 -3815 -37136 -29704 13600 12202
8283A2202l4134L359L0610n358j6272q417n103J6739R28K363K2267n585K0674
$$ 12202 -21932 -18573 12037 6679 -9593 -18010 -23113 -6374 -5446 -3083 19184 13599 34273
8270C4273j3767q755L1522J3959k7139o325k190J576J0998j204j3993R685l8357
$$ 34273 20506 11751 43273 57232 30093 23768 21578 23154 34152 32948 18955 28640 -9717
8257i717n0217j367L2699K979J9794J5388R485m326j4675j5334J6371L6509K5727
$$ -9717 -59934 -61301 -28602 -25623 -5829 9559 19044 14718 43 -15291 1080 37589 63316
8244F3316J586J935J095P237k19L8705M495m3853l9270n734K0483r239J9442J1069
$$ 63316 64902 66837 67932 75169 74950 113655 118150 74297 35027 29293 49776 40537 59979 71048
8230G1048J587P675m808k9635Q08R550r266j3406j1448j7456j866l628j365K4224
$$ 71048 72635 80310 75502 45867 46675 56225 46959 33553 22105 4649 2783 -845 -2210 22014
8216B2014j0369j4012o618j5817J8987K0140J4427k4317R71J4395J5753k2486
$$ 22014 11645 -2367 -8985 -24802 -5815 14325 28752 4435 5406 19801 35554 13068
8204A3068j9734J6500j3790j5211L7275K4457q648J0469m835j0338j8276j1181
$$ 13068 -6666 9834 -3956 -19167 18108 42565 33917 44386 39551 29213 10937 -244
8192b44k71N952o955N980K0188J7887j8098L1053J9632m2945o0052j0906M578
$$ -244 -515 5437 -1518 4462 24650 42537 24439 55492 75124 32179 -27873 -38779 -34201
8179c4201M036J4788k369q159P522K4680J5693j4952P332N689j6365m567N274
$$ -34201 -30165 -15377 -17746 -25905 -18383 6297 21990 7038 14370 20059 3694 -873 4401
8166D401n031n914O055L5031J6844k6973J2536P958j7506m624J082l4319j8470
$$ 4401 -630 -6544 -489 34542 51386 24413 36949 44907 27401 22777 23859 -10460 -28930
8153b8930O971J7323K420k988j423J5683K920j1891j0972j6175J5386j492k2361
$$ -28930 -21959 -4636 -2216 -5204 -6627 9056 11976 85 -10887 -27062 -11676 -13168 -35529
8140c5529k4413L2856K7623K1066q884L725J2340Q201k0534k2319K5503J4872
$$ -35529 -59942 -27086 537 21603 12719 16444 28784 36985 16451 -5868 19635 34507
8128C4507O028j0090r754n780o656j1722K322j226j856j1248J5114J4229M376
$$ 34507 40535 30445 20691 14911 8255 -3467 -1145 -2371 -4227 -15475 -361 13868 18244
8115A8244Q917j1430K9448K9698L6936o739N2268L1370J5914N3900L3020P008
$$ 18244 27161 15731 45179 74877 111813 105074 157342 188712 204626 258526 291546 298554
8103B98554M5058L4757L2922K6906K0938k1086k8783k0100n2798q4995l2208l111
$$ 298554 343612 378369 411291 438197 459135 438049 409266 389166 336368 251373 219165 216054
8091B16054j3340j6780m2552n4029r318K2818J2154N91l2431k1112r891l400L0311
$$ 216054 202714 185934 143382 89353 80035 102853 115007 115598 83167 62055 52164 48764 79075
8078G9075k037k1284k4521L802K491K2902j224j7131n723K494O341k7478j4596
$$ 79075 77038 55754 31233 35035 37526 60428 59204 42073 36350 38844 45185 17707 3111
8065C111J2941l67j3064j8024l556L3225J6335K0651J3682j7386l9914q887L0530
$$ 3111 16052 15685 2621 -15403 -18959 14266 30601 51252 64934 47548 7634 -1253 29277
8052B9277J7779j0707j504K858K1060j710p417O351l9507j7082O635K0607J2291
$$ 29277 47056 36349 34845 37703 58763 57053 49636 55987 16480 -602 6033 26640 38931
8039C8931p637L93Q756N367J0141M052j0289m508k9231k0824K6663M3180J3043
$$ 38931 31294 31687 40443 45810 55951 60003 49714 45206 15975 -4849 21814 64994 78037
8026G8037k9269r254m3203l6609K90M813n193J3474L4622J210j8859K4056L5306
$$ 78037 48768 39514 -3689 -40298 -40008 -35195 -40388 -26914 7708 8918 -9941 14115 49421
8013D9421J0235n624R876l792j2592J3128k5314q658J4048O815M415j8532K3813
$$ 49421 59656 54032 63908 60116 47524 60652 35338 26680 40728 47543 51958 33426 57239
8000E7239K4409N847j7370k7892j6168j0959J213N700l5150k4228J7783K3993
$$ 57239 81648 87495 70125 42233 26065 15106 16319 22019 -13131 -37359 -19576 4417
7988D417J9768j0401j8424m501Q1j2914l163K1669l392Q031J0548N124J5102o487
$$ 4417 24185 13784 -4640 -9141 -9060 -21974 -25137 -3468 -6860 1171 11719 16843 31945 25458
7974B5458k230o632J7142K2506k1863k0839r386J429j3598J7035K186k9310K0797
$$ 25458 23228 16596 33738 56244 34381 13542 4156 5585 -8013 9022 11208 -18102 2695
7961B695K0893K2871K743j0441k2112J2548k4705J96J3141K2097J1804P231j6229
$$ 2695 23588 46459 49202 38761 16649 29197 4492 4688 17829 39926 51730 58961 42732
7948D2732R428k14j5136q019j2848k54o051J0571J1993N037L473Q293l469o522
$$ 42732 52160 51946 36810 28791 15943 15689 9638 20209 32202 37239 40712 49005 45536 39014
7934C9014j6786j9849n614p235O034k2734P134P605m962M63M0103K5040m737n950
$$ 39014 22228 2379 -3235 -10470 -4436 -27170 -20036 -12431 -17393 -16930 23173 48213 43476 37526
7920C7526j1636k9029j4922J2923N788n247K3100J3528J3233k0808j9035q979
$$ 37526 25890 -3139 -18061 -5138 650 -4597 18503 32031 45264 24456 5421 -3558
7908c558M043n898j4766J2316m028j0734J857J1227J0474l702N04R407k124o386
$$ -3558 485 -5413 -20179 -7863 -11891 -22625 -20768 -9541 933 -2769 -2265 7142 5018 -1368
7894a368j2364j3598J8713P316K5805Q663k0720k5233j540K4989J9808J5975Q586
$$ -1368 -13732 -27330 -8617 -1301 24504 33167 12447 -12786 -14326 10663 30471 46446 55032
7881E5032j5925l6444m836o41o032N462K2580n571j9908l4942N72M300k536K5297
$$ 55032 39107 2663 -2173 -2814 -8846 -3384 19196 13625 -6283 -41225 -40653 -36353 -38889 -13592
7867a3592M2031M798l3353l0900K263q864m600j2316J9403K875q12K4730l926
$$ -13592 28439 33237 -116 -31016 -28753 -37617 -42217 -54533 -35130 -32255 -33067 -8337 -12263
7854a2263j7420q43K3844j8574l2171o477J6141J2251Q94R02L0468o347j7792
$$ -12263 -29683 -30526 -6682 -25256 -57427 -63904 -47763 -35512 -34618 -33716 -3248 -9595 -27387
7841b7387j3797n183k74J9710J3286j9643q382M634l609K0632l617Q642J6718
$$ -27387 -41184 -46367 -46641 -26931 -13645 -33288 -41670 -37036 -40645 -20013 -23630 -14988 1730
7828A730k7306m290o899L747M453J2961k1946l565R435J1896L921J7518p098k6440
$$ 1730 -25576 -29866 -36765 -33018 -28565 -15604 -37550 -41115 -31680 -19784 -15863 1655 -5443 -31883
7814c1883K8927J7447k1446j0403k1931n648J5321K566J9809O910J2331q160l6440
$$ -31883 -2956 14491 -6955 -17358 -39289 -44937 -29616 -27050 -7241 -331 12000 3840 -32600
7801c2600J1931k6554O362p46o696K4736J9978j3540l4958L3583L566l208J1892
$$ -32600 -20669 -47223 -40861 -41607 -48303 -23567 -3589 -17129 -52087 -18504 -14938 -18146 -6254
7788f254j2475J4089k7417j3772K3987j1911k9530N545L3266k051K0410r318k0903
$$ -6254 -18729 -4640 -32057 -45829 -21842 -33753 -63283 -57738 -24472 -26523 -6113 -15431 -36334
7775c6334j3053O067K9275P954L8663L3694j7284l5993p904k7727k6333K2001
$$ -36334 -49387 -43320 -14045 -6091 32572 66266 48982 12989 5085 -22642 -48975 -26974
7763b6974N467j7792j2005R505j3354l369n759L2312n402J3J5539Q874K955j1741
$$ -26974 -21507 -39299 -51304 -41799 -55153 -58522 -64281 -31969 -37371 -37358 -21819 -12945 -9990 -21731
7749b1731J7857o913k3290K2513K8064J8l1874m802J5181R78k9850k0542N978
$$ -21731 -3874 -10787 -34077 -11564 16500 16518 -15356 -20158 -4977 -3999 -33849 -54391 -48413
7736d8413L4238J3294k4190L834L633J3863r900N202p090L1835q486j4693J5976
$$ -48413 -14175 -881 -25071 -21237 -17604 -3741 -13641 -8439 -15529 16306 7820 -6873 9103
7723I103P881J2316k4512m6404o029J2478m687P81M123j3254j4736J3890p84j0272
$$ 9103 16984 29300 4788 -41616 -47645 -35167 -39854 -39073 -34950 -48204 -62940 -49050 -49834 -60106
7709f0106P977J4545P062K3636R355j8003J7931L541j3750j6525j7698m884Q728
$$ -60106 -52129 -37584 -30522 -6886 2469 -15534 2397 5938 -7812 -24337 -42035 -46919 -38191
7696c8191o989J4896N5088l55j5243L350j1699j6288K45j757m086J8866M938k3831
$$ -38191 -45180 -30284 24804 24449 9206 12556 857 -15431 -15186 -16943 -21029 -2163 2775 -21056
7682b1056j0538q663M501R983q165j1592J1275J185J2788Q719K3324L188p099
$$ -21056 -31594 -40257 -35756 -25773 -33938 -45530 -34255 -33070 -20282 -11563 11761 14949 7850
7669G850j712K631j5768M45j3354p916J5632k2189J4577K8422L7176k5787l917
$$ 7850 6138 8769 -6999 -6554 -19908 -27824 -12192 -34381 -19804 8618 45794 20007 16090
7656A6090j2894R822k381k6970N762o423J807P956J4812k3513j3837q343q028
$$ 16090 3196 13018 10637 -16333 -10571 -16994 -15187 -7231 7581 -15932 -29769 -38112 -46140
7643d6140m168K6778P337n887q65j3860j3527p509l339J2933P744k0903J3051
$$ -46140 -50308 -23530 -16193 -22080 -22945 -36805 -50332 -57841 -61180 -48247 -40503 -61406 -48355
7630d8355K7573J9128l94J9945k7311j0679k1116L429K476j5617o348K7680J1071
$$ -48355 -20782 -1654 -2048 17897 -9414 -20093 -41209 -37780 -35304 -50921 -57269 -29589 -18518
7617a8518p104k7636J2389K1090n855Q421j0515R220J9691J8842l4503l0020L487
$$ -18518 -25622 -53258 -40869 -19779 -25634 -17213 -27728 -18508 1183 20025 -14478 -44498 -41011
7604d1011J7420O388J0917P493J8398J1462j5864j3698P415rk6330M12J7084m992
$$ -41011 -23591 -17203 -6286 1207 19605 31067 15203 1505 8920 8911 -17419 -17007 77 -4915
7590d915k0030j065j2027J0389l736P301K6049J0648r474J817j3326J0993k5669
$$ -4915 -24945 -26010 -38037 -27648 -31384 -24083 1966 12614 3140 4957 -8369 2624 -23045
7577b3045j6312L6103M8007j4430j4427j996q870k89j6427K9430n9723l2364L7398
$$ -23045 -39357 -3254 44753 30323 15896 13900 5030 4741 -11686 17744 -41979 -74343 -36945
7564c6945K2670l1365R044Q336R423l0636J1303J9091k1142o130j1350o250K6277
$$ -36945 -14275 -45640 -36596 -28260 -18837 -49473 -38170 -19079 -40221 -46351 -57701 -63951 -37674
7551c7674N675j5159k1865Q320L5692M7153L684j1857k5437J3415J7642p194k9974
$$ -37674 -31999 -47158 -69023 -60703 -25011 22142 25826 13969 -11468 1947 19589 12395 -17579
7538a7579l5698k659J1803j4440J4773K2342J1557j8967n441r359K413K1507J1795
$$ -17579 -53277 -55936 -44133 -58573 -43800 -21458 -9901 -28868 -34309 -43668 -41255 -19748 -7953
7525g953J1346j8167j1918j4262K4148L7181J3391j1916m3212J1061k6340o652
$$ -7953 3393 -14774 -26692 -40954 -16806 20375 33766 21850 -21362 -10301 -36641 -43293
7513d3293J5089J8255J0691L924j7232M665o740k7186j6103N795n835k6764P228
$$ -43293 -28204 -9949 742 4666 -12566 -7901 -14641 -41827 -57930 -52135 -57970 -84734 -77506
7500g7506M5090J0864k2635K365l972n418j7345J7496K2887R872K3271r610o178
$$ -77506 -32416 -21552 -44187 -41822 -45794 -51212 -68557 -51061 -28174 -18302 4969 -4641 -10819
7487a0819J5428K5509j2516k549m632q436l083j5449r523j053K8586K1230j2098
$$ -10819 4609 30118 17602 15053 10421 1985 -1098 -16547 -26070 -27123 1463 22693 10595
7474A0595j539j7311R532j5399J5064o248k3589Q861p094k2570J4609Q50J5126
$$ 10595 9056 -8255 1277 -14122 942 -5306 -28895 -20034 -27128 -49698 -35089 -34239 -19113
7461a9113K9492N847j5898l4129L261o622K0280m720o165J723p348J0585L923
$$ -19113 10379 16226 328 -33801 -30540 -37162 -16882 -21602 -27767 -26044 -33392 -22807 -18884
7448a8884k9979j4314P751M086r59K1971j269k8462J9672j6702P477J2105K784
$$ -18884 -48863 -63177 -55426 -51340 -52299 -30328 -31597 -60059 -40387 -57089 -49612 -37507 -34723
7435c4723p38j4857j6986N076J3717N542J339J9504Q021m279J2033l880p569m559
$$ -34723 -35461 -50318 -67304 -62228 -48511 -42969 -41630 -22126 -14105 -18384 -6351 -10231 -17800 -22359
7421b2359q700J8854N2904Q861j1728j7294j4469j7682k0417J7971Q743j4311
$$ -22359 -31059 -12205 40699 49560 37832 20538 6069 -11613 -32030 -14059 -5316 -19627
7409a9627j6702l1410m475k392L7067J2086J9940K0607j1136j2021p969L984M457
$$ -19627 -36329 -67739 -72214 -74606 -37539 -25453 -5513 15094 3958 -8063 -16032 -12048 -7591
7396g591k606P199M960M398j0771j9027M420Q658k3331O044J1340P920J5623P679
$$ -7591 -10197 -2998 1962 6360 -4411 -23438 -19018 -10360 -33691 -27647 -16307 -8387 7236 14915
7382A4915m1139l6507j0223k472P866K0237r848k60K8018J086p867j2589J1545
$$ 14915 -26224 -62731 -72954 -75426 -67560 -47323 -57171 -57431 -29413 -28327 -36194 -48783 -37238
7369c7238L1776L3532o824l5074L896J1574K8916O044j5611N176j0767P48j5585
$$ -37238 -5462 28070 21246 -13828 -9932 1642 30558 36602 20991 26167 15400 16148 563
7356E63O286J88q287j1261j6121j1240N883L647j7873J4594K7434q432J6331j1555
$$ 563 6849 7037 -1250 -12511 -28632 -39872 -33989 -30342 -48215 -33621 -6187 -14619 1712 -9843
7342i843j3690J4447j0628N965q441N77K9524K884j2791k4663K8l365o181J2350
$$ -9843 -23533 -9086 -19714 -13749 -22190 -21613 7911 10795 -1996 -26659 -26631 -29996 -36177 -23827
7328b3827J7474l757J8009K14m0581r131q018l87N143J6136K5845L3756M152j5711
$$ -23827 -6353 -10110 7899 8113 -32468 -41599 -49617 -50004 -44861 -28725 -2880 30876 35028 19317
7314A9317l1088j2908J7949J8458K4064j7070j1663J9488J6293l876k2083j5859
$$ 19317 -11771 -24679 -6730 11728 35792 18722 7059 26547 42840 38964 16881 1022
7302A022k5214k1162K9590K5715L1744k7364p605j1529l748r105k285M886j1485
$$ 1022 -24192 -45354 -15764 9951 41695 14331 6726 -4803 -8551 -17656 -19941 -15055 -26540
7289b6540j3116K5354J0771L030M862l3616k911L5019l236j9942j1347m26R929
$$ -26540 -39656 -14302 -3531 -501 4361 -29255 -32166 2853 -383 -20325 -31672 -32098 -22169
7276b2169j1687m969J3828P231l012J6191q891J7084Q181j1365j3668k4422J4144
$$ -22169 -33856 -38825 -24997 -17766 -20778 -4587 -13478 3606 11787 422 -13246 -37668 -23524
7263b3524J6179j0337l4573q166l1563J6583K6485p041J7002J7229l241K1718
$$ -23524 -7345 -17682 -52255 -60421 -91984 -75401 -48916 -55957 -38955 -21726 -24967 -3249
7251c249j9353J306K2206q699j1362k2197J032L717L926J3931J2738n664p298
$$ -3249 -22602 -21296 910 -7789 -19151 -41348 -40316 -36599 -32673 -18742 -6004 -11668 -18966
7238a8966j1456o193P665L0858m187k9050k59J3009j932n679K398j0077m150l485
$$ -18966 -30422 -36615 -28950 1908 -2279 -31329 -31588 -18579 -20511 -26190 -23792 -33869 -38019 -41504
7224d1504M187J2893O658O667p883m572J7370K2972J0158k6597j3114m731j9475
$$ -41504 -37317 -24424 -17766 -11099 -18982 -23554 -6184 16788 26946 349 -12765 -17496 -36971
7211c6971j3542K2222J1929L0675K1732K7292R044k1578l4312k3763m3113k7974
$$ -36971 -50513 -28291 -16362 14313 36045 63337 72381 50803 16491 -7272 -50385 -78359
7199g8359K0233L838J4023N364J903J004J1531R493k3681J6725L4258l9323l5025
$$ -78359 -58126 -54288 -40265 -34901 -32998 -31994 -20463 -10970 -34651 -17926 16332 -22991 -58016
7186e8016q057K3116j2423N211K4256K066r76j3050j1783L048o186O766M935J8172
$$ -58016 -66073 -42957 -55380 -50169 -25913 -23847 -24823 -37873 -49656 -46608 -52794 -46028 -41093 -22921
7172b2921R871q608l010l255k6715L0005q100q320L193J1833j9062k4277J013
$$ -22921 -13050 -21658 -24668 -27923 -54638 -24633 -32733 -41053 -37860 -26027 -45089 -69366 -68353
7159f8353K4820J0414k4196L232N360L178K2036K474k2978K6960M4678j6120k8330
$$ -68353 -43533 -33119 -57315 -54083 -48723 -45545 -23509 -21035 -44013 -17053 27625 11505 -16825
7146a6825j7407Q534n705N408L46n504p735K6868j268k7017j5221k1992O261K1421
$$ -16825 -34232 -25698 -31403 -25995 -25649 -31153 -38888 -12020 -13288 -40305 -55526 -77518 -71257 -49836
7132d9836Q513l458J1153L1386K3649k9139q012m339N103K5618J9358j2803O713
$$ -49836 -41323 -44781 -33628 -2242 21407 -7732 -15744 -20083 -14980 10638 29996 17193 23906
7119B3906N676R731m870k0789j5226j1933j2937j8601J0834J4519R751l105j4004
$$ 23906 29582 39313 34443 13654 -1572 -13505 -26442 -45043 -34209 -19690 -9939 -13044 -27048
7106b7048R846j0114k4883J5197M5065j0984l5773m485M641R193L914j4710r567
$$ -27048 -17202 -27316 -52199 -37002 8063 -2921 -38694 -43179 -38538 -29345 -25431 -40141 -49708
7093d9708R513J4953K6919J4728P975j7347l9633j2301M09l799p401J0739J3304
$$ -49708 -40195 -25242 1677 16405 24380 7033 -32600 -44901 -44492 -48291 -55692 -44953 -31649
7080c1649K5290k2170k2479o09L170j2121j0064j866R200o909L2184J2262j2031
$$ -31649 -6359 -28529 -51008 -51617 -48447 -60568 -70632 -72498 -63298 -70207 -38023 -25761 -37792
7067c7792R655M363r630L9592p740J2119m155j2235p578n635J5054K0364J745
$$ -37792 -28137 -23774 -33404 6188 -1552 10567 6412 -5823 -13401 -19036 -3982 16382 18127
7054A8127r777j6531o19N00k4213l7277P095M2459P540m073M981J5040J8164m321
$$ 18127 8350 -8181 -8800 -8300 -32513 -69790 -62695 -20236 -12696 -16769 -11788 3252 21416 17095
7040A7095k987k0764j1472J1469j2354j0341l859j8043j3162p062J3941J2804
$$ 17095 14108 -6656 -18128 -6659 -19013 -29354 -33213 -51256 -64418 -71480 -57539 -44735
7028d4735O178L1638r067m431M021J5681L4576J8490k0420k2418L192j4637k3768
$$ -44735 -38557 -6919 -15986 -20417 -16396 -715 33861 52351 31931 9513 12705 -1932 -25700
7015b5700j460j0960l30J0990K8260j2650j9873J1109j8690k0745j6774k229Q163
$$ -25700 -27160 -38120 -38450 -27460 800 -11850 -31723 -20614 -39304 -60049 -76823 -79052 -70889
7002g0889J5960L1558K4154J7385j0081r942j6839j590o378J4918k1270p464L0419
$$ -70889 -54929 -23371 783 18168 8087 -1855 -18694 -20284 -26662 -11744 -33014 -40478 -10059
6989a0059K8292j167j8559J4652J391n187q009j5365J7986R373O738N630k548
$$ -10059 18233 17066 -1493 13159 14550 9363 1354 -14011 3975 13348 20086 25716 23168
6976B3168j3435J4705k338j9690j6528L351K0757J0564K609P679j2398k7557R21
$$ 23168 9733 24438 22100 2410 -14118 -10767 9990 20554 23163 30842 18444 -9113 -8192
6963h192j9840M632j3396j8146j9971j932J660J0952K2148j6411K7405K4127k0887
$$ -8192 -28032 -23400 -36796 -54942 -74913 -76845 -75185 -64233 -42085 -58496 -31091 -6964 -27851
6950b7851m804M2286L641p648j8850M377p46P593K969J8265J8696l8768k506N715
$$ -27851 -32655 9631 13272 5624 -13226 -8849 -9595 -2002 967 19232 37928 -840 -3346 2369
6936B369K58j3650J2378J5092j604o013N98n118p664m439k7390m198P93K5394
$$ 2369 2627 -11023 1355 16447 14843 8830 9428 4310 -3354 -7793 -35183 -39381 -38588 -13194
6922a3194k981N073j0053l3764j5234P47K5558Q543K738L98M965J3896K1877J0674
$$ -13194 -16175 -11102 -21155 -54919 -70153 -69406 -43848 -35305 -32567 -32169 -27204 -13308 8569 19243
6908A9243P258J3089n450j9664J0928j2577l6957o984J2168M070K1263J9952j2286
$$ 19243 26501 39590 34140 14476 25404 12827 -24130 -31114 -18946 -14876 6387 26339 14053
6895A4053j8471j0843n278j2109R032K4038K515k0523m859K0768j3868o853J1179
$$ 14053 -4418 -15261 -20539 -32648 -23616 422 2937 -17586 -22445 -1677 -15545 -22398 -11219
6882a1219J2050J3375n524j4284M316j1713j3436j2985k192j1070N512Q250O120
$$ -11219 831 14206 8682 -5602 -1286 -12999 -26435 -39420 -41612 -52682 -47170 -38920 -32800
6869c2800Ql290R960J7250J425j2639m86J1805k856q557K2970M352l7524j5214
$$ -32800 -32792 -36082 -26122 -8872 -7447 -20086 -20572 -8767 -11623 -20180 2790 7142 -30382 -45596
6855d5596P015Q072J4550Q792J6750j3993j0914N051k058q575n345J0771j4899
$$ -45596 -38581 -30509 -15959 -7167 9583 -4410 -15324 -10273 -12331 -20906 -26251 -15480 -30379
6842c0379j5604j2765J0043K8468L3527P950r249k3173j9486n107M850J2517K630
$$ -30379 -45983 -58748 -48705 -20237 13290 21240 11991 -11182 -30668 -35775 -30925 -18408 -15778
6829a5778k252j4371J1494L0500r70J7576l96k7369p375k4272R93n175j4647K6492
$$ -15778 -18030 -32401 -20907 9593 8623 26199 25803 -1566 -8941 -33213 -32220 -37395 -52042 -25550
6815b5550O629q184k0844j8880J7802l4809M085L7662L3206j2451j586l406J4408
$$ -25550 -18921 -27105 -47949 -66829 -49027 -83836 -79751 -42089 -8883 -21334 -22920 -26326 -11918
6802a1918J3219j1113j3438j9412J0291J8571o031L386K1317K2817O49r814j4161
$$ -11918 1301 -9812 -23250 -42662 -32371 -13800 -19831 -16445 4872 27689 28338 18524 4363
6789D363L922O327m40n654j7248P625K7491K9865p104j8998N890l2737k2688j4090
$$ 4363 8285 14612 14172 8518 -8730 -1105 26386 56251 49147 30149 36039 3302 -19386 -33476
6775c3476J7119K4881O167j1608n066r133J2545N661k97k7639O443K4389J5436
$$ -33476 -16357 8524 14691 3083 -1983 -11116 1429 7090 6793 -20846 -14403 9986 25422
6762B5422l919q777j1628J0039k1184J9967L0393n523j0749k6529j9322J4634
$$ 25422 21503 12726 1098 11137 -10047 9920 40313 34790 24041 -2488 -21810 -7176
6750g176L760r91r243K109J8068J8573j0622Q288J0618k747p120j5408O45q342
$$ -7176 -3416 -4407 -13650 -11541 6527 25100 14478 22766 33384 30637 23517 8109 8754 412
6736D12o196m074J8412R395M494j4166n339J2755J868K093k9252p777K0769j7404
$$ 412 -5784 -9858 8554 17949 22443 8277 2938 15693 17561 19654 -9598 -17375 3394 -14010
6722a4010l382J3633J2542J4465k1129j9135M015N476J9139N145l0305k5902O796
$$ -14010 -17392 -3759 8783 23248 2119 -17016 -13001 -7525 11614 16759 -13546 -39448 -32652
6709c2652J994J1561K3081j6695j7396L5166M0838j4693j7185j3955K179j5900
$$ -32652 -30658 -19097 3984 -12711 -30107 5059 45897 31204 14019 64 2243 -13657
6697a3657l599r031j7168m821J4993L1723P310k535j2253J8703L414l3102j4705
$$ -13657 -17256 -26287 -43455 -48276 -33283 -1560 5750 3215 -9038 9665 13079 -20023 -34728
6684c4728j6576o440q145J1294J7486J1050j1441K8361J337j324m680P660p98
$$ -34728 -51304 -57744 -65889 -54595 -37109 -26059 -37500 -9139 -7802 -9126 -13806 -6146 -6944
6671f944L28n4755J7795J4590K2849K6160j0729j2220j7625k4773J1622M4458
$$ -6944 -6616 -61371 -43576 -28986 -6137 20023 9294 -2926 -20551 -45324 -33702 10756
6659A0756J7142l403m152J004m4402k5351N924K5013n678J710M167j0942l1411
$$ 10756 27898 24495 20343 21347 -23055 -48406 -42482 -17469 -23147 -21437 -17270 -28212 -59623
6646e9623n865k362K6866J8108L2374r667Q99J3959N260J2695l3550j4875j71
$$ -59623 -65488 -67850 -40984 -22876 9498 -169 730 14689 19949 32644 -906 -15781 -15952
6633a5952j4075j607Q875n579Q04k8176l442J6455Q609R942l84j9698K0511J0065
$$ -15952 -30027 -31634 -22759 -28338 -27534 -55710 -59152 -42697 -34088 -24146 -24530 -44228 -23717 -13652
6619a3652N622q440p205j3562L489J4761J1227K3332J5890M965j3836k7612m435
$$ -13652 -8030 -16470 -23675 -37237 -33748 -18987 -7760 15572 31462 36427 22591 -5021 -9456
6606i456r300J383j8740j2510N298L5001m330q850m395k2426N589J3469K2451
$$ -9456 -18756 -17373 -36113 -48623 -43325 -8324 -12654 -21504 -25899 -48325 -42736 -29267 -6816
6593f816K8647K2043j3631k0900k0337k0328J1189P552k7627j5188K8810J9668
$$ -6816 21831 43874 30243 9343 -10994 -31322 -20133 -12581 -40208 -55396 -26586 -6918
$$ [...]
##END NTUPLES=NMR SPECTRUM
##END=
