##TITLE=Analysis number 319260
Compound Code cc 55613
Book Reference 481/54
Project Code adrs
Chemist Name bruced
##JCAMPDX= 6.0         $$ Bruker NMR JCAMP-DX V2.0
##DATA TYPE= NMR SPECTRUM
##DATA CLASS= NTUPLES
##ORIGIN= Bruker BioSpin GmbH
##OWNER= nmr
$$ XWIN-NMR		Version 3.5
$$ Mon May  8 12:34:03 2006 GMT Daylight Time (UT+1h)  MAYBRIDGE\nmr@NMR_250MHZ
##.OBSERVE FREQUENCY= 250.131544655141
##.OBSERVE NUCLEUS= ^1H
##.ACQUISITION MODE= SIMULTANEOUS (DQD)
##.ACQUISITION SCHEME= undefined
##.AVERAGES= 16
##.DIGITISER RES= 18
##SPECTROMETER/DATA SYSTEM= dpx250
##.PULSE SEQUENCE= zg30
##.SOLVENT NAME= CDCl3
##.SHIFT REFERENCE= (INTERNAL, CDCl3, 0, 16.522)
##AUDIT TRAIL= $$ (NUMBER, WHEN, WHO, WHERE, WHAT)
$$ ##TITLE= Audit trail, XWIN-NMR		Version 3.5
$$ ##JCAMPDX= 5.01
$$ ##ORIGIN= Bruker BioSpin GmbH
$$ ##OWNER= nmr
$$ C:\u/data/dgb/nmr/ADRS/3850/pdata/1/auditp.txt
$$ ##AUDIT TRAIL=  $$ (NUMBER, WHEN, WHO, WHERE, WHAT)
(   1,<2006-05-08 12:33:37.92 +100>,<MAYBRIDGE\nmr>,<NMR_250MHZ>,
      <created by zg, POWCHK disabled, PULCHK disabled
       configuration hash MD5:
       84 BC 41 DB A1 6E 1D 46 DA 25 12 A5 C1 ED C5 3A
       data hash MD5: 64K
       00 AD CB F0 BA D2 81 8D 34 3B BC 95 CC 80 15 C1>)
(   2,<2006-05-08 12:33:53.52 +100>,<MAYBRIDGE\nmr>,<NMR_250MHZ>,
      <Start of raw data processing
       ef LB = 0.3 FT_mod = 6 PKNL = 1 SI = 32K 
       data hash MD5: 32K
       17 D2 B2 8D 53 2A 42 FB 2E 0C 56 83 7F 6C A5 DD>)
(   3,<2006-05-08 12:33:55.31 +100>,<MAYBRIDGE\nmr>,<NMR_250MHZ>,
      <apk 
       data hash MD5: 32K
       B7 DC 52 6D 3F 6B 4A 52 77 BB 84 88 19 B3 DA 11>)
(   4,<2006-05-08 12:33:56.08 +100>,<MAYBRIDGE\nmr>,<NMR_250MHZ>,
      <abs ABSG = 5 
       data hash MD5: 32K
       6B 1A 9E BE 9F 8C 38 31 FC A7 CA 99 10 8D 2C 3C>)
$$ ##END=
$$ 
$$ hash MD5
$$ 8E CD F9 70 94 2F BD BA 16 10 4A 20 D6 EA 6A 2A
##$RELAX= 
##$RELAX= 
##$RELAX= 
##$RELAX= 
##$RELAX= 
##$RELAX= 
##$RELAX= 
$$ Bruker specific parameters
$$ --------------------------
##$DU= <C:\u>
##$EXPNO= 3850
##$NAME= <ADRS>
##$PROCNO= 1
##$TYPE= <nmr>
##$USER= <dgb>
##$AMP= (0..31)
100 100 100 100 100 100 100 100 100 100 100 100 100 100 100 100 100 100 
100 100 100 100 100 100 100 100 100 100 100 100 100 100 
##$AQSEQ= 0
##$AQ_mod= 3
##$AUNM= <au_zg>
##$AUTOPOS= <30 >
##$BF1= 250.13
##$BF2= 250.13
##$BF3= 250.13
##$BF4= 250.13
##$BF5= 500.13
##$BF6= 500.13
##$BF7= 500.13
##$BF8= 500.13
##$BYTORDA= 1
##$CFDGTYP= 0
##$CFRGTYP= 5
##$CHEMSTR= <none>
##$CNST= (0..31)
1 1 145 1 1 1 1 1 1 1 1 1 1 1 1 1 1 1 1 1 1 1 1 1 1 1 1 1 1 1 1 1 
##$CPDPRG= <>
##$CPDPRG1= <>
##$CPDPRG2= <>
##$CPDPRG3= <>
##$CPDPRG4= <mlev>
##$CPDPRG5= <mlev>
##$CPDPRG6= <mlev>
##$CPDPRG7= <mlev>
##$CPDPRG8= <mlev>
##$CPDPRGB= <>
##$CPDPRGT= <>
##$D= (0..31)
0 1 0 0 0 0 0 0 0 0.06 0 0 0 0 0 0 0.0002 0 0 0 0 0 0 0 0 0 0 0 0 0 0 
0 
##$DATE= 1147088017
##$DBL= (0..7)
120 120 120 120 120 120 120 120 
##$DBP= (0..7)
150 150 150 150 150 150 150 150 
##$DBP07= 0
##$DBPNAM0= <>
##$DBPNAM1= <>
$$ [...]
##$SUBNAM7= <"">
##$SUBNAM8= <"">
##$SUBNAM9= <"">
##$SW= 20.6930455092707
##$SWIBOX= (0..15)
0 0 3 0 0 0 0 0 0 0 0 0 0 0 0 0 
##$SW_h= 5175.983436853
##$TD= 65536
##$TD0= 1
##$TE= 295.16
##$TE2= 300
##$TE3= 300
##$TEG= 300
##$TL= (0..7)
0 120 120 120 120 120 120 120 
##$TP= (0..7)
150 150 150 150 150 150 150 150 
##$TP07= 0
##$TPNAME0= <>
##$TPNAME1= <>
##$TPNAME2= <>
##$TPNAME3= <>
##$TPNAME4= <>
##$TPNAME5= <>
##$TPNAME6= <>
##$TPNAME7= <>
##$TPOAL= (0..7)
0.5 0.5 0.5 0.5 0.5 0.5 0.5 0.5 
##$TPOFFS= (0..7)
0 0 0 0 0 0 0 0 
##$TUNHIN= 0
##$TUNHOUT= 0
##$TUNXOUT= 0
##$USERA1= <user>
##$USERA2= <user>
##$USERA3= <user>
##$USERA4= <user>
##$USERA5= <user>
##$V9= 5
##$VALIST= <valist>
##$VCLIST= <CCCCCCCCCCCCCCC>
##$VD= 0
##$VDLIST= <DDDDDDDDDDDDDDD>
##$VPLIST= <PPPPPPPPPPPPPPP>
##$VTLIST= <TTTTTTTTTTTTTTT>
##$WBST= 1024
##$WBSW= 4
##$XGAIN= (0..3)
0 0 0 0 
##$XL= 0
##$YL= 0
##$YMAX_a= 460075
##$YMIN_a= -277943
##$ZGOPTNS= <>
##$ZL1= 120
##$ZL2= 120
##$ZL3= 120
##$ZL4= 120
##$ABSF1= 16.522
##$ABSF2= -4.171173
##$ABSG= 5
##$ABSL= 3
##$ALPHA= 0
##$AQORDER= 0
##$ASSFAC= 0
##$ASSFACI= 0
##$ASSFACX= 0
##$ASSWID= 0
##$AUNMP= <proc_1d>
##$AZFE= 0.1
##$AZFW= 0.1
##$BCFW= 0
##$BC_mod= 0
##$BYTORDP= 0
##$COROFFS= 0
##$CY= 12.5
##$DATMOD= 1
##$DC= 0
##$DFILT= <>
##$DTYPP= 0
##$F1P= 14.0000005364418
##$F2P= -0.99999901652339
##$FCOR= 0.5
##$FTSIZE= 32768
##$FT_mod= 6
##$GAMMA= 0
##$GB= 0
##$INTBC= 1
##$INTSCL= 1
##$ISEN= 128
##$LB= 0.3
##$LEV0= 0
##$LPBIN= 0
##$MAXI= 10000
##$MC2= 0
##$MEAN= 0
##$ME_mod= 0
##$MI= 0
##$NCOEF= 0
##$NC_proc= -5
##$NLEV= 6
##$NOISF1= 0
##$NOISF2= 0
##$NSP= 0
##$NTH_PI= 0
##$NZP= 0
##$OFFSET= 16.522
##$PC= 1
##$PHC0= 17.16504
##$PHC1= 5.121938
##$PH_mod= 1
##$PKNL= yes
##$PPARMOD= 0
##$PSCAL= 4
##$PSIGN= 0
##$REVERSE= no
##$SF= 250.13
##$SI= 32768
##$SIGF1= 0
##$SIGF2= 0
##$SINO= 400
##$SIOLD= 32768
##$SREGLST= <1H.CDCl3>
##$SSB= 0
##$STSI= 32768
##$STSR= 0
##$SW_p= 5175.98343685301
##$SYMM= 0
##$S_DEV= 0
##$TDeff= 65536
##$TDoff= 0
##$TI= <Analysis number 999999
Compound Code 99
Book Reference 9
Project Code 9>
##$TILT= no
##$TM1= 0
##$TM2= 0
##$TOPLEV= 0
##$USERP1= <user>
##$USERP2= <user>
##$USERP3= <user>
##$USERP4= <user>
##$USERP5= <user>
##$WDW= 1
##$XDIM= 32768
##$YMAX_p= 385354375
##$YMIN_p= -117931
$$ End of Bruker specific parameters
$$ ---------------------------------
##NTUPLES= NMR SPECTRUM
##VAR_NAME=  FREQUENCY,     SPECTRUM/REAL,   SPECTRUM/IMAG
##SYMBOL=    X,             R,               I
##VAR_TYPE=  INDEPENDENT,   DEPENDENT,       DEPENDENT
##VAR_FORM=  AFFN,          ASDF,            ASDF
##VAR_DIM=   32768,         32768,           32768
##UNITS=     HZ,            ARBITRARY UNITS, ARBITRARY UNITS
##FACTOR=    0.157963299565203, 1,           1
##FIRST=     4132.6476996994, 0,             0
##LAST=      -1043.33573715361, 0,           0
##MIN=       -1043.33573715361, -117931,     0
##MAX=       4132.6476996994, 385354375,     0
$$ Real data points
##PAGE= N=1
##DATA TABLE= (X++(R..R)), XYDATA
$$ [...]
18454G4630K937L545K2320m532O52m782k1445J303k26l146K0875J3773K9925R751
$$ 74630 77567 81112 103432 98900 99552 94770 73325 74628 74402 71256 92131 105904 135829 145580
18440A45580j2861j4431m293o969N909J102J1944Q020P797O946j7791L91N555
$$ 145580 132719 118288 113995 107026 112935 114037 125981 134001 141798 148744 130953 131344 136899
18427A36899J7262k0511k6156J1922L3478J158q721J94j7906j8555j3397k3056
$$ 136899 154161 133650 107494 119416 152894 154052 145331 145525 127619 109064 95667 72611
18415G2611j4059J3950q915O455J3146O038L202R675m301N71Q71j5896J9667N070
$$ 72611 58552 72502 63587 70042 83188 89226 92428 102103 97802 98373 99244 83348 103015 108085
18401A08085j1525O422J0157L8069r92j3015Q501J0786M650k5374l6564K7670
$$ 108085 96560 102982 113139 151208 150216 137201 145702 156488 161138 135764 99200 126870
18389A26870K4875J1818K2214R737R648n513J0577L8220M2084J8790K84l0341
$$ 126870 151745 163563 185777 195514 205162 199649 210226 248446 290530 309320 309604 279263
18377B79263l2550Q201J3171m942j1924j1578k7404l3009j5167j1164r959J366
$$ 279263 246713 254914 268085 263143 251219 239641 212237 179228 164061 152897 142938 144304
18365A44304N217J4491J0842K9633K3152L1175L1589M477P343J4446l693k0578
$$ 144304 149521 164012 174854 204487 227639 258814 290403 294880 302223 316669 312976 292398
18353B92398K7868J7591K8014L8862p259J2433M0452k1127k5818l1005J2420J2623
$$ 292398 320266 337857 365871 404733 397474 409907 450359 429232 403414 372409 384829 397452
18341C97452k7995j5198k2152j6869R375K4112j3549k0809j1929k60n536J5296
$$ 397452 369457 354259 332107 315238 324613 348725 335176 314367 302438 302178 296642 311938
18329C11938K7095k8565J606J0931k171m3074j9488O544K2050K2310J220R652
$$ 311938 339033 310468 312074 323005 320834 277760 258272 264816 286866 309176 310396 320048
18317C20048k9422m265J2631O943J8134J0796N2826K6360o44k7454M848o087j5448
$$ 320048 290626 286361 298992 305935 324069 334865 387691 414051 413407 385953 390801 384714 369266
18304C69266m310j262k6482J3345K4317K4514N2519L2950J2063k7121m5494J185
$$ 369266 364956 363694 337212 350557 374874 399388 451907 484857 496920 469799 424305 425490
18292D25490k944p80J9988j7499J2131O306j6052k831O715p076P82J8254L6896
$$ 425490 422546 421766 441754 424255 436386 442692 426640 423809 430524 423448 424230 442484 479380
18279D79380K8665J4304q746N850O064o789q928J3757j1354j4334K597L0950R824
$$ 479380 508045 522349 513603 519453 525517 518728 509800 523557 512203 497869 500466 531416 541240
18266E41240j3316p508J8699J8854L2608k9659R265J6721j7189r631J3478k199
$$ 541240 527924 520416 539115 557969 590577 560918 570183 586904 569715 560084 573562 571363
18254E71363k4117k2374j7626o829q815j3242K5954m92K1929J7541L5713K1039
$$ 571363 547246 524872 507246 500417 491602 478360 504314 503822 525751 543292 579005 600044
18242F00044K5161J0579J6618J4607K035O4088M2007M53j7397J2990j5634k800
$$ 600044 625205 635784 652402 667009 669044 733132 775139 775592 758195 771185 755551 752751
18230G52751j9725N851L0199N2183L7668N919P293k2895L2714K3709J037j113
$$ 752751 733026 738877 769076 821259 858927 864846 872139 849244 881958 905667 906704 905591
18218I05591n342L2292P5960Q4100N3383N4224O5734Q9833P4909O9346N9661R5281
$$ 905591 900249 932541 1008501 1092601 1145984 1200208 1265942 1355775 1430684 1500030 1559691 1654972
18206A654972J44574J73092J60551J20587J51992J89192K02723K13494K23955
$$ 1654972 1799546 1972638 2133189 2253776 2405768 2594960 2797683 3011177 3235132
18197C235132K83790L75415N24952P35473Q97072J060154J201985J341106J520094
$$ 3235132 3518922 3894337 4419289 5154762 6051834 7111988 8313973 9655079 11175173
18188A1175173J680063K033714K798620L987115N326338O428692P126489P064703
$$ 11175173 12855236 14888950 17687570 21674685 27001023 33429715 40556204 47620907
18180D7620907N703386L416931J031764j127363k343495k880291l439987l697700
$$ 47620907 53324293 56741224 57772988 56645625 54302130 51421839 47981852 44284152
18172D4284152l551835l060179k248022j336359n34808Q0668J24128l92309j174362
$$ 44284152 40732317 37672138 35424116 34087757 33552949 33633617 33757745 33365436 32191074
18163C2191074j958358k451526k524510k370097k055890j613763j137034p44069
$$ 32191074 30232716 27781190 25256680 22886583 20830693 19216930 18079896 17335827
18155A7335827l96381j30168J12306L26912O08170R53411J394427K074594L003916
$$ 17335827 16939446 16809278 16921584 17248496 17856666 18810077 20204504 22279098 25283014
18146B5283014M078743N000144N602324N522891M353450K441707N16244r19403
$$ 25283014 29361757 34361901 39964225 45487116 49840566 52282273 52798517 51879114
18138E1879114j145620J2389K392891N995537J0899864J6813771K3115740K9103260
$$ 51879114 50733494 50745883 53138774 59134311 70034175 86847946 109963686 139066946
18130A39066946L3553647L4385040L0259595K1608400R904530k967443j4265360
$$ 139066946 172620593 207005633 237265228 258873628 268778158 265810715 251545355
18123B51545355k1681351k4918040k4053287k0795511j7805624j5540811j3874009
$$ 251545355 229864004 204945964 180892677 160097166 142291542 126750731 112876722
18116A12876722j2594320j0694290q424887o038624l608734j386600R67960M096686
$$ 112876722 100282402 89588112 81163225 75124601 71515867 70129267 71097227 75193913
18108G5193913Q575916J3794194J4272913J0154387P004889M896282P553010J3192000
$$ 75193913 83769829 97564023 111836936 121991323 128996212 133892494 141445504 154637504
18100A54637504J8076746K2203999K5404030K5424305K1436362J4142540M060156
$$ 154637504 172714250 194918249 220322279 245746584 267182946 281325486 285385642
18093B85385642p144472j7268150k4745324k8626368k8597890k5787275k1558807
$$ 285385642 278241170 260973020 236227696 207601328 179003438 153216163 131657356
18086A31657356j6599063j1515575p017818l648869j471884m25007o60002j948666
$$ 131657356 115058293 103542718 96524900 92876031 91404147 90979140 90319138 88370472
18078H8370472l516756m878935n694195n747963n332294m640294l774532k998550
$$ 88370472 84853716 79974781 74280586 68532623 63200329 58560035 54785503 51786953
18070E1786953k416396j965135j650647j382440j119093q51496n14235n8823M59188
$$ 51786953 49370557 47405422 45754775 44372335 43253242 42401746 41887511 41828688 42287876
18061D2287876R94132J419852J721994J873132J786301J361236P15192J12472
$$ 42287876 43282008 44701860 46423854 48296986 50083287 51444523 52159715 52272187
18053E2272187p3708J95292P20696J309144K101349L000791L674253L936118L713744
$$ 52272187 52198479 52393771 53114467 54423611 56524960 59525751 63200004 67136122 70849866
18044G0849866L244851K677112J313851r45745l178137m987121o038635o208510
$$ 70849866 74094717 76771829 78085680 77139935 73961798 68974677 62936042 56727532
18036E6727532n815072n118326m137009l174776k505498k092057j856347j684536
$$ 56727532 50912460 45794134 41657125 38482349 35976851 33884794 32028447 30343911
18028C0343911j499009j369024j181456j005538q26415p69948p23043o74167o22050
$$ 30343911 28844902 27475878 26294422 25288884 24462469 23692521 22969478 22295311 21673261
18019B1673261o18330o24347o29049o21752n54120n33734n49009n11247m39047
$$ 21673261 21054931 20430584 19801535 19179783 18625663 18091929 17542920 17031673 16592626
18010A6592626m17577m10616l91671l96303l59959l06740k80730l34326l34570
$$ 16592626 16175049 15764433 15372762 14976459 14616500 14309760 14029030 13694704 13360134
18001A3360134k86054k89312l27357l49458l16613k95785k72644k37765k31455
$$ 13360134 13074080 12784768 12457411 12107953 11791340 11495555 11222911 10985146 10753691
17992A0753691k03654j47242j40223j24416j43490j16111j12075j51162j48173
$$ 10753691 10550037 10402795 10262572 10138156 9994666 9878555 9766480 9615318 9467145
17983I467145j48565j49831j51059j26815n2160q553P3322J40651K30862K84288
$$ 9467145 9318580 9168749 9017690 8890875 8838715 8830162 8903484 9044135 9274997 9559285
17973I559285K56247K18863J22622m790j38834k87333l96023m62738m69072m34164
$$ 9559285 9815532 10034395 10157017 10152227 10013393 9726060 9330037 8867299 8398227 7964063
17963G964063l99551l13807k87255k62076k75364k42452j91692j84132j94368
$$ 7964063 7564512 7250705 6963450 6701374 6426010 6183558 5991866 5807734 5613366
17954E613366j79792j23732r6406j05446j29856j10991j03822q5279p7751q9323
$$ 5613366 5433574 5309842 5213436 5107990 4978134 4867143 4763321 4678042 4600291 4510968
17944D510968o9744m8422p4149q6531k6025J79k2426k6714J4007L8451N6116P1196
$$ 4510968 4441224 4392802 4318653 4232122 4206097 4206276 4183850 4157136 4171143 4209594 4265710 4336906
17932D336906O3653J29821J63725K02874K16550K21450K12265J64052J10233M5718
$$ 4336906 4400559 4530380 4694105 4896979 5113529 5334979 5547244 5711296 5821529 5867247
17922E867247j9000j11173k17158k63308l23480l12659k99887k80016k39025j35394
$$ 5867247 5848247 5737074 5519916 5256608 4933128 4620469 4320582 4040566 3801541 3666147
17912C666147r9709j01664j04662o4205j3026q0682p1720p5512r3952q8411p4098
$$ 3666147 3566438 3464774 3360112 3295907 3282881 3202199 3130479 3054967 2961015 2872604 2798506
17901B798506r5702j21418o9638n6182l1712l1512m9866k7682k2392j7795m2667
$$ 2798506 2702804 2581386 2511748 2455566 2423854 2392342 2342476 2314794 2292402 2274607 2231940
17890B231940k3079m81J0748K6073K3929K37m1909l411L0314J4963j9541K4938
$$ 2231940 2208861 2208380 2219128 2245201 2269130 2269367 2227458 2224047 2254361 2269324 2249783 2274721
17878B274721K2187J3043L1855M2889M2299J1193r934j4026l5797m7559p3261
$$ 2274721 2296908 2309951 2341806 2384695 2426994 2438187 2428253 2414227 2378430 2330871 2257610
17867B257610p9068q8848j04916q4477r6217p7472p6455q0535m0193m2274l0302
$$ 2257610 2178542 2089694 1984778 1900301 1804084 1726612 1650157 1569622 1529429 1487155 1456853
17856A456853m7198l1596j6579m776j3292l7306m5205k9114Q223l9041k9686n644
$$ 1456853 1409655 1378059 1361480 1356704 1343412 1306106 1260901 1231787 1240010 1200969 1171283 1165639
17844A165639j8816k0133L803N252m1706k5094j3545o959l2152l6681k9366m1258
$$ 1165639 1146823 1126690 1130493 1135745 1094039 1068945 1055400 1048441 1016289 979608 950242 908984
17832I08984n90j4467n747K042j2824J5329J0337k5347k1911k6002r572l515k4554
$$ 908984 908394 893927 888180 890222 877398 892727 903064 877717 855806 829804 820232 816717 792163
17819G92163j7093j3995R390J4184q485k7216l3303j3241L7100K0488m1990J94
$$ 792163 775070 761075 770465 784649 776164 748948 715645 702404 739504 759992 718002 718196
17807G18196j0274k4825l4649k5654k649k509K175j4579l3423J0761J2461o276
$$ 718196 707922 683097 648448 622794 620145 617636 619811 605232 571809 582570 595031 588755
17795E88755k5771L099l215j2367j1180L265Q956k0088J1873k8637m0540r374
$$ 588755 562984 566083 562868 550501 539321 542586 551542 531454 543327 514690 474150 464776
17783D64776j6299o541k2292j2861J3489K3991m6748k3524J9820J8002J2896k139
$$ 464776 448477 441936 419644 406783 420272 444263 397515 373991 393811 411813 424709 422570
17771D22570J649l1689m8273j7598n444k748L401j5953j2082m958l117o773k556
$$ 422570 424219 392530 344257 326659 321215 318467 321868 305915 293833 288875 285758 278985 276429
17758B76429J8240k2880j6655j2654n353j6257K4683K8993P41l498J0750k1147
$$ 276429 294669 271789 255134 242480 237127 220870 245553 274546 275287 271789 282539 261392
17746B61392P643p179p830J9069K2317l0523k3278l1236j4266J0564p718N5305
$$ 261392 269035 261856 254026 273095 295412 264889 241611 210375 196109 206673 198955 254260
17734B54260L0679L493j0078K9402J1143j8769J2061j9910l1119j2421p463m6512
$$ 254260 284939 288432 278354 307756 318899 300130 312191 292281 261162 248741 241278 194766
17722A94766j3273m2757j4416M817R668m093j5782L0787J1422J19L439q294k3682
$$ 194766 181493 138736 124320 129137 138805 134712 118930 149717 161139 161258 164697 156403 132721
17709A32721P938K9010L460l2012j9370J631L5073L7739M3844N3454j2996m2363
$$ 132721 140659 169669 173129 141117 121747 123378 158451 196190 240034 293488 280492 238129
17697B38129r171j2021r944j0566k4757j4387j4616R953K548N284r699P092K568
$$ 238129 228958 216937 206993 196427 171670 157283 142667 152620 155168 160452 150753 157845 160413
17684A60413j1483j2560M7458P4999P8187P3813O5926O1552N3213N1042L9480
$$ 160413 148930 136370 183828 258827 337014 410827 476753 538305 591518 642560 682040
17673F82040q185k3414q446k1342m752m701O5187N2731L1297J4014M374j6547
$$ 682040 673855 650441 641995 620653 615901 611200 676387 729118 760415 774429 778803 762256
17661G62256l6114l3552j5923m235J2280Q007l387O0736L2805J1111M5329R3638
$$ 762256 726142 692590 676667 672432 684712 692719 689332 750068 782873 793984 839313 932951
17649I32951J51190J67299J09552L3386j3217j5665m878l7334j24780j42587r0287
$$ 932951 1084141 1251440 1360992 1394378 1381161 1365496 1360618 1323284 1198504 1055917 965630
17638I65630p3757r8892r5850n1431j8426j5965j2203j8516j5768k262K301L0957
$$ 965630 891873 792981 697131 645700 627274 611309 599106 580590 564822 562560 564861 595818
17626E95818J2979K2266N8706N0914P0836M5232L5067J5948M443n943j2403K4772
$$ 595818 608797 631063 689769 740683 811519 856751 891818 907766 912209 906266 893863 918635
17614I18635L7834L9197L4198M7606L1613j6778M748j6156P055k7427j8683k8290
$$ 918635 956469 995666 1029864 1077470 1109083 1092305 1097053 1080897 1087952 1060525 1041842 1013552
17602A013552j0664p499k5681k1944l2057n1720j7385k3954p7081r1463o8640
$$ 1013552 1002888 995389 969708 947764 915707 863987 846602 822648 745567 654104 585464
17591E85464m5190m1050m7391k7658m655J154k9787K0239K8168R892L167l4653
$$ 585464 540274 499224 451833 424175 419520 420674 390887 411126 439294 449186 452353 417700
17579D17700l9776k5786K1033R656j2917m1617j7963k47J5191R572M1321O7591
$$ 417700 377924 352138 373171 382827 369910 328293 310330 310083 325274 334846 376167 443758
17567D43758L8937K8178L4196L687L7971K5668O269R842n951k0566P771l9213
$$ 443758 482695 510873 545069 548756 586727 612395 618664 628506 622555 601989 609760 570547
17555E70547l0286j5040k8707k5591k3912J2090K9244L0852N4161K3536q588k3184
$$ 570547 540261 525221 496514 470923 447011 459101 488345 519197 573358 596894 588306 565122
17543E65122m0085k2898m9210p0712l1757l8943j4291j8879j7134k1347j5565
$$ 565122 525037 502139 452929 382217 350460 311517 297226 278347 261213 239866 224301
17532B24301j4320j5022j2302p594j8444N756J5914M388j9099j826j1175k9865
$$ 224301 209981 194959 182657 175063 156619 162375 178289 182677 163578 161752 150577 120712
17520A20712J1443J3030O137K6497m855j5992j5739j2296K2444K5711q854p7k1008
$$ 120712 132155 145185 151322 177819 172964 156972 141233 128937 151381 177092 168238 168161 147153
17507A47153l0207j2756J239m089J0993K1080n281j8126j6922j6204k2817R631
$$ 147153 116946 104190 105429 101340 112333 133413 128132 110006 93084 76880 54063 63694
17495F3694J9216j9529j2859J5760K771J7361J5058l6604P819K1433O53m747J4342
$$ 63694 82910 63381 50522 66282 69053 86414 101472 64868 72687 94120 94773 90026 104368
17482A04368k0527L181J2656K712j0300k0325N857J0388J8263j795j6718q614
$$ 104368 83841 87022 99678 102390 92090 71765 77622 88010 106273 104478 87760 79146
17470G9146J7733k276j3485o787K704j0399K284k3117j1832L4212m25k5522p01
$$ 79146 96879 94603 81118 74331 77035 66636 68920 45803 33971 68183 67758 42236 41535
17457D1535l965J5544j5351Q071J6177O380K873k0931k589k3755J6294K9515J423
$$ 41535 37570 53114 37763 45834 62011 68391 71264 50333 47744 23989 40283 69798 71221
17444G1221j0381j0223K1850M1047L3839N3281r555k3848j9664k7592j6216k8479
$$ 71221 60840 50617 72467 113514 147353 200634 191079 167231 147567 119975 103759 75280
17432G5280k0666Q564N335k2604l854Q111J959j0688K7298J9500o615j9120J378
$$ 75280 54614 63178 68513 45909 42055 50166 52125 41437 68735 88235 81620 62500 63878
17419F3878K2425J975k4937j3958J0818L3216O023j0017r484n706r773q501q547
$$ 63878 86303 88278 63341 49383 60201 93417 99440 89423 79939 74233 64460 55959 47412
17406D7412k062L693j5801k3145J6183J6230J1208k5100j3258P423J2221O294
$$ 47412 45350 49043 33242 10097 26280 42510 53718 28618 15360 22783 35004 41298
17394D1298r258K0729K1300K514R774k0885m4384p650M337K6687k14J94L6928
$$ 41298 32040 52769 74069 76583 86357 65472 21088 13438 17775 44462 44248 44442 81370
17381H1370l444l387k3609l355K6618k373O135l1471k0995P127J4265j5554J4592
$$ 81370 77926 74539 50930 47575 74193 71820 77955 46484 25489 32616 46881 31327 45919
17368D5919K3845j8752k5661J8852Q346j0339J4621L8572O454q732m128l0487
$$ 45919 69764 51012 25351 44203 52549 42210 56831 95403 101857 93125 88997 58510
17356E8510k9408k0172j98J6840J1888R380k3691k6174j2102N091J6421K3100
$$ 58510 29102 8930 8732 25572 37460 46840 23149 -3025 -15127 -10036 6385 29485
17344B9485J7347J6475j8048k279k760n434j1203j0231n974j6365J0006N814j976
$$ 29485 46832 63307 45259 42980 40220 34786 23583 13352 7378 -8987 1019 6833 4857
17331D857J1494J8283j000k1520l6247r539N3995L1806k3849j9584M81k9440O245
$$ 4857 16351 34634 33634 12114 -24133 -33672 20323 52129 28280 8696 9177 -20263 -14018
17318a4018M678Q733j1963K7854R854J0212N665l1753j6983k1416J0946K0393
$$ -14018 -9340 -607 -12570 15284 25138 35350 41015 9262 -7721 -29137 -18191 2202
17306B202K8268M100j0556l872o467O229Q078j746J9047j4291L855k0529k570
$$ 2202 30470 34570 24014 20142 13675 19904 27982 26236 45283 30992 34847 14318 11748
17293A1748Q773M4061n523q58O688l038j3387j2883J6751L1192j429q323m6070
$$ 11748 20521 64582 59059 58201 64889 61851 48464 35581 52332 83524 82095 73772 27702
17280B7702l4996n145k283k522K2240M11N364l104k4106m756L718L0425K4960
$$ 27702 -7294 -12439 -14722 -17244 4996 5407 10771 7667 -16439 -21195 -17477 12948 37908
17267C7908J6593O035j2606l2270Q139J1245j3093L089J8295K1630n325l4707
$$ 37908 54501 60536 47930 15660 23799 35044 21951 25040 43335 64965 59640 24933
17255B4933j3085k4071P948j9306q485J3707K3684N218P974k857L0463M950l701
$$ 24933 11848 -12223 -4275 -23581 -32066 -18359 5325 10543 18517 15660 46123 51073 47372
17242D7372q433M096n35k0053j3408n377J5301j3358J863R017J7M532K929l471
$$ 47372 38939 43035 42500 22447 9039 3662 18963 5605 7468 16485 16502 21034 23963 20492
17228B0492Q385j3048R756K1369q943n318o348j7448j2318q185J4115K8695K7217
$$ 20492 28877 15829 25585 46954 38011 32693 26345 8897 -3421 -11606 2509 31204 58421
17215E8421q248k1698N592l978j9741k3421j4175N676L148J584m559o392Q664
$$ 58421 50173 28475 34067 30089 10348 -13073 -27248 -21572 -18424 -16840 -21399 -27791 -19127
17202a9127L1237j596K887o053L469O923n887l102j649M575j846J486N764k4418
$$ -19127 12110 10514 13401 7348 10817 17740 11853 8751 7102 11677 9831 11317 17081 -7337
17188g337l4974Q94K5336J2763J3419k8367j3407j0953K5464L4644Q061r345j2769
$$ -7337 -42311 -41417 -16081 -3318 10101 -18266 -31673 -42626 -17162 17482 25543 16198 3429
17175C429P249j961k5021R725j948l2196J4325J8726j4984J5214N545p250k0133
$$ 3429 10678 8717 -16304 -6579 -8527 -40723 -26398 -7672 -22656 -7442 -1897 -9147 -29280
17162b9280K899J3061Q731J1924J8095l094j8549J6915K369m0722J3324J4265
$$ -29280 -26381 -13320 -4589 7335 25430 22336 3787 20702 23071 -17651 -4327 9938
17150I938n915M928J3047j3043k8740k527p398L2099l986J610o601k6452J6935
$$ 9938 4023 8951 21998 8955 -19785 -22312 -29710 2389 -1597 13 -6588 -33040 -16105
17137a6105K2400N763k761K8206l5556l4316J3587J0317O782k0682o838j2350
$$ -16105 6295 12058 9297 37503 1947 -32369 -18782 -8465 -1683 -22365 -29203 -41553
17125d1553J9353J5938N36k562P458J7847M30j0314o85K5719L3578k24m3141M534
$$ -41553 -22200 -6262 -5726 -8288 -830 17017 17447 7133 6448 32167 65745 65521 22380 26914
17111B6914J8611n965j9451n399m654P383r18k0908r931K1479r277j5178K996
$$ 26914 45525 39560 20109 14710 10056 17439 16521 -4387 -14318 7161 -2116 -17294 -14298
17098a4298K3086K9694J8880P782j8373k0515j41K1153M008k8088k6203j0839
$$ -14298 8788 38482 57362 65144 46771 26256 26115 47268 51276 23188 -3015 -13854
17086a3854M056M31K512j6148o015J6710K4324j4712K979M0804q422j2598J0716
$$ -13854 -9798 -9367 -6855 -23003 -29018 -12308 12016 -2696 283 41087 32665 20067 30783
17073C0783K0234J0754O783l903j9381j1355n011k1663j5273L5160r336J3998
$$ 30783 51017 61771 68554 64651 45270 33915 28904 7241 -8032 27128 17792 31790
17061C1790R055j739j1280J8935n375L810n867p216M987K5623n552k9895k0224
$$ 31790 40845 39106 27826 46761 41386 45196 39329 32113 37100 62723 57171 27276 7052
17048G052K528o086j2304J8676L0711j3194k7258j003J866J8425K1922o198k9799
$$ 7052 9580 3494 -8810 9866 40577 27383 125 -878 988 19413 41335 35137 5338
17035E338K155J2589J0689p517j1833n000J0914j6531L824p489L398P589K2021
$$ 5338 7493 20082 30771 23254 11421 6421 17335 804 4628 -2861 537 8126 30147
17022C0147j0130o725J7657j3822q211k8883R204M9641k2437m7181K795L1302
$$ 30147 20017 13292 30949 17127 8916 -19967 -10763 38878 16441 -30740 -27945 3357
17010C357k4569j5823P572M711K2836L3086O331k0358r925m452K2954o753m281
$$ 3357 -21212 -37035 -29463 -24752 -1916 31170 37501 17143 7218 2766 25720 18967 14686
16997A4686j1941J2128N0970n882m1700k1510J9383L185j8289o557j4518J5974
$$ 14686 2745 14873 65843 59961 18261 -3249 16134 19319 1030 -5527 -20045 -4071
16985d071m810j9386M78N106N538j5437l906J3590K4615Q704j0913j1016k7704
$$ -4071 -8881 -28267 -27789 -22683 -17145 -32582 -36488 -22898 1717 10421 -492 -11508 -39212
16972c9212R934J8972j1006j9701L268K0038L2649N697j5403N599p708K635j0723
$$ -39212 -29278 -10306 -21312 -41013 -37745 -17707 14942 20639 5236 10835 3127 5762 -4961
16959d961j2540L0Q102M676k1075L840J3942J9725K2020Q488r05r727k1647j8970
$$ -4961 -17501 -17471 -9369 -4693 -25768 -21928 -7986 11739 33759 42247 41342 31615 9968 -9002
16945i002J5025K8034l6076O61J7216j2281k357Q290K3497r560r113K181l3785
$$ -9002 6023 34057 -2019 -1358 15858 3577 1220 9510 33007 23447 14334 16515 -17270
16932a7270k5553K4248L3685K4998l790k308j2355j9206J7310J247k957l6061
$$ -17270 -42823 -18575 15110 40108 36318 34010 21655 2449 19759 21006 18049 -18012
16920a8012O856K0290j57n242J1067J6681p270k1263Q437K7723Q915m76O475j4262
$$ -18012 -11156 9134 8977 3735 14802 31483 24213 2950 11387 39110 48025 47549 54024 39762
16906C9762m1949m762K2795j110R528l928n677Q43q757j2076j9422P340k034n017
$$ 39762 -2187 -6949 15846 14736 24264 20336 14659 15502 6745 -5331 -24753 -17413 -19447 -24464
16892b4464J0942p778J4798Q393j0733l1816n986P0636L5167m4221j8091L1228
$$ -24464 -13522 -21300 -6502 1891 -8842 -40658 -46644 23992 59159 14938 -3153 28075
16880B8075l924L334l673j0572Q751r446j9144m598P888j3537N136o370k8157
$$ 28075 24151 27485 23812 13240 21991 12545 -6599 -11197 -3309 -16846 -11710 -18080 -46237
16867d6237j6166j0460l3856L7270J0399K0621K3171K2450J4875O76k9359j6045
$$ -46237 -62403 -72863 -106719 -69449 -59050 -38429 -15258 7192 22067 22743 -6616 -22661
16855b2661k676j7490k894l103K4819m346L152N23J2268J6211K5294l0519l550
$$ -22661 -25337 -42827 -45721 -48824 -24005 -28351 -25199 -24676 -12408 3803 29097 -1422 -4972
16842d972L713o427J3432K8086r027l016L355R576R498o853L101j4131j8911o449
$$ -4972 -1259 -7686 5746 33832 24805 21789 25144 34720 44218 37365 40466 26335 7424 975
16828I75J8497J429k5449J404j5405p788P852J3597n25R533P474j7366K0076O638
$$ 975 19472 20901 -4548 -3144 -18549 -26337 -18485 -4888 -5413 4120 11594 -5772 14304 20942
16814B0942j9285r168Q018j965j3426K1180O621Q205j4900j5146M872L271l784
$$ 20942 1657 -7511 507 -1458 -14884 6296 12917 21122 6222 -8924 -4052 -781 -4565
16801d565J561o548j0298J7614j2917j4801j310K1298J3619r167J0518k1333j6516
$$ -4565 -3004 -9552 -19850 -2236 -15153 -29954 -31264 -9966 3653 -5514 5004 -16329 -32845
16788c2845O144L515J8101J6002j1865k1957J0834j1697R43L3016K8500q750l1792
$$ -32845 -26701 -23186 -5085 10917 -948 -22905 -12071 -23768 -22825 10191 38691 29941 -1851
16775a851j9121Q123m447k1534L707J728k12L489j5930J0713K0794K0374J092
$$ -1851 -20972 -12849 -17296 -38830 -35123 -33395 -33607 -30118 -46048 -35335 -14541 5833 6925
16762F925o238L300J8783n2387Q293J7553J6416j1274l3840l7053L65J7124K491
$$ 6925 687 3987 22770 -29617 -21324 -3771 12645 1371 -32469 -69522 -69157 -52033 -49542
16749d9542m9098J6546N1544J1440N560k2312o454K467J2371j8610j6340K9944
$$ -49542 -98640 -82094 -30550 -19110 -13550 -35862 -42316 -39849 -27478 -46088 -62428 -32484
16737c2484J1645k4337k312k853Q295J8123K1953J3951n179n420J1437O357q841
$$ -32484 -20839 -45176 -47488 -50341 -42046 -23923 -1970 11981 6802 1382 12819 19176 10335
16724A0335J8648J3329j4586K613j7028l828l0411k0782K819l6501J0291L2660
$$ 10335 28983 42312 27726 30339 13311 9483 -20928 -41710 -38891 -75392 -65101 -32441
16712c2441J4433k7325k2727K9666N4727K1764j3164j6442J9590J0348m2710k0998
$$ -32441 -18008 -45333 -68060 -38394 16333 38097 24933 8491 28081 38429 -4281 -25279
16700b5279J794J9043N560m608N732m244j417J6382j2077m3485j3132K812J8709
$$ -25279 -23485 -4442 1118 -3490 2242 -2002 -3419 12963 886 -42599 -55731 -52919 -34210
16687c4210K2927J5455K1029n940k6628j1924J1739j2678J3601M0909l316l0594
$$ -34210 -11283 4172 25201 19261 -7367 -19291 -7552 -20230 -6629 34280 30964 370
16675C70j7120k1402M002L0159j838M241L4317k50j4777r724j4118l517M2J066
$$ 370 -16750 -38152 -34150 -3991 -5829 -1588 32729 32479 17702 7978 -6140 -9657 -9615 -8549
16661h549j700Q913K65J0463J7994p704j4193j368K6747R787m467j5542l1166
$$ -8549 -10249 -1336 -1071 9392 27386 19682 5489 4121 30868 40655 36188 20646 -10520
16648a0520k1308J8335K8902n359k0163o098M10k493K7193J374j9852n6248K2966
$$ -10520 -31828 -13493 15409 10050 -10113 -16211 -15801 -18294 8899 10273 -9579 -65827 -42861
16635d2861O5010j3261k0615J7710L3567J8154m737K272j2113j4480k0935J2714
$$ -42861 22149 8888 -11727 5983 39550 57704 52967 55239 43126 28646 7711 20425
16623B0425K7770l3297l0987J0947j1457o031j4428J0442R309K0992J0196m925
$$ 20425 48195 14898 -16089 -5142 -16599 -22630 -37058 -26616 -17307 3685 13881 8956
16611H956j3205k960K3159n618j1777l3287%J400R500R784k7648r754K156K1421
$$ 8956 -4249 -7209 15950 10332 -1445 -34732 -34732 -33332 -23832 -14048 -41696 -51450 -49294 -27873
16597b7873k0013O332N916K0308J9219l5970j6016o35k093J8098J7709J697j3604
$$ -27873 -47886 -41554 -35638 -15330 3889 -32081 -48097 -48732 -50825 -32727 -15018 -13321 -26925
16584b6925j8574l763L271J9827m116O204n38m858N590m481J1378O984J3761k337
$$ -26925 -45499 -49262 -45991 -26164 -30280 -24076 -24614 -29472 -23882 -28363 -16985 -10001 3760 1423
16570A423k1409m719n605m137P673o085j8189J9528K1466L68K07J5041O833o410
$$ 1423 -19986 -24705 -30310 -34447 -26774 -32859 -51048 -31520 -10054 -9686 -9479 5562 12395 5985
16556E985J3159j0774J1079j5587j7087K4207J458J627j713o740r327J3400N699
$$ 5985 19144 8370 19449 3862 -13225 10982 12440 14067 12354 5614 -3713 9687 15386
16543A5386m810j9046j2711K1336K2503o419N028R552r577m104o784k5957j4350
$$ 15386 10576 -8470 -21181 155 22658 16239 21267 30819 21242 17138 10354 -15603 -29953
16530b9953k986j6281j1049P638K095J4640k2897q482J7173J4787K3618K2358
$$ -29953 -32939 -49220 -60269 -52631 -50536 -35896 -58793 -67275 -50102 -35315 -11697 10661
16518A0661j6066j9294J4276M898Q486j8291j6006Q130J925L2258j4365k8398
$$ 10661 -5405 -24699 -10423 -5525 2961 -15330 -31336 -23206 -21281 10977 -3388 -31786
16506c1786O412J222j555j168K9515R023l4768O80N477k5270j5727J8669l822
$$ -31786 -25374 -24152 -25707 -26875 2640 11663 -23105 -22425 -16948 -42218 -57945 -39276 -43098
16493d3098L2462N7577l7035m0024J9204k1369l541N802L390K6963J6469J171
$$ -43098 -10636 46941 9906 -30118 -10914 -32283 -35824 -30022 -26632 331 16800 17971
16481A7971o068q193K6314O471k0582j1526q663L378Q71P652K06O320k4858l2627
$$ 17971 11903 3710 30024 36495 15913 4387 -4276 -898 -27 7625 7831 14151 -10707 -43334
16467d3334K0146r068k0422K161M780J5079Q643j292l010L5460p825o566J462
$$ -43334 -23188 -32256 -52678 -50517 -45737 -30658 -22015 -23307 -26317 9143 1318 -5248 -3786
16454c786O034q065k4479j3743n82J2998j3307j5385M691J6717L6687P13K4794
$$ -3786 2248 -5817 -30296 -44039 -44621 -31623 -44930 -60315 -55624 -38907 -2220 -1507 23287
16441B3287J054k4891l0091L771J2343K2069Q060k9130l5260O749j7777k466q766
$$ 23287 24341 -550 -30641 -26870 -14527 7542 15602 -13528 -48788 -42039 -59816 -62282 -71048
16428g1048j3239J9648N2509L1782k517K960j1158j4455k3262k937O93J0931J995
$$ -71048 -84287 -64639 -12130 19652 17135 20095 8937 -5518 -28780 -31717 -31024 -20093 -18098
16415a8098J3936j5038l6232j1449K0519q262p88J4430R722J5369o671N181L367
$$ -18098 -4162 -19200 -55432 -66881 -46362 -54624 -55412 -40982 -31260 -15891 -22562 -17381 -14014
16402a4014R018k300j078L051q028J3908R722p772j5037K3035K0569j3397l8263
$$ -14014 -4996 -7296 -8374 -5323 -13351 557 10279 2507 -12530 10505 31074 17677 -20586
16389b0586R699L0968J7668R781k759k5251j6754j3033m841N580j6670K851O185
$$ -20586 -10887 20081 37749 47530 44771 19520 2766 -10267 -15108 -9528 -26198 -23347 -17162
16376a7162j4272l403M284p88m348J5738L6736m078k86r639N267J6622k1379j1446
$$ -17162 -31434 -34837 -30553 -31341 -35689 -19951 16785 12707 12421 2782 8049 24671 3292 -8154
16362h154k4206j0382J6857K3553K2617N852j3240J3572K3109j0640j3400j2281
$$ -8154 -32360 -42742 -25885 -2332 20285 26137 12897 26469 49578 38938 25538 13257
16350A3257k1486R242J136j5724N09J6512N100p826r776p96J9946J0615j6984
$$ 13257 -8229 1013 2149 -13575 -13066 3446 8546 720 -9056 -9852 10094 20709 3725
16337C725J8591L259j3924j3010K9213r058j7351l0012j0092l635M2436J2700
$$ 3725 22316 25575 11651 -1359 27854 18796 1445 -28567 -38659 -42294 142 12842
16325A2842j9386K759L790p853M07J918Q76M721l565J6054j4220K9376k6000m326
$$ 12842 -6544 -3785 5 -7848 -7441 -5523 -4647 74 -3491 12563 -1657 27719 1719 -2607
16311b607J1479k3152j6678R306J8339J6413j1978j6234O633J5787k7837o475
$$ -2607 8872 -14280 -30958 -21652 -3313 13100 1122 -15112 -8479 7308 -20529 -27004
16299b7004Q285j5216O234Q79r212l711K225J190r639K4137J4987n703j7716k5445
$$ -27004 -18719 -33935 -27701 -26822 -36034 -39745 -37520 -36330 -45969 -21832 -6845 -12548 -30264 -55709
16285e5709J4579K50J7784O562J92j0014q171j1304J5726o792j6937J0909L8290
$$ -55709 -41130 -40880 -23096 -16534 -16342 -26356 -34527 -45831 -30105 -36897 -53834 -42925 -4635
16272d635j1812p823M718r189O195J760q579p592N612L6370J9376j0085j3453
$$ -4635 -16447 -24270 -19552 -28741 -22546 -20786 -29365 -36957 -31345 5025 24401 14316 863
16259H63k4075J5842J002O366k5706j0549n577J2951J0089K443L6786J2018j1974
$$ 863 -23212 -7370 -6368 -2 -25708 -36257 -41834 -28883 -18794 -16351 20435 32453 20479
16246B0479j5628m916J8576L968j473l2405Qm243J626o703l6829N944J9230p224
$$ 20479 4851 -65 18511 22479 21006 -11399 -11391 -15634 -14008 -20711 -57540 -51596 -32366 -39590
16232c9590r616O437L0409J6212j837l3267r720J3453M211J4430N87J9769n952
$$ -39590 -49206 -42769 -12360 3852 2015 -31252 -40972 -27519 -23308 -8878 -8291 11478 5526
16219E526j4747j5475l0J7188o568o842j1901R520L2722M398k944k5788j8309
$$ 5526 -9221 -24696 -24726 -7538 -14106 -20948 -32849 -23329 9393 13791 10847 -14941 -33250
16206c3250Q65J9047J9562J3388K495k4282l1310J1750N681j948k0875J6647J5797
$$ -33250 -32385 -13338 6224 19612 22107 -2175 -33485 -21735 -16054 -18002 -38877 -22230 -6433
16193f433j6363n372J0046J5482J3540k566j1746n714n105L866k2668j0705K7313
$$ -6433 -22796 -28168 -18122 -2640 10900 8334 -3412 -9126 -14231 -10365 -33033 -43738 -16425
16180a6425J0621l52K044K602l39L821k4106K0994J0059P025P851m1314k1979
$$ -16425 -5804 -6156 -4112 -1510 -1849 1972 -22134 -1140 8919 15944 23795 -17519 -39498
16167c9498J3532j9281n251J9833L7336J9040K685j0303j7515J1770j5991L933
$$ -39498 -25966 -45247 -50498 -30665 6671 25711 28396 18093 578 12348 -3643 290
16155B90j2620l7484k863L2364J6332j6937j6972k186K4337J1136Q948M208k5144
$$ 290 -12330 -49814 -52677 -20313 -3981 -20918 -37890 -40076 -15739 -4603 4345 8553 -16591
16142a6591j3169J7242K4386j8675m8897k978N5427p302m5531J0367J7921R179
$$ -16591 -29760 -12518 11868 -6807 -55704 -58682 -3255 -10557 -56088 -45721 -27800 -18621
16130a8621j2158k1201o100j3793N722K8585P973R469J9819l35J077K2205J0105
$$ -18621 -30779 -51980 -58080 -71873 -66151 -37566 -29593 -20124 -305 -640 437 22642 32747
16117C2747m1294J678J5056K565l960j1604l3266j4973K0679J9880J1880M6315
$$ 32747 -8547 -6869 8187 10752 6792 -4812 -38078 -53051 -32372 -12492 -612 45703
16105D5703J8671l1985l1210M917J8247m956j9999o877J7604P831k609J5854j1504
$$ 45703 64374 32389 1179 6096 24343 19387 -612 -7489 10115 17946 15337 31191 19687
16092A9687J449k5459k538k133J9509r01K0789K6916l39m3243j3456k5399k3827
$$ 19687 21136 -4323 -6861 -8994 10515 9614 30403 57319 56980 13737 281 -25118 -48945
16079d8945O273J3270j8872K935K2649l81k25j5381n07J0590l877l071K1900m193
$$ -48945 -42672 -29402 -48274 -45339 -22690 -23071 -23296 -38677 -39184 -28594 -32471 -35542 -13642 -17835
16065a7835L525O098J4116q032j0165K2257J3855k318k0115J56k715N918J3017
$$ -17835 -14310 -8212 5904 -2128 -12293 9964 23819 21501 1386 1542 -1173 4745 17762
16052A7762q468l48j280j1963k0747N994j1015o479l275k1339k086K5576M4480
$$ 17762 9294 8946 7666 -4297 -25044 -19050 -30065 -36544 -39819 -61158 -63244 -37668 6812
16039F812k0827k6388J1778o097n141K6264J2752j6503j2317J0633j0136n330
$$ 6812 -14015 -40403 -28625 -34722 -39863 -13599 -847 -17350 -29667 -19034 -29170 -34500
16027c4500J9252J4329p785j641R370l312q569n174k4654n089q202k5854j0827
$$ -34500 -15248 -919 -8704 -10345 -975 -4287 -12856 -18030 -42684 -47773 -55975 -81829 -92656
16014i2656K0898J9094j5000k1089L2879L0373L7043J8553o517j4720r687o360
$$ -92656 -71758 -52664 -67664 -88753 -55874 -25501 11542 30095 23578 8858 -829 -7189
16002g189j6715J0680M123j6060J587j944L335O772j8263j7368J9140K43j1546
$$ -7189 -23904 -13224 -9101 -25161 -23574 -25518 -22183 -15411 -33674 -51042 -31902 -31659 -43205
15989d3205j1942J3481M1756O74n896L0813p100k8982o230K548O620j5786k6567
$$ -43205 -55147 -41666 90 764 -5132 25681 18581 -10401 -16631 -14083 -7463 -23249 -49816
15976d9816K2078m922J4398J0922k776o525J034p653j3541l722j323q053J5574
$$ -49816 -27738 -32660 -18262 -7340 -10116 -16641 -15607 -23260 -36801 -40523 -41846 -49899 -34325
15963c4325K5808l420R34n793L355l193j2694j8925K0587K7965J5549r593j758
$$ -34325 -8517 -11937 -11003 -16796 -13441 -16634 -29328 -48253 -27666 299 15848 6255 4497
15950D497N871k0843j5943J0749J3569J3197J0645L6023n095k7154k2576j0367
$$ 4497 10368 -10475 -26418 -15669 -2100 11097 21742 57765 52670 25516 2940 -7427
15938g427j380k4658j9178q717K932J1643M791N459l0899Q233J6049J7962J004
$$ -7427 -8807 -33465 -52643 -61360 -58428 -46785 -41994 -36535 -67434 -59201 -43152 -25190 -24186
15925b4186J8869P582R88k3473O27j6699J1536J6836r433k3094J6993M423o685
$$ -24186 -5317 2265 3253 -20220 -19593 -36292 -24756 -7920 -17353 -40447 -23454 -19031 -25716
15912b5716J453L554J5242O463Q535k7027m083L1976p52j5950k6995n523J7083
$$ -25716 -24263 -20709 -5467 996 9531 -17496 -21579 10397 9645 -6305 -33300 -38823 -21740
15899b1740r33P428o493l8247q263J3170L0379Q734L781K216j2315k7809J2779
$$ -21740 -22673 -15245 -21738 -59985 -68248 -55078 -24699 -15965 -12184 -9968 -22283 -50092 -37313
15886c7313O19q599J3311M939q130p534p958j0267p158J0193k576J0013K7562
$$ -37313 -36694 -45293 -31982 -27043 -35173 -42707 -50665 -60932 -68090 -57897 -60473 -50460 -22898
15873b2898M532N059J971R916J2383k7286l0764J928M490K7908P357j1135J711
$$ -22898 -18366 -13307 -11336 -1420 10963 -16323 -47087 -45159 -40669 -12761 -5404 -16539 -14828
15860a4828J775k4079n434J6528k068N109L145r362k2516j62r957J067r126j972
$$ -14828 -13053 -37132 -42566 -26038 -28106 -22997 -19852 -29214 -51730 -51892 -61849 -60782 -69908 -71880
15846g1880K974Q335J4557K4114l200j1464n413K9918M290j4191j1323j3992Q70
$$ -71880 -68906 -60571 -46014 -21900 -25100 -36564 -41977 -12059 -7769 -21960 -33283 -47275 -46405
15833d6405J9370J955p209k319j5254j1903q631K9157L5041j047p920j8114o037
$$ -46405 -27035 -25080 -32289 -34608 -49862 -61765 -70396 -41239 -6198 -7245 -15165 -33279 -39316
15820c9316P469K3996m33k2068k2843j657J3126O672O882J3449m7j4990p58N456
$$ -39316 -31847 -7851 -8284 -30352 -53195 -54852 -41726 -35054 -28172 -14723 -14770 -29760 -30518 -25062
15806b5062J2910J3220j4368L415l9081q065j3049L1939K1148L241k3031k2034
$$ -25062 -12152 1068 -13300 -9885 -48966 -57031 -70080 -38141 -16993 -13752 -36783 -58817
15794e8817L9013l646O183K8139M496m842l216j6595n809j489k006J2719j13j0806
$$ -58817 -19804 -23450 -17267 10872 15368 10526 7310 -9285 -15094 -16583 -18589 -5870 -5983 -16789
15780a6789j3660O096l960j4599J8447O730J1278J5031J5799j3797j0702K887
$$ -16789 -30449 -24353 -28313 -42912 -24465 -17735 -6457 8574 24373 10576 -126 2761
15768B761j7122p615J4610N654L91K364j954j2547J455R202o125M56j5637j9567
$$ 2761 -14361 -21976 -7366 -1712 -1321 1043 -911 -13458 -12003 -2801 -8926 -8470 -24107 -43674
15754d3674R756l87r818p22Q010n756j0273j6343j1779L0203K5607j236k709J2607
$$ -43674 -33918 -34305 -44123 -44845 -36835 -42591 -52864 -69207 -80986 -50783 -25176 -26412 -29121 -16514
15740a6514P265J1285n985p080o311J4557J3719K866n149m552J400M796r016J4698
$$ -16514 -9249 2036 -3949 -11029 -17340 -2783 10936 13802 8653 4101 5501 10297 1281 15979
15726A5979j9686j7376Q684l5990K7354L5386J267k148j2739k4166l0782l3818
$$ 15979 -3707 -21083 -12399 -48389 -21035 14351 15618 13470 731 -23435 -54217 -88035
15714h8035L8915M9961M815k4072k7138K5380Q623j7768K5357J4679m347l406
$$ -88035 -49120 841 5656 -18416 -45554 -20174 -11551 -29319 -3962 10717 6370 2964
15702B964j1986Q898p265n92P985q624k5706J9109o594J2786J5607p480q958M602
$$ 2964 -9022 -124 -7389 -7981 4 -8620 -34326 -15217 -21811 -9025 6582 -898 -9856 -5254
15688e254r601j2209K6882k725P025j9319q482j7718j1891N581L9554K334j4936
$$ -5254 -14855 -27064 -182 -2907 4118 -15201 -23683 -41401 -53292 -47711 -8157 -5823 -20759
15675b0759O44m237l1808p438n040J395K2799J9830J1042o362j1966K603k8175
$$ -20759 -20115 -24352 -56160 -63598 -68638 -67243 -44444 -24614 -13572 -19934 -31900 -29297 -57472
15662e7472j4400J8361K4961K6311k1306k4634R646Q687q411J2428L3420p475
$$ -57472 -71872 -53511 -28550 -2239 -23545 -48179 -38533 -29846 -38257 -25829 7591 116
15650A16q280k857N718J8493k5218k4974N756o969J7653O269m1416j6814J90j4384
$$ 116 -8164 -11021 -5303 13190 -12028 -37002 -31246 -38215 -20562 -14293 -55709 -72523 -72333 -86717
15636h6717L972J5308k1388J2988K0543K4158Q162M1024R834j2238k2536q345
$$ -86717 -82745 -67437 -88825 -75837 -55294 -31136 -22974 18050 27884 15646 -6890 -15235
15624a5235J0094l4312j3113J2809j477K5402L1483j8817O515j6641J0818k6642
$$ -15235 -5141 -39453 -52566 -39757 -41234 -15832 15651 -3166 3349 -13292 -2474 -29116
15612b9116j9677m146P995O877J4067L4904N815m6578r864J3364M22M194K0456
$$ -29116 -48793 -52939 -44944 -38067 -24000 10904 16719 -29859 -39723 -26359 -25937 -21743 -1287
15599a287r439L459k427q631k835j2080o963j893P664N244O05O513L3292J3133
$$ -1287 -10726 -7267 -9694 -18325 -21160 -33240 -40203 -42096 -34432 -29188 -28583 -22070 11222 24355
15585B4355m1193j0477Q258j8897j1990J1404O58J825K2373M360J4666R657L0568
$$ 24355 -16838 -27315 -19057 -37954 -49944 -38540 -37882 -36057 -13684 -9324 5342 14999 45567
15572D5567M123M0o080R309J1875P098r27p334L291n0997m4963l7563P792J4138
$$ 45567 49690 49730 43650 52959 64834 71932 71005 63671 66962 15965 -28998 -66561 -58769 -44631
15558d4631Q713k444P973m091P339K1906O578l086j3557k102j2019K893K4228
$$ -44631 -35918 -38362 -30389 -34480 -27141 -5235 1343 -1743 -15300 -17402 -29421 -26528 -2300
15545b300J000j6882j3096K4651J4219K342k7052j72J9187k6332j1371J7578K2481
$$ -2300 -1300 -18182 -31278 -6627 7592 9934 -17118 -17290 1897 -24435 -35806 -18228 4253
15532D253j0021j2433J3273j5818N749j96L389K0102R156j0728l3509k3218P865
$$ 4253 -5768 -18201 -4928 -20746 -14997 -15193 -11804 8298 17454 6726 -26783 -50001 -42136
15519d2136p586K7551J8848K1238o415k3435j9852n542j9437L467R117N388k6714
$$ -42136 -49722 -22171 -3323 17915 11500 -11935 -31787 -37329 -56766 -53299 -44182 -38794 -65508
15506f5508K238L1982J6817j5541k2140l749p813k562J4251M092p193L7745p645
$$ -65508 -63270 -31288 -14471 -30012 -52152 -55901 -63714 -66276 -52025 -47933 -55126 -17381 -25026
15493b5026K412N928j2604j8716k032M0733O774k2020n234m450J2862J4202j0612
$$ -25026 -22614 -16686 -29290 -48006 -50038 -9305 -2531 -24551 -29785 -34235 -21373 -7171 -17783
15480a7783p513r788Q977o1J67K5747P642l4735j6073l1822p333L2280L6561o085
$$ -17783 -25296 -35084 -26107 -26168 -26001 -254 7388 -27347 -43420 -75242 -82575 -50295 -13734 -19819
15466a9819p415j1864n587K1474o28k135k2807l1297J791L1313M0508o973j7546
$$ -19819 -27234 -39098 -44685 -23211 -23839 -25974 -48781 -80078 -78287 -46974 -6466 -13439 -30985
15453c0985q283J6723M2567K0535o700o424m0738l1948O393l988l260j3718J3043
$$ -30985 -39268 -22545 20022 40557 33857 27433 -13305 -45253 -38860 -42848 -46108 -59826 -46783
15440d6783J9371J3539K7681j0272l0120j7228j7024n239J7836K8942J8394N093
$$ -46783 -27412 -13873 13808 3536 -26584 -43812 -60836 -66075 -48239 -19297 -903 4190
15428D190J9726j6169P745j420k5186j493k1231p656P664L5093J7268k7523k1002
$$ 4190 23916 7747 15492 14072 -11114 -12607 -33838 -41494 -33830 1263 18531 -8992 -29994
15415b9994J1619K5404o040l8739O191J2338j4341j9015J1987J5746M136J031
$$ -29994 -18375 7029 989 -37750 -31559 -19221 -33562 -52577 -40590 -24844 -20708 -19677
15403a9677n041J9986r422j597J1242n24N067m378j6462k6466j0297N068L4775
$$ -19677 -24718 -4732 -14154 -15751 -4509 -5033 34 -4344 -20806 -47272 -57569 -52501 -17726
15390a7726K9959P992j123k0579q865J243k32j2809j8617k6986j2814J6551J8904
$$ -17726 12233 20225 19102 -1477 -10342 -9099 -9331 -22140 -40757 -67743 -80557 -64006 -45102
15377d5102K0618m692P057k2323J192J5327k4974o567M6907J5942j3896j0507
$$ -45102 -24484 -29176 -22119 -44442 -43250 -27923 -52897 -59464 -12557 3385 -10511 -21018
15365b1018k3203K7201K2552j0521j4761j860j9292r684M969J0390Q748r14J30
$$ -21018 -44221 -17020 5532 -4989 -19750 -21610 -40902 -50586 -45617 -35227 -26479 -27393 -27263
15352b7263k032l259j5307J5644J2007P123K0688j8857k105k6397j1118M768j616
$$ -27263 -29295 -32554 -47861 -32217 -20210 -13087 7601 -11256 -13361 -39758 -50876 -46108 -47724
15339d7724P143L3698p285k8682j5917K5146P371L194O26q369N409K829o234j0800
$$ -47724 -40581 -6883 -14168 -42850 -58767 -33621 -26250 -23056 -22430 -30799 -25390 -22561 -28795 -39595
15325c9595K202j112J2755K685k200l480J6792k5008j2441K6514J1010J1730J4102
$$ -39595 -37393 -38505 -25750 -23065 -25265 -28745 -11953 -36961 -49402 -22888 -11878 -148 13954
15312A3954p237j0211k518J2825m310L263m1184n588J7397K5178O202k1478j6334
$$ 13954 6717 -3494 -6012 6813 2503 5766 -35418 -41006 -23609 1569 7771 -13707 -30041
15299c0041r041l77J4952J4680j1261j965L927m782q04J1704L7921m121o897r382
$$ -30041 -39082 -39459 -24507 -9827 -21088 -23053 -19126 -23908 -24712 -13008 24913 20792 13895 4513
15285D513J4347N845j0892n45l8489p116J871O836L7716J4221P043k1385k5854
$$ 4513 18860 24705 13813 13268 -25221 -32337 -30466 -23630 14086 28307 35350 13965 -11889
15272a1889p809q02M183Q820J4257R266j0196l386l231p467r24K994l1587O3K4054
$$ -11889 -19698 -20500 -16317 -7497 6760 16026 5830 2444 -787 -8254 -9178 -6184 -37771 -37708 -13654
15257a3654O341P105j3843j9156L969K6723N143J9226J9319J3288m745l1063l7032
$$ -13654 -7313 -208 -14051 -33207 -29238 -2515 2628 21854 41173 54461 49716 18653 -18379
15244a8379M679K564k5220p376L8402L2193O567J0284l837j7181j9218J1641R08
$$ -18379 -13700 -11136 -36356 -43732 -5330 26863 33430 43714 39877 22696 3478 15119 16027
15231A6027k0399j9178m2193J4474L1210q793M718L221q479j1212L3311O177j4515
$$ 16027 -4372 -23550 -65743 -51269 -20059 -28852 -24134 -20913 -29392 -40604 -7293 -1116 -15631
15218a5631P49j4267J7762N41j5947r21j5014n674L5795J7422j9169k1850J6994
$$ -15631 -14882 -29149 -11387 -10846 -26793 -27714 -42728 -48402 -12607 4815 -14354 -36204 -19210
15205a9210J765j2108k0444m5538k2396L6038K5578N213J3212M708j5400l7751
$$ -19210 -17445 -29553 -49997 -95535 -117931 -81893 -56315 -51102 -37890 -33182 -48582 -86333
15193h6333K1788K9948K1467k147P445p681j2150j203J3514j1715M417j9222J8891
$$ -86333 -64545 -34597 -13130 -15277 -7832 -15513 -27663 -28866 -15352 -27067 -22650 -41872 -22981
15180b2981J3599j1761j066J8991j3088N039L0822J3420p292j8110j0952K1055
$$ -22981 -9382 -21143 -22209 -3218 -16306 -11267 19555 32975 25683 7573 -3379 17676
15168A7676p049k0987m111N818j380j4114j1274m259L673j0903J6378r772J8565
$$ 17676 10627 -10360 -14471 -8653 -10033 -24147 -35421 -39680 -36007 -46910 -30532 -40304 -21739
15155b1739L5486J2249j6709j3299k1471k7029M037R734o4j621K625J7865j1614
$$ -21739 13747 25996 9287 -4012 -25483 -52512 -48475 -38741 -38805 -40426 -37801 -19936 -31550
15142c1550m161j2801r265j3455O378R877Q403L226r613k0413n089O704O707j1401
$$ -31550 -35711 -48512 -57777 -71232 -64854 -54977 -46574 -43348 -52961 -73374 -78463 -71759 -65052 -76453
15128g6453j4397K0417L3101J1992n095j8979m457j0068j3685K2112Q871M3601
$$ -76453 -90850 -70433 -37332 -25340 -30435 -49414 -53871 -63939 -77624 -55512 -46641 -3040
15116c040l607K4096J7393k4753l1321j0396j7318K2700J7109L1655j6630l6933
$$ -3040 -6647 17449 34842 10089 -21232 -31628 -48946 -26246 -9137 22518 5888 -31045
15104c1045J669r310j8645j3407m650R278M2991j885k1016R089j8791M792N651
$$ -31045 -29376 -38686 -57331 -70738 -75388 -66110 -23119 -25004 -46020 -36931 -55722 -50930 -45279
15091d5279o695j2886J914K0563L2869N284j2325j2297N626J0939r311k249J2701
$$ -45279 -51974 -64860 -62946 -42383 -9514 -4230 -16555 -28852 -23226 -12287 -21598 -23847 -11146
15078a1146k5443k978L0706K0204j9469r502k0945K5248K5688P607q414n4220
$$ -11146 -36589 -39567 -8861 11343 -8126 -17628 -38573 -13325 12363 19970 11556 -42664
15066d2664m116p342j3212K3343J3382j6035r359l618K1142M978R756R689j2431
$$ -42664 -46780 -54122 -67334 -43991 -30609 -46644 -56003 -59621 -38479 -33501 -23745 -14056 -26487
15053b6487L2964j4733j3701o773l699O695l996j3426R633R262J5764N349j525
$$ -26487 6477 -8256 -21957 -28730 -32429 -25734 -29730 -43156 -33523 -24261 -8497 -3148 -4673
15040d673k1646P719J6483r145O188k5698j5085J2424M450o19k9036j2409R833
$$ -4673 -26319 -18600 -2117 -11262 -5074 -30772 -45857 -33433 -28983 -29602 -58638 -71047 -61214
15027f1214k503k0158J7940O909K693J0459l8822j0128L7101Q740K9182K8885
$$ -61214 -63717 -83875 -65935 -59026 -56333 -45874 -84696 -94824 -57723 -48983 -19801 9084
15015I084j8602k3370k2913J2728K4517J0965k0782m55k9977l925K4636N3p571
$$ 9084 -9518 -32888 -55801 -43073 -18556 -7591 -28373 -28828 -58805 -62730 -38094 -38041 -45612
15002d5612j3109P604J1858k1919p069K2470K1593o052r868J0239J4570l931N968
$$ -45612 -58721 -51117 -39259 -61178 -68247 -45777 -24184 -30236 -40104 -29865 -15295 -19226 -13258
14989a3258j6337j6640J4019J3621N968j3285q241j0732J2593Q997k4397q042
$$ -13258 -29595 -46235 -32216 -18595 -12627 -25912 -34153 -44885 -32292 -23295 -47692 -55734
14977e5734P920P288j4065J0548J6696N50J8635K1231l1175r923o562j6326K2766
$$ -55734 -47814 -40526 -54591 -44043 -27347 -26797 -8162 13069 -18106 -28029 -34591 -50917 -28151
14964b8151M8954J5102M086O132j6891k2953m3836m102K9676J7986K1721J1767
$$ -28151 20803 35905 39991 46123 29232 6279 -37557 -41659 -11983 6003 27724 39491
14952C9491k7428k0614k0457k2142k0689J1414K4999J7384l2891k5750K4674L9452
$$ 39491 12063 -8551 -29008 -51150 -71839 -60425 -35426 -18042 -50933 -76683 -52009 -12557
14940a2557J7919o439j7553k3038j7512M789L034Q710K1579j8655L383L0633O670
$$ -12557 5362 -1077 -18630 -41668 -59180 -54391 -51357 -42647 -21068 -39723 -36340 -5707 963
14927I63p347l1981j2361l0425m181J6550J5578J1201J4829r844K1267j5152p518
$$ 963 -6384 -38365 -50726 -81151 -85332 -68782 -53204 -42003 -27174 -37018 -15751 -30903 -38421
14914c8421k003Q643K238j0177r881L7751J5851k5023k3620j0127j9333M47Q163
$$ -38421 -40424 -31781 -29543 -39720 -49601 -11850 4001 -21022 -44642 -54769 -74102 -73655 -65492
14901f5492K5511K0534O271q107K819k4063J4393J375K3373q557q740j0525K1247
$$ -65492 -39981 -19447 -13176 -21283 -18464 -42527 -28134 -26759 -3386 -11943 -20683 -31208 -9961
14888i961M8070l053l3386l8665o619K4178P179r033q523q340j9823j044P826
$$ -9961 38109 35056 1670 -36995 -43614 -19436 -12257 -21290 -29813 -38153 -57976 -59020 -51194
14875e1194j2823J2906k0478j4559L3059K9089K8346L555k0699J7953K0618J876
$$ -51194 -64017 -51111 -71589 -86148 -53089 -24000 4346 7901 -12798 5155 25773 27649
14863B7649p238l0513j7623J652K7588J3160j2762k6407N082O458j7207J600l013
$$ 27649 20411 -10102 -27725 -26073 1515 14675 1913 -24494 -19412 -12954 -30161 -28561 -31574
14850c1574R184J8302K577K749K863L6838p603l3594j6750L4145j4887n908R715
$$ -31574 -22390 -4088 -1511 1238 4101 40939 33336 -258 -17008 17137 2250 -3658 6057
14837F057j5636j7948J2156p515j8254K6985J3404L0955O439m307j8967N113n480
$$ 6057 -9579 -27527 -15371 -22886 -41140 -14155 -751 30204 36643 32336 13369 18482 13002
14824A3002k0636j3889J7914j7215l543J9904K20L544J5244J5872r472j4598J0844
$$ 13002 -7634 -21523 -3609 -20824 -24367 -4463 -4243 -699 14545 30417 20945 6347 17191
14811A7191m394j2426j7186n873j9187M798L9868K6939l0839j5884j0580o433
$$ 17191 12797 371 -16815 -22688 -41875 -37077 2791 29730 -1109 -16993 -27573 -34006
14799c4006K1048l072p965R136J8715j4376j0870K0314K960M619J940R512N435
$$ -34006 -12958 -16030 -23995 -14859 3856 -10520 -21390 -1076 1884 6503 8443 17955 23390
14786B3390l516m8399j9526P663o949J2905L4618j364k3472r148j6056J5145J5729
$$ 23390 19874 -28525 -48051 -40388 -47337 -34432 186 -1178 -24650 -33798 -49854 -34709 -18980
14773a8980p889j5923p39K7210K6150j3213j4244N706J1597J1529k3600m2914
$$ -18980 -26869 -42792 -43531 -16321 9829 -3384 -17628 -11922 -325 11204 -12396 -55310
14761e5310P411J0299o793O625j784l9927q810L6595L9192K4342L866J4448J5489
$$ -55310 -47899 -37600 -44393 -37768 -39552 -79479 -88289 -51694 -12502 11840 15706 30154 45643
14748D5643J1027j2367m0809j9263r429l3153L550J3808o218K683L6102J2878
$$ 45643 56670 44303 3494 -15769 -25198 -58351 -54801 -40993 -47211 -44528 -8426 4452
14736D452k388k918j7949j3291m615K9400L0189o603k5233O793K3705K0460k6365
$$ 4452 2064 -854 -18803 -32094 -36709 -7309 22880 16277 -8956 -2163 21542 42002 15637
14723A5637k8610r984j9834k817J3419k543L076K0067J9585m053J1307K5847k8484
$$ 15637 -12973 -22957 -42791 -45608 -32189 -34732 -31656 -11589 7996 3943 15250 41097 12613
14710A2613l6217J0028M5562P89l8306P589M1422m882p838j8842j3919O667j3639
$$ 12613 -23604 -13576 31986 32775 -5531 2058 43480 38598 30760 11918 -2001 4666 -8973
14697h973O219J821J5339K1838M001J0970k5886k3101J6771L819k596O606P59
$$ -8973 -2754 -933 14406 36244 40245 51215 25329 2228 18999 22818 20222 26828 27587
14684B7587o751n988J1373Q267j0038j1958k86j0449k4547j1553M5222K7701N984
$$ 27587 20836 14848 26221 34488 24450 12492 12206 1757 -22790 -34343 10879 38580 44564
14671D4564l3012P402J1311l0044N30L4347M1269m333j3423j6456J1671l4717
$$ 44564 11552 18954 30265 221 751 35098 76367 72034 58611 42155 53826 19109
14659A9109N546Q746J7714o314j8908J4K2474O07k0451P750j6790n8307l2J8985
$$ 19109 24655 33401 51115 44801 25893 25907 48381 48988 28537 36287 19497 -38810 -38842 -19857
14645a9857K1376P654l800O418K6373M685M2904J30k2617r734n681l33k2701k7363
$$ -19857 1519 9173 5373 11791 38164 42849 85753 85883 63266 53532 47851 47518 24817 -2546
14631b546J1315n144j779N043j061J6016l573n27L7773q294n032J3876r072M25
$$ -2546 8769 3625 1846 6889 5828 21844 18271 17744 55517 47223 42191 56067 46995 47420
14617D7420J0092k065k4680k264N027l645j7082n846j2134O651k0186j9933J2356
$$ 47420 57512 55447 30767 28503 33530 29885 12803 6957 -5177 1474 -18712 -38645 -26289
14604b6289m695K0532R897j0279J654P972o644K987m193j0337J5340M911P850
$$ -26289 -30984 -10452 -555 -10834 -9180 -1208 -7852 -4865 -9058 -19395 -4055 856 8706
14591H706j1175L270o790l511J675J6755j9233k5362P608J4759p53k641Q791j2853
$$ 8706 -2469 801 -5989 -9500 -7825 8930 -10303 -35665 -28057 -13298 -14051 -16692 -7901 -20754
14577b0754r146K3785k3604m30L2475L4144k0478l827j5300o658J0372J3437J0761
$$ -20754 -29900 -6115 -29719 -30149 2326 36470 15992 12165 -3135 -9793 579 14016 24777
14564B4777k2947r89M093j3903j9768p134K633M9478K2432o494j9277P302j3766
$$ 24777 1830 841 4934 -8969 -28737 -35871 -33238 16240 38672 32178 12901 20203 6437
14551F437j509J681j0804K3484N285j925j4239q823J0592L299j0332R155n890
$$ 6437 4928 6609 -4195 19289 24574 22649 8410 -413 10179 13478 3146 12301 6411
14538F411j1136j4162J2640j5136N70K1150K4849j9431j4373K6713j4241j8621
$$ 6411 -4725 -18887 -6247 -21383 -20813 337 25186 5755 -8618 18095 3854 -14767
14526a4767j5150J339j3839m2908m76K4064J9781L773J1025k5949K384L2661j3224
$$ -14767 -29917 -28578 -42417 -85325 -85801 -61737 -41956 -38183 -27158 -53107 -50723 -18062 -31286
14513c1286p197J9011L4843L888L991R1r675q250M130P645j2880k0489o521J213
$$ -31286 -38483 -19472 15371 19259 23250 23341 13666 5416 9546 17191 4311 -16178 -22699 -21486
14499b1486K3791J223k3265Q422P373k7147j0241J6457l370l808L877J5010m818
$$ -21486 2305 3528 -19737 -11315 -3942 -31089 -41330 -24873 -28243 -32051 -28174 -13164 -17982
14486a7982j4626q248Q439K738k14N633r414K7408K7214J3567j9672j625m907
$$ -17982 -32608 -40856 -32417 -29679 -29893 -24260 -33674 -6266 20948 34515 14843 13218 8311
14473H311L482K3352j7368j6245L399J2487L492o911l2497J4535R975J2588q398
$$ 8311 11793 35145 17777 1532 4931 17418 20910 13999 -18498 -3963 6012 18600 10202
14460A0202k9192j2788n164M105k496j7062r849k614K3423J0862J1269j4598J7651
$$ 10202 -18990 -31778 -36942 -32837 -35333 -52395 -62244 -64858 -41435 -30573 -19304 -33902 -16251
14447a6251J8276R365l786k2740M111K1995Q833j8217j4350R300K2301J0228r409
$$ -16251 2025 11390 7604 -15136 -11025 10970 19803 1586 -12764 -3464 18837 29065 19656
14434A9656J6078K7780j8642J2329O018k9542l9175q997P703l72o450k1481l4102
$$ 19656 35734 63514 44872 57201 63219 33677 -5498 -14495 -6792 -7164 -13614 -35095 -69197
14421f9197k9474M2982L6148j2021m505M850L56j8697n334J3428N969L2490j263
$$ -69197 -98671 -55689 -19541 -31562 -36067 -31217 -30861 -49558 -54892 -41464 -35495 -3005 -4268
14408d268K7782J2250k3621n762k7505j6459L1784J6765j330j4220P229J3717
$$ -4268 23514 35764 12143 6381 -21124 -37583 -5799 10966 9636 -4584 2645 16362
14396A6362j890j2582j2355J196j1866k441J3742N112k3913K6589R012K265k2014
$$ 16362 14472 1890 -10465 -9269 -21135 -23576 -9834 -4722 -28635 -2046 6966 9231 -12783
14383a2783l4952l2626J9j1500J3280J8792K1653q65j350O566k89K3948J8107
$$ -12783 -47735 -80361 -80342 -91842 -78562 -59770 -38117 -38982 -40332 -33766 -34055 -10107 8000
14370H000j4370k0940k6711N821K8249J5515m1694N015Q066m2064k8456J9089
$$ 8000 -6370 -27310 -54021 -48200 -19951 -4436 -46130 -41115 -33049 -75113 -103569 -84480
14358h4480J2830J10Q339n030Q792J8600l651j2650J3045j3977J6765j0799L027
$$ -84480 -71650 -71540 -63201 -68231 -59439 -40839 -44490 -57140 -44095 -58072 -41307 -52106 -49079
14345d9079L539M808n105j199K1166J1359o688O30j9076M422K4127L1089K0864
$$ -49079 -45540 -40732 -45837 -47036 -25870 -14511 -21199 -20569 -39645 -35223 -11096 19993 40857
14332D0857j3466k838k9830l9268M82J4425M402J879J5597j7530j9025q267q36
$$ 40857 27391 24553 -5277 -44545 -44063 -29638 -25236 -23357 -7760 -25290 -44315 -52582 -53418
14319e3418p055N050J0797J036J7762L912P213L667k9843j1979j5259j6003K8849
$$ -53418 -60473 -55423 -44626 -43590 -25828 -21916 -14703 -11036 -40879 -52858 -68117 -84120 -55271
14306e5271j0339j18K2477N548k4812N564K6043J3740K5684R154k0751j1791p155
$$ -55271 -65610 -65728 -43251 -37703 -62515 -56951 -30908 -17168 8516 17670 -3081 -14872 -22027
14293b2027R430n206K901q649q397k1507M345n384J2280n907j0218j1634j1723
$$ -22027 -12597 -17803 -14902 -23551 -31948 -53455 -49110 -54494 -42214 -48121 -58339 -69973 -81696
14280h1696K3046K4764O746j792j0593J569k570L9153L8873j1626p562k8645J1931
$$ -81696 -58650 -33886 -27140 -28932 -39525 -37956 -40526 -1373 37500 25874 18312 -10333 1598
14267A598j2797P882K1718j5820l9848j9022J5923J6423J7654K7683J357k0256
$$ 1598 -11199 -3317 18401 2581 -37267 -56289 -40366 -23943 -6289 21394 22751 2495
14255B495l8190j8170q622J8124J1392r841J6100m5N999L6616M006n1578k7511
$$ 2495 -35695 -53865 -62487 -44363 -32971 -42812 -26712 -26757 -20758 15858 19864 -31714 -59225
14242e9225O063R795j8179K5207K0730K0884j4571J7592K0238j5669j9919r636
$$ -59225 -53162 -43367 -61546 -36339 -15609 5275 -9296 8296 28534 12865 -7054 -16690
14230a6690j1322P55N903m594p434Q019J0998j4580r767j7449j5066K4704J5211
$$ -16690 -28012 -27257 -21354 -25948 -33382 -25363 -14365 -28945 -38712 -56161 -71227 -46523 -31312
14217c1312J2537J0448J715R466J2707k2797m424J760J150J3341j2018m321M947
$$ -31312 -18775 -8327 -6612 2854 15561 -7236 -11660 -9900 -8750 4591 -7427 -11748 -6801
14204f801j8690j4472K0434k962j17j0880j1565K1388q685m302q071r001O241
$$ -6801 -25491 -39963 -19529 -22491 -22608 -33488 -45053 -23665 -32350 -36652 -44723 -53724 -47483
14191d7483J1392L4764L0272K3433k269k4063k3843L954Q011M26n382k3727K2649
$$ -47483 -36091 -1327 28945 52378 50109 26046 2203 6157 14168 14594 9212 -14515 8134
14178H134J1599j7863l8590r477L2942O969j7361J2161K5363K124j133j9951K988
$$ 8134 19733 1870 -36720 -46197 -13255 -6286 -23647 -11486 13877 16001 14868 -5083 -2095
14165b095k02j8226m2369J709K2842K0610J8671j3q88J3528J7475o301j8434l84
$$ -2095 -2297 -20523 -62892 -61183 -38341 -17731 940 927 39 13567 31042 24741 6307 5923
14151E923J642J5690k8063j7440J7457J169K284K221J3928o308j4918j5384q061
$$ 5923 7565 23255 -4808 -22248 -4791 -3622 -1338 883 14811 8503 -6415 -21799 -29860
14138b9860K697J1410j1557k272L0528K3245j5951k9053j6219k2441P811P128
$$ -29860 -27163 -15753 -27310 -29582 946 24191 8240 -20813 -37032 -59473 -51662 -44534
14126d4534q96O465L368J2499k2002J8675K5899K495j0760o956r214L214L440
$$ -44534 -45430 -38965 -35597 -23098 -45100 -26425 -526 1969 -8791 -15747 -24961 -21747 -18307
14113a8307N309m1582j6017j100R646K3714m3740P920K6666J2955n96P747j8328
$$ -18307 -12998 -54580 -70597 -71697 -62051 -38337 -82077 -74157 -47491 -34536 -35132 -27385 -45713
14100d5713j8501K508K894J2403J9755j5973J0432O99O159K3532p780l5602R243
$$ -45713 -64214 -61706 -58812 -46409 -26654 -42627 -32195 -31496 -25337 -1805 -9585 -45187 -35944
14087c5944L218j2007R049N304K776q51J344J2206l4724j2164q750K3346L2079
$$ -35944 -32726 -44733 -35684 -30380 -27604 -28455 -27111 -14905 -49629 -61793 -70543 -47197 -15118
14074a5118O158r745K0362J0994J6501L116k4055q383l9153P669j7371j4512K2882
$$ -15118 -8960 -18705 1657 12651 29152 32268 8213 -170 -39323 -31654 -49025 -63537 -40655
14061d0655J3792J7774L779N852J152l0367j6170l173j474N107K7216m7j0761
$$ -40655 -26863 -9089 -5310 542 1694 -28673 -44843 -48016 -49490 -44383 -17167 -17214 -27975
14048b7975l657J9019J8113q705k3472j5585M0348J0340R983m697m197K1912j5640
$$ -27975 -31632 -12613 5500 -3205 -26677 -42262 -1914 8426 18409 13712 9515 31427 15787
14035A5787l703p618j892J8721J6309K0101k218k2489k9624J582K180k2543J1940
$$ 15787 12084 4466 2574 21295 37604 57705 55487 32998 3374 4956 7136 -15407 -3467
14022c467j5191L094K5573J669k3433l340J3669K2181j1260k90K9951l695L82
$$ -3467 -18658 -15564 10009 11678 -11755 -15095 -1426 20755 9495 9205 39156 35461 35843
14009C5843L095n041p21m1811l3017P569j860l120L2014j4170k0348j0847K490
$$ 35843 38938 33897 33176 -8635 -41652 -34083 -35943 -39063 -7049 -21219 -41567 -52414 -49924
13996d9924J3455k2775r335k128K9963R908O32L2575j9664k2586J0388J2389J1895
$$ -49924 -36469 -59244 -68579 -70707 -40744 -30836 -30204 2371 -17293 -39879 -29491 -17102 -5207
13983e207j2292k4091Q231P718O607j9692q763J3447K2960K8861R60k5309l289
$$ -5207 -17499 -41590 -33359 -25641 -19034 -38726 -47489 -34042 -11082 17779 18739 -6570 -9859
13970i859j2140q403k3767K2438L84L7208L9639k2870k6898N956p4m573K5477
$$ -9859 -21999 -30402 -54169 -31731 -31347 5861 45500 22630 -4268 1688 1614 -2959 22518
13957B2518K31m5335k7210L4049L8773K8044Q272m522o8282l2340O211J2985J8440
$$ 22518 22749 -22586 -49796 -15747 23026 51070 59342 54820 -13462 -45802 -39591 -26606 -8166
13944h166K2583k0242L33K9055J5678J4820P94k3286L8625M2582J3593J3068O7599
$$ -8166 14417 -5825 -5492 23563 39241 54061 54855 31569 70194 112776 126369 139437 207036
13931B07036K4154K0217r399M045J4686l3061l2615m0370j7667j9822n582N233
$$ 207036 231190 251407 242008 246053 260739 227678 195063 154693 137026 117204 111622 116855
13919A16855p067k3568j7477j4770l2589P09j8560r368m84P349j2800j879j2964
$$ 116855 109788 86220 68743 53973 21384 22093 3533 -5835 -6319 1030 -11770 -13649 -26613
13906b6613r4K3050O215J1527j1649j1281j5177j2440J7008J1778K0869P637k0451
$$ -26613 -26707 -3657 2558 14085 2436 -8845 -24022 -36462 -19454 -7676 13193 20830 379
13893C79L940K4277j9422K6143P612l7197k002K1179N927J3642j9398j8624N63
$$ 379 4319 28596 9174 35317 42929 5732 3730 24909 30836 44478 25080 6456 7019
13880G019J6527L557j0230j5088j6829q678K8551J984K7494K9788o680j1177j1585
$$ 7019 23546 27103 16873 1785 -15044 -23722 4829 6813 34307 64095 57415 46238 34653
13867C4653j1295o845m216J3121l1916l5354O183N61J443J6374J42j4732R480
$$ 34653 23358 16513 12297 25418 -6498 -41852 -35669 -35108 -33665 -17291 -17149 -31881 -22401
13854b2401O966p593J9657K7705L363k0875p766j0008k7233l391J6990J8855P715
$$ -22401 -15435 -23028 -3371 24334 27697 6822 -944 -10952 -38185 -41576 -24586 -5731 1984
13841A984K3592n030j519j9736k9356o659k8770M348K8764K0581m800l1128J8362
$$ 1984 25576 20546 19027 -709 -30065 -36724 -65494 -61146 -32382 -11801 -16601 -47729 -29367
13828b9367K4095o674J6282j9869k0103M434L0523J494j7699N765O736o994k0936
$$ -29367 -5272 -11946 4336 -15533 -35636 -31202 -679 815 -16884 -11119 -4383 -11377 -32313
13815c2313k9197j1389P846n04r603M2957J8138k5577j5812K2221L2163j1285
$$ -32313 -61510 -72899 -65053 -65557 -75160 -32203 -14065 -39642 -55454 -33233 -1070 -12355
13803a2355o418k2230J0833n188L1125M4349J1306k375l0467k3120K9439k984
$$ -12355 -18773 -41003 -30170 -35358 -4233 40116 51422 49047 18580 -4540 24899 21915
13791B1915l0447k4423R903j563J548J4325j171j6769j7012R540M2951j9010j6925
$$ 21915 -8532 -32955 -23052 -24615 -23067 -8742 -9913 -26682 -43694 -34154 8797 -10213 -27138
13778b7138j071Q870k339o562l938j3668Q256R037L0165M0923O535l1593j6881
$$ -27138 -28209 -19339 -21678 -28240 -32178 -45846 -37590 -28553 1612 42535 49070 17477 596
13765E96J213M983m2970j5065K4759L1436n707l4849N132p589J342J4627o296
$$ 596 1809 6792 -36178 -51243 -26484 4952 -755 -35604 -30472 -38061 -36719 -22092 -28388
13752b8388l653o044N553j3493l9271L7369L5618j0973n13n380o008J8024M3359
$$ -28388 -32041 -38085 -32532 -46025 -85296 -47927 -12309 -23282 -23795 -29175 -35183 -17159 26200
13739B6200J2469J2682l561m3423k0225r943j9727J815L3523M822k7809l962K7973
$$ 26200 38669 51351 47790 4367 -15858 -25801 -45528 -43713 -10190 -5368 -33177 -37139 -9166
13726i166J4140J7075k2588l5335k0561L6889K5736R473l1790l5179K2650J5665
$$ -9166 4974 22049 -539 -35874 -56435 -19546 6190 15663 -16127 -51306 -28656 -12991
13714a2991J0249J1252p924K453K1401p015k5295n062j0947l777p348J8228Q646
$$ -12991 -2742 8510 586 3039 24440 17425 -7870 -12932 -23879 -27656 -35004 -16776 -8130
13701h130M653j3339J7016L6518k332k8234l0166j2486N069l481J7290J2292K6435
$$ -8130 -3477 -16816 200 36718 34386 6152 -24014 -36500 -31431 -34912 -17622 -5330 21105
13688B1105j6112j3752j7254P047O992M671J7139N336k285j9307j9592L989L255
$$ 21105 4993 -8759 -26013 -18966 -11974 -7303 9836 15172 12887 -6420 -26012 -22023 -18768
13675a8768k5159k4357Q883p02J1501J1257J4848L218M502j1366K9037N665n483
$$ -18768 -43927 -68284 -59401 -60103 -48602 -37345 -22497 -19279 -14777 -26143 2894 8559 3076
13662C076L682J2713O80K9107j338j6344l972j0814Q079k589k5573l320N278J2142
$$ 3076 6758 19471 20151 49258 47920 31576 27604 16790 24869 22280 -3293 -6613 -1335 10807
13648A0807q789K3137K3465r016L0512R247J8516j3258j6034J4086J9954L2779
$$ 10807 2018 25155 48620 39604 70116 79363 97879 84621 68587 82673 102627 135406
13636A35406L6977j481L493K1173N6057O2406L8391N9487P6969J04278R9360J29553
$$ 135406 172383 170902 174395 195568 251625 314031 352422 411909 488878 593156 692516 822069
13624H22069J44847J45561J61930J72009J45560J73633K32807K39186K32737J96801
$$ 822069 966916 1112477 1274407 1446416 1591976 1765609 1998416 2237602 2470339 2667140
13614B667140K09533J66182J61772J67087J15491J03576O1147M7825M2776m023
$$ 2667140 2876673 3042855 3204627 3371714 3487205 3590781 3651928 3699753 3742529 3738506
13604C738506l9674r1021j05900j08379j73607j79808j60210j49673j82195j98683
$$ 3738506 3698832 3607811 3501911 3393532 3219925 3040117 2879907 2730234 2548039 2349356
13594B349356j83018j92937j55765j30568j44035j10458j02080j07895r7731q2823
$$ 2349356 2166338 1973401 1817636 1687068 1543033 1432575 1330495 1222600 1124869 1042046
13584A042046p0128p0050o9195n4863o5018l9053J009p452k2701l5004k5370m9009
$$ 1042046 971918 901868 832673 777810 712792 673739 674748 667296 644595 609591 584221 535212
13572E35212j1597l927k4002r716m9426j2627r079k1135l206N57j9548l8397k138
$$ 535212 523615 519688 495686 485970 436544 423917 414838 393703 390497 391054 371506 333109 330971
13559C30971J9559j262j1728k2769k3932j9760r680m40J3417J1606k6956m4689
$$ 330971 350530 349268 337540 314771 290839 271079 261399 260959 274376 285982 259026 214337
13547B14337k0635l851k267n725O376L1326J4875k6875L043J499J997M3963j7566
$$ 214337 193702 189851 187584 181859 188235 219561 234436 207561 210604 212103 214100 258063 240497
13534B40497k0130k9606k9020P622L646j5214m6095q035P185J1484n391l04K0071
$$ 240497 220367 190761 161741 169363 173009 157795 111700 103665 110850 122334 116943 116639 136710
13521A36710J6473K300J3799j3592r430J2632k1392J1311m055J6649k770j839
$$ 136710 153183 155483 169282 155690 146260 158892 137500 148811 144756 161405 158635 156796
13509A56796j3446k1523Q49j0760L97r057j7198J5660J6819k6514m2011j9097
$$ 156796 143350 121827 122676 111916 112313 103256 86058 101718 118537 92023 50012 30915
13497C0915k4233M9066M4398R260o522j8079j4715R203j4817q839k0516L063Q612
$$ 30915 6682 55748 100146 109406 102884 84805 70090 79293 64476 55637 35121 38184 46796
13484D6796p712j8186k0496K648L1042L3975K8890K4960j6155j7327k2394L927
$$ 46796 39084 20898 402 3050 34092 68067 96957 121917 105762 88435 66041 69968
13472F9968j2979k2984J1863n251J7993K5530j5277n609j8041o391Q923J8071
$$ 69968 56989 34005 45868 40617 58610 84140 68863 63254 45213 38822 47745 65816
13460F5816n71j0014K4942j0340k2322j3376q789l603j4429j1989J9950K8492
$$ 65816 65245 55231 80173 69833 47511 34135 25346 21743 7314 -4675 15275 43767
13448D3767J1843J242o909K305q506J0583J4186K820j0759l9011j4316Q216J0051
$$ 43767 55610 56852 49943 52248 43742 54325 68511 71331 60572 21561 7245 15461 25512
13435B5512n928M4707J8471J8387l896j8150k4563j4552p486K053J8843l970J7400
$$ 25512 19584 64291 82762 101149 97253 79103 54540 39988 32502 34555 53398 49428 66828
13422F6828J255l154j6323r688J2277j5329N662J2793K8455J3892k518m857o044
$$ 66828 68083 64929 48606 38918 51195 35866 41528 54321 82776 96668 94150 89293 83249
13409H3249o910p009l49l0153m0086N462L4608J3569r778j1207N965K490n292
$$ 83249 76339 69330 68981 38828 -1258 4204 38812 52381 42603 31396 37361 39851 34559
13396C4559p313R434L252l0717J8817L919J5652L20j7452k19l694p746j2116K1604
$$ 34559 27246 36680 39932 9215 28032 31951 47603 47923 30471 30252 26558 18812 6696 28300
13382B8300O599m9162j6619K6466q926j1260j3273J8449K1080K3084J7574j9488
$$ 28300 34899 -14263 -30882 -4416 -13342 -24602 -37875 -19426 1654 24738 42312 22824
13370B2824r537q826K37J6324L3838j1002l4432K1044L9478O2l8653j1473j8408
$$ 22824 13287 4461 4698 21022 54860 43858 9426 30470 69948 70010 31357 19884 1476
13357A476j5700P469L224n532p602J1156M7769P573m2593j2595j759N496J8596
$$ 1476 -14224 -6755 -3531 -9063 -16665 -5509 42260 49833 7240 -5355 -7114 -1618 16978
13344A6978j6287K2098J1478O81M2879q031l0384q289j06n930J1987l242o666
$$ 16978 691 22789 34267 34948 77827 69796 39412 31123 31017 25087 37074 33832 27166
13331B7166j2355j2917J5796J1964j7365j97Q614p963k444N110J6866K821o885
$$ 27166 14811 1894 17690 29654 12289 12092 20706 12743 10299 15409 32275 35096 28211
13318B8211k2776M351J2184K297M06J1201Q29k1812k4140R119O549R179m919l943
$$ 28211 5435 9786 21970 24267 24673 35874 36703 14891 -9249 -130 6419 15598 10679 6736
13304F736K9332J1491m591M83O511N320R955n314j5073k2202K879R310R961l852
$$ 6736 36068 47559 42968 43451 49962 55282 65237 59923 44850 22648 25527 34837 44798 40946
13290D0946j8567j4685J0092K4457q236m0595j5377J7283K8741K236n481j2231
$$ 40946 22379 7694 17786 42243 34007 -6588 -21965 -4682 24059 26295 20814 8583
13278H583M014j5739M062M88j0969j5898L2059L1078J896P828K9442r833m0407
$$ 8583 12597 -3142 920 1408 -9561 -25459 6600 37678 39574 47402 76844 67011 26604
13265B6604l5245J4923J7472J2278j9487J3323M3416j0065k3421P759k970l0345
$$ 26604 -8641 6282 23754 36032 16545 29868 73284 63219 39798 47557 44587 14242
13253A4242k8803J6892R958J3699J5393P316K032j5834k3834O168N329J8287J4898
$$ 14242 -14561 2331 12289 25988 41381 48697 50729 34895 11061 17229 22558 40845 55743
13240E5743j0913m434j2705J06L822k788r910q345p231J859K5729R866J861k3373
$$ 55743 44830 40396 27691 27797 31619 28831 18921 10576 3345 5204 30933 40799 42660 19287
13226A9287J523K3388l23k0058l947j1787k2621M965K3787q255Q518R041M311
$$ 19287 20810 44198 43875 23817 19870 8083 -14538 -9573 14214 5959 14477 23518 27829
13213B7829k7171j4167M752K4630j592j8213j1127J3924L20M677J7503j3310j1345
$$ 27829 658 -13509 -8757 15873 14281 -3932 -15059 -1135 -815 3862 21365 8055 -3290
13200c290K0485J4780P263k6585j7548N849j552K8481L2976m386n760r031P03
$$ -3290 17195 31975 39238 12653 -4895 954 -598 27883 60859 56473 50713 41682 42385
13187D2385M524k3508P071K7947M3123K6620N3409J5618l7394j0239l6970m7012
$$ 42385 46909 23401 30472 58419 101542 128162 181571 197189 159795 149556 112586 65574
13175F5574l8350O841K3191q335k4424L6468n99j1392K23N340Q42m281j1653j6540
$$ 65574 27224 34065 57256 48921 24497 60965 60366 48974 49197 54537 55379 51098 39445 22905
13161B2905J5159l35j3609M277N51r143r599j9735K7909L7135m00p817P488K6476
$$ 22905 38064 37729 24120 28397 28948 19805 10206 -9529 18380 55515 55115 47298 54786 81262
13147H1262P507r736J6973k167J3499K4129M6036K6991N1867O2274R0621P3034
$$ 81262 88769 79033 96006 93839 107338 131467 177503 204494 256361 318635 409256 482290
13135D82290O5051L0826o5795r0558n3906r4882l1279J1731K1323p850l4516k1434
$$ 482290 547341 578167 512372 421814 367908 273026 241747 253478 274801 266951 232435 211001
13123B11001l016J5530K5901L1335L0091M6586K9456O2754J55097K06717K19360
$$ 211001 207985 223515 249416 280751 310842 357428 386884 449638 604735 811452 1030812
13112A030812K64021K53662J89896J47314Q3428J4551r7320j54427k29929j99208
$$ 1030812 1294833 1548495 1738391 1885705 1969133 1983684 1886364 1731937 1502008 1302800
13102A302800j68246k02407j43188j17326o8211l9833j8052o532L441K7880Q2896
$$ 1302800 1134554 932147 788959 671633 603422 563589 545537 539005 542446 570326 653222
13091F53222R6255L7707K2663l2240r0193q6665p8067n4100l4781n9358k937K772
$$ 653222 749477 787184 809847 777607 687414 600749 522682 468582 433801 374443 371506 374278
13079C74278l4749l8771r041Q414O773k1379p673j8626j3004j7634p493J9275
$$ 374278 339529 300758 291717 300131 306904 285525 277852 259226 246222 228588 221095 240370
13067B40370J96K762k0654j2051k2068k1062K0909j1335Q327l6459l8112J403
$$ 240370 240566 243328 222674 210623 188555 167493 188402 177067 185394 148935 110823 112226
13055A12226J8644l37m839R652P826M109R67K3595O0837N0485K6500N458J1177
$$ 112226 130870 130533 125694 135346 143172 147281 148248 171843 232680 283165 309665 315123 326300
13042C26300k7842m0571k7382l145k899j1874j1740j8796m0815j1430j3718O779
$$ 326300 298458 257887 230505 227360 224461 212587 200847 182051 141236 129806 116088 122867
13030A22867o44j197M565p249J4070K1758j0780K546R546R755m425j9070j5722
$$ 122867 122223 121026 125591 118342 132412 154170 143390 145936 155482 165237 160812 141742 126020
13017A26020l347M520L474R480J1968J7751r095k0491k7695j1885K9578J3300
$$ 126020 122673 127193 130667 140147 152115 169866 160771 140280 112585 100700 130278 143578
13005A43578K3051p684k4697j6028j2716j6820J0721K6766j4200P734J9618k746
$$ 143578 166629 158945 134248 118220 105504 88684 99405 126171 111971 119705 139323 136577
12993A36577m9730j6208K730J7567j8360o564K5449J9030j8750j638K4112n310
$$ 136577 86847 70639 73369 90936 72576 66012 91461 110491 91741 90103 114215 108905
12981A08905j6377M351M317j7301Q949K532l1024j1604J4601Q450K482J154j8313
$$ 108905 92528 96879 101196 83895 92844 95376 64352 52748 67349 75799 78281 79435 61122
12968F1122k2203J6811M2885R125j9945k8507j4871M406J8870j4469l3614L825
$$ 61122 38919 55730 98615 107740 87795 59288 44417 48823 67693 53224 19610 23435
12956B3435m477q924K834L6090J6634L1916J993p365J7610K9779k184J5100M4322
$$ 23435 18958 10034 12868 48958 65592 97508 99501 92136 109746 139525 137341 152441 196763
12943A96763M9637O2302L4262J0543Q539J7240R94k4887p335r14j7650l5016m6584
$$ 196763 246400 308702 342964 353507 362046 379286 380280 355393 348058 347144 329494 294478 247894
12930B47894r830k3039k6419k6267J974K7340K3257J6913m644j9026O079j2152
$$ 247894 238064 215025 188606 162339 164313 191653 214910 231823 227179 208153 214232 202080
12918B02080N850j5931K3555L7860M494j1670k0192p243m471j7443P476l0896
$$ 202080 207930 191999 215554 253414 257908 246238 226046 218803 214332 196889 204365 173469
12906A73469M889J2602R529p964M844J7283K8716j6775L0759K5721l017m0968
$$ 173469 178358 190960 200489 192525 197369 214652 243368 226593 257352 283073 280056 239088
12894B39088k7664l224P275K7431J83m0867J1332l975k9608j7426N070J2804R671
$$ 239088 211424 208200 215475 242906 243089 202222 213554 209579 179971 162545 167615 180419 190090
12881A90090k4864M144K1635n834J6292J4176K1447J0146K4427J9132R688J7173
$$ 190090 165226 169370 191005 185171 201463 215639 237086 247232 271659 290791 300479 317652
12869C17652j9897l3720J3019K5062N804J6964J9333j1555Q261J2029M942k4546
$$ 317652 297755 264035 277054 302116 307920 324884 344217 332662 340923 352952 357894 333348
12857C33348O383n9o105j0068k8284p138J7914o289l1924p863M03m2020q111L7501
$$ 333348 339731 339672 333567 323499 295215 288077 305991 299702 267778 259915 260318 218298 210187 247688
12843B47688K0363k1713P783J7956J7595J8799N268m115K153n557j580J9544R889
$$ 247688 268051 246338 254121 272077 289672 308471 313739 309624 311777 306220 304640 324184 334073
12830C34073l0881n677L3921J8518J3270L542K0737K233K7400J8613j699L807
$$ 334073 303192 297515 331436 349954 363224 366766 387503 389736 417136 435749 434050 437857
12818D37857K3043J0701m871l834r081m3761m2660j1481j7381j2119o562q411
$$ 437857 460900 471601 466730 462896 453815 410054 367394 355913 338532 326413 319851 311440
12806C11440j9585q556L9339N5389K1322M969K8666M9647J6546k0774m978j2592
$$ 311440 291855 283299 322638 378027 399349 404318 432984 482631 499177 478403 473425 460833
12794D60833m870p986l083P716j3599j0720R389J0256J801L5601N6936k286J1041
$$ 460833 455963 447977 444894 452610 439011 428291 437680 447936 449737 485338 542274 539988 551029
12781E51029N524J1655n653J3887M1016J8651K6453N1120M2870J6253M6086K8199
$$ 551029 556553 568208 562555 576442 617458 636109 662562 713682 756552 772805 818891 847090
12769H47090O7K859l1928n4046j895J0747K794j2114J8027K3015l019K8896M1672
$$ 847090 847157 850016 818088 764042 762147 772894 775688 763574 781601 804616 801597 830493 872165
12756H72165J1016k3290j2495J9281K0425M2827J3508L6686K1476K696K8689J9521
$$ 872165 883181 859891 847396 866677 887102 929929 943437 980123 1001599 1004295 1032984 1052505
12744A052505L4648M1801L1425N0302P0682M0515N6219P8090R4463N0788N3953
$$ 1052505 1087153 1128954 1160379 1210681 1281363 1321878 1378097 1456187 1550650 1601438 1655391
12733A655391P8878J2125M4436O2202P1009P7192K8519Q8310J33619J62607J80472
$$ 1655391 1734269 1746394 1790830 1853032 1924041 2001233 2029752 2118062 2251681 2414288 2594760
12722B594760J74849J76498J91493K27172K45811K80168L65675L50831L86654
$$ 2594760 2769609 2946107 3137600 3364772 3610583 3890751 4256426 4607257 4993911
12713D993911M31852N05332O02667P26434Q48654R78418J192229J415381J639908
$$ 4993911 5425763 5931095 6533762 7260196 8108850 9087268 10279497 11694878 13334786
12704A3334786J868460K088832K284793K514124K745537L096112L628789M475261
$$ 13334786 15203246 17292078 19576871 22090995 24836532 27932644 31561433 36036694
12696C6036694N871926Q161478J1756334J7094124K4269752L2479085M0016823
$$ 36036694 41908620 50070098 61826432 78920556 103190308 135669393 175686216
12689A75686216M4760593M5328537M1198821L2209623J9201351L623431j2199123
$$ 175686216 220446809 265775346 306974167 339183790 358385141 362008572 349809449
12682C49809449k5821179l5434253m0089177m0063909l6282480l0128216k3359542
$$ 349809449 323988270 288554017 248464840 208400931 172118451 141990235 118630693
12675A18630693j7328133j2567012r174246o932964n494216m555560l933558l471115
$$ 118630693 101302560 88735548 79561302 72628338 67134122 62578562 58645004 55173889
12667E5173889l183457k902391k599967k346337k128188j909954j681548j485396
$$ 55173889 51990432 49088041 46488074 44141737 42013549 40103595 38422047 36936651
12659C6936651j361075j238525j166465j091724j009647r46990q64839p48373
$$ 36936651 35575576 34337051 33170586 32078862 31069215 30122225 29257386 28509013
12651B8509013o24715m95937l70638k44535j57895j29899j50118k52993l79241
$$ 28509013 27884298 27388361 27017723 26773188 26615293 26485394 26335276 26082283 25703042
12642B5703042n69413p25533q27124r42191r93939j025999r58460q50205p73378
$$ 25703042 25133629 24408096 23580972 22638781 21644842 20618843 19660383 18810178 18036800
12633A8036800p05658n74683m82283m80172m33665l90764l57975l08163k96138
$$ 18036800 17331142 16756459 16274176 15794004 15360339 14969575 14611600 14303437 14007299
12624A4007299l47772l41677k88912l36966l05289k65346k60866k48074k35912
$$ 14007299 13659527 13317850 13028938 12691972 12386683 12121337 11860471 11612397 11376485
12615A1376485k66965k56055k73368k61976k37514k13339k24397k29984k13516
$$ 11376485 11109520 10853465 10580097 10318121 10080607 9867268 9642871 9412887 9199371
12606I199371k05899j80914j72072j72335j70910j67584j69063j88389j63914
$$ 9199371 8993472 8812558 8640486 8468151 8297241 8129657 7960594 7772205 7608291
12597G608291j71810j60365j21892j53654j74638j45965j08981j28763j44791
$$ 7608291 7436481 7276116 7154224 7000570 6825932 6679967 6570986 6442223 6297432
12588F297432j25575j11762j39224j02853p6414j11162j19025j13242j27136j07725
$$ 6297432 6171857 6060095 5920871 5818018 5741604 5630442 5511417 5398175 5271039 5163314
12578E163314j08082j06466j10392q6443q8869j25281q4523p7878n2690n0092
$$ 5163314 5055232 4948766 4838374 4751931 4663062 4537781 4453258 4375380 4322690 4272598
12568D272598n3775n9859o0192l2827l416l5628m1646m2485m8111o9731j13754
$$ 4272598 4218823 4158964 4098772 4065945 4062529 4026901 3985255 3942770 3894659 3824928 3711174
12557C711174r9287j02184j11814j05754r6855q0256r0110n5875k9906j0013l8954
$$ 3711174 3611887 3509703 3397889 3292135 3195280 3115024 3024914 2969039 2939133 2929120 2890166
12546B890166m2473j8999k2788k6572j8673o397n7774o0096o5412o7776o8504
$$ 2890166 2847693 2828694 2805906 2779334 2760661 2754264 2696490 2636394 2570982 2503206 2434702
12535B434702p9643m7245j9584m3150l9423p6622o2309l6951j9507k0514l1837
$$ 2434702 2355059 2307814 2288230 2245080 2205657 2129035 2066726 2029775 2010268 1989754 1957917
12524A957917j0519R556j2214l7279j3742l0426l8156l5133q8674m9478o1977
$$ 1957917 1947398 1956954 1944740 1907461 1893719 1863293 1825137 1790004 1701330 1651852 1589875
12513A589875l9412k9829l5951o0521l8295n760r816Q521K323k7578J0158k2555
$$ 1589875 1550463 1520634 1484683 1424162 1385867 1380107 1370291 1378812 1381135 1353557 1363715 1341160
12501A341160m7610o099N025k1180k1814k4334k2746k8348Q539J5557n214Q05
$$ 1341160 1293550 1287451 1292476 1271296 1249482 1225148 1202402 1174054 1182593 1198150 1192936 1193741
12489A193741j1167l3106j9520q280k6315l5073j6706P199K5184L8157Q20k4406
$$ 1193741 1182574 1149468 1129948 1121668 1095353 1060280 1043574 1050773 1075957 1114114 1114934 1090528
12477A090528k8823m147k0978j0312k4552k5676J6773P688j8423P950j342q573
$$ 1090528 1061705 1057558 1036580 1026268 1001716 976040 992813 1000501 982078 990028 988686 980113
12465I80113J3375P05r025j955J9880J1875j3679m9097m9859m8661k4630j5791
$$ 980113 993488 994193 985168 983213 1003093 1014968 1001289 952192 902333 853672 829042 813251
12453H13251l6354j3490n359l8231J1410K9950J2437k645k6637j0472J8125j4026
$$ 813251 776897 763407 758048 719817 731227 761177 773614 770969 744332 733860 751985 737959
12441G37959p224m446N060Q59P73j0632J5706J1588K3516L5868K8966m0442m3971
$$ 737959 730735 726289 731349 732208 732981 722349 738055 749643 773159 809027 837993 797551 753580
12428G53580O118M3798J9921J4716K648J1574q13L7365O189j8042m6011n7299
$$ 753580 759698 803496 823417 838133 840781 852355 851542 888907 895096 877054 831043 773744
12416G73744k6863l8225o7715n2082J7979J0938j8613K8161L7073L8729K9951
$$ 773744 746881 708656 640941 588859 606838 617776 599163 627324 664397 703126 733077
12405G33077K1907L992n151j2996o624l470l516k9970j6126l308o214j0792R386
$$ 733077 754984 758976 753825 740829 734205 730735 727219 697249 681123 677815 671601 660809 670195
12392F70195J2151L2646j0619k3072K9140K1887K3835L7439m43k0876Q243J9704
$$ 670195 682346 714992 704373 681301 710441 732328 756163 793602 793159 772283 780526 800230
12380H00230n825J6218M5451q209k6921k5542j028L956J4931K3866Q594m477j8228
$$ 800230 794405 810623 856074 847865 820944 795402 794374 798330 813261 837127 845721 841244 823016
12367H23016R680K3415j1210l2997J3551K3710K2402q86P089M0492K9573r969
$$ 823016 832696 856111 844901 811904 825455 849165 871567 870681 877770 918262 947835 937866
12355I37866J5353M5530J7601j9776K0159L9678K4525L0771L6601J5899j1693
$$ 937866 953219 998749 1016350 996574 1016733 1056411 1080936 1111707 1148308 1164207 1152514
12344A152514K4129J4501M4857Q1728Q9551R8704Q6972O0879J5940N232K295L0554
$$ 1152514 1176643 1191144 1236001 1317729 1407280 1505984 1592956 1653835 1669775 1675007 1677302 1707856
12332A707856K9505N9068Q3252J28318J47978J65630J65535J60347J80854J98707
$$ 1707856 1737361 1796429 1879681 2007999 2155977 2321607 2487142 2647489 2828343 3027050
12322C027050K12649K33984K61046L37010L63571L90638M39369M57554N58918
$$ 3027050 3239699 3473683 3734729 4071739 4435310 4825948 5265317 5722871 6281789
12313F281789P08983Q79412J040763J277552J564568J902708K222937K479131
$$ 6281789 6990772 7870184 8910947 10188499 11753067 13655775 15878712 18357843
12305A8357843K733868K890476L066354L322859L827120M754854O495134R376302
$$ 18357843 21091711 23982187 27048541 30371400 34198520 38953374 45448508 54824810
12297E4824810J4070679K0921889K9640391L9152040M7267232N1624746N0194404
$$ 54824810 68895489 89817378 119457769 158609809 205877041 257501787 307696191
12290C07696191M1847318K7202800Q608066j0894993k8006875m0202534m6007913
$$ 307696191 349543509 376746309 385354375 374459382 346452507 306249973 260242060
12283B60242060m5428314l9773005l1362145k2740358j5682118j0644452p522761
$$ 260242060 214813746 175040741 143678596 120938238 105256120 94611668 87088907
12276H7088907n735266m905985m546787m419145m380965m293501m038654l683107
$$ 87088907 81353641 76447656 71900869 67481724 63100759 58807258 54768604 51085497
12268E1085497l284476k844636k399879j990992j689373j423413j247238j110535
$$ 51085497 47801021 44956385 42556506 40565514 38876141 37452728 36205490 35094955
12260C5094955j026031r70751r14995r28590r29049r50840r49258r25522r22416
$$ 35094955 34068924 33098173 32183178 31254588 30325539 29374699 28425441 27499919 26577503
12251B6577503r16734q95115q68410q10729p77860p43716p05758o58839o04545
$$ 26577503 25660769 24765654 23897244 23086515 22308655 21564939 20859181 20200342 19595797
12242A9595797n86102n16752n55963n21403m56390m27880m22379l83796l30768
$$ 19595797 19009695 18492943 17936980 17415577 16959187 16531307 16108928 15725132 15394364
12233A5394364k92608l39263l48957l30506l36449l31283k92364l05355k64259
$$ 15394364 15101756 14762493 14413536 14083030 13746581 13415298 13122934 12817579 12553320
12224A2553320k46536k46078k37473k43851k50132k57517k59471k50999k13993
$$ 12553320 12306784 12060706 11823233 11579382 11329250 11071733 10812262 10561263 10347270
12215A0347270k37799k54032k27328k06690j90683j89104k11863k22605j93340
$$ 10347270 10109471 9855439 9628111 9421421 9230738 9041634 8829771 8607166 8413826
12206H413826j75392j84588j73774j44067j78252j58979j40408j15369j56117
$$ 8413826 8238434 8053846 7880072 7736005 7557753 7398774 7258366 7142997 6986880
12197F986880j73727j50282j37972j17187j23135j18694j17479j20992j42965
$$ 6986880 6813153 6662871 6524899 6407712 6284577 6165883 6048404 5927412 5784447
12188E784447j43812j06386j00813j07608r2588p9741j07232j12898j10791j00763
$$ 5784447 5640635 5534249 5433436 5325828 5233240 5153499 5046267 4933369 4822578 4721815
12178D721815j01843j14706p8074n4840o1129r5332p6851m7245l1075l7725m4104
$$ 4721815 4619972 4505266 4427192 4372352 4311223 4215891 4139040 4091795 4060720 4022995 3978891
12167C978891o472l4234m3815m3998o6288p7332j14249j37815j31956j10825p4687
$$ 3978891 3972419 3938185 3894370 3850372 3784084 3706752 3592503 3454688 3322732 3211907 3137220
12156C137220q3909j00102q4708n7430p5581n0791l9665n7686n8521n9704m2106
$$ 3137220 3053311 2953209 2868501 2811071 2735490 2684699 2645034 2587348 2528827 2469123 2427017
12145B427017n4621q0876n8428m2850q024k9263l3887n2642l6953l7714n1444
$$ 2427017 2372396 2291520 2233092 2190242 2182218 2152955 2119068 2066426 2029473 1991759 1940315
12134A940315l2535j3026r822k0772k0624k2701j8134l8212L360R40l9006n7900
$$ 1940315 1907780 1894754 1884932 1864160 1843536 1820835 1802701 1764489 1767849 1768789 1729783 1671883
12122A671883m8541o7376n5366k9407l3326n1467l2763k6851l7045k8594q621
$$ 1671883 1623342 1555966 1500600 1471193 1437867 1386400 1353637 1326786 1289741 1261147 1252526
12111A252526j2314J9673k3900j7734k6467N295r122j3686m2721m2177m5479l2147
$$ 1252526 1240212 1259885 1235985 1218251 1191784 1197079 1187957 1174271 1131550 1089373 1043894 1011747
12099A011747j0385j4455j0310N26P959L1673q933J1264J2142n0831m2693j2437
$$ 1011747 1001362 986907 976597 977123 985082 1016755 1007822 1019086 1031228 980397 937704 925267
12087I25267j9950k2488q312l719l5908l1581k2115l530l939r004m0372l7043
$$ 925267 905317 882829 874517 870798 834890 803309 781194 777664 773725 764721 724349 687306
12075F87306k46J5233K2258Q052j1217j1364J7277R1r575j6598k4906j3195j6922
$$ 687306 687060 702293 724551 732603 721386 710022 727299 727390 717815 701217 676311 663116 646194
12062F46194k458q471j6677j2050k2040k4997j1333j4639k0660l0902p592m84
$$ 646194 643736 635265 618588 606538 584498 559501 548168 533529 512869 481967 474375 473891
12050D73891j6251j7373M1495K542o01j4102l189l800k8393m232J5084K152k652
$$ 473891 457640 440267 481762 484304 483703 469601 466412 462612 434219 429987 445071 447223 444571
12037D44571J429M229k1478K663P861l829l1334k771K7046j6542r368K4933M345
$$ 444571 446000 450229 428751 431414 439275 435446 404112 401341 428387 411845 402477 427410 431755
12024D31755j3620N46K510l001o739j7331m970l924Q590j4969o559j4924j8233
$$ 431755 418135 418681 421191 418190 411451 394120 389150 385226 393816 378847 372288 357364 339131
12011C39131K0312p852m725L0871N242j3612O32j9790k7615j209L624J1202k332
$$ 339131 359443 351591 346866 377737 382979 369367 369999 350209 322594 321385 325009 336211 333879
11998C33879r332p852j4563j6368O827L1500K6825J2159m2609l173l119J3221
$$ 333879 324547 316695 302132 285764 292591 324091 350916 363075 320466 317293 314174 327395
11986C27395K9922m3133l1074m85j8023k4733p509j0775q662r539K4022K2994
$$ 327395 357317 314184 283110 282625 264602 239869 232360 221585 212923 203384 227406 250400
11974B50400j4408K407L057j7739m640j2404j2267K864K9797k1460j5789J6j2274
$$ 250400 235992 238399 241456 223717 219077 206673 194406 197270 227067 205607 189818 189834 177560
11961A77560j2022Q61p806O539m399Q92J2615J2207K9413K9098k4423k2534p005
$$ 177560 165538 166399 158593 165132 160733 161625 174240 186447 215860 244958 220535 198001 190996
11948A90996k9581j9882k3962P988K9293O677J5928N038J7321j231j0901j9293
$$ 190996 161415 141533 117571 125559 154852 161529 177457 182495 199816 198585 187684 168391
11936A68391l6239l6707k6516j6359K6481p772l561m075j0578o042K2665K098
$$ 168391 132152 95445 68929 52570 79051 71279 67718 63643 53065 47023 69688 71786
11924G1786J7993L0481J4374j012p895n812k2609j1769r909P482M797J5801j5175
$$ 71786 89779 120260 134634 133622 125727 119915 97306 85537 75628 83110 87907 103708 88533
11911H8533j0044J3663J0717R562K6342J4094k6620j4876N166k1220J4354J9683
$$ 88533 78489 92152 102869 112431 138773 152867 126247 111371 116537 95317 109671 129354
11899A29354J4194N6173J2440m206M779R051m832j4397L884J5535n927j4183j4109
$$ 129354 143548 199721 212161 207955 212734 221785 216953 202556 206440 221975 216048 201865 187756
11886A87756N32q025J199P102J448L1802K6101K6028M8242P3940R3697J12609
$$ 187756 188288 180263 181462 188564 190012 221814 247915 273943 322185 396125 489822 602431
11874F02431J56874K05409K45599K56468K67971K15449J03842J9214j04534j83990
$$ 602431 759305 964714 1210313 1466781 1734752 1950201 2054043 2073257 1968723 1784733
11864A784733k49880k47222j84093j79797j64079j33385o7275k9589m8202p2302
$$ 1784733 1534853 1287631 1103538 923741 759662 626277 559002 529413 481211 408909
11854D08909l9704j3499j306p914k5513l1981k0805O982P569k4762k9435l730
$$ 408909 369205 355706 354400 346486 320973 288992 268187 275169 282738 257976 228541 224811
11842B24811J451j2860j9100J1980R412j1542m9470k5549R0r854j7331M040P433
$$ 224811 226262 213402 194302 206282 215694 204152 154682 129133 129223 119369 102038 106078 113511
11829A13511J7405K5736J8806R528J1510j7540j9374K5642j9770j1984j6498k9187
$$ 113511 130916 156652 175458 184986 196496 178956 159582 185224 165454 153470 136972 107785
11817A07785J4070k69l4249k5125m242K3072J3209j2770j5136l11J9037r584L66
$$ 107785 121855 121586 87337 62212 57970 81042 94251 81481 66345 66034 85071 75487 75853
11804G5853j1603j2840N3486r329j2857L1696k725p953j4344M316K661P788k610
$$ 75853 64250 51410 104896 95567 82710 114406 111681 103728 89384 93700 96361 104149 101539
11791A01539J3709r748k0733j5405K742Q580n677K5438J8582l531j5322k4689
$$ 101539 115248 105500 84767 69362 72104 80684 75007 100445 119027 115496 100174 75485
11779G5485k3496O482K1541J2455k0672k9504q543J6559n720l27q172J5252l443
$$ 75485 51989 58471 80012 92467 71795 42291 33748 50307 44587 44260 36088 51340 47897
11766D7897K0748J0400j8259j7640j7793K962r530J1191L1515J2499o509j4430
$$ 47897 68645 79045 60786 43146 25353 28315 18785 29976 61491 73990 67481 53051
11754E3051j8706k7110L0299L0648M71r426m2736l1223K3221M327j7268l8976
$$ 53051 34345 7235 37534 68182 68653 59227 16491 -14732 8489 12816 -4452 -43428
11742d3428J0678L5178j6413J3007J6715j652J9830J6061L955m172k2208j0405
$$ -43428 -32750 2428 -13985 -978 15737 14085 33915 49976 53931 49759 27551 17146
11730A7146j1583k7683o982J1344M142J5747K0620K7936J5807J6227l3379j4883
$$ 17146 5563 -22120 -29102 -17758 -13616 2131 22751 50687 66494 82721 49342 34459
11718C4459K7572q234M043J8108J442j7190o726j7730R134l54j4519j6652J356
$$ 34459 62031 53797 57840 75948 77390 60200 53474 35744 44878 44524 30005 13353 14709
11705A4709m464j5697Q026j4202Q010J2533P697L1438j4070l2727J0894L6831
$$ 14709 10245 -5452 2574 -11628 -3618 8915 16612 48050 33980 1253 12147 48978
11693D8978J2993q415l2076k1004m862K1522K2049l425j34l610o517P946j0983
$$ 48978 61971 53556 21480 476 -4386 17136 39185 35760 35626 32016 25499 33445 22462
11680B2462K4344q413k2094j4075M492N93K89K4805J197j3898j1671J6162p395
$$ 22462 46806 38393 16299 2224 6716 7309 7598 32403 33600 19702 8031 24193 16798
11667A6798J795j000j460K3768P570O186j9061k6897j9756J1571K3453K1647j351
$$ 16798 18593 17593 16133 39901 47471 53657 34596 7699 -12057 -486 22967 44614 43263
11654D3263k0106Q496k6155q233l1601J5060M3461K5144O03L83R015k0249k2294
$$ 43263 23157 31653 5498 -2735 -34336 -19276 24185 49329 49932 50315 59330 39081 16787
11641A6787o508K0747J6726l72q215l5198l2535k8578n804L7232K0465K558k0711
$$ 16787 10279 31026 47752 47380 39165 3967 -28568 -57146 -62950 -25718 -5253 -2695 -23406
11628b3406J6326k0032k832k0379J254L2565K6543j4027R34J1693K561J0092L2593
$$ -23406 -7080 -27112 -29944 -50323 -49069 -16504 10039 -3988 -3054 8639 11200 21292 53885
11615E3885o592k4170m57Q58j7806k518m73R115k1379O879K1522j0293j2775N712
$$ 53885 47293 23123 22666 23524 5718 3200 2727 11842 -9537 -2658 18864 8571 -4204 1508
11601A508j3735q529J4145J9783M6437L0012j0361m219l6789o096J0517L085j0138
$$ 1508 -12227 -20756 -6611 13172 59609 89621 79260 75041 38252 32156 42673 45758 35620
11588C5620j7456R178N381J7555N089l0900j6966m21P511L949p514j6992J1144
$$ 35620 18164 27342 32723 50278 55367 24467 7501 7080 14591 18540 11026 -5966 5178
11575E178K4381o095j5764j148O928K2785M087j6970j8214j7018L1116j5947R651
$$ 5178 29559 23464 7700 6552 13480 36265 40352 23382 5168 -11850 19266 3319 12970
11562A2970O42Q684Q47j6374m231j403n951n466M92J1477n062J5218j3127o033
$$ 12970 13612 22296 23143 6769 2538 1135 -4816 -10282 -9790 1687 -3375 11843 -1284 -7317
11548g317J1755m805J8156k4850l0322J4839L2033J4242j5538j6710L1031Q121
$$ -7317 4438 -367 17789 -7061 -37383 -22544 9489 23731 8193 -8517 22514 30635
11536C0635l5929j5038J6626K3792N159L201n857l5020n374J5617K7322k7125
$$ 30635 -5294 -20332 -3706 20086 25245 28446 22589 -12431 -17805 -2188 25134 -1991
11524a991j7890R129K2627L9562J60k7490j846N34k6919n570k0244J0759J1499
$$ -1991 -19881 -10752 11875 51437 51597 24107 22261 22795 -4124 -9694 -29938 -19179 -7680
11511g680J4418J3327q03k9359R01o924k1956J2375N1389P167k594j3403l0019
$$ -7680 6738 20065 19262 -10097 -9196 -16120 -38076 -25701 25688 32855 30261 16858 -13161
11498a3161k6476K253J8575l210n160R221O446K820o089K8499O534k3106n651
$$ -13161 -39637 -37384 -18809 -22019 -27179 -17958 -11512 -8692 -14781 13718 20252 -2854 -8505
11485h505K9387P697l0835l778J4222K351r483l613L7136J2635k5496K6111k503
$$ -8505 20882 28579 -2256 -6034 8188 10539 1056 -2557 34579 47214 21718 47829 45326
11472D5326j4772j6493j5420J4048J9714J0647R510J9326J7889j8489k2534k6396
$$ 45326 30554 14061 -1359 12689 32403 43050 52560 71886 89775 71286 48752 22356
11460B2356O77k362j2180j412O498m099K8638K5481m908J0594j1072l229J010
$$ 22356 23033 20671 8491 7079 13577 9478 38116 63597 58689 69283 58211 54982 55992
11447E5992k457j2924Q795q004q081j4647M40R868Q896J0132j2795n001L3998
$$ 55992 53535 40611 49406 41402 33321 18674 19114 28982 37878 48010 35215 30214 64212
11434F4212N054k787j5153O967l752Q371n779k8978k9883m826k689J3908k770
$$ 64212 69266 66479 51326 58293 54541 62912 57133 28155 -1728 -6554 -9243 4665 1895
11421A895j6502j0657L8601M9789q803k4864K2915L691k1822j4313k1995M732
$$ 1895 -14607 -25264 13337 63126 54323 29459 52374 56065 34243 19930 -2065 2667
11409B667J1301M3240k750j8359Q621q990k7295J9714P394n811J4447q035j7138
$$ 2667 13968 57208 54458 36099 44720 35730 8435 28149 35543 29732 44179 36144 19006
11396A9006J932R75R857L922J0409j7399M025o589k2429j8574P173K0918O317
$$ 19006 20938 21913 31770 35692 46101 28702 32727 26138 3709 -14865 -7692 13226 19543
11383A9543j0313q529J2002Q69n864J0729l648K2499J3117j948m764R161Q524
$$ 19543 9230 701 12703 13572 7708 18437 14789 37288 50405 48457 43693 52854 61378
11370F1378J9867o715k2491j2972o566R862K1730l0199L3974N7879l4358n1301
$$ 61378 81245 74530 52039 39067 32501 42363 64093 33894 67868 125747 91389 40088
11358D0088L556J0210l176O166p650q808j149K237O099j3619K0487J9792O054
$$ 40088 43644 53854 50678 56844 49194 40386 39237 41474 47573 33954 54441 74233 80287
11345H0287n6034j9791K9164K2291j6170j6019j0833K6399K370l4247j7985L1783
$$ 80287 24253 4462 33626 55917 39747 23728 12895 39294 41664 7417 -10568 21215
11333B1215K5256O035J351j4445J277j1935j323J5320J3821j9039J494K4033K1340
$$ 21215 46471 52506 53857 39412 40689 28754 27431 42751 56572 37533 39027 63060 84400
11320H4400O534J6219L620j3711j6664n6717k5392J471J4368p695P607J4217P439
$$ 84400 90934 107153 110773 97062 80398 23681 -1711 -240 14128 6433 14040 28257 35696
11307C5696N219M3272q65j5206k2403l894k528j340J3989N969J6286M826j0341
$$ 35696 40915 84187 83322 68116 45713 41819 39291 37951 51940 57909 74195 79021 68680
11294F8680k2277r155K783K7618J2008k6938J449K4658j405p331k9539j8123r032
$$ 68680 46403 37248 40031 67649 79657 52719 54168 78826 77421 70090 40551 22428 13396
11281A3396J2703M069L0335j7556J3209q83q490n965r023J3311N927J7055Q181
$$ 13396 26099 30168 60503 42947 56156 55273 46783 40818 31795 45106 51033 68088 76269
11268G6269k973q289j7085J1782J7790K3528j262j2545j8799j445R321K4262m0753
$$ 76269 73296 65007 47922 59704 77494 101022 99760 87215 68416 66971 76292 100554 59801
11255E9801j7908O300J3187q992r706Q475P531J0922j4995k3637j3316K2576J5933
$$ 59801 41893 48193 61380 52388 42682 51157 58688 69610 54615 30978 17662 40238 56171
11242E6171L453J1390J756K5565l680l9319l305J2701K264j2808l0176J3986L9344
$$ 56171 59624 71014 72770 98335 94655 55336 52031 64732 66996 54188 24012 37998 77342
11229G7342l0095l25K1870j3510r965j2768J2919K5088K427j6287j1581L0491
$$ 77342 47247 46922 68792 55282 45317 32549 45468 70556 72983 56696 45115 75606
11217G5606J2727M718L481K426j9017j6418j13K6284m401j0721q999q537L6270
$$ 75606 88333 93051 96532 98958 79941 63523 63410 89694 85293 74572 65573 57036 93306
11204I3306j3474k6293j1819Q843P020K4624L8710J4936k1856r67n211M601R414
$$ 93306 79832 53539 41720 50563 57583 82207 120917 135853 113997 113030 107819 112420 121834
11191A21834l221k0721j2872n643J4194L5597j4742o296J614j1302k8190m357
$$ 121834 118613 97892 85020 79377 93571 129168 114426 108130 109744 98442 70252 65895
11179F5895L0915J6640k2615l1474O587l343j6211J8274M705m2022j8448K7804
$$ 65895 96810 113450 90835 59361 65948 62605 46394 64668 69373 27351 8903 36707
11167C6707J1335K8317M3171K795j7704k7803M271J590j0924k6734k6795M581
$$ 36707 48042 76359 119530 122325 104621 76818 81089 82679 71755 45021 18226 22807
11155B2807J4730Q594n986K9648M0834k303j5165J3199K643J3613L3792k2409
$$ 22807 37537 46131 40145 69793 110627 108324 93159 106358 109001 122614 156406 133997
11143A33997j7322k0300j6334p357K9981p632k4502J465K1817j855M367q323M726
$$ 133997 116675 96375 80041 72684 102665 95033 70531 71996 93813 91958 96325 88002 92728
11130I2728J4562J1511j4335j4669l1719J3679L354J6590K6147J2534R220o76
$$ 92728 107290 118801 104466 89797 58078 71757 75111 91701 117848 130382 139602 138926
11118A38926k8104k5396N62K0151L774K5866O988j2993j5284j1234o489J8391
$$ 138926 110822 85426 85988 106139 109913 135779 142767 129774 114490 103256 96767 115158
11106A15158j6639j1157K2878K3294L027l6229o318K1544o458q834j110l4196
$$ 115158 98519 87362 110240 133534 136561 100332 94014 115558 109100 100266 99156 64960
11094F4960j1575J7881k6311N308J4685L2044J7340j0656r217q508J0733k2885
$$ 64960 53385 71266 44955 50263 64948 96992 114332 103676 94459 85951 96684 73799
11082G3799M783L6956K339j3360k3982n036P075K994l586J2094R764J3161P631
$$ 73799 78582 115538 117877 104517 80535 75499 82574 85568 81982 94076 103840 117001 124632
11069A24632Q473l4493l21Q249k1483j0696O823Q477K9091K2405R998j3346j7378
$$ 124632 133105 98612 98291 106540 85057 74361 81184 89661 118752 141157 151155 137809 120431
11056A20431p614l34q920m693J9514j1462N540K8951j2498p586k7836n589K0257
$$ 120431 112817 112483 103563 98870 118384 106922 112462 141413 128915 121329 93493 87904 108161
11043A08161K4139r87n547n790j0367J0200K741Q769J6933j4664j7003L8096K047
$$ 108161 132300 131313 125766 119976 109609 119809 122550 131319 148252 133588 116585 154681 156728
11030A56728k313o501J9372R142P651j0236k3009J029k115o467K22K4159M925
$$ 156728 154415 147914 167286 176428 184079 173843 150834 151863 149748 143281 143503 167662 172587
11017A72587L9952N9923Q3784P6612L8559L0487L3931k575J6316j0551n7914o1787
$$ 172587 212539 272462 356246 432858 471417 501904 535835 533260 549576 539025 481111 419324
11005D19324J3272K8823L0181J4861j3836K1592K4255J3137j5392J574J7718o37
$$ 419324 432596 461419 491600 506461 492625 514217 538472 551609 536217 537791 555509 554872
10993E54872l5135R172L0250K6508j8964l629N5331O4576K5495r454m2976j3877
$$ 554872 519737 528909 559159 585667 566703 563074 618405 682981 708476 699022 656046 642169
10981F42169n897P266R812J0067M4664O6307P1750P0212R3924J15435J08496O9056
$$ 642169 636272 643538 653350 663417 708081 774388 846138 916350 1010274 1125709 1234205 1303261
10969A303261J6279k422o1753o8256p4815m3638m5327j1780l4937l2225J4228
$$ 1303261 1319540 1317118 1255365 1187109 1112294 1068656 1023329 1011549 976612 944387 958615
10958I58615j8990p337k954K3385p299k2265n1855j9104L580k8960n7034k4996
$$ 958615 939625 932288 929334 952719 945420 923155 871300 852196 855776 826816 769782 744786
10946G44786R350K789o932k4775l22n316j6645J9247K9356o737l992l1879N90
$$ 744786 754136 756925 749993 725218 724896 719580 702935 722182 751538 744801 740809 708930 709520
10933G09520m725j8479L250L6279M5445K9644O224l7891m3080n1944k7815l7061
$$ 709520 704795 686316 689566 725845 771290 800934 807158 769267 726187 674243 646428 609367
10921F09367l4928o2222m2817k8035j0563n535J0894j8376n3350L531o596p739
$$ 609367 574439 512217 469400 441365 430802 425267 436161 417785 364435 367966 361370 353631
10909C53631k6456j4975J4263K1374j0213l780j180n438K8420k1218j4458j6149
$$ 353631 327175 312200 326463 347837 337624 333844 332664 327226 355646 334428 319970 303821
10897C03821k901j6530n33o470k6382J2469L1158q122k2694J0139R345J4325j2911
$$ 303821 300920 284390 283857 277387 251005 263474 294632 286510 263816 273955 283300 297625 284714
10884B84714q562r63j8450J465P159j1167l6736k5597j6387J2899J8588N144j6770
$$ 284714 276152 275189 256739 258204 265363 254196 217460 191863 175476 188375 206963 212107 195337
10871A95337k2442j0049k046N790r908J9329J8615M0554j994o806J4158l448o3228
$$ 195337 172895 162846 160800 166590 156682 176011 194626 235180 233186 226380 240538 237090 173862
10858A73862r395K1889j1178l313R406l008j925J3052k071Q721J0531j5371K5948
$$ 173862 164467 186356 175178 171865 181271 178263 176338 189390 187319 196040 206571 191200 217148
10845B17148L3443J9323r798r125K8177p944j361j6947p310j39O760K5411L852
$$ 217148 250591 269914 260116 250991 279168 271224 269863 252916 245606 245467 252227 277638 281490
10832B81490k8664l4458Q629Q950J4322O950k0568N8355R810j7007j2291r207
$$ 281490 252826 218368 226997 235947 250269 257219 236651 295006 304816 287809 275518 266311
10820B66311k621j387J5537N009J0619K0520n751m866l0459R229n188Q186o392
$$ 266311 263690 262303 277840 282849 293468 313988 308237 303371 272912 282141 276953 285139 278747
10807B78747P774J2421M834j2934N485L9433p148k1180K3932O0158K4767j6543
$$ 278747 286521 298942 303776 290842 296327 335760 328612 307432 331364 391522 416289 399746
10795C99746q526j2474n75j6835j1075J7029K6440k3986j9768o02o809j3491j2639
$$ 399746 391220 378746 378171 361336 350261 367290 393730 369744 349976 349374 342565 329074 316435
10782C16435J8957J7873Q473K799p98K1758J2368Q437j2261m519j409k9902k7790
$$ 316435 335392 353265 361738 364537 363739 385497 397865 406302 394041 389522 388113 358211 330421
10769C30421N621K1234J3847N426L1894J0318K7361K2342p179K2185K2917O98
$$ 330421 336042 357276 371123 376549 408443 418761 446122 468464 461285 483470 506387 507085
10757E07085j1140L589k544j475l74l3071p25N684j8127j8257l3505j5546K9736
$$ 507085 495945 499534 496990 495515 495141 462070 461345 467029 448902 430645 397140 381594 411330
10744D11330J6509J3076o772p79J0856m206J9557J6070J0545J1660K8110k421
$$ 411330 427839 440915 434143 433364 444220 440014 459571 475641 486186 497846 525956 523535
10732E23535j6337n802M2930L0669J1018j207m823j674r980K4515M7652R536N406
$$ 523535 507198 501396 544326 574995 586013 584806 579983 578309 568329 592844 640496 650032 655438
10719F55438K8233K3505p51k7076l5708J0840k150l3426k9504J3647L6475K3762
$$ 655438 683671 707176 706425 679349 643641 654481 652331 618905 589401 603048 639523 663285
10707F63285j9481l157K4772J4074m798O763l240K8966L0134M456l02J8480L5694
$$ 663285 643804 640647 665419 679493 674695 681458 678218 707184 737318 741774 741472 759952 795646
10694G95646L5704J4874R595L7177O0625Q0954P3971K254j5488j3092O261K9870
$$ 795646 831350 846224 855819 892996 953621 1034575 1108546 1110800 1095312 1082220 1088481 1118351
10682A118351M0429L1479N0736N5257J8057M6571J01151J33230J17336J60304
$$ 1118351 1158780 1190259 1240995 1296252 1314309 1360880 1462031 1595261 1712597 1872901
10672A872901J71901J18718L9201k8531l7876o9309p0985n0819L687M6433M8439
$$ 1872901 2044802 2163520 2202721 2174190 2136314 2067005 1996020 1945201 1948888 1995321 2043760
10661B043760M4531L0849j7046j5701k1286K2141N2471P0748R0435J01199N2516
$$ 2043760 2088291 2119140 2102094 2086393 2065107 2087248 2139719 2210467 2300902 2402101 2454617
10650B454617J2641M2544O3393K3407J1586O540k4436l3682r048K034N5031L4929
$$ 2454617 2467258 2509802 2573195 2596602 2608188 2614728 2590292 2556610 2547562 2549596 2604627 2639556
10638B639556J12305J28960J15888J31440J89599K21276K56965L23008L33690
$$ 2639556 2751861 2880821 2996709 3128149 3317748 3539024 3795989 4118997 4452687
10629D452687K87469K10653J43987J36850J41980J96296J92413J77550K66814
$$ 4452687 4740156 4950809 5094796 5231646 5373626 5569922 5762335 5939885 6206699
10620F206699M28067O68004Q13244R13198Q72121P30989N91098N23096N00821
$$ 6206699 6634766 7302770 8116014 9029212 9901333 10632322 11223420 11746516 12247337
10611A2247337M43210L79299L76321L74367L49806K45912P5627j88263m20851
$$ 12247337 12690547 13069846 13446167 13820534 14170340 14416252 14491879 14303616 13882765
10602A3882765m32955k57534R288K86005N62170Q69700J160155J530613K061823
$$ 13882765 13449810 13192276 13201564 13487569 14049739 14919439 16079594 17610207 19672030
10593A9672030K942204M339201O418606R180727J1609698J2019725R348267M342444
$$ 19672030 22614234 26953435 33372041 42552768 54162466 66182191 75530458 79872902
10585G9872902r55168m253146m535526k450122N52232L057892M250890L880117
$$ 79872902 78917734 74664588 70129062 67678940 68231172 71289064 75539954 79420071
10577G9420071K250643J36292j316727j295656N944J577229K045332J220762K3880
$$ 79420071 81670714 81807006 80490279 79194623 79200567 80777796 82823128 84043890 84067770
10568H4067770m39162L86878K169627M153086N710021O351186N653290L729354
$$ 84067770 83628608 84015486 86185113 90338199 96048220 102399406 108052696 111782050
10560A11782050J334418m65887r04349J04442J908250L563697M586421M975768
$$ 111782050 113116468 112650581 111746232 111850674 113758924 117322621 121909042 126884810
10552A26884810M630565L872009L717821N074913Q397666J3123433J7642171J8937968
$$ 126884810 131515375 135387384 139105205 144180118 152577784 165701217 183343388 202281356
10544B02281356J3957448L873983o657695j3495719j4361520j1024660p098611
$$ 202281356 216238804 220112787 213455092 199959373 185597853 174573193 167474582
10537A67474582m377046k726173j830667j673251k024327k174764j561440l23743
$$ 167474582 163097536 160371363 158540696 156867445 154843118 152668354 151106914 150783171
10529A50783171M23802m70992k636138m863647o156906o164132n586199m687632
$$ 150783171 151206973 150735981 148099843 143236196 137079290 130915158 125328959 120641327
10521A20641327l427356j762831k27978L62095m27730j740364k369451j569874
$$ 120641327 117213971 115451140 115223162 115585257 115157527 113417163 111047712 109477838
10513A09477838L79030K182776K833482K055624P2887k245380l630973l346520
$$ 109477838 109856868 112039644 114873126 116928750 117001637 114756257 111125284 107778764
10505A07778764r79329L044796O945020P889978M098729l036314j0156801j4146821
$$ 107778764 106799435 109844231 116789251 124679229 128777958 125741644 115584843 101438022
10497A01438022j3948654j1210371q144172n845107m326394l347194k670932k082071
$$ 101438022 87489368 76278997 68134825 62289718 57963324 54616130 51945198 49863127
10489D9863127j658110j257080q83562n40991k40467j35961k47420m22204n89079
$$ 49863127 48205017 46947937 46064375 45523384 45282917 45146956 44899536 44477332 43888253
10480D3888253o32252o47182p04564q02794r41158j062799j038165j008134j068196
$$ 43888253 43256001 42608819 41904255 41101461 40160303 39097504 38059339 37051205 35983009
10471C5983009j206213j327943j370577j295974j122487r95901r33368q17142
$$ 35983009 34776796 33448853 32078276 30782302 29659815 28663914 27730546 26913404
10463B6913404o86528n57990n21233n42114o19375p29972p87423p71387p33666
$$ 26913404 26226876 25668886 25147653 24605539 23986164 23256192 22468769 21697382 20963716
10454B0963716o67658n77330n39250n13141m97709m41557l96365l73084l64374
$$ 20963716 20296058 19718728 19179478 18666337 18168628 17727071 17330706 16957622 16593248
10445A6593248l20352k73646k35482k32769k51358k43577k59248k52199k02324
$$ 16593248 16272896 15999250 15763768 15530999 15279641 15036064 14776816 14524617 14322293
10436A4322293k21129k70167l02595l26623k82218k19705j86085j74715j82946
$$ 14322293 14101164 13830997 13528402 13201779 12919561 12699856 12513771 12339056 12156110
10427A2156110k15386k59336k26998j60416j52384p7227k2931l3703m5007q6906
$$ 12156110 11940724 11681388 11454390 11293974 11141590 11064363 11041432 11007729 10962722 10875816
10417A0875816j63563k31002l17249l85844m15564l66520l02255k56234j94677
$$ 10875816 10712253 10481251 10164002 9778158 9362594 8996074 8693819 8437585 8242908
10408H242908j86508j90823k12901j86844j66169j46595j22250j16773j05347
$$ 8242908 8056400 7865577 7652676 7465832 7299663 7153068 7030818 6914045 6808698
10399F808698r9133j41298j46862j63244j78752j59267j50394j38334j30668j11326
$$ 6808698 6709565 6568267 6421405 6258161 6079409 5920142 5769748 5631414 5500746 5389420
10389E389420j00830j18765j23559q4687p9718o5034p3540r0954j00694j05475
$$ 5389420 5288590 5169825 5046266 4961579 4881861 4816827 4743287 4652333 4551639 4446164
10379D446164n8895q4680r4668n5842n1006j04147r8846o2409j09707r7103q2337
$$ 4446164 4387269 4302589 4207921 4152079 4101073 3996926 3898080 3835671 3725964 3628861 3546524
10368C546524p8582n9741j8592p8981j05457p1525q4211l9991l5020k8323m1223
$$ 3546524 3467942 3408201 3389609 3310628 3205171 3133646 3049435 3009444 2974424 2946101 2904878
10357B904878p4404n4810l2015m0858l2824m8300m5668k8536j3201n8296o5360
$$ 2904878 2830474 2775664 2743649 2702791 2669967 2621667 2575999 2547463 2534262 2475966 2410606
10346B410606l9761l4301m0779l4471m3703l0100j4485l4768l2018L60m9452m5257
$$ 2410606 2370845 2336544 2295765 2261294 2217591 2187491 2173006 2138238 2106220 2106580 2057128 2011871
10334B011871o3154n4213j0163K663L799l1739n5755k9199J516j5716k7280j8648
$$ 2011871 1948717 1894504 1884341 1887004 1890803 1859064 1803309 1774110 1775626 1759910 1732630 1713982
10322A713982o1018p3645o336J6798J7423m199l4451j9302R378M8095L0818K0581
$$ 1713982 1652964 1579319 1572983 1589781 1607204 1603005 1568554 1549252 1558630 1606725 1637543 1658124
10310A658124p388r248K3159J3983L5334M2488P0477N8703R7797J71528K80661
$$ 1658124 1650736 1641488 1664647 1678630 1713964 1756452 1826929 1885632 1983429 2154957 2435618
10299B435618M30640N37583O77791Q22792Q92373Q71263Q66701P02220M83479
$$ 2435618 2866258 3403841 4081632 4904424 5796797 6668060 7534761 8236981 8720460
10290H720460K20822o1070l46957o25063p88735q44990q11538p33629o22197n37497
$$ 8720460 8941282 8880212 8533255 7908192 7119457 6274467 5462929 4729300 4107103 3569606
10280C569606m17499k89085k00829j54169r4518r9203r9512j00360m5805m8241
$$ 3569606 3152107 2863022 2662193 2508024 2413506 2314303 2214791 2114431 2068626 2020385
10270B020385l6678k6881m8725r1294k9042m0800n6935o5983m4769l6578l7183
$$ 2020385 1983707 1956826 1908101 1816807 1787765 1746965 1690030 1624047 1579278 1542700 1505517
10259A505517m7076l8786n8247o2271l7855L4873Q954l7971l4831l6470m668j1560
$$ 1505517 1458441 1419655 1361408 1299137 1261282 1296155 1305109 1267138 1232307 1195837 1191169 1179609
10247A179609k8780p955l6003k2472j7482j2804j8808j7681q519J430p968o83
$$ 1179609 1150829 1142874 1106871 1084399 1066917 1054113 1035305 1017624 1009105 1010535 1002567 1001884
10235A001884l1297j2459K582l718l4092m4556m0588j5033Q1j3808k3020K301
$$ 1001884 970587 958128 960710 956992 922900 878344 837756 822723 822804 808996 785976 788277
10223G88277J8387Q653j4951n0218l0247k3026k025J1334o547R912J2891K370
$$ 788277 806664 815317 800366 750148 719901 696875 694850 706184 699637 709549 722440 724810
10211G24810j3310p847k4651l0693K1173J2851k5057J269K72l424l73K6495L9712
$$ 724810 711500 703653 679002 648309 669482 682333 657276 658545 658817 655393 655020 681515 721227
10198G21227P7376J04950J70973K09140K20062K18225K21818K09231J67419R3255
$$ 721227 798603 903553 1074526 1283666 1503728 1721953 1943771 2153002 2320421 2413676
10188B413676j3171j39461j63775j96247j97058k32628k35246j58605j26417q1550
$$ 2413676 2400505 2261044 2097269 1901022 1703964 1471336 1236090 1077485 951068 869518
10178H69518l0161j8025k0474j3974k0711o698k1415l4752j1956k894J9327k128
$$ 869518 839357 821332 800858 786884 766173 759475 738060 703308 691352 688458 707785 705657
10166G05657k5810j1396N21K2540J3248k4994Q473J2474K3737K4211L1634K1290
$$ 705657 679847 668451 668972 691512 704760 679766 688239 700713 724450 748661 780295 801585
10154H01585N622K5566k237P900K7694j1454q734N880K427l6380m9129k6899K1804
$$ 801585 807207 832773 830536 838436 866130 854676 845942 851822 854249 817869 768740 741841 763645
10141G63645j2970k1792k4863J5665M7168K4858J8629J1642o557R726R443K8896
$$ 763645 750675 728883 704020 719685 766853 791711 810340 821982 815425 825151 834594 863490
10129H63490L8059K4536L2327L8035j754l7416j7689j7315j2014J7022L0970J3814
$$ 863490 901549 926085 958412 996447 994693 957277 939588 922273 910259 927281 958251 972065
10117I72065K6358Q2641J02874J05217R6689N7451M8543l576j4792n0520p9703
$$ 972065 998423 1081064 1183938 1289155 1385844 1443295 1491838 1488262 1473470 1422950 1343247
10106A343247o8655o4166r2065p2345p0780k2119k5794L105n516o321K7620J0612
$$ 1343247 1274592 1210426 1118361 1046016 975236 953117 927323 930428 924912 918591 946211 956823
10094I56823j849j0599J6066j6767o772k770k1212j8146m771k1022l0571L38K4031
$$ 956823 954974 944375 960441 943674 936902 934132 912920 894774 890003 868981 838410 838748 862779
10081H62779j0347J6786j3524l1168k041L9341L3598r091j7338J1511L4520L9378
$$ 862779 852432 869218 855694 824526 822485 861826 895424 886333 868995 880506 915026 954404
10069I54404J0737j3891m5016n5559p2300n1205o1644m7584k0559l2603m652j563
$$ 954404 965141 951250 906234 850675 778375 727170 665526 617942 597383 564780 560128 558565
10057E58565j7513k2163J1631o104K269J2421L071J1652p726j2327M849j0100
$$ 558565 541052 518889 530520 524416 526685 539106 542177 553829 546103 533776 538625 528525
10045E28525m5079m360M947K3967m38l8417j1569J791k7647j3136J2756J0403
$$ 528525 483446 479086 484033 508000 507562 469145 457576 459367 431720 418584 431340 441743
10033D41743K1676M6568J763q765K245J9585L9431R4280K62978L65707K74281
$$ 441743 463419 509987 511750 502985 505230 524815 564246 658526 921504 1287211 1561492
10022A561492O3082j40326l28342l13108j71816p3817m6569m8218l8881j1866
$$ 1561492 1624574 1484248 1155906 842798 670982 597165 550596 502378 463497 451631
10012D51631l939j4615j5417r475j267j4519J0243L2198r283R349K2187o053l0494
$$ 451631 447692 433077 417660 408185 406918 392399 402642 434840 425557 434906 457093 451040 420546
9999D20546j2699n1015k1722j0273J5172Q995n772Q295r111q868l4040n601J8336
$$ 420546 407847 356832 335110 324837 340009 349004 343232 351527 342416 333548 299508 293907 312243
9986C12243J6006j6179K864L8476J2194j0213j2169K393j5392l258k7519Q388
$$ 312243 328249 312070 314934 353410 365604 355391 343222 345615 330223 326965 299446 307834
9974C07834R757l779k8095K582J0602m008N093K2080J3275n15j6402K0011j2659
$$ 307834 317591 313812 285717 288299 298901 294893 299986 322066 335341 334826 318424 338435 325776
9961C25776l9441k6480O242K3211J9107l5130Q782j2479j6532J4414R980M05k8048
$$ 325776 286335 259855 266097 289308 308415 273285 282067 269588 253056 267470 277450 277855 249807
9948B49807j4481M036J4553K590k0840J8555K190J5578O762j8342K0287L8820
$$ 249807 235326 239362 253915 256505 235665 254220 256410 271988 278750 260408 280695 319515
9936C19515L747p43J2405p83j6086j5556q218L1697L177j1451r945J7921j379
$$ 319515 323262 322519 334924 334141 318055 302499 294281 325978 329155 317704 307759 325680 324301
9923C24301J227K2358L8623Q607K6023L6423N2909P4017P3921P0602N7408M2143
$$ 324301 325528 347886 386509 395116 421139 457562 510471 584488 658409 729011 786419 828562
9911H28562L9166J1708K0620O3529O6539J49898K40678L72222O05560Q79940J027844
$$ 828562 867728 879436 900056 963585 1030124 1180022 1420700 1792922 2398482 3278422 4306266
9900D306266P33869J89964k85947m23486q4463N26249J297252J874067J513447
$$ 4306266 5040135 5230099 4944152 4520666 4436203 4962452 6259704 8133771 9647218
9891I647218L22692q55899j634604j447181p02788m8121L67088M30253P9123m14043
$$ 9647218 9969910 9114011 7479407 6032226 5329438 5281317 5648405 6078658 6157781 5743738
9881E743738q13157r01573o76883m25484k68234j68597j44702q9521q6269o5432
$$ 5743738 4930581 4029008 3352125 2926641 2658407 2489810 2345108 2255587 2169318 2103886
9871B103886n1455o8542p8568k5307q395j379q251m7052m9135p2103j09308j06469
$$ 2103886 2052431 1983889 1905321 1880014 1871619 1870240 1861989 1814937 1765802 1693699 1584391 1477922
9859A477922r6876q2346p7077l9135m5473j7256j6671k6889R694r422j6207K4571
$$ 1477922 1381046 1298700 1221623 1182488 1137015 1119759 1103088 1076199 1085893 1076471 1060264 1084835
9847A084835N8533M7046o810l7550l3677l6612l1205k362j1394l29J9957J2922
$$ 1084835 1143368 1190414 1183604 1146054 1112377 1075765 1044560 1042198 1030804 1030475 1050432 1063354
9835A063354K7972O1496L3434N9340N9965Q8921J40031K32183L89098N36887N11384
$$ 1063354 1091326 1152822 1186256 1245596 1305561 1394482 1534513 1766696 2155794 2692681 3204065
9824C204065K77848j03463m26365n12884l95028j84980r4248n9386p1074o2729
$$ 3204065 3481913 3378450 2952085 2439201 2044173 1859193 1764945 1705559 1634485 1571756
9814A571756r6704j04420q7855p3708k4975R327j7238j4467q010j2786k2548K5954
$$ 1571756 1475052 1370632 1282777 1209069 1184094 1193421 1176183 1161716 1153706 1140920 1118372 1144326
9802A144326K5118J2025l3191o6807l4864k2346m6770k1784j2435r440p777m730
$$ 1144326 1169444 1181469 1148278 1081471 1046607 1024261 977491 955707 943272 933832 926055 921325
9790I21325O168Q706M430J9726k1996l1440k9321J9422q367j4282k2765k9805
$$ 921325 927493 936199 940629 960355 938359 906919 877598 897020 888653 874371 851606 821801
9778H21801K8559M2726L5202K5522M0806O9731Q5715Q9696N7563r696n5829o3661
$$ 821801 850360 893086 928288 953810 994616 1064347 1150062 1239758 1297321 1287625 1231796 1168135
9766A168135p7116o5508n5968m6613j6310l8141l1148J177k0092j5065l2756p10
$$ 1168135 1091019 1025511 969543 922930 906620 868479 837331 838508 818416 803351 770595 769885
9754G69885j174l9335Q859k6491o0187j9956k3566j2519O589k5833m259J4014
$$ 769885 768711 729376 738235 711744 651557 631601 608035 595516 602105 576272 572013 586027
9742E86027J5433j8296j7970J2881k1375l1781q194J927P561Q625J1694K1564
$$ 586027 601460 583164 565194 578075 556700 524919 516725 518652 526213 534838 546532 568096
9730E68096L5831L5530L8222M7347L4626L0868J1837k1468m7989q0996o1820k6477
$$ 568096 603927 639457 677679 725026 759652 790520 802357 780889 732900 651904 590084 563607
9718E63607j3603k1872Q415J6878p644l4155n53J0428J3126k0248j9955K6395
$$ 563607 550004 528132 536547 553425 545781 511626 511073 521501 534627 514379 494424 520819
9706E20819L840N956J0222J6524j2919j2386k4614m676P828q886j0421J0985j7426
$$ 520819 524659 530615 540837 557361 544442 532056 507442 502766 510594 501708 491287 502272 484846
9693D84846J5036J063n634p97j8790J044p495P757K9295J0417J6684J5167J6990
$$ 484846 499882 500945 495311 494514 475724 476768 469273 477030 506325 516742 533426 548593 565583
9680E65583Q605J0845K3103n464j2613l951J4223R569K7442K303L3714R198K6964
$$ 565583 574188 585033 608136 602672 590059 586108 600331 609900 637342 639645 673359 682557 709521
9667G09521N4288K9161M2565K5805P6439Q8253R4926Q5526J33248J87031K02282
$$ 709521 763809 792970 835535 861340 937779 1026032 1120958 1206484 1339732 1526763 1729045
9656A729045K82683M79047Q03626J170885J363747J210673J044442J191261J516038
$$ 1729045 2011728 2490775 3294401 4465286 5829033 7039706 8084148 9275409 10791447
9647A0791447J195063K30953o50851j176163j021982q94743j029316j235954j207336
$$ 10791447 11986510 12217463 11566612 10390449 9368467 8473724 7444408 6208454 5001118
9638E001118q65364n44154l87853l20652k21646j81054j29524j11179j16873q3684
$$ 5001118 4135754 3591600 3203747 2883095 2661449 2480395 2350871 2239692 2122819 2039135
9628B039135r9738n7200q2509m3373k0031j7939p687m170m9012m3805k2159r207
$$ 2039135 1939397 1882197 1799688 1756315 1736284 1718345 1710658 1706488 1657476 1613671 1591512 1582305
9616A582305j1797k2235m4316l8265k2049k7726m6830m293r247o996j7376k5172
$$ 1582305 1570508 1548273 1503957 1465692 1443643 1415917 1369087 1364794 1355547 1348551 1331175 1306003
9604A306003q209k510j6681k6516k5654j1100J1161M545J0469p384k0383j2297
$$ 1306003 1297794 1295284 1278603 1252087 1226433 1215333 1226494 1231039 1241508 1234124 1213741 1201444
9592A201444l1908j4972K7771J4053N870o907q385j9487k20J9217K7196L2749
$$ 1201444 1169536 1154564 1182335 1196388 1202258 1195351 1186966 1167479 1167259 1186476 1213672 1246421
9580A246421J4255n704K045j7258k9926k5380K636j2241k8259j5383J1428J3346
$$ 1246421 1260676 1254972 1257017 1239759 1209833 1184453 1187089 1174848 1146589 1131206 1142634 1155980
9568A155980M951j5385o282k014L3751J8354J7633L0415K9170J5022Q64J9262
$$ 1155980 1160931 1145546 1139264 1137250 1171001 1189355 1206988 1237403 1266573 1281595 1282459 1301721
9556A301721R899N8107J8966j60J2622M957j878L478K0243K8928J2315O243K0182
$$ 1301721 1311620 1369727 1388693 1388533 1401155 1406112 1404234 1407712 1427955 1456883 1469198 1475441 1495623
9543A495623N0959P3614P4620J08119J20521J19399Q9625Q1180O8854P6201J28615
$$ 1495623 1546582 1620196 1694816 1802935 1923456 2042855 2132480 2213660 2282514 2358715 2487330
9532B487330J44064J20559J32190J27088J24489J98655K65104L75144L63654K60549
$$ 2487330 2631394 2751953 2884143 3011231 3135720 3334375 3599479 3974623 4338277 4598826
9522D598826J17479p6487j83503k30604k20393j70000j45998j30514o1712l5815
$$ 4598826 4716305 4639818 4456315 4225711 4005318 3835318 3689320 3558806 3497094 3461279
9512C461279O453p556J8688L5112O0802J17643J50997K32272L31837M18885O24530
$$ 3461279 3467732 3460176 3478864 3513976 3574778 3692421 3843418 4075690 4407527 4826412 5450942
9501E450942Q81801J084475J144614J033878P64511L64893k7719l24748m48662
$$ 5450942 6332743 7417218 8561832 9595710 10360221 10725114 10697395 10372647 9923985
9492I923985m91235m89627m73899m00979l85353l17104k31260j50483r7524o2316
$$ 9923985 9432750 8943123 8469224 8068245 7682892 7365788 7134528 6984045 6886521 6824205
9482F824205j6459P7087J74066K41172L17733M09810M79510N38854O56925Q34783
$$ 6824205 6807746 6884833 7058899 7300071 7617804 8027614 8507124 9045978 9702903 10537686
9472A0537686J159934J477190J550296J257956P01212L4476m90435o92863o66939
$$ 10537686 11697620 13174810 14725106 15983062 16684274 16718750 16228315 15535452 14868513
9463A4868513n11620l09762q5461K12383N79693J056996J615255K222325K993348
$$ 14868513 14356893 14047131 13961670 14174053 14753746 15810742 17425997 19648322 22641670
9454B2641670L982677N402093P159871R325728J1733467J2874251J1016183N988474
$$ 22641670 26624347 32026440 39186311 48512039 60245506 73119757 84135940 90124414
9446I0124414l20968n263038p157713o266095m224498k004123J91436K163344
$$ 90124414 89803446 84540408 77382695 71116600 66892102 64887979 65079415 67242759
9438F7242759L360142L460278K932957K766124L341596M611750O196501P679701
$$ 67242759 70602901 74063179 76996136 79762260 83103856 87715606 93912107 101591808
9430A01591808Q740578Q433429O231730K826208l41848k130525k625411k724092
$$ 101591808 110332386 118765815 124997545 127823753 127481905 125351380 122725969 120001877
9422A20001877l083112l599630l650485k774467j000698J174577L011760M020362
$$ 120001877 116918765 113319135 109668650 106894183 105893485 107068062 110079822 114100184
9414A14100184M359037M375119M887507O508205R151993J2816972J8108734K4337716
$$ 114100184 118459221 122834340 127721847 134230052 143382045 156199017 174307751 198645467
9406A98645467K8053392K4113174J1329255n230591j9238039k6016880k5488549
$$ 198645467 226698859 250812033 262141288 256910697 237672658 211655778 186167229
9399A86167229k1137700j5570045r910970n047089j911960j261658k285464l391270
$$ 186167229 165029529 149459484 139548514 134501425 132589465 131327807 129042343 125651073
9391A25651073l452747j836819P29037L029882M276515M714190M836280M983453
$$ 125651073 122198326 120361507 121090544 124120426 128396941 133111131 137947411 142930864
9383A42930864M947359L583142N43612l337798p064787r484357r971263q899839
$$ 142930864 147878223 151461365 152004977 148667179 141602392 132118035 122146772 113246933
9375A13246933o794800m406115k635478j974041k299049k841293k722973j621337
$$ 113246933 106452133 102046018 99410540 97436499 95137450 92296157 89573184 87951847
9367H7951847J13126K205090M394663O266072O660647M288741o19325o135178
$$ 87951847 88064973 90270063 94664726 100930798 107591445 111880186 111260861 105125683
9359A05125683j0038407j1157494r997592p970854o148656m817845l835641l099345
$$ 105125683 95087276 83929782 73932190 65961336 59812680 54994835 51159194 48059849
9351D8059849k482182j918673j417230j036229o75652m18404k38532j12336q5720
$$ 48059849 45577667 43658994 42241764 41205535 40529883 40111479 39872947 39760611 39674891
9342C9674891j72724m92194q67102j297264j609014j646099j505214j272794j105151
$$ 39674891 39502167 39009973 38142871 36845607 35236593 33590494 32085280 30812486 29707335
9333B9707335j003165q98059q68517q13602o78100o07199n46765m68802m11048
$$ 29707335 28704170 27806111 26937594 26123992 25445892 24838693 24291928 23823126 23412078
9324B3412078l63488k82491k12908j82551j29270q7234l9809M6000J42940K28766
$$ 23412078 23048590 22766099 22553191 22370640 22241370 22154136 22114327 22160327 22303267 22532033
9314B2532033J41565j01854m61959q49263j094041j137829j009326q62433o71708
$$ 22532033 22673598 22571744 22109785 21260522 20166481 19028652 18019326 17156893 16485185
9305A6485185n48241m80589m00332l52840l45560k95015k80224l09075k67499
$$ 16485185 15936944 15456355 15056023 14703183 14357623 14062608 13782384 13473309 13205810
9296A3205810k42014k29157j93283j68040j39582q4242r4378m9524k0778K7161
$$ 13205810 12963796 12734639 12541356 12373316 12233734 12149492 12055114 12005590 11984812 12011973
9286A2011973L570j02964j78938k93588l62048l60703l39211k85690k35346k61252
$$ 12011973 12015543 11912579 11733641 11440053 11078005 10717302 10378091 10092401 9857055 9595803
9276I595803k46450k51466k27406j89256j69172j71920j91208k12670k16023j94876
$$ 9595803 9349353 9097887 8870481 8681225 8512053 8340133 8148925 7936255 7720232 7525356
9266G525356j52997j65219j59301j32053j25209j13968j24842j20153j15405q7091
$$ 7525356 7372359 7207140 7047839 6915786 6790577 6676609 6551767 6431614 6316209 6229118
9256F229118j08883j17144r8378j05096j16706j12564r4595p4193r6248q6457
$$ 6229118 6120235 6003091 5904713 5799617 5682911 5570347 5475752 5401559 5305311 5218854
9246E218854p2727p1988o5528q3616q2918r7864n8548n4625n6239q1189r5554
$$ 5218854 5146127 5074139 5008611 4924995 4842077 4744213 4685665 4631040 4574801 4493612 4398058
9235D398058r6791p8562o8251p2076q5557q5456l8402l8401o6105n3766k3366
$$ 4398058 4301267 4222705 4154454 4082378 3996821 3911365 3872963 3834562 3768457 3714691 3691325
9224C691325k0774p1406m3228m3544m1540l5192k5429m2913p1753p6966k0638
$$ 3691325 3670551 3599145 3555917 3512373 3470833 3435641 3410212 3367299 3295546 3218580 3197942
9213C197942k9337m6145l7230m0644j1691j951l9239j6337j7798o5270p7426o0745
$$ 3197942 3168605 3122460 3085230 3044586 3032895 3030944 2991705 2975368 2957570 2892300 2814874 2754129
9201B754129l0099p155J4633k9934j5955j4373k0410l8674l2173k9078r781j4372
$$ 2754129 2724030 2716875 2731508 2701574 2685619 2671246 2650836 2612162 2579989 2550911 2541130 2526758
9189B526758m539R328Q268k6301n197l2900m5750k7260j3735k1791k0922j184
$$ 2526758 2522219 2531547 2539815 2513514 2508317 2475417 2429667 2402407 2388672 2366881 2345959 2344775
9177B344775j8283j6463J484P11m5882l2161l7975l3870k7044J2507L2663J7047
$$ 2344775 2326492 2310029 2311513 2312224 2266342 2234181 2196206 2162336 2135292 2147799 2180462 2197509
9165B197509L066m5698l3726j5401j2971k429J995k730k0310J540J6734K4908
$$ 2197509 2200575 2154877 2121151 2105750 2092779 2090350 2092345 2089615 2069305 2070845 2087579 2112487
9153B112487p106j5390j8351j8254p829j2996m0834L0q10K500J458j0859j1450
$$ 2112487 2105381 2089991 2071640 2053386 2045557 2032561 1991727 1991757 1990947 1993447 1994905 1984046 1972596
9140A972596O929J9344Q435k1100l6144j7896K003J4828K140J7572j775M874n940
$$ 1972596 1979525 1998869 2007304 1986204 1950060 1932164 1934167 1948995 1951135 1968707 1966932 1971806 1965866
9127A965866j1939N973o770L813k7162R545M1991j5727j2592J0624N4Q757p53
$$ 1965866 1953927 1959900 1953130 1956943 1929781 1939326 1981317 1965590 1952998 1963622 1963676 1972433 1971680
9114A971680J3440J0207k2308K573k123j566J0000J7404J1766k430L921J2575
$$ 1971680 1985120 1995327 1973019 1975592 1973469 1971903 1981903 1999307 2011073 2008643 2012564 2025139
9102B025139k102r278O566j3943j9470P543o496J0235K8060K7233K5632k2554
$$ 2025139 2023037 2013759 2020325 2006382 1986912 1994455 1987959 1998194 2026254 2053487 2079119 2056565
9090B056565m4291O380L7774J2110N1281K6445L0201O7641M3851L9766L1174L3615
$$ 2056565 2012274 2018654 2056428 2068538 2119819 2146264 2176465 2244106 2287957 2327723 2358897 2392512
9078B392512l1253Q388L9106J6829P873l4011r898p999m9288l2040n906J3491
$$ 2392512 2361259 2369647 2408753 2425582 2433455 2399444 2389546 2381547 2332259 2300219 2294313 2307804
9066B307804J5966n765o844q874q039J7905K5087J3450J1378Q011K2538L1162
$$ 2307804 2323770 2318005 2311161 2302287 2294248 2312153 2337240 2350690 2362068 2370079 2392617 2423779
9054B423779L5498N4328M5372K8021J0452L0484J8879M3373L7621M0057O862K1120
$$ 2423779 2459277 2513605 2558977 2586998 2597450 2627934 2646813 2690186 2727807 2767864 2774726 2795846
9042B795846N2962J5989j547K5084P9232J04748J28993J34410N3910N3336K4281
$$ 2795846 2848808 2864797 2863250 2888334 2967566 3072314 3201307 3335717 3389627 3442963 3467244
9031C467244k6014j4245j0785l580j9816m0188k1296K0771M4438K464L315p211
$$ 3467244 3441230 3426985 3416200 3412620 3392804 3352616 3331320 3352091 3396529 3398993 3402308 3395097
9019C395097j3970K5882J5481M9833M7786L5305K3883N135J4764K8655K4083K1030
$$ 3395097 3381127 3407009 3422490 3472323 3520109 3555414 3579297 3584432 3599196 3627851 3651934 3672964
9007C672964M4812O5459M1167N0024O6512L6757L4177M7080J5420L719J1276j415
$$ 3672964 3717776 3783235 3824402 3874426 3940938 3977695 4011872 4058952 4074372 4078091 4089367 4087952
8995D087952N2983O8401Q9498J10582J12982J00759P3472P5352P0127K7915Q902
$$ 4087952 4140935 4209336 4298834 4409416 4522398 4623157 4696629 4771981 4842108 4870023 4878925
8984D878925K6962K8800M2497N9793O0608O9076O5688O6271N9335M6681N1523
$$ 4878925 4905887 4934687 4977184 5036977 5097585 5166661 5232349 5298620 5357955 5404636 5456159
8973E456159K3947K2321J3275L5446K9985J6395Q431J9241L8665L1605N9112P4203
$$ 5456159 5480106 5502427 5515702 5551148 5581133 5597528 5605959 5625200 5663865 5695470 5754582 5828785
8961E828785P6494Q5639R6241O5629M2510M3180N4137O5683J09679O6159P4389
$$ 5828785 5905279 5990918 6087159 6152788 6195298 6238478 6292615 6358298 6467977 6534136 6608525
8950F608525P1006Q5580R2281Q3500J12325J28560J12119J12356J70392J59604
$$ 6608525 6679531 6765111 6857392 6940892 7053217 7181777 7293896 7406252 7576644 7736248
8940G736248J69174J60261J05132J22363J56024J15566J03893J47772J28697J62521
$$ 7736248 7905422 8065683 8170815 8293178 8449202 8564768 8668661 8816433 8945130 9107651
8930I107651J36354J40985R0194J03489J17259J00444J48547J34964J33755J35532
$$ 9107651 9244005 9384990 9475184 9578673 9695932 9796376 9944923 10079887 10213642 10349174
8920A0349174J64639J62177J54944J34617J93259K34027K13975K12819K04522
$$ 10349174 10513813 10675990 10830934 10965551 11158810 11392837 11606812 11819631 12024153
8911A2024153K08782K24377K08829K23262K62560K66254K16496K26986K84027
$$ 12024153 12232935 12457312 12666141 12889403 13151963 13418217 13634713 13861699 14145726
8902A4145726K88191K84947K89542K89300L14350L43340L22658L68768L83695
$$ 14145726 14433917 14718864 15008406 15297706 15612056 15955396 16278054 16646822 17030517
8893A7030517L73610L56726L62037L76696L85984M25303M15372M11561M37723
$$ 17030517 17404127 17760853 18122890 18499586 18885570 19310873 19726245 20137806 20575529
8884B0575529M62036M59892M56913M80999M91478M97123N16778N47013N82158
$$ 20575529 21037565 21497457 21954370 22435369 22926847 23423970 23940748 24487761 25069919
8875B5069919N81549O02365O26245O81423O96654O91890P15241P25903P65392
$$ 25069919 25651468 26253833 26880078 27561501 28258155 28950045 29665286 30391189 31156581
8866C1156581Q42817R77652J113651J336789J722275K469746L564384M374329
$$ 31156581 31999398 32977050 34090701 35427490 37149765 39619511 43183895 47558224
8858D7558224L642426J431328q63558k416896k489753j549506p05397k49147l608
$$ 47558224 51200650 52631978 51768420 49351524 46861771 45312265 44606868 44357721 44354113
8849D4354113J47758L25186L53572M15315M17261L74794L35223L07710L26081
$$ 44354113 44501871 44827057 45180629 45595944 46013205 46387999 46723222 47030932 47357013
8840D7357013K79606K48445K54480K26575J59764J35405J02952P2675M3915l1435
$$ 47357013 47636619 47885064 48139544 48366119 48525883 48661288 48764240 48836915 48880830 48849395
8830D8849395k8520n5193j04105j77735j76614k34007k59671k66513l18108l29427
$$ 48849395 48820875 48765682 48661577 48483842 48307228 48073221 47813550 47547037 47228929 46899502
8820D6899502l52877m10507m23956m34906m81384n05183m66772m77748n28176
$$ 46899502 46546625 46136118 45712162 45277256 44795872 44290689 43823917 43346169 42817993
8811D2817993n64251n25986n47459n31543n36734n66096n40588n68932n93186
$$ 42817993 42253742 41727756 41180297 40648754 40112020 39545924 39005336 38436404 37843218
8802C7843218n76241n81396n51721n43880n49143n18656n20374n74815n55443
$$ 37843218 37266977 36685581 36133860 35589980 35040837 34522181 34001807 33426992 32871549
8793C2871549n63229n45983n21096n00904m71241n13774n33580n04298m48978
$$ 32871549 32308320 31762337 31241241 30740337 30269096 29755322 29221742 28717444 28268466
8784B8268466m31315m68394m66546m66182m49892m49531l84616l85590l90911
$$ 28268466 27837151 27368757 26902211 26436029 25986137 25536606 25151990 24766400 24375489
8775B4375489m10834l95519l81575l74127l71656m01174l65821l76770l56574
$$ 24375489 23964655 23569136 23187561 22813434 22441778 22040604 21674783 21298013 20941439
8766B0941439l19019l12073l21691l23530k96238l23764l28992k88979k91918
$$ 20941439 20622420 20310347 19988656 19665126 19368888 19045124 18716132 18427153 18135235
8757A8135235k84565k79585k89968k95131k68783k53982k43226k48339k34932
$$ 18135235 17850670 17571085 17281117 16985986 16717203 16463221 16219995 15971656 15736724
8748A5736724k42241k51790k39628k14537k34475k10279k07065j97187k20995
$$ 15736724 15494483 15242693 15003065 14788528 14554053 14343774 14136709 13939522 13718527
8739A3718527k14375j75653j87347k02736j96318j89393j73352j76680j49166
$$ 13718527 13504152 13328499 13141152 12938416 12742098 12552705 12379353 12202673 12053507
8730A2053507j86829j99294j52172j44354j43806j77900k03797j68371j45308
$$ 12053507 11866678 11667384 11515212 11370858 11227052 11049152 10845355 10676984 10531676
8721A0531676j35953j40617j38289j37976j67327j39602j41568j39889r0487j07936
$$ 10531676 10395723 10255106 10116817 9978841 9811514 9671912 9530344 9390455 9299968 9192032
8711I192032j51851j40160j05323j20459j10201j01950j20270j02493j18066j00386
$$ 9192032 9040181 8900021 8794698 8674239 8564038 8462088 8341818 8239325 8121259 8020873
8701H020873j07960r9269j25165j00837q1460r4386j02035j13867j03224q3172
$$ 8020873 7912913 7813644 7688479 7587642 7506182 7411796 7309761 7195894 7092670 7009498
8691G009498n3060n9231j10306j02396p7021r9085r9691o9796p3542q7497q5598
$$ 7009498 6956438 6897207 6786901 6684505 6607484 6508399 6408708 6338912 6265370 6177873 6092275
8680F092275p5460k7790n4297r4920r0020o2428p5338r4041m8523n0676o8666
$$ 6092275 6016815 5989025 5934728 5839808 5749788 5687360 5612022 5517981 5469458 5418782 5350116
8669E350116o8138n6134n2269m8733r1768n0408o5616n6579o8229p4679n3669
$$ 5350116 5281978 5225844 5173575 5124842 5033074 4982666 4917050 4860471 4792242 4717563 4663894
8658D663894l2951m3017n7669m9544m0284m4296m9817n4181m1100l1485m2793
$$ 4663894 4630943 4587926 4530257 4480713 4440429 4396133 4346316 4292135 4251035 4219550 4176757
8647D176757o0391k9483j2803m2195k9695p0468p9618p2946m1488l3316l2780
$$ 4176757 4116366 4086883 4074080 4031885 4002190 3931722 3852104 3779158 3737670 3704354 3671574
8636C671574j5086k5662r520k5216l8190N12r036L2962J06374J42183M9104n9659
$$ 3671574 3656488 3630826 3621306 3596090 3557900 3558412 3549376 3582338 3688712 3830895 3879999 3820340
8624C820340j13927j48617j22523j24207q5309n0029l3768l3210m5384l5177l4227
$$ 3820340 3706413 3557796 3435273 3311066 3225757 3175728 3141960 3108750 3063366 3028189 2993962
8613B993962k8749o146m2468k0938j7329k1302n0533m3323n5794k6469l2084l7227
$$ 2993962 2965213 2959067 2916599 2895661 2878332 2857030 2806497 2763174 2707380 2680911 2648827 2611600
8601B611600J795q724k8877n2578j8848j545n899k9879o232l929R940M601q740
$$ 2611600 2613395 2604671 2575794 2523216 2504368 2502823 2496924 2467045 2460813 2456884 2466824 2471425 2462685
8588B462685J5574J2035J1927L7021J15980K27902L05746K22067k7926k40590
$$ 2462685 2478259 2490294 2502221 2539242 2655222 2883124 3188870 3410937 3383011 3142421
8578C142421l25142k37147j32249j09871p7480n1663n3790K200p485o0893m2386
$$ 3142421 2817279 2580132 2447883 2338012 2260532 2208869 2155079 2157279 2149794 2088901 2046515
8567B046515M51j5419J684l2163p406l824j2286r215l225k8521l7475k7451k0809
$$ 2046515 2046966 2031547 2033231 2001068 1993662 1989838 1977552 1968337 1965112 1936591 1899116 1871665 1850856
8554A850856q630k2316o374j6684n6204k4282J8936j4220n0990j1127J0690Q991
$$ 1850856 1842226 1819910 1813536 1796852 1740648 1716366 1735302 1721082 1670092 1658965 1669655 1678646
8542A678646k2952P667J6269N4107J17065J38681J17301J837r1888j44200j44917
$$ 1678646 1655694 1663361 1679630 1733737 1850802 1989483 2106784 2108621 2016733 1872533 1727616
8531A727616q7639k1435l414l2591l4876l8037r944k7822r984k6675m1966k1628
$$ 1727616 1639977 1618542 1615128 1582537 1547661 1509624 1499680 1471858 1461874 1435199 1393233 1371605
8519A371605N582k2158k0681K8291k132K455j2592j9039j1161j4774k2295j5986
$$ 1371605 1377187 1355029 1334348 1362639 1360507 1362962 1350370 1331331 1320170 1305396 1283101 1267115
8507A267115N587j4500n838R287j6805k9148j2747k3977l337J045k1483j2923
$$ 1267115 1272702 1258202 1252364 1261651 1244846 1215698 1202951 1178974 1175637 1176682 1155199 1142276
8495A142276j710p961n262o333J4375m613j3115j4459m1696j5520J0031J5603
$$ 1142276 1140566 1132605 1127343 1121010 1135385 1130772 1117657 1103198 1061502 1045982 1056013 1071616
8483A071616r071r050k6265j3621j242m5781j0586J414J2291K3866L93k7609j8567
$$ 1071616 1062545 1053495 1027230 1013609 1012367 966586 956000 957414 969705 993571 993964 966355 947788
8470I47788k8988k043P504J103J4399K4440k7046k9284O844P334j6L8313P560
$$ 947788 918800 916757 924261 925364 939763 964203 937157 907873 914717 922051 922035 960348 967908
8457I67908j3110m2421k4951q471M124m076j7651p448N282P04n02k8993n4070
$$ 967908 954798 912377 887426 878955 883079 879003 861352 853904 859186 859890 859388 830395 776325
8444G76325k458J6448J731K6923J501K324l0381r933J7857q36j5171j9883K019
$$ 776325 773867 790315 792046 818969 820470 822794 792413 782480 800337 799501 784330 764447 766466
8431G66466K763j2294m883j8075j881L6366K2530j6655O968k4428l0211P15N089
$$ 766466 769229 756935 752052 733977 732096 768462 790992 774337 781305 756877 726666 727381 732470
8418G32470k1667p194l2680J9483J1868j551j7496j7359n582L0227J1845l1014
$$ 732470 710803 703609 670929 690412 702280 700729 683233 665874 660292 690519 702364 671350
8406F71350o613J7062j0920q826M675L003l3183j1342q3J6355J6216J0086k2636
$$ 671350 664737 681799 670879 662053 666728 669731 636548 625206 625123 641478 657694 667780 645144
8393F45144K3720M3328J7976J7017J155k2842j5488m1997n3126j2789J6087p095
$$ 645144 668864 712192 730168 747185 748340 725498 710010 668013 614887 602098 618185 611090
8381F11090q249q363l724j382j4469k6892J6912R283Q143k9660l3200p505K8359
$$ 611090 602841 594478 590754 589372 574903 548011 564923 574206 582349 552689 519489 511984 540343
8368E40343R458j7875K172J0175k1701m110k133N163j0778J2971M4148J6172k2752
$$ 540343 549801 531926 534098 544273 522572 518462 516329 521492 510714 523685 567833 584005 561253
8355E61253O74k1874j4540J7803j169k7146j7848M209J49k0632j1582J5592K0991
$$ 561253 561927 540053 525513 543316 542147 515001 497153 501362 501511 480879 469297 484889 505880
8342E05880m582k6364j971M608P856p822k840l2556l6096M669k072J0047N134
$$ 505880 501298 474934 472963 477571 485427 477605 474765 442209 406113 410782 408710 418757 423891
8329D23891J2599K9991Q515R082k2881l3116N71J1358k9748k6367K6646j6812
$$ 423891 436490 466481 474996 484078 461197 428081 428652 440010 410262 383895 410541 393729
8317C93729P414L3108J1280o427J4307k0338j1144j5512o449J924N033q72N208
$$ 393729 401143 434251 445531 439104 453411 433073 421929 406417 399968 401892 406925 406053 411261
8304D11261m507K399J2629j7662k8439p405j4349l47J0635J025R120K1482p655
$$ 411261 406754 409153 421782 404120 375681 368276 353927 353580 364215 365240 374360 395842 388187
8291C88187M160M6K846j3914k086O229m974j2992l8840J0873J9425J4513K2416
$$ 388187 392347 392393 395239 381325 379239 385468 380494 367502 328662 339535 358960 373473 395889
8278C95889Q959m4164l0803j0306Q355P932M114O238O247p392K6669p268l5454
$$ 395889 404848 360684 329881 319575 327930 335862 339976 346214 352461 345069 371738 364470 329016
8265C29016r587j8087P555j496j0509j7863r770j5513J617J4310l3025M1639K2644
$$ 329016 319429 301342 308897 307401 296892 279029 269259 253746 255363 269673 236648 278287 300931
8252C00931p417N903M057n709J1610l4657R370J3941J9904j9921k2872K0005R031
$$ 300931 293514 299417 303474 297765 309375 274718 284088 298029 317933 298012 275140 295145 304176
8239C04176j7534M365l2530l070K584K6121P816k7319j2477P044L9597J4596k9684
$$ 304176 286642 291007 258477 255407 257991 284112 291928 264609 252132 259176 298773 313369 283685
8226B83685O247j4817j7007n982k943m604R046j8358J0118J3635J1623O749J0413
$$ 283685 289932 275115 258108 252126 249183 244579 253625 235267 245385 259020 270643 277392 287805
8213B87805j8173j9656l309k2537j8923J1680J3467J8415J8077k5824K2721J9916
$$ 287805 269632 249976 246667 224130 205207 216887 230354 248769 266846 241022 263743 283659
8201B83659K5739l8801j9177O923J2213L607k7013R003Q564Q712k9035l120k1601
$$ 283659 309398 270597 251420 258343 270556 274163 247150 256153 264717 273429 244394 241274 219673
8188B19673k084q35j6082p80J3718N764l6139J2058L438J2974M7310M46j8810
$$ 219673 217589 216754 200672 199892 213610 219374 183235 195293 198731 211705 259015 259461 240651
8175B40651k0379n076N518J5875J759j49j3020m147J8724M30k9083k5143K7205
$$ 240651 220272 215196 220714 236589 238348 238199 225179 221032 239756 240186 211103 185960 213165
8162B13165J7652l0104J6111l587J9271j3193k7711J2355K0630o022K0472j5205
$$ 213165 230817 200713 216824 213237 232508 219315 191604 203959 224589 218567 239039 223834
8150B23834l7307J6608J5171J2784k393j1205J3463K522m295j0670j9443L944
$$ 223834 186527 203135 218306 231090 228697 217492 230955 233477 229182 218512 199069 203013
8138B03013J3537J7466k0207k1442K1106j539J1941N790Q219J2968j2299m655
$$ 203013 216550 234016 213809 192367 213473 211934 223875 229665 237884 250852 238553 233898
8126B33898k2641k0735k2878j1952p560M260j3291P351j1606j9360M668M0990
$$ 233898 211257 190522 167644 155692 148132 152392 139101 146452 134846 115486 120154 161144
8114A61144N0268R766m0821k0152J8557k23J411J2258n246k450K0387J8496k001
$$ 161144 211412 221178 180357 160205 178762 178539 179950 192208 186962 184512 204899 223395 221394
8101B21394q015j5000O163k930L129k3029k5035J8099Q282K0436J1338l6553o754
$$ 221394 213379 198379 204542 201612 204741 181712 156677 174776 183058 203494 214832 178279 171525
8088A71525P939j2128J9879L4349j3724j4143j9566k9211J345J7081J1463L139
$$ 171525 179464 167336 187215 221564 207840 193697 174131 144920 146265 163346 174809 177948
8076A77948j0645k299k1468M623J7885R357M232j5654m7536j4229J6676J7903
$$ 177948 167303 165004 143536 148159 166044 175401 179633 163979 116443 102214 118890 136793
8064A36793Q565J1411j4121Q017K0352q307j1024R734n539Q29J2943J0207l4833
$$ 136793 145358 156769 142648 150665 171017 162710 151686 161420 155881 156710 169653 179860 145027
8051A45027j8777o544k9993J0340M3761J3088k0148M135K2957j5253j1778J2306
$$ 145027 126250 119706 89713 100053 143814 156902 136754 140889 163846 148593 136815 149121
8039A49121l520j3554j8337N780J2296O285n400j914L342q192q111J0626q022
$$ 149121 145601 132047 113710 119490 131786 138071 132671 130757 134099 125907 117796 128422 120400
8026A20400m077K203p391j9366J9141K7947J0493p684q677J3809L816o853M390
$$ 120400 116323 118526 111135 91769 110910 138857 149350 141666 132989 146798 150614 143761 148151
8013A48151J2373j324j9457j0630J6049L2259k3802k8220k1874j3368p858K767
$$ 148151 160524 159200 139743 129113 145162 177421 153619 125399 103525 90157 82299 85066
8001H5066L4530L4818j1541J1812j1720j1594J896J4090p133L160k2638j6109
$$ 85066 119596 154414 142873 154685 142965 131371 133267 147357 140224 143384 120746 104637
7989A04637J7503J3392K3765j8859m4851J3036L8099J9685k8090p596k3241K88
$$ 104637 122140 135532 159297 140438 95587 108623 146722 166407 138317 130721 107480 107768
7977A07768K6793R107m0498j0423N599r898J2529J9073J0141L106n329L3701Q670
$$ 107768 134561 143668 103170 92747 98346 88448 100977 120050 130191 133297 127968 161669 170339
7964A70339j3358k8011q034L43O928n171j8387j014N169j2727J0512O341K0977
$$ 170339 156981 128970 120936 121279 128207 123036 104649 103635 108804 96077 106589 112930 133907
7951A33907J0122J9882l05J6466q238o7766k1798L897K2480J6322l005l0037J3337
$$ 133907 144029 163911 163606 180072 171834 104068 82270 86167 108647 124969 121964 91927 105264
7938A05264Q398K94L004K2219n346n416Q526o232Q106P760j2733J4906j0399J0155
$$ 105264 113662 113956 116960 139179 133833 128417 136943 130711 138817 146577 133844 148750 138351 148506
7924A48506J7066j090k3002j2270L2188J167L610j4166j5515j6966j1065K0942
$$ 148506 165572 164482 141480 129210 161398 162565 166175 152009 136494 119528 108463 129405
7912A29405J1292j5250j0001K8812m145k1614J2038j9730j6853J1899J5563k8351
$$ 129405 140697 125447 115446 144258 140113 118499 130537 110807 93954 105853 121416 93065
7900I3065l0333J0412L6759K4064p824l7234K584J8842M3027J7940k7842j6445
$$ 93065 62732 73144 109903 133967 126143 88909 91493 110335 153362 171302 143460 127015
7888A27015j6446k7761j7200K4413M2277J0926j9529l789l632k834k3770m506
$$ 127015 110569 82808 65608 90021 132298 143224 123695 119906 116274 113440 89670 85164
7876H5164o701j0144p013K703N777j6874K2929K4254M25j5787j95K6145J761k870
$$ 85164 78463 68319 61306 64009 69786 52912 75841 100095 100520 84733 84538 110683 112444 109574
7862A09574L527j8692K3558J0049o678j9490j8592K5903J9640k0624j7943m476
$$ 109574 113101 94409 117967 128016 121338 101848 83256 109159 128799 108175 90232 85756
7850H5756N826O263k476K6288q023j6952M174j0047L360j4954k2159j464P963
$$ 85756 91582 97845 95369 121657 113634 96682 100856 90809 94169 79215 57056 55592 63555
7837F3555K0345J7081o080j8265J701K4856l2271j7453l0051j5544q476M2716
$$ 63555 83900 100981 94901 76636 78337 103193 70922 53469 23418 7874 -602 42114
7825D2114K7904J6516J2304p933J7688l665j3894j1040J923J4608k251m672J8072
$$ 42114 70018 86534 98838 90905 108593 104928 91034 79994 81917 96525 94274 89602 107674
7812A07674j354r640m570p705q174j4057j5646J5506J2510J2571j0786j4261L2193
$$ 107674 106320 96680 92110 84405 76231 62174 46528 62034 74544 87115 76329 62068 94261
7799I4261K2329j0141K2237l3542m2562n803k449Q282k147Q023k1413j2945M581
$$ 94261 116590 106449 128686 95144 52582 46779 44330 52612 50465 58488 37075 24130 28711
7786B8711K1596j5424j6384j6523R460N852J9528O126l713O694Q590q948J2388
$$ 28711 50307 34883 18499 1976 11436 17288 36816 42942 39229 45923 54513 45565 57953
7773E7953L036N7J2530J7998p408K3979P247p830L137o537l1882J4103J7852k8938
$$ 57953 60989 61046 73576 91574 84166 108145 115392 107562 110699 104162 72280 86383 104235 75297
7759G5297l8247k0800j0530K3195K1210j6893O205J003j7031m716Q372J49K040
$$ 75297 37050 16250 5720 28915 50125 33232 39437 40440 23409 18693 27065 27214 29254
7746B9254j0110J2733J4436L858J9009N945J0564k885k5502J2900J0882k0091
$$ 29254 19144 31877 46313 50171 69180 75125 85689 82804 57302 70202 81084 60993
7734F0993R802r768L413j283j4340k2601J565L5013M0297K423j3555k4999j4607
$$ 60993 70795 61027 64440 63157 48817 26216 27781 62794 103091 105514 91959 66960 52353
7721E2353R889J5890j8294j4852J6215N51k203j0989q639K0675j2916j2514j7722
$$ 52353 62242 78132 59838 44986 61201 61752 59549 48560 39921 60596 47680 35166 17444
7708A7444m915J1979o466L1294J7307K2824J8053K072r590k7300j0429j4207k692
$$ 17444 12529 24508 18042 49336 66643 89467 107520 109592 100002 72702 62273 48066 45374
7695D5374j3702p56n063N151p177l631j4433J0736L2002J9152K5373J6780l25
$$ 45374 31672 30916 25853 31004 23827 20196 5763 16499 48501 67653 93026 109806 109481
7682A09481k7420k9596m676o444n405j3583L3480K5151k7549l5231k2156J8363
$$ 109481 82061 52465 47789 41345 35940 22357 55837 80988 53439 18208 -3948 14415
7670A4415n763j3232j4374j6245Q910J6320M3023K5956J0151K540r163r412J292
$$ 14415 8652 -4580 -18954 -35199 -26289 -9969 33054 59010 69161 71701 62538 53126 54418
7657E4418M688K0898k0001O977k5684J9887J2826j9118Q469n039o1173j5020J7017
$$ 54418 59106 80004 60003 66980 41296 61183 74009 54891 63360 58321 -2852 -17872 -855
7644h55J5793R837J1082J580P654k0691J4348m914P963O921L486J539R78j789
$$ -855 14938 24775 35857 37437 45091 24400 38748 33834 41797 48718 52204 53743 54721 52932
7630E2932J5059j5638o059Q361l2618J8499L4761J2341K4751M150k1798l3275
$$ 52932 67991 52353 46294 54655 22037 40536 75297 87638 112389 116539 94741 61466
7618F1466M905J2500M931k0685k5494J0631j1809j1802j721K1883j3099l9222
$$ 61466 66371 78871 83802 63117 37623 48254 36445 24643 22922 44805 31706 -7516
7606g516J6032K1449J8072j6195j2363J0080L4498j961o965M562L599k6800K913
$$ -7516 8516 29965 48037 31842 19479 29559 64057 62096 55131 59693 63292 36492 39405
7593C9405q236k2143k495j427P026R063R496K8182j4857K668N447n589N62j4794
$$ 39405 31169 9026 6531 5104 12130 21193 30689 58871 44014 46682 52129 46540 47102 32308
7579C2308Q54O685J4690l812M124K018l4106J0894j882Q501J6714j1340j0605
$$ 32308 33162 39847 54537 50725 54849 56867 22761 33655 31773 40274 56988 45648 35043
7566C5043k1307k3525j5311L5465J0176k9026L048J3594K7060j2846J5201R587
$$ 35043 13736 -9789 -25100 10365 20541 -8485 -5437 8157 35217 22371 37572 47159
7554D7159J810J0320j7772J4825j3776k4497K1183K5900m5634J533K5253p383
$$ 47159 48969 59289 41517 56342 42566 18069 39252 65152 19518 21051 46304 38921
7542C8921p334k011j0285j0192J6254J3427j2210j1742j6803J2728L797o093k331
$$ 38921 31587 29576 19291 9099 25353 38780 26570 14828 -1975 10753 14550 8457 6126
7529F126K5372l552m097J7935J6211k0384l2617k7392K9576K877l415J7648P814
$$ 6126 31498 27946 23849 41784 57995 37611 4994 -22398 7178 10055 6640 24288 32102
7516C2102k2718n816q601k0887J2270M1375J9212m442j8349j5980l2548J1100
$$ 32102 9384 3568 -5033 -25920 -13650 27725 46937 42495 24146 8166 -24382 -13282
7504a3282J1888K1708O123p540K2442J1511j0258j9815M724K0864k4077q868K6380
$$ -13282 -1394 20314 26437 18897 41339 52850 42592 22777 27501 48365 24288 15420 41800
7491D1800K8177k2489j7758n043j9876J6141k292q50q874j0117K7058N011j2034
$$ 41800 69977 47488 29730 24687 4811 20952 18660 17810 8936 -1181 25877 30888 18854
7478A8854l2689k5823N486K7414P25j8103k171K6098L2602k664N644n128l144
$$ 18854 -13835 -39658 -34172 -6758 -6033 -24136 -26307 -209 32393 29729 35373 30245 27101
7465B7101l6200k4855L0825L1292j1944l1756L730J5137J7197q022J507Q422K495
$$ 27101 -9099 -33954 -3129 28163 16219 -15537 -11807 3330 20527 12505 14012 22434 24929
7452B4929l43L1131J3494J4568J4824j1715k9654n082J8362N388p068l3838j7792
$$ 24929 24586 55717 69211 83779 98603 86888 57234 52152 70514 75902 68834 34996 17204
7439A7204K5092L8135k3311k0997o389k9919R3J2930Q989j3363O405r355j3087
$$ 17204 42296 80431 57120 36123 29734 -185 -92 12838 21827 8464 14869 5514 -7573
7426g573K2763M465K6387J2175j1005l1840K922J3238K1850j8655j1004R268P790
$$ -7573 15190 19655 46042 58217 47212 15372 18294 31532 53382 34727 23723 32991 40781
7413D0781l7492k4075j7657O687K7619j3632K040R244j1223P156K7306J5115j3248
$$ 40781 3289 -20786 -38443 -31756 -4137 -17769 -15729 -6485 -17708 -10552 16754 31869 18621
7400A8621J1572q099m574r563o352R728J4801k915N304J0395J8631l0610m0516
$$ 18621 30193 22094 17520 7957 1605 11333 26134 23219 28523 38918 57549 26939 -13577
7387a3577j8040J4452L914N579L3321J4618l1351L79M085j7314j1580J6723R857
$$ -13577 -31617 -17165 -13251 -7672 25649 40267 8916 9295 13380 -3934 -15514 1209 11066
7374A1066K186J2970J6002k4449o149m598n847Q313J3170j4982m826J8848M198
$$ 11066 13252 26222 42224 17775 11626 7028 1181 9494 22664 7682 2856 21704 25902
$$ [...]
##END NTUPLES=NMR SPECTRUM
##END=
