##TITLE=Analysis number 319757
Compound Code cc 55711
Book Reference 467/44
Project Code adrs
Chemist Name benw
##JCAMPDX= 6.0         $$ Bruker NMR JCAMP-DX V2.0
##DATA TYPE= NMR SPECTRUM
##DATA CLASS= NTUPLES
##ORIGIN= Bruker BioSpin GmbH
##OWNER= nmr
$$ XWIN-NMR		Version 3.5
$$ Thu May 25 13:53:05 2006 GMT Daylight Time (UT+1h)  MAYBRIDGE\nmr@NMR_250MHZ
##.OBSERVE FREQUENCY= 250.131544655141
##.OBSERVE NUCLEUS= ^1H
##.ACQUISITION MODE= SIMULTANEOUS (DQD)
##.ACQUISITION SCHEME= undefined
##.AVERAGES= 16
##.DIGITISER RES= 18
##SPECTROMETER/DATA SYSTEM= dpx250
##.PULSE SEQUENCE= zg30
##.SOLVENT NAME= CDCl3
##.SHIFT REFERENCE= (INTERNAL, CDCl3, 0, 16.522)
##AUDIT TRAIL= $$ (NUMBER, WHEN, WHO, WHERE, WHAT)
$$ ##TITLE= Audit trail, XWIN-NMR		Version 3.5
$$ ##JCAMPDX= 5.01
$$ ##ORIGIN= Bruker BioSpin GmbH
$$ ##OWNER= nmr
$$ C:\u/data/dgb/nmr/ADRS/5200/pdata/1/auditp.txt
$$ ##AUDIT TRAIL=  $$ (NUMBER, WHEN, WHO, WHERE, WHAT)
(   1,<2006-05-25 13:52:30.01 +100>,<MAYBRIDGE\nmr>,<NMR_250MHZ>,
      <created by zg, POWCHK disabled, PULCHK disabled
       configuration hash MD5:
       84 BC 41 DB A1 6E 1D 46 DA 25 12 A5 C1 ED C5 3A
       data hash MD5: 64K
       40 AC C9 92 EA EC F5 10 13 1E 53 0B 14 B3 15 35>)
(   2,<2006-05-25 13:52:46.11 +100>,<MAYBRIDGE\nmr>,<NMR_250MHZ>,
      <Start of raw data processing
       ef LB = 0.3 FT_mod = 6 PKNL = 1 SI = 32K 
       data hash MD5: 32K
       21 91 68 DC 46 D6 26 9D 00 AF 0E AE A1 DB 4E 40>)
(   3,<2006-05-25 13:52:49.93 +100>,<MAYBRIDGE\nmr>,<NMR_250MHZ>,
      <apk 
       data hash MD5: 32K
       A1 BF EB 57 06 76 87 38 6C 37 F6 CC 19 9B CC CE>)
(   4,<2006-05-25 13:52:51.43 +100>,<MAYBRIDGE\nmr>,<NMR_250MHZ>,
      <abs ABSG = 5 
       data hash MD5: 32K
       34 10 A4 CB FF 40 BF 44 29 E9 A5 AD 68 A4 74 16>)
$$ ##END=
$$ 
$$ hash MD5
$$ 6D 60 60 B4 2B 88 3E A2 16 3C 48 CF 2B 08 76 71
##$RELAX= 
##$RELAX= 
##$RELAX= 
##$RELAX= 
##$RELAX= 
##$RELAX= 
##$RELAX= 
$$ Bruker specific parameters
$$ --------------------------
##$DU= <C:\u>
##$EXPNO= 5200
##$NAME= <ADRS>
##$PROCNO= 1
##$TYPE= <nmr>
##$USER= <dgb>
##$AMP= (0..31)
100 100 100 100 100 100 100 100 100 100 100 100 100 100 100 100 100 100 
100 100 100 100 100 100 100 100 100 100 100 100 100 100 
##$AQSEQ= 0
##$AQ_mod= 3
##$AUNM= <au_zg>
##$AUTOPOS= <1 >
##$BF1= 250.13
##$BF2= 250.13
##$BF3= 250.13
##$BF4= 250.13
##$BF5= 500.13
##$BF6= 500.13
##$BF7= 500.13
##$BF8= 500.13
##$BYTORDA= 1
##$CFDGTYP= 0
##$CFRGTYP= 5
##$CHEMSTR= <none>
##$CNST= (0..31)
1 1 145 1 1 1 1 1 1 1 1 1 1 1 1 1 1 1 1 1 1 1 1 1 1 1 1 1 1 1 1 1 
##$CPDPRG= <>
##$CPDPRG1= <>
##$CPDPRG2= <>
##$CPDPRG3= <>
##$CPDPRG4= <mlev>
##$CPDPRG5= <mlev>
##$CPDPRG6= <mlev>
##$CPDPRG7= <mlev>
##$CPDPRG8= <mlev>
##$CPDPRGB= <>
##$CPDPRGT= <>
##$D= (0..31)
0 1 0 0 0 0 0 0 0 0.06 0 0 0 0 0 0 0.0002 0 0 0 0 0 0 0 0 0 0 0 0 0 0 
0 
##$DATE= 1148561548
##$DBL= (0..7)
120 120 120 120 120 120 120 120 
##$DBP= (0..7)
150 150 150 150 150 150 150 150 
##$DBP07= 0
##$DBPNAM0= <>
##$DBPNAM1= <>
$$ [...]
##$SUBNAM7= <"">
##$SUBNAM8= <"">
##$SUBNAM9= <"">
##$SW= 20.6930455092707
##$SWIBOX= (0..15)
0 0 3 0 0 0 0 0 0 0 0 0 0 0 0 0 
##$SW_h= 5175.983436853
##$TD= 65536
##$TD0= 1
##$TE= 295.16
##$TE2= 300
##$TE3= 300
##$TEG= 300
##$TL= (0..7)
0 120 120 120 120 120 120 120 
##$TP= (0..7)
150 150 150 150 150 150 150 150 
##$TP07= 0
##$TPNAME0= <>
##$TPNAME1= <>
##$TPNAME2= <>
##$TPNAME3= <>
##$TPNAME4= <>
##$TPNAME5= <>
##$TPNAME6= <>
##$TPNAME7= <>
##$TPOAL= (0..7)
0.5 0.5 0.5 0.5 0.5 0.5 0.5 0.5 
##$TPOFFS= (0..7)
0 0 0 0 0 0 0 0 
##$TUNHIN= 0
##$TUNHOUT= 0
##$TUNXOUT= 0
##$USERA1= <user>
##$USERA2= <user>
##$USERA3= <user>
##$USERA4= <user>
##$USERA5= <user>
##$V9= 5
##$VALIST= <valist>
##$VCLIST= <CCCCCCCCCCCCCCC>
##$VD= 0
##$VDLIST= <DDDDDDDDDDDDDDD>
##$VPLIST= <PPPPPPPPPPPPPPP>
##$VTLIST= <TTTTTTTTTTTTTTT>
##$WBST= 1024
##$WBSW= 4
##$XGAIN= (0..3)
0 0 0 0 
##$XL= 0
##$YL= 0
##$YMAX_a= 379877
##$YMIN_a= -580331
##$ZGOPTNS= <>
##$ZL1= 120
##$ZL2= 120
##$ZL3= 120
##$ZL4= 120
##$ABSF1= 16.522
##$ABSF2= -4.171173
##$ABSG= 5
##$ABSL= 3
##$ALPHA= 0
##$AQORDER= 0
##$ASSFAC= 0
##$ASSFACI= 0
##$ASSFACX= 0
##$ASSWID= 0
##$AUNMP= <proc_1d>
##$AZFE= 0.1
##$AZFW= 0.1
##$BCFW= 0
##$BC_mod= 0
##$BYTORDP= 0
##$COROFFS= 0
##$CY= 12.5
##$DATMOD= 1
##$DC= 0
##$DFILT= <>
##$DTYPP= 0
##$F1P= 14.0000005364418
##$F2P= -0.99999901652339
##$FCOR= 0.5
##$FTSIZE= 32768
##$FT_mod= 6
##$GAMMA= 0
##$GB= 0
##$INTBC= 1
##$INTSCL= 1
##$ISEN= 128
##$LB= 0.3
##$LEV0= 0
##$LPBIN= 0
##$MAXI= 10000
##$MC2= 0
##$MEAN= 0
##$ME_mod= 0
##$MI= 0
##$NCOEF= 0
##$NC_proc= -4
##$NLEV= 6
##$NOISF1= 0
##$NOISF2= 0
##$NSP= 0
##$NTH_PI= 0
##$NZP= 0
##$OFFSET= 16.522
##$PC= 1
##$PHC0= 171.7715
##$PHC1= 3.730639
##$PH_mod= 1
##$PKNL= yes
##$PPARMOD= 0
##$PSCAL= 4
##$PSIGN= 0
##$REVERSE= no
##$SF= 250.13
##$SI= 32768
##$SIGF1= 0
##$SIGF2= 0
##$SINO= 400
##$SIOLD= 32768
##$SREGLST= <1H.CDCl3>
##$SSB= 0
##$STSI= 32768
##$STSR= 0
##$SW_p= 5175.98343685301
##$SYMM= 0
##$S_DEV= 0
##$TDeff= 65536
##$TDoff= 0
##$TI= <Analysis number 999999
Compound Code 99
Book Reference 9
Project Code 9>
##$TILT= no
##$TM1= 0
##$TM2= 0
##$TOPLEV= 0
##$USERP1= <user>
##$USERP2= <user>
##$USERP3= <user>
##$USERP4= <user>
##$USERP5= <user>
##$WDW= 1
##$XDIM= 32768
##$YMAX_p= 301178343
##$YMIN_p= -236459
$$ End of Bruker specific parameters
$$ ---------------------------------
##NTUPLES= NMR SPECTRUM
##VAR_NAME=  FREQUENCY,     SPECTRUM/REAL,   SPECTRUM/IMAG
##SYMBOL=    X,             R,               I
##VAR_TYPE=  INDEPENDENT,   DEPENDENT,       DEPENDENT
##VAR_FORM=  AFFN,          ASDF,            ASDF
##VAR_DIM=   32768,         32768,           32768
##UNITS=     HZ,            ARBITRARY UNITS, ARBITRARY UNITS
##FACTOR=    0.157963299565203, 1,           1
##FIRST=     4132.6476996994, 0,             0
##LAST=      -1043.33573715361, 0,           0
##MIN=       -1043.33573715361, -236459,     0
##MAX=       4132.6476996994, 301178343,     0
$$ Real data points
##PAGE= N=1
##DATA TABLE= (X++(R..R)), XYDATA
$$ [...]
17905D80744l5785k3428n4858l8877M8973m2824k2982Q667K8176j3420k0216J4251
17893C28421N0538J5460o1748J2552l4101l889J9358k5964M116L5904Q441j7063
17881C32025N0748N0364M5482K4038M557J9393L553K2333P621O947L3879O8290
17869F69230J4499l4425O926o3530j14208N404M2311j6062k0547k5090n0609j3640
17857D00259K0530J4565o3918J1858l2820N140O5341R474O2259Q732m1235J6635
17845D76820M9268L4374L4297J06244L2554J3538J6773R1455J01449l6267o102
17834I14403n302L2644O9734R6459L8498P2413J22568P6172O0969J00718J00547
17823A679823N9538J05294J47178J17177J39182J62280K27265K57384L66666N51645
$$ y = [480744, 444959, 421531, 366673, 327796, 376769, 333945, 310963, 319630, 347806, 334386, 314170, 328421, 378959, 394419, 332671, 345223, 311122, 307233, 326591, 300627, 304743, 340647, 349088, 332025, 382773, 433137, 478619, 502657, 507214, 526607, 530160, 552493, 560114, 567061, 600940, 669230, 683729, 649304, 656230, 592700, 478492, 483896, 526207, 510145, 489598, 464508, 413899, 400259, 420789, 435354, 371436, 383294, 350474, 355614, 420955, 430429, 492688, 501420, 460185, 476820, 526088, 560462, 594759, 701003, 733557, 747095, 763868, 855323, 956772, 920505, 914403, 909101, 941745, 1011479, 1107938, 1146436, 1218849, 1341417, 1417589, 1478558, 1579276, 1679823, 1739361, 1844655, 1991833, 2109010, 2248192, 2410472, 2637737, 2895121, 3261787, 3813432]
17813C813432P36731R15367J401531K143830L263781M904240O840588Q442882
17805C2462382Q932400Q297338O221816K716934j816188n657838p789510q926986
17797C4440348q089860o142405m107559k686913j771663j303212q88417p46712
17789H703607o39131m10965l05384l15608l26777k94390k35334j94163r4281m4996
17779E842578M363j01334m9725r8096j09821r8283n944J40924Q4245J41496L41991
17768F092394M26378M33793O32343Q95961J146213J592285K351128L605637N569521
17759B2745653Q203210J1229380J3661064J4442267J3203617R647316L836309
17752I6968816l133440r159868j2926487j4289739j3157350j0148753p063925
$$ y = [3813432, 4550163, 5465530, 6867061, 9010891, 12274672, 17178912, 24019500, 32462382, 41394782, 49692120, 55913936, 58630870, 56814682, 51156844, 43367334, 34440348, 26350488, 20208083, 16100524, 13413611, 11641948, 10338736, 9450319, 8703607, 8064476, 7653511, 7348127, 7032519, 6705742, 6411352, 6176018, 5981855, 5887574, 5842578, 5846941, 5745607, 5695882, 5597786, 5487965, 5389682, 5383738, 5524662, 5608907, 5750403, 6092394, 6518772, 6952565, 7584908, 8480869, 9627082, 11219367, 13570495, 17176132, 22745653, 30948863, 42178243, 55839307, 70281574, 83485191, 93132507, 96968816, 93835376, 84675508, 71749021, 57459282, 44301932, 34153179, 27089254]
17745B7089254m666512l184362k307594j760363j298568r71700p92108o99229
17737A1408818n84716n32423m92909m27678m19340l26281k13045k37469k68934
17728G906023k65066l03948k42271k36985j75656l9940n2210l1704R371P8337
17718F645951J29511J53962K77315L62215N42577Q11410J338551K297859L514800
17709A6074151M876840N888052O129159N623884M008170J379481j953707m522015
17701C7504015n821098o440712n703704m277642k818159j882904j361866r59772
17693H238158p02150n88976n22776l71137l29019l12148k81419k02348j54938
17684D773247j68279j85828j92257j30213j02292j67196j52018j19076j07804
$$ y = [27089254, 22422742, 19238380, 16930786, 15170423, 13871855, 12900155, 12108047, 11408818, 10824102, 10291679, 9798770, 9371092, 8951752, 8625471, 8412426, 8174957, 7906023, 7640957, 7337009, 7094738, 6857753, 6682097, 6642157, 6589947, 6558243, 6567614, 6645951, 6775462, 6929424, 7206739, 7568954, 8111531, 8922941, 10261492, 12559351, 16074151, 20950991, 26839043, 32968202, 38592086, 42600256, 43979737, 42026030, 37504015, 31682917, 25242205, 19538501, 15260859, 12442700, 10559796, 9197930, 8238158, 7536008, 6947032, 6424256, 6053119, 5724100, 5411952, 5130533, 4928185, 4773247, 4604968, 4419140, 4226883, 4096670, 3994378, 3827182, 3675164, 3556088, 3448284]
17675C448284r2808j24743j04151q2255k9789J0721m8711q2504j30535m7719m4582
17664B671208p3273j00538o944p62n0015l9077j00213o7368o4321m9000l6508
17653B083189o9018j15159j92888r0095n8132k3684j17827o5290l2930n3022o1821
17642A203323o5420L667o0835q0885n012J9325m8218p0045k7929k8320J5846j4536
17630H40961m2513j5828o7443o8089k8470r674N9888K5944o548k809L3345K1012
17618G39776l8591p9434k4768r163L3246R754J9290L5479j7680k5998L6117j7704
17606F60324n9571l5972j2470L9378q33j339m6089l9055K9105m9953o3044k3499
17594C96982k7564q5605K9493L7413k9220K6192M854q2678k3456L627m482l8361
$$ y = [3448284, 3355476, 3230733, 3126582, 3044327, 3014538, 3025259, 2976548, 2894044, 2763509, 2715790, 2671208, 2597935, 2497397, 2490453, 2489691, 2439676, 2400599, 2300386, 2233018, 2168697, 2119697, 2083189, 2014171, 1899012, 1706124, 1616029, 1557897, 1534213, 1416386, 1351096, 1318166, 1265144, 1203323, 1137903, 1141570, 1080735, 999850, 994838, 1014163, 965945, 895900, 867971, 839651, 855497, 840961, 798448, 782620, 715177, 647088, 618618, 608944, 668832, 694776, 688228, 685419, 718764, 739776, 701185, 621751, 596983, 587820, 621066, 630820, 650110, 685589, 667909, 641911, 678028, 660324, 600753, 564781, 552311, 591689, 590856, 589517, 543428, 504373, 533478, 483525, 420481, 396982, 369418, 283813, 313306, 350719, 321499, 347691, 352545, 269867, 246411, 250038, 245556, 207195]
17582B07195l5114J4271L5542K8318L2952J166n637J316m819J9207m6081l1561
17570B16755Q558O711M275k6532P602m8220l357M4911K2038O0350j3667l1510
17558B47914l7321J0556K5247o8424q457p25O567O0593n198o6198R605k0243k6013
17545A27903L1358M5146n5076k6791l1035m4808k9921K7972N5949K1790j6230
17534A06257K1247P733M792L5747Q828O4016J3101M4025O90n3905j13020l3329
17522A06182K3744O871M6132K7921l927l3101o2341K5342M5832o8045R293K4180
17510A48083K6656m6299o3990p764K4655N9806l1570q2188K5333J2210j0244K1931
17498G6619M445k0298l7626l1474M680L4964j0619J9189k3531P820L966k2715
$$ y = [207195, 172081, 186352, 221894, 250212, 283164, 284330, 278693, 280009, 275190, 294397, 248316, 216755, 225313, 232024, 236299, 209767, 217369, 169149, 165792, 210703, 232741, 293091, 279424, 247914, 210593, 221149, 246396, 177972, 169515, 168790, 175357, 235950, 230752, 164554, 174159, 153916, 127903, 159261, 204407, 149331, 122540, 91505, 46697, 16776, 44748, 100697, 122487, 106257, 127504, 135237, 140029, 175776, 184604, 248620, 261721, 305746, 306436, 252531, 139511, 106182, 129926, 136797, 182929, 210850, 206923, 173822, 111481, 136823, 182655, 114610, 123903, 148083, 174739, 128440, 64450, 56686, 81341, 141147, 109577, 27389, 52722, 64932, 54688, 76619, 81064, 60766, 23140, -8334, -3654, 31310, 20691, 39880, 16349, 24169, 28135, 5420]
17486E420k960Q0360L6053n281R05M00n9300p6962K4035R9280m3877q7696J8291
17473a1332J07940J1931J0904j3182R309L2947M5740m694k9497k6244k4863l3905
17461G5054j49o1263n8235N8659K4559N6816l4630q3546l5285K7952r038j0860
17449d9966J4769p140M4513M3724J6749L3948P164N2878P5187L6804j8059M6712
17437B97283Q6155n5462j72387j31563k1479m911p466L7208P1238L1684l8685
17426I1615L1283l2658k9717p1141J388M9228P3618j8257n055K4236l4614j06545
17414b6619o2153n67M7761k759M4756L4066J4931M159j3720p248k5831J0516j2454
17401D838p3434k8956J669P7480N9260J7337J7396P9671n5346q9974j8794J8438
$$ y = [5420, 2460, 82820, 118873, 113592, 114497, 114897, 55597, -21365, 2670, 101950, 58073, -29623, -11332, 96608, 108539, 119443, 106261, 115570, 148517, 194257, 189563, 160066, 133822, 108959, 75054, 74905, 13642, -44593, 14066, 38625, 95441, 60811, -22735, -58020, -30068, -39106, -49966, -35197, -42337, 2176, 45900, 62649, 96597, 103761, 156639, 231826, 268630, 250571, 297283, 383438, 327976, 155589, 24026, 2547, -2364, -9830, 27378, 98616, 130300, 91615, 122898, 90240, 60523, -10618, -9230, 39998, 113616, 95359, 90304, 114540, 79926, -26619, -88772, -89339, -41578, -44337, 419, 34485, 49416, 53575, 39855, 32607, 6776, 17292, 4838, -68596, -97552, -95883, -18403, 40857, 58194, 75590, 155261, 99915, 9941, -8853, 9585]
17389I585K1371J6117L4567K8662M3261n7538q0039p26l7046k0990O6107J14990
17377A38321N3383q0983l9005N2404J6293o1983k3049J0181m4004n1402K1194
17366h650J9592m359M4204J0677l9035j3501M0412M2084m4632j7844R761J8394
17354E7103k2299k7801k8167k5094p3901k681P9130R6882P691k0072m1145J2610
17342A2256j1914L3955J7360m391J6982L1888j8405p6060j1083J5496N8959n2579
17330A2464o3861Q064J1696M972j1154N59j677L4464L3393J8661J9680n7077q7098
17317g6914K8838Q280l0731K3824L5981K6352J7677K637p2041j9510R8318K5139
17305F7850J8506k8242K6290L9203o8591l5229K7411K4782K2146N835L2757O5766
$$ y = [9585, 30956, 47073, 81640, 110302, 153563, 96025, 15986, 15260, -21786, -42776, 23331, 138321, 191704, 110721, 71716, 124120, 140413, 78430, 55381, 65562, 21558, -29844, -8650, 10942, 6583, 50787, 61464, 22429, 8928, 49340, 91424, 46792, 28948, 38709, 57103, 34804, 7003, -21164, -46258, -120159, -122840, -43710, 53172, 60863, 40791, -354, 12256, 342, 34297, 51657, 47266, 64248, 96136, 77731, 1671, -9412, 6084, 65043, 12464, -51397, -43333, -31637, -26665, -37819, -37260, -38937, -4473, 28920, 47581, 67261, 10184, -76914, -48076, -39796, -70527, -46703, -10722, 15630, 33307, 35944, -36097, -55607, 42711, 67850, 86356, 58114, 84404, 123607, 55016, 19787, 47198, 71980, 94126, 99961, 132718, 198484]
17293A98484Q1088J22241M433j01610o2163J1684l7181L652l9231k3464n4993
17282A02940j52194k160M5256O5594q77L9736k1030K0883l26R921m34L669j7449
17269I3529j5277L5360J6431m0704n0996l2199Q636q03l0166K5428K1211j0646
17257A9804J3625k227K9405j0O76Q923m057L3269O508M7027L5138R2080R6425
17244C76586N4309J2673M8009K4164l4205o351o1234p7857r9384q3487j8392J3252
17232A48083j2056Q139K8835K3562o2835m5396m820M7539q1907p9358N0809l20
17220B0275m308O8284L2703o1108j020n672R572J087k9298L6199P07M512l8561
17207C3372M3633J2628M0922k3362j21931m6118O3438R1458L4024O229M2021K1098
$$ y = [198484, 279572, 401813, 406246, 304636, 242473, 254157, 216976, 220628, 181397, 157933, 102940, -49254, -51414, -6158, 59436, 58559, 98295, 77265, 98148, 97822, 107743, 107309, 110978, 93529, 78252, 113612, 130043, 89339, 38343, 6144, 14780, 13977, -16189, 9239, 30450, 19804, 33429, 31202, 60607, 60597, 61273, 70196, 66139, 99408, 105916, 152943, 188081, 280161, 376586, 430895, 443568, 491577, 515741, 481536, 475185, 413951, 336094, 236710, 153223, 134831, 148083, 136027, 144166, 173001, 196563, 133728, 88332, 83512, 131051, 49144, -30214, 20595, 20275, 15967, 84251, 116954, 55846, 54826, 49154, 58726, 59813, 30515, 66714, 67421, 71933, 33372, 77005, 89633, 130555, 107193, -14738, -60856, 2582, 94040, 128064, 134293, 176314, 197412]
17195A97412L355O7834N7650m8362k3717p249o1643n1866l6669l2823J4752L6946
17183A15620o7923K2920M252n7269j8864O2112j1456J8122O779K597k787j5564
17171E8539j6485L5136N818q25L7337K4145k5940n0657k2262L6616o7575l2282
17159a8435J1819K4760m4452j1730j4684K6170Q5210l2612j00973o5244N0044
17148i0127Q6089J5503n0093N4345J28987N968j25456k9698r912k0941j6604j4423
17136f6362j6197J1324J0380n3926K3764Q4800K6713l1816k459J1392J8737m5638
17124b9288k2220j077J5444q959n5298K479K4305K5525l4938k8416K2995J5445
17112g4003n306O5710L920p7L7180J1243q698l0164o5284k3046j1842J1417Q4625
$$ y = [197412, 200767, 268601, 326251, 277889, 254172, 246923, 185280, 133414, 96745, 63922, 78674, 115620, 47697, 70617, 74869, 17600, -1264, 60848, 49392, 67514, 74293, 76890, 74103, 58539, 42054, 77190, 83008, 82183, 119520, 143665, 117725, 67068, 44806, 81422, 13847, -18435, -6616, 18144, -26308, -38038, -52722, -26552, 58658, 26046, -74927, -140171, -90127, -4038, 11465, -38628, 15717, 144704, 150672, 25216, -4482, -14394, -35335, -51939, -66362, -82559, -71235, -60855, -114781, -91017, -6217, 20496, -11320, -13779, -2387, 16350, -29288, -51508, -52585, -37141, -46100, -101398, -98919, -74614, -49089, -84027, -112443, -89448, -74003, -79309, -13599, -9679, -9756, 27424, 38667, 29969, -195, -65479, -88525, -100367, -88950, -4325]
17099d325M6440R328r703L6219L4096k5638j3404k6739j3898M4237K7382m5427
17087E8568p6441J7161N5930L3040M3732m6530l4313j235j8293j3939k5754k2940
17075c1014J092n6292k5604Q3065l0581M5018M7915J6510K032M1917K6912k3902
17063I7068j8764k6855N891J8316j5456q3987m2179L013j8823K9826J3675k58
17051c8533J9170K604K5312r15k0277N0132j4065l5889m8694k315Q873K4756n972
17038c5813L3008l0117m5633Q1206L3673k7045k4891l4698l290j1398N2691J7001
17026D694J5502K398l7387K0414N6530K3498K2631p6596n0721L4233J9941l2590
17014B547j9557j8094J5329M8180K4808k9943O4J004P2421Q814p0819l4488Q699
$$ y = [-4325, 42115, 51443, 41740, 77959, 112055, 86417, 73013, 46274, 32376, 76613, 103995, 58568, -17873, -712, 55218, 88258, 131990, 85460, 51147, 49912, 31619, 17680, -8074, -31014, -29922, -86214, -111818, -28753, -59334, -14316, 33599, 50109, 52141, 94058, 120970, 97068, 78304, 51449, 57340, 75656, 60200, -23787, -65966, -62953, -81776, -51950, -38275, -38533, -19363, -16759, 8553, 7638, -12639, 37493, 23428, -12461, -61155, -63470, -54597, -29841, -35813, -2805, -32922, -78555, 2651, 36324, 9279, -15612, -50310, -53600, -64998, -12307, 4694, 20196, 22594, -14793, 5621, 62151, 85649, 108280, 31684, -19037, 15196, 35137, 2547, -17010, -35104, -19775, 28405, 53213, 23270, 23334, 24338, 96759, 105573, 34754, 266, 8965]
17001H965L2750J7407n3476N1757L0680m0374k5616m1351J0860j076j4294o100
16989b9868r109M0686k0602M8204M4241j7996M1462o1294m051p688l6356k1554
16977c3925J6439J6952M5283k1868n4919k6384K1128M198K3265P223P6401L4867
16965A08660p2841k2598j333k4012j9659J1048L9139K3996l7538n5166L5303L8151
16953B3150M578o1769j3702J5243m0237J027M6929J1775m364m6096J0231Q7097
16941C3862p393m0951L332Q4190O932n0550L892o014l167o3453n446P4747l4102
16928d121j0035K9062L3014l6113L5121K2134m7653n1617K3401K069j973L6836
16916C0125m8970o8827n535O2639J5614k6917k4316J3569p85n2343m172L5584
$$ y = [8965, 41715, 59122, 5646, 57403, 88083, 47709, 22093, -19258, -8398, -9474, -23768, -29868, -38977, 1709, -18893, 29311, 73552, 55556, 97018, 35724, 31673, 23985, -12371, -33925, -17486, -534, 44749, 22881, -32038, -58422, -37294, -33096, -9831, -2608, 73793, 108660, 35819, 13221, 11888, -12124, -31783, -20735, 18404, 42400, 4862, -50304, -15001, 23150, 27728, -34041, -47743, -32500, -72737, -71710, -24781, -13006, -17370, -63466, -53235, 33862, 26469, -14482, -11150, 73040, 79972, 29422, 33314, 27300, 24133, -39320, -44766, 29981, -4121, -14156, 14906, 47920, 11807, 46928, 69062, 21409, -30208, -6807, -4738, -6711, 30125, -18845, -87672, -93207, -30568, -14954, -41871, -66187, -52618, -53403, -105746, -109918, -74334]
16904g4334N2301P480K6364K3860n5806n633K1218N3531Q4575J7136m8857n1059
16892E0776m4894k1634N1978K3089q0338k2926M0770K4036n6748q4474K9618M3427
16880d7320M3723K3430l772L637o4654N041J4541k568r374m4255j0137j5973K9931
16867g7750P2162k3184P443M2793k7229m175J00537J5583j9715l2627n2111j6904
16855a5177l1234J2219k1751m2363N23n444k2079O2565L8171L3898p1632o0533
16843a22837k4824J1241j067L2614J0775M7865k6658l9189K7297J7123L3111J0023
16831b4526j1281j566J1848k2895m3913K2794P3821L9094k0756l4069J4282N5556
16819E8389O47m5894J1444l1618N3133N5082J299q5837q5492m246j9946R311J9520
$$ y = [-74334, -22033, -14553, 11811, 35671, -20135, -25768, -4550, 48981, 133556, 150692, 101835, 50776, 5882, -15752, 36226, 59315, -21023, -43949, -3179, 20857, -35891, -120365, -90747, -47320, -3597, 19833, 16061, 19698, -44956, -39915, -25374, -27942, -37316, -81571, -91708, -107681, -77750, -5588, -28772, -21329, 21464, -5765, -9940, 90597, 106180, 86465, 53838, 1727, -15177, -46411, -34192, -55943, -98306, -97783, -103227, -125306, -62741, -24570, 9328, -62304, -122837, -147661, -136420, -137487, -104873, -94098, -46233, -72891, -112080, -84783, -67660, -34549, -24526, -35807, -37373, -25525, -48420, -92333, -69539, 4282, 43376, 22620, -11449, 2833, 58389, 59036, 13142, 24586, -7032, 46101, 101183, 102482, 16645, -68847, -73093, -93039, -83728, -64208]
16806f4208j1168M8486M0331L4779Q505J1523N401k4977J9855O2944k088k2508
16794A06875m1178J9602l4491J5663o0018j3569m0218N418M822L9220O0843k7827
16782C5142o7164m2128j6349L1630j3285K154J5850N7538M2983l6674m9549n9268
16770i9120P0065N5614l8463q401j9862R839j7127j6012K9873J281K1522N459
16758e332j3076M925J3545K3277l9474J1045Q5177L2205r0454m9697P750N6445
16746C6336l4965J3138K953K5260k0433k280j0520m0433n05K6758Q8333L906r644
16733G7904o179K015r585Q343L4487o1835k4697n4271j6124o113M1475q247K5376
16720B549n0577k2939j2681M9772m968L434q610j5037k5793M6313J7217O6268
$$ y = [-64208, -75376, -26890, 13441, 48220, 56725, 68248, 73649, 48672, 68527, 131471, 129383, 106875, 65697, 85299, 50808, 66471, 6453, -7116, -47334, -41916, -37094, 2126, 62969, 35142, -32022, -74150, -90499, -58869, -72154, -70000, -54150, 3388, 46371, 9697, -39852, -99120, -29055, 26559, -11904, -20305, -40167, -30328, -47455, -63467, -33594, -32313, -10791, -5332, -18408, -13483, 62, 23339, -16135, -5090, 80087, 112292, 21838, -27859, -20109, 36336, 1371, 14509, 17462, 42722, 22289, 20009, 9489, -30944, -31449, -4691, 83642, 87548, 77904, 71725, 73740, 64155, 72498, 106985, 45150, 20453, -33818, -49942, -56055, -14580, -22827, 2549, -48028, -70967, -83648, -33876, -38844, -35410, -44020, -59057, -84850, -38537, -21320, 44948]
16708D4948k2567l7529M2001N6787j8398n2894o0560n3154J8642r893j0879L0023
16696g3473K3914O551K7562P7355l5811j1213L9905K934J1016o340k7405o505
16684B8490l2974m7689R90l916K1094l4233l4189K3755M703J6781j259L8100Q2861
16671F2514L6228k6348p8734j1083M9112m2147o4710K4748M5910k4626J4889L2078
16659A7831m7168r2032j324L7079P2218N665k2240o310N0811K2957Q413k9851
16647A6049l5734l4508l4783J9874M3968r293k6774J5698L798K2652j2491L5912
16635D368J679J8055m4660l7949K4044L9009J426L3577p2789o0472l3571n5907
16623a83190r397K6620J18599M8353j6723L5589p731m0102R857N2377j2020K1554
$$ y = [44948, 22381, -15148, 26853, 83640, 65242, 12348, -48212, -101366, -82724, -92617, -103496, -73473, -49559, -43008, -15446, 61909, 26098, 14885, 54790, 57724, 68740, 62400, 34995, 28490, -4484, -52173, -51183, -55099, -34005, -68238, -102427, -78672, -73969, -57188, -58447, -20347, 62514, 98742, 72394, -6340, -17423, 31689, -10458, -75168, -50420, -4510, -29136, -14247, 17831, -29337, -121369, -122693, -85614, -13396, -7731, -29971, -36281, 14530, 37487, 45900, 16049, -19685, -54193, -88976, -69102, -25134, -34427, -61201, -45503, -41705, -19053, -31544, 4368, 6047, 24102, -20558, -58507, -34463, 4546, 5972, 39549, -33240, -93712, -127283, -183190, -192587, -165967, -47368, 985, -15738, 19851, 12120, -27982, -18125, 34252, 22232, 43786]
16611D3786k1849k2774L3540K9777j4588n905l2080l1592J4028K5375p2008l1882
16599h6172K2645J4220K3301L0551O7285p231L8599K1926r6081l8759L9274L5415
16587F4973L3002K8759q730R256o7532k9560L2599K4365L2689k6303j6115k4754
16575E2649l383m583k1780L0118j6427j2273r302K8804o5509k5608k309o5493
16563a15096J9144L5431l0322J8086P9423J3068j9964m1535j3468L3196O7044
16552D5007j4992o2314l098J5584l0023P345O003M1831J5441n8438n347o7J4665
16539b8403J1520J3600m9987m5627K1671N1244M3509L8111l554n831J4118n8550
16527A821k6067L5749n4226k1136k5024j3952M4870L1762P967N275m5466k1568
$$ y = [43786, 21937, -837, 32703, 62480, 47892, 41987, 9907, -21685, -7657, 17718, -54290, -86172, -63527, -49307, -26006, 4545, 71830, 64599, 103198, 125124, 29043, -9716, 29558, 64973, 97975, 126734, 118004, 127260, 59728, 30168, 62767, 87132, 119821, 93518, 77403, 52649, 49266, 44683, 22903, 53021, 36594, 24321, 15019, 43823, -21686, -47294, -49603, -115096, -95952, -60521, -90843, -72757, 6666, 19734, -230, -41765, -55233, -22037, 45007, 30015, -32299, -35397, -19813, -49836, -42491, -36488, 5343, 20784, -37654, -43001, -43068, -28403, -16883, -3283, -53270, -98897, -77226, -25982, 17527, 55638, 52084, 46253, 60371, 1821, -24246, 11503, -42723, -63859, -88883, -102835, -57965, -26203, -18236, -12961, -58427, -79995]
16515g9995J7056P0932P1158J3800m8821o4405l9681p367l4004L8276M3605M6726
16503B7280q838L6457K9652k4869o6986j3209k1248n1003P0908P8284J4584j8241
16491E2771o0920l5289k1324l2320J7775O0324l539p653M4245K1500k6717n869
16479B984p5887K0867p044O3827J4188m3964n6749k1449J23597R7943n3813o1950
16467B550L8128J0235m4393j5260j5655L3710m703N2425J2817L8547o0161p3252
16455b5012m1981m0267J3169l896k6022N577P7099L6218L9719k4352J574O238
16443A8064Q393k1878k6984J0888M8106r829m181k1445j0357J6264K1473J3663
16431D2177l6518n2568K848r989j7164R787J777l9987K9023L9855P0736K9203
$$ y = [-79995, -62939, 7993, 79151, 92951, 44130, -20275, -59956, -67323, -101327, -63051, -19446, 27280, 18442, 54899, 84551, 59682, -7304, -20513, -41761, -92764, -21856, 56428, 71012, 52771, -8149, -43438, -64762, -97082, -79307, -18983, -22522, -30175, 14070, 35570, 8853, 2984, -72903, -52036, -59080, 4747, 18935, -25029, -81778, -103227, 20370, 118313, 64500, 2550, 40678, 50913, 6520, -8740, -24395, 9315, 4612, 57037, 69854, 108401, 48240, -25012, -66993, -107260, -94091, -97987, -124009, -118432, -41333, -5115, 34604, 10252, 11826, 18064, 26457, 4579, -22405, -11517, 36589, 26760, 22579, 1134, -9223, 7041, 28514, 42177, 5659, -46909, -44061, -54050, -71214, -61427, -59650, -99637, -70614, -30759, 39977, 69180]
16419F9180m6036k5298P182o308q188N5852k8300M406l8000l7912N7390L6823
16407D0791k6551l7194j3018J7615L4959l0727j7168J7068J156K8970L6900p1872
16395a9071j4787K8840j2456p58M30K833j0447K0881n23M5437O166k3743K667
16382B5469j5466N2948O8340J8095k7038l8319q9965r51J8001m239j3893j4226
16370b1244J8299o171m2955k5284j3976L4656M9979J806k2149j3184J3380L9112
16358A2269J1954o841j0917L6802o179M4427m7614o3178J6509K6403J7487L5J4216
16345D5373J9625m9426l7710P623O052O6578J307j7292l4544j9826M8315J9831
16333E5906m534q561P255m6325m2401O5971j9260l8534j6027n681K1515M207m8250
$$ y = [69180, 23144, -2154, 5028, -1280, -9468, 46384, 18084, 22490, -15510, -53422, 3968, 40791, 14240, -22954, -35972, -18357, 16602, -14125, -31293, -14225, -13069, 15901, 52801, -19071, -33858, -5018, -17474, -18232, -17802, -14969, -25416, -4535, -5058, 40379, 46545, 22802, 25469, 10003, 62951, 131291, 149386, 122348, 84029, -5936, -6887, 11114, 6875, -7018, -21244, -2945, -9116, -52071, -77355, -91331, -56675, -6696, -4890, -27039, -40223, -26843, 12269, 24223, 17382, 6465, 43267, 37088, 81515, 33901, -29277, -12768, 13635, 31122, 31157, 45373, 64998, 15572, -22138, -14515, -8463, 58115, 59422, 42130, 7586, -12240, 36075, 55906, 51372, 42811, 50066, 3741, -38660, 27311, 8051, -30483, -46510, -52191, -30676, -26469, -74719]
16320g4719o4634l670N4592P4530J4186j6433o5717m6148R7987P4075k3041m1618
16308b0610K5498k1347k3180P481J5336L4632K4301J9054R666k6358P268J9699
16296G1440j765l9199k3137r100M3407n329m97M3874J1358l9792k3937n7698k3436
16283e3811n407K4516k680L4932p820k4794O7253J7105r335j649O121Q314K315
16270E5060m169M9187J9360j7282k4489k1499K13p9258k850N1362j4182N0493
16258F1946m9593l9303K662K4862L3309l9124n913P3274j47l2368k3840n1044
16246d5279m3704J2014J458O4846L1804L6837r459l5644n889K2507p8302O408
16234d2403O1304M6705L6l1321N1652m0670k1615N2163L5260J2474l4099l5346
$$ y = [-74719, -139353, -143023, -88431, -13901, 285, -16148, -81865, -128013, -30026, 44049, 21008, -20610, 4888, -16459, -39639, -32158, -16822, 17810, 42111, 61165, 70831, 44473, 51741, 71440, 69675, 30476, 7339, -1761, 41646, 36317, 35820, 79694, 91052, 51260, 27323, -30375, -53811, -59218, -34702, -37382, -2450, -10270, -35064, 32189, 49294, 39959, 38310, 44431, 52745, 55060, 50891, 100078, 119438, 102156, 77667, 56168, 56381, -22877, -25727, 25635, 11453, 61946, 12353, -26950, -24288, 574, 33883, -5241, -11154, 62120, 61973, 29605, 5765, -45279, -88983, -76969, -75511, -10665, 21139, 57976, 48517, 12873, 6984, 29491, -48811, -42403, 18901, 65606, 65642, 34321, 85973, 45303, 23688, 75851, 111111, 123585, 89486, 54140]
16222E4140p861n2222k8475o774J3752Q1131K4691r6471p3571l8933K5032L961
16210a01600K9344j0768r268K6426J9938L4393K2419l5106K279J7936N0745O5245
16198A11983q97k1835m1126J504N2557K2434M299m2223j7787J2809k6932j6953
16186C7833j9016l0363J7818k0786M7611k9529k2788K5251K6531k4500k4347j0307
16174b6592p731q704K175j311L0417k1738n216m564L1909M2905R162l9256l1496
16161c0040L5847k0595J1706k1832k2543j3912p648q961L9634N7836J641o7976
16149d6843r71Q871m9734L0J9490k5526R906M7083K293M9362L1407k4039k1328
16136Ak567N3134j5172j9873o095K9805M580m9711n2371J7561L6571M8200L4029
$$ y = [54140, 46279, -5943, -34418, -41192, -27440, 53691, 78382, -18089, -91660, -130593, -105561, -101600, -72256, -83024, -92292, -65866, -45928, -11535, 10884, -24222, -21943, -4007, 46738, 111983, 111086, 89251, 48125, 49629, 102186, 124620, 128919, 86696, 68909, 81718, 54786, 37833, 18817, -11546, 6272, -14514, 33097, 3568, -19220, 6031, 32562, 8062, -16285, -26592, -34323, -43027, -40852, -42163, -11746, -33484, -38700, -43264, -11355, 31550, 40712, 1456, -30040, 5807, -14788, -3082, -24914, -47457, -61369, -69017, -77978, -38344, 19492, 21133, -46843, -47814, -38943, -88677, -88647, -69157, -94683, -84777, -37694, -35401, 13961, 45368, 21329, 1, -2566, 50568, 35396, 15523, 9428, 39233, 43813, -5898, -58269, -40708, -4137, 44063, 78092]
16123G8092K8653J1410j4765p6733o9164K2251N5427m8096p582K7825k6903J6240
16111c345L4454k8967K430K1378k5865J4312J4753j7057l3796L3015M2247m4740
16099H819n08P4531O4610r7572l4082k981l2281J0000N9852R383l0102l6740J9254
16086A2183k4343n5003k258N0109K4193j489j6766j1067j9410j3984M7129N5197
16074D4491j0454k7130j5008k8680n7416J8227L6438J0203K2088L3194k4347m4108
16062d2502l0106M7270j507J7157k2485K8804L6368Q689o0075J2253J5018j4274
16050e390L3490R104L7769q836p2031l6848M864J7554J4086j0382J2273k2860
16038b7207l919M6017q181m5305N314Q375Q901k5353l6450M3266R628k4205m6426
$$ y = [78092, 106745, 118155, 103390, 26657, -42507, -20256, 35171, -12925, -20507, 7318, -19585, -3345, 31109, 2142, 4572, 25950, 85, 14397, 29150, 12093, -21703, 11312, 53559, 8819, 8311, 82842, 147452, 49880, 15798, 12817, -19464, -9464, 50388, 59771, 29669, -7071, 12183, -12160, -67163, -69421, -19312, 4881, 3392, -13374, -24441, -43851, -57835, -10706, 44491, 34037, 6907, -8101, -36781, -94197, -75970, -39532, -29329, -7241, 25953, 1606, -42502, -72608, -25338, -26845, -9688, -32173, -3369, 32999, 41688, -18387, -6134, 8884, -5390, 28100, 37204, 74973, 66137, -5894, -42742, -37878, -20324, -6238, -16620, -4347, -27207, -31126, 14891, 6710, -38595, -33281, -24906, -16005, -41358, -77808, -34542, -24914, -49119, -95545]
16025i5545K8090J07766K3563k0804q1071m572R655M12k5533L9922l3923J0528
16013d1512K4974m3452J6165k1494K0188L3770l2292J1768N5556j7457j4505j4247
16001b2538j548J14561J3566m9672K2705l8391n604M2815J0696j664m884q0833
15989g91l2419J8445m3442n2891P994N3747K3676l2912k3562L7049k567k4354
15977g2027Q6851K3201L871q383l1669j8308N675J0270j5950l1515M4375N4971
15965E1362o2900k2534j3897j0799J8663r829l0291O063M4642L498J1153M1918
15953B7049n2445K7574K7268n4510M71k0847j6256j1042M858P27J5958N464l3709
15940g9440l5812N0862M0901J7828j0243J7054k8046j9716J8211J8961m662J1456
$$ y = [-95545, -67455, 40311, 63874, 43070, -38001, -42573, -32918, -32506, -58039, -18117, -52040, -41512, -16538, -59990, -43825, -65319, -45131, -11361, -43653, -31885, 23671, 6214, -8291, -22538, -24086, 90475, 104041, 54369, 77074, 38683, 33079, 75894, 86590, 84926, 80042, -791, -33210, -14765, -58207, -111098, -103104, -49357, -25681, -58593, -82155, -45106, -47673, -72027, 14824, 38025, 41896, 33513, 1844, -16464, -10789, -519, -16469, -47984, -3609, 51362, -11538, -34072, -47969, -58768, -40105, -49934, -80225, -74162, -29520, -26022, -14869, 27049, -25396, 2178, 29446, -25064, -24593, -45440, -61696, -72738, -67880, -67153, -51195, -45731, -79440, -115252, -64390, -23489, -5661, -15904, 1150, -26896, -46612, -28401, -9440, -14102, -2646]
15928b646Q4674r035j7034J8560L2650m4924n2602k7424k4781l1888p900L5763
15916d6587J00009J5910o8536J0562K2010l3874m6358O4618M7124P1498J7461
15905A53837o6523m1237m3134o1033r041M5837M4242j037m6782n8044J6638L208
15893f3069K6933O3855m8048k8622k0169J7341K4072j6749J141L851k3127l4526
15881i7117L5618L2444M507J6854R614J376k3167m4333J8471k4043j1326K5475
15869e5627M9406M8740m0907k7620M0367M4435k7032j7083k09p1018o9743l1019
15857a57310K7919j831K3896N1262M145k0560o564j5643K996N1480O3829K3076
15845D6695l3989J4920K023o1996M7810P7919k7254O528l4638p1405L3962J5317
$$ y = [-2646, 82028, 72993, 55959, 74519, 107169, 62245, 9643, -17781, -42562, -74450, -82350, -46587, 53422, 69332, 796, 11358, 33368, -506, -46864, 17754, 64878, 136376, 153837, 87314, 46077, 2943, -58090, -67131, -21294, 22948, 21911, -24871, -82915, -66277, -63069, -36136, 27719, -20329, -48951, -69120, -51779, -27707, -44456, -43315, -39464, -62591, -97117, -61499, -29055, -24548, -7694, 1920, 3296, -19871, -64204, -45733, -69776, -81102, -55627, -6221, 42519, 1612, -26008, 14359, 58794, 31762, 14679, 14470, -56548, -126291, -157310, -129391, -131222, -107326, -56064, -51919, -72479, -79043, -94686, -91690, -40210, 23619, 46695, 12706, 27626, 29649, -32347, 15463, 93382, 66128, 72656, 38018, -33387, 575, 15892]
15833A5892k0649N8881Q2488n631m3351m4991k2910K4580M5940k7566o6386k2118
15821b5821J8921J3808K7074L5820q898J7899Q9218l7736o3185l6679l2916k7504
15809b9999L1965j8042j5015n006j6318n1648K1622k2096O2384P1349l7352k8068
15797c6224j0968O830J4653q337r127j2930K2256K1216l8095o0289L7042K6388
15785d7585J2019L439K2499j1699k6163J7497k4529N5360P2540J0695K4304l0340
15773G8037j2001N5952r1751l4775o035n2350k075k82N8631K4499L856j3413k1390
15760a3097L093K3136L1883N8176l4093o2398K6309K9508L153k5539l4014j17693
15748a11576j607P6046N0604k7858l2724L7689J3829n4447j2315K184R197n8335
$$ y = [15892, -4757, 54124, 136612, 130981, 87630, 42639, 19729, 44309, 90249, 62683, -3703, -25821, -6900, 6908, 33982, 69802, 60904, 78803, 168021, 130285, 67100, 30421, -2495, -29999, 1966, -16076, -31091, -36097, -52415, -104063, -82441, -104537, -42153, 29196, -8156, -36224, -47192, -40362, -25709, -34046, -43173, -56103, -33847, -12631, -50726, -111015, -73973, -47585, -35566, -32127, -9628, -21327, -47490, -29993, -54522, 838, 73378, 84073, 108377, 78037, 66036, 121988, 30237, -4538, -10573, -62923, -64998, -65280, -6649, 17850, 21706, 8293, -13097, -10004, 13132, 45015, 103191, 69098, 6700, 33009, 62517, 65670, 40131, 6117, -111576, -113183, -37137, 13467, -14391, -47115, -9426, 4403, -50044, -62359, -60175, -50978, -109313]
15736a09313m3579N4518K1323K1355J7115M3783J0145K9924j027o3733j0208O2999
15724C3302N8313k1099j6701k4879k4911j356k7734L37J9138M1006L6858J8128
15712I0402l3253p3017k4741M3297N0125j4350j0129k9614p2818J0809Q879o091
15700f0501n643J2822k2933M0722K5850K011J0487N7146j6822o573k9104K3874
15688C1336L7686k3918N1035k4106n6895m492j7485J999n4239K5537Nj491l1589
15675f6617k2494k4259N2941Q571q120j369J778K4721p829R667P181k3496K7511
15662b1814L8678l6515j2590k8039M556K6423J4268o1079o7782R2894M4204l8312
15650d5108j7448j8811O4796K7207J3031J5233O449J3613J5974m0330r4880j2544
$$ y = [-109313, -152892, -98374, -77051, -55696, -38581, 5202, 15347, 45271, 44244, -19489, -29697, 33302, 91615, 70516, 53815, 28936, 4025, 2669, -25065, -24728, -5590, 35416, 72274, 90402, 57149, -15868, -40609, 2688, 52813, 38463, 28334, -1280, -74098, -63289, -54410, -60501, -66144, -53322, -76255, -35533, -9683, -7672, 2815, 59961, 43139, 36566, 7462, 31336, 69022, 45104, 96139, 72033, 15138, 10646, -6839, -4840, -59079, -33542, -33537, -35028, -66617, -89111, -113370, -60429, -51858, -59978, -61347, -59569, -34848, -42677, -33010, -25829, -49325, -21814, 16864, -19651, -32241, -60280, -55724, -29301, -15033, -76112, -143894, -51000, -6796, -45108, -62556, -81367, -16571, 10636, 23667, 38900, 45349, 58962, 74936, 34606, -60274, -72818]
15638g2818J001l7431O015K2341O1430j3494j9158K987N5005J1196J2802Q04n510
15625B5170M8424m152n335M6754l988J8537p9450q0916M0785k335n7999K0673
15613c3832k3385m7388j1764Q0465M1491J3106N7726K0585n7310j6290k1736n4101
15601e2433m3445L0884R3338J5423Q925o4442o0799M3087K1432J5037j1934j4684
15589a9611J4917k192k2319K727L4167Q339n4229n2184l3241R661K1073L2807
15577f0085L6809M3818l8761m5026P508L4261J5723J8866Q4189J2888p4210o4833
15565b8853Q755J0054k2671k1646n402q689l5995R344L8979l631L326Q38N7143
15552A552P1621l1987n7500l0105R478Q2417n4538q7597L0404M5411j7330m0513
$$ y = [-72818, -71817, -109248, -103233, -80892, -19462, -32956, -52114, -49127, 5878, 17074, 29876, 30680, 25170, 73594, 69442, 64107, 110861, 106873, 125410, 45960, -34956, 5829, 3494, -54505, -33832, -57217, -104605, -116369, -35904, 5587, 18693, 76419, 97004, 39694, 23404, 1668, -52433, -95878, -64994, 28344, 43767, 52692, -11750, -72549, -29462, -8030, 7007, -4927, -19611, -4694, -6886, -29205, -26478, 7689, 16028, -38201, -90385, -123626, -113965, -92892, -60085, -23276, 20542, -18219, -63245, -55737, -21476, -5753, 13113, 97302, 110190, 35980, -28853, -20098, -10044, -32715, -54361, -59763, -68452, -104447, -95103, -56124, -59755, -56429, -55591, 1552, 73173, 41186, -16314, -46419, -36941, 45476, -9062, -96659, -66255, -20844, -38174, -78687]
15540g8687k7667L0201M2662R1264m7587r125r8317n1361P061O9334L7817Q1002
15528D6597J9378k9985m8728m3140l6707r118L1238K3773J0336k331q213k3471
15516g0371m260l3866M9093M4183Q466r972J1576o887J6932n4803k1712p827m2951
15503a22399k4969R2101J2719o425Q775Q919m913N8232L8841k2467r771R064m3948
15490f241k1998J05400M2692m9159q1530K011J4786R849l3488m178J6357k6527
15478c2026k1129K0257L1483k5536n9314O4130N5003j4322M445K4642K3348L5168
15466A06149j9936q4587q700j8180K4173P76k3562L1196K750q813l9439l9044
15454g7217q811K5864J4361R323k4548R183j9645k404j0440L9162N9475r850k9631
$$ y = [-78687, -106354, -76153, -33491, 57773, 10186, 1061, -97256, -148617, -141556, -72222, -34405, 46597, 65975, 35990, -12738, -55878, -92585, -101703, -70465, -46692, -36356, -38687, -46900, -70371, -74631, -108497, -59404, -15221, -6755, -16727, -5151, -12038, 4894, -49909, -71621, -79448, -122399, -147368, -55267, -42548, -48973, -40198, -31279, -36192, 22040, 60881, 38414, 28643, 37707, -6241, -28239, 77161, 119853, 70694, -10836, -8825, 5961, 15810, -17678, -21856, -5499, -32026, -53155, -32898, -1415, -26951, -86265, -22135, 32868, 18546, 22991, 47633, 70981, 106149, 86213, 1626, -7074, -25254, -1081, -305, -23867, 7329, 10079, 1266, -38173, -77217, -86028, -60164, -45803, -36480, -61028, -51845, -71490, -73894, -84334, -45172, 14303, 4453, -25178]
15441b5178l5517l1639L3053M9040l1937N1373N5504K6814j00974j0350k734K9933
15429G388M3041J2954m106k326o5706J7357j2347J6959k1461p1869K9111L1323
15417a9682J2655K730k0635l8301j1893K0296J1354J2547J4464J8293k1208J0462
15405h918k520k8943M748L2707K6380j3409o1867k8319J1413m1467k3651Q0034
15393e3812L3321K2769L4729M8242j2238l1954N31p200J7631m4083J108K1047
15381C0091r220j7488L6328O4404M7635P132l2612m1493o4868J4788K1103K2710
15369G8510k9697o4141m2963O013m8516l8599O6222P3264n5359J138l3134n0713
15357a37975m918M4025N8822Q5800J8332j5722L064J570n2796n617Q032k0473
$$ y = [-25178, -60695, -92334, -59281, -10241, -42178, 9195, 64699, 91513, -9461, -19811, -22545, 7388, 50429, 63383, 59277, 56951, -8755, 8602, -3745, 13214, -8247, -80116, -51005, -19682, -7027, -4297, -24932, -63233, -75126, -54830, -43476, -30929, -16465, 1828, -19380, -8918, -11438, -40381, -35633, -2926, 23454, 10045, -51822, -80141, -68728, -110195, -133846, -53812, -20491, 2278, 37007, 85249, 73011, 41057, 41588, 34388, 52019, 7936, 9044, 30091, 20871, 3383, 39711, 104115, 151750, 158882, 126270, 84777, 19909, 34697, 55800, 78510, 48813, -15328, -58291, -52278, -100794, -139393, -73171, 93, -55266, -54128, -87262, -137975, -142893, -98868, -40046, 45754, 64086, 48364, 51428, 52998, 202, -5415, 2617, -17856]
15345a7856p262K0826L2010k2772n4069J747p496J6486J5749L1770K124j3822
15333b565L930R286K210M5477J6803k7128m3959l7568J3865j0884N0149k1342
15321a726m377N5094M0632K0397k1386j6585m5573K8561L5828k7742r6324l3175
15309f6376Q1338O6249l7089m4007k8806n148K3160m1254j1251K3202J101j5579
15297e4460L809k5320k9860L8917P0372J4417p9920o619K973L9089K8716p131
15285e017M3103m926l3895l3088J145k0848M609N7007j6644j2237j7351k8045
15273f6187L3557J4863R534J1272k4439j7335j6566K0641p114l4865L9733O3565
15261B6659l2413k7103J2674L7956L0344p6429P971J9726L8655k9736o5725K9480
$$ y = [-17856, -25118, -4292, 27718, 4946, -49123, -47376, -54872, -38386, -22637, 9133, 11257, -2565, 1365, 10651, 12861, 58338, 75141, 48013, 4054, -33514, -19649, -30533, 19616, -1726, -6103, 48991, 89623, 110020, 88634, 72049, 26476, 55037, 90865, 63123, -33201, -66376, 14962, 81211, 44122, 115, -28691, -33839, -10679, -51933, -63184, -39982, -38881, -54460, -50651, -75971, -105831, -66914, 3458, 17875, -62045, -68664, -65691, -26602, 2114, -5017, 38086, 33160, -735, -33823, -32678, -53526, -48917, 8090, -8554, -20791, -38142, -66187, -32630, -17767, -8233, 3039, -21400, -38735, -55301, -34660, -41774, -76639, -36906, 26659, -5754, -32857, -20183, 17773, 48117, -28312, -20341, -615, 38040, 8304, -57421, -27941]
15249b7941J8901M6446l474k6235m9862K667p043p8722J1090N8760O2418j2515
15237e510k9746l80m7168q713Q1073k2285N981K7177k0673J4149K4129l2772J3396
15224a342j6205K7469K1978N792J7901k5412J6169K624m089l0155k5922m90P8442
15211F6760j1789q459l0509k6547J8540Q406o1756m3932M0832M4963Q208l7829
15199c3112r75L5956n9513j3797N4159r927j2405M547M5192k6387l466j4115L1957
15186a886M2181N7691K4710j5350l8309r9937J073P1616K3939J3747n6374n0127
15174b7026n6996n012M4761L0546M5317n5484o2648o405N1655M3827k9756k9038
15162e6259L83L2560R4770J1279l5691K3364K3362l092l6487p878J6948l8608
$$ y = [-27941, -9040, 37406, 33932, 7697, -42165, -39498, -46541, -125263, -114173, -55413, 7005, -5510, -35256, -35636, -82804, -91517, -10444, -32729, -26748, 429, -20244, -6095, 18034, -14738, -1342, -17547, 9922, 31900, 37692, 55593, 30181, 46350, 48974, 44885, 14730, -11192, -11682, 66760, 54971, 46512, 16003, -10544, 7996, 16402, -45354, -89286, -48454, -3491, 4717, -33112, -34087, 1869, -57644, -71441, -17282, -27209, -39614, -35067, 10125, -16262, -19728, -33843, -1886, 40295, 97986, 122696, 107346, 69037, -30900, -29827, 41789, 65728, 79475, 23101, -27026, -84022, -89034, -44273, -13727, 31590, -23894, -86542, -92947, -41292, 2535, -27221, -56259, -55876, -23316, 71454, 82733, 47042, 70406, 93768, 90676, 54189, 46311, 63259, 24651]
15150B4651r854L4449O288o2876K2470m8819K8012M6598L7212j0814l9431K5941
15138E3827J4882m0011m6093M0966L9500j2547L590q72q1686l0320J8391o584
15126d6957j2552L110J7580N2627L8734o0246o1887J7137R5455L0527j5825l6510
15114B1193J9243k9508j4564l4782m2839J7203M7731M604l7432k8746p3181p4565
15102b25643N204P4680J0782N150O9026N7098n4667k0394j0951M2764M8334K1206
15090B2589K7021j3677k5403l0380l1849J9453P302l7452k0398k1390L497P3955
15078b6732j6275k5565J9712N4382L9828O1767Q103K7712n0512l0491Q015k8774
15066D1170O8260k416m491n8586m9468N1927K2327k9806j1291J7558k9610l2017
$$ y = [24651, 14797, 49246, 55534, -7342, 15128, -33691, -5679, 40919, 78131, 67317, 27886, 53827, 68709, 28698, -17395, 23571, 63071, 50524, 54114, 53242, -28444, -58764, -40373, -46957, -59509, -56399, -38819, 13808, 52542, -7704, -69591, -52454, 43001, 73528, 57703, 21193, 40436, 10928, -3636, -38418, -81257, -64054, -16323, -11719, -49151, -77897, -151078, -225643, -220439, -145759, -134977, -129827, -60801, -3703, -58370, -78764, -89715, -46951, 1383, 22589, 49610, 35933, 10530, -19850, -51699, -32246, -24944, -62396, -82794, -104184, -100687, -26732, -43007, -68572, -48860, 5522, 45350, 107117, 115220, 142932, 92420, 61929, 69944, 41170, 109430, 107014, 102523, 43937, -5531, 46396, 68723, 38917, 27626, 45184, 15574, -16443]
15054a6443J518q589R665J1677k927j0946R721M9398O326n650K3832L3366n9092
15041D1856q990L2624m1066K4338L6495j7485l9886m7817j5833j2737m0606k9771
15029a18878M8622J22534L4815l2280l9159M6097K6407l2107k1456K7328m2371
15018A9552l7133O3795L0636k747L6563J5514q2j3841r6580m9078l7146R417K2505
15005c8625k8182K3967J5781O27L7841M7179K11n6716j3649M1260q87J39l174
14992B5772q1039J2192L3967L2787O0374r2303l3406o6272q187P0841N4394k5889
14980a6769k5729q430r485L1738n6m655Q9567L9448l5496o7842l1878N1654J727
14967A3794r070L4976j4478k7657j0159k1103P7640Q1064k9855n6265m312j8285
$$ y = [-16443, -14925, -23514, -13849, -2172, -5099, -16045, -6324, 43074, 49400, 43750, 67582, 100948, 41856, 32866, 65490, 24424, 48762, 85257, 67772, 27886, -19931, -35764, -48501, -89107, -118878, -70256, 52278, 87093, 54813, 15654, 61751, 88158, 56051, 34595, 61923, 19552, -17581, 46214, 76850, 74103, 110666, 126180, 126098, 112257, 15677, -33401, -70547, -61130, -38625, -66807, -42840, -27059, -26432, 11409, 58588, 58799, 2083, -11566, 29694, 28807, 28946, 25772, -55267, -43075, -9108, 23679, 84053, -8250, -41656, -107928, -116115, -45274, 9120, -16769, -42498, -50928, -60413, -28675, -28731, -33386, 56181, 95629, 60133, -7709, -39587, 12067, 13794, 4724, 39700, 25222, -2435, -12594, -33697, 43943, 125007, 95152, 38887, 34575, 16290]
14955A6290r3934L7433O2140J665k094k4886K0736M6936J4732K9417L1494l8167
14943A01762j8853R326m2364q6853k3995J7070m132q436J2181l2690n3065l0997
14931a61046M2768N2919M5167p888j749p382J5948k0297k3047J1064L7001N8379
14919D1837J620m3009O387J1998j2912q435k284j9949o2760L2341P9451l4455
14907a0170k7440J2534k2173k4207j8536O2767K0132n818L0355K908k920m4075
14895b6643j6366O0299K7903O646m7238j1826J1175l5964J4631K4196M116n024
14883E905N6891j917k2931l937j411q9999l8902O1589l651K3599M9328J4519l5911
14870A3172j0034K9394j2033l0703K1790L2153N0654j6956k5807j5079P585O107
$$ y = [16290, -77644, -40211, 21929, 23594, 21500, -3386, 17350, 64286, 79018, 108435, 139929, 101762, 82909, 92235, 49871, -36982, -60977, -43907, -48039, -56475, -44294, -76984, -130049, -161046, -118278, -65359, -20192, -28080, -29829, -37211, -21263, -41560, -64607, -53543, -16542, 41837, 43457, 448, 6835, 18833, 5921, -2514, -4798, -24747, -87507, -55166, 24285, -10170, -37610, -25076, -47249, -71456, -89992, -27225, -7093, -12911, 17444, 20352, 17432, -26643, -43009, 17290, 45193, 51839, 4601, -7225, 3950, -32014, -17383, 6813, 10929, 5905, 62796, 60879, 37948, 34011, 32600, -57399, -96301, -34712, -38363, -14764, 34564, 49083, 13172, 3138, 32532, 20499, -10204, 11586, 43739, 94393, 77437, 51630, 36551, 44136, 50243]
14858E0243j0801M8359p064j6803q1508n6524K9869j1514Q60m228J8971M0713
14846E73L6222l6504m7996L253K5281M2915N0036j603n8998j4733M7704K1441
14834F7591l5403k7397l5551Q532M8862L3098k9749q1484j9637j6966K3013M0193
14822b4898N5245q164J9345m6872n7525L1401K4041m163K3350m1790N7540K2437
14810D9947K1574o1102J3793j7979M0161J5827K276j4486j4277m2371O94l2671
14798c8614l4666k346P9311j6697o528J0094K6202q81N3558M3086l7698q0213
14786e392N188L1762j198m1146j0806K2616P642n0210l1193p380k5202o257j8198
14773a29774O9946K8927L5391n5287n6852L6947N9744l7725k2742j4466l408K1598
$$ y = [50243, 39442, 87801, 80737, 63934, -17574, -74098, -44229, -55743, -54883, -59111, -40140, 573, 36795, 291, -47705, -44452, -19171, 23744, 73780, 72177, 13179, -1554, 46150, 67591, 32188, 4791, -30760, -22228, 26634, 59732, 29983, -51501, -71138, -88104, -65091, -24898, 30347, 22183, 41528, -5344, -62869, -31468, -7427, -11590, 11760, -30030, 27510, 49947, 71521, 10419, 24212, 6233, 46394, 62221, 64497, 50011, 35734, -6637, -5943, -38614, -73280, -75626, 3685, -13012, -19540, -9446, 16756, 15875, 69433, 112519, 74821, -5392, -204, 31558, 30360, -10786, -21592, 1024, 8666, -41544, -72737, -80117, -105319, -111576, -129774, -59828, -30901, 4490, -50797, -107649, -70702, -10958, -48683, -71425, -85891, -89299, -67701]
14761f7701j2080j789K5993M3726K3249J0086j1163l4492n6796N157j4316n531
14749i5657K0236K2677k3919k7916M9184P6394J456m3188R640j3109l3733J3006
14737d4929o300k9354k4996K3084L8709k0792l134J0524L870O5199j2206k448
14725b773J6974j0227J0300J9796m8386P913o0374l1760J3736L8524R7673J8549
14713F9945p4989p6555n0037J7369P6181L1887J1964Q088n1885K3014J2220M8260
14701D5462L2165j0921l9853n3779p385p196l2975K1921O3037k0826J258L6368
14689B7276K4330k5906l9532p4872k5504N0800O7613O8298J15j8679m753o1055
14677a1869q1817L5560n143k2276K9312L0230K2427J3966n09J0861m8208N9168
$$ y = [-67701, -79781, -81570, -55577, -11851, 11398, 21484, 10321, -24171, -80967, -75810, -90126, -95657, -75421, -52744, -76663, -104579, -55395, 20999, 22455, -20733, -11093, -24202, -57935, -44929, -51229, -80583, -105579, -82495, -43786, -64578, -67712, -57188, -53318, 11881, -325, -2773, 14201, 3974, 14274, 34070, -14316, -6403, -66777, -98537, -84801, -46277, 51396, 69945, -5044, -81599, -131636, -114267, -38086, -6199, 5765, 13853, -38032, -15018, -2798, 45462, 77627, 66706, 26853, -26926, -34311, -41507, -74482, -52561, 10476, -10350, -9092, 27276, 51606, 25700, -13832, -88704, -114208, -63408, 4205, 72503, 72618, 53939, 49186, -11869, -93686, -58126, -63269, -85545, -56233, -26003, -3576, 10390, 9881, 20742, -27466, 31702]
14665C1702o787k4344m5629M022L4879P3876j6905j04010J9489P1287K1559j2844
14653D6295m6781L6154m17o2546n871N4585J0694r460q763q610m4606J8436j8169
14640c9059j679J5419j0468L8726M3007n1953K9606J2699K215k5478o420j7216
14628a0601o8410J9346J5952k2738j1569L0686J8797k478L2430M0097J1431K9343
14616H2286l6839j9537l56p9893o1553L1093J8403j3115j3140Q0400P6126N688
14604F9563m1555m9049n1681N3458N894J6971J7201J0j0028l207n2381P0500J6095
14591D1791l3787L2846L5629N7312l3075l3506k8860m1045j2759K7148k0136K6006
14579A7564L9764l2406o9124j4685K1345j78q210j3590K016k3197L3051P2605
$$ y = [31702, 24915, 571, -45058, -41036, -6157, 67719, 50814, -53196, -33707, 37580, 59139, 46295, -486, 35668, 35251, -27295, -33166, 21419, 32113, 22653, 13890, 5280, -39326, -20890, -39059, -40738, -25319, -35787, 2939, 45946, -6007, 23599, 36298, 38513, 13035, 6615, -10601, -79011, -59665, -43713, -66451, -78020, -47334, -28537, -31015, 1415, 41512, 52943, 82286, 45447, 25910, 25554, -54339, -115892, -84799, -66396, -79511, -92651, -12251, 63875, 69563, 28008, -21041, -72722, -19264, -13370, 3601, 20802, 20812, 10784, 7577, -44804, 25696, 41791, 8004, 40850, 76479, 133791, 100716, 67210, 38350, -2695, -15454, 11694, -8442, 17564, 57328, 24922, -44202, -58887, -37542, -37720, -45930, -59520, -57504, -80701, -47650, 24955]
14567B4955j9496K1603l1505k8363j9029k7741O3760O7728k9107L443N2932r254
14555F9926q608p3640L7234R358o7759k0689J7018K6769l4983J1527O5112Q0897
14543A12162K5327J310k9672l0983j6521j0378J1329n145n25j6324o806j0145
14531B3629m3194O902J5207o7262L4253M8537l346l3177m3094j8133P919p431
14519g9190K0309n703M3949K5397K3509m1353q3824o0387k8985N5392P0145O078
14507e4663K7614K5883O165J8370k3702k9904r718m8987k9161K9315M7761M1008
14495a9j7148n6659K8661K1870M940M3613O5680l5698p609J2052R824l8364l4697
14482c554l1035k8062K8706L9442J6505m4081l0125M5541j9991M5396N2894m0896
$$ y = [24955, 5459, 27062, -4443, -32806, -51835, -79576, -15816, 51912, 22805, 26248, 79180, 69926, 61318, -12322, 24912, 34270, -33489, -54178, -37160, -10391, -45374, -33847, 31265, 112162, 137489, 138799, 109127, 78144, 61623, 51245, 62574, 57429, 56904, 40580, 33774, 23629, -19565, -12663, 2544, -64718, -30465, 18072, 14726, -18451, -61545, -79678, -71759, -79190, -58881, -64584, -20635, 4762, 28271, -13082, -96906, -157293, -186278, -130886, -60741, -54663, -27049, -1166, 4999, 23369, -333, -30237, -39955, -88942, -118103, -88788, -41027, -19, -17167, -73826, -45165, -23295, -18355, 25258, 90938, 55240, 47631, 59683, 69507, 31143, -3554, -34589, -62651, -33945, 5497, 22002, -22079, -52204, -6663, -26654, 18742, 71636, 30740]
14470C0740n9881J1483L8657M4615j6775n7100j1200k3007P547l1618k8794J9334
14458g5999n818J1451N5562J3042J4429O4179p488j1397K322m2732P057R716L117
14445C7441K748k0378Q8165K942o6440p692q413k9270j3607l0185N0904j0330
14433d115o3883k7127n615J9149K3683j3219L7973J8438l4696K6637N0637q180
14421A9682o0944p832l275j9547m9847l8340K6718L0913L8236P7390N5448R68
14409F9570j2049k8053j9298K0976l0675k2714Q369P870j9831p761J4132j2272
14397c1736K0683K9917j1358J2200l7003k8178j2471M099J05817J1273n8928l6188
14385c1873L869j9034j1949L2525P5443L0202q186J739n750l9943l4041o6159
$$ y = [30740, -29141, -17658, 20999, 65614, 48839, -8261, -19461, -42468, -34921, -66539, -95333, -75999, -81817, -70366, -14804, -1762, 12667, 76846, 69358, 57961, 60283, 17551, 24608, 34324, 37441, 40189, 19811, 107976, 110918, 44478, 36786, 28373, -897, -14504, -44689, 6215, -4115, -67998, -95125, -100740, -81591, -57908, -71127, -33154, -14716, -49412, -22775, 27862, 19682, -41262, -49094, -52369, -71916, -121763, -160103, -133385, -102472, -64236, 13154, 68602, 69570, 57521, 29468, 10170, 31146, 471, -22243, -13874, -6004, -25835, -33596, -19464, -31736, -11053, 18864, 7506, 19706, -17297, -45475, -57946, -53847, 51970, 63243, 4315, -31873, -28004, -47038, -58987, -26462, 48981, 79183, 70997, 72736, 66986, 27043, -6998, -73157]
14373g3157j7525k2163M1940L5501L9206k4150J0207L2889M64O330n0183K693
14361a7948l3700J8485N8503J3560o809j2955o156j6979k7281N2451M645j8953
14349F863k2831J1142n5022l5854Q1701M0355k6097m963j5103k2360j4049L2302
14337b3916M3395J9198K0057q862k4453j1256L73r709q2375j2453P0757L1472
14325A2228K5426j2139l8430k5348K4078J3833M5745J5216n682r732j6547n9180
14313c0532L188k6201m6575M980K1809K5784M4167l2261j435J6952J1947Q132
14301d5q577m4161n9937l6652O4890j8072O665P3761M5070j4772J2128r886k7258
14288a6846k8851n1758j9269K3183K8882L1003n1927J3632P4987J6975j1398p5452
$$ y = [-73157, -90682, -112845, -70905, -35404, 3802, -20348, -10141, 22748, 23212, 29542, -20641, -17948, -51648, -33163, 25340, 38900, 32091, 19136, 12980, -3999, -31280, 21171, 25816, 6863, -15968, -4826, -59848, -95702, -14001, 26354, 257, -4706, -19809, -42169, -56218, -23916, 19479, 38677, 58734, 49872, 25419, 14163, 14536, 4827, -77548, -90001, -19244, 12228, 37654, 25515, -12915, -38263, -14185, -352, 45393, 60609, 54927, 45195, 28648, -30532, -27344, -53545, -100120, -95140, -73331, -47547, -3380, -35641, -37076, -20124, -8177, -45, -8622, -52783, -112720, -149372, -84482, -102554, -95889, -22128, 22942, 8170, 20298, 10412, -16846, -45697, -97455, -116724, -93541, -64659, -33656, -85583, -71951, 3036, 20011, 8613, -66839]
14276f6839J3689K4913j5997l7166n8186L4036N1555N7996K4827L5766l3020r5313
14264f3739O50L8160K24J7738k5648k1370M0345M6488m1910n9291J9294J05278
14252E6219K200j3081m4370j6607J0397K0550k3437j5693j621m0329J5503P1347
14240B1078K9421n2526p7456k3357P150J2998L4878j7271L757K4923K7967q2707
14228i1145o3035O1258L8109K1023M396J7590j5992O753l0164l5743j8043J149
14216a03844r518O386O4894P114L2168K5775j1196j8465n1769J7945k0183n2253
14204a12946M0137J8796M7798r4L8102l9359m1174m8234k4397J3102N6502O611
14192d5156l9052K6264j2363N689j7932K0299q741N755J6405J6327J7834Q939
$$ y = [-66839, -53150, -28237, -44234, -81400, -139586, -105550, -53995, 4001, 28828, 64594, 31574, -63739, -63089, -24929, -24705, -6967, -32615, -53985, -13640, 32848, -9062, -68353, -49059, 56219, 58419, 45338, 968, -15639, -5242, 15308, -8129, -23822, -25443, -65772, -50269, 21078, 50499, -2027, -79483, -102840, -95690, -82692, -47814, -65085, -61328, -36405, -8438, -91145, -154180, -92922, -54813, -33790, -29394, -11804, -27796, -21043, -51207, -86950, -104993, -103844, -113362, -106976, -42082, -34968, -2800, 22975, 11779, -6686, -58455, -40510, -60693, -112946, -72809, -54013, -6215, -6309, 31793, -7566, -48740, -96974, -121371, -108269, -51767, -45156, -84208, -57944, -70307, -64618, -82550, -62251, -70992, -65237, -48832, -32505, -14671, -5732]
14180e732O1272j6685k4266M4786N1587l1296o248k122l6559q448K6260j0812
14168D1737K6908P616K9341l5209p349l51k5157j2178J0185j6473j880l7115m2523
14155f2448j9962m3926K7639N8826r058O547m661Q287k6575N8191N0907k0962
14143B2805K2633m76p6946l2806l2665k4930n2768N7130P5316j5985j2772J765
14131f9699Q6323j4925l7356M2632K5329Q097Q551k5017k5273j6653l9336o0895
14119a18222m566K9667L8197M8090O684m2460J5700l134j0204j2268n366K3659
14107c4223M3391k5172k0589l1639k6743j4753L4399M8774l2670m9833M1623L4167
14095c3268L5103o047N3000L3858J4212m5602o3301l3995K6827j8483L0060j9616
$$ y = [-5732, 55540, 38855, 14589, 59375, 110962, 79666, 73418, 71296, 34737, 26289, 52549, 41737, 68645, 76261, 105602, 70393, 63044, 62693, 37536, 25358, 35543, 19070, 17190, -19925, -62448, -82410, -126336, -98697, -39871, -48929, -42382, -47043, -38756, -65331, -7140, 43767, 22805, 45438, 44962, -31984, -64790, -97455, -122385, -175153, -118023, -42707, -58692, -71464, -69699, 16624, 1699, -35657, 6975, 32304, 40401, 48952, 23935, -1338, -17991, -57327, -118222, -122788, -93121, -54924, -6834, -150, -42610, -26910, -30044, -40248, -52516, -57882, -34223, 9168, -16004, -36593, -68232, -94975, -109728, -75329, -26555, -59225, -109058, -67435, -33268, 1835, -4212, 48788, 82646, 96858, 51256, -12045, -46040, -19213, -37696, -7636, -27252]
14083b7252q7912K5609Q6476l8378l1279j8412O0164K6298k244J8993J9365k1176
14071A0252K2337K9430Q616L355p023J318K2714N2379o1946o8391l0122J013p511
14058b3579q2357L3417R0259L9774n818k374m272K4438K1691J9631J6651J8845
14046A46306l5361m4708j7082L8689L0348j9433n0391m9073j9012L6604K9991
14035D6878j6863l1770M6723k010J6852q364K7656m5518k6242R52j5816J3434
14023E912m6691j6751N8292L4595J4094K5687k4294j607j9816p7386L429O3641
14011A9105K8979K6741R665K8177R810l8015n4723n7352k4000j5714J670J626
13999f4031K5404L1887k6902L1721J2656J3202m7464N6017O1209l7923k5294n8163
$$ y = [-27252, -115164, -89555, -3079, -41457, -72736, -91148, -30984, -4686, -6930, 12063, 31428, 10252, 32589, 62019, 70635, 73990, 66967, 68285, 90999, 143378, 81432, 13041, -17081, -16068, -23579, -105936, -72519, 17740, 57514, 51696, 49322, 45050, 69488, 91179, 110810, 127461, 146306, 110945, 66237, 49155, 87844, 118192, 98759, 48368, -705, -19717, 16887, 46878, 30015, -1755, 44968, 42958, 59810, 51446, 79102, 33584, 7342, 8294, -7522, 5912, -40779, -57530, 762, 35357, 49451, 75138, 50844, 49237, 29421, -47965, -44536, 19105, 48084, 74825, 84490, 112667, 122477, 84462, 29739, -27613, -51613, -67327, -65657, -64031, -38627, -6740, -33642, -1921, 10735, 23937, -23527, 32490, 93699, 55776, 30482, -27681]
13987b7681J3023n4256K8691o7r0467O5811L9315j9242K3351L4494K636k1107
13975e499k5172k6197o492L3734K4813j2952N27N0768L258k3729J6919M4203J7635
13962I1816k6032p1721M4205K5228n579j6650j9441N2910J2920l7665O1871M9909
13950A61771n2443j3267k1674o3543m061j2659L3099K9411k5780k3160N0448r956
13938D8186o5801k8049O0092k3403J3291L3610N4835Q805q6956o5743K0445O292
13926b4396P370M8373J6856j2730l1169l3465P1392P1674j952n2429J9860o4598
13914A4786l3265m1687m5114K5148j8622j2992L581M883P6653r187J8986J228
13902a5602n7605k7007N9526N43l6194N7596M9929J0004M951j0988m7607j6814
$$ y = [-27681, -14658, -68914, -40223, -40290, -130757, -64946, -25631, -44873, -21522, 12972, 15608, -5499, -30671, -56868, -63360, -29626, -4813, -17765, -17238, 33530, 36788, 13059, 29978, 74181, 91816, 65784, -5937, 38268, 63496, 57917, 41267, 21826, 74736, 87656, 49991, 111862, 161771, 109328, 96061, 74387, 10844, 6783, -5876, 27223, 56634, 30854, 7694, 58142, 48186, -17615, -45664, 14428, -8975, 4316, 37926, 92761, 101566, 14610, -51133, -30688, -24396, -17026, 31347, 48203, 35473, 4304, -29161, 42231, 113905, 111953, 59524, 79384, 14786, -18479, -60166, -105280, -80132, -98754, -111746, -108165, -103282, -26629, -35816, -16830, -15602, -73207, -100214, -40688, -40145, -76339, -18743, 31186, 41190, 46141, 35153, -12454, -29268]
13890b9268Q214p100O7693j9012q5573j3292K0216N591J956k6183Q237j9311k0593
13877a08425L3586K1862R641j3365J821P88J5630L8223O877m1559M1701k6348
13865a9568J6691Q132M065K3940J7993n7779L8848l9081n9731P239M1136K0029
13853A914J8348K8015k606r452M2776K818m1491k5901j4481k9427L4531M3348
13841D8392l6590j0231p705L2473l992k9589j659k0892K415K829j1772P6411K1436
13828F1526m1954m4668k1526O9942K9518J2116k4384o2461l1426L9659J0740L9567
13816C6649q489j3803Q037k8388M972m3345J4957l3816N829L5819L423k6068Q837
13803c5386j3896r9510l1007O6892M9418N9855K5666J7285l8432m5467o119M5429
$$ y = [-29268, -21054, -28154, 39539, 20527, -65046, -78338, -58122, -52531, -50575, -76758, -68521, -87832, -108425, -74839, -52977, -43336, -56701, -54880, -54092, -38462, -239, 6638, -34921, 6780, -19568, -2877, 5255, 9320, 33260, 51253, -6526, 32322, -6759, -66490, -59251, -18115, 1914, 20262, 48277, 45671, 36219, 78995, 81813, 40322, 14421, -60, -29487, 5044, 48392, 11802, 1571, -6134, 26339, 22347, -7242, -8901, -29793, -27378, -24549, -36321, 40090, 61526, 19572, -25096, -46622, 23320, 52838, 64954, 40570, -21891, -53317, -13658, -2918, 36649, 28160, 14357, 22394, -5994, -1022, -44367, -29410, -63226, -57397, -21578, -18155, -44223, -35386, -49282, -148792, -179799, -112907, -63489, -3634, 22032, 39317, 885, -44582, -50701, -5272]
13791e272K9187M2045J857k3540m5157J1105R504M9256N4676J6449l3238n5461
13779E1411k8521J7204O8984K3823p8649q4897l4138K1924J5897O0139J9627P6065
13767A28869l9173o6457q088J7315o5263n6560K8909N4353J9802L4941m8983o1490
13755f1825j2305O39J1296P4136N0080J2253n6488o6806J996L461K8633k9587
13743d4517K8689l7707j6029K9663M0670O0k8131K8948L103N5626m2726j5497
13731B152k4195l7074K3543k389q3266j9329J3495K9167O1332O092J019k1440
13719e0893j5885j2607L8454O3564k3693r1836j5904N7015l7706l1426K2160K1775
13707g6982M3561L1680j8210l1939l3132K4535L2833P9740R981j3107l6169m2068
$$ y = [-5272, 23915, 65960, 67817, 44277, -880, 10225, 19729, 68985, 123661, 140110, 106872, 51411, 22890, 40094, 109078, 132901, 54252, -30645, -64783, -42859, -26962, 33177, 52804, 128869, 89696, 23239, 15151, 32466, -32797, -89357, -60448, -6095, 13707, 48648, -335, -61825, -74130, -73491, -62195, 11941, 62021, 74274, 17786, -49020, -47024, -43563, -14930, -44517, -15828, -53535, -69564, -39901, 769, 829, -27302, 1646, 4749, 60375, 17649, 2152, -22043, -59117, -35574, -37963, -121229, -140558, -127063, -97896, -36564, -30472, -29453, -50893, -66778, -79385, -40931, 22633, -1060, -92896, -108800, -51785, -89491, -120917, -98757, -76982, -33421, -1741, -19951, -51890, -85022, -60487, -27654, 52086, 62067, 48960, 12791, -29277]
13695b9277K5647P052L2229m670n9940K443o6855j0112K7594N5322N6974n9285
13683b2878m430M5054L8639l5465j9326j4385M0087J2463q752K3120l794o5273
13671a4940l892N1197K0026k4968o7230J8640m137r445o461j6964L2642p796O1448
13658B8120K1136p4033J6077J0699J4168P4995K6337m6636k9709k6529l9966n3489
13646g8830L022N428M7827j7920l8714M8125K5946j8584l9708K1749N6313J0826
13634B5480o805l3306m817k9163P391M3089j662o798r004M8668R342r0090n2437
13621a00112j1802J199n133j108K9454M619M9807O0041L1227m1476L728k6327
13609e883j8170N4722k0145K8222K3184K0425k936o0413J7540M6985m1395p4511
$$ y = [-29277, -3630, 3422, 35651, 30981, -28959, -26516, -93371, -103483, -75889, -20567, 36407, -22878, -27308, 17746, 56385, 20920, 1594, -12791, 27296, 39759, 31007, 54127, 50333, -14940, -18832, 32365, 52391, 27423, -39807, -21167, -25304, -34749, -41210, -58174, -25532, -33328, 28120, 49256, -24777, -8700, 1999, 16167, 91162, 117499, 70863, 41154, 14625, -25341, -78830, -75808, -70380, -22553, -40473, -79187, -31062, -5116, -23700, -63408, -41659, 14654, 25480, 18675, -14631, -19448, -48611, -41220, 1869, 207, -6591, -15595, 33073, 42415, -47675, -100112, -111914, -110715, -115848, -116956, -87502, -82883, -33076, 26965, 58192, 16716, 20444, -5883, -24053, 30669, 10524, 38746, 61930, 82355, 79419, 19006, 36546, 83531, 42136, -32375]
13597c2375K4733M6213M9283K1567m7345M4437l2495o5528K5919j1154N6455Q5865
13585A65575m8354O778Q517O3046J8936N6703J63435J67164P4123J70961K29106
13574A075990J50052R9817J47152J34154m182p1400q4034j33793j57165j74550
13564I82041j49979j58480j22737j35597p0994m6557j110Q926N757p9843J4135
13553B45562M9303p7987l665K8586L2230m9319J2105o0058k905j3511P158k387
13541A65112k7611N9021j4496L564j3082o0433n6437P325N4598j8926R244M561
13529A12440j1923p985j7190o71M6166n3963K7873K9968J3885K2262k9349N0424
13517A81937K0003j02250k0227k7676l7398L953k344k1030R407L1154m808k1258
$$ y = [-32375, -7642, 38571, 87854, 109421, 62076, 106513, 74018, 8490, 34409, 23255, 79710, 165575, 117221, 123999, 132516, 195562, 214498, 271201, 434636, 601800, 675923, 846884, 1075990, 1226042, 1325859, 1473011, 1607165, 1602983, 1531583, 1447549, 1313756, 1156591, 982041, 832062, 673582, 550845, 415248, 344254, 297697, 296587, 305513, 311270, 231427, 245562, 294865, 216878, 213213, 241799, 274029, 224710, 236815, 176757, 173852, 160341, 167499, 165112, 137501, 196522, 182026, 185590, 172508, 112075, 55638, 62963, 117561, 98635, 107879, 112440, 100517, 92532, 75342, 74671, 120837, 66874, 94747, 124715, 138600, 160862, 131513, 181937, 201940, 99690, 79463, 51787, 14389, 18342, 15998, -5032, 4375, 35529, 30721, 9463]
13505I463j6733l0174J9922P248m083J0229P0756J3832K4829K2185o3647n5110
13493H717l827n0713k7489P4905p579l7203J2790N8406J8755l8935r3742m1999
13481a27914M0609L6594j4068P6988M5711j8386k0071P6793j7383o4250l0426
13470a5803r732L5447j0484m1806J9266M761p2212N446l6829O615K000N82J11578
13457a171J285K6594M5962L0435q6153o3081O7567K514K7749L0180r1412l2029
13445d1560M0426l4927N914K2O7478Q0326l0781o4376m3600N9410l7287R340P1470
13432H1855Q974m0926M669m1055k8317L980M6164n7392k1252q786K8875N7916
13420C4705L409m4559L9839M2702k2863n1873L5315l2088r324M2592k5485k5746
$$ y = [9463, -7270, -37444, -17522, -10274, -14357, -4128, 66628, 80460, 105289, 127474, 63827, 8717, 4890, -45823, -73312, 1593, -5986, -43189, -30399, 28007, 46762, 7827, -85915, -127914, -87305, -50711, -64779, 12209, 57920, 39534, 19463, 96256, 78873, 14623, -15803, -25535, 9912, -572, -42378, -23112, -18351, -90563, -85117, -121946, -115331, -113331, -112749, -1171, 114, 26708, 72670, 103105, 16952, -46129, 21438, 23952, 51701, 81881, -9531, -41560, -1134, -36061, -30147, -30125, 37353, 117679, 86898, 22522, -21078, 38332, 1045, 10385, 81855, 90829, 49903, 54572, 13517, -14800, -10820, 35344, -22048, -43300, -52086, -23211, 34705, 38114, -6445, 33394, 76096, 53233, 1360, 36675, 4587, -4737, 37855, 12370, -13376]
13408a3376n919J068j3828R40J8049K6387M9537n0385r270N242j3748k9651J3547
13395b1407n0374j605M6054J3993P113M5505N7848m7311n2961N2104m5907o170
13383c118M6429k5520o9364P365M3703l8252o6445n3502o366L2264P182M0081
13371h5543O9198J0426K3823Q0622L129m1055k7924J9398k0133m3732k431M3597
13359B9375L9242l3031K2815O9296L7604l4589o7031Q840J261j792L74q2704M468
13346e872L2485J04128M3926q1677o0989K3168k5827k9631q146J398o463k5109
13334c8609M4458M6502j6887q722r41L6620M7984p8263o8560l42l967N1354L0754
13321D1381l5148J2706l8553M832K7293l5268n082P9067N300m5703J2138M3803
$$ y = [-13376, -19295, -18227, -32055, -31115, -13066, 13321, 62858, 12473, 3203, 8445, -5303, -34954, -21407, -71781, -73386, -27332, -13339, -6226, 39279, 97127, 49816, -3145, 48959, 3052, -3118, 43311, 17791, -51573, -44208, -505, -38757, -105202, -158704, -165070, -132806, -125624, -85543, -16345, -5919, 17904, 98526, 101655, 60600, 32676, 52074, 31941, -11791, -14222, 29375, 68617, 35586, 58401, 127697, 165301, 130712, 63681, 72521, 73782, 71990, 72364, -10340, -5872, 26613, 130741, 174667, 92990, 32001, 55169, 29342, -289, -8435, -7037, -13500, -38609, 5849, 52351, 35464, 26742, 25801, 62421, 110405, 32142, -36418, -36760, -40727, 10627, 41381, 6233, 18939, -19614, -14782, 12511, -22757, -27839, 51228, 56528, 10825, 22963, 66766]
13309F6766j7537J1232k7590m9975j1576K0021M631L9981j8670P053K3266k0307
13297B7295k3246L4963O0233j6628O86j0709o1741q565O399n419n2045k5803P625
13284f6955N6568O5412K521l686M6077J6798l5245K4572J6439p2762j8321j9821
13272A1597r958L0820N3939q946m5679o6392m264j702l7641J563M5848L7007m0532
13259c4340p914J4496J5129q658l2604J7902Q424J4888k262o6521j0913N4672
13247c7701O687k6077K153K0167l6503m3224J5143N5743K8138k7861n438P5792
13235B7019J8772k5187k3240m3028l274K5121K2j0489n685j2383M3968n300j7100
13222c0784K8271k9743L2222l9547K9446M8262m277m353K8723J3883O91N629j5174
$$ y = [66766, 49229, 60461, 32871, -17104, -28680, -8659, -4028, 35953, 17283, 24336, 47602, 27295, 4049, 39012, 99245, 82617, 83303, 72594, 10853, 2288, 8687, 3268, -48777, -74580, -66955, -10387, 55025, 57546, 53860, 99937, 116735, 81490, 106062, 122501, 49739, 31418, 11597, 1639, 32459, 86398, 77452, 31773, -34619, -38883, -40585, -78226, -76663, -30815, 6192, -34340, -42254, -27758, -12629, -21287, -53891, -35989, -27565, -12677, -14939, -81460, -92373, -37701, -31014, -57091, -54938, -34771, -71274, -114498, -99355, -43612, -15474, -43335, -48773, 27019, 45791, 20604, -2636, -45664, -48938, -23817, -23795, -34284, -39969, -52352, -8384, -13684, -30784, -2513, -32256, -34, -39581, -10135, 38127, 33850, 29497, 58220, 72103, 72794, 78423, 63249]
13209F3249l7813j7783m2531o88P5930N9959m8737l7250L4780m5357k9235k1434
13197d6910m9118K7203O0035M6883K0158j4612j2363M5561k4438k4197k6396P884
13185I690L7395J4610k4039k3710q8571R240K0022J7485K2831K2260N1308k1312
13173D7209j0307j1841k7960J1944N8775J7299q212o4129o0640l3111p684M823
13161h3834P705q65P573m755J9265J4725L1049j3410k6082M0593K6221l7698n7247
13148g6760Q247J8786j9454L2687J1403r14J1987R10p2722K1005N6613p39K6763
13135A7812M9807k948j4231j4824J2644k4083p1770J5019J5386n0089K9095N5183
13123A7001K5310Q321M114j4542k8837m4145M3480L1610l8693l2187l9035O330
$$ y = [63249, 25436, 7653, -34878, -35566, 40364, 100323, 51586, 14336, 49116, 3759, -25476, -46910, -96028, -68825, -8790, 38093, 58251, 43639, 31276, 76837, 52399, 28202, 1806, 9690, 47085, 61695, 37656, 13946, -74625, -65385, -45363, -27878, -5047, 17213, 68521, 47209, 36902, 25061, -2899, 9045, 67820, 85119, 76907, 12778, -47862, -80973, -88657, -83834, -76129, -76994, -69421, -74176, -54911, -40186, -9137, -22547, -48629, -8036, 18185, -19513, -76760, -68513, -49727, -69181, -36494, -25091, -26005, -14018, -13108, -85830, -64825, -8212, -8951, 17812, 67619, 64671, 50440, 35616, 48260, 24177, -47593, -32574, -17188, -67277, -38182, 17001, 42311, 50632, 54746, 40204, 11367, -32778, 10702, 42312, 3619, -28568, -67603, -61273]
13111f1273M585j3221k9972M5230N1941N2678K9733M4714j5874k6475l9155r729
13099C3182J3201k4177J5145m3385k1469J4716J3037k8301J1311J3227N1694m9004
13087h23L2309j7781l5361q1540m2595O996M9072j936j5626j8873K0291R254r760
13074a06373K0319R1509j2265l2194K8925j0131O8503j5033p7529o7m1969p662
13062i3967j9767n843M3463L0757k4308L3347P7299k5405J3342P966L555l830
13050C6609j9840o221l6368J585K8396O8534P0376k7636M1872n8665p2935L9520
13038F5227L694n4921O4623k9424n8453o9867J3707M5886O164J4376L0625O6084
13026I7721K5599j05990j1324k731n0847m5050l909M1856J2131J2502J3444l1069
$$ y = [-61273, -56688, -69909, -99881, -54651, -2710, 49968, 79701, 124415, 108541, 82066, 42911, 33182, 46383, 22206, 37351, -6034, -27503, -12787, 250, -28051, -16740, -3513, 48181, -823, 31486, 13705, -21656, -103196, -145791, -138795, -89723, -91659, -107285, -126158, -105867, -96613, -106373, -86054, 5455, -6810, -39004, -10079, -20210, 48293, 33260, -44269, -44336, -86305, -93967, -113734, -119577, -76114, -45357, -69665, -36318, 40981, 15576, 28918, 36884, 40439, 36609, 16769, 10548, -25820, -24235, 4161, 72695, 143071, 115435, 157307, 98642, 25707, 65227, 68921, 14000, 78623, 49199, -9254, -79121, -65414, -19528, -13364, 1012, 31637, 97721, 123320, 17330, 6006, 3275, -47572, -92622, -96531, -54675, -42544, -30042, -16598, -47667]
13014d7667j4895k4633j3705K3726O0409R7071k0843n8410J9508k5609r67J33180
13002A27165J3106m243j9144n9194r4970j39537n9642O9710J31154N0314L9449
12991E4168M0265l8002N741m1474p3227o600L3607M6455M7023K3889n1992m2257
12979b404J262K4984k5436r8502m7797l1908K3846R1732O2784n5490j9331O8842
12967g418j3709j8474K9554M0081J2862o7460j0477K9840m5792L0190R0727L2891
12955A02815m2207J8851n827j9360M6407q74l5408j367O452M6056J7537j6050
12943A17025m0692j9620l1804n7030M5768L7188N6299N1967k713k8953m169R448
12931A32714Q052j9317j8584n9382k4258L4493M7968J5095m2362l2687l8784j9705
$$ y = [-47667, -62562, -87195, -100900, -77174, -16765, 80306, 59463, 1053, 20561, -5048, -6015, 127165, 140271, 136028, 116884, 57690, -37280, -176817, -236459, -166749, -35595, 14719, 54168, 94433, 56431, 62172, 20698, -52529, -59129, -25522, 20933, 67956, 91845, 39853, -2404, -1142, 23842, -1594, -100096, -147893, -179801, -155955, -64223, -1439, -56929, -76260, -7418, -21127, -39601, -10047, 30034, 42896, -24564, -35041, -5201, -50993, -20803, 69924, 102815, 60608, 79459, 73632, 54272, 100679, 99805, 64397, 63030, 69482, 115538, 133075, 117025, 76333, 56713, 24909, -32121, 13647, 50835, 107134, 159101, 156388, 127435, 123266, 132714, 140766, 121449, 102865, 43483, 19225, 53718, 101686, 116781, 74419, 41732, 2948, -16757]
12919a6757j1555R9720K2024j973P596l7420l2373j9157k2507k2101K1824J3181
12907E02j5949M3955J6710q677N2729j0593m201j4933j4888K5574m3975M5474
12895G1728L4716m8604j3524j4654q136K2287K3154J5203q9630K1478j301J2636
12883B5353P7971k6294k2594l4689N8229M5653q5921n0298l733J8537j5780M1291
12871B7725O6282k0427p3559M8273J364j859O69j972o007k7087K4913O4867K3413
12858A26595m7409n503K5278l4507m4146k3649K9085j1249m1693l9258K5398J02844
12846F1786O0408K8914N140j6833j925m5852l4006L2424n6828j5469L2728o552
12834D3935j3113K2912O3277J3058K603K508K2504n8840l2108j2943k485j7201
$$ y = [-16757, -28312, 71408, 93432, 91459, 99055, 61635, 29262, 10105, -12402, -34503, -12679, 502, -15447, 28508, 45218, 36541, 89270, 78677, 74476, 59543, 44655, 70229, 26254, 71728, 106444, 57840, 44316, 29662, 21526, 43813, 66967, 82170, -7460, 14018, 12717, 25353, 103324, 77030, 54436, 19747, 77976, 123629, 37708, -12590, -16323, 2214, -13566, 27725, 94007, 73580, 21, 48294, 49658, 47799, 48468, 46496, 40489, 13402, 38315, 103182, 126595, 79186, 73683, 98961, 64454, 20308, -3341, 25744, 14495, -27198, -66456, -41058, 61786, 122194, 151108, 156248, 139415, 137490, 91638, 57632, 90056, 33228, 17759, 50487, 43935, 30822, 53734, 117011, 130069, 132672, 135180, 157684, 98844, 66736, 53793, 51308, 34107]
12822C4107J3928P5364O4677k9098l5795L9652m1164q017J295p1312L4941k5980
12810E2598r2496k1086J5267P0472L3909L459l054K3978R270K0820J2165o959
12798A18343Q909o5318m7209k1340j5180Q1501O4266l310j5209m0953j3721j3569
12786C7210q754j1837l5017j6656K4049M7414N5117r820O858l5893n6661k1154
12774b5144l0507L5774L7038m5372l2285O2610J0478l552k884k5056m107O1203
12762C8196j4929j7548K2890q511q729J5916R401l8973K3597L2558M4267J5861
12750A13996r231k6836l5212Q689q786K244n7093m7437P4942Q281q828J1870l0877
12737d278P098l9084k5975k5909l7125J7286N6714J9665M5779L3093M6633K7041
$$ y = [34107, 48035, 123399, 188076, 158978, 123183, 162835, 121671, 113654, 114949, 43637, 78578, 52598, -39898, -60984, -45717, 24755, 58664, 62123, 59069, 83047, 92317, 113137, 125302, 118343, 127252, 61934, 14725, -6615, -21795, 59706, 123972, 120662, 105453, 64500, 50779, 37210, 28456, 16619, -18398, -35054, -11005, 36409, 91526, 81706, 88564, 52671, -3990, -25144, -55651, -19877, 17161, -28211, -60496, 2114, 12592, 9040, 6156, -18900, -23007, 38196, 23267, 5719, 28609, 20098, 11369, 27285, 36686, -2287, 21310, 53868, 98135, 113996, 104765, 77929, 42717, 51406, 42620, 44864, -12229, -59666, 15276, 23557, 14729, 26599, -4278, 2820, -36264, -62239, -88148, -125273, -107987, -51273, -31608, 14171, 47264, 93897, 120938]
12725A20938o1760j7779J3445j8350J4447M1653n6032L890P5063J0064k1705k9849
12713G4025K8397j0922k5870n5431j9503O403K9541j7225j5803N6058J9744r9
12701F9315p265q6766j0015O1805Q261l5258k6549L6549O5682l672J2336p324
12689G7099q618L7831L8731J8622k640K4869k4633n1690L7069J4884m4874Q853
12677A25503m8150m2459K6031J8834r436j2768K5659K4046L4059Q29n1244J700
12665I2604M2384k0038n5314j9938J7409J9985P279K9603K7893J1603N7478L2554
12653B43502m319l43k67K7151K3087K4992J38551J21595K04800J72871K07767
12642A159387J33390J20293R6523N8809P7456O520q8644j68523j76196k38520
$$ y = [120938, 59178, 41399, 54844, 36494, 50941, 92594, 36562, 40452, 115515, 125579, 103874, 74025, 102422, 91500, 65630, 10199, -9304, -2901, 26640, 9415, -6388, 49670, 69414, 69315, 62050, -24716, -34731, 27074, 35335, 77, -26472, 10077, 75759, 72087, 84423, 77099, 68481, 106312, 145043, 163665, 161025, 185894, 161261, 109571, 146640, 161524, 116650, 125503, 77353, 34894, 60925, 79759, 70323, 57555, 83214, 107260, 141319, 142148, 90904, 92604, 134988, 114950, 59636, 39698, 57107, 77092, 84371, 113974, 141867, 153470, 210948, 243502, 239183, 238840, 238573, 265724, 288811, 313803, 452354, 573949, 778749, 951620, 1159387, 1292777, 1413070, 1509593, 1568402, 1645858, 1652378, 1563734, 1395211, 1219015, 980495]
12632I80495j74677j18594m1386p1059k2951k1496o5280R58j0515n126n0797r703
12620C89869l3390p7794J6552r831o92l2760M027l2264j0736J1159l324k6560
12608A94256m1582L6372J038K5247J8081L83k7007m4680Q284O195j9963L569p738
12595A52455J7p5142n6053J4063P5978M6493j6476K0821P523q874p6247l2764
12583E1794L5192L5420n9344m9496Q281K8638k5547M0768J4766k0267j3006N881
12571E3080n0157P537K9182j670L9332L200k1930J7539J851K7302l6283m7219
12559B1764k7368N3051N1754K0227K9950J2883l3351K1310m6007J3006M4708K6846
12547A88773K060L0571l6613J3282l1848j5198l210l873L1429p228o880K4949
$$ y = [980495, 805818, 687224, 645838, 574779, 551828, 530332, 465052, 466010, 455495, 450369, 399572, 389869, 356479, 278685, 295237, 285406, 284714, 251954, 255981, 223717, 212981, 224140, 220816, 194256, 152674, 189046, 190084, 215331, 233412, 233795, 206788, 162108, 170392, 176587, 156624, 160193, 152455, 152472, 77330, 21277, 35340, 111318, 157811, 141335, 162156, 169679, 160805, 84558, 51794, 86986, 122406, 63062, 13566, 21847, 50485, 24938, 65706, 80472, 60205, 47199, 53080, 2923, 10460, 39642, 37972, 77304, 80504, 58574, 76113, 77964, 105266, 68983, 21764, -5604, 47447, 99201, 119428, 149378, 162261, 128910, 150220, 104213, 117219, 161927, 188773, 190833, 221404, 184791, 198073, 166225, 151027, 147817, 143944, 175373, 168145, 161265, 186214]
12535A86214N027m9757Q533K51l8873m5868J1266L4096j6205j1808M3017o947
12523A18946l5068k0852l3385L1811n2342n0073O9289j4095J7051P9651j4431
12512I6502k1918j3277k741o7J7145l7880m1580O4307j6470M9019Q524n0525j4474
12499C6565J2908J6720J417Q543K557o870k6836m181Q598n0413L9248O7871J0929
12486A17056j6508K5244j3974N7044O4651L376j6662J560N6685N3584l5776m492
12474B91788R354n6143n0130J4910m169J4938L6338K7305J2514o3291j6524Q6336
12462C03226J1463o8815l4405k0595J9743J535j6972l2971Q101L9561j5749o957
12450A87165k0731k5851m3048p973q410M1747m4390K1632k3549j443K0450j7555
$$ y = [186214, 191241, 141484, 150017, 150268, 111395, 65527, 76793, 110889, 94684, 82876, 125893, 118946, 83878, 63026, 29641, 61452, 9110, -40963, 28326, 14231, 31282, 110933, 96502, 74584, 61307, 58566, 58499, 75644, 37764, -3816, 60491, 44021, 93040, 101564, 51039, 36565, 49473, 66193, 67610, 76153, 78710, 71840, 45004, 40823, 49421, -992, 38256, 106127, 117056, 100548, 125792, 111818, 168862, 233513, 236889, 220227, 221787, 278472, 332056, 296280, 291788, 301142, 244999, 194869, 209779, 205610, 220548, 256886, 284191, 296705, 233414, 216890, 303226, 314689, 245874, 211469, 190874, 210617, 212152, 195180, 162209, 170310, 209871, 194122, 187165, 166434, 140583, 97535, 89562, 81152, 122899, 78509, 100141, 76592, 75149, 95599, 78044]
12438G8044J4332Q1352J1356K3787o2052J7806J1977n931K1244J1582j4203O2449
12426B51743M4550n3581l3509n461m0207p9155L7830m3585l8570Q7016J9631Q613
12414A55315m0895k5432L7643p239k4024k4806k3748Q789J4921l5534l892m1947
12402a0849J5921Q8585J4710o423L9641K7425j4513M7390K4303L5056L8034m8673
12390B50607m1377Q0016K0419j5077j9928J1428M4755L098M6091N7619j6452l9785
12378C81414P05L5400N1693k2114p2212r6711j5430J0146J355R82L8864M3708
12366C57800L1467r5934p9783l6756L6498P6149n689n812M9971M4886Q0721L0978
12354D84496Q612K2251J5237M0131K3507J4010n337K5853N2725N0166j2475o2186
$$ y = [78044, 92376, 173728, 185084, 208871, 146819, 164625, 176602, 170671, 191915, 203497, 189294, 251743, 296293, 242712, 209203, 203742, 163535, 84380, 122210, 78625, 40055, 127071, 146702, 155315, 114420, 88988, 126631, 119392, 95368, 70562, 46814, 55603, 70524, 34990, 31098, -10849, 5072, 93657, 108367, 101944, 141585, 169010, 154497, 201887, 226190, 261246, 299280, 250607, 209230, 289246, 309665, 294588, 274660, 286088, 330843, 333941, 380032, 437651, 421199, 381414, 382119, 417519, 469212, 447098, 374886, 278175, 262745, 272891, 274246, 275228, 314092, 357800, 389267, 293333, 213550, 176794, 213292, 289441, 283752, 277940, 327911, 372797, 453518, 484496, 493108, 515359, 530596, 570727, 594234, 608244, 602907, 628760, 681485, 731651, 719176, 656990]
12342F56990L0372J1086m0929K896L5953l5722j3628q216k709J0270J5740j88
12330F61915J8199n2762k1273L5720J2013j4218k6055j5469J0118j1774K8563
12319F24977K2437m1109k5225N703J007J2182M345J7590K1030j4919M4617N8921
12307G31556J2936k2494L8094N3434l0458j5884M9739J06020M9183K4290L2019
12296A028435M689K6814l8679l0674M68k3218M5094L9505N8094Q2428J6138P2598
12284A281692L3880K3003K2981M3782J01035J25943K11741K77499K66387L19752
12274B707695M43693N45175N45447N66946O19466O02727M26910K04591M9632j67100
12264F545182l11161m07522m50201l97756k84162k07705j72947j5759J0987J02681
$$ y = [656990, 687362, 698448, 657519, 660415, 696368, 660646, 647018, 638802, 636093, 646363, 662103, 661915, 680114, 627352, 606079, 641799, 653812, 639594, 613539, 598070, 608188, 596414, 624977, 647414, 606305, 581080, 586783, 587790, 599972, 604317, 621907, 642937, 628018, 672635, 731556, 744492, 721998, 760092, 813526, 783068, 767184, 816923, 922943, 972126, 996416, 1028435, 1033124, 1059938, 1021259, 990585, 991053, 967835, 1012929, 1052434, 1110528, 1192956, 1209094, 1281692, 1315572, 1338575, 1361556, 1405338, 1506373, 1632316, 1844057, 2121556, 2387943, 2707695, 3151388, 3696563, 4242010, 4808956, 5428422, 6031149, 6458059, 6662650, 6712282, 6545182, 6234021, 5826499, 5376298, 4978542, 4694380, 4486675, 4313728, 4297969, 4308956, 4411637]
12254D411637J38844J85239K98210L34153L23727L58047M90579O86501P67485
12245G994422R94098J231987J450759J788145K004502K261756K527742K685528
12237B2938939L096928L578051M471995O235212R018416J3061032J7849135K2901223
12229A03150931K8221113L3240074L5636654L3730414K9574683K3363394J3531268
12222C00448531P29812j0946257j9852091k6868485l2088575l3291024l0297031
12215A47834880k5851540k1451619j6607538j1572194p889129n698523m424113
12208E4340224l691178l205915l022108k930104k840988k727397k567798k373742
12200C0980994k089207j898205j651609j380638j221587j129951r53446q22127
$$ y = [4411637, 4550481, 4735720, 5033930, 5368083, 5691810, 6049857, 6540436, 7226937, 7994422, 8988520, 10220507, 11671266, 13459411, 15463913, 17725669, 20253411, 22938939, 26035867, 29613918, 34085913, 40321125, 49339541, 62400573, 80249708, 103150931, 131372044, 164612118, 200248772, 233979186, 263553869, 286917263, 300448531, 301178343, 290232086, 270379995, 243511510, 211422935, 178131911, 147834880, 121983340, 100531721, 83924183, 72351989, 64462860, 58764337, 54340224, 50649046, 47443131, 44421023, 41490919, 38649931, 35922534, 33354736, 30980994, 28891787, 26993582, 25341973, 23961335, 22739748, 21609797, 20656351, 19834224]
12192A9834224p67986o66129o36857n29749n23980n48469n41456m74262m79549
12183A4665787m83847m57922n31400m69525m00852m27767m62132m71102m52126
12174A0509114m34271l01850l30354l07326k44679l39247k95530k25476j81746
12165G848635k24373k48745k95595k31372k11836k48990j32360j19256k05757
12156E930351j86331j70504j61447j43281j15622k12530j99979j33505r4501j68248
12146D344403j10202j30321j68033j90404p5059j0886o6577p4425j15032q9217
12136C314247k4139J3278j2094o0369q4246m7042j4499j0955l2573k510k3416
12125C015682n6643r24j29199j93380j50165j53053j53156q5324j77347j99339
$$ y = [19834224, 19066238, 18400109, 17763252, 17233503, 16709523, 16161054, 15619598, 15145336, 14665787, 14181940, 13724018, 13192618, 12723093, 12322241, 11894474, 11432342, 10961240, 10509114, 10074843, 9772993, 9442639, 9135313, 8890634, 8551387, 8255857, 8030381, 7848635, 7624262, 7375517, 7079922, 6848550, 6636714, 6387724, 6255364, 6136108, 5930351, 5744020, 5573516, 5412069, 5268788, 5153166, 4940636, 4740657, 4607152, 4512651, 4344403, 4234201, 4103880, 3935847, 3745443, 3670384, 3659498, 3592921, 3518496, 3403464, 3314247, 3290108, 3303386, 3291292, 3230923, 3146677, 3099635, 3085136, 3074181, 3041608, 3039098, 3015682, 2959039, 2958115, 2828916, 2635536, 2485371, 2332318, 2179162, 2093838, 1916491, 1717152]
12115A717152j30486j48774q0007l2244q8079j14311q4729j19021r6946p4253
12105G48302M5404Q5738m2063o9370m8333j0418m7238p2077j6682L4347N5209
12094F62819Q6035l535J3124m4430N1448Q2669Q8051N0417M8789N540N8120P8371
12082A177418L5310L423k7648J5730k3870o9993j38985j30026r1446m3243q5197
12071F21473n2808P134J8121m685L023l616n1221O051q9998K6558J50728J05548
12059G36308M6408J08306J1112l5890L1444M8060m3849M3689O9577J912n7377
12048I59700q9760M8910L6482J6235j4926j8940j7222l3414L4798P2116P040m6297
12036I54722n3349n6325k634k9004o7841n3685o0823o8005k0137l9660J4243M729
$$ y = [1717152, 1586666, 1437892, 1357885, 1325641, 1237562, 1123251, 1038522, 919501, 822555, 748302, 793706, 879444, 837381, 768011, 719678, 709260, 662022, 589945, 573263, 607610, 662819, 748854, 745319, 758443, 714013, 765461, 848130, 936181, 986598, 1035387, 1040927, 1099047, 1177418, 1212728, 1216151, 1188503, 1204233, 1180363, 1110370, 971385, 841359, 749913, 706670, 621473, 568665, 575799, 593920, 589235, 592258, 588642, 537421, 543472, 453474, 480032, 630760, 736308, 782716, 891022, 902134, 866244, 897688, 945748, 901899, 945588, 1015165, 1017077, 959700, 869940, 918850, 955332, 971567, 956641, 937701, 920479, 887065, 921863, 993979, 1001019, 954722, 901373, 845048, 842414, 813410, 745569, 691884, 631061, 563056, 542919, 503259, 517502, 522231]
12024E22231O751N8792P3462N5619K2994J55051K2883K4782R2258R9972O3318
12013A198113p6799n3202l2923j04623j02810r0904l5165n2478K814L3945L1465
12002G17433L426o2589o9481q4894J6839J8330J5896m635j5972n1805m3932p5470
11990C63146l2980L4157O7010J4818k4752J17339Q2154l4166m2741M2978M1980
11979F28943O1874J73359J88360K41683M00912O07231Q11749O77408L81553J57044
11969D330116P93n37642r85518q10852m59419k91670k44589j79077p3899M385
11959G52628k3576o7316l8600l1684J3899m2199o7626r7730J8767O655l1028m2451
11947C49739m4324j2716O824J7086k8434K9081j5118m5648K8217m9074p5367P1823
$$ y = [522231, 528982, 587774, 661236, 716855, 739849, 894900, 917783, 942565, 1034823, 1134795, 1198113, 1121314, 1068112, 1035189, 930566, 827756, 736852, 701687, 649209, 652023, 685968, 717433, 720859, 658270, 588789, 503895, 520734, 539064, 554960, 550325, 534353, 482548, 438616, 363146, 330166, 364323, 431333, 446151, 421399, 538738, 620892, 586726, 543985, 586963, 628943, 690817, 864176, 1052536, 1294219, 1695131, 2302362, 3114111, 3791519, 4173072, 4330116, 4330909, 3793267, 2807749, 1996897, 1537478, 1245808, 1001219, 822142, 748243, 752628, 729052, 661736, 623136, 591452, 605351, 563152, 495526, 397796, 416563, 423218, 392190, 349739, 305415, 292699, 299523, 316609, 288175, 317256, 302138, 256490, 284707, 235633, 160266, 232089]
11935B32089O6078l1701P298K6023m1097n1203n9251n193K8768M320r0658n8715
11923B6758J0044O0059P5538n3l5922N780L8129K5500j03702p8654N980N7402
11911H6859N3115o9537n0639O8553N4011K8878o7006q5452J8002O1819j2148k4144
11899F2311m6337k1571K9476K3095N8972J0807n1941p0551P796L710k68k2658
11887a7159l8192K2288o257O4249J3121K7051L7247n277o0606K401M5194P53k0897
11874F3916J7726N6003K944o0719n173r687m714O203l7041N4449J1781J6413m2985
11861F9116k0107k6354K1610Q0287m814k0658N1964K03q8132j02200j6038L9095
11849a6028N875J1698q345l2829L3675Q4131j9798j9445m500j8994j8546P244
$$ y = [232089, 298167, 266466, 273764, 299787, 258690, 207487, 148236, 143043, 171811, 176131, 85473, 26758, 36802, 96861, 172399, 172346, 136424, 142204, 180333, 205833, 102131, 23477, 29457, 86859, 139974, 70437, 19798, 88351, 142362, 171240, 104234, 18782, 36784, 98603, 86455, 62311, 15974, -5597, 23879, 46974, 105946, 116753, 64812, -5739, 2057, 5767, 5499, -17159, -55351, -33063, -39320, 24929, 38050, 65101, 102348, 97071, 36465, 38866, 84060, 84813, 63916, 81642, 137645, 140589, 79870, 74697, 65010, 60296, 66499, 29458, 83907, 95688, 112101, 69116, 49009, 22655, 44265, 124552, 119738, 99080, 151044, 151247, 63115, -39085, -55123, -16028, -10153, 1545, -6800, -39629, -5954, 78177, 58379, 38934, 34434, 15440, -3106, 4138]
11837D138k1379k1527J7905K2007M9665P2546O7007k3370l2078n8799j0618K933
11825F8430R4276N0164q0415p4232l7226P0268K4130L9710j6064p5977k2187K6898
11813F7775N4102J13295J07554O9149J02216J25928P1912J52036J96010J80700
11803A240677Q0593J11947R341K9592O757q5386j11239j69691k16214j72921o7884
11792F55572m3017j02295o2825J770j7483k9982p5708m8738l8714K4027l4204
11781B28403k1205m5682j5271M779l684k0712k5353L9981P5915o762l2978l4866
11769A42565m8367p830O108M8578L9942L185m0334K2136K1159J1714N166k5456
11757A78566M239J2188j2961j7405j3998m5838k5898L3962K9128J7116j2063j9159
$$ y = [4138, -17241, -38768, -20863, 1144, 50809, 123355, 190362, 166992, 134914, 76115, 65497, 68430, 162706, 212870, 132455, 58223, 20997, 91265, 115395, 155105, 139041, 63064, 40877, 67775, 121877, 235172, 342726, 411875, 514091, 640019, 711931, 863967, 1059977, 1240677, 1321270, 1433217, 1442558, 1472150, 1478907, 1393521, 1282282, 1112591, 896377, 723456, 655572, 612555, 510260, 447435, 449205, 431722, 401740, 326032, 277294, 238580, 262607, 228403, 207198, 161516, 146245, 151024, 147340, 126628, 101275, 141256, 217171, 210409, 177431, 142565, 94198, 86368, 92476, 141054, 180996, 184181, 143847, 165983, 187142, 198856, 204022, 178566, 182805, 194993, 182032, 164627, 150629, 104791, 78893, 112855, 141983, 159099, 147036, 127877]
11745A27877j3K651j10915l3787l1487K3799M23j210J0953Q368J2818j4079L0663
11732B6061j9446J1889N1674j2350m9529O9831M0885l5062J6676l2396l5917N0414
11720H2730J062m3505j0488N5854J8651m5355J5048j950m7900k5953M999P017
11708A0210k8534M2408Q3621O6962n6597j4834j1445k5688m8663k3688M1366N8759
11696I3877N6077N1790k9205n2671n3162k1026j1359Q961p241l655o3985j7241
11684d8840L3340P142J2308J8587L7721k707J109J0105L9714k5855o8487n1784
11672c7647K6930p319M7209m2569j2142K5663K3709J4637M6718O954l8038n5724
11660a619M0837j5265L0108K897L2100j3749k1869K8333L8008N0367L5323l7117
$$ y = [127877, 127864, 130515, 19600, -14187, -45674, -21875, -21452, -22662, -11709, -3341, 9477, -4602, 26061, 6615, 18504, 70178, 57828, 8299, 78130, 119015, 83953, 100629, 68233, 32316, 82730, 83792, 40287, 29799, 85653, 104304, 58949, 73997, 72047, 24147, -1806, 3193, 10210, -18324, 24084, 107705, 174667, 118070, 103236, 91791, 66103, 17440, -6248, 35118, 93877, 149954, 201744, 172539, 119868, 66706, 45680, 34321, 43282, 36041, 32386, -31599, -48840, -15500, -8358, 3950, 22537, 60258, 57551, 58660, 68765, 108479, 82624, 14137, -37647, -10717, -18036, 29173, -13396, -25538, 125, 23834, 38471, 85189, 92143, 54105, -1619, 39218, 23953, 54061, 56958, 89058, 75309, 53440, 81773, 119781, 170148, 205471, 168354]
11648A68354o8001l4439n5444n2963j6812N5067L2705J9329m8725M5161K4319
11637F8551m0483O553M2903j9931O926l9685m4780k9417O249O0956J7684m417
11625C1109q4941J3452Q2836K958l369m616j7773N5580M8738j0701r0909Q607
11613C0971J0423M3461M6293k0452n8527R177l1034j8670L1311J8189l4725l8926
11601a2509K5970N838m589m103j2460K6135L7j9709J1506n0698k911M2881L1626
11588C7014m8675N724r588K4948K1643K2996l3959j2705m0722k834M6467K6214
11576C6523K0103N9518L9989k7282l5166m3792N880p5049n7771J4930K3230R5497
11564E6610L7967o260k8632k8420p673J9481J7841m2362j8096Q09j1998M4435
$$ y = [168354, 100353, 65914, 10470, -42493, -59305, -4238, 28467, 47796, -929, 44232, 68551, 28068, 34621, 77524, 57593, 64519, 24834, -19946, -49363, -43114, 17842, 35526, 31109, -53832, -40380, 42456, 45414, 42045, 37429, 19656, 75236, 123974, 113273, 22364, 30971, 41394, 84855, 131148, 110696, 52169, 61346, 30312, 11642, 42953, 61142, 26417, -12509, 13461, 19299, 14710, 10607, -1853, 24282, 24319, 4610, 16116, -34582, -37493, 5388, 37014, -11661, -5937, -15525, 9423, 31066, 54062, 20103, 7398, -33324, -36158, 10309, 36523, 56626, 116144, 156133, 128851, 93685, 49893, 55773, -19276, -77047, -62117, -38887, 56610, 94577, 88317, 59685, 31265, 23592, 43073, 60914, 18552, 456, 1265, -10733, 33702]
11552C3702j361J1428P935O5990N9875r3976k9851k68M708j6269m9033l8199l6289
11539h1608J7983M9244j3633o9648J1308M1994q351J9550L0341O7526J8526J5892
11527I9124k2652O335j1016k1683N767K9047L4480K1616k9908L4167m1318m3779
11515F0180L8905j167L1634L21q9678o0977O453O9423L8591n7849N2951J7165
11503A05952l0987m3375l550J5293K3394L7535k7416m4929n4119J5161J6024k544
11491F439j8988K2811k191n7712n0043M6803N4160j6266j5703l1842J1244N4738
11479C450O2852N9945O7076j3597q3193m2871j1348K899L7766J355k851K9132
11467A10615m076m4171m9195k6247J0137M1069J3685J9490J9892n1520q4209j3740
$$ y = [33702, 32341, 43769, 51704, 117694, 177569, 83593, 53742, 53474, 58182, 41913, -7120, -45319, -81608, -63625, -14381, -28014, -97662, -86354, -44360, -52711, -33161, -2820, 64706, 83232, 99124, 76472, 82807, 71791, 50108, 55875, 84922, 119402, 141018, 111110, 145277, 103959, 60180, 99085, 97918, 129552, 129873, 40195, -20782, -14329, 55094, 93685, 35836, 88787, 105952, 74965, 31590, 28040, 43333, 66727, 104262, 76846, 31917, -22202, -7041, 8983, 6439, -12549, 10262, 8071, -49641, -99684, -52881, 1279, -14987, -30690, -62532, -51288, 3450, 66302, 126247, 193323, 179726, 96533, 53662, 42314, 45213, 82979, 84334, 81483, 110615, 106539, 62368, 13173, -13074, -2937, 38132, 51817, 71307, 91199, 39679, -44530, -58270]
11455e8270O2072L2812J1888Q766L4644l0861J5703R145L6104J9763j7717j9368
11443A04681n7384l2489l9060k729J9919J15248M0965o3894J1404j6408J0298
11432I0551m698K6092P4576o3846O789r235k217l9823m8662k8869J391m3116M7467
11419F400K7341P1419O1115j4804p5814l0607L2311O6090K1073P706k0529n2801
11407I8900n3662J142N5792L5741L5729o549j2036l2337M4415l6722j03090k0850
11395F473K9347L4121k8681M7414K3079l3292J912j2186k4257L833j3330k0804
11383A3629j0061m928k5077K822N1067L9562m5338m0033R2322O8415o306K0723
11371A56797J3577k0012n2530L7875l4308n2255m7560j7844M576N1714L6581K8266
$$ y = [-58270, 3802, 36614, 48502, 57268, 91912, 61051, 76754, 85899, 122003, 141766, 124049, 104681, 47297, 14808, -24252, -26981, -7062, 108186, 149151, 85257, 96661, 80253, 90551, 85853, 111945, 186521, 122675, 129464, 120229, 118012, 78189, 29527, 658, 2049, -41067, 6400, 33741, 105160, 166275, 151471, 75657, 45050, 77361, 143451, 164524, 172230, 151701, 98900, 45238, 46380, 102172, 137913, 173642, 167093, 155057, 122720, 167135, 130413, 27323, 6473, 35820, 69941, 41260, 88674, 111753, 78461, 80373, 68187, 43930, 47763, 34433, 13629, 3568, -1360, -26437, -23615, 27452, 67014, 21676, -18357, 73965, 142380, 136074, 156797, 170374, 150362, 97832, 135707, 101399, 49144, 1584, -16260, -11684, 40030, 76611, 104877]
11359A04877K6806o0876M1762N8159k7222j6347j9460n8960O071j9686j9689J2850
11347B8285m6517k1752p043N5525O2577L5795J5016n8723Q386O7078N1511l5900
11335A54238l2542m8026M0511p248m2121j6237m9159K948O4283j2893r393L1583
11323G5944J4022M417k9152J2520k415K3648o303j613J3236k5829q6568k2675
11311c0768M4422K6006o7559L9268J24896M0379J9596K2557n0686R13K7098m7639
11299A48483j2551m7910k2477l8815m068J18849P2412l8092q1182o161K6908M2990
11287A58386K5991q1615L631j2384K2067n0140j7294l0266O7335J24167K1296
11276B31174n7861p0319J8772n682n4343J4487N1329j2561m3059N980J4085L5504
$$ y = [104877, 131683, 70807, 112569, 170728, 143506, 127159, 107699, 48739, 54810, 35124, 15435, 28285, -18232, -39984, -47027, 8498, 71075, 106870, 121886, 63163, 71549, 138627, 190138, 154238, 121696, 73670, 114181, 106933, 64812, 48575, -584, 2364, 66647, 53754, 44361, 75944, 89966, 94383, 65231, 77751, 75336, 98984, 92681, 91068, 104304, 78475, -8093, -30768, 13654, 39660, -27899, 11369, 136265, 176644, 196240, 218797, 168111, 169024, 196122, 148483, 135932, 88022, 65545, 26730, 22662, 141511, 213923, 175831, 94649, 88488, 115396, 158386, 184377, 102762, 106393, 94009, 116076, 65936, 48642, 18376, 85711, 209878, 231174, 173313, 102994, 121766, 116084, 61741, 76228, 127557, 114996, 71937, 77917, 92002, 127506]
11264A27506J746m3521L0622L668m7969R390K4304k6933m4432R089M5131L2453
11252A21054L2577N0784l2677q6824k5247m819Q3361O2621m596j2517J2086J7914
11240B13717l0188o8088N536O3253o32K690J4526L0836M344o567k6572j8550q7474
11227I6831l4630L1881J1920m9396j2540L7790J1306p3924J0887J1628O0540J8893
11215A21186J4020k3230l0891l6840K5945R0984l1240q4284K1642P133p005j222
11203F6198M285O1152J31813O8363k0502l3636n1286p0448m8350J5506M9269J7855
11191A90219p646j1074m8289k088k0170j2575M5794O8959n429k9292o3874k6111
11179G8424L5174l5552J7789J6847R3506L5059o0566j13690n7675L443k175K8658
$$ y = [127506, 129252, 85731, 116353, 120021, 72052, 81442, 105746, 78813, 34381, 43470, 88601, 121054, 153631, 204415, 171738, 84914, 59667, 54848, 138209, 200830, 196234, 183717, 195803, 213717, 183529, 115441, 120977, 184230, 183598, 186288, 200814, 231650, 235994, 229427, 202855, 184305, 96831, 62201, 94082, 106002, 56606, 44066, 81856, 93162, 19238, 30125, 41753, 102293, 121186, 135206, 111976, 81085, 44245, 70190, 161174, 129934, 45650, 67292, 74425, 67420, 66198, 70483, 131635, 263448, 331811, 311309, 277673, 226387, 155939, 107589, 123095, 172364, 190219, 182573, 171499, 123210, 121122, 100952, 88377, 134171, 203130, 197701, 168409, 104535, 78424, 113598, 78046, 95835, 112682, 206188, 241247, 180681, 66991, 9316, 12759, 10584, 39242]
11167C9242k679J5651J6211l2256M8319J1120Q040K9011J6629p822m8921n773
11155H6772l6135M2962K93k1220K9772K0426k9456K2816n248K5680k1761k6659
11143H8242j5360k0205Q385N7328L7597m4265q462l9965K9396J4492n4056L1590
11131H4717K2801o287n0032j9751L2942M5445k553l4878J4446n910n881R2612
11119A67671K9047o5469J6414K4001L3027r497k1401k48j249l9616k8924J2258
11107A16014k1625m1994m2881P2351L9900J6789J03894Q608j7872l7412j00477
11096I5295l9562J8707k473M8558L9315j8209L5290L440K79K5208N962l8141m1542
11083A32127M373l8959K6120N3028J7826k1913j4725L4090N573k3752P122J9477
$$ y = [39242, 36563, 52214, 68425, 36169, 84488, 95608, 103648, 132659, 149288, 141466, 92545, 86772, 50637, 93599, 93892, 72672, 102444, 122870, 93414, 116230, 110982, 136662, 114901, 88242, 72882, 52677, 61062, 118390, 155987, 111722, 103260, 63295, 92691, 107183, 53127, 84717, 107518, 101231, 51199, 31448, 64390, 109835, 107282, 72404, 86850, 80940, 75059, 167671, 196718, 131249, 147663, 171664, 204691, 195194, 173793, 173545, 172296, 132680, 103756, 116014, 94389, 52395, 9514, 81865, 121765, 138554, 242448, 251056, 233184, 195772, 95295, 55733, 74440, 71967, 120525, 159840, 141631, 176921, 180361, 180640, 205848, 211810, 173669, 132127, 136500, 97541, 123661, 176689, 194515, 172602, 157877, 191967, 197540, 173788, 180910, 200387]
11071B00387k3954n9635k9547M3609N1008J1895l1220J0280K91l1981J882J1941
11059A54956J4774j9413m66Q691m5663m3770J7872M1004N2837M827L063m2164
11047A46548l6209N931M2872O0263o0182o8488m4716n1605R4125J45226M2813
11036B76578N002N527j8257N5614j8453n0106l4680j0022M0730J6313M5657O3160
11024C77063P1339N3483K8246K9463l0264K8826L7958l9130m4372k392L1641J0013
11012E51874l2798J828N2146J7692Q7361l6381n2288M7423J2565m0934n9005J0995
11000E60478L6765M1799m167j139l19J3350o0734M161N361J3219K7189J6079L9037
10987F91079N3301M6838l1073M6665J28145R2027N4614L8939j4023J1158j3830
$$ y = [200387, 176433, 116798, 87251, 130860, 181868, 193763, 162543, 172823, 173114, 141133, 143015, 154956, 169730, 150317, 149851, 158542, 112879, 69109, 86981, 127985, 180822, 185649, 188712, 146548, 110339, 116270, 159142, 219405, 159223, 90735, 46019, -5586, 88539, 233765, 276578, 281580, 287107, 268850, 324464, 306011, 255905, 221225, 211203, 251933, 268246, 313903, 377063, 448402, 501885, 530131, 559594, 529330, 558156, 596114, 556984, 512612, 510220, 541861, 551874, 519076, 520904, 573050, 590742, 678103, 641722, 589434, 636857, 649422, 608488, 549483, 560478, 597243, 639042, 634875, 633736, 633417, 646767, 586033, 590194, 595555, 608774, 635963, 652042, 691079, 744380, 791218, 760145, 806810, 934955, 1026982, 1081596, 1120535, 1106512, 1117670, 1103840]
10976A103840l9227j7199j9675m5157r5520m3808l6587l3449l07q541N9850K3426
10964H47646o4679j6789L0122K9789J7419l0919m9702l6439l7476k252l9305L9741
10952F87156p5361r42K8423L4641P790K704m2520m6352l0850k5357j700N990L7133
10939E80755K9254O2492M2248J234N322l9211o983p5938o2215r1110k7693m7421
10927C70734P95M0022j3897o7871l7314j4133O7833J6611Q900L4093J4505P813
10915D28091l1996k4666J9741M2702R325m98j1499j8350j5056p113K0010j1737
10903C98954p6598L13k8077k117k8502J0248L5852j0172M9589K8509o8192J008
10891C10815L0243o8750m0046l120K508m0121N4999K5929l3416J3652J3201K0676
$$ y = [1103840, 1064613, 1047414, 1027739, 982582, 887062, 843254, 806667, 773218, 772911, 764370, 824220, 847646, 782967, 766178, 796300, 826089, 843508, 812589, 762887, 726448, 688972, 686720, 647415, 687156, 611795, 610853, 639276, 673917, 681707, 684411, 641891, 595539, 564689, 539332, 537632, 543622, 580755, 610009, 672501, 714749, 715983, 721305, 682094, 675111, 599173, 536958, 445848, 418155, 370734, 371529, 411551, 397654, 329783, 292469, 278336, 346169, 362780, 371680, 405773, 420278, 428091, 396095, 371429, 391170, 433872, 443197, 442699, 431200, 412850, 397794, 390681, 410691, 398954, 322356, 322669, 294592, 292475, 263973, 274221, 310073, 299901, 349490, 377999, 309807, 310815, 341058, 272308, 232262, 229142, 231650, 191529, 246528, 272457, 239041, 252693, 265894, 286570]
10879B86570j9087L0677Q3601k5399n2310m9462O4301M0294L2526o772L4655l2135
10867C87459q2437p4811J2089K6523q413M753k6642n3160J559P5432N6113p2319
10855B46146p639L0264J9752p866J9305N370M735o0580o7598l5065Q8996P2262
10843C08082l909l1182K9031K9230L3783k1875j6277p995k9915k5953j5437J0350
10831B57933k3875j3352p62N299k1114l747J115l7238P4385O8889J03307K163
10819D13003l9662P580l0802k976J8180n9630J4388O3057K5641n048Q001j9477
10807C92255l3238p2983k3846M2780L2823k7797M0618N180K2516l3177m8961L0389
10795C26559L5271L7662J541n3168m8409L833M9432M9424J8512M3619n6234o7315
$$ y = [286570, 267483, 298160, 381761, 356362, 304052, 254590, 318891, 359185, 391711, 384939, 419594, 387459, 305022, 230211, 242300, 268823, 260410, 265163, 238521, 185361, 186920, 262352, 318465, 246146, 238507, 268771, 288523, 280657, 299962, 305332, 310067, 249487, 181889, 146824, 235820, 308082, 304173, 272991, 302022, 331252, 365035, 343160, 326883, 318888, 288973, 263020, 247583, 257933, 234058, 220706, 219944, 225243, 204129, 200382, 201497, 164259, 238644, 307533, 410840, 413003, 373341, 380921, 350119, 347143, 365323, 305693, 320081, 383138, 408779, 403731, 411732, 392255, 359017, 286034, 262188, 304968, 337791, 309994, 350612, 355792, 378308, 345131, 296170, 326559, 361830, 399492, 401033, 347865, 299456, 303289, 352721, 402145, 420657, 464276, 408042, 340727]
10783C40727m7858P81K0154l923J5284L6528M528L1417J430m6137n5253K6894
10771C24572k2020L6335M0384j0825k3585M9856P2476m8065k8490R006L2841k9043
10759D03442k6320K523L1718m280L8875l7092L9110K0818M1790j2344m1523J8640
10747D75357k8407o3692m7582j0736R0432M8385q334n8939m4015k2592J0583M9285
10735C89745O1264L366m1647N5563M5215k9045j8653J8038J9654J5533O0345N7676
10723F37054l240k3240m5362O5901J11753p1851m8378L577K9378K8540N3618L6994
10711G74744m7513J3535J9538K9469N4081l3038K5573R9381N2923n220O223L0202
10699A019898L1969K1928O0796P0902J6196j1047n21k7339M95N5977j5319P724
$$ y = [340727, 292869, 293650, 313804, 309881, 325165, 361693, 366221, 397638, 399068, 352931, 297678, 324572, 302552, 338887, 379271, 368446, 344861, 394717, 467193, 419128, 390638, 399644, 432485, 403442, 377122, 379645, 411363, 407083, 445958, 408866, 447976, 468794, 510584, 498240, 456717, 475357, 446950, 383258, 335676, 324940, 415372, 463757, 455423, 396484, 352469, 329877, 340460, 389745, 451009, 454375, 412728, 468291, 513506, 484461, 465808, 483846, 503500, 519033, 579378, 637054, 633814, 610574, 565212, 631113, 742866, 671015, 622637, 626214, 655592, 684132, 737750, 774744, 727231, 740766, 760304, 789773, 843854, 810816, 836389, 935770, 988693, 983473, 989696, 1019898, 1051867, 1073795, 1134591, 1205493, 1221689, 1210642, 1210121, 1182782, 1183277, 1239254, 1223935, 1231659]
10687A231659J07670J22625L7543n853Q6557J08385J23819J52603J27161R3396
10677B185565K0587l6516l7128L4496n793L5276l4117m070j099K06M9695J15012
10665B322114Q4549n650o3776P4812M5371Q8511L5900R826o312M4926M7347J6211
10653B693829o3005n5355p2615l016P4300O6576J01974N7110J22504J15111J18575
10642C155988J88424L05253L43555K59456K62690K08493J53893J20696K05632
10633E204080K05689J75390J90666K77675L29681M36060O22518O96969P02759
10624H841487O94164O73279N40633M14307L33111L51132L10965K62855K41150
10615A2663083J78373J42058M1061j09742j84475k03873j63712J78481N73342
$$ y = [1231659, 1339329, 1461954, 1499497, 1493644, 1580201, 1688586, 1812405, 1965008, 2092169, 2185565, 2206152, 2169636, 2132508, 2167004, 2161211, 2196487, 2162370, 2158300, 2157201, 2157407, 2207102, 2322114, 2406663, 2401013, 2337237, 2412049, 2457420, 2545931, 2581831, 2591657, 2585345, 2630271, 2677618, 2693829, 2630824, 2575469, 2502854, 2499838, 2574138, 2640714, 2742688, 2799798, 2922302, 3037413, 3155988, 3344412, 3649665, 3993220, 4252676, 4515366, 4723859, 4877752, 4998448, 5204080, 5409769, 5585159, 5775825, 6053500, 6383181, 6819241, 7441759, 8138728, 8841487, 9535651, 10208930, 10749563, 11163870, 11496981, 11848113, 12159078, 12421933, 12663083, 12841456, 12983514, 13024575, 12914833, 12730358, 12526485, 12362773, 12541254, 13114596]
10606A3114596Q04034J090045J363670J869141K567372L713068N412267P178429
10598C7112622Q298438Q235679P012210N014864K317292n64613k325039k413080
10590F2688373j049576Q13416K150883K549144J930306Q04393J05341k14105l16275
10581F9461900l8988M82680Q62938R97907P67893N16598J273601K670106L936227
10572H0930862M494353M168803L306082K213991J113065K98596K22200R97875
10564I7745827K094427L295049M010706L990194L704949M102665N389266P073448
10556A31406531R406500J1875806J2114104R132586M761492M59631m635636r758800
10548A64762214j1142025q859001n679911l603329k722745k492204k166556j593608
$$ y = [13114596, 13918630, 15008675, 16372345, 18241486, 20808858, 24521926, 29934193, 37112622, 45411060, 53646739, 60658949, 65673813, 67991105, 67426492, 65101453, 62688373, 61638797, 62452213, 64603096, 67152240, 69082546, 69886939, 69992280, 69778175, 69461900, 69422912, 69905592, 70768530, 71766437, 72534330, 73050928, 74324529, 76994635, 80930862, 85425215, 89594018, 92900100, 95114091, 96227156, 96525752, 96747952, 97745827, 99840254, 103135303, 107146009, 111136203, 114841152, 118943817, 124333083, 131406531, 140813031, 152688837, 164802941, 173935527, 178697019, 179156650, 174521014, 164762214, 153620189, 144761188, 139081277, 135477948, 132755203, 130262999, 128096443, 126502835]
10540A26502835j177346j030054j365281j584698j831890k755738m137096n077095
10532A07543637n067864m268542l183085k092227j339502r56067p59032o23188
10524H9254130o72350q24719m35865N36198J410185J515263O12334p16104j486311
10515H9192761j588105p25810J294848L225358L365781J513436r00414l853468
10507I1524387p876837j0976839j1074926q844419o292095m477124l304514k493309
10499C6184324j921342j510718j110950p74992n82283m49929k75925j19552p4102
10490B9364531k23323l70175m45390m99590o75517o76289o71478q22060r56675
10481B4024034r46759r13123r43269j014154r73621r28843q58450o66767n89575
$$ y = [126502835, 125325489, 124295435, 122930154, 121345456, 119513566, 116757828, 112620732, 107543637, 102475773, 98207231, 95024146, 92931919, 91592417, 90636350, 89877318, 89254130, 88581780, 87757061, 87321196, 87857394, 89267579, 90782842, 91395176, 90679072, 89192761, 87604656, 86878846, 88173694, 91399052, 94764833, 96278269, 95377855, 91524387, 83647550, 72670711, 61595785, 52751366, 46459271, 41982147, 38677633, 36184324, 34262982, 32752264, 31641314, 30866322, 30284039, 29834110, 29558185, 29438633, 29364531, 29141208, 28771033, 28325643, 27826053, 27150536, 26474247, 25802769, 24980709, 24024034, 23077275, 22164152, 21220883, 20206729, 19233108, 18304265, 17445815, 16779048, 16189473]
10472A6189473n36183n75084n38406m49364m36059m98087n13306n65791o37003
10463A1440190n70909m81949m39902m20566l29318k41024k75889k22025k25666
10454H232942k14724k06514j45833j32019j68604j15046o4594j29870k01102j92341
10444F662295j56784j84656j90730j68062j69494j95054j72371j26847j57711
10435E140586j17705j13586p2951j01183m0591n7N9436m4486n7243o3752p8434
10424D510034j96464j98133k84863k68483k35246j68894p1766j24078j44007j07547
10414B710553r3971j35075p6092p9854p3468q136k7511o1831q1632j01450r0046
10403A881487q1237r6901p4066k6160p5504j9298n8252p3781l0230j5841k4664
$$ y = [16189473, 15653290, 15078206, 14539800, 14090436, 13654377, 13156290, 12642984, 12077193, 11440190, 10869281, 10387332, 9947430, 9526864, 9197546, 8956522, 8680633, 8458608, 8232942, 8018218, 7811704, 7665871, 7533852, 7365248, 7250202, 7185608, 7055738, 6854636, 6662295, 6505511, 6320855, 6130125, 5962063, 5792569, 5597515, 5425144, 5298297, 5140586, 5022881, 4909295, 4836344, 4735161, 4694570, 4694513, 4753949, 4709463, 4652220, 4588468, 4510034, 4313570, 4115437, 3830574, 3562091, 3326845, 3157951, 3086185, 2962107, 2818100, 2710553, 2616582, 2481507, 2405415, 2325561, 2252093, 2243957, 2216446, 2154615, 2072983, 1971533, 1881487, 1800250, 1703349, 1629283, 1603123, 1527619, 1508321, 1450069, 1376288, 1346058, 1330217, 1305553]
10392A305553J0114o053l8578k5503n3861l1002N628Q03k5289p5883l3459j2707
10380A019763k0018K2596M0207J5668J1228q7647p6280o5576N875P437Q045J6171
10368H97469l1842n3501m3828M8568k4500m662L3162j5705m6290j2951p0427l7292
10356F38201L656M9882J0457o4150j9902M1695K955l5152n502R186j8118k8846
10344E84362p912n258j5961K5045l875o246n2291L7758P5401Q5908N981j4454
10332G08458j5186j08287j3375M5598K9574o057M872p8260j5103J3243o698r917
10320E48862m2110K8081O7244m8900m5360j2805m051p6223J514j8276K0476K7356
10308D45808k7474q078N3776M3518n7105q0367j837m3678m733L8903j7254l3983
$$ y = [1305553, 1315667, 1309614, 1271036, 1245533, 1191672, 1160670, 1166298, 1167101, 1141812, 1065929, 1032470, 1019763, 999745, 1022341, 1062548, 1078216, 1089444, 1001797, 925517, 859941, 865816, 873253, 881298, 897469, 865627, 812126, 768298, 816866, 792366, 787704, 820866, 805161, 758871, 745920, 675493, 638201, 641857, 691739, 702196, 638046, 618144, 659839, 662794, 627642, 622140, 631326, 613208, 584362, 576450, 571192, 555231, 580276, 576401, 570155, 517864, 555622, 631023, 716931, 722912, 708458, 693272, 584985, 571610, 617208, 646782, 640725, 645597, 567337, 552234, 565477, 558779, 548862, 506752, 534833, 602077, 553177, 507817, 495012, 490961, 414738, 416252, 397976, 418452, 445808, 418334, 410256, 464032, 507550, 450445, 370078, 368241, 324563, 319830, 358733, 341479, 307496]
10296C07496m1290l9582J6737P9376j120m9237J2534K9067K5192L2258m4436q1143
10284B45852n9921N7334K7432N6151j922k3459p4333o1220L2300p851m9741O226
10272A46848L589k472K3951p591j0123J3718M6468j891j4096j9930r768L320j5472
10259A56551K0004K7370J626j2730L5799Q734J584K2496K5050L7472q0253p6790
10247A66913m1475k3712o9455J2793M5605M7372r923o2574K5373L8927J8942L9651
10235A88437K1173p6318k3389K8224N5459p905k2454R310n3895n7720M3329L2970
10223A37221j4643j5127n395k2931K0800L9254L2567k0662q2419Q429J2073l893
10211H5274m2625L1556J8951n7967P2568N0505k8143p5277m2165J2660N490o0329
$$ y = [307496, 266206, 226624, 243361, 322737, 321617, 272380, 284914, 313981, 339173, 371431, 326995, 245852, 185931, 243265, 270697, 326848, 324926, 301467, 227134, 165914, 198214, 190363, 140622, 146848, 150437, 147965, 171916, 164325, 154202, 167920, 214388, 212497, 198401, 178471, 168703, 172023, 156551, 176555, 203925, 205551, 192821, 228620, 237354, 238938, 261434, 286484, 323956, 243703, 166913, 125438, 101726, 32271, 45064, 90669, 138041, 128118, 65544, 90917, 129844, 148786, 188437, 209610, 133292, 109903, 138127, 193586, 185681, 163227, 172537, 118642, 60922, 104251, 137221, 122578, 107451, 102056, 79125, 99925, 139179, 171746, 151084, 68665, 77094, 89167, 85274, 42649, 74205, 93156, 35189, 107757, 158262, 130119, 54842, 12677, 25337, 30827, -29502]
10199b9502K0136j1080J6059N0578L0585O3932J0997M471J7804j1438L726J3017
10187A79285r8179n5344M2938P0272O1579J3021j1002K0186R532p04j1776k5388
10175A94420L867m3498K1286j6504r541O4924J1420m2119M2322L5782O3389J6572
10163C42320N664P1675O153k3594k2997m1034r638N0739K3656M810P898L9759
10151D55411m2705J7152J4875q931r553j9718M8795K1241M9414J1250M9303k4110
10139E62424R066M1845j4368l6801J5382n5314k6308L9014K0056L6426M6013O759
10127F44194K2135M138L124J15053J67362k8774L2674R0891N182L5568k6314j3026
10115A052207o5205r4046p8825o0786m4362j7958J1360K3976Q019J5729m3139
$$ y = [-29502, -9366, -20446, -4387, 46191, 76776, 140708, 151705, 156176, 173980, 162542, 166268, 179285, 81106, 25762, 68700, 138972, 200551, 213572, 202570, 222756, 232288, 231584, 219808, 194420, 198287, 154789, 176075, 159571, 150030, 214954, 226374, 184255, 226577, 262359, 325748, 342320, 347984, 419659, 425812, 402218, 379221, 338187, 328549, 379288, 402944, 407754, 415652, 455411, 412706, 429858, 444733, 435802, 426249, 406531, 455326, 476567, 525981, 537231, 586534, 562424, 571490, 613335, 598967, 562166, 577548, 522234, 495926, 534940, 554996, 591422, 637435, 644194, 666329, 670467, 673591, 788644, 956006, 927232, 959906, 1050797, 1055979, 1091547, 1065233, 1052207, 987002, 892956, 814131, 753345, 708983, 691025, 702385, 726361, 734380, 750109, 706970]
10104G06970J3280k1635l7580R464P5335j4321n8434K5300K8609p356J140n9935
10092F60837o3082j6811K3949L8319O293K655n1891q6975k6622J2886O4208O8136
10080F31902R807K101l4461o321j0539p8553k3383j9626p0214r2430q4754R250
10068B32779L7235k7724k6494j0223M0564L8821M5328L2729O614n544l2037l132
10056C28916L137J1020L424n8125j9439K5652Q7834L4866M6781M4066k3265K9294
10044E14161L1789r9231n0173k9833j3334m9631n7502m6804J9784J6706j3258
10033B22674l0294k4857N7674L2338k2580M043j4958J5739m385n5404j0384L1051
10021B00657j866k517P58K4747J8879j6444l8973M998L8175k9145j9348p268l3809
$$ y = [706970, 720250, 698615, 661035, 670499, 745834, 731513, 673079, 698379, 726988, 719632, 720772, 660837, 597755, 580944, 604893, 643212, 649505, 652160, 600269, 513294, 486672, 499558, 563766, 631902, 641709, 643810, 609349, 603028, 592489, 513936, 490553, 470927, 400713, 308283, 223529, 232779, 270014, 242290, 215796, 205573, 246137, 284958, 330286, 363015, 369629, 364085, 332048, 328916, 332053, 343073, 346497, 288372, 268933, 294585, 382419, 417285, 464066, 508132, 484867, 514161, 545950, 446719, 396546, 366713, 353379, 303748, 246246, 199442, 219226, 235932, 222674, 192380, 167523, 225197, 257535, 234955, 238998, 224040, 239779, 235394, 179990, 169606, 200657, 198791, 196274, 197032, 221779, 240658, 224214, 185241, 190239, 228414, 199269, 179921, 172653, 138844]
10008A38844n2514j605P5892J2165J3596J2661j2680O117j3525M7793N0842o0077
9996B17509l4882j2444k719l507P5447R789k7369J6851o7144m1617j5644K231
9984A16501O399m3572o891O6142N973L1324M7253M1556j3053m740j921J4591m3201
9971B16361J821L3533K644n2808L656k698l5235j4325j6493j82N6459J00641K5
9958B93399n4515n5658j8150J2618m8508L3894K1556K4483M2071Q7268K9769K0936
9946C89163K957N963L0387K1354p7203P118o241n9765l6402l7262j509J3079P1959
9933C23598L9294J0466j5775R012q203m2305m9964p0024P3714L8478L8590N6636
9921D03517J7768n5891m7662l5887k9670K0778L326K202P2362N7093m0694k5601
$$ y = [138844, 86330, 84725, 160617, 172782, 186378, 199039, 186359, 192476, 178951, 226744, 277586, 217509, 182627, 170183, 167464, 163957, 239404, 249193, 221824, 238675, 171531, 129914, 114270, 116501, 122900, 79328, 72437, 138579, 144552, 175876, 223129, 264685, 251632, 246892, 244971, 259562, 216361, 218182, 251715, 254359, 201551, 205207, 202509, 167274, 152949, 136456, 136274, 192733, 293374, 293399, 238884, 183226, 165076, 177694, 129186, 163080, 184636, 209119, 251190, 338458, 368227, 389163, 392120, 398083, 428470, 449824, 372621, 379739, 373498, 313733, 277331, 240069, 238560, 251639, 323598, 362892, 373358, 357583, 366595, 358392, 316087, 266123, 196099, 269813, 308291, 346881, 403517, 421285, 365394, 317732, 281845, 252175, 272953, 276279, 278481, 350843, 407936, 367242, 341641]
9909C41641L4329L6401J6052k6365L7334R6434K5101Q487N8987J15330P3601n2902
9897G64430k2783L5315r490j5471M9402R850q9278j11011n5903p3865j03750J0149
9885C87595J8790m1691J3563q570M5461o444n6660J6979M6752M8196N4342J8319
9873E36632K9112l757N396J6796J4742n1781L9890J07693J07784J02048J45685
9862A050240J98122K52037M23519M24655M41734M74873M05821J83692O2871J498
9852C919062k81973m54350l74620k90809k98608l60048k65051j31997j44131q0047
9842A237428n8002p5569m0395L522J5068k1111n9308N1879q4134o0706K187k4136
9830H86723m2673k1958m8911l8935l7532p3735K0840n386M8207K0511l9222j6301
$$ y = [341641, 375970, 412371, 428423, 402058, 439392, 535826, 560927, 569414, 628401, 743731, 817332, 764430, 741647, 776962, 767472, 752001, 801403, 811253, 721975, 610964, 555061, 481196, 377446, 387595, 406385, 364694, 378257, 369687, 415148, 408704, 352044, 369023, 415775, 463971, 518313, 536632, 565744, 561987, 567383, 584179, 598921, 547140, 587030, 694723, 802507, 904555, 1050240, 1248362, 1500399, 1923918, 2348573, 2790307, 3265180, 3671001, 3854693, 3917564, 3919062, 3637089, 3182739, 2808119, 2517310, 2218702, 1858654, 1593603, 1461606, 1317475, 1237428, 1179426, 1103857, 1063462, 1066984, 1082052, 1060941, 1001633, 1053512, 969378, 908672, 910859, 886723, 844050, 822092, 773181, 734246, 696714, 622979, 643819, 638433, 686640, 707151, 667929, 651628]
9818F51628K0914K1380k1745k3895j3736m1267l5274M9507J6505k263P7991L8263
9806G38008m365j240K3814N9301J61146R3246J6327L6175j5551q9419o9013p0758
9794H77671o2449r2937o1493q401J7316j1318J195k4569l2479n7716l4301J6221
9782E26740K1597n2125L8049L9780k6308n8765o2061q135L4714M363m349M792
9770D58292k373N6750R139K8872L1310N9667k7696k2709M4628J9446K4373O0486
9758G40185n1053l959M3017N1276p331Q88k9062l7747n7928k9924n1656k2684
9746E44022M7862M5296o917r4624k7180J6261R424k6783n0037J7519k3l6405K4730
9733D63145j0850K0556j0980k2031k4536K0100J4005n903p7233j7556K4753L3723
$$ y = [651628, 672542, 693922, 672177, 648282, 634546, 593279, 558005, 607512, 624017, 621754, 699745, 738008, 733643, 732403, 756217, 815518, 976664, 1069910, 1086237, 1122412, 1106861, 1017442, 948429, 877671, 815222, 722285, 660792, 652391, 669707, 658389, 659584, 635015, 602536, 544820, 510519, 526740, 548337, 496212, 534261, 574041, 547733, 488968, 426907, 418772, 453486, 457849, 453500, 458292, 455919, 512669, 521808, 550680, 581990, 641657, 613961, 591252, 635880, 655326, 679699, 740185, 689132, 685173, 728190, 779466, 772135, 773023, 743961, 706214, 648286, 618362, 566706, 544022, 591884, 637180, 630263, 535639, 508459, 524720, 534144, 507361, 457324, 474843, 474820, 438415, 463145, 452295, 472851, 461871, 439840, 415304, 435404, 449409, 443506, 366273, 348717, 373470, 407193]
9721D07193j4697l431L5137Q5769M8524K2192L1736oq92j7955K0740m326L0543
9708F40527J02936L5865R917j951J9164M5708K862J2598P696k0564j17670q2198
9696F54890n38J2577k7421j2105k8504k1840m422M0169M6511k6784j2818o4504
9684E55211j0234j8397j3219m353K1946R378L2677L4406R0809M4068L323O59o892
9671G39382O6079k3437k4550N1809q931M0393L874l0961L7498l8932o3103L3087
9659G82208N3920K609m6032l7092q428j1206K4630k2336K5863l584k3467l78n611
9646G31096J4057J0620k1936o1535m8689P865L1597L7597L9499O7200M1236N7243
9634I05850M6220K1037k6001l2693k616j6639l4243L9888O5486J2843J1500m6802
$$ y = [407193, 392496, 389065, 424202, 509971, 558495, 580687, 612423, 612417, 611525, 593570, 614310, 609984, 640527, 743463, 779328, 789245, 787294, 806458, 852166, 855028, 867626, 875322, 854758, 737088, 654890, 654352, 666929, 639508, 627403, 598899, 577059, 572637, 612806, 659317, 632533, 619715, 555211, 544977, 526580, 513361, 509008, 530954, 540332, 573009, 607415, 698224, 742292, 745615, 746274, 739382, 805461, 782024, 757474, 809283, 800352, 840745, 844619, 813658, 851156, 812224, 749121, 782208, 836128, 838737, 792705, 755613, 747185, 735979, 760609, 738273, 764136, 760552, 737085, 736707, 731096, 745153, 755773, 733837, 672302, 623613, 631478, 663075, 700672, 740171, 807371, 848607, 905850, 952070, 973107, 947106, 914413, 911797, 895158, 860915, 900803, 966289, 979132, 990632, 943830]
9622I43830l1290n6674o6566m9732j1492K5691j4840o7928k0635j7292R4374J11961
9610H39407J0623N6322L4083p431O3826J6624M8355K1086j534K1161K618Q67j546
9597A104461M736N6666R8092l6978n8776n5895K4326P4807N0541L2721k0117J5149
9585A289733L3370j1908k7174n6918m6118l9982K2855R8393K5025R1276J9394
9574A397946L704O1215J03011Q8169J43399R6494M3044J26862J05931Q8157R8134
9563B356066J25572J67211K09544J81153J40719J35181K44649K51306K23003K72552
9553D306956J62152J12226p456j29976j42715j97795j70485j41946j22257j17593
9543C551111r4598k6332l9988n109N7612O9745N5626J04140K11958L24659M37585
$$ y = [943830, 912540, 855866, 789300, 739568, 728076, 753767, 738927, 670999, 650364, 633072, 727446, 839407, 850030, 906352, 940435, 933004, 996830, 1013454, 1061809, 1082895, 1081361, 1102522, 1105140, 1106007, 1104461, 1109197, 1165863, 1263955, 1226977, 1168201, 1112306, 1136632, 1211439, 1261980, 1294701, 1274584, 1289733, 1323103, 1311195, 1284021, 1227103, 1180985, 1141003, 1163858, 1262251, 1287276, 1378552, 1397946, 1401650, 1462865, 1565876, 1654045, 1797444, 1893938, 1936982, 2063844, 2169775, 2257932, 2356066, 2481638, 2648849, 2858393, 3039546, 3180265, 3315446, 3560095, 3811401, 4034404, 4306956, 4469108, 4581334, 4573878, 4443902, 4301187, 4103392, 3932907, 3790961, 3668704, 3551111, 3456513, 3430181, 3390193, 3385084, 3442696, 3512441, 3568067, 3672207, 3884165, 4208824, 4646409]
9532D646409N41593O99191P83680Q17401Q12321O84968M51703J43509j56670k82007
9522I142098l25058l85952m67554m18857k64649k23684k39218k08114r8657q789
9512F501566L7440J8170K921J77211K58720L18979M03907N32542N89814P56292
9502I597562R98569J076625J014628R10238P17272M21146j97l72335n07083m46645
9492A3409780k93885p5158K25336M76068Q65621J324890J943257K709973L650282
9483B4236164M851335O288381Q058891R376992R191576P361144M852264K139186
9475G6355933j229563m424323n615734m428742k239822l62568R65801J729162
9467F0750144K279718K827395L165185L210068L662041M977691O279480O585072
$$ y = [4646409, 5188002, 5887193, 6670873, 7488274, 8300595, 8985563, 9437266, 9580775, 9424105, 9142098, 8817040, 8431088, 7963534, 7544677, 7280028, 7056344, 6817126, 6609012, 6510355, 6501566, 6539006, 6557176, 6560097, 6737308, 6996028, 7315007, 7718914, 8251456, 8841270, 9597562, 10596131, 11672756, 12687384, 13597622, 14314894, 14736040, 14735843, 14363508, 13856425, 13409780, 13115895, 13040737, 13266073, 13742141, 14607762, 15932652, 17875909, 20585882, 24236164, 29087499, 35375880, 43434771, 52811763, 62003339, 69364483, 74216747, 76355933, 75126370, 70702047, 65086313, 60657571, 58417749, 58055181, 59020982, 60750144, 63029862, 65857257, 69022442, 72232510, 75894551, 80872242, 87151722, 93736794]
9459I3736794N831361M484356L141904J555269o03400k436717l186525k914570
9451I9608472k662217k665637k238068j050882M28124J681770K720624L610693
9443I9432879M250739M938161O192669Q125571J1313056J5794548J9190708J8561516
9435A87799847J4210303Q372273J391543p995498j7718867k1722240j9617906
9428A44719455j5161044j0653349o720188l937584k531598k093769j802665j828656
9420I9990602j662390m18973J192588K710944L912015M557201M466436L662357
9412A18410780K163170J79711k001640m498569o893404p917367p576131o321750
9404H5544800m821079l432908k427809j825248j530757j432742j007422L1748
$$ y = [93736794, 99568155, 104052511, 107194415, 108749684, 108146284, 105709567, 102523042, 99608472, 96946255, 94280618, 92042550, 90991668, 91419792, 93101562, 95822186, 99432879, 103683618, 108621779, 114814448, 122940019, 134253075, 150047623, 169238331, 187799847, 202010150, 210382423, 211773966, 203778468, 186059601, 164337361, 144719455, 129558411, 118905062, 112184874, 108247290, 105715692, 103621923, 101819258, 99990602, 98328212, 97909239, 99101827, 101812771, 105724786, 110281987, 114748423, 118410780, 120573950, 120753661, 118752021, 114253452, 107360048, 99442681, 91866550, 85544800, 80723721, 77290813, 74863004, 73037756, 71506999, 70074257, 69066835, 69098583]
9396F9098583J701852L393767M372985M006993K227098j69081k685370n592255
9388G6354572q094190q652819p485889n826724m273352l184559k343815j632531
9380C4860693r99387m30556J06145O24089J125463J508869J743477J953593J892709
9371D2385095J477738O89875k45903j138830k007987k578512k870720k834425
9363C2876331k590577k275789k016169j781145j574399j353663j062577r40055
9355A9281957q44890o89457n51824m28456l50832l10450k34419j3442J734k0584
9345A5839337n8530q9390l16220m29774o19059p87741r50243q86638q83253p24332
9335A0094157n67998l68552k55360l08599l12218k48618l11341k91028k04930
$$ y = [69098583, 70800435, 74194202, 78567187, 82574180, 84801278, 84632197, 81946827, 76354572, 68260382, 59607563, 52121674, 46294950, 42021598, 38837039, 36493224, 34860693, 33861306, 33430750, 33536895, 34160984, 35286447, 36795316, 38538793, 40492386, 42385095, 43862833, 44552708, 44306805, 43167975, 41159988, 38581476, 35710756, 32876331, 30285754, 28009965, 25993796, 24212651, 22638252, 21284589, 20222012, 19281957, 18437067, 17747610, 17195786, 16767330, 16416498, 16106048, 15871629, 15858187, 15859921, 15839337, 15780807, 15691417, 15375197, 14945423, 14326364, 13538623, 12588380, 11701742, 10818489, 10094157, 9526159, 9157607, 8902247, 8593648, 8281430, 8032812, 7721471, 7430443, 7225513]
9326G225513k65849k19781j94496j32375r6091j29865k4709n0315l0115m0015
9316F041902o2020o3584j16943j11821j71792l00067l45401k93387p2003j33986
9306D370898k31766j96495j03838n9231j66249j49049j54751j39880j62148j44278
9296B863213j04415j60360r0661m5579j10509j08393q8875l9863j622l775n9821
9285B049340m2256j17995r4303n5328m1828q128o9500l8222o0059o9962k9708
9274A422051K1280K0365k2177m3830m2375k5934L7311M1156k9377p0227p2063
9263A236180m5776M6041N3900q2842j48863O485R121j1648n1953m172K2600m5156
9251I83917M4482J4682o6340j8752L83l2089l3231p383j6650r974j0335J1019
$$ y = [7225513, 6959664, 6739883, 6545387, 6413012, 6316921, 6187056, 6162347, 6112032, 6081917, 6041902, 5979882, 5916298, 5799355, 5687534, 5515742, 5215675, 4870274, 4576887, 4504884, 4370898, 4139132, 3942637, 3838799, 3779568, 3613319, 3464270, 3309519, 3169639, 3007491, 2863213, 2758798, 2598438, 2507777, 2462198, 2351689, 2243296, 2154421, 2114558, 2112936, 2109161, 2049340, 2007084, 1889089, 1794786, 1739458, 1697630, 1689502, 1620002, 1581780, 1521721, 1451759, 1422051, 1443331, 1463696, 1441519, 1397689, 1355314, 1329380, 1366691, 1407847, 1378470, 1308243, 1236180, 1190404, 1236445, 1290345, 1207503, 1058640, 1065125, 1074246, 1062598, 1010645, 1006473, 1029073, 983917, 1028399, 1043081, 976741, 957989, 958372, 926283, 893052, 885669, 869019, 859045, 848710, 859729]
9239H59729m0015m1834k8463q939J7085K8018o7603J9454K922J0813j4688K7871
9227G64350K0704l7543p784m6001K145K6907K4651K232j5370k8170m713J4699
9215G16107k4339j7793k0020k8285p8776N949r74K487l4814O034J1549L8330K0969
9202E96424j6575o207k8519j5206n379k7313l0836l0660M1801M1169j0197l1226
9190D77276k0955l1661L9917L0343p2173m4223N6649P1068K8638n9698l2053l1608
9178D11520p742J7018o246L4028P1220O4344o1494o3102k8255j9751p620j14P853
9165D11659K4785J6220r6517n5532j5948j3716j3362J0043P47J6539l4477o8225
9153A82216k3060N9003k731K6516M4738P2415k3587l4718m145j6565j3805J300
$$ y = [859729, 819714, 777880, 749417, 740478, 757563, 785581, 717978, 737432, 740354, 751167, 736479, 764350, 785054, 747511, 739727, 693726, 695871, 722778, 747429, 749661, 734291, 706121, 701408, 716107, 691768, 673975, 653955, 625670, 546894, 552843, 551869, 554356, 519542, 525576, 537125, 575455, 596424, 579849, 573642, 545123, 529917, 524538, 497225, 466389, 435729, 477530, 518699, 508502, 477276, 456321, 424660, 464577, 494920, 422747, 378524, 435173, 506241, 534879, 475181, 443128, 411520, 403778, 420796, 414550, 448578, 519798, 584142, 522648, 459546, 431291, 411540, 403920, 403806, 411659, 436444, 452664, 356147, 300615, 284667, 270951, 257589, 267632, 268379, 284918, 250441, 182216, 159156, 218159, 215428, 241944, 286682, 359097, 335510, 300792, 296647, 280082, 266277, 267577]
9141B67577p9847m3869m016M0733J20175q521p2864L0387Q777j1370n7865j520
9129A87777k1183j3505n8416j9595p309O780P892j2944N09k6464l7239K2309J7954
9116D6566M746O6502O6626M1695O039k7394R103N2333O1817K2137L1288l985m4556
9103C32917J5156l8433j3456k0957r476K880l5484k0381K1692N754m8239j9430
9091A72543K0212j1112K244O9883j1722o3920n9654J9075J6309K4693K902N0516
9079B31969m9296M263M4810k6969k8930L560N5598O5444L0764Q308l2117J4086
9067C21490R6300M7309J10343J91206N3990m7983k0413l1004r3846q5541o844
9056E35007j3243J4300J0472m1625r0093m3140n8616K1041M2518j6559K7332L3661
$$ y = [267577, 187730, 143861, 139845, 180578, 300753, 292232, 219368, 249755, 258532, 247162, 189297, 187777, 166594, 153089, 94673, 75078, 67769, 74549, 82441, 69497, 70006, 43542, 6303, 28612, 46566, 51312, 117814, 184440, 226135, 232174, 204780, 213883, 266216, 328033, 350170, 381458, 377473, 332917, 348073, 309640, 296184, 275227, 265751, 268631, 233147, 212766, 234458, 240212, 191973, 172543, 192755, 181643, 183887, 253770, 242048, 178128, 118474, 137549, 153858, 178551, 181453, 231969, 182673, 186936, 231746, 204777, 175847, 179407, 235005, 300449, 331213, 339521, 307404, 321490, 417790, 465099, 575442, 766648, 820638, 772655, 752242, 721238, 627392, 541851, 535007, 521764, 536064, 546536, 504911, 414818, 371678, 313062, 334103, 376621, 360062, 387394, 421055]
9044D21055n0883m4921j8627K773q665j449N508j8703l1795L323N8711K4731M5650
9031C86708K6338l9615N1495k925n224l5790J9342O8196N9488M6901R238J3126
9019E97278K8189P7725N4727n7763o0857q4164K8452l4391m2286l0796M4811R1414
9007F12339N8545K9709M0589m9806m4093p173k2923n7172m3582o1325j14388l2405
8995C08315k2312o6127L2601K7647N0542k471l1686o5599k850L6359M8364J568
8983C14351j8049o8600k731l9705J0740N0090R084r8944l1325N1860K6138L5345
8971B38254R6278R2341O0358j2285P718J456K792n958k9795n761L2677j9574j3850
8958D44651L1067j6834n8133o5834n0978m4286q3952j3216j9716m545M1269J5390
$$ y = [421055, 370172, 325251, 306624, 309397, 300732, 299283, 304791, 286088, 254293, 257616, 316327, 341058, 386708, 413046, 373431, 424926, 422001, 416777, 380987, 400329, 468525, 528013, 574914, 584152, 597278, 625467, 703192, 757919, 700156, 639299, 555135, 583587, 549196, 506910, 476114, 520925, 612339, 670884, 700593, 741182, 691376, 647283, 640110, 617187, 560015, 516433, 455108, 340720, 308315, 286003, 219876, 252477, 280124, 330666, 328195, 296509, 230910, 228060, 264419, 312783, 314351, 296302, 227702, 224971, 185266, 196006, 246096, 255180, 156236, 124911, 176771, 202909, 238254, 334532, 426873, 487231, 474946, 482664, 484120, 486912, 480954, 451159, 445398, 478075, 458501, 444651, 475718, 458884, 400751, 334917, 283939, 239653, 155701, 142485, 122769, 118224, 159493, 174883]
8946A74883l6107K6199k2287L6196n6676N4899R5830m1091l2054o4181J15P996
8934A43722n7976J9577P4293M4516m1934j0482N0827p0053l6840L9046L8950L5798
8922B29444k2418J0120K7998l9856m5387k3350O9463J4m8985r397j0420j446N715
8909A41495m696k9801m8982L738P17j2364k6277j11145M6187Q4131j1717k1707
8897I579o310k8239k0576O0944L9263j6280L5591m1822j4144R5090J7019J236
8885A31351l4768n778P1482q767l660R613m8441o3983m4800j9960O072j0106j6173
8872c7918l5833l4600O2109r521j3781p941J946J2140M0319M7505J3074q685o7960
8859c9146K4355Q1019J4665l6602J1933k3419o6101j0776O7972L0216l654K5269
$$ y = [174883, 138776, 164975, 142688, 178884, 122208, 177107, 272937, 231846, 199792, 135611, 135726, 143722, 85746, 105323, 179616, 224132, 182198, 171716, 222543, 152490, 115650, 154696, 193646, 229444, 207026, 217146, 245144, 205288, 159901, 136551, 206014, 206028, 157043, 147646, 137226, 135780, 141495, 136799, 106998, 58016, 61754, 62471, 50107, 23830, -87315, -41128, 43003, 31286, 9579, 3269, -24970, -45546, 15398, 54661, 38381, 73972, 32150, 18006, 113096, 130115, 131351, 96583, 90805, 162287, 153520, 149860, 159473, 111032, 47049, 2249, -17711, -11639, -21745, -37918, -73751, -108351, -46242, -55763, -69544, -77485, -75539, -63399, -23080, 24425, 37499, 28814, -39146, -14791, 66228, 80893, 44291, 56224, 32805, -33296, -44072, 23900, 54116, 50462, 75731]
8847G5731k2509j8383k5433q78L8958j121k3349l8910o4706M2547L7296l3224
8835c3981M0388j062K2028J5805o551o019j8872J7727N2050k5206q1124K920N0508
8822B8611K2776j285p126L2890m991M902o8570l4962L9368k7607k6930o5531J8290
8809i0165Q7540R7902K8426J6072L5505j3402r7057n2963L9921N7076L3400J4927
8797A57182r017r746J4458q0334m7962o771p6863n2151M2891P6118K6662J821
8785C6288N3242k7690o5117j2228M6429J0381J8679o802m1827O8816J3159j9619
8773G3711k8698M3588M4689J5652j7217K4288K7893p807j0931n834j5223n0086
8761I4025m4391l5298N7381L0420k6418l4578m1840Q896M8124m166n455j631J5277
$$ y = [75731, 53222, 34839, 9406, 8528, 47486, 46365, 23016, -15894, -80600, -38053, -757, -33981, 6407, 5345, 27373, 43178, 36627, 30608, 11736, 29463, 81513, 56307, -24817, -21897, 28611, 51387, 50102, 42976, 75866, 70875, 75777, 7207, -27755, 11613, -15994, -42924, -108455, -90165, -2625, 95277, 123703, 139775, 175280, 161878, 64821, 11858, 51779, 108855, 142255, 157182, 148165, 138419, 152877, 72543, 24581, 17810, -59053, -111204, -68313, 7805, 34467, 36288, 89530, 61840, -3277, -15505, 30924, 41305, 59984, 53182, 11355, 80171, 93330, 73711, 45013, 88601, 133290, 148942, 131725, 156013, 183906, 176099, 165168, 159334, 144111, 94025, 49634, 14336, 71717, 102137, 75719, 41141, -699, 8197, 56321, 52155, 46700, 45069, 60346]
8748F0346k5654j9665l6632k1234k6634J0857k4366l472P5863J02449O3344J9793
8736A74995o2015j1776L3307j4553N136J2241J7668l490j641N252l1012K6676
8724A50788L8456p157N930o7568j2144M6703M1479j4787n4818r616K5492k0639
8712A22119j8592K7081L1779l2064l426K0278O0911j730q8738n2233j3689p5477
8700b3781J892J10315L9931N808k4174J7184K3728j9818q863j745k1726K4344
8688A23095p5754p0161K3952J0748m8764N6750O6790k3307L675N203M2505J9396
8676A34128p504J695p4198k4211M7040L058n6583q2155M7478N0771L5387L5053
8664A09959k7755Q115p783R378q122L3790N596M2065L5868j2297p6566p2987m426
$$ y = [60346, 34692, 15027, -21605, -42839, -69473, -58616, -82982, -86454, -10591, 91858, 155202, 174995, 112980, 101204, 134511, 119958, 125094, 137335, 155003, 151513, 149872, 155124, 124112, 150788, 189244, 182087, 188017, 120449, 108305, 155008, 196487, 181700, 126882, 117266, 142758, 122119, 103527, 130608, 162387, 130323, 126897, 147175, 208086, 206356, 117618, 65385, 51696, -23781, -21889, 88426, 128357, 134165, 109991, 127175, 150903, 131085, 122222, 120477, 98751, 123095, 47341, -22820, 1132, 11880, -36884, 19866, 86656, 63349, 67024, 72227, 114732, 134128, 126624, 128319, 54121, 29910, 76950, 80008, 23425, -58730, -11252, 39519, 74906, 109959, 82204, 90319, 82536, 91914, 83792, 117582, 123178, 165243, 201111, 188814, 112248, 39261, 34835]
8651C4835m853J5795L231P534k6981M8057j2297K1835K6987P4558K5560R141j1982
8638B11420J6514r235m2679l7683j0248K9305m9679M8145J76L171j9721Q652l3909
8625A14229m3847K295N5056J3611n2792K4205r440K5580J7788N882k3340k2877
8613A06350l3475J3759N7095J7688O6263Q90K6355J27648O3546K5735K4563k9451
8601D66966l983N2552O1379N8264r01k8794M7028Q4597J5121k1350m6186p5931
8589F08762l9579k7181p8271l6485l2564n5185l6910m9036k5929J706k2760K4934
8577B31502N200j368L7249k119k3462K6748j3516l3516Q290P823o612L3681L7590
8564C07490p8116L95o5810p679L0842N8711L0606L267m9099P147m44J5865p184
$$ y = [34835, 29982, 45777, 49008, 56542, 29561, 77618, 65321, 87156, 114143, 188701, 214261, 223402, 211420, 227934, 218699, 176020, 138337, 128089, 157394, 107715, 155860, 156036, 159207, 139486, 148138, 114229, 70382, 72677, 127733, 141344, 88552, 112757, 103317, 128897, 146685, 152567, 129227, 106350, 72875, 86634, 143729, 161417, 227680, 228570, 254925, 382573, 446119, 471854, 496417, 466966, 462983, 515535, 576914, 635178, 634277, 605483, 652511, 737108, 752229, 730879, 684693, 608762, 569183, 542002, 463731, 427246, 394682, 339497, 302587, 253551, 227622, 229328, 206568, 231502, 236702, 235334, 272583, 270464, 247002, 273750, 260234, 226718, 235008, 242831, 236219, 269900, 307490, 229374, 229769, 163959, 156280, 187122, 245833, 276439, 279706, 230607, 237754, 237310, 253175, 245991]
8551B45991m0864m2815r0234l1043M9156M4652L7591J5530M448L423o732k2591
8539A66512J6085L5818m134j1387j4650j3313l6250J1806N1545J5845Q3324M1558
8527C42759q4377p6801k6805M9724R756k3995j320K8649R452q937j0786N8183
8515B65502M8410p2669o7070K0561O9547j4413K479O8297k9443k3501J1320n6474
8503B22546K7333K2576L2016k1360j09336k5883J0122j0441M874m449Q452l5739
8491A20711J0710L4247j1354J8608M7422M7966l8502q7824l8192N9621N2515K9240
8479B45168n094l207o194k8417j4295J4225j1622j2691k5206k234M368L5670q4726
8466A05745q0206M3709L5039K2489M8990J9812K8742j0955q7899q2489L3993L4360
$$ y = [245991, 205127, 162312, 72078, 41035, 90191, 134843, 172434, 187964, 192412, 195835, 189103, 166512, 182597, 218415, 214281, 202894, 188244, 174931, 138681, 150487, 202032, 217877, 301201, 342759, 258382, 181581, 154776, 204500, 214256, 190261, 188941, 217590, 227042, 218105, 207319, 265502, 313912, 241243, 174173, 194734, 264281, 249868, 252347, 320644, 291201, 267700, 279020, 222546, 249879, 272455, 304471, 283111, 173775, 147892, 158014, 147573, 152447, 147998, 156450, 120711, 131421, 165668, 154314, 172922, 220344, 268310, 229808, 141984, 103792, 163413, 215928, 245168, 240074, 236867, 230673, 202256, 187961, 202186, 190564, 177873, 152667, 150433, 154801, 190471, 105745, 25539, 69248, 104287, 126776, 175766, 195578, 224320, 213365, 125466, 42977, 76970, 111330]
8454A11330J649k2896k3710n354K7817P7775K9151l3051r4014n3547L8538Q9477
8442A43165Q570l5784m7975L3852J3403j332p1374n4309R3374o722o0927L9718
8430E3659K4238o1569l7056M852j5215Q625N6768K2466l5006l2123l1979M4459
8418B119R4151L0574l542j3030R8048l9684l4894m2885j2020M3033M3392M6486
8406B11748r022q059k345q4459n1514K8784L6297q9330m8471M0980M1513K4229
8394I0351N3278L1470m2790L3729j8990o7014K5602j4057j3275n7415l3407P151
8382e367J6442k1273J9946N1464M5793j6732p005L0899M5212k6721J1152N4733
8370A98543O1901L9307l3187l2115J3427j14683o0418L8134k229P646L5472j434
$$ y = [111330, 112979, 90083, 66373, 61019, 88836, 166611, 195762, 162711, 68697, 15150, 53688, 143165, 151735, 115951, 67976, 101828, 115231, 113899, 42525, -11784, 81590, 74868, 13941, 53659, 77897, 16328, -20728, -15876, -31091, -22466, 34302, 56768, 21762, -10361, -42340, 2119, 96270, 126844, 123302, 110272, 208320, 168636, 133742, 90857, 78837, 121870, 165262, 211748, 202726, 194667, 192322, 107863, 56349, 85133, 121430, 32100, -16371, 24609, 66122, 90351, 143629, 175099, 132309, 166038, 147048, 80034, 105636, 91579, 78304, 20889, -12518, -5367, 11075, -10198, 9748, 61212, 107005, 90273, 83268, 114167, 159379, 132658, 143810, 198543, 260444, 299751, 266564, 234449, 247876, 133193, 72775, 110909, 108680, 116326, 151798, 150364]
8358A50364m1835k2097J8900N240j9745p1246M3588N3190l1949J7128j3935m0537
8346D7066M8601L6157m0630m0502K013N881K8304P223o93m5826k3923M339m0128
8333a2118N0160P55L9961J1325L8134r032q7510n013l8269K5837M2995l7507j0520
8320I198m0368N4388O0317p413J5614l6637k8715k1205J62M0207O0035k3437l3395
8307D8751m3197m3254n9700Q227L1374N5848R4574K9607M59n4028j06778J1632
8295b6485O9847K8745l7963k5265R691M2316o0515o1472Q1235O3646L1818m8988
8283F6610k3488l9786j9141n647o023p114r700J2613R303L040N74j1129N2628
8270B2740k623O462o0149n3709K1240N1809J4446L4430k6794K3704J3139K6290
$$ y = [150364, 108529, 86432, 105332, 110572, 90827, 19581, 63169, 116359, 84410, 101538, 87603, 47066, 95667, 131824, 91194, 50692, 52705, 58586, 86890, 94113, 93420, 47594, 23671, 28010, -12118, 38042, 38797, 78758, 90083, 128217, 119185, 31675, 26662, -11607, 14230, 57225, 19718, 9198, -31170, 23218, 83535, 76122, 91736, 55099, 26384, 5179, 5341, 45548, 105583, 82146, 48751, 5554, -37700, -97400, -89173, -57799, -1951, 92623, 122230, 122689, 68661, -38117, -26485, 43362, 72107, 34144, 8879, 18570, 60886, 371, -61101, 20134, 83780, 115598, 66610, 43122, 3336, -15805, -21452, -27475, -34589, -44289, -31676, -22373, -19333, -18759, -29888, 22740, 20117, 26579, -33570, -87279, -66039, -14230, 216, 34646, 7852, 31556, 44695, 70985]
8258G0985k0508o0849L0557L1309l5457q389P5229P5800K051p5565o2002M6614
8246F9775m6744o6651j2290j0115m0711M1925M8896K6997j20520L8729K9703N7596
8234A6590N3490j995n0945N408L0574Q734N2681J0199k6541l8059q3340l8523
8222f1727l015J8686N0121M0970K2051L4038k9826l7096M0419K5954l9368o9348
8210h141l5675O2756N0365L4076J906n2033P954J3219M472r197R450L6027m8833
8197F6346l0102r067m3309K9274k2352k0992O6679J7698p6727j4907N1750R6440
8185A10731N4456k4990o087k5081p2002O9486M4051P636K1947o8801q2979P112
8173C5479K8771K3411l0919l2516K1345K5272j255L3739n1603m7809P5476O6209
$$ y = [70985, 50477, -10372, 20185, 51494, 16037, 7648, 82877, 158677, 160728, 85163, 23161, 69775, 23031, -43620, -55910, -66025, -106736, -64811, -15915, 11082, -109438, -70709, -41006, 16590, 70080, 68085, 17140, 22548, 53122, 61856, 114537, 124736, 98195, 60136, -23204, -61727, -64742, -46056, 4065, 45035, 67086, 101124, 71298, 34202, 74621, 100575, 61207, -8141, -43816, 18940, 69305, 103381, 105287, 53254, 61208, 74427, 78899, 69702, 79152, 115179, 66346, 36244, 27177, -16132, 13142, -9210, -30202, 36477, 54175, -22552, -37459, 14291, 110731, 165187, 140197, 134110, 109029, 37027, 106513, 150564, 158200, 180147, 111346, 28367, 35479, 64250, 87661, 56742, 24226, 45571, 70843, 69588, 103327, 51724, 3915, 79391, 145600]
8161A45600p931k9173m7067m8304j1700j7381K8866K0576k3324l1237M3794j3073
8149I646P781M371K7542l5904K5833P9474o825l4315m867o595n805k8902l0043
8136A391p844m9419r385M1497K6355K7107l7339J4417Q222k1681m7955j5206P3790
8123C950P0787p796J5430O3559J9115j7992p0733k1606k41j1190l8799M6038R7894
8110A48416L7756J2999o7496n0644K2820N4279k5980J8987J9641Q715L4084k2683
8098A90894N210l0401O352K9675K8109o137o7729o0735m7872K765K162J2446k5829
8085C8910N8278M8150l66j2514J3300n4900l7125k1015j8570J6043K2343j5627
8073C6907J6858j4704K8630l3402R010P8747j6926q8543m9648M8236N2182M7693
$$ y = [145600, 137669, 108496, 61429, 13125, 1425, -15956, 12910, 33486, 10162, -21075, 22719, 9646, 17427, 21798, 49340, 13436, 39269, 118743, 111918, 77603, 72736, 66141, 60336, 31434, 1391, -6453, -55872, -65257, -23760, 2595, 29702, -7637, 6780, 15002, -6679, -54634, -69840, 3950, 74737, 66941, 82371, 145930, 165045, 147053, 76320, 54714, 54473, 43283, 4484, 50522, 148416, 186172, 199171, 131675, 81031, 103851, 158130, 132150, 151137, 170778, 179493, 213577, 190894, 196104, 165703, 172055, 201730, 229839, 223702, 155973, 95238, 47366, 50131, 52293, 64739, 38910, 97188, 145338, 144972, 132458, 145758, 90858, 53733, 32718, 14148, 30191, 52534, 36907, 53765, 39061, 67691, 34289, 43299, 122046, 105120, 16577, -33071, 15165, 67347, 115040]
8061A15040k1281r844l0577K2287k1586J2369L4048k0349O115l2226J9795M4907
8049A18698p234j1210o8660P051M3689K1051k7196j7438m5013J4988R4362k1126
8037A01962o4012K8924p32o6945K0816p080m5395j7584k740J7295J4307M8013
8025B6829M6618K8786k5961n883p722k7057j9004j4452N5386k1246K8385N9599
8013A24278j5951m1293L9627K3550L266o8475J2694O9230k9904o522n768p080
8001I7652l0574j1550J06241N5751p3794q1513O170P4378M864J3297l41K5542
7989A86123M2472k9184n3792k7091m753M8748N0830K899K015k3999m9690J0495
7977A55073j7425J6789R668N1785k9376j0319L1611M6402N9511j2223k8216J0367
$$ y = [115040, 93759, 83915, 53338, 75625, 54039, 66408, 100456, 80107, 86222, 53996, 73791, 118698, 111464, 100254, 31594, 38645, 82334, 103385, 76189, 58751, 13738, 28726, 123088, 101962, 37950, 66874, 66142, -803, 20013, 12933, -32462, -50046, -52786, -35491, -21184, 26829, 73447, 102233, 76272, 70389, 62667, 35610, 16606, 2154, 57540, 36294, 64679, 124278, 108327, 67034, 106661, 130211, 133477, 65002, 77696, 146926, 117022, 110500, 104732, 97652, 67078, 55528, 161769, 217520, 143726, 62213, 68383, 142761, 147625, 160922, 160581, 186123, 228595, 199411, 145619, 118528, 113775, 162523, 213353, 216252, 218267, 194268, 144578, 155073, 137648, 154437, 164105, 215890, 186514, 176195, 207806, 254208, 313719, 301496, 273280, 283647]
7965B83647J815k0327q179O6778m4367m3336J8666J3433j5486r508Q526K0495
7953B72157k6511l5540L6049j0939K28l4214R898m0230J1829N6729o0745M623
7941A83334N6292k2953n146j816m4379k2850L7547j0731m6065k0488J7520M2718
7929A62983M7035m3765J5831K0978L1203j131J6902M749j6524K5114K0004r118
7917B74261K7339M2508J2012j4298j3105l208p989M5488j6429j7943k5852k3678
7905B79106J6348q1551k3442J2341j0917J7171j7001j2312L8390K3075k6162L722
7893B18768j4577K7929K5512j8817n5813k3484l9774o8052J1759j3246n331J8668
7881F3542J3043l8900l5855L1049M0334j2192N1293l8497j0166J5758J4197Q747
$$ y = [283647, 285462, 265135, 256956, 323734, 279367, 236031, 254697, 268130, 252644, 243136, 251662, 272157, 245646, 210106, 246155, 235216, 235444, 201230, 211128, 170898, 182727, 239456, 178711, 183334, 239626, 216673, 211527, 209711, 165332, 142482, 180029, 169298, 123233, 102745, 120265, 162983, 210018, 166253, 182084, 203062, 234265, 233134, 250036, 254785, 238261, 263375, 283379, 274261, 301600, 344108, 356120, 341822, 328717, 325509, 317520, 363008, 346579, 328636, 302784, 279106, 295454, 213903, 190461, 202802, 191885, 209056, 192055, 179743, 218133, 241208, 215046, 218768, 204191, 232120, 257632, 238815, 183002, 159518, 119744, 51692, 63451, 50205, 44874, 63542, 76585, 37685, 1830, 32879, 73213, 61021, 112314, 73817, 63651, 79409, 93606, 102353]
7869A02353k723m2920k9568L9601L752J9701j813K2084k5143L0424J0879R596
7857A36223P8687N865m7811j9118L6997j0053n3380J537o033k0358O275M194j6273
7844I6752n447j0Q104R326m7431n4650m0582l3091N0627J9972l476M1078K7802
7831F8974Q180k709m3301K3990O9209r9663l3698O972N323J8199J3086M3192k2849
7818E4905q3375j7084K4284O8107j0874l5237m155k5948k1301J2685O2773K4127
7806D8907k5329k5492J526J6694m4463R69J9036J3489l4941k4754M4263N9667
7794D9572O5872j19598o7163L2147M1465l1504M7940M567p8434k7698n395P0045
7782a8184j273L2406M3809l3131m4922M2311j9409l3204j0360N3509K789r68n5745
$$ y = [102353, 99630, 56710, 27142, 66743, 70495, 90196, 88383, 110467, 85324, 115748, 126627, 136223, 214910, 220775, 172964, 153846, 190843, 180790, 127410, 128947, 122914, 102556, 108831, 113025, 96752, 91305, 91295, 99399, 108725, 61294, 6644, -33938, -67029, -16402, 3570, 94, 41172, 68974, 77154, 74445, 31144, 55134, 124343, 24680, -9018, -2046, 3277, 21476, 34562, 77754, 54905, -28470, -45554, -21270, 46837, 35963, 726, -3429, -29377, -50678, -37993, 24780, 48907, 23578, -1914, -388, 16306, -28157, -27188, -8152, 5337, -29604, -54358, -10095, 49572, 115444, -4154, -71317, -39170, 2295, -29209, 18731, 23298, -55136, -82834, -88229, -18184, -19457, 12949, 56758, 23627, -21295, 21016, 1607, -31597, -41957, 11552, 14341, 13373, -42372]
7769d2372L1535O345N383l1626j0332j5920L9786L1762N5500m4005r8094n7363
7757a29401O0776L6806k8173l6635N7342L8197j7385P2044P8407l6104m5955r1034
7745d1115K151j6945j9435O8636M5351k0250m1137n7247j1537R840L2599O2598
7733A3509P465j4606j6031j034k1369n6858J423Q0605k2499j3934L2427j3603
7721b4505j6129o139L1699J449J7252L7178K9799L7532j791k6557l8755o2198
7709b1165k179o585q901q222M4720J855M213j1520N578j6122N644m997K9154L0242
7695D1715o7940k7126p520n197Q717r134M1248M5943L9715j7471k9640k5797r3091
7682a05578l9284M6850N2676J5120j1956J3332R56P094r90J2614L0774O3k3502
$$ y = [-42372, -10837, -4492, 891, -30735, -41067, -56987, -17201, 14561, 70061, 26056, -72038, -129401, -68625, -31819, -59992, -96627, -39285, -1088, -18473, 53571, 131978, 95874, 49919, -41115, -38964, -55909, -75344, -6708, 38643, 18393, -22744, -79991, -91528, -81688, -49089, 13509, 20974, 6368, -9663, -10697, -32066, -88924, -87501, -6896, -29395, -43329, -10902, -24505, -40634, -46773, -15074, -13625, 3627, 40805, 70604, 108136, 106345, 79788, 41033, -21165, -23344, -29929, -38830, -47052, -2332, -477, 3736, -7784, -2206, -18328, -12684, -17681, 11473, 41715, -26225, -53351, -60871, -66068, -57351, -66485, -25237, 20706, 60421, 42950, 13310, -12487, -105578, -144862, -98012, -45336, -30216, -42172, -28840, -27884, -20790, -21780, -9166, 21608, 21671, -1831]
7669a831Q044j9946K3164K5644K1976n760m0820l6295J2766l552K0851j7255l4040
7656d7054K4589L1622N5207k2116m0135p927o2080q7129K8056L3661L9294Q950
7644d5062k7620k701l165l6337k6141N6602L7511J3687J0899r174k3472m9115
7632a04088j03233J6982P1176Q1699J6248n6229J4898Q0709N3133K768n7749k1541
7620e227R123l4543r450J637k692R7180J0519p904o6707N731p99m9091k3385N6592
7606a9016O0314r754m0415j5548j7278J2745J0804K2629q2107p4081j5280L4602
7594a32385k089N1977K3221m8316n0597K7973P5741R6100l956m938n0291J475
7582a6085l2715l2390J9316l6330N9416j999o8774l2464j4799Q4427M7422l4317
$$ y = [-1831, 6213, -13733, 9431, 35075, 57051, 51291, 10471, -25824, -13058, -16610, 4241, -13014, -47054, -22465, 9157, 64364, 42248, 2113, -5814, -67894, -155023, -126967, -93306, -54012, -45062, -72682, -75383, -78548, -114885, -141026, -84424, -46913, -33226, -22327, -31501, -54973, -104088, -207321, -190339, -119163, -37464, -21216, -77445, -62547, 18162, 71295, 74063, 16314, -5227, 3896, -30647, -40097, -38460, -41152, 56028, 66547, 58643, -8064, -2333, -3132, -52223, -75608, -19016, 41298, 31544, -8871, -24419, -41697, -28952, -18148, 4481, -77626, -151707, -166987, -132385, -134474, -82497, -59276, -107592, -158189, -130216, -54475, 41625, 37669, 32731, -17560, -16085, -48800, -81190, -61874, -98204, -38788, -40787, -109561, -142025, -156824, -72397, -24975, -59292]
7570e9292M5307J2662p999N6866N6512l452j14295j8533M3733q834p707L9097
7558C4065J5477k031n6636L2522L2220J9638m0015o7433j5208j4448l7569N590
7546i3828J8070K575M666J7003Q9944L7151o4472k4036L3009m2129k8594L0096
7534b0545j6976O7630K2174j3143j6993j4544n5289k1432J3731m744K8473J6494
7522a5164M4833J0979p4480l0165J4152j8443K8884L3754O454K8758o415L037
7510B6184n4296K2604M6845K5183j2923m1130L9154L7243q9842j22565J630L6587
7498h5326M9015P7091n3647k0942N7228P925k9712l2937k5634l8226K3280P0172
7486a713q339k6722m4051m7579O040L0488L5885O880N9887p922l9018m0821l5880
$$ y = [-59292, -13985, -1323, -9322, 47544, 104056, 100604, -13691, -32224, 11509, 2675, -5032, 34065, 49542, 47511, -9125, 23397, 55617, 75255, 35240, -32193, -47401, -61849, -99418, -93828, -75758, -73183, -68517, -51514, 38430, 75581, 11109, -12927, 20082, -22047, -50641, -20545, -37521, 30109, 52283, 39140, 22147, 7603, -47686, -69118, -55387, -60131, -31658, -15164, 29669, 40648, -33832, -63997, -49845, -68288, -39404, -5650, 804, 29562, 23147, 26184, -28112, -5508, 41337, 66520, 53597, 12467, 51621, 88864, -978, -123543, -121913, -85326, -36311, 40780, -12867, -33809, 23419, 31344, 1632, -31305, -56939, -95165, -71885, -1713, -10052, -36774, -80825, -128404, -122364, -91876, -55991, -49111, 10776, 2854, -36164, -76985, -112865]
7473a12865k4869J00526K4892p8888o3225L849l8448j3625K3923M4191R0992N4924
7461A1377O2587O654n8034o4653O150Q4553P515j7326n8037L8855K8820P333n1507
7448D287k9947L6929j924J8757k7121l7807j9430k1018M2933J2006l1677O1221
7436G209M3614r751m633L2126l2739j8956l7659l5154j6863k2240J1897P2560
7424a0589P570k6953l6841L3299P103m0988l2307L1850r343N565M0960K2817m0839
7411d8696k0496m683N8204P2102m1525o3905l2374J9598J2035n8814L364j8731
7399a23921k3552m866N8001J7461p271j4817M6074M5196K0772l3076L7145Q629
7387B5775J0720l5874n0251j645L6165m0140k1023n63q519j0405J5005K241L7132
$$ y = [-112865, -137734, -37208, -12316, -91204, -154429, -150580, -189028, -202653, -178730, -134539, -43547, 11377, 73964, 80618, 22584, -42069, -35919, 48634, 56149, 38823, -19214, 19641, 48461, 55794, 4287, -25660, 11269, 9345, 28102, 981, -36826, -56256, -77274, -34341, -22335, -54012, 7209, 50823, 41072, 36439, 68565, 35826, 16870, -20789, -55943, -72806, -95046, -83149, -10589, -3019, -29972, -66813, -33514, -26411, -67399, -99706, -67856, -77199, -71634, -30674, -7857, -48696, -69192, -73875, -15671, 56431, 14906, -48999, -81373, -61775, -49740, -108554, -105190, -123921, -147473, -152339, -94338, -76877, -84148, -98965, -52891, -7695, 13077, -19999, 17146, 25775, 36495, 621, -49630, -51275, -15110, -55250, -76273, -76836, -85355, -95760, -80755, -78514, -41382]
7374d1382R2639j209k6150j0886L8402J9929j5860M0457q2471n332N3650n3842
7362G945j1416K3030L9489l7223j12177o630L7592O4872L5182K276J8296k7017
7350C4219r9639k3966L6419k3406k0464j3287k2098N4929Q3192o24q2879l9617
7338a17221k0723L5965N5976Q911n4775k43l8535K074O0147K0501l8044p1267
7326a57234k8103K0617P9420L6079m7400N825N4107K5093O469j4559k4533Q3921
7314C9702O8439n0983p625m6821k94o5350q2819K6669K092J4073N1532J0681j7212
7301e7916o508M5812K8644r4038r370L0531M176J6064k1520n925P0082j5058l2235
7288d7261k1164L6235R0514m7472m0283J851K2552J1953L5062N1413P2184o2186
$$ y = [-41382, 51257, 50048, 23898, 13012, 51414, 71343, 55483, 95940, 13469, 8137, 61787, 7945, -3471, 19559, 59048, 21825, -90352, -96982, -59390, 5482, 40664, 42940, 61236, 34219, -65420, -89386, -52967, -76373, -96837, -110124, -132222, -77293, 5899, 5275, -77604, -117221, -137944, -101979, -46003, -37092, -91867, -92110, -130645, -128571, -68424, -47923, -85967, -157234, -185337, -164720, -85300, -49221, -96621, -90796, -36689, -11596, -5127, -19686, -44219, 39702, 108141, 57158, 49533, 2712, 2418, -62932, -145751, -119082, -116990, -102917, -51385, -40704, -57916, -64424, -18612, 10032, -84006, -93376, -62845, -58669, -42605, -64125, -70050, 32, -15026, -47261, -68425, -32190, 58324, 10852, -29431, -27580, -5028, 6925, 41987, 93400, 165584, 103398]
7276A03398j03134O307j6843q9733l6616l2855L2210O6585J8812l6485J1473Q3
7264g6798j7169k9051K3841L9473Q6689J3948o7093p5264K3543K2175K817o421
7252e9310j0185J7138n817l4678K6968L8322l8578M008R251J3172j5903L1980
7240b3632J0225K7244O195O024p4031n5363L3083O4964P332K4257q6341j9094
7228g9137J4630O3202M4239k4145p5532j1774O4670n536n1475k0807L819L8538
7216c9308M7604n5468M080L5390L275j4301l2561l7061M08L7627R1358O4241r894
7203I5390j13218p8119M7997P7836N0561o9773m6506m8514O838J7902K9888J06589
7191G6871n0397m4578r54m5145o350J2456L2103N8459l3774k196R373q0923q270
$$ y = [103398, 264, 6571, -10272, -100005, -136621, -169476, -137266, -70681, -51869, -88354, -76881, -76798, -93967, -123018, -99177, -59704, 26985, 40933, -26160, -101424, -77881, -55706, -52889, -59310, -69495, -52357, -58174, -92852, -65884, -27562, -66140, -62132, -52881, -39709, -55612, -23632, -13407, 13837, 20032, 26056, -47975, -103338, -70255, -5291, 2041, 26298, -60043, -79137, -64507, -1305, 42934, 18789, -56743, -68517, -3847, -9383, -60858, -81665, -77846, -39308, 8296, -47172, -43092, -7702, -4427, -18728, -51289, -88350, -87942, -50315, 41043, 105284, 95390, -17828, -95947, -47950, 29886, 80447, 10674, -35832, -84346, -77508, -59606, -29718, 76871, 26474, -18104, -19058, -64203, -70553, -58097, -25994, 32465, -1309, -3505, 5868, -75055, -83325]
7178h3325J4082n2375N1345O8217O641n0992M423O541q891n6569j7516K8812K1251
7165f8356M534J01531P0052l3463q835p956j6411n5876m5167k2820k8211J7450
7153i3528p750L2742o175j7648j6402L0958m162j7928K8188K9615K4370O727l0343
7140d1336N2948p1299J8223L3575j5658j229m939j2788J6025j4783K2627M6899
7128B8265k0201M247J9289P832j3891k202o2485l6046p029M1387J3475K9307j0714
7115h766J2153k8789j5841p725O936N559l0939q963j5657O2127L2445l6223k2588
7102e6271j2160k4481K1975O1053J4115K966K4281k7113O568j1532k7625J7554
7090a0670J4439K413Q7982N975L185l9394k0688j209j13472m9846J8001j2670
$$ y = [-83325, -69243, -121618, -70273, -2056, 4585, -46407, -41984, -35443, -44334, -100903, -118419, -89607, -68356, -63822, 37709, 107761, 74298, 65463, 57507, 41096, -14780, -59947, -82767, -110978, -93528, -101278, -68536, -74711, -92359, -108761, -77803, -81965, -99893, -71705, -42090, -17720, -10993, -41336, 11612, -59687, -41464, -7889, -23547, -24776, -29715, -42503, -26478, -41261, -18634, 28265, 8064, 12311, 31600, 39432, 25541, 23339, -39146, -75192, -82221, -40834, -27359, 1948, -8766, 3387, -25402, -41243, -48968, -42032, -36473, -67412, -76375, -92032, -29905, 2540, -33683, -56271, -68431, -92912, -70937, -9884, 4231, 7197, 31478, 4365, 10933, -599, -28224, -10670, 3769, 6182, 94164, 100139, 103324, 63930, 43242, 42033, -71439, -121285, -103284, -115954]
7078a15954M2843q526J5698K5918M8276j267j9011m14r379l1568k1789Q3749q082
7065D94n9562j533R15K1097L5306M4438o0249j7030j1450j9693J7855N3278L3791
7052C7657l4642n646K680o2761J1278K0816l3624j4974K6179K5041J9125n186
7040a4057o3985k0829K9044m432r930k969O468L5630p0401K7064J7946j3781j6732
7027a00964L8594k4998m0696K0237P841M2948L8730M0319K3293r084j2324L0771
7015E4667k5287L9258K4810R5269J6114j08124j33660k9560J3743L5531K0930
7004C691L1752L5727L2559l8702o7074K08N4538l518o9882j2399J8912n170q364
6991b7722L4869j782k1598N3574J806J63J4375j2082l2073k0884n998n262p6779
$$ y = [-115954, -73111, -81637, -65939, -40021, 8255, 6988, -12023, -12437, -21816, -53384, -75173, 8576, 494, -59068, -60601, -59686, -38589, -3283, 41155, -19094, -36124, -47574, -67267, -49412, 3866, 37657, 3015, -2631, 49, -62712, -51434, -30618, -64242, -79216, -53037, -27996, -8871, -14057, -78042, -98871, -69827, -74259, -84189, -87158, -80690, -45060, -115461, -88397, -70451, -84232, -100964, -62370, -87368, -128064, -107827, -99986, -57038, -18308, 22011, 45304, 36220, 23896, 54667, 29380, 68638, 93448, 188717, 204831, 96707, -36953, -66513, -52770, -17239, 3691, 35443, 71170, 103729, 65027, -2047, -1839, 52699, 49181, -20701, -33100, -14188, -19358, -27722, 7147, 5365, -16233, 37341, 39147, 39310, 53685, 41603, 9530, -11354, -17352, -22614, -99393]
6978i9393O2366Q3123Q1235o4076q5042k8276N0828N5615K3563k936Q879L0606
6966A16492j570k9394j1511m5739j5773L3693j5525l9122j0086J396L471m3425
6954e7093n073R861j4438J6813j0144J7127O3020L0012o0262l955q753m0913M5492
6941a8306Q808l4907k0952Q126K5304l0563k5782K8886k7188j7770J0662J2098
6929h1584k4422p936O5653Q772n2587M668L6601L439k6149L967o223j0363K2576
6916f3588L6796k927J7342k2690l2713M1120M9180n3652r679n083M4595L187l9160
6903c7272N739L7949r160l5185l3954J6419Q0774L8581k7445q9664j6894M5169
6891b4943j9211n7542m654P6963N2728m0224P579K4880M6665m0536p7857N8004
$$ y = [-99393, -37027, 46096, 127331, 63255, -21787, -50063, 765, 56380, 79943, 77007, 85886, 116492, 114922, 85528, 74017, 28278, 12505, 46198, 30673, -8449, -18535, -17139, -13668, -57093, -62166, -52305, -66743, -49930, -60074, -42947, 20073, 50085, -10177, -14132, -22885, -63798, -18306, -9498, -44405, -65357, -57231, -31927, -62490, -88272, -59386, -86574, -104344, -93682, -81584, -106006, -113942, -48289, -39517, -92104, -87436, -50835, -47396, -73545, -69578, -75801, -86164, -63588, -26792, -29719, -12377, -35067, -67780, -26660, 22520, -31132, -40811, -45894, -1299, 1888, -37272, -31533, 6416, -2744, -37929, -71883, -55464, 25310, 63891, 36446, -53218, -70112, -24943, -44154, -101696, -106350, -29387, 23341, -16883, -9304, 15576, 62241, 21705, -56152, 1852]
6879A852m300r6445M3M7013K5085J4502J8201l2979j8599K6821l8403m0736L7522
6866f0423M1822N9312k8950m4798K8240L8494j6098j7740p195j9497k5337M3437
6854h733J6346l6497n456K3219k5226j8907J076K8040J7839K2129M1968O535J1670
6841G4003n0970l1726K7951J8238j4423k9161r769J4198j0349M046N518j8541
6829b0985K6052k4400j6991j9079n4192j9130L2418l7569j0402Q3337L6733j1931
6817c6139m0747j8327N8001K9421p456l9960J7849O9391L5789K3040n4976j1919
6805B3967J8189n2341N450L44j9140N381l6071q885O0554L2468L1086M633o441
6792E9194l1773k9962j6623l489m8563N9049O054l8598p6865Q885R767M7351L4410
$$ y = [1852, -2448, -98893, -98850, -51837, -26752, -12250, 5951, -27028, -45627, -18806, -57209, -97945, -60423, -18601, 40711, 11761, -33037, -4797, 33697, 17599, -141, -7336, -26833, -52170, -8733, 7613, -28884, -34340, -11121, -36347, -55254, -54178, -26138, -8299, 13830, 55798, 62333, 74003, 23033, -8693, 19258, 37496, 23073, -6088, -15857, -1659, -12008, -7962, -2444, -20985, 5067, -19333, -36324, -55403, -109595, -128725, -96307, -133876, -144278, -60941, -24208, -36139, -76886, -95213, -37212, -7791, -15247, -55207, -37358, 32033, 67822, 90862, 35886, 23967, 42156, -10185, -4735, -4391, -23531, -18150, -54221, -63106, -2552, 29916, 61002, 65635, 59194, 27421, -2541, -19164, -22653, -71216, -12167, -6113, -44711, -121576, -112691, -102924, -55573, -21163]
6779b1163J1628m443N3876R098q562M050q421L226m8005m2231l7627k1756L0966
6766g9364O1533R834j2439m8446P720j1742M8882M7788m506j193k0716r3618K2145
6753g4122M4283k2432Q608q446L5278m4108Q721p816L0040q454J1552K4242k3776
6740b6430L7659L4387J2937Q33K0168j5086q0544k6376M309K018P5333K015m1031
6727A92J2915M1981L0688m2759o4150n1901M5513Q9442l5994K7575K7755j4874
6715F6383o0999j8632J769J1414L2262J2559m4437m7748N973l598J3156K0494
6703a1404j5793K3838K9176K0084j7432r6045P675R0571P31j4405m029J146K2344
6690C6457m1985Q979n4937j6110L8420l600j7150M831o8304J6312Q345l415l9122
$$ y = [-21163, -9535, -13978, 39898, 48996, 40434, 44484, 36063, 39289, -8716, -50947, -88574, -110330, -79364, -17831, -7997, -20436, -68882, -61162, -72904, -24022, 23766, 19260, 18067, -2649, -96267, -74122, -29839, -52271, -43663, -52109, -16831, -60939, -52218, -60034, -29994, -38448, -26896, -2654, -26430, 11229, 45616, 58553, 59386, 79554, 64468, -16076, -42452, -38143, -36125, 39208, 41223, 192, 13107, 55088, 85776, 43017, -21133, -73034, -27521, 61921, 25927, 53502, 81257, 66383, 5384, -13248, -11479, -65, 32197, 44756, 319, -47429, -41456, -45054, -31898, -11404, -27197, -3359, 25817, 45901, 28469, -67576, -59901, 30670, 31401, 16996, 12967, 14113, 36457, -5528, 3451, -51486, -67596, -29176, -32776, -49926, -45095, -113399, -97087, -88742, -92157, -131279]
6677a31279M9855r421k4294J7096O5666l5215l0779K6205N0590J5584K0888O9927
$$ y = [-131279, -81424, -90845, -115139, -98043, -32377, -67592, -98371, -72166, -21576, -5992, 14896, 84823]
$$ [...]
##END NTUPLES=NMR SPECTRUM
##END=
