##TITLE=Analysis number 319778
Compound Code cc 55813
Book Reference 422/175
Project Code adrs
Chemist Name robb
##JCAMPDX= 6.0         $$ Bruker NMR JCAMP-DX V2.0
##DATA TYPE= NMR SPECTRUM
##DATA CLASS= NTUPLES
##ORIGIN= Bruker BioSpin GmbH
##OWNER= nmr
$$ XWIN-NMR		Version 3.5
$$ Fri May 26 12:02:36 2006 GMT Daylight Time (UT+1h)  MAYBRIDGE\nmr@NMR_250MHZ
##.OBSERVE FREQUENCY= 250.131544655141
##.OBSERVE NUCLEUS= ^1H
##.ACQUISITION MODE= SIMULTANEOUS (DQD)
##.ACQUISITION SCHEME= undefined
##.AVERAGES= 16
##.DIGITISER RES= 18
##SPECTROMETER/DATA SYSTEM= dpx250
##.PULSE SEQUENCE= zg30
##.SOLVENT NAME= CDCl3
##.SHIFT REFERENCE= (INTERNAL, CDCl3, 0, 16.522)
##AUDIT TRAIL= $$ (NUMBER, WHEN, WHO, WHERE, WHAT)
$$ ##TITLE= Audit trail, XWIN-NMR		Version 3.5
$$ ##JCAMPDX= 5.01
$$ ##ORIGIN= Bruker BioSpin GmbH
$$ ##OWNER= nmr
$$ C:\u/data/dgb/nmr/ADRS/5330/pdata/1/auditp.txt
$$ ##AUDIT TRAIL=  $$ (NUMBER, WHEN, WHO, WHERE, WHAT)
(   1,<2006-05-26 12:01:55.56 +100>,<MAYBRIDGE\nmr>,<NMR_250MHZ>,
      <created by zg, POWCHK disabled, PULCHK disabled
       configuration hash MD5:
       84 BC 41 DB A1 6E 1D 46 DA 25 12 A5 C1 ED C5 3A
       data hash MD5: 64K
       A7 B2 07 1A 75 95 9E EA 93 77 E9 18 CF FB 57 DB>)
(   2,<2006-05-26 12:02:14.19 +100>,<MAYBRIDGE\nmr>,<NMR_250MHZ>,
      <Start of raw data processing
       ef LB = 0.3 FT_mod = 6 PKNL = 1 SI = 32K 
       data hash MD5: 32K
       2E A4 86 DE 3C 4E 24 D3 01 67 5B 2F 4D 96 1B B2>)
(   3,<2006-05-26 12:02:18.83 +100>,<MAYBRIDGE\nmr>,<NMR_250MHZ>,
      <apk 
       data hash MD5: 32K
       26 3F E9 DB C1 C9 06 FB DA 4A 32 6E AD 3B 29 BE>)
(   4,<2006-05-26 12:02:20.37 +100>,<MAYBRIDGE\nmr>,<NMR_250MHZ>,
      <abs ABSG = 5 
       data hash MD5: 32K
       85 4F C3 CB 02 6F 1E 23 46 F8 9A 95 EF 44 13 07>)
$$ ##END=
$$ 
$$ hash MD5
$$ FD 77 6C 10 65 91 CD 88 96 EE 92 55 43 D9 BD 14
##$RELAX= 
##$RELAX= 
##$RELAX= 
##$RELAX= 
##$RELAX= 
##$RELAX= 
##$RELAX= 
$$ Bruker specific parameters
$$ --------------------------
##$DU= <C:\u>
##$EXPNO= 5330
##$NAME= <ADRS>
##$PROCNO= 1
##$TYPE= <nmr>
##$USER= <dgb>
##$AMP= (0..31)
100 100 100 100 100 100 100 100 100 100 100 100 100 100 100 100 100 100 
100 100 100 100 100 100 100 100 100 100 100 100 100 100 
##$AQSEQ= 0
##$AQ_mod= 3
##$AUNM= <au_zg>
##$AUTOPOS= <22 >
##$BF1= 250.13
##$BF2= 250.13
##$BF3= 250.13
##$BF4= 250.13
##$BF5= 500.13
##$BF6= 500.13
##$BF7= 500.13
##$BF8= 500.13
##$BYTORDA= 1
##$CFDGTYP= 0
##$CFRGTYP= 5
##$CHEMSTR= <none>
##$CNST= (0..31)
1 1 145 1 1 1 1 1 1 1 1 1 1 1 1 1 1 1 1 1 1 1 1 1 1 1 1 1 1 1 1 1 
##$CPDPRG= <>
##$CPDPRG1= <>
##$CPDPRG2= <>
##$CPDPRG3= <>
##$CPDPRG4= <mlev>
##$CPDPRG5= <mlev>
##$CPDPRG6= <mlev>
##$CPDPRG7= <mlev>
##$CPDPRG8= <mlev>
##$CPDPRGB= <>
##$CPDPRGT= <>
##$D= (0..31)
0 1 0 0 0 0 0 0 0 0.06 0 0 0 0 0 0 0.0002 0 0 0 0 0 0 0 0 0 0 0 0 0 0 
0 
##$DATE= 1148641312
##$DBL= (0..7)
120 120 120 120 120 120 120 120 
##$DBP= (0..7)
150 150 150 150 150 150 150 150 
##$DBP07= 0
##$DBPNAM0= <>
##$DBPNAM1= <>
$$ [...]
##$SUBNAM7= <"">
##$SUBNAM8= <"">
##$SUBNAM9= <"">
##$SW= 20.6930455092707
##$SWIBOX= (0..15)
0 0 3 0 0 0 0 0 0 0 0 0 0 0 0 0 
##$SW_h= 5175.983436853
##$TD= 65536
##$TD0= 1
##$TE= 295.16
##$TE2= 300
##$TE3= 300
##$TEG= 300
##$TL= (0..7)
0 120 120 120 120 120 120 120 
##$TP= (0..7)
150 150 150 150 150 150 150 150 
##$TP07= 0
##$TPNAME0= <>
##$TPNAME1= <>
##$TPNAME2= <>
##$TPNAME3= <>
##$TPNAME4= <>
##$TPNAME5= <>
##$TPNAME6= <>
##$TPNAME7= <>
##$TPOAL= (0..7)
0.5 0.5 0.5 0.5 0.5 0.5 0.5 0.5 
##$TPOFFS= (0..7)
0 0 0 0 0 0 0 0 
##$TUNHIN= 0
##$TUNHOUT= 0
##$TUNXOUT= 0
##$USERA1= <user>
##$USERA2= <user>
##$USERA3= <user>
##$USERA4= <user>
##$USERA5= <user>
##$V9= 5
##$VALIST= <valist>
##$VCLIST= <CCCCCCCCCCCCCCC>
##$VD= 0
##$VDLIST= <DDDDDDDDDDDDDDD>
##$VPLIST= <PPPPPPPPPPPPPPP>
##$VTLIST= <TTTTTTTTTTTTTTT>
##$WBST= 1024
##$WBSW= 4
##$XGAIN= (0..3)
0 0 0 0 
##$XL= 0
##$YL= 0
##$YMAX_a= 391549
##$YMIN_a= -562037
##$ZGOPTNS= <>
##$ZL1= 120
##$ZL2= 120
##$ZL3= 120
##$ZL4= 120
##$ABSF1= 16.522
##$ABSF2= -4.171173
##$ABSG= 5
##$ABSL= 3
##$ALPHA= 0
##$AQORDER= 0
##$ASSFAC= 0
##$ASSFACI= 0
##$ASSFACX= 0
##$ASSWID= 0
##$AUNMP= <proc_1d>
##$AZFE= 0.1
##$AZFW= 0.1
##$BCFW= 0
##$BC_mod= 0
##$BYTORDP= 0
##$COROFFS= 0
##$CY= 12.5
##$DATMOD= 1
##$DC= 0
##$DFILT= <>
##$DTYPP= 0
##$F1P= 14.0000005364418
##$F2P= -0.99999901652339
##$FCOR= 0.5
##$FTSIZE= 32768
##$FT_mod= 6
##$GAMMA= 0
##$GB= 0
##$INTBC= 1
##$INTSCL= 1
##$ISEN= 128
##$LB= 0.3
##$LEV0= 0
##$LPBIN= 0
##$MAXI= 10000
##$MC2= 0
##$MEAN= 0
##$ME_mod= 0
##$MI= 0
##$NCOEF= 0
##$NC_proc= -4
##$NLEV= 6
##$NOISF1= 0
##$NOISF2= 0
##$NSP= 0
##$NTH_PI= 0
##$NZP= 0
##$OFFSET= 16.522
##$PC= 1
##$PHC0= 169.456
##$PHC1= 7.029502
##$PH_mod= 1
##$PKNL= yes
##$PPARMOD= 0
##$PSCAL= 4
##$PSIGN= 0
##$REVERSE= no
##$SF= 250.13
##$SI= 32768
##$SIGF1= 0
##$SIGF2= 0
##$SINO= 400
##$SIOLD= 32768
##$SREGLST= <1H.CDCl3>
##$SSB= 0
##$STSI= 32768
##$STSR= 0
##$SW_p= 5175.98343685301
##$SYMM= 0
##$S_DEV= 0
##$TDeff= 65536
##$TDoff= 0
##$TI= <Analysis number 999999
Compound Code 99
Book Reference 9
Project Code 9>
##$TILT= no
##$TM1= 0
##$TM2= 0
##$TOPLEV= 0
##$USERP1= <user>
##$USERP2= <user>
##$USERP3= <user>
##$USERP4= <user>
##$USERP5= <user>
##$WDW= 1
##$XDIM= 32768
##$YMAX_p= 347411735
##$YMIN_p= -102360
$$ End of Bruker specific parameters
$$ ---------------------------------
##NTUPLES= NMR SPECTRUM
##VAR_NAME=  FREQUENCY,     SPECTRUM/REAL,   SPECTRUM/IMAG
##SYMBOL=    X,             R,               I
##VAR_TYPE=  INDEPENDENT,   DEPENDENT,       DEPENDENT
##VAR_FORM=  AFFN,          ASDF,            ASDF
##VAR_DIM=   32768,         32768,           32768
##UNITS=     HZ,            ARBITRARY UNITS, ARBITRARY UNITS
##FACTOR=    0.157963299565203, 1,           1
##FIRST=     4132.6476996994, 0,             0
##LAST=      -1043.33573715361, 0,           0
##MIN=       -1043.33573715361, -102360,     0
##MAX=       4132.6476996994, 347411735,     0
$$ Real data points
##PAGE= N=1
##DATA TABLE= (X++(R..R)), XYDATA
$$ [...]
20264 -33271 -18370 -17356 -6258 -11346 3194 -59 -23488 -25380 -36439 -17722 -8654 12210 36058
20251 36058 34360 16599 10812 -3325 -26663 -18570 -10092 -14277 -42421 -47179 -7169 -829 -22324
20238 -22324 -11887 -3248 -10897 -20271 -37465 -30014 -36646 -31518 -30279 -32843 -49442 -69749 -87953
20225 -87953 -52145 -63969 -72707 -71242 -47308 -13493 20470 2739 -4806 17713 29914 2976
20213 2976 -7435 -24064 115 34587 52612 7238 -17054 -19649 -23109 -25635 -38877 -43111 -29820
20200 -29820 5294 27722 24025 11909 24903 25658 13225 1034 2259 28698 20401 8153 2373
20187 2373 -3639 -22124 -20512 -20383 -15545 -61 15268 3935 5403 19802 3379 -8645 -16165
20174 -16165 6376 18741 13548 -3026 17604 41102 8165 -32138 -39275 -33295 -28802 -31642 -16102
20161 -16102 -37387 -28763 -12794 -24750 -39591 -23164 -18600 -38896 -22213 24435 39364 21145
20149 21145 25395 23115 11760 -46 29905 55075 42357 7978 -4603 3725 -3110 -33905
20137 -33905 -35107 -26129 -17813 -8072 -8389 7167 10712 11634 23473 23849 -5264 -12676 -27137 -24323
20123 -24323 -24335 -25121 -28617 -17551 -15370 -28212 -41398 -51832 -27690 -5027 -1882 4899 11136 2594
20109 2594 9488 23510 24810 1257 -9095 23147 29914 8914 23028 29063 10146 14763 14749
20096 14749 -14180 -7226 2833 17934 25467 28453 19215 -628 -5587 12148 18230 11033 16537
20083 16537 -15742 -17236 1449 -9102 -16877 18069 25535 19008 32391 17425 -1028 -46930
20071 -46930 -81329 -57700 -36136 -26257 -24082 -36343 -25172 -20717 -25250 -22929 -24376 -12399 -5608
20058 -5608 -19451 -29909 -36953 2649 -4552 -27568 -43949 -37044 -32957 -24766 -15060 -19523 5155
20045 5155 15021 -9835 -6851 5406 -23028 -9504 35180 50216 30528 1368 -22953 -8170
20033 -8170 32036 27578 -18045 -12732 11634 12534 22691 40725 31020 -12193 -25924 -21202 -25776
20020 -25776 -26084 -35643 -16398 13928 28863 10634 -29920 -56411 -66810 -37690 -26887 -27531 -15999
20007 -15999 -29312 -35309 -23559 -17389 -21179 -18292 -4517 -27512 -37666 -6386 10861 19887 23779
19994 23779 -3842 -27019 -18798 -27564 -39297 -30140 -18877 -13676 2679 -12316 -10488 -11595 -1693
19981 -1693 11127 10900 -10952 -958 -4565 3753 15998 21453 -1313 -11248 15397 35340 14723
19968 14723 4844 -3029 -26281 -38331 -1443 -7091 -12023 -32491 -25144 -10141 -9092 -7672 -16500
19955 -16500 -31357 -32563 -13500 -1260 -18339 -1172 1438 12677 15523 34482 52231 35605
19943 35605 4446 -3226 33858 29097 20192 24286 -9188 -7560 -28137 -21230 -14672 11367 37396
19930 37396 36250 38713 15186 21974 43681 55288 25258 4537 4703 -5816 21384 72395 68643
19917 68643 59359 22525 -1069 -10409 2246 13886 1064 -32820 -18811 -8927 -6063 -1103 16337
19904 16337 -7009 -29055 -41041 -48201 -59762 -45888 -19110 -16907 -34047 -52818 -50998 -44655
19892 -44655 -23577 -6322 15380 20817 15559 23434 35958 21729 -18436 -31689 -45089 -37773
19880 -37773 -16380 -32326 -39300 -40425 -28438 -20580 -35820 -49799 -25863 12592 15503 9212 14301
19867 14301 16002 25478 40658 42242 50448 57501 43858 44667 29150 7867 8632 25714 22042 11692
19853 11692 -3446 -16454 5048 24355 27263 40400 34005 40191 67193 54731 22739 4587
19841 4587 8809 27429 14612 19150 21867 8297 -8755 -20582 -42871 -37506 -25017 -22458 -23194
19828 -23194 -24445 -14093 -1917 9233 39689 52176 69935 60993 46900 51831 78848 98818
19816 98818 61403 42158 11342 7574 5682 -4494 5093 -13305 -37335 -42352 -34468 -29802 -6672
19803 -6672 -9602 -6293 15244 17801 -15577 -14604 -16848 -1624 33771 20213 4910 -10825 -35605
19790 -35605 -8094 16844 28802 32971 29290 29534 31608 -1847 9575 28419 19630 -15926 -50490
19777 -50490 -57137 -68440 -64086 -26019 -4000 24039 7188 -22028 -32703 -26471 -26353 -3447 34768
19764 34768 31976 36264 14551 20580 50158 60033 55047 47506 50279 22446 22923 33132 31191 16572
19750 16572 31969 -628 3186 2016 -1456 -14467 -8296 -9220 -10833 -18069 -9612 14116 8603 6961
19736 6961 -2961 -2251 22724 27455 33223 44641 34102 23577 18392 8133 -1293 -16131 -21016
19723 -21016 2920 1208 -17514 -45141 -30641 -4683 18302 5023 -31572 -1004 25707 48426
19711 48426 58871 59667 48610 28449 22780 10620 3658 -30686 -38482 -18705 -12657 -5027 9634
19698 9634 30642 33818 -3565 -31453 -32669 -26129 4193 46539 48291 37591 21922 13344 2948
19685 2948 -25282 -35881 -6837 7274 10935 9343 -6164 -8940 -27699 -54333 -57930 -51429 -44087
19672 -44087 -32286 -31956 -13433 6035 -3601 -15986 -8588 -13185 -20223 -28886 -29194 -7075 17486
19659 17486 29662 8135 -635 -11942 -430 33321 19501 5761 16 8646 8391 7828 1976
19646 1976 2561 -18781 -34930 -49983 -26780 -20129 -33844 -39315 8218 16230 1432 -27133 -44342
19633 -44342 -37887 -21209 -14328 -20903 -30581 -19371 4851 -9602 -17825 -10121 -6348 -3939 -3852 26195
19619 26195 3918 -19197 -37110 -34658 -24829 -32902 -2416 28111 43626 28259 23762 31029 34125
19606 34125 32610 34742 5314 -8704 -7325 -6151 13897 46813 60038 67915 39029 9106 -2010
19593 -2010 -7679 -33747 -31544 -2195 -24637 -51026 -30139 -33429 -17713 -15630 -24026 -12009 -23622
19580 -23622 -8864 -3654 -1832 -7430 -19218 -40511 -33155 -11470 968 17901 32107 31896 23011
19567 23011 31064 64828 47253 2136 4392 10917 18137 29041 78379 93072 77636 85515 59628
19554 59628 55152 45687 55274 62238 49230 37398 19072 12350 28994 14402 26735 34902 26750
19541 26750 25625 67108 44153 104 -23182 -21080 60 32109 43455 44381 26616 15889
19529 15889 31909 49359 56689 74037 63845 41683 39342 46716 40362 29121 34985 39909 64246
19516 64246 99581 68998 51062 23495 1960 6219 30331 -4289 -28671 -19549 -4589 -7339
19504 -7339 6147 -10334 19918 32522 49896 47488 37251 40325 23456 39168 48658 33778
19492 33778 16440 23703 3922 20571 19803 15179 21217 21783 20969 10065 -12791 -20457 -17192 5640
19478 5640 3508 -5344 -5829 -5134 -18697 -50106 -62504 -48576 -9452 2674 10586 22427 9621
19465 9621 -4056 -25972 -18627 3887 13627 -17611 -28116 -37267 -47183 -59020 -49833 -52796 -28485
19452 -28485 -29141 -44089 -39915 -48756 -37672 -6303 767 -1018 42963 40148 18467 12459 -5135
19439 -5135 6981 7662 21815 18707 20740 2878 -30382 -51706 -32737 6462 -13815 -26365 -6866
19426 -6866 -16135 -29350 -23515 5495 35611 55648 47121 17484 -7105 -11255 5425 12435 -4555
19413 -4555 4610 999 -87 22913 42306 39143 2797 -25536 6517 39904 45707 15980 5280
19400 5280 21100 3903 -33144 -51344 -44131 -25466 -18964 -32527 -26284 -25482 -60207 -66912 -40155
19387 -40155 -37606 -52472 -54571 -39805 -39974 -39186 -36856 -17606 -37034 -35620 -47348 -32246 -2300
19374 -2300 17474 -1434 2910 -9941 -28217 -10021 -9157 3501 33460 60829 54854 31267 7911
19361 7911 7095 -1438 -22683 -3892 -6507 -26493 -21668 -2027 3127 -9480 -34924 -8858 2671
19348 2671 -24100 -26168 -21223 -6347 11218 32115 4586 2995 -3961 -9556 -8505 -19362 -13164
19335 -13164 -5624 13301 5863 -23273 -20195 -58636 -45894 -35370 -28087 -7774 -10901 -6365 2519
19322 2519 1849 32930 45984 40791 6062 9455 -5349 -8893 -22470 -13658 -8485 -8868 -11347 5352
19308 5352 35550 40656 16757 -3924 -11901 68 4473 -2453 4981 28198 34816 9320 7100
19295 7100 11060 4870 -10183 -19877 -21719 -27113 -19386 -14808 -5267 -27367 -26769 -3865 7763 -1219
19281 -1219 17529 17645 981 -17352 -38263 -39931 -40418 -34315 -13594 3667 20588 36119 32184
19268 32184 43168 27341 5832 10200 10692 14121 13223 33996 19504 -5021 2519 11318 -18523
19255 -18523 -16206 -50374 -59898 -26958 -21121 5230 15860 19007 7445 874 -29325 -40197 -24997
19242 -24997 -19420 -21993 -11659 -811 -7649 -20206 6664 16777 7188 -29641 -34350 -12079 4273
19229 4273 27235 45602 30742 24283 22099 20289 12698 16938 19285 11608 1579 -17464 -23192
19216 -23192 -39870 -34495 6978 26612 34314 43497 16603 8132 -11354 3494 17978 -4986
19204 -4986 -10948 3015 26951 -4350 -10598 23692 48174 28544 -25078 -874 15939 -4535
19192 -4535 -21166 -42484 -28527 -22434 -14727 -25727 -29629 -30755 -17859 -17710 -7654 -1523 15029
19179 15029 10088 -544 -23623 -40737 -12161 3993 3311 15164 3995 -7225 3451 -9860
19167 -9860 -29060 -28284 -946 -16862 -18913 -15610 -17530 -14457 -11126 -4530 -18807 -37099 -64879
19154 -64879 -59224 -58672 -49593 -47862 -31551 -19355 -17431 -530 -9947 9461 23217 48120 39548
19141 39548 19839 2507 -6236 8097 6168 19085 27306 20124 14173 22545 51093 51041 77872
19128 77872 66721 48978 21479 -5812 -13073 1777 -13892 -12412 -24601 -14113 14034 -3397
19116 -3397 -13745 -28773 -47774 -88039 -56591 -41698 -36882 -15246 30804 10449 -4452 3418
19104 3418 2299 -11816 -293 13571 33090 34874 21393 -15417 -32891 -24347 -16808 -7134 -12858
19091 -12858 -19529 -16335 -15406 -25474 -42701 -51812 -42197 -33698 -8282 22153 42731 54587 42930
19078 42930 21690 2465 19632 26478 17600 -11290 -35747 -39052 -36546 -10384 11663 2356 11390
19065 11390 623 3822 -4448 18331 8528 -30278 -34369 -962 -28062 -35474 -2909 30760 27542
19052 27542 7317 -101 7664 26623 24004 13100 2674 -1428 7564 17145 4209 -8295 -2575
19039 -2575 9565 -1561 -6934 -19823 -53544 -42364 -14950 1144 24094 33382 39762 38180 27396
19026 27396 30995 27521 -19745 -13483 -40 -2140 -1997 9230 6934 -28997 -25391 -12160 -35597
19013 -35597 -27868 -22617 7962 19342 -1174 -3470 44065 40875 30168 15833 -5872 16568
19001 16568 56769 33541 20562 38981 19870 -15110 -36681 -10372 27514 24675 5446 8343
18989 8343 31324 40437 24605 18537 -1494 -5554 -6627 9885 3341 -4979 944 2325 -2837 -4671
18975 -4671 -1001 8746 2183 28204 10617 -899 2959 20733 -5950 11147 13537 -2280 9667
18962 9667 23716 46800 49200 24862 -3999 -30608 -15580 -13043 -17128 -8129 -3993 -23434 -37226
18949 -37226 -52109 -69269 -20106 25127 30639 22548 37140 47061 54217 51332 46599 13918 17191
18936 17191 27496 55787 53604 31895 10925 9104 -3225 -7940 -10067 -34166 -31405 -30255 -25787
18923 -25787 -35305 -11633 1404 14054 14678 18758 14529 13788 8648 -1470 17982 15060 -2594
18910 -2594 -21385 -33858 -29078 28919 21099 5112 12051 13292 32775 45414 56000 23585 6402
18897 6402 3883 6659 10195 5169 13337 -301 -11652 -15744 -11641 -12560 -16739 -12203 -32782 -39376
18883 -39376 -26122 -14085 7046 12666 -8276 -15617 20944 5274 -5119 -1984 14457 1752
18871 1752 10260 15973 11337 36150 44870 36944 20813 6747 -2175 -5841 12053 13988 13385 11352
18857 11352 37927 61197 53415 66624 74643 50017 42712 40010 20830 -2200 30630 21215 17930
18844 17930 4111 15395 9502 6649 26628 39426 52851 78557 79825 83764 64135 16377
18832 16377 -2589 -8990 -15574 7648 18284 14957 12828 9363 4493 26326 40714 13825 6156
18819 6156 25577 22585 52663 85424 73275 62324 86776 78296 33965 5383 -1134 12219
18807 12219 21798 15651 28342 35272 42011 24913 7248 4320 5497 -3132 7770 21009 30349
18794 30349 50067 55887 43935 27431 23650 44528 47898 27187 -1166 -9533 19281 7040
18782 7040 -839 24875 50548 84970 68991 30842 46774 63880 46538 34703 47617 64957
18770 64957 49683 57616 78920 117054 141114 162822 162498 167178 199487 191308 158509 150944 145047
18757 145047 100434 72545 60557 50516 61266 56085 71541 64168 29010 19094 5385 6677
18745 6677 35773 32924 36519 28468 6717 20263 44950 61323 53516 49102 49401 38540 27739
18732 27739 44766 74292 74337 50624 54591 56992 36681 21489 18992 25227 28046 9779 43243
18719 43243 90559 117514 120629 111264 77652 20975 3682 12596 14228 16552 -2041 -13406 17113
18706 17113 27505 25514 37898 53841 47247 67338 99002 118048 112460 111944 129638 159895 180511
18693 180511 167524 189362 204031 239963 241003 222745 215308 245009 245457 229868 214567 227904
18681 227904 225003 212303 211792 230410 248775 219569 225744 217021 225329 253460 254537 251022 224711
18668 224711 178128 170674 170228 183358 189267 173787 142952 131186 122848 118911 119142 120930 131968
18655 131968 136316 138013 151241 144402 138202 141235 129856 92303 100204 95196 84915 109099 149992
18642 149992 174531 158052 155639 187127 245061 274474 292121 327214 378992 394074 386017 380425
18630 380425 396025 374853 360283 349719 331774 332539 344241 333424 314014 301745 272381 223543
18618 223543 160386 116120 118309 126378 154079 173991 183288 199386 193678 169296 152969 129484
18606 129484 129525 125765 117020 134958 178148 214951 254964 259238 262690 281787 275734 295608 291516
18593 291516 301660 314007 314042 319594 308156 310508 313919 309027 325513 308730 268482 261625 234030
18580 234030 189969 196385 198950 203581 222554 200066 165531 162032 149833 137194 130269 117942
18568 117942 126658 138498 127679 118447 83437 81556 97492 124135 138838 136264 127881 116605
18556 116605 111609 132722 153424 187066 215028 242989 255919 260628 276632 296846 296950 290092
18544 290092 286868 290841 301176 296315 268071 266899 280432 272566 268481 297041 282865 265581 306559
18531 306559 321397 293966 226671 210067 191371 148585 116749 136207 163284 172308 142430 135648
18519 135648 136677 148366 136642 138746 114121 96526 98211 95612 77551 62728 52739 65036
18507 65036 78698 68027 53582 36453 40127 53467 68034 80126 82024 95991 113071 91684
18495 91684 82975 77956 97098 95822 69343 72140 79913 109096 101463 75700 83159 95486 85752
18482 85752 68481 40797 27201 -10451 11889 27993 25591 19166 15255 13819 24951 26861 14359
18469 14359 34508 42522 27061 32992 20525 9454 -25871 -21125 8994 11850 35702 39141 24508
18456 24508 58317 64252 57153 89753 89179 65909 81666 92348 105437 116685 104963 69982
18444 69982 46604 51063 54712 54469 70025 57595 30095 47618 35639 46948 73916 102895
18432 102895 118642 97639 55578 48270 63728 46829 17949 11221 -5799 8773 38292 44788
18420 44788 50278 63922 66101 42446 41707 19184 29864 50931 78888 79684 62033 42247 47104
18407 47104 47271 67792 73171 64466 53915 80980 112875 103654 78816 77306 84612 75943 59224
18394 59224 79013 97947 98788 91185 87359 75714 91710 101729 96316 98568 131392 132721 125186
18381 125186 112821 118552 131567 119301 135731 147644 135735 138341 135321 119967 109156 100521
18369 100521 108378 103263 121720 133691 157270 154452 138894 133435 147667 135991 125617 122146
18357 122146 115759 142257 128497 117377 130631 134343 122564 114115 126599 165541 169475 161193
18345 161193 162924 148307 170823 179365 155252 148140 141527 157870 167521 191909 193555 190958 197534
18332 197534 214961 244041 255832 265564 282752 248398 244792 269373 295855 296752 308238 280746
18320 280746 256483 254222 253920 255827 290279 307932 308121 299753 265894 254452 255280 235983 207997
18307 207997 227194 260091 253496 223432 219245 238879 228449 214523 216137 202981 196960 181058
18295 181058 207204 221174 228083 226597 249866 289456 302426 315598 316405 327343 332201 381068
18283 381068 422110 430357 444322 445365 462280 474576 464713 455129 455456 450281 448410 443192 468226
18270 468226 483669 483080 468357 482463 497128 511791 522755 532802 531654 536174 542379 530047
18258 530047 508627 482344 481834 492355 506387 523104 552302 533439 525921 517471 563490 623188
18246 623188 634300 627413 620623 622664 633962 640705 640394 631809 641821 671184 714918 749551 779116
18233 779116 799993 822354 845295 906309 950746 966364 977667 1018967 1067035 1115677 1169808
18222 1169808 1218205 1275348 1345288 1439959 1518978 1616752 1748010 1854971 1964750 2101215
18212 2101215 2261880 2525587 2832268 3213524 3692568 4210950 4806029 5479469 6245137
18203 6245137 7075022 7993418 9196565 10778884 12813080 15406886 18526015 22113221
18195 22113221 25809336 29106909 31733233 33550166 34269470 33689358 32349250 30680578
18187 30680578 28770465 26663035 24639738 23015757 21846413 21027675 20378148 19771796
18179 19771796 19081011 18223777 17113515 15832548 14524005 13307766 12220743 11315220
18171 11315220 10634495 10150848 9866230 9696915 9612348 9619243 9772318 10065496 10529696 11286140
18161 11286140 12407311 13891857 15781185 18037023 20532764 23006835 25185047 26923038
18153 26923038 28242045 29082904 29771148 31015300 33407268 37443668 43454109 51624574
18145 51624574 61854294 73400995 85161205 95940328 104437575 109340201 109958838 106626996
18137 106626996 100075381 91218811 81396385 72001262 63751024 56619029 50595341 45532770
18129 45532770 40973037 36713764 32981514 29831308 27206890 25184918 23748728 22806818
18121 22806818 22236810 21927358 21762756 21652563 21605221 21518909 21379866 21310348 21382221 21690825
18111 21690825 22480624 24203838 27705351 33853065 41495463 47528056 52431483 57022103
18103 57022103 55429898 50404349 49353310 51671241 56233878 62492039 70454073 80073632
18095 80073632 90522092 100589247 109242094 115265675 117433304 115277443 109376656 100629234
18087 100629234 89946742 78725663 68397308 59678209 52795453 47866317 44726251
18080 44726251 42905593 41753093 40700301 39433807 37770703 35496652 32782506 30026507
18072 30026507 27387994 24947761 22815598 21051232 19638234 18490608 17582771 16834123
18064 16834123 16222784 15789923 15492498 15345192 15445346 15794437 16381615 17211175 18245764
18055 18245764 19415838 20630428 21728509 22654473 23483081 24178022 24746643 25489372 26681008
18046 26681008 28309482 30289205 32467654 34807027 37117582 38981513 39925198 39896330
18038 39896330 39108183 37291971 34281655 30725716 27337551 24257546 21447672 19082439
18030 19082439 17246480 15882731 14781873 13795349 12855372 11976918 11212745 10463287 9758277
18021 9758277 9164983 8652162 8168338 7749755 7395410 7073062 6755399 6440346 6145002
18012 6145002 5866425 5663729 5456169 5238043 5028949 4844677 4671547 4505577 4388052
18003 4388052 4248035 4129362 3995587 3860122 3777276 3723349 3609280 3517002 3444970 3358434
17993 3358434 3309167 3229037 3156158 3089203 3016238 2952595 2874067 2794257 2719990 2637523 2568915
17982 2568915 2580555 2626377 2714259 2805801 2891395 2967074 3017734 3056584 3025605 2933692 2824095
17971 2824095 2666865 2476951 2327043 2175320 2032659 1932897 1823852 1685832 1560745 1492059
17961 1492059 1410235 1282849 1182056 1158143 1139167 1100281 1043530 1026532 1034816 989517 951076
17950 951076 934132 900680 898152 924714 912150 918261 937737 941343 948261 978793 1025508 1046849
17938 1046849 1055511 1111572 1196174 1277356 1369718 1462588 1536887 1647758 1743163 1803999 1857171
17927 1857171 1890038 1892742 1824164 1696031 1584542 1461039 1331852 1205882 1125181 1065556
17917 1065556 984787 928732 895638 902028 857233 831721 783066 720685 695024 643987 587844
17906 587844 551037 484679 477670 508361 495226 501086 488351 497124 527109 520741 542023 550720
17894 550720 533696 531839 537415 565899 572580 575069 593479 610714 616344 635129 637733 642767 667321
17881 667321 696413 721052 747522 785353 792398 809313 810878 826204 802778 753061 690916 643449
17869 643449 603913 571666 541201 517639 474925 428926 422890 396980 396586 362957 334460 333637
17857 333637 330639 303613 290566 287555 282103 285122 285518 261503 232341 258213 296006 295906 269858
17844 269858 260322 290808 300466 293098 288180 295037 281128 273259 273201 260091 244727 261013 238577
17831 238577 230800 239065 225745 221658 194439 210395 212631 192231 195967 209496 201223 189084 190934
17818 190934 178436 144361 140596 137364 164967 160870 163094 149762 140240 155159 183623 182073 166593
17805 166593 167977 169643 139267 113819 106330 100278 117974 149590 155512 138961 130997 136981 126446
17792 126446 90732 85039 72764 64829 57996 58778 78372 99327 92911 45401 49718 62313 89486
17779 89486 105665 114759 114350 86771 98042 86242 74177 106618 98409 132338 140993 115914 104683
17766 104683 106503 139073 138601 137224 139346 127712 130075 154149 136873 107995 77790 66965 79377
17753 79377 84064 77434 72977 71590 100646 83840 63543 61599 53621 44492 49128 66826 73574
17740 73574 68506 74148 81575 49391 54479 66228 77452 85424 88104 70418 35439 73233 103490
17727 103490 106598 88826 66819 97091 134579 122894 106655 101212 93329 90834 87729 100280
17715 100280 110093 108364 110492 99328 88756 90005 78296 76453 63447 49589 89523 119684
17703 119684 109193 100738 79123 68020 60926 110573 142863 152597 162276 179689 217894 226268
17691 226268 241990 255957 277106 306028 328193 337474 361085 358614 378843 406194 414104 408853
17679 408853 400327 423694 400896 358289 344392 304066 281210 313150 338555 325114 321987 324865
17667 324865 291444 291400 297557 306892 298086 286964 291198 310403 320361 339276 347612 363970 440559
17654 440559 564934 728111 888089 1064163 1339251 1602260 1826677 2067249 2270040 2403609
17644 2403609 2403393 2361426 2293004 2198843 1971412 1718843 1536326 1402307 1236638 1081209
17634 1081209 945572 860720 823651 784776 727427 707495 692926 684105 623245 556492 531386
17623 531386 550448 523258 488241 462197 401223 383310 380657 345452 342659 333899 318239 333951
17611 333951 386310 385176 365595 365248 360166 386916 408216 422160 443453 444541 442383 448632 474580
17598 474580 452613 437991 423133 432623 441493 430634 405984 388923 345958 295163 275809 245863
17586 245863 233454 237975 224759 202442 196337 179567 183678 174531 165246 156579 143298 140745 150426
17573 150426 138363 151323 200582 196927 180251 200435 219141 214985 229491 243970 238360 252642
17561 252642 282908 271515 280712 301087 319050 315583 335553 331547 325475 312765 298248 318966
17549 318966 334104 323332 306497 280050 273697 300931 335141 327245 332150 349345 356205 310109
17537 310109 256397 215288 183507 185888 193838 188599 139831 117275 147674 169493 168395 160341
17525 160341 141991 132368 115915 127376 105711 98333 83551 65571 50567 64246 83534 71720
17513 71720 58927 56508 73588 77701 71175 48301 30646 38037 52585 45139 56541 47853 43304
17500 43304 74196 94446 43528 48263 57915 27875 29103 50487 49511 40494 35664 39992 50153
17487 50153 42467 29537 39307 35872 19828 8758 12587 41908 56763 39000 43850 73187 65894
17474 65894 26657 25650 29624 13108 27666 31402 25986 37864 31742 -1826 -3125 -16769 -17473
17461 -17473 -22845 -31940 -27920 -38703 -27326 -17903 534 -5184 14932 31679 41097 35271 44181
17448 44181 36187 30403 33168 41994 34676 23603 51158 84517 119279 150065 168324 145343 118439
17435 118439 84824 80248 76266 43839 48196 50623 54062 56446 51934 57450 61909 29367 37335
17422 37335 38340 50278 39277 43756 49937 23609 25860 33611 30731 57836 50971 29309 26052
17409 26052 14260 -5677 4205 33848 45421 42331 65239 65613 53440 35300 40589 56448 37761
17396 37761 16300 2585 13332 44499 59035 34373 13195 18972 48909 59232 60620 43893
17384 43893 38771 -9451 -38799 -12336 -9961 -21778 -31129 -13066 3592 8610 -26794 -59174
17372 -59174 -67591 -52107 -40003 -27410 6755 44036 31850 23516 -626 -2985 16649 22647
17360 22647 -861 -3808 7991 28160 26535 10432 30388 18967 5100 -6556 -26620 -16091
17348 -16091 -16318 -13597 -21570 -33925 -18192 -6701 4543 28807 39898 46781 34590 6766 -32305
17335 -32305 -30406 -20980 -43355 -27150 6797 -2398 24897 40619 38667 56249 51909 23834 7395
17322 7395 -11914 -16350 -1927 3784 26066 62950 55559 78169 73624 52836 -696 -15145 -26202
17309 -26202 -28938 -32354 -8468 27067 34102 38149 32541 24088 24777 23430 25734 -4596 2055 12196
17295 12196 9351 -355 2357 -2965 12048 30968 28186 7442 -15101 -28213 -27166 -27492 -27809 -37969
17281 -37969 -43205 -12311 -6577 -1558 10891 9383 28185 30516 6419 6536 2664 28326 37695
17268 37695 32418 28433 24128 -8728 -25275 -24718 -30069 -31049 -15007 -12439 -42073 -47539 -60756 -9777
17254 -9777 8737 15720 2552 -17102 -20606 12903 12252 3511 8611 23873 22048 -8089 -34881
17241 -34881 -61871 -50960 -43672 -39519 -22080 10796 28717 36400 38522 45435 58152 57558 51410
17228 51410 28506 -2136 9863 35920 35997 4871 16321 39325 41787 35669 35585 37650 21741
17215 21741 7340 1389 19763 2582 -40548 -20389 19661 37217 39506 40815 45058 24694
17203 24694 26074 17641 13653 18448 14353 8330 -33538 -37413 -10232 1606 -17744 -16002 -15377 1434
17189 1434 19556 -14095 -37255 -29784 -26449 -32635 -20495 -14252 -10849 -12324 10632 12818 -11664
17176 -11664 402 21460 10691 19765 4813 -15716 -30120 -30272 -29480 -35838 -60953 -46823 -7861
17163 -7861 23629 28275 43915 39653 31647 3989 18199 41769 29377 30304 17161 24089 6867
17150 6867 -9251 -35805 -27495 -6608 240 16095 9379 -15481 -35864 -20899 -24947 -45431 -43995
17137 -43995 -50805 -29400 -15466 1783 6460 -23069 -41568 -24672 10542 31890 18991 13453
17125 13453 1377 1721 5991 -21510 -28733 -29781 -18358 -23436 -32496 -34129 2429 20987 -6435
17112 -6435 -18229 1192 -12426 -28025 -25079 -15794 -32465 -42394 -27758 1824 19825 23537 7242
17099 7242 21500 13569 -2035 -6491 -19267 -29024 -25424 -8010 -7729 -4005 -9496 -15689 5163 18835
17085 18835 2058 1074 -13051 377 21989 37060 32844 20879 -40043 -73166 -69335 -46076
17073 -46076 -42431 -36028 -23167 -18500 -8097 23467 58460 81298 63108 31659 8713 -12831
17061 -12831 -31239 -54637 -62893 -57673 -36118 1763 4784 -29231 -59158 -49430 -31492 -30340 -4145
17048 -4145 13928 -7314 2521 16900 4801 9416 14439 1906 -18990 -48425 -47158 -26704 -6977
17035 -6977 -20285 -603 14415 17931 45856 58698 61846 36467 33648 48456 66058 60534 51079
17022 51079 32368 45528 40479 9947 15776 22693 3134 10185 130 8979 1779 -1760 11042
17009 11042 14457 14622 -2130 -22496 -5660 20688 20495 14426 -10310 -21467 11177 26815 59323
16996 59323 72511 16967 17900 9732 -16967 -13793 -11319 4642 28688 29822 27097 22100 13572
16983 13572 2586 -33969 -50914 -33006 -20606 -3025 3312 -37381 -67657 -72737 -36215 -9183
16971 -9183 22822 4126 -12744 -12055 8097 9928 -2311 -7873 -34166 -24872 -32957 -41176 -9733
16958 -9733 13250 38237 36425 4836 13299 7761 -859 13803 8892 -21067 -12892 15126 30412
16945 30412 37349 42157 20990 5710 22586 10617 -3717 4392 6028 20914 24873 25430 19702
16932 19702 16865 18490 9271 -1961 3347 -4722 -5435 25747 17531 6106 6746 5184 -3121 -9203
16918 -9203 -13163 -19417 -18435 -10647 -1449 -11610 -18575 4211 21774 2642 -13066 -14111 4638
16905 4638 14784 25233 12907 2894 -3121 -16859 -21946 5256 40718 41953 33230 6592 13369
16892 13369 43685 59844 82639 52871 36269 1738 -17603 -17863 -3413 10808 4300 -16232
16880 -16232 -2910 -19371 -15242 14377 37692 53546 41525 10133 -28797 -23286 -26263 -36857
16868 -36857 -14438 34842 39406 39807 9706 -21737 -28005 -7220 -12350 -19709 -33122 -34904 -22369
16855 -22369 -20828 -14256 -49454 -39475 -44952 -32514 -14025 18941 16402 8373 20803 7822 -17049
16842 -17049 -17613 -4855 -15568 -150 -17849 -44271 -29528 -28566 -17608 -13038 -6127 -9895 -4942
16829 -4942 -18704 7400 21864 6702 -10131 -1025 35959 40601 40825 8762 -13127 -15941 -11015
16816 -11015 5072 -3248 17755 37729 8204 -2535 -19465 -34951 -28738 -3637 11773 62237
16804 62237 53512 3670 -25406 -29775 -8756 8250 23294 44899 36472 45411 28599 -15888
16792 -15888 -11873 -34098 -26977 -11477 -587 13396 9264 24546 20176 5427 2006 554 -498
16779 -498 -6322 -26966 -13279 -399 7956 23279 40415 60030 38588 11449 23971 19818 15532
16766 15532 15914 -668 -30216 -18435 -14539 -5588 20265 38787 29975 24611 13771 -57 -34536
16753 -34536 -42534 -27089 -40442 -46843 -29975 -8452 -6113 -21197 6455 16026 30188 -1591
16741 -1591 -12762 16619 27969 21716 36886 25938 25501 42344 22576 -23105 -47652 -27435
16729 -27435 -27765 1344 14822 9943 19870 4834 -46948 -65037 -27935 -21479 -7207 -899 -11836
16716 -11836 -43402 -28005 -11887 -14368 -18782 2302 43397 39086 21683 16982 21226 27256 39564
16703 39564 19989 -11672 -17018 -8167 15471 34698 9613 -24884 -30933 -36772 -29788 -49799 -55887
16690 -55887 -73824 -77676 -82508 -67956 -27012 12281 18040 -6029 -14724 678 5373 16504 16298
16677 16298 25828 55120 31528 3863 -7977 19762 29995 5864 -7209 700 22253 27376
16665 27376 35727 17373 2356 3299 17171 -16707 -20172 237 9966 -10742 5734 19199 20144
16652 20144 21831 11715 -9337 -19921 -18914 -25441 -31147 -12798 -14160 -18704 20092 41443 23907
16639 23907 38970 22927 1461 12113 11599 -9743 -9422 5273 21647 1319 -7495 13850 15888
16626 15888 17988 26298 26807 30545 33584 26196 26912 28682 34687 58842 54963 42781 20484 11188
16612 11188 17176 19655 56042 60717 42158 36806 6364 600 2313 -27072 -48173 -30646 19040
16599 19040 25852 8142 18775 6728 -19363 -44693 -68596 -52037 -4963 -18962 -13069 3471
16587 3471 19916 932 -7257 -19675 -25663 -51604 -30939 -11861 -7146 6683 -6348 -11691 -28634
16574 -28634 -33420 -28808 -4214 -7010 -35429 -14274 -14704 -34470 -4406 -2927 -28297 -40550 -28890
16561 -28890 -5202 9643 -5440 -28452 -12077 15184 1133 -23347 -17047 19563 33962 -5811
16549 -5811 -31420 -47222 -41226 -38641 -39590 -3217 -5175 -24404 -12408 7560 -8456 -19897 -6626
16536 -6626 -2296 -32725 -35889 -27190 -38228 -53053 -28349 -25435 -24171 -24886 1111 24807 11913
16523 11913 3747 -8314 18275 18531 9550 17430 9265 14986 -1435 -11180 -12609 -40021 -29603
16510 -29603 -8907 3963 1699 -25152 -29152 -41665 -28977 -12067 -4281 -25061 -17054 4250
16498 4250 -1280 3906 -11323 -18876 -37654 -34662 -64380 -66773 -83031 -85296 -66080 -46388 -54180
16485 -54180 -31268 7769 4443 -14710 -30037 -37086 -17980 6442 8918 -5719 -7256 -19412
16473 -19412 -26587 -31559 -29033 -15207 15103 41975 41096 18071 21315 7723 31910 8117 -24606
16460 -24606 -45313 -49866 -57415 -40396 -1743 -462 11319 32688 35647 5623 1806 5470 1553
16447 1553 -25719 -38073 -41276 -44624 -42002 -20764 7785 18342 8070 -1352 18751 7783 -26710
16434 -26710 -32739 -16362 -14910 -23430 -3624 28397 22918 20550 34121 24395 1877 -2198 5046
16421 5046 4206 -19983 -12337 -22610 4854 -175 3779 -3080 9804 7023 25376 16362 -21797
16408 -21797 -30662 -20417 -3291 -1247 -12825 -2611 263 503 2008 10065 -3491 -21205 -21067
16395 -21067 -23853 -32889 -29394 12839 19105 18663 27520 9432 -17611 -15887 -7048 -9581 -6339 -3681
16381 -3681 -12876 -45052 -55193 -47681 -8997 2342 -22323 -44959 -42455 -771 11372 8081 3623
16368 3623 4905 4994 9588 2703 12982 12983 10131 -10003 -24059 -17609 -5782 10126 9523 -20906 -35880
16353 -35880 -36021 -18367 -20464 -27186 -23941 -39695 -28977 -27341 329 22836 34859 -13346 -21703
16340 -21703 -32451 -42785 -34873 -41994 -16842 16288 -1562 -34912 -65360 -51970 -29650 -25894
16328 -25894 -50361 -39594 -24360 -5171 4731 13076 5496 3071 -3632 -20337 -2592 -781 -30339
16315 -30339 -40533 -45172 -41277 -44405 -44379 -42495 -64595 -38371 -18275 -29370 -26940 -17274 -18264 -10573
16301 -10573 846 2241 17489 21416 6528 -6864 -14114 -10189 9371 33927 46386 29652
16289 29652 19480 26627 22711 24052 27553 9643 4158 14596 29103 34652 46325 14325 8247
16276 8247 13092 20328 39067 37191 27321 18676 10359 -19216 -26104 -38127 -23549 5721 32361
16263 32361 52285 59117 26217 -12740 -13176 2634 2225 -21249 -43608 -21120 -1734 -8666 -30351
16250 -30351 -21101 -20093 -3226 12798 35616 57102 45909 17555 9146 2795 -16559 -31817
16238 -31817 -40563 -40028 -43203 -47996 -34619 -49664 -34070 -4263 -19411 -25092 -26010 1443 29426
16225 29426 34747 55609 70131 49396 63837 55673 14175 -25112 -34960 -26116 -9943 -1957 10089
16212 10089 14987 -1354 -8736 -4919 10879 9709 -5904 -19261 -30565 -31954 -61863 -78186 -61379
16199 -61379 -23239 21009 7215 -1682 -18344 -36389 -6293 -12904 -7778 9967 -13721 -16520
16187 -16520 2762 29218 34970 -6275 -15032 -10388 15258 13742 9726 -2817 -28852 -18968 -1559
16174 -1559 12023 -5168 -9958 11993 9277 -9097 -21736 -12486 29475 38490 19365 -17275 -4238
16161 -4238 5833 38801 33528 10219 -20519 -11955 -26241 -42542 -68629 -44196 -1843 3929
16149 3929 10203 9384 -25229 -31359 -17635 -11129 -18784 8178 -4150 3838 12606 10337 5583 -13056
16135 -13056 -11687 -17131 -29447 -35219 -34025 -31793 -13061 -23107 -35635 -42793 -30255 -6623 -1580
16122 -1580 -20213 -20509 -31911 -31390 -7157 7587 -2943 -24504 -40111 -37996 -23973 -31922 -58630
16109 -58630 -70058 -36714 -9723 27396 25503 22424 24881 -3106 -20320 -787 14128 23721
16097 23721 15178 12431 20701 26035 22736 16355 11693 -22935 -22914 -11130 -5248 -6269 13213 56012
16083 56012 64016 36713 -1676 1903 9872 -4903 -45273 -27450 -7471 -17093 -27216 -19795 -15768
16070 -15768 7200 19368 11876 -17134 -44082 -46536 -37028 -39855 -22937 -6176 3390 -8087 -18389
16057 -18389 -27343 -33686 -10083 8667 -19036 -13251 -7185 -11889 21054 16932 5252 -24749 -43751
16044 -43751 -12530 -1198 2210 -10770 -4706 -2195 -7217 -15053 10530 5906 23158 40371 42583
16031 42583 35438 22956 15281 -22780 -39776 -30850 -22170 -12883 -16773 -29866 -36578 -45239 -50849
16018 -50849 -21291 -31735 -37171 -49298 -32471 -12233 -3252 -6364 -4124 -23353 -26526 -13010 -16462
16005 -16462 -21904 -12025 -13863 -11170 11708 10190 2696 -7666 -18592 -29552 -4046 8645 5734
15992 5734 4557 12874 23147 17596 29614 45786 52093 52150 54910 29889 -4787 2450 19491 10988
15978 10988 18118 31671 46488 20500 297 -15978 -22442 5060 5696 4449 -10529 -18591 -33807
15965 -33807 -30992 -35066 -46218 -61622 -64891 -63863 -79328 -51410 -21076 -5521 8636 11354 -8954
15952 -8954 -8409 8592 2977 -22453 -19818 -2515 -1431 -15810 -13934 -12936 -29710 -49003 -53571 -53529
15938 -53529 -40840 -13145 14195 15747 24478 37478 25524 42141 25711 -1958 -23630 -34768
15926 -34768 -29406 -30956 -23892 -25298 -34700 -44480 -35108 11748 23276 -624 17055 7129 -12252
15913 -12252 -24158 8780 28993 44692 24837 15786 19274 24701 38012 28262 -8404 -20174
15901 -20174 -31890 -31949 -13784 25215 41769 37991 661 -2471 -19152 -27654 -37298 -31419 -9864
15888 -9864 34736 39955 26779 2239 -5245 20482 22553 22692 9408 18216 31758 46858 29252
15875 29252 16885 12283 -18573 -23987 -16316 7232 -9797 -21791 -38313 -41614 -28844 -13651
15863 -13651 -9723 -600 7113 1967 15413 15664 17853 19619 -12290 -26646 -10886 12598 11111
15850 11111 -8149 -20939 -41236 -34172 -19840 4846 25154 29361 28026 14106 297 -15712
15838 -15712 -18745 -27444 -46994 -24649 -14994 -55027 -69687 -52363 -35029 -21965 3334 -2777
15826 -2777 -16658 -19314 19552 44313 61991 58640 4845 -22570 -44320 -62177 -53145 -56197 -23658
15813 -23658 3866 -2722 -9029 1581 19209 47363 38639 15778 -13688 -22044 -24639 -17330 -33155
15800 -33155 -34387 1621 9947 -6137 -9141 -7133 -10908 -8693 -7182 -16244 -19977 -25896 -16612 -10785
15786 -10785 10240 6697 21515 41812 25332 31826 14611 15592 56651 53062 33163 26207 25274
15773 25274 18729 1740 -14390 -16473 -12210 -10181 -31265 -26375 -20479 -11829 -19348 -34767 -16344
15760 -16344 -24020 -40070 -65737 -89209 -57292 -39695 -33179 -15311 -13408 -28225 -35880 -48088
15748 -48088 -66572 -81250 -91215 -46546 -1981 3338 -11685 -34038 -61702 -81729 -93246 -70618
15736 -70618 -40651 -32457 -17238 -7226 -26675 -37857 -15925 32206 60549 18902 40962 66679
15724 66679 45374 30468 31815 24876 3012 -18915 -21307 -29766 -38118 -22367 -12201 -1329 31319
15711 31319 47277 45178 39685 39223 19408 -2721 -22023 -13326 -1065 -16860 -25561 -38872 -35020
15698 -35020 -7982 22106 27663 1975 9654 43181 876 -50575 -20347 8302 7840 -1867 -6978
15685 -6978 -14254 -41289 -19738 10401 3982 3666 5405 14527 12366 -5086 -40483 -41460 -41464 -56323
15671 -56323 -42912 -55025 -91422 -48038 -5168 11991 8790 13521 15545 1350 13114 8765
15659 8765 -25899 -25523 -18220 -1841 -15789 -38229 -38609 -21411 -92 9790 2695 -13546 -34306
15646 -34306 -26512 -49362 -28805 2083 7285 -28961 -62777 -42118 -38848 -28716 -23838 -493
15634 -493 18672 28827 12443 -23616 -18766 -7730 -19388 -30979 -4995 -15819 -42620 -52128
15622 -52128 -56652 -50339 -39715 -22225 -25926 -32579 -44369 -55430 -59612 -45158 -41536 -21865 -43410
15609 -43410 -64796 -42875 -29131 -6933 -21617 -31974 -10399 -5332 -9112 -7781 -97 12761
15597 12761 5418 -19482 -24970 685 10042 33245 40212 41686 38448 33998 11433 -18260 -3278
15584 -3278 11359 13761 -4185 5203 22024 18399 18667 30742 11446 -17337 -38827 -47541 -28427
15571 -28427 35449 22002 -11000 -50329 -87296 -55006 -23218 -30248 -38241 -23411 -13405 -26299
15559 -26299 -39843 -45647 -75582 -67800 -49130 -61537 -70762 -75947 -67865 -52102 -67925 -43974 -37014
15546 -37014 -34728 -15361 -2748 -22745 -1792 -31271 -56750 -43792 -43420 -11425 -9656 -24832
15534 -24832 3134 2157 -24921 -31466 -30811 -23498 -22415 -11301 -18489 -11794 3620 21289 34934
15521 34934 7993 -14492 3910 7096 -18341 -12794 -682 11994 -2527 -12472 1331 -6354
15509 -6354 779 -15129 -31830 -25049 -2512 26051 20541 -17924 7272 13451 10349 12027 -7138
15496 -7138 -42047 -35639 -3139 -18057 -18100 -17426 -41964 -57401 -41516 -12628 32530 57995 34065
15483 34065 9266 -11606 -17404 -18696 -73 10466 13299 17463 12962 -3381 15997 20234 3521
15470 3521 -1968 -5461 -21812 -50151 -50543 -30222 -19444 -9671 -18708 -30991 -13900 -35210 -34763
15457 -34763 -31356 -17729 -21225 -17111 -18133 -47763 -31220 -13933 -5125 6324 20770 -3758 -13552
15444 -13552 -31301 -6168 -22793 -12727 -7280 -30060 -40939 -46958 -56940 -49296 -17060 -3885
15432 -3885 -9672 14797 -8768 -18775 -8176 -17338 -47412 -34214 -9330 -3863 -1144 -12851 6081
15419 6081 -22516 -41526 -27023 -25184 -31074 -30120 -37639 -28196 -13008 -42298 -55234 -25521 -26969
15406 -26969 -6740 -9818 -13970 -16255 -7639 -10266 301 -12895 -34338 -45955 -43110 -22684 -30235
15393 -30235 -21739 -32929 -35743 -39805 -44334 -23112 -31496 -62284 -62912 -54050 -28714 -18010 -28723
15380 -28723 -532 18604 4216 -26892 -39410 -35031 -40945 -29476 -14502 -15317 -8926 22210 29639
15367 29639 19116 15985 9940 -8162 -6365 -15381 -29193 -29511 -45643 -66399 -43868 -51182 -43600
15354 -43600 -31644 -2823 30213 27942 25259 14561 3674 -8112 -6459 13250 -24954 -33849
15342 -33849 -35006 -42207 -48316 -26165 -36058 -53420 -54891 -52680 -45490 -41213 -2320 24092 31856
15329 31856 10319 5454 13363 15906 31288 32462 49232 21173 28813 47300 37185 30416 2892
15316 2892 -14011 -20515 -5979 -24272 -36297 -54309 -70463 -68042 -74937 -66590 -56114 -50620 -40523
15303 -40523 6092 4808 -19533 -30883 -26385 -21950 675 -20351 -7084 20297 15305 10900 -6853
15290 -6853 -17563 -24 16436 19343 -5908 -35762 -39533 -33287 -34941 -25223 -22082 -10013 -19313
15277 -19313 -41337 -22020 -13103 -15397 -15971 6235 24063 -3478 -27262 -15846 -25209 -39291 -35730
15264 -35730 -39814 -31048 -34117 -54077 -36428 -13571 -8382 -22957 -49836 -43706 -55700 -48161 -19162
15251 -19162 -21288 -21886 -9663 27506 46962 36168 19676 666 -7035 -19447 -36492 -27555 -23704
15238 -23704 -47842 -61472 -55185 -29978 -6213 -10717 -8468 3147 12957 1272 -17399 -10423 -38559
15225 -38559 -63576 -37235 -18219 -11523 -29680 -30186 -14506 24359 20154 6700 19813 1106
15213 1106 9077 19532 12547 -6869 -14769 16754 20326 6101 -15135 -35411 -33715 -19248 -39495
15200 -39495 -41313 -18937 -19087 -16531 5465 18307 15388 -7553 -26065 -33073 -316 -9539 -42849
15187 -42849 -48286 -54567 -41851 -38561 -33936 -17330 -13100 -27407 -38377 -22940 -43455 -49384 -66982
15174 -66982 -69315 -49299 -27750 -18807 -413 25062 23732 11867 -7497 -45800 -61239 -35509
15162 -35509 2130 -6830 -17129 -9511 2344 -9692 -26100 -24121 -20362 8397 -2705 -16079
15150 -16079 -2066 -9514 6542 -5077 -14775 2236 19779 29810 17170 29208 36018 63655
15138 63655 55343 -7141 -34401 -46238 -60897 -67848 -66949 -59473 -45024 -26132 -19749 -7939 -20389
15125 -20389 -1500 18559 38141 24772 400 3325 4687 -9965 -21914 -6898 -7805 -29406
15113 -29406 -43773 -43021 -21626 -25297 -41668 -39270 -29694 -17290 -16907 -42958 -43646 -43518 -46554 -33770
15099 -33770 -24638 -33257 -43049 -42814 -36187 -41605 -52901 -47786 -46816 -35228 -37422 -23211 10847 31899
15085 31899 4190 6907 19063 19349 28437 17269 -3928 -6243 15537 13022 5292 10007 -7705
15072 -7705 -10226 10119 -3875 -9957 14718 -14421 -6001 10630 284 -22794 -32155 -39538 -5094
15059 -5094 7259 -15437 -9139 1832 -2767 7338 -9915 -7890 -748 -16971 -24712 -25124 -24006
15046 -24006 -3178 -3942 -15859 -12000 -23852 -35065 -23284 -36904 -32080 -55005 -67978 -37737
15034 -37737 -17934 -19027 -50293 -78532 -64558 -52604 -32013 -29856 -28882 -27255 -21233 -41059 -35969
15021 -35969 -28037 -47604 -31511 -31889 -82339 -81852 -47891 -25171 -2535 13647 1658 11170 10526
15008 10526 -20525 -21429 -30920 -61657 -62682 -87749 -80984 -55021 -24111 -22051 9756 28778 25436
14995 25436 17065 -13642 -18693 7172 13799 18015 -5680 -11276 10817 -4965 -10667 14240 6022
14982 6022 4687 34300 78290 120700 109106 80188 72693 47700 8046 -14909 -15369 -9646 -9604
14969 -9604 6242 13163 1111 -12296 -31678 -6415 10030 -7298 -8571 -12237 4027 3160 -5259
14956 -5259 -15046 -14632 -4115 -4454 -9210 -18722 -34994 -47424 -61161 -43811 -21579 1712 23499
14943 23499 19081 1370 13319 1130 -3067 -1499 -15336 -16238 -1254 -6719 -25430 -36243 -34739
14930 -34739 -22403 -19661 -9165 -17394 -25160 -5120 26721 23802 23534 38857 27815 28125 8989
14917 8989 6006 11765 -2553 -7492 -5967 -14989 3676 -11933 -26182 -25687 531 10630 -27024
14904 -27024 -14810 -9297 -31946 -37179 -45063 -26033 -16666 -8849 -24849 -1425 -4471 -16611 -19760
14891 -19760 -42492 -37662 -20062 20793 17717 -2238 -16213 -40770 -31328 -5839 -18794 -31002
14879 -31002 -34275 -32534 -27575 -7637 -19401 -51218 -33755 -36414 -44541 -34594 -37339 -23752 -53665
14866 -53665 -90326 -102360 -91463 -62555 -48533 -50651 -25502 21949 14568 -14216 -17728 -27429
14854 -27429 -26964 -11992 -25454 -29065 -29862 -2226 38146 57714 48548 21209 16179 29393 19567
14841 19567 -9259 -14726 -20990 -20116 -21017 -15597 -26269 -24938 -39643 -55763 -60755 -19780 -16
14828 -16 3101 33488 55915 39818 1540 -13634 7734 9542 1049 20093 13016 -3193 13674
14815 13674 -2498 -21755 462 17124 35913 22641 -1600 7064 5325 10282 -46 -1858
14803 -1858 17078 29387 13088 14379 6686 12625 15265 7490 -10535 -4136 -5066 -8850 4867 -14188
14789 -14188 -44423 -44335 -72975 -84267 -46912 -39001 -19312 -9143 -12791 5756 18061 -12440 -30026
14776 -30026 -20953 -22185 -42828 -26611 -10295 17046 -3766 -14673 -16553 -38743 -47823 -30230
14764 -30230 6631 -18640 -44911 -54352 -41193 -30604 -5113 7414 8611 -4670 -15655 -44344
14752 -44344 -29180 -3077 -4039 -20415 -34994 4562 3326 -22196 -12512 1887 20330 48933
14740 48933 31750 -6553 -7244 2805 -31396 -36158 -41979 -51336 -47807 -35912 -35705 -24371 -50641
14727 -50641 -39124 -8479 -32956 -26009 -16272 -26112 -37587 -25012 -21265 -21671 -13545 8133 17001
14714 17001 725 -13007 -8324 -11581 -41510 -40805 2948 13406 18089 771 2796 -12856 -44297
14701 -44297 -20454 -17791 -19444 -22117 -7937 4251 14456 5456 -23407 -358 16721 16095 6958
14688 6958 -18455 -20512 -15683 -8571 -5531 -363 2316 1465 -9211 -6922 10755 11861 29551 33613
14674 33613 21409 -4937 -2567 -12165 -10031 1392 -6955 10602 -7175 -32149 -35869 -36484 -17095
14661 -17095 8113 3130 -21239 -54342 -60697 -18755 -15266 -10693 999 -5450 -15786 16339 50640
14648 50640 30650 33766 51988 52000 32681 4937 -8744 -11989 2786 12222 39372 36910 33441
14635 33441 33674 24111 26282 15079 4236 -4004 -5908 5407 11064 4292 -13995 14943 52492
14622 52492 58462 34434 34375 39698 41645 70738 71106 76719 90368 81419 105542 142985 138336 120249
14608 120249 104428 111196 139809 165683 158206 178559 184971 195293 188318 178935 176911 175856 198912
14595 198912 208402 220409 234427 243052 234322 215096 213947 237224 254571 257524 254747 260311 275746
14582 275746 257172 246076 258927 227623 219108 257639 264685 234099 207726 204167 231894 240210
14570 240210 231125 214774 184692 174929 148666 129593 145527 161224 142765 162065 146899 134950
14558 134950 131075 134772 131181 125849 140591 181684 176288 165673 167495 143937 139453 120413 107892
14545 107892 125624 143341 146510 113504 96123 95523 73570 51601 74807 66475 49228 17738
14533 17738 20310 42670 48273 65293 76221 87166 91844 90838 62860 55358 73950 65075 75364
14520 75364 68138 53173 68730 63899 46078 47650 42081 47543 54190 53497 71247 78855 63933
14507 63933 55991 28176 3340 22218 47995 14597 1388 27080 36468 10087 20791 27764
14495 27764 50106 58081 42213 32852 26887 3274 12363 15767 12913 3938 12390 24408 481
14482 481 -16433 4545 11936 2336 2041 22891 18394 -4682 -40849 -24936 -2931 11746 10809
14469 10809 -10412 -36206 -33933 -19504 -8558 -3726 -27305 -41467 -24281 -15077 -30357 -9741
14457 -9741 36568 47355 50461 29021 -7280 -12854 -21495 -47032 -52964 -24162 26060 14206 5164
14444 5164 -21139 -21033 -12840 -28610 -49853 -61165 -44614 -42294 -27971 -17201 -20067 -19385 -6958
14431 -6958 -30324 -62571 -74117 -60661 -39113 -31946 -30127 -36322 -38327 -26197 5103 12560 11263
14418 11263 12157 -1113 -5942 672 -3325 -22024 -31715 -35012 -32242 -28622 -42794 -33417 -19110 20626
14404 20626 26101 34586 11736 -9433 -12884 -8478 26230 25972 6741 -18890 -37808 -44550 -43976
14391 -43976 -30744 -30209 -18832 -4586 8870 10666 7243 -19064 -12921 -15225 -13757 -345 -1911
14378 -1911 -31284 -14166 -26785 -16962 -2669 27427 26916 1130 -37540 -61888 -20524 5339
14366 5339 3428 -12152 -36737 -44915 -14948 -12406 -19708 -42602 -71034 -65188 -28280 -5322 -42912
14353 -42912 -81163 -64698 -33066 -31213 -47304 -40087 -11732 -4737 -3360 17662 -1234 -20753
14341 -20753 -18776 -9432 -16273 -34618 -61088 -49738 -34834 -42015 -43158 -54374 -36142 -8030 -37010
14328 -37010 -30247 -8250 -27800 -48097 -38396 375 16426 -397 -23769 -26957 -26640 -30370 -18900
14315 -18900 -6886 -27634 -63377 -50810 -28509 -30149 -33363 -37985 -44097 -48025 -28766 -2673 21508
14302 21508 29435 26744 33518 18110 -2014 -29469 -43699 -42112 -19245 -18256 -14536 -18557 -1124
14289 -1124 1048 -21060 -41029 -12710 -17436 -31435 -47214 -34727 -38758 -13857 -7691 -3091 -27859
14276 -27859 -27149 -21442 -33870 -36213 -2916 -6485 -23788 -42267 -31715 -540 6790 7733 13799
14263 13799 9312 -7278 -2277 1364 -10012 -22096 -16931 -21869 -14218 22 -23157 -21537 -50848
14250 -50848 -65112 -66753 -52510 -53226 -50942 -27551 -18725 -8099 -9500 -11368 -13629 1148 -12241
14237 -12241 -11863 -34825 -52106 -67438 -59855 -37012 -17756 -17945 -13522 -10383 -19608 -58000 -76461
14224 -76461 -96979 -87112 -63328 -56205 -38146 -21948 -20649 -48016 -37286 -31343 -57611 -83386
14212 -83386 -84390 -65751 -49615 -43345 -34256 -45769 -35679 -16402 -21731 -33617 -35438 -38674 -30059
14199 -30059 -24164 -24736 -20428 -10437 -9034 -4479 7580 -18471 -38484 -17224 -7791 1622 -8278 -24322
14185 -24322 -27927 -44305 -53033 -40281 -41656 -55413 -36283 4404 27850 20660 7353 15156 12387
14172 12387 4884 -8070 -42145 -43050 7950 -7747 -24280 -40731 -65713 -54599 -45217 -42307 -1493
14159 -1493 5021 -30340 -51460 -46853 -32802 -11851 -17307 -21926 -52992 -16712 -20071 -43433 -16127
14146 -16127 28105 16554 -9293 -22539 -10447 1824 -27261 -56636 -59791 -38367 -36304 -65017
14134 -65017 -45677 -45127 -25102 5571 8862 10790 1342 -11956 13258 28112 33409 30904 18468
14121 18468 22736 12754 -8578 -8798 -2615 17749 8014 -4960 -8537 -18166 -50089 -50432 -25937 -3079
14107 -3079 -485 24105 13330 -11343 -7908 -22672 -30029 -11431 -14470 -9369 -8107 -23246 -20259
14094 -20259 11581 840 -33103 -60578 -75192 -64571 -40522 -25939 -40431 -44686 -43980 -43408 -48386
14081 -48386 -46849 -34596 -6695 -26545 -28435 -25633 -53916 -58848 -33170 -56985 -73745 -73746 -72569
14068 -72569 -49493 -30196 -23019 10579 5190 -21322 -17788 -16231 -15619 -24398 -27138 -28056 -45321 -31184
14054 -31184 11114 -14593 -7512 2566 -32138 -70729 -72626 -54022 -39710 -59704 -57981 -42582
14042 -42582 -45530 -62260 -62190 -43822 -11608 -17135 5083 22378 3659 15349 29399 17593 -7975
14029 -7975 427 8257 -15547 -44777 -35637 -11094 -543 -19574 -24501 -40368 -14117 -10308 -32480
14016 -32480 -9500 -6656 -20191 -18866 6720 18965 26726 19193 -9980 8717 13475 19777 4422
14003 4422 -923 15066 35559 33846 777 3670 485 -20138 -16775 21619 57309 41624 -14877
13990 -14877 -28365 -31966 -21931 -10175 -11320 -17558 -867 28285 10286 -2892 9228 15346
13978 15346 14910 25799 44142 43497 47055 51852 30186 27402 21810 19544 22325 26597 31748 2782
13964 2782 -9556 26566 27119 14108 -18216 -52352 -48859 -43152 -25789 -21606 -8330 10104 1135
13951 1135 -6756 -16192 -28192 -22739 -33875 -42843 -34845 -39306 -27939 -3730 -6173 -28549 -63933
13938 -63933 -65808 -56368 -31748 -14147 -23762 -19012 -5373 -27425 -21939 -8910 -6748 -14275 -31950
13925 -31950 -40125 -67596 -97472 -89730 -71871 -32019 -6780 -11233 -45829 -38038 -32316 -25133 -8878
13912 -8878 -10068 -37726 -48069 -63173 -71130 -52329 -43856 -66426 -47512 -25419 -13904 313
13900 313 15748 -19539 -23774 -32456 -41539 -25968 -13532 -3394 27332 24168 11808 -4801 7062
13887 7062 4782 -36158 -45051 -47648 -32148 -28068 -20198 -55276 -83926 -79287 -46654 -51091 -52508
13874 -52508 -53286 -60749 -70023 -54266 -21552 -1069 -17413 -20827 -26992 -17549 -23382 -28155 -47277
13861 -47277 -66599 -67795 -54629 -37272 -9319 12 -24525 -53999 -13504 12920 4411 -644
13849 -644 24012 27729 26689 45060 53869 52705 33012 17006 13984 28459 2028 -7825 -20275
13836 -20275 -16982 -37187 -76865 -56549 -18583 -3182 -272 172 -7146 -11477 -1173 -16815 -51590
13823 -51590 -36149 -27775 -21143 -20846 -39348 -37174 -32744 -51240 -38748 -15280 1517 -8933 -5530
13810 -5530 -25373 -40824 -19172 -2043 -25866 -61634 -55765 -60785 -56394 -37676 -19038 -5987
13798 -5987 -21025 -25984 31596 26224 17766 8224 -10495 -36036 -22934 -12376 6300 30862 14791
13785 14791 -10729 3887 21937 18676 7916 2546 16386 51841 63594 52943 14904 6083
13773 6083 -827 10244 20821 5602 16654 2604 -11912 28892 38796 14441 -2870 -13851
13761 -13851 -25741 -50306 -17657 19092 34815 35974 2629 -18340 -22363 -38612 -16385 -7834
13749 -7834 -18419 -45634 -51466 -57389 -44233 -59569 -69963 -39573 -20613 -3530 -38661 -63421
13737 -63421 -58812 -58632 -28945 -33038 -39751 -33682 -17562 -16442 8531 -5142 -15175 -14689 -47726
13724 -47726 -69634 -55370 -93535 -91748 -66116 -38761 -17320 -22029 -6483 -10015 -28883 -33963
13712 -33963 -48406 -44016 -40228 -46215 -32147 -29813 -3974 10275 14726 -9425 -35853 -5381 5678
13699 5678 12026 1150 -28447 -55873 -35638 -54384 -65462 -55569 -49315 -14370 -29224 -48068
13687 -48068 -21590 -44224 -29948 -9660 6311 23513 33895 38731 50088 30396 8564 -16918
13675 -16918 -29661 -57107 -52824 -35267 -10093 3107 16529 30312 14667 -20564 -35615 -33997
13663 -33997 -34244 -45763 -56549 -34520 -15109 21160 31361 44337 55025 31069 6955 -13510
13651 -13510 -2550 16398 18831 32076 39948 42133 29424 40687 29334 30340 8719 26838
13639 26838 25735 -7447 -30660 -27570 -16770 -16555 -27812 -19485 -2636 17086 6409 533 -8854
13626 -8854 -704 12870 48940 41125 28467 45427 80646 109208 133761 124337 146980 183040
13614 183040 201464 255309 318558 369732 396279 460523 503382 558440 598532 637498 689133
13603 689133 743749 804739 850979 897439 946289 961195 966781 950736 938592 930031 909345 886220
13591 886220 857201 806956 788812 756307 721669 688226 636682 574675 546344 499507 446142
13580 446142 376952 334502 300923 263681 217717 208902 191107 167969 173180 180065 198093 188170
13568 188170 173972 185165 231268 232974 216412 182838 166315 176073 164602 155252 151976 150370
13556 150370 116371 98549 99114 114866 114100 98639 63513 45882 49362 47051 45026 32058 17859
13543 17859 -4137 -2861 -19325 -33811 -9845 -13927 -17858 9734 5704 12866 17481 14842 22669
13530 22669 25426 32688 45494 57848 42688 39806 34721 15788 -12630 -39630 -61738 -33476
13518 -33476 16949 45958 58920 68895 42562 24776 11137 -18518 -10340 -5729 5143 910
13506 910 18849 41820 36572 28930 14629 18185 20457 32464 54346 75019 36184 28424 45628
13493 45628 74631 56796 55519 33624 1006 399 -30067 -48435 -18956 -16680 -14702 1598 14997
13480 14997 11528 -28804 -53072 -47408 -38317 -12056 -1822 -14307 -25368 -15510 -28540 -37975 -12273
13467 -12273 -12623 -11658 784 25512 7726 3199 30029 3679 -44148 -19809 -17831 3164 33060
13454 33060 19510 -22666 -34973 -5600 -13971 -32458 -45501 -37286 -42752 -13252 -150 -12666
13442 -12666 -13062 572 -5718 -2259 3747 15726 13980 22655 23698 7094 1736 -6358 -3764 -20234
13428 -20234 -31426 -24843 -7407 15388 13691 21469 7687 6950 2941 -10435 178 25486 15867
13415 15867 2108 6470 7774 -12361 -27482 -14750 -10874 -10979 -26599 -11737 23659 25472 3575
13402 3575 -6318 -15127 -15894 10353 1481 -20131 -44189 -47925 -37753 -33920 -26798 -17845 -29938 -45208
13388 -45208 -39055 -6921 -3808 -4971 8014 711 -7309 -21794 -11770 1284 13920 33064 30631
13375 30631 -3880 -15229 232 -9840 1168 16071 13030 -10 11056 8088 -1724 1493
13363 1493 5649 -2050 -3940 6582 -6195 -35061 -38491 -21973 -5321 -3647 -29557 -48013 -56303
13350 -56303 -43274 -41468 -53970 -51778 -36564 -35597 -36482 -19343 -26786 -28422 -23963 5472 9296 14155
13336 14155 42314 21404 -970 -5004 17922 -6298 4997 -7171 -10290 -1689 -19229 -22139
13324 -22139 8851 8193 -17458 -29047 -4744 7514 93 -4411 2159 26189 32903 3645 15272
13311 15272 19445 20736 26678 23199 -4414 -18583 -2437 -7202 -34423 -47269 -60895 -37736 -19043
13298 -19043 -16400 -33209 -32052 1352 29082 9764 -8394 16448 15811 1382 -27529 -56584
13286 -56584 -42644 -32826 -19228 -19270 -9757 -29971 -46546 -36423 -2720 2288 5706 -6958 -53168
13273 -53168 -49545 -53442 -58540 -50033 -37310 -50738 -52170 -37581 -32620 -36445 -45975 -39959 -65270
13260 -65270 -77697 -56609 -61523 -57521 -34793 -21203 -25551 -41959 -69026 -85493 -86905 -72058
13248 -72058 -29693 2587 -5240 -2664 -9709 -16842 -3770 -2732 11940 25678 26436 6202 -10426
13235 -10426 -24432 -22896 -21458 -6994 2805 5195 -2969 37793 53929 35708 45736 30413 -8817
13222 -8817 -8205 -13655 -9303 48 -4789 -3087 6991 -17698 -7086 8775 49130 71426 57267
13209 57267 32103 18782 -5733 17067 40558 31874 50346 28195 38983 39121 13786 14014 24370
13196 24370 45677 40204 37011 17977 -9931 -11194 -658 19431 37549 25094 14457 14633 849
13183 849 -9057 -5056 -49674 -57317 7888 12648 11714 15215 4333 4312 -28042 -31644 -7913 26382
13169 26382 26335 25772 7429 8016 31595 19809 14716 30036 25968 -4644 -12366 -19063 -23389 -13625
13155 -13625 -13676 -7780 6702 -12367 -25225 -25415 -18862 6944 1472 -8168 4934 38394 61737
13142 61737 54307 47936 35287 30704 10662 -5049 -19259 -38107 -23958 -9188 6906 1621
13130 1621 -1518 17146 26830 12406 25224 64718 91147 106072 163514 236096 297015 360312
13118 360312 441568 525327 587420 636186 701543 745181 769843 737617 704230 678891 641293
13107 641293 565488 486939 424232 344280 281881 234248 162259 167317 179592 161815 157769 151062
13095 151062 144331 121598 97428 74429 70279 69684 64760 53969 32511 36196 43263 54883 59875
13082 59875 74323 79709 56414 24523 14286 42517 98007 117025 101348 87098 111577 78823
13070 78823 52379 44290 44271 26587 33034 50312 39802 35441 46455 26967 9207 2104 4097
13057 4097 23205 45552 43379 46541 53144 45607 13544 -2221 16588 16073 -563 -3890 -465
13044 -465 16000 386 6933 10448 13574 16929 40103 61390 42021 -6297 -12706 10027 32862
13031 32862 46346 20625 3250 24327 50240 32832 -9759 -23222 -5212 34079 61813 51766
13019 51766 42814 43276 28054 21241 22350 36502 41889 66442 44003 18234 32305 36647 18128
13006 18128 17532 12228 14950 21247 30559 40472 18044 -8014 -28475 -25318 -25196 -14450 -3787 10884
12992 10884 9408 -4909 -10121 -16377 18182 9753 8945 18746 19205 33919 38251 35637 24160 12503
12978 12503 7892 18615 26799 -4246 -2517 24523 14623 -29166 -37044 -6857 -1886 -18505 -42031
12965 -42031 -24507 3103 6887 15287 -975 2647 5638 -3315 12212 33963 62996 95040 83263
12952 83263 82509 45585 39486 34129 56937 76834 62575 59638 76857 91432 100742 96841 80474
12939 80474 54565 60656 71175 73338 77414 66400 54548 78980 93093 85615 30614 -9950
12927 -9950 31614 47073 52550 18908 1343 -3071 -33979 9094 34768 60127 67943 61874 53411
12914 53411 41459 27708 19334 13427 3824 18957 30733 11608 -8639 1674 38782 46086
12902 46086 50039 50406 45358 44246 34988 34826 54073 51869 27395 17862 5117 28519 29951 37749
12888 37749 42835 60916 74945 98648 98185 119808 92930 98921 152801 183787 200681 211472
12876 211472 232010 240131 242334 244183 251366 235593 227120 223061 212052 197130 169208 158677 185635
12863 185635 181995 162570 164232 151138 132407 109971 92706 113201 91896 64359 81080 124094
12851 124094 127659 138064 133439 136039 111481 88437 122425 139850 122459 100209 77189 75201
12839 75201 106605 128420 109243 123575 150233 164836 167655 171744 167069 162093 160747 148704 148384
12826 148384 158545 157057 175874 189199 196472 220833 278161 307616 316563 341411 340883 323450
12814 323450 332526 334315 349087 378515 384450 342984 307733 295683 298873 343533 359182 357967
12802 357967 366559 388419 380926 369291 352689 358726 399742 403729 404138 386824 381874 371817 398138
12789 398138 397227 393335 415363 429818 439259 438428 461011 481351 494440 473718 442377 425034 406974
12776 406974 430696 433172 459801 485274 510558 519967 541730 555005 560287 547525 545822 546239 563564
12763 563564 572304 597644 620809 632577 654600 688334 727301 734230 719362 768323 816145 864418
12751 864418 933290 979268 1013970 1076721 1163361 1236737 1327914 1410163 1508686 1628458 1786021
12740 1786021 1915324 2008112 2081378 2141666 2151258 2154164 2157661 2135255 2135231 2146082 2168743 2188048
12728 2188048 2188914 2223200 2324993 2422413 2540210 2654597 2777299 2887623 3041669 3246623
12718 3246623 3465036 3668989 3922200 4189791 4510868 4899296 5367366 5939545 6635940
12709 6635940 7474031 8424585 9546364 10885175 12423840 14248271 16388790 18917976
12701 18917976 22066686 26172411 31584581 38679813 47879116 59438494 73254964 88789688
12693 88789688 105141335 121066062 135088706 145761776 151953590 153048416 149015335
12686 149015335 140419830 128377905 114268155 99539283 85369778 72690833 62003395
12679 62003395 53384197 46595185 41323497 37203225 33919548 31240202 28980251 26976431
12671 26976431 25166024 23526002 22041080 20683582 19422882 18274884 17259455 16311483
12663 16311483 15453287 14719562 14076643 13447634 12906001 12455513 12089100 11794564 11559654
12654 11559654 11395392 11275169 11157991 11035244 10903302 10730753 10506073 10217976 9851831
12645 9851831 9459049 9025093 8592352 8179526 7761875 7339429 6974704 6664287 6393606
12636 6393606 6152765 5926805 5713326 5504278 5320732 5158545 5021615 4847556 4678542
12627 4678542 4522728 4383744 4219460 4087408 3980901 3854339 3729425 3609942 3538782 3420342
12617 3420342 3294245 3227521 3163271 3051775 2932632 2864049 2829395 2784190 2694900 2575217
12607 2575217 2524846 2486378 2428668 2366075 2283884 2216035 2173759 2121905 2046320 1991356 1960627
12596 1960627 1938795 1894394 1898854 1909537 1914010 1883632 1845315 1826836 1798140 1747189 1686736 1627223
12584 1627223 1571744 1485448 1418070 1341792 1324388 1298196 1254341 1205003 1162624 1113169 1091114
12573 1091114 1094527 1127761 1151862 1173200 1187496 1211458 1275301 1374755 1474440 1555044 1577333
12562 1577333 1567353 1552050 1496744 1389588 1269647 1145647 1006945 895817 829483 780388
12552 780388 728541 682868 627243 584403 557938 549229 525407 511372 512817 505275 472811 454507
12540 454507 452677 423304 425001 432827 445527 436388 424338 421739 409186 415001 381735 376115 379224
12527 379224 371667 334743 314265 325448 348187 373609 394920 381961 370643 351886 391922 444144
12515 444144 431413 392852 426661 456098 464074 474258 480252 474015 477843 431254 395770 388289
12503 388289 347364 311072 309023 343125 360650 411312 480868 539535 579168 611092 638376 673302
12491 673302 688813 682516 649013 598355 563883 535008 494891 484569 454277 437143 401992 353556
12479 353556 323662 330553 319077 351582 402101 405754 408542 431805 452500 427190 422085 443014
12467 443014 437149 396416 360788 353159 363369 380215 361644 351778 381912 433270 445044 440155
12455 440155 460658 477830 492709 509488 519075 523608 537488 548335 552196 567071 539048 491151
12443 491151 470010 437204 421145 418105 419183 412282 413016 412179 406883 425579 441174 441350 420338
12430 420338 379511 398853 418065 452439 479665 465181 478582 490546 465733 481616 487164 492497
12418 492497 496791 498000 491570 478327 452699 462314 456588 435279 446239 472263 475440 462177 466937
12405 466937 489048 513515 526670 548469 574037 559732 547228 559224 584089 596645 615233
12394 615233 625229 636496 649694 663468 650782 660662 700106 721210 749203 782623 824805 854073
12382 854073 917464 931440 970624 1033527 1070833 1145712 1226524 1304713 1368602 1445998 1527633
12371 1527633 1607506 1715873 1790062 1877635 1945874 1995399 2009749 2014537 1993632 1996660 1998563 2011426
12359 2011426 2045335 2106909 2180869 2261731 2360404 2504337 2679472 2850971 3047085 3260326
12349 3260326 3490097 3778824 4133288 4570918 5130478 5795435 6579465 7534694 8652632
12340 8652632 9945214 11393166 13005475 14834079 16997020 19714893 23278504 28133919
12332 28133919 34765809 43696452 55329094 69723962 86413360 104544238 122636962
12325 122636962 138945679 151733783 159677274 161894120 158117270 148961804 135770978
12318 135770978 120155510 103743822 87989150 74020305 62478747 53453834 46691204
12311 46691204 41674913 37910963 34986693 32588992 30503262 28651344 26949157 25385810
12303 25385810 23889025 22413343 21007985 19703510 18467451 17313032 16242606 15245448
12295 15245448 14382762 13622852 12944420 12343764 11773403 11280773 10862679 10490083 10125556
12286 10125556 9822497 9560141 9259244 8972398 8695169 8435278 8170476 7910607 7649501
12277 7649501 7406992 7147660 6908007 6666307 6415696 6200521 6002094 5795581 5642572
12268 5642572 5494937 5369253 5294610 5230459 5187235 5132405 5101422 5030237 4926845 4850062 4743253
12257 4743253 4595226 4425472 4224394 4028150 3850817 3680452 3545990 3407003 3271752
12248 3271752 3155317 3031901 2942891 2841856 2745228 2685431 2592591 2511560 2473059 2397743 2297612
12237 2297612 2258491 2216038 2160514 2096632 2014436 1967897 1941052 1904929 1890009 1862836 1815074
12226 1815074 1782201 1763492 1707258 1677442 1596740 1533970 1490293 1433831 1365538 1300974 1232195
12215 1232195 1159214 1127472 1096769 1069130 1038652 968816 905565 842412 791389 773327 787191
12204 787191 770568 729768 719572 693925 636549 625114 583012 529732 500123 488139 484231 464736
12192 464736 439429 400376 396764 391142 390326 390300 392054 393549 360501 350869 331280 335141 321569 331793
12178 331793 303294 308736 330724 335859 343760 338141 359052 359035 377514 384859 369695 338002 325899
12165 325899 332826 322180 309655 316689 312183 300036 282275 267589 277633 268349 265933 247011
12153 247011 229780 247473 251645 254649 280322 275753 248446 240129 262193 304763 350065 407275
12141 407275 460406 479617 526039 567933 590344 595064 579787 529541 469659 447489 432291 421310
12129 421310 408164 402995 378760 391089 380319 394490 394754 382076 385265 412929 413844 386756 368305
12116 368305 353646 353602 389085 396541 380410 370418 376042 399167 395851 398532 450184 520886 592890
12103 592890 652542 803372 953089 1127228 1272840 1464602 1607094 1662812 1664543 1624769
12093 1624769 1522073 1368157 1200911 999266 821549 715409 644918 592123 552072 524814
12083 524814 487881 477904 450115 423527 415171 398826 366160 340346 327739 308633 303997 304018 312734
12070 312734 307491 301373 255456 224248 231705 247740 262977 224698 198038 196965 169994 149780
12058 149780 170924 199027 188538 195155 197446 188270 166924 154655 140313 124551 146704 117157
12046 117157 99646 108296 107116 115280 111748 83309 87764 124201 132704 101325 74309 67631 78731
12033 78731 89145 132774 133828 122535 118384 81509 47003 66515 100088 97751 90946 80502
12021 80502 73865 60538 67121 50209 78184 83140 66192 50024 78622 92385 87869 115051
12009 115051 111796 79656 73388 62458 32468 44387 52010 75012 90604 87598 70938 52701
11997 52701 62846 62645 56791 68286 66352 55638 24101 38177 36356 48896 64743 83459 67073
11984 67073 70065 65247 80487 76759 77373 76929 66637 55452 50002 41590 34766 38698 52231 18627
11970 18627 3164 -1277 5734 9336 49588 74145 97521 86335 66532 65020 77620 84515 79299
11957 79299 85990 76854 71732 76554 73795 65336 55773 60968 81973 78869 111288 97814 86097
11944 86097 128467 125267 114775 123559 148343 139178 101073 78721 44416 35425 16855 12504 49680
11931 49680 59196 68655 70470 56779 48717 45577 55026 72462 89230 90091 80970 87529 85126 79299
11917 79299 94770 112585 142053 164592 155264 187053 234614 270287 320177 412271 520023 586827
11905 586827 642741 710699 774678 815842 848178 827930 769311 727384 663454 622165 542368
11894 542368 450825 393338 344365 309718 260800 243040 220624 195701 189802 163529 188575 197848
11882 197848 200058 163477 152628 146834 143447 124033 106771 86947 84574 93823 96922 90366 81746
11869 81746 86968 99903 91459 73081 68582 58606 48705 74440 79749 91502 113942 116450 128769
11856 128769 99605 69630 50682 80708 123116 119564 103955 102219 105000 77516 62780 54559
11844 54559 42493 49998 76130 52229 40023 18680 4302 21994 21522 14173 28367 84149
11832 84149 116651 115612 107959 93917 64525 59115 54995 49044 67980 77464 67363 5294 -3451
11819 -3451 5533 33024 42800 54070 60711 58352 58636 33977 2358 9590 40156 62471 48990
11806 48990 26563 -3405 -1459 22562 28716 47377 65592 66786 54212 59756 44041 17006
11794 17006 30163 60961 61621 38537 24439 25813 22177 21943 42635 32354 35444 41572 4762
11781 4762 -24050 -12893 -9355 6685 28656 49937 45264 32173 44691 18993 21427 2642
11769 2642 8 23227 27978 57060 63406 50048 58619 56756 48076 17892 -18825 -54443 -20539
11756 -20539 30601 31891 36730 25657 -8531 2831 -9024 -9375 32396 35946 15077 -9154 10431
11743 10431 2867 12 46226 44394 47982 41725 9336 -10144 911 -12140 -22436 -31895 -37886
11730 -37886 -7373 33731 21417 33307 56318 46355 36201 53966 72816 56856 27212 12512
11718 12512 14183 10943 5796 20838 43748 32407 40126 38333 54322 82996 67172 57464 71283
11705 71283 90298 68401 20948 -4737 -7271 51103 48244 30365 18549 -4772 665 3334
11693 3334 -4127 -26531 -18530 -4861 -7981 3159 21260 28973 19400 4957 -15012 -29480 -30499
11680 -30499 -18742 -3224 -3948 -41635 -28991 -591 10688 -14067 -8457 7191 7976 8663 17543
11667 17543 10861 1805 28675 26339 2983 24063 33658 40443 51807 43507 41013 21907 23134
11654 23134 37233 18810 27430 66407 46603 30026 19548 23217 34883 27377 4635 11487
11642 11487 38435 53570 56954 29599 6617 22589 58182 70050 42233 -1397 -1716 8099
11630 8099 -19274 -32508 -29710 -14476 19136 15267 13153 58450 47238 13082 -2327 -16418
11618 -16418 -4906 16655 9790 5531 25429 54240 50883 26541 -13408 11521 17298 9405 -1990
11605 -1990 -8403 -6117 -20079 -857 7929 8647 15131 40024 29155 16549 3261 15644 48920
11592 48920 28491 14320 12136 12881 21612 25083 28543 22452 13174 16445 15115 27535 21650 8379
11578 8379 33359 62239 57474 18171 -19078 -31855 -12764 -34504 -44040 -60476 -42828 -12288
11566 -12288 21033 42483 29372 39284 1709 -3098 10092 39846 19039 19803 20255 13829 11868
11553 11868 -6572 1373 19277 55713 45683 6956 23276 39529 39126 43561 74619 74822 69327
11540 69327 87324 79679 44007 48034 50908 37665 33087 40019 35421 24802 38752 70118 59416
11527 59416 22267 33527 33370 33820 41691 17263 30916 35251 51638 48792 26525 28265 34822
11514 34822 32211 2072 3513 -2896 -11464 -8485 23747 24859 4555 15295 8124 9689 25698
11501 25698 33328 42326 40210 30280 35718 36698 32052 36295 25456 37230 44374 35366 37947 53089
11487 53089 60225 53450 31495 39547 52558 69931 40816 9606 27157 40313 38117 42544 69227
11474 69227 46762 55502 64640 58207 53874 56699 61861 83274 81042 81092 68770 63261 45616 34505
11460 34505 27558 29678 23437 20709 45507 51103 26974 57404 88170 72733 55916 77392 63340
11447 63340 88273 94407 61931 64272 60180 43630 43412 50350 73739 80603 101671 91080 73648
11434 73648 32766 42689 48902 32842 22452 28514 16822 -2345 -3094 3527 -6783 -19948 8255
11421 8255 13966 36714 65307 63753 63245 66380 82893 81139 60892 71481 77567 91310 72994
11408 72994 42862 24326 67742 108758 112735 87968 70754 76692 63986 71923 40654 -64
11396 -64 6427 28516 49664 42689 36129 59766 53293 60249 82196 88470 73964 44491 44845 65507
11382 65507 103117 67746 59989 41695 60620 74002 83829 59413 27554 37966 65204 80942
11370 80942 77393 92257 87883 76881 57911 68403 92933 90589 99433 86895 66751 62264 46926
11357 46926 53915 75968 70592 55188 34562 20778 38551 53399 79232 74891 75107 91296 100873
11344 100873 128230 125357 141706 181620 218134 245542 263365 280552 282281 286092 272497 274641
11332 274641 224358 191963 188416 172127 161127 166492 155613 163817 177979 204171 190443 177581
11320 177581 182222 193860 220467 262635 333907 397501 454585 530302 597694 631265 648899 625139
11308 625139 596548 570992 556440 553279 542445 551275 566001 568619 554166 581533 609520 622051
11296 622051 648887 678598 650864 624216 613163 571116 515072 471329 438488 430735 471057 464643
11284 464643 440890 453669 472804 520919 548543 564831 636167 735803 834427 910132 974105
11273 974105 1052639 1082840 1075057 1009019 978048 935264 888891 869784 852466 865007 887142 891600
11261 891600 889861 896403 876291 854320 827402 813349 815898 813792 822496 827418 810604 808619 798771
11248 798771 759885 747028 742690 717993 738363 784021 792203 766033 736458 749489 782105 863667
11236 863667 964087 1049937 1153152 1223070 1254247 1212884 1182094 1107777 1030993 955678 869662
11225 869662 849749 823141 815194 808152 823648 821421 773345 749188 745883 709440 697675 700942
11213 700942 725549 741639 774723 822295 878870 900656 906911 867392 817993 771909 746055 722616
11201 722616 680476 608594 594687 587181 562266 558635 577291 566996 593864 623705 668555 736383
11189 736383 813096 886862 934222 926655 921924 966851 999885 1051882 1118841 1183302 1218658 1254739
11177 1254739 1265437 1214723 1165227 1139086 1113540 1114249 1119479 1108346 1073507 1025026 962588 863655
11165 863655 767063 712242 696956 727178 752393 775742 779477 814636 887016 957972 971993 1017662
11153 1017662 1105717 1218808 1274860 1326263 1400182 1456969 1480704 1465125 1445949 1440580 1407236
11142 1407236 1344271 1250718 1192924 1122951 1049154 1000461 943997 897832 854028 805346 788283
11131 788283 750214 727422 736927 753830 758718 743411 737492 755465 769506 835142 956067 1055305
11119 1055305 1121391 1159391 1199716 1211076 1175638 1127974 1055247 971213 903078 847902 799323
11108 799323 757493 719776 666652 663618 648349 635992 623409 612913 629876 629294 610739 577990
11096 577990 566125 564002 560109 552459 555524 562987 570546 576748 568409 578514 616837 635354 637355
11083 637355 588220 557580 547939 484128 454465 460804 447191 432956 438548 459641 471535 490688
11071 490688 505635 474269 476131 497207 505693 490981 466209 455921 458483 432056 392489 389688
11059 389688 402976 396734 402832 376875 345301 363965 402189 434588 463315 479759 486487 485871
11047 485871 459963 418653 423843 441408 437754 410947 378327 341335 367955 414562 426544 430505
11035 430505 413872 427664 439184 446398 441639 467160 473310 483877 497258 513413 481356 449032
11023 449032 487488 540273 565968 548860 565215 554700 548087 575322 572895 564119 591748 614758
11011 614758 610459 617611 652412 666979 681438 671289 675217 693842 687561 647112 622901 608304
10999 608304 601022 620190 601442 615398 653317 686661 693214 682422 724746 773713 786942 799922
10987 799922 826566 836699 855051 887953 884132 890055 901977 919446 946966 975880 993728 1020922
10975 1020922 1047919 1086344 1108567 1115099 1145186 1166727 1178947 1176923 1178053 1206850 1254457 1290732
10963 1290732 1300380 1310303 1309974 1328160 1378611 1407388 1423183 1442075 1477615 1540874 1602143 1649287
10951 1649287 1700999 1761608 1847099 1951148 2053382 2160257 2314713 2503338 2679813 2866656
10941 2866656 3108769 3366283 3651625 3941919 4301558 4743749 5253829 5909842 6722336
10932 6722336 7863795 9392517 11441150 14251430 18013713 22842872 28529920 34590082
10924 34590082 40165387 44243940 46050734 45274328 42153992 37543152 32400160 27554592
10916 27554592 23549410 20543414 18422930 16966695 15947815 15286555 14944791 14797899
10908 14797899 14744540 14803458 14940100 15082163 15163885 15240496 15352535 15571142 15989463 16675742
10898 16675742 17675442 19096120 21018721 23558447 26875044 31185495 36749777 43681662
10890 43681662 51931726 61177727 70834920 80007960 87812340 93427096 96316986 96392718
10882 96392718 94042316 89770359 84076908 77526108 70708300 64186206 58489888 53916484
10874 53916484 50657230 48685495 47892858 48012670 48708761 49555036 50259040 50666393 50725563
10865 50725563 50570485 50319865 50128737 50085870 50107780 50077982 49930385 49690682 49422374 49539780
10855 49539780 50254457 51770187 54268571 57677276 61897501 66699451 71698637 76358345
10847 76358345 79981873 81836960 81478493 78947221 74766311 69855225 65310428 62126784
10839 62126784 61016826 62226905 65736321 71150651 77897895 85019740 91446112 96080703
10831 96080703 98216912 97811648 95301892 91589791 87687999 84313417 81765415 79954949
10823 79954949 78718268 77879022 77327170 76852906 76331970 75782946 74967267 73370227 70539536
10814 70539536 66484920 61710720 56774815 52110066 48160932 45201532 43287448 42409694
10806 42409694 42513582 43505235 45240635 47618809 50463584 53638567 56908798 60124954
10798 60124954 63324907 66264559 68658999 70212384 70656515 69786293 67726631 64836010
10790 64836010 61646181 58438127 55402700 52521708 49614574 46582983 43483016 40414727
10782 40414727 37373208 34540494 32074840 29979172 28256988 26921114 25914771 25237321
10774 25237321 24839402 24664685 24695790 24832506 25038305 25234154 25413285 25620327 26008176
10765 26008176 26817474 28351665 30956464 34762246 39804736 45683664 51736460 56960453
10757 56960453 60256309 60837882 58593552 54017023 48121425 42022087 36627929 32403915
10749 32403915 29296389 27106110 25643200 24768887 24358398 24383389 24900736 26022990 27759149
10740 27759149 30115451 33174757 36827792 40743441 44670396 48343249 51302343 53333632
10732 53333632 54553327 55263678 55575338 55645017 55635780 55440764 54757198 53497210 51799378
10723 51799378 50058438 48630508 47739433 47603730 48109436 48784851 49117118 48651700 47143822
10714 47143822 44683859 41551054 38262345 35238284 32621665 30540443 29066338 28186534
10706 28186534 27850521 28002456 28613086 29672084 31065357 32688180 34283005 35551662
10698 35551662 36309322 36568122 36442455 36193788 36016619 36071155 36352723 36708079 36959941
10689 36959941 36998510 36920521 36806515 36833377 37067616 37467533 37754385 37657010 36961482 35575268
10679 35575268 33660321 31506794 29492084 27980780 27151571 27038409 27578844 28532081 29644437
10670 29644437 30544382 31088698 31215217 31007823 30581751 30159420 29681333 28972617 27914025
10661 27914025 26374661 24320443 21934652 19485166 17283116 15515630 14141622 13041901
10653 13041901 12153852 11445260 10818999 10266932 9784166 9340625 8926582 8566697 8243739
10644 8243739 7899061 7559755 7250898 6957388 6660077 6394753 6125486 5927822 5729847
10635 5729847 5540571 5373360 5227624 5078853 4924092 4760454 4612908 4495008 4361144
10626 4361144 4241268 4151753 4063656 3967197 3874910 3773989 3691601 3585189 3497284 3409992 3303775
10615 3303775 3193146 3114114 3012438 2920640 2830432 2768074 2678316 2581232 2501290 2422545 2383555
10604 2383555 2324737 2295901 2287384 2283753 2246583 2192254 2193481 2166432 2109822 2039875 1966425 1954656
10592 1954656 1934534 1895144 1824415 1781121 1768534 1744820 1727107 1704640 1683456 1647959 1646926
10581 1646926 1650965 1642652 1667377 1673608 1689194 1749080 1787560 1796162 1777873 1775921 1735827 1689754
10569 1689754 1640201 1561732 1498564 1460900 1405443 1360560 1311660 1267127 1246687 1196957 1179605
10558 1179605 1142796 1128498 1147200 1150116 1116996 1089600 1084295 1040385 1015374 982439 956460 924231
10546 924231 912026 897296 867939 834668 785040 783131 806199 803342 794146 803778 795959 766493
10534 766493 776737 806469 807616 783469 776215 787812 793487 790377 810969 811766 825203 845573 834057
10521 834057 833707 854150 839632 840740 827731 824742 822428 861231 945805 1068400 1199342 1322367
10509 1322367 1371753 1345829 1310932 1282388 1251260 1268994 1262848 1293674 1320582 1283915 1262306
10498 1262306 1259693 1232987 1210367 1148678 1119765 1123708 1151335 1220828 1296064 1388729 1502361
10487 1502361 1571685 1603087 1570691 1478134 1346927 1211097 1136563 1077131 1034381 1020503 1021764
10476 1021764 1008448 1000047 1003010 983479 1036046 1112785 1176317 1203905 1231397 1279204 1317219 1350566
10464 1350566 1391538 1429057 1427413 1434013 1447832 1465724 1481295 1503998 1509856 1519189 1483447 1474539
10452 1474539 1481416 1482432 1492284 1522613 1562104 1571427 1558333 1532375 1515373 1487257 1426663 1378651
10440 1378651 1346246 1306768 1281508 1304984 1340984 1367228 1419987 1470645 1529222 1628744 1754870
10429 1754870 1881079 1984116 2093701 2196755 2248228 2246851 2231161 2191797 2125251 2043404 1952092
10418 1952092 1864065 1815347 1762835 1769544 1808238 1826431 1866160 1926064 1938201 1919795 1889864
10407 1889864 1850200 1823817 1790070 1771674 1771309 1781153 1788373 1801361 1844758 1874234 1911743 1937647
10395 1937647 1958195 1964521 1943040 1920737 1922355 1928888 1931022 1967663 1989907 2052989 2165481 2283282
10383 2283282 2373103 2424581 2451005 2537277 2595799 2650591 2694391 2771723 2875067 3004488 3187474
10372 3187474 3481628 3896010 4411007 4856945 5165270 5297165 5099606 4628699 4191362
10363 4191362 3915722 3769089 3719643 3751969 3768546 3823045 3913462 4020271 4154791 4313467
10353 4313467 4496336 4708524 4910212 5151245 5449377 5757755 6091128 6494327 7054124
10344 7054124 7768496 8647789 9767513 11138651 12660164 14279031 15966661 17680591
10336 17680591 19367264 21240367 23652130 26925298 31425103 37675116 46572860 59607567
10328 59607567 79113563 108722309 152637019 210575877 271157010 318621519 346477870
10321 346477870 347411735 307962411 242901843 184438867 143025426 114981773 95681893
10314 95681893 82000882 71897881 64014188 57502077 52137695 47985065 44924899 42627435
10306 42627435 40747805 39055331 37258938 35187942 33065501 31170667 29578068 28268603
10298 28268603 27166969 26185933 25244485 24334686 23439218 22573721 21695718 20826855 19921379
10289 19921379 19014761 18173121 17417772 16691237 16037842 15410390 14803556 14302991 13900147
10280 13900147 13488730 13077481 12634731 12160782 11637719 11147178 10716989 10349573 9986765
10271 9986765 9616138 9264526 8940537 8625190 8368717 8154439 7964060 7781300 7569276
10262 7569276 7347715 7122882 6911200 6706643 6495617 6314023 6169662 6030750 5894903
10253 5894903 5718719 5507137 5359879 5222758 5088648 4936421 4792407 4684364 4572013
10244 4572013 4460977 4365518 4262450 4130607 4013128 3932018 3835978 3739883 3648353 3549299
10234 3549299 3454713 3340074 3278901 3218147 3146394 3107380 3066756 3027790 2988619 2956923 2927300
10223 2927300 2883753 2802634 2710356 2592493 2449292 2312705 2209417 2140211 2067112 1978536
10213 1978536 1895171 1823016 1735443 1684680 1662128 1639946 1600716 1568356 1537090 1529752 1537951 1548679
10201 1548679 1544697 1588236 1665617 1837918 2065389 2384868 2766076 3136658 3602679 4068603
10191 4068603 4402693 4605411 4804239 4837968 4551507 4096591 3743798 3404142 2928592 2411715
10181 2411715 2059915 1806074 1622195 1522513 1409040 1346607 1291615 1239336 1243743 1213207 1195704
10170 1195704 1214864 1208004 1148707 1098254 1053332 1013961 965872 936070 930311 916546 905388 865407
10158 865407 825319 828625 859405 850654 841097 818219 781648 813350 802642 777401 763619 744740
10146 744740 712100 648171 628464 614112 558565 542650 524862 489450 430810 355717 283300
10135 283300 244126 229767 282957 362477 485443 596291 647266 682192 667807 655486 644637
10124 644637 650344 613715 605635 642829 643115 642450 653026 654672 647477 644676 645860 636593 662036 648733
10110 648733 661878 664969 671303 688542 698081 702768 685050 680717 674891 659964 652938 681047 717116
10097 717116 677643 657692 662012 663903 650111 651168 645678 633994 639884 644686 640953 672962 706034
10084 706034 732219 740353 711149 649750 654237 670681 658863 660410 682507 720504 743718 752182
10072 752182 784017 797608 788359 769620 732064 732001 761280 737700 668431 590814 561834 552902
10060 552902 535618 491943 481508 465075 463062 465833 442262 435952 422021 419490 418988 404118 402215
10047 402215 423060 447183 450932 460442 442716 417499 405655 407554 397597 396059 383913 373928 343764
10034 343764 328242 338198 376398 406377 391984 381787 372766 351388 338507 346678 340359 329627
10022 329627 306355 311248 324671 328598 333912 339068 330677 315227 307475 306118 318048 322871 314518
10009 314518 316628 329076 295419 297345 356446 365886 343700 299371 288592 290995 283967 302796
9997 302796 299452 299711 310938 318477 314870 314443 310699 306729 287310 283849 296484 313616 314259 318296
9983 318296 332374 334769 314977 302396 272738 249598 265558 311494 327571 307932 285196 295878
9971 295878 272598 246886 259567 281655 281544 270024 260801 295350 289097 306560 348648 361817
9959 361817 342351 333909 320644 347341 363091 352667 357026 349641 303958 285153 280969 277180 289320
9946 289320 333530 359968 345274 367029 380788 366017 317794 289268 314403 318813 336978 328819
9934 328819 340371 348021 339554 365627 369205 366252 373376 362050 339139 327946 330880 330928 337740 370546
9920 370546 431152 460610 455722 469920 480104 535634 602771 666484 708281 764530 895469 1079271
9908 1079271 1284166 1505089 1688866 1853059 1986890 2107939 2342748 2738230 3290796 3815743
9898 3815743 4111337 4200002 4002779 3445431 2816414 2438515 2260745 2218318 2183682 2161294
9888 2161294 2114896 1944426 1686879 1456289 1273324 1182077 1122759 1080188 1013130 954763 925294
9877 925294 933237 926030 892133 848481 806409 802561 788410 760660 715440 664674 597340 629802
9865 629802 650077 610092 569274 532104 499616 502373 487311 470234 501299 519319 558053 569323
9853 569323 557951 531816 532312 531069 520214 516678 509968 515996 548164 574236 566054 549278 584778
9840 584778 606652 595306 582185 589101 591070 564623 563851 525487 522536 520808 500789 468880 448935
9827 448935 431878 418212 379233 369712 368200 348562 366720 378512 386908 391465 410028 445412
9815 445412 462632 488002 487429 484249 483485 495504 491178 477605 471662 476436 484877 499451 529272
9802 529272 550192 548085 527243 536098 538963 552642 560114 596598 627296 649066 690725 714905
9790 714905 687253 622195 575165 538260 523318 500251 485089 497831 518598 520620 529743 536454
9778 536454 523236 480743 479035 509707 503644 475559 431310 400044 388285 401606 368237 357718
9766 357718 379699 408457 418342 406419 416923 412566 371034 359848 376135 386821 369342 354718
9754 354718 350685 348329 355423 327663 296908 272657 276564 302075 330215 324202 297364 306686 318674
9741 318674 309384 305117 320980 328165 312061 303739 295464 274433 280073 300964 288221 271658 284699
9728 284699 313996 303937 303974 284972 304069 330489 390939 416256 393697 384739 360874 363249 341269
9715 341269 326198 315957 312764 326074 346479 360929 378397 377481 354579 349826 343911 341887 354882
9702 354882 376081 403602 395587 366098 360521 345175 328280 333180 335320 325255 346175 370505
9690 370505 368243 394029 384669 381345 359573 338030 333535 357243 382900 412073 416918 415520 437698
9677 437698 487061 531362 578743 600604 635590 729195 847692 1015669 1281252 1587741 1908003
9666 1908003 2223217 2586693 2858482 3006562 3150646 3279803 3127129 2748705 2481453 2269040
9656 2269040 2024923 1663878 1370436 1198476 1120448 1025765 934971 871826 834279 790218 748450
9645 748450 719590 685334 643093 621153 628436 653456 673567 664412 664216 681488 683744 703068 679576
9632 679576 658164 665282 664299 655162 657296 631302 624349 680897 699390 690994 689270 695459 672848
9619 672848 649036 616668 612700 603112 596200 614095 627076 596975 557037 558584 569000 563907 569483
9606 569483 582715 612144 617573 570975 563638 593490 616130 653408 642851 623214 596318 603923
9594 603923 625215 627816 657653 668848 657752 608257 621036 660367 655057 669976 670732 658363
9582 658363 640206 646853 662496 675621 702251 737336 744509 710640 685181 661069 673042 692086
9570 692086 703422 702138 714661 722906 722263 750325 743797 735255 771575 796233 813511 800783 776870
9557 776870 761997 767357 809128 842638 854325 874835 902742 924524 965934 1002643 1036332 1058047
9545 1058047 1099918 1145621 1172941 1238849 1315804 1430142 1556493 1660287 1790755 1969105
9535 1969105 2135050 2331521 2580607 2921516 3346894 3917846 4689960 5748318 7136541
9526 7136541 8820898 10591689 12234951 13410506 13885265 13578931 12551954 11086388 9650702
9517 9650702 8444874 7570564 6970467 6620656 6477255 6492810 6617371 6790401 6992153 7142919
9507 7142919 7220595 7212605 7175248 7103958 7018956 6980901 7056672 7335032 7834838 8565265 9563572
9496 9563572 10891184 12435926 14150186 16009549 17957531 19930618 21966793 24163044
9488 24163044 26505894 28799678 30878627 32603534 33741918 34091121 33617705 32455528
9480 32455528 30894630 29111767 27006392 24681438 22437679 20488423 18851988 17539344
9472 17539344 16536723 15758844 15182261 14806529 14666218 14784979 15170141 15772421 16559550
9463 16559550 17561470 18769611 20052695 21277602 22278454 22972990 23308324 23376409 23649491
9454 23649491 24682341 26815667 30119123 34504054 39542963 44454974 48393174 50501433
9446 50501433 50275553 47926031 44106585 39759244 35784569 32724048 30585007 29106828
9438 29106828 28041820 27074942 25901764 24582033 23204615 21888802 20662460 19461981
9430 19461981 18372028 17454090 16738648 16278986 16069980 16127608 16445909 17045569 17929729
9421 17929729 19043351 20353777 21780965 23190767 24492207 25596919 26548047 27369948
9413 27369948 28153782 29088981 30172675 31238701 31972081 32130635 31651644 30605028 29161262
9404 29161262 27347566 25238147 23089665 21063624 19150053 17308986 15672040 14329865
9396 14329865 13289778 12461963 11849709 11425892 11145756 10958797 10843861 10715194 10517978
9387 10517978 10285572 9985358 9674385 9364310 9067406 8828625 8712991 8713870 8873515 9235457
9377 9235457 9847419 10729947 11854067 13022405 14008105 14611176 14623715 13971456 12799766
9368 12799766 11342411 9926254 8718298 7747823 7013174 6435402 5995005 5638280 5328371
9359 5328371 5092629 4903481 4738133 4539844 4350206 4205364 4082607 3957856 3797341 3666592
9349 3666592 3531761 3424746 3261409 3131822 3032469 2950626 2869829 2783570 2735288 2680339 2611753
9338 2611753 2535858 2487984 2420687 2367743 2349736 2299055 2259335 2210106 2183229 2162962 2146840
9327 2146840 2086140 2028021 1992393 1949097 1889178 1825850 1781894 1763531 1746821 1739105 1728524 1705838
9315 1705838 1662231 1636981 1640379 1620953 1567388 1543884 1507778 1440653 1415220 1418414 1432553 1397236
9303 1397236 1345394 1321939 1312997 1312334 1311700 1301093 1282460 1261886 1251578 1251337 1275638 1255226 1244252
9290 1244252 1234126 1211489 1197744 1151375 1152653 1152795 1138572 1138492 1164849 1180435 1182683 1174490 1168556
9277 1168556 1173651 1176861 1172599 1178265 1189312 1194629 1213764 1188360 1147745 1084135 1073198 1111651
9265 1111651 1111548 1095749 1093143 1102268 1097775 1103410 1119256 1168536 1184408 1176009 1193792 1222440 1237487
9252 1237487 1228454 1202817 1158251 1148288 1196544 1201526 1176273 1153407 1136118 1130594 1157298 1159450
9240 1159450 1142192 1150608 1161497 1136805 1131669 1148835 1156948 1156089 1152559 1160752 1148940 1110511 1100649
9227 1100649 1118695 1104706 1105211 1113392 1130921 1129484 1136392 1152754 1131967 1144164 1180018 1183719 1153948
9214 1153948 1143981 1126202 1110938 1117220 1127060 1183055 1225424 1203993 1186177 1193923 1182609 1159473
9202 1159473 1182930 1224795 1232834 1238328 1251198 1235731 1230267 1258745 1277497 1289437 1259198 1240951
9190 1240951 1268164 1286096 1289701 1281139 1254996 1247883 1230916 1219692 1237732 1251700 1242148 1258342
9178 1258342 1271521 1270715 1284302 1282787 1285085 1283242 1283740 1295955 1330890 1333474 1329145 1310734 1336180
9165 1336180 1325808 1310194 1356767 1376248 1382171 1386227 1405228 1409146 1399318 1402142 1397375 1386020 1391928
9152 1391928 1414945 1441372 1466438 1459507 1467998 1471484 1495941 1500733 1496541 1475378 1480255 1465884 1463400
9139 1463400 1486822 1488451 1496130 1488802 1509320 1516283 1515887 1533087 1553898 1588052 1592148 1602763 1614209
9126 1614209 1645016 1650836 1662747 1673950 1680108 1703185 1718162 1707628 1712905 1695275 1672388 1681562
9114 1681562 1688644 1710103 1738222 1766736 1807184 1817115 1832918 1873686 1892596 1854253 1817881 1814512
9102 1814512 1864509 1889126 1900290 1920966 1953482 1987348 1991834 1967659 1993803 2007927 2037465 2074141
9090 2074141 2098103 2153948 2192311 2189790 2230686 2246281 2235533 2224817 2211991 2215568 2241058 2291765
9078 2291765 2302325 2284507 2266888 2270042 2306591 2295501 2287994 2314609 2309283 2333521 2365791 2382479
9066 2382479 2392248 2387133 2402327 2441809 2475784 2482608 2515441 2548253 2585085 2603721 2628116 2652390
9054 2652390 2684150 2717257 2729699 2785240 2861427 2897105 2911503 2911092 2928139 2946840 2951314 2944188
9042 2944188 2935790 2944614 2994913 3022410 3008467 3014107 3006043 3029873 3067086 3071204 3093042 3143339
9030 3143339 3155456 3171751 3205989 3212280 3223311 3237853 3247272 3281537 3324119 3350813 3407296 3471603
9018 3471603 3548748 3570288 3583704 3599520 3620034 3616237 3626465 3655225 3724745 3779482 3795966 3816884
9006 3816884 3852998 3903859 3939693 3978341 4002931 3981688 3990038 4047004 4086594 4118238 4160544 4176888
8994 4176888 4207976 4218811 4268695 4306380 4331553 4378571 4434229 4460739 4487534 4570318 4613710
8983 4613710 4633188 4672659 4713997 4739151 4783445 4833730 4900903 4970308 5051276 5094325 5140118
8972 5140118 5219525 5253224 5265794 5299497 5338702 5382850 5443137 5497972 5518349 5550647 5588117
8961 5588117 5643654 5710566 5783018 5850426 5912574 5957935 6034013 6084616 6101843 6186327 6255113
8950 6255113 6329930 6379498 6431079 6490317 6557876 6604293 6646465 6721665 6777743 6829265 6908648
8939 6908648 6991104 7076458 7171998 7261955 7314741 7371650 7422389 7485472 7551366 7640820 7711770
8928 7711770 7794827 7884946 7958206 8041541 8111833 8186462 8272863 8376895 8480083 8568547 8624843
8917 8624843 8699100 8777469 8873536 8971392 9054568 9138373 9206627 9280440 9361949 9441390 9525199
8906 9525199 9615214 9677447 9750178 9826091 9898611 9969816 10071371 10206216 10284216 10356144 10455867
8895 10455867 10548916 10630076 10707695 10772184 10873189 10973245 11069672 11171081 11237956 11345146
8885 11345146 11437364 11542429 11607150 11683687 11777426 11884924 11990379 12095250 12226815 12398540
8875 12398540 12582749 12780928 13028771 13313768 13596724 13889067 14155886 14480463 14918111
8866 14918111 15543013 16485269 17937869 20260719 23924094 29154901 34795423 39135315
8858 39135315 41800654 42270534 38382206 31822729 26478377 22986533 20749765 19262196
8850 19262196 18228139 17526808 17012579 16593491 16234841 15938927 15691493 15441681 15200642
8841 15200642 14991461 14801490 14601350 14351520 14140811 13970523 13793371 13622893 13462775
8832 13462775 13303033 13174050 13055161 12929612 12819004 12719262 12626936 12540053 12427838 12315641
8822 12315641 12204912 12099520 11993101 11894450 11785726 11679455 11607046 11520541 11401860 11269820
8812 11269820 11174620 11096296 10983000 10870316 10769732 10683507 10568531 10474137 10388125 10285277
8802 10285277 10185553 10079652 9976179 9882640 9811139 9728842 9616687 9527606 9435654 9313831
8792 9313831 9209939 9115052 9019816 8931185 8861853 8777972 8712653 8636628 8516366 8419894 8310716
8781 8310716 8217965 8118606 8019524 7936242 7875585 7818524 7724600 7598207 7528966 7510388 7453413
8770 7453413 7344107 7268285 7204262 7122679 6998230 6897858 6866308 6800641 6735526 6677367 6650797
8759 6650797 6582413 6471401 6404879 6333933 6267704 6183638 6138010 6056665 5974644 5914293 5840587
8748 5840587 5757252 5691960 5650888 5595980 5552843 5498272 5440980 5397829 5342088 5260552 5195972
8737 5195972 5147367 5066865 5018382 4983190 4940214 4885731 4821180 4765304 4702543 4646007 4575320
8726 4575320 4519549 4478877 4435608 4398208 4349875 4285508 4231066 4191240 4145849 4124495 4083873
8715 4083873 4038045 4020939 3991910 3973543 3950440 3882287 3815341 3777521 3766631 3718335 3665419
8704 3665419 3640446 3625917 3586892 3560237 3524511 3452519 3443556 3414001 3416837 3396018 3378002 3342504
8692 3342504 3311652 3290947 3264047 3223670 3169601 3135806 3111539 3078953 3050430 3029297 2992309
8681 2992309 2957580 2927489 2875911 2839563 2834359 2820315 2807045 2759112 2718796 2672885 2649233 2648149
8669 2648149 2610744 2600428 2578350 2580030 2580538 2576063 2566582 2535470 2513910 2481864 2471888 2433215 2405428
8656 2405428 2398509 2371010 2392730 2364573 2368593 2359649 2299755 2288213 2285994 2280398 2224658 2211274
8644 2211274 2185183 2176951 2166960 2134509 2106576 2094231 2095136 2058973 2044958 2062044 2054021 2038226
8632 2038226 2022433 2024466 2004173 1963591 1930528 1950383 1969886 1930281 1871756 1864812 1832126 1801513
8620 1801513 1793622 1806484 1807634 1804104 1787559 1762921 1756362 1722976 1723881 1743511 1737046 1689635 1651435
8607 1651435 1656168 1647403 1602856 1603006 1602416 1612823 1604509 1600435 1588916 1574789 1590280 1581298 1549674
8594 1549674 1567086 1559389 1575296 1591860 1570975 1559028 1570468 1578422 1575543 1524261 1507236 1509541
8582 1509541 1526496 1531274 1562229 1597870 1608588 1564867 1538873 1528139 1485355 1440616 1433486 1400209
8570 1400209 1337101 1303188 1288626 1282412 1246386 1235405 1222811 1245189 1251538 1245476 1249563 1215543
8558 1215543 1208413 1203974 1199420 1170341 1137416 1135552 1145064 1162284 1182281 1164190 1147846 1143951 1146601
8545 1146601 1113750 1121550 1144186 1144004 1115611 1095557 1101283 1112412 1067771 1006454 1028757 1067094
8533 1067094 1096565 1110239 1096611 1083203 1064383 1062807 1063986 1056147 1041343 1043873 1044014 1025749 1012346
8520 1012346 1005972 1047982 1104324 1154491 1142419 1139272 1120260 1082617 1034882 1024278 1007040 965410
8508 965410 954624 942023 935398 924688 899917 887524 868055 856722 860806 855472 839414 835480
8496 835480 851675 850197 861130 855311 833302 814772 778762 766633 776082 754670 750627 761236
8484 761236 775528 782082 771530 767032 750652 743432 737904 736646 741670 712455 719752 711164 721847
8471 721847 746327 755831 755656 724466 738345 762663 737123 721083 762089 786339 786943 789129 773447
8458 773447 792135 825250 829366 774854 733260 714723 687893 674198 682819 679905 668682 673707
8446 673707 675528 664581 655587 669761 668068 674664 696486 707351 717797 742719 803337 904038
8434 904038 987212 1059296 1133195 1174934 1136374 1030927 904661 807898 765015 734414 714916
8423 714916 694332 664860 671609 687830 654161 633605 632344 617602 597896 617072 620490 576985
8411 576985 594906 636540 597312 582511 560222 586474 592411 595869 594107 602801 626070 619128 644099
8398 644099 671798 686598 668003 677978 718898 764137 816752 927007 1087542 1278735 1424386
8387 1424386 1530947 1594986 1554664 1350138 1141069 988441 876459 815850 739421 670527
8377 670527 646872 632951 616480 626267 641262 606158 589315 599303 609770 594629 591086 560769
8365 560769 537575 540093 539389 562835 574727 584132 548320 512680 501746 494427 487045 506696 550450
8352 550450 541873 548423 597189 660218 696907 770332 810714 849046 892171 956619 1004106 1034565
8340 1034565 1064802 1081591 1019900 938981 856426 806905 750229 703584 656676 601561 581990
8329 581990 562810 539354 566086 581087 589592 581242 601474 583365 566387 565295 570639 533683
8317 533683 494330 464792 451995 469127 484036 508368 555094 576075 595507 579961 561509 545182
8305 545182 540482 534792 524570 527645 518470 522102 509427 509606 527785 556184 606409 696618 809356
8292 809356 889205 906958 884431 842781 748788 661325 593698 529490 515957 489622 495656 505477
8280 505477 489955 484555 463066 433612 413336 414684 413117 396139 377140 345881 331328 353282
8268 353282 351648 324258 341488 342300 345968 378335 415828 468884 500630 491886 500422 499770 490275
8255 490275 467072 432738 448794 457034 458799 489337 538197 567910 585987 599223 607364 587651
8243 587651 584557 556276 525073 496141 465340 430317 396993 375765 361247 357691 330355 315210
8231 315210 336405 345784 304628 304657 297741 309800 320300 338555 366487 344415 329228 318430 330328
8218 330328 345995 335596 355479 343464 343662 369469 345542 344599 380467 374218 326600 284627 294785
8205 294785 311030 324878 316263 295714 311292 323021 313524 311067 282370 286309 322324 339255
8193 339255 323300 317404 294084 279641 292279 300312 299515 253446 245486 257754 255420 296314 299069
8180 299069 287707 302131 271682 244066 247956 234738 245300 249323 241916 239943 258813 280883
8168 280883 263663 245148 256036 236864 215382 230393 233601 239711 206900 246704 306782 291613
8156 291613 271072 281949 280485 260603 254775 246307 222179 201667 213170 208035 210487 236805 222359
8143 222359 208225 213716 190801 195387 193317 189006 202178 216815 206502 205532 172488 147627 173366
8130 173366 213526 256821 255746 246017 229995 227558 210795 201143 205942 200995 200249 197399 208455
8117 208455 198333 180506 169935 175528 194990 195231 211020 222450 206833 192769 157399 170499
8105 170499 173139 139939 127221 133545 160487 174893 173547 151999 135623 120930 116180 133159
8093 133159 154389 158287 158795 173888 180182 164672 133226 133954 144813 153451 136934 158526 160482
8080 160482 163298 164608 172953 196966 207248 218112 216554 198517 187884 166083 137690 137253 178237
8067 178237 192385 184363 186778 167116 147151 176174 180977 152724 146610 140015 136763 155499 162081
8054 162081 167743 183264 187104 192269 166792 142344 149784 178838 205653 211717 200709 179430 186882
8041 186882 192774 198559 201023 195278 190989 166603 125794 113294 121119 156980 183712 187194 208767
8028 208767 225587 197791 183134 159912 164378 193020 201141 201548 211895 193470 179221 188199 195171
8015 195171 186554 199616 195074 203492 221487 193375 186668 146700 134752 158444 197560 213993
8003 213993 232884 236541 209114 225958 230648 221659 206507 198071 177915 166818 186774 179043 187900
7990 187900 184917 171301 175438 200955 225472 208136 202001 195457 208953 218818 207240 210276 204232
7977 204232 198474 174343 149924 167596 198412 204013 193979 207197 212043 174472 175170 167864 158025
7964 158025 173399 153301 143111 152433 170576 175344 173969 194005 203321 203442 184702 166598 157189
7951 157189 159168 154088 180224 201524 195993 200020 174540 179897 189633 187610 185841 171737 180968
7938 180968 210865 208940 215223 195595 152390 137924 167720 172062 164411 151652 156514 157439 150990
7925 150990 134210 143020 137736 124377 135635 148178 137192 129767 129749 104432 106302 119785 134799
7912 134799 135201 145179 132566 126614 123395 161222 167916 163964 169741 176159 147423 160502 183976
7899 183976 158915 147612 161180 146636 121546 124506 128222 117383 122283 110148 115493 113534 126935
7886 126935 128230 131863 122053 126038 123785 141528 153037 126185 103229 96555 107860 110713 83175
7873 83175 69562 72022 89299 121978 136557 125948 123558 122718 135885 127966 127896 125107 124765 107184
7859 107184 95911 97756 89606 73749 90379 93487 94438 92843 92233 57195 39537 65625 100677
7846 100677 101293 95166 115664 136644 154363 164603 152596 164588 175439 147240 141399 126697
7834 126697 122105 141282 152730 163571 149839 120030 105027 102260 123858 119039 127832 140262
7822 140262 123065 102717 96385 115534 102909 67840 49951 44318 65788 101853 127751 96167
7810 96167 79045 58715 60634 59198 79004 86696 93679 80276 61060 40657 58368 84135 81091
7797 81091 76422 74314 66534 83848 87445 96695 82950 77152 72752 64318 60453 45000 31471 46292
7783 46292 47739 59201 36747 46831 75223 64217 45628 44930 59970 84484 73814 52007
7771 52007 53993 71130 98646 115211 84965 76606 95729 123696 110419 90040 62682 37728
7759 37728 49374 59052 63354 77809 76954 62631 68118 65646 75653 90742 90053 46143 52079 78594
7745 78594 70233 67795 92115 83740 62677 26498 35787 54776 84813 74166 85551 104726 83667
7732 83667 73791 75216 71066 57420 53329 55339 66665 84096 69134 54285 95247 106244 91296
7719 91296 76127 67529 66233 61990 28315 31683 26010 -7430 3606 52878 68394 53602 51958
7706 51958 51231 79874 85232 80231 75801 55531 79606 127772 126294 95186 88200 90402 62766
7693 62766 45181 50994 62098 68450 54257 40808 35794 40751 48591 86873 75240 50544 69947
7680 69947 72061 37292 3052 6119 38244 57425 78333 68243 58314 56067 61950 41916 65804
7667 65804 62969 29627 44301 52999 30471 40470 45899 9467 -5758 -8771 20777 42226 22400
7654 22400 6936 -14603 2551 35145 70163 50646 27912 42088 83535 108939 123044 99955
7642 99955 66444 70861 75112 77684 77565 62065 41977 48975 58533 85141 99650 117669 106360
7629 106360 61515 53381 81286 96722 107588 81764 48196 41494 64171 64862 60374 71049 45062
7616 45062 42260 46763 60237 60938 57907 55487 74339 67502 66897 69706 68758 52792 78184 112532
7602 112532 104835 92296 67038 49744 49591 67071 57049 58744 54073 71113 57031 33908 11114
7589 11114 31455 58661 53607 46322 55816 67926 76817 48345 44600 50472 72011 67641 29149
7576 29149 40869 46541 52352 47209 82532 93155 92661 68310 33715 40894 52045 37914 25109
7563 25109 37457 51719 46956 52431 35247 37369 25847 13208 20125 36900 35352 38587 44152
7550 44152 49052 51042 20092 34036 39888 64723 97699 81299 64307 38107 46413 54799 66468
7537 66468 84048 88382 74906 58099 40500 26748 64091 86796 66058 44122 30134 49493
7525 49493 46024 44009 44776 43596 65306 59444 67076 44127 32940 20912 10364 39000 49612
7512 49612 46749 45783 50686 49345 51681 28627 28886 33498 17004 6646 10651 512 -5480 -45
7498 -45 23882 16929 5431 18462 28303 37287 54902 44047 41294 67680 66513 57651 42011 39701
7484 39701 51167 40853 10030 37323 33921 5273 1761 26288 15850 6299 13852 -11439 -9707
7471 -9707 6826 27312 29885 33522 31050 17686 394 6026 682 14112 19707 33941 41825
7458 41825 40777 34625 48175 78882 76009 62590 51844 11444 27754 33533 36900 18056 19935
7445 19935 -11119 -4270 24239 21974 4606 25612 37321 29457 49143 56061 29735 25914 26978
7432 26978 12231 13014 26504 17075 32572 51438 47189 43035 42565 31951 35783 39587 25673 -6580
7418 -6580 -10806 -40470 -49864 -17956 -28432 -45261 -19911 17940 41319 49872 39198 25713 -346
7405 -346 17282 49589 61719 41794 19219 24999 49885 61607 47718 14199 22934 7638 -17421
7392 -17421 -20616 3943 35706 42505 59579 36137 20111 20110 33200 24657 13273 1814 -5428
7379 -5428 -2458 33846 40017 1750 32897 51452 61933 74224 51572 30776 18091 55087
7367 55087 75001 81923 41723 19645 20570 9825 8149 11868 31657 62344 41859 38469 67686
7354 67686 65619 81829 68069 41575 27370 19389 13658 2736 -8055 15069 21926 -2219 -19630
7341 -19630 18668 59486 47890 43928 20296 13142 35163 40226 21730 8152 489 1676 6451
7328 6451 37658 51789 71212 91172 35997 11218 32025 23141 10042 34620 43860 26239
7316 26239 38708 34754 53512 48250 16528 1941 665 2747 31871 65080 66217 67004 35242
7303 35242 7710 37859 51392 36968 56506 64534 60791 55178 67490 59946 44203 45764 27729
7290 27729 9611 5506 18062 19501 9660 -636 -4809 -3707 -9314 -14716 12407 12077 23018 40596
7276 40596 41395 50943 43268 40477 51254 27267 47381 42305 40236 18289 3874 6162 6250 28522
7262 28522 44120 43508 47413 27034 -3593 -7036 21416 55475 74072 64056 70449 57696 46483
7249 46483 37246 45435 43597 32411 10441 29386 61605 53219 69434 73715 54208 27517 20307
7236 20307 23268 42532 40799 33073 37084 32376 40684 18489 8786 43189 66252 64072 63245 55329
7222 55329 24075 11067 7531 17163 29033 36887 50545 40257 34499 18668 18414 8941 -30445
7209 -30445 -27600 -3371 15195 49441 31535 2951 1260 916 -4916 12041 7905 -21914 -15242
7196 -15242 19166 48451 85635 82141 58232 54697 35264 38711 53153 52195 38674 50833 69376
7183 69376 92236 54401 52279 43460 46313 16360 -1410 8562 20980 48060 73749 22835 6230
7170 6230 19193 17631 4994 10435 13928 12922 34095 55852 52968 49885 31301 26784 29165 44388
7156 44388 39405 -2875 -12665 6401 10623 27812 30488 33428 37408 44408 43095 34920 60947 53517
7142 53517 30355 32548 36180 42349 48883 38969 39449 12246 738 33533 66949 73853 38217
7129 38217 5592 14532 31615 43837 34312 46078 48071 30499 54472 51856 44503 25771 24519
7116 24519 26034 19647 9275 9344 22014 36389 36855 45985 63251 53916 55540 33514 21888 23923
7102 23923 27766 37657 26506 7215 22661 53713 57533 55707 78755 78982 66904 44372 9853
7089 9853 -5839 10448 5180 3204 15612 13571 17804 11618 12086 14521 36367 47929 53181 42185
7075 42185 50337 26539 4333 18103 29616 2188 -9114 -617 -7671 20081 16727 -12643 -11526
7062 -11526 -3441 540 8108 -7866 21929 20907 2274 3128 8315 49 -31179 -49421 -19366
7049 -19366 -21739 -23908 -4956 31671 37798 12419 12751 18548 23814 36618 32892 22124 -13226
7036 -13226 -9849 -3849 -8804 -18756 -30076 -20779 -13630 -13138 8637 11970 21402 21971 30585 12003
7022 12003 18061 31933 61328 49051 -3267 -11219 10557 111 -3526 -11309 6812 -5077 -22715
7009 -22715 -16197 19805 46670 59581 77068 69666 24570 23372 32856 35916 28839 -24520 -7167
6996 -7167 18365 14310 1367 32816 68051 33060 -9466 -3926 -4570 -6871 17331 25773 6944
6983 6944 1718 9316 11196 -5468 -7332 8547 -6909 -955 -10083 -16293 -6861 6952 -28093 -29155
6969 -29155 5505 37100 37822 53577 45055 11733 13164 7011 -2095 -2434 26428 14679 -21995
6956 -21995 -27065 -41952 -24968 -13463 2587 15740 18240 11474 -8243 2657 -19159 22885
6944 22885 40236 15318 -9124 -13333 -12679 10879 17979 20103 17682 8991 -2514 15688 27672
6931 27672 19784 21362 6300 -8966 -16440 -25675 -15451 1912 8390 2191 -11578 -18751 1699
6918 1699 8081 1632 3964 25373 34139 51627 60301 67103 73542 61797 36585 27367 -55 -4443
6904 -4443 23072 28947 940 4284 9087 18730 3847 -12378 -8034 -11106 5567 8399 17686 20591
6890 20591 -1706 23423 30530 16994 -1518 6464 31690 46893 47280 21240 -976 -16575 557
6877 557 8477 28316 28824 29715 23109 40441 32810 43577 41595 58280 80115 53428 -9967 -19125
6863 -19125 -5307 6218 3453 6218 11135 16413 11732 9559 -7147 -9149 -6659 3580 -4439 12494
6849 12494 17523 17807 28667 31077 4054 -1429 5487 3457 -24899 -33221 -38160 -22687 -8625 -15381
6835 -15381 -20878 -15285 -3453 5583 11738 32247 39010 35118 17448 23140 26595 39037 43758 29561
6821 29561 25475 21160 20599 36881 28061 15244 12216 -1332 -13663 -20476 -18870 -1311 3649 7838
6807 7838 16558 170 13334 36225 46046 4802 -2797 12030 4107 -1416 1633 4195 20434
6794 20434 38833 29745 15073 -7420 -8131 -11742 -16590 -490 -29847 -25885 -1834 4340 8386
6781 8386 -13933 -36495 -31615 -17529 -17232 -17231 -21979 -36350 -61478 -79901 -66933 -58749 -67464 -36348
6767 -36348 17707 27200 17034 24433 13433 -22220 -28162 -1957 25707 2355 -26600 -12808
6755 -12808 11606 3028 15796 12604 4012 7513 28723 9305 -9535 11503 18410 18461 10086 6697
6741 6697 31884 5762 -34025 -49858 -20512 -8240 -12469 -17293 -46773 -47554 -36748 -3765 14811
6728 14811 7126 -4198 -500 24315 -8961 -3682 -558 20073 22848 30063 17046 15536 29626
6715 29626 42389 50765 32889 -9752 -43060 -15046 22811 9019 -18825 -20117 -14488 22318
6703 22318 30968 11425 -17187 -5699 8649 1000 1738 -4292 7651 4976 18783 -10973 2386
6690 2386 -2338 7845 30506 22414 22529 27685 34790 47030 37069 53887 60498 60245 66215 70255
6676 70255 47551 18679 11095 -2294 442 15953 18009 -12401 -5821 9313 27734 19854 -10109
6663 -10109 6608 4291 -16501 -17557 17788 21226 23214 34132 33495 29777 25403 22944 18419 26457
6649 26457 36099 25739 -6551 3214 30735 13575 4669 17412 1232 6733 2212 -16159 -33701
6636 -33701 -48347 -30845 -1696 5438 -4095 22480 3587 -30607 680 22548 -5251 -30051
6624 -30051 -58111 -34417 -20071 -4374 -1288 -3623 -15954 -23793 -8451 19073 7830 28817
6612 28817 19341 -10201 -28901 -12006 11763 26607 34601 13406 -4426 18608 3310 -2586
6600 -2586 18486 16374 34124 23667 24226 24572 -7223 7886 16329 33442 31767 23303 13377 18909
6586 18909 2750 -8668 10741 20735 23398 16329 -11317 -12418 -9509 -18075 -10792 -15552 -40908
6573 -40908 -38615 -24272 -45172 -68767 -40582 -36040 -48632 -39795 -19284 11665 -5780 -10428 15680
6560 15680 11627 -6765 -9612 -31120 -38863 -23635 -3789 -4830 13683 39338 42684 41392 36983
6547 36983 34108 14123 8158 19466 30188 43951 58283 30397 20548 27846 -1540 -7250 -2602
6534 -2602 25489 23958 -823 -2679 -5639 -21786 -10369 -1952 14992 13109 23020 37371 40179
6521 40179 32919 7573 -1146 26699 25426 11895 -7596 26888 35777 14966 -11257 10190 39660
6508 39660 18282 -2557 -16478 -14750 -6267 18081 39787 33707 14681 815 -19046 -27356 -25045
6495 -25045 -18507 -16021 3942 17737 36755 70583 55170 31387 -3072 9366 26311 32161
6483 32161 50026 32814 42769 49331 7354 -27535 -36233 -24585 -13946 -15103 -13677 12750 8393
6470 8393 -1387 21678 37150 50767 88264 70804 38940 10439 26024 32328 39454 26353 10385
6457 10385 13361 20690 10780 -14144 -41909 -44012 -29790 -16904 6496 19446 12612 4619 -16807
6444 -16807 -39460 -16750 13885 11355 1942 14955 17864 11949 13000 35962 47193 60423 69126
6431 69126 73615 78071 80016 69967 37844 15514 35551 32990 48516 60025 42776 25015 4382
6418 4382 -14804 -11820 -2261 30258 22267 1679 16502 9604 -16488 -26232 -45998 -35847 -44007
6405 -44007 -24588 -24962 -25649 -27977 -16238 9203 11818 -10575 -23475 -2908 25890 28325 -9168
6392 -9168 12067 21652 1053 12151 14287 -7134 1021 27272 45810 37861 22397 12813 -6289
6379 -6289 -18278 11107 32336 38334 42788 33378 -17484 -23370 -8964 -1581 19846 6301 7369
6366 7369 3755 -3067 -2937 -1650 -5916 9944 13127 25404 26753 34915 27085 4034 -1578 -9174
6352 -9174 -16587 2840 19683 14260 5038 -1740 -22705 -30313 -29482 -7322 -9886 -19305 -17607 -8576
6338 -8576 7497 28799 35131 16673 2345 549 8875 -7920 13052 17056 12639 18050 19444
6325 19444 21409 15161 20925 39203 25179 7269 13824 18775 17196 25033 33886 49590 35543
6312 35543 34401 37309 11274 9872 6788 19361 59483 51447 43403 49912 50975 24718 19981 14160
6298 14160 10009 -4892 -7225 -8969 3179 12766 682 -41788 -34045 -6711 -4482 -33367 -30353
6285 -30353 -59016 -76025 -57360 -30619 4360 32557 39359 23070 -6089 8230 30789 32932
6273 32932 39768 41250 24080 35346 43613 40081 36552 11860 15756 14604 22565 24252 2036 -5060
6259 -5060 11683 36495 24628 35009 56042 45073 24875 -1694 -2844 -7796 -19735 -3532
6247 -3532 27162 36377 23070 13936 10307 38567 28423 6242 11108 5958 -4162 4583 26135
6234 26135 17518 4839 -3578 14815 19926 21808 45724 56749 73438 58222 60365 46450 21468
6221 21468 21741 9858 12412 15274 -6072 -20568 -14896 2254 -2985 -24883 -4743 -11522 -26747
6208 -26747 772 21395 -2512 -23756 8149 8747 -313 8296 3727 50098 78098 87121 87146 65229
6194 65229 48231 40397 31077 17401 22491 49308 66943 81114 110652 49534 61 9508 20020
6181 20020 -381 9283 783 21547 26651 19623 46088 42066 23645 -1307 12515 27306 16294
6168 16294 39808 66869 52650 32950 7346 13459 32336 25836 27063 37853 37592 19090 15645
6155 15645 10672 9618 24660 9751 -3226 26383 26460 17729 15698 34470 24714 7359 -21104
6142 -21104 -36966 -15108 -28320 -38844 -43614 -37963 -21337 23190 36073 5164 -2622 -3912 11686
6129 11686 13140 23039 15634 27509 11745 17288 14853 22437 12581 8396 -1575 -8953 -32720 -19210
6115 -19210 -30844 -37748 -44431 -33682 -4621 14729 26342 16444 9419 23715 34835 5456 4411
6102 4411 -8848 -29719 -21315 -25741 -25025 -38700 -45241 -21124 -19861 -47716 -28273 -27756 -46257 -54259
6088 -54259 -36255 -937 1266 -14431 -32385 -30893 -11633 29241 41863 73250 67602 63694 32135
6075 32135 -2712 -44171 -18361 -1907 1483 -2972 11018 11206 4618 10936 5101 -9420 -3567
6062 -3567 -14707 -30039 -28012 -44361 -71153 -40023 -5331 20352 5693 -4697 2804 1894 -14801
6049 -14801 -12548 -19506 -6286 6609 15543 -5610 -28052 -2855 -741 18045 24744 512 -23974
6036 -23974 -48713 -64691 -61456 -41279 -27149 -32886 -23172 -9139 -7704 16531 25491 -1877 -779
6023 -779 26774 42213 31894 35569 30270 2695 -19424 -20950 688 13310 896 8366 18986
6010 18986 13724 15495 11192 -4141 -5384 6703 6403 2821 18982 30202 12104 -2644 -27113
5997 -27113 -21920 -17506 3582 -8241 -29474 -15456 -2386 -9161 -10145 -18515 10611 67972 91228
5984 91228 40465 8112 -40295 -50073 -3174 -15224 -38480 -25937 -6275 -14431 -22503 -55022
5972 -55022 -66410 -44095 -4403 27212 32509 29234 18813 22145 -2480 -36999 -41228 -67719 -70699
5959 -70699 -60142 -55984 -49081 -44009 -34351 -27065 -14239 -38290 -79219 -95028 -75431 -24379 -33751
5946 -33751 -49565 -60691 -80164 -70984 -49200 -21299 -9930 -14727 -50371 -61668 -48186 -15889
5934 -15889 -17010 -40459 -38493 -37883 -5020 13616 -8881 -23082 -17290 3752 372 5905 7558
5921 7558 5781 22734 33675 6233 -622 3770 -1608 3426 -21368 -36279 -53378 -52121 -29825
5908 -29825 -26840 -48522 -58333 -34740 -44394 -48534 -39263 -55101 -27328 -8372 -939 12131 15708
5895 15708 28591 23515 17510 23037 1844 -18269 -23520 -19410 -7904 -9534 -17384 -27973 -40651
5882 -40651 -49373 -30904 -36207 -26009 -5546 10336 2288 -1308 -18485 -40679 -51143 -54558 -35053
5869 -35053 -15050 -8213 -1524 -24889 -31704 -14723 9412 17757 212 5746 -17914 -57124 -43208
5856 -43208 -59213 -37330 -8628 -3440 -13501 -4824 11223 -3454 -12253 -4355 9100 11129 12482
5843 12482 -10809 -40742 -33198 -26759 -27777 -32635 -5301 -21019 -22640 -12026 -15435 -1709 18269
5830 18269 3776 -3893 -41554 -46089 -51598 -54154 -43764 -17905 2862 12370 20442 22890 17145
5817 17145 9229 -6008 -14493 5609 2625 -23148 -9787 -8640 -19988 -21652 -50211 -18317 -14393
5804 -14393 3793 17786 6363 -17322 -52706 -41823 -44726 -56318 -39018 7819 18289 33368
5792 33368 19681 28470 42610 33616 6184 -5194 -4428 -8853 -40001 -59405 -54055 -46136 -35148
5779 -35148 -46336 -45788 -49409 -31154 -30846 2094 26814 21237 -27233 -64462 -70539 -52787 -11970
5766 -11970 6354 4618 18695 2650 -7425 23050 9156 -17369 -18801 -23947 -38757 -49900
5754 -49900 -67794 -66689 -46355 -30715 -29940 -1744 14916 3048 -4506 9646 14388 -21359 -44341
5741 -44341 -35470 -20950 4231 -3140 -20009 -17590 -17321 -12437 -14549 504 -29935 -50076 -50414 -41162
5727 -41162 -40020 -27062 -9925 1422 3799 19998 32185 4524 -1985 -10750 -10735 -7588 -19698
5714 -19698 -6098 7808 11585 5169 -13533 -11001 -24419 -27520 -37451 -28883 -9655 4116 19280
5701 19280 28658 41803 6810 6335 -5676 -50249 -32900 -14170 4313 14908 20623 50268 20837
5688 20837 14614 48800 62726 47009 57137 61243 48952 32186 23486 16926 23633 14697 23866
5675 23866 10228 -9692 -22238 -25544 -27882 -41088 -31853 -13516 -28379 -28677 -17720 -26731 -12750
5662 -12750 15421 31847 29437 7265 -4015 7935 10252 9562 9594 19156 9477 10210 5156 -23067
5648 -23067 -38305 -29796 7188 2916 -14381 -31915 -53671 -26826 -549 -17676 -6349 -1390
5636 -1390 8207 6874 -3677 -350 -36400 -27902 2774 13370 5104 -24683 -23326 -14569 -44216
5623 -44216 -54821 -35341 -10667 -6240 -15140 -5569 -5161 26809 15994 17496 18292 -7363 -10549 -15747
5609 -15747 -8784 7480 17628 5853 -23402 -37318 -26278 -22102 -13808 9493 52 7440 397
5596 397 -1181 20724 30644 6773 -3198 -22916 -35967 -15971 18862 31326 15422 21378 22755
5583 22755 17486 10789 -11314 -24796 -12634 -26118 -16445 -10944 -6703 17757 16383 2938 20758
5570 20758 31206 6417 -14363 1696 -8808 6932 23688 26765 21380 -12632 -25231 -27610
5558 -27610 6615 33649 16516 -12959 -38408 -41156 -26472 -19725 -19382 -1142 22602 32455 18398
5545 18398 20401 -6630 -19269 -32241 -23684 -42656 -41147 -32783 -6739 -4623 -4393 -9952 -3251 -39284
5531 -39284 -47489 -51860 -35659 -13452 -29306 -36163 -2655 4852 -20725 -24833 -16194 -29511 -21658
5518 -21658 10116 30101 26304 9879 3521 -7428 -124 10397 -5444 -41063 -48117 -5443 56001
5505 56001 52506 56896 54004 25743 16148 -26264 -61404 -36974 -23019 10647 25173 8192 14621
5492 14621 -5223 -15808 -13649 6607 19512 -14082 -16752 -582 -10904 -49730 -45238 -49842 -61067
5479 -61067 -57293 -17927 17562 38018 44619 -3341 -4312 4079 12261 30058 22680 14384 -4379
5466 -4379 -17596 9039 35275 62784 33388 16908 5947 -8133 8657 -6903 -15244 -13115
5454 -13115 11422 19182 -11293 -26045 -27787 -45441 -35851 -55565 -43665 4839 2546 -17118 -20915
5441 -20915 17948 9167 1649 15456 2988 -8097 -25588 -40766 -26261 -16951 -18969 -12173 -22294
5428 -22294 -11939 21247 9788 -22995 -39917 -52341 -53102 -34602 -11162 -12445 -15952 -16367 -23515
5415 -23515 -22194 9117 1403 -22325 -36340 -34208 -23514 -13266 -3420 -19229 -28584 -19408 -28213
5402 -28213 -61279 -35418 -1612 13883 8332 13948 38916 17509 -6050 -25066 -17968 -18802 -38095
5389 -38095 -41855 -23095 -8206 25923 10941 4350 -8154 3918 22350 25788 11716 80
5377 80 -19752 -10836 8957 27857 27921 -4274 2847 -1572 5416 9854 12315 30545 29607 34738 21239
5362 21239 -16133 -18097 696 -13463 -9210 -17935 -17436 -5559 16025 7406 -34008 -42259 -18678
5349 -18678 7459 -15742 -20233 10158 -5507 -29234 -16440 -7982 -3263 -27822 -40250 -35411 -1592
5336 -1592 6383 31594 22467 -15212 -12215 -20949 -27388 -33953 -41775 -28940 -23733 -6777 15265 19238
5322 19238 -322 -9523 -21484 -25296 -3523 -9474 -3250 27991 12816 8463 -1012 -201 -1368 -6219
5308 -6219 -34509 -37476 -21646 -11792 -14186 -25397 -406 -135 -1034 -22132 -21476 -27642 -23673 -20775
5294 -20775 -29889 -19441 -8774 -4895 23727 27029 5484 7539 9392 29656 24751 -32453 -41609
5281 -41609 -23433 -23727 14968 -9000 -31087 -31582 5479 5815 -5910 295 -876 9880 25531
5268 25531 4551 -28924 -29777 -16119 -18107 -5453 15385 8849 -5420 -7700 -12115 -13795 -39773
5255 -39773 -43341 -34639 -14647 -12741 -5869 6347 -2727 -277 -6741 -38827 -20524 -15584 -22507 -8969
5241 -8969 -6081 -29858 -41070 -54271 -31374 -38468 -36290 -20890 -12867 -29292 -4812 -2292 -2152
5228 -2152 -13449 3580 10279 -2917 11863 -5410 -28114 -22719 -21513 -21540 -39905 -14656 -10700
5215 -10700 -23814 -37468 -53372 442 45722 35438 25631 24015 37365 33607 12813 13138 -8899
5202 -8899 -27305 -27525 -20357 -22074 -28821 -30482 -32172 -6576 8810 6576 -28211 -39653 -36923 -49317
5188 -49317 -35417 -30128 -56160 -61343 -56061 -40048 -14304 -15246 -25628 -15123 8815 7079 -5158
5175 -5158 -20466 -28708 -8232 -31806 -52948 -45238 -17869 -18101 -21272 -21261 -24687 -34906 -13623 5982
5161 5982 -4625 -10674 -25929 -44038 -44220 -16618 3346 18048 -6627 -26969 -19498 -28308 -33936
5148 -33936 -4538 -1132 13101 15163 6520 31532 35526 43732 22769 -12626 -19240 -14057 -13240 -16110
5134 -16110 -16141 -9692 6797 27288 44315 47737 32377 22917 -6430 -55478 -57227 -47897 -61255
5121 -61255 -51194 -14734 9509 -5021 -11080 -4318 -15584 -25895 -33142 -19116 -18850 28059 20257
5108 20257 -2296 -32116 -29177 -31944 -58775 -43312 -23704 -438 -243 -12893 -4202 153 21560
5095 21560 23323 15537 24599 -10167 -36963 -6367 5223 -10052 4784 2760 -10065 -57108 -74754
5082 -74754 -60879 -39354 -14204 -8207 -7517 24244 40247 41193 19114 4619 10147 7228 -32809
5069 -32809 -18084 -7835 -1180 -1774 7445 -14518 9873 12511 4199 12384 -22718 -9344 -4291
5056 -4291 17739 31646 35212 7689 -11459 -20146 546 35880 39902 48056 25397 16374 -8654
5043 -8654 -22924 -25920 -41300 -35745 5688 36393 49670 31450 14750 18934 5830 -26085 -18949
5030 -18949 12767 -6930 -1223 18793 3321 -38610 -32107 -4169 -17400 -71317 -45684 -26468
5018 -26468 -36684 -38792 -15070 -15191 -7991 -2816 -10849 -13852 -21133 26083 54913 20472 -2072
5005 -2072 7534 11673 -17420 -15085 -8334 14023 30590 50860 33782 15560 20040 57522 35594
4992 35594 22803 20464 12045 27575 20960 -5485 -54903 -85874 -91080 -71000 -58663 -60304 -91908
4979 -91908 -53894 -37479 -19966 6997 25613 4048 -6041 -11107 -19876 -28775 -28385 -10715 -2905
4966 -2905 -22823 -39543 -28285 852 25686 -23888 -61258 -83687 -87718 -65756 -33117 -27828
4954 -27828 -55504 -52380 -62865 -58926 -32695 -23140 -39623 -35804 -17935 -54663 -85577 -67853 -70436
4941 -70436 -63071 -68129 -61416 -37021 -25913 4435 30058 34244 62051 62631 46485 35180 -5452
4928 -5452 -7583 8381 -8845 -1273 2450 -14446 -26538 -20780 -14040 -15793 -4264 10257 -5451
4915 -5451 -15680 -8344 23618 26001 33730 83988 87256 35914 9182 -4706 -9762 -21064 -26565
4902 -26565 -22667 -28984 -37897 -27014 -14303 -27456 -21623 -5494 13869 32033 24786 3971 -33251
4889 -33251 -35983 -19456 -5353 11272 17301 -12764 -17610 -3836 -5709 17739 42153 48438 54446
4876 54446 39024 23180 20796 29686 34150 55735 40331 32289 5352 12839 1193 -23704 -34525
4863 -34525 -59443 -70060 -37663 -19585 -15239 -23233 -14693 13109 387 -23384 -21726 -17619 -32361
4850 -32361 -35408 -18160 -3303 22633 46208 3287 -7007 -21154 -23370 -10125 -10372 -33382 14832
4837 14832 26033 34481 6603 7355 41777 19811 -5903 5584 8410 10219 20053 16720 -10594
4824 -10594 -51004 -38112 -8164 493 -16292 -33058 -25428 -25793 -3431 -9231 -40632 -39344 -13862
4811 -13862 -1591 -11093 -29372 -45171 -54667 -67354 -48968 -44084 -32834 1258 28094 21002 -20818
4798 -20818 -33396 -9277 -4432 -20004 -26740 -28182 -33778 -19145 17199 34955 9703 1780 38722
4785 38722 35857 36504 33150 18077 12007 31298 25634 -4238 -15049 -45733 -47359 -44151 -40533 -45856
4771 -45856 -44765 -39426 -35701 -34488 -18714 6379 18731 3173 -20476 -15907 -27252 -33085 -34106
4758 -34106 -43125 -28467 -19676 -16199 -36208 -37988 -52699 -53970 -33579 -32688 -36873 -30851 -21902 -20826
4744 -20826 -29302 -16140 -16237 -13288 -5326 -1334 -3092 -6224 -27697 -6343 -3146 -28326 -20078 -393
4730 -393 7333 17821 18778 16660 8272 7442 15306 -5369 -39660 -51242 -34928 -18892 -6506 4820
4716 4820 -8050 -27738 -22584 -9141 18588 43061 27201 5420 -6750 -33738 -28630 8884
4704 8884 25294 17703 13405 5313 2286 -23053 -31399 -24602 -22205 -43208 -50284 -22866 15099 29393
4690 29393 7177 14256 28880 21119 -1440 -17378 -8303 -1617 -5972 37802 71460 48994 11696
4677 11696 16189 35009 41899 22319 -2113 -6480 3128 1459 21262 42990 40934 33677 27957
4664 27957 8173 -407 -643 3303 -2271 7880 -15352 -20374 24904 19474 35171 35560 -16911 3139
4650 3139 31173 29706 35352 32027 30633 12540 -6941 -33266 -22605 -26376 -9096 -20280 -29319
4637 -29319 -33347 -46710 -25850 7663 28019 54287 33470 7230 -13836 -3393 3015 3161 21141
4624 21141 37025 15049 -19683 -32283 -28477 -40232 854 16019 -1771 -9001 16135 14422
4612 14422 12385 -19541 -30561 -10009 13210 22813 28647 41627 -364 -33569 -33759 -6781 -23513
4599 -23513 -22765 -25906 -15939 -3315 3406 11768 28818 7378 9159 9743 -19322 4702 14580 -4013
4585 -4013 -19872 -53228 -68029 -48206 -36667 -25217 -9234 -4076 3434 6625 -8478 -28890 -18875
4572 -18875 -20727 -34222 -36496 -33306 -20326 9787 25824 25572 30128 39984 30978 -7787 -28399
4559 -28399 -11176 36882 20076 18251 32614 24036 44796 36981 38905 52503 44723 14301 -11261
4546 -11261 -55672 -50337 -2567 14032 -5412 -17419 -34336 -37774 -39714 -32458 960 7411 10048
4533 10048 10535 -14207 -15939 3839 17195 16484 -7370 -24255 -12922 -27580 -54772 -56717 -27174
4520 -27174 -1243 -21444 -20376 7329 11724 16271 19426 16286 14507 32720 18241 2130 -8090
4507 -8090 -2414 -10726 -42261 -41636 -39108 -44588 -32625 -7809 5521 49879 49129 18518 6062 -9823
4493 -9823 -10576 -2355 -16372 -15088 -33691 -34611 -36737 -52219 -56561 -16877 19565 50924 46487 5188
4479 5188 -36067 -35259 -39205 -52094 -29834 -8553 10688 25633 29892 8548 -25990 -45271 -37843
4466 -37843 -20638 -11448 -11863 -34728 -32975 8811 24594 21902 28992 -3415 -5692 -20679 -22773
4453 -22773 -31567 -28694 -11088 3769 6963 17178 16426 1838 -22338 -13033 -14871 -17915 -9319 -8584
4439 -8584 1237 -18761 -18428 -21831 -19782 -1757 -14395 -7597 -7110 -8573 -12459 -5166 -4905 -28060 -46560
4424 -46560 -18278 18801 34771 -9479 -38361 -21180 -1997 7543 2375 -17688 -31116 -51147
4412 -51147 -59063 -44901 -46926 -53435 -42107 -28819 -21185 -11882 -8358 -36328 -29093 -2789 31725
4399 31725 11854 -19782 -15061 -13207 -7009 10398 2189 -25042 -12297 -27408 -4116 -1986 4385
4386 4385 9663 4046 -11884 131 16663 23039 18637 48150 31083 25678 -403 -8320 -2999
4373 -2999 -32960 -26232 -50036 -49509 -19990 -5256 -21198 -29520 -25002 -32836 3723 22430 42547
4360 42547 40343 36567 25468 -13411 -30341 -11641 -24324 -35743 -37284 -47971 -42569 -14789 11758
4347 11758 15946 10320 3945 -7359 -26130 -31616 -19331 -31407 -35660 -39251 -39562 -34074 -39481 -29027
4333 -29027 -14601 -5779 -24861 -15908 -18789 -27772 -1417 18185 28097 25825 30934 27546 -2739
4320 -2739 -39787 -27745 -20009 -8426 -20651 -25000 -33029 -56508 -78877 -52211 -20044 -28555 -34905
4307 -34905 -11098 -5235 -2187 8698 -11193 -32358 -16322 -11942 -28453 -8674 -13639 -38086 -48961
4294 -48961 -34834 -24321 8900 24632 4571 -20211 -32664 -32079 -8227 -20607 -18528 -53478
4282 -53478 -51016 -27277 -24475 -67359 -42211 -1503 -3936 -29499 -24167 -38778 -33669 -40690 -28085
4269 -28085 -39482 -41622 -50249 -52681 -66780 -26729 4899 18587 21031 -1841 -37307 -32470 -1367
4256 -1367 11553 -65 -14507 -58920 -51891 -39119 -44365 -17869 -11212 -21288 -4197 -7309 -27765
4243 -27765 -53360 -32005 -23512 -62119 -54177 -25149 -13265 -19484 -9134 -12918 -24568 -54365 -37916
4230 -37916 -34557 -45612 -40678 -27302 -43743 -35281 -14206 -19997 -8591 9391 7763 5971 207
4217 207 -1576 -17806 -15384 -22445 -13030 -14711 -8804 -4155 -16275 -17363 -11716 -16151 -20013 -413
4203 -413 9884 3937 11815 904 -14113 -57543 -70025 -70678 -48021 -41837 -19641 -15726 -7931 -40499
4189 -40499 -47392 -23291 -8381 -14998 -3464 8871 8093 -31747 -49422 -27122 -9568 -33039 -30355
4176 -30355 -11698 -12900 -20160 -5288 8895 -15375 -19730 -12459 -28472 -20152 -21357 -13702 -24297
4163 -24297 -18250 -11545 -27802 -43658 -33550 -21941 -38123 -42387 -61355 -67192 -29368 -17333 -32816
4150 -32816 -32 17059 9462 80 -2798 10283 37668 18698 5520 -12976 -27815 -56214
4138 -56214 -40575 -19028 -14403 -2443 14805 1724 -20781 -14957 8722 -5664 -23919 -31433
4126 -31433 -44094 -47262 -9518 -13983 -50986 -48688 -21839 -35155 -53049 -30989 16091 13696 -5158
4113 -5158 -24032 -21988 -27450 -12041 -16444 -5000 9772 6363 10330 -10645 -17075 -7001 27083
4100 27083 33930 26714 9593 -18715 -17652 -3464 -891 -8073 2641 36393 55173 53223 37650
4087 37650 35994 37346 39979 -19 -9477 -42728 -33554 -29572 -39541 -49892 -74265 -77553 -39139
4074 -39139 -12327 13560 10321 -1290 -2076 6780 -17384 -7606 21576 2293 -35175 -29591 11673
4061 11673 17299 14114 -9520 -35217 -9435 8512 -4079 -11882 -10920 5972 19335 -3182 -29129
4048 -29129 -44591 -55980 -49215 -45209 -54153 -61880 -41739 1049 17213 -3552 -11118 5647 2487
4035 2487 10300 8864 -7663 -21738 -10886 -7495 340 21762 19075 -9533 -28702 -30589 -38063
4022 -38063 -37783 -31731 -28130 -36886 -47319 -34866 -15975 22043 44205 16735 3220 -1780 -14185
4009 -14185 -17175 -7409 -24884 -15875 -5501 -19963 -34776 -42373 -37845 -37100 -48977 -46872 -36653
3996 -36653 3862 28910 9437 1600 -2295 -9304 -13708 -17400 -17281 -18237 -6512 -15034 -55786 -83105
3982 -83105 -80234 -19459 -6868 -7534 -21191 -2719 582 -28537 -32269 -18660 -21167 -19659 -35456
3969 -35456 -22764 -26532 -39407 -31455 -34758 -11162 24406 29807 -6103 -19516 -17046 -25585 -11201
3956 -11201 1422 8483 2968 -3060 12120 10727 15909 11160 17562 11897 -18751 -26437 -8373 14602
3942 14602 9755 -17179 -48066 -55436 -42721 -23587 11694 4768 -12772 -10938 4282 1284 30933
3929 30933 35801 27306 27166 30799 23947 -2392 -20797 -12513 -117 -28552 -41561 -59471 -60411 -78290
3915 -78290 -57594 -22884 19888 31904 13051 -4048 -7453 -47201 -38693 -32987 -24725 -1239 -3751
3902 -3751 2209 -27645 -51645 -58150 -52856 -71535 -47559 -50632 -11901 32881 28237 33884 60344
3889 60344 40532 25587 17542 28433 -1496 -14577 11068 11817 -8884 -7913 -6170 -16295 -25465
3876 -25465 -46615 -61625 -63642 -49610 -20915 -28030 -32173 -37670 -19993 -10189 -18424 -22086 -13792
3863 -13792 9080 16230 11009 -6983 -18611 -40005 -39234 -34201 -38388 -56278 -50995 -17420 -15305
3850 -15305 -28605 -18880 -5379 -760 20460 36301 25859 -11564 -13957 13458 39662 22193
3838 22193 -21139 -40250 -45398 -34585 -18469 -3334 9326 12776 7609 4140 10326 18467 35068
3825 35068 45107 55954 64757 63491 48007 25730 -1404 -8079 17054 -10764 -25683 -3224
3813 -3224 5247 -111 8441 -5742 -24064 -26406 -10200 23477 29147 51923 47601 33427 33159 36618
3799 36618 9013 4853 10976 7955 4062 -29923 -43764 -50306 -63421 -58784 -62328 -46653 -21293
3786 -21293 -10625 -1549 23745 17748 5877 14811 -2981 31376 35631 17692 13927 22909 24748
3773 24748 23958 36103 69605 44093 11469 481 7793 32254 22359 3184 -6877 3758 16628
3760 16628 18375 11336 -11591 -34754 -46402 -35468 -806 17322 -1942 -22461 -18170 -14122 -35199
3747 -35199 -48033 -51085 -27034 -3917 -3248 -16910 -22309 -30030 -34541 -22812 -17927 -2291 36045
3734 36045 37672 16465 15790 19090 25602 24965 3391 -26051 -40293 -29420 -13675 4028 9210
3721 9210 9985 13365 28381 23918 -7163 -36417 -41759 -23828 -26283 -25487 -21703 -53334 -38873 -13454
3707 -13454 4482 -2530 -27274 -17049 -19601 -24221 -27280 -12207 -33213 -26020 -7372 -16793 -31972
3694 -31972 -36718 -37132 -9831 11450 6063 2002 390 3635 -13799 15028 21914 3227 -490 -6378
3680 -6378 -5681 -11327 -5232 -13277 -13762 -14483 -8968 -6863 -4758 210 -9340 -11158 16712 -2782 -7225
3665 -7225 2674 19255 15118 -14518 -3888 4236 -16655 -29098 -30086 -34377 -23548 -38004 -38862 -36836
3651 -36836 -39509 -37709 -4917 18550 -19152 -43758 -49593 -42622 -24612 -23748 -54192 -66816 -45703
3638 -45703 -27562 -15247 1312 1416 -23109 -8822 -3434 6185 16292 13037 -1630 -3110 4557
3625 4557 -5968 -5032 -1671 20485 1032 -23054 -27042 -42369 -39452 -30741 -30878 -65159 -33042 -6804
3611 -6804 -2321 -4331 -15579 -23492 -53898 -76346 -37421 16300 22935 -10747 -14686 -33148 -48541
3598 -48541 -26594 -7906 23304 13857 -7560 7396 23730 22927 26149 337 -7790 18950 7094
3585 7094 -26232 -31833 -37556 -42354 -27536 -26325 -31368 -19250 -16810 -22393 -3081 23988 28718 -4771
3571 -4771 490 16479 10732 -152 5837 6629 4997 -14131 -49219 -62618 -45099 -26408 -31545
3558 -31545 -34089 -6553 -2734 -15614 -23982 -7977 1720 -4303 -5767 17850 2268 -16189 -21502
3545 -21502 -17978 -14071 -18226 -20793 -34835 -38441 -29685 -19172 -16604 -30203 -17819 -9035 -1212 -199
3531 -199 -5379 3482 3687 1731 3595 17174 26529 9468 7604 12328 31698 23436 29618 24154 13075
3516 13075 20866 -669 -33985 -37307 -7087 14510 6798 -23484 -23403 464 10314 -5609 -11725
3503 -11725 -21736 -29664 -24439 8154 3484 -15518 -13302 4308 19663 21544 -20527 -30159 -14928
3490 -14928 -11031 -958 28291 6537 -46166 -66608 -48763 -32024 -7627 -17470 -10762 -3670 -43337
3477 -43337 -42982 -53013 -59147 -8892 29268 31877 15313 -563 -20739 -21787 4290 12485 19270
3464 19270 15021 4223 -3203 -40725 -38673 -19470 10487 11624 -5043 -10476 -16264 -5445 -9458
3451 -9458 -14349 -6887 4521 15430 10091 -8065 -5431 20072 23427 19769 3923 1774 21171
3438 21171 772 -35238 -41969 -26438 -29412 -34758 -5270 20034 37292 16870 5744 24192
3426 24192 1973 -5177 8282 4333 17246 -3416 1940 13589 1869 -19559 -26748 -28156 -24725
3413 -24725 -18585 -11912 -10655 -34452 -38099 -1250 14226 6738 3021 -4191 -34697 -56051 -47586
3400 -47586 -43328 -53678 -53489 -33523 -23853 1509 -8403 -6783 11007 -3841 -29397 -29417 -28784 8569
3386 8569 12856 -13119 -16380 -19475 -22164 -13904 5294 -329 -1720 -16334 -2988 12748 8859 -6899
3372 -6899 -24448 -38944 -22540 15984 17385 19389 29497 26036 7945 5604 2507 -16406 -21615
3359 -21615 -7442 -34494 -25806 4061 36366 43883 46928 33956 7238 -4738 10606 357
3347 357 -7864 18816 43442 9802 -10781 792 20469 16789 -885 -24115 -33195 3597 -14788
3334 -14788 -28600 -18578 -19197 -35933 -29533 -23567 -17432 2208 21132 5578 -5761 5910 -8870
3321 -8870 -10061 -18690 -12658 -30542 -26188 -9978 16363 29677 33722 27450 10440 -8039 -12846
3308 -12846 -4263 -1847 6063 -254 -6806 -5097 -28908 -39154 -31200 -25747 -13454 -27897 -21608 -18742
3294 -18742 -39582 -42019 -57398 -67220 -57063 -49190 -65063 -87562 -91834 -77530 -43487 -40115 -35910
3281 -35910 -13448 12352 -17913 -52769 -58166 -14689 -6915 -25502 -56323 -49391 -18302 -3394
3269 -3394 -20255 16210 33579 37563 21000 -13666 -43945 -17663 -4781 -27007 -42355 -20140
3257 -20140 -11281 9737 21818 -13136 -28095 -26239 -3273 6085 -10145 -17911 2616 6888 16746
3244 16746 6244 34258 25125 2460 -10609 1289 -8797 -4741 4965 -4715 -30889 -53021 -71821
3231 -71821 -65103 -57741 -53291 -39088 -28770 -11218 18755 48396 40022 28095 22988 28396 24206
3218 24206 26681 1911 6389 20179 10681 -29373 -15791 26443 53551 56954 45214 44532 12435
3205 12435 6222 11100 12911 37191 22711 5278 -13782 -17173 2090 22972 5162 28513 33981
3192 33981 13347 7999 -18819 -2926 34871 63860 54396 19473 13738 7320 -21265 -57782 -70750
3179 -70750 -60050 -44413 -48362 -58961 -35187 -27240 30793 33765 -1611 20033 25531 39073 22713
3166 22713 -18845 -41964 -13180 27481 32732 4125 9127 13736 40074 30980 17649 1148 -17169
3153 -17169 -20466 -16963 8329 13721 23699 19780 16072 -2660 -12916 -23569 -38602 -43981 -31937
3140 -31937 -38801 -48882 -37432 -31245 -40477 -47660 -48508 2570 24200 16439 8024 -6771 -27172
3127 -27172 -8252 24695 27735 11454 -20038 -10684 9425 -5281 -25701 -9717 -1116 -6986 10997
3114 10997 14565 -4595 -28810 -23386 6845 15925 -37821 -64984 -66173 -48770 -22104 -25748 -35586
3101 -35586 -21854 -22048 -28219 -1854 24925 11899 -3901 1873 13530 25243 39099 54651 65543
3088 65543 35957 -2797 -19754 -39930 -29086 13113 45388 21997 1683 -5544 -8361 -17632
3076 -17632 -18169 -19289 -38008 -33472 -43586 -45553 -6694 -6625 -20987 -38263 -11796 -20916 -31612 -14342
3062 -14342 -16958 -33864 -59194 -46937 -8657 13107 21669 21554 12650 16739 -26101 -61054 -44664
3049 -44664 -34070 -28083 2349 -3779 -23210 -68465 -78272 -42019 -46473 -33434 -19619 -6206 -28990
3036 -28990 -49061 -50780 -38409 -14656 -2406 10241 20540 10583 -1212 5520 41126 23160
3024 23160 14212 13593 15337 11899 -7728 -20003 -43976 -52057 -40852 -10036 13128 6565 -17317
3011 -17317 -18425 -1162 20793 12255 -7192 26044 62672 56927 60599 60701 72153 63783 39146
2998 39146 24564 45937 24118 12043 30075 34796 6980 -49244 -36875 -14489 -19668 19622
2986 19622 33223 38017 45842 38135 47060 20914 -16996 -45863 -26857 -28601 -29843 -17001 1302
2973 1302 -25238 -15294 26014 40542 17597 -17591 -26398 -25788 398 18650 2385 -18267 -36333
2960 -36333 -56188 -60742 -32636 -9063 1309 -3774 -21860 -35264 -28749 -38913 -21174 -5555
2948 -5555 28077 35619 35002 17533 7656 7962 7799 21474 34694 33243 -10238 -18478 -20271 17579
2934 17579 25268 20233 5941 -4031 -26889 -26601 -36778 -32339 -21431 10962 1062 -18167 -29435
2921 -29435 -27106 -35177 -55615 -45505 -26664 -13838 -7753 -1981 13406 11227 -33284 -38981 8297
2908 8297 30075 43920 21469 6251 24414 19877 4515 -5077 -9301 26182 48728 27411 -3715
2895 -3715 -29912 -21407 -13481 3422 11311 -19693 -40294 -18502 3948 11 -25476 -19129 9463
2882 9463 37251 28881 -998 -16109 -17714 -21091 -9050 19599 23223 20705 -8512 -7745 -141 4536
2868 4536 -23962 -54780 -54158 -68885 -87174 -39867 -33096 2210 7172 -8477 9858 21083 -12509
2855 -12509 -27151 17225 31283 3650 -20027 -10509 1275 20057 15425 3802 21152 35043
2843 35043 14632 -16038 -43054 -24935 -6399 12313 18560 -2540 -15968 -18239 -588 -21648
2831 -21648 -37663 -26640 -4690 -6949 17026 37180 9851 -17547 614 -13140 -22138 4021
2819 4021 1166 -7881 -19106 -10861 -5188 -29472 3533 22435 21090 5541 10836 7224 12126 17635
2805 17635 18058 146 -17523 8757 17386 17039 47142 27982 4042 6538 -20005 -25958 -16584
2792 -16584 -31696 -17193 16795 9719 4725 -4459 -20299 -15418 20632 6271 -30600 -23463 -4725
2779 -4725 16746 15610 18211 -9073 -21851 -19893 -26965 -26382 -24925 -25094 7997 22477 24801 17342
2765 17342 -17188 -20431 -20753 -22467 14505 35676 12175 3718 15316 10906 4153 -4801 -19829
2752 -19829 -13421 1231 19326 18508 28308 30041 20448 14648 12899 5435 -7504 14479 20945 4550
2738 4550 -12260 -15203 4252 -4088 -1583 33759 26732 2952 -6811 -12637 558 -7135 -31963
2725 -31963 -31579 9912 9308 7545 20809 4234 -21292 -6140 8125 -3113 13695 27751 7420
2712 7420 9440 14788 22104 19292 -8711 -19644 -10813 -1329 -16321 -32248 -31482 -20415 -8449 -13625
2698 -13625 -22182 -22161 -24834 -3962 -4249 19802 16191 -2777 -710 3902 2499 12892 18408 20545
2684 20545 5110 -12413 15723 33770 6127 -12803 7748 21263 25329 32684 54169 18459
2672 18459 15943 3476 -51 -21207 -37154 -24100 2822 30324 9058 -8269 -28194 -37276
2660 -37276 -39817 -9617 -731 316 904 11380 24121 -4937 -22422 -22363 -16870 -11241 -25685 -29644
2646 -29644 -28923 -30956 -37214 -62941 -78470 -62729 -25304 9075 16165 29351 41031 21709 13349
2633 13349 27108 7440 -12721 -6422 3078 6989 5427 14788 32704 37293 35691 49675 20900
2620 20900 -10465 -13085 18436 26559 15435 -320 5094 -2081 -1450 -1919 12488 19062 23530 33340
2606 33340 25810 3416 -7402 -9170 -3673 7787 8345 10341 608 4789 1253 -16566 -26982 -42648
2592 -42648 -48805 -21636 -39845 -46084 -42620 -19448 -5946 3179 27096 25760 20647 -3946 -36412
2579 -36412 -28595 6326 -24920 -20162 -15537 -9720 23470 40619 44786 50783 17332 8508 -18140
2566 -18140 -23726 -17991 -30791 -26618 -16391 -27970 -31557 -20538 -26987 -43082 -38542 -5649 2700
2553 2700 18794 37699 41834 16987 -1339 -15089 -13453 -21220 -38185 -15997 -9518 10058 13130
2540 13130 8668 28938 28739 33262 12317 -17645 -35837 -67601 -48850 -23087 8211 30749 32619
2527 32619 30716 11439 797 18816 6871 -32936 -39598 -15576 -3328 -10375 -5334 -9448 -23646
2514 -23646 -45922 -48575 -21150 11096 36491 20561 18457 31363 14684 -4996 12506 12142 -19968
2501 -19968 -23636 -22130 -36815 -45308 -37808 -37421 -31113 10433 -3736 -46930 -42471 -27338 -28953 -24920
2487 -24920 -27694 -45608 -38495 -18645 15041 13472 -12612 -20526 -38992 -14048 -18755 -14651 -5893
2474 -5893 281 -4427 -3558 -16996 -20310 -27338 -35588 -50106 -40784 -23544 -14445 -17312 -31925 -33625
2460 -33625 -17923 -5341 1291 1664 12851 -3389 -7447 24205 55820 37855 14116 -6920 12338
2447 12338 3372 -28110 -7005 -3684 4129 17989 15311 15356 -4819 -18796 -5644 -8618 -14214 -20466
2433 -20466 -14795 -2835 -7868 -12469 -18802 -10701 13971 10246 20416 36891 28813 10590 1150
2420 1150 -1088 11662 21923 23486 -7182 -25387 -42723 -14873 987 -1768 -6396 -15218 -24613
2407 -24613 -28482 -23652 -11067 29351 10711 3911 -182 4929 17943 29634 5647 -9054 -2076
2394 -2076 15942 16149 23916 21799 -6366 -7226 -38334 -19946 -10270 2587 20939 780 -9187 10867
2380 10867 20339 -610 3363 724 -19546 -37064 -7647 8135 16259 44286 33483 -2120 -10003
2367 -10003 -21868 -24989 -21590 -32245 -12689 17384 28245 32325 37900 46989 28893 7217 19759
2354 19759 33103 52132 41935 4062 -23179 -26228 -7210 3725 -18433 -13895 2801 -6328
2342 -6328 -8984 -17735 -24122 -21075 -38 10480 4142 7269 13371 14842 -4816 -11916 -2000 17109
2328 17109 9565 -9519 -22781 -34680 -14595 25670 57544 65695 36040 11919 19944 21091 23795
2315 23795 9661 -4682 -5379 3464 29153 31902 18693 27000 27958 2088 5636 20512 6058
2302 6058 -13475 -13886 -16617 -14517 -21984 -36490 -58840 -55998 -38104 -36068 -39172 -20305 -10187 -968
2288 -968 -2201 -6026 -10362 2300 25359 48408 40498 50207 61075 22755 18027 24893 12856 10121
2274 10121 23993 27928 21582 527 -4611 31082 27068 22236 -15767 -52889 -57944 -46593 -19108
2261 -19108 -8690 -3693 -15310 668 16395 18026 11778 -8103 -10641 -13965 -36324 -48789 -34040
2248 -34040 -5653 -9604 -16443 -12283 2466 7083 26070 34527 3050 -3174 -6430 -19102 -9711
2235 -9711 -10626 -12382 -22693 -22167 -29309 -37675 -45291 -72396 -58217 -10912 -9463 -25529 -9233 -7016
2221 -7016 -8877 1529 -3147 -32280 -39776 -21187 -24057 -34444 -20930 6693 -1754 -39149 -23562
2208 -23562 -26779 -12827 -318 -8247 -2804 14875 24276 9682 -36132 -48838 -25736 248 15190
2195 15190 -19918 -46274 -16238 -3133 -10580 -28117 -23795 8243 -15959 -27572 8641 1516
2183 1516 -24878 -35921 -25078 -24632 -19743 -4640 20990 11983 2968 -4833 8939 19278 41104
2170 41104 10805 -7980 -4496 15541 4747 -15427 -28323 -36474 -34003 -36933 -49154 -38249 -2837
2157 -2837 38880 52086 38853 31665 31327 20267 26086 16345 14710 8323 -12885 -15350 -11049 -29054
2143 -29054 -10605 13112 28315 21443 9122 29518 34274 16776 31036 39226 13939 2706
2131 2706 -3103 -21426 -12398 13169 27781 33205 15251 6279 14276 -5108 -27761 -40329 621
2118 621 17831 21226 16374 6776 636 -6382 -4382 2448 9602 1600 -21550 -13023 -12630 3950 1940
2103 1940 -461 50227 63340 16918 -7663 4598 7580 -876 -1667 -24663 -37884 -10220 35789
2090 35789 62584 35740 293 -13303 -34974 -9805 10192 25802 -4108 -23725 5768 12717
2078 12717 -3815 -5017 -7978 3051 13221 -2248 -5083 7854 12072 -5956 -980 -27174 -35108
2065 -35108 -19307 -21762 -21746 -16482 -19133 2336 7100 22547 17320 9790 13205 11538 3265 14806
2051 14806 6218 22867 23445 12137 -9056 -16134 17638 13988 2424 17514 21023 9711 -2262
2038 -2262 26376 16855 22626 51043 40699 6264 -2774 19366 35937 28367 15672 -13516 10509
2025 10509 24524 13171 10002 1350 2079 -1384 -14007 3226 -5244 -2663 -4915 13839 14162 12405
2011 12405 6267 -38797 -56759 -22471 1149 15263 31690 13682 4013 -20670 -38562 -30603
1999 -30603 -23093 5324 -7577 -44444 -47680 -29097 -15613 -10557 4754 20732 52780 31981
1987 31981 1425 -5308 8493 21972 18244 18620 4617 780 7631 2421 -5570 723 10107 13529
1973 13529 -1194 -22660 -30685 -20784 9487 12669 8163 -15544 -41479 -43667 -25941 -29743 -42218
1960 -42218 -44581 -60307 -56287 -39986 -3398 3668 -10147 -2838 -18412 -5858 -5938 -23877 -34234
1947 -34234 -9657 -1547 -6395 -35816 -58085 -40476 -9573 -13533 -43992 -37864 -27409 -24008 -22907
1934 -22907 5839 29796 25941 25592 26415 14964 -20985 -9867 5435 27918 24961 -71 -9089
1921 -9089 -12689 -314 1470 -1097 6740 -11695 -25635 -8439 10146 82 -13754 834 22417
1908 22417 17748 17977 20991 21222 27558 37088 48467 30841 34407 14031 -11721 -772 -577 -10312
1894 -10312 13120 41682 36498 33491 42758 50780 36730 28425 13489 34846 36427 19813 4679
1881 4679 -15051 10316 31741 53905 45213 9677 33547 39348 22635 1765 23456 15403 -5466
1868 -5466 -9033 -33604 -38967 -46625 -44380 -20844 -30024 -13327 -19288 -22368 -11361 -24049 -17253 -6480
1854 -6480 -28051 -36942 -20052 4574 3378 -25971 -18772 -28481 -16990 -18821 -18622 -15684 -12321 -11409
1840 -11409 -2618 29753 31287 18483 22082 39366 32308 33077 11569 19213 36043 4137 -15258
1827 -15258 21744 4306 -25620 -10919 -21954 -27019 -8638 -20351 -11465 -10962 -7755 -1490 -12015
1814 -12015 1732 4163 -31116 -37672 -30478 -2208 874 6473 15588 17463 10463 -10239 -14974 -7104
1800 -7104 -1665 -5823 -24120 -35590 -46755 -30364 9802 17735 15896 7778 -21862 -41827 -50677
1787 -50677 -43331 -53335 -39580 -1414 9392 -905 -899 15994 23021 9213 912 35814 28563
1774 28563 -11864 -397 8534 3738 -11250 4136 18633 11934 21659 23112 7610 28498 24566
1761 24566 -1996 -31579 -25374 -26148 -24437 -18001 21225 36792 7718 -725 9912 17229 22787
1748 22787 2001 6313 12344 22270 -18585 -21546 -6944 48245 50946 36071 21187 28364 26963
1735 26963 4901 14021 16871 -1124 -11926 -22350 -19274 -3019 -34721 -25077 -926 -7057 -11961
1722 -11961 -17299 -28482 -11182 35845 20621 4809 1281 132 30482 29704 5436 -3802 -20081
1709 -20081 -4239 16546 20327 -820 -18684 -3595 11741 -987 30575 40344 36094 14436
1697 14436 -343 -6852 -15991 -47965 -66128 -63043 -51480 -26877 -24211 9878 36300 26361 1955
1684 1955 12568 18027 18769 -8311 24891 42042 25980 13402 595 -19681 -12187 -3943 6338
1671 6338 -2643 22122 35749 38212 21926 27206 12278 -5549 -7493 17771 -6920 -21608 -24801
1658 -24801 -7234 -12039 2823 -4367 -19747 -43759 -30884 -15142 -10375 -18888 -27485 -6092 -6831
1645 -6831 -22862 -25144 -13646 3276 22628 5382 -23971 -42201 -36279 -22587 -35771 -29556 4605
1632 4605 13657 30954 27944 11420 20177 28977 16709 -13317 -32320 -48127 -14649 -777 18263
1619 18263 18329 23658 4495 -8248 -25309 -26120 -22393 -26899 -37229 -13086 669 7914 12060 -17343
1605 -17343 -3479 19550 62248 66537 44600 22620 634 -6832 16435 24327 30763 17205 12082
1592 12082 12371 32598 26385 -5284 -4194 -1731 7513 -3403 586 -2584 -18564 -58639 -65007 -42576
1578 -42576 -14273 -25250 -28384 9397 27785 28181 21860 35007 26899 30559 9113 -18264 -21337
1565 -21337 12065 41854 33637 39392 43093 13002 17968 31808 7243 5087 6677 -3214 15369
1552 15369 20430 19282 7319 871 18942 8555 4940 13246 400 6995 2703 -7814 -15769
1539 -15769 7598 16740 9423 3707 -34381 -26525 -4249 20193 49886 77137 87580 76401 53377
1526 53377 21704 13671 -18748 -34673 3556 6812 15374 33184 58912 53677 43058 29023 24664
1513 24664 -9164 -35316 -10679 -10176 -12388 -4117 -9527 -5041 3516 3413 -4911 -29890 -44230 -25859
1499 -25859 -23093 -10530 560 13204 22199 18065 29933 42469 56762 73640 60266 33828
1487 33828 27787 63682 66078 67412 53108 25808 9080 19192 16124 17234 17300 10782 -21491 -36686
1473 -36686 -10039 13231 28865 19344 14991 -7860 -4356 -25664 -47908 -38850 -32575 -19023 -4029
1460 -4029 2975 3398 17420 33998 14928 18227 42761 50089 50458 66679 63341 35182 24777 15029
1446 15029 9088 13082 -9829 -9538 -13657 883 13992 5658 -1460 2194 8701 1245 -10041 -1064
1432 -1064 -2890 10875 21421 5326 3034 19439 10470 -13885 -18824 -10879 -19560 -21182 -17639 -16018
1418 -16018 -21868 -18711 -34346 -22881 -11582 -16285 -3313 -5182 -5065 -14020 -13435 -23635 -45230 -57758
1404 -57758 -54478 -35316 -7624 -38873 -29406 -1 -3536 479 23456 23946 3552 -12507 -35007
1391 -35007 -44561 -44189 -25245 -8158 -7075 5664 45370 47544 15860 -7151 -19231 -25218 -25150 -10118
1377 -10118 4857 -3641 -13037 -1257 21834 19045 41201 74105 64302 16240 9617 43531 35073
1364 35073 21286 6152 14295 21185 6120 -129 -3486 -10976 -21613 -4471 31357 27393 19170
1351 19170 13018 30460 22220 28363 54912 57387 48083 44290 50159 63311 54820 36783 26454
1338 26454 25079 23740 47978 62979 47538 26354 -16269 -28492 -3947 -4728 -18898 -37169 -28659
1325 -28659 -6320 17706 34249 15943 15221 16455 4615 -323 1442 6611 24893 12243 819
1312 819 4793 36273 39137 28650 21258 1492 21413 24101 17686 17843 21936 8449 11955 21944
1298 21944 35859 36188 29557 15960 -23688 -36231 -27393 -13463 -7195 23022 26557 18993 13540
1285 13540 29177 30143 50075 30046 -37033 -35564 13235 35082 39881 31089 1418 2195 6834
1272 6834 -99 12964 -444 -6997 5745 27684 9003 3095 -5012 -20346 -9881 9917 27825
1259 27825 3497 8623 13920 -10102 -14587 -14452 5329 5685 -1536 10764 5422 3846 -9401 -615
1245 -615 5068 -5679 -27445 -41931 -43737 -42651 -11279 26829 57437 68639 68167 76843 68728 63516
1231 63516 44417 35242 35116 26783 22379 21099 41523 36649 19117 24590 9377 -8221 -2384 10830
1217 10830 1243 -12640 -29962 -14694 9340 34304 22575 17736 30936 21407 8701 14046 15932
1204 15932 -2763 8790 17651 28665 49654 57399 32599 18107 10153 27423 31628 28861 36605
1191 36605 14819 -15068 -18710 -6121 5726 -10088 -8331 -4075 12517 1892 -14486 -2464
1179 -2464 7054 28905 41831 63893 53500 40233 29773 25902 24455 20992 27066 12081 -4716
1166 -4716 -1038 17872 57844 46753 32918 23057 25927 21597 6628 9762 35507 24123 -4812
1153 -4812 -1954 18276 25204 18360 41357 52595 26101 8277 -12536 8013 26209 21910 31046
1140 31046 30484 27716 19692 32277 47266 40208 50380 49465 58491 20872 18490 57904 35776 2372
1126 2372 -4428 -10225 -20320 -19205 -21290 -18655 -8134 -3851 -36885 -44348 -29120 8973 26145
1113 26145 14481 2029 -17699 -17382 7816 32092 30757 21877 13133 17501 11858 9940 7366 8353
1099 8353 10037 26748 29148 37963 39471 28764 21831 28823 3868 7993 45115 70603 47865
1086 47865 49182 44115 49815 9756 -13856 -50388 -25775 9488 8083 30216 23763 37143 36771
1073 36771 39931 38088 33666 29978 33031 26318 17673 24190 37933 4272 -1831 -6533 -19064 -18232
1059 -18232 10573 38167 17099 4668 -22472 -28762 -4088 29089 14642 11782 16986 17030 8483
1046 8483 9944 5284 -16289 -9333 -9234 -6519 7641 -3445 -3347 -6149 2428 22361 29151 12143 5172
1031 5172 9329 -6312 -37906 -10530 24809 4080 -1280 -12006 -22423 -2989 29409 55949
1019 55949 49907 36244 18251 1752 4144 4944 52926 76544 70143 47285 51917 78345 79542
1006 79542 28529 -6203 -33090 -36366 -16800 -10762 -10112 2929 16133 14314 33918 42249 21065
993 21065 10595 26986 37392 20207 12940 13537 16613 15406 17432 27591 39750 34879 20913
980 20913 16905 14426 35673 49479 46672 66917 83707 66334 55718 56785 31590 36218 51307
967 51307 52896 38469 31050 19507 -7127 726 -4331 -13770 -23471 -856 1333 -2060 7886 39954
953 39954 45660 61117 46900 16083 -1530 -3782 -2713 8577 7561 22106 23735 18786 9461
940 9461 23483 18925 29329 2253 -1063 -8465 6887 18362 379 -28915 -22130 2199 5058
927 5058 17436 17557 13864 -6574 -254 8195 8293 17091 6819 27984 22090 23462 29665 31580 30237
912 30237 13213 15718 14796 572 28257 51527 43866 26495 30591 8936 3809 12417 36441
899 36441 21370 13420 9809 -6769 824 -14218 -24712 -18325 -12282 4659 -3452 -14696 -5516
886 -5516 -3964 -8210 -1469 12986 132 24376 29230 27107 31620 32571 3380 -21513 -15989 -6492
872 -6492 17221 38473 37310 43927 36471 28788 31618 -575 -19850 -6608 21104 57523 44472
859 44472 35096 13770 5135 -2058 -7859 5518 6441 21267 6588 3335 35291 31434 5935 17418
845 17418 41071 69123 48205 8667 14338 26598 20732 12216 -8565 -38902 -50345 -49959 -26424
832 -26424 -3432 30701 34717 37154 41779 44361 11607 11567 17846 24301 21595 -10685 -28707 -20833
818 -20833 2688 10448 20187 5008 7410 -8468 -40055 -28144 10723 28728 43341 37165 38475
805 38475 75845 68732 60300 60550 19705 11112 31725 25944 -11135 1437 5192 27648 51600
792 51600 23440 18542 3267 537 8312 1691 -20066 -9961 11201 34939 21909 16338 1777
779 1777 13704 72216 95756 55872 17826 35043 19780 7666 3463 15622 20633 12592 10601
766 10601 18693 14358 6848 15114 22246 19394 31048 23394 33954 48356 40164 12933 -10274 -16677
752 -16677 1423 34783 46053 27932 11499 36885 70497 49409 10132 17949 -12933 -33346
740 -33346 -24143 16547 35937 33789 15706 16890 29177 25837 28242 35503 36611 21893 -3728
727 -3728 -2191 -11906 2950 23210 30972 -220 10313 -4620 -17771 -31119 -1625 27105 37753
714 37753 35186 21794 -1246 -1546 -21120 -33614 -22809 -18937 -5932 14312 37976 17909 -3243
701 -3243 -8737 -6256 -2748 -11916 -15951 -20263 -6138 8434 -9348 5622 41393 21108 21870 12523
687 12523 725 -1869 27554 29818 21420 -6577 -3208 -92 7182 26095 32872 32458 30931 9211
673 9211 5898 40265 40707 47685 19284 -4264 -3821 -11670 -21898 -8922 17387 -1372 3827 18508
659 18508 29543 32286 40560 46812 68314 61147 57309 62883 68430 40109 13805 -20509 -9300
646 -9300 5127 12941 22186 25585 51157 72300 74635 61927 58006 30818 30328 30435 35909 37552
632 37552 34635 47137 67658 49384 52424 41562 36648 35661 43267 45501 59985 88120 77486
619 77486 54926 38230 28399 43086 29853 9096 -5841 -8589 10963 16373 28846 48847 47958
606 47958 37412 36242 47163 15371 -8452 -21246 15817 40969 41782 24281 38790 59350 48913
593 48913 17291 23505 20857 -9901 -6871 13932 20556 13473 40977 43657 23394 26410 9852
580 9852 15872 9273 8317 18410 3907 -4286 22711 17079 5551 -17972 -25153 -25177 -18088 -34152
566 -34152 -19796 -16662 -12419 37 30033 38672 25829 5366 4913 833 -2935 -9748 12266 5825
552 5825 9915 -11820 16398 42605 45039 35492 47066 64888 72077 66410 70017 48073 39086 25649
538 25649 24529 60912 84254 56161 14887 -8923 -6954 -1612 -4205 -2708 -7386 -10893 -34467
525 -34467 -12940 -3205 21 14283 25828 51378 32723 6989 -11743 5377 13822 5103 17701
512 17701 40763 45876 82358 60689 12035 -19031 -40344 -43070 -20546 -19353 -5791 20238 26234
499 26234 30575 31774 23342 25631 21347 27109 20689 42973 27979 33478 44177 21525 2570 14511
485 14511 15214 549 5514 -140 -12317 -6391 11640 6252 -18629 -30361 -15245 -5125 -16453
472 -16453 -13569 3029 -183 4037 4697 -4008 -8380 20992 26267 7625 5748 -4859 -10754 7834
458 7834 27834 22158 41834 40628 32250 36984 36314 25043 15324 8327 9803 24195 45950 47174
444 47174 46572 52969 64350 50773 43914 48940 30163 35107 60198 62257 64544 68453 44074 45635
430 45635 45028 60368 53527 33920 10952 10997 13100 5428 -2444 2210 17332 5548 4865 23897
416 23897 14540 -1117 -7196 -11596 -7889 35486 54441 45846 15859 19860 22574 49233 53126 43536
402 43536 23594 3262 -16633 -11612 -6933 -27144 -23679 -9187 33149 52518 51502 15477 13986
389 13986 38926 37248 23926 17236 44999 54695 57929 59890 34194 29467 45871 27611 46494
376 46494 38818 39046 35983 9539 20038 22301 33910 45692 31025 42790 54900 57821 36714
363 36714 21359 27301 25543 19700 28358 67516 44222 7504 1648 8849 19395 22687 16709 25689
349 25689 47996 72407 64947 37999 1215 -6018 210 -1554 86 21717 37630 14063 34025
336 34025 49217 48957 57981 74163 82367 64563 62631 61148 53309 6410 -862 -1926 3822 13930
322 13930 6340 6533 9431 -14009 -15401 1564 32419 29901 32282 29509 24296 16351 12211 16500
308 16500 11825 11504 -6820 -1071 12703 775 11296 10851 13729 38090 30725 19190 15018 -6599
294 -6599 647 27811 8826 -5097 -19929 -33184 -39296 -18099 -1069 12320 27423 17012 33932
281 33932 42996 42729 41921 48053 25370 1721 22006 33898 51996 53231 39881 9466 33582
268 33582 66305 73949 49905 29602 31880 17893 32388 48266 41487 25449 7374 -5865 3844
255 3844 26285 15869 14805 22757 -44 -18163 -9805 13458 26344 36817 38078 44967 41432
242 41432 25526 15792 18374 22556 23481 14519 4303 -6329 23531 49398 37391 30012 26709 19834
228 19834 10682 306 8275 15387 39313 55274 47361 37457 19879 9286 26481 33553 22514
215 22514 14641 1212 14830 8689 -4456 1631 16906 26264 25213 18621 -9839 -8797 12752
202 12752 18329 20495 39803 49305 42380 50031 36004 -2770 7751 24926 31078 23853 14303 14898
188 14898 33722 47515 23126 12639 37268 51454 51037 52163 45416 47601 16610 7940 33861
175 33861 45242 45645 38227 33868 39032 41401 37923 39907 40940 67718 60641 52265 59547 58606 43320
160 43320 29265 6634 24552 32404 21510 15633 42823 59213 48075 29010 28048 42507 36436
147 36436 21574 19099 12754 5375 -4658 -7812 -8266 11922 25242 23815 29239 46764 49818 59213
133 59213 40963 32852 32103 16691 13298 6825 7899 18290 39476 65548 68716 57095 56785 64630
119 64630 47667 29834 31335 30346 20908 25167 42029 55792 49567 46321 18496 12136 17832 18583
105 18583 11916 -12075 -21321 -13872 199 -13360 -11315 1480 12189 22461 -364 -4245 -3073
92 -3073 -13330 -4898 -6940 -7781 5734 -1857 17604 15777 22066 33855 19227 13870 34118 38444
78 38444 30047 24473 47901 86055 84489 63025 38462 25603 24736 23023 33400 36035 29016 22695
64 22695 27781 21386 36758 41983 43878 33356 44478 59657 47829 33236 29580 30611 31947 15174
50 15174 17320 43793 42646 37427 51233 44852 24471 28021 21518 10238 29500 33167 21362 18773
36 18773 30572 49738 43614 17547 -4336 -4301 1929 20089 20218 5587 -16351 1475 -975 -33790
22 -33790 -4235 11034 4340 12764 23974 20782 7009 2304 7900 15541 23293 51054 57251 66913
8 66913 81766 87312 76462 43643 42133 45951 40994 52553
0 52553
$$ Imaginary data points
##PAGE= N=2
##DATA TABLE= (X++(I..I)), XYDATA
32767 64542 77639 101370 133078 133324 128545 138542 151058 158604 146045 130628 125117 128167 129533
32754 129533 135202 134649 133917 167283 175264 160257 147482 139456 134199 112299 95413 109588 139021
32741 139021 155461 159895 168595 154953 152473 163726 166672 163402 172168 170874 167174 179084 191420
32728 191420 201416 211308 215087 199124 200518 188432 174879 182373 174566 175081 207361 203445 201793
32715 201793 217726 226803 244772 221894 209179 215595 214581 216388 235753 248654 256681 235369
32703 235369 228071 232282 246819 237206 222381 208591 224254 233856 234911 246671 253827 253017 251849
$$ [...]
##END NTUPLES=NMR SPECTRUM
##END=
