##TITLE=Analysis number 318647
Compound Code cc 56001
Book Reference 440/170
Project Code adrs
Chemist Name craigr
##JCAMPDX= 6.0         $$ Bruker NMR JCAMP-DX V2.0
##DATA TYPE= NMR SPECTRUM
##DATA CLASS= NTUPLES
##ORIGIN= Bruker BioSpin GmbH
##OWNER= nmr
$$ XWIN-NMR		Version 3.5
$$ Fri Apr  7 08:19:59 2006 GMT Daylight Time (UT+1h)  MAYBRIDGE\nmr@NMR_250MHZ
##.OBSERVE FREQUENCY= 250.131544655141
##.OBSERVE NUCLEUS= ^1H
##.ACQUISITION MODE= SIMULTANEOUS (DQD)
##.ACQUISITION SCHEME= undefined
##.AVERAGES= 16
##.DIGITISER RES= 18
##SPECTROMETER/DATA SYSTEM= dpx250
##.PULSE SEQUENCE= zg30
##.SOLVENT NAME= DMSO
##.SHIFT REFERENCE= (INTERNAL, DMSO, 0, 16.522)
##AUDIT TRAIL= $$ (NUMBER, WHEN, WHO, WHERE, WHAT)
$$ ##TITLE= Audit trail, XWIN-NMR		Version 3.5
$$ ##JCAMPDX= 5.01
$$ ##ORIGIN= Bruker BioSpin GmbH
$$ ##OWNER= nmr
$$ C:\u/data/dgb/nmr/ADRS/2310/pdata/1/auditp.txt
$$ ##AUDIT TRAIL=  $$ (NUMBER, WHEN, WHO, WHERE, WHAT)
(   1,<2006-04-07 08:19:39.50 +100>,<MAYBRIDGE\nmr>,<NMR_250MHZ>,
      <created by zg, POWCHK disabled, PULCHK disabled
       configuration hash MD5:
       84 BC 41 DB A1 6E 1D 46 DA 25 12 A5 C1 ED C5 3A
       data hash MD5: 64K
       09 41 92 7B 7A 6D 83 7D 8A 76 CE 98 F8 BC E8 B7>)
(   2,<2006-04-07 08:19:51.29 +100>,<MAYBRIDGE\nmr>,<NMR_250MHZ>,
      <Start of raw data processing
       ef LB = 0.3 FT_mod = 6 PKNL = 1 SI = 32K 
       data hash MD5: 32K
       F9 7D 83 CA 7D AD 5B C4 FB AD A6 34 EE B6 BA 2B>)
(   3,<2006-04-07 08:19:53.01 +100>,<MAYBRIDGE\nmr>,<NMR_250MHZ>,
      <apk 
       data hash MD5: 32K
       B0 58 C1 30 80 D9 19 D3 0C C9 9C 75 F1 72 DD B5>)
(   4,<2006-04-07 08:19:53.72 +100>,<MAYBRIDGE\nmr>,<NMR_250MHZ>,
      <abs ABSG = 5 
       data hash MD5: 32K
       D5 99 AD AD 07 6C 48 EB FB EE FD 43 A0 3F 78 DE>)
$$ ##END=
$$ 
$$ hash MD5
$$ 9B A0 DB 10 25 83 AF 85 C6 B5 02 27 34 5B 0A 87
##$RELAX= 
##$RELAX= 
##$RELAX= 
##$RELAX= 
##$RELAX= 
##$RELAX= 
##$RELAX= 
$$ Bruker specific parameters
$$ --------------------------
##$DU= <C:\u>
##$EXPNO= 2310
##$NAME= <ADRS>
##$PROCNO= 1
##$TYPE= <nmr>
##$USER= <dgb>
##$AMP= (0..31)
100 100 100 100 100 100 100 100 100 100 100 100 100 100 100 100 100 100 
100 100 100 100 100 100 100 100 100 100 100 100 100 100 
##$AQSEQ= 0
##$AQ_mod= 3
##$AUNM= <au_zg>
##$AUTOPOS= <44 >
##$BF1= 250.13
##$BF2= 250.13
##$BF3= 250.13
##$BF4= 250.13
##$BF5= 500.13
##$BF6= 500.13
##$BF7= 500.13
##$BF8= 500.13
##$BYTORDA= 1
##$CFDGTYP= 0
##$CFRGTYP= 5
##$CHEMSTR= <none>
##$CNST= (0..31)
1 1 145 1 1 1 1 1 1 1 1 1 1 1 1 1 1 1 1 1 1 1 1 1 1 1 1 1 1 1 1 1 
##$CPDPRG= <>
##$CPDPRG1= <>
##$CPDPRG2= <>
##$CPDPRG3= <>
##$CPDPRG4= <mlev>
##$CPDPRG5= <mlev>
##$CPDPRG6= <mlev>
##$CPDPRG7= <mlev>
##$CPDPRG8= <mlev>
##$CPDPRGB= <>
##$CPDPRGT= <>
##$D= (0..31)
0 1 0 0 0 0 0 0 0 0.06 0 0 0 0 0 0 0.0002 0 0 0 0 0 0 0 0 0 0 0 0 0 0 
0 
##$DATE= 1144394378
##$DBL= (0..7)
120 120 120 120 120 120 120 120 
##$DBP= (0..7)
150 150 150 150 150 150 150 150 
##$DBP07= 0
##$DBPNAM0= <>
##$DBPNAM1= <>
$$ [...]
##$SUBNAM7= <"">
##$SUBNAM8= <"">
##$SUBNAM9= <"">
##$SW= 20.6930455092707
##$SWIBOX= (0..15)
0 0 3 0 0 0 0 0 0 0 0 0 0 0 0 0 
##$SW_h= 5175.983436853
##$TD= 65536
##$TD0= 1
##$TE= 294.16
##$TE2= 300
##$TE3= 300
##$TEG= 300
##$TL= (0..7)
0 120 120 120 120 120 120 120 
##$TP= (0..7)
150 150 150 150 150 150 150 150 
##$TP07= 0
##$TPNAME0= <>
##$TPNAME1= <>
##$TPNAME2= <>
##$TPNAME3= <>
##$TPNAME4= <>
##$TPNAME5= <>
##$TPNAME6= <>
##$TPNAME7= <>
##$TPOAL= (0..7)
0.5 0.5 0.5 0.5 0.5 0.5 0.5 0.5 
##$TPOFFS= (0..7)
0 0 0 0 0 0 0 0 
##$TUNHIN= 0
##$TUNHOUT= 0
##$TUNXOUT= 0
##$USERA1= <user>
##$USERA2= <user>
##$USERA3= <user>
##$USERA4= <user>
##$USERA5= <user>
##$V9= 5
##$VALIST= <valist>
##$VCLIST= <CCCCCCCCCCCCCCC>
##$VD= 0
##$VDLIST= <DDDDDDDDDDDDDDD>
##$VPLIST= <PPPPPPPPPPPPPPP>
##$VTLIST= <TTTTTTTTTTTTTTT>
##$WBST= 1024
##$WBSW= 4
##$XGAIN= (0..3)
0 0 0 0 
##$XL= 0
##$YL= 0
##$YMAX_a= 268051
##$YMIN_a= -462467
##$ZGOPTNS= <>
##$ZL1= 120
##$ZL2= 120
##$ZL3= 120
##$ZL4= 120
##$ABSF1= 16.522
##$ABSF2= -4.171173
##$ABSG= 5
##$ABSL= 3
##$ALPHA= 0
##$AQORDER= 0
##$ASSFAC= 0
##$ASSFACI= 0
##$ASSFACX= 0
##$ASSWID= 0
##$AUNMP= <proc_1d>
##$AZFE= 0.1
##$AZFW= 0.1
##$BCFW= 0
##$BC_mod= 0
##$BYTORDP= 0
##$COROFFS= 0
##$CY= 12.5
##$DATMOD= 1
##$DC= 0
##$DFILT= <>
##$DTYPP= 0
##$F1P= 14.0000005364418
##$F2P= -0.99999901652339
##$FCOR= 0.5
##$FTSIZE= 32768
##$FT_mod= 6
##$GAMMA= 0
##$GB= 0
##$INTBC= 1
##$INTSCL= 1
##$ISEN= 128
##$LB= 0.3
##$LEV0= 0
##$LPBIN= 0
##$MAXI= 10000
##$MC2= 0
##$MEAN= 0
##$ME_mod= 0
##$MI= 0
##$NCOEF= 0
##$NC_proc= -5
##$NLEV= 6
##$NOISF1= 0
##$NOISF2= 0
##$NSP= 0
##$NTH_PI= 0
##$NZP= 0
##$OFFSET= 16.522
##$PC= 1
##$PHC0= 159.8311
##$PHC1= 18.10454
##$PH_mod= 1
##$PKNL= yes
##$PPARMOD= 0
##$PSCAL= 4
##$PSIGN= 0
##$REVERSE= no
##$SF= 250.13
##$SI= 32768
##$SIGF1= 0
##$SIGF2= 0
##$SINO= 400
##$SIOLD= 32768
##$SREGLST= <1H.DMSO>
##$SSB= 0
##$STSI= 32768
##$STSR= 0
##$SW_p= 5175.98343685301
##$SYMM= 0
##$S_DEV= 0
##$TDeff= 65536
##$TDoff= 0
##$TI= <Analysis number 999999
Compound Code 99
Book Reference 9
Project Code 9>
##$TILT= no
##$TM1= 0
##$TM2= 0
##$TOPLEV= 0
##$USERP1= <user>
##$USERP2= <user>
##$USERP3= <user>
##$USERP4= <user>
##$USERP5= <user>
##$WDW= 1
##$XDIM= 32768
##$YMAX_p= 411688482
##$YMIN_p= -898830
$$ End of Bruker specific parameters
$$ ---------------------------------
##NTUPLES= NMR SPECTRUM
##VAR_NAME=  FREQUENCY,     SPECTRUM/REAL,   SPECTRUM/IMAG
##SYMBOL=    X,             R,               I
##VAR_TYPE=  INDEPENDENT,   DEPENDENT,       DEPENDENT
##VAR_FORM=  AFFN,          ASDF,            ASDF
##VAR_DIM=   32768,         32768,           32768
##UNITS=     HZ,            ARBITRARY UNITS, ARBITRARY UNITS
##FACTOR=    0.157963299565203, 1,           1
##FIRST=     4132.6476996994, 0,             0
##LAST=      -1043.33573715361, 0,           0
##MIN=       -1043.33573715361, -898830,     0
##MAX=       4132.6476996994, 411688482,     0
$$ Real data points
##PAGE= N=1
##DATA TABLE= (X++(R..R)), XYDATA
$$ [...]
20139A53476q6819m6822N5013O5884J3733N3516O0759q465J22940p0430p4482
$$ 153476 66657 19835 74848 140732 154465 207981 268740 260275 383215 312785 238303
20128B38303j38047j80192m1432J3735k2932J7955R6034J43805J06126j31077
$$ 238303 100256 -79936 -121368 -107633 -130565 -112610 -16576 127229 233355 102278
20118A02278p3635j90355K4703L31130P4208q7055j67607o002k6398j81870N34
$$ 102278 28643 -161712 -137009 194121 268329 181274 13667 7665 -18733 -200603 -200069
20107b00069R0986q8271q883Q6252O9726K23161j3295j10390M6380J58171J9796
$$ -200069 -109083 -197354 -206237 -119985 -50259 172902 159607 49217 95597 253768 273564
20096B73564k95263k52793P5489Q5373J73956K02673L4099j10143l0058J79446
$$ 273564 -21699 -274492 -199003 -113630 60326 262999 297098 186955 156897 336343
20086C36343J39150l24164j89099j709J93747J64775j36515L0994J36134j34331
$$ 336343 475493 151329 -37770 -39479 154268 319043 182528 213522 349656 215325
20076B15325m1947k5889j167j21519M3464J29091J27741j7435j62789J3856l9743
$$ 215325 173378 147489 146322 24803 68267 197358 325099 307664 144875 158731 118988
20065A18988j48938p8356j03577J29031K58340J02741j71431j55711k56270Q7139
$$ 118988 -29950 -108306 -211883 -82852 175488 278229 106798 -48913 -305183 -218044
20055b18044J35952L3260J0265K11528m0490j08506Q1766K1500O262r719l3536
$$ -218044 -82092 -48832 -38567 172961 132471 23965 105731 127231 133493 123774 90238
20044I0238o918o3984m7301L0591m7298r0351J32599O4763r5168J85281K6704
$$ 90238 83320 19336 -27965 2626 -44672 -135023 -2424 62339 -32829 152452 179156
20033A79156p7020j3982j30772O3911j65085k20912R5066P7764K20663R9534J21654
$$ 179156 102136 88154 -42618 21293 -143792 -364704 -269638 -191874 28789 128323 249977
20022B49977j60637k42855J49149J68825R4835L4894j44465k09186J41797J8424
$$ 249977 89340 -153515 -4366 164459 259294 294188 149723 -59463 82334 100758
20012A00758j23861O6547K14486j2324j33448l24589p5902M1918M4713P7420r8912
$$ 100758 -23103 43444 257930 245606 112158 -212431 -288333 -246415 -201702 -124282 -223194
20001b23194J71923Q9178O2894J87120m9380O3311o766M6219M3666N960J31329
$$ -223194 -51271 37907 100801 287921 238541 301852 295086 341305 384971 390931 522260
19990E22260j59634l33685q9371k5928j02656L34164O3438k39680m9422M3977
$$ 522260 362626 28941 -60430 -86358 -189014 145150 208588 -31092 -80514 -36537
19980c6537J00965r458m7465j93892j8428M9542N0250K69078o9007j37937P4021
$$ -36537 64428 54970 7505 -186387 -204815 -155273 -105023 164055 95048 -42889 31132
19969C1132R8963J43235M0168Q7289n2075r6678k1807r0088R7992J59086p5255
$$ 31132 130095 273330 313498 400787 348712 252034 230227 140139 238131 397217 321962
19958C21962l1172Q8732l6482M2229m4368J06331p711k11350j68093L1920J98551
$$ 321962 290790 379522 343040 385269 340901 447232 439521 228171 60078 91998 290549
19947B90549J79896M8325J645N2657o570k31111j69666j46030l8885R7639Q8114
$$ 290549 470445 518770 520415 573072 566502 335391 165725 19695 -19190 78449 166563
19936A66563p3374j2127J32895K85308N0707k04109k42838j21841k6773K28543
$$ 166563 93189 81062 213957 499265 549972 345863 103025 -18816 -45589 182954
19926A82954Q2078Q5663R1393j44090k37553N768Q0128r4206k67771J81187J75173
$$ 182954 265032 350695 442088 297998 60445 66213 146341 52135 -215636 -34449 140724
19915A40724o8148j1542o8380K7298k8931k5045j13938J25100J00331K03655M2871
$$ 140724 72576 61034 -7346 19952 -8979 -34024 -147962 -22862 77469 281124 323995
19904C23995j68988K6363o8394J258J42848r461o6737j67530Q7449J49611J02211
$$ 323995 155007 181370 112976 114234 257082 247621 180884 13354 100803 250414 352625
19893C52625r5803J1715M4529j27049r1744P49j17844r8234P9175J44541J32586
$$ 352625 256822 268537 313066 186017 94273 95022 -22822 -121056 -41881 102660 235246
19882B35246n2209l0626j66604J56935L4883p6661P5094L4926k7295q5131j6481
$$ 235246 183037 152411 -14193 142742 177625 100964 176058 210984 183689 98558 82077
19871H2077J87199J06323o837P3144j59928J06921n7930r3315o7J30956J2986
$$ 82077 269276 375599 368762 441906 281978 388899 330969 237654 237587 368543 381529
19860C81529J73881n3578j5662j5647K3746q0178k6533k334r4000k04934j44555
$$ 381529 555410 501832 486170 470523 494269 414091 387558 385224 291224 86290 -58265
19849e8265J84634J43558M7831q4496K306J28470Q1965m4072j02960j22137j77604
$$ -58265 126369 269927 317758 233262 235568 364038 446003 401931 298971 176834 -770
19838g70j79366K0480L85900J18115j9986m6859m5032J12644k5403o5956j9935
$$ -770 -180136 -159656 226244 344359 324373 277514 232482 345126 319723 253767 233832
19827B33832j55814m1704l8547J75420J9069N0253R1954j07616N2858l7001j2662
$$ 233832 78018 36314 -2233 173187 192256 242509 334463 226847 279705 242704 230042
19816B30042j8239J88524n9529k59391J25701M2795m2629l5561M537J43256K56300
$$ 230042 211803 400327 340798 81407 207108 249903 207274 171713 176250 319506 575806
19805E75806J01040o3065j20919l75735k30297R6587L03629j9447r7936R877M7337
$$ 575806 676846 613781 492862 117127 -113170 -16583 287046 267599 169663 179540 226877
19794B26877j4929j66174Q0751L9376O4543N5583j25475j2610o177r8797j64507
$$ 226877 211948 45774 126525 165901 230444 286027 160552 147942 141765 42968 -121539
19783a21539J75430L42893o9074o2542l2590N6840P5166k9209o1846N3731N1852
$$ -121539 53891 396784 327710 265168 232578 289418 364584 335375 273529 327260 379112
19772C79112N8940o4495Q2764N2736q2148o1040m6132o7567p832m91K0876K5359
$$ 379112 438052 373557 456321 509057 426909 365869 319737 252170 244338 243847 264723 290082
19760B90082J59175R2185p5435k22310J16512J01065P7224r2365o6854j79431
$$ 290082 449257 541442 466007 243697 360209 461274 538498 446133 379279 199848
19750A99848o5231k2173J21867J48600P5446M5335k10819L432K44908k7871k63868
$$ 199848 134617 112444 234311 382911 458357 503692 292873 296305 541213 513342 249474
19739B49474q9237L8723Q7473P9553o214L4295p1865J18741J69865n4230q7810
$$ 249474 160237 198960 286433 365986 359772 394067 322202 440943 610808 556578 468768
19728D68768j84593J2000r4976J6054R5395j00046r4981o122r6849j60848n1871
$$ 468768 284175 296175 201199 217253 312648 212602 117621 111499 14650 -146198 -198069
19717a98069J58543p8835J41154K29174M0265j70464M9767K04426J319m9961N9419
$$ -198069 -39526 -118361 22793 251967 292232 121768 171535 375961 377280 327319 386738
19706C86738k5324K32806M2575k10253l57249q3053j01850J07703J53936J31580
$$ 386738 361414 594220 636795 426542 69293 -13760 -115610 -7907 146029 277609
19696B77609J73249n1759P5237q8815J5579K39212j57730j8502M0247L1412l7686
$$ 277609 450858 399099 474336 385521 401100 640312 482582 464080 504327 535739 498053
19685D98053K88732K21624J05580L43365J07615J6080j46381K6350J14975k74973
$$ 498053 786785 1008409 1113989 1457354 1564969 1581049 1434668 1461018 1575993 1301020
19675A301020l06791m0941Q0897j05687j3107K20684J97664J65666K2244O506
$$ 1301020 994229 953288 1034185 928498 915391 1136075 1333739 1499405 1521649 1528155
19665A528155K92410K9547j69659L9134j02301k77531j26064J072k20218j54179
$$ 1528155 1820565 1850112 1680453 1719587 1617286 1339755 1213691 1214763 994545 840366
19655H40366k9417L6316R010p5967n9317O0498k0478l7837J66494L9663P0416
$$ 840366 810949 847265 856275 780308 720991 781489 761011 723174 889668 929331 999747
19644I99747p5841O2998Q424k8644K64176j61675j66131l2323r982n480q0125
$$ 999747 923906 986904 995328 966684 1230860 1069185 903054 870731 860749 855269 775144
19633G75144J48437n4602j67247m2385J01568J57085j83344P2486L65334r49j89928
$$ 775144 923581 868979 701732 659347 760915 918000 734656 807142 1172476 1171527 981599
19622I81599J36455K50561j51810j85747P5449P5189k76711P6683J70961k35009
$$ 981599 1118054 1368615 1216805 1031058 1106507 1181696 904985 981668 1152629 917620
19612I17620j82751p2897j32384k28582n5759J9375P861J07448o9536P029j7023
$$ 917620 734869 661972 529588 301006 245247 264622 272483 379931 310395 317424 300401
19601C00401j271L6837j07898O0379m2509N5746M2110r066O147J09766j0771q4957
$$ 300401 299130 335967 228069 288448 245939 301685 343795 334729 340876 450642 439871 354914
19589C54914p4239R4942M6561l61j82257J37937Q6691n0906J03573J68483Q2892
$$ 354914 280675 375617 422178 421817 239560 377497 464188 413282 516855 685338 768230
19578G68230k55264L9637P1368o2251k1069K8290r5761m3346l9552J47197l0110
$$ 768230 512966 552603 623971 561720 540651 568941 473180 429834 390282 537479 507369
19567E07369j01569l7708P5586J22852k35003n2511J95639J88237j80766j13871
$$ 507369 405800 368092 443678 566530 331527 279016 474655 662892 482126 368255
19557C68255L6786k06961j06389L5310J307K39266M8237j86585r1620M8526J23795
$$ 368255 405041 198080 91691 127001 128308 367574 415811 229226 137606 186132 309927
19546C09927j14416k07924q9122J28616K59844J54809N4201j8091J53578K4760
$$ 309927 195511 -12413 -101535 27081 286925 441734 495935 477844 631422 656182
19536F56182r0151j43419N1830K51114N3551k72047j25377J73696J86347q2008
$$ 656182 566031 422612 474442 725556 779107 507060 381683 555379 741726 659718
19526F59718j02640k0422R001j07745J40568J85589J08572q5122k04528q6711
$$ 659718 557078 536656 545657 437912 578480 764069 872641 787519 582991 496280
19516D96280j35052j51749o2194k923p4571K45781J10774k19603N1603J24206
$$ 496280 361228 209479 147285 144362 69791 315572 426346 206743 258346 382552
19506C82552K7073q8017r3168l9169j54493k41983J52305K26001R362p0048k1829
$$ 382552 409625 321608 228440 189271 34778 -207205 -54900 171101 180463 110415 88586
19495H8586J19172N6577k3370L2383R6134L02224J0286k04079p1443n5294J56417
$$ 88586 207758 264335 240965 273348 369482 671706 681992 477913 406470 351176 507593
19484E07593J52765j44645M2863M1420N5431J93265q5819j78671j6626q8572p8142
$$ 507593 660358 515713 558576 599996 655427 848692 762873 584202 567576 479004 400862
19473D00862k61166N5286L63775l5738N2591J10627j22766p5377j55271j70500
$$ 400862 139696 194982 558757 523019 575610 686237 563471 488094 332823 162323
19463A62323N0774J38491J29534j95495K65942L621M2647J27330Q6661L839J21116
$$ 162323 213097 351588 481122 285627 551569 555190 597837 725167 811828 815667 936783
19452I36783p6968l3591j52449m6405j19104J141J31466l1019j32152K6936J73982
$$ 936783 859815 826224 673775 627370 508266 509407 640873 609854 477702 504638 678620
19441F78620L0247q8953N3568J84412n3773j92907j36725j0082J45584J61845
$$ 678620 708867 619914 673482 857894 804121 611214 474489 464407 609991 771836
19431G71836N0502K47192j90761k29189J1663j06417J5468J58777K37459l2815
$$ 771836 822338 1069530 878769 649580 661243 554826 570294 729071 966530 933715
19421I33715k12401P2629j05847K9500N6629n6409k70311R7892L54100O4080j09423
$$ 933715 721314 793943 688096 717596 774225 717816 447505 545397 899497 963577 854154
19410H54154j96273n1972p8059J75386N4694O6124k25716q986P8116j02672j11231
$$ 854154 657881 605909 527850 703236 757930 824054 598338 589352 667468 564796 453565
19399D53565K22329K21879o562k19956k9971J28207r5720P9831r3472j29018K00482
$$ 453565 675894 897773 891211 671255 641284 769491 673771 753602 660130 531112 731594
19388G31594J41628j4321k32306k26145r9866J22712k2207L1219J67306L05061
$$ 731594 873222 858901 626595 400450 300584 423296 401089 432308 599614 904675
19378I04675O0808M5134p6216J73566Q0436j11948j64156j79889m205n3603M2517
$$ 904675 965483 1010617 934401 1107967 1188403 1076455 912299 732410 728205 674602 717119
19367G17119J53697J6122o7812n0834P3099q174J09532J70007J56281M1505J34161
$$ 717119 870816 886938 819126 768292 841391 833217 942749 1112756 1269037 1310542 1444703
19356A444703q6805r5316M9444j79673j91490q3306Q8033R9885j1230M1121j35341
$$ 1444703 1357898 1262582 1312026 1132353 940863 857557 945590 1045475 1034245 1075366 940025
19345I40025o8987O8869L0919K6896j32105Q7250J60497j078k62016l8988j34731
$$ 940025 871038 939907 970826 997722 865617 952867 1113364 1112286 850270 811282 676551
19334F76551L3967m317J33673L19744L1933j90573r776k1763J07953q3679M8194
$$ 676551 710518 706201 839874 1159618 1191551 1000978 991202 969439 1077392 993713 1041907
19323A041907R6476j61924j20728j14955J76524J15281K36333O0601r3159M3776
$$ 1041907 1138383 976459 855731 740776 917300 1032581 1268914 1329515 1236356 1280132
19313A280132J20483J5986O96j55856j8246O6291M3938J3759J31678l8334r3291
$$ 1280132 1400615 1416601 1417297 1261441 1243195 1309486 1353424 1367183 1498861 1460527 1367236
19302A367236M1396J90835J40431j4500k23664K352J53859J93491J07790n9953
$$ 1367236 1408632 1599467 1739898 1725398 1501734 1504086 1657945 1851436 1959226 1899273
19292A899273k18419J26048R0297k6486J83453n6065j39696Q5741J56479j46640
$$ 1899273 1680854 1806902 1897199 1870713 2054166 1998101 1858405 1944146 2100625 1953985
19282A953985o6072n2825O1297J49545l8704j08791K5339J36828j79045j18487
$$ 1953985 1887913 1835088 1896385 2045930 2007226 1898435 1923774 2060602 1881557 1763070
19272A763070j34798J4336P7260L102K08230K80407j20131K1756l0192J6409Q8245
$$ 1763070 1628272 1642608 1719868 1722970 1931200 2211607 2091476 2113232 2083040 2099449 2187694
19261B187694j5720K03386R703j92307r4619P3421J8063N5353J20007J43315N7582
$$ 2187694 2171974 2375360 2385063 2192756 2098137 2171558 2189621 2244974 2364981 2508296 2565878
19250B565878j65448k18022k0394J10576L4105N6372J61328P637K7058K55173
$$ 2565878 2400430 2182408 2162014 2272590 2306695 2363067 2524395 2532032 2559090 2814263
19240B814263L33713J34863l8963j12604n4313m8151N8155K82906P7394J1221
$$ 2814263 3147976 3282839 3243876 3131272 3076959 3028808 3086963 3369869 3447263 3458484
19230C458484k70025k26630O6916J4359j7758J88014p1010O5137O5212L7643J16660
$$ 3458484 3188459 2961829 3028745 3043104 3025346 3213360 3142350 3207487 3272699 3310342 3427002
19219C427002J78522R5055m4017K36650M1911k4271n4883J05039J52760J50930
$$ 3427002 3605524 3700579 3656562 3893212 3935123 3910852 3855969 3961008 4113768 4264698
19209D264698K62861J89130O9184J23625j34500j02153L04979J45946K34567K30344
$$ 4264698 4527559 4716689 4785873 4909498 4774998 4672845 4977824 5123770 5358337 5588681
19199E588681R1693J04100J31062J82062J61791L34318M44168K85452K45052N18939
$$ 5588681 5680374 5784474 5915536 6097598 6259389 6593707 7037875 7323327 7568379 8087318
19189H087318O33225M78947L39072L96656N39965R14669J228042R82496J530262
$$ 8087318 8720543 9199490 9538562 9935218 10475183 11389852 12617894 13600390 15130652
19180A5130652J957673K774726L525389L982370L942889L957818L561141L147490
$$ 15130652 17088325 19863051 23388440 27370810 31313699 35271517 38832658 41980148
19172D1980148K924670L010873M807295Q450631J3572995J9609544K4796338K7414549
$$ 41980148 44904818 47915691 52722986 61173617 74746612 94356156 119152494 146567043
19164A46567043K5964291K2444913J7252645N457669j0260828j8296342j9855284
$$ 146567043 172531334 194976247 212228892 217686561 207425733 189129391 169274107
19157A69274107k1039683k0121251j5567542r955303n061375k225840j902513
$$ 169274107 148234424 128113173 112545631 102590328 97528953 95303113 93400600
19150I3400600k633931m389290p354743r245090r255176p885322n861475m330039
$$ 93400600 90766669 86377379 79022636 69777546 60522370 52637048 46775573 42445534
19142D2445534k906981k020882j539840j167920m83387k44102l48637m02272l9567
$$ 42445534 39538553 37517671 35977831 34809911 34326524 34082422 33733785 33331513 33291946
19133C3291946J17387J23393M72928J158276K079152K984983M088966N848226
$$ 33291946 33409333 33532726 34005654 35163930 37243082 40228065 44317031 50165257
19125E0165257P680110Q914547Q866981P941793O901884M920162L179430K625334
$$ 50165257 57845367 66759914 75626895 83568688 90470572 95390734 98570164 101195498
19117A01195498N234904J0616610J7154891K2615095K6051892K8034232K5675558
$$ 101195498 106430402 117047012 134201903 156816998 182868890 210903122 236578680
19110B36578680J4698931R13014p833756j7578173k9684894l3762985k9422431
$$ 236578680 251277611 252190625 244356869 226778696 197093802 163330817 133908386
19103A33908386k1587795j3904303p893837m040887j921951r19296j35918L87386
$$ 133908386 112320591 98416288 90522451 86481564 84559613 83640317 83504399 83891785
19095H3891785Q64298L285262P921259J3361573J5186917J3851692J5597174J7550057
$$ 83891785 84756083 88041345 95962604 109324177 124511094 138362786 153959960 171510017
19087A71510017R025165n015919r877627o120676o160692j6111456j9269956j1845869
$$ 171510017 180535182 175519263 165641636 159520960 153360268 137248812 117978856 106132987
19079A06132987j356579Q049121J3449874J3017716J3357998J6127518J2122363
$$ 106132987 104776408 112825529 126275403 139293119 152651117 168778635 180900998
19072A80900998k760677j1840646j0455348p840100j5469815k4018874k2110389
$$ 180900998 178140321 166299675 155844327 148004227 132534412 108515538 86405149
19065H6405149j5716668j0163890o643943m664259l584317k802324j957222k154410
$$ 86405149 70688481 60524591 53880648 49216389 45632072 42829748 40872526 38718116
19057C8718116j895582j463218j527432j334469j201723j192942r10729p17523
$$ 38718116 36822534 35359316 33831884 32497415 31295692 30102750 29192021 28474498
19049B8474498o86949p51939q87040n60270m84285n06922m40704p23624q12338
$$ 28474498 27787549 27035610 26148570 25588300 25104015 24597093 24156389 23432765 22620427
19040B2620427l68925k60698m81006o90707n09181n69815o11879m61767l67540
$$ 22620427 22251502 21990804 21509798 20819091 20309910 19740095 19128216 18666449 18298909
19031A8298909m41161l81837l86490l26736m90826o89100l70079l04751n21410
$$ 18298909 17857748 17475911 17089421 16762685 16271859 15582759 15212680 14907929 14386519
19022A4386519j25402k33376m59428l26751m05003l26632m57650k82706j28082
$$ 14386519 14261117 14027741 13568313 13241562 12836559 12509927 12052277 11769571 11641489
19013A1641489q8569l70629j25254k33667j12139r5513m19458k71319l52812m5247
$$ 11641489 11552920 11182291 11057037 10823370 10711231 10615718 10196260 9924941 9572129 9526882
19003I526882k29089l41153P2584K09515j55401j72558k26768k02845r4062M6224
$$ 9526882 9297793 8956640 9029224 9238739 9083338 8910780 8684012 8481167 8387105 8433329
18993H433329j13709l38166p1340M2270n7466j01780l0922J37742j88043j92581
$$ 8433329 8319620 7981454 7910114 7952384 7894918 7793138 7762216 7899958 7711915 7519334
18983G519334j68934q766q3292p5667j10608l08432k88900J6867j69052k49074
$$ 7519334 7350400 7341634 7258342 7182675 7072067 6763635 6474735 6491602 6322550 6073476
18973F073476j23945j32881O8985k20599k55750K4661K28312j4213k85903k6628
$$ 6073476 5949531 5816650 5885635 5665036 5409286 5433947 5662259 5648046 5362143 5335515
18963E335515m6284j69990o014J02832P7138N9985k9656j06349j18165o0643j11477
$$ 5335515 5289231 5119241 5113227 5216059 5293197 5353182 5323526 5217177 5099012 5038369 4926892
18952D926892j16550J15459L4023j0112j07001j92370j9560n1649j28645r9031
$$ 4926892 4810342 4925801 4959824 4949712 4842711 4650341 4630781 4579132 4450487 4351456
18942D351456k01238r6600J58729P0108k09831l41730j70250P2926J45124J8882
$$ 4351456 4150218 4053618 4212347 4282455 4072624 3730894 3560644 3633570 3778694 3797576
18932C797576r9345q7393j31226k52957J18184K6589j89859k33863J3685N0119
$$ 3797576 3698231 3610838 3479612 3226655 3344839 3371428 3181569 2947706 2961391 3011510
18922C011510j81804k45715O9569L1446n0255j11199n9993q7473o872O7319K2052
$$ 3011510 2829706 2583991 2653560 2685006 2634751 2523552 2463559 2376086 2369214 2436533 2458585
18911B458585r3944j70028n2651j6048j73600o5556J7507n5272L9859K0985J49269
$$ 2458585 2364641 2194613 2141962 2125914 1952314 1886758 1904265 1848993 1888852 1909837 2059106
18900B059106K3333k81246O6890J44654J1449o4196Q4061k12202K0581p3969r6860
$$ 2059106 2082439 1801193 1868083 2012737 2024186 1959990 2044051 1831849 1852430 1778461 1681601
18889A681601J8672J21225L8637m8124j38131k7046j3420j2797l13515j30422
$$ 1681601 1700273 1821498 1860135 1812011 1673880 1646834 1633414 1620617 1307102 1176680
18879A176680k5417Q7514j55507J30066M5259o8637n0142j12483j7709l6204m4867
$$ 1176680 1151263 1238777 1083270 1213336 1258595 1189958 1139816 1027333 1009624 973420 928553
18868I28553k6759J60792O3165r778m6511J31533j5762m7150j4573Q8333J19046
$$ 928553 901794 1062586 1125751 1115973 1069462 1200995 1185233 1138083 1123510 1211843 1330889
18857A330889m3379j14327n5927q71j84202r5683R2412q4520j0153m0455K5159
$$ 1330889 1287510 1173183 1117256 1116385 932183 836500 928912 844392 834239 793784 818943
18846H18943N5036Q4565J4374L3049K0084p3429m4376L6074P6911J78987j6691
$$ 818943 873979 958544 972918 1005967 1026051 952622 908246 944320 1021231 1200218 1183527
18835A183527j28633j12394O6905P3918N5891N1706j46909j41721p8160p6307
$$ 1183527 1054894 942500 1009405 1083323 1139214 1190920 1044011 902290 824130 747823
18825G47823j13613O0098Q0311j26024N2687J51824K6343j38952q8720R5238J42970
$$ 747823 634210 694308 774619 648595 701282 853106 879449 740497 651777 747015 889985
18814H89985j00805l0168M0552l94Q4723J21801j64216k58443J7395J78586J94911
$$ 889985 789180 759012 799564 799170 883893 1005694 841478 583035 600430 779016 973927
18803I73927r0721J9365J39213k11479j97672n8841J88124K41769N739k47474
$$ 973927 883206 902571 1041784 830305 632633 573792 761916 1003685 1009424 761950
18793G61950l2341q623l1793J73513j86726l39781O288J3753j5114L7761q3173
$$ 761950 729609 720986 689193 862706 675980 336199 342487 356240 341126 378887 295714
18782B95714J5035J82874K9083n1233p7523J46070q7086q0881K7551Q8894m2057
$$ 295714 310749 493623 522706 471473 393950 540020 452934 372053 399604 488498 446441
18771D46441J3108J01300j9728M1070J16456j74980K5763p3990j4019k1934M1597
$$ 446441 459549 560849 541121 582191 698647 523667 549430 475440 461421 439487 481084
18760D81084R7590j56094j83684j2696P7071P3483P5056J16516j38104J22340
$$ 481084 578674 422580 238896 226200 303271 376754 451810 568326 430222 552562
18750E52562J38419j98585j64085J59378L2414j76142j32457J30409K15512j0856
$$ 552562 690981 492396 328311 487689 520103 343961 211504 341913 557425 546569
18740E46569l8056K0457j05300P1356j08783j98736J27519Q431k7301K41152K2949
$$ 546569 508513 528970 423670 495026 386243 187507 315026 323457 296156 537308 560257
18729E60257k05713j62496O3059N9708l18866p0249P2742m8750M0099L16485K1187
$$ 560257 354544 192048 255107 314815 -4051 -74300 -1558 -50308 -10209 306276 327463
18718C27463k41751o0398l2412J4864K54625J75809j1998N2775m5034m6859j05506
$$ 327463 85712 25314 -7098 7766 262391 438200 426202 478977 433943 387084 281578
18707B81578m6903P8570M9853J3807J56915k11548k17711q6211J75186K73252
$$ 281578 234675 313245 363098 376905 533820 322272 104561 18350 193536 466788
18697D66788J25965Q8898r7803J47200k8828o4060L9448K635j31682k66034j45968
$$ 466788 592753 681651 583848 731048 702220 638160 677608 680243 548561 282527 136559
18686A36559J16228J3315j26131O3430J02592M4118K9495J28949K10962L90521
$$ 136559 252787 266102 139971 203401 305993 350111 379606 508555 719517 1110038
18676A110038j3678l327M40712L38596j09358j60474R6291l3461j16218m1114
$$ 1110038 1096360 1093033 1533745 1872341 1762983 1602509 1698800 1665339 1549121 1508007
18666A508007J04642J65199K60957J30334R3752N766j83596p0776j12002p7661
$$ 1508007 1612649 1777848 2038805 2169139 2262891 2268657 2085061 2014285 1902283 1824622
18656A824622j05297O40K08662J5342J06573j38975j80446q1467j00570j0111
$$ 1824622 1719325 1719965 1928627 1943969 2050542 1911567 1731121 1649654 1549084 1538973
18646A538973k10249J31831j0508L9006J49392J84720M5246k917j82250j54689
$$ 1538973 1328724 1460555 1450047 1489053 1638445 1823165 1868411 1865494 1683244 1528555
18636A528555M8112R0050j47313J719j90743k4737J04386q3656Q9855J54282j67876
$$ 1528555 1576667 1666717 1519404 1521123 1330380 1305643 1410029 1326373 1416228 1570510 1402634
18625A402634O2192R6949O924p2041K27741P0859K67447J63126j15824N7803j7207
$$ 1402634 1464826 1561775 1568699 1496658 1724399 1795258 2062705 2225831 2110007 2167810 2150603
18614B150603J49829Q255j05926j5657M6355m3011J21747L25553K2836k75133
$$ 2150603 2300432 2308687 2202761 2187104 2233459 2190448 2312195 2637748 2660584 2385451
18604B385451m5987J2792K34098J45551j33881j02622o5005j03181q6185j98776
$$ 2385451 2339464 2352256 2586354 2731905 2598024 2495402 2430397 2327216 2241031 2042255
18594B042255p1097j09866L3233j8293N1288j7107l6245k7834K44204O2742p8705
$$ 2042255 1971158 1861292 1894525 1876232 1927520 1910413 1874168 1846334 2090538 2153280 2074575
18583B074575K18457k2349K3239j50128l77507j32409j27865k8710K38225J1827
$$ 2074575 2293032 2270683 2293922 2143794 1766287 1633878 1506013 1477303 1715528 1727355
18573A727355j0032j33749R4463J07314j59981l3216R4599J00019k15944N900
$$ 1727355 1717323 1583574 1678037 1785351 1625370 1592154 1686753 1786772 1570828 1576728
18563A576728k2638j07511q1634k3442J42425K9809m7860m3988P8277J56333R6657
$$ 1576728 1554090 1446579 1364945 1341503 1483928 1513737 1465877 1421889 1500166 1656499 1753156
18552A753156j24748J392J04481j06258J03664L9691R0968k13093m3097J48660
$$ 1753156 1628408 1629800 1734281 1628023 1731687 1771378 1862346 1649253 1606156 1754816
18542A754816k8164L62684J57783k0182j01456J36418M6806J39320M4000K37192
$$ 1754816 1726652 2089336 2247119 2226937 2125481 2261899 2308705 2448025 2492025 2729217
18532B729217K09704K24095L657j13028P6454N4619L83878K66821L55223L53249
$$ 2729217 2938921 3163016 3166673 3053645 3130099 3184718 3568596 3835417 4190640 4543889
18522D543889P1896Q6782K61777K78380K46872L92941N03766L52287J94327L27351
$$ 4543889 4615785 4702567 4964344 5242724 5489596 5882537 6386303 6738590 6932917 7260268
18512G260268P16788R00221O06838R04904J240110J417893K151321K779061L822813
$$ 7260268 7977056 8877277 9484115 10389019 11629129 13047022 15198343 17977404 21800217
18503B1800217N743335Q665749J3056045J7453873J8309631J5594118J6629481
$$ 21800217 27543552 36209301 49265346 66719219 85028850 100622968 117252449
18496A17252449J9079187J0816711l094413p242640k104940l52410p608173p685429
$$ 117252449 136331636 147148347 144053934 136811294 134706354 134353944 126745771 119060342
18488A19060342P67030N671897P379904J2237270J3535219J709799j0797437j1755803
$$ 119060342 119827372 125499269 132879173 145116443 158651662 160361461 149564024 137808221
18480A37808221p291379j1060921k1097416k2131015j6122787j0334418o903944
$$ 137808221 130516842 119455921 98358505 76227490 60104703 49770285 42866341
18473D2866341m930958l633603k574493j852501j712188j767759j533692j310762
$$ 42866341 37935383 34301780 31727287 29874786 28162598 26394839 24861147 23550385
18465B3550385j201311r02713p75288p68244n43062o54408o14998m16633k99943
$$ 23550385 22349074 21446361 20671073 19902829 19359767 18705359 18090361 17673728 17373785
18456A7373785n73569n39381n90248m59944n64351m22449j86693m68813m68046
$$ 17373785 16800216 16260835 15670587 15210643 14646292 14223843 14037150 13568337 13100291
18447A3100291n63167l69926m20991m12650l52616k16287l23791m12587l50484
$$ 13100291 12537124 12167198 11746207 11333557 10980941 10764654 10440863 10028276 9677792
18438I677792l60418k36274Q5243j71010k75508l17610k99646k53494l07957j30426
$$ 9677792 9317374 9081100 9166343 8995333 8719825 8402215 8102569 7849075 7541118 7410692
18428G410692M0609k924j44596k10908j87399k56210k05467j59429M5204M1995
$$ 7410692 7451301 7448377 7303781 7092873 6905474 6649264 6443797 6284368 6329572 6371567
18418F371567q7247r7653l6391m5585j55667k20185j77478j55950j43418p433
$$ 6371567 6284320 6186667 6150276 6104691 5949024 5728839 5551361 5395411 5251993 5244560
18408E244560K2297j49253j27735p8835j58444j01772m7838o4787L4610j22931
$$ 5244560 5266857 5117604 4989869 4911034 4752590 4650818 4602980 4538193 4572803 4449872
18398D449872O0540q5942k72788j02104j00047q5874j71090j45782j9080q6688
$$ 4449872 4510412 4424470 4151682 4049578 3949531 3863657 3692567 3546785 3527705 3441017
18388C441017j32012Q3174j34424l329j06031P6203m7325m2838L1645j14893j10788
$$ 3441017 3309005 3392179 3257755 3254426 3148395 3224598 3177273 3134435 3166080 3051187 2940399
18377B940399J6706J83274J543P6259J13067k98110k30389J52998K9717N0765
$$ 2940399 2957105 3140379 3141922 3218181 3331248 3033138 2802749 2955747 2985464 3036229
18367C036229o748m9645J03851J53931o5878M8384P4364j18572P4424K52085M2449
$$ 3036229 3029481 2979836 3083687 3237618 3171740 3220124 3294488 3175916 3250340 3502425 3544874
18356C544874o0665K2038j09857r8983j92905l60684p1209m2302K0045j1133n6534
$$ 3544874 3484209 3506247 3396390 3297407 3104502 2743818 2672609 2630307 2650352 2639219 2582685
18345B582685j99498o4142K6899j49995o746p4515j53677n3261m573j83592j26171
$$ 2582685 2383187 2319045 2345944 2195949 2189203 2114688 1961011 1907750 1903177 1719585 1593414
18334A593414q364J4152M2398J16098J11511J1238j25138k02213K54362J78377
$$ 1593414 1585050 1599202 1641600 1757698 1869209 1880447 1755309 1553096 1807458 1985835
18324A985835k9892j24679O1498q2987j12170l9191j63756j4484J04351j0559
$$ 1985835 1955943 1831264 1892762 1809775 1697605 1658414 1494658 1480174 1584525 1573966
18314A573966L836N7209J45662j49659K05649J35159o5035o613j04106l1303O9762
$$ 1573966 1577802 1635011 1780673 1631014 1836663 1971822 1906787 1900174 1796068 1764765 1834527
18303A834527j32839Q5645P6461L5976k35662J6517o3540k02202l181J06870J89636
$$ 1834527 1701688 1787333 1863794 1899770 1664108 1680625 1617085 1414883 1411702 1518572 1708208
18292A708208N1447P7181p2349J27135J96713J7657J09199O1012k0235Q7724j22017
$$ 1708208 1759655 1836836 1764487 1891622 2088335 2105992 2215191 2276203 2255968 2343692 2221675
18281B221675j91068o5505K0944k2353r1168j50594J9760K15679Q9078p4042q1591
$$ 2221675 2030607 1965102 1986046 1963693 1872525 1721931 1741691 1957370 2046448 1972406 1890815
18270A890815J46581J53643M7894j30666L0684q268k05845o4201j01502q0021
$$ 1890815 2037396 2191039 2238933 2108267 2138951 2130683 1924838 1860637 1759135 1679114
18260A679114j21396R6968O8330J9574n4831k9591o121J69256M8914j83357l9533
$$ 1679114 1557718 1654686 1723016 1742590 1687759 1658168 1652047 1821303 1870217 1686860 1647327
18249A647327J45342o7090p1467J37704K89711Q0418M47K60398k0636Q8429n8201
$$ 1647327 1792669 1725579 1654112 1791816 2081527 2161945 2162392 2422790 2402154 2490583 2432382
18238B432382q90J38162J81670o7158N989P452o2136J03286j2152M9351j2207
$$ 2432382 2431492 2569654 2751324 2684166 2690155 2697607 2635471 2738757 2726605 2775956 2763749
18227B763749K6261l9695J72962J98878N219j97435k03645J5349P3844J08654
$$ 2763749 2790010 2750315 2923277 3122155 3127374 2929939 2726294 2741643 2815487 2924141
18217B924141K6602j85318j48608J02512K78326o3302l4020J53939j89025j03835
$$ 2924141 2950743 2765425 2616817 2719329 2997655 2934353 2900333 3054272 2865247 2761412
18207B761412r5967O0092M42192J32410N529K3005j7787O762P2016K43884J97970
$$ 2761412 2665445 2725537 3167729 3300139 3305668 3328673 3310886 3317648 3389664 3633548 3831518
18196C831518j23400n6051Q4538M14503L26734O2730L01899M23337N67130M56432
$$ 3831518 3708118 3652067 3736605 4151108 4477842 4540572 4842471 5265808 5832938 6289370
18186F289370M76659M47744N93363M20619P49138J033466J151316J546224J730567
$$ 6289370 6766029 7213773 7807136 8227755 8976893 10010359 11161675 12707899 14438466
18177A4438466K063631K473271K968844L443577L900912L838149L757229M142246
$$ 14438466 16502097 18975368 21944212 25387789 29288701 33126850 36884079 41026325
18169D1026325M958556O044093P593882R970985J2915114J6028229J9955823K2544351
$$ 41026325 45984881 52028974 59622856 69593841 82508955 98537184 118493007 141037358
18161A41037358K1257288J6639464J4124010J2521218K622151r617063j2390956
$$ 141037358 162294646 178934110 193058120 205579338 208201489 198584426 186193470
18154A86193470j1746935j4977043j6740628j4438699j0660955p945650o828017
$$ 186193470 174446535 159469492 142728864 128290165 117629210 109683560 102855543
18147A02855543o110714n129114m950060n986708p075018p281273o466870n783290
$$ 102855543 96744829 91615715 86665655 80678947 73603929 66322656 59855786 54072496
18139E4072496n164042m366984l474961k521321j827766j390960r62661o80483
$$ 54072496 48908454 44541470 41066509 38545188 36717422 35326462 34363801 33683318
18131C3683318m86127k92325O8945O35430J108551J318609K182353K986654L807287
$$ 33683318 33197191 32904866 32973811 33609241 34717792 36036401 38218754 41205408 45012695
18122D5012695M902328N709374O225411O326238N967797N843912O466003O068405
$$ 45012695 49915023 55624397 61849808 68176046 74143843 79987755 86453758 92522163
18114I2522163O190899Q059473J1694180J4237132J4132466J3742162J5579796
$$ 92522163 98713062 106772535 118466715 132703847 146836313 160578475 176158271
18107A76158271J4435409N079341l366438m138593o787508j6117122k1036447
$$ 176158271 190593680 195673021 192306583 188167990 181380482 165263360 144226913
18100A44226913j8698866j5368895j3748022j1610843r140182o913564n406602
$$ 144226913 125528047 110159152 96411130 84800287 75660105 68746541 63339939
18093F3339939m010231l197532l409450l982548l708715l552274l100658k849980
$$ 63339939 59329708 56132176 52722726 48740178 45031463 41479189 38378531 35528551
18085C5528551k485891k046415j609935j291305j078369q81243r25356q05685
$$ 35528551 33042660 30996245 29386310 28095005 27016636 26135393 25210037 24404352
18077B4404352j181528j084599p64141p16591n27485q67263o64616n19019o78689
$$ 24404352 23222824 22138225 21374084 20657493 20130008 19262745 18598129 18079110 17400421
18068A7400421n52722n35739k53917m13812n51780m46595m12975l08405k33569
$$ 17400421 16847699 16311960 16058043 15644231 15092451 14645856 14232881 13924476 13690907
18059A3690907m78466l08176m47895l54665n4666k16730o4109l84944l03751j82951
$$ 13690907 13212441 12904265 12456370 12101705 12047039 11830309 11766200 11381256 11077505 10894554
18049A0894554k93840m03779m14349m22232o0112k9389o1740R2911k88806p5594
$$ 10894554 10600714 10196935 9782586 9360354 9300242 9270853 9209113 9302024 9013218 8937624
18039H937624p1230l64499q1462m3347k00524l46838J6585L6270P5504K1735j04220
$$ 8937624 8866394 8501895 8420433 8377086 8176562 7829724 7846309 7882579 7958083 7979818 7875598
18028G875598k56998l64643j76806O2176M2835k32609j04369j47320k09382j17054
$$ 7875598 7618600 7253957 7077151 7139327 7182162 6949553 6845184 6697864 6488482 6371428
18018F371428k76969k36167q6012j39398k59957j31832j13922j21342J36557J58851
$$ 6371428 6094459 5858292 5772280 5632882 5372925 5241093 5127171 5005829 5142386 5301237
18008E301237p8036k48263k84811k83601j79533j20126k30556Q5081j7018o0201
$$ 5301237 5223201 4974938 4690127 4406526 4226993 4106867 3876311 3961392 3944374 3884173
17998C884173N5628L5003m9860l2102R0989J78412P6986r7022j85931j20202O3596
$$ 3884173 3939801 3974804 3924944 3892842 3983831 4162243 4239229 4142207 3956276 3836074 3899670
17987C899670J07735o7865k28985L8556m5377L3199J45794j3224J5366J62959
$$ 3899670 4007405 3939540 3710555 3749111 3703734 3736933 3882727 3869503 3884869 4047828
17977D047828p4447j6074j26022k80991j89565n4024k60422m4890j80948m4808
$$ 4047828 3973381 3957307 3831285 3550294 3360729 3306705 3046283 3001393 2820445 2775637
17967B775637j62205j87888K17451Q0102K0047k56171k28513j77245k67120J34684
$$ 2775637 2613432 2425544 2642995 2723097 2743144 2486973 2258460 2081215 1814095 1948779
17957A948779M7265J38597P1975l4604m577J22167O2443m2468M4923j84789k70074
$$ 1948779 1996044 2134641 2206616 2172012 2167435 2289602 2352045 2309577 2354500 2169711 1899637
17946A899637J5547P1375J8395j68075j80042K081K03483J48522J9059J8053j73184
$$ 1899637 1915184 1986559 2004954 1836879 1656837 1658918 1862401 2010923 2029982 2048035 1874851
17935A874851p3409q1133K811k36485r3379r7775O2919L2679K14317P75j41285
$$ 1874851 1801442 1720309 1723120 1486635 1393256 1295481 1358400 1391079 1605396 1606171 1464886
17924A464886j34359n9261k24488n6419P0100J18481j26044P778R1358Q8198J01273
$$ 1464886 1330527 1271266 1046778 990359 1060459 1178940 1052896 1060674 1152032 1240230 1341503
17913A341503l1120j6736k433O7370K20947K0210m8677N7131j79148k06087K01375
$$ 1341503 1310383 1293647 1291214 1358584 1579531 1599741 1551064 1608195 1429047 1222960 1424335
17902A424335J22113J8480R1043m5174J4676l7088M4623m1416j89095k3666r2661
$$ 1424335 1546448 1564928 1655971 1610797 1625473 1588385 1633008 1591592 1402497 1378831 1286170
17891A286170j21573M9463j10833j98038l0190N3452o2035n8735q1564L1116J19778
$$ 1286170 1164597 1214060 1103227 905189 874999 928451 866416 807681 726117 757233 877011
17880H77011k23131k0133K7259l5522J24721n0788j9021j06026q79K528Q6525
$$ 877011 653880 633747 661006 625484 750205 699417 680396 574370 573491 576019 662544
17869F62544k13279j34865j60991K506L46061J9974l1802k33772O6153J10872
$$ 662544 449265 314400 153409 155915 501976 521950 490148 256376 322529 433401
17859D33401p2703J7993j28543L9851J33470K6498j32676j61900n4150J12515
$$ 433401 360698 378691 250148 289999 423469 449967 317291 155391 101241 213756
17849B13756K78406K14723M129n1996j81735q5728k8770j13325o7826q2793J9974
$$ 213756 492162 706885 711014 659018 477283 391555 362785 249460 181634 98841 118815
17838A18815Q5486J51667P122j01186j33603J06343J33897M6375k0503J74189
$$ 118815 204301 355968 363090 261904 128301 234644 368541 414916 394413 568602
17828E68602l4074n4034k13075p8096o7070L3186k9171k9031M4415j07464m835
$$ 568602 534528 480494 267419 189323 122253 155439 126268 97237 141652 34188 29353
17817B9353o8109j81754J88498J09635J0995j2958p3180o5406J923L3635J38242
$$ 29353 -38756 -220510 -32012 77623 88618 75660 2480 -62926 -61003 -27368 110874
17806A10874j10257j05410K25836j5920P852j9908P9568j15920l8918k8132o3751
$$ 110874 617 -104793 121043 105123 112975 93067 172635 56715 17797 -10335 -74086
17795g4086j8958J73266m5822j53003n0153R539J77449O3017P3331O51r3601L4465
$$ -74086 -93044 80222 34400 -118603 -168756 -159217 18232 81249 154580 155231 61630 96095
17783I6095J38730J01444j37757j60193k22931j48190L2501P3597J02930m3174
$$ 96095 234825 336269 198512 38319 -184612 -332802 -300301 -226704 -123774 -166948
17773a66948j3578Q7011O4489j67770J82481J62319p759k1465l583j19360q8451
$$ -166948 -180526 -93515 -29026 -196796 -14315 148004 140245 118780 115197 -4163 -92614
17762i2614k32692j37201j3378L35019J31058r5766j68099k6169k9790j69114
$$ -92614 -325306 -462507 -475885 -140866 -9808 -105574 -273673 -299842 -329632 -498746
17752d98746N7361M3306J85661J86728R3057j0569p0742k6609M6043k8528j19089
$$ -498746 -441385 -398079 -212418 -25690 67367 56798 -13944 -40553 5490 -23038 -142127
17741a42127p1629R0012P1767P705J50360K18271J00454r0655k15568r6220n6769
$$ -142127 -213756 -123744 -51977 -44272 106088 324359 424813 334158 118590 22370 -34399
17730c4399l9756K02182J2495j2726j4486j36546k10742j9429M3393J45485J85149
$$ -34399 -74155 128027 140522 127796 113310 -23236 -233978 -253407 -210014 -64529 120620
17719A20620j289j18884M0359K562j67769l15598j98307o7896J07091J06960m7999
$$ 120620 119331 447 40806 43368 -124401 -439999 -638306 -706202 -599111 -492151 -540150
17708e40150r3160Q8874K28176K02953q985j9040J48636J22741j62402k68828
$$ -540150 -633310 -544436 -316260 -113307 -122292 -141332 7304 130045 -32357 -301185
17698c01185K9874J94761O8414p0922l2054L1287M2583J20211J08146k71902J34213
$$ -301185 -271311 -76550 -8136 -79058 -111112 -79825 -37242 82969 191115 -80787 53426
17687E3426p422j92543j97774M8224N9876n8241j74217q0518K4348K28172J63611
$$ 53426 46004 -146539 -344313 -296089 -236213 -294454 -468671 -549189 -524841 -296669 -133058
17676a33058N8275L575J83527j24821N3123P5392j87024p5507P6494J1991j54743
$$ -133058 -74783 -71208 112319 -12502 40621 116013 -71011 -146518 -70024 -58033 -212776
17665b12776n998P5506m8843o2815L22930M5642j6616J00461P7435k2595j21224
$$ -212776 -218774 -143268 -192111 -254926 68004 113646 97030 197491 274926 252331 131107
17654A31107n9995J73113K46255K55251L9787j8511j76901k07930q0760P3497
$$ 131107 71112 244225 490480 745731 785518 767007 590106 382176 301416 374913
17644C74913K96471J57536J78490j9441j29861j50641m0745j01802K0165j73079
$$ 374913 671384 828920 1007410 987969 858108 707467 666722 564920 585085 412006
17634D12006K51733q7451j2149j37862n41440j81103P0482K18856m8116P726K01453
$$ 412006 663739 576288 564139 426277 -115163 -296266 -225784 -6928 -55044 -47318 154135
17623A54135J64088k30064k48883j37148j63531K49748R2804J01980L5304L5839
$$ 154135 318223 88159 -160724 -297872 -461403 -211655 -118851 -16871 18433 54272
17613E4272p4424J29861L5652j96905M746J65438J59739J44315r4564j29469J11045
$$ 54272 -20152 109709 145361 -51544 -46798 118640 278379 422694 328130 198661 309706
17602C09706J89196N089R6594J12847K1952j29121q2562j42884j51259J33658
$$ 309706 498902 503991 600585 713432 735384 606263 523701 380817 229558 363216
17592C63216J19596J14396K7616J47050k4008m7998k52349j92494o0674l2097
$$ 363216 482812 597208 624824 771874 747866 699868 447519 255025 194351 162254
17582A62254J06702O4034J8586r8315j55876J02677n7807j98180L4588m8791j30028
$$ 162254 268956 332990 351576 253261 97385 200062 142255 -55925 -21337 -70128 -200156
17571b00156l6726P7075m4183O2615o7326K12522K71895p2629k65127j9938Q7623
$$ -200156 -236882 -159807 -203990 -141375 -208701 3821 275716 203087 -62040 -81978 5645
17560E645L7121q9376j36007k9520L2046J0916o3734K2302K44620L02349J71177
$$ 5645 42766 -46610 -182617 -212137 -180091 -169175 -232909 -210607 34013 336362 507539
17549E07539q3999l19086j59224N9133M0828j8723J06284n881j65190l1017N3344
$$ 507539 423540 104454 -54770 4363 45191 26468 132752 126871 -38319 -69336 -15992
17538a5992J07894r2672m0559n6286j12419k0906K56929J56167r7706o3913M6102
$$ -15992 91902 -770 -41329 -97615 -210034 -230940 25989 182156 84450 20537 66639
17527F6639j86394L3602J09682n5246p6374j02967N2794J8035Q4686Q7288M4378
$$ 66639 -119755 -86153 23529 -31717 -108091 -211058 -158264 -140229 -55543 31745 76123
17516G6123N3713q3382j26900l1638j16094j50530m5834J03743N9077J01725j98770
$$ 76123 129836 46454 -80446 -112084 -228178 -378708 -424542 -320799 -261722 -159997 -358767
17505c58767M6881p3160l1665K52583Q4482j45770m8618l1837J4723K89414N9317
$$ -358767 -311886 -385046 -416711 -164128 -79646 -225416 -274034 -305871 -291148 -1734 57583
17494E7583r1114q7152K0489k2762j99521m8176N1133J17160M9490l0702O9161
$$ 57583 -33531 -120683 -100194 -122956 -322477 -370653 -319520 -202360 -152870 -183572 -114411
17483a14411O3527j08654k5105q5256O330Q6276J0573P48k96907j79742L01293
$$ -114411 -50884 -159538 -184643 -269899 -263569 -177293 -166720 -165972 -462879 -642621 -341328
17472c41328L19125O5711M6615m6940j69438k21518j16624P202K58691K37908
$$ -341328 -22203 43508 90123 43183 -126255 -347773 -464397 -457195 -198504 39404
17462C9404M4999r9090J39146N2448j08902j42106L3447l9171J9731J95687P3675
$$ 39404 84403 -14687 124459 176907 68005 -74101 -40654 -79825 -60094 135593 209268
17451B09268l5450o8198l93396j27580O9128L26274J05563k05844j36310l4657
$$ 209268 173818 105620 -287776 -415356 -346228 -19954 85609 -120235 -256545 -291202
17441b91202J84551O5666k4099j9692k24829j1115M69822N1624k10246k47623
$$ -291202 -106651 -40985 -65084 -84776 -309605 -320720 149102 200726 -9520 -257143
17431b57143o1637q2434J70242M4305j43114J10441J16239k0333j51937P5199
$$ -257143 -318780 -401214 -230972 -186667 -329781 -219340 -103101 -123434 -275371 -200172
17421b00172J69687o8597m0882O4213J1384o6159O8488J06327j27350N1103p1848
$$ -200172 -30485 -99082 -139964 -75751 -64367 -130526 -62038 44289 -83061 -31958 -103806
17410a03806j88114p5649j01788J99582K75298m4932k11439k11073L4036Q5257
$$ -103806 -291920 -367569 -469357 -269775 5523 -39409 -250848 -461921 -427885 -342628
17400c42628P132Q6868J27959J09689J70832j04906N0797j52658j16346J46655
$$ -342628 -335496 -248628 -120669 -10980 159852 54946 105743 -46915 -163261 -16606
17390a6606J44938k03234l9340l3475k6181j30397j87233p7081L35765K87459
$$ -16606 128332 -74902 -114242 -147717 -173898 -304295 -491528 -568609 -232844 54615
17380E4615J55440J8353j67240k65767q0098J62493o124l19615j06726K02124
$$ 54615 210055 228408 61168 -204599 -284697 -122204 -128328 -447943 -554669 -352545
17370c52545K64355J42072o592j14690k9210j8416l3742l664j15040o875L6845
$$ -352545 -88190 53882 47290 -67400 -96610 -115026 -148768 -152432 -267472 -274347 -237502
17359b37502k704L2599j8000K54635k3179r2301k5808Q3040R472P9763N6554l7998
$$ -237502 -240206 -207607 -225607 29028 5849 -86452 -112260 -29220 -19748 60015 116569 78571
17347G8571k15445k69204j60942l1799J17939J04290r5392p4723j59428k3743
$$ 78571 -136874 -406078 -567020 -598819 -480880 -376590 -471982 -546705 -706133 -729876
17337g29876K31447J30393J30226m8000j69200r2699J49589J26924L9159N8435
$$ -729876 -498429 -368036 -237810 -285810 -455010 -547709 -398120 -271196 -232037 -173602
17327a73602n880j8485p9837j23121J85768K49161J25248j37910J09427K9795
$$ -173602 -179482 -197967 -277804 -400925 -215157 34004 159252 21342 130769 160564
17317A60564k34639P81j33181q8243Q1424J85252k02618n5733L3151k02274L77
$$ 160564 -74075 -73294 -206475 -294718 -213294 -28042 -230660 -286393 -253242 -455516 -455139
17306d55139K83726j50258j70790l772J23418J13398K4100j91591r0929m2547
$$ -455139 -171413 -321671 -492461 -496233 -372815 -259417 -235317 -426908 -517837 -560384
17296e60384k445l9505M907L23148R5004O3498j31262L1165J01750Q3945n2605
$$ -560384 -562829 -602334 -597427 -274279 -179275 -115777 -247039 -215874 -114124 -30179 -82784
17285h2784L4704J18323m3159j59059j98177o7910R9950m6017N1513r227n5284
$$ -82784 -48080 70243 27084 -131975 -330152 -398062 -298112 -344129 -292616 -301843 -357127
17274c57127k2135K7967Q7008n2215N130J17958j58286p4420J26837N4014J17688
$$ -357127 -379262 -351295 -264287 -316502 -311372 -193414 -351700 -426120 -299283 -245269 -127581
17263a27581J99127J68710k35274q0743L1367J21845q4577M9280n0586k33117
$$ -127581 71546 240256 4982 -75761 -44394 77451 -7126 42154 -8432 -241549
17253b41549k69683K3079L10467M1448k31541J2611J18865q5155q3981K64017
$$ -241549 -511232 -488153 -177686 -136238 -367779 -355168 -236303 -321458 -405439 -141422
17243a41422L00486o214m622m2825r7239k12464L2951K05934j0390k6075j07833
$$ -141422 159064 152850 148228 105403 8164 -204300 -171349 34585 24195 -1880 -109713
17232a09713m9233o156l965j3760m5773o5245N5543J5871N3685j75707j29957
$$ -109713 -158946 -165102 -169067 -182827 -228600 -293845 -238302 -222431 -168746 -344453 -474410
17221d74410M8364J99263K03959Q0987k33418j093Q0009R4894r423q3297q5465
$$ -474410 -426046 -226783 -22824 58163 -175255 -176348 -96339 -1445 -10868 -94165 -179630
17210a79630J05865N2150m1151K42412R7449k30333q3750j73287j24987n5719
$$ -179630 -73765 -21615 -62766 179646 277095 46762 -36988 -210275 -335262 -390981
17200c90981n1805M3335L063J3383J23720J56250n9366k05552Q9498K18690J53391
$$ -390981 -442786 -399451 -396388 -383005 -259285 -103035 -162401 -367953 -278455 -59765 93626
17189I3626J29034q6065j01492L045j87476p5110L4023j06632M5503J0427j3595
$$ 93626 222660 136595 35103 38148 -149328 -224438 -190415 -297047 -251544 -241117 -254712
17178b54712L8822l7595r066O1598J94320K6516k6703K16180J65322k0140N1435
$$ -254712 -215890 -253485 -262551 -200953 -6633 19883 -6820 209360 374682 354542 405977
17167D05977J43371P6028j39771j37831l05862q4197N6211o5972K27802J58980
$$ 405977 549348 625376 485605 347774 41912 -42285 13926 -52046 175756 334736
17157C34736L6204J39911L47263N1814r3586L9342j76476j34492k87373j81997
$$ 334736 370940 510851 858114 909928 816342 855684 679208 544716 257343 75346
17147G5346J86149J29523j4896O4048j39617p6546J92443K65480j53211m05142
$$ 75346 261495 391018 376122 440170 300553 224007 416450 681930 528719 123577
17137A23577k36675L9865R3672P4578n2223l890K98258J26204l18879j83404n1165
$$ 123577 -113098 -73233 20439 95017 42794 38904 337162 463366 144487 -38917 -90082
17126i0082m4852j15604K01236m0308j15707k5196M3954O6085j00509n2218J19456
$$ -90082 -134934 -250538 -49302 -89610 -205317 -230513 -186559 -120474 -220983 -273201 -153745
17115a53745m1382Q79O3421J0596r3362N6943j11155l4905k8789l742K46249J37319
$$ -153745 -195127 -194248 -130827 -120231 -213593 -156650 -267805 -302710 -331499 -335241 -88992 48327
17103D8327R2782L560n2512M2115N6323o1418l6498k58576o3923K2158K05891
$$ 48327 141109 144669 92157 134272 190595 129177 92679 -165897 -229820 -207662 -1771
17092a771J54850j67362k11064m0413J37798J04569p4535p4244N4366k77470J96484
$$ -1771 153079 -14283 -225347 -265760 -127962 -23393 -97928 -172172 -117806 -395276 -198792
17081a98792K14022J09109N9694m1909l53910j15214K59315K16780J23742k07539
$$ -198792 15230 124339 184033 142124 -211786 -327000 -67685 149095 272837 65298
17071F5298k10211j70281J2251J48396J66579j29631r4087j24038k5138K04024
$$ 65298 -144913 -315194 -302943 -154547 12032 -117599 -211686 -335724 -360862 -156838
17061a56838J35260J45097k2198j17388J47912q1967q7325j13367j52252p1705
$$ -156838 -21578 123519 101321 -16067 131845 49878 -37447 -150814 -303066 -374771
17051c74771J00684m4790k03686R0664K03508L181l23595N3963K25713J26208
$$ -374771 -274087 -318877 -522563 -431899 -228391 -225210 -548805 -494842 -269129 -142921
17041a42921J25693L3129j07859l7319j1108Q2720L6011m0725m0994k17850M4127
$$ -142921 -17228 15901 -91958 -129277 -140385 -57665 -21654 -62379 -103373 -321223 -277096
17030b77096J42485J43874P4881k09970k1263k2891K5350J94371J39696j78404
$$ -277096 -134611 9263 84144 -125826 -147089 -169980 -144630 49741 189437 11033
17020A1033j47416l3300L6114Q7737j16456P0712J27168q3502j6279q927p8986
$$ 11033 -136383 -169683 -133569 -45832 -162288 -91576 35592 -47910 -64189 -73116 -152102
17009a52102r9554j564K09615K14971l9259m0286r7162j88276q7006o0544q8494
$$ -152102 -251656 -253220 -43605 171366 132107 91821 -5341 -193617 -280623 -341167 -429661
16998d29661N9711K40576P8447r6096k5019j01059l607P5913J55352p1095j99024
$$ -429661 -369950 -129374 -50927 -147023 -172042 -273101 -276708 -200795 -45443 -116538 -315562
16987c15562j51841n9218N2601J58708J69436K93581J82518q7569l04570r2166
$$ -315562 -467403 -526621 -474020 -315312 -145876 147705 330223 242654 -61916 -154082
16977a54082Q2845O5857j42537j17155k37760N5122M7049K4758L44646K09753
$$ -154082 -71237 -5380 -147917 -265072 -502832 -447710 -400661 -375903 -31257 178496
16967A78496j36881O2084k7957k26199j45698J80137k444j70916L4823O7936j13323
$$ 178496 41615 103699 75742 -150457 -296155 -116018 -118462 -289378 -254555 -186619 -299942
16956b99942P321M6713J2280k72852r0040J75704J27963J04558j7063P2104n5892
$$ -299942 -292621 -245908 -233628 -506480 -596520 -420816 -292853 -188295 -205358 -133254 -189146
16945a89146o2548m4315P9299J18313M6105J32767k0502k23575J12710K1160j85768
$$ -189146 -251694 -296009 -216710 -98397 -52292 80475 59973 -163602 -50892 -29732 -215500
16934b15500p358n4597J03273K9851n5600l5715J1380O9334O3241M3959l6473
$$ -215500 -222858 -277455 -174182 -144331 -199931 -235646 -224266 -154932 -91691 -47732 -84205
16923h4205j96508n2563K27056Q9334o5281K3502M166m2900k6580K2026l3228
$$ -84205 -280713 -333276 -106220 -16886 -82167 -58665 -54499 -97399 -123979 -101953 -135181
16912a35181R75J27231L9077j19067k54326L4275P6731r2889J18652K84747L11394
$$ -135181 -134206 -6975 32102 -86965 -341291 -307016 -230285 -323174 -204522 80225 391619
16901C91619K8690k32434r9564l2963Q12J46456k1890n6842j28337j21879N750
$$ 391619 420309 187875 88311 55348 56160 202616 180726 123884 -4453 -126332 -120582
16890a20582Q0323J842o708L0844L727j47784m1601j32949J17064L63651k6242
$$ -120582 -40259 -38417 -45125 -14281 -10554 -158338 -199939 -332888 -215824 147827 121585
16879A21585k33907Q953o7436l6246k30921O9189O9518q068J50418L00834p1744
$$ 121585 -112322 -103369 -170805 -207051 -437972 -368783 -299265 -307333 -156915 143919 72175
16868G2175j69173j26935P4430J74472k0995j6228l1139P6589O8263k5310j73413
$$ 72175 -96998 -223933 -149503 24969 3974 -12254 -43393 33196 101459 76149 -97264
16857i7264L5789R100j23481J85703J31798J78557L9170k30029j9158K6962K8656
$$ -97264 -61475 -52375 -175856 9847 141645 320202 359372 129343 110185 137147 165803
16846A65803q8588J05161K8975r5683J6265j4142j22606J33144J49027L8599r9012
$$ 165803 77215 182376 211351 115668 131933 117791 -4815 128329 277356 315955 216943
16835B16943k33434q0332k68743k29897j52565L27322M15314m4138r0734J17175
$$ 216943 -16491 -96823 -365566 -595463 -748028 -420706 -5392 -49530 -140264 -23089
16825b3089J76447N6498m822O7977J1529m5776k57211j71105l7086N5907j89267
$$ -23089 153358 209856 205034 273011 284540 238764 -18447 -189552 -226638 -170731 -359998
16814c59998L6741J70761R9956m0016P7323K12517j8203o6261k12612j65723j41
$$ -359998 -323257 -152496 -52540 -92556 -15233 197284 179081 112820 -99792 -265515 -265656
16803b65656J33966J44144p5063J73296L7667K3089m6874N7162r7095l0296l5595
$$ -265656 -131690 12454 -62609 110687 148354 171443 124569 181731 84636 54340 18745
16792A8745r4381J24507J78018M123R030o0613m2426j20477j23799O9576l5930
$$ 18745 -75636 48871 226889 231012 240042 179429 137003 16526 -107273 -37697 -73627
16781g3627j9935j08635J23519O4604Q8598N5090J140L5994n7623j45214R5461
$$ -73627 -93562 -202197 -78678 -14074 74524 129614 130754 166748 109125 -36089 59372
16770E9372O4100j49504j16417k36483L00280J86299q7272j47546m4889R0783
$$ 59372 123472 -26032 -142449 -378932 -78652 107647 20375 -127171 -172060 -81277
16760h1277J51355K09256j74777j78265J076p5320L5734M2925k34857J38006J54309
$$ -81277 70078 279334 104557 -73708 -72632 -147952 -112218 -69293 -304150 -166144 -11835
16749a1835o1033k8612K70520j74782N4969L56134L04162o6668m9156K3335J00405
$$ -11835 -72868 -101480 169040 -5742 49227 405361 709523 642855 593699 617034 717439
16738G17439k07562p4250J1506K19557N0691L9268L06100K4152j3727j63561n3478
$$ 717439 509877 435627 447133 666690 717381 756649 1062749 1086901 1073174 909613 856135
16727H56135P4662J01469j85554j31366P9530Q8842J2042j49552j55060J11785
$$ 856135 930797 1032266 846712 715346 794876 883718 895760 746208 591148 702933
16717G02933J01271M6345k00473m4703J67327M5240j83796n5201M5998L08K91634
$$ 702933 804204 850549 650076 605373 772700 817940 634144 578943 624941 625249 916883
16706I16883j24764l60773K7796Q5964J56251J8596l13637j04257J77607Q5889
$$ 916883 792119 431346 459142 545106 701357 719953 406316 302059 479666 565555
16696E65555j00614L1493J841P3993l1959m1946q1727J84481r5014q8205r9524
$$ 565555 464941 496434 498275 572268 540309 498363 416636 601117 506103 417898 318374
16685C18374K32782K9237j96865M4913P419r82L5887P0667L5444P387K44654R6279
$$ 318374 551156 580393 383528 428441 435860 434878 470765 541432 576876 584263 828917 925196
16673I25196L2885r2460j61954j23904O660O5851J16539R8825j9649q8657q8084
$$ 925196 958081 865621 703667 579763 586423 652274 768813 867638 847989 759332 671248
16662F71248P2271N4215j09803L7660L1927O981K362O7980J76850J49641j08017
$$ 671248 743519 797734 687931 725591 757518 764499 766861 834841 1011691 1161332 1053315
16651A053315j13678J02326J96024P2753j0175J28702O6577p7960J27117J45236
$$ 1053315 939637 1041963 1237987 1310740 1300565 1429267 1495844 1417884 1545001 1690237
16641A690237P175K65359L31927J99699j21316m7403L23726L47301L33005K50005
$$ 1690237 1697412 1962771 2294698 2494397 2373081 2325678 2649404 2996705 3329710 3579715
16631C579715L71093M87836M20066J79272N16421N99168P11118Q59009J067604
$$ 3579715 3950808 4438644 4858710 5037982 5554403 6153571 6864689 7723698 8791302
16622H791302J434798K319029L283570N403025Q757119J3406837J7593434J6252294
$$ 8791302 10226100 12545129 15828699 21231724 29988843 43395680 60989114 77241408
16614G7241408R655647Q666026Q838821o298319k0348850j6726295q005555k22352
$$ 77241408 86897055 95563081 104401902 98103583 77754733 61028438 53022883 52800531
16606E2800531P158029J5319359K2447283K3501832K2683950K4001352J4953671
$$ 52800531 59958560 75277919 97725202 121227034 143910984 167912336 182866007
16599A82866007o721014j4307563j8266003k9630818k7086157j6644488p084426
$$ 182866007 176144993 161837430 143571427 113940609 86854452 70209964 63125538
16592F3125538L99794P191278J3003829J2909803O681108N250331N782494p986339
$$ 63125538 63525332 70716610 83720439 96630242 103311350 108561681 114344175 106357836
16584A06357836k3129958k1009527j3692583q221055n525701m011931k721862
$$ 106357836 83227878 62218351 48525768 40304713 34779012 30767081 28045219
16577B8045219k101500j875271j227884j008734j094058p92940o35584n50843
$$ 28045219 25943719 24068448 22840564 21831830 20737772 19944832 19309248 18758405
16569A8758405m18797m70467o83265o57484r16818m85942m06314o02755o07039
$$ 18758405 18339608 17869141 17185876 16528392 15611574 15125632 14719318 14116563 13509524
16560A3509524m51434m53386l84792l70438k71634l55840l96701k53280l20982
$$ 13509524 13058090 12604704 12219912 11849474 11577840 11222000 10825299 10572019 10251037
16551A0251037l99556m59340l4175j45056n2636k64696n27645m29044q6302k67433
$$ 10251037 9851481 9392141 9357966 9212910 9160274 8895578 8367933 7938889 7852587 7585154
16541G585154k38132j06937p5345l13673j91887k51104j00049J7742p8197n8490
$$ 7585154 7347022 7240085 7164740 6851067 6659180 6408076 6308027 6325769 6247572 6189082
16531F189082o2808k18464j88026j59423Q440k23041q2634j84119n4010J50515
$$ 6189082 6126274 5907810 5719784 5560361 5568801 5345760 5263126 5079007 5024997 5175512
16521E175512M6556j38789n4163j34948j94892l25286l11703k77807n4996J36630
$$ 5175512 5222068 5083279 5029116 4894168 4699276 4373990 4062287 3784480 3729484 3866114
16511C866114j3956j35151j12251J3975L4151N3436o7493q5146O3817M0210l30722
$$ 3866114 3852158 3717007 3604756 3618731 3652882 3706318 3638825 3553679 3617496 3657706 3326984
16500C326984j59337L150j38356q7031n204K4870L716M6558J43614K4344k0887
$$ 3326984 3167647 3170797 3032441 2945410 2940206 2965076 2968792 3015350 3158964 3183308 3162421
16489C162421m8028n8624K6778l3708m3985q3789K1199j11117m8475j5284M1303
$$ 3162421 3114393 3055769 3082547 3048839 3004854 2921065 2942264 2831147 2782672 2767388 2808691
16478B808691J08445p2954Q6446L7084K4654q0492j12458k9674j5907l6254J8041
$$ 2808691 2917136 2844182 2930628 2967712 2992366 2911874 2799416 2769742 2753835 2717581 2735622
16467B735622k30172o8622K3120o8805k5883M4990j02277q9304L8270O7281j40036
$$ 2735622 2505450 2436828 2459948 2391143 2365260 2410250 2307973 2218669 2256939 2324220 2184184
16456B184184k17943P5711P9500o9641k62182j38285j37524J02624O9859O9679
$$ 2184184 1966241 2041952 2121452 2051811 1789629 1651344 1513820 1616444 1686303 1755982
16446A755982q3337m7476n0274p2824j48843k17060K7991L2481m023K31014j28322
$$ 1755982 1672645 1625169 1574895 1502071 1353228 1136168 1164159 1196640 1192617 1423631 1295309
16435A295309j63583J46767N4743q099o879j56970j42826R7484m9301j13143K1411
$$ 1295309 1131726 1278493 1333236 1325137 1318258 1161288 1018462 1115946 1066645 953502 974913
16424I74913j44858m2779K19959K9072j11933J25307O1981k88232N469j9605k067
$$ 974913 830055 787276 1007235 1036307 924374 1049681 1111662 823430 828899 809294 807227
16413H07227M4581M4020Q797K521J48145j7682j87656k5336K6600j41185l17029
$$ 807227 851808 895828 904625 907146 1055291 1037609 849953 824617 851217 710032 393003
16402C93003j18755j02028N0680O4713K58003K13129l0991n8718q4210j415j01912
$$ 393003 274248 172220 222900 287613 545616 758745 727754 669036 584826 583411 481499
16391D81499O2508J67701M8270n0438K2167P9999m0382K3002K3456n5948k13516
$$ 481499 544007 711708 759978 709540 731707 811706 771324 794326 817782 761834 548318
16380E48318k20300J12845J30237k02487O7182J11352j50451q8450R6347k7726
$$ 548318 328018 440863 571100 368613 435795 547147 396696 308246 404593 376867
16370C76867k5202J42626j89655p7194K13668O2105k2602l0067p1655K06017l6382
$$ 376867 351665 494291 304636 227442 441110 503215 480613 450546 378891 584908 548526
16359E48526j30540O8503j14213J945m5981K172j703P8131j02916N4378J57526
$$ 548526 417986 486489 372276 374221 328240 330412 328709 406840 303924 358302 515828
16348E15828j19313k14213q6817P1172m8418n8722J51143O3327L6544Q540j40138
$$ 515828 396515 182302 95485 166657 118239 59517 210660 273987 310531 319071 178933
16337A78933J46101j6988k35386l9263J74965k8853O3935N0754J33463R1320j52607
$$ 178933 325034 308046 72660 33397 208362 179509 243444 294198 427661 518981 366374
16326C66374j71600j47869j29589J3414L4303o6942n8654l0398k9006K00225N4418
$$ 366374 194774 46905 -82684 -69270 -34967 -101909 -160563 -190961 -219967 -19742 34676
16315C4676m8463J44845n0712P0848k9385j05412n5982p3802r718J42122m3974
$$ 34676 -13787 131058 80346 151194 121809 16397 -39585 -113387 -123105 19017 -24957
16304b4957k4144o1799K01286K50931j3511j09523m714r9108p6812j0293k16907
$$ -24957 -49101 -110900 90386 341317 327806 218283 213569 114461 37649 27356 -189551
16293a89551R2049P2657M4466J4182K66738K82p1625n6369J4602m5585j61158
$$ -189551 -97502 -24845 19621 33803 300541 300823 229198 172829 187431 141846 -19312
16282a9312j33280j17882N2538K06486r458j28901P151J04046K02827K1298q0951
$$ -19312 -152592 -270474 -217936 -11450 -20908 -149809 -142658 -38612 164215 185513 104562
16271A04562K8214o9681N378K13903o6868k80868p6473J96880R9798J9942J95547
$$ 104562 132776 63095 68473 282376 215508 -65360 -141833 55047 154845 174787 370334
16260C70334k7946k33644j91038n0158L5521l2169m8931L8815K8424J00974q0450
$$ 370334 342388 108744 -82294 -132452 -96931 -129100 -178031 -139216 -110792 -9818 -90268
16249i0268j27848j41166m4888K18597K93222J81739j03338j33995J6763N1907
$$ -90268 -218116 -359282 -404170 -185573 107649 289388 186050 52055 68818 120725
16239A20725k07832j28482m7453j34695K19820J99736K32278J7213n9804n7892
$$ 120725 -87107 -215589 -263042 -397737 -177917 21819 254097 271310 211506 153614
16229A53614M5785m5235N6377J54639m0015k72562K29K6828o2136j70380K88k37419
$$ 153614 199399 154164 210541 365180 325165 52603 52832 79660 17524 -152856 -152568 -389987
16217c89987J02898M8680K41999P3530J12863M211j6364p0396k46259k67628K6142
$$ -389987 -287089 -238409 3590 77120 189983 194194 177830 107434 -138825 -406453 -380311
16206c80311K64075Q3235N6173L3139j04023j0332j2511j65813K5058p0721j31830
$$ -380311 -116236 -33001 23172 56311 -47712 -58044 -70555 -236368 -211310 -282031 -413861
16195d13861J59058J0278n5455j27258m4113Q9902R1912O7200r7231k0096r2003
$$ -413861 -254803 -244525 -299980 -427238 -471351 -381449 -289537 -222337 -319568 -339664 -431667
16184d31667k6754K02002Q6163O0984j3453j7987J0163m6040o4871k7568J85127
$$ -431667 -458421 -256419 -170256 -109272 -122725 -140712 -130549 -176589 -241460 -269028 -83901
16173h3901Q630K783Q2040J11322J05189p9358p9593L1316j22808j47283k31019
$$ -83901 -75271 -72488 9552 120874 226063 146705 67112 98428 -24380 -171663 -402682
16162d02682J14632K27252j37557j50005p350P5350J17698p0430o7280o6496K8725
$$ -402682 -288050 -60798 -198355 -348360 -355710 -280360 -162662 -233092 -300372 -366868 -338143
16151c38143N5850p7611j27276j37273J30732j80132J7141Q4178N4758N0787L3427
$$ -338143 -282293 -359904 -487180 -624453 -493721 -673853 -656712 -572534 -517776 -466989 -433562
16140d33562R9549K5691j8905J78002m3284R6025j4044L9832K65816J16783j0797
$$ -433562 -334013 -308322 -327227 -149225 -192509 -96484 -110528 -70696 195120 311903 301106
16129C01106k38854k46455j21490k09319L6712J45121J75267J82998l03848q2447
$$ 301106 62252 -184203 -305693 -515012 -478300 -333179 -157912 25086 -278762 -361209
16119c61209K43862K00747J7215m6574q9389r1313l06650j66725K96674R1733
$$ -361209 -117347 83400 100615 54041 -35348 -126661 -433311 -600036 -303362 -211629
16109b11629J4063K9342k3648j37140K2729J90838P4443n1017j43510q219Q6206
$$ -211629 -197566 -168224 -191872 -329012 -306283 -115445 -41002 -92019 -235529 -243748 -157542
16098a57542j86497j62348R0400K8273J44730J47340o4091q9218L820r6299l288
$$ -157542 -344039 -506387 -415987 -387714 -242984 -95644 -159735 -248953 -245133 -341432 -344720
16087c44720J70187Q6814p9171j81088J79971J48568M50p7211Q2675M1231o2982
$$ -344720 -174533 -87719 -166890 -347978 -168007 -19439 -18989 -96200 -13525 27706 -35276
16076c5276r5440P3840P8741k59042k4002J30395n3980m1507j5477k69293q6413
$$ -35276 -130716 -56876 21865 -237177 -261179 -130784 -184764 -226271 -241748 -511041 -597454
16065e97454J05997J04128j0389M1398r5402j20128O0059Q9902J28362K76095
$$ -597454 -491457 -387329 -397718 -356320 -451722 -571850 -511791 -421889 -293527 -17432
16055a7432L08375K28387n3469O7143l707j94990j77873j17453j031J59928J04116
$$ -17432 290943 519330 465861 533004 529297 334307 156434 38981 37950 197878 301994
16044C01994L4677J75269J15258l9510J80978J88655k8767k99234Q7768N6407
$$ 301994 336671 511940 627198 587688 768666 957321 928554 629320 717088 773495
16034G73495r5439q6731J4361L8375n9590L3349j39000r9103M9785k10592q087
$$ 773495 678056 591325 605686 644061 584471 617820 478820 379717 429502 218910 210823
16023B10823L4369J03154m6742j60095m941j59833p5352m7269M1950J03131Q6605
$$ 210823 245192 348346 301604 141509 136568 -23265 -98617 -145886 -103936 -805 85800
16012H5800j90872K7145r5535R8111J02571k0220k74881K40793J52387j01902
$$ 85800 -105072 -77927 -173462 -75351 27220 7000 -267881 -27088 125299 23397
16002B3397j62361M677P9312n4903p5282J09683J18139N0421r3379j41226q1952
$$ 23397 -138964 -134287 -54975 -109878 -185160 -75477 42662 93083 -296 -141522 -223474
15991b23474J17755l5036k65755P3009J19610P1359o2420K2780n6474R1234J20828
$$ -223474 -105719 -140755 -406510 -333501 -213891 -142532 -204952 -182172 -238646 -147412 -26584
15980b6584K45320l3823j09632j9038q2694l3911J7090N5904p7950J94231j4966
$$ -26584 218736 184913 75281 56243 -26451 -60362 -43272 12632 -65318 128913 113947
15969A13947r013j27324K1189N3723j04562j68367l4766L07526N8479p1215J17422
$$ 113947 104934 -22390 -1201 52522 -52040 -220407 -255173 52353 110832 39617 157039
15958A57039l3113j83522j30212M9701J5166j2477J46523n5691j76337O8194K93729
$$ 157039 123926 -59596 -189808 -140107 -124941 -137418 9105 -46586 -222923 -154729 139000
15947A39000O922J27364P5071j471j33631j38656j96929l8830q4632Q3607j01597
$$ 139000 145922 273286 348357 346886 213255 74599 -122330 -161160 -245792 -162185 -263782
15936b63782j44916J4601J61940R6125J02283l4830P9797J62743Q6984j89892
$$ -263782 -408698 -394097 -232157 -136032 -33749 -68579 11218 173961 260945 71053
15926G1053N9413j13410j33169o2549k85668M3600M41228P0411J52149l2298k25484
$$ 71053 130466 17056 -116113 -178662 -464330 -420730 20498 90909 243058 210760 -14724
15915a4724j19233q2636N5166J6470j8565o1365p1659J47518J84472P0617j11126
$$ -14724 -133957 -216593 -161427 -144957 -163522 -224887 -296546 -149028 35444 106061 -5065
15904e065j8983k43487k05335k02971L0518J54498J43915K03150M350l2978j54635
$$ -5065 -24048 -267535 -472870 -675841 -645323 -490825 -346910 -143760 -139410 -172388 -327023
15893c27023J34601O3194p2791J63096O5448q049N3286p0083L5328L5370K09980
$$ -327023 -192422 -129228 -202019 -38923 26525 18476 71762 1679 37007 72377 282357
15882B82357k3490k17795j07595j51475J26943j5011J33248p2587J0326q8418
$$ 282357 258867 41072 -66523 -217998 -91055 -106066 27182 -45405 -35079 -123497
15872a23497k39390q7885K23891J06102o0009J33634j99707N2970K94633q6322
$$ -123497 -362887 -450772 -226881 -120779 -180788 -47154 -246861 -193891 100742 14420
15862A4420j63583J80931L4024m3031J30946O2976j45076k26008K5448j7393j27430
$$ 14420 -149163 31768 65792 22761 153707 216683 71607 -154401 -128953 -146346 -273776
15851b73776J36691J75002j55599j21249J71313l8128k5921M436K2330p2900M331
$$ -273776 -137085 37917 -117682 -238931 -67618 -105746 -131667 -127231 -104901 -177801 -173470
15840a73470K04200J22855N8647k0814p640r8486j6887J45763M3683M435p2334
$$ -173470 30730 153585 212232 191418 183778 85292 68405 214168 257851 262286 189952
15829A89952j32266j22350j90720J20832O2445L1671j00912J00441m9098K0866
$$ 189952 57686 -64664 -255384 -134552 -72107 -40436 -141348 -40907 -90005 -69139
15819f9139o3257k5225K53928R8055o2005j42091q864J17291j73006j85618r002
$$ -69139 -132396 -157621 96307 194362 132357 -9734 -18598 98693 -74313 -259931 -268933
15808b68933N6536R0252r1092j1180K160o1016L72088J82140j82338k02379p6869
$$ -268933 -212397 -122145 -213237 -224417 -222257 -283273 88815 270955 88617 -113762 -190631
15797a90631j3203P6400J05802l0410M7811N0708P1210j00485j54680P7728P223
$$ -190631 -203834 -127434 -21632 -52042 -4231 46477 117687 17202 -137478 -59750 -52527
15786e2527N7750o375j4306l9308j79949J57599L83432Q5755j09662k14770o4052
$$ -52527 5223 -1152 -15458 -54766 -234715 -77116 306316 392071 282409 67639 3587
15775C587k0950K9602n7641j77895n9545J75376J88995k967k22129j27393L2998
$$ 3587 -17363 12239 -45402 -223297 -282842 -107466 81529 78562 -143567 -270960 -237962
15764b37962Q2473J79881J61484k9399l9644m962N588j1758j74114j24977R6613
$$ -237962 -155489 24392 185876 156477 116833 111871 117459 105701 -68413 -193390 -96777
15753i6777K48543r1784j79268j03541j78929j1694k6251J25934P6627j10936
$$ -96777 151766 59982 -119286 -222827 -401756 -413450 -439701 -313767 -237140 -348076
15743c48076j9377J35717r3358r5176K81908K55627K36880k71311j57457P6066
$$ -348076 -367453 -231736 -325094 -420270 -138362 117265 354145 82834 -74623 1443
15733A443p2496j54972P7409K09487n3551q0245l2153p6858k42880j09549J38860
$$ 1443 -71053 -226025 -148616 60871 7320 -72925 -105078 -181936 -424816 -534365 -395505
15722c95505J30955J89808J97714k7444k03151N4309Q9266j48446q1902J36457
$$ -395505 -264550 -74742 122972 95528 -107623 -53314 35952 -112494 -194396 -57939
15712e7939R5025l61804k0392K25254J5786O0945O8131J7938J8098J9616R8947
$$ -57939 37086 -324718 -345110 -119856 -104070 -43125 25006 42944 61042 80658 179605
15701A79605k03369j21748K8695K28966K06934j19287k01388n019L2106L182m9057
$$ 179605 -23764 -145512 -116817 112149 319083 199796 -1592 -6611 25495 28677 -20380
15690b0380k16439N514J66835J02518N9411k00942k81J53651J94764j07910o5924
$$ -20380 -236819 -231305 -64470 38048 97459 -103483 -103764 49887 244651 136741 70817
15679G0817M0767L22790J15503L2695J212k05297J98010O0107J7269J75003J45800
$$ 70817 111584 434374 549877 582572 583784 378487 576497 636604 653873 828876 974676
15668I74676J34574K01383L8892o6847J63755L23503J36991j79361j92487p0480
$$ 974676 1109250 1310633 1349525 1282678 1446433 1769936 1906927 1727566 1535079 1464599
15658A464599m4583j10150j67148j13662j37516j03666J2267L4491l4677k42090
$$ 1464599 1420016 1309866 1142718 1029056 891540 787874 800141 834632 799955 557865
15648E57865j35813j75877j57214J80482J03595J13487J68439j17639k05844j98351
$$ 557865 422052 246175 88961 269443 373038 486525 654964 537325 331481 133130
15638A33130J4556p5163j76111J05090J47408L8634J11982k09562j38347k531
$$ 133130 147686 72523 -103588 1502 148910 187544 299526 89964 -48383 -50914
15628e0914n1039J20016J24366P6660O4607j48135j80755j51941P7990M6077J06133
$$ -50914 -101953 18063 142429 219089 283696 135561 -45194 -197135 -119145 -73068 33065
15617C3065M4397j74903k0671k62051M7122J07914p7680r3787J9336L5629J41176
$$ 33065 77462 -97441 -118112 -380163 -333041 -225127 -302807 -396594 -377258 -341629 -200453
15606b00453J21575Q6628j18911L8081k38487J7319L79965L98721l63661l00326
$$ -200453 -78878 7750 -111161 -73080 -311567 -294248 85717 484438 120777 -179549
15596a79549O3248L49712q6000j57878j66131K830J98480J37039k29731j47231
$$ -179549 -116301 233411 147411 -10467 -176598 -173768 24712 161751 -67980 -215211
15586b15211L28015q0895j88614j03557J51760j36679p9568J48560J83085j5284
$$ -215211 112804 31909 -156705 -260262 -108502 -245181 -324749 -176189 6896 -8388
15576h388j07147j52858J38428J16725J44096j20314j3789n7870k58651J25416
$$ -8388 -115535 -268393 -129965 -13240 130856 10542 -3247 -61117 -319768 -194352
15566a94352J60110l4676q7373k2515J68068M4900l9566j0589M7128j68932l1430
$$ -194352 -34242 -68918 -156291 -178806 -10738 34162 -5404 -15993 31135 -137797 -169227
15555a69227J40665l1366k39282K8911K03836L08494j34302l05720M6977K92264
$$ -169227 -28562 -59928 -299210 -270299 -66463 242031 107729 -197991 -151014 141250
15545A41250K93488j64195l11441j08854o7845j16853L3446L40620J69714J17347
$$ 141250 434738 270543 -40898 -149752 -217597 -334450 -301004 39616 209330 326677
15535C26677R0039k87915k28394J35409j4215P476k4063q9336j12000m2680J63018
$$ 326677 416716 128801 -99593 35816 21601 29077 5014 -84322 -196322 -239002 -75984
15524g5984j46771O064O4583j65296J42391K95543J2005l3457j8013k7599k4341
$$ -75984 -222755 -216691 -152108 -317404 -175013 120530 132535 99078 81065 53466 29125
15513B9125j77745n7856J1747j49095O2505J46187J19156P181r3299M357m343
$$ 29125 -148620 -206476 -194729 -343824 -281319 -135132 -15976 -8795 -102094 -97737 -102080
15502a02080K33044K26060M5355j73235J0686J10396p6800j14805n3401J6904
$$ -102080 130964 357024 402379 229144 239830 350226 273426 158621 105220 122124
15492A22124j69547j21877J00882K18873J8142p4570l2741R2506k24989j47860
$$ 122124 -47423 -169300 -68418 150455 168597 94027 61286 153792 -71197 -219057
15482b19057P3649m5904J52678K43253L6671o6602l6101j17903Q6230Q3047R1725
$$ -219057 -145408 -191312 -38634 204619 241290 174688 138587 20684 106914 189961 281686
15471B81686n4952J13680J21018K7512M1420j94330l64853j56024l2107K6006
$$ 281686 226734 340414 461432 488944 530364 336034 -28819 -184843 -216950 -190944
15461a90944M4872R5085O8981j53884k713Q0470K9325k4583J11732L27255K1562
$$ -190944 -146072 -50987 17994 -135890 -138603 -58133 -28808 -53391 58341 385596 407158
15450D07158k22984j6375n8910j78532J04192J21309k55237j38934J05216m861
$$ 407158 184174 167799 108889 -69643 34549 155858 -99379 -238313 -133097 -137958
15440a37958L2026o9691Q1110J18225M4246j18115n5900o986n3083j98838k05323
$$ -137958 -105932 -175623 -94513 23712 67958 -50157 -106057 -113043 -166126 -364964 -570287
15429e70287R4008K55019J73185J77500o8151j97938J60776J34720p6592r9341
$$ -570287 -476279 -221260 -48075 129425 61274 -136664 24112 158832 82240 -17101
15419a7101P1583O1026j4992r5774J12632N4923N358M0799Q9632K6791Q1908p9929
$$ -17101 54482 115508 100516 4742 117374 172297 177655 218454 308086 334877 416785 336856
15407C36856p2162j77452j09539j19105J35006N4384r8434R3150Q8461J14174
$$ 336856 264694 87242 -22297 -141402 -6396 47988 -50446 42704 131165 245339
15397B45339K6580R2309j07685j37065N6268k4315M8754J02852j25640j50762
$$ 245339 271919 364228 256543 119478 175746 151431 200185 303037 177397 26635
15387B6635J78463J38903J28672j39721k12204k22923K330J67756J00073p7650
$$ 26635 205098 344001 472673 332952 120748 -102175 -99845 67911 167984 90334
15377I0334o8701j21122m9246J09112K06538K50013Q0855n0891p0597m7268J25055
$$ 90334 21633 -99489 -148735 -39623 166915 416928 497783 446892 376295 329027 454082
15366D54082J23042J53868K1050M7452J56238J12140M6720k9550n167O5548J82850
$$ 454082 577124 730992 752042 799494 955732 1067872 1114592 1085042 1079875 1145423 1328273
15355A328273J03258J85575K88625K4563j20162j9823j1383J88216p2301k3579
$$ 1328273 1431531 1617106 1905731 1930294 1810132 1790309 1778926 1967142 1894841 1871262
15345A871262P7943M8032Q6555n166Q967j27521m0148j97548j06633n668J57714
$$ 1871262 1949205 1997237 2083792 2078626 2087593 1960072 1919924 1722376 1615743 1610075 1767789
15334A767789J72948q8169j63241m4484j88233k31277j85401Q8044N4373k3687
$$ 1767789 1940737 1852568 1689327 1644843 1456610 1225333 1039932 1127976 1182349 1158662
15324A158662K04188K2216j89045O0208J49350p2447k04861r8723j2258J93347
$$ 1158662 1362850 1385066 1196021 1256229 1405579 1333132 1128271 1029548 1017290 1210637
15314A210637L30001l691j89591j25810J62671L72302J57556j33212k05039J0683
$$ 1210637 1540638 1536947 1347356 1221546 1384217 1756519 1914075 1780863 1575824 1586507
15304A586507J06903K0998J10504m4976l8469j9390J12186Q8590r9414n9568j33542
$$ 1586507 1693410 1714408 1824912 1779936 1741467 1722077 1834263 1922853 1823439 1763871 1630329
15293A630329L9403L99963J14015j7258j24222r8962M9185J24037Q7018j52396
$$ 1630329 1669732 2069695 2183710 2166452 2042230 1943268 1992453 2116490 2203508 2051112
15283B051112j20229J17572P3792J30248K18504J93369K28748J38197J25073j17998
$$ 2051112 1930883 2048455 2122247 2252495 2470999 2664368 2893116 3031313 3156386 3038388
15273C038388j22971K08271J74814R0123M7394J71909K30510J59517N12513K60573
$$ 3038388 2915417 3123688 3298502 3388625 3436019 3607928 3838438 3997955 4510468 4771041
15263D771041n4168j64268m0264K33863L47362M26981L55422K79279M56984N44257
$$ 4771041 4716873 4552605 4512341 4746204 5093566 5520547 5875969 6155248 6612232 7156489
15253G156489P16914O28546N59815N40862O51500J265002J332391J054970J290491
$$ 7156489 7873403 8501949 9061764 9602626 10254126 11519128 12851519 13906489 15196980
15244A5196980J373065J838389K481721K755703L161279L617952M268079N054295
$$ 15196980 16570045 18408434 20890155 23645858 26807137 30425089 34693168 39747463
15236C9747463O207627P837773R600184J2221306J6035352K0238595K5237166
$$ 39747463 45955090 53792863 63393047 75614353 91649705 111888300 137125466
15229A37125466L0437804L5267332L9046280M0879998L9621306L5423460K8011204
$$ 137125466 167563270 202830602 241876882 282756880 322378186 357801646 385812850
15222C85812850J8565602P310030m340517j5396377k5009396l2085592l5735914
$$ 385812850 404378452 411688482 407347965 391951588 366942192 334856600 299120686
15215B99120686l6533493l4944723l1761348k7458030k2389192j7960576j4064307
$$ 299120686 262587193 227642470 195881122 168423092 146033900 128073324 114009017
15208A14009017j1330543r165685p647184o470959n590843n096447m647946l953087
$$ 114009017 102678474 93512789 85865605 79394646 73803803 68707356 64059410 60106323
15200F0106323l546212l113867k813458k512817j861763j954680j847918j923023
$$ 60106323 56560111 53446244 50632786 48119969 46258206 44303526 42455608 40532585
15192D0532585j607733j373216j299858j237494j205153j090210j112138r80752
$$ 40532585 38924852 37551636 36251778 35014284 33809131 32718921 31606783 30626031
15184C0626031j001017q29114p42740p36606r13212r84720p88269o79333m90372
$$ 30626031 29625014 28795900 28053160 27316554 26403342 25418622 24630353 23951020 23460648
15175B3460648n36084p29268o10570m95749o73257m32039n18113p43908n56916
$$ 23460648 22924564 22195296 21584726 21088977 20415720 19983681 19465568 18721660 18164744
15166A8164744m25756k83187k82877l17313m73881l14998k32119m76030k05279
$$ 18164744 17738988 17455801 17172924 16855611 16381730 16066732 15834613 15358583 15153304
15157A5153304l31859m81739l21208j91315j31958n3938l61994k36757l33311
$$ 15153304 14821445 14339706 14018498 13827183 13695225 13641287 13279293 13042536 12709225
15148A2709225k96859j31711l19815m85795l17164k40625l85830l73020k25114
$$ 12709225 12412366 12280655 11960840 11475045 11157881 10917256 10531426 10158406 9933292
15139I933292p6925j67939j43860k4136o6947k12276q697l07984r6794o6718j33752
$$ 9933292 9856367 9688428 9544568 9520432 9453485 9241209 9232512 8924528 8827734 8761016 8627264
15128H627264j71616l03926j18561l7485l82822j72163l23679j27281j55380j1952
$$ 8627264 8455648 8151722 8033161 7995676 7612854 7440691 7117012 6989731 6834351 6822399
15118F822399j60762j0947J0845o0868P981j23166n1485J6592j36691o0981J8607
$$ 6822399 6661637 6650690 6661535 6600667 6608648 6485482 6433997 6450589 6313898 6252917 6271524
15107F271524J4250k44726N697J60744N2025n145J76190O4070J97461K06326j07740
$$ 6271524 6285774 6041048 6046745 6207489 6259514 6254369 6430559 6494629 6692090 6898416 6790676
15096F790676k23733p2199K39046J9610m06588j42039q0084k2399j06212k17911
$$ 6790676 6566943 6494744 6733790 6753400 6346812 6204773 6124689 6102290 5996078 5778167
15086E778167j21046k6324M5724k31100k37899l6013o2620j0683j55944j02188
$$ 5778167 5657121 5630797 5676521 5445421 5207522 5171509 5108889 5098206 4942262 4840074
15076D840074m6944J09637j2119j29805k02958k11358j83649l04624l46654q5797
$$ 4840074 4793130 4902767 4890648 4760843 4557885 4346527 4162878 3858254 3511600 3425803
15066C425803L6071j9833p5947P7927p9556J0988R5490O4649K7012J12765k6135
$$ 3425803 3461874 3442041 3366094 3444021 3364465 3375453 3470943 3535592 3562604 3675369 3649234
15055C649234j97762j87060K04566j17390k61322R252l6103p6381j524j18516
$$ 3649234 3451472 3264412 3468978 3351588 3090266 3099518 3063415 2987034 2985510 2866994
15045B866994j92292J09499J37791N2270j25022k28068p6224k6380j79222j827
$$ 2866994 2674702 2784201 2921992 2974262 2849240 2621172 2544948 2518568 2339346 2337519
15035B337519p5936K7552j89989r7964P5342J25110k4464j93636P0002p0889k01206
$$ 2337519 2261583 2289135 2099146 2001182 2076524 2201634 2177170 1983534 2053536 1982647 1781441
15024A781441j57629k03084o3591K60582J18965k9559k55420q8704k7233J21858
$$ 1781441 1623812 1420728 1357137 1617719 1736684 1707125 1451705 1363001 1335768 1457626
15014A457626p64R1467J31249Q4260k66829l0115k95504j32428J3032M6771P8113
$$ 1457626 1456862 1548329 1679578 1763838 1497009 1466894 1171390 1038962 1051994 1098765 1176878
15003A176878J38763m9138J4445J17999L1188j3726j73185O7821J19906m4820
$$ 1176878 1315641 1266503 1280948 1398947 1430135 1416409 1243224 1311045 1430951 1386131
14993A386131L2024j11468j24286N8395M1972R3625q6741j18884j71756r1890
$$ 1386131 1418155 1306687 1182401 1240796 1282768 1376393 1289652 1170768 999012 907122
14983I07122M9455K49500J31657j32285l05322n5486r1481q2451J76416J97546
$$ 907122 956577 1206077 1337734 1205449 900127 844641 753160 670709 847125 1044671
14973A044671J11306l75410j56743J58708r7427J143K4131K2509J95806j1293
$$ 1044671 1155977 780567 623824 782532 685105 686248 710379 732888 928694 917401
14963I17401l0892L4418k3443j54078k19873J54365L8652k59665j8452L83941
$$ 917401 886509 920927 897484 743406 523533 677898 716550 456885 438433 822374
14953H22374J09947j31156j8221J9605j26725j66122j00018K19090L9326j63125
$$ 822374 932321 801165 782944 802549 675824 509702 409684 628774 668100 504975
14943E04975K58014k7982K1652R7157r7872n9325K02027R8367j68736j23520k25864
$$ 504975 762989 735007 756659 853816 755944 696619 898646 997013 828277 704757 478893
14932D78893O0952m2551M0044Q5944J67112J49672n2866j63556p2218P6964N9084
$$ 478893 539845 497294 537338 623282 790394 940066 887200 723644 651426 728390 787474
14921G87474j69186o104O6206K0826o2626l8599k12077r455J38806j18876k768
$$ 787474 618288 612184 678390 699216 636590 597991 385914 376459 515265 396389 393621
14910C93621q9404m3268J24165R6776J21869R1581o883j39336r0477J28832o457
$$ 393621 304217 260949 385114 481890 603759 695340 688457 549121 458644 587476 581019
14899E81019j8959j30283k11510J31641q7279o098J7603m0532R73j31260k32095
$$ 581019 562060 431777 220267 351908 264629 258531 276134 235602 236575 105315 -126780
14888a26780q1001J89069L11749K98126o9878j89235k2790n4468j78979J55209
$$ -126780 -207781 -18712 293037 591163 521285 332050 309260 254792 75813 231022
14878B31022K24477j49818p8976p9116P914p8771Q2322J02395O4993M392N4303
$$ 231022 455499 305681 226705 147589 155503 76732 159054 261449 326442 330834 385137
14867C85137j08985J0658J35393L8367j28912k15496j13633j57167J5338j40543
$$ 385137 276152 286810 422203 460570 331658 116162 2529 -154638 -139300 -279843
14857b79843Q2478L17742J486m1179K00570l0793j37751k45882r5414l0978o2576
$$ -279843 -197365 120377 121863 80684 281254 250461 112710 -133172 -228586 -259564 -322140
14846c22140J77370K45578J2334J42336J71195q648k96584k76926R0874N9861
$$ -322140 -144770 100808 113142 255478 426673 418025 121441 -155485 -64611 -4750
14836d750R5695K7256k9940M528R5691o2355k4329k551k239j99626p7852l6263
$$ -4750 90945 118201 88261 92789 188480 126125 101796 99245 97006 -102620 -180472 -216735
14824b16735K71204K37876M3302j00390k18542o9219Q0415N6616N3239r7595j16121
$$ -216735 54469 292345 335647 235257 16715 -52504 27911 84527 137766 40171 -75950
14813g5950Q4188K7898O4177o175p4914J61263J84881j86842l13184j81529Q2695
$$ -75950 8238 36136 100313 94138 19224 180487 365368 178526 -134658 -316187 -233492
14802b33492j5812N0067K21204P9866R7877j15455k23138J60624K01271j09851
$$ -233492 -249304 -199237 21967 101833 199710 84255 -138883 21741 223012 113161
14792A13161M7890O5931J62497q583l2985k57390m486K98134K94439K86645K32956
$$ 113161 161051 226982 389479 380896 347911 90521 86035 384169 678608 965253 1198209
14781A198209J70594N9692P806P8935J69001j38690J18367K38331O0915r8391
$$ 1198209 1368803 1428495 1436301 1515236 1684237 1545547 1663914 1902245 1963160 1864769
14771A864769j64896k39882j29853N343o2848k4914q7297k89857k41174J53897
$$ 1864769 1699873 1459991 1330138 1335481 1272633 1247719 1160422 870565 629391 783288
14761G83288n5297k16156j36043K8951J57452P1914m900l0825q4501N4059k7734
$$ 783288 727991 511835 375792 404743 562195 634109 629209 598384 513883 567942 540208
14750E40208j71267J07677J24452p7217o7582j41285n80N8127j05509m7428L6948
$$ 540208 368941 476618 601070 523853 456271 314986 314406 372533 267024 219596 256544
14739B56544N9522Q8253N768j18722k5347q1605q5934J09523J51175L1502j54727
$$ 256544 316066 404319 410087 291365 266018 184413 98479 208002 359177 390679 235952
14728B35952o3100p4790p7910r3344J01068N5877p8175Q7465L2426q5166J9062
$$ 235952 172852 98062 20152 -73192 27876 83753 5578 93043 125469 40303 59365
14717E9365Q2718j287p5301j2085J02334q8443j14692j20432p2467K18768J46358
$$ 59365 142083 140796 65495 53410 155744 67301 -47391 -167823 -240290 -21522 124836
14706A24836j8590n4827j17615k43900J72395J06561k49239q5135j8044L57767
$$ 124836 106246 51419 -66196 -310096 -137701 -31140 -280379 -365514 -383558 -25791
14696b5791K14010J0748j57886j7959J06059j20333k14855J24660M2064L0953
$$ -25791 188219 198967 41081 23122 129181 8848 -206007 -81347 -39283 -8330
14686h330l5978o2472K5424L3682l4207Q999m1341m7698L393O1881L4378J43385
$$ -8330 -44308 -106780 -81356 -47674 -81881 -72882 -114223 -161921 -158528 -96647 -62269 81116
14674H1116N078l330J12446J30279q4514K9028R0855q512l33500r7896j09689
$$ 81116 86194 82864 195310 325589 241075 270103 360958 352446 18946 -78950 -188639
14663a88639j55396J1702J13228J27796O6576k1139k09412k86716R5461K03182
$$ -188639 -344035 -332333 -219105 -91309 -24733 -45872 -255284 -542000 -446539 -243357
14653b43357O8431J55378m372N3327k22007L9211P0508j00781N1692M3092K54747
$$ -243357 -174926 -19548 -23920 29407 -192600 -153389 -82881 -183662 -131970 -88878 165869
14642A65869J55808R2911j82555m075r592K324j79296n5330q3357q1474K23199
$$ 165869 321677 414588 232033 227958 218366 220690 41394 -13936 -97293 -178767 44432
14631D4432J19286k20922p7056J09365L1355n0925K4407l3312j08618j6587M6804
$$ 44432 163718 -57204 -134260 -24895 6460 -44465 -20058 -53370 -161988 -178575 -131771
14620a31771O6009L34759J35326j2057k29102k67580p1783o8316o9024J63845
$$ -131771 -65762 268997 404323 392266 163164 -104416 -176199 -244515 -313539 -149694
14610a49694J88914k2491n5150J45991K6726k9682n3887J41183J10896m1093j26888
$$ -149694 39220 16729 -38421 107570 134296 104614 50727 191910 302806 261713 134825
14599A34825j92790k09478n5963J05469j0588L1854N7318j26722L8448P9286J65350
$$ 134825 -57965 -267443 -323406 -217937 -228525 -196671 -139353 -266075 -227627 -148341 17009
14588A7009K16565j53876m09604q9123M4828K47096k300L0945N3429q3027k4722
$$ 17009 233574 79698 -329906 -419029 -374201 -127105 -129405 -98460 -45031 -128058 -152780
14577a52780j42704j01246j5822J65393K06825o9142J13195Q4708J17327n954
$$ -152780 -295484 -396730 -412552 -247159 -40334 -109476 3719 88427 205754 199800
14567A99800r7680o4748j62428j1304p0642r2750J93111O0092N6257J24102P1764
$$ 199800 102120 37372 -125056 -136360 -207002 -299752 -106641 -46549 9708 133810 205574
14556B05574j75075l1797J4079L4749L28388O4218j96403p2769P4424K73617o0738
$$ 205574 30499 -1298 12781 47530 375918 440136 243733 170964 245388 519005 458267
14545D58267k15134j75346j79152n6648K11832j67009j49501O082R7978J18885
$$ 458267 243133 67787 -111365 -168013 43819 -123190 -272691 -266609 -168631 -49746
14535d9746O1992J32991K2538q2437k17698k3773K09643P5372p8083L0359R4803
$$ -49746 12246 145237 167775 85338 -132360 -156133 53510 128882 50799 81158 175961
14524A75961j45998j37459j65163J53930R9085l8560J24572J0552Q1870J01886
$$ 175961 29963 -107496 -272659 -118729 -19644 -58204 66368 76920 158790 260676
14514B60676j62161k1452j15882q6486l5738J33965J89522j28402j61888l9524
$$ 260676 98515 77063 -38819 -125305 -161043 -27078 162444 34042 -127846 -167370
14504a67370j72212K14145P1027m1668K8645j23983M4165J93447m4404J57878
$$ -167370 -339582 -125437 -54410 -96078 -67433 -191416 -147251 46196 1792 159670
14494A59670Q1890J8068O1627Q6429j26978l03420m6815R8718K8728K7886P2081
$$ 159670 241560 259628 321255 407684 280706 -22714 -69529 29189 57917 85803 157884
14483A57884j32844J7413J4824l98943q1303K10704J75013J6273K09435J1253
$$ 157884 25040 42453 57277 -341666 -422969 -212265 -37252 -20979 188456 199709
14473A99709L3580j94240j40377n6869j24450l1518R555J68211m448L38275m3121
$$ 199709 233289 39049 -101328 -158197 -282647 -314165 -304610 -136399 -140847 197428 154307
14462A54307l82141j14621R7351J55106K1489j01343p1448K7423O4796k38180
$$ 154307 -227834 -342455 -245104 -89998 -68509 -169852 -241300 -213877 -149081 -387261
14452c87261J16860N0386J4210j37477L3393P0658K67074M3247l1795p9631M1819
$$ -387261 -270401 -220015 -205805 -343282 -309889 -239231 27843 71090 39295 -40336 1483
14441A483Q4952o2037j81030j04437L9756N9510j02k9751K1226m926K5540L4977
$$ 1483 86435 24398 -156632 -261069 -221313 -161803 -161905 -191656 -170430 -175356 -149816 -114839
14429a14839L7895m1671k72883O5202o6257J75654K38228R4994p9588r6585J9223
$$ -114839 -76944 -118615 -391498 -326296 -392553 -216899 21329 116323 36735 -59850 -40627
14418d0627O4013j55859J8385J38477j3880J70894k9773K9849k1662K0673n1434
$$ -40627 23386 -132473 -114088 24389 10509 181403 151630 181479 159817 180490 129056
14407A29056J230l9640K79544j04380k06442l48675r08J51902J33079r5122p6806
$$ 129056 130286 90646 370190 265810 59368 -289307 -290215 -138313 -5234 -100356 -177162
14396a77162L4820J86357j41826O5460J89795p7983k48767j28913J99061J75716
$$ -177162 -142342 44015 -97811 -32351 157444 79461 -169306 -298219 -99158 76558
14386G6558J2794M4686k33582j56737m6321J78214J39461m6243j50962j37412
$$ 76558 89352 134038 -99544 -256281 -302602 -124388 15073 -31170 -182132 -319544
14376c19544k9152l017r4439j49572J32607L02511P7759q2558k9958K4669k969
$$ -319544 -348696 -351713 -446152 -595724 -463117 -160606 -82847 -165405 -195363 -170694 -173663
14365a73663j79195J12992Q8113J17218j58126m9927J79443J58095J68621p1778
$$ -173663 -352858 -239866 -151753 -34535 -192661 -242588 -63145 94950 263571 191793
14355A91793j68531j71931j64088J17143L26124M7347k64414k97898J38565J43083
$$ 191793 23262 -148669 -312757 -195614 130510 177857 -86557 -384455 -245890 -102807
14345a02807m3719r2468j97287J13477K00600J21520j68L888L6936K1424k2818
$$ -102807 -146526 -238994 -436281 -322804 -122204 -684 -852 3036 39972 61396 38578
14334C8578P1414M4706j96976j80340j19015Q6841J35403j4009k25514n0759K87898
$$ 38578 109992 154698 -42278 -222618 -341633 -254792 -119389 -133398 -358912 -409671 -121773
14323a21773J35666L0156Q4775P8950K6995k3708l6520l18152k99665j00936R579
$$ -121773 13893 44049 128824 207774 234769 211061 174541 -143611 -443276 -544212 -534633
14312e34633K99752J20506K24742J4958k46449j41635J28621Q6785j1370M3135
$$ -534633 -234881 -114375 110367 125325 -121124 -262759 -134138 -47353 -58723 -15588
14302a5588k3413k03947L7446J45760M3689o6620j20839p8215j44667P1801J89840
$$ -15588 -39001 -242948 -205502 -59742 -16053 -82673 -203512 -281727 -426394 -354593 -164753
14291a64753L6409Q0914j79006Q9499J28011j25427j26020O0426Q2305q2057j95778
$$ -164753 -128344 -47430 -226436 -136937 -8926 -134353 -260373 -199947 -117642 -199699 -395477
14280c95477J18697J67610J60033J82662J53230j54478k20103Q3892J64918j35073
$$ -395477 -276780 -109170 50863 233525 386755 232277 12174 96066 260984 125911
14270A25911k4121R0616j4810j85539l7229K36677R9157j39789o2997k33705k17660
$$ 125911 101790 192406 177596 -7943 -45172 191505 290662 150873 87876 -145829 -363489
14259c63489P1985K90050J41324P5593j03117J78029l2559j23591l2053q2315
$$ -363489 -291504 -1454 139870 215463 112346 290375 257816 134225 102172 19857
14249A9857r3462P3535J75359q8153o2952j17446n2179j37792L0123J82792k9936
$$ 19857 -73605 -70 175289 87136 24184 -93262 -145441 -283233 -253110 -70318 -100254
14238a00254p4781j8643P3176r0951J17008J39506P8785N7983p4120j43879j17398
$$ -100254 -175035 -193678 -120502 -211453 -94445 45061 123846 181829 107709 -36170 -153568
14227a53568l8419o6060J66174o6046k53371j18208r454N7672J01691r996L7085
$$ -153568 -191987 -258047 -91873 -157919 -411290 -529498 -538952 -481280 -379589 -389585 -352500
14216c52500p3820k6583J05905J05106M0602O2960K8324L5626J44779r2424K2920
$$ -352500 -426320 -452903 -346998 -241892 -201290 -138330 -110006 -74380 70399 -22025 895
14205H95R3090N4531j23722j6765j06328k5489j23901R4052K1715k18856J14181
$$ 895 93985 148516 24794 8029 -98299 -123788 -247689 -153637 -131922 -350778 -236597
14194b36597j896K43704J24193j5107n8649p5199K59755J26550J34620j48921
$$ -236597 -238493 5211 129404 114297 55648 -19551 240204 366754 501374 352453
14184C52453n4230m2183p3729j23258O5199j07323j67671j25721L8257J01925
$$ 352453 298223 256040 182311 59053 124252 16929 -150742 -276463 -238206 -136281
14174a36281P88j17113K55692o5531p2083r140o4775K28996R5244o0765p943K17069
$$ -136281 -135493 -252606 3086 -62445 -134528 -143668 -208443 20553 115797 55032 47089 264158
14162B64158p9049K5474l822j08225n6549R0517J2316q9856j02382j69547k8816
$$ 264158 185109 210583 206761 98536 41987 132504 144820 54964 -47418 -216965 -245781
14151b45781R5633o4908j8325m0718J57566J89448n0243j26645l8009j11539Q4648
$$ -245781 -150148 -215056 -233381 -274099 -116533 72915 22672 -103973 -141982 -253521 -168873
14140a68873L5098p5338R8276L4316K8258M7998j36954j32129J05526r9475l1430
$$ -168873 -133775 -209113 -110837 -76521 -48263 -265 -137219 -269348 -163822 -263297 -294727
14129b94727K59335J21429k01182l1171r5089J02185R275J96839J30727k076k36404
$$ -294727 -35392 86037 -115145 -146316 -241405 -139220 -129945 66894 197621 195545 -40859
14118d0859k2481J64013P9470j46677L7857L8816j09712j90472j51706J20908
$$ -40859 -63340 100673 180143 33466 71323 110139 427 -190045 -341751 -220843
14108b20843Q8383K67864J11029k2094q8013j29300q8093j24572j14019j13752
$$ -220843 -132460 135404 246433 224339 136326 7026 -81067 -205639 -319658 -433410
14098d33410j78728q6958K39696N7161N2349j27093j39801J156K2057J21219J20099
$$ -433410 -612138 -699096 -459400 -402239 -349890 -476983 -616784 -615628 -593571 -472352 -352253
14087c52253J18599K0831n4562j64862Q3742P7221J47184J40974K04296J61180
$$ -352253 -233654 -212823 -267385 -432247 -348505 -271284 -124100 16874 221170 382350
14077C82350m8704j67003k75379j12443J11530J6566j17640j44860Q7150p9041
$$ 382350 333646 166643 -108736 -221179 -109649 -93083 -210723 -355583 -268433 -347474
14067c47474J28341J16048M4797j00284j45996j05655K42489n189O1528R772n3590
$$ -347474 -219133 -103085 -58288 -158572 -304568 -410223 -167734 -172923 -111395 -101623 -155213
14056a55213k3376J16404K8431L64565L8353j88243j09720N6886l1828M0102O3797
$$ -155213 -178589 -62185 -33754 330811 369164 180921 71201 128087 96259 136361 200158
14045B00158N9888J7671j36464j35679q6943q5157q8823O3328P4033J37739j58533
$$ 200158 260046 277717 141253 5574 -81369 -166526 -255349 -192021 -117988 19751 -138782
14034a38782j22049q0773R7932m0617N5521J9044J92333K59241J79134j07754
$$ -138782 -260831 -341604 -243672 -284289 -228768 -209724 -17391 241850 420984 313230
14024C13230k54960j43560n558J22685j42889O3669N6698j57493p66k8626N0843
$$ 313230 58270 -85290 -90848 31837 -111052 -47383 9315 -148178 -148944 -177570 -126727
14013a26727j14494j22684K57761J69772L318j04993r7665L6074n585r0477J87717
$$ -126727 -241221 -363905 -106144 63628 66946 -38047 -135712 -99638 -105223 -195700 -7983
14002g983J86029j53539j87535j97306P9066j16384l752J40654J03585l4166j59456
$$ -7983 178046 24507 -163028 -360334 -281268 -397652 -401404 -260750 -157165 -191331 -350787
13991c50787K86548P0411q9332J34668K0975P776J74230k83309l82633J88745
$$ -350787 -64239 6172 -83160 51508 72483 80259 254489 -28820 -411453 -222708
13981b22708Q5157K95581Q4372q7936j49222k15405m2050J66178K7838q6501k9322
$$ -222708 -137551 158030 242402 154466 5244 -210161 -252211 -86033 -58195 -144696 -174018
13970a74018L3365L5660n4571P6888p1984n1510J96930J58829m4085q0740k23201
$$ -174018 -140653 -104993 -159564 -82676 -154660 -206170 -9240 149589 105504 24764 -198437
13959a98437o6151r5693K23544K75627J3072j00251j43005m5624o9041J75733
$$ -198437 -264588 -360281 -136737 138890 151962 51711 -91294 -136918 -205959 -30226
13949c0226P4006Q4980o0943o7749J13222M8662L2121k2273k83472j35601J94354
$$ -30226 43780 128760 67817 68 113290 161952 194073 171800 -111672 -247273 -52919
13938e2919K23020j40850q324j54796K4422k2028N9554J01863j14283p5381m0655
$$ -52919 170101 29251 20927 -133869 -109447 -131475 -71921 29942 -84341 -159722 -200377
13927b00377K7110l7061K7021J19164J63482O6274P2317n2535r6128N9988K156
$$ -200377 -173267 -210328 -183307 -64143 99339 165613 237930 185395 89267 149255 151411
13916A51411j50103j35086l1345K20920J03649j23938j56186P461R7764k6766
$$ 151411 1308 -133778 -165123 55797 159446 35508 -120678 -113217 -15453 -42219
13906d2219J84128O3681m1095J37073K5996J67061o8051q9835k5125j134L2764
$$ -42219 141909 205590 164495 301568 327564 494625 426574 336739 311614 310480 343244
13895C43244o7209j53867P4573P2975q3106o0389m5359K02243k73860l69706r5527
$$ 343244 276035 122168 196741 269716 186610 126221 80862 283105 9245 -360461 -455988
13884d55988J27848K16354J8125j8332j2192j43368j20714n5520J83605K08630
$$ -455988 -328140 -111786 -93661 -111993 -124185 -267553 -388267 -443787 -260182 -51552
13874e1552O4983K2287q8709J09441J99838q5369J46669J67118M9259Q0394O4457
$$ -51552 13431 35718 -52991 56450 256288 170919 317588 484706 533965 614359 678816
13863F78816j10174k29553J2785P4906k65275m8107j33209r8229o8230Q4802M0609
$$ 678816 568642 339089 351874 426780 161505 113398 -19811 -118040 -186270 -101468 -60859
13852f0859O3594J82468j62679j92344p4607J63448j22513j70573J22298K57327
$$ -60859 2735 185203 22524 -169820 -244427 -80979 -203492 -374065 -251767 5560
13842E560K1258j334L489j03369j27447L4377N2287K130J90929o2161j18163k5957
$$ 5560 26818 25484 28973 -74396 -201843 -167466 -115179 -113049 77880 15719 -102444 -128401
13830a28401M8642J33126J72699J74948o9210J07913m4577j66038r7519o906o6729
$$ -128401 -79759 53367 226066 401014 331804 439717 395140 229102 131583 124677 57948
13819E7948n5475j24589n0691j05466k6816N9254J16527J89290k7922j313m6737
$$ 57948 2473 -122116 -172807 -278273 -305089 -245835 -129308 59982 32060 30747 -15990
13808a5990j10308K3485M9762P7328o3156O1108O64k17990N5001K59995j17517
$$ -15990 -126298 -102813 -53051 24277 -38879 22229 22893 -195097 -140096 119899 2382
13797B382m377J90601L0994J6945o1562l7067j99751k5931L0545M0850M0876K8954
$$ 2382 -1995 188606 219600 236545 174983 137916 -61835 -87766 -57221 -16371 24505 53459
13785E3459O5483m5513j63668m6924J6269j1047j17061J78360J08006j55427p2593
$$ 53459 118942 73429 -90239 -137163 -120894 -131941 -249002 -70642 37364 -118063 -190656
13774a90656K740K09782K10772j12789j402J0216J1401K09473J16540J52478J03480
$$ -190656 -187916 21866 232638 119849 118447 128663 140064 349537 466077 618555 722035
13763G22035j99061k59794N2954k24592j39495J59224N8582M3277j65425j50375
$$ 722035 522974 263180 316134 91542 -47953 111271 169853 213130 47705 -102670
13753a02670j8675O7345k9931J61148J43361K8342o481m7902j74668K9125J08477
$$ -102670 -121345 -54000 -83931 77217 220578 248920 242439 194537 19869 48994 157471
13742A57471k15834o2321j23591j94308j81643L5850L83271K53912R4958k6233
$$ 157471 -58363 -120684 -244275 -438583 -620226 -584376 -201105 52807 147765 121532
13732A21532n9973k47765k4311J18176J31250j2175M0346k16386j5719J01595
$$ 121532 61559 -186206 -210517 -92341 38909 26734 67080 -149306 -165025 -63430
13722f3430q0467j6712m0674J15976K30494J6532j50105k2252Q7051J14875J45194
$$ -63430 -143897 -160609 -201283 -85307 145187 161719 11614 -10638 76413 191288 336482
13711C36482j89317L2885J88113j06553k07405j44486j59310N773K91155J70832
$$ 336482 147165 180050 368163 261610 54205 -90281 -249591 -243818 47337 218169
13701B18169p8892r6277p1074l0254J65902L6007k25471j65983L3382q8038N9776
$$ 218169 139277 43000 -28074 -58328 107574 143581 -81890 -247873 -214491 -302529 -242753
13690b42753J94359P1325O2771J18918J6512k20159j92771P9513Q3262J07155
$$ -242753 -48394 22931 85702 204620 221132 973 -191798 -112285 -29023 78132
13680G8132J35424n2312r4978J14574m2186k8450j2522M8471J04966J25356j26308
$$ 78132 213556 161244 66266 180840 138654 110204 97682 146153 251119 376475 250167
13669B50167j61539J91864j69698k96914N6912P7543j43619j57033Q8818J08147
$$ 250167 88628 280492 110794 -186120 -129208 -51665 -195284 -352317 -263499 -155352
13659a55352O7521J47908K94271j75516k21603j18312o4906Q4734J05787j17897
$$ -155352 -87831 60077 354348 178832 -42771 -161083 -225989 -141255 -35468 -153365
13649a53365R7625O5762j66391k0993J6542L9747j42507K9334k6677L8577J08683
$$ -153365 -55740 10022 -156369 -177362 -160820 -121073 -263580 -234246 -260923 -222346 -113663
13638a13663q7834j16152N1225P4552q3355K0741P069P7209q180R7187j67817
$$ -113663 -201497 -317649 -266424 -191872 -275227 -254486 -247417 -170208 -178388 -81201 -249018
13627b49018p8044K33933K67088J45835j47588k86734j15036j2914J10020J71013
$$ -249018 -327062 -93129 173959 319794 172206 -114528 -229564 -242478 -132458 38555
13617C8555l0142O0217j00589L4350M6593n228k13597j24038K06416R1109o729
$$ 38555 8413 68630 -31959 2391 48984 43756 -169841 -293879 -87463 3646 -3083
13606c083P4839J2743p1648o3628k765p2997o837K94822J11693j51646r8292k26126
$$ -3083 71756 84499 12851 -50777 -53542 -126539 -133376 161446 273139 121493 23201 -202925
13594b02925j86841J8913J92853L44234m4677j62038m8323J20631J72670Q6168
$$ -202925 -389766 -370853 -178000 166234 121557 -40481 -88804 31827 204497 290665
13584B90665J47160q8974k70590j32991j69706P5169J30376p6441l0663j32023
$$ 290665 437825 348851 78261 -54730 -224436 -149267 -18891 -95332 -125995 -258018
13574b58018J88866J55392J86075o2017k39927k72994j41103J17239J57551N1871
$$ -258018 -69152 86240 272315 210298 -29629 -302623 -443726 -326487 -168936 -117065
13564a17065J63963j98121l4765R8818O1540k3114l3250m498k51643N027K49944
$$ -117065 46898 -151223 -185988 -87170 -25630 -48744 -81994 -86492 -338135 -333108 -83164
13553h3164Q3119P9430K2295j61436J37383J38850k70059J01677J02155k0803
$$ -83164 -45 79385 101680 -59756 77627 216477 -53582 48095 150250 129447
13543A29447k95989k5317K20794J54356k502M9075p3738o1442n3465k70482r3702
$$ 129447 -166542 -191859 28935 183291 180789 229864 156126 94684 41219 -229263 -322965
13532c22965j5677J00479J22492J07865J12756k7735l1521J29046j2918Q7914
$$ -322965 -338642 -238163 -115671 -7806 104950 77215 45694 174740 161822 249736
13522B49736K961k28517o8884j54194k85744M2293M66488J11228j78328L4389
$$ 249736 252697 24180 -44704 -198898 -484642 -442349 24139 135367 -42961 -8572
13512h572J45551n3148j17381o0157Q973N7727J72479k1118J30380j50098j1131
$$ -8572 136979 83831 -33550 -93707 -84734 -27007 145472 124354 254734 104636 93505
13501I3505N4940J7211J18015q8861k17382P4657j01790R3545k5222M5353q801
$$ 93505 148445 165656 283671 194810 -22572 52085 -49705 43840 18618 63971 55170
13490E5170o746o4621k04534K261K99746R2066j23832k8865R9768j17473K5784
$$ 55170 48424 -16197 -220731 -218470 81276 173342 49510 20645 120413 2940 28724
13479B8724p3264M1083Q5407M4564m3171J76978J38151M6099n6222m8945j72886
$$ 28724 -44540 -3457 81950 126514 83343 260321 398472 444571 388349 339404 166518
13468A66518l6390j00105k23662j7065K33670J15291j8209P3271j06246k93245
$$ 166518 130128 30023 -193639 -210704 22966 138257 120048 193319 87073 -206172
13458b06172R5056K06755r3302M5289j8757l215J06781j50446K8017l8290j09371
$$ -206172 -111116 95639 2337 47626 28869 25654 132435 -18011 10006 -28284 -137655
13447a37655J37815K1742j03040Q2653J64269o7858k5867P241j83471J18552L01733
$$ -137655 160 21902 -81138 1515 165784 97926 72059 79300 -104171 14381 316114
13436C16114j27308j20830J3698q1415j08729M4315j16251j39082l1975j7431
$$ 316114 188806 67976 81674 259 -108470 -64155 -180406 -319488 -351463 -368894
13426c68894M4401o6190J26239K67733j14148P4477N7867J4445K03937J1374j31358
$$ -368894 -324493 -390683 -264444 3289 -110859 -36382 21485 35930 239867 251241 119883
13415A19883j8526O3983R0461J454R256l3237J70047j32882L4316j22379l05435
$$ 119883 101357 165340 255801 257255 266511 233274 403321 270439 304755 182376 -123059
13404a23059J1529J08308N8029r458o4600Q7038q7549l26770J69343J99607J94895
$$ -123059 -111530 -3222 54807 45349 -19251 67787 -19762 -346532 -177189 22418 217313
13393B17313k00699p2079R152o2131R9510L76801O6644l01939j47981K25916J75562
$$ 217313 16614 -55465 -46313 -108444 -8934 367867 434511 132572 -15409 210507 386069
13382C86069j68219j52240j90242K8643M1780J6070m5993j09071n4439R4778P3225
$$ 386069 217850 65610 -124632 -95989 -54209 -38139 -84132 -193203 -247642 -152864 -79639
13371g9639Q275M8001J27447m5000j74499j27039J9848J69908O1970O95k2532
$$ -79639 -71364 -23363 104084 59084 -115415 -242454 -222606 -52698 9272 9967 -12565
13360a2565J51253m3423o569j47865k11314m6682J75582R6939o368k32294j03698
$$ -12565 138688 95265 88696 -59169 -270483 -317165 -141583 -44644 -51012 -283306 -387004
13349c87004k250j5463R4435k4240L5670K00045K40344N1004J444L3646k3589
$$ -387004 -389254 -404717 -310282 -334522 -298852 -98807 141537 192541 193985 227631 204042
13338B04042j9380K6987L3863o2200p1397k36947r4582q8573J33626Q1785L5234
$$ 204042 184662 211649 245512 183312 111915 -125032 -219614 -308187 -174561 -92776 -57542
13327e7542J84635J7850k8284r0817L4000J52020o7293k29404j19696r591j45350
$$ -57542 127093 144943 116659 25842 59842 211862 144569 -84835 -204531 -214122 -359472
13316c59472J8022M6132J25130J14351j42749r9795J42879k2186j11916N7723
$$ -359472 -341450 -295318 -170188 -55837 -198586 -298381 -155502 -177688 -289604 -231881
13306b31881M0656J1956L3449p1733k92395k43349N926L58238L22047k6893j3330
$$ -231881 -191225 -179269 -145820 -217553 -509948 -753297 -747371 -389133 -67086 -93979 -107309
13295a07309L5933K1628k2813j32883m3939l3729j3425J88514J33718r120q5757
$$ -107309 -71376 -49748 -72561 -205444 -249383 -283112 -296537 -108023 25695 16575 -69182
13284f9182K3453j52335j89996J25105J73780J14334n6436r5378j28346k7481
$$ -69182 -45729 -198064 -388060 -262955 -89175 25159 -31277 -126655 -255001 -282482
13274b82482J45884L40519J36361j25159m8690P3634l5047j29210m6798q397Q7954
$$ -282482 -136598 203921 340282 215123 166433 240067 205020 75810 29012 20615 108569
13263A08569J29939n9093j813k0882j95278o8815Q5624J11410j22239j76002m8146
$$ 108569 238508 179415 177602 156720 -38558 -107373 -21749 89661 -32578 -208580 -256726
13252b56726K1703J51733K62611L1458j7426M5062k1666j35969k1473j36401j26961
$$ -256726 -235023 -83290 179321 210779 193353 238415 216749 80780 59307 -77094 -204055
13241b04055P7358J4186j08441M7344m410N6639q7663j7274m6086P3450j630J90598
$$ -204055 -126697 -112511 -220952 -173608 -178018 -121379 -209042 -226316 -272402 -198952 -200582 -9984
13229i984j26857k02284j68621P6685P0010J90354K9871j72216m4374j38348J82294
$$ -9984 -136841 -339125 -507746 -431061 -361051 -170697 -140826 -313042 -357416 -495764 -313470
13218c13470J40100J03588m8076j05940Q4422J3192j65466o526J82276Q6893j2211
$$ -313470 -173370 -69782 -117858 -223798 -139376 -126184 -291650 -298176 -115900 -29007 -41218
13207d1218Q5452P6040J62602R6933m6351j48524P0335j79713r0909N5106P1899
$$ -41218 44234 120274 282876 379809 333458 184934 255269 75556 -15353 39753 111652
13196A11652J92454J02281o6808m7608j4015P9785r6964o2906K1457L3337J11637
$$ 111652 304106 406387 339579 291971 277956 357741 260777 197871 219328 252665 364302
13185C64302R848j53256p4557j56161n0969J51305L4411q9227k6387Q5739n5351
$$ 364302 374150 220894 146337 -9824 -60793 90512 124923 35696 9309 95048 39697
13174C9697r1295j72007N3120p3175J44013J81156K90074l757k52615j07458p7149
$$ 39697 -51598 -223605 -170485 -243660 -99647 81509 371583 367826 115211 7753 -69396
13163f9396L2810M23j5188j94502J37635m6405J77271L45975j20391j53575J07084
$$ -69396 -36586 -36163 -51351 -245853 -108218 -154623 22648 368623 248232 94657 201741
13152B01741Q9734o6777o4445M2466K51605J39248j78169j36107o758k20478m1797
$$ 201741 291475 224698 160253 202719 454324 593572 415403 279296 272538 52060 10263
13141A0263J14011J52644o3345j11934j70669R0805n0730J18014q2614j77459
$$ 10263 124274 276918 213573 101639 -69030 21775 -28955 89059 6445 -171014
13131a71014p0268r8721R3701L06860m5098j20470J45469R8652k29746q3785L671
$$ -171014 -241282 -340003 -246302 60558 15460 -105010 40459 139111 -90635 -174420 -170749
13120a70749M1390k159Q8754L00123J20198j99569j35183o1568L2062n5886o1460
$$ -170749 -129359 -131518 -42764 257359 377557 177988 42805 -18763 13299 -42587 -104047
13109a04047J5641J4194O6725O4106J18624K32734r4274k13678O7235J47741k43244
$$ -104047 -88406 -74212 -7487 56619 175243 407977 313703 100025 167260 315001 71757
13098G1757j86655J3999o212Q1340p4649J26261Q2280N2886O227k1050R6698n2768
$$ 71757 -114898 -100899 -107111 -25771 -100420 25841 108121 161007 167234 146184 242882 190114
13086A90114o9845l5275J23750M5465j2876r7257N8691K6924q822L0008j83446
$$ 190114 120269 84994 208744 254209 241333 144076 202767 229691 220869 250877 67431
13075F7431k5385M6767j2649L80930J3016k00583k05595j0244P0733m4469L5613
$$ 67431 42046 88813 76164 457094 470110 269527 63932 53688 124421 79952 115565
13064A15565M5086m7306N2486m1673l06680j2416J00045J28184m4137k8725k698
$$ 115565 160651 113345 165831 124158 -182522 -194938 -94893 33291 -10846 -39571 -42269
13053d2269r9219j68390p5358j24113J02275M9888k61618J56423J52000K07007
$$ -42269 -141488 -309878 -385236 -509349 -407074 -357186 -618804 -462381 -310381 -103374
13043a03374J61657j71656j28607k9589O7209J53637N2552o9481K893j5337p0032
$$ -103374 58283 -113373 -241980 -271569 -204360 -50723 1829 -67652 -64759 -80096 -150128
13032a50128Q7638L20073J97306j98884k40341j04581J79324j4585j32185P589
$$ -150128 -62490 257583 454889 256005 15664 -88917 90407 75822 -56363 -48774
13022d8774K2373M4339j34108o1137J39238J13366R2560K6666n3403j16496j25033
$$ -48774 -26401 17938 -116170 -177307 -38069 75297 167857 194523 141120 24624 -100409
13011a00409J18126J93075J80512j23901j30241k81507m9225J48889P1068P3743
$$ -100409 17717 210792 391304 267403 137162 -144345 -193570 -44681 26387 100130
13001A00130k099K28626p9005k59421q1563K350O2647R9071J28446j36223k11447
$$ 100130 98031 326657 247652 -11769 -93332 -90982 -28335 70736 199182 62959 -148488
12990a48488j13906K71944J63543j01363p8337k4069R2722K2396K18783k788j34168
$$ -148488 -262394 9550 173093 71730 -6607 -30676 62046 84442 303225 300437 166269
12979A66269j15017j11887P1487K02064J48631j14493R3307k15910k18282J21655
$$ 166269 51252 -60635 10852 212916 361547 247054 340361 124451 -93831 27824
12969B7824J97954k1164j28340M9084M1540O859j3127k13297m9069R7922J3652
$$ 27824 225778 204614 76274 125358 166898 173757 160630 -52667 -101736 -3814 9838
12958I838N8096m3882P4496m3090l6324j63356l1779L5446K6382q7281j81852
$$ 9838 67934 24052 98548 55458 19134 -144222 -176001 -140555 -114173 -201454 -383306
12947c83306J73929M5969k8937J99582J54128O2642K5133J3483k5090q7955j76394
$$ -383306 -209377 -163408 -192345 7237 161365 224007 249140 262623 237533 149578 -26816
12936b6816j28880J07354J20145L4912N2466n7753L6098P1294q9340k6022M8429
$$ -26816 -155696 -48342 71803 106715 159181 101428 137526 208820 119480 93458 141887
12925A41887q0703M3983l6440j43893N5291J30468l974r0372K0477Q1459K2385
$$ 141887 61184 105167 68727 -75166 -19875 110593 106619 16247 36724 118183 140568
12914A40568j27930l4201L9472k022M4488J56191Q6964k7421j45387j72962M0215
$$ 140568 12638 -21563 17909 15887 60375 216566 303530 276109 130722 -42240 -2025
12903b025J57903P200m4353r0499j04837N2510J64346J95713J05878j49337k42299
$$ -2025 155878 163078 118725 28226 -76611 -24101 140245 335958 441836 292499 50200
12892E0200O637J46338j78343k01973j15240O892J64930L8650J1121R4976j6479
$$ 50200 56837 203175 24832 -177141 -292381 -285489 -120559 -81909 -70788 24188 7709
12881G709k7656k4197p6997L3687J17321Q5854K15348p524j08679k45675j22106
$$ 7709 -19947 -44144 -121141 -87454 29867 115721 331069 323545 214866 -30809 -152915
12870a52915o8872K5331O858m7060K52354K49876K58713q2401q605O1121J0596
$$ -152915 -221787 -196456 -189598 -236658 15696 265572 524285 441884 433279 494400 504996
12859E04996j12710p5527k9999n0805p1848j08819p230K17j76107j34855K49715
$$ 504996 392286 316759 286760 235955 164107 55288 48058 48275 -127832 -262687 -12972
12848a2972K54803o3345j78679n5626J2632J35117j12306j24944J09081K08076
$$ -12972 241831 178486 -193 -55819 -43187 91930 -20376 -145320 -36239 171837
12838A71837O9394o5376k9900p465j45638j42715q3800J13118L5086k8071k8056
$$ 171837 241231 175855 145955 138490 -7148 -149863 -233663 -120545 -85459 -113530 -141586
12827a41586J24112j53846m5814M60014J35437k90486j88087J98012j31612J13641
$$ -141586 -17474 -171320 -217134 242880 378317 87831 -100256 97756 -33856 79785
12817G9785K21204P0636j25681k91922p117o4711K7504j4673o7207R9182O4690
$$ 79785 300989 371625 245944 -45978 -53095 -117806 -90302 -104975 -172182 -73000 -8310
12806h310J44971J16877k48207k56930J19462J70801l453j8625L2840n166J13463
$$ -8310 136661 253538 5331 -251599 -132137 38664 35211 16586 49426 44260 157723
12795A57723j01178j1150R1707O5491K09994L00913m2163k77306o8154j09768
$$ 157723 56545 45395 137102 202593 412587 713500 671337 394031 325877 216109
12785B16109k51935m3907P704J92869J57584O4054k50578O9848J31469J4435r6686
$$ 216109 -35826 -79733 -72029 120840 278424 342478 91900 161748 293217 307652 210966
12774B10966N7119R5542O0370j13440p0607m2436j62060K6508J66289r9922k2591
$$ 210966 268085 363627 423997 310557 239950 197514 35454 61962 228251 128329 105738
12763A05738m5230R0068m245o3916J10993J38158r8542K2755j6128k765J5524
$$ 105738 60508 150576 146331 82415 193408 331566 233024 255779 239651 236886 252410
12752B52410o1874j33724j7766o0168m4608k5492j08198m070j5096K05604Q265
$$ 252410 190536 56812 39046 -21122 -65730 -91222 -199420 -203490 -218586 -12982 -4717
12741d717K8775n2895K7531J09519J4303M652m7979n6939j34180k8020O6337J12009
$$ -4717 24058 -28837 -1306 108213 122516 127168 79189 22250 -111930 -139950 -73613 38396
12729C8396r1873j84595K6719O9759J51975J10630K8918j77218k276R1265j5198
$$ 38396 -53477 -238072 -211353 -141594 10381 121011 149929 -27289 -29565 61700 46502
12718D6502o7433N4105m8290J47027J22248J27721j71715j0363K12565Q8542o632
$$ 46502 -20931 33174 -15116 131911 254159 381880 210165 199802 412367 500909 494277
12707D94277l05966j53135l3036j33182O7405J09777K44131O1413q639K3931M863
$$ 494277 188311 35176 2140 -131042 -63637 46140 290271 351684 343045 366976 371839
12696C71839j61863k5787r3183m4714K11410j14168O0189J69590P5191k29589
$$ 371839 209976 184189 91006 46292 257702 143534 203723 373313 448504 218915
12686B18915j36714o7082q0433N8354J87990P3570K13869r7846m4272j32734j49430
$$ 218915 82201 15119 -65314 -6960 181030 254600 468469 370623 326351 193617 44187
12675D4187J98184K27516j31885l7107j35605N0313J32588J72113K17005n2035
$$ 44187 242371 469887 338002 300895 165290 215603 348191 520304 737309 685274
12665F85274j66592J4154r6068j46703R3298l0234q005j29572K0309o7643l0962
$$ 685274 518682 532836 436768 290065 383363 353129 345124 215552 235861 168218 137256
12654A37256Q3212R9337J63463L1520P8417J42378r549K99486P804p1937l800
$$ 137256 220468 319805 483268 514788 593205 735583 726034 1025520 1033324 961387 957587
12643I57587j6715K1174r1354m747K7716J7687J03868j47384j04277L6072r3316
$$ 957587 940872 962046 870692 865945 893661 911348 1015216 867832 763555 799627 706311
12632G06311q3686K14455O5850n3223j1664j64704j91357M5542R1598j72720j20578
$$ 706311 622625 837080 902930 849707 838043 673339 481982 527524 619122 446402 325824
12621C25824m7751k0178o5647n9453L6575K37726J86935k20814j34052n5075P8898
$$ 325824 278073 257895 192248 132795 169370 407096 594031 373217 239165 184090 262988
12610B62988m2565j50714J59356O4355J22139J5242j42206l8050q373M3459k2663
$$ 262988 220423 69709 229065 293420 415559 430801 288595 250545 242172 285631 262968
12599B62968p7279o4848J42409J20051P1758J20403J72701k51772j52359j73563
$$ 262968 185689 120841 263250 383301 455059 575462 748163 496391 344032 170469
12589A70469r443J12150K05101k7351j79069J70585Q9929p4209l47384J82551
$$ 170469 161026 273176 478277 450926 271857 442442 532371 458162 110778 293329
12579B93329K34151k70529k8103K09415K31035j45579k07873j02444J40710n242
$$ 293329 527480 256951 228848 438263 669298 523719 315846 213402 354112 348870
12569C48870r9635k6431k21812J90644q2473k08886J9701J23139J28979K17508
$$ 348870 249235 222804 992 191636 109163 -99723 -80022 43117 172096 389604
12559C89604K8094n5836k72969N1800J80444j06134M4348l1046K8733J00283m0057
$$ 389604 417698 361862 88893 140693 321137 215003 259351 228305 257038 357321 317264
12548C17264J18042K0544j4927j38864j25057O2955Q1339O3884l6340J08162J94936
$$ 317264 435306 455850 440923 302059 177002 239957 321296 385180 348840 457002 651938
12537F51938j2310k54957j67121j7007K8378m8929j6373P4251l7492J16836J2195
$$ 651938 639628 384671 217550 200543 228921 179992 163619 237870 200378 317214 329409
12526C29409N9253m7354R3609J01031K38860J57887p1578k41639j78915l3203
$$ 329409 388662 341308 434917 535948 774808 932695 861117 619478 440563 407360
12516D07360r8966l3148j01100j22467R2318J94450p3320L635r5078j82455N8104
$$ 407360 308394 275246 174146 51679 143997 338447 265127 268762 173684 -8771 49333
12505D9333K29659J42132J29684j5868q8875K3940j8182k05284j26213j27047
$$ 49333 278992 421124 550808 534940 446065 470005 451823 246539 120326 -6721
12495f721O8664K57556N8868n5050M6344J22385j84087K0766J84004L4240j30349
$$ -6721 61943 319499 378367 323317 369661 492046 307959 328725 512729 546969 416620
12484D16620k33301l6260n3601K05151Q640J06238J36783J13058j58578n2690
$$ 416620 183319 147059 93458 298609 307249 413487 550270 663328 504750 452060
12474D52060J9788j7306j41429J1909J20137L6449L02416J86604j43397l26049
$$ 452060 471848 454542 313113 325022 445159 481608 784024 970628 827231 501182
12464E01182k28085q1232j1824K3727N7175K31534R9594J72682q0650N051j09068
$$ 501182 273097 191865 180041 203768 260943 492477 592071 764753 684103 689154 580086
12453E80086j08258J92180L1252m1680o8288l9539j43166J9377L7388J6629j6290
$$ 580086 471828 664008 695260 653580 585292 545753 402587 421964 459352 475981 459691
12442D59691J40931n9527m1676K2403R6008J41036k0377N7500l4969L2331O0992
$$ 459691 600622 541095 499419 521822 617830 758866 738489 795989 761020 793351 854343
12431H54343j66371j71225J57216J53551K700j07073K0565J6159o3383P0286k76393
$$ 854343 687972 516747 673963 827514 830214 723141 743706 759865 696482 766768 490375
12420D90375J06351k8516p1524o9010p1495L9248k3348j07188n9676j61145K05095
$$ 490375 596726 568210 496686 427676 356181 395429 372081 264893 205217 44072 249167
12409B49167P108k3452L5600K56972J51953j88546p544j1233K1672p8454O3673
$$ 249167 256275 232823 268423 525395 677348 488802 481258 470025 491697 413243 476916
12398D76916J15153j4894J33382m6719L6878K64094O8389j71173r2216J04271
$$ 476916 592069 577175 710557 663838 700716 964810 1033199 862026 769810 874081
12388H74081J25396j94751o9728J48137K51694O8712m4279m19193o3212J58947
$$ 874081 999477 804726 734998 883135 1134829 1203541 1159262 740069 676857 835804
12378H35804k9095j04836N6637R0486j09743J649Q2658L0888j00976J84103J84227
$$ 835804 806709 701873 758510 848996 739253 740902 823560 854448 753472 937575 1121802
12367A121802R7501l3108r8557j07492j06714k1943O7611l2817r7252k43187j40740
$$ 1121802 1219303 1186195 1087638 980146 873432 851489 919100 886283 789031 545844 405104
12356D05104J05684P1726O749O6216Q2959p4908p7212r9845K6551J40768J62256
$$ 405104 510788 582514 589263 655479 738438 663530 586318 486473 513024 653792 816048
12345H16048k3668k76566M2002K62742M2539p9394L9730J43354j41003k60496
$$ 816048 792380 515814 557816 820558 863097 783703 823433 966787 825784 565288
12335E65288j75940L4531K29473K6551R9858N9382J75758J53101J77746O3102
$$ 565288 389348 423879 653352 679903 779761 839143 1014901 1168002 1345748 1408850
12325A408850k30432p3105Q7955R602p5872q5794j02451j23110j0533J9498J88967
$$ 1408850 1178418 1105313 1193268 1202870 1126998 1041204 938753 815643 805110 824608 1013575
12314A013575J7195m9805K9463J1846Q58l1728J60179k1938n2209J51956J73349
$$ 1013575 1030770 980965 1010428 1022274 1023132 991404 1151583 1129645 1077436 1229392 1402741
12303A402741j73588J10423Q709j94518k95264J3032M0641j67433j3688K24882
$$ 1402741 1229153 1339576 1348285 1153767 858503 871535 912176 744743 731055 955937
12293I55937K6589K35779k86611m4380J03446J01546j07952r03J23555j8224p3236
$$ 955937 982526 1218305 931694 887314 990760 1092306 984354 983451 1107006 1088782 1015546
12282A015546P8934L0167R265O054M6956j74328k6114J18235J52928R27R3364
$$ 1015546 1094480 1124647 1133912 1139966 1186922 1012594 986480 1104715 1257643 1258570 1351934
12271A351934o9207J5112J8960j45264J810P0706M6292J13355J10179j42049J37245
$$ 1351934 1282727 1297839 1316799 1171535 1173345 1244051 1290343 1403698 1513877 1371828 1509073
12260A509073j2153J51768K5881j35621k19226J69569R2522q082k09623j98003
$$ 1509073 1496920 1648688 1674569 1538948 1319722 1489291 1581813 1573731 1364108 1166105
12250A166105j59079J17624J25147R0086K56866j10214l07333o1779K54382K23323
$$ 1166105 1007026 1124650 1249797 1339883 1596749 1486535 1179202 1117423 1371805 1595128
12240A595128r9872j22296j03790L0347J70120J04136J08549J19032J91985m0377
$$ 1595128 1495256 1372960 1269170 1299517 1469637 1573773 1682322 1801354 1993339 1952962
12230A952962j38037Q444K3102P1789K05589m876k04550k61189j17681J3751j08763
$$ 1952962 1814925 1823369 1846471 1918260 2123849 2118973 1914423 1653234 1535553 1549304 1440541
12219A440541J41963R6956q6197j03490J81086j12146n7352K44428P7278p6749
$$ 1440541 1582504 1679460 1593263 1489773 1670859 1558713 1501361 1745789 1823067 1746318
12209A746318J25980K8806o8365n034J71766n8473k07978M732K1251J567M8449
$$ 1746318 1872298 1901104 1832739 1827705 1999471 1940998 1733020 1737752 1759003 1760570 1809019
12198A809019M3476o0322K2411q0167j00883L891Q1063K67325J71632N501q1940
$$ 1809019 1852495 1792173 1814584 1734417 1633534 1637425 1718488 1985813 2157445 2162946 2081006
12187B081006o2205P698m4898J06789j4373j21267J72975J7893K6141l9682q5725
$$ 2081006 2018801 2026499 1981601 2088390 2074017 1952750 2125725 2143618 2169759 2130077 2044352
12176B044352j33560R3930J61436K22050N7348p0167J2124j25953m3912J12667
$$ 2044352 1910792 2004722 2166158 2388208 2445556 2375389 2387513 2261560 2217648 2330315
12166B330315L2345J54484M0067k4332o7118k1407P404n7046j92603J8997k659
$$ 2330315 2362660 2517144 2557211 2532879 2465761 2444354 2451758 2394712 2202109 2221106 2218447
12155B218447O5192M5791L45988K60163n3459O1437k61468k95846j54931K84654
$$ 2218447 2283639 2329430 2675418 2935581 2882122 2943559 2682091 2386245 2231314 2515968
12145B515968J93714K5016K2910J31725p4953j07225j8131J60136Q5132P5554
$$ 2515968 2709682 2734698 2757608 2889333 2814380 2707155 2689024 2849160 2934292 3009846
12135C009846j38466n1723L36853N7474j81530N9654m4280j038M1240J1913n7252
$$ 3009846 2871380 2819657 3156510 3213984 3032454 3092108 3047828 3046790 3088030 3099943 3042691
12124C042691K18667J81516J08902J03327P25k43296j60797M6496k9124o1862
$$ 3042691 3261358 3442874 3551776 3655103 3655828 3412532 3251735 3298231 3269107 3207245
12114C207245j1049l3438J21230M39460J39461M2302n570j20734J04350L35200
$$ 3207245 3196196 3162758 3283988 3723448 3862909 3905211 3899641 3778907 3883257 4218457
12104D218457K83275O9942m8985l42p0260j22591J55640n0874q7616Q9261J20662
$$ 4218457 4501732 4571674 4522689 4522347 4452087 4329496 4485136 4434262 4346646 4435907 4556569
12093D556569j05942J37694K9284m959K12609M7648J55266O6019j7647K5756J31561
$$ 4556569 4450627 4588321 4617605 4612646 4825255 4872903 5028169 5094188 5076541 5102297 5233858
12082E233858L2635k9373J61600l6304J4532J63486J49059r9546L3493m5936l4635
$$ 5233858 5266493 5237120 5398720 5362416 5376948 5540434 5689493 5589947 5623440 5577504 5542869
12071E542869r3779K24902K85766R6801l6801j01127M3756P7393J91438K78585
$$ 5542869 5449090 5673992 5959758 6056559 6019758 5918631 5962387 6039780 6231218 6509803
12061F509803j73168K03545L31228K32590J05219j81164m9596J49842N0085J55141
$$ 6509803 6336635 6540180 6871408 7103998 7209217 7028053 6978457 7128299 7178384 7333525
12051G333525K15021n0013q8716j29840o6996J97380M65501J14195j03455Q2265
$$ 7333525 7548546 7498533 7409817 7279977 7212981 7410361 7875862 7990057 7886602 7968867
12041G968867p340j53377m872K11935P8425K51484K57122K40281r0518O0051o0033
$$ 7968867 7961527 7808150 7803278 8015213 8093638 8345122 8602244 8842525 8752007 8812058 8752025
12030H752025j2400J19681J22655J90686K71390J45407l0836J32497M09880K15693
$$ 8752025 8739625 8859306 8981961 9172647 9444037 9589444 9558608 9691105 10100985 10316678
12020A0316678J72492L6083J12150L42859j969J3300K33142O2688k5147M4662
$$ 10316678 10489170 10525253 10637403 10980262 10978293 10991593 11224735 11287423 11262276 11306938
12010A1306938J10782K00103J40991L50879M92977K99084m0341J45164J76879
$$ 11306938 11417720 11617823 11758814 12109693 12602670 12901754 12861413 13006577 13183456
12001A3183456J53554L97992K57319j78057o8268K44613M54039L08837J53534
$$ 13183456 13337010 13735002 13992321 13814264 13745996 13990609 14444648 14753485 14907019
11992A4907019J43938K18529K37849K00237J2029J28235L80569L08328L7161J09452
$$ 14907019 15050957 15269486 15507335 15707572 15719601 15847836 16228405 16536733 16573894 16683346
11982A6683346j2674J21313J93767J48230N01215J65510N6612L01717J85403J15800
$$ 16683346 16670672 16791985 16985752 17133982 17635197 17800707 17857319 18159036 18344439 18460239
11972A8460239K55497K7491J08544K75634J59062K02887M10683K37161Q9709Q9278
$$ 18460239 18715736 18743227 18851771 19127405 19286467 19489354 19900037 20137198 20226907 20316185
11962B0316185L71641K91789k3002P9202R6904L25808O8239L48951M77611L26840
$$ 20316185 20687826 20979615 20956613 21035815 21132719 21458527 21526766 21875717 22353328 22680168
11952B2680168Q9831j2702M8527j83965m4155R4937K49575K78955K61510K22012
$$ 22680168 22769999 22757297 22805824 22621859 22577704 22672641 22922216 23201171 23462681 23684693
11942B3684693K90923O3869Q1092j4945R2442n9144Q3317K80465K06164K42426
$$ 23684693 23975616 24039485 24120577 24105632 24198074 24138930 24222247 24502712 24708876 24951302
11932B4951302J81245j14938k30360m4231L316n4691n6285L45001L23127J3493
$$ 24951302 25132547 25017609 24787249 24743018 24746334 24691643 24635358 24980359 25303486 25316979
11922B5316979l0855l32104p5082j16799L7078J62664j37192l6914q7883k18727
$$ 25316979 25286124 24954020 24878938 24762139 24799217 24961881 24824689 24787775 24699892 24481165
11912B4481165l9315Q6388N4392q1321k3536l84583l90504j07452j03963m0090
$$ 24481165 24441850 24528238 24582630 24501309 24477773 24093190 23702686 23595234 23491271 23451181
11902B3451181K5957j26935K5507k28801j61218N3793j26275l34487m31142p7497
$$ 23451181 23477138 23350203 23375710 23146909 22985691 23039484 22913209 22578722 22147580 22070083
11892B2070083Q0224r871j20123k89519m23470k48612q1357O142k07607k58569
$$ 22070083 22150307 22140436 22020313 21730794 21307324 21058712 20977355 20983497 20775890 20517321
11882B0517321k79279k17034n2087r3894k03803L4582k33454j90995k52119k24286
$$ 20517321 20238042 20021008 19968921 19875027 19671224 19705806 19472352 19281357 19029238 18804952
11872A8804952k28977j54499J19686j74341j24413j95362j27798k10987l39449
$$ 18804952 18575975 18421476 18541162 18366821 18242408 18047046 17919248 17708261 17368812
11863A7368812k98796k45651L9443j21055l03239k80103L3119o4831j03650j60489
$$ 17368812 17070016 16824365 16863808 16742753 16439514 16159411 16192530 16127699 16024049 15863560
11853A5863560j38962k79802l29889j91406p859r8935p9104m03539l15062o3489
$$ 15863560 15724598 15444796 15114907 14923501 14915642 14816707 14737603 14334064 14019002 13955513
11843A3955513j02817r007j7176j26786l92014l23997K1287J98664P915k61518
$$ 13955513 13852696 13843689 13826513 13699727 13307713 12983716 13005003 13203667 13211582 12950064
11833A2950064l32503k44552Q0192j02908k47624j26080J5350j95473j18054k452
$$ 12950064 12617561 12373009 12453201 12350293 12102669 11976589 11991939 11796466 11678412 11675960
11823A1675960k7006l86423l49208N8253l5681k24691j28675Q7766L9206l16588
$$ 11675960 11648954 11262531 10913323 10971576 10935895 10711204 10582529 10670295 10709501 10392913
11813A0392913k52057j33278j11085k8437J37484j76314j26743j54113j58261
$$ 10392913 10140856 10007578 9896493 9868056 10005540 9829226 9702483 9548370 9390109
11804I390109p1417L381o6475j46985j21996n3507j04551j44692k73358J45118
$$ 9390109 9318692 9322073 9255598 9108613 8986617 8933110 8828559 8683867 8410509 8555627
11794H555627O6546j15865K3147R5874k79425k50409j63123j02242q1099r5129
$$ 8555627 8622173 8506308 8529455 8625329 8345904 8095495 7932372 7830130 7749031 7653902
11784G653902M3213J17548k54966j79430j81401J45210Q5475k08103l07474p8213
$$ 7653902 7697115 7814663 7559697 7380267 7198866 7344076 7429551 7221448 6913974 6835761
11774F835761P0324Q473l6826J948k22398M151j0265p3938j86234p262p9121q931
$$ 6835761 6906085 6914558 6877732 6879680 6657282 6661433 6651168 6577230 6390996 6383734 6304613 6295682
11762F295682J53608N2891k01326m09821k30848l6130j28196q359K8005N1729
$$ 6295682 6449290 6502181 6300855 5891034 5660186 5624056 5495860 5487501 5515506 5567235
11752E567235M9892n0227p9025j91170j8995J95171J76351R784j40317k59219
$$ 5567235 5617127 5566900 5487875 5296705 5277710 5472881 5649232 5659016 5518699 5259480
11742E259480k14384l8356k1614q5163n8674L0691L1003M2228K6722k0859r8348
$$ 5259480 5045096 5006740 4985126 4899963 4841289 4871980 4902983 4945211 4971933 4951074 4852726
11731D852726j4243m2685J18096q0644k25245k35210m9429r9131j75123K2993
$$ 4852726 4838483 4795798 4913894 4833250 4608005 4372795 4323366 4224235 4049112 4072105
11721D072105J4914j35680j35379J76910M9834m8150J54794k45684j37189q3256
$$ 4072105 4087019 3951339 3815960 3992870 4042704 3994554 4149348 3903664 3766475 3683219
11711C683219q9540n3915J96160o4488k58451N8154P3224J16386J5982j25748
$$ 3683219 3593679 3539764 3735924 3671436 3412985 3471139 3544363 3660749 3676731 3550983
11701C550983N0633J28937K8550r6790J99824j10477j79589L0462k04644N867
$$ 3550983 3601616 3730553 3759103 3662313 3862137 3751660 3572071 3602533 3397889 3403756
11691C403756N2700j07313M1662N9933n0306j33077R6184O4342m2441k4230j19289
$$ 3403756 3456456 3349143 3390805 3450738 3400432 3267355 3363539 3427881 3385440 3361210 3241921
11680C241921J33249o4064l45926M9779M6846k3450j9731k16341L4140M8855j51661
$$ 3241921 3375170 3311106 2965180 3014959 3061805 3038355 3018624 2802283 2836423 2885278 2733617
11669B733617j18005j15591J91717M8819J2511L1937k8740q6690j26933Q4695
$$ 2733617 2615612 2500021 2691738 2740557 2753068 2785005 2756265 2669575 2542642 2627337
11659B627337k3459k98162j13136K34769O7284M7223j67159j16145q170j73553
$$ 2627337 2603878 2305716 2192580 2427349 2494633 2541856 2374697 2258552 2250382 2076829
11649B076829K8162L25692j103K8192P2653K006j5561J35128p0603j10613k35732
$$ 2076829 2104991 2430683 2429580 2457772 2530425 2532431 2516870 2651998 2581395 2470782 2235050
11638B235050p9170K68629r5925j21016p5095J50336N482q3569P9908k5485n5807
$$ 2235050 2155880 2424509 2328584 2207568 2132473 2282809 2288291 2204722 2284630 2259145 2203338
11627B203338P3046j42251j13596Q4854j50516n737m3146J22592j37144p1729
$$ 2203338 2276384 2134133 2020537 2105391 1954875 1949138 1905992 2028584 1891440 1819711
11617A819711M0210n723k11878m962K97812k648j4887j38625j41793q8609o7738
$$ 1819711 1859921 1854198 1642320 1637358 1935170 1932522 1917635 1779010 1637217 1548608 1480870
11606A480870J16306P9972j56433j60806k65884o2499K66688J40596M0269J4832
$$ 1480870 1597176 1677148 1520715 1359909 1094025 1031526 1298214 1438810 1479079 1493911
11596A493911o3795o5200j8369M9834o8724O2502J72936J12598J087j63643n3487
$$ 1493911 1430116 1364916 1346547 1396381 1327657 1390159 1563095 1675693 1676780 1513137 1459650
11585A459650J26006m3210j34179j08152J56869J18332J36947O3167o9727O4163
$$ 1459650 1585656 1542446 1408267 1300115 1456984 1575316 1712263 1775430 1705703 1769866
11575A769866j26879m6930j5676r8428j92820k40836n4050q5697R7611J28727
$$ 1769866 1642987 1596057 1580381 1481953 1289133 1048297 994247 908550 1006161 1134888
11565A134888K83720K82831j47693j00052L4940p8631K4537k90608j20618J85298
$$ 1134888 1418608 1701439 1553746 1453694 1488634 1410003 1434540 1143932 1023314 1208612
11555A208612p292J69430j24258k38221K6009J12959N9137k11821j34977m0343
$$ 1208612 1201320 1370750 1246492 1008271 1034280 1147239 1206376 994555 859578 819235
11545H19235J06875J65230P9542J1992K70402O4250r5971l1442P0366k22745j55047
$$ 819235 926110 1091340 1170882 1182874 1453276 1517526 1421555 1390113 1460479 1237734 1082687
11534A082687R9339J9734k6592j4533R4329l8634k12355m0411P6905Q0133J00174
$$ 1082687 1182026 1201760 1175168 1160635 1254964 1216330 1003975 963564 1040469 1120602 1220776
11523A220776J470j82612p2780J2523r2484j412K54010J42273j11169J07809q4601
$$ 1220776 1222246 1039634 966854 979377 886893 885481 1139491 1281764 1170595 1278404 1193803
11512A193803k59893j75335j8262J13995K7963j24763j3671k7893Q8996J75096
$$ 1193803 933910 758575 740313 854308 882271 757508 743837 715944 804940 980036
11502I80036J03339j60447n1546j06331P7062J35835l092q5572j23627j03818
$$ 980036 1083375 922928 871382 765051 842113 977948 974856 889284 765657 661839
11492F61839j2856m9866K56295J36103j08988P731J66329r2705j2922K0207l1749
$$ 661839 648983 599117 855412 991515 882527 890258 1056587 963882 950960 971167 939418
11481I39418p3970J22886J581J61102P4521j02211j03304j07034j50737m8488
$$ 939418 865448 988334 989915 1151017 1225538 1123327 1020023 912989 762252 713764
11471G13764J30841O8923L5850r476l8622j95086m9703K1496o9778J04037J28854
$$ 713764 844605 913528 949378 939902 901280 706194 656491 677987 608209 712246 841100
11460H41100P8564M5451n2662j57032j32080Q1306J43182j14996m5422M0805L1946
$$ 841100 919664 965115 912453 755421 623341 704647 847829 732833 687411 728216 760162
11449G60162J09790R3299k02085J5868p9866j14994Q4439j20737j4027J89410
$$ 760162 869952 963251 761166 777034 697168 582174 666613 545876 531849 721259
11439G21259J86097O0552k2432n6902r3608q0045j40613J18199O2682j57134p6219
$$ 721259 907356 967908 945476 888574 794966 714921 574308 692507 755189 598055 521836
11428E21836Q7579J81025j71712k98535p2422K21236M1195k0757K1265j6133o26
$$ 521836 609415 790440 618728 320193 247771 469007 510202 489445 510710 494577 493951
11417D93951n1151k8694J7343J36515J17324P4000k06726q6536R2750j99281j9460
$$ 493951 442800 414106 431449 567964 685288 759288 552562 466026 558776 359495 340035
11406C40035J34585P2517o5390j91819J8455K15469m6537o6108K17624K9271r5253
$$ 340035 474620 547137 481747 289928 308383 523852 477315 411207 628831 658102 562849
11395E62849j49690j24450Q3134O1852R6537j84836j7359Q1690J06537J84664
$$ 562849 413159 288709 371843 433695 530232 345396 328037 409727 516264 700928
11385G00928J3587L9880j56009j81058K2245J55279K02437j47574j16883P160
$$ 700928 714515 754395 598386 417328 439573 594852 797289 649715 532832 539992
11375E39992k20068K3511K77884J79260K749j47238j29421j71844k5489J96694
$$ 539992 319924 343435 621319 800579 803328 656090 526669 354825 329336 526030
11365E26030j3188R549k2912M6044J08890l66708m8549J62233M9760o5368L0246
$$ 526030 512842 522391 499479 545523 654413 287705 239156 401389 451149 385781 416027
11354D16027q4059j1185o401K04080j1066N4206j09682j87830J18692n686j42097
$$ 416027 331968 320783 314382 518462 507396 561602 451920 264090 382782 377096 234999
11343B34999l1831J0388Q5710j2547N1158Q2247j1829J48272K03340P7747j53854
$$ 234999 203168 213556 299266 286719 337877 420124 408295 556567 759907 837654 683800
11332F83800k99111k4422R4436N7479p1810m4699k40764r7500K85322j6203l2729
$$ 683800 384689 360267 454703 512182 440372 395673 154909 57409 342731 326528 293799
11321B93799J54665k1137q0894N3858l0362l1276L9328J4450l811N1810n9076
$$ 293799 448464 427327 346433 400291 369929 338653 377981 392431 388620 440430 381354
11310C81354M9094R9166j28706l3288p499n0454P6673O0904n4252j67181J36296
$$ 381354 430448 529614 400908 367620 360121 309667 386340 447244 392992 225811 362107
11299C62107Q8975J3790J50128J9494k45435j46265j29876J25626O814j5571m9657
$$ 362107 451082 464872 615000 634494 389059 242794 112918 238544 245358 229787 180130
11288A80130J53196j75885J64354J77798r3410q9732P3026j07931J99272p381
$$ 180130 333326 157441 321795 499593 406183 316451 389477 281546 480818 473437
11278D73437p0939K27287j53649j07077M7012j1896q211o8026j46513K78572m3999
$$ 473437 402498 629785 476136 369059 416071 404175 395964 327938 181425 459997 415998
11267D15998r1980O873J15912p6693n4407j31900K6860J55147q5800J57577P3846
$$ 415998 324018 330891 446803 370110 315703 183803 210663 365810 280010 437587 511433
11256E11433p0343j96377l70694j05251K03729J64330J05661j9019J77852j5066
$$ 511433 441090 244713 -125981 -231232 -27503 136827 242488 223469 401321 386255
11246C86255l11386j37769j31431M1476K21464J78447R8707J3358l13633j44962
$$ 386255 74869 -62900 -194331 -152855 68609 247056 345763 359121 45488 -99474
11236i9474j8178n5855N4801J33356j11969m4659K88678K48232j521R708J14994
$$ -99474 -117652 -173507 -118706 14650 -97319 -141978 146700 394932 393411 403119 518113
11225E18113J09811k03012L9890J62241O368j52022l5533j07849J93252j0421
$$ 518113 627924 424912 464802 627043 633411 481389 445856 338007 531259 520838
11215E20838j30872j10784q6458k7641k146J74484K4193j7254M2527k0614k6747
$$ 520838 389966 279182 192724 165083 162937 337421 361614 344360 386887 366273 339526
11204C39526K21722j57482k35657J5057K3741j06953n5257J60620J42383l9495
$$ 339526 561248 403766 168109 183166 206907 99954 44697 205317 347700 308205
11194C08205j21731r7818P0205m6459n1592J11963l2714K3279Q3254j21081j85626
$$ 308205 186474 88656 158861 112402 60810 172773 140059 163338 246592 125511 -60115
11183f0115j10901J13944J23290J32498j70612j12891L9071J47250O3707J63166
$$ -60115 -171016 -57072 66218 198716 28104 -84787 -45716 101534 165241 328407
11173C28407J41820M6656j59559o3827l3527Q3855j1791J7772k41768j08228q9482
$$ 328407 470227 516883 357324 293497 259970 343825 332034 349806 108038 -190 -89672
11162h9672l027N6503n1959j7754J00712M5934o4407J15941O5707m9684j62261
$$ -89672 -92699 -36196 -88155 -105909 -5197 40737 -23670 92271 157978 108294 -53967
11151e3967P353K01479j40405J2954k14077o1605n8731p418Q3572N6969P5202
$$ -53967 -46614 154865 14460 27414 -186663 -248268 -306999 -314417 -230845 -173876 -98674
11140i8674L70477J74943M6805j17795k49200p239J69842J50119J34332K3640
$$ -98674 271803 446746 493551 375756 126556 119317 289159 439278 573610 597250
11130E97250m1857N2093K189r2020l91846J1627k16226o4877J39220Q1941j53068
$$ 597250 555393 607486 609675 517655 125809 137436 -78790 -143667 -4447 77494 -75574
11119g5574m253J11397K93296m8928r0226p3693P9660K13051L063k52903K7252
$$ -75574 -79827 31570 324866 275938 185712 112019 191679 404730 407793 154890 182142
11108A82142J36214M3245j02838k74115k28252M1185J78365K03488Q4037j04240
$$ 182142 318356 361601 258763 -15352 -243604 -202419 -24054 179434 263471 159231
11098A59231k08659j18331L21641J6436o6499q2093R138J33842K21981J20521
$$ 159231 -49428 -167759 153882 170318 103819 21726 30864 164706 386687 507208
11088E07208O5708j14669l15572o1981J60527L7967r9212j99586k37242l628J01208
$$ 507208 572916 458247 142675 80694 241221 279188 179976 -19610 -256852 -260480 -159272
11077a59272l9118l2314M643J24837L20069m7215j60419n9007J37255J77519l3010
$$ -159272 -198390 -230704 -226061 -101224 218845 171630 11211 -47796 89459 266978 233968
11066B33968l7176R0775L2770l61462o7435N7571J01139J37812k1451j66889j41349
$$ 233968 196792 287567 320337 -41125 -108560 -50989 50150 187962 166511 -378 -141727
11055a41727j85310m1762L17493J02534m2114R6261o7952R4645R7356J20986K4851
$$ -141727 -327037 -368799 -51306 51228 9114 105375 37423 132068 229424 350410 375261
11044C75261j9448K35630N6309J73164L4880j93230j6909l393P9617o6635R7746
$$ 375261 355813 591443 647752 820916 855796 662566 645657 642264 721881 655246 752992
11033G52992P3196m3373o7583M9312R2329j919o2808p5024L48569K92595O8680
$$ 752992 826188 782815 715232 764544 856873 854954 792146 717122 1065691 1358286 1426966
11022A426966K182o8636M2204m3005o9135r4050j79178R1541J01900q2982K22742
$$ 1426966 1429148 1360512 1402716 1359711 1290576 1196526 1017348 1108889 1210789 1127807 1350549
11011A350549K8699j32385J0478J4053j21750k58624J7311l2188j64866q6273
$$ 1350549 1379248 1246863 1257341 1271394 1149644 891020 908331 876143 711277 625004
11001F25004J96997K1616j47948L3143O2866k22108K3977J16134j37990p4697
$$ 625004 822001 843617 695669 728812 791678 569570 593547 709681 571691 496994
10991D96994J25930p6647l46198j93784P8381o29j01441q4606L4112J89433j23086
$$ 496994 622924 546277 200079 6295 84676 84047 -17394 -102000 -67888 121545 -1541
10980a541q5573n9849q2136J30809J73633K3122j08381k12666Q8836K07130N684
$$ -1541 -87114 -146963 -229099 -98290 75343 98465 -9916 -222582 -133746 73384 79068
10969G9068J9307j24263n3717M5142k4023r2277m6746k2773j02648J5377M42527
$$ 79068 98375 -25888 -79605 -34463 -58486 -150763 -197509 -220282 -322930 -307553 134974
10958A34974J65253j54546o9574k26048j07144J79940K33716l3873k43574R091
$$ 134974 300227 145681 76107 -149941 -257085 -77145 156571 122698 -120876 -111785
10948a11785J90382p9254O775j72646K2721Q4172p8581r3456n8193J84944J1572
$$ -111785 78597 -657 6118 -166528 -143807 -59635 -138216 -231672 -289865 -104921 -93349
10937i3349r9284Q8867K7052J56663N3537j29184k50127l4894p288J74117J04166
$$ -93349 -192633 -103766 -76714 79949 133486 4302 -245825 -280719 -288007 -113890 -9724
10926i724k72398o2123L05656O7506m7433M2874O9904K1950J04876k492j61145
$$ -9724 -282122 -344245 -38589 28917 -18516 24358 94262 116212 221088 218596 57451
10915E7451o8973M3433q5048l4821q1870j79674J01764N3175J01755L0742K8424
$$ 57451 -11522 31911 -53137 -87958 -169828 -349502 -247738 -194563 -92808 -62066 -33642
10904c3642o3126l880j362n8254m5087r201L5252k50218k02203L18396K03645
$$ -33642 -96768 -100648 -102010 -160264 -205351 -214552 -179300 -429518 -631721 -313325 -109680
10893a09680r263L2905J95920L91m3151j36316k0666J30499K96060J50826j77587
$$ -109680 -118943 -86038 109882 110273 67122 -69194 -89860 40639 336699 487525 309938
10882C09938n9358q8153j54987j01423l11668R2239L08652K97843J03662k03721
$$ 309938 250580 162427 7440 -93983 -405651 -313412 -4760 293083 396745 193024
10872A93024k6135k1236j96587p3061J77942Q9466r8882N235Q9966l5365j61014
$$ 193024 166889 145653 -50934 -123995 53947 143413 44531 49766 139732 104367 -56647
10861e6647j61015O9908J91385J1337j82503K3933K8581n0986J85253P9420r3892
$$ -56647 -217662 -147754 43631 54968 -127535 -103602 -75021 -126007 59246 138666 44774
10850D4774j18101O3725L6672l4208l8115p6550j9796l4837J88764O9197N4940
$$ 44774 -73327 -9602 27070 -7138 -45253 -121803 -141599 -176436 12328 81525 136465
10839A36465J47520K21188j83941k93479k88995j34768L564R3361M2109q6572
$$ 136465 283985 505173 321232 27753 -261242 -396010 -392446 -299085 -256976 -343548
10829c43548p7094q3501J44293J01309N771r6210L9284p3132M4840L7158J41646
$$ -343548 -420642 -504143 -359850 -258541 -252770 -348980 -309696 -382828 -337988 -300830 -159184
10818a59184K2341j43854J43326N7928j27993N5792j11805Q9332K0851l40186
$$ -159184 -136843 -280697 -137371 -79443 -207436 -151644 -263449 -174117 -153266 -493452
10808d93452R7755J07112j25215K3924R6375J03021j101j29393j22158J99699
$$ -493452 -395697 -288585 -413800 -389876 -293501 -190480 -191581 -320974 -443132 -243433
10798b43433J38394K56975j8046j97948j2971j41988j00385j4466M7471R7638
$$ -243433 -105039 151936 133890 -64058 -77029 -219017 -319402 -333868 -286397 -188759
10788a88759J00074k09589M8502L5122Q8318o5336o2436M9405n3259K8084m2749
$$ -188759 -88685 -298274 -249772 -214650 -126332 -191668 -254104 -204699 -257958 -229874 -272623
10777b72623r4578j5060K1577R956J67913K7203j25907J44907J71111j80082L7083
$$ -272623 -367201 -382261 -360684 -350728 -182815 -155612 -281519 -136612 34499 -145583 -108500
10766a08500R1773J8693k448k28558m4402J5126k84507n5900J26476J70756O8983
$$ -108500 -16727 1966 -482 -229040 -273442 -258316 -542823 -598723 -472247 -301491 -232508
10755b32508N4887m4731l1179o3317K34478N4607q6558k95541q4628K09219K51135
$$ -232508 -177621 -222352 -253531 -316848 -82370 -27763 -114321 -409862 -494490 -285271 -34136
10744c4136R2091J8805L9022j32409K9608J9345J14862L7777m628J18523K98129
$$ -34136 57955 76760 115782 -16627 12981 32326 147188 184965 180337 298860 596989
10733E96989N3768j20291j63246j70679l3327P1310K4005r576J54386L84290L237
$$ 596989 650757 530466 367220 196541 163214 234524 258529 248953 403339 787629 790866
10722G90866j20187j85302o8649K20415J87097M4279q6614K3660J1904j04067
$$ 790866 670679 485377 416728 637143 824240 868519 781905 805565 817469 713402
10712G13402q795L34144K2153l63098j50267O0509N5484O2346J20834j94875j04017
$$ 713402 704607 1038751 1060904 697806 547539 608048 663532 725878 846712 651837 547820
10701E47820O541M2018m1772J33420N3747k4240j99525n3285j66287O6864K27203
$$ 547820 554361 596379 554607 688027 741774 717534 518009 464724 298437 365301 592504
10690E92504K3487j62898Q6063j09653p4193L7515J76973q1481L0020n4778J47064
$$ 592504 615991 453093 539156 429503 355310 392825 569798 488317 518337 463559 610623
10679F10623M3709n8328j09910L1036r6503p5001j46173m4736o1056M6457J63312
$$ 610623 654332 596004 486094 517130 420627 345626 199453 154717 93661 140118 303430
10668C03430J35165j6093n3349J7050p1383k26991O1864K05968J41632j34591
$$ 303430 438595 422502 369153 386203 314820 87829 149693 355661 497293 362702
10658C62702j48851M8048n8833J75053M95819L82739R9121K439j17825k60725
$$ 362702 213851 261899 203066 378119 873938 1256677 1355798 1358237 1240412 979687
10648I79687j38667n6287R228pq4255k3325o6596j1812N9581M40143J40432J9457
$$ 979687 841020 784733 793961 793954 709699 686374 619778 607966 667547 1107690 1248122 1267579
10636A267579L62272O72344O07617O22278M38956M15287M06139L79733N57026
$$ 1267579 1629851 2302195 2909812 3532090 3971046 4386333 4792472 5172205 5729231
10627E729231O47043O78444Q60048J471031J974073K410299L268551M695722O461365
$$ 5729231 6376274 7054718 7914766 9385797 11359870 13770169 17038720 21734442 28195807
10618B8195807Q182216R445196R858325R544578Q326846O610026L898113O23817
$$ 28195807 36378023 45823219 55681544 65226122 73552968 80162994 84061107 84684924
10610H4684924q21054L07543L393811P769417J2914893J7287698J8693498J7246053
$$ 84684924 83863870 84171413 87565224 95334641 108249534 125537232 144230730 161476783
10602A61476783J4295898R595283J835794o679767j0404772p436976r76268P142795
$$ 161476783 175772681 185367964 187203758 180523991 170119219 162682243 161705975 168848770
10594A68848770J5344257K1228171K2736822J9462000J3753474N593089o705388
$$ 168848770 184193027 205421198 228158020 247620020 261373494 266966583 260261195
10587B60261195j9065427k3869457k0412721j2598053l832210L453489Q358082
$$ 260261195 241195768 217326311 196913590 184315537 180483327 183936816 192294898
10580A92294898R551319P230254L182262k194063j0432172j8406397k0431596
$$ 192294898 201846217 209076471 212258733 210064670 199632498 181226101 160794505
10573A60794505j7310371j2053104o657662k404024J3689N41954l55659j940424
$$ 160794505 143484134 131431030 124773368 122369344 122383033 122924987 122569328 120628904
10565A20628904m767025q108206j0629289j1410872j0385327q344699o779058
$$ 120628904 115861879 107753673 97124384 85713512 75328185 66983486 60204428
10558F0204428n108854l993944l101104k462286k327957k022109j626939j533203
$$ 60204428 55095574 51101630 48000526 45538240 43210283 41188174 39561235 38028032
10550C8028032j472044j295940j322287j197139j086770j037553o03319n49491
$$ 38028032 36555988 35260048 33937761 32740622 31653852 30616299 30012980 29463489
10542B9463489q82087q88813p53650j011123q11074n58032n38273n14284n19322
$$ 29463489 28581402 27692589 26938939 25927816 25116742 24558710 24020437 23506153 22986831
10533B2986831n91717m96597n60667n97395m41849l39498l19576l18355m04940
$$ 22986831 22395114 21898517 21337850 20740455 20298606 19959108 19639532 19321177 18916237
10524A8916237m71180m23669l79556n61992n17226k85950m08540j00430k7922
$$ 18916237 18445057 18021388 17641832 17079840 16562614 16276664 15868124 15767694 15739772
10515A5739772o1657m00860l57319l57962l53613k30564k21928l97118k59997
$$ 15739772 15678115 15277255 14919936 14561974 14208361 13977797 13755869 13358751 13098754
10506A3098754j56011l10842l01929k90762J02297j62897l87977l35230j67644
$$ 13098754 12942743 12631901 12329972 12039210 12141507 11978610 11590633 11255403 11087759
10497A1087759j495m0433j80686q8878p4984l13436k90348k46059l03116j72891
$$ 11087759 11086264 11045831 10865145 10776267 10701283 10387847 10097499 9851440 9548324 9375433
10487I375433j36091m4672n5033O1331j80264j64335k11211o665N3121N5844k48925
$$ 9375433 9239342 9194670 9139637 9200968 9020704 8856369 8645158 8638493 8691614 8747458 8498533
10476H498533l03940j0550l7068Q676J4805o3249j49591J0184o1680K47948m8519
$$ 8498533 8194593 8184043 8146975 8155651 8170456 8107207 7957616 7967800 7906120 8154068 8105549
10465H105549j0864r4597j22589k66316l21463j64712j04359l575J5018k35044
$$ 8105549 8094685 8000088 7877499 7611183 7289720 7125008 7020649 7017074 7032092 6797048
10455F797048j85141J99008N8748L1298m4095m32573k91529K794R1720k3790L9438
$$ 6797048 6611907 6810915 6869663 6900961 6856866 6424293 6132764 6135558 6227278 6203488 6242926
10444F242926q8910k50812o7198M3286q6541k43416k7676n6945m03019n0669O3419
$$ 6242926 6154016 5903204 5836006 5879292 5792751 5549335 5521659 5464714 5061695 5011026 5074445
10433E074445q1117j09212k15234k11235R3826N7345m2704N252M5777k31305k57168
$$ 5074445 4993328 4884116 4668882 4457647 4551473 4608818 4566114 4571366 4617143 4385838 4128670
10422D128670j16617O6002Q0331M8934o9773j57745J9002j318p4736j73730m4119
$$ 4128670 4012053 4078055 4158386 4207320 4137547 3979802 3998804 3997486 3922750 3749020 3704901
10411C704901p8728j10269q4816L3444L237n6289j68298k959k18832m8870Q3768
$$ 3704901 3626173 3515904 3431088 3464532 3467769 3411480 3243182 3240223 3021391 2972521 3056289
10400C056289L0670n3895j10858l7939K908j48876n695j79583J4279K4535N100
$$ 3056289 3086959 3033064 2922206 2884267 2887175 2738299 2732604 2553021 2567300 2591835 2596935
10389B596935k20686N1297Q5414Q2855J37565M9678o5799K6843j84160j63849
$$ 2596935 2376249 2427546 2512960 2595815 2733380 2783058 2717259 2744102 2559942 2396093
10379B396093j15595j8845L8186N57J30160J771P9836j55674k21113N0431m5006
$$ 2396093 2280498 2261653 2299839 2300396 2430556 2432327 2512163 2356489 2135376 2185807 2140801
10368B140801k6583P5134J3677j38390J5548R8007m5069j7118j57114o2767Q3158
$$ 2140801 2114218 2189352 2203029 2064639 2080187 2178194 2133125 2116007 1958893 1896126 1979284
10357A979284j05951j78630n4828M5391J74028K19147o9640j74991p1055R5379
$$ 1979284 1873333 1694703 1639875 1685266 1859294 2078441 2008801 1833810 1762755 1858134
10347A858134J9504k32857m8029J47015J05140L9139j45375M7065k42086o7699
$$ 1858134 1877638 1644781 1596752 1743767 1848907 1888046 1742671 1789736 1547650 1479951
10337A479951J09997O6006L980Q5039K5056j57439m543K5737l78449p0717k06865
$$ 1479951 1589948 1655954 1659934 1744973 1770029 1612590 1608047 1633784 1255335 1184618 977753
10326I77753J94239J25809j30673j22240J00799J7221L5851P331O0693j54532
$$ 977753 1171992 1297801 1167128 1044888 1145687 1162908 1198759 1206090 1266783 1112251
10316A112251q0569J21331J16217m3260J11491L7378l5928j39259k47460l3430
$$ 1112251 1031682 1153013 1269230 1225970 1337461 1374839 1338911 1199652 952192 918762
10306I18762J21469J25115j66085l6705l2137P3344J6602l7556J34167P4745J06015
$$ 918762 1040231 1165346 999261 962556 930419 1003763 1020365 982809 1116976 1191721 1297736
10295A297736j57740k4898j01980k94766k3221J23862k0499O0440j38252m3187
$$ 1297736 1139996 1115098 1013118 718352 695131 818993 798494 858934 720682 677495
10285F77495J95091l675K1579j39897p0071J14446j16846M7834j70664q6807R4707
$$ 677495 872586 868911 890490 750593 680522 794968 678122 725956 555292 468485 563192
10274E63192R0233J50147J49537r5974j98376k9186P8671K67251j64777n7351
$$ 563192 653425 803572 953109 857135 658759 629573 708244 975495 810718 753367
10264G53367O3566j2401L0272l029j9807r367j37581Q0363O0912L3590q8568j59010
$$ 753367 816933 804532 834804 831775 811968 802601 665020 745383 806295 839885 751317 592307
10252E92307J4656j26637k09299M7192K58622J96712j87117j52326N9751K09119
$$ 592307 606963 480326 271027 318219 576841 773553 586436 434110 493861 702980
10242G02980J72750k5070P4161n7584k91100j82860P085j8400N3406n9028M5272
$$ 702980 875730 850660 924821 867237 576137 393277 400362 381962 435368 376340 421612
10231D21612o2186M6675K14608K52590j26804j98366j2397J15642L9487q6j01770
$$ 421612 359426 406101 620709 873299 746495 548129 535732 651374 690861 690775 589005
10220E89005j3615l524L187J58046o4346p4656j99372Q8894M8231L1464j53406
$$ 589005 575390 571866 575053 733099 668753 594097 394725 483619 531850 563314 409908
10209D09908j24733J81145O753j59901J005O5230J7685J64080J72530J05219n2507
$$ 409908 285175 466320 473073 313172 314177 379407 397092 561172 733702 838921 786414
10198G86414j42976j14836N7240J6818J05938p7538J0001n0236j27444o1399P6354
$$ 786414 643438 528602 585842 602660 708598 631060 641061 590825 463381 401982 478336
$$ [...]
##END NTUPLES=NMR SPECTRUM
##END=
