##TITLE=Analysis number 319664
Compound Code cc 56009
Book Reference 440/184
Project Code adrs
Chemist Name craigr
##JCAMPDX= 6.0         $$ Bruker NMR JCAMP-DX V2.0
##DATA TYPE= NMR SPECTRUM
##DATA CLASS= NTUPLES
##ORIGIN= Bruker BioSpin GmbH
##OWNER= nmr
$$ XWIN-NMR		Version 3.5
$$ Tue May 23 14:02:11 2006 GMT Daylight Time (UT+1h)  MAYBRIDGE\nmr@NMR_250MHZ
##.OBSERVE FREQUENCY= 250.131544655141
##.OBSERVE NUCLEUS= ^1H
##.ACQUISITION MODE= SIMULTANEOUS (DQD)
##.ACQUISITION SCHEME= undefined
##.AVERAGES= 16
##.DIGITISER RES= 18
##SPECTROMETER/DATA SYSTEM= dpx250
##.PULSE SEQUENCE= zg30
##.SOLVENT NAME= CDCl3
##.SHIFT REFERENCE= (INTERNAL, CDCl3, 0, 16.522)
##AUDIT TRAIL= $$ (NUMBER, WHEN, WHO, WHERE, WHAT)
$$ ##TITLE= Audit trail, XWIN-NMR		Version 3.5
$$ ##JCAMPDX= 5.01
$$ ##ORIGIN= Bruker BioSpin GmbH
$$ ##OWNER= nmr
$$ C:\u/data/dgb/nmr/ADRS/5030/pdata/1/auditp.txt
$$ ##AUDIT TRAIL=  $$ (NUMBER, WHEN, WHO, WHERE, WHAT)
(   1,<2006-05-23 14:01:18.85 +100>,<MAYBRIDGE\nmr>,<NMR_250MHZ>,
      <created by zg, POWCHK disabled, PULCHK disabled
       configuration hash MD5:
       84 BC 41 DB A1 6E 1D 46 DA 25 12 A5 C1 ED C5 3A
       data hash MD5: 64K
       BA B7 6C C6 16 BE 5C C4 EC 66 D5 4E F0 11 62 E9>)
(   2,<2006-05-23 14:01:49.38 +100>,<MAYBRIDGE\nmr>,<NMR_250MHZ>,
      <Start of raw data processing
       ef LB = 0.3 FT_mod = 6 PKNL = 1 SI = 32K 
       data hash MD5: 32K
       15 97 59 55 79 2A C9 90 51 7A 9C DB 54 88 1D D2>)
(   3,<2006-05-23 14:01:54.32 +100>,<MAYBRIDGE\nmr>,<NMR_250MHZ>,
      <apk 
       data hash MD5: 32K
       F7 76 4A FD 51 0B AF A5 8E 3E 97 4B 9E B6 CF 5B>)
(   4,<2006-05-23 14:01:55.77 +100>,<MAYBRIDGE\nmr>,<NMR_250MHZ>,
      <abs ABSG = 5 
       data hash MD5: 32K
       4B 54 4E FF A6 73 CB 7D 3C 93 56 4A 36 A0 78 A5>)
$$ ##END=
$$ 
$$ hash MD5
$$ 27 36 66 61 7F F4 EE 3F A5 B9 36 35 BA FA 2A F2
##$RELAX= 
##$RELAX= 
##$RELAX= 
##$RELAX= 
##$RELAX= 
##$RELAX= 
##$RELAX= 
$$ Bruker specific parameters
$$ --------------------------
##$DU= <C:\u>
##$EXPNO= 5030
##$NAME= <ADRS>
##$PROCNO= 1
##$TYPE= <nmr>
##$USER= <dgb>
##$AMP= (0..31)
100 100 100 100 100 100 100 100 100 100 100 100 100 100 100 100 100 100 
100 100 100 100 100 100 100 100 100 100 100 100 100 100 
##$AQSEQ= 0
##$AQ_mod= 3
##$AUNM= <au_zg>
##$AUTOPOS= <42 >
##$BF1= 250.13
##$BF2= 250.13
##$BF3= 250.13
##$BF4= 250.13
##$BF5= 500.13
##$BF6= 500.13
##$BF7= 500.13
##$BF8= 500.13
##$BYTORDA= 1
##$CFDGTYP= 0
##$CFRGTYP= 5
##$CHEMSTR= <none>
##$CNST= (0..31)
1 1 145 1 1 1 1 1 1 1 1 1 1 1 1 1 1 1 1 1 1 1 1 1 1 1 1 1 1 1 1 1 
##$CPDPRG= <>
##$CPDPRG1= <>
##$CPDPRG2= <>
##$CPDPRG3= <>
##$CPDPRG4= <mlev>
##$CPDPRG5= <mlev>
##$CPDPRG6= <mlev>
##$CPDPRG7= <mlev>
##$CPDPRG8= <mlev>
##$CPDPRGB= <>
##$CPDPRGT= <>
##$D= (0..31)
0 1 0 0 0 0 0 0 0 0.06 0 0 0 0 0 0 0.0002 0 0 0 0 0 0 0 0 0 0 0 0 0 0 
0 
##$DATE= 1148389276
##$DBL= (0..7)
120 120 120 120 120 120 120 120 
##$DBP= (0..7)
150 150 150 150 150 150 150 150 
##$DBP07= 0
##$DBPNAM0= <>
##$DBPNAM1= <>
$$ [...]
##$SUBNAM7= <"">
##$SUBNAM8= <"">
##$SUBNAM9= <"">
##$SW= 20.6930455092707
##$SWIBOX= (0..15)
0 0 3 0 0 0 0 0 0 0 0 0 0 0 0 0 
##$SW_h= 5175.983436853
##$TD= 65536
##$TD0= 1
##$TE= 295.16
##$TE2= 300
##$TE3= 300
##$TEG= 300
##$TL= (0..7)
0 120 120 120 120 120 120 120 
##$TP= (0..7)
150 150 150 150 150 150 150 150 
##$TP07= 0
##$TPNAME0= <>
##$TPNAME1= <>
##$TPNAME2= <>
##$TPNAME3= <>
##$TPNAME4= <>
##$TPNAME5= <>
##$TPNAME6= <>
##$TPNAME7= <>
##$TPOAL= (0..7)
0.5 0.5 0.5 0.5 0.5 0.5 0.5 0.5 
##$TPOFFS= (0..7)
0 0 0 0 0 0 0 0 
##$TUNHIN= 0
##$TUNHOUT= 0
##$TUNXOUT= 0
##$USERA1= <user>
##$USERA2= <user>
##$USERA3= <user>
##$USERA4= <user>
##$USERA5= <user>
##$V9= 5
##$VALIST= <valist>
##$VCLIST= <CCCCCCCCCCCCCCC>
##$VD= 0
##$VDLIST= <DDDDDDDDDDDDDDD>
##$VPLIST= <PPPPPPPPPPPPPPP>
##$VTLIST= <TTTTTTTTTTTTTTT>
##$WBST= 1024
##$WBSW= 4
##$XGAIN= (0..3)
0 0 0 0 
##$XL= 0
##$YL= 0
##$YMAX_a= 418920
##$YMIN_a= -591075
##$ZGOPTNS= <>
##$ZL1= 120
##$ZL2= 120
##$ZL3= 120
##$ZL4= 120
##$ABSF1= 16.522
##$ABSF2= -4.171173
##$ABSG= 5
##$ABSL= 3
##$ALPHA= 0
##$AQORDER= 0
##$ASSFAC= 0
##$ASSFACI= 0
##$ASSFACX= 0
##$ASSWID= 0
##$AUNMP= <proc_1d>
##$AZFE= 0.1
##$AZFW= 0.1
##$BCFW= 0
##$BC_mod= 0
##$BYTORDP= 0
##$COROFFS= 0
##$CY= 12.5
##$DATMOD= 1
##$DC= 0
##$DFILT= <>
##$DTYPP= 0
##$F1P= 14.0000005364418
##$F2P= -0.99999901652339
##$FCOR= 0.5
##$FTSIZE= 32768
##$FT_mod= 6
##$GAMMA= 0
##$GB= 0
##$INTBC= 1
##$INTSCL= 1
##$ISEN= 128
##$LB= 0.3
##$LEV0= 0
##$LPBIN= 0
##$MAXI= 10000
##$MC2= 0
##$MEAN= 0
##$ME_mod= 0
##$MI= 0
##$NCOEF= 0
##$NC_proc= -4
##$NLEV= 6
##$NOISF1= 0
##$NOISF2= 0
##$NSP= 0
##$NTH_PI= 0
##$NZP= 0
##$OFFSET= 16.522
##$PC= 1
##$PHC0= 167.5272
##$PHC1= 9.663817
##$PH_mod= 1
##$PKNL= yes
##$PPARMOD= 0
##$PSCAL= 4
##$PSIGN= 0
##$REVERSE= no
##$SF= 250.13
##$SI= 32768
##$SIGF1= 0
##$SIGF2= 0
##$SINO= 400
##$SIOLD= 32768
##$SREGLST= <1H.CDCl3>
##$SSB= 0
##$STSI= 32768
##$STSR= 0
##$SW_p= 5175.98343685301
##$SYMM= 0
##$S_DEV= 0
##$TDeff= 65536
##$TDoff= 0
##$TI= <Analysis number 999999
Compound Code 99
Book Reference 9
Project Code 9>
##$TILT= no
##$TM1= 0
##$TM2= 0
##$TOPLEV= 0
##$USERP1= <user>
##$USERP2= <user>
##$USERP3= <user>
##$USERP4= <user>
##$USERP5= <user>
##$WDW= 1
##$XDIM= 32768
##$YMAX_p= 338649582
##$YMIN_p= -183069
$$ End of Bruker specific parameters
$$ ---------------------------------
##NTUPLES= NMR SPECTRUM
##VAR_NAME=  FREQUENCY,     SPECTRUM/REAL,   SPECTRUM/IMAG
##SYMBOL=    X,             R,               I
##VAR_TYPE=  INDEPENDENT,   DEPENDENT,       DEPENDENT
##VAR_FORM=  AFFN,          ASDF,            ASDF
##VAR_DIM=   32768,         32768,           32768
##UNITS=     HZ,            ARBITRARY UNITS, ARBITRARY UNITS
##FACTOR=    0.157963299565203, 1,           1
##FIRST=     4132.6476996994, 0,             0
##LAST=      -1043.33573715361, 0,           0
##MIN=       -1043.33573715361, -183069,     0
##MAX=       4132.6476996994, 338649582,     0
$$ Real data points
##PAGE= N=1
##DATA TABLE= (X++(R..R)), XYDATA
$$ [...]
20488B1052O860N768p819L9218J8609m0581n3365j1732K6541J9071q002L8490
20476E4110J1570j9357J44L85n482k038l2658l2254j8127j6085j6067k7968k4423
20463a28250O9573N226L0424j4634K8449J8271r167M0913k1272k8222l4997k7153
20451g0839k8384M1637N8359Q98j6701m5012Q819O0262j635L3705Q556o41l862
20438D5162l8356l2286j2778l5854J2535L7715J6598N770m176m335j8994J4492
20426a4507J4344N0092j697j1177k8977n5549l9692J9544k563N4300J4746l6703
20414c7839k0474J9675M4062L6757j3497J6597J690k3567j5505J0555M1635q405
20402E1684j2440M015l4905m631J4321J6374N743k5982k3555l6470o303K2488
$$ plain form
20488 21052 27912 33680 25861 65079 83688 43107 -10258 -21990 4551 23622 15620 54110
20476 54110 65680 46323 46467 46852 41370 39332 6674 -25580 -43707 -59792 -75859 -103827 -128250
20463 -128250 -58677 -53451 -23027 -37661 -9212 9059 -108 40805 19533 -8689 -43686 -70839
20451 -70839 -99223 -57586 773 1671 -15030 -60042 -51223 9039 7404 41109 49665 49024 45162
20438 45162 6806 -25480 -38258 -74112 -61577 -23862 -7264 -1494 -5670 -10005 -28999 -14507
20426 -14507 -163 49929 48232 37055 8078 -47471 -87163 -67619 -70182 -15882 -1136 -37839
20414 -37839 -58313 -38638 5424 42181 28684 45281 46971 23404 7899 18454 60089 51684
20402 51684 39244 43259 8354 3723 18044 34418 40161 14179 -9376 -45846 -52149 -29661
20390b9661K2269L388k0977l4758j1053k92J8763q140K7771K1912Q95m875k7818
20377d2576j7975k497O5799M3391k0075l5772k1088M1283J5333k4960l001k9913
20365c2051J5885K4951o121l4930k8827N6235L8964j1960l1989J8057k2705J5274
20353G83k0331k1826L5969M1590P815j8174j8557l9138K1482J8248J6279Q080
20341C2220K2769k5256m3788K139K4704L8451k3887l9231k0533O753O572j4841
20329c3928J4251J2543J5432J0956j3169K9381Q61m370J6428l3890m5426L5318
20317D387n358j0323J4655N506k3708m0522R405L3025R415r722J9319K2607k6572
20304B114n299M1284J2763o2304n7011L9343N2093J5417m1582m1864P500L5817
$$ plain form
20390 -29661 -7392 -4004 -24981 -59739 -70792 -71084 -52321 -60461 -32690 -10778 -9883 -14758 -42576
20377 -42576 -60551 -63048 2751 46142 26067 -9705 -30793 10490 25823 863 -2138 -32051
20365 -32051 -16166 8785 2664 -32266 -61093 -4858 34106 22146 -9843 8214 -14491 783
20353 783 -19548 -41374 -5405 36185 44000 25826 7269 -31869 -10387 7861 24140 32220
20341 32220 54989 29733 -14055 -11916 12788 51239 27352 -11879 -32412 -25659 -19087 -33928
20329 -33928 -19677 -7134 8298 19254 6085 35466 36327 31957 48385 14495 -30931 4387
20317 4387 -971 -11294 3361 8867 -14841 -55363 -45958 -12933 -3518 -13240 6079 28686 2114
20304 2114 -3185 38099 50862 -11442 -68453 -29110 22983 38400 -3182 -45046 -37546 -1729
20292a729m1076l7664q049M5525O2371n389k4156m9913O349o835N5058K6606l6536
20279a5438l97k6660J9841k7471j3080l1786J2731K8414M4840K8849J1093o9K939
20266C3806j7681m7163J6163P548l0268L302q766K8281l0142k6123k3179J8332
20254g5890L0981K3017j0741Q679K306J2936Q936m145J2726K8816K946J5510m946
20241E1131m0759m9119l1686L4944k2034L9949K1484q372n0317J3703J3759N6059
20229B8742N1705q4712o6990L9640r289R172J955M565K4503O127l347J1597J1924
20216B5592J3983k7188K4432L0857Q234K3813m3066n0921K190j5741l635N5779
20204D4329K7001q5103k6660J9812n182k4088r675K3623M0977J2630l2528m0095
$$ plain form
20292 -1729 -42805 -80469 -88518 -42993 19378 13989 -10167 -60080 -53731 -60566 -5508 21098 -15438
20279 -15438 -15835 -42495 -22654 -50125 -63205 -94991 -82260 -53846 -9006 19843 30936 30867 33806
20266 33806 16125 -31038 -14875 -7327 -37595 -34293 -43059 -14778 -44920 -71043 -94222 -75890
20254 -75890 -44909 -21892 -32633 -23954 -21648 -8712 224 -3921 8805 37621 40567 56077 51131
20241 51131 10372 -38747 -70433 -35489 -57523 -17574 3910 -4462 -54779 -41076 -27317 28742
20229 28742 80447 -4265 -71255 -31615 -40904 -31732 -29777 -25212 -709 5418 2071 13668 25592
20216 25592 39575 12387 36819 67676 75910 99723 56657 5736 7926 -7815 -11450 44329
20204 44329 71330 -13773 -40433 -20621 -25803 -49891 -59566 -35943 5034 17664 -14864 -54959
20192e4959J3233L7075J7407l293j2579O854k4422J4178J1029K8753M9944L0746
20180A13966j8970r756j4654o0341J1025l2284j8449L0770K758K417k1254o9127
20168h3899R68L0125O23K4931r599J1934K0467l6930l0913M5501k2568J7809K4360
20155g191m20l4334k5373j7231j1223K4817K0699Q377M0797O7173k4272l3466
20143H353r23K5848n391J6928J6116k410r0435j3556M5408j5877m0304n606k245
20130f4094p829j7543L8383O9872j083K834m6039p082K0802J1400N325o291J270
20117g5J5698j6475J8862p465l7417j4107L453K1304p996J2105n8280O876N2602
20104a0915J2636q397K7212k913K4860j9176J85k1458j6820j1826l8876L145K396
$$ plain form
20192 -54959 -41726 -4651 12756 9463 -3116 3738 -20684 -6506 4523 33276 83220 113966
20180 113966 94996 85240 70586 10245 21270 -11014 -29463 1307 4065 6482 -14772 -83899
20168 -83899 -82931 -52806 -52183 -27252 -36851 -24917 -4450 -41380 -72293 -26792 -49360 -31551 -7191
20155 -7191 -7611 -41945 -67318 -84549 -95772 -70955 -50256 -41879 -1082 66091 41819 8353
20143 8353 7430 33278 27887 44815 60931 58521 -31914 -45470 -62 -15939 -56243 -61849 -64094
20130 -64094 -71923 -89466 -51083 18789 17706 20540 -25499 -32581 -11779 -379 4946 -1345 -75
20117 -75 15623 -852 18010 10545 -26872 -40979 -37526 -16222 -24218 -12113 -70393 -63517 -10915
20104 -10915 1721 -6676 20536 17623 42483 23307 23492 2034 -14786 -26612 -65488 -62343 -59947
20091e9947L5381M1779l603M507j2946N8610L683k5421l0647m9274m376K0663
20079b1591m5695q99K6056M430P003L3823L4052l8604k959j5544l5419P621K1351
20066b6375M7752J7721R775j6793l0975k2526L9151N1390J3336l5639l4149j0884
20054A784O908r738j0721k0698J0884J8262L2326l1875r85l4297o821L3477k339
20041a3833p220j0770k452k347k8406k239P1496r649m575q947L886j93j3616J9242
20027i623K4039J0748Q507k1453Q44Q107J171j1094m4316L0836P3135j247k6728
20014D2926j6575Q686L3605j9563j4700k1119L3462r854j6588K1823j8312M6201
20002F9992R408q771k8290l0248k9217K126j2464J0470O060m4622j1757K1177
$$ plain form
20091 -59947 -24566 17213 13610 18117 5171 63781 67464 42043 11396 -37878 -42254 -21591
20079 -21591 -67286 -68185 -42129 -37699 -30696 3127 37179 -1425 -4384 -19928 -55347 -47726 -26375
20066 -26375 21377 39098 48873 32080 1105 -21421 17730 69120 82456 46817 12668 1784
20054 1784 8692 -1046 -11767 -32465 -21581 -3319 29007 -2868 -3853 -38150 -44971 -11494 -13833
20041 -13833 -21053 -31823 -34275 -36622 -65028 -67267 4229 -5420 -9995 -18942 -15056 -15249 -28865 -9623
20027 -9623 14416 25164 33671 12218 13062 21169 22340 11246 -33070 -2234 70901 69654 42926
20014 42926 26351 35037 68642 49079 34379 13260 46722 36868 20280 42103 23791 69992
20002 69992 79400 70629 42339 12091 -17126 -15000 -27464 -16994 -10934 -55556 -67313 -46136
19990d6136M7885R694n4075J991n241k044j4402r899k681L7288K1862J5391m862
19977e229L7927K2171j1682m015L4378M826k8089k7594J0144M7543n4484p5818
19965d9922m4290k1077M6774K7765K0562J3203j6205k6773p897N8816K7462l5264
19953f846j4560R936L1515K9162j8203q3882J068L7304K2853K9184m1027J5363
19941A1867K2780j4521k1428l3742N0975K0808l6314r838m347O695n3050L6035
19929b4080L3604j3196l3382m4724M6431K2049j073r265j9919J7399l310l28M2232
19916A2438M80k6362j8375J3425M0968k0357r408J4605k119J0248N3943P830n0443
19903B6873k412K2398l1351n2231l482J180l2565j5601l18j1742M726M3442J02614
$$ plain form
19990 -46136 1749 11443 -42632 -40641 -45882 -47926 -62328 -72227 -74908 -37620 -15758 -367 -5229
19977 -5229 32698 54869 43187 39172 73550 78376 50287 22693 32837 80380 25896 -49922
19965 -49922 -94212 -115289 -68515 -40750 -20188 -6985 -23190 -49963 -57860 956 28418 -6846
19953 -6846 -21406 -11470 20045 49207 31004 -52878 -51810 -14506 8347 37531 -3496 11867
19941 11867 34647 20126 -1302 -35044 15931 36739 425 -9413 -13760 -7065 -60115 -24080
19929 -24080 9524 -3672 -37054 -81778 -35347 -13298 -14371 -23636 -43555 -26156 -29466 -29794 12438
19916 12438 12918 -13444 -31819 -18394 22574 2217 -7191 7414 5295 15543 69486 77316 26873
19903 26873 24461 46859 15508 -36723 -40205 -39025 -71590 -87191 -87509 -99251 -94525 -51083 51531
19890E1531J2003R967m007n7106p2497j2552J6414R87M1345L4688O84k224j9221
19877A2m0229L7486L0812P085J5603J4110p1505j0800P3481K3543J6490j2178
19865H3910k2940k6806J703M2475k384k4058m9160r555J119Q550O8455L4861m7544
19852E8626q032j3176l2352j1901j2497j0304K0319K4955L0617m2764o0149r695
19840f6353j2437M4059M4022k7569Q487j2888J756K9673J7760j5088K315N6145
19828F9882k4093l4799k5874k1015J6724J3147n654l9830K1093O826l6329M1909
19816a8013P4450L0060j7749J0573k19J3068j5820l8656j2248K0088o710Q494
19804D7318j5442J3287k4258k4337J9099L9720r629n1366K6887J724m075K8047
$$ plain form
19890 51531 63534 73501 69494 12388 -60109 -72661 -56247 -55260 -13915 20773 21457 19233 12
19877 12 -40217 -2731 28081 35166 50769 64879 -6626 -17426 56055 79598 96088 83910
19865 83910 60970 34164 35867 78342 75958 51900 2740 -6815 -5696 2854 71309 106170 58626
19852 58626 50594 37418 5066 -6835 -19332 -29636 -9317 15638 46255 3491 -56658 -66353
19840 -66353 -78790 -34731 9291 -18278 -9791 -22679 -20923 8750 26510 11422 13737 69882
19828 69882 45789 10990 -14884 -35899 -19175 -6028 -11682 -51512 -30419 -23593 -59922 -18013
19816 -18013 56437 86497 68748 79321 79102 92170 76350 37694 25446 45534 38824 47318
19804 47318 31876 45163 20905 -3432 15667 55387 45758 -5608 21279 23003 18928 46975
19792D6975k9071K3750K8040k9157k7347K2772L8045k5818l0320j8679j4161k2968
19780c7939Q827k396j3720M2174K5700K6555J9582l1196k3678L0346J4800m0892
19768A8163j1347M3844N3616n551n5835m0944M079L8421k0226J6228K8967k5083
19756D4332n4630o7272J376K9051K9050J6862p577J7242K1566J2793m1591l5675
19744c4473P566Q159k1749P7426K9746J1712l2935o9181j9351K8306k12K8120
19732A3134k0748j4200K9209J7322L5620j7344K1805J0230r594K3312l4099m286
19720E0361l389l7517l3735K7844J3704O065J7444K0154J1390O489J1756M213
19708I4779j3314j0012Q102n6965l2780j1597J176M0688K2435J8747m6374j4928
$$ plain form
19792 46975 17904 41654 69694 40537 13190 35962 74007 48189 17869 -810 -14971 -37939
19780 -37939 -29112 -31508 -45228 -3054 22646 49201 68783 37587 13909 44255 59055 18163
19768 18163 6816 50660 104276 98725 42890 1946 6025 44446 24220 40448 69415 44332
19756 44332 -10298 -77570 -76194 -47143 -18093 -1231 -8808 8434 30000 42793 1202 -34473
19744 -34473 -26907 -18748 -40497 36929 66675 78387 45452 -23729 -43080 -14774 -14986 13134
19732 13134 -7614 -21814 7395 24717 60337 42993 64798 75028 65434 88746 54647 50361
19720 50361 46972 9455 -24280 3564 17268 23333 40777 60931 72321 78810 90566 94779
19708 94779 81465 71453 79555 22590 -10190 -21787 -20611 20077 42512 61259 14885 -43
19696d3R146j3602J297k6009L117J6535M7695P428k8057M4000k3073j2653Q376
19683C4157j9019P1498L6969L866o8489l9468n501K647M4175J9938j1292K5606
19671I5087R325j1965m799k686K0050l7436k968o8125m454P8566K8947r97n817
19658I2728m8975j3969K599l6967K0333M3181N2935j2449j4581q512j9919m8718
19646G686j3881K7571J6337L0101j7117j0386l596J5407r405n2031n2506L6585
19634b5235L1923k167N6316L1471r798j1315l4088k6526N2723J6540m6829k4328
19622H687k3406j0107k5020J6275k4452R220L7010J9071O589k5036m3956j214
19610e6339J5439L0786K4938j6384j6854M4018J3581n1098J1383J8556l839K7327
$$ plain form
19696 -43 9103 -4499 -3202 -29211 -26094 -9559 38136 45564 17507 61507 38434 25781 34157
19683 34157 15138 86636 123605 127471 58982 19514 14013 16660 60835 80773 69481 95087
19671 95087 104412 92447 87648 84962 105012 67576 64608 -3517 -7971 70595 99542 98545 92728
19658 92728 43753 29784 32383 -4584 15749 58930 111865 99416 84835 76323 56404 7686
19646 7686 -6195 21376 37713 67814 50697 40311 36715 52122 42717 -9314 -61820 -25235
19634 -25235 6688 4521 60837 92308 82510 71195 37107 10581 63304 79844 33015 8687
19622 8687 -14719 -24826 -49846 -33571 -58023 -48803 -11793 7278 13867 -11169 -55125 -56339
19610 -56339 -40900 -10114 14824 -1560 -18414 25604 39185 -11913 -530 18026 14187 41514
19598D1514M5224l2191k9360l408P688K5079L9528m847k5844o7694l2496J6227
19586b0580K2602N310l0706O707q671m6558P199O2341M1875q566K8834J3299l7193
19573C5893p2492m0257M3486M4783K4338R126m5580j9619j4590N980m494J5573
19561a7853j1867J3958N8353P122p1069k174O1614K9297m4287k4651J7054L200
19549A8697R154j0719l6540l7542L3735n2712O06R379J9071L2099j8867R819N140
19536a8680q570n2366J1943K8907n158K8276Q516N786k8443j0715L1351P912Q377
19523G136k2221K1593j2548j1199r188N1595j0961o399M2973j0634N8191m0250
19511E8088n3060O510m896K4065N474j0510j3477k3876k9049r160P362K631J1939
$$ plain form
19598 41514 86738 54547 25187 21779 29467 54546 94074 89227 63383 -4311 -36807 -20580
19586 -20580 2022 7332 -23374 -16667 -25338 -71896 -64697 -2356 39519 30953 59787 73086 35893
19573 35893 -36599 -76856 -33370 11413 35751 44877 -703 -20322 -34912 -28932 -33426 -17853
19561 -17853 -29720 -15762 42591 49713 -21356 -23530 38084 67381 23094 -1557 15497 18697
19549 18697 27851 17132 -19408 -56950 -23215 -75927 -75321 -65942 -46871 -14772 -33639 -23820 -18680
19536 -18680 -27250 -79616 -67673 -38766 -43924 -15648 -7132 -1346 -29789 -40504 -9153 -1241 7136
19523 7136 -15085 6508 -6040 -17239 -26427 25168 14207 7808 50781 40147 98338 58088
19511 58088 5028 11538 6642 30707 36181 25671 12194 -11682 -40731 -49891 -42529 -39898 -27959
19498b7959L1243O7688P2943q196p899j8423l6368m8458n0685j5661j8680J6966
19486d3489P0851O366l8906m4123O324M9339L4232k0050M745K9707j3820M600
19474D5776K5354l914q703Q005j050M839k1584l4140Q742L8744J7659k5069k0642
19461C4017K695p265j1978O030m6688j2216O5477L9239n4232j1925l3383r9L514
19448b6814J3301q398l1869J4828L4731j201j7468l0332O1214l8391j2047M66
19436d1980O179N6657N2617k4037k9375j7515r319N7043L0247m4849l9780K0388
19424A6276k0526j6282K3102O565q266j9963K7981M979j828L5136j4532Q432m1676
19411f02L865J4579M3094m123o3444k1491L8944j2283k2132K4440j857K5087m2405
$$ plain form
19498 -27959 3284 70972 143915 135719 127820 109397 73029 24571 -26114 -41775 -60455 -43489
19486 -43489 27362 33728 -5178 -49301 -42977 6362 40594 20544 25289 54996 41176 45776
19474 45776 71130 67216 58513 66518 65468 70307 48723 14583 23325 62069 79728 54659 34017
19461 34017 36712 29447 17469 23499 -23189 -35405 30072 69311 15079 3154 -30229 -30328 -26814
19448 -26814 -13513 -21911 -53780 -38952 -4221 -5422 -22890 -53222 7992 -30399 -42446 -41980
19436 -41980 -35801 20856 73473 49436 20061 2546 -6773 50270 80517 35668 -4112 16276
19424 16276 -4250 -20532 2570 9135 869 -19094 8887 13866 12038 47174 32642 41074 -602
19411 -602 3263 17842 60936 56813 -6631 -28122 10822 -1461 -23593 847 -1010 24077 -18328
19398a8328Q826L7287J9456J393j9711j1898o638k628J7374K9992m293m0325l5363
19385b4856J575l0532Q499r162M8404M8832K4688j0407j5480m4885m1837j4229
19373e9390O016M077K5978L9422L4459k914p298k5186j9952N152j0945l5295k0665
19360f6541N1794J1160M6484O1804k4090o3830n300L0202k6597p268J6519M6462
19348G0799K2523m5200P918M9657k1716k3621J0866P946k4813J2342n8871p946
19336a16J4666K9889R043O164j7927Q177O044Q680r747k4639J5410J0026j3459
19323D2211k9719J4997J8734J0144O4357K063N877m4878l1748K0099k5063l2201
19311A4873k808M441K699L8035J3370k3578r368k3580n939l9608L814N816Q4662
$$ plain form
19398 -18328 -9502 27785 47241 48634 28923 17025 10387 7759 25133 55125 50832 10507 -24856
19385 -24856 -23281 -53813 -45314 -54476 -6072 42760 67448 57041 41561 -3324 -45161 -59390
19373 -59390 -53374 -49297 -23319 16103 50562 47648 40350 15164 -4788 364 -10581 -45876 -66541
19360 -66541 -14747 -3587 42897 104701 80611 16781 11481 41683 15086 7818 24337 70799
19348 70799 93322 48122 56040 105697 83981 60360 71226 79172 54359 66701 7830 -116
19336 -116 14550 44439 53482 59646 41719 49896 55940 64620 54873 30234 45644 55670 42211
19323 42211 12492 27489 46223 56367 120724 122787 128664 83786 52038 72137 47074 14873
19311 14873 12065 16506 19205 57240 70610 47032 37664 14084 8145 -31463 -27649 -21833 62829
19298F2829J5244l3K6271N506P95n0687n0390j6018j8156M7869J05j7036J1919
19285A8218j5851k0143L3679m778l841J3670J7610j572m6292R831R4972q353k046
19272H5104Q288m7502k4095m933j1098K2166J2207J4743M436m904K3344J6120
19260I3876j3923j3797j085p899K5214J3246N679m0723K6745O2921k7606j8855
19248A03793k4440r582j4997m1933q964N2674l779p767O961k9876k8238j6273
19236b2421K5782O4962J7038l9903l1230L4765J584J5066J9971J3305R069l3773
19224G4215m8884l0843N274k9269q827M3926J12515K6507n605Q52n9929K7549
19212A07481K1968k6747l9294m397n8519R17N4165M3718j3470l2979j0904J2969
$$ plain form
19298 62829 78073 78040 104311 109817 110612 59925 9535 -6483 -24639 23230 23335 6299 18218
19285 18218 2367 -17776 15903 11125 7284 20954 38564 36992 -9300 531 95503 87150 85104
19272 85104 93392 45890 21795 16862 5764 27930 40137 54880 59316 54412 77756 93876
19260 93876 79953 66156 65071 57172 82386 95632 101311 60588 87333 150254 122648 103793
19248 103793 79353 69771 54774 12841 3877 56551 52772 45005 51966 22090 -6148 -22421
19236 -22421 3361 68323 85361 45458 14228 48993 50577 65643 85614 98919 107988 74215
19224 74215 25331 -5512 -238 -29507 -38334 5592 118107 144614 139009 139861 79932 107481
19212 107481 129449 102702 63408 59011 492 1409 55574 99292 85822 52843 41939 54908
19200E4908M9961J9572q149l9152j2911N1933p77N064j89L0070l9868m1075l6553
19187C2834j0756J9733K0209K3259j5478k3615K0948M1149k6904m966k033n714
19175F8666K833J6293K7834j6337n4339o7884k3073L8096O0316j60j5003J2544
19163D9786N5138p59j7884M9851M2992K07k7979k4964j2298l7711N991K3346K748
19150A08464K2207J5479K2269l918k5845j2027j176l547K9780K2405l8786k0774
19138A14531k5940n284N0359k5566l4930p169K4185M6371J8186j4192L2022Q146
19126A80719k2212K4739J6306k9639J849M9643P3614Q8140J06792R9114L4286
19115F23351O774K0660J858l6676j0336o7267J0498J4446k1446J1662L5866K3166
$$ plain form
19200 54908 104869 124441 116292 77140 64229 116162 115385 120449 120260 150330 110462 69387 32834
19187 32834 22078 41811 62020 85279 69801 46186 67134 108283 81379 76413 74380 68666
19175 68666 71499 87792 115626 99289 44950 -22934 -46007 -7911 52405 52245 37242 49786
19163 49786 104924 104165 86281 136132 179124 179331 151352 126388 114090 76379 82370 105716 108464
19150 108464 130671 146150 168419 164501 138656 126629 125453 121906 151686 174091 135305 114531
19138 114531 88591 83307 133666 108100 73170 66001 90186 136557 154743 140551 172573 180719
19126 180719 158507 183246 199552 169913 171762 221405 295019 383159 489951 589065 623351
19115 623351 630125 650785 652643 615967 605631 538364 548862 563308 541862 553524 589390 612556
19103F12556M8560K7770l2274o2763p0930p0010p4237p537K109n4131r9438j2818
19091B06857l5130l3428K3522M3230n5083n8369J0705n435j0741K2663K9356l6238
19079A01909l2666O3921O0863l7807m1279L5596J4040J3646m801r379K343k795
19067A63591o130j2564J5018P5l5823J6404k0520m2091K7986L6010K1924J7233
19055A81113L2224K7745o2128n0414l7343P545O932J1061L5347l5315k7741k3541
19043F5485N3399N5253L3526j5604n4739J1301k9569k8126O8832J8812l5739k8086
19031A14745J5608R403M3118L769j6216l4308l0147L9921J237k2564j0145M4286
19019A58707N096K0708K0596k7471o2196P390N038N8670N01l069j0317o322j2686
$$ plain form
19103 612556 661116 688886 656612 593849 522919 452909 378672 371135 373244 319113 219675 206857
19091 206857 171727 138299 161821 205051 149968 91599 102304 96869 86128 108791 138147 101909
19079 101909 69243 133164 194027 156220 114941 150537 164577 178223 173422 164043 166386 163591
19067 163591 157461 144897 159915 159990 124167 140571 120051 77960 105946 141956 163880 181113
19055 181113 213337 241082 178954 128540 91197 98742 105674 116735 152082 116767 89026 65485
19043 65485 118884 174137 207663 192059 137320 148621 119052 90926 159758 178570 142831 114745
19031 114745 130353 139756 182874 186643 170427 136119 105972 145893 147130 124566 114421 158707
19019 158707 163803 184511 205107 177636 115440 122830 127868 186538 187039 183970 173653 167331 154645
19006A54645j3990r252L189l8985M3447m4401q563l387J6036K6064k2540J6148
18994A18411R665l3481L7858r187R12n518l1844j294J3964L7101o158j7766J2512
18981A25175L71l89j0584m3867l7024l1230j1694k0943J6970P0783L0098L7178
18969A24844l415J9313j3598n3804l3796l949N0862J9942o022m381q998l3388
18957E3610j5891q519L3876J7105L8518M119k0826J5681o9486L7394N4467N699
18945A45747k1217K201l9243j582L1621Q26l468L939J8932j1948k5359k1077J3390
18932I2762m4172p599J2469M5023R183k0929m552L6718l4046L165M8489K9548
18920A66059K97m9697L5675L8334k7166J046K7109k0002o0527k7804P887Q101
$$ plain form
19006 154645 140655 131403 134592 95607 139054 94653 86090 82703 98739 124803 102263 118411
18994 118411 128076 94595 132453 123266 124178 118660 86816 85522 99486 136587 130429 112663 125175
18981 125175 125546 125157 114573 70706 33682 2452 -9242 -30185 -13215 57568 87666 124844
18969 124844 121429 140742 127144 73340 39544 35595 86457 106399 100377 95996 86998 53610
18957 53610 37719 29200 63076 80181 118699 122818 101992 117673 48187 85581 140048 145747
18945 145747 124530 126731 87488 85906 117527 118353 114885 118824 137756 125808 100449 79372 92762
18932 92762 48590 40991 53460 98483 107666 86737 82185 118903 84857 88022 136511 166059
18920 166059 166356 116659 152334 190668 163502 164548 191657 171655 111128 83324 91211 99312
18908I9312j9339l5547R812K3468N7802J4918l0755k6816r51L4456l3145M661
18896I7876j2158N4854K3606J6854K617n3274m1271L9547N7718l646J2957k639
18884A93041q984k0207M4981k928o1821m2055L6891R388L5487K5972P2497J28391
18872D10653J24885O6708K7125J5106K7334m480M5340k9200j11754p3759m6080
18861D51878k9437l334O0188P5416R4682N1836N5149K2225q1650o3148k9977j0519
18849E93309n7389m3805m5427n1009j8484m1141o5047m8417m9311Q83L9821k5549
18837A88434J6860R074M1338J9913j7560n8934m8348K6084M8374N5874j0871j6819
18825B53419l4825J6478R549P191n274L478L2557J1198j6238K6805j0896m8083
$$ plain form
18908 99312 79973 44426 54238 77706 135508 150426 119671 92855 91904 126360 93215 97876
18896 97876 85718 140572 164178 181032 183649 130375 89104 128651 186369 182723 195680 193041
18884 193041 184057 163850 208831 205903 144082 102027 138918 148306 183793 209765 282262 410653
18872 410653 535538 602246 629371 644477 671811 667331 712671 683471 571717 497958 451878
18861 451878 422441 419107 479295 554711 649393 701229 756378 778603 696953 633805 603828 593309
18849 593309 535920 492115 446688 395679 377195 336054 271007 222590 173279 174162 213983 188434
18837 188434 205294 214368 255706 275619 258059 199125 150777 176861 225235 281109 270238 253419
18825 253419 218594 235072 244621 251812 246538 250016 282573 293771 277533 304338 293442 245359
18813B45359J6550L2422M846n0232K2112P6905K0638r4186l4891L7420J2324K1519
18801C10786L8260l8206l7725o043k5453l103J2231l905l7933o014k5613O9691
18789B46973M9850j4801O373k365n0539J2679K1358J8872j7403r555j8370L060
18777B46132L4101L3985J6346l4309j7338K9446N2241M6642P2135J07923j4082
18766E73222o563n9046k6030n4358l5571k1791j5134K97k9110j3692l9851l6043
18754B36330Q029P7390L1782o764m6708J6444K4070k9176M1883o468l5952r3530
18742B17330l5889O6484J375J3557K834k2151L229O3841L2227O5367P5791K243
18730D86238l8113l081M7754O7032K2973K0581M289j244j8785k4499K2912M9737
$$ plain form
18813 245359 261909 294331 299177 248945 271057 347962 368600 274414 239523 276943 289267 310786
18801 310786 349046 310840 273115 267072 241619 238516 250747 246842 208909 202895 177282 246973
18789 246973 296823 282022 288395 286030 235491 248170 269528 288400 270997 261442 243072 246132
18777 246132 280233 314218 330564 296255 278917 308363 360604 407246 479381 587304 573222
18766 573222 566659 507613 481583 427225 391654 369863 354729 355026 325916 312224 272373 236330
18754 236330 244359 321749 353531 346767 300059 316503 340573 311397 353280 346812 310860 217330
18742 217330 181441 247925 249300 262857 265691 243540 246769 310610 342837 408204 483995 486238
18730 486238 448125 445044 492798 559830 582803 603384 607673 606429 587644 563145 586057 635794
18718F35794M7132K9778P3460M8530m7404n5008m3534j3863l3682l0589J0956
18707F21570K7066K5934l2742p6846p1650j6533l5084k3565j9140l0363J9580
18696C88227J1597N1560J2295m4404l5859L918L5920P5029L8960K0770k1013p984
18684E29016l0151j1511L143L6021Q6247K0976K9120O5470j6455M1510M8209O9382
18672H70977P7997M4637J3243j5449m3387J0271N516m435l4422j9578j0087q2895
18660H12388j2655N1000j4255l3585K2415k2543m2399j9273m5935P236k5601o0396
18648F16397l2519l4057O4667J2634K645J2939m399l2080R496K6996k0621R193
18636F31291K0990k4980k8906j2619J4623J2976n015M3980K720J9095K7848k0035
$$ plain form
18718 635794 682926 712704 786164 834694 787290 732282 688748 674885 641203 610614 621570
18707 621570 648636 674570 641828 564982 493332 476799 441715 418150 399010 368647 388227
18696 388227 399824 451384 463679 419275 383416 387334 423254 498283 537243 558013 537000 529016
18684 529016 498865 487354 490497 526518 612765 633741 662861 728331 711876 753386 801595 870977
18672 870977 948974 993611 1006854 991405 948018 958289 963805 959370 924948 905370 895283 812388
18660 812388 799733 850733 836478 802893 825308 802765 760366 741093 695158 702394 676793 616397
18648 616397 583878 549821 614488 627122 629767 642706 638307 606227 615723 642719 622098 631291
18636 631291 652281 627301 598395 585776 600399 613375 608360 652340 655060 674155 702003 681968
18624F81968o342j7713k1099J6086K8291J5017k1484J8273K1416J158K3558K2203
18612G61332O9555K1687j507J7326P597l7702m6088P4690O3715p0639m8041L0265
18600H42190K9161L3768L5157j1500J0522O446Q968l36L091K1545J00514n881
18588A073645k5394P5154M3713k2095N8475M6395K4213K7300j1825J2257O6264
18577A368102J06700P0119J07672P2881J00703P8116R0193J07617J43543J60843
18567B406489J68088J11377P0752R7218J74505J95319J59633K02162J82160J64932
18557C932635K34521K45163K96719L39507L14870M23344N26335N81932N82704
18548G477730P14174R14646J155114J480351J840735K374311L304580M714173
$$ plain form
18624 681968 675626 657913 636814 652900 681191 696208 674724 692997 714413 715571 739129 761332
18612 761332 830887 852574 851067 868393 875990 838288 792200 866890 930605 859966 811925 842190
18600 842190 871351 905119 940276 928776 939298 945744 954712 954376 957467 979012 1079526 1073645
18588 1073645 1048251 1123405 1167118 1145023 1203498 1249893 1274106 1301406 1289581 1301838 1368102
18577 1368102 1474802 1544921 1652593 1725474 1826177 1904293 1994486 2102103 2245646 2406489
18567 2406489 2574577 2685954 2756706 2853924 3028429 3223748 3383381 3585543 3767703 3932635
18557 3932635 4167156 4412319 4709038 5048545 5363415 5786759 6313094 6895026 7477730
18548 7477730 8191904 9106550 10261664 11742015 13582750 15957061 19261641 23975814
18540B3975814O621242Q940487J1112096J1980982J1090726R441748P157916L691863
18532I4012874L03557j731101l226549m849578m930218j705005K861151N789038
18524H6524169O454616N694967L867965N12783l063624n496589p558107j0266748
18516G6669432j2075143j1162539q676237o258840m545145l331809k548430k051754
18508B6019535j698360j389952j189442j109560r41347q35070p83480q15999p85919
18499A6470406p37078o73995o41786n74226n11695m74713m42315m22846l78331
18490A1613421m11715m05061l40829l26026l02704k80796l14010l11685k95582
18481H625013l39514k70388k21766k62199k89443k74970k85945k27689k07370
$$ plain form
18540 23975814 30597056 39537543 50649639 62630621 73721347 83163095 90321011 94012874
18532 94012874 94316431 92585330 89358781 84509203 79578985 77873980 80735131 86524169
18524 86524169 92978785 98673752 102541717 103054500 99990876 94494287 86936180 76669432
18516 76669432 64594289 53431750 44755513 38496673 33951528 30619719 28071289 26019535
18508 26019535 24321175 22931223 21741781 20632221 19690874 18855804 18072324 17256325 16470406
18499 16470406 15733328 15059333 14417547 13843321 13331626 12856913 12414598 11991752 11613421
18490 11613421 11201706 10796645 10455816 10129790 9827086 9546290 9232280 8920595 8625013
18481 8625013 8285499 8015111 7793345 7531146 7241703 6966733 6680788 6453099 6245729
18472F245729k24704j66739j73122j81416j16071j10230j94470j40453j84774
18463D753750j34282l7918q4876j10676j15721j29260q6229r1942o2334l3413
18453C867099o8065n7951m8755n5564n3344j2361L9522p2422j46858p4768j36765
18442C179768r5354p8546p0288r0705o5290k5524n013m1493p3986p9913o4560
18431B489096r1463j27681j22625p6923n9620o5091r1107j03501n1416j5307J0872
18420A695234j1499o1097n3435o0923j9999N2601L2202q985j1953m793n928k8061
18408A513364j4087J4459n441o9544k6817p0669n5095O0591K7458l5021j7018
18397A322180J451K23l4947k7723p7776k0067m0247l4966j7767j4913n4265p385
$$ plain form
18472 6245729 6021025 5854286 5681164 5499748 5383677 5273447 5078977 4938524 4753750
18463 4753750 4619468 4581550 4496674 4385998 4270277 4141017 4054788 3962846 3900512 3867099
18453 3867099 3799034 3741083 3692328 3636764 3583420 3571059 3610581 3538159 3391301 3316533 3179768
18442 3179768 3084414 3005868 2935580 2844875 2779585 2754061 2749048 2707555 2633569 2553656 2489096
18431 2489096 2397633 2269952 2147327 2070404 2010784 1945693 1854586 1751085 1699669 1684362 1695234
18420 1695234 1683735 1622638 1569203 1508280 1488281 1540882 1573084 1564099 1552146 1547353 1541425 1513364
18408 1513364 1499277 1513736 1508295 1438751 1411934 1341265 1286170 1346761 1374219 1339198 1322180
18397 1322180 1323631 1323854 1288907 1261184 1183408 1163341 1123094 1088128 1070361 1055448 1001183 993798
18385I93798j4417j851K0158r6272n3226M0550j1491l1635J35j1837N938K9655
18373H69505K8296l3793m4756k7633J8337N6259j135N092L4958L4507K543K549
18361I44729N6100K0165J5856n4478j5434L170L6375L5827K7043N6035N3084L1525
18349A209997J4980J3676L260J775K6417k4135N5377K1921r00O18J1939j3649
18337A321276j9071M8232M6153j2870K556J6392K6059j491j5520J9955O6863N2389
18325A550923K4773O2117K4158K440P5034J24965J03265O6978J43223J75056K16861
18314B569793K52777K13981K57410J61865R1679O9063M0393M5529L8601J16588
18304C857679K38666K71973L87345M76703N90079O80643Q00291J005282J252926
$$ plain form
18385 993798 979381 977530 997688 901416 848190 888740 877249 845614 845749 833912 839850 869505
18373 869505 897801 864008 819252 791619 809956 866215 865080 870172 905130 939637 942180 944729
18361 944729 1000829 1020994 1036850 982372 966938 970108 1006483 1042310 1069353 1125388 1178472 1209997
18349 1209997 1224977 1238653 1241913 1243688 1270105 1245970 1301347 1323268 1322368 1322986 1334925 1321276
18337 1321276 1302205 1350437 1396590 1383720 1386276 1402668 1428727 1427236 1411716 1431671 1498534 1550923
18325 1550923 1575696 1637813 1661971 1664411 1739445 1864410 1967675 2034653 2177876 2352932 2569793
18314 2569793 2822570 3036551 3293961 3455826 3547505 3616568 3656961 3702490 3741091 3857679
18304 3857679 4096345 4368318 4755663 5232366 5822445 6503088 7303379 8308661 9561587
18295I561587J599180K114197L125006M896568P776109J1237693J4085242J5070226
18287F9465808J3761403J1083932P279578K040288k203603n356769p879936j0784134
18279G7406567j1761763q779593l202752L321968Q921124J2409453J2959277J1165714
18271A02439995Q182203L587108j636346n494952q452293j1278028j4441173j4671292
18263E8235222j1938816q236589n226033l367031k297459j789491j365396j067039
18255B2947368r22847q14254o96248o18052n94013m63598m04741l24733j81349
18246A7927533k3391J60785M04577O09775P80285R63222J126010J197733J135677
18237B4282206J120028J208932J532425K099332L254777M953221O730647Q504530
$$ plain form
18295 9561587 11160767 13274964 16399970 21296538 29072647 40310340 54395582 69465808
18287 69465808 83227211 94311143 101590721 103631009 101427406 96070637 88190701 77406567
18279 77406567 65644804 56865211 53662459 56984427 65905551 78315004 91274281 102439995
18271 102439995 110622198 114209306 112572960 107078008 98625715 87347687 72906514 58235222
18263 58235222 46296406 38059817 32833784 29466753 27169294 25379803 24014407 22947368
18255 22947368 22024521 21210267 20514019 19895967 19301954 18838356 18433615 18108882 17927533
18246 17927533 17904142 18064927 18469504 19079279 19859564 20822786 21948796 23146529 24282206
18237 24282206 25402234 26611166 28143591 30242923 33497700 38450921 45181568 53686098
18229E3686098R959481J1183138J1511741J0360209Q280931N746007K455847j681002
18221A11502450m483515n919832o779971p717747p489222o203886m578021l520584
18213F4809672l141672k964460l037069l412115l925422m123772m031935l731773
18205C6441454l403932k896560k272789j635404j161964q28050n43331l58322
18197B3341102k31475K615L43803P89919J411273K239784L118388L834373M398453
18188C9248235M775015M820009M483426L866213L369454L276280L618523M835958
18180G2293113O990179R917776J2723991J4835684J5759621J5502772J3751093
18173A61774229R954022M073736j721148o780398j1884172j5707768j6651767
$$ plain form
18229 53686098 63645579 74828717 86340458 96700667 104981598 110727605 113183452 111502450
18221 111502450 107018935 101099103 94319132 86601385 79112163 72908277 68330256 64809672
18213 64809672 61668000 58703540 55666471 52254356 48328934 44205162 40173227 36441454
18205 36441454 33037522 30140962 27868173 26232769 25070805 24242755 23699424 23341102
18197 23341102 23109627 23112242 23456045 24245964 25657237 27897021 31015409 34849782 39248235
18188 39248235 44023250 48843259 53326685 57192898 60562352 63838632 67457155 72293113
18180 72293113 79283292 89201068 101925059 116760743 132520364 148023136 161774229
18173 161774229 171728251 175801987 174080839 167300441 155416269 139708501 123056734
18166A23056734j5656120j3965938j2028584r484736o969354m966610l761895
18159E6223497l218990l325525l510973l488886l315631l139001k865209k493329
18151C0865953k128702j762243j544773j383212j224783j070085j006076r89954
18143A9756125r56204q30898p43380p00231o82534o62291n50164n20667m71057
18134A3638699m84908m10034l61771l99747l71797l47170k80035k91129k69047
18125A0423061k18503k29923j45317p8247p747M5950J29894J91665L17770M61941
18115A0890544Q17612J491138K669536N040629R206263J3107214J0177067L813546
18107E7213549J470445o736078j5939293j1843360n998813l084766j877859j266637
$$ plain form
18166 123056734 107400614 93434676 81406092 71921356 64952002 59985392 56223497
18159 56223497 53004507 49678982 46168009 42679123 39363492 36224491 33359282 30865953
18151 30865953 28737251 26975008 25430235 24047023 22822240 21752155 20746079 19756125
18143 19756125 18799921 17969023 17225643 16525412 15842878 15180587 14630423 14109756 13638699
18134 13638699 13153791 12743757 12381986 11982239 11610442 11263272 10983237 10692108 10423061
18125 10423061 10204558 9974635 9829318 9751071 9743324 9789274 9919168 10110833 10428603 10890544
18115 10890544 11708156 13199294 15868830 20909459 30115722 43222936 53400003 57213549
18107 57213549 58683994 51947916 36008623 24165263 18166450 15081684 13203825 11937188
18099A1937188r37190o86604n67477m80635m38829m01188k79333k40315k37920
18090G667697k19505k23847k88894l22543l28688k43580k05867j71578j83985
18081E479210j95490j68490j49799j44472j69846q0669o7803r4475q4191j17050
18071D206925q5941o2364l1709o4747j26984q1495n5433m4562p5610j04550p1518
18060C402012q341J8324q2296j11383p5163l7994k2860m2882l8326n1358o7210
18049B882523o0561n6587j4518L3970M045l2691q0525o9255K3829N492q7982k2738
18037B525002k8525L4312M4601L8916M442L6916N0139K7524R2767J08942J05077
18026C040113J78004K24090J62792K54048K74783K35409K88202L32075L61656
$$ plain form
18099 11937188 10999998 10313394 9745917 9265282 8826453 8425265 8145932 7905617 7667697
18090 7667697 7448192 7224345 6935451 6612908 6284220 6040640 5834773 5663195 5479210
18081 5479210 5283720 5115230 4965431 4820959 4651113 4570444 4502641 4408166 4323975 4206925
18071 4206925 4120984 4058620 4026911 3962164 3835180 3753685 3698252 3653690 3578080 3473530 3402012
18060 3402012 3393671 3411995 3329699 3218316 3143153 3105159 3082299 3039417 3001091 2949733 2882523
18049 2882523 2821962 2765375 2750857 2784827 2788872 2756181 2675656 2606401 2630230 2635722 2547740 2525002
18037 2525002 2496477 2530789 2575390 2614306 2618748 2655664 2705803 2733327 2826094 2935036 3040113
18026 3040113 3218117 3442207 3604999 3859047 4133830 4369239 4657441 4989516 5351172
18017E351172M29558M71327N52871P04811Q96764J241557J642351K104292K527564
18008A5922267K846265L196521L287174L260816L314249L614306M452603N992171
18000D5886372Q401863J1334293J4392138J6974661J8616149J8673596J6417048
17993A50696120J2374398P133220P13257o074747j0709917j3376600j4849295
17986A25906436j4526266j2575151r752944o889572m582593l106671k594405k753270
17978F9125564l374457m317401n042609n290602n091957m667191m090982l325304
17970C3925061k641771j986303j473704j151938q53695o79874n25527k77076J09095
17961B4444268N47930J095250J681600K424204L140562L630777L945428L898792
$$ plain form
18017 5351172 5780730 6252057 6804928 7509739 8406503 9648060 11290411 13394703 15922267
18008 15922267 18768532 21965053 25252227 28513043 31827292 35441598 39894201 45886372
18000 45886372 54288235 65622528 80014666 96989327 115605476 134279072 150696120
17993 150696120 163070518 170203738 170916995 164842248 154132331 140755731 125906436
17986 125906436 111380170 98805019 89052075 82162503 77579910 74473239 71878834 69125564
17978 69125564 65751107 61433706 56391097 51100495 46008538 41341347 37250365 33925061
17970 33925061 31283290 29296987 27823283 26671345 25817650 25137776 24612249 24335173 24444268
17961 24444268 24992198 26087448 27769048 30193252 33333814 36964591 40910019 44808811
17953D4808811L661414L320353L181890L095310L441933M475142O031872P618405
17945G9635130Q592089Q807834Q343008P068439M189522N90090k829208n975402
17937A08421502r227723j1024936j1125482j0235068q903984p302715n613794
17930D4987800l988777k758281k037476j775824j830952j966948k043517k028123
17922B6557902j866895j757034j629969j369096j177228j067068r06219q43797
17914A5940596p62986o93896o85088n94167n98885n65556m58179m40241m25273
17905A0716325m22530l98199l80403l21189k92399k68356k94138k35079k82813
17896G821219k82798k61679j84509j73400k08577k14894k07093k01835k01523
$$ plain form
17953 44808811 48470225 51790578 54972468 58067778 61509711 65984853 72016725 79635130
17945 79635130 88227219 97035053 105378061 112446500 116636022 117226112 114396904 108421502
17937 108421502 99193779 88168843 77043361 66808293 57904309 50601594 44987800
17930 44987800 40999023 38240742 36203266 34427442 32596490 30629542 28586025 26557902
17922 26557902 24691007 22933973 21304004 19934908 18757680 17690612 16784393 15940596
17914 15940596 15177610 14483714 13798626 13204459 12605574 12040018 11581839 11141598 10716325
17905 10716325 10293795 9895596 9515193 9194004 8901605 8633249 8339111 8104032 7821219
17896 7821219 7538421 7276742 7092233 6918833 6710256 6495362 6288269 6086434 5884911
17887E884911j78927k05086j61138j43715q4780j73065j64702r0545j45690j45039
17877D392224j60666j17113j09380j21183p4075p7678j37858j15128r2713j18689
17867C267741q3032p1106q1514r2305j00730j11802q3871r8806j09005j26971
17857B308599r5292p3390n4478m4335j06259o3532n0497p0614o6233j9710p8124
17846A586135m2994o2261k7104m947o7003k9764l2477j7453k1150o2678l3314
17835A184990j3250k7274q5320j0344J2491k355k519p542l2691k4041k3817j0444
17823I57884k9876l9058L2595N909k5589p9480n6958l6787m6233N442K8156q044
17811G07961j0834m1132m5785j0216K3012m2831q3486k2355L61n218K299J1823
$$ plain form
17887 5884911 5705984 5500898 5339760 5196045 5111265 4938200 4773498 4682953 4537263 4392224
17877 4392224 4231558 4114445 4005065 3883882 3809807 3732129 3594271 3479143 3386430 3267741
17867 3267741 3184709 3113603 3032089 2939784 2839054 2727252 2643381 2544575 2435570 2308599
17857 2308599 2213307 2139917 2085439 2041104 1934845 1871313 1820816 1750202 1683969 1664259 1586135
17846 1586135 1543141 1480880 1453776 1448829 1381826 1352062 1319585 1302132 1280982 1218304 1184990
17835 1184990 1171740 1144466 1059146 1048802 1061293 1058938 1056419 1048877 1016186 992145 968328 957884
17823 957884 928008 888950 921545 927454 901865 822385 765427 728640 682407 687849 716005 707961
17811 707961 697127 655995 610210 599994 623006 580175 496689 474334 474695 469477 471776 483599
17799D83599r109k7239n4872J2955J5584m814L1285j2224k8760J0973K4542k5081
17787D16839k9725K1178k3566m1411k8173M427P527k7944K6904L0588m7170j9522
17775B89952j2963r472n3115Q800j267J5974j6713p5056k244L5938j2387n148
17763A62299L0617o220Q85L6723k8915N20J8687N2538N4320n2211q6492m717R3740
17750B71774P8151j2047j5841l8193m8549J0553P124j096R171n249k69r247m8245
17737A98037K558M0467L0109o882n7339k9701J4122N5667L2675K0953J5164O8900
17725C84730R0620K5274M3400M5506L0691N8221k7053j8575L7569Q0160K5013
17714G75556J6270M5627j3625k857j6195m7986k8318j6323o4143l6869l7300m3248
$$ plain form
17799 483599 474490 447251 392379 405334 420918 416104 447389 435165 406405 417378 441920 416839
17787 416839 387114 408292 384726 343315 315142 319569 327096 299152 326056 356644 309474 289952
17775 289952 276989 267517 214402 223202 221935 237909 221196 146140 143896 179834 167447 162299
17763 162299 192916 186696 187581 224304 195389 195909 214596 267134 321454 269243 182751 178034 271774
17750 271774 349925 337878 322037 283844 235295 245848 252972 251876 261047 255798 255529 246282 198037
17737 198037 200595 241062 271171 264289 206950 177249 191371 247038 279713 300666 315830 384730
17725 384730 475350 500624 544024 589530 620221 678442 651389 632814 670383 750543 775556
17714 775556 791826 837453 823828 820971 804776 756790 728472 712149 648006 611137 573837 530589
17702E30589k1243n3838L6532O8427J9601J6347L4054J7716L7683J2351J664j4720
17690F85163m8773j00150l5788m4859l1335k3309J0862O8318P8346Q4401J15036
17679G57912K3895L6592J9088k6461l3459j2016m4387p1557n8931k2380o26K3097
17667E90767K5256l265l2527o2790k4692k1586k00J8356N1303j1513l4534k1531
17655D73044M0463o076j8422j8081m5902p9290n7740m0973l3050m1599k8538M5106
17643A88942m568n2355M233l1369l2314R691J6113L7473j2623l2907l6091K555
17631E6780l994J4558K9477m6773j9841K8346j4456j5316l7343j2724n951m3049
17619g0286j5150k6728R385N9082O8985j4564j1989K7497n4670j4810j6878k2916
$$ plain form
17702 530589 509346 455508 492040 560467 580068 596415 630469 648185 685868 698219 699883 685163
17690 685163 636390 536240 500452 455593 424258 400949 411811 480129 558475 642876 757912
17679 757912 781807 818399 837487 811026 777567 765551 721164 649607 590676 568296 567670 590767
17667 590767 616023 612758 580231 517441 492749 471163 470963 489319 540622 529109 494575 473044
17655 473044 513507 507431 489009 470928 425026 345736 287996 247023 213973 172374 143836 188942
17643 188942 184374 132019 136252 104883 72569 82260 98373 135846 123223 90316 54225 56780
17631 56780 52786 67344 96821 50048 30207 58553 44097 28781 -8562 -21286 -27237 -70286
17619 -70286 -85436 -112164 -102779 -43697 25288 10724 -1265 26232 -28438 -43248 -60126 -83042
17607h3042P128J2453L5053O4305J9656n3549j2046L576k8905J5304L0383L3854
17595D4170M9487k0818k6454p1103q968L2596r560k9757O848J724k3586L0855
17583b4566k6840j1590R48r620l5960R890M4613J4009j3678p453R581k8497n185
17570h4348K4058N4152J7551m9483n004k803l2343L9983J9349m172l516m7316
17558g3892O057L562K1691M7201L5105l1460l5238m7119N1592K5157m9779k9818
17546g6941q823P8757R576j2956j7770p575O1471N1229n2820l2910r141k743l4965
17533e5611l1448K0094K2011M5094J4121j5944J1937M3395k7732J8394O3037K2476
17521A29824o6117l5134J0389j2884p0491J4029K2376j8216n799m984j7329l6939
$$ plain form
17607 -83042 -75914 -63461 -28408 35897 55553 2004 -10042 -6466 -35371 -20067 10316 44170
17595 44170 93657 72839 46385 -24718 -33686 -1090 -10650 -40407 -33559 -31835 -55421 -24566
17583 -24566 -51406 -62996 -62048 -71668 -107628 -97738 -53125 -39116 -52794 -60247 -50666 -79163 -84348
17570 -84348 -60290 -6138 11413 -38070 -43074 -45877 -78220 -38237 -18888 -23060 -26576 -73892
17558 -73892 -67835 -64273 -42582 4619 39724 8264 -26974 -74093 -22501 2656 -47123 -76941
17546 -76941 -85764 -7007 2569 -10387 -28157 -35732 25739 76968 24148 -8762 -17903 -20646 -55611
17533 -55611 -87059 -66965 -44954 140 14261 -1683 10254 53649 25917 44311 107348 129824
17521 129824 63707 28573 38962 26078 -44413 -30384 -8008 -26224 -32023 -37007 -54336 -91275
17509i1275L748P6237M2349M0396J1844J3015J7251L9656M2460J6468J526O2030
17497B75705J03578O1254r385J5738K6791M7078j2907M7917o361L1808L1835K9250
17485F42301R575m5487r5803l8052n7437r7518p5044n9990o1832J1579M9634l648
17473A78278l9679O262L6654l3942Q361J6189o7459n6497M0584K726o1719j2774
17461A6984J086l1545K1589N2609Q3570K8233L0241L6193J5031J2078M9788O7600
17449C83457L5432K8304j3509N9868M4765K8910P1058q219k5351J9589p0542p4850
17437D78912m0230L4548J1915k0964l0605m7970j4320K6615J3025K4058m0777
17426C94207r1174o7675n2408Q17K3192j2758l2001J643k0967n1753O361j3727
$$ plain form
17509 -91275 -87527 -11290 31059 71455 83299 96314 113565 153221 195681 212149 213675 275705
17497 275705 379283 440537 431152 446890 473681 520759 507852 555769 549408 581216 613051 642301
17485 642301 651876 606389 510586 472534 415097 317579 242535 182545 120713 132292 181926 178278
17473 178278 138599 144861 181515 147573 155934 172123 104664 48167 88751 91477 29758 16984
17461 16984 18070 -13475 8114 60723 144293 172526 202767 238960 253991 266069 315857 383457
17449 383457 418889 447193 433684 493552 538317 567227 638285 630066 604715 624304 553762 478912
17437 478912 438682 473230 485145 464181 433576 385606 371286 397901 410926 434984 394207
17426 394207 303033 235358 182950 183767 206959 194201 162200 163843 142876 91123 97484 83757
17414H3757q698J7551q565k0207J7425L2476j0428r589q2775l3438J1363L4027
17402B2899m596K5957l1402q0555l041M8325J0080k343p203l446j2115j6146J7463
17389c6123N0989l405n560N4867l7061k5898m0355l4040o065k829m1201L9918
17377h6763O9928j9684q880M7791J9253J9200L952n4247o5344l0304K3218J9281
17365f2599k0771J3552M8287K6607k0736j3905P765N8349J4005n3548k3487J2030
17353a4451L191M9117l1452m7667m047K4565L6852O0551J6412n286m7963l8316
17341A506j9274m4139n3784p576q3m6366K1430M2222K4228m976N370N4556l4453
17328f1339O82Q3299J9036j401o057k2984m0680n3154K6624K6226J1586o1958
$$ plain form
17414 83757 75059 92610 84045 63838 81263 113739 103311 93722 10947 -22491 -11128 22899
17402 22899 18303 44260 12858 -67697 -70738 -22413 -12333 -14676 -21879 -25325 -37440 -53586 -36123
17389 -36123 14866 11461 5901 60768 23707 -2191 -42546 -76586 -82651 -85480 -126681 -86763
17377 -86763 -16835 -36519 -45399 2392 21645 40845 44797 -9450 -74794 -105098 -81880 -62599
17365 -62599 -83370 -69818 -21531 5076 -15660 -29565 -21800 36549 50554 -2994 -26481 -14451
17353 -14451 -11260 37857 6405 -41262 -45309 -20744 16108 76659 93071 87785 39822 1506
17341 1506 -17768 -61907 -115691 -123267 -123350 -169716 -148286 -106064 -81836 -86812 -81442 -26886 -61339
17328 -61339 -60657 22642 41678 40277 34220 11236 -29444 -82598 -55974 -29748 -18162 -80120
17316h0120m6430P6843P5712R766p274j2083l4510j4852p063K1096m1N126q620
17303b2450j7929k7295O235K1763j5031J682k0376q536N6850J3081n8882n4360
17291a25248M4729N0851J711j0469J6797M4056l914j484j3082n082J3936l205
17279I596j3092k511j0366L1759l2248q6237j3229M7963K0799L6933k4953K422
17267c3164N7730l0j962k2463l6313j6079K3594L5664K9727n9330n567l4454k2332
17254h4979K1111O780K0992L4424K8948m0641r255O829k8867p397m4245j9189
17242a15489L0763L0294k756k4172J4453P085J7519P526M013M946K2733L5745
17230C2660j4804n0733N9130j0473K5565M177p2538j9774K9809J7534N111M7540
$$ plain form
17316 -80120 -126550 -49707 26005 35771 28497 16414 -18096 -32948 -40011 -18915 -18956 -13830 -22450
17303 -22450 -40379 -67674 -61439 -39676 -54707 -53025 -73401 -81937 -25087 -12006 -70888 -125248
17291 -125248 -80519 -29668 -27957 -38426 -21629 22427 18513 17029 3947 -1135 12801 9596
17279 9596 -3496 -6007 -16373 15386 -16862 -103099 -116328 -68365 -47566 -10633 -35586 -33164
17267 -33164 24566 24536 22574 111 -36202 -52281 -28687 6977 36704 -22626 -28193 -62647 -84979
17254 -84979 -63868 -57088 -36096 -1672 27276 -13365 -22620 -15791 -44658 -52055 -96300 -115489
17242 -115489 -84726 -54432 -57188 -81360 -66907 -59822 -42303 -34777 -30764 -25818 -3085 32660
17230 32660 17856 -32877 26253 15780 41345 45522 -27016 -46790 -16981 553 5664 53204
17218E3204K0882L471p5440p942k3095K7686L6966J763k0713o7745l9775K7830
17206f2908J7832k51N6941Q642o752k5431n6689j1662K0596N44L9237L4616k708
17193A2007J4485J3193J8810J660n1592q580K8848L4622k4488K2257k5563k4381
17181A1278J0117o9072k9459L6181O401l1790L2165K2091n9166k8325q693N8771
17169d9501n440L739k9213l7862O274P5933k5630k5331O172M097L41l2889k918
17156a12228N9252N2120J7590k2424J288j4414k1912M5557R982J000p602n8497
17144e0288o3289J3985N8460K3052k4148n5332L139L6022j234k2165N2089M6314
17132A6605K5417j9577m1505J6309k308J853R231M517j4092j3123K0785P189m8455
$$ plain form
17218 53204 74086 77557 2117 -5825 -28920 -1234 35732 37495 16782 -50963 -90738 -62908
17206 -62908 -45076 -45327 11614 20256 13504 -11927 -68616 -80278 -59682 -59138 -19901 14715 12007
17193 12007 26492 39685 58495 60155 8563 -17 28831 63453 38965 61222 35659 11278
17181 11278 21395 -47677 -77136 -40955 -34554 -66344 -34179 -12088 -71254 -99579 -108272 -49501
17169 -49501 -54941 -51202 -80415 -118277 -112003 -36070 -61700 -87031 -80859 -76762 -76421 -109310 -112228
17156 -112228 -52976 -856 16734 -5690 -4402 -18816 -40728 4829 14811 15811 8209 -50288
17144 -50288 -113577 -99592 -41132 -18080 -42228 -97560 -94421 -58399 -59633 -81798 -29709 16605
17132 16605 42022 22445 -19060 -2751 -5059 -3206 6025 10542 -3550 -16673 4112 11301 -37154
17119c7154l6396N7604L4641L3435R7802M2296K2466O5621R4389q840n2427L9446
17107C52883l677m1487m4837m6063j1594j2200J03415J26893Q7669O2878P4355
17096F48235M5717l8056r3001n9433r3037r5971r7226r876l216N0466N4837L1750
17084C41189J3571N4609J5121m0021k7396q8725j34184N925j2062l3363m031M6596
17072A37229l3389j7474J0253o408l0219j8094j8683K9556L1377L830o213r266
17060G2499M4460l3024k2224j46L4707j7706k6207n8611j1315L7556N9514m4988
17048C4515p7380J8641Q4612K6057j3959m404k6688j3958l8025L1329N2230m3080
17036B9890O446M5788L1397O655m5263n4922l4131j5705n223Q3068J506j7013
$$ plain form
17119 -37154 -73550 -15946 18695 52130 149932 192228 214694 280315 374704 365864 313437 352883
17107 352883 349206 307719 262882 216819 205225 193025 296440 423333 511002 573880 648235
17096 648235 693952 655896 562895 503462 410425 314454 217228 207352 204136 254602 309439 341189
17084 341189 354760 409369 424490 384469 357073 268348 134164 140089 128027 94664 90633 137229
17072 137229 103840 86366 96619 90211 59992 41898 23215 52771 84148 87978 81765 72499
17060 72499 116959 83935 61711 61565 96272 78566 52359 -6252 -17567 19989 79503 34515
17048 34515 -42865 -24224 60388 86445 72486 68082 41394 27436 -10589 20740 72970 29890
17036 29890 36336 82124 113521 120176 74913 19991 -14140 -29845 -35068 48000 49506 32493
17024C2493L293o763J631k6740L1698N8344k6228n1599p4584l934n058M5888m669
17011b6228k1473L5028J9656l4973j4676L6505q077m4167L8088J664J813j609
16999a8449n6358n708m0470J8658N6208K5578l7452l2066P456L9972N0685j4904
16987f850l1238k3499J6233L4480P1767J3794j8563o5418M9669M5973o7665l8674
16975a9991K5314K0273N763J4848k5409j4758K4524l3235P52l7352j2385j4079
16963f5735M6428l564n328M7385K7839l2387k9746J1721R4953P0227k4077j7041
16951A20675r6208n1799j5821o916k891m5550L4671O1244N5487k0555J0671J900
16939D4908m7478n8260K8751K3991j7859L6482j8788j7674M952M3982K3232Q141
$$ plain form
17024 32493 35786 29023 30654 3914 35612 93956 67728 16129 -58455 -62389 -67447 -21559 -26228
17011 -26228 -47701 -12673 6983 -27990 -42666 -6161 -14238 -58405 -20317 -18653 -16840 -18449
16999 -18449 -74807 -80515 -120985 -102327 -46119 -20541 -57993 -90059 -82603 -42631 8054 -6850
16987 -6850 -38088 -61587 -45354 -10874 60893 74687 56124 -9294 40375 86348 18683 -19991
16975 -19991 5323 25596 31359 46207 20798 6040 30564 -2671 -1919 -39271 -51656 -65735
16963 -65735 -19307 -22871 -28199 19186 47025 14638 -15108 -3387 91566 161793 137716 120675
16951 120675 24467 -27332 -43153 -50069 -52960 -98510 -63839 -2595 52892 32337 43008 44908
16939 44908 -2570 -60830 -32079 -8088 -25947 10535 -8253 -25927 -20975 23007 46239 54380
16927E4380m973j9639l5878l1039j928j7858k5211K0348k6240k1034J526K0800
16915h6746K6417L567Q544L3970P793k0350l1828k9173j0978K6560Q6280J144
16903A5200r750M135r327J5446j0684j6524k6275j3504j6778J6883R878j8289
16891e9589L834P5397O865m2737j6990n1038m1010L0963L7751K9573K3987M866
16879A872o765Q082J9988J4232l64L0j4663k4640L8370n667J7557m1882n5157
16866d9007k1572L8414k2805L0085M0188p447o2930J8601M3258m5155l8075m306
16854h0751J8125M9730K6573q435l8092M6369M1449j8647q98l0122P8L8369j7115
16841B6633p5731k169J0418q931j5691K5319J9629l3757J8443k0227J9055N5506
$$ plain form
16927 54380 49407 29768 -6110 -37149 -39077 -56935 -82146 -61798 -88038 -109072 -107546 -86746
16915 -86746 -60329 -56762 -48218 -14248 -6455 -26805 -58633 -87806 -98784 -72224 14056 15200
16903 15200 5450 9585 258 15704 5020 -11504 -37779 -51283 -68061 -51178 -41300 -59589
16891 -59589 -55755 19642 26507 -16230 -33220 -84258 -125268 -94305 -56554 -26981 -2994 1872
16879 1872 -4893 3189 23177 37409 37045 37075 22412 -2228 36142 30475 48032 6150 -49007
16866 -49007 -70579 -32165 -54970 -24885 15303 7856 -55074 -36473 6785 -38370 -76445 -80751
16854 -80751 -62626 -12896 13677 5242 -32850 13519 54968 36321 35423 5301 5379 43748 26633
16841 26633 -49098 -51267 -40849 -49780 -65471 -40152 -20523 -54280 -35837 -56064 -37009 18497
16829A8497j368m8916m7450L2065P088J0172J3520N445k5874K1212L194L9029
16817B6614M8617m7809k9431Q723k1077j4714K8692L9165J5403J3352J2070l8420
16805D1185L4048m0010k9946j2632L6393k1841N068K9953J3814j820O7399O6192
16793A87803k0637p7427k8643j138K6775j3833K3751n9142p0599N0640O7109J252
16781H5911J596k0694k5215N280K9527J3486M807k2149j9118K7793N218j425m0140
16768D4877o3032k0211J9770m074M610M4286k1255K2344o891k7779J2130L4735
16756C9510L2659r411n8554J6025q214M050n118j6654K0655j5134J8701n141j3906
16743e32n1226r345M4406K8532j1807n330J0005o866R887O6982m22q5091o901
$$ plain form
16829 18497 17129 -31787 -79237 -47172 -40084 -29912 -16392 -10947 -36821 -15609 -12415 26614
16817 26614 75231 27422 -2009 6714 -14363 -29077 -385 38780 54183 67535 79605 41185
16805 41185 75233 35223 5277 -7355 29038 7197 12265 42218 56032 54212 121611 187803
16793 187803 167166 89739 61096 59958 86733 72900 96651 37509 -33090 17550 84659 85911
16781 85911 87507 66813 41598 46878 76405 89891 94698 72549 53431 81224 86442 85017 44877
16768 44877 -18155 -38366 -18596 -22670 -18060 26226 4971 27315 20424 -7355 4775 39510
16756 39510 72169 62758 4204 20229 12015 16065 10947 -5707 14948 -186 18515 13374 -532
16743 -532 -51758 -61103 -16697 11835 28 -5302 4703 -2163 7724 74706 74284 -10807 -17708
16730a7708j4783n1834N398P0206N8826j1333j9690l2770M0581K9901O839j491
16718F2142J1145m857q764N5211p239k8286m3911j1117J3066l4939l4529l0661
16706f2739M6601N6880M8365r881n0519L78j2736k363M6731M4919j5005q028J9631
16693A02234O07r118Q301k6854K054K932j1487q17K5479J257M7575L2838l9227
16680A35774l4669n434m030L348O871k071R754K1195p270k2569L0297K6451K3753
16667A81400k4686k0184m117K8202L6769o7045l8493J4323K0381K5069j3424L4752
16655A72947Q0848J6391j3891r425K9901J6269J2802K355m4583j4487Q068p105
16643B50090J1542L1298K1778K9565L0813l1525m1248k3056P3286L4242O560j5036
$$ plain form
16730 -17708 -32491 -84325 -78927 -8721 50105 38772 19082 -13688 26893 56794 63633 62142
16718 62142 73287 68430 59666 114877 107638 79352 35441 24324 37390 2451 -32078 -62739
16706 -62739 -16138 40742 89107 79226 28707 29085 16349 13986 60717 105636 90631 82603 102234
16693 102234 102841 93723 102024 75170 77224 80156 68669 67852 93331 94588 142163 175001 135774
16680 135774 101105 95671 91641 94989 101860 99789 109543 130738 123468 100899 131196 157647 181400
16667 181400 156714 136530 132413 160615 197384 130339 91846 106169 126550 151619 138195 172947
16655 172947 253795 270186 256295 246870 276771 293040 305842 308197 263614 249127 257195 250090
16643 250090 261632 292930 314708 344273 375086 343561 302313 279257 352543 386785 393345 378309
16631C78309j1186J6352K9263j228m5105l1353m1885O5819M6267k8086j8398K4576
16619C83345N0904J0010J3512n984J1852j1085j8550O099K3847j8536j5328J4017
16607D44103K5200L3961o984J3280K7058K5559j1879l816n945L3424K1993m7823
16595E48131L7538J5931L1843o067j5989M8440J09256M6687K7621K393J01993
16584I47777J04409O8026J27736J12764P9446Q5898J14246O8446Q3605J06436
16574A898789J75329J86983K45205K56073L15313L41421L37955L56837L85776
16565D499681M13089N56458P73867J023181J372274K027255L141280M850973P779024
16556B6437082J1764393J4168584J1903508O634438J324919o364703j2707054
$$ plain form
16631 378309 367123 383475 412738 411510 366405 335052 293167 358986 405253 377167 358769 383345
16619 383345 434249 444259 457771 451787 463639 452554 434004 440103 463950 445414 430086 444103
16607 444103 469303 503264 496280 509560 536618 562177 550298 546482 540537 573961 595954 548131
16595 548131 585669 601600 633443 627376 611387 659827 769083 815770 843391 845784 947777
16584 947777 1052186 1120212 1247948 1360712 1440158 1526056 1640302 1708748 1792353 1898789
16574 1898789 2074118 2261101 2506306 2762379 3077692 3419113 3757068 4113905 4499681
16565 4499681 4912770 5469228 6243095 7266276 8638550 10665805 13807085 18658058 26437082
16556 26437082 38201475 52370059 64273567 70908005 72232924 65868221 53161167
16549E3161167j1162248n829095j085975K948175P524551J3058371J7938832J9212864
16541I5766642J7576177J3035442J573724j0094184j5085419j8660276j8430301
16534F5681805j2842718o889699k457610J436278N731917R959752J1143635P448841
16526G9212201K411949l288560j1288317j4921479j1616825p339440m700169l230043
16518B5239317k393244j951071j565470j234886j010205q12694o90003n40214
16510A5041530m77615m78421m96244n99477o65808o66729n77818n06110m85468
16501A0087840m14450l59722l21122k78877k18931k82928k49849k87898k90782
16492G383281l21724k90502k95621k39370j92377j44837j84133j85224k13486
$$ plain form
16549 53161167 41998919 36169824 35083849 38032024 45556575 58614946 76553778 95766642
16541 95766642 113342819 126378261 127951985 117857801 102772382 84112106 65681805
16534 65681805 52839087 45949388 43491778 44928056 50659973 60619725 71763360 79212201
16526 79212201 81624150 78335590 67047273 52125794 40508969 33169529 28469360 25239317
16518 25239317 22846073 20895002 19329532 18094646 17084441 16271747 15581744 15041530
16510 15041530 14563915 14085494 13589250 12989773 12323965 11657236 11079418 10573308 10087840
16501 10087840 9673390 9313668 8992546 8713669 8494738 8211810 7961961 7674063 7383281
16492 7383281 7061557 6771055 6475434 6236064 6043687 5898850 5714717 5529493 5316007
16483E316007j60503j26822j51714j33666j28064j36127j28881j94963j65351
16474C989916j67834p4585q5395r9595q4477j10237j19522j69464j37885j03714
16464B837208o0702n9122o1996o6372p6673p8821q4155j01475n8709m7355p3336
16453B068492m7773o5969m9682m0695n7920n3736j8068o0416j29687m3751k2102
16442A478693m3468r885l2610l1792J703k8218n4295k3184p7111J277l9785m5054
16430A096271j5972k2125l8778l5941L343m6100l6727p825j0450k3259J1368o3343
16418H10462p6352o774M956j0611J4078q627J1794J8628m5271n5849p194j2660
16406F36580m6469k7278p3884m3416q996K3169J7056M52m5865n7746j7861L9441
$$ plain form
16483 5316007 5155504 5028682 4876968 4743302 4615238 4479111 4350230 4155267 3989916
16474 3989916 3822082 3747497 3662102 3562507 3478030 3367793 3248271 3078807 2940922 2837208
16464 2837208 2776506 2717384 2655388 2589016 2512343 2433522 2349367 2247892 2189183 2141828 2068492
16453 2068492 2020719 1954750 1905068 1864373 1806453 1752717 1734649 1674233 1544546 1500795 1478693
16442 1478693 1435225 1425340 1392730 1360938 1362641 1334423 1280128 1256944 1179833 1181110 1141325 1096271
16430 1096271 1080299 1058174 1019396 983455 986798 940698 903971 896146 885696 862437 873805 810462
16418 810462 734110 727336 732292 721681 735759 727132 738926 757554 712283 656434 649240 636580
16406 636580 590111 562833 488949 445533 436537 459706 476762 477214 431349 373603 355742 395183
16394C95183m703l7845l5914k4948j6932M1243J0037J4536n8890q3098Q227L8208
16382B45104J3299n8815K303J5785k9812n8699j3486L2672R274m0139k7492J1753
16370A01747N711L228k0252O0483P6562L6498p3215n9140M463K3275l9057m6913
16358G3390j6922n197L5806k9232p999L902J01060M0030p293J2203M852l8820
16346A65780k6596j9314M536M904M644O8047J9228o047J3653j5104k0768j7252
16334A75711K3892l7006p3571l8422M0421O451J1513J3006k8712q6496k9913J4581
16322h545Q378L0918K559K9421K9393Q968r632l2L5928k4282j5102k9143j3011
16309D5818j4711K1193K502l5805J9408M211K8191M0611k575k4400J2083O3116
$$ plain form
16394 395183 390480 352635 316721 291773 274841 316084 326121 340657 281767 198669 206896 245104
16382 245104 258403 199588 201891 217676 187864 129165 115679 148351 157625 117486 89994 101747
16370 101747 107458 110686 90434 150917 227479 263977 190762 131622 136085 159360 120303 73390
16358 73390 56468 51271 87077 57845 49846 53748 154808 194838 187545 199748 204600 165780
16346 165780 139184 119870 124406 129310 133954 202001 221229 215182 228835 213731 192963 175711
16334 175711 199603 162597 89026 50604 91025 97476 108989 121995 93283 6787 -23126 -8545
16322 -8545 -167 30751 33310 62731 92124 101092 91460 91428 127356 103074 87972 58829 45818
16309 45818 31107 52300 54802 18997 38405 42616 70807 111418 108843 84443 96526 159642
16297A59642J9410L6014K9190m4341q4339m0346K9571J9929o426o0571j7315J7216
16285E7634K041j0969p52r217J1488K3373o2443k5798J5064L6201N9634k241l2162
16272F1853m913K7896m807l0177j3483k4832k3041K307K5108M728N250r206k6148
16259i465J8619j972k9242K6216Q86R161j0115O591K6780j3002k2578l604R958
16246H233Q814N530j1909k669m3278j1225l9951K0650J7682L7317j1866m9653
16234g2325k0884k5391N1615K164j9K199p114L5206K2001L1894j1497O826L119
16221A7794J280p332k658l3829k1197Q328q032k5216k2192K4409L4853O7374j567
16208C2015j8924m209r652n1269k3230j9520J6062k3095k7611M8324L6114N6508
$$ plain form
16297 159642 179052 215066 244256 199915 115576 75230 104801 124730 118304 57733 40418 57634
16285 57634 59675 48706 47954 38737 50225 73598 11155 -14643 421 36622 96256 94015 61853
16272 61853 56940 84836 80029 49852 36369 11537 -11504 -9197 15911 20639 25889 16683 -9465
16259 -9465 9154 7182 -22060 4156 5042 14203 4088 10679 37459 24457 1879 -1725 8233
16246 8233 17047 22577 10668 7999 -35279 -46504 -86455 -65805 -48123 -10806 -22672 -72325
16234 -72325 -93209 -118600 -66985 -64821 -64840 -62641 -69755 -34549 -12548 19346 7849 14675 17794
16221 17794 19074 11742 9084 -24745 -45942 -37614 -45646 -70862 -93054 -68645 -33792 33582 32015
16208 32015 13091 8882 -770 -52039 -75269 -94789 -78727 -101822 -129433 -81109 -44995 11513
16196A1513j2909j2654L1386N9932o489m8937Q894j7566L463k926k8425m527K9358
16183A0113M353Q693L1187o391q71l651L1913J1532l0836N9089l7696l0489n3763
16170f817n8706j1678J2690Q327M5812K2404j3602k5877Q715R600J3338m709R621
16157I118j257k9552l3190J0126K7106L0100O3939k9887l6948k0117k886j65P200
16144f413j0657K3969L1461n2050p575q083K445L0541m305J7172O4492m407m5316
16131C1274n285o557p382o909P696n312m4014m8569j9975j3166K4728k040N015
16118i0496k6236k9200L4360Q6767L8399J5210N083k0325j3439j9945m736n7113
16106h1671j6190O0639j6700O261j32P73K7773j2764j1385q589j0959Q479L5890
$$ plain form
16196 11513 -1396 -14050 17336 77268 70779 21842 30736 13170 16633 13707 -14718 -19245 10113
16183 10113 14466 23159 54346 47955 47084 43433 75346 86878 56042 115131 77435 46946 -6817
16170 -6817 -65523 -77201 -64511 -56184 -10372 12032 -1570 -27447 -18732 -9132 4206 -503 9118
16157 9118 7861 -21691 -54881 -44755 -17649 12451 76390 46503 9555 -10562 -13448 -13613 -6413
16144 -6413 -17070 6899 38360 -13690 -21265 -29348 -26903 3638 -667 16505 80997 76590 31274
16131 31274 25989 19432 12050 5141 12837 7525 -36489 -85058 -105033 -118199 -93471 -95511 -90496
16118 -90496 -116732 -145932 -111572 -24805 13594 28804 33887 13562 123 -19822 -24558 -81671
16106 -81671 -97861 -37222 -53922 -47661 -47793 -47020 -19247 -32011 -43396 -51985 -62944 -54465 -18575
16093a8575J7665j1985M519L1621L5815n319k694q236j6773l694j270j0451K1382
16080C2005J1878o5507K673j9672k9002J922J041N8338N2818m1530m6768k7948
16068f9752l179K2430M1919L9101J5690l1838k5930K1014o937M5807q388o1926
16056b1989m1451j9282J416O2489L116R0P332J6325k4313p81J14N473J9494K1463
16042B9496k6316o5J5199j7524J0789k6196j6497L1523J5695j1097M684L0045
16030C9736p000k7089j3719k2859k6577J9513j3307L7686N865j2058n3853j6695
16018i0357M1714M3661k328m439J5045j4856J2023M9977J5040q5713m8408J76
16006f8465J7307J4881j2928K1524J9482k4080K6499N528L4095M6858l839J0317
$$ plain form
16093 -18575 -910 -12895 -8376 23245 59060 53741 51047 42811 26038 22344 21074 10623 32005
16080 32005 43883 -21624 -18951 -38623 -67625 -65703 -64662 -6324 46494 4964 -41804 -69752
16068 -69752 -72931 -50501 -8582 30519 46209 14371 -11559 9455 2518 48325 39937 -21989
16056 -21989 -63440 -82722 -81306 -18817 -15701 -15611 -8279 8046 -16267 -17048 -16934 -11461 8033 29496
16042 29496 3180 3115 18314 790 11579 -14617 -31114 409 16104 5007 9691 39736
16030 39736 32736 5647 -8072 -30931 -57508 -37995 -51302 -13616 -7751 -19809 -73662 -90357
16018 -90357 -48643 -4982 -7310 -11749 3296 -11560 463 50440 65480 -20233 -68641 -68465
16006 -68465 -51158 -36277 -49205 -27681 -8199 -32279 -5780 -252 33843 80701 76862 87179
15994H7179O9464R6212Q8280J8477r802m0387K9420j8106p7150n5309j4104K0709
15982A94883L5260N2393R6925R7384P7538O3688K859n1567p2629m2541l9843r8489
15970C15861l8544K055l0596L2667Q5488K380M0836M7289j5721p5030q4330m1944
15958B40411o4121n3685k3333j9185m910l9962J5508L6697j9824O859K3950J4100
15946A12505l6379K5578R187k2763k8051K9862O238n2175m3284o9912J8320O2093
15934A1219q407k4927K5620O2626j1635k3666n3915l5119L7347Q1875l303k6175
15922C1540j6292J196j9424j2555r311L001M180Q686k0249l5621K965L8238M1323
15909A7677L0927l5848l0815N5443j4633l3092l735J4824M284k2834R023k0811
$$ plain form
15994 87179 156643 252855 341135 359612 349810 309423 338843 320737 243587 188278 174174 194883
15982 194883 230143 282536 379461 476845 554383 618071 620930 569363 496734 454193 414350 315861
15970 315861 277317 279372 248776 281443 366931 369311 410147 457436 441715 366685 282355 240411
15958 240411 176290 122605 99272 80087 75177 35215 50723 87420 67596 74455 98405 112505
15946 112505 76126 101704 110891 88128 60077 89939 96177 44002 718 -69194 -50874 11219
15934 11219 2812 -22115 3505 66131 54496 30830 -23085 -58204 -20857 61018 57715 31540
15922 31540 15248 16444 -2980 -15535 -24846 -21845 -17665 -8979 -29228 -64849 -61884 -23646 17677
15909 17677 48604 12756 -18059 37384 22751 -10341 -14076 748 5032 -17802 -8779 -29590
15897b9590L6070L0926l6371k4717m4642m0580O0688r062O835L9062O796n1077
15885e5662j313r685L8691k35j0666o015P895M094K1197K900l5310k5498K6323
15872d3284K4930j3874k277O0998L3455m3298n7575L493P972J9547K5741n0843
15860c5015k1725m473M0219j2129J7070N311q557m407K8593k9845l438n323p499
15847d1218M6156K2592k6125k2066j9494j6961M2117J8475J9222r351l077l0609
15835b0339m5403K4280j6200L6063j08k7957M0086L8428K192j1832k7562n5696
15823f4048n2322L3876O523p894J4523L4872M7940j6804k3896M603N7206J7163
15811E1742j6465n6571k1936n8271j8590L6506L7068J5260l935q598K3008M5135
$$ plain form
15897 -29590 6480 37406 1035 -23682 -68324 -108904 -48216 -57278 -50443 -11381 -4585 -55662
15885 -55662 -56975 -66660 -27969 -28204 -38870 -44885 -36990 -32896 -11699 -8799 -44109 -69607 -43284
15872 -43284 -18354 -32228 -34505 26493 59948 16650 -40925 -37432 -29460 -9913 15828 -35015
15860 -35015 -56740 -61213 -20994 -33123 -16053 -10742 -19299 -23706 4887 -24958 -28396 -33719 -41218
15847 -41218 4938 27530 1405 -20661 -40155 -57116 -14999 3476 22698 13347 10270 -20339
15835 -20339 -65742 -41462 -57662 -21599 -21707 -49664 -9578 28850 31042 19210 -8352 -64048
15823 -64048 -116370 -82494 -75971 -83865 -69342 -34470 13470 -3334 -27230 -22627 34579 51742
15811 51742 35277 -21294 -43230 -101501 -120091 -83585 -46517 -31257 -35192 -43790 -20782 24353
15799B4353k4820m5806n5881m499M1645K1774j5285q933j0597N786M3861m129
15787c2531j1075M4941M4675J2676l1627k3316j6063K6795K1586r453r380k9636
15775a2408l0835n1447L9191n39m3411O4780M0357k180l6939J6317p634N094J2155
15762g499o7865m0329J2808Q3695J4283J4235M4494K7184m7108q348J0406r061
15750B6895J7868J6756m3403m9558k1305l0121r013J6235K1887N9548K1442o5276
15738c8045m5483K4758L384J05l1488l3492K534L8034m792J0954K1287M0101K9366
15725A7223l409L5508N575m4711o0617J0006J9206J4498j9446j2543j7446L0748
15713b5408N2152K2734k3365k5324j8723M6495p488N083o038m3729O601j1785
$$ plain form
15799 24353 -467 -46273 -102154 -106653 -65008 -43234 -58519 -67452 -78049 -72263 -28402 -32531
15787 -32531 -43606 1335 46010 58686 27059 3743 -12320 14475 36061 26608 17228 -12408
15775 -12408 -43243 -94690 -55499 -56038 -99449 -34669 5688 3508 -33431 -17114 -24748 -19654 -7499
15762 -7499 -75364 -115693 -102885 -19190 -4907 9328 53822 81006 33898 25550 35956 26895
15750 26895 44763 61519 18116 -31442 -52747 -82868 -91881 -75646 -53759 5789 27231 -38045
15738 -38045 -83528 -58770 -55386 -55281 -86769 -120261 -117727 -79693 -84485 -73531 -52244 -12143 17223
15725 17223 13814 49322 54897 10186 -50431 -40425 -21219 -6721 -26167 -38710 -56156 -25408
15713 -25408 26744 49478 26113 789 -17934 28561 21073 26156 20118 -23611 -17010 -28795
15701b8795l1663N7797M5149L746k3897m7888m0885M1067P9134K515n7051k0007
15689b0778K2623P584j0313k5142J0101J4194K1048p07n2415J3551j7763l718
15677d1735O1975K5635k9443l354J5671j2079N0912K3582J1710M6233k6670q07
15665A21630k377n1797J0790N170J2906J1583k6372J997l9457k0640J7558k1124
15653A9867P34l9562l3516k8598j4328m083L8282P5584P778k624k967m3543k7285
15640e4261L835J8866L6039L6758k1208l2714k4361O0381p592O358L172J1568
15628C6841j9121l2961p6229K6144O0893K5609l3611k0187l7999r283N0323J6265
15616a3316k4037k2405J6809P3586L7035K1508K4820q938m6814l4740J1498k3944
$$ plain form
15701 -28795 -60458 -2661 42488 46234 22337 -25551 -66436 -25369 53765 56280 -771 -20778
15689 -20778 1845 9429 -884 -26026 -15925 -1731 19317 18610 -33805 -20254 -38017 -41735
15677 -41735 20240 45875 16432 13078 28749 16670 67582 91164 102874 149107 122437 121630
15665 121630 119253 67456 78246 83416 96322 107905 81533 83530 44073 23433 40991 19867
15653 19867 20601 -18961 -52477 -81075 -95403 -99486 -61204 14380 22158 19534 16567 -26976 -54261
15640 -54261 -50426 -31560 4479 41237 20029 -12685 -37046 23335 15743 22101 25273 36841
15628 36841 17720 -15241 -91470 -65326 -4433 21176 -12435 -32622 -70621 -79904 -29581 -13316
15616 -13316 -37353 -59758 -42949 30637 67672 89180 114000 105062 58248 23508 35006 11062
15604A1062n167j6809J6796J2362Q309L6877l0625l1355j568L0176k7011k6303
15592b3256o591Q221j0595L4908K4732L9976Q660j6536n761m2676j1377K055k8307
15579b6547O173K6054l1506j2517j3090K7059J74K3574L0363J9282L3052J9897
15567A01968m7693q3541o3741l8790M4295J00885K1692J8241N9754k023o5052
15556D5995J437l0161L734K3344k9807m5005p804L0386l1107K648K6657m7026
15544e6709l5918m160M6189P9407r199o8301J6085N605L126K7965M664J760n68
15531I946K7488J1503P829K9658K1125j2627o1489p4645l0281N4055K8430n580
15519E412K744r663P2915R474J9512l39m3601P243J5559J9050j7037l7648K9371
$$ plain form
15604 11062 5895 -10914 5882 18244 26553 63430 32805 1450 -118 30058 3047 -23256
15592 -23256 -29847 -21626 -32221 2687 27419 67395 76055 59519 53758 11082 -295 1760 -26547
15579 -26547 -20374 5680 -25826 -38343 -51433 -24374 -24200 -626 29737 49019 82071 101968
15567 101968 54275 -29266 -93007 -131797 -87502 13383 35075 53316 113070 111047 45995
15556 45995 47432 17271 21005 44349 14542 -30463 -38267 -7881 -38988 -36340 -9683 -56709
15544 -56709 -92627 -96787 -50598 28809 19610 -48691 -32606 -27001 -23875 4090 8754 10514 9946
15531 9946 37434 48937 56766 86424 107549 94922 33433 -41212 -71493 -17438 10992 5412
15519 5412 8156 -1507 71408 80882 100394 100055 56454 63697 79256 98306 81269 43621 72992
15506G2992Q062r388K987k1180j6122N271m805k6839k9635L6465l1669j5068Q3656
15493E4727N9639q775P454k225k5648L1892J2487l2290n3528o7768j9148j2100
15481e5283M4611k8040M0388L3272l2548k0374M545L4533K0679J496j516l9134
15469B629J654K1285L8988N761M488L7001R652n8992k833K6799o3082m5520K6057
15456C887R189L4720m225j0988K3991L4696L104r759n952k5849l7995K7694N362
15443D7875m4707l7745L4125L5005M7899N1741q840k9920J5755Q8674R5585J36510
15431D31957J23625J25113R5864J44717K05769J85753J36756J42250J24061L1003
15421A746868m7302j05370r6589j51543k03251j78602j62520j51097r0545l6672
$$ plain form
15506 72992 81054 71666 74653 53473 37351 42622 37817 10978 -18657 17808 -13861 -28929 54727
15493 54727 114366 105591 113045 110820 85172 117064 129551 97261 43733 -24035 -43183 -55283
15481 -55283 -10672 -38712 1676 34948 2400 -17974 -13429 21104 41783 43279 41763 2629
15469 2629 4283 25568 64556 70317 74805 111806 121458 62466 59633 86432 23350 -22170 3887
15456 3887 13076 47796 43571 32583 56574 91270 94374 84615 78663 52814 14819 42513 47875
15443 47875 3168 -34577 -452 34553 82452 134193 125353 95433 111188 199862 295447 431957
15431 431957 555582 680695 776559 921276 1127045 1312798 1449554 1591804 1715865 1746868
15421 1746868 1699566 1594196 1497607 1346064 1142813 964211 801691 650594 560049 523377
15411E23377m8178k4340L3024l8552r7973j7449l2425o5698m3363l759L4414K210
15399B21288l8395k9091j9249K3107J4354J2936q662k4937k3280N434k3865k9787
15387G9853K2241J3346L0633j6993l4223l516K6879N984O426j4923m9151l3111
15375C3445K5102O9928J0226L529k3930K8109k320k2959J6048K5114p215m0129
15363A14948K8351k4317J282Q412n5028j529O386k172l4454k7001M974K7551l7803
15350I600n4103O9269L2515J0685n3504j7466k7510M258m206l2q218M1687L8842
15337D1817N825K2488j5217k9088l286M819J9703L2110n0389j6239l0346M190
15325a3613M7137n011Q640j3305K4548n22j7930k1458k3141l909J2804K7040Q784
$$ plain form
15411 523377 475199 450859 483883 445331 347358 329909 297484 231786 188423 184664 219078 221288
15399 221288 182893 153802 134553 157660 172014 184950 176288 151351 128071 133505 109640 79853
15387 79853 102094 115440 146073 129080 94857 91341 118220 124204 130630 115707 66556 33445
15375 33445 58547 128475 138701 142230 118300 146409 144089 121130 137178 162292 155077 114948
15363 114948 143299 118982 120264 128676 73648 72119 78505 76333 41879 14878 19852 47403 9600
15350 9600 -44503 24766 57281 67966 14462 -3004 -30514 -26256 -30462 -30494 -38712 2975 41817
15337 41817 47642 70130 54913 25825 22539 27358 47061 79171 28782 12543 -17803 -13613
15325 -13613 33524 28513 37153 23848 48396 47874 29944 8486 -14655 -18564 -5760 21280 30064
15312C0064R867L7764K3567J1709m9555n648k0307j0827M9946K3739J139k2016
15300G9442k6156L448J9398J595J0622l2488M275O3830k9530l1710l0512o144
15288B6070M7486K5874l9193k128L0566k934L583Q699K44P136n4453j1909j1556
15275B7485o247J8636Q78J4563k3619J8346q477m104K1209R113K7396K652J2212
15262A10043q681j8518j0038M1967N4708m0288m2615o6980J099M1396N205n601
15250F1697K9144Q062j0821j8605k4354K1762L4026K7818R2539M7698j5809j7945
15238B35212M131n571J7432k7000m8775L8828p809M45J440k3119n655l3498k1322
15225A24739K0633m681L6905J8740R349k7004j9424M288k3210N477K9623L8914
$$ plain form
15312 30064 39931 77695 101262 112971 63416 57768 37461 26634 76580 100319 101458 79442
15300 79442 53286 56734 76132 77727 88349 55861 60136 123966 94436 62726 32214 26070
15288 26070 73556 99430 60237 58109 88675 85741 89324 98023 98267 105403 50950 39041 27485
15275 27485 21238 39874 40752 55315 31696 50042 41565 37461 58670 67783 95179 97831 110043
15262 110043 101362 82844 72806 114773 169481 129193 86578 19598 20697 62093 67298 61697
15250 61697 90841 98903 88082 69477 45123 66885 100911 128729 221268 268966 253157 235212
15238 235212 239343 233772 251204 224204 175429 214257 206448 206893 208333 185214 179559 146061 124739
15225 124739 145372 140691 177596 196336 205685 178681 159257 163545 140335 145812 175435 214349
15213B14349m266J2044K2888K383l8898n0781l535J7637N999q882J1767L7632
15201B18337p8172l8020r873k1272n2516p3599k657o099N6289M8505l6008o0248
15189e5333n576N974k3865K52q589l3527N567M0060k508l304K9618J6884J4919
15176a9428J6727j1779K6556K6504J5687J8987L2926m29Q8499M3832K1828j7328
15164B42582n3565J9174j2629k8251k6349k5894J4392Q709J1082M0256J6666k8627
15152A77546r914m6291p442J146J996j0898l7092R520K5235l7938j9215K2608
15140F9261K4984o447J9822K2497R842o327N2958L7993O1036n0678n7511L9781
15128B17211J5109P193k5361L1772O5503k4628l2225k662N2178M8208Q872j8108
$$ plain form
15213 214349 210083 222127 245015 247398 208500 157719 154184 171821 177820 168938 180705 218337
15201 218337 140165 102145 92272 71000 18484 -55115 -57772 -63871 -7582 40923 4915 -55333
15189 -55333 -60909 -54935 -78800 -78548 -87137 -120664 -115097 -75037 -77545 -80849 -51231 -34347 -19428
15176 -19428 -2701 -14480 12076 38580 54267 73254 106180 105751 194250 238082 259910 242582
15164 242582 189017 208191 195562 167311 140962 115068 129460 138169 149251 189507 206173 177546
15152 177546 167632 121341 113899 115045 117041 106143 69051 78571 103806 65868 46653 69261
15140 69261 94245 87798 107620 130117 139959 133632 186590 224583 285619 234941 177430 217211
15128 217211 232320 239513 214152 245924 311427 286799 254574 251912 304090 352298 361170 343062
15116C43062J3078O9551K343J1664R989j47K1675O584l5544r877j4596N5749J7652
15103D91183q3925n1097N2829J32878L3344n4368m1137J8477O3588r618J1719
15092E63873l9888K926K8012j2283J7731M6583J2174k0432l4063o887Q925J5473
15080E82144R5378Q3273O4494M271L8492J9938j5815j8849K6965J3919k220l6231
15068H55759K4550n462J1368J124m2237P966L1229K5952l5151l2079N2076O0660
15056I55755L3900m189k149l0688J0451P4369K1423p4451k0110J4103N2234J4588
15044A045236k147q895o030N9721n8601n395K6920P9713J04886P9350O9879M1108
15032A425745R0767J03588O9904J2926K5013Q1055Q2059J29688P2473M9968Q4747
$$ plain form
15116 343062 356140 425691 428034 439698 449687 449540 471215 477799 442255 432378 417782 473531 491183
15103 491183 407258 356161 408990 541868 575212 520844 479707 498184 561772 552154 563873
15092 563873 523985 526911 554923 542640 560371 606954 619128 598696 564633 557746 566671 582144
15080 582144 677522 760795 825289 829560 868052 887990 872175 853326 880291 894210 891990 855759
15068 855759 880309 874847 886215 887339 845102 853068 884297 910249 875098 843019 895095 955755
15056 955755 989655 985466 983317 952629 963080 1037449 1058872 984421 964311 978414 1030648 1045236
15044 1045236 1043089 1034194 1028164 1087885 1029284 1023889 1050809 1130522 1235408 1314758 1384637 1425745
15032 1425745 1516512 1620100 1690004 1702930 1727943 1808998 1891057 2020745 2093218 2143186 2227933
15021B227933J19393O4126J52753K21224J91299K32576K41165K58719L43601L74624
15011D427413L50231M46920N69310O89843Q33277R98664J182257J436349J731202
15002A2665466K009385K289198K683728L228907M077075N334540P148317R947176
14994D9383792J3750289J8749655K4437834L0011853L4741920L7798254L8063014
14987B46936611L5122671K8832939J9507067Q250294l777684j5105327k4471506
14980B95295065l0931236l4089462l4137695l1656722k7307859k2132725j7085792
14973I7953574j2667969r284586o771506n196816m276955l718609l398900l170950
14965D9467283k998202k763652k611829k530502k310227k071353j873457j781012
$$ plain form
15021 2227933 2347326 2411452 2564205 2785429 2976728 3209304 3450469 3709188 4052789 4427413
15011 4427413 4777644 5224564 5793874 6483717 7316994 8315658 9497915 10934264 12665466
15002 12665466 14674851 16964049 19647777 22876684 26953759 32288299 39436616 49383792
14994 49383792 63134081 81883736 106321570 136333423 171075343 208873597 246936611
14987 246936611 282059282 310892221 330399288 338649582 334871898 319766571 295295065
14980 295295065 264363829 230274367 196136672 164479950 137172091 115039366 97953574
14973 97953574 85285605 76001019 69229513 64032697 59755742 56037133 52638233 49467283
14965 49467283 46469081 43705429 41093600 38563098 36252871 34181518 32308061 30527049
14957C0527049j592336j421045j315169j206818j050735r35266q84093q30938
14949B1290649p24406o98671o63355o57994n96907n83250n67773n48347m95165
14940A5754781m55031m69134m20072m71989m22423m46335m03416l54402l70209
14931A1941770l26971l46959m02533l49533l30754k87110l08223l40727k89212
14922H959748k41114l29409k45345k57208k55822k31461k64411k72296k37177
14913F625505j84687j31951j69769k38434k06463j58056j95304k12205j33828
14904D994808j25655j56859j55715j87199j16124j39641j38358j30678r5412q0503
14894C668664n5239j17470j25506q7757p2194p5261r8116j02399q4937n3182o6336
$$ plain form
14957 30527049 28934713 27513668 26198499 24991681 23940946 23005680 22121587 21290649
14949 21290649 20566243 19867572 19204217 18546223 17949316 17366066 16798293 16249946 15754781
14940 15754781 15299750 14830616 14410544 13938555 13516132 13069797 12666381 12311979 11941770
14931 11941770 11614799 11267840 10865307 10515774 10185020 9897910 9589687 9248960 8959748
14922 8959748 8718634 8389225 8143880 7886672 7630850 7399389 7134978 6862682 6625505
14913 6625505 6440818 6308867 6139098 5900664 5694201 5536145 5340841 5128636 4994808
14904 4994808 4869153 4712294 4556579 4369380 4253256 4113615 3975257 3844579 3749167 3668664
14894 3668664 3613425 3495955 3370449 3282692 3210498 3135237 3037121 2934722 2849785 2796603 2730267
14883B730267p5060j39015p6284j4799l6158j8409k5787q6317q5698j6637n3745
14872B102358p0655n5962l782o350k9869k3115j3164L6565K2357k5363m2762r663
14860A880595M908k0143o4021p0675l4190r5464j02816p3707p6834p4694j11267
14849A161692l9907q8812m5989m553K1974l3802q8726m4357m1031m4798K4472
14838G76163L2873o7658q4099j7535L0133m707k5654j6991o2020j6104J4607N53
14826E59561K2194j4579K6214k4870p2167k5386j2712l6194m5528M760K4134M074
14814D09501K7416L5597j0218j0128J7941j0299q026L7304r111p7536l7152K1501
14802C86790k7789L1650L3860o906O7640K7342k6671L7440M9227Q992n1123j7093
$$ plain form
14883 2730267 2655207 2516192 2439908 2425109 2388951 2370542 2344755 2258438 2172740 2156103 2102358
14872 2102358 2031703 1975741 1971959 1965609 1935740 1912625 1899461 1936026 1958383 1933020 1890258 1880595
14860 1880595 1885503 1865360 1801339 1730664 1696474 1601010 1498194 1424487 1347653 1272959 1161692
14849 1161692 1121785 1032973 986984 982431 1004405 970603 881877 837520 796489 751691 776163
14838 776163 809036 741378 657279 639744 669877 665170 639516 622525 560505 544401 559008 559561
14826 559561 581755 567176 593390 568520 496353 470967 458255 422061 376533 381293 405427 409501
14814 409501 436917 472514 462296 452168 470109 459810 451784 489088 479977 402441 365289 386790
14802 386790 359001 390651 424511 417605 485245 512587 485916 523356 572583 581575 530452 513359
14790E13359J2834K0451r280O0752m7089n811L9929j5371l1852l2112m1418j6389
14778D48003K3631k0221k0528l6728m3647O507Q683j8036o3517j9058q181l9922
14766B16986m0838j4974j4831N6025j395m451q753k0557M268L1582J8160n994
14754B15228K0130q731L0715K2871m640k5399J3050M3418j5646q420j9428J1463
14742B74611r027m8359q361J5220K3918N6405K5809j840j9341n316l4272J9861
14730B89308K313l3729O775k7021l0840L1006K6465j0424l6708O342k3989m4994
14718A54504J1462K9976L86j803o8914o063J8609J4655L3450L989L6136j7552
14706B08835k4606K421k2176k0952R746m7819n8778j7577K2721L8472j467l7188
$$ plain form
14790 513359 526193 546644 537364 598116 551027 545216 585145 569774 537922 505810 464392 448003
14778 448003 471634 451413 430885 394157 350510 357017 365700 347664 284147 265089 256908 216986
14766 216986 176148 161174 146343 202368 200973 196522 187769 167212 171480 203062 221222 215228
14754 215228 235358 226627 257342 280213 275573 250174 263224 306642 290996 282576 263148 274611
14742 274611 265584 217225 208864 224084 248002 304407 330216 328376 309035 303719 269447 289308
14730 289308 291621 257892 264667 237646 206806 237812 264277 253853 217145 223487 199498 154504
14718 154504 165966 195942 196328 194525 125611 119548 138157 152812 186262 190251 226387 208835
14706 208835 184229 186650 164474 143522 153268 105449 46671 29094 51815 90287 88820 51632
14694E1632K0757K52j1514K997m293J0406k976J1442k0070o6885M3831N7066L4537
14681A27182M6361j4057k2392M863R216P370o9984J6457j0094l2533j3181J9941
14669F9149M08J4045K5786q680m9657K8598Q0484r101n4580O833l6362k640K5754
14656I0037m877J2116l2997m910J3362j7119K1125l275N0518j4069m6755j2249
14644E0907P9029J4818O008L476n610M523r779J9415m167K67m2453n507k0593
14631I0334n7222O099L7995J8873L440L6452j9171k7174L7303K3417q316K3461
14619A65491L1291j9755n2025N150P36K7211P287l3603J2596k6110n2450k1105
14607D4714L0968j8163L71j4801j808l1776j1157N6520K9360J7438k774k2823
$$ plain form
14694 51632 72389 72641 61127 64124 59831 70237 67261 78703 58633 -8252 35579 92645 127182
14681 127182 173543 159486 137094 141957 151173 158543 88559 105016 94922 62389 49208 69149
14669 69149 69557 83602 109388 100708 51051 79649 160133 151032 96452 103285 66923 64283 90037
14656 90037 85160 97276 64279 59369 72731 55612 76737 73462 123980 109911 63156 50907
14644 50907 129936 144754 150762 154238 148628 153151 143372 162787 158620 158887 116434 110927 90334
14631 90334 33112 39211 77206 96079 99519 135971 116800 89626 126929 150346 142030 165491
14619 165491 196782 177027 125002 130152 130888 158099 165386 131783 144379 118269 65819 44714
14607 44714 75682 57519 57890 43089 41281 9505 -1652 54868 84228 101666 98892 76069
14595G6069k6818M6072J0208j738k5500Q8180J3261m0442J8353O111j0380j7664
14583A35712j3950o9460l0910k8283j9988j7526K9987L974N2166L8949M4311l0366
14571I4616N693J3870j6950n9207L0384L3982L0264L9624j0348n9387J4826J7341
14559A34708j3161Q273L1805k0526k694K7045N3916M0480N8539Q5766R6938R7317
14547E98406J37736J61427K06200J87233J36230J33842J51088J00819j1620n3137
14537A748224j00286j19603j11237j59136j62860j57027j93338j41201l2014n2676
14527E18846m9141k9320L3691l9761p6903M6833J0674m7339n2209k1323j7911
14516B76137P243o790k8316J7721P94l6668j9792N18j3301j999o6690m1088K5445
$$ plain form
14595 76069 49251 95323 105531 103793 78293 166473 179734 139292 157645 163756 153376 135712
14583 135712 121762 52302 21392 -6891 -26879 -44405 -14418 -10444 41722 80671 124982 94616
14571 94616 100309 114179 97229 38022 68406 102388 132652 172276 161928 102541 117367 134708
14559 134708 121547 129820 161625 141099 138405 165450 219366 259846 318385 404151 501089 598406
14547 598406 736142 897569 1103769 1291002 1427232 1561074 1712162 1812981 1801361 1748224
14537 1748224 1647938 1528335 1417098 1257962 1095102 938075 744737 603536 571522 518846
14527 518846 469705 440385 474076 434315 357412 404245 414919 367580 315371 294048 276137
14516 276137 283380 276590 248274 265995 266789 230121 210329 210847 197546 195547 128857 87769 113214
14503A13214K8609k7081K557j4532K7833k1160l2981M2274J8442j3900J0165N1313
14491A84753m1272m5634l1847P4198l106j8847m640J0782o834k6933k4740J711
14479F7591K577m839J4503J5825J4718k135m845k0972m0458l8472k4722j3185
14467c4414k4048J7332K2098Q3074M9242j1107K6761O9681L9339l9155L8104P6859
14455C13766L3413R0374P7969O9357l472K3668Q3486L5921j7600R437l3826q1115
14443F01378N208o097q499o7987m4634n3923m4032p9933j1919k5541q278J3453
14431B69196k0919J3043Q017O326L3165N2743q454j4492J024K2485J448J7734
14419C81316L6943J10380P7509O38j5633Q9911K8017O4224M6211j3481k9345l7693
$$ plain form
14503 113214 141823 114742 117299 102767 130600 109440 76459 118733 137175 123275 133440 184753
14491 184753 143481 97847 66000 140198 137092 118245 113605 124387 117553 90620 65880 67591
14479 67591 70168 65329 79832 95657 110375 108240 103395 82423 41965 3493 -21229 -34414
14467 -34414 -58462 -41130 -19032 64042 113284 102177 128938 198619 237958 198803 236907 313766
14455 313766 347179 437553 515522 584879 581407 605075 688561 724482 706882 716319 682493 601378
14443 601378 606586 600489 591990 524003 479369 425446 381414 301481 289562 264021 255743 269196
14431 269196 248277 261320 269337 275663 308828 361571 353117 338625 339649 362134 363582 381316
14419 381316 418259 528639 606148 606786 591153 681064 709081 773305 819516 806035 776690 738997
14407G38997m6853o6253q1276j15018o4037m2919m3383p899n0081j9090K0030
14396B22218n0563r446N429K2453k809l658N330j8319m4028L0293R6590k5108
14384B28382p0277N3386p756q0599j06187M7018k9571l5251m9301j5599K8705
14373c7050L2277K5038p946R106J2298R376l7411n364N3612O0609J5451k2888
14361A07108j4756q455K3758o053p82m580l6224r575j0677Q130K3421M0357m8160
14348F3512k0963j4925N3551j453n7503m8433p982J8997M3564l0123Q34J9307
14336A8383P394j9484K7398J7860n455p0016J1393L4287m289J1081r517Q667j2556
14323A5146m0323J5469J134P0048K126p03L29K8242M9556J1928k9693n9784O132
$$ plain form
14407 738997 692144 625891 544615 429597 365560 322641 279258 271359 221278 202188 222218
14396 222218 171655 162209 167638 190091 187282 183624 188954 170635 126607 156900 253490 228382
14384 228382 158105 211491 203735 123136 16949 63967 34396 -855 -50156 -65755 -37050
14373 -37050 -4773 20265 12319 21425 33723 43099 5688 324 53936 114545 129996 107108
14361 107108 92352 83897 107655 101602 100820 96240 60016 50441 39764 47894 71315 111672 63512
14348 63512 42549 27624 81175 79722 22219 -26214 -34196 -15199 28365 -1758 -924 18383
14336 18383 25777 6293 33691 51551 46096 -23920 -12527 21760 17471 28552 19035 27702 15146
14323 15146 -25177 -9708 -8574 61474 63600 62897 63226 91468 141024 152952 123259 63475 69607
14310F9607L4490j2128m1696Q262l3374l6533k4718N6177J4268l0065j2331J7078
14298I037K4177L422J5688R157j9164L435l6672J0894L8451l3415k0461Q824K9411
14285D2784l2542o20M2109J3091j5533m1660j1855k0574k7088j855J2940L9993
14273h10K079l153J4645l106L6513K1658r41r394K3543K4593N0277J7126p4194
14260I8836k3661m4810K3146K8776R6452N0942j6446J8324j0894q0099k9558K653
14248A13661j6136K8177k2852M06M3857K6120l1465l5637j5096j427p306M956
14236H7258K6545J0050k8337m285P299J907L8770J0514J6879l1752n804J5049
14224A44093L1995j166K3423m0477l6701K1030p966K0111J9990J7299L4953L6288
$$ plain form
14310 69607 104097 91969 50273 58535 25161 -11372 -36090 20087 34355 4290 -8041 9037
14298 9037 33214 36636 52324 61481 42317 45752 9080 19974 58425 25010 4549 13373 42784
14285 42784 10242 9622 51731 64822 49289 7629 -4226 -24800 -51888 -53743 -40803 -810
14273 -810 1269 -1884 12761 9655 46168 67826 66885 57491 81034 105627 155904 173030 98836
14260 98836 75175 30365 53511 82287 178739 229681 213235 231559 220665 140566 111008 113661
14248 113661 97525 125702 102850 103256 147113 173233 141768 106131 91035 89608 82302 87258
14236 87258 113803 123853 95516 91231 98530 100437 139207 149721 166600 134848 129044 144093
14224 144093 176088 174922 198345 157868 121167 142197 134231 154342 174332 191631 226584 262872
14212B62872q9391k1090j776k7484q197j6407k2074M1604J9621k1472m3232m2904
14200C0070m4864J8699L9616N1699l956l1645O629k4393M1581K8114J9974j9678
14188A11846J2957l2603j4939j6220K9536k0795k4377P9943J0040j415k9148j9881
14176H4944k067J7352J3223n7443k1271K0035n2100k1146l0734n731L0069k8115
14164e2984k1452O772R655j1293M820M7654L8924R688n3199M1315M7671R999j0596
14151F6974M646k156P989K8052J721r225j4791R238K7187L2022L1025k3727j8062
14138A40893N533j7737l1882L3830J9097M8880J7350M6256N69l6714L7605L4714
14126B98394k3503m8624K6948K4344k1744J8773K5956l9598j7320J2329L3538
$$ plain form
14212 262872 173481 152391 150615 123131 114934 98527 76453 118057 137678 116206 72974 30070
14200 30070 -14794 3905 43521 95220 91264 59619 66248 41855 83436 111550 131524 111846
14188 111846 124803 92200 77261 61041 90577 69782 45405 125348 135388 133973 104825 84944
14176 84944 82877 100229 113452 56009 34738 54773 2673 -18473 -49207 -54938 -24869 -52984
14164 -52984 -74436 -67664 -58009 -69302 -64482 -16828 22096 31784 -21415 19900 67571 77570 66974
14151 66974 71620 69464 77453 105505 107226 98001 83210 92448 119635 151657 182682 158955 140893
14138 140893 146426 128689 96807 130637 149734 198614 215964 262220 262789 226075 263680 298394
14126 298394 274891 226267 253215 277559 255815 274588 300544 260946 243626 255955 289493
14115B89493j7842L7668N0744k0732o209M7313m2935r207M8384K2658M4141Q442
14103D51918l0796k1577n2639p444p02Q1322J4557K396l4628M277J5958J6273
14091D38915L1820P1034Q4610J8129J090j76k4518m7101J179Q242O4982Q922j2721
14078F44407j6230j1420J1722N0668O6716j3095l3232J0587J8817k3446K171J0045
14066G17710L031J9215k6209M7948N3736j1382l6781J4981M5445L5872J7612k2679
14054H58499j8024Q3842N5979M4336L9081L9955M0068O0335J08702J02939L7491
14043A453203L2678L6618P6674O2022M9400M9136J2356J12160J30813J96115J23451
14032B334626P6527J85031K46960K41471K43967K63464L16549L77181M51170N16506
$$ plain form
14115 289493 271651 309319 360063 339331 333122 380435 337500 328293 376677 399335 443476 451918
14103 451918 421122 399545 346906 339462 338760 420082 434639 437035 402407 406684 422642 438915
14091 438915 470735 541769 626379 644508 645598 645422 620904 573803 574982 583224 648206 657128 644407
14078 644407 628177 616757 628479 679147 745863 732768 699536 710123 728940 705494 707665 717710
14066 717710 720741 739956 713747 761695 815431 804049 767268 782249 827694 863566 881178 858499
14054 858499 840475 924317 980296 1024632 1063713 1103668 1143736 1204071 1312773 1415712 1453203
14043 1453203 1485881 1522499 1599173 1661195 1710595 1759731 1772087 1884247 2015060 2211175 2334626
14032 2334626 2411153 2596184 2843144 3084615 3328582 3592046 3908595 4285776 4736946 5253452
14022E253452N54207P35463R12819J006495J267559J527264J785729K210677K761354
14013A8015019L545301M424922N597232O955811Q409293R910197J1284788J2213823
14005H0356386J2537479J2162468J1036601Q967425O255379L163230j29749l231052
13997A31118167n839400p792549r081450r520076r297675q536524p499115o348742
13989F7202636n187843m125422l245356k508108j873676j381276r64550n80089
13981D7336316j70669K91728P34692J282484J936500K762787L684135M762038
13973F2620011O079601P531075Q829484J0002984J0762267J0937379J0326304
13966A27089105Q919796O777323L928907O89182k678796n839082q396906j0264634
$$ plain form
14022 5253452 5807659 6543122 7455941 8462436 9729995 11257259 13042988 15253665 18015019
14013 18015019 21560320 25985242 31582474 38538285 46947578 56857775 68142563 80356386
14005 80356386 92893865 105056333 116092934 125060359 131315738 134478968 134349219 131118167
13997 131118167 125278767 117486218 108404768 98884692 89587017 81050493 73551378 67202636
13989 67202636 62014793 57889371 54644015 52135907 50262231 48880955 47916405 47336316
13981 47336316 47165647 47457375 48192067 49474551 51411051 54173838 57857973 62620011
13973 62620011 68699612 76230687 85060171 95063155 105825422 116762801 127089105
13966 127089105 136008901 142786224 146715131 147404313 144725517 138886435 130489529 120224895
13958A20224895j1302948j1614527j1134479j0176805q914662p563773o256689
13951E3261012n066581m171088l433424k883361k582290k198404j930910j808640
13943B9186314j675804j497374j346035j266107j180577j131888j042914r07135
13935A9138480p73297p44675p38387p35565o61628n67269n73737n12148m54844
13926A3376930m81982m39886m17489l54722l64000l95552l51023l44637l37880
13917I889759k88861l17526k85940l03633k59366k28272k27179l12190k53265
13908G413527j74241k28703k31213j85745k16358j63032j94268k03800j77732
13899E638435j54360j52610j58864j46224k15402j54129j28809j47760j39016
$$ plain form
13958 120224895 108921947 97307420 86172941 75996136 67081474 59517701 53261012
13951 53261012 48194431 44023343 40589919 37706558 35124268 32925864 30994954 29186314
13943 29186314 27510510 26013136 24667101 23400994 22220417 21088529 20045615 19138480
13935 19138480 18365183 17620508 16882121 16146556 15484928 14917659 14343922 13831774 13376930
13926 13376930 12894948 12455062 12037573 11682851 11318851 10923299 10572276 10227639 9889759
13917 9889759 9600898 9283372 8997432 8693799 8434433 8206161 7978982 7666792 7413527
13908 7413527 7239286 7010583 6779370 6593625 6377267 6214235 6019967 5816167 5638435
13899 5638435 5484075 5331465 5172601 5026377 4810975 4656846 4528037 4380277 4241261
13890D241261j08730q2912j20625j11288o5961o8446j44148q6893o0820p5824
13880C315614j19217j21651q3873n5473j00302r3586n8205n7637m7325j02824
13870B475521j07018q3562j04227o0889n0240o2941n8830m8214j06724j03641
13860A689235m2199l6223n3906o4776l4601k23k84o626j6766j7738o3398n107
13848A347388j1480k0136j6807n061o9786J7396K2555j9575l8376o647n9332m7759
13836A092380l1111o350l6924j1068l1719r9708n0130m0214l2685J565l6100l1644
13824F86292j193k7271O515L941m3123k3783l8798j2094j161l0574p779K8627
13812E39599L4467M579p204j9941O592J8928p520l3318k4719m128L4319p10l5588
$$ plain form
13890 4241261 4132531 4049619 3928994 3817706 3751745 3683299 3539151 3452258 3391438 3315614
13880 3315614 3196397 3074746 2990873 2935400 2835098 2741512 2683307 2625670 2578345 2475521
13870 2475521 2368503 2284941 2180714 2119825 2069585 2006644 1947814 1899600 1792876 1689235
13860 1689235 1647036 1610813 1556907 1492131 1457530 1457307 1457023 1450397 1433631 1415893 1352495 1347388
13848 1347388 1335908 1315772 1298965 1293904 1224118 1241514 1264069 1244494 1206118 1199471 1140139 1092380
13836 1092380 1061269 1054919 1017995 1006927 975208 875500 825370 785156 752471 754036 717936 686292
13824 686292 685099 657828 664343 668284 625161 601378 562580 550486 549325 518751 510972 539599
13812 539599 574066 578645 571441 551500 558092 577020 569500 536182 511463 507335 541654 540944 505356
13799E05356o9983j5158J2072M6676J9091j2763K911p757k7966Q306k3123j8587
13787D19075o477M143k5702l50k9662k9596N111K7153K219J5120J508m2354j5686
13774C24502J3277j1286n6L4080Q075l070j9036K3514P348k350k2635O3906Q5453
13761E01722K8460m648m8738n8164j2852K5362l9393o6769k6564k0622Q233n2691
13749B33336m4518N0785M1693K7108q4448n8158r861r332L6437L5096K1535K560
13737B42233L3100O205o059m3841j9055J222M6285K0147J9320o4814o7388k7592
13725A39763J9282M7938K541k6574o5422m6616o408O3648M5500K8011o661J3389
13713B08391J4028j4761p849l965j0751J873j5112P041J8411J3054l1857j4304
$$ plain form
13799 505356 435373 420215 432287 478963 498054 485291 488202 480445 452479 460785 437662 419075
13787 419075 412598 416741 391039 390689 361027 331431 336542 363695 365914 381034 382542 340188 324502
13774 324502 337779 326493 326437 360517 368592 365522 346486 370000 377348 374998 352363 416269 501722
13761 501722 530182 525534 476796 418632 405780 431142 391749 324980 298416 277794 286027 233336
13749 233336 188818 239603 281296 308404 223956 165798 155937 146605 183042 218138 239673 242233
13737 242233 275333 281538 275479 231638 212583 213805 260090 280237 299557 234743 167355 139763
13725 139763 159045 206983 209524 182950 117528 70912 64504 128152 173652 201663 195002 208391
13713 208391 222419 207658 199809 195844 185093 186966 171854 178895 197306 210360 178503 164199
13701A64199o440M6003N7178l2330l6693o8352K3721O2429q2895p7008m7102M9325
13689E2035N7448k6931m7325J6145j8073j9577n6322j8285O932L3102Q1060L2937
13677I3146q00J4919O579k9740l0940j6671K5545K6750R440L7648J1170m4581
13665A02465J0486j1617j9561M4804Q841q1630k0542R16P825k0541q955O036M9634
13652F8161J7975j7973n9529J2309J1279p38J1395j697K9063j5433m8542k4088
13640a7818M3222J9701J6855n1853j6300j9042l9727P6446N0542J0896J6442K3732
13628A13096n755k156j5236j3284R25L4950k2702l8757j3446R197K9254L531l3948
13615D5669n4108j991M7132m946L8663L0798j268p3641J0649J6351O635j107j5198
$$ plain form
13701 164199 157759 203762 260940 228610 191917 123565 147286 209715 126820 49812 2710 52035
13689 52035 109483 82552 35227 51372 33299 13722 -42600 -60885 -53953 -20851 60209 93146
13677 93146 92346 107265 113844 84104 53164 36493 62038 88788 98228 135876 147046 102465
13665 102465 112951 101334 81773 126577 135418 53788 33246 34162 41987 21446 12491 18527 68161
13652 68161 86136 68163 8634 20943 32222 31484 42879 41182 70245 54812 6270 -17818
13640 -17818 25404 45105 61960 10107 -6193 -25235 -64962 11484 62026 72922 89364 113096
13628 113096 107341 105185 89949 76665 77590 112540 89838 51081 37635 46832 76086 79617 45669
13615 45669 -8439 -10430 36702 31756 70419 101217 99949 26308 36957 53308 59943 58836 43638
13602D3638k1134O282k4833m3113n6452J624J9027N2797p668l2406L1994M1338
13590A1094N917l683L609K4305k0749J27L0538M1977j5284m749K0068J6286k5381
13577H4075J6889L5775p135l8916k6840J6079k53j517Q279J9425N595J7547J6077
13564A45080o5024l3443j3078M8921P8749K0237m864j8598L408K4684N3719N3549
13552B93340Q2578J15832N9429N8788j6672J2567K2959J3917r471j146j2416j1852
13540F07853k8481o4631r1587l5408O192P7k8625k895k9516Q418n5017J2346l3189
13527B65537o0469J6654O0333l148k9178J1459L8452N5273N7266O3540P6903J1166
13515E63788L8961M6605J4568L9977P9234L3277l164n6987l945m0237k8257j9783
$$ plain form
13602 43638 22504 28786 3953 -39160 -95612 -93988 -74961 -22164 -29832 -62238 -30244 11094
13590 11094 17011 13328 16937 41242 20493 20620 51158 93135 77851 73102 93170 109456 84075
13577 84075 100964 136739 129604 90688 63848 79927 79674 78157 86436 105861 111456 129003 145080
13564 145080 80056 46613 33535 82456 161205 181442 176578 157980 161388 186072 239791 293340
13552 293340 375918 491750 551179 609967 593295 605862 628821 642738 633267 632121 619705 607853
13540 607853 579372 514741 423154 387746 393938 394015 365390 362495 332979 341397 286380 298726 265537
13527 265537 205068 221722 282055 278907 249729 261188 299640 354913 412179 475719 552622 563788
13515 563788 602749 649354 663922 703899 783133 816410 813246 756259 752314 712077 683820 664037
13503F64037n7226j20854m0794m5949r3002n8084k8529J5536k1736k07m3279k0500
13491A49413L4930j1613l7575n366K004q983n437k7384O52m1187R863P791k3274
13478D3834k7761k1611J8537M3013M0559O1215k893m9807n1065j1962j6139J1869
13466C7789j8124k2136L8475L830L7264N738l7389m5520j867J5915O0263J7535
13454I1773m3736j9443L0509O520J4249j0711p785J5785k6987P333j850m825J4659
13441F5491j4939j7908K0627L9608k7889o8573m968K7316L961k1528m2656K6846
13429a4612M681K4010R510j5877K8029L2458K8188j6532l8714j0790m2109K1658
13417I900N0289L6916k5081J0959p576m522J6314l1322l3220J2032k0723j2477
$$ plain form
13503 664037 606811 485957 445163 399214 306212 248128 219599 235135 213399 213192 169913 149413
13491 149413 184343 172730 135155 129789 131793 122810 117373 89989 90641 49454 59317 67108 43834
13478 43834 16073 -5538 12999 56012 96571 157786 154893 105086 54021 42059 25920 37789
13466 37789 19665 -2471 36004 39834 77098 82836 45447 -73 -1940 13975 74238 91773
13454 91773 48037 28594 59103 65623 79872 69161 61376 77161 50174 57507 55657 50832 65491
13441 65491 50552 32644 53271 92879 64990 -3583 -8551 18765 22726 1198 -41458 -14612
13429 -14612 -9931 14079 23589 7712 35741 68199 96387 79855 41141 30351 -11758 9900
13417 9900 60189 97105 72024 82983 75407 70885 87199 55877 22657 34689 13966 1489
13405A489K0600j5739m445R477L1035k5630N78N5381M448j0767J7872o3940m4663
13392b4304J2777l285L0859N6728P013k0964K1781j9133k2204j8412r97J9271
13380C9130j8503l4309J1712L3747M4J8578K0283N183L64j6844k2025m3079L4560
13367B8841K1645K901k8120l5087k4835O050q968K5534O084J7793L2443j5961
13355B8320k4937J6423M8208l9077L2315L0661l527k6223J7296j8211n5650j9866
13343a4268O3714r425k710J9313K3336k3002k5107l834r074m6202n0959J2406
13331f5812J8215q720k9443L6002J5976j0164j045L9393M204J7028K2359m862
13319C3131K5392P480k6649n4060j3189J7887J5791J6595k0100K2024r15O765
$$ plain form
13405 1489 22089 6350 1905 11382 42417 16787 17365 72746 77194 66427 84299 20359 -24304
13392 -24304 -11527 -14812 16047 72775 79788 58824 80605 61472 39268 20856 19859 39130
13380 39130 20627 -13682 -1970 31777 31821 50399 70682 75865 76229 59385 37360 -5719 28841
13367 28841 50486 53387 25267 -9820 -34655 -28605 -37573 -12039 -5955 11838 44281 28320
13355 28320 3383 19806 68014 28937 61252 91913 88386 62163 79459 61248 5598 -14268
13343 -14268 49446 40021 37311 56624 79960 56958 31851 28017 18943 -27259 -78218 -65812
13331 -65812 -47597 -56317 -85760 -49758 -33782 -43946 -44991 -5598 -1394 15634 37993 33131
13319 33131 58523 66003 39354 -14706 -27895 -10008 5783 22378 2278 24302 23387 30152
13307C0152J5062k2284k0138j6996k5824N2579Q870k8402k8348r342L9115n17
13295f073l8158j9506J29K9508K837j6198J397J7921L4307K8089k3359p1197k4526
13282h4829N5710M0566l991m283k785J2470P618q050p469Q10K1959n985J0268
13269C2009r79k9704k2453J5052O7805n611n1578J6667L4896J1977l3562o2183
13257b7664j3470o072K1873J048j0172l0248J9496M2389k2380l0945J783K7237
13245b7125J1091j0327K4637N3543m8047r76k1699L3919j7594k8823J9310M1070
13233B8979j6269J3654k7184L4657M1063n2242l3576J9251N0182K1940j5022M585
13221G0018o503j4391n045J3405n5107m5370j4135M1144J6814M6560K6266l6607
$$ plain form
13307 30152 45214 22930 2792 -14204 -40028 12551 21421 -6981 -35329 -44671 -5556 -6073
13295 -6073 -44231 -63737 -63608 -34100 -31263 -47461 -46064 -28143 6164 34253 10894 -60303 -84829
13282 -84829 -29119 11447 7456 3173 388 12858 20476 12426 4957 5767 27726 21741 32009
13269 32009 31030 1326 -21127 -6075 61730 56119 4541 21208 56104 68081 34519 -27664
13257 -27664 -41134 -47206 -25333 -24285 -34457 -64705 -45209 -2820 -25200 -56145 -54362 -27125
13245 -27125 -16034 -26361 -1724 51819 3772 2796 -18903 15016 -2578 -31401 -12091 28979
13233 28979 12710 26364 -820 33837 74900 22658 -10918 8333 58515 80455 65433 70018
13221 70018 63515 49124 44079 57484 2377 -42993 -57128 -15984 830 47390 73656 37049
13209C7049l4730j8763K9196K337L1013j2299O20p900L8802l738j6037Q3821J00196
13196B29567r37O4865M2829m2932l0918p9428r8741m4632M8031n596n9073k8748
13184e713J3947l3051l5949P456J6016K4326K27K6801j8206j2099j4617K0805
13172a0057M7817L5958k914n53k2328l5848P82K2568J5402m896k1496p000l2675
13159a5240J8943M2561N333J7181L5326Q5434J71511J34874J69305J64303R0899
13148I20430P086j10487j65754j80840j61734j23608j2008j040n364P611P030
13137A81322j8215m7584k6369J0685L3692L0013K1985l9934k6836j5935K8035
13126A30859j2237m6604o7086k1359M480N5598K7078N3078N0806K9709J0038o640
$$ plain form
13209 37049 2319 -16444 12752 15089 46102 33803 34423 26523 65325 61587 45550 129371 229567
13196 229567 228630 293495 336324 293392 262474 183046 84305 39673 87704 82108 23035 -5713
13184 -5713 8234 -24817 -60766 -53310 -37294 -12968 -12741 14060 -4146 -16245 -30862 -10057
13172 -10057 37760 73718 70804 70251 47923 12075 12857 35425 50827 45931 24435 17435 -15240
13159 -15240 3703 46264 51597 68778 104104 189538 361049 495923 665228 829531 920430
13148 920430 927516 817029 651275 470435 308701 185093 173085 172045 166681 174292 181322
13137 181322 163107 115523 89154 99839 133531 163544 185529 145595 118759 102824 130859
13126 130859 118622 72018 4932 -16427 -11947 43651 70729 123807 174613 204322 214360 207720
13114B07720R441m068l1184K4375K4093L8395J14412J43454J91321J63839Q6826
13103I68624j4290j16600j25482j62194j03950r5317q2049n6510l2789L37l271
13092A76509k6568J661Q0652k1263j15382p0319L885K8743K4525J1029L4062N3031
13080A80565J3709O0549J5225j1593j9522L9594q188m6850m7060l0464k0936K3848
13068A48877K5874m9184j0984Q029Q595M5403O9575P1514J1590J4985N6725j0358
13056C90641l0493m2232p9024o1237n6783n7459L3381j4356K0627n850J8878k8317
13044H7776j8323j3173J5301L0788L6844j2838l2525K1528M9278N318M098k780
13032A71292m3274n4975k2068O958J8284L5209L038k8462k4141m4999m9855j1566
$$ plain form
13114 207720 217161 213093 181909 206284 230377 268772 383184 526638 717959 881798 968624
13103 968624 954334 837734 712252 550058 446108 350791 268742 212232 179443 179780 176509
13092 176509 149941 151602 232254 210991 95609 25290 29175 57918 82443 93472 127534 180565
13080 180565 194274 254823 270048 258455 238933 278527 270339 223489 176429 145965 125029 148877
13068 148877 174751 125567 114583 122612 131207 176610 246185 317699 329289 344274 400999 390641
13056 390641 360148 317916 238892 177655 120872 63413 96794 82438 103065 97215 116093 87776
13044 87776 69453 56280 71581 102369 139213 126375 93850 115378 164656 169974 174072 171292
13032 171292 128018 73043 50975 57933 76217 111426 114464 86002 61861 16862 -32993 -44559
13020d4559l4036M7209J1492K1549k596j6141r361J1327M1198M0146k4304m0716
13008A208l5383K6962K3397L3284j3970J4708k4030m1820K6646L1277k8404l1020
12996a7145J6468k0367K9866N1319l5078J9275K2594m0935K7162R284o199L1086
12984H7330p619k0002l5564n5551j4947j1621J5531L5711k2286l2750J2473K060
12972d7235M1591J4257j2444L4476K2488o3975o4314L2392P6146J9851k7986p403
12960A7844m113J6768q707K452n7203l6248j1844K7365K4175L6013J1303O377
12948B4182R027L8232m1590j2169k158j713k055m997k0466J3194J8218M7614J0489
12935G5808J9676P293m5251j9377m895l1115L784K45q874j8621L8419k4963p6844
$$ plain form
13020 -44559 -78595 -31386 -19894 1655 -941 -17082 -26443 -15116 26082 66228 41924 1208
13008 1208 -34175 -7213 16184 49468 35498 50206 26176 -15644 11002 42279 13875 -17145
12996 -17145 -677 -21044 8822 60141 25063 44338 66932 25997 53159 62443 56244 87330
12984 87330 79711 59709 24145 -31406 -46353 -57974 -42443 -6732 -29018 -61768 -49295 -47235
12972 -47235 -5644 8613 -3831 30645 53133 -10842 -75156 -42764 33382 53233 25247 17844
12960 17844 13731 30499 21792 24244 -32959 -69207 -81051 -53686 -29511 6502 17805 24182
12948 24182 33209 71441 29851 17682 15524 13811 11756 6759 -13707 -513 17705 65319 75808
12935 75808 95484 102777 57526 38149 33254 2139 5923 6168 -2706 -21327 17092 -7871 -84715
12922h4715R067L3163J7483K370j2850J121k2318j571l3385O6785K3482O915k7946
12909b2399j8223j2697L6047J5825K8321J3498l4914n379J0624k1943n4074j2180
12897g7494L494j807o286L5230O3276N0053k8754o2338m5961r629M5715L1800
12885b701M6540J8661m1977m3899j404L4669j4243l4293O908M8383N27l8675k6337
12872d7841K8557J755j9302l1244M6088j8230J1814j7420n106O945K4998M8552
12860B9566M65j0119k7428k1999O651k430n652L988j74k6831O4869Q035j6038
12847B903o229L1471l1703o0324N0443M7896o5342p44j0959P586J2712n465k7569
12834e5324j9599L1890J5698l935J4646N3821K5184L071k0574k846j7479q698
$$ plain form
12922 -84715 -75648 -42485 -25002 -22632 -35482 -34361 -56679 -58250 -91635 -24850 -1368 5547 -22399
12909 -22399 -40622 -53319 -17272 -1447 26874 40372 5458 79 10703 -11240 -65314 -77494
12897 -77494 -74000 -75807 -82093 -46863 16413 66466 37712 -24626 -70587 -80216 -34501 -2701
12885 -2701 43839 62500 20523 -23376 -24780 9889 -4354 -38647 -31739 16644 17171 -21504 -47841
12872 -47841 -19284 -17529 -36831 -68075 -21987 -40217 -28403 -45823 -50929 -43984 -18986 29566
12860 29566 30031 19912 -7516 -29515 -22864 -25294 -30946 -26958 -27132 -53963 10906 18941 2903
12847 2903 -3326 28145 -3558 -63882 -13439 34457 -30885 -31629 -42588 -35002 -22290 -27755 -55324
12834 -55324 -74923 -43033 -27335 -31270 -16624 37197 62381 65452 44878 42032 24553 15855
12822A5855k1942l9511q322k0242M833J6010j0737K0823P8002K2799k0283L1882
12810F9167j0391j2942l1529O15N579k27O29j7321n9090k8067R142N4230m613
12797b4818r70L9425N640r458M1724J4967J7786K4798m7794R885O4640M0439J0627
12784A86891L8644M5832N855j06978m3970k2984m2373j3011k2070L071l9330J03
12772a0320L6292n368m2872N0777K6849J7303j00716j8354O6622J01544j9407
12761A02350l8787k5735j8322k5994j9959l2256L1282K7340j4144l1005L8574
12750f656J3285M719L617j7263L5232P782Q120l989k7495n1080o604J0458J9023
12737a0851J4690M738L419Q776m5227P924J798M3468J2720j0795L6755k1880m0419
$$ plain form
12822 15855 -6087 -45598 -53920 -74162 -69329 -53319 -64056 -43233 34769 57568 37285 69167
12810 69167 58776 45834 14305 14920 20499 20272 20901 3580 -55510 -83577 -74435 -20205 -24818
12797 -24818 -25788 13637 19277 9819 51543 66510 84296 109094 61300 71185 135825 176264 186891
12784 186891 225535 271367 277222 170244 126274 103290 60917 47906 25836 28907 -10423 -10320
12772 -10320 25972 20604 -22268 28509 55358 72661 -28055 -46409 20213 121757 102350
12761 102350 63563 37828 19506 -6488 -26447 -58703 -27421 -81 -14225 -45230 -6656
12750 -6656 6629 11348 14965 -2298 32934 40716 48836 44847 17352 -33728 -40332 -29874 -10851
12737 -10851 3839 8577 11996 20772 -24455 -16531 -14733 28735 41455 30660 67415 45535 5116
12724E116m0099P356J3718J0693l2793m1992m0206Q64L3734K3678K65K682P475
12711d9509k6937o0440l34j7610J9183M5719O8089n844o598L0944Q417l0265K0847
12698d338J6412n0127p118O6113K5773J0146N6968l699k6481n0593l4405J5946
12686A4597r959k1602k3908j7633K4527N1547J9657j8871l6148j0449J1414j3204
12674c0032Q624J7164k2878J1806R292J7742J5373k676j0280n039J9696O434r361
12661B5865j7680j2611j8020J3574K3461J6036j6849j8917J1025N291J2291M278
12649B7744l851j3396j6530l2771m4974j4524J08741L0353n3437j0645p378l545
12637c4213L5146L1170L0308l1853m2519m012K3110k711Q416n5297k1149M386
$$ plain form
12724 5116 -34983 -27627 -13909 -3216 -36009 -78001 -118207 -117343 -83609 -59931 -59666 -56984 -49509
12711 -49509 -76446 -136886 -137220 -154830 -135647 -89928 -21839 -27683 -34281 -3337 5080 -25185 -4338
12698 -4338 12074 -38053 -45171 20942 46715 56861 113829 110130 83649 33056 -1349 14597
12686 14597 4638 -16964 -40872 -58505 -33978 17569 37226 18355 -17793 -28242 -16828 -30032
12674 -30032 -21408 -4244 -27122 -15316 -6024 11718 27091 24415 14135 9096 28792 35226 25865
12661 25865 8185 -4426 -22446 -8872 14589 30625 13776 -5141 5884 11175 23466 27744
12649 27744 23893 10497 -6033 -38804 -83778 -98302 10439 40792 -12645 -23290 -30668 -34213
12637 -34213 933 32103 62411 30558 -11961 -15973 7137 4426 12842 -42455 -63604 -59218
12625e9218J7825K2458Q107M2090L316m9347j5434N2981P326p0973J376Q427M833
12612b6233k3842K9998J7916q692k305j2224l1359j4156K5502J790J0357j4325
12600d7573q976J3511p062o1746j359l479J6788O0299J8146K5244K5680M22j8804
12587A1091R041j3403r984J2519J1486K1745l5699m5147l2066K7738R608K04J070
12574c1797j318p923J7876q80k8704L0089O561q424M3820O597k4482k4794L3965
12561A0586j8213K940J1778o237l4741k4361P0088L1858k2857l7435j6487O0574
12549B7493J3236l7260m0444K1103o670m0378j7776K6946J9554K1911K5161k616
12537A0260k3469R927N1145j9359l010J473j3346k2434q136j4590P162N5198k060
$$ plain form
12625 -59218 -41393 -18935 -10828 31262 34578 -14769 -30203 22778 30104 -40869 -39493 -31066 -26233
12612 -26233 -50075 -20077 -2161 -10853 -13158 -25382 -56741 -70897 -45395 -43605 -33248 -47573
12600 -47573 -56549 -43038 -50100 -111846 -113205 -116684 -99896 -39597 -21451 3793 29473 29895 11091
12587 11091 20132 6729 -3255 9264 20750 42495 6796 -38351 -70417 -42679 -33071 -32867 -31797
12574 -31797 -33115 -41038 -23162 -24042 -52746 -22657 -16096 -24520 19300 25897 1415 -23379 10586
12561 10586 -7627 -4687 7091 854 -33887 -58248 11840 43698 20841 -16594 -33081 27493
12549 27493 40729 3469 -36975 -15872 -22542 -62920 -80696 -53750 -34196 -12285 12876 10260
12537 10260 -13209 -3282 47863 28504 25494 26967 13621 -8813 -16949 -31539 -24377 30821 28761
12524B8761k7849K2121j4616o386L4573k7750l4784m6534j2040O0276J3320j9330
12512c0238k1470J0485L1858n036k4792m9408K7791N6198K0123j3386n390k0649
12500b3914K622M1291k7334n2214R748L6888O098l6580J7851J6799K2672k3103
12488i176j1385l523P404k9680J306O7025K8124K5809l7842k7118J4341k1446
12476C839m8529l2543k6780J2919J0186P549R272n68L5987L3950k094nl2496r5
12462b9408K3205o848N9291J1860j9331m6645l1998R399K1564J1761O389p126
12450B113n6667J9134L2666J1132N9013j4810n5921K7884M5359J4677K7923J8046
12438A30549k1053r423o0794K838K036N215j2687N733L1654K1818j7300n2063
$$ plain form
12524 28761 912 23033 8417 2031 36604 8854 -25930 -72464 -84504 -24228 -10908 -30238
12512 -30238 -51708 -41223 -9365 -14401 -39193 -88601 -60810 -4612 15511 2125 -3265 -23914
12500 -23914 -21292 19999 -7335 -59549 -49801 -12913 -6815 -43395 -25544 -8745 13927 -9176
12488 -9176 -20561 -24084 -16680 -46360 -45054 21971 50095 75904 38062 10944 25285 3839
12476 3839 -44690 -77233 -104013 -91094 -80908 -73359 -64087 -64655 -28668 5282 3188 3183 -29313 -29408
12462 -29408 -6203 -13051 46240 58100 38769 -7876 -39874 -30475 -8911 2850 9239 2113
12450 2113 -54554 -35420 -2754 8378 67391 52581 -3340 24544 69903 84580 112503 130549
12438 130549 109496 100073 39279 42117 44153 49368 36681 42414 74068 95886 78586 26523
12426B6523j2186J9972L1043J4971J4324r455O5899j2190m1861j0722L8035j0507
12414A13846L7175L888m1404k777q301J7789O290l1950n4452m0104L4494M0194
12402G4688j2543j2390J0738J5336r713j3687J584K0554j6559m8238N050L5561
12390E0381p165j7655N8892L9285J6202K8202k4788k1223l7273k2139M711k3742
12378D3688j5559K9104l692K4141J2174J0321Q459K021m353p0325M911J2774l5835
12365A7829j6809j3065K8111J0474j8135N811j4968l0728J2682N7327M0344k8014
12353E0859q310J577J7579l3367o1317l3405k2680l3582L8937O3782j6233k4492
12341f0652Q346r123j2374j3712j8618r832O643K7197N6279J9482j2326l1135
$$ plain form
12426 26523 14337 34309 65352 80323 94647 85192 151091 138901 97040 86318 124353 113846
12414 113846 151021 154909 113505 110728 102427 120216 126506 94556 40104 0 34494 74688
12402 74688 62145 49755 60493 75829 66116 52429 54013 74567 58008 9770 14820 50381
12390 50381 43216 25561 84453 123738 139940 168142 143354 122131 84858 62719 67430 43688
12378 43688 28129 57233 53541 77682 89856 100177 108636 110657 106304 35979 40890 53664 17829
12365 17829 1020 -12045 16066 26540 8405 14216 -752 -31480 -18798 38529 78873 50859
12353 50859 42549 44126 61705 28338 -32979 -66384 -89064 -122646 -83709 -19927 -36160 -60652
12341 -60652 -52306 -61429 -73803 -87515 -106133 -115965 -109322 -82125 -25846 -6364 -18690 -49825
12329d9825j363M9452L5323P2025R463o4697o1353j2426l0559L7514N258j2659
12317b3847k0247K4741l4862k3874K8420K3443J9313m153J912J779K5417k1160
12305c118m7154N7019L931k8593K1116J9563j8019m5905j8261R518l5N5839L4381
12292D0282J1429j3476m2646k3608q9978O94K5711K7043L1249R194l987m1036
12280f9129M388O6187P4238Q088m9588j3589M0858n4249K46n51l4860m5262j4438
12267h7661M3128J9835l9224L3491m266j7552n1920K5185L1827L7282M6303K5164
12255F1592q9614k155R2804Q3003J6301q9673l3998N930j8532k1115J9289J6860
12243D0692K995m4740J1944j303L7146k3545m0034q063L0097j3905o847Q578k1929
$$ plain form
12329 -49825 -51188 -1736 33587 105612 115075 50378 -10975 -23401 -53960 -16446 -11188 -23847
12317 -23847 -44094 -19353 -54215 -78089 -49669 -26226 -6913 -11066 -9154 -7375 18042 -3118
12305 -3118 -50272 6747 10678 -17915 3201 22764 4745 -41160 -59421 -49903 -49938 5901 40282
12292 40282 51711 38235 -4411 -28019 -117997 -117303 -91592 -64549 -33300 -24106 -28093 -69129
12280 -69129 -64741 1446 75684 83772 34184 20595 61453 7204 7450 6899 -27961 -73223 -87661
12267 -87661 -44533 -24698 -63922 -30431 -34697 -52249 -104169 -78984 -47157 -9875 36428 61592
12255 61592 -28022 -30177 62627 145630 161931 72258 38260 44190 25658 4543 23832 40692
12243 40692 43687 -1053 10891 9588 46734 23189 -16845 -24908 5189 -8716 -15563 -6985 -28914
12230b8914j0719K1656P557J7138l9270m7309L1041P918l8434N2625P0995J8999
12218F3283n4539l3177K2569P7943m7066q5390K2952O917J1436Q867k8836j3298
12206d8339k0544N0375N025J2818L3775k92N43k1055l3565J5751R108L3262l073
12193C3789l2303l6021K0308M6721q907J9269j232k5892l1988K594j1870K2524
12181c008n694L1140N2062o5346m8967L2699K3886k1215m0049O501p068l8016
12169h3075j6337M0927j6515N656N5305J9442k581j5589l8521j55K7594O42j4130
12156c7337L7191J3334k8494J690M5623m929r181o254j8697L831J3471j0965r510
12143a0227K0585q195l1255j862K0635N1036J0199n1935n938M6721P564N603k9264
$$ plain form
12230 -28914 -39633 -17977 -10420 6718 -32552 -79861 -48820 -40902 -79336 -26711 44284 63283
12218 63283 8744 -24433 -1864 76079 29013 -56377 -33425 -26508 -15072 -6205 -35041 -48339
12206 -48339 -68883 -18508 -13483 -665 33110 32818 33361 12306 -21259 -5508 3600 36862 33789
12193 33789 1486 -34535 -14227 32494 23587 42856 41624 15732 -16256 -13662 -25532 -3008
12181 -3008 -8702 22438 74500 9154 -39813 -7114 16772 -4443 -44492 -37991 -45059 -83075
12169 -83075 -99412 -58485 -75000 -69344 -14039 5403 2822 -12767 -51288 -51443 -23849 -23207 -37337
12156 -37337 -146 13188 -15306 -13616 32007 27078 17897 11643 -7054 -3223 10248 -717 -10227
12143 -10227 10358 2163 -29092 -30954 -10319 40717 50916 -1019 -6957 39764 47328 52931 23667
12130B3667n8480k589K523l0860L2939K8989k4039l292M6899j3996j2643J3958
12118C076l6840K8246L2688j7988o909r006K8224j2891j149Q363j6760j3894j4261
12105b9101l312o1K749k2286j8192L0038j249k9493L2904Q1031J3009Q552m1569
12092B3020k9246R332j7389J5282K8974K437j1728L1852o730J7776m9462m0946
12080b6828l3491K2378K86k8185L4625J4121L2490L8855J4833j1361l51m4428
12068A2944p2953p672K834K5676O8624L0889J1346R468l8609m0405k3221k7802
12056d8881m8739M443K1882J3784J0722M3720N69M493P396l70k460J266j0971
12043c146j6441L8740l7293j2845L0675j5694J0580k9887n3607Q088J0092M4627
$$ plain form
12130 23667 -34813 -37402 -34879 -65739 -32800 -3811 -27850 -31142 15757 1761 -10882 3076
12118 3076 -33764 -5518 27170 9182 2273 -6733 21491 8600 7451 15814 -946 -14840 -29101
12105 -29101 -32413 -32474 -29725 -52011 -70203 -40165 -41414 -70907 -38003 43028 56037 64589 23020
12092 23020 -6226 3106 -14283 999 29973 32410 20682 52534 45804 63580 14118 -26828
12080 -26828 -60319 -37941 -37655 -65840 -31215 -17094 15396 54251 69084 57723 57372 12944
12068 12944 -60009 -67681 -64847 -39171 29453 60342 71688 81156 42547 2142 -21079 -48881
12056 -48881 -97620 -93177 -71295 -57511 -46789 -3069 -2500 1993 9389 9019 6559 7825 -3146
12043 -3146 -19587 19153 -18140 -30985 -310 -16004 -5424 -35311 -88918 -80830 -70738 -26111
12031b6111L1098O128j4471j0505j4903m9427p877L7432O341J0483L8034l15M7528
12018E3435k4753j7549J5792N9972O789l1962o5265k2030m8769J2653K6829m181
12006c9039k2557M8817P7404L7265l0918j8985Q46j629l7853r663N8430J0156
11994G2274J0482l5004p2821J1340J7850l3604l815m3652j3912L1458K5336j9874
11982e3942N1021K2404j7046J0501k4070j1503k5618K6251Q5285J902k6001l2329
11970F855k0848l1808N7529j4482j7494J3082M0356m6124k6548k3591J289k320
11958f4104M1744N8662k957j8807k1627J069M092o334k129k5003J6749M3228J108
11945B5691J4378P96L8352K5713m0466r3728l8441L73J0642K6192j0480N131K9295
$$ plain form
12031 -26111 4987 11115 -3356 -13861 -28764 -78191 -86068 -48636 -42295 -31812 6222 5907 53435
12018 53435 28682 11133 26925 86897 93686 61724 -3541 -25571 -74340 -61687 -34858 -39039
12006 -39039 -61596 -12779 64625 101890 70972 51987 52833 51204 13351 3688 62118 72274
11994 72274 82756 47752 -25069 -13729 4121 -29483 -33298 -76950 -90862 -59404 -34068 -53942
11982 -53942 -2921 19483 2437 12938 -11132 -22635 -48253 -22002 63283 65185 39184 6855
11970 6855 -13993 -45801 11728 -2754 -20248 -7166 33190 -12934 -39482 -63073 -61784 -64104
11958 -64104 -22360 36302 33345 14538 -7089 -6020 -1928 -8262 -10391 -35394 -18645 24583 25691
11945 25691 40069 40865 79217 104930 64464 -29264 -67705 -67332 -56690 -30498 -40978 -35847 -6552
11932f552M2095J8748j8869l986Q15j6344j5280n0880k5544L5051r465N885J9759
11919b4567L9654m345k8101k7980J1868O572o960J0871P482j3140K735k8609K7928
11906b6592K3990J3221O85k2370k6228K2121p203m5435K9391P8544N2904p490
11894H5538m1683K133k3417k148K3276l0308J0228j0732m6657L4553J4366p9189
11882f4040l0424M9672K0843J6373l0930j3089K1553k5603r119P3113M1011K2567
11870G1927n805m1863j6794o001j3344r704J0693n186l8788J4412K6646l9658
11858e3465j0901L2k3313n723L7060m514p2727J4880M1485j6614j1403O4001J8239
11845b2963P527N6977k605n7300m7135J166o525M7601k2100l7068N562J5519l1911
$$ plain form
11932 -6552 35543 54291 35422 31436 32251 15907 627 -50253 -75797 -40746 -50211 -44326 -24567
11919 -24567 15087 10742 -17359 -45339 -33471 -26899 -33859 -22988 -15506 -28646 -25911 -54520 -26592
11906 -26592 -2602 10619 11304 -11066 -37294 -15173 -22376 -67811 -38420 40124 93028 85538
11894 85538 43855 45988 22571 20423 43699 13391 23619 12887 -33770 783 15149 -64040
11882 -64040 -94464 -44792 -23949 -7576 -38506 -51595 -30042 -55645 -64764 8349 49360 71927
11870 71927 66122 24259 7465 1464 -11880 -21584 -10891 -16077 -54865 -40453 -13807 -53465
11858 -53465 -64366 -64334 -87647 -93370 -56310 -60824 -133551 -118671 -77186 -93800 -105203 -41202 -22963
11845 -22963 -15436 41541 38936 -18364 -65499 -64333 -70858 -23257 -45357 -82425 -76863 -61344 -93255
11832i3255j9456L0589M5479M0380l5618j9398L6320L7869J4992k8447r820M127
11820C762R117K1029k8231k7753M6878M4919Q805K090m9486m2726k2989K0877
11808a3708K3357j2126J0134l1707j7111k0069l9365j2343K1305M7003O4064k6000
11796f566n9011j8559L3293K8779k4133o676l493p088J663j7996J8913J4418K6389
11783b0067K3154K247n620P400k4311K0443M1877k4203p613j6838Q166K3271R846
11770C7752J0789K066l6182k4209q652K4595J2243K0025j0388l9709j6654J9727
11758h597L7377m3662j2638J7494K0963J3199k4275m2826j6099J1342L0349K4041
11746F668k4500m72L5969R509l600J1719O069j5241k5136q19o881N981k5052m8485
$$ plain form
11832 -93255 -112711 -82122 -36643 3737 -31881 -51279 -14959 22910 37902 9455 -365 3762
11820 3762 12879 33908 5677 -22076 24802 69721 78526 80616 31130 -11596 -34585 -13708
11808 -13708 9649 -2477 7657 -24050 -41161 -61230 -100595 -112938 -91633 -44630 19434 -6566
11796 -6566 -65577 -84136 -50843 -22064 -46197 -52873 -56366 -63454 -61791 -79787 -60874 -46456 -20067
11783 -20067 3087 5334 -286 7114 -17197 3246 45123 20920 13307 -3531 4635 27906 37752
11770 37752 48541 50607 14425 -9784 -18436 6159 18402 38427 28039 -11670 -28324 -8597
11758 -8597 28780 -14882 -27520 -10026 10937 24136 -139 -42965 -59064 -47722 -17373 6668
11746 6668 -17832 -18304 17665 27174 23574 35293 41362 26121 985 166 -6715 -734 -25786 -74271
11732g4271l014N4778l92L4330Q237m0488q522L3412k2025l7484l2455n609L0303
11719f3200L5718J6884j1226k7309K691J6333J7042j9651l2564j1395j0832K1873
11707f5636N9866j0353L9251J1067n0299l5331L9024K4112O2721j8973l6094m1361
11695b2006p385l8756Q09L1674K0673r958K4893n602k6489j633K0067N497K9856
11682B1640K1126l2651K3593J5976J0095k7421n5494K963j4101n6871K5132P507
11670e8506L7207L0268O448J7453k2668l8894O866L639K0427K1818k6628l5551
11658c8121n68L5900L5991q355K2491K8994k5594Q000l9393j7231k0077r346n3911
11645h1220l3172m516L7389q046O4294M7801k4229l9956K8166k2456k4215J1891
$$ plain form
11732 -74271 -77285 -22507 -22899 11431 19668 -20820 -29342 4070 -17955 -55439 -87894 -93503 -63200
11719 -63200 -27482 -10598 -21824 -49133 -46442 -30109 -13067 -32718 -65282 -76677 -87509 -65636
11707 -65636 -5770 -16123 23128 34195 -16104 -51435 -12411 11701 74422 55449 19355 -22006
11695 -22006 -29391 -68147 -67338 -35664 -14991 -24949 -56 -5658 -32147 -33780 -13713 -8216 21640
11682 21640 42766 10115 33708 49684 59779 32358 -23136 -20173 -34274 -91145 -66013 -58506
11670 -58506 -21299 8969 15417 32870 10202 -28692 -21826 -18187 2240 24058 -2570 -38121
11658 -38121 -38689 -2789 33202 24847 47338 76332 50738 58738 19345 2114 -17963 -27309 -81220
11645 -81220 -114392 -118908 -81519 -89565 -25271 22530 -1699 -41655 -13489 -35945 -60160 -48269
11633d8269L8898O969o055l1043K6139j2925K6382K4184R068k9347k6535l2548
11621e5082j7509K3798J9216J3089k3024l6702k6519r249J8108N1920k3444n5105
11609a20503L985N7380J5920K1468j0717k2008K1890K7445M4404j0720k7648K054
11597B950k6544j3553O2103J5887j0931m0789j0946L4362j6947M102l1140k4150
11585e5596o813r890K4297J1769M0784J2625M223O243k888j042K47J9753J6709
11572F0421K0332m53r207k3033m1901o468J5619k3377l5427L8638l5493r216K2031
11559b7534k2735m3482J9280j4652K1682j916J0951J1547R255L9665K0403J821
11547B4285p3125n5491N5551O3607L916k8107n4270j9861M4443J1369l6993j0103
$$ plain form
11633 -48269 -9371 -2402 -8457 -39500 -13361 -26286 96 24280 33348 4001 -22534 -55082
11621 -55082 -72591 -48793 -29577 -16488 -39512 -76214 -102733 -111982 -93874 -41954 -65398 -120503
11609 -120503 -116518 -59138 -43218 -21750 -32467 -54475 -32585 -5140 39264 28544 896 2950
11597 2950 -23594 -37147 24956 40843 29912 -10877 -21823 12539 -4408 -306 -31446 -55596
11585 -55596 -62409 -72299 -48002 -36233 4551 17176 21399 27642 24754 23712 23959 43712 60421
11572 60421 80753 80300 71093 48060 6159 -309 15310 -8067 -43494 -4856 -40349 -49565 -27534
11559 -27534 -50269 -93751 -74471 -89123 -67441 -69357 -58406 -46859 -37604 2061 22464 24285
11547 24285 -48840 -104331 -48780 14827 18743 -9364 -63634 -83495 -39052 -27683 -64676 -74779
11535g4779L2466j236K0702K5933J3810k6679J4819j0606k1648J2408o5490N7750
11523b2550K0314k376J0748l7484l3595K9047N5506L9155j9411n2023j4943K8906
11511A294k5678K1147q064m4875k9600l9463L4737J0454j0368J5643M2953J4713
11499a7107j0053J428p53p452J765j994j9789k1265j3716M54J2354l332j4666
11486i4126J0665P8108P163l4059k042K139R348M1925J4914o2292k5505M1169
11474a2593L0562L3094m1782j9014l8318j8629L8790J258M219l2593j0802N2995
11462a2813K4708L6627J7368n6197o034l680p804L791O882j5881k2497k7535L051
11449f0014J5226k6886o956N350k8296J4520j1559K0853N8432j2115J0643K4269
$$ plain form
11535 -74779 -42313 -43549 -22847 3086 16896 -9783 5036 -5570 -27218 -14810 -80300 -22550
11523 -22550 -2236 -4612 6136 -31348 -64943 -35896 19610 58765 39354 -12669 -27612 1294
11511 1294 -24384 -3237 -11301 -56176 -85776 -125239 -90502 -80048 -90416 -74773 -31820 -17107
11499 -17107 -27160 -25732 -26485 -33937 -32172 -34166 -53955 -75220 -88936 -88482 -76128 -79460 -94126
11486 -94126 -83461 -5353 1810 -32249 -34291 -32152 -22804 19121 34035 -28257 -53762 -12593
11474 -12593 17969 51063 9281 -9733 -48051 -66680 -27890 -26632 -22413 -55006 -65808 -12813
11462 -12813 11895 48522 65890 9693 3659 -21 -7825 -4034 2848 -13033 -35530 -63065 -60014
11449 -60014 -44788 -71674 -78630 -73280 -101576 -87056 -98615 -77762 -19330 -31445 -20802 3467
11437C467K7735L2923l4454j9799j0957j1518n2096l663j117m3451K7321m337
11425h9946L8522m541k1414J8166N9027L2991k9078m7682J4575M836j0295K9402
11413e437L7578K9087o0556k0304P515J7055M368j071m1665L623J9558J4276j831
11400B196j6595n3134l6538J6370P2200J48p870M1194J6523n2110K7450k2801
11388a2967K2839O935l5528n664M8183n066n1791M4337k3374n0588l1223J5247
11376g8660r102J8162N5901k417K0940M5252o305O032j9538m0190P132J0144J7314
11363B4665K3457n9843J7446K0499m0834p146k4623j5405O464j3042k4669j4291
11351a07322L6531P7341J7267j4798l0311J5117j3540M783O355k5700L5029J9353
$$ plain form
11437 3467 31202 64125 29671 9872 -1085 -12603 -64699 -68362 -69479 -112930 -85609 -89946
11425 -89946 -51424 -55965 -77379 -59213 -186 32805 3727 -43955 -29380 -24544 -34839 -5437
11413 -5437 32141 61228 672 -19632 -12117 4938 9306 8235 -33430 -29807 -10249 4027 2196
11400 2196 -14399 -67533 -104071 -87701 -15501 -15353 -23223 17971 34494 -17616 9834 -12967
11388 -12967 9872 16807 -18721 -24385 23798 18732 -33059 11278 -12096 -62684 -93907 -78660
11376 -78660 -87762 -69600 -13699 -16116 4824 50076 43771 49803 30265 -9925 -2793 7351 24665
11363 24665 48122 -11721 5725 26224 -14610 -21756 -46379 -61784 -55320 -68362 -93031 -107322
11351 -107322 -70791 6550 23817 9019 -21292 -6175 -19715 -14932 -8577 -34277 752 20105
11339B0105m3133O260m2290l2675L5705P933L8196m3756k9647J8115K9632j7341
11327e2896L1284J8185j3778j1397k894J3607j8993j9221L1525J388j9963K581
11315d0572K1911L0117m6655k4527j9054N183r556L3342j3261j1434O656j3521
11303h1371j1710N1326M0416K7634k0581r702N205r895M4692L7444j4341j3350
11291D5767L504n2403j2842J3402M7719j287J4119R271J5941m5795l3126j3269
11279h999k8469j2097j2682N1480O8480j995J5476m3255l0359j4492r727o8246
11267i4885J2606M4490j5193k2006o488J009J4783K8405J6690j7491o0219L9327
11255e8972N0238L1042R611K6905K439k9083m7140J7212o077J7006j5691j6523
$$ plain form
11339 20105 -23028 -16768 -59058 -91733 -56028 -48095 -9899 -53655 -83302 -65187 -35555 -52896
11327 -52896 -21612 -3427 -17205 -28602 -31496 -17889 -36882 -56103 -24578 -23190 -43153 -40572
11315 -40572 -18661 11456 -35199 -59726 -78780 -73597 -83153 -49811 -63072 -74506 -67850 -81371
11303 -81371 -93081 -41755 -1339 26295 5714 -3988 1217 -8678 36014 73458 59117 45767
11291 45767 49271 -3132 -15974 -2572 45147 43860 57979 67250 83191 37396 4270 -8999
11279 -8999 -37468 -49565 -62247 -10767 57713 55718 71194 27939 -2420 -16912 -26639 -94885
11267 -94885 -82279 -37789 -52982 -74988 -81476 -80467 -65684 -37279 -20589 -38080 -98299 -58972
11255 -58972 -8734 22308 31919 58824 61263 32180 -14960 2252 -3825 13181 -2510 -19033
11243a9033J7221J9763k5292Q242j051n1161J0364O4505J823j4384J8828k9243
11231E82j6214N605K436j7887J1914Q717l4379J6616O929L7847l7389k1461j8169
11218e4853L21J2649O8468L6984k2040l7750k6186M9941L9428K190l6587L6835
11206F9400K788p0342k4891j100j3366j0384J1181M0878M3692K4801k4681n7634
11194i658l4478r379M5503p520J2089J8779M47P671M3953m1364o7093K1741J02
11181a9207L937Q7898M1722q0418q3760K5540Q2043k1862k7093k693q56r166l9377
11168d3292o9101J7937O7738L0826j4903q744J51J7482J1755j3669j8274m5024
11156f7118R26P6558L8305O591j3024k5424k5401j7182K7226l9119K0232L6109
$$ plain form
11243 -19033 -1812 17951 -7341 901 -150 -51311 -40947 23558 25381 10997 29825 582
11231 582 -15632 -10027 -7591 -25478 -13564 -4847 -39226 -22610 -15681 22166 -15223 -36684 -54853
11218 -54853 -54532 -41883 26585 63569 41529 3779 -22407 27534 66962 69152 32565 69400
11206 69400 72188 1846 -23045 -24145 -37511 -47895 -36714 4164 47856 72657 47976 -9658
11194 -9658 -44136 -53515 -8012 -15532 -3443 15336 15783 23454 67407 26043 -41050 -19309 -19207
11181 -19207 -15270 72628 114350 33932 -49828 -24288 57755 35893 8800 6107 5251 -3915 -43292
11168 -43292 -112393 -94456 -26718 4108 -10795 -19539 -19388 -1906 9849 -3820 -22094 -67118
11156 -67118 -66192 10366 48671 55262 42238 16814 -8587 -25769 1457 -37662 -17430 18679
11144A8679j3402m0705j4930J6587J2548K6626K939n2730K7897L4711j6338n9524
11132e7642j6444J9915l1898M3449K1779l744K2760K8688R85j1711l3886m8824
11120f6573j9867N326K9766N1615K0969J3204J1898r751j0324n880K7225r872
11108C7736n745J2292N2374M6322j5020o4344j05914k4332M2206L5099j66r61
11096I547O410P8331K1615n1444l6858L5380l5682k1756K9808O511j2429K2532
11084E1965M369k767j8617N3129j3260n117Q594n9382J2419J2054J080j7737j4375
11071A2355J3580J178k6718n9523M271J5305k0774J1492J5037N6507K3259l4797
11059A1172K449J1277k5308m1460j6209o082J6696K2394l1612j4259K0124P2259
$$ plain form
11144 18679 5277 -35428 -50358 -33771 -21223 5403 8342 -44388 -16491 18220 1882 -57642
11132 -57642 -74086 -54171 -86069 -42620 -20841 -24585 -1825 26863 27848 16137 -17749 -66573
11120 -66573 -86440 -81114 -51348 267 21236 34440 46338 36587 26263 20383 47608 37736
11108 37736 31991 44283 96657 142979 127959 63615 -42299 -66631 -24425 10674 10508 9547
11096 9547 15957 94288 115903 64459 27601 62981 27299 5543 35351 41862 29433 51965
11084 51965 56334 53567 34950 88079 74819 69702 78296 18914 31333 43387 44467 26730 12355
11071 12355 25935 27113 395 -59128 -54857 -39552 -60326 -48834 -33797 22710 45969 11172
11059 11172 13621 24898 -410 -41870 -58079 -64161 -47465 -25071 -56683 -70942 -50818 21441
11047B1441L7660K6049O558O45m2265l2599l5381O204N566k2473L299L5532J149
11034A1385r153Q314p8419l8745L6190J4782K0690P953L0941K9276J6270R226
11022E8710P598k6976k7229p44L14m326Q362j5640q100Q242j5196o014J1861l5035
11008d4173l3330L2946j235J2987O6815k6004j5879l0505L2685P59j1320M2237
10996B5983L1520q90l3293Q15J1876j8802K2681l903l0763k388J4088K7694N033
10983D9651L012J2756j3228n683l2566J001J3L9276m335N57k383M061O49K2121
10969G4902k1319n2658k1513M429L2354K0171j7884J458l6207l172J6656j4369
10957a7152M4464K2608l5338n1977J6908K8242k956j0762J8797J1998l0487r684
$$ plain form
11047 21441 59101 85150 91708 92353 50088 17489 -17892 -11688 -6122 -28595 -25296 10236 11385
11034 11385 2232 10546 -67873 -106618 -70428 -55646 -34956 -27003 3938 33214 49484 58710
11022 58710 66308 39332 12103 11359 11673 7347 15709 69 -8031 211 -14985 -20999 -9138 -44173
11008 -44173 -77503 -44557 -45792 -32805 34010 8006 -7873 -38378 -5693 -4934 -16254 25983
10996 25983 57503 56613 23320 24135 36011 17209 39890 35987 5224 2836 16924 44618 49651
10983 49651 52663 65419 52191 46508 13942 14943 14956 54232 49897 50454 48071 52132 52781 74902
10969 74902 53583 925 -20588 -16159 16195 36366 18482 19940 -16267 -19439 -2783 -17152
10957 -17152 27312 49920 14582 -37395 -20487 7755 4799 -5963 12834 24832 -5655 -15339
10945a5339m3166R612K3104N1950J2104k632k4573k3730m4306M9416K8584Q78
10933B1902p8333j1795O0032m956k6608M0365q276j0665L5793O759k5236J4506
10921A3488L1141L0430j9790j9640L2668J0154j4537l6472r0678k1094N0602N721
10909b8007Q713K5943j0062j3209J3701k9631l1835j4026m717J7506J6403J2420
10897c6801m2349l0954J0000M5788J6938M5333L5568n934N5716M1703p7053k9974
10885B7981k1126l3792K215j2499j2989o184L4714K4349j7780J596K7526p750
10873F261L413R902O988K1168K6959J6678o3896o4350r156j3118j5334K315M3977
10860b8193Q1974k613j2775m4414k258Q245k2387j908j3971k8392J0L0060M4853
$$ plain form
10945 -15339 -58505 -48893 -25789 26161 38265 35633 11060 -12670 -56976 -7560 21024 21902
10933 21902 -56431 -68226 -8194 -13150 -39758 607 -7669 -18334 17459 24218 -1018 13488
10921 13488 44629 75059 55269 35629 68297 78451 63914 27442 -63236 -84330 -33728 -28007
10909 -28007 -19294 6649 -3413 -16622 -2921 -32552 -64387 -78413 -83130 -65624 -49221 -36801
10897 -36801 -79150 -110104 -100104 -54316 -37378 7955 43523 37589 93305 135008 57955 27981
10885 27981 6855 -26937 -24722 -37221 -50210 -56394 -21680 2669 -15111 -13515 14011 6261
10873 6261 9674 19576 26564 47732 74691 91369 27473 -36877 -46033 -59151 -74485 -72170 -28193
10860 -28193 53781 51168 38393 -6021 -8279 -34 -22421 -24329 -38300 -66692 -66682 -36622 8231
10847H231M6706l9781m95L7084m9121m7650p750K9000m375L5183J8995N699P222
10834C8948k4594N723J4042K908L28l5299N590N5752k4027o0697m8699k1737m281
10821i6043N3729N5886j5573j2963j7640J7609k0426K429N5976R252L9286O410
10809G7932m2756J5946j4052J5315p4388m9037N6912P2644o797k5657j0489J4444
10797C0017O319J787K284l4115p3272K561O761K3736k509k8258k953L4887l511
10784c6266j0798J4235M0140J5356M0107Q524J9365q47m7643k1885l903J3150
10772B9535j4310L1796K9954p723L9375K087r5798l4424L9243o548N629l1860
10760a3044J4125M007k7529m3340j7040K3732l4922N4587J5861j736R893K3569
$$ plain form
10847 8231 54937 15156 14661 51745 2624 -45026 -52776 -23776 -28151 7032 26027 31726 38948
10834 38948 14354 20077 34119 37027 37355 2056 7646 63398 39371 -21326 -70025 -91762 -96043
10821 -96043 -42314 13572 -2001 -14964 -32604 -14995 -35421 -32992 22984 32236 71522 77932
10809 77932 35176 51122 37070 52385 -22003 -71040 -14128 58516 51719 26062 15573 30017
10797 30017 36336 38123 40407 6292 -66980 -64419 -57658 -33922 -36431 -64689 -67642 -32755 -36266
10784 -36266 -47064 -32829 7311 22667 62774 71298 90663 89816 42173 20288 16385 29535
10772 29535 15225 47021 76975 69252 108627 110714 14916 -19508 19735 13187 18816 -13044
10760 -13044 1081 5088 -22441 -65781 -82821 -59089 -94011 -39424 -23563 -25299 -15406 8163
10748H163O319o5797L0231K019J2960N7923j2644o7899k4303N4389L1620J0908
10736D3889o134j0825n6165j2780M1289l111l4503m1846J2225N9120M2977k3078
10724A1058k6079q802k559j3428K9011K3915M3994k3969p3905m0091J6346J0113
10712e4396K8303J3514J4865j5667j5498L781j7445m4858M519J2358Q4194L8069
10700E1739o3616n9123J3160K5439M7485K0981J0067j2575o5855m2343j1119J0849
10688g4911J3058K6736L876J1494Q635r058J8155j4561P690M2729J4649k1670
10676B6822N551k9109o384r051j0679m4523k8903j6827O9508j543L5033K6397
10664A6292L6693K3586m3289J9834L8689m7571o1455j6598J5919J5732k104k6986
$$ plain form
10748 8163 14482 -51315 -21084 -19065 -6105 51818 39174 -28725 -53028 1361 32981 43889
10736 43889 37755 26930 -29235 -42015 -726 -3837 -38340 -80186 -67961 -8841 34136 11058
10724 11058 -15021 -23823 -26382 -39810 -10799 13116 57110 33141 -40764 -80855 -64509 -54396
10712 -54396 -26093 -12579 2286 -13381 -28879 -25098 -42543 -87401 -82882 -70524 13670 51739
10700 51739 -11877 -71000 -57840 -32401 15084 36065 46132 33557 -32298 -74641 -85760 -74911
10688 -74911 -61853 -35117 -31241 -19747 -11112 -20170 -2015 -16576 -8886 33843 48492 26822
10676 26822 32373 3264 -3120 -12171 -22850 -67373 -96276 -113103 -43595 -45138 -10105 16292
10664 16292 52985 76571 33282 53116 91805 44234 -17221 -33819 -17900 -2168 -4272 -31258
10652c1258j138K763K8972l0489j5768J892Q256M2384q52o6799N142j2998k9152
10639i9045P668N3017L3081k4920L4991P132k8295n3095P249k7778K6238L5651
10627b8106K7212n956n491j7179L3190L3460K0995J2001r920L287k5521k7775
10615A0197l9734P2722P1183k5064n9320k1190j4831K1256N9113l670j4710J7097
10603G3049K5211l0254o9945k0709J5208J725l0776q341O55N3210J5122J6965
10591D1120n1337k312M3195O2437K5732j6475m4707J50M8944k6137K7190l041
10579A04759j8450m0014j1804L4492p1360j2213L6934J1835J2844L634p302N0780
10567I4135k3173j1099K5527k3217j8913J3023J05l3768k3749K3551J4692N3414
$$ plain form
10652 -31258 -32396 -29633 -661 -31150 -46918 -45026 -36770 5614 4762 -62037 -56895 -69893 -99045
10639 -99045 -91377 -38360 -5279 -30199 4792 11924 -16371 -69466 -62217 -89995 -63757 -28106
10627 -28106 -894 -6850 -12341 -29520 3670 37130 58125 70126 60206 63493 37972 10197
10615 10197 -29537 43185 114368 89304 29984 8794 -6037 15219 74332 70662 55952 73049
10603 73049 98260 68006 -1939 -22648 -7440 -5715 -36491 -44832 -44177 9033 24155 41120
10591 41120 -10217 -12529 30666 93103 118835 102360 57653 57803 106747 80610 107800 104759
10579 104759 86309 46295 34491 68983 -2377 -14590 22344 34179 47023 50657 43355 94135
10567 94135 70962 59863 85390 62173 43260 56283 56388 22620 -1129 22422 37114 90528
10555I0528q321j6170J0996K1947k8374n2940K7998M2236J9983j7517K4100K119
10543A16585j9374j8173k6528M3317K1234j8228k2941J3478O395k9594K668j6902
10531E1937k181l833r667J200K6311M4928n0551k5839r23q542j7574j4012K3143
10518A4397L6142j177J6628m444k5560O648P639R663k7942l3250K5353K3941n242
10505D2796K7621k0207p6872J7253P2842Q0825K8404l3730k6325k8943J4235J3509
10493A11408J0748j9724p462j8113j9474K304k222k0826J1177o960N900N7080
10481A03836j9569j0937N1637L8010l8998j9415j0646J2590l6905K2886Q2310
10470A74799J0973k5452R399K7296j4096m1411Q244j4345j4666K4665N3328L1863
$$ plain form
10555 90528 82207 66037 77033 98980 70606 17666 45664 87900 107883 90366 114466 116585
10543 116585 97211 79038 52510 95827 117061 98833 75892 89370 95765 66171 68839 51937
10531 51937 49756 45923 36256 37456 63767 108695 58144 32305 31382 22840 5266 -8746 14397
10518 14397 50539 49362 65990 61546 35986 42634 50273 59936 31994 -1256 24097 48038 42796
10505 42796 70417 50210 -26662 -9409 63433 144258 172662 138932 112607 83664 97899 111408
10493 111408 122156 102432 94970 76857 57383 59687 57465 36639 47816 40856 46756 103836
10481 103836 84267 73330 124967 162977 123979 104564 93918 106508 69603 92489 174799
10470 174799 185772 160320 169719 197015 182919 141508 149752 135407 120741 145406 198734 230597
10458B30597j7150L6419o563K9532K0072Q809K7464o559n3692j8456K0455O044
10446B76972K5350j8439M366j7426k1998J3545M7347K6511Q370K2899l2756k7562
10434C07179K9749O0039M1243j3642k4105J8091J6460J944k3268m828O311K9440
10422D44613L8120k9507k7574K4073M4932k387N3089N1452K1547K0554l528N3455
10410F88839K8910l155M3468K571M2854M6433M0580P3006p382J7511O9223O3300
10398A106158P1718P6035O7935O4572J02026O0776J06649J39057J39931J47848
10388B082705J68232K02040K10553K03608K42233K51902L51383M57167N05591
10379D675414N88986O52805Q56553J019486J261901J522224J841908K230939K653273
$$ plain form
10458 230597 213447 249866 243303 272835 292907 301716 329180 322621 268929 250473 270928 276972
10446 276972 302322 283883 288249 270823 248825 262370 309717 336228 344598 367497 334741 307179
10434 307179 336928 396967 438210 424568 400463 418554 435014 436958 413690 408862 415173 444613
10422 444613 482733 453226 425652 449725 494657 492270 545359 596811 618358 638912 635384 688839
10410 688839 717749 714594 758062 760633 803487 849920 890500 963506 956124 973635 1042858 1106158
10398 1106158 1177876 1253911 1321846 1386418 1488444 1549220 1655869 1794926 1934857 2082705
10388 2082705 2250937 2452977 2663530 2867138 3109371 3361273 3712656 4169823 4675414
10379 4675414 5264400 5917205 6773758 7793244 9055145 10577369 12419277 14650216 17303489
10370A7303489L187866L593467L836509L643840L052618J949731M63985j004616
10362C6026889k129151k791784k965276k817384k451061k047572j627376j272215
10354A7925070j065273q29428o22041m71542m28358k68787p5952p066Q4446K51432
10344A4492501M01483N15681O98225R69339J158263J532023J975093K481152L179960
10335B7403720L951180N004247O109103P231646Q103665Q140542P014198M597007
10327G7555308J254722k400584n599053p553746q007305p173704o021206m802216
10319C7252216l786412l074783k422626j986938j698540j396322j093716r16920
10311B0875959q43746p36865n41750m01687l42364l11453j49400k219L4684K24069
$$ plain form
10370 17303489 20491355 24084822 27921331 31565171 34617789 36567520 37031505 36026889
10362 36026889 33897738 31105954 28140678 25323294 22872233 20824661 19197285 17925070
10354 17925070 16859797 16030369 15408328 14936786 14508428 14239641 14163689 14156623 14241069 14492501
10344 14492501 14893984 15409665 16107890 17077229 18235492 19767515 21742608 24223760 27403720
10335 27403720 31354900 36359147 42468250 49699896 57803561 65944103 72958301 77555308
10327 77555308 78810030 76409446 70810393 63256647 55249342 48075638 42054432 37252216
10319 37252216 33465804 30391021 27968395 25981457 24282917 22886595 21792879 20875959
10311 20875959 20032213 19295348 18753598 18351911 18009547 17698094 17548694 17546475 17581159 17805228
10301A7805228M39229O46960Q70736J185760J523973J901017K253294K591848
10293B9218045K722327K596412K016132J067116j31398j384575k398803l024257
10285C0680999l205009l004523k695860k273501j890862j452727j226014j065542
10277A3866961r07025q17138p12182o55788n48644m74699m53876m13927l99246
10268H484436l90758l68759k73301l05312l77211k65485k02286k03930k26294
10259E871100k72025k33769j94510j54993j35025j44945j71727j80666j36099
10250D247341j46269j12412n0659j12129j46171j27826o1886j25665j21266r8277
10240C144781l1672p5011j45468j10218n4206p9579r0268q9657j19282j06926
$$ plain form
10301 17805228 18244457 18891417 19762153 20947913 22471886 24372903 26626197 29218045
10293 29218045 31940372 34536784 36552916 37620032 37488634 36104059 33705256 30680999
10285 30680999 27475990 24471467 21775607 19502106 17611244 16158517 14932503 13866961
10277 13866961 12959936 12142798 11430616 10774828 10226184 9751485 9297609 8883682 8484436
10268 8484436 8093678 7724919 7451618 7146306 6769095 6503610 6301324 6097394 5871100
10259 5871100 5599075 5365306 5170796 5015803 4880778 4735833 4564106 4383440 4247341
10250 4247341 4101072 3988660 3938001 3825872 3679701 3551875 3489989 3364324 3243058 3144781
10240 3144781 3113109 3038098 2892630 2782412 2728206 2648627 2558359 2468702 2349420 2242494
10230B242494m8547m7757m8115l8306n8533N603l136l1005r2801q1494p9932m2227
10218A676244K782O363J1886J9553n0706o8806L100j0472n2002l3261l9647n5922
10206A409112j02791o8463k8513l4003l0857R505k8236n2522L6561k7139p9601
10195A003053q7815m9811j9680k5663l9707j3124Q450j9107j5007l7075l6021
10184F68493J5739L4741q392J097J8341j7198j089k3073k0934j6650l0580K793
10172F23288n914k5568m536j4301K5524j900J5658J0270L2472O744l9479Q338
10160F30596R6321J51732J36816J65823Q0883m3122j21316j18596j29760j45273
10150G04104j18056q0158k0250n8845m2702m264J2855K1671K3234J7543J1806
$$ plain form
10230 2242494 2193947 2146190 2098075 2059769 2001236 2006839 2003703 1972698 1879897 1798403 1718471 1676244
10218 1676244 1679026 1685389 1697275 1716828 1666122 1597316 1600416 1589944 1537942 1504681 1465034 1409112
10206 1409112 1306321 1237858 1209345 1175342 1144485 1153990 1125754 1073232 1109793 1082654 1003053
10195 1003053 915238 865427 845747 820084 780377 767253 775703 756596 741589 704514 668493
10184 668493 684232 718973 710581 711678 730019 712821 711732 688659 667725 651075 620495 623288
10172 623288 617374 591806 587270 572969 598493 596593 612251 622521 654993 661737 622258 630596
10160 630596 726917 878649 1015465 1181288 1262171 1219049 1097733 979137 849377 704104
10150 704104 586048 505890 485640 426795 384093 379829 392684 414355 437589 455132 466938
10139D66938J3024r568n3778J2958p638K8539N813k5857l9322k2052m4799l4555
10127B89703j0386K3339m319K6236K5868O372k7702p2932Q71M4725M4293K713
10115C48781O866p0519p8889r192K2725M332l2999j2229M1965j0692q544k663
10103A98942N6450N573k6217J3793j3832k0424o200L9511J2333k6482l0989l475
10091A98983J6384L3741l7692j1983L4036j1950p491M13J3575p891n665j3765
10079B00695L6131K5124J2186j5000n1804j6513k0502R409k6989J6251L9769L1320
10067B40077L3807O7811k7424k0594J1265K255j4545N971Q533j5652L0946j4445
10055C08005j1246N573O8354O7092M2470k748K7980Q0988P6046P7212J91424K68403
$$ plain form
10139 466938 479962 470394 416616 429574 421936 450475 456288 430431 391109 369057 324258 289703
10127 289703 279317 302656 298337 324573 350441 356813 329111 256179 257050 301775 346068 348781
10115 348781 355647 285128 206239 197047 219772 224104 191105 178876 220841 210149 201605 198942
10103 198942 255392 260965 234748 248541 234709 214285 208085 247596 259929 233447 202458 198983
10091 198983 215367 249108 211416 199433 233469 221519 214028 214441 228016 220125 214460 200695
10079 200695 236826 261950 274136 259136 207332 190819 170317 179726 152737 168988 208757 240077
10067 240077 273884 341695 314271 293677 304942 307197 292652 298623 307156 291504 322450 308005
10055 308005 296759 302332 370686 437778 480248 477500 505480 586468 662514 739726 931150 1199553
10043A199553M21040Q41071J567675K272708J840104P42222L08571j084042k779371
10034E329531j999524j032585m80510l00807j95778j34072r4830m6466l7981r1283
10024I15695m4442m8813l2184j6896o762k6798k6513n5810r0438p736l3469l0127
10012D95707j757m5382m2749Q602K7429k2197J080p4057j3726N5554m2326J845
10000C48023K2332n8705k4458J4211J168k2639m2282l8011j4695J260J9463O782
9988B12449L8861L3958L365o8163l8002K0451O7476J0682o3581L8444M5252L689
9976C04881j1458k0466m039j6592j2216r474k6845n0379j5693L3438r824K2122
9964A83455k0614k8923L786q216j3108O641O935n188M093M083P087m166J2066
$$ plain form
10043 1199553 1620593 2461664 4029339 6302047 8142151 8884373 9192944 8108902 5329531
10034 5329531 3330007 2297422 1816912 1516105 1320327 1186255 1091425 1044959 1006978 915695
10024 915695 871253 822440 790256 773360 766598 739800 713287 657477 567039 559303 525834 495707
10012 495707 493950 448568 405819 414421 441850 419653 420733 346676 332950 388504 346178 348023
10000 348023 370355 311650 287192 301403 302571 279932 237650 199639 184944 186204 205667 212449
9988 212449 251310 285268 288633 220470 182468 202919 270395 281077 217496 255940 301192 304881
9976 304881 293423 272957 268918 252326 240110 230636 203791 153412 137719 171157 161333 183455
9964 183455 162841 133918 137704 129488 116380 123021 129956 124768 128861 132944 140031 135865 147931
9951A47931M485l0937q4456P95o783j1840k53M5584L7789N725k1532K5818K5775
9938A38101r482j1898J663n3076K2054M0419J4207k161l1757K5905J9842l759
9926A50058J2277j9296k1570P62L624K3249m4894L491J5541n063l6124k7004K3712
9913G8763j557L4401M1446L0534m9016q390M5424L8189n149k2931p169L364k4170
9900A53739r658M4742k8885n2357k5001k8949L6137M1586J685m6180k8878K5083
9888H3064L0454J1705K3754j1533l1978J0369m5401m7486K1880Q0467M200k0629
9876A08866l7545k2017k520L4801K9275j6276J218M8136O420p223j0280q0296
9864E2559j2991r691L4394J5058L1134N3712m851j13J368K3346M9821O3349N9216
$$ plain form
9951 147931 152416 121479 37023 37818 31035 19195 18942 64526 102315 108040 86508 112326 138101
9938 138101 128619 116721 118384 65308 87362 127781 141988 139827 108070 133975 153817 150058
9926 150058 162335 143039 121469 122231 125855 149104 104210 107701 123242 118179 82055 55051 78763
9913 78763 77206 111607 153053 183587 134571 126181 171605 209794 204645 181714 174545 177909 153739
9900 153739 144081 188823 159938 107581 82580 53631 89768 131354 133039 86859 57981 83064
9888 83064 113518 125223 148977 137444 105466 115835 70434 22948 44828 125295 129495 108866
9876 108866 71321 49304 46784 81585 110860 94584 95802 143938 150358 143135 132855 52559
9864 52559 39568 29877 64271 79329 110463 164175 159324 159211 160579 183925 233746 297095 356311
9851C56311J28167O3032J30579K18130K86109K70292K48243K46842M04750O12052
9841B964507P32425O60920L63436j47531o86729j014297r03486n70799l05444
9832A093002j55937q9365p9599o5496o6289m8699k5885m5085j1694j8046j2310
9821D74597k9965l4095J1369j9057l7995j0184m1138r33j0595L151l4183l6722
9809B34250j4016k074L7724R479j5990O398j9902k9799k125J1952R335L065L6027
9796B64324j034j119j3042l166j2405Q626K5882m4348m6692n3288l6031q84J7238
9783A04061N2580J4334K3243n6968p9666m119O343J2169m266n6035n199L5760
9771D2237L6411R342l9260j3676L5465M7904m347j9762l8204M90L3865q975j3832
$$ plain form
9851 356311 484478 547510 678089 896219 1182328 1452620 1700863 1947705 2352455 2964507
9841 2964507 3696932 4357852 4721288 4573757 3887028 2872731 1969245 1398446 1093002
9832 1093002 937065 847700 768101 702605 636316 587617 561732 516647 504953 486907 474597
9821 474597 444632 410537 421906 402849 364854 354670 313532 312599 302004 305155 270972 234250
9809 234250 220234 218160 255884 265363 249373 255771 235869 206070 203945 215897 225232 228297 264324
9796 264324 263290 262171 249129 245963 233558 242184 268066 223718 177026 123738 87707 86823 104061
9783 104061 156641 170975 194218 137250 57584 53465 59808 71977 67711 11676 6477 42237
9771 42237 78648 87990 48730 35054 70519 118423 114076 94314 56110 56600 90465 81490 67658
9758F7658J8740J1969K1006K501k0463j1922l7362l0277R414J2595q358q552J778
9745B8727k6466J4415M3713J8939n8196j1764J0668l5680p41M0585p329k944L3891
9732D7818K0291l1876j9125N4996O4685l0499k9877l1326k3311k0161M2513L6048
9720H0176O972p864L806l8329l3705J7171J6382J1778j0857j9066R007J8520N6292
9707A10283L0741L6748L0044J4399r0067p4168o604m7755m2964M623Q109r0L3045
9694F344N5554N1129l6150N227K0485k7165o78k9111n928l9044n4351M6058J6863
9681I233q68M2464k2136J254l5239j957Q935o891j8730k991k7979L417O3817J5722
9667B8051P311o775m4884l0587j5603M8281N5851Q49J9681n1834l7382Q20K9888
$$ plain form
9758 67658 86398 98367 119373 121874 101411 89489 52127 21850 31264 43859 35501 26949 28727
9745 28727 2261 16676 60389 79328 21132 9368 20036 -15644 -16385 24200 16871 13927 47818
9732 47818 68109 36233 17108 72104 136789 106290 76413 45087 21776 1615 44128 80176
9720 80176 87148 79284 83090 44761 11056 28227 44609 56387 45530 26464 35471 53991 110283
9707 110283 141024 177772 207816 222215 132148 57980 51376 3621 -39343 -34720 -26611 -26701 6344
9694 6344 61898 113027 76877 82104 102589 75424 74746 45635 39707 663 -53688 -7630 9233
9681 9233 8365 50829 28693 29947 -5292 -7249 1686 -5205 -23935 -26926 -54905 -51488 12329 28051
9667 28051 35362 28587 -16297 -46884 -62487 -14206 41645 42494 62175 10341 -27041 -26221 3667
9654C667P0096j2561n3440m4J5661M074m2348K1597N3797j8957l0021l2088k029
9641b2596k5069K7327l646j816N867J5360L5756J6120j8868j5541j5868J149K0406
9628A8581j9662K2650k4662k3587k445M365K8574k9900K6381J9771J7984K5025
9616F3075o047M4361q870j2509l0840L784j1140m3911M453K1373j8501J0313P0013
9603H5554o271n6269J5053o764j8778P26K9815R816K6584J5389j5758j4342q553
9590E6202m5843l9836m060J2996M2626J8630m7786n9478K7401L6721J1865m54
9578H984K796K5327K5124k0240k627J1164J7158j1482o8739P972N9104K5630l8908
9565D1263k7725N0855K010j0771K1398L9165n250R489J7073l9543j7655q406J4742
$$ plain form
9654 3667 73763 61202 7762 7718 23379 27453 -14895 6702 60499 41542 11521 -20567 -22596
9641 -22596 -47665 -20338 -23984 -25800 -19933 -4573 31183 47303 28435 12894 -2974 -1825 18581
9628 18581 -1081 21569 -3093 -26680 -29125 -24760 3814 -26086 295 20066 38050 63075
9616 63075 57028 101389 92519 80010 49170 52954 41814 -2097 2356 23729 5228 15541 85554
9603 85554 79283 23014 38067 31303 12525 13251 43066 52882 79466 94855 79097 64755 56202
9590 56202 10359 -29477 -33537 -20541 22085 40715 -7071 -66549 -39148 -2427 9438 8984
9578 8984 11780 37107 62231 41991 39364 50528 67686 56204 -12535 -4563 54541 80171 41263
9565 41263 13538 64393 66403 55632 77030 116195 110945 120434 137507 97964 80309 71903 86645
9552H6645k9936J6176M4540M132k6268R689L9817l4464m9498o2783p037K4443
9540A5456J4166K1733Q495P005k2392L8115L0835k5798q280J8208P196O074L0487
9527A41300J5071R424k6870l6049k8548M7391M2384O161r168Q05j4422M650p400
9514A44729K3189j311R676L1649J0578J7734N1772N0491N9164l234k0341M6605
9502D20701J10338Q7735K3044Q5142L7191O1805R1514J63395J38418J37164K58247
9491A614694K90875L72911M66450O21987Q00311J038159J255882J450499J500047
9482I411815J289890Q08362J75746o02219j166481j487200j377151j113361r21757
9473E017644p15513n00691m18116l39603k86251k37094j80376j65060r1564p9693
$$ plain form
9552 86645 56709 72885 117425 121557 95289 104978 144795 110331 60833 -1950 -8987 15456
9540 15456 29622 51355 59850 66855 44463 82578 113413 87615 79335 97543 104739 110813 141300
9527 141300 156371 165795 138925 102876 74328 121719 164103 170264 161096 161901 147479 152129 144729
9514 144729 167918 166607 176283 207932 218510 236244 288016 338507 397671 394437 374096 420701
9502 420701 531039 618774 641818 726960 764151 825956 917470 1080865 1219283 1356447 1614694
9491 1614694 1905569 2278480 2744930 3366917 4167228 5205387 6461269 7911768 9411815
9482 9411815 10701705 11510067 11685813 11083594 9917113 8429913 7052762 5939401 5017644
9473 5017644 4302131 3801440 3383324 3043721 2757470 2520376 2340000 2174940 2083376 2003683
9463B003683j45249j73135j11386k9156R621r1575p6359p5137r4894l8803p1880
9452A105730j2821m6056j09343p3211k8394J4163k7047k6739p3445p0681k0523
9441F31633L4811O0673k4127p9513n5016k7452q046l698J4209j4202J6044O033
9429E51349J4938R869k5522o4407m6886n746J7524O692M7342n8495p1165L4244
9417D09737o397m3392m7288j6966L3721P670k960K9270j9471m7408J600l2944
9405B65172o108n443j5096k6230N2213k3710K5837L1585m5541q3193L417L1157
9393B04060J0677O748K0204J9298l1167J1434l1796l5357N1661J0334m7028j06543
9381H2525K949m891J1462J7072L622J1009l1940j4824M7235K944L1084N5090J3358
$$ plain form
9463 2003683 1858434 1685299 1573913 1544757 1554378 1462803 1386444 1311307 1216413 1177610 1105730
9452 1105730 1092909 1046853 937510 864299 835905 850068 823021 796282 722837 652156 631633
9441 631633 666444 727117 702990 623477 568461 541009 532963 529265 543474 529272 545316 551349
9429 551349 566287 576156 550634 486227 439341 433595 451119 457811 505153 446658 375493 409737
9417 409737 403340 359948 312660 295694 329415 337085 334125 363395 343924 296516 298116 265172
9405 265172 259064 253621 238525 212295 264508 240798 266635 298220 252679 169486 172903 204060
9393 204060 214737 221485 241689 260987 229820 241254 209458 174101 225762 236096 189068 82525
9381 82525 85474 80583 92045 109117 112739 123748 91808 76984 124219 127163 158247 213337 226695
9368B26695l3677j0789L0156K6414j6075n8190j3047n8609j7324L677N836o102
9356G8965k9345o772r912L6874M1982P797k1554k3361q635J1618J3640M3423J5036
9343A49756j8177K5060n8317LK3072l553Q352o8181o651L1149P751q525K680j6105
$$ plain form
9368 226695 193018 182229 212385 238799 222724 164534 151487 92878 75554 79231 85067 78965
9356 78965 49620 42848 32936 69810 111792 119589 98035 74674 66039 77657 91297 134720 149756
9343 149756 131579 156639 98322 98325 121397 117844 126196 58015 51364 82513 90264 81739 84419 68314
$$ [...]
##END NTUPLES=NMR SPECTRUM
##END=
