##TITLE=Analysis number 318957
Compound Code cc 56011
Book Reference 438/120
Project Code adrs
Chemist Name antons
##JCAMPDX= 6.0         $$ Bruker NMR JCAMP-DX V2.0
##DATA TYPE= NMR SPECTRUM
##DATA CLASS= NTUPLES
##ORIGIN= Bruker BioSpin GmbH
##OWNER= nmr
$$ XWIN-NMR		Version 3.5
$$ Tue Apr 25 16:38:42 2006 GMT Daylight Time (UT+1h)  MAYBRIDGE\nmr@NMR_250MHZ
##.OBSERVE FREQUENCY= 250.131544655141
##.OBSERVE NUCLEUS= ^1H
##.ACQUISITION MODE= SIMULTANEOUS (DQD)
##.ACQUISITION SCHEME= undefined
##.AVERAGES= 16
##.DIGITISER RES= 18
##SPECTROMETER/DATA SYSTEM= dpx250
##.PULSE SEQUENCE= zg30
##.SOLVENT NAME= CDCl3
##.SHIFT REFERENCE= (INTERNAL, CDCl3, 0, 16.522)
##AUDIT TRAIL= $$ (NUMBER, WHEN, WHO, WHERE, WHAT)
$$ ##TITLE= Audit trail, XWIN-NMR		Version 3.5
$$ ##JCAMPDX= 5.01
$$ ##ORIGIN= Bruker BioSpin GmbH
$$ ##OWNER= nmr
$$ C:\u/data/dgb/nmr/ADRS/3130/pdata/1/auditp.txt
$$ ##AUDIT TRAIL=  $$ (NUMBER, WHEN, WHO, WHERE, WHAT)
(   1,<2006-04-25 16:38:11.84 +100>,<MAYBRIDGE\nmr>,<NMR_250MHZ>,
      <created by zg, POWCHK disabled, PULCHK disabled
       configuration hash MD5:
       84 BC 41 DB A1 6E 1D 46 DA 25 12 A5 C1 ED C5 3A
       data hash MD5: 64K
       41 C0 0E 5B 2F DC 96 70 85 5E 3A E6 88 D2 62 B3>)
(   2,<2006-04-25 16:38:29.78 +100>,<MAYBRIDGE\nmr>,<NMR_250MHZ>,
      <Start of raw data processing
       ef LB = 0.3 FT_mod = 6 PKNL = 1 SI = 32K 
       data hash MD5: 32K
       48 02 33 23 51 D3 96 78 BC 03 7C 8B 63 39 C7 86>)
(   3,<2006-04-25 16:38:31.47 +100>,<MAYBRIDGE\nmr>,<NMR_250MHZ>,
      <apk 
       data hash MD5: 32K
       DA C6 7C E8 64 BC 64 C2 C7 03 5A A1 64 36 28 5A>)
(   4,<2006-04-25 16:38:32.34 +100>,<MAYBRIDGE\nmr>,<NMR_250MHZ>,
      <abs ABSG = 5 
       data hash MD5: 32K
       D7 40 14 BE C1 94 80 06 BC 73 B4 C7 13 14 C4 63>)
$$ ##END=
$$ 
$$ hash MD5
$$ F0 23 58 D2 0D 2F DB 6F AA 4B 6A 76 47 AE F9 30
##$RELAX= 
##$RELAX= 
##$RELAX= 
##$RELAX= 
##$RELAX= 
##$RELAX= 
##$RELAX= 
$$ Bruker specific parameters
$$ --------------------------
##$DU= <C:\u>
##$EXPNO= 3130
##$NAME= <ADRS>
##$PROCNO= 1
##$TYPE= <nmr>
##$USER= <dgb>
##$AMP= (0..31)
100 100 100 100 100 100 100 100 100 100 100 100 100 100 100 100 100 100 
100 100 100 100 100 100 100 100 100 100 100 100 100 100 
##$AQSEQ= 0
##$AQ_mod= 3
##$AUNM= <au_zg>
##$AUTOPOS= <1 >
##$BF1= 250.13
##$BF2= 250.13
##$BF3= 250.13
##$BF4= 250.13
##$BF5= 500.13
##$BF6= 500.13
##$BF7= 500.13
##$BF8= 500.13
##$BYTORDA= 1
##$CFDGTYP= 0
##$CFRGTYP= 5
##$CHEMSTR= <none>
##$CNST= (0..31)
1 1 145 1 1 1 1 1 1 1 1 1 1 1 1 1 1 1 1 1 1 1 1 1 1 1 1 1 1 1 1 1 
##$CPDPRG= <>
##$CPDPRG1= <>
##$CPDPRG2= <>
##$CPDPRG3= <>
##$CPDPRG4= <mlev>
##$CPDPRG5= <mlev>
##$CPDPRG6= <mlev>
##$CPDPRG7= <mlev>
##$CPDPRG8= <mlev>
##$CPDPRGB= <>
##$CPDPRGT= <>
##$D= (0..31)
0 1 0 0 0 0 0 0 0 0.06 0 0 0 0 0 0 0.0002 0 0 0 0 0 0 0 0 0 0 0 0 0 0 
0 
##$DATE= 1145979490
##$DBL= (0..7)
120 120 120 120 120 120 120 120 
##$DBP= (0..7)
150 150 150 150 150 150 150 150 
##$DBP07= 0
##$DBPNAM0= <>
##$DBPNAM1= <>
$$ [...]
##$SUBNAM7= <"">
##$SUBNAM8= <"">
##$SUBNAM9= <"">
##$SW= 20.6930455092707
##$SWIBOX= (0..15)
0 0 3 0 0 0 0 0 0 0 0 0 0 0 0 0 
##$SW_h= 5175.983436853
##$TD= 65536
##$TD0= 1
##$TE= 295.16
##$TE2= 300
##$TE3= 300
##$TEG= 300
##$TL= (0..7)
0 120 120 120 120 120 120 120 
##$TP= (0..7)
150 150 150 150 150 150 150 150 
##$TP07= 0
##$TPNAME0= <>
##$TPNAME1= <>
##$TPNAME2= <>
##$TPNAME3= <>
##$TPNAME4= <>
##$TPNAME5= <>
##$TPNAME6= <>
##$TPNAME7= <>
##$TPOAL= (0..7)
0.5 0.5 0.5 0.5 0.5 0.5 0.5 0.5 
##$TPOFFS= (0..7)
0 0 0 0 0 0 0 0 
##$TUNHIN= 0
##$TUNHOUT= 0
##$TUNXOUT= 0
##$USERA1= <user>
##$USERA2= <user>
##$USERA3= <user>
##$USERA4= <user>
##$USERA5= <user>
##$V9= 5
##$VALIST= <valist>
##$VCLIST= <CCCCCCCCCCCCCCC>
##$VD= 0
##$VDLIST= <DDDDDDDDDDDDDDD>
##$VPLIST= <PPPPPPPPPPPPPPP>
##$VTLIST= <TTTTTTTTTTTTTTT>
##$WBST= 1024
##$WBSW= 4
##$XGAIN= (0..3)
0 0 0 0 
##$XL= 0
##$YL= 0
##$YMAX_a= 263391
##$YMIN_a= -525033
##$ZGOPTNS= <>
##$ZL1= 120
##$ZL2= 120
##$ZL3= 120
##$ZL4= 120
##$ABSF1= 16.522
##$ABSF2= -4.171173
##$ABSG= 5
##$ABSL= 3
##$ALPHA= 0
##$AQORDER= 0
##$ASSFAC= 0
##$ASSFACI= 0
##$ASSFACX= 0
##$ASSWID= 0
##$AUNMP= <proc_1d>
##$AZFE= 0.1
##$AZFW= 0.1
##$BCFW= 0
##$BC_mod= 0
##$BYTORDP= 0
##$COROFFS= 0
##$CY= 12.5
##$DATMOD= 1
##$DC= 0
##$DFILT= <>
##$DTYPP= 0
##$F1P= 14.0000005364418
##$F2P= -0.99999901652339
##$FCOR= 0.5
##$FTSIZE= 32768
##$FT_mod= 6
##$GAMMA= 0
##$GB= 0
##$INTBC= 1
##$INTSCL= 1
##$ISEN= 128
##$LB= 0.3
##$LEV0= 0
##$LPBIN= 0
##$MAXI= 10000
##$MC2= 0
##$MEAN= 0
##$ME_mod= 0
##$MI= 0
##$NCOEF= 0
##$NC_proc= -4
##$NLEV= 6
##$NOISF1= 0
##$NOISF2= 0
##$NSP= 0
##$NTH_PI= 0
##$NZP= 0
##$OFFSET= 16.522
##$PC= 1
##$PHC0= 169.1899
##$PHC1= 0.8056063
##$PH_mod= 1
##$PKNL= yes
##$PPARMOD= 0
##$PSCAL= 4
##$PSIGN= 0
##$REVERSE= no
##$SF= 250.13
##$SI= 32768
##$SIGF1= 0
##$SIGF2= 0
##$SINO= 400
##$SIOLD= 32768
##$SREGLST= <1H.CDCl3>
##$SSB= 0
##$STSI= 32768
##$STSR= 0
##$SW_p= 5175.98343685301
##$SYMM= 0
##$S_DEV= 0
##$TDeff= 65536
##$TDoff= 0
##$TI= <Analysis number 999999
Compound Code 99
Book Reference 9
Project Code 9>
##$TILT= no
##$TM1= 0
##$TM2= 0
##$TOPLEV= 0
##$USERP1= <user>
##$USERP2= <user>
##$USERP3= <user>
##$USERP4= <user>
##$USERP5= <user>
##$WDW= 1
##$XDIM= 32768
##$YMAX_p= 362518221
##$YMIN_p= -282238
$$ End of Bruker specific parameters
$$ ---------------------------------
##NTUPLES= NMR SPECTRUM
##VAR_NAME=  FREQUENCY,     SPECTRUM/REAL,   SPECTRUM/IMAG
##SYMBOL=    X,             R,               I
##VAR_TYPE=  INDEPENDENT,   DEPENDENT,       DEPENDENT
##VAR_FORM=  AFFN,          ASDF,            ASDF
##VAR_DIM=   32768,         32768,           32768
##UNITS=     HZ,            ARBITRARY UNITS, ARBITRARY UNITS
##FACTOR=    0.157963299565203, 1,           1
##FIRST=     4132.6476996994, 0,             0
##LAST=      -1043.33573715361, 0,           0
##MIN=       -1043.33573715361, -282238,     0
##MAX=       4132.6476996994, 362518221,     0
$$ Real data points
##PAGE= N=1
##DATA TABLE= (X++(R..R)), XYDATA
$$ [...]
24476 50004 43134 14041 56665 -9466 -30485 -59396 -55764 191 49266 101214 79744 52700
24464 52700 5353 -477 -8672 -10252 -19348 -64068 725 21802 -42991 -76093 -36051 -15303
24452 -15303 9258 5815 37539 13000 -71671 -96376 -70946 -71280 -74450 -87326 -46764 -43535 -55890
24439 -55890 -16806 -21215 -57713 -34515 9154 9757 48948 15451 -30691 -74245 -105469 -73322
24427 -73322 -53037 -60210 -32724 -22598 -7589 -33779 -60455 -50039 -32949 -20830 30473 -16264
24415 -16264 -24366 -57384 -49504 28470 -3849 -6411 -2975 55262 25641 -44386 -77883 -68476 -77395
24402 -77395 -128648 -149480 -160378 -189755 -176361 -139900 -159768 -92861 -74629 -43011 11794 20395
24390 20395 39024 46833 47265 57265 2841 -22206 -74464 -94217 -133027 -109490 -33465 21950
24378 21950 1749 11039 26739 46618 103301 65091 50191 63093 23969 33943 1127 -4057
24366 -4057 -4163 -1894 -8371 -10638 -62387 -45459 -72663 -143889 -155897 -32855 67096 31515 -31966
24353 -31966 -29177 -32371 -34208 -31365 51929 37272 13592 -8346 -32252 -48057 -16182 40775
24341 40775 136412 137903 74775 84095 15050 12879 6582 -9411 46448 46804 40242 23281 -32715
24328 -32715 -112303 -76916 9173 -22806 -5114 -9306 -106412 -64152 -4770 -1039 53632 65542
24316 65542 45040 14375 54037 95678 96385 13808 -34174 17275 -10032 75261 111494 19412
24304 19412 -34397 -9216 27635 36180 76647 64440 61561 40053 51160 5646 -56981 -94359
24292 -94359 -165020 -125518 -60296 -49742 -34991 -25583 -35974 -35277 -68986 -98816 -106067 -76275
24280 -76275 1488 -11407 -29512 40700 66721 52282 76411 62169 17839 -28618 -656 60292
24268 60292 101834 58913 10972 37409 37553 14486 -14792 -7318 62289 75515 11488 10769 -41608
24255 -41608 -54772 -6421 -931 17458 68036 162974 139496 143055 64429 35629 50921 71063
24243 71063 113102 104917 72138 32675 54165 89066 64134 63231 80043 47720 -13806 18363
24231 18363 35243 7724 -44274 -20391 -27137 54063 85073 47627 21022 -27820 -81455 -23581
24219 -23581 35482 8774 39119 79569 83383 48446 9029 35789 57633 59912 128426 93199
24207 93199 63326 57431 2889 4831 -88022 -72768 -37205 -24958 24083 21456 42658 59711
24195 59711 24407 -16625 900 26299 45524 56776 10027 -94494 -154293 -173871 -126711
24184 -126711 -97740 -121998 -145414 -87127 -73297 -55515 -20944 -26056 -3314 19543 -6139 5970
24172 5970 15 -3897 -7267 -16626 -110931 -92077 10390 95155 82357 -39172 -1888 77429
24160 77429 97047 93183 39208 75027 118722 84210 30592 -24535 -2743 19054 44472 52269
24148 52269 60226 44044 69574 56874 29457 42840 46698 75294 37757 45789 81325 113350
24136 113350 44488 -15758 -112175 -145168 -81127 -33691 -18588 -15626 6907 -18694 13529 975
24124 975 29010 -2092 -45217 -41282 -63950 -103990 -39375 60181 84208 13820 16474 5638
24112 5638 -19779 3913 2575 -13720 7010 58013 76050 137258 109185 32790 -11701 -22937
24100 -22937 -2516 -9612 8554 1651 -46819 -16722 -17186 -85083 -83018 -8746 65 -87978 -160488
24087 -160488 -175835 -107648 -79424 -60955 69041 72983 43859 65375 32175 20264 7313
24076 7313 -52288 -82672 -5666 -62545 -35257 -3732 -8561 -3110 -40278 -24185 -36888 -73918
24064 -73918 -24545 7818 -12136 -98491 -88579 -82184 -47699 -51582 -22743 -74991 -81835 -33745
24052 -33745 -62954 -59285 37371 118191 160336 127111 57009 56452 56183 37490 9124 22206 17460
24039 17460 64553 26018 -11872 -72665 -74637 -119910 -116765 -134660 -22429 21414 29283 29832
24027 29832 -12077 2169 -2648 -5029 -20603 -29830 -48532 -28271 -5069 37004 28534 -25675
24015 -25675 -13057 -58343 -144342 -128570 -46145 4701 1030 -1120 13045 -6086 2564 -25378
24003 -25378 37721 21987 -6428 -17582 -27013 -90759 -73992 -50362 -46694 -3740 21105 -7152
23991 -7152 4863 -19503 -39429 -15588 -11295 -24602 -62909 -80930 -23489 -20322 1490 -19291
23979 -19291 -21454 55559 108675 148722 116378 92044 6350 -43250 -27410 -39524 -78134 -16190
23967 -16190 -39382 -47060 -44197 -62444 -73866 -14875 38358 64561 56677 38246 57611 19220
23955 19220 -9382 -49390 -47229 -41419 -37945 -97879 -81810 -61245 -33333 53628 49801 12978
23943 12978 41500 120495 111126 42151 43442 66133 76053 -8170 -101104 -131097 -65577 14297
23931 14297 -34360 -49798 17746 9680 29808 45823 49067 -12963 -69094 -80200 -115154 -72531
23919 -72531 -22711 -15475 62221 134544 134929 98223 79379 35792 60949 38546 56232 19017
23907 19017 -53777 -125035 -49640 48389 85903 65901 -264 -3162 -12031 -94 48103 123326
23895 123326 123677 64612 -30965 -45229 2440 -36147 -42807 -37997 -22581 -62426 -62525 -12571 35050
23882 35050 40302 45372 48792 7577 -6553 66706 128649 103519 72484 -9469 -102003 -76853
23870 -76853 -18211 -12335 -113974 -110694 -12412 37197 18893 -39524 -31650 -19306 8822 35695
23858 35695 47899 -36508 -71637 -122445 -199662 -118175 -35467 -8927 -74023 -104862 -58668 -42734
23846 -42734 -47495 -21011 -61511 -6986 -4426 33181 -3107 -83226 -44258 -54351 -50096 -5837
23834 -5837 22855 16966 41808 27773 -20369 -56190 -70487 -40938 47079 -25422 -61247 -73196
23822 -73196 506 66747 -11014 23597 87716 139386 132864 91302 -4748 -42007 -68385 -87437
23810 -87437 -60283 -42919 -38 4979 43173 38714 23816 -3009 -37607 36874 92656 102623
23798 102623 92042 54722 27136 19383 24340 -30322 1135 44333 -1229 -49968 -17153 -31067
23786 -31067 12628 52352 41380 21314 53330 -27606 -5908 78965 65636 61534 52105 37378
23774 37378 33332 56958 64723 79055 -2408 11655 82304 118250 138193 112991 55162 -67675
23762 -67675 -74038 -81582 -46763 -14746 -14804 -15246 8861 23217 -60747 -105687 26423 91204 30188
23749 30188 13670 22186 -498 19060 10439 -7558 -31748 7113 21069 -16654 -133507 -150480
23737 -150480 -65980 -89123 -75073 -65016 -155708 -195323 -196065 -102705 -86169 -61746 -28994 -54721
23725 -54721 -36025 22285 57764 73480 80669 71378 75073 28115 -24893 -72881 -133131 -118385
23713 -118385 -49529 13369 44850 82640 63766 27575 25616 24031 14034 -7308 -1687 -15646
23701 -15646 14535 15905 -34873 -89427 -86725 -80600 -23031 27507 49974 34101 -32841 -71660
23689 -71660 -11460 63323 57880 -14776 -86226 -148874 -128616 -112805 -90533 -45760 -47184 -51977
23677 -51977 -74118 -133788 -148806 -104038 -103489 -91725 -46303 -38394 -45952 -61506 -92745 -52156
23665 -52156 -22180 -42618 26561 78764 10750 -10138 7357 -18295 4126 52021 68493 93957
23653 93957 34828 42934 48765 5194 26264 -36027 -70798 -10830 -40616 -34646 -71715 -84185
23641 -84185 -49942 17148 40042 55553 81671 93254 36483 55837 63713 42469 -13252 -54350
23629 -54350 -14947 6698 32083 -12913 -1861 30722 43165 1829 1894 38400 52368 37856
23617 37856 47878 18009 -109405 -113183 -65127 -34949 16561 -10767 -51513 -59823 -58360 -3823
23605 -3823 -12206 -70256 -115381 -114241 -118998 -91928 -110147 -145926 -176806 -86483 -82191 -75275 -127590
23592 -127590 -106325 -49178 -53530 -111689 -147037 -108113 -65578 -60822 -29442 -114793 -129607 -46220
23580 -46220 -9627 38089 48851 39410 46554 95207 52201 31952 95511 94320 100416 76091
23568 76091 19591 -6518 -22149 -34364 -63200 2663 49208 66705 6999 -68692 -54039 890
23556 890 8272 47495 -11866 -55310 -23834 -4104 -22700 -39324 -409 7340 10715 33010 4097
23543 4097 -25449 -34205 -50505 33741 2954 -54687 -48264 -29473 19774 1357 27371 53904
23531 53904 39523 -13258 -1244 -13814 -68526 -94371 -8554 -13194 23828 60298 8895 40018
23519 40018 90570 87335 26030 -38238 -26580 13185 -14987 -37458 -6014 19863 81271 55765
23507 55765 31547 91137 80660 -5179 -57896 -81265 -80769 -24595 32996 26672 -18093 -40216
23495 -40216 -23667 -54520 -41963 42950 101957 77555 116338 167553 120945 24534 53578 123277
23483 123277 63638 7068 26607 -13666 -30009 -3483 23364 19575 -5164 46492 15436 -2589
23471 -2589 -2958 -26775 -75146 -57070 -41094 -76451 -42566 -26878 -3457 12800 -43460 -53753
23459 -53753 -17444 -79068 -139719 -68968 -18789 -42351 -23323 25936 46302 129331 136026 120500
23447 120500 81950 35792 -41419 -99141 -60541 -36060 -18483 352 -52536 -5509 48042
23436 48042 100223 119218 157871 74500 -22921 -83523 -15542 -43463 -71037 12210 44310 48327
23424 48327 37542 27108 -13826 40822 65922 61846 56999 8957 -15849 -1148 36851 -18187
23412 -18187 -14784 -48584 -28451 20252 61185 75124 26641 6419 -51453 -179955 -186171 -99741
23400 -99741 -74302 -87389 -62378 -60776 -59222 -66921 -120271 -64082 -22679 -44305 -45632 -139117
23388 -139117 -202728 -140272 -74812 -23626 -47893 -73029 -80533 -56262 -82446 -40555 -55237 5479
23376 5479 77409 42516 16173 -14549 -33464 -1353 -30884 -44742 -47303 -91029 -94880 -16895
23364 -16895 1201 -14368 -104053 -88408 7838 49737 7575 -26927 -22424 -15180 -45303 -95840
23352 -95840 -33509 30999 42163 3292 -8323 -15178 11440 18431 58122 96484 129604 125161
23340 125161 77051 48320 -4878 -17672 -6638 5246 606 1508 -46360 -112467 -132261 -90691
23328 -90691 -62623 -60312 8661 35389 -13237 -97878 -118511 -81621 -54463 -38192 7471 30174
23316 30174 49111 17842 -35278 -73328 -101411 -86222 -47191 4363 37603 58117 77334 8851
23304 8851 -21502 30018 16133 -60455 -33564 3749 8494 4919 33946 -11973 -71145 1981
23292 1981 7925 31824 55072 42816 36908 -19812 -54830 -53773 -68643 -14846 -3300 8344
23280 8344 35187 44279 63168 20046 -40413 -48011 -66059 -129405 -177552 -108171 -62489 -134179
23268 -134179 -192214 -114713 9939 18835 -111704 -106463 -52704 -61682 -81579 -79895 -47201 -43383
23256 -43383 -13079 82205 55781 32441 42182 24853 62854 43859 51729 -32312 -83247 -112931
23244 -112931 -72248 -75309 -97654 3859 68735 84083 86670 47773 94725 114532 90079 31262
23232 31262 -24241 -55876 -31467 -27493 29170 25177 11888 27443 14829 42265 45444 39647
23220 39647 11907 -37777 -11674 41756 -10169 -17744 9580 32608 118315 55034 34178 12038
23208 12038 -52776 -65867 -68594 -114246 -45668 -22414 14137 36649 -33598 -169766 -121544 -10083
23196 -10083 30385 27673 55384 26119 -68935 -66731 -46629 -14884 -10952 3788 27265 -11834
23184 -11834 17360 3495 23959 12698 -100091 -152599 -76387 -45839 -24285 11375 37774
23173 37774 46303 24066 -64322 -79739 -281 97016 110802 50925 43144 29914 -22026 -35134
23161 -35134 -54002 -7431 39167 6810 -47628 -54398 48113 62108 38345 42604 73747 34229
23149 34229 10398 21989 15652 -41848 -100017 -106376 -8063 85153 141212 106956 41987 36109
23137 36109 26686 16614 16100 53297 40581 28357 -103156 -141412 -138015 -127090 -53800 8864
23125 8864 34476 -11373 -62853 -83088 -45867 -26533 -18532 -33009 -60018 7376 23625 -22581
23113 -22581 -16376 12586 -26677 -26635 7749 50090 52361 -1760 -53716 -20255 -10815 12255 34259
23100 34259 78898 100020 105637 90646 74118 30680 27535 12584 -8894 -84845 -103641 -45531
23088 -45531 -49532 -25043 15516 -9743 -63472 -85742 -104699 -84271 -79596 -77680 -22269 -49231
23076 -49231 -94678 -81770 -61842 -15547 11519 26354 34575 44840 68984 43034 5925 -46214
23064 -46214 -68278 -28439 -22664 -20179 10082 4934 -72350 -103492 -51643 -12424 64938 -28832
23052 -28832 -48831 15661 -1454 -18869 -12854 -33608 -19148 -4776 18310 33046 -12923 -48650
23040 -48650 -92216 -121292 -102737 -39814 -9278 -15574 27572 97781 157653 122007 118868 123314
23028 123314 135777 82583 27566 -37256 -65259 -42124 42175 -27275 -112272 -20893 36069
23017 36069 45849 52269 -36535 -40305 -82173 -82000 -60249 2556 30378 -16245 -35473 -80754 -61451
23004 -61451 24543 91410 78713 3939 2864 16100 35856 71757 63806 53952 -9135 -74662
22992 -74662 -68266 -37604 -73196 -77149 -33402 -54450 -79350 -111670 -79277 -65568 -110545 -98248
22980 -98248 -70234 -73448 5654 29444 -19560 -77548 -87537 -141158 -120604 -43049 -42707 -38423 -8471
22967 -8471 -3931 -26334 -60518 -64226 -52091 -30036 -27019 -22897 50311 51544 50708 85662 75857
22954 75857 30472 6185 -57060 -89229 -34384 -83454 -50924 -79873 -113174 -65069 -49307 -24969
22942 -24969 18370 26754 -17991 -28818 -16627 -33779 -32490 -5518 30785 41709 -14244 -80145
22930 -80145 -83574 -102463 -130198 -60198 3099 -995 -37725 -26819 -28943 -28215 30207 55803 -50562
22917 -50562 -100744 -89885 -125107 -85079 -91756 -69955 -80364 -100632 -126088 -108690 -125101 -81071
22905 -81071 -107062 -58537 -38478 -45902 21068 95806 89600 25864 15981 27293 41677 87332
22893 87332 106936 85431 62680 98638 76794 55082 86418 123320 109178 91630 46518 82887
22881 82887 118833 48434 6455 35448 66243 90578 96753 80547 21411 9134 -22575 -79420
22869 -79420 -37787 26413 78852 86392 6906 6857 2597 -2633 15821 25975 14522 -17741 -105678
22856 -105678 -144183 -150557 -41345 -76957 -80694 -45470 -34403 -55623 -46096 -72485 -63895 -52893
22844 -52893 35268 52951 66499 74675 44885 28633 51164 20665 -790 -44891 -62243 -64865
22832 -64865 -163364 -237003 -253898 -210182 -138522 -56747 -101093 -131362 -124739 -80796 -99596 -131667
22820 -131667 -102865 -106444 -66217 -30500 -75468 -96799 -121535 -136719 -166002 -162857 -132097 -112274
22808 -112274 -87178 -66092 -62437 -21510 19866 44725 30134 19142 31313 109042 46194 -144
22796 -144 37265 44947 1549 -44167 -47350 -63259 -44558 2794 14362 30379 -24953 -101652
22784 -101652 -49884 -22943 3315 29995 -1091 -49712 -69438 3369 30914 -42558 -28529
22773 -28529 -40372 -27400 54789 47129 -12708 -54541 -19821 -31838 -44549 -69480 -76661 -94687
22761 -94687 -94024 -63269 -6836 -366 -48229 -110508 -107974 -38350 -31668 -26245 -56337 -85725 -112225
22748 -112225 -80004 -64920 -99133 -75811 50037 136930 125696 72873 21655 -50579 -143435
22737 -143435 -138497 -125154 -89472 -4653 75327 117187 66313 -6390 -13848 -5411 -30503 37678
22725 37678 54166 73827 14433 3886 73156 91277 65947 100692 106662 33192 -54646 -13420
22713 -13420 19138 -22619 15280 -45953 -79071 -88594 -99111 -84282 -75851 -76208 -133961 -146123
22701 -146123 -117197 -41966 39027 -16923 -60761 -40828 -69712 -83770 -9033 23268 -18431
22690 -18431 -67570 -3240 12075 6401 -27909 -75650 -111057 -99008 -75006 -91841 -9896 39398
22678 39398 5483 31599 51672 -11197 -52686 -45203 -66857 -98234 -90691 7057 16474 1903
22666 1903 -3631 -74105 -115200 -123312 -127326 -95935 -37012 24717 57349 83405 30281 -19640
22654 -19640 59446 103387 63607 -6099 -67371 -80208 -65185 -23959 -17205 4822 51855 90888
22642 90888 94918 46658 36889 60111 99633 129163 94461 55699 111888 99583 115544 126172
22630 126172 39923 10136 6414 -36725 -36495 -25267 -6298 3843 -29422 -128771 -114068 -513
22618 -513 31702 21578 47777 69715 18794 35756 70662 37784 34285 64392 -11286 -26624
22606 -26624 59031 -27383 -74491 -32220 -70933 -116443 -110403 -69769 -40506 -12543 -44136 -11880
22594 -11880 -26546 -7688 104611 72299 26524 83123 17192 -64109 -68602 -112074 -82375 -89394
22582 -89394 -42532 -33732 -51409 -20203 16597 23427 50556 89864 56013 12887 12529 -43713
22570 -43713 -2702 11360 -26343 42378 74232 52796 23325 36493 59490 49476 -278 -74053
22558 -74053 -34898 3396 62267 44272 -26606 -82369 -111473 -84565 -11232 -77567 -167994 -102951
22546 -102951 38527 37652 -12275 7560 43287 5091 1260 26481 47367 33912 17592 4109
22534 4109 -10407 -68775 -22852 -7622 17524 34153 28953 64448 91515 78206 13399 -29236
22522 -29236 -9766 -18215 -84474 -129788 -76150 -27580 -45725 -52690 -60575 -40518 -41226 19245 24410
22509 24410 13812 27703 59375 95449 106942 117712 65693 2327 -33006 -21392 10798 -42075
22497 -42075 -14661 2884 -44785 -42268 5195 50757 40778 -9437 -13996 -36435 -102371 -44924
22485 -44924 5472 -59170 -130136 -128907 -91517 -110096 -145571 -94328 -48197 12471 -89943 -50188
22473 -50188 9800 -18575 -33160 -42044 -48478 747 36229 32537 18334 40876 65704 53447
22461 53447 -28639 -30496 -60545 -23505 27379 82617 60708 41049 22200 702 -4591 -4106
22449 -4106 -14715 -59875 -97228 -120063 -56164 -4628 -70007 -133851 -125301 -101827 -119321 -147607
22437 -147607 -89647 -62138 -53841 -103759 -79626 -39205 -43859 -50853 -33844 32430 -29153 -54793
22425 -54793 -32495 3868 -2656 -11022 -52193 46533 96025 69143 82481 125721 122915 52714
22413 52714 -780 6864 18729 20140 36251 47849 -8938 -103081 -175961 -146498 -72234 20332
22401 20332 29545 71480 62984 26302 25671 57055 62836 33224 -7400 37595 52537 -20361 33662
22388 33662 32717 31316 70081 26398 -65402 -110605 -87505 -112201 -70996 -5073 81018 178162
22376 178162 202841 303732 390383 437196 416977 403213 337452 237376 153412 62950 64571
22365 64571 60315 67776 46027 16611 61706 85103 99341 89482 90557 42853 -47537 -54474 -26894
22352 -26894 6072 18580 72495 40977 50194 29441 -11412 -23550 68716 48670 48913 -5537
22340 -5537 16667 97561 124109 92792 108814 95424 81011 52431 56411 29619 31274 89201
22328 89201 75199 30705 -31400 -31585 -66000 -97858 -41471 -19363 -8144 -56069 -59590 -23360
22316 -23360 -10358 -15032 -14274 -57832 -384 2058 -45114 -8940 55665 25626 -36728 -48746
22304 -48746 -51448 9409 28954 40521 63806 45362 -7608 -51721 -16167 27827 36881 12458
22292 12458 -17274 -61661 -73185 -37802 -49390 -45104 -31314 -14754 -42977 -32506 -49448 -80365
22280 -80365 -30856 -54422 -90998 -28272 -22502 -62531 2935 -58911 -90389 -103099 -49840 -76342
22268 -76342 -131361 -152507 -77446 -16550 -56561 -82993 -40114 -17918 -69696 -29449 5319 -26873
22256 -26873 -64168 -137124 -136591 -60224 -469 -5748 -8451 11722 -22344 -64908 -95412 -85674 -84522
22243 -84522 -71992 -176998 -208692 -122092 -88838 -72086 -141519 -176247 -209582 -162144 -69023
22232 -69023 -31182 -12068 -16271 43064 19172 -54142 -122271 -142517 -124321 -125998 -65463 -45148
22220 -45148 -23255 -5042 -33283 -7895 -6858 55381 41479 67040 105099 132817 171082 101953
22208 101953 8787 -53614 -68451 -96801 -71631 -105229 -126598 -91089 42997 71607 122983
22197 122983 74261 88860 56312 4893 -92008 -102315 -99963 -94375 -11899 -24724 -107749 -108363
22185 -108363 -135767 -144260 -80712 -16327 53201 49002 66887 41825 8258 19538 9214 17475
22173 17475 23 -70265 -116694 -127341 -100561 -78900 -70549 -82510 -95925 -67546 -68885 -96703
22161 -96703 -103889 -62593 -26545 -70853 -149556 -148444 -73640 -14478 -53153 -151329 -84830 -38731
22149 -38731 600 -36807 -48660 -25077 -28281 -18643 22502 7812 -17383 -45124 -69585 -53788
22137 -53788 -52916 -104568 -129516 -146223 -98679 -44696 -64420 -65124 -108169 -107834 -116788 -95652 -62996
22124 -62996 -84646 -11082 74892 24570 -37596 -23709 -22960 -14491 -53153 -112813 -53242 -15832
22112 -15832 -67279 -25526 51024 28180 64686 31855 -9851 -64645 -86824 -16144 -9590 -102815
22100 -102815 -116253 -28708 -7820 -57294 -93765 -78438 -59431 -6726 -41208 -63401 -67208 -109825
22088 -109825 -95487 872 52259 54138 67511 75196 100523 59087 48049 46281 1715 -60764
22076 -60764 -65554 -111764 -103539 -11993 -1134 -11649 -2266 28555 40219 -6159 -5481 -54909 -163029
22063 -163029 -114387 -41480 -12462 13764 -14212 -9292 -10547 -12127 -1187 -5397 34189 69029
22051 69029 94494 98157 66926 40106 88151 19536 -19651 -19409 -19115 -3210 43626 39249 12157
22038 12157 90953 122238 15986 -11786 -8486 28664 4628 -38938 21358 1711 -40169 -106676
22026 -106676 -87318 -63555 -48140 -4762 6502 56425 30731 47131 94032 85688 101274 113270
22014 113270 117493 68769 13523 -37351 -1899 30756 40000 28865 12304 7828 44299 20765
22002 20765 22214 32558 -9775 -21533 46508 89533 50377 -32012 -19131 -14607 -47227 -113388
21990 -113388 -114808 -81885 -95753 -35381 -85614 -169068 -181286 -138946 -74323 -34964 15398 -11912
21978 -11912 -93070 -55315 -29574 -46492 -113064 -128169 -86983 14631 9454 3705 12980 14296
21966 14296 53111 11341 -23557 -79518 -54360 -51042 -67869 -32455 5053 -4939 -48883 -50776
21954 -50776 -48308 -89305 -114178 -138419 -115246 -36281 35030 117358 57341 -10903 -35924 -29736
21942 -29736 28931 32123 34954 3496 -44983 -71329 -38780 56559 165963 93295 -8055 -62730
21930 -62730 -57824 -7353 -26263 -41337 -30779 -5463 -31029 -66387 -96151 -64681 -71721 -72829
21918 -72829 -57488 -79011 -45128 -44905 -85570 -113861 -91749 -50040 -25467 21579 -10486 -6109
21906 -6109 37320 -15165 -23865 26577 2223 -13226 -25530 -49627 -63463 -7689 -8989 -43457
21894 -43457 -112302 -103780 -47198 -38329 -96402 -119633 -62334 -19425 -97310 -65967 -5598 57048
21882 57048 94125 142590 61626 48304 41569 2008 12741 -2670 -48537 -85271 -105935 -90665
21870 -90665 -109854 -107917 -59435 -61411 -59615 -32521 -18508 -17692 -37335 -55114 -59311 -92855 -83564
21857 -83564 -25926 -19267 9817 -29155 -38832 -64481 -77707 -10843 29963 27746 -21767 -66658
21845 -66658 -41417 670 -55970 -25775 -55865 -97994 -94110 -43579 -49744 -74520 -53329 -43412
21833 -43412 -107854 -120659 -67363 -84763 -112880 -115374 -129969 -148756 -132389 -76822 -87731 -56955
21821 -56955 30111 56614 15632 1765 -1390 -42394 -21469 -7631 6851 -31896 -67400 -151055
21809 -151055 -86821 -17600 -50199 -37674 -8299 42804 3121 -51807 -44598 -3298 -26257 13336
21797 13336 9920 -49342 -18819 17673 2425 4779 27214 49698 31319 30352 -15217 -46203
21785 -46203 8130 73996 118801 94118 97105 17570 15202 -38826 -73307 -44915 -47500 -46377
21773 -46377 -120418 -169288 -130041 -40885 18800 78729 90269 90369 136128 60302 33062 6058
21761 6058 18244 -8232 -57453 -145821 -119554 -62876 -4562 8807 55024 55377 -41589 -75335
21749 -75335 -89795 -63231 -50822 -30543 -85793 -178133 -133733 -122060 -137508 -71820 4844 -19932
21737 -19932 -124510 -141714 -121055 -100048 -86907 -154503 -125456 -57817 -20372 33195 44478
21726 44478 51885 70638 26250 -18791 23939 38123 73509 15763 -9324 -13548 -26507 -34105
21714 -34105 10909 4316 -35623 7922 60430 19812 21990 642 57324 87930 51847 52746
21702 52746 -4019 -63492 -49792 -107363 -100790 -107474 -65115 2572 -13618 16474 12400 -29678
21690 -29678 -98024 -97176 -130567 -134933 -93384 -12976 -11253 -36791 -46747 -85042 -29462 11130 -2588
21677 -2588 -28543 -34230 -3076 11355 1929 12506 -2757 -18499 -64548 -31268 1817 6763
21665 6763 -10889 -15997 -68062 -130905 -89114 -26572 -29538 -83647 -65595 -24105 -38154 -25838
21653 -25838 13951 67230 55262 47514 31793 -8266 -86901 -144289 -112424 -17823 18572 8796
21641 8796 -4804 -72183 -66730 -82228 -89340 -44277 -60549 -126216 -126659 -103921 -97884 -107142 -118958
21628 -118958 -68923 -55570 -8623 -1262 -22675 -13776 -18045 -37233 -24299 12983 25440 38148
21616 38148 64710 45740 6896 -2946 -3646 4436 13100 9825 -40163 -83328 -73565 -52119 -18024
21603 -18024 16114 -13190 9572 74975 49544 40538 24886 20928 -20250 -37616 -73836 -65644
21591 -65644 -37790 -27120 -15374 -39341 -44902 7921 -62749 -53304 -14592 -21093 3228 -49793
21579 -49793 -93427 -86449 -63895 -73898 -51838 -20569 -11805 -29341 -14917 27303 29352 44951
21567 44951 5458 -19698 46303 -6133 -68557 -38034 -46291 -57640 -91490 -112426 -131219 -104656
21555 -104656 -53255 -26876 16074 35155 -3903 -17345 -26663 -20799 -7803 -21503 -13495 -29607
21543 -29607 -65814 -55998 -69012 -99710 -100703 -83193 -61175 -70425 -35600 30395 74303 102536
21531 102536 110687 101583 83863 59791 45254 29811 42572 -12256 -104325 -173275 -154937 -80082
21519 -80082 -20876 -1274 -55512 -88117 -99294 -96207 -75578 -31216 -74929 -59249 5471 1413
21507 1413 -55599 -60785 -2674 -1627 -25393 -43656 -17676 26646 4228 -21914 -75804 -2580
21495 -2580 3191 -58126 -41050 14559 -470 3330 -27674 -31408 908 12103 -50805 -66438
21483 -66438 -94642 -96182 -54405 -41858 -54555 -44774 -29746 10096 6669 -16388 -18635 -77506
21471 -77506 -129337 -72075 -73029 -88710 -63186 -70381 -97387 -116836 -94491 -74547 -90502 -64771
21459 -64771 1538 39301 9675 -4577 80511 97504 47515 52065 24847 -37626 -31044 3737
21447 3737 -14540 2044 -21388 -117279 -113933 -43648 -4170 -37769 -73742 -62393 -98430 -146183
21435 -146183 -156178 -98831 -71640 -23280 -20266 -38067 -5135 40248 56331 -2366 -54734 -74664
21423 -74664 -81955 -63977 -84086 -96323 -66985 -7773 46798 71884 64966 44259 -28318 -89753
21411 -89753 -50241 -64320 -130953 -133456 -54305 -38380 -66540 -14622 -2357 -20991 -50710 -21744
21399 -21744 27546 44937 68250 26118 -25151 40539 61133 27801 48811 40641 -12590 -80060
21387 -80060 -106818 -57302 -36678 -54382 -38280 -59446 -88636 -64678 -81955 -49292 19965 25938
21375 25938 48513 68567 -2710 2979 -102737 -123840 -85002 -131296 -186031 -88707 -13887 22175
21363 22175 17673 -51348 -100352 -91420 -72029 -107526 -81010 6400 -22376 -15329 -25118 -68175
21351 -68175 -25819 -54821 -15782 37790 -15735 -113500 -108767 -99529 -78028 -182498 -174362 -120824
21339 -120824 -79202 -31871 -13554 -49730 -36682 49162 53964 44629 2320 -72323 -96008 -46118
21327 -46118 29753 25308 6870 -17633 -115017 -178112 -262001 -282238 -212068 -133776 -121682 -128804
21315 -128804 -99346 -100774 -99106 -47278 -34286 59439 64883 73863 50434 31034 17008 -63143
21303 -63143 -104577 -51915 -44041 -43662 -73104 -113453 -30534 54333 21908 -45861 -142128 -184631
21291 -184631 -121245 -15541 43931 47658 -31522 -3361 -12682 -31180 -73795 -98076 -111342 -138443
21279 -138443 -129183 -122964 -77450 -37418 33137 53577 -7736 -101339 -78206 -38203 -53535 -65889
21267 -65889 -115805 -191769 -175793 -68854 -60762 -89893 -81255 -68576 -60869 -35059 -17853 44667
21255 44667 24504 39682 37574 9968 20200 24258 65079 67778 22927 -2936 14963 43570
21243 43570 80188 126393 91965 52100 -20331 -167287 -147551 -98960 -44595 1711 12485
21232 12485 25501 93111 139578 144778 78457 13384 8038 42470 79225 -11006 -14448 -81636
21220 -81636 -125652 -122670 -55196 -20227 4870 18979 3331 -27126 9400 -11154 23224 72655
21208 72655 34564 -17190 -75858 -89243 -36596 -639 41667 62653 52324 38253 77025 -32321
21196 -32321 -88623 -44922 -33262 2231 39013 70567 46745 34819 5941 -46935 -106208 -47819
21184 -47819 18551 38688 121461 132540 66696 -56694 -145650 -75153 -9610 -17103 1486 -1365
21172 -1365 39686 92784 74340 -14460 3211 45043 21437 3763 69244 30409 -84672 -138733
21160 -138733 -139682 -55842 -29879 -9411 -46438 -117324 -129852 -39522 16036 18855 -72 91054
21148 91054 169370 104348 32855 -5300 -9231 1319 17216 24142 32924 51595 -20649 -5447
21136 -5447 59683 41559 48318 51723 94667 157418 170385 140078 100076 100463 55836 10356 -622
21123 -622 -31336 -100295 -85958 -7840 20297 30162 45542 110866 78760 84915 84133 11004 -73096
21110 -73096 -113060 -93174 -57763 33560 13225 -65823 -62048 -57149 -28280 11699 18539 -53152
21098 -53152 -73052 -1285 29323 37530 36649 44427 3000 7647 25692 -20216 -50111 21023 43693
21085 43693 25200 -5935 -104946 -78230 -49161 -30350 -18426 -2663 -36447 -23627 -14245 -2483
21073 -2483 -3018 13121 -29395 -32616 -8110 20402 1558 -12697 34673 -20845 -116851 -112423 -150616
21060 -150616 -132294 -55645 45546 75532 15172 -17778 -6251 1917 -90055 -167105 -150527
21049 -150527 -50594 -16030 -54308 -79588 -7802 34070 -52717 -72955 -14685 91950 90200
21038 90200 25611 1525 -26483 -46045 -101137 -66046 -15163 16380 18308 -52558 -100085 -96262
21026 -96262 -75687 -48600 23746 32768 170 -9661 19319 56021 40749 -23669 -48646 -51049
21014 -51049 -24616 -3606 -32156 -97402 -108552 -97649 -146545 -157646 -136820 -98691 -17301 38592
21002 38592 15692 -71000 -106775 -94056 -74876 -24726 -32884 -7839 -9563 -39363 -164 -12622
20990 -12622 29474 61963 89782 92383 -42616 -51928 2471 71262 81071 11978 27870 9506
20978 9506 -54079 -79761 -64509 -18655 1210 -3058 5781 115533 139086 102767 26097 -17136
20966 -17136 44698 80233 61157 25359 16189 70627 127948 102396 172162 328934 420940 537411
20954 537411 745609 1030317 1312729 1713241 2045491 2254266 2286213 2105652 1826081 1523298
20944 1523298 1241278 976823 797752 709463 656871 554626 452390 466612 430840 330867
20934 330867 312312 338682 317625 228169 242054 244098 244567 253744 240207 208456 146398 108177
20922 108177 124439 51168 65770 53884 65131 83761 69088 81805 99013 139227 57793
20911 57793 1080 71050 96558 107601 79836 48643 25791 37453 15363 33119 51743 67972
20899 67972 13383 15942 17831 61827 49352 57311 107866 86048 82256 60918 91554 80056
20887 80056 134924 134659 102540 26126 -34857 -53666 18354 22098 -15477 -35095 -31135 9217
20875 9217 46580 79087 136904 88848 16294 38870 44769 12876 47406 69500 90098 15298
20863 15298 19862 -32631 -24412 485 -24507 -75938 7121 -7854 -20314 -4695 -13503 -17786
20851 -17786 18370 -38603 -107344 -127196 -56491 -50039 -50077 -55265 2458 28421 -35359 -82804 -118184
20838 -118184 -66238 -48056 -64693 -25888 29025 67656 16803 -28292 -5479 7617 -31395
20827 -31395 -49027 -37646 -16022 42209 14478 39375 55601 47402 76412 56862 -10675 -55695
20815 -55695 -103341 -82330 -31101 22353 59685 40618 -18807 -23897 -35870 -76328 -86704 -49326
20803 -49326 24392 95955 123900 150316 108393 70970 14732 -12785 12389 -1937 12629 -2125
20791 -2125 -29937 21609 1718 -27536 2422 -9767 -39082 -59564 -73066 -54726 -61146 -42935
20779 -42935 -56319 -37270 18342 72418 -33135 -65604 -4544 -5744 -459 -65575 -98526 -121970
20767 -121970 -131735 -104334 -120008 -112388 -35678 13951 -7276 -35063 -82651 -95618 -1686 54159
20755 54159 -1816 5233 65804 45984 -10104 3458 33177 53581 64690 108072 81764 69668
20743 69668 -9748 21072 48813 110565 55054 31443 -19995 -11247 -81398 -138472 -160193 -116409
20731 -116409 -82543 -83302 -151109 -188757 -133771 -45933 -18477 -39834 -70352 -34339 -1992 -15156
20719 -15156 -52223 -119663 -98914 -32384 -29660 -76486 -106149 -88888 -82317 -108843 -118221 -64944
20707 -64944 17226 -13860 46431 134080 129609 57711 -9123 -53475 -159254 -156779 -88663 21510
20695 21510 69567 67273 17688 -40955 -22952 4490 51764 51614 -13199 -51606 -13345 5235
20683 5235 -50929 -102798 -60193 13941 50275 3246 -59597 -62705 -138100 -178854 -175402 -185976
20671 -185976 -109721 -65895 -34010 -41905 -39647 -21266 -40785 -54569 -47639 -83265 -48900 -39465
20659 -39465 -28438 -85804 -50479 -93193 -101592 -34398 13741 36544 -3753 8141 -22495 -36195
20647 -36195 -49487 -31227 -49721 4960 35385 15801 -11564 -35726 18202 84368 80996 122359
20635 122359 162638 73081 6415 -3127 -54609 -35823 -32557 -23516 -87313 -145780 -173700 -128502
20623 -128502 -95008 -99056 -94006 -25616 -29126 -88908 -98898 -107021 -54803 -101098 -85637 -38070
20611 -38070 -14318 -61666 -101164 -106095 -118855 -100325 -45890 -29694 -15423 -40449 -9864 68608
20599 68608 83661 29854 -19575 -11269 -3439 56297 17544 -10498 -70026 -68169 -28491 -48363
20587 -48363 -55980 -43615 4779 58430 43962 -9368 19047 69048 54789 50088 4194 34670
20575 34670 54412 53997 65184 64246 44254 -22379 -50084 -66082 -46284 -23393 29543 3256
20563 3256 -12205 9790 46464 47052 72607 71742 30943 30048 37369 47163 32012 42140 6896
20550 6896 -23653 3395 -11633 -95280 -96079 -72809 -86224 -125301 -108762 -60525 -73272 -76766
20538 -76766 -89476 -94016 -165542 -179199 -177730 -141454 -97339 -74480 -161446 -180732 -149670 -102034
20526 -102034 -64886 -469 -1808 -12531 -65136 -48119 -117894 -191081 -105262 1030 45897
20515 45897 -40117 -76680 -148616 -124694 -93392 -81747 -65777 -34280 -52501 -114132 -212666 -160473
20503 -160473 -48360 2602 20195 39591 79017 15641 -46392 -37684 -3631 -15434 -92385
20492 -92385 -58254 -53719 -73896 -86384 -60236 -32119 -30293 -10738 -11515 24639 28996 -9766 4161
20479 4161 33265 -15115 -60403 -27613 -24858 -64237 -128455 -133096 -127566 -133847 -91890 -52726 -14837
20466 -14837 -17929 -15132 -40688 -12534 -55115 -86605 -83889 -69010 -157493 -181860 -78630 -47406
20454 -47406 -52945 24294 -2703 -2385 -19214 4135 32370 11529 -29545 -47510 -52232 -93156
20442 -93156 -100980 -59583 -77136 -38361 -56977 -99147 15253 69404 66560 101650 63630 -583
20430 -583 2269 -48337 -98963 -89981 3632 19483 35419 30564 -20815 -70143 -61040 -42434 -8140
20417 -8140 3382 -45373 -79346 -125951 -137671 -65706 19907 31784 23819 -3415 -50422 -101605
20405 -101605 -145103 -151680 -102183 -103771 -93363 -67920 -95561 -84662 -10045 -51976 -174134 -165672
20393 -165672 -137519 -27896 6160 -33579 -30439 194 -36502 -41638 -11366 31291 19285 -3947
20381 -3947 -12252 -8406 -59755 -127131 -118872 -89714 -66812 -44048 -40163 -34309 -49427 30660 63874
20368 63874 26804 34554 51024 23166 3180 51379 6305 -23089 -78018 -160706 -166753 -124589
20356 -124589 -71487 -79420 -62762 -9967 44352 65783 21977 5993 38820 28318 63439 28317
20344 28317 -16008 -47277 -50219 60125 38385 -54913 -14979 24417 3784 -42368 -85732 -46393
20332 -46393 -103713 -155722 -77095 -16522 -21555 -3313 -30894 -17818 71185 17228 -69057 -44683
20320 -44683 -65953 -39879 -18052 -35660 8304 110450 83963 29040 13653 4116 46225 104978
20308 104978 125663 144717 103606 134107 172676 151490 120737 97395 61756 34592 57327
20297 57327 41556 28538 25797 63432 11353 -5916 60821 47032 26105 37339 32142 49713
20285 49713 75431 85428 121003 174636 217784 197177 259439 275914 231792 188797 215840 202723
20273 202723 172109 130959 107339 99000 114670 104968 76364 140652 167190 141871 109760 92897
20261 92897 84641 103800 185182 201773 154960 120616 116922 97057 50638 -10243 12330 150507
20249 150507 208205 168454 113411 50029 23647 66084 112848 150786 147217 112968 123735 173293
20237 173293 146025 103572 140906 125040 144766 202672 294583 299666 265161 249106 232585 150223
20225 150223 67994 71605 81999 66421 109828 139425 179110 198073 180258 136576 159316 223870
20213 223870 237065 179926 117916 101059 97372 44402 46626 39642 49045 39327 82703 91932 41214
20200 41214 -5586 35310 80475 67723 78581 47053 110711 152013 125946 115554 170966 256688
20188 256688 272056 255218 245109 259958 211362 163748 151441 126804 140008 135110 144490 164681
20176 164681 191341 191215 159094 74137 26290 44800 88186 112956 151698 85928 74878 93598
20164 93598 82381 33416 -1226 -40649 -17597 -17226 -20277 -10861 67436 123130 136034 155176
20152 155176 153315 120255 59064 16238 -4071 41745 65933 113752 121982 72697 77877 55625
20140 55625 53439 83997 71732 80527 90202 98691 53306 6469 7245 63989 90122 131585 148023
20127 148023 96399 79247 36885 49776 69239 82622 140990 140877 139607 20116 66563 91862
20115 91862 78306 98219 73758 77342 89249 25809 -56905 -49085 -108133 -103041 -67157 -56421
20103 -56421 9629 73886 49714 7972 -288 52735 62300 52221 -7239 -76978 -140730 -63011
20091 -63011 -23218 14696 -4615 -8461 -26056 -19221 56612 112479 135571 164561 99935 18830
20079 18830 16619 -12258 -56822 -51449 -36351 -80396 -56656 22586 51902 25657 45609 91700
20067 91700 15499 -53621 -61752 -18248 20738 24404 28765 5397 20917 22874 -5140 5204
20055 5204 10167 77352 93005 35265 -28906 -12860 -21104 -9034 -43185 -83535 -42093 17408
20043 17408 11242 -83004 -83493 -87009 -7661 29682 32149 101500 22586 36406 52964 38632 64328
20030 64328 38198 -16239 -50763 -63620 -55994 -28092 -36891 -30263 -67909 -66052 -58610 -34504 -44907
20017 -44907 17132 17724 -3887 -2778 -85773 -111224 -133290 -127112 -128130 -106253 -77476 -53459 20174
20004 20174 10512 -43768 -19619 -32226 -43509 -36570 48817 38842 -66721 -91538 -63503 -43861
19992 -43861 -50360 -109058 -123042 -151008 -164494 -117388 -66124 -85734 -75381 -41826 -55343 -123997
19980 -123997 -151779 -67860 -89439 -104018 -32094 -26956 3593 -3079 12014 17939 34532 62405
19968 62405 63634 12844 -52048 -66466 -55962 -45151 -104893 -154035 -151310 -121109 -63847 -96416
19956 -96416 -123657 -62107 12533 29999 24098 43180 15225 -51975 -101757 -76029 -55188 -38067
19944 -38067 -15344 -19503 -52439 -59385 -55809 1274 5266 -19121 -42755 -35311 -16917 -19555 16803
19931 16803 50978 84170 82520 3668 -96971 -93698 -56907 -72425 -147171 -174467 -128563 -43763
19919 -43763 6386 -50451 -101657 -125809 -116375 -73376 -71503 -31059 56222 15360 -65001 -154899
19907 -154899 -125776 -75986 -2802 -38808 -90072 -132416 -91057 -69188 15088 51031 71226
19896 71226 49065 38644 42922 28809 -7484 -19027 -91457 -75649 -93602 -104231 -89571 -14753
19884 -14753 14645 -44053 -65686 -79906 -157156 -143086 -109249 -44111 -15229 5326 50912 34421
19872 34421 7520 -68402 -42193 944 -58141 -54422 -52573 -76912 -99288 -124314 -129547 -109222
19860 -109222 -135409 -111409 -70128 -39867 -95667 -103271 -67586 13546 65285 -24318 -32069 -48732
19848 -48732 -39557 -35389 -3889 24037 -5260 -34362 -69043 -26942 40702 73453 2713 -16311
19836 -16311 -6580 63285 53661 17301 -19354 -18995 -5464 16645 -47581 -37988 -37180 28920 92637
19823 92637 -5295 -38166 -68999 -78212 -94986 -80728 -64408 -120024 -203336 -175415 -106069 -55860
19811 -55860 -51640 -99000 -172676 -212548 -214962 -206293 -118606 -25663 27458 -35200 -71814 -80031
19799 -80031 -75960 -41307 -22979 -24222 -63977 -29211 -43379 -115828 -73120 -44796 -79779 -83925
19787 -83925 -66992 -44299 12950 15110 -18142 -79030 -132376 -103594 -58244 -45673 -65142 -115840
19775 -115840 -140052 -171118 -132806 -39930 14544 40083 22971 -15775 18037 51643 87013
19764 87013 60450 4601 -75010 -41848 -20041 -59855 -53877 -82177 -95267 -85997 -95470 -55255
19752 -55255 7936 40702 -37029 -82322 -99978 -84091 -85044 -37472 -78254 -30379 -66359 -172242
19740 -172242 -191611 -120666 -134791 -92614 -26269 1696 -5619 38804 34728 43881 38469 -20494
19728 -20494 -66535 -76513 -30427 40723 51628 34921 8305 62278 35050 -34406 -75332 -54315
19716 -54315 -40387 -22004 40978 99748 26250 -50725 -49781 -22730 32352 -19066 -47917 -65807
19704 -65807 -60163 -78231 -90589 -99294 -17619 19252 -32930 -3797 14219 3296 -52193 -61404
19692 -61404 20195 -80900 -96386 3275 -22880 -65976 -44966 -26888 -50147 -82409 -12659
19681 -12659 90006 83206 -7331 -78825 -91215 -84742 -101844 -87171 -45666 -32126 25596 85650
19669 85650 82814 69073 17493 4399 -25314 -78478 -159846 -156443 -56859 -50988 -67696 -25213
19657 -25213 6765 -19205 -41898 -41791 -75595 -76522 -120324 -64477 -37662 -29618 15927 75613 100624
19644 100624 79179 21900 -7696 14419 -3249 -856 -10599 65594 38819 11063 65367 50493
19632 50493 -37018 -54608 -92128 -132946 -141001 -141075 -119503 -26689 -24307 -34582 -92817 -107248 -86052
19619 -86052 -74275 -123760 -110694 -67346 -56842 -75653 -94313 -71657 -72006 -120732 -134462 -133440
19607 -133440 -125922 -118682 -129821 -117888 -71647 -16878 -23191 -74290 -118545 -131951 -107774 -51732
19595 -51732 -35223 15964 50581 -16033 -66812 -49555 34721 4550 56938 116430 114187 44766
19583 44766 31485 98097 41949 -1195 -4208 -84294 -79152 -67298 -67446 -29242 40446 60003
19571 60003 64034 -10689 -37040 -52525 -25432 -55232 -82487 -21629 38491 93666 97850 59290
19559 59290 36430 23493 -13888 6898 -4744 2333 -24646 -66722 988 53046 4281 -74659
19547 -74659 -157286 -100465 -13217 1017 -107828 -100387 -58010 -82573 -64229 -45087 -22481 18943
19535 18943 67787 49844 -47796 -74118 -68379 -49233 -101130 -105386 -63963 -59819 -150115 -142803
19523 -142803 -143891 -152334 -164893 -118344 -61245 -68711 -165450 -139347 -72847 -38858 -9588 12231
19511 12231 38293 96693 62956 5338 -18191 -10191 -10552 9604 -5803 -50498 -22511 25906
19499 25906 -38763 -73056 -38666 -59812 -41071 1493 -47232 -46935 -71353 -45344 -43505 -64809
19487 -64809 -58259 -113385 -94772 -24765 -13547 -21739 -68091 -36034 51092 25362 -31940 -46044
19475 -46044 -56662 -55699 -71206 -67032 -49248 -35247 -41844 -33980 4139 60779 71180 42824 67206
19462 67206 79587 92927 14147 -52195 -99977 -118949 -44666 -3944 40204 93437 88711 67503
19450 67503 38228 -14053 -37687 -38313 -16253 34722 48183 91652 70193 12477 47597 66066
19438 66066 102048 52981 47329 44547 175 55065 74883 36534 52617 79834 35238 -49115
19426 -49115 -151587 -157223 -146049 -126824 -126962 -17368 24285 -52776 -94526 -35270 -12974 -43873
19414 -43873 -82301 -108336 -73230 -119478 -83989 -3504 58243 68158 57754 37932 18627 52398
19402 52398 65510 53328 29799 43109 26595 21418 -3247 -80334 -98318 -114738 -104247 -15284
19390 -15284 1699 40311 73197 69607 57657 6714 -30731 3832 51177 81716 91213 46379
19378 46379 54575 68759 66591 48723 29638 14440 -17976 10103 32327 87529 105298 123487
19366 123487 118408 -18747 -69404 -63276 -27370 7072 12161 -48158 17609 44329 15007 8133
19354 8133 -65774 -111469 -153964 -115896 -84723 -28087 -22653 -10207 49482 50352 48271 86364 124455
19341 124455 78328 79313 33341 27690 16419 25872 -6803 -25797 321 -8454 -91620 -137076
19329 -137076 -109764 -65146 -22234 2974 -678 -50905 -87773 -45323 -15081 2698 -19682 -71664
19317 -71664 -80171 -99552 -24434 -27140 -46937 -75270 -46695 -13271 -22568 -2043 72395 80211
19305 80211 110320 133107 123548 184345 153517 196047 303083 335081 356690 318714 381375 497061
19293 497061 519356 491503 400645 327305 254358 239531 201733 194376 287146 378049 464920 505230
19281 505230 561543 586547 516495 439809 434789 431408 423207 278916 266462 277331 228921 264974
19269 264974 291562 236676 146069 92375 73668 90372 64822 35764 65072 65917 87687 163530
19257 163530 156879 168323 217546 252899 261383 240385 260637 257783 188066 153593 73868 100881
19245 100881 164728 187980 228809 273934 367900 474561 534690 603646 660479 677716 761382
19234 761382 749442 682387 707437 641305 567839 559489 525254 507027 425956 425848 445184 374276
19222 374276 309716 285595 285428 241367 158222 140159 222541 252995 200052 206599 218940 170956
19210 170956 139794 81122 75508 91827 77087 48939 92379 104907 121621 121781 43608 48283
19198 48283 133916 157450 79107 -27432 -70978 47044 97519 99732 104960 84050 39364 127266
19186 127266 173214 161902 123274 116369 99541 67739 36131 56032 95713 153521 132481 157486
19174 157486 173228 231807 319738 353133 307172 253551 235768 275280 308901 263294 237784
19163 237784 196881 198374 193854 210407 255254 269542 241833 236088 271312 349891 469609 500807
19151 500807 560198 616517 617575 552131 595851 701685 694215 658526 637228 593418 549575 600484
19139 600484 613077 595769 585389 544980 540747 553543 486191 457836 500612 523228 447241 393887
19127 393887 421520 376986 328913 321649 318875 381459 436287 405707 452650 487156 483319 357690
19115 357690 256236 193133 143512 91638 97439 105575 105080 165583 201306 176585 182526 192721
19103 192721 123098 135489 83766 51551 96922 174101 182376 144638 76917 168065 233884 209697
19091 209697 186809 162942 128331 129721 105273 122397 149747 147519 89602 91929 123811 113609
19079 113609 92215 78992 117420 230297 313572 250745 164038 149094 82218 43481 141095
19068 141095 142730 75162 29402 66711 68244 119371 156780 94591 84842 75600 80544 20209
19056 20209 74661 30619 3281 3508 37803 864 46012 20398 12864 81755 135354 155413
19044 155413 180947 165125 113752 85348 58934 62285 49408 91350 130045 147194 99517 69578
19032 69578 41787 25217 59947 61612 197442 278207 242231 256781 237335 287432 230134 95293
19020 95293 69791 60146 81959 124059 194387 200599 156134 152968 145148 82410 114445 104802 115166
19007 115166 147851 135264 106124 101335 6091 47944 107406 113222 142589 144578 132738 59795
18995 59795 66002 115014 159038 152448 188846 221124 145810 177110 225755 229065 282242 265711
18983 265711 236795 211394 179167 196280 162294 112214 154680 243481 259893 232517 200736
18972 200736 161587 196512 249034 168586 108028 22597 -65455 -98238 -1458 45731 42957 -12761
18960 -12761 -115854 -122096 -77722 -58608 -100101 -32115 -25744 6853 72610 81781 161299 151501
18948 151501 83156 67458 79845 80355 66097 84103 165525 157445 110929 72688 46217 56827
18936 56827 119198 100559 108561 81792 89717 93227 64231 17945 44962 73674 66280 72379 96522
18923 96522 105560 11648 -46130 57209 177135 204845 201952 190889 236630 262178 247304 204012
18911 204012 215968 254455 249068 282555 229442 157894 163212 256941 326470 378202 487719 504865
18899 504865 520387 515342 534135 571775 673653 839254 958399 1042912 1253022 1483147 1543338
18888 1543338 1558227 1506141 1429896 1371055 1345508 1250717 1175422 1084739 1012159 1011143 1055692
18877 1055692 1055626 1136812 1287886 1355820 1399295 1338433 1207597 1181545 1246766 1211159 1138209
18866 1138209 1057081 881358 702567 697095 643240 650372 677816 734302 719822 696053 686462
18855 686462 679827 641651 681740 789022 871684 859689 953474 1062274 1063996 1051199 1095025
18844 1095025 1132457 1199045 1262434 1322011 1389881 1421912 1511825 1711239 1799702 1854946 1762197
18833 1762197 1638948 1462585 1394921 1333038 1214369 1177869 1256553 1278250 1262559 1262246 1237558
18822 1237558 1223165 1228844 1282728 1305073 1239077 1232086 1331982 1276605 1204134 1163539 1123492 1135041
18810 1135041 1186512 1166793 1176620 1232725 1204284 1269442 1373737 1412039 1471673 1474275 1461834
18799 1461834 1495621 1641154 1814597 1952177 2104860 2217066 2483831 2898918 3305742 3610129
18789 3610129 3986306 4277033 4536174 4825742 5151712 5846567 7149225 9208218 12141910
18780 12141910 15730406 19151789 21529629 22455801 21550776 19988831 18654067 18139932
18772 18139932 18857493 21035873 25511190 34144018 49270735 72104892 102184058 135050721
18764 135050721 161570228 177029234 176099151 160704595 137865270 114270438 93659197
18757 93659197 77777557 67724398 63203525 63731349 67472197 71254315 72342851 69668226
18749 69668226 62526836 53465295 44730940 37627515 32689316 29514389 27403120 25928466
18741 25928466 24861460 24081020 23543639 23068414 22676695 22288979 21882764 21486531 21086059
18732 21086059 20848807 20797826 21266547 22511256 24924255 29162357 35728393 44390084 53934808
18723 53934808 62078741 66819413 67286663 63741442 59426385 57460048 60346926 69608467
18715 69608467 85947765 108812428 137084567 167006024 191803370 204090087 200641200
18708 200641200 180509163 148344117 115838106 88615783 69796905 58242069 51407007
18701 51407007 47401473 45431775 45171991 46283212 48014013 49183691 48969401 46835717
18693 46835717 42879701 38535370 34496998 31268049 28969069 27350686 26181999 25172435
18685 25172435 24327907 23475978 22571611 21650212 20760605 19936259 19317161 18779994 18212714
18676 18212714 17683269 17237256 16863262 16557769 16250378 15929267 15630395 15429987 15188017
18667 15188017 14908454 14613433 14305063 14087564 13706295 13337605 13111905 12877190 12624052
18658 12624052 12510596 12421738 12393527 12421378 12451819 12322606 12134641 11859172 11579612 11304991
18648 11304991 11047333 10943180 10907793 10975477 11080883 11176525 11118125 10909027 10578153 10235242
18638 10235242 9900829 9526553 9252954 9025419 8790663 8633435 8502783 8368897 8220128
18629 8220128 8151288 8135591 8201086 8285373 8341546 8466743 8670529 8743382 8698200 8520294 8186704
18618 8186704 7741300 7450825 7197128 6969776 6836658 6738574 6727875 6724058 6758489 6757536 6698791
18607 6698791 6623773 6518174 6468558 6421825 6410799 6501182 6590956 6650195 6720356 6766902 6848526
18596 6848526 6836414 6883115 6984577 7070037 7186103 7387924 7632802 7818406 8083784 8396983
18586 8396983 8777833 9343693 9852337 10382298 11091012 11869161 12719612 13671151 14856511
18577 14856511 16526766 18702134 21700878 25965375 31912677 40029167 50453638 62398478
18569 62398478 74279638 84657971 92361295 96767961 98326270 97603795 94685376 89738459
18561 89738459 84741455 82222737 83746754 88703491 95054853 100912234 104788116 105824796
18553 105824796 104070501 99996190 93121227 83110160 71390310 60331531 51295207
18546 51295207 44447571 39330797 35490973 32547852 30204922 28285735 26676646 25273140
18538 25273140 24036051 22900515 21839251 20944139 20127676 19345688 18654227 17975739 17321774
18529 17321774 16758286 16318041 15803802 15261725 14837597 14417210 14003291 13661137 13403250
18520 13403250 13092851 12822133 12505698 12175770 11854070 11559406 11223121 10837832 10519421
18511 10519421 10236526 9946058 9685060 9500903 9234570 9008698 8739691 8478956 8227911
18502 8227911 7913444 7773861 7639357 7527784 7364089 7268604 7154813 7024770 6889250 6892721
18492 6892721 6855925 6802569 6841839 6887619 6891558 6837248 6765469 6664829 6587031 6465337 6339098
18481 6339098 6141017 5962745 5859453 5805350 5806688 5804448 5788802 5827837 5895252 5811677 5701516
18470 5701516 5518014 5324506 5136708 5005700 4812009 4578838 4448818 4423164 4389814 4335266
18460 4335266 4311797 4238242 4224011 4199549 4151297 4092075 4056722 3945556 3924219 3925168 4029386
18449 4029386 4338265 4889300 5520547 6152994 6573378 6826935 6693210 6313742 5846206
18440 5846206 5333992 4849618 4606108 4440711 4371593 4466173 4593270 4723456 4779416 4765291
18430 4765291 4623490 4493658 4388120 4222735 4124942 4015408 3864022 3739034 3715679 3599535
18420 3599535 3518034 3475710 3499995 3505785 3494043 3477748 3466588 3426940 3321505 3235632 3237117
18409 3237117 3180257 3198819 3211845 3357500 3574113 3671578 3713035 3601651 3460978 3364346
18399 3364346 3260932 3260582 3419603 3711945 4185873 4855845 5506514 6095461 6319515 6157139
18389 6157139 5742764 5085096 4318663 3590393 3088194 2846578 2644220 2541889 2542920 2520866
18379 2520866 2508680 2464571 2455992 2459362 2470267 2481837 2457832 2286908 2150695 2076352 2023257
18368 2023257 1903934 1881389 1856491 1801326 1740107 1680957 1685933 1747332 1735613 1760114 1743024
18357 1743024 1709807 1723464 1753995 1754291 1704895 1714832 1731851 1652642 1500963 1463414 1451323 1522074
18345 1522074 1595755 1657396 1674241 1681751 1719540 1681197 1630265 1689624 1679039 1733104 1849037
18334 1849037 1933835 2104319 2294801 2449259 2670990 2814739 2924268 3062288 3079191 3066737
18324 3066737 3036278 2986805 3098035 3310603 3655945 4112819 4690764 5293380 6005455 6860528
18314 6860528 7900552 9231732 11046761 13661209 17549346 23859585 33738385 47472767
18306 47472767 63681550 79612503 92749022 101542474 105180498 104844495 101121593 93944142
18298 93944142 82384487 69237553 58475676 52986591 53917969 61107282 73198557 87607480
18290 87607480 100919187 110936113 115963137 116126861 112546060 105580258 94536657 79347731
18282 79347731 63558956 50294177 41032798 34928115 30955545 28158954 26001906 24339967
18274 24339967 23000720 21751433 20630510 19674039 18798584 17938363 17152596 16533350 15990368
18265 15990368 15440868 15046352 14702409 14334741 13923054 13502690 13102068 12679320 12253550
18256 12253550 11899272 11527426 11139541 10755636 10397138 10056736 9798855 9502207 9175715
18247 9175715 8902649 8685336 8428729 8275414 8102990 7930711 7828357 7740956 7550063 7396135
18237 7396135 7367297 7310711 7186336 7085916 7030699 6902756 6818610 6709151 6528400 6331034
18227 6331034 6116988 5923955 5734187 5528076 5363434 5136253 5032444 4992997 4883030 4800006
18217 4800006 4786454 4719649 4665316 4595046 4436642 4319327 4191800 4111725 4079207 3967065
18207 3967065 3830783 3795863 3825620 3796661 3664462 3586227 3522723 3430825 3318234 3235399 3206819
18196 3206819 3190213 3179019 3223320 3302518 3320425 3378265 3439064 3445572 3417291 3362587 3270289
18185 3270289 3177773 3072133 3024902 2953213 2883478 2932065 3004574 3106915 3199243 3230286 3300564
18174 3300564 3303974 3292259 3297884 3218562 3070739 2852922 2757723 2731395 2662237 2692507 2746686
18163 2746686 2728881 2745577 2715157 2593100 2421761 2406790 2390781 2378460 2331500 2230363 2205676
18152 2205676 2166711 2122894 2123590 2100935 2065416 2053127 2058900 2003850 1921772 1884543 1826575 1807219
18140 1807219 1854350 1882291 1943265 2063879 2133557 2180972 2136287 2138677 2142950 2196458 2170044
18129 2170044 2117474 2061115 2024714 2008972 2027391 2072089 2107456 2274920 2460466 2663048 2886094
18118 2886094 3075661 3276960 3577668 3960215 4441439 5112627 6118959 7812581 10976268
18109 10976268 17401820 30403253 50179833 67237010 77130630 80070270 64202395
18102 64202395 42450178 27761449 19926965 15656349 13079333 11435531 10276883 9315232
18094 9315232 8584647 8046242 7600239 7220702 6902325 6573111 6288128 6037951 5784019
18085 5784019 5494828 5264629 5101999 4996525 4832582 4662850 4601623 4569568 4546258 4474279
18075 4474279 4324842 4200034 4084840 3950303 3882556 3811764 3822261 3826961 3765530 3645870
18065 3645870 3501309 3450706 3339040 3268741 3192524 3135619 3023325 2880888 2852008 2778984
18055 2778984 2721668 2559512 2440585 2333305 2251708 2253394 2255702 2181471 2070729 2027773 1995700
18044 1995700 2005937 1996376 1999620 1883367 1792863 1773579 1717691 1717347 1772211 1783725 1734412 1689638
18032 1689638 1663716 1584587 1510207 1490335 1493109 1450656 1379153 1293718 1283727 1271918 1188367 1135325
18020 1135325 1161829 1194084 1202081 1142821 1087673 1138401 1121742 1001898 929057 912186 922796
18009 922796 938260 894776 954969 948121 911535 888306 895119 798587 732940 743674 741410 776452
17997 776452 866731 889527 916921 875939 830069 814657 823296 792240 785576 832539 929133 962650
17985 962650 976993 952391 896073 962822 1033297 1109454 1229882 1300673 1307105 1339974 1301287
17974 1301287 1277894 1279231 1258665 1204619 1166638 1166769 1225147 1245381 1246623 1262678 1261051 1321575
17962 1321575 1284999 1250875 1111140 1007120 982386 949905 868458 852588 868057 789050 743668
17951 743668 721807 685954 666233 697030 590225 501311 477107 444417 498548 559043 560856
17940 560856 523038 504126 502604 567204 614848 612576 640679 653244 603385 582702 523394 488456
17928 488456 482868 460270 545745 571800 597122 605933 594752 612024 633897 623191 488371 392953
17916 392953 441502 448593 445172 446844 433051 434194 509297 527747 493645 505059 435166 420663
17904 420663 430674 375577 423634 513896 605406 635420 711886 775238 864969 941520 1069961
17893 1069961 1103803 1073430 1042858 1033344 888488 756484 715511 737546 791489 808705 771755
17882 771755 795926 827033 725149 593432 519357 442538 391739 475721 489300 452843 439239
17871 439239 423589 383401 325522 366858 422879 347396 294938 299997 332762 375364 389033 340820
17859 340820 370322 371360 361261 399437 434698 486279 517167 552941 553095 596368 704088 748560
17847 748560 797879 865047 923656 1031732 1143120 1145121 1176936 1218215 1190033 1128869 1076398
17836 1076398 1123347 1185119 1283673 1430434 1750692 2164888 2628730 3085366 3480824 3690130
17826 3690130 3951143 3929830 3664238 3282145 2964315 2643072 2358690 2064098 1783372 1686591
17816 1686591 1719319 1792333 1710956 1627980 1541456 1447913 1311765 1234922 1135689 1061147 1040244
17805 1040244 1001144 999154 933543 821786 747390 737798 697417 639857 626895 620231 672153 701145
17793 701145 663432 721657 820020 940362 1040243 1143655 1235376 1369184 1413839 1411014 1451744
17782 1451744 1497484 1536856 1714644 1943589 2220843 2473159 2821371 3143646 3297643 3328825
17772 3328825 3320390 3252382 2961619 2623271 2324334 2094146 1824294 1547462 1396061 1310009
17762 1310009 1254078 1145906 1164045 1253915 1267785 1213213 1189116 1206954 1233411 1292588 1382763
17751 1382763 1467177 1466996 1567378 1619765 1595501 1627849 1648470 1590525 1538587 1481346 1399832
17740 1399832 1307335 1255960 1203836 1192436 1203362 1198377 1147666 1055466 1042422 1022383 1064776
17729 1064776 1072756 1111499 1008350 975863 1014055 948509 980710 963598 997778 1043637 1097272
17718 1097272 1121093 1137147 1104126 1091237 1204116 1392401 1530639 1637522 1766746 1906584
17708 1906584 2021771 2041006 2103448 2175797 2222068 2220223 2199087 2193522 2215527 2340510 2401172
17697 2401172 2433239 2432743 2508515 2490372 2376442 2244536 2204301 2131053 1942422 1775210 1718415
17686 1718415 1608657 1554624 1561899 1551276 1502885 1441264 1372513 1370491 1339431 1276253 1256271
17675 1256271 1211162 1121255 1097285 1141691 1178428 1224758 1266568 1287114 1221140 1247472 1278183
17664 1278183 1313902 1370903 1374138 1393214 1475412 1616639 1712392 1841660 2043105 2253873 2438790
17653 2438790 2571924 2698391 2831848 2888529 2935638 3004608 3164974 3378974 3621237 4018063
17643 4018063 4655142 5681605 7103486 8890567 10768229 12982615 15361486 17501768
17635 17501768 19182523 20682001 21453513 21339386 21452904 22570933 25152785 30152141
17627 30152141 39262058 52351117 67505623 84994327 104956076 124094770 139197483
17620 139197483 151389876 157823797 152335662 140753239 130247556 120108882 106348812
17613 106348812 92472657 82379575 76456385 72750242 70198507 68323254 66735502 63526460
17605 63526460 58067549 52532130 47862115 43253533 38173038 33561770 30113037 27681049
17597 27681049 25903346 24558300 23549117 22831441 22244498 21790342 21570918 21499426 21661053
17588 21661053 22330641 23724104 26025777 29303504 33121691 37316817 42042497 46977878
17580 46977878 51346103 55032456 58446277 60444897 61826367 64822166 71337227 81246705
17572 81246705 93036278 105410274 118927774 132985313 143199091 148752528 150735692
17565 150735692 147447454 133512359 116178485 101490785 88693611 74617711 61561819
17558 61561819 52650156 47481750 44546585 43080990 42318051 41656898 40838255 39916739 38079665
17549 38079665 35547970 33220085 31162189 28985541 26715589 24742088 23210162 22004131
17541 22004131 21041668 20271331 19636724 19024971 18461530 17870208 17384337 16965179 16549996
17532 16549996 16035364 15546909 15060607 14585198 14162815 13652106 13185241 12861483 12532448
17523 12532448 12212846 11865834 11552501 11293698 11013564 10718408 10476407 10206758 10005919
17514 10005919 9765973 9560259 9405167 9182570 8875624 8680683 8611476 8438243 8202216
17505 8202216 8030050 7833764 7669008 7511116 7447596 7364888 7297948 7312877 7284121 7200897
17495 7200897 7098859 7028086 7014442 6907808 6773334 6677062 6557258 6355499 6235917 6158661
17485 6158661 5981936 5837318 5770221 5745025 5727180 5628239 5479975 5351019 5208769 5047937
17475 5047937 4872858 4773742 4679154 4536870 4402652 4361256 4270338 4225974 4157432 4132007 4135658
17464 4135658 4090848 3984497 3898954 3805577 3795882 3745158 3681912 3604435 3595266 3577466 3514298
17453 3514298 3494117 3427231 3447756 3474734 3426861 3325181 3395274 3492618 3498042 3478964 3518011
17442 3518011 3593583 3631229 3688167 3708307 3723720 3615342 3439577 3232327 3063855 3007592
17432 3007592 2919855 2849681 2712466 2740071 2701007 2705719 2699488 2620115 2552698 2575751 2547893
17421 2547893 2539630 2475198 2331859 2279608 2252372 2194292 2166086 2124062 2052695 1969094 1921158
17410 1921158 1922267 1913932 1919406 1892090 1863451 1896127 1888374 1754643 1615491 1572756 1594135 1680302
17398 1680302 1783390 1784580 1725944 1639073 1557608 1471460 1482067 1505693 1503718 1491208 1437239
17387 1437239 1420268 1366044 1356139 1313154 1272587 1222101 1174063 1139884 1135391 1150835 1149325 1164299
17375 1164299 1249485 1252580 1174876 1136392 1149456 1157503 1201937 1195798 1133040 1155126 1109294 989408
17363 989408 992839 1003011 1008240 941594 958910 964192 913858 885433 860931 926277 969880 1024115
17351 1024115 1065343 1064697 984052 913765 863632 769936 757805 796685 751891 741596 755641 772728
17339 772728 754219 747963 686810 655385 678127 710896 701701 678582 655531 620647 677389 721955
17327 721955 701176 689989 696166 736707 728547 704836 689102 702563 660966 610174 699907 723843
17315 723843 695982 639590 554685 544964 555471 533564 503707 521894 422768 400035 435678 484555
17303 484555 464383 450667 423034 446464 441008 397158 351968 347491 382471 409050 338340 293355
17291 293355 286410 275352 272569 324928 340020 253823 217391 309087 394519 423524 407592 413227
17279 413227 402387 378196 360691 350030 345150 320556 290243 257058 221877 336041 372432
17268 372432 347859 373741 302884 277534 203188 235659 322377 341880 345032 295061 333023 370805
17256 370805 408242 394589 440582 446629 398529 392852 334576 284364 279011 309119 308033 327192
17244 327192 361296 358215 292231 297444 307280 272353 284018 254303 228538 124340 134959 203888
17232 203888 284679 293262 233200 190916 211475 302699 331580 329727 387543 491134 525462 495638
17220 495638 485430 419449 428260 560803 662478 787781 850049 1014154 1130830 1251133
17210 1251133 1466619 1740640 1854459 1869645 1748561 1568092 1524297 1499963 1310758 1130224
17200 1130224 959810 882825 828788 906019 910877 862544 770354 759461 710207 622467 538227
17189 538227 513233 447222 414266 389658 336960 285601 286126 264211 299118 392461 445026 446834
17177 446834 426548 445900 433430 416787 496569 561173 552353 634644 697811 720493 805207 912970
17165 912970 952490 1010264 1048142 1203582 1365158 1457517 1538968 1626111 1718475 1898420 1935607
17154 1935607 2016133 1973808 1909089 1916032 1975050 2114396 2202862 2186039 2058694 2001211 2008106
17143 2008106 2092057 2115106 2130309 2112670 2032650 1889831 1796074 1766913 1797001 1730643 1547696
17132 1547696 1403705 1315395 1203312 1173694 1181180 1249525 1162541 1137640 1286348 1371991 1403622
17121 1403622 1564340 1623894 1552748 1459221 1334095 1271138 1264712 1228918 1251223 1276252 1255076
17110 1255076 1311756 1429568 1544859 1586213 1589379 1572374 1583302 1551606 1458823 1414013 1434501
17099 1434501 1441524 1476785 1573655 1661034 1702593 1862014 2017832 2018520 1860172 1741658 1823536
17088 1823536 1855042 1826762 1768802 1613211 1388142 1180042 1028424 998182 972155 900404
17078 900404 810710 781246 810322 822378 779656 710687 715994 730007 780187 804717 892662 982183
17066 982183 935060 941828 969618 914847 919708 883626 813328 714195 675218 659091 637879 592626
17054 592626 672321 780432 865897 866851 936428 947390 946795 908319 767782 710243 698822 613893
17042 613893 517477 471648 407415 394420 353180 352900 334262 365837 329666 343825 356445 306089
17030 306089 336117 379365 393406 371579 331117 345329 307620 222035 179635 227859 267468
17019 267468 264269 290920 320744 363271 344570 232637 232492 269804 274437 277826 333473 316824
17007 316824 309930 249993 197869 236519 175635 182690 203580 214338 250797 245491 247357 249940
16995 249940 176627 119296 107322 141758 116874 119202 147848 181577 175706 177385 209783 212743
16983 212743 126262 144630 134080 146720 177995 140720 162403 147572 171739 181407 199577 147810
16971 147810 130230 143660 123782 23568 -32634 22707 118153 183564 191899 204592 235878
16960 235878 195979 185743 234505 192603 113723 104700 138166 149717 164022 172582 137712 103016
16948 103016 114538 166680 228099 242944 234522 166967 158995 204856 112714 47195 20961 -6386
16936 -6386 -6358 91212 143733 89804 111982 102168 103731 86638 67879 3955 69987 215369 261595
16923 261595 237681 175640 92531 89512 100278 45885 14090 13273 51519 45809 53336 86333
16911 86333 110976 166849 115713 35065 -3021 32940 81227 82547 71022 75086 76248 91074
16899 91074 104370 130061 137300 144710 88330 1355 36027 109235 46624 54564 46964 47915 62963
16886 62963 44392 30601 36440 54975 47179 -8623 -12963 80689 119546 157818 113591 181272
16874 181272 190080 92209 129510 120448 100376 129319 56166 70686 111119 137380 199952 174369
16862 174369 101758 55447 34367 2686 13040 67624 75548 60792 99389 52826 63528 124457
16850 124457 139360 169984 176365 185611 189569 180361 177156 229981 211981 136637 154447 183601
16838 183601 183322 125437 90716 63965 40833 54700 54406 120098 136026 178491 182957 164636
16826 164636 166818 157983 76844 49524 41083 97373 132552 139416 109013 119971 91304 69394
16814 69394 1077 12956 21699 20010 21749 11293 -11382 -75838 -43948 21757 22207 34556 -12767
16801 -12767 -59766 -7238 15773 -42575 -131754 -171752 -132276 -58817 -75996 -41942 71402
16790 71402 125043 113237 87176 83025 23739 14070 -18317 32558 85209 49936 10385 -2227
16778 -2227 63953 94036 89114 28899 46820 77590 94152 122884 63923 53046 69081 89120
16766 89120 144240 102181 65923 109998 150029 153192 141390 153250 170219 179838 85577 -50261
16754 -50261 -25423 105153 167440 144538 152717 203997 172434 101513 78723 66895 58453 -975
16742 -975 -18804 -6175 31392 116026 190808 136834 150589 203898 179733 155285 146730 128114
16730 128114 87658 65438 57510 63383 131673 110849 130197 154693 128108 72920 39473 79524
16718 79524 89809 79895 126739 228518 231168 247702 266767 255877 286718 309492 363908 360984
16706 360984 452112 544120 590757 594094 604102 534076 439451 486810 516719 540220 635975 821635
16694 821635 957513 1034951 1087371 1189848 1249234 1257938 1257819 1208960 1194237 1187035 1119649 1149169
16682 1149169 1298048 1359495 1349876 1391748 1487389 1508306 1449062 1488555 1452659 1413591 1312710
16671 1312710 1236288 1206258 1173562 1165756 1112754 1058288 979483 913810 918528 946928 991680 1001341
16659 1001341 923622 886925 835636 825480 819951 794712 878401 825670 800325 753879 685521
16648 685521 686697 689297 695842 757606 769957 752149 735745 820258 871081 806580 822206 827317
16636 827317 808366 785681 746485 746159 798131 704542 707805 791934 821843 883458 939576 914755
16624 914755 824987 731010 751125 709187 716617 809781 819125 815226 831523 814890 827732 917503
16612 917503 1014084 1073353 1190195 1327666 1483115 1691740 1970529 2252073 2469820 2484119
16602 2484119 2411237 2271864 2133055 2107746 2238250 2453637 2835800 3319361 3850416 4387871
16592 4387871 4990102 5537506 5989881 6300184 6621631 7114430 7962884 9462990 11882777
16583 11882777 15678730 21834833 31832506 46021649 61084230 72356691 77214645 72675439
16575 72675439 59957971 47088242 38874948 35530384 36281474 41315813 51705113 68048938
16567 68048938 88110663 108574229 126030520 133052053 127360232 114143973 95252389
16560 95252389 75076284 59565201 50176590 45577173 44802950 48179101 56454224 68401093
16552 68401093 79505015 85973983 85292415 74969326 59633391 46457296 37517837 31833845
16544 31833845 28081208 25314773 23083199 21280011 19979609 18915263 18086662 17454540
16536 17454540 16928231 16406631 15901513 15358026 14711170 14121973 13552466 13032169 12565200
16527 12565200 12173424 11742979 11352055 10980407 10634709 10352149 10085197 9843763 9533650
16518 9533650 9184806 8853583 8619102 8425508 8186880 7949945 7750809 7593757 7352467
16509 7352467 7137061 6993485 6822150 6638912 6544503 6316669 6124276 5923619 5783392 5651680
16499 5651680 5513795 5409417 5257651 5159344 5026559 4941357 4820182 4736190 4642932 4575845
16489 4575845 4469436 4331600 4311117 4272233 4228347 4104608 4064062 4045572 4017271 3951905 3804685
16478 3804685 3668890 3576885 3493476 3456118 3388677 3258821 3196405 3164492 3104204 3128890 3138060
16467 3138060 3117497 3047280 2983388 2935980 2889765 2882221 2791738 2682972 2615590 2618265 2519093
16456 2519093 2510744 2534617 2522304 2537924 2504269 2450682 2448122 2401497 2375659 2428477 2476523 2455317
16444 2455317 2479488 2506122 2516877 2497201 2462779 2453887 2395057 2304349 2244305 2252182 2235953 2134263
16432 2134263 2032895 2034710 2009861 2021034 2065212 2078552 2098680 2106725 2029614 1957437 1974950
16421 1974950 1984804 1923429 1801030 1721719 1607532 1511763 1521497 1505465 1515636 1477121 1446163
16410 1446163 1430712 1435174 1456997 1425095 1427933 1369594 1229641 1178757 1182148 1212437 1203576 1100312
16398 1100312 1050460 1056949 1099018 1095406 1061592 1049507 1014361 1002223 1014817 1066698 997182 923407
16386 923407 964057 919719 788902 738288 681078 687504 711888 712763 704464 688795 681413 711653
16374 711653 694839 713796 766098 769359 795355 845590 702487 683255 686376 623450 609397 594419
16362 594419 585822 589096 581962 573478 603881 610110 593139 619481 607287 574816 598259 567936
16350 567936 485780 442954 398912 455135 456437 502228 571507 521381 480672 500599 432243 378997
16338 378997 426569 479423 517082 621599 674708 574984 495581 494025 496989 469518 461033 480422
16326 480422 518525 535678 530260 490545 525584 516123 489404 489868 504240 487525 459802 408017
16314 408017 377844 251897 238461 358877 384596 446634 528348 517883 387162 360415 283712
16303 283712 196484 158252 231900 244560 252570 280649 269463 324237 317409 305950 245536 250870
16291 250870 216231 120121 81578 40462 72942 164460 180076 170787 168667 150734 131030 109289
16279 109289 114946 151077 161633 207993 205200 169466 168840 249756 251137 166886 139978 184970
16267 184970 244398 164397 53632 -12619 -17255 67167 100152 86361 117021 103417 178667
16256 178667 177064 137356 123198 113191 115472 72039 33610 58383 119916 132109 149405 76706
16244 76706 4947 50986 26050 26283 46025 87078 114464 60604 -15215 59770 39984 57128
16232 57128 63229 85884 160973 145076 102818 101751 67303 64746 31086 6229 55350 89683
16220 89683 111023 75808 81091 98639 87573 -11111 -41125 -11126 4683 55093 101426 21959
16208 21959 47045 96446 17132 -79774 -31997 -20662 24452 129011 135884 102432 146285 142390
16196 142390 152744 187382 106184 78457 62076 99636 33909 -5938 50882 71131 61945 80278
16184 80278 180149 141071 59253 54914 123723 136360 86349 -3516 18795 88213 94125 77129
16172 77129 95486 128929 186006 119953 25544 -1831 6064 82833 33956 35226 36321 18100
16160 18100 29204 100734 106141 143117 140121 74088 25994 -1925 -70221 -74192 -14767 8408
16148 8408 -48225 -109038 -95977 -61019 -36925 57435 91016 101639 140658 25764 -9836 -51188
16136 -51188 -19706 28575 -10236 27722 6975 -37007 -52156 28768 22285 34414 25131 -21745
16124 -21745 -22238 71565 98720 44920 -59581 -87506 34849 26271 41210 53648 51672 37528
16112 37528 34638 -23224 -92923 -120998 -70554 -81245 -81148 -58313 -15546 48925 51610 -35442 -67496
16099 -67496 -48796 47332 31090 -43418 -75584 -24971 3944 661 34160 93029 76790 40199
16087 40199 101004 129090 128052 31374 4132 -23483 13596 39207 52531 66400 75991 157175
16075 157175 162593 19597 -44334 -1570 17062 29266 -19955 -29025 -17175 -10218 -32081 -32811
16063 -32811 11178 54241 21664 66407 37634 75006 19467 11826 45081 57470 57072 13570
16051 13570 -15092 14273 7009 29000 8110 28758 -7064 -4010 52808 44800 42988 18445
16039 18445 -43485 -47430 -9613 26648 96300 60444 11476 14858 -23935 33217 53144 -8312
16027 -8312 10522 36092 69812 127001 122621 94574 76660 41013 130126 206183 258317 342054
16015 342054 429077 460082 423270 344238 294353 257508 212374 194424 259286 325507 388339
16004 388339 425612 553917 681886 805972 773938 705145 588075 419278 339440 390882
15994 390882 454488 391280 431188 473609 469106 517399 611809 582891 444506 319358 224098
15983 224098 267295 252363 198718 189100 139082 104831 123740 85792 132389 206393 236829 200204
15971 200204 124205 119039 109445 94388 11248 -7448 -6784 -17964 -8660 -7646 10071 21521 52870
15958 52870 75513 65619 23763 90072 137662 109549 40730 -2456 23696 29526 45612 24097
15946 24097 25305 5471 -47866 4051 35653 80310 80552 77734 69936 57502 55172 -54179 -10951
15933 -10951 31960 -3933 -69767 -56610 -47798 -14681 52848 76832 38754 5185 -21956 35771
15921 35771 46094 67437 76641 108041 146955 136634 68092 55673 101285 78497 41772 -415
15909 -415 -7508 -32516 -94202 -105718 -114992 -50372 -52906 -54036 48948 82106 12855 -43855 -5165
15896 -5165 428 35586 -12038 10728 65696 29184 35068 14657 41592 117131 146068 89567
15884 89567 43665 -50158 -4893 15527 6598 66471 70882 27108 91010 41633 60259 67832
15872 67832 107874 152739 103786 48641 45824 42843 15517 -10100 -15231 -30240 -58743 -5660
15860 -5660 -4145 11954 -549 14022 70573 81355 26805 -38959 -1976 33994 62149 63271
15848 63271 40451 91531 106146 65270 61197 53400 42285 85210 120164 92603 53876 78263
15836 78263 40902 -30059 -88797 -102887 -117181 -48854 4046 -44373 -65566 -72332 -15988 18102
15824 18102 29246 24204 7690 -21879 -6986 -20106 -12118 -6159 -5869 33259 29741 69858 147609
15811 147609 114414 46732 53631 48434 20078 7802 -17974 -45513 -32373 11885 21755 55455
15799 55455 -18209 -69705 -50321 31694 2373 16335 -11144 3261 35116 15717 -7303 -9528
15787 -9528 40793 42307 66634 85277 65126 24493 29989 28194 -11500 -31384 -72779 -23216
15775 -23216 -35098 -52630 -91995 -32611 33240 62395 102267 64519 53578 11687 36434 77735
15763 77735 136938 78254 -75138 -67850 -55573 -4738 2612 23930 19593 49897 103025 161091
15751 161091 176805 78416 62908 46051 36990 -28293 -30583 36297 32274 55558 34170 -33861
15739 -33861 -54198 10918 41509 38917 -22538 -16363 3475 50289 53335 5443 5956 10142 -21370
15726 -21370 4877 31846 67766 69103 49240 55013 121857 84222 -1176 -30129 -71592 -73185
15714 -73185 -53990 -37484 -18752 -2313 12461 -12800 -24186 -23762 23789 -4198 -37619 -31848
15702 -31848 -40124 -64391 -14617 24762 62769 -30110 -26830 38977 64987 55433 33367 23640
15690 23640 46579 60194 20761 15176 50603 101454 70498 18619 -27039 12649 24580 -46671
15678 -46671 -56057 -38016 10065 -14735 33275 59083 83594 150333 171730 109290 58306 57689
15666 57689 27294 21895 -26549 -2267 31726 71722 85965 86540 37966 11264 522 -65836
15654 -65836 -71862 -20536 52918 97326 76889 30457 -20107 15607 49228 49346 14184 119014
15642 119014 123538 97425 61876 55354 86421 104523 132882 89416 -7486 -44241 -46661 12128
15630 12128 45017 8678 24023 45063 44673 -13910 -53943 -124363 -105079 -13359 31890 -40885
15618 -40885 -70442 -15541 33513 88981 83013 114859 114471 36637 18043 -8011 27668 114534
15606 114534 128579 122699 22852 18199 21794 30619 81644 154509 125839 47864 -32659 -15764
15594 -15764 3204 36080 63032 56892 18903 59210 48696 28177 40328 78654 86134 10731
15582 10731 73389 123838 94563 42487 26870 51629 28310 54444 48713 8334 -16602 -33231
15570 -33231 -19199 45768 73130 79844 43952 38463 -41064 -80006 -52004 -59987 -42612 -44047
15558 -44047 -13846 -44157 12944 25632 -21230 21553 21732 26744 50165 44584 -57210 -64952
15546 -64952 -3799 50251 102671 132030 90451 43978 -60616 -96577 -144662 -116540 5169
15535 5169 137168 184508 86528 -36047 -24961 14334 -54 10186 -19359 246 27707
15524 27707 18207 10084 28883 88446 116453 82589 55291 31565 -72908 -31185 36385 75526
15512 75526 111473 120369 91078 105935 73641 3163 46151 71017 81419 -786 -93913 -91123
15500 -91123 32622 25969 63323 48502 -13319 -25361 -28092 14456 13931 -32294 -39337 -84361
15488 -84361 -200677 -176532 -78106 14762 67353 14094 -68551 -76774 34597 111360 194382
15477 194382 100975 -13301 -12 52660 96574 68558 34511 -6662 15992 -1623 -17986
15466 -17986 -43092 -51833 -51873 -8773 61275 121241 151913 149021 76728 27334 -42543 -32587 6105
15453 6105 -42530 -57814 -64948 -86876 -20875 64783 96324 15247 -21487 -49293 -774 17995
15441 17995 20037 53072 38695 44137 94488 87301 104279 74321 49137 75896 150383 174934
15429 174934 121920 103251 83588 81842 62082 19498 108915 210571 143721 101775 106475 63023
15417 63023 17639 65418 106090 77954 109365 199231 176659 78842 99260 127931 51366 -33639
15405 -33639 -5197 24819 51849 67981 69591 102615 97242 97870 119854 191327 209379 171747
15393 171747 138071 118402 148755 195065 255469 320751 314386 278155 276681 336774 402680 531454
15381 531454 728246 946666 1206077 1466088 1578196 1719814 1754297 1780509 1831438 1836706
15371 1836706 1726637 1572411 1436322 1179555 945457 719697 617456 545415 554021 549298
15361 549298 504878 439663 449686 474117 443944 379162 422698 448672 383955 307866 259543
15350 259543 216952 155684 179732 269185 250612 219127 253113 256207 269977 296454 272671 259226
15338 259226 282754 290358 240524 170410 193178 192097 105292 96720 73561 115153 38949 48501
15326 48501 103901 94096 167807 170853 101189 93128 43069 -2841 62650 181055 182826 122579
15314 122579 187122 226590 237435 186000 73616 69675 64834 88214 144299 81785 10491 20390
15302 20390 37612 88649 77936 135821 137442 44495 54873 49053 7582 64249 44887 34064
15290 34064 36512 71636 26535 22106 96414 147072 148071 146641 89842 68075 105979 125158 158081
15277 158081 138150 71012 88714 132796 156725 182326 255943 219076 163672 137391 108668
15266 108668 130969 132984 108663 55151 37905 21955 56448 108534 91363 60974 104664 136545
15254 136545 128303 96060 46679 16020 101207 125528 97539 109393 179245 222074 211166 191239
15242 191239 173195 114714 94863 142792 91331 64041 36860 62605 92601 131169 111369
15231 111369 131421 129109 87295 149138 160802 149688 149639 179879 201928 213440 218654 215444 168407
15218 168407 151147 157906 144137 181881 225423 275052 243624 242227 254509 285169 296293 297909
15206 297909 281907 344045 339452 399224 403662 404676 432871 452473 415642 375079 239990 235490
15194 235490 231777 228261 176106 132757 83307 28535 6756 17117 67195 17736 -23199 -68711
15182 -68711 -56792 16660 42179 105737 87356 53358 69826 80488 28300 -5531 -17671 29814
15170 29814 68751 6268 -91276 -96112 -48853 -64141 -64803 -66040 -64058 -94588 -77275 17641 116491
15157 116491 88440 23815 -5130 -24744 -73018 -133222 -138531 -138822 -191642 -131616 1663 30792
15145 30792 62695 162551 141837 186404 291141 306909 354308 318682 297434 273763 220457
15134 220457 166709 78837 76557 134083 171098 151144 151793 116382 131945 157423 168317 213988
15122 213988 224596 217933 268360 313759 317101 305385 319186 310007 228841 224370 239757 235147
15110 235147 219109 223221 178637 173515 265156 276950 305105 315664 261100 209528 192174 215804
15098 215804 187396 176424 159489 168294 206553 185154 152198 119872 228471 325211 369021
15087 369021 343355 269917 281594 311310 343961 377074 445313 498524 522296 449332 464950
15076 464950 526172 581925 587859 619516 660703 849779 987140 1105790 1207393 1401834 1708747
15065 1708747 1971666 2136663 2149249 2172495 2247423 2221794 2180815 2077431 1905051 1814253
15055 1814253 1693440 1633723 1552865 1456098 1346006 1271056 1201950 1184591 1184549 1147968 1037898
15044 1037898 945408 934161 1055761 1085376 1009556 960685 901454 862742 904122 977786 989597
15033 989597 1012153 985836 979090 1049348 1015337 999121 1011916 1048661 1044748 995373 924964 963704
15021 963704 1073102 1132631 1044989 1055694 1052625 988877 975177 1037990 995571 978665 1032762
15010 1032762 1058839 1058761 1056030 1073520 1102535 1087247 1101213 1099728 1132803 1145664 1143305 1231620
14998 1231620 1241997 1219394 1195978 1225635 1224351 1286440 1279072 1328924 1279881 1230153 1222144 1211716
14986 1211716 1213699 1290313 1383665 1489314 1563566 1545798 1547741 1555264 1622814 1726891 1781298
14975 1781298 1900236 1972623 2096406 2240746 2325662 2528256 2721910 2990173 3322529 3769669
14965 3769669 4234688 4782762 5521332 6565475 7747897 9124860 10660835 12286674 13947450
14956 13947450 15702468 17418231 19013474 20660027 22334272 24149889 26366078 28998045
14948 28998045 32395149 37444192 45264352 57568737 75941120 101653996 134808822
14941 134808822 173925949 216653922 259635946 299599892 332335872 354311793 362518221
14934 362518221 355817152 335744644 305486441 269498352 230972804 193203876 158848818
14927 158848818 130094045 107799170 91865492 80911749 73115964 67226606 62451776
14920 62451776 58368652 54752024 51430812 48295214 45405438 42755429 40379223 38174006
14912 38174006 36226438 34466469 32968595 31610464 30355615 29248896 28255212 27360103
14904 27360103 26478664 25644713 24888089 24204721 23488555 22776666 22110847 21467222 20838082
14895 20838082 20309098 19666624 19092969 18612958 18149014 17651085 17173743 16680893 16241581
14886 16241581 15777396 15417506 15094221 14715341 14293968 13972864 13588873 13180008 12825859
14877 12825859 12466746 12152505 11808037 11429596 11111212 10851328 10637114 10485977 10293178
14868 10293178 10101558 9900406 9652658 9416394 9181297 8996294 8853506 8646612 8510738
14859 8510738 8367056 8227138 8053421 7844494 7724979 7614273 7470082 7316710 7178864
14850 7178864 7071136 6942748 6805865 6693512 6534880 6413808 6341256 6262578 6117521 6005685
14840 6005685 5874180 5740447 5611774 5488966 5424363 5341402 5232473 5094317 4954551 4882337
14830 4882337 4859011 4819203 4768221 4699945 4612693 4434028 4308815 4236010 4244732 4286623 4252179
14819 4252179 4283922 4378010 4471359 4571611 4663932 4751319 4760288 4863391 4966251 5004112 5050506
14808 5050506 5144763 5101226 5011937 4875658 4741417 4622938 4488649 4380740 4365198 4227507
14798 4227507 4083855 4026802 3935236 3825561 3745532 3628366 3539172 3438238 3379816 3317801
14788 3317801 3264508 3254254 3187441 3146167 3005245 2888125 2838522 2758502 2685769 2665902 2617925
14777 2617925 2579012 2507473 2540668 2590429 2522329 2518398 2506467 2426175 2340197 2232733 2163962
14766 2163962 2124091 2092354 2009676 1893090 1829245 1845605 1725678 1629006 1663339 1668400 1616472
14755 1616472 1490528 1423066 1426161 1427718 1412408 1362527 1340402 1272165 1239743 1251018 1320061
14744 1320061 1359842 1425483 1421605 1387549 1329409 1268984 1233808 1171049 1136234 1089141 1039898
14733 1039898 1000447 997872 981571 984842 993517 1006836 1010084 999894 1074459 1129321 1128523 1076326
14721 1076326 1062296 1098887 1132681 1153014 1173402 1250921 1204159 1099686 980119 936336 910481
14710 910481 901681 887249 933399 941556 916198 856094 805211 798176 891181 960975 899455 883931
14698 883931 915448 917410 859449 820125 841972 827171 787657 794294 794019 820166 817975 826454 871224
14685 871224 899933 904813 848870 864804 860050 781444 696587 615306 565746 519545 422413 426937
14673 426937 404694 378465 397770 364029 313365 326028 341287 302897 229679 310715 369729
14662 369729 365900 391875 427135 362055 250231 200077 203834 205891 250978 287935 315282 321694
14650 321694 324216 292151 323143 344029 313932 258830 241037 235795 236369 206841 263220 264722
14638 264722 272825 286825 271254 236936 230478 216985 170833 177829 210943 188739 188300 155628
14626 155628 111484 92216 128412 184665 221781 192699 165154 152207 158515 153018 171680 186852
14614 186852 122802 132298 199051 181519 129609 142696 114487 82676 90936 96147 145761 158689
14602 158689 131995 169108 61054 63335 142694 191568 102968 42210 139796 180448 139776
14591 139776 213773 260907 248417 274027 214083 177111 143333 106307 122253 111152 53615
14580 53615 80085 168478 228328 215549 145678 53739 75738 125231 71041 91118 189840 150683
14568 150683 132213 133545 122587 105788 74617 62584 80077 136797 137109 50694 65034 50414
14556 50414 49475 26998 30145 21710 68404 128914 137567 81397 52572 -16516 -23681 -41555 -65921
14543 -65921 -38069 -42154 -76589 -54367 55855 37215 13699 36355 91274 62362 46225 69604
14531 69604 148454 118583 26278 51446 54591 32484 74366 15301 -11515 34616 102449 65605
14519 65605 66156 16563 42530 88046 75836 68393 62037 56625 129034 149300 117154 105822 137873
14506 137873 173153 105153 45377 74618 157080 258030 313738 446789 631756 795460 946642
14495 946642 1103744 1350579 1533601 1708288 1789361 1861670 1826089 1700298 1567675 1478016
14485 1478016 1230892 1045329 815321 634095 540340 477326 403698 394821 358617 302051 225075
14474 225075 210048 200611 167767 184702 211731 218846 187579 254652 250124 188221 153234 145789
14462 145789 155242 190452 239692 237679 223480 266726 181046 152336 159014 96218 78812 81201
14450 81201 88509 107706 121644 50443 33368 2237 6227 57932 121045 151393 148686 128468
14438 128468 119367 154097 186350 204408 139628 123590 93405 68594 5328 -10583 668 -23382
14426 -23382 -15335 7746 -15616 6074 -27094 -146683 -128065 -52292 -56873 -67231 -67895 5269
14414 5269 78025 89551 66786 -17 -9284 92654 55425 22179 51626 54459 25068 58179
14402 58179 68249 46701 36243 41714 81978 39417 31765 47351 17247 39804 49371 11116
14390 11116 96109 170793 130589 131252 64386 48824 21328 7909 19782 -29455 -50053 -47672
14378 -47672 31268 95692 173142 132947 73666 64485 107834 123001 62289 -37677 -56365 -78629
14366 -78629 -123396 -62906 -73610 -72490 4416 30443 -27649 -15767 -930 28032 -16250 -9771
14354 -9771 -50135 -61419 -58388 -67614 -86612 -43483 -2602 13066 -20782 -7066 9403 -37194
14342 -37194 -62542 -36256 -69784 -71116 -48629 -73616 -115361 -60853 -69971 -113883 -54547 -39712
14330 -39712 -24972 -21775 18841 -36288 -45022 -56190 -22982 -15051 1435 -1247 28866 61503
14318 61503 6086 -3164 -38256 -20852 -29901 -35153 -68894 -73074 24939 51073 47445 -6218 85100
14305 85100 86188 36967 -42532 -91497 -34475 -14296 -35782 52462 49042 -25080 6648 16488
14293 16488 53840 32330 -88062 -148549 -102038 -82863 -37274 12112 -7086 -10298 50961 21484
14281 21484 34669 53888 80335 9149 -68860 -69167 -92725 -59241 9984 42421 71795 36797
14269 36797 -45602 -69340 -71515 -66579 -19902 -7534 -15785 -3365 -30778 -53333 -8914 -2341
14257 -2341 -1045 -50187 -29795 -61036 -73716 -94053 -7714 30117 7013 -34196 17516 112315
14245 112315 77138 46303 -10085 -36278 -49341 -1079 34310 26100 43781 -6307 -8998 10831
14233 10831 940 -3167 -65403 -182185 -249920 -229886 -178605 -78866 -14652 6912 -5513 4281
14221 4281 28816 -12523 -79420 -78784 -9870 -24340 3222 -12803 -53403 -86088 -96712 -97744
14209 -97744 -107836 -172463 -202510 -140283 -60712 -63422 -30051 31920 47505 46473 71852 17962
14197 17962 -34545 -33736 -63475 -63395 -86519 -131663 -80364 -46875 -12086 56702 35421 37569 -15998
14184 -15998 -63723 -105669 -88798 -121219 -108464 -65889 -42347 -33540 39492 67905 -24547 26313
14172 26313 95712 83941 99433 147285 106563 7731 -25000 7781 43662 52417 -55164 -139256
14160 -139256 -68571 31608 92412 68093 75167 74724 17935 -1875 -3390 -7408 -345 54116
14148 54116 9411 -62543 -45390 -98575 -116587 -93824 -89409 -75791 -53439 -56865 -78702 -127332
14136 -127332 -114678 -76607 -58142 -84293 -45436 45345 51926 37769 25674 39649 3565 -4357
14124 -4357 38280 51491 23211 -31402 -57937 -15972 -17304 46466 92036 56631 10010 69258
14112 69258 -26599 -40713 -37275 -2140 89982 128397 54642 -6472 -17598 -5405 -45934 -85113
14100 -85113 -55651 250 46013 29660 -5323 -7708 -45494 -35106 30369 21759 -60238 -91849
14088 -91849 -14018 3485 64864 90155 38795 33858 -84431 -157557 -112224 -23838 -7238 24581
14076 24581 28204 53051 29284 -18008 -27559 -24408 -33920 -53434 -14114 -786 -10680 -27737 -70480
14063 -70480 -89263 -57597 10006 51616 58310 27798 -3365 -72177 -105645 -92661 -34492 28983
14051 28983 80405 69243 -6884 -94610 -108534 -11190 26723 -25208 -39262 19865 101218 29956
14039 29956 -52536 -66366 -11247 39543 84443 67043 24180 -3542 -21983 42474 150093
14028 150093 138027 108967 109033 -4426 -83232 -101029 -77769 -132232 -131092 -91087 -132962 -61108
14016 -61108 3679 -827 -32319 -54507 1528 13262 12666 -29319 34728 36671 -21613 -55153
14004 -55153 -1812 -16458 -14896 1016 62717 53229 29970 5592 2224 -4702 24892 90869
13992 90869 80300 55602 57642 66888 113337 92237 -16771 -47831 -28850 8111 2718 4206
13980 4206 -17715 -47230 -40297 -61491 22614 59473 44976 -17971 -53567 29349 65608 49241
13968 49241 1606 -9132 48278 79299 68306 123536 166127 134494 154801 216468 289352 435510
13956 435510 606937 810369 925685 1004872 1117847 1225992 1261527 1189036 1031127 925622
13946 925622 822788 752337 661330 532595 475903 361353 269637 232687 234471 229925 188844
13935 188844 176600 190802 204129 163532 153294 105675 114248 153492 145661 73603 55235 95620
13923 95620 120976 97346 53361 46102 70954 77546 34809 73361 39303 -4331 -50103 -23188
13911 -23188 3875 26788 45912 108908 128490 95062 -9873 -9769 20141 83442 119272 97688
13899 97688 54625 -8859 24859 85722 91248 128607 133113 154454 56727 7345 51206 24870
13887 24870 -55560 -4516 -1805 -21680 -19794 4833 33786 53200 6923 -31088 -14783 -19759
13875 -19759 -47851 -29802 27093 30474 3961 -28156 5739 -11431 55290 79791 21082 -8939
13863 -8939 25485 117887 148602 170678 181292 141097 144166 189757 209514 186883 186375 89800
13851 89800 -23455 62786 52997 63320 45176 27247 35284 104071 141216 117695 92625 50671
13839 50671 41130 66617 8731 -68828 -95661 -88178 -31203 -28500 -27596 -24256 -51147 -55601 -60125
13826 -60125 -89191 -99716 -69031 -27578 8056 7698 -16060 45410 78847 30368 8240 29587
13814 29587 18623 -24601 -45524 -54756 -37580 -13670 -11297 -79651 -108161 -69725 -61248 -97447
13802 -97447 -69468 14188 31755 24888 7510 74795 78598 83042 67966 50090 103537 109809
13790 109809 113644 79787 97792 124228 72336 69925 58718 67855 82105 43996 -5603 -5173
13778 -5173 -6841 37790 89662 149566 124425 107117 125908 111893 22211 -12580 -70620 -108389
13766 -108389 -18322 30732 16017 33276 -12655 3741 19766 26524 25815 25905 21601 67776 55571
13753 55571 -4931 15349 30090 7408 -6935 -29486 -73575 36665 68060 29260 70833
13742 70833 23835 -42055 -16889 3027 -54801 -28795 42675 41145 102672 120337 106474 24689
13730 24689 -77369 -119317 -145588 -76492 8334 67692 47493 -25168 -9891 16752 50318
13719 50318 151388 179578 193555 115873 84941 124291 137451 108243 53172 53862 76398 110601
13707 110601 74604 -16755 -44605 -9664 45401 65006 70166 78090 4678 -21474 -4266 -78186
13695 -78186 -116684 -46739 45323 45183 5987 40333 28265 40329 41210 12827 45548 46607 65344
13682 65344 77425 79967 91435 111089 116644 106302 68928 18564 42660 22808 -12464 -51703
13670 -51703 7540 36370 49988 66076 37917 -6817 -67411 -97562 -19137 72884 159080 138028
13658 138028 86760 82293 138420 111009 36850 1934 56126 149365 183802 171979 168106 194672
13646 194672 219471 212759 154402 110796 78735 83891 65130 98231 95332 159830 161289 83623
13634 83623 90309 155978 106155 79581 124373 124950 190746 205965 151630 95460 47956 37194
13622 37194 94587 79235 53012 25690 960 -12362 -5376 27909 44103 -4941 465 40763
13610 40763 86203 155519 241971 293526 287912 209249 223182 289130 279528 212033 136420 104433
13598 104433 107812 67220 102678 159646 200176 232664 222919 226948 172930 196166 166904 194403
13586 194403 239280 216735 144173 103431 99823 139219 103876 24775 6754 20946 46417 62724
13574 62724 47247 93008 127966 85331 -14700 -7833 69080 58935 11881 977 42278 132479
13562 132479 149197 150337 178653 189610 238694 218025 136040 86656 82349 99918 96238 89972
13550 89972 87406 72244 109090 184356 287948 336861 384433 403805 386801 417631 440772 445701
13538 445701 538416 585757 595553 582023 595623 675724 645205 596573 544448 534565 537347 399840
13526 399840 275718 239304 241585 281125 216099 184356 207909 265129 296145 306681 300916 312703
13514 312703 286071 306623 228971 201768 182983 173354 244290 333257 352662 389790 381877 382097
13502 382097 464145 531949 622368 698183 727651 732650 714150 705618 714694 662602 666204 615952
13490 615952 573987 528943 399511 349518 248961 256603 307330 316689 308062 278047 331025 346412
13478 346412 297748 308661 380110 454500 463602 458314 528867 630347 744125 702987 767993
13467 767993 859660 892187 852833 795461 810922 836761 802725 735814 703392 627435 596248
13456 596248 554412 511163 451710 442542 448904 369846 386573 410451 407082 367999 376960 389880
13444 389880 413652 385962 408216 382298 349058 285274 290455 312462 354017 396157 446965 510744
13432 510744 545789 610058 666491 663514 686868 786459 790346 755719 747089 716692 713348 674099
13420 674099 604620 551155 525942 519179 452552 442048 434431 409147 385454 321257 304083 315059
13408 315059 266579 218200 291710 279332 292293 308633 321299 291412 289670 253495 197776 115465
13396 115465 139558 216619 303579 252063 193215 186582 194449 183582 171091 153986 233511 230723
13384 230723 125076 137769 121872 136451 176639 201459 216170 254972 191363 133086 122389
13373 122389 145929 191280 247142 270958 243089 204756 166642 195171 283346 305799 297251 296233
13361 296233 261246 296042 269639 259901 241757 223050 187184 148785 143781 154210 141197 230559
13349 230559 170822 79141 55598 38353 57760 62732 76721 141361 184898 217904 222132 205426
13337 205426 177408 203307 252322 317369 209857 183282 255652 290133 244341 256438 297952
13326 297952 289736 272510 264771 229378 220187 235938 211926 199676 163426 123618 142494 162759
13314 162759 172667 150494 105630 111667 150743 200487 232385 227715 206445 184585 204187 177282
13302 177282 152388 173949 240581 283922 172240 166474 224207 229754 139356 122297 104300 142982
13290 142982 158891 184428 166078 145268 140647 153299 128758 79653 16629 50631 39588 18984
13278 18984 -9771 7697 82245 113551 115931 67795 89602 51070 48192 55762 50663 30901
13266 30901 3157 41494 100553 85338 16454 23442 21875 45400 95944 60679 -58280 22855
13254 22855 22010 16200 6134 -13043 -45207 -40560 -5638 49536 60053 44236 45613 32863 43371
13241 43371 56139 99119 128887 106515 99656 79259 62744 48631 38718 42868 32587 27078
13229 27078 62564 21310 -26864 -49697 -10133 37230 42249 22590 29678 23574 31562 -18811
13217 -18811 -2172 27097 -57534 -73466 -45304 28186 83769 20380 -9945 -35264 -23556 34779
13205 34779 87554 67020 66868 54276 50660 94967 141854 78696 31018 73863 49434 30537
13193 30537 126740 103864 114685 80238 116906 154199 110555 42378 17203 26320 10007 -67406
13181 -67406 -68722 -9501 -11497 -13901 -10038 -68368 -24094 25400 2392 25473 910 -27644
13169 -27644 9422 51050 60920 81117 35941 -56274 -64259 -5136 55752 68611 47919 96616
13157 96616 85138 29042 -46399 -115974 -96246 -86899 -132051 -113707 -115706 -73006 -28224 -47803
13145 -47803 -31919 -76297 -60032 -51587 -89929 -87524 -17288 -62954 -75211 -80750 -42191 -9842
13133 -9842 30665 51832 42528 61830 55242 -1993 -27762 -72448 -22376 49565 41535 53156
13121 53156 54286 -59378 -76401 -77906 -41837 -58184 -54456 -97817 -76669 -5060 35204 50935
13109 50935 19630 3375 23454 22863 45915 90803 108719 125524 149892 158595 210559 155599
13097 155599 34343 -12986 15459 37998 48219 -60524 -87694 -108540 -50544 33626 105788
13086 105788 65663 27599 27429 59885 63066 75269 33066 -77754 -116598 -32393 22867 -12461
13074 -12461 81033 97357 75337 15398 -8422 -56228 22086 60393 98642 100895 88290 41451
13062 41451 -29079 -44758 3636 -545 -68613 24088 80165 87401 83497 80212 97845 77758
13050 77758 111519 75568 27907 2783 -10616 19235 34196 57664 24419 -4081 -35456 -30784
13038 -30784 -2283 37771 -1106 -12017 -39527 -69432 -36568 -888 17693 -7907 -68105 -33630
13026 -33630 22888 19977 -6417 -3702 -59802 -84487 -111964 -92415 -23098 11879 20373 -17729
13014 -17729 -25924 -65252 -79485 -71345 -61082 -56556 -33026 -60814 -60354 -16283 23309 -57860 -144716
13001 -144716 -124201 -153012 -163061 -99273 2656 81772 115308 113303 61886 -13883 -70287
12990 -70287 -79059 -130874 -160298 -167903 -110898 -41487 -61982 -104178 -70419 -40446 -87153 -150611
12978 -150611 -163098 -119954 -61133 -40203 -5622 7244 -18419 4562 -44606 -94460 -30370
12967 -30370 -4035 -14336 -21698 26318 13798 -26810 1578 58316 25565 -25580 -3644 185
12955 185 -226 -20741 21091 27015 58370 64214 42466 36622 40335 55487 41517 20674 78874
12942 78874 83645 24911 37078 60743 48027 62726 29053 11700 31605 1635 -11545 -65162
12930 -65162 -105003 -110428 -125763 -164166 -187913 -117780 -67232 -95993 -171709 -144046 -100948 -141446
12918 -141446 -90510 -25502 -40375 -78991 -34411 12750 20698 20900 65006 62934 -14289 -38009
12906 -38009 -3499 16336 14655 85725 134317 70505 18103 -31594 -5500 -13168 -13055 -64572
12894 -64572 -59381 -30980 -12677 24448 -7561 -5777 -47718 -75299 -75519 -12986 -3127 1184 -89088
12881 -89088 -90459 21278 81327 106128 24818 8790 -2319 -2535 32951 59469 72309 34416
12869 34416 7394 39578 74293 56185 40845 40459 125262 148506 121163 81630 61493 55695
12857 55695 -1580 26023 35644 65894 55050 59934 93617 56602 52153 38308 16430 -26533
12845 -26533 -107390 -117663 -43123 -40634 18386 23507 12324 -4198 -65916 -146105 -119504 -105191
12833 -105191 -57978 -23336 -75445 -87947 -73625 -30511 3041 3889 -66753 -138148 -95200 -73503
12821 -73503 -98033 -112471 -118356 -148743 -163342 -118756 -17093 -49021 -38115 -62623 -116011 -15769
12809 -15769 -13713 -62285 -31168 39215 27361 72626 80538 72864 45720 19428 66888 4433
12797 4433 -101126 -26681 5300 37444 -26048 -54079 -110230 -82872 -21769 11341 26875 47314
12785 47314 792 -53327 -113929 -127160 -110513 -91233 -68553 -57749 -77924 -87133 -128264 -125556
12773 -125556 -107551 22315 10930 -1036 -39607 22001 48331 -16384 -36915 -65258 -104933
12762 -104933 -73280 -27340 -15954 -41037 -26673 -88556 -111589 -77661 -101297 -88902 -107849
12751 -107849 -147723 -119894 -22934 -10945 -43949 -52511 -54142 -24863 -81822 -65097 -77906 -58095
12739 -58095 -55071 -6990 59708 79321 21718 -17427 -72638 -156166 -114173 -44869 -31453 3098
12727 3098 28095 15633 -15242 -64600 -145872 -135581 -90818 -54909 9966 411 -26477 74639
12715 74639 143193 47977 16840 38482 -41720 -6012 15070 -49703 -42687 -28744 -86065 -48790
12703 -48790 -48759 -58469 22247 17081 10364 -32941 -78423 -106047 -113598 -92537 -88141 -107925 -51736
12690 -51736 -35500 -55386 -38132 33638 -33164 -52946 5129 11622 -12053 -59614 -13927 -28928
12678 -28928 -127231 -133095 -84601 -121195 -138471 -79085 -57102 -74139 -15024 3635 -22362 -5915
12666 -5915 399 -25855 -75834 -70327 -88924 -69428 -60674 -61200 5017 15063 21770 35514 60663
12653 60663 48865 -51755 -120415 -80025 -116767 -125121 -99086 -77326 -29167 -21339 -33015 -31004
12641 -31004 -54072 -93878 -94395 -65085 -82875 -38360 -27807 -51193 -71018 -51227 5799 4568
12629 4568 -27819 30493 27222 -51369 -119376 -67307 -77441 -80395 -44473 -104213 -174677 -157571
12617 -157571 -148494 -179519 -176925 -127055 -126210 -64792 -33228 16114 18397 -25460 -7889 -40845
12605 -40845 -11262 -12256 -52417 -84614 -106056 -106251 -29116 -18318 17114 9866 18600 -23320 -58739
12592 -58739 -50750 -14100 -14775 -78820 -100852 -53706 -52951 -77565 -109454 -65654 4564 60804 34615
12579 34615 -35574 -30315 2814 14121 9928 -32351 -67352 -66260 -19217 -46758 -91126 -110905
12567 -110905 -13794 2015 29774 39297 23873 1961 -86 33733 -752 -62341 -111929 -98622
12555 -98622 -84397 -54356 -25825 -25605 17898 79211 35556 -32984 -11905 -27096 -40350 -24639
12543 -24639 -47447 -41565 -38199 -85079 -79505 -83458 -20683 -22992 -70674 -81532 -88298 -114790 -63911
12530 -63911 -36784 5553 3304 33838 -12196 -49365 -35021 30104 -37365 -50610 80652 57074
12518 57074 15791 16963 -28977 -49736 -69914 -119997 -105413 -57383 -120172 -99506 -40790 9346
12506 9346 -15177 -83027 -143331 -145619 -148239 -114079 -109356 -148318 -183988 -144754 -34774 17864
12494 17864 17743 -5112 -4683 6006 -11621 -53451 -45456 -10960 5812 -28621 -31534 17694 44894
12481 44894 96324 119676 126330 70715 -34835 -63685 -36522 -72521 -52641 -9785 29469 -303
12469 -303 43758 19822 -60978 -30908 33198 49267 27779 84675 107149 91171 111687 126691
12457 126691 9838 -7010 26335 36533 -6768 -60885 -65189 -89789 -110737 -89423 -85838 -68532
12445 -68532 -76410 -74845 -56118 -89032 -132389 -140856 -161510 -134550 -118499 -122137 -82789 -45827
12433 -45827 -11500 89833 84538 58216 13908 -64068 -122503 -131146 -78852 -41939 -15401 14032
12421 14032 19782 -4088 -51124 -74228 -71573 -49792 -26984 -3023 29509 31669 -25715 -39120
12409 -39120 -86157 -62634 18810 12176 56110 2053 -51868 -61320 -97444 -61169 -26578 -64271
12397 -64271 -79516 -90457 -47132 -36934 -83753 -125868 -72085 -33430 -64704 -78257 -114369 -67333
12385 -67333 -6206 17157 43610 39213 26062 21875 20596 -15953 -1142 55387 83036 80952
12373 80952 -9530 -91838 -76073 -46028 -87577 -82753 -42235 -42724 -18823 55594 8902 -70288
12361 -70288 -90960 -56591 -93766 -53330 -60153 -55415 -30561 -19311 -107393 -146688 -157372 -110408
12349 -110408 -21357 -64682 -96755 -82060 -100963 -83606 -64998 -49820 -72252 -26472 -18010 28122
12337 28122 66120 18836 -30773 2807 -5627 46385 54849 37807 30401 -13527 -119888 -125635
12325 -125635 -197340 -224039 -187158 -143573 -146984 -125185 -98841 -71247 21014 21895 41560 40737
12313 40737 -10225 -115573 -150005 -73571 -103734 -114149 4554 22475 46825 -16751 -60132
12302 -60132 -34072 -68678 -67790 -24198 -7380 -8697 -10792 84301 78625 -25857 -119323 -148064
12290 -148064 -172892 -171687 -112582 -66730 -30663 2932 13026 26945 54035 64516 80363 61376
12278 61376 31535 15474 46052 -17738 -79655 -33037 -18020 -37707 -20429 -23297 7089 -30542
12266 -30542 -20104 134834 115583 107308 109070 80157 40820 -50763 -16626 5917 21275 27139
12254 27139 80278 80224 49159 35335 -19669 -27093 26512 19790 3163 425 -10572 6235 11645
12241 11645 37564 22548 -105079 -140011 -133870 -25942 56522 84316 81243 14231 -27031 -3179
12229 -3179 -3733 7350 65871 49797 46012 49362 117843 23745 -52629 -57103 -72367 -59054 -90124
12216 -90124 -114257 -65793 -46412 -44147 23753 10806 -982 -45261 -35186 -56653 -86525 -68852
12204 -68852 -20239 31834 16536 -55061 -82889 -117079 -138346 -74817 708 80185 89809 70870
12192 70870 36640 -24543 -60329 -54214 -12063 36269 31634 -34593 -20811 -23630 776 3589
12180 3589 -8746 7228 -23309 -32186 -15715 -423 23420 9236 19836 28084 -3429 -16810
12168 -16810 -80186 -95780 -79970 -116618 -154464 -82093 -31509 13103 3396 6608 15687 -54463
12156 -54463 -94827 -55395 33103 26092 40662 116865 105484 72399 96194 37708 -24237 -1734
12144 -1734 2270 -15823 -49904 -30846 -36054 -79953 -36324 73576 100615 50285 39651 5142
12132 5142 22929 48392 28441 -32408 -33734 -12614 -75385 -112707 -102757 -9110 22201 36056
12120 36056 10476 -1115 11661 -27186 -99290 -117583 -63151 -40895 -83223 -139273 -89038 -19020
12108 -19020 27819 14911 -22085 -92189 -139595 -146560 -150712 -140101 -125534 -90491 -67569 -68253
12096 -68253 -5826 27331 -48726 -28005 12203 -6510 -48945 -48826 -61140 -35369 -6674 60736
12084 60736 120245 88753 76221 118422 148737 98166 75089 -3787 -55692 -57719 -73891 -42462
12072 -42462 -71685 6896 76294 48697 -40359 -42836 -61227 -54464 -29664 -2862 27953 -22280
12060 -22280 -31118 -21434 -43090 -50804 -71433 -22989 2078 -17172 890 11203 -29864 -108705
12048 -108705 -111012 -50715 -32326 -58731 -102328 -76602 -54973 -18700 -48485 -6231 9950 -14634
12036 -14634 -55896 -104329 -78035 -48395 -61544 -65612 -43236 -3203 -50122 -103676 -54119 6653
12024 6653 -13343 7888 33536 19877 -47838 -70292 -71304 -44203 -34123 -58919 -40111 -34146
12012 -34146 -29533 -35159 65571 42551 -24696 6810 -16785 15727 -14259 -11423 -7812 -14402
12000 -14402 -62935 -94870 -78301 -38044 -64593 -4389 25280 30492 60107 73284 65674 97429
11988 97429 101625 48095 -47640 -107792 -49563 -51775 -20085 -56967 -29231 -40319 -23669 5682
11976 5682 55164 57930 21827 -10475 -49504 -126285 -149055 -116586 -78863 -69301 3384 62109
11964 62109 15489 -43613 -39962 -28434 22413 67679 65094 80030 37768 48623 10380 -24106
11952 -24106 -38925 -58678 -51616 -48163 15766 -8463 -21064 3600 -11535 15294 22227 -91933
11940 -91933 -112006 -53879 16294 53589 65441 71184 56523 77879 51018 31722 3728 25382
11928 25382 65932 56225 24320 40708 53358 33414 64993 150562 144809 51359 75307 96067
11916 96067 52518 110736 81835 -10386 -35007 11548 55776 23825 -22568 14067 24278 -35507
11904 -35507 -62029 -84120 -44084 27502 60485 40485 15328 33148 -3773 -54705 -117824 -69247
11892 -69247 -85240 -95890 -71840 -40026 -44444 -68502 -26377 42489 76717 67701 77250 66312
11880 66312 19289 -52879 -60237 -68885 -147501 -135659 -70697 -17236 34617 44634 60884 83659
11868 83659 53995 34844 25603 20574 3225 -9865 14076 50999 49337 -3316 -28815 -32693
11856 -32693 67178 117526 55176 -23468 -38209 -29476 -35336 -67711 -43687 -33293 -75581 -85047
11844 -85047 -9292 -21890 -43008 -75732 -70887 -71397 -69690 -109099 -142873 -131102 -41124 -40330 -62440
11831 -62440 -32041 47962 107921 67379 76461 51319 8114 -9773 -54884 -59076 -83784 -23572
11819 -23572 -52872 -34026 -5621 -31592 -9925 -39980 -31793 -9532 43602 12986 12370 -9415
11807 -9415 2946 31181 14273 -50430 -38465 -83934 -68593 -13995 -10227 14549 28471 -75815
11795 -75815 -94637 -59932 12593 111682 -11637 -88330 -83686 -95412 -62345 -1307 27309 1315
11783 1315 -19922 -34108 -28943 -27959 -32822 -14549 -27494 -43604 -49475 5655 45417 66257 16511
11770 16511 19187 33642 -29874 -39451 -46497 -89501 -45966 22653 12798 -14121 -38160 -71490
11758 -71490 -73274 17364 6300 -10239 -5307 43912 45911 16175 17335 6013 2610 33 -28074
11745 -28074 -71149 -49436 4673 -36936 -25158 -27064 -19559 -13691 41314 48075 7612 -9878
11733 -9878 8096 -53799 -63817 -34377 -31058 -40895 -42243 8542 15090 -1465 -24197 -16315 -29502
11720 -29502 -25580 -40800 -20610 14963 4045 27576 16537 41295 51770 21196 -4724 5300
11708 5300 -18115 -17978 -29570 -39044 -21071 -18283 -37853 15031 66572 32167 -7458 58948 63294
11695 63294 70014 44102 18901 -74877 -104323 -96476 -18253 17125 -18825 -66501 -52724 48654
11683 48654 32595 -12937 1803 38261 -17363 -52677 -97180 -98841 -51628 -6163 -36107 -33023
11671 -33023 -78750 -71691 -68673 -61681 -123936 -99196 -70639 -54886 29191 -9656 -54092 -17481
11659 -17481 35303 20281 -70609 -85820 -46834 -23824 29220 9616 -10464 -4793 -12195 -46732
11647 -46732 -55145 -59992 -64094 -58049 -62424 -135392 -129003 -84078 -46843 -53631 -56108 -19909 -51136
11634 -51136 -46174 10592 87525 43178 -52012 -74877 -2932 -1819 21677 13672 -7503 -23592
11622 -23592 -53774 -89120 -47836 -75914 -52884 14911 1568 -3663 -29192 -85969 -56565 -64362
11610 -64362 -91822 -59961 21830 41233 -15457 -20057 -12477 -737 -3547 -8816 10045 -17309
11598 -17309 -98710 -44664 -24178 -121508 -178828 -113611 -51622 2383 15370 866 -1227 1147
11586 1147 -44706 -139891 -76989 -29238 -14316 -29712 30192 12396 22684 34967 -9879 -71110
11574 -71110 -83210 -69697 -39909 -4516 -67274 -68073 -54046 -82516 -55811 -44213 -59180 -2637
11562 -2637 -489 -7455 -9558 57387 108604 47215 22255 44073 -35815 -31383 -4510 49880 34569
11549 34569 -23929 -71498 -68082 -23383 -5258 15616 -23110 35243 55421 40519 -39647 -22672
11537 -22672 69890 73805 -12522 -62887 -58051 -34919 2087 -5249 -38759 -45273 -88177 -65693
11525 -65693 -16082 3860 -58782 -115189 -141666 -124525 -136533 -60220 -29412 25732 68630 23473
11513 23473 -22059 -98423 -115345 -96656 -107798 -118310 -80704 -65651 -24581 6333 9143 -5983
11501 -5983 28390 32579 -61256 -88588 -90022 -36864 -21639 18414 48952 51393 23460 -35662
11489 -35662 -79328 -30655 -20019 -18191 -8665 13941 8034 41192 4847 15450 6063 -24263
11477 -24263 -54595 -33506 -9382 -36183 -62877 -20986 36033 11624 15898 50189 36026 -51450
11465 -51450 1763 67139 60242 27381 52984 83642 23523 -16938 -95610 -125064 -58119 32709
11453 32709 31360 36959 112815 137332 100030 68481 55115 34535 21487 -53612 -98250 -75157
11441 -75157 -105342 -51524 -68924 -63979 -34756 -82675 -144558 -183829 -219114 -149544 -27920 -1771
11429 -1771 -4611 -55634 -21849 107232 76925 973 -53000 -52552 -62608 -90684 -126834 -145248
11417 -145248 -93708 -39552 -81540 -136384 -121829 -97500 -111051 -66651 -75738 -82418 -76101 -90774
11405 -90774 -31875 -21386 -50577 -43368 -27003 27945 19635 -38814 -35470 32549 99509 142775
11393 142775 171692 110295 59377 47321 46706 15906 -19904 -46728 -76185 -55773 -40402 24857
11381 24857 74429 46963 -57264 -104278 -98620 -51176 -13694 28433 24817 -43565 -142105 -193467
11369 -193467 -126239 -101373 -35975 -58176 -122328 -97891 -62778 -106637 -172362 -180513 -138245 -92469
11357 -92469 -78241 -53176 2622 15332 4701 39540 104153 80812 -4999 -19913 36241 -36471
11345 -36471 -55730 -9939 67171 100310 54564 17676 -35609 22588 22602 44479 82478 125160
11333 125160 99634 105512 80610 20846 -61866 -41018 13576 61856 58395 -13654 -74853 -95234
11321 -95234 25305 58807 26640 43702 49386 54224 57275 70425 61789 -32579 -82850 -22020
11309 -22020 86846 83842 -51649 -142313 -95857 -110023 -86638 -41017 -21294 -3000 16759
11298 16759 -29978 -28070 20361 67171 114036 69242 39005 13302 32335 91109 102589 64524
11286 64524 19845 -41809 -62583 -32074 -9688 12033 76646 85110 -12815 -36560 -31821 33388
11274 33388 64198 51704 46798 31292 48034 45921 49155 98025 49818 -11945 -109255 -91998
11262 -91998 -74851 -19044 16557 -25561 -110499 -96790 -91667 -130451 -85599 -60217 -34098 -34876
11250 -34876 -31419 23912 78299 104670 118563 91184 21346 -18892 2455 52507 37613 42416
11238 42416 67620 47106 -999 2964 -30359 -14142 7545 -31555 -21737 -42734 -77293 -75286
11226 -75286 -34442 -1922 -6400 -17502 -28098 -6907 -5769 -9847 14116 16764 -6637 4470
11214 4470 -3352 -10667 -41967 -68562 -57761 -11322 -28523 -67804 -73415 -104613 -70675 21186
11202 21186 95322 108881 68429 107553 141407 118604 53462 42428 -14809 -47017 -10076 28716
11190 28716 49412 7344 19456 21075 71071 54475 212 -84325 -114627 -18818 37682 37109
11178 37109 -2938 -47139 -65253 -115348 -66233 -81105 23474 78106 53815 -21508 -34658
11167 -34658 -38647 -92072 -92124 -52363 -35621 -11720 -16880 6512 10249 17403 -1503 -50825 -109457
11154 -109457 -119710 -79479 -98246 -83442 -62757 -53216 -13873 16146 35901 40825 33837 13008
11142 13008 -18238 -14551 16433 -22826 -77857 -84384 -39775 -54101 -21193 22163 62029 114611
11130 114611 31469 -2441 7651 41683 35202 63534 55193 51303 -17071 -54598 -81536 -116189
11118 -116189 -112881 -76489 -79897 8126 35126 91763 140844 142917 171958 105368 93285 147367
11106 147367 142781 68202 -22072 -73507 -88659 -112068 -118142 -29647 -19656 -31757 -49081 -46150
11094 -46150 801 21155 30016 43827 24755 -35354 -58811 -92364 -75731 -99710 -85558 -63633
11082 -63633 -98986 -78260 -9146 8350 -33222 -62006 -104489 -106766 -135625 -211280 -211394 -108816
11070 -108816 -87031 -63346 -10185 2439 -43659 -77732 -57539 -68086 -113594 -84100 -69723
11059 -69723 -95929 -69558 -39026 -51022 -909 -23880 -28557 -54986 -71322 -8215 44117 31523
11047 31523 45998 43681 -15081 2655 18502 38433 19304 38681 24612 32438 -23066 -61928
11035 -61928 -63528 -72503 -56563 -25063 17000 -4103 32036 43902 39425 -52134 -80422 -29376
11023 -29376 34312 47958 20038 -20179 -61183 -45477 -27373 -65951 -155918 -119773 -92493 -62450
11011 -62450 -70991 -56205 -4183 68587 72945 35645 46823 19781 47734 31237 -4599 23996
10999 23996 -51641 -73741 -33028 27084 81553 80767 103062 62791 17199 -11562 -579 -26146
10987 -26146 -71809 -27325 26290 -21159 -54985 -21947 7436 16160 110854 128328 95217 66559
10975 66559 6817 -33102 -117788 -116646 -104186 -108359 6568 32450 -62406 -73914 -41657 -38916
10963 -38916 -78720 -24442 69666 61384 48550 54058 29549 42591 78942 174453 193536 161009
10951 161009 117278 107255 70265 71748 40285 29917 -12490 -54472 -29600 16850 45114 34360
10939 34360 59088 124686 30080 -2625 23301 45362 46456 37676 29637 51714 8303 2907
10927 2907 5623 -40958 -24927 37599 37187 -8553 -31415 -61279 -52895 -37166 -70766 -36927 1733
10914 1733 -12562 -123574 -214197 -225540 -132785 -51995 -59148 -64019 6001 26661 -19433 -39061
10902 -39061 -56377 -108547 -107414 -47262 -9067 -4347 50052 35665 28098 -48823 -64246 -35457
10890 -35457 12810 24370 37535 10603 -7227 -1535 30331 4869 -118047 -136385 -86873 -73219
10878 -73219 -62807 -11877 30913 -55984 -111709 -50996 -77410 -74331 -16710 -4391 32140 -29980
10866 -29980 -35911 138 -19390 55921 51055 8932 14937 36200 59909 70140 100297 118909
10854 118909 148384 166133 192873 106202 7651 -33077 3512 4158 13810 -77029 -60333 53391
10842 53391 100989 59920 57479 20514 -3768 39870 16374 -45383 -80402 -36173 44542 20534
10830 20534 -31396 23119 88125 70302 14035 -19165 -11739 18078 27461 -5043 -57782 -36787
10818 -36787 -19454 -73311 -90252 -74471 -42266 -18645 -53623 -75307 -90656 -100254 -87034 -108800
10806 -108800 -151600 -163215 -114388 -60958 -4324 -68423 -55120 -25531 6338 -8369 9578
10795 9578 21496 39647 9377 -29705 2868 -31705 -52997 -108482 -126979 -104999 -125220 -150186
10783 -150186 -164650 -177815 -131147 -76723 -36041 -44012 -41069 -15170 74254 4459 -56783 -61347
10771 -61347 -135224 -180695 -186984 -182147 -94497 -72953 -46007 -29773 -67222 6065 77383 62487
10759 62487 1886 -6239 -23087 -27016 -31212 -60129 -134324 -108422 -23311 41883 154792 137178
10747 137178 99526 131506 81916 77904 127712 119414 112598 121408 137083 163153 175937 117710
10735 117710 65581 38804 7115 -54036 -60243 -86349 -36816 60391 133442 88528 44384 22346
10723 22346 76756 118844 110040 66694 75665 131136 150513 142426 105582 87728 80502 2042
10711 2042 -22121 5755 -9033 -34773 -33901 -67824 -30705 21581 -15883 15383 -43900 -68130
10699 -68130 -85111 -74897 -51981 -33242 -3942 24382 210 9806 5137 -7310 -26221 916
10687 916 -13854 -3809 3003 10960 56208 96682 81468 72906 41470 34564 4367 -2251 27616
10674 27616 82130 141997 136130 160463 94875 89440 113846 43405 46636 60377 46090 5574
10662 5574 37361 107890 90317 32383 -26865 -32736 -9912 28529 -4075 -50958 -58179 14084
10650 14084 86191 94013 57387 80432 90080 67358 36632 -73208 -127268 -41597 47818 99657
10638 99657 120825 145964 124687 114843 108767 99100 104055 79458 53427 99935 189792 186914 195200
10625 195200 129989 17486 -73292 -73538 -44612 27263 80681 103951 104299 147762 181656 152067
10613 152067 92922 4131 11203 15723 35561 -13680 -51165 21539 125854 126090 134696 135038 78798
10600 78798 14407 59675 58196 -19095 1729 38354 57905 -2026 -38796 -20678 -11768 48949
10588 48949 125813 131893 111736 107944 62893 15132 31735 12318 44830 63113 53672 16110
10576 16110 -4556 50633 94465 64963 44914 114658 225429 160822 89479 133393 95569
10565 95569 39348 3547 -84772 -91983 -57501 -45699 -52575 -66150 -63014 54654 124367 60118
10553 60118 16611 -11837 22774 29204 29279 -1068 13249 -14957 -4036 78231 147469 127060
10541 127060 81252 1867 20179 111421 91842 62763 37118 -32046 -51037 -24121 -28674 -28525
10529 -28525 14448 13190 -12790 11497 41870 -13391 2394 30828 12432 91957 149044 79841
10517 79841 27039 34104 22128 31849 39895 28728 38575 78563 97257 50840 20552 26000 -1721
10504 -1721 19461 107684 130733 54192 -28502 -56588 -51386 -37461 18972 18424 -5623 -26090
10492 -26090 21192 53881 67526 -19304 -31529 11050 71425 38662 43070 103132 135925 151033
10480 151033 157795 115483 69320 73747 30879 -1794 -29763 -13116 -37849 4569 28267 50974
10468 50974 -4135 -63856 -42487 65900 121650 194322 181272 92565 82526 64081 1634
10457 1634 -15278 -13125 1746 50428 42693 25572 -11084 -116260 -132831 -28791 16724 35412
10445 35412 44270 44219 120737 186961 121922 82016 184428 171532 156943 159246 86712 25176
10433 25176 43458 64317 121676 121832 84891 89112 60882 52352 85882 91692 129892 120079 122014
10420 122014 187619 154822 133211 162574 145336 85950 74362 42956 24585 29745 42107 36693
10408 36693 -23688 4798 36496 73238 112127 191866 84549 27639 53856 -8448 355 -15492
10396 -15492 -43267 165 4136 -23881 -4274 51563 109659 101591 103332 139865 106966 118035
10384 118035 144094 92485 27612 -27568 -13428 19886 11502 7466 46646 105002 96778 86628
10372 86628 109322 82263 52290 73557 74577 107367 76281 33791 29085 83025 137060 146002
10360 146002 110353 81794 159562 179131 70851 22076 18724 40903 58341 72501 76863 99491
10348 99491 106309 75618 115272 150427 70264 64335 65792 35759 13838 8680 22787 61687
10336 61687 130461 102469 83187 69890 97623 120889 127420 113566 97772 126017 109737 122216
10324 122216 72304 90266 127487 171514 135198 67756 81254 156581 156910 164255 142971 162367
10312 162367 259557 232348 143306 145801 183727 245432 210285 158059 152019 203755 186287 145144
10300 145144 110889 106100 183643 233230 230554 206730 157393 131506 136630 123556 106787 86959
10288 86959 75919 64845 95612 95706 108195 89235 135939 74348 43786 33586 67456 87452
10276 87452 75914 118615 163371 182030 187213 236289 223808 192887 195658 173000 122692 104366
10264 104366 135941 163393 246919 284827 244507 184528 171283 138882 67971 118891 151610
10253 151610 224548 205886 104940 81217 48015 54280 99795 117043 96852 59059 18078
10242 18078 3557 28085 60891 84029 104157 98735 84367 46116 31233 12080 62451 99347
10230 99347 99814 122931 154952 215928 258420 155962 108832 101652 122533 125885 107180 55826
10218 55826 89403 101249 23656 -25872 -25775 23237 51436 56820 46747 4753 61410 107433
10206 107433 91671 54767 70771 127707 163326 179534 170442 128582 158520 156738 141673 141639
10194 141639 142784 138747 125068 125803 101449 131831 116804 74741 -19354 -40178 -25400 11292
10182 11292 -13369 30175 107220 113829 105205 143331 169794 103848 75141 69770 75725 41286
10170 41286 75333 153734 164373 76634 -45560 -22834 25494 93255 117158 120886 143398 226356
10158 226356 238338 190512 152547 167894 136095 140734 212408 186631 161707 188313 196090 152225
10146 152225 164724 184805 157316 69787 82109 146242 134301 121675 139023 127325 96442
10135 96442 115913 168529 193007 162627 153793 210015 133827 130053 155916 128669 126167 177567
10123 177567 172903 97981 24324 59378 122674 106760 133078 142782 178192 189964 221419 215846
10111 215846 117945 29394 60424 131072 141722 156140 158325 153885 90475 98406 99386 133832
10099 133832 151949 121350 146407 97709 86106 140953 170824 131917 158299 206533 282845
10088 282845 259882 192427 123353 151149 235195 255688 265348 276350 241027 178274 180101 196046
10076 196046 212645 179390 184649 127234 153101 166396 179681 147553 110899 69744 80733 86921
10064 86921 209950 249589 249995 153146 92362 54355 102944 227220 236020 166256 196495 206240
10052 206240 253599 306087 236374 167163 171838 220655 193744 190226 205523 213919 198583 183792
10040 183792 237823 254911 180977 184238 182658 164258 195665 212210 218425 215907 248519 153354
10028 153354 145768 181702 202414 200156 190739 180094 172110 156652 263249 264197 269620 220903 221893
10015 221893 237678 265661 274984 203573 145352 187306 274976 315358 381498 364298 377345 324803
10003 324803 306244 216965 165340 180359 275738 326139 271198 203686 232753 298675 327777
9992 327777 347934 361886 311870 265743 247292 236518 200109 172366 140737 185732 225892 176881
9980 176881 165646 234149 217492 198553 227113 266041 297427 291880 366112 386415 308286 275266
9968 275266 348588 367240 404438 336389 233947 212898 197876 191337 216499 222405 254825 293853
9956 293853 320711 297858 283201 306221 344963 368390 369078 313841 288312 321738 326773 260404
9944 260404 198254 209035 214285 286377 339065 341090 286557 258826 258535 297040 261353 149713
9932 149713 123154 121786 206033 244408 253378 372826 394906 319024 284390 311332 320776 256839
9920 256839 259272 311953 295857 238086 270619 309359 387515 403870 271145 200798 154516 171074
9908 171074 253791 297933 247605 256936 302653 314971 333681 312013 339691 350952 354105 324458
9896 324458 393639 408378 380033 374423 372958 399432 418611 427942 398091 386360 358339 368460
9884 368460 379158 449403 490672 428400 364772 406128 391220 325806 239841 235952 325967 394669
9872 394669 423943 470871 490230 421149 348708 381963 366621 363979 404869 456814 446533 422422
9860 422422 386170 351543 369358 387685 370222 340188 383803 420949 462816 449758 447969 424401
9848 424401 431955 423026 368670 412962 388676 343871 322002 355437 418941 521532 506175 486921
9836 486921 499409 490875 410572 392341 409265 376709 362325 402802 380092 390707 386417 397405
9824 397405 407743 392085 392589 391388 401602 458877 411272 358226 285891 282781 288542 335553 334719
9811 334719 313250 412664 405540 358763 398536 447105 462789 480812 453234 438641 432511 393253
9799 393253 323086 353408 417351 430514 427312 347050 390691 377366 399244 381003 386515 396322
9787 396322 435415 478555 482109 351474 353815 428493 494808 499093 480097 497768 429431 420269
9775 420269 363002 338405 377287 403684 350115 305390 317481 329332 318769 358504 372143 389589
9763 389589 426335 393294 391191 420468 478432 513968 503591 477578 461939 472689 463334 484039
9751 484039 423444 357888 431528 493473 539717 420964 347040 365909 381619 387242 461789 441508
9739 441508 387406 478422 490461 433793 435483 496776 572781 534480 418959 403394 426218 420617
9727 420617 450300 517282 559143 564268 572897 564157 551460 541066 496178 430166 503220 578852
9715 578852 575747 565310 573962 575156 588363 571435 564544 576039 552728 520149 554825 531014
9703 531014 471240 457205 477374 532915 577402 625644 637797 558269 579634 555187 517259 462217
9691 462217 418147 450196 485736 487241 460548 481761 566722 686835 752917 770563 681247 603681
9679 603681 526789 521122 494464 460337 477201 486541 466832 502344 496689 509567 505327 473211
9667 473211 394817 467388 502345 522247 501666 484736 523793 537890 512021 483691 477960 505253
9655 505253 552452 566379 544395 599105 597313 625101 696733 672467 592792 539284 517888 556197
9643 556197 604456 608272 602443 582050 634425 654698 630847 621994 662157 658209 619673 620044 628477
9630 628477 646411 677862 658016 675111 670805 624244 572455 573609 599314 562118 522491 578364
9618 578364 615680 614318 627677 599145 642823 704905 632769 614256 691779 699787 746828 728588
9606 728588 707986 765437 766476 718377 698490 692152 647414 635188 636220 701303 657477 683604
9594 683604 708874 626538 626840 653286 652960 589052 603039 654254 612415 614403 633295 655475 705646
9581 705646 621993 608606 572306 533936 574742 612845 653607 637306 641975 699041 686736 714569
9569 714569 699892 676955 683821 760067 716812 661504 672831 624109 690584 718146 700269 719134
9557 719134 715045 734061 757474 833762 949492 905977 766728 692006 760187 726087 705040
9546 705040 770429 773629 770323 752277 715338 767004 784556 781630 785476 790042 752288 713769 734519
9533 734519 722661 710632 683891 658247 714220 789204 861346 847581 725676 767095 808956
9522 808956 773908 792181 799450 822495 824696 819372 811375 824253 850725 854365 823708 823934 792586
9509 792586 690129 706329 754704 720606 733912 723559 780675 819064 859501 877683 717483
9498 717483 660941 685675 681876 711485 772777 766278 724830 795574 801531 726304 622418 628433
9486 628433 677218 672284 674946 698524 700172 765939 856570 764484 740552 791974 816772 766481
9474 766481 692712 674600 643149 648573 647071 643282 661312 680298 693421 674282 624867 626393
9462 626393 677036 704396 755761 803626 767823 735045 705970 712002 776214 797706 765098 664805
9450 664805 743324 821332 740026 666261 681822 713254 688422 669081 631096 661928 697013 695120
9438 695120 642272 643027 666206 640998 664621 659564 691261 746666 749776 755435 681807 649741 673175
9425 673175 713413 722228 690702 609508 591595 665578 646616 624818 617110 661656 717610 645334
9413 645334 615094 660360 685155 706282 746396 741902 653318 646876 733986 747844 682004 702056
9401 702056 686285 675491 655950 629641 636661 638882 693064 758937 730830 700806 696727 687539
9389 687539 709903 626022 548875 537859 573256 628289 659311 651459 648677 560253 538158 597328
9377 597328 637535 636262 600084 547168 610962 659797 693203 685052 651686 656884 580913 550646
9365 550646 545763 576098 581541 596379 593927 637135 682856 665810 631845 668825 627353 535935
9353 535935 497380 579692 643475 642081 647186 621036 605052 609724 551754 528169 492435 475496
9341 475496 509682 515534 510659 556859 576377 546272 562469 594534 645092 686780 652433 631870
9329 631870 644199 631565 652393 646083 616506 560772 552292 627364 658803 624908 552150 536351
9317 536351 596723 614765 583216 555204 574721 614792 610101 563420 510212 522997 552730 526913
9305 526913 462414 437126 449837 485696 485190 448769 473140 536586 586228 568840 552352 566395
9293 566395 553857 463664 490406 469703 468724 483049 495560 477275 475377 428326 419310 458163
9281 458163 447606 394335 413228 485657 492042 496731 461502 496964 444290 474871 500842 464772
9269 464772 447898 475041 497771 448173 466924 508159 451721 458246 441223 440478 486657 540327
9257 540327 505331 465752 518329 543768 452150 442729 474007 467528 431723 448611 452761 380030
9245 380030 360265 428653 479414 492983 466903 483538 495053 440917 421620 324233 252693 334011
9233 334011 350219 336795 355707 399200 408296 406958 445345 435221 485702 530018 453928 365851
9221 365851 322316 337669 349186 395667 399374 344412 315554 347857 330702 324287 363449 356540
9209 356540 335475 290133 294005 370663 434595 408455 424893 447944 489963 412451 320456 304676
9197 304676 393806 399018 341744 317622 342086 383563 400207 517502 473702 442536 376298 350681
9185 350681 377274 354809 372466 386851 390813 342557 308393 306584 337119 433399 390847 317154
9173 317154 217641 257472 332503 347487 290571 251278 258242 362143 361473 285466 274460 310076
9161 310076 347177 350480 389214 434950 439483 463110 402716 361580 360533 366187 299131 278380
9149 278380 340679 340013 265061 314843 315452 312809 342257 363141 369619 319120 331185 375004 342575
9136 342575 327400 365237 394032 317025 350443 371821 367276 337981 297861 300063 313056 293329
9124 293329 275667 329349 334705 293367 242560 221592 220739 278366 287978 322509 391299 387482 385712
9111 385712 372821 329762 313450 246673 275966 285694 308498 375491 361999 324422 209873 234137
9099 234137 294961 282222 288584 298359 269184 269957 248406 205639 223723 242549 260204 271224
9087 271224 279121 321909 310628 277873 219883 209050 212469 267989 281790 253997 267775 243942
9075 243942 230133 273581 341645 330299 264252 304804 273428 215405 236203 255788 327465 303956
9063 303956 294355 314705 213629 234920 273793 195795 113122 147064 185786 212756 203282 193798
9051 193798 218589 195794 227400 256767 274068 285960 372065 380444 322720 276516 252555 253092
9039 253092 188258 172431 183286 171867 191490 223359 298469 338906 288983 211796 184231 164897
9027 164897 163821 105178 158245 193104 104552 95987 207697 273604 286149 310364 305738 242948
9015 242948 232337 207296 166637 181192 279131 312832 247819 226153 234604 260565 255200 244656
9003 244656 202402 210287 284598 287761 303029 414441 391140 373383 409525 451394 456828 430835
8991 430835 419396 375900 388483 363508 300151 289680 330324 341543 400824 386471 360345 352223
8979 352223 352015 355840 393669 428455 417181 376612 355210 306351 214371 146910 135587 133078
8967 133078 153531 222409 287533 222547 193352 135527 182204 161171 164336 215367 259183 296459
8955 296459 331223 295329 235829 179231 132472 135592 226619 237768 198953 219850 261672 303287
8943 303287 331223 322737 314196 336740 388461 314999 277296 249718 162797 135731 70088 165578
8931 165578 195190 212979 243103 229470 283152 246109 226801 220270 245070 213276 237916 293267
8919 293267 268953 288933 355973 374688 378885 326504 359798 361619 377953 402018 401203 354168
8907 354168 395600 422097 410887 410966 400840 424408 482330 447509 458933 438846 384435 359360
8895 359360 413054 534913 587207 560611 622166 571831 590420 656488 707157 762439 885098
8884 885098 988250 1074478 1185399 1275490 1417428 1648076 1861218 2087953 2319998 2582006
8874 2582006 3049688 3701210 4464325 5614698 7423879 10283720 15132920 22458881 31057607
8865 31057607 38062518 41668512 40326727 33313236 24637717 17915070 13577130 10873975
8857 10873975 9042363 7708937 6765885 6129422 5607473 5135181 4826036 4522705 4278200
8848 4278200 4046623 3851351 3676265 3519562 3334739 3117076 2923540 2756246 2627331 2508070
8838 2508070 2436187 2303653 2245381 2236811 2191798 2135562 2074063 2009007 1905918 1861450 1828989
8827 1828989 1848618 1815663 1700695 1649628 1648396 1619026 1541872 1475738 1472610 1413972 1354698 1309384
8815 1309384 1234451 1290022 1271961 1223769 1193902 1127068 1102124 1071477 1031870 1110177 1106692 1000440
8803 1000440 977456 916623 921589 942661 864189 745032 711145 706757 748294 786211 707291 705666
8791 705666 643862 663136 692454 674122 641382 599112 600788 665659 663204 632191 609846 622057
8779 622057 656511 674618 630849 570039 509514 526927 532466 545023 488904 506909 583126 598265
8767 598265 532482 527242 496198 511367 510992 483099 449149 442676 462802 480257 505245 491722
8755 491722 488559 546624 505010 487471 479507 442890 412451 397656 440274 444438 409544 423997
8743 423997 451081 474727 456795 398117 383624 424805 500387 469429 465138 461954 458333 512754
8731 512754 426375 326720 337327 347540 344780 328493 270072 260233 238700 276341 326327 331785
8719 331785 346340 362679 387646 365545 381720 359528 403298 424503 393466 338988 290833 223544
8707 223544 251052 327799 312669 209730 151479 166161 203758 214570 235788 243652 305196 324691
8695 324691 280479 222706 167125 161799 220644 269190 258424 214620 160746 145037 110354 154645
8683 154645 121146 164822 228065 220525 133939 115414 116951 175473 239170 208489 183180 190907
8671 190907 237812 273971 246993 214288 250882 285917 207048 220679 305779 229262 168077 69704
8659 69704 43537 110743 89963 149254 238801 235597 187022 107716 142349 182006 166132 161951
8647 161951 202237 213481 171123 235191 274108 286194 337348 318553 191507 145292 111518
8636 111518 82186 122293 90848 55671 67762 113195 179076 184075 223868 196175 182006 164466
8624 164466 178417 201289 258938 295994 294541 285469 248175 266312 265493 210552 135076 140793 122332
8611 122332 117825 99144 94790 85208 145503 200512 213647 212796 199566 174707 141156 183495 224855
8598 224855 182070 199510 195886 132486 113932 110383 24736 52326 102616 89355 38304 12173
8586 12173 -13380 20556 22524 23198 85190 131070 106187 41246 99480 162473 113842 83217
8574 83217 30042 9384 93378 162016 180584 167402 164302 162099 183592 180992 238805 198969
8562 198969 141466 89611 116111 118603 166635 190721 234472 224173 229186 271333 277916 197134
8550 197134 141566 130848 104533 91504 79799 11256 -6017 2460 -30307 -40876 -15558 9676
8538 9676 66753 83105 84838 116510 76742 62809 94190 20085 -38878 -72419 -9932 32965
8526 32965 74304 95227 85125 51238 55404 92681 29395 -10068 -15679 1442 -9499 -12179
8514 -12179 -1845 2695 52369 43656 57722 65507 103992 161870 152026 163219 139913 198022 252690
8501 252690 160624 86440 145819 235746 161548 73398 50085 -8376 -30186 -34485 76023 55211
8489 55211 82243 123188 85077 72999 46248 -13317 -18993 -43574 -54981 13357 -21758 -59219
8477 -59219 27070 35804 50253 31234 57947 104861 147853 202478 234558 209317 235115 234458
8465 234458 239031 152097 58778 43258 55276 60279 79423 90982 4032 23807 86550 70369
8453 70369 24086 57765 46183 51946 53279 18355 35257 83877 110885 93152 33947 -24854
8441 -24854 -71990 -81019 -119916 -106182 -38293 -7368 69128 149021 126858 150496 128677 119485
8429 119485 96734 77448 71966 107519 193261 138036 66902 140060 124452 48350 48319 131967
8417 131967 134826 62800 80304 110547 151749 185319 191901 199090 172573 115268 42145 68268
8405 68268 61430 48911 81240 104776 114976 84219 40330 79120 88342 79252 74258 20544 35648
8392 35648 97046 97588 84929 46632 36815 41468 67608 455 48500 85311 90080 97160 142313
8379 142313 138284 116004 95169 -2772 -80330 -124830 -105356 -51917 -78626 -81521 -26528 4674
8367 4674 39528 43810 67492 91602 78865 63012 11833 -22497 4378 46504 -14008 42026
8355 42026 28227 -39422 -47341 -5840 30207 -36579 -135601 -109682 -78062 4238 12285 -23604
8343 -23604 -12676 -9838 -22366 -30224 -10016 22759 -26555 -44360 22330 44140 -32055 -114396
8331 -114396 -42135 45484 61526 108223 102478 65235 67736 87417 46157 -42100 -59448 -79539
8319 -79539 -52008 -29678 4766 55102 42467 40908 15488 -23968 -34945 -35407 -118296 -111370 -69142
8306 -69142 -50606 22174 85994 127884 86404 13654 -39514 -42989 -52203 -61288 -34032 -29489 -3481
8293 -3481 35894 54528 92814 127721 102587 135115 155306 173438 138437 111204 110047 143906
8281 143906 181708 127031 70930 20165 -45079 -50718 -52749 -51140 19530 7736 18687 42548
8269 42548 50671 22994 -29928 -32242 -29003 -80993 -94284 -67871 -34362 25097 76006 111556
8257 111556 80972 47870 36567 12385 34204 62666 75350 45832 55606 45504 69858 26572
8245 26572 -65099 -28649 52579 87600 120824 81060 20280 -55701 -31646 26543 48165 56991
8233 56991 23900 -43817 -85932 -40015 -2665 5323 -72961 -111611 -82672 -71217 -74467 -53461
8221 -53461 -70448 -69599 -40959 -30849 48920 57724 -11677 68765 125981 51204 -20887 -12577 -23734
8208 -23734 -17086 -33373 -47035 -12398 10367 -1641 -20227 -25569 -6797 20379 -33830 -120390
8196 -120390 -84650 -38401 9445 -19153 58009 75814 16068 -269 54772 71648 79083 115087
8184 115087 105295 114553 79196 48804 64965 15548 -23960 -3815 38327 40574 60851 71713
8172 71713 39790 65323 99861 51424 54491 21619 -22779 7939 31918 85348 110402 82028
8160 82028 74863 44815 -63314 -121804 -50717 -16416 3049 24678 85326 58970 58693 47296
8148 47296 -22755 -68960 -51041 -35059 -34894 -38240 -46194 -76498 -77444 -57784 -75686 -82268 -72122
8135 -72122 -104604 -113787 -142947 -105342 -23150 -17991 24962 -21768 -4721 53549 33316 -54903
8123 -54903 -94170 6641 88856 102730 56100 76681 66501 16414 5019 -22290 -15547 -30757
8111 -30757 -6454 71710 83682 46280 48896 44277 -16503 -93513 -42751 -29214 -34099 -67023
8099 -67023 -119021 -69515 -3367 6374 2707 37879 33221 29769 41852 -30444 -18272 -26001 15289
8086 15289 55802 85022 157235 252214 219411 141888 72599 45168 39841 101192 208926 230246
8074 230246 144737 -7861 -21340 -17728 -11396 4262 89428 76876 89234 75717 711 -11349
8062 -11349 -31087 2020 57104 25752 38844 45157 89281 109382 75374 69890 47626 651
8050 651 -58561 -126216 -112028 -58228 -24121 11630 12339 -62563 -91743 10415 59397 11598
8038 11598 -11930 51030 42596 20796 -40661 -31678 -32499 -41584 -49279 -3901 40457 34976 -22572
8025 -22572 -94824 -67672 -72880 -10909 64945 74566 24106 580 -11591 1150 52544 64042
8013 64042 81285 80086 80072 127413 169954 221137 254703 273716 178843 172902 179276 120410 125459
8000 125459 74246 99771 103612 73197 67409 67633 76208 154980 163665 135558 122292 58460 7737
7987 7737 53270 52291 -15641 18215 42800 -13324 -115624 -128855 -66636 32432 69195 153376
7975 153376 200271 101129 29208 54991 31025 82594 101744 99789 125511 134263 162922 230508
7963 230508 335203 324873 222865 141222 164453 99900 46192 40333 42434 53034 2887 32889
7951 32889 63464 146820 121041 139292 144858 158830 77160 23757 37514 30346 3194 -49361
7939 -49361 -92602 -123307 -120514 -32994 28825 -11107 -50154 4820 55288 84547 27447 -24591
7927 -24591 6632 26464 43063 45014 39931 1076 35454 77342 75619 39394 112395 94071
7915 94071 47634 31468 15397 32817 -16599 -64982 -6130 59742 51943 -6974 -82173 -148208
7903 -148208 -117064 -57882 -13412 -54872 -68293 -80333 -88154 -16736 44413 104440 127058 98103
7891 98103 -2438 -52368 -28473 -3976 2191 12223 24931 100404 86922 30025 -6169 -51913
7879 -51913 -27140 -48405 -84715 -65640 -68351 -46979 -39479 -58040 6478 45651 40649 63555
7867 63555 44246 41979 114600 118029 54203 9461 4264 23790 99949 102313 34344 -27135 -12342
7854 -12342 16494 53280 82612 65401 -51251 -110497 -197939 -206707 -132806 -28191 51346 9059
7842 9059 -67162 -61341 -77466 -121090 -120503 -115137 -86813 -87861 -75956 -88679 -97340 -82502 -75776
7829 -75776 -79644 -72317 -6034 -8987 14644 -24544 -18692 17957 1538 -10519 39309 163008
7817 163008 132623 146781 151409 29322 -7000 3417 -3830 6135 55042 143750 120092 74579
7805 74579 62972 12105 34069 95026 28591 -24190 -58262 -20244 20300 76320 70349 21081
7793 21081 -7079 43833 105550 38362 56333 69952 90020 91292 13627 -10369 -19447 -34135
7781 -34135 29095 67497 83332 61689 103761 100143 -21704 -26084 -15211 -10862 5594 67572
7769 67572 55888 4686 -5943 473 26535 -40392 -123961 -149453 -116871 -73332 -103810 -61040
7757 -61040 -27843 -12615 -21154 8979 -13523 -30139 -54298 -79411 -42367 -22760 -33019 -94355
7745 -94355 -122794 -12112 104723 50100 13448 -22571 -25196 -40858 -15086 -42062 -32059 43214
7733 43214 94540 40990 23027 -12963 24263 45788 -28452 -38383 -36088 -82084 -101690 -71297
7721 -71297 4883 25440 -47588 -83007 -39289 18253 62034 45484 59612 115442 67484 49319
7709 49319 34017 -29787 -106202 -97853 -44352 -23728 68575 156027 158800 70227 -17265 -64029
7697 -64029 -14887 64633 46873 34220 33563 29613 19745 37393 47074 67210 117722 66664 -15352
7684 -15352 -29718 -42322 -59640 -28612 -2757 -33775 -10778 -3640 -21433 2853 4905 40003
7672 40003 106467 102628 74529 70825 99024 99107 61523 55216 46366 5228 -55556 -60517 1701
7659 1701 -173 -46924 -60801 -48959 -3223 21231 57616 51419 26530 27928 -635 -17585 4916
7646 4916 -40789 -44778 -45420 50779 64921 -7152 -1188 44931 125414 83574 58004 38921 54416
7633 54416 45585 51540 105279 154519 117710 2640 -114300 -171929 -147555 -18140 38953 60726
7621 60726 51600 -10351 -44691 -51820 -38404 -21784 39688 54953 29688 10393 519 -2299 3539
7608 3539 16952 -89827 -44687 -20383 5128 20460 -13688 11300 -16831 -102684 -98514 -50840
7596 -50840 11809 63300 112467 57582 -1754 -22515 -33585 -45851 18420 44834 52289 74692
7584 74692 21752 12559 12982 47552 98833 45123 -26050 -67862 -72601 -63800 -67908 -35086 -16549
7571 -16549 -44944 -52294 4237 18619 22880 2704 -7888 -57822 -59475 -89296 -42202 -20149
7559 -20149 -68492 -59098 -46180 -64334 -58877 -39940 -10190 6864 1621 -62639 -52196 -7734
7547 -7734 16316 -12119 18627 -17868 -54494 -22118 -12480 -39194 -31101 34638 -86679 -127650
7535 -127650 -137795 -76853 39504 43237 -41935 -8043 41418 16356 84031 60031 -12028 -5781
7523 -5781 -12130 23416 15892 -31924 -38376 6100 22713 -26826 -21318 -39340 -22790 47813 59608
7510 59608 47222 22863 5098 -5791 -64917 -58486 -47968 -44416 2088 -9873 22979 42985
7498 42985 -15616 -59847 26626 58553 30503 17069 375 21284 45369 22285 1080 -48479
7486 -48479 -168363 -220833 -136224 -39666 -47571 -92705 -74528 -19607 12837 -48741 -53246 -80696
7474 -80696 -19454 76530 104058 47157 248 15673 1545 35563 91252 108647 86678 35685
7462 35685 42937 98245 159618 91391 55192 95896 54829 49965 -88796 -136178 -68322 11860
7450 11860 70230 22567 33200 18730 50347 110644 127634 78668 43664 65796 122692 129246
7438 129246 59927 -54193 -98375 -126743 -193788 -176794 -159402 -58178 23113 -6985 -44771
7427 -44771 -87152 -27557 65796 26450 -61628 -67312 -32240 -71943 -79768 -89021 -70598 -16920
7415 -16920 4021 8940 23853 10775 11984 -3258 10246 -10736 -74293 -118106 -141666 -42003
7403 -42003 -52972 -20350 63781 31872 -46052 -52793 -15739 -17810 -101785 -122626 -148952 -123990
7391 -123990 -17053 -1679 -37975 -35520 -4269 -20145 -50639 -68844 -91850 -113108 -115565 -74399
7379 -74399 -23934 -6350 -19191 -11027 -7179 37099 -9234 -8414 -812 -55292 -33424 47459 60984
7366 60984 59940 32134 34237 65461 30173 4446 -9299 -47695 -35553 8040 58973 79089
7354 79089 -49367 -125762 -71553 -14534 -39882 -36091 -3442 7286 26510 44228 43987 -5793
7342 -5793 -19967 -9939 -26308 21860 4214 44725 59392 31904 -17023 -74905 -65146 -16905
7330 -16905 14523 507 -13495 -36353 -43482 -100078 -103074 -72719 19574 96731 69291 20426
7318 20426 -41140 -33604 -14421 -38062 -43841 -52614 -59559 -55533 -69308 -56683 -63050 -108090 -66094
7305 -66094 -53760 -27146 42325 50652 -4460 -35552 -53576 -713 53854 7146 -34041 -62273
7293 -62273 -39668 -42677 -127606 -106132 -78471 -94141 -146009 -121711 -56536 11040 24771 -48578
7281 -48578 -43304 -28007 -10967 -57993 -40518 2318 789 11083 -6590 -41273 28061 32628
7269 32628 52544 27201 36319 2662 -13685 -35059 -67696 -143859 -141620 -52694 -57249 -41685
7257 -41685 32606 48737 11965 -24087 -60 -10622 -36381 -70580 -80828 -63331 -47911 -2578
7245 -2578 93925 87995 62371 27315 -119356 -209969 -143172 -192657 -198053 -149954 -77411 -30739
7233 -30739 -78091 -101646 -128346 -96667 -33145 34417 62072 29169 -31243 -68831 23794 51924
7221 51924 75985 100947 -8046 -70526 -44163 -50052 10131 6934 12538 22130 78987 64744
7209 64744 19073 -10253 12916 29575 -22393 -65433 -8118 59437 12143 -19040 -50581 -39915
7197 -39915 -91860 -14408 52338 4290 -7390 5226 -28899 -117267 -82476 -7333 -16516 6673
7185 6673 8156 -18882 -28428 9237 -14887 -86947 -85000 -85118 -64517 -36880 -38241 -19495 -20947
7172 -20947 -36165 -43864 9426 70577 87508 14199 46 66431 20046 4423 -47287 -50181
7160 -50181 56876 34666 27797 -47095 -53180 -43093 -13512 -6438 -13061 -22411 12079 -16218 -18178
7147 -18178 20783 24083 -54280 -25344 -30731 -50934 -49923 -36460 -33829 -1565 23031 -19707 35708
7134 35708 59442 36460 -16465 -27764 -32612 -12512 -957 -5267 6121 7947 -30752 35436
7122 35436 107226 109210 68170 38770 -46703 -49467 -7968 34459 -8214 -27222 -5734 15156
7110 15156 -18767 -7941 52220 53866 51660 78114 88732 86722 -429 8852 23493 17911 27542
7097 27542 95626 70037 37681 7288 23921 -43628 -89215 -45858 -34711 4893 -71089 -109564
7085 -109564 -106784 -104072 -110118 -80903 -61509 -123812 -157404 -149277 -111661 -91666 -13213 1883
7073 1883 32465 81038 81993 55492 5998 2235 5738 17599 59087 53194 63728 64176 52360
7060 52360 32223 4061 -86471 -91064 -80898 -137736 -105932 -60077 -41136 -31180 66038 110577
7048 110577 89366 76600 97333 82894 98368 84825 29589 14890 -5538 -8437 -13897 -7198
7036 -7198 -3712 -41054 -104599 -78820 24499 42019 51165 27642 6541 32911 38012 36409 -67584
7023 -67584 -39871 -76164 -9859 37244 -13737 12170 3777 8139 5176 -55748 -78938 -41499
7011 -41499 -62158 -106265 -118266 -138365 -167774 -117335 -69264 -73340 -97944 -50403 -13883 -19849
6999 -19849 -46854 -59416 -54679 28698 -39637 -102809 -21621 14974 -13386 6476 -19777 -39069
6987 -39069 -11454 85616 90777 62283 23836 17179 41183 32170 -42153 -63338 -99638 -54436
6975 -54436 -74880 -128118 -123759 -173892 -169906 -128941 -83236 -70200 -1064 52026 66909 -2361
6963 -2361 -23726 -10188 4611 -11057 -49496 -90419 -167090 -133370 -26941 71545 16317 -105602
6951 -105602 -112724 -50947 -33003 19427 17562 -5121 -77365 -87611 -41083 -33537 55551 106750
6939 106750 57806 18438 -4409 -67176 -28448 -11759 13295 -21359 -32710 -21456 -51589 -15490
6927 -15490 -45421 -13953 74073 93922 44702 -16950 -63408 -56244 -13527 -67046 -52581 21573
6915 21573 48199 60395 38058 1626 -25509 -36107 -66016 -94065 -141234 -143274 -116659 -70823
6903 -70823 -107706 -56165 -83129 -53580 4453 10687 -54882 -122954 -74626 -67381 -75935 -67234 -87140
6890 -87140 -92893 -64162 -55774 -101709 -75175 -29609 -111595 -120002 -120147 -114136 -111101 -97808 -63513
6877 -63513 18821 13420 18590 -22872 4032 43895 67241 40368 2771 -62729 -72123 -101300
6865 -101300 -150604 -135810 -32209 35025 -49981 -117008 -98451 -53992 -1832 17461 7911 -47043
6853 -47043 -128921 -137952 -106348 -11832 -47075 -36684 -24477 35804 31670 9231 -42388 5722
6841 5722 64625 17043 -11528 -44024 -27804 -81539 -123641 -127371 -179966 -150421 -34111 12111
6829 12111 52558 -5680 -80928 -77407 -42800 -3022 5431 -11944 -31117 -41305 -12624 -26334
6817 -26334 5068 59142 27195 9356 -8872 -10647 70158 67182 99233 72107 11084 -48165
6805 -48165 -75106 -32899 -3355 -12420 10457 23583 72179 99797 79143 52770 458 42744
6793 42744 22155 -32125 -24776 -11588 13503 -31434 -65300 -46724 -18982 -4612 -2747 -67701
6781 -67701 -54324 -35551 -58941 -84183 -113298 -100027 -138406 -115532 -98638 -57031 -13304 38690
6769 38690 93532 105609 114404 56429 41577 9218 -90039 -85178 -66076 -22728 -37925 -75374
6757 -75374 -72378 -56839 -39860 -60657 -42992 9816 -18918 -74650 -68693 -12681 14172 -41937
6745 -41937 -61550 -50852 -40832 -102169 -59705 -68619 -110461 -31580 43486 74141 63282 23646
6733 23646 -57557 -113599 -73745 -77048 -107770 -84831 -22067 41880 -5084 -76927 -102070 -79577
6721 -79577 -87018 -132188 -159818 -102402 -78862 -68317 -60555 -73073 -133996 -180478 -105759 -34120
6709 -34120 51664 78942 -10942 -50647 21417 11879 25760 53988 35059 -14977 -51717 -22800
6697 -22800 -13842 -33729 8092 -29032 37703 69302 9017 -35846 -132030 -205996 -187786 -73943
6685 -73943 3220 -7242 826 -12798 -17876 1240 -2067 14574 47180 87294 79811 103475 59933
6672 59933 12957 -18538 -44305 12260 35451 -10804 -14770 50322 79971 139790 151462 104995
6660 104995 57057 69063 55928 47589 21492 8652 32571 91109 21498 -101292 -163576 -226292
6648 -226292 -188225 -106925 -52750 -69456 -12847 21920 72396 4326 -56890 -65520 -115359 -60299
6636 -60299 -7387 -36991 -72310 -24453 -67902 -71929 -33319 -40188 -35645 -71393 -127140 -105107
6624 -105107 15229 65810 76998 51312 -5191 -67721 -35712 -15800 -33464 -126611 -195884
6613 -195884 -103783 -31682 -10556 -22646 -10171 32774 47331 8029 28437 91733 55525 28508
6601 28508 41453 -2798 -17967 8813 -19578 -84444 -89702 -26969 51368 3600 -74244 -89641
6589 -89641 -66514 -39716 -81004 -70588 -91019 -98690 -18929 36864 1320 -7851 -20724 28695
6577 28695 1969 -45279 -14523 -41197 -59675 -28193 -59640 -50187 32696 60721 62111 47454
6565 47454 65878 50401 43959 18811 42171 48533 -19418 -7500 -9355 7530 34911 22983
6553 22983 16156 -47195 -135723 -151945 -204877 -175339 -82628 22726 22336 36710 77037 80547
6541 80547 89893 72614 32205 63036 58748 -1712 -28269 8982 6770 -14363 -1878 -11287 -31449
6528 -31449 -109955 -114660 -115237 -110682 -95422 -51274 -53492 -38244 13643 -31600 -29497 46766 91953
6515 91953 -54945 -76269 -27304 -38477 40250 97181 112592 32951 -63181 -55998 -61108 -102063
6503 -102063 -150300 -128604 -162270 -199109 -231173 -243580 -203125 -114306 -76060 -20957 -19130 18021
6491 18021 8738 -61439 -41609 -37436 -67142 -33914 -55170 -41949 4553 47720 102808 96203
6479 96203 4485 -23879 18416 39983 21912 11662 28075 4649 -35098 -43373 -57089 -51374
6467 -51374 -44131 -51215 -75551 -91653 -133765 -162306 -136160 -96669 -77632 -47011 -56048 -51410 -52197
6454 -52197 -106027 -105372 -57648 -66954 -73298 -83594 -90490 -16485 -81831 -50444 30964 62355 50009
6441 50009 2314 -67659 -80593 -85545 -80616 -100589 -140583 -84658 -833 -12230 -18672 26207
6429 26207 -20669 -108818 -137533 -97365 -113833 -118956 -52017 14640 39928 6973 -46330 -57782
6417 -57782 -3088 15332 35268 -22234 -45435 -71489 -124684 -96660 -32022 -72136 -26429 27111
6405 27111 45781 30475 25745 -957 2050 -18335 -63206 -65359 -71640 -40112 -52024 -49302 -23356
6392 -23356 -3922 -31839 23377 33665 26524 -5257 -13082 2148 4316 -17103 -39014 -51207
6380 -51207 32297 5585 9470 748 -15609 -41430 -79819 -33574 -24030 -17370 -876 -22714 -78178
6367 -78178 -109648 -90496 -74474 -50433 -62194 -51152 -48512 -25589 -3904 40519 10751 -61712
6355 -61712 -33347 -68644 -109192 -26915 38764 3779 17454 36968 5674 -15720 -48043 -23263
6343 -23263 62377 88187 57850 33015 -4190 -30439 -57480 -29685 88 -22088 -16618 -4562
6331 -4562 1724 -11409 381 -8941 28922 -5005 -14325 60993 91714 84109 66768 32875 -3165
6318 -3165 -3900 -14032 13765 60545 27090 -21 -13643 -92723 -99774 -84105 -74419 16070 -24041
6305 -24041 -83515 -75712 -24257 73686 112198 23372 -32849 -55394 -52197 -75389 -23658 41036
6293 41036 -11338 -284 46748 29434 4403 -76950 -95324 -42108 36591 34481 507 4614
6281 4614 -49531 -75597 -12504 26548 37007 41057 4551 6172 65565 -14446 -17241 34932 22770
6268 22770 -29062 -90461 -21641 -10906 -60299 -80015 -69614 -86905 -154721 -144715 -100301 -8765
6256 -8765 33267 29574 99277 112596 115279 92124 83530 18351 -64674 -90313 -80752 -71240 -35106
6243 -35106 2582 -11301 -85688 -68882 -57191 19329 15062 -62545 -38678 4925 2587 45400
6231 45400 -32396 -55470 -64250 -82095 -76804 -72782 -41840 337 16233 -14642 -61897 -72872
6219 -72872 -60102 16673 91757 84453 -24458 -102104 -165284 -111099 -78471 -47218 -2258 -8380
6207 -8380 11085 36299 62945 76357 16380 -48424 -100952 -124883 -100329 -34838 30581 -2354
6195 -2354 -66861 -56390 -53613 -80712 -40102 -22354 -50362 -74445 -102262 -127206 -108547 -89719
6183 -89719 -42068 -10383 -12892 -3330 -72420 -126264 -86835 -37621 -26026 -22656 -32533 -21534 -39943
6170 -39943 -82918 -70359 -29891 306 -14695 -7431 -26607 -13312 -8785 2011 25171 22750
6158 22750 19729 48098 70699 58705 103599 76171 46152 -6625 -35326 -68749 -109714 -132704
6146 -132704 -114612 -55751 78282 56252 -19523 -45596 -609 -12715 13833 36025 32225 -11990
6134 -11990 16116 58198 77653 120494 213958 165300 137002 55270 -13154 -38899 -23550 5183
6122 5183 31943 7192 -77875 -141109 -155588 -157289 -69913 -59915 -50657 9292 36475 19080 59621
6109 59621 88292 19730 -49244 -75944 -101694 -77082 -46400 -86395 -45024 38921 53991 88570
6097 88570 123534 153819 139559 133456 107694 118043 139914 93830 39890 46647 14288 -333
6085 -333 17803 18614 27686 20328 18065 -30918 30952 94399 131022 99565 9461 -7793 -3056
6072 -3056 -8049 -2172 24394 22616 -3686 -1998 28367 -4907 1860 -12152 -56425 -24136 38010
6059 38010 43243 -8189 -8893 -31444 -95596 -163137 -128105 -189815 -179130 -73174 -23866 -17521
6047 -17521 14031 -3916 -37021 -11935 -23753 -78014 -103023 -79758 -90736 -89148 -48369 -12135
6035 -12135 12565 -23513 -20175 -8415 6909 -21277 -73127 -19312 16987 -60448 -81793 -141367
6023 -141367 -128511 -160937 -87397 3760 25849 32487 80381 59325 -35678 -70027 -52361 -61175
6011 -61175 -50256 -38920 -14686 3993 -24955 -53166 -43167 -6462 24874 80230 71257 12534
5999 12534 -31375 -6513 1366 5019 -18240 13482 1766 -54215 -30874 -41859 2013 91846
5987 91846 65144 56627 42533 41461 27303 -23831 -55686 -54404 -30818 -51209 -8629 41107
5975 41107 22643 20950 50100 1200 -3029 43365 33387 34727 14145 -40505 10526 64668 107039
5962 107039 131630 54700 68586 84574 104389 51029 6509 62280 27779 -12437 3075 33905
5950 33905 70158 50589 21570 54113 65303 3342 39267 82051 59906 67782 31808 64177
5938 64177 82214 30098 -47091 -86627 -92674 -35456 39149 64104 33826 37865 56754 13799
5926 13799 18287 -46553 -76493 -119553 -154092 -164490 -104846 -75464 -84161 -50181 -137 48460
5914 48460 52192 38399 53334 99530 43895 16415 -2016 -49312 -54088 -71104 -32638 947
5902 947 68990 103422 105756 78608 43498 -5500 2449 -24673 -48990 439 39493 22468 -51984
5889 -51984 -91494 -111257 -70843 -55358 -72664 -64947 -71971 -123826 -85366 -69407 -15759 -61245
5877 -61245 -48849 -46934 -94015 -93437 -46142 -65591 -51025 -5289 -32802 -29251 19210 -742 12878
5864 12878 -36547 -37706 39180 5998 -58390 -103081 -112799 -41149 -8344 -16966 -38430 -6296
5852 -6296 38151 6191 -68760 -25110 -52683 -108733 -98555 -121394 -87817 -21808 13081 19654
5840 19654 -31101 -95550 -19211 40299 -6938 -40505 -62002 -49087 -62170 -26592 8264 -17229
5828 -17229 -50642 -14865 -63450 -62783 46793 67741 68519 109832 86787 -56379 -115145 -81436
5816 -81436 -32764 29077 6890 -107234 -134388 -189718 -190971 -159954 -138991 -148651 -73368 -97548
5804 -97548 -88597 -62658 -50067 38503 81445 149866 101837 44742 10640 28772 -8080 -6318
5792 -6318 26460 46818 65815 62623 8679 2252 -30706 -26802 24277 26228 52254 82573 125206
5779 125206 91806 13406 -39359 -62230 -115896 -134602 -77547 16753 16804 -27101 -38175 -29658
5767 -29658 -37113 -49010 -42710 -131449 -81401 -35283 -66493 -55548 -28310 -75626 -77663 -111248
5755 -111248 -74088 -18019 -37676 -39293 -52227 -52725 -132860 -180839 -179377 -124471 -80747 -1114
5743 -1114 58016 11077 -26552 -27984 -17384 6939 22437 -37594 -16151 28915 -5241 12557
5731 12557 17405 56700 38298 62992 71993 51329 41054 102602 98231 78117 48865 -35913
5719 -35913 -28217 -10152 -6617 -70843 -18708 -39331 -43462 -51347 -4987 -55829 -99174 -51644 -14151
5706 -14151 7910 63559 70139 32089 -17286 66326 101269 71243 71097 -9216 -82923 -88046 -99759
5693 -99759 -85563 -108144 -113499 -82290 -41797 9340 -646 -54308 -29769 29300 74521 42927
5681 42927 -44848 -68855 -67190 -38014 -20114 27805 55892 53720 68922 128327 112997 71435
5669 71435 21389 -33347 6162 22596 11310 -36621 -81656 -56570 -45778 -73208 -54120 -20593
5657 -20593 35174 47017 -14057 -44463 -57269 -90187 -67197 -75734 -62572 -59502 -98957 -121369
5645 -121369 -148793 -166709 -78272 -17270 -34680 -108940 -98593 -114567 -150028 -147499 -163034 -132602
5633 -132602 -119011 -76158 -106236 -130540 -124882 -137975 -78381 -21787 -19800 -81300 -115592 -151127
5621 -151127 -87871 -29980 -23134 -29170 444 16120 -13888 -93063 -76864 -8045 -19245 -59563
5609 -59563 -2589 44888 61041 108517 47637 -5276 254 55223 109161 57449 -77967 -68140
5597 -68140 69834 83396 75660 11816 -37197 -8914 -26513 -56093 -65491 -67041 -57903 -85267
5585 -85267 -152631 -216566 -134761 -41393 -35823 -35348 -12916 -10954 13586 63714 29909 -12811 -11018
5572 -11018 3687 -12500 -12873 26302 32586 387 -14021 -23136 -51574 -24407 -76849 -32434 -23183
5559 -23183 3596 2368 790 -79932 -5085 65905 73519 78469 67918 21789 16648 22680 -13055
5546 -13055 -62731 -67475 -7899 44446 54348 111229 163733 145452 102018 109820 93293 77191
5534 77191 109563 81770 39374 -18750 -63588 -17443 6348 40346 89270 95068 78749 84573
5522 84573 70302 34430 79985 123425 112448 125210 19437 -48602 -69881 29915 95940 74282
5510 74282 33371 25760 35349 20585 -4551 12584 -17861 -27421 2729 -35378 -92711 -134803
5498 -134803 -60519 12069 23769 19276 42847 76781 114376 54971 -28102 -63046 -24594 -105080
5486 -105080 -198133 -147691 -78027 -77453 -86734 -98880 -96440 -44877 -34913 -48896 -49733 -46328 -940
5473 -940 34314 43895 1525 -9711 -74378 -65280 -56323 -60624 -74859 -32609 -30096 -8759 33045
5460 33045 34588 27204 -31993 -33394 -67454 -99692 -62338 35027 54232 -26853 4 1685 -7248
5447 -7248 -31073 -87062 -141024 -73160 19414 61830 53123 956 -22970 -6983 -16736 -8368 -1490
5434 -1490 -32365 -46526 28864 4694 61086 86180 101176 101296 134155 109613 137786 42803
5422 42803 21686 43132 -51539 -27165 15329 -4451 3196 23212 -4970 -3960 -28999 -68764
5410 -68764 -66201 -78763 -104848 -93580 -75284 -19728 -3350 -14045 -61927 -110519 -36581 -577
5398 -577 49841 -3981 -21134 -28998 -67831 -116271 -112406 18645 56145 43215 40876 44087 7767
5385 7767 4657 1775 61240 49881 21335 -36631 -61076 -71793 -34912 47657 61258 109753
5373 109753 151522 204131 184237 90991 -102 -39092 16055 88934 89695 8923 -34034 -77151
5361 -77151 -144139 -83803 62398 125099 94504 100311 150157 97218 105787 119270 62795 10763
5349 10763 50642 19179 933 -11394 -1614 21355 -66792 -149618 -164507 -147589 -86005 -64196
5337 -64196 -60715 -41798 -61919 -103452 -92814 -64993 -57066 -99093 -130057 -118660 -138284 -142807
5325 -142807 -80794 -71997 -82175 -69534 -96174 -81517 -29803 88467 108892 76873 59784 32079
5313 32079 56117 21782 -31631 596 -19524 -65240 -37818 35284 46059 24117 311 -2633
5301 -2633 -18927 -24420 -52559 -49960 -42344 -67858 -104426 -140039 -90661 -83173 -3233 -25329 -81858
5288 -81858 -119366 -70322 -65773 -107511 -95424 -28138 -70505 -105139 -116005 -102532 -58587 -48663
5276 -48663 -10207 24977 31908 -33431 -26940 27309 36608 30910 80277 125864 133638 126976 126176
5263 126176 134646 112964 91324 133488 155560 78409 16544 64100 86060 125748 94473 72525
5251 72525 38547 -19405 -35529 -23771 -6074 7542 37247 67907 32814 -10266 6761 30052
5239 30052 5108 31139 34804 32140 11805 -22126 -24737 -33536 -73693 -56399 -7799 17814 2193
5226 2193 -20431 -18099 -26059 13881 -41025 -38434 -54850 8242 32593 13554 -60306 -53136 -11090
5213 -11090 -15919 -13600 5685 -26390 -30790 -43562 -37461 -32596 17261 45387 31488 15727 -35815
5200 -35815 -74189 -73194 -10154 63629 82860 56083 83417 130832 82514 57540 16589 -30149
5188 -30149 -49349 -46801 -50381 -70463 -23738 10592 26946 55559 11258 -39299 -20297 -34120
5176 -34120 -82666 -66668 -46783 -64474 -110328 -107192 -126143 -183592 -111125 -81196 -93006 -49566
5164 -49566 10043 5829 -33897 24912 18495 -13854 -64304 -57034 -42440 -29598 8996 -15811
5152 -15811 -32689 -81296 -85738 -74822 -5474 36657 14439 77567 -5964 -43643 -13939 -61367
5140 -61367 -97744 -120252 -18568 -7662 -33385 -101704 -149098 -118230 -106481 -89621 -8837 33090
5128 33090 14379 -63332 -94272 -94604 -58310 -60328 -104387 -129315 -109780 -67610 -76962 -77810 -38328
5115 -38328 -71800 -128251 -93986 -20080 3762 -52489 -67191 -21538 -50304 -87784 -102832 -121459
5103 -121459 -42207 26601 -9955 9368 99940 135069 92712 100879 42840 -10994 -19735 4864
5091 4864 27016 73972 113405 82071 87592 82393 90684 11688 -43385 -28252 85523 74312
5079 74312 24036 14008 48512 -43956 -55283 8212 98552 108325 65209 65993 81601 48251
5067 48251 -15831 -20941 1883 49217 20935 -27350 42456 10927 -44335 -65882 -63366 -94612
5055 -94612 -61738 -38842 -19167 75415 66279 72208 87404 -1579 -59484 -66717 -47139 -33977
5043 -33977 -34045 -27141 -50796 -69086 -8036 66280 50056 10681 65179 47624 -24061 -40319 -11950
5030 -11950 -15127 -96671 -103148 -103866 -121562 -71078 -44190 -40993 22119 63423 42115 -23985 -18789
5017 -18789 39877 68872 14793 -35149 -45911 -39796 -28910 -51107 -67155 -59337 -13989 8838
5005 8838 6212 10687 13266 82550 126748 10908 -7869 -10343 -14309 3696 -43506 -44707 -51697
4992 -51697 -60363 -6667 24781 79869 81407 44026 -3004 -5606 39748 20048 21133 38493 46132
4979 46132 4954 14803 18192 -4763 10206 -41605 -57845 -2002 -24006 39389 24590 41425
$$ [...]
##END NTUPLES=NMR SPECTRUM
##END=
