##TITLE=Analysis number 319621
Compound Code cc 56014
Book Reference 438/140
Project Code adrs
Chemist Name antons
##JCAMPDX= 6.0         $$ Bruker NMR JCAMP-DX V2.0
##DATA TYPE= NMR SPECTRUM
##DATA CLASS= NTUPLES
##ORIGIN= Bruker BioSpin GmbH
##OWNER= nmr
$$ XWIN-NMR		Version 3.5
$$ Mon May 22 12:26:37 2006 GMT Daylight Time (UT+1h)  MAYBRIDGE\nmr@NMR_250MHZ
##.OBSERVE FREQUENCY= 250.131544655141
##.OBSERVE NUCLEUS= ^1H
##.ACQUISITION MODE= SIMULTANEOUS (DQD)
##.ACQUISITION SCHEME= undefined
##.AVERAGES= 16
##.DIGITISER RES= 18
##SPECTROMETER/DATA SYSTEM= dpx250
##.PULSE SEQUENCE= zg30
##.SOLVENT NAME= CDCl3
##.SHIFT REFERENCE= (INTERNAL, CDCl3, 0, 16.4425)
##AUDIT TRAIL= $$ (NUMBER, WHEN, WHO, WHERE, WHAT)
$$ ##TITLE= Audit trail, XWIN-NMR		Version 3.5
$$ ##JCAMPDX= 5.01
$$ ##ORIGIN= Bruker BioSpin GmbH
$$ ##OWNER= nmr
$$ C:\u/data/dgb/nmr/ADRS/4870/pdata/1/auditp.txt
$$ ##AUDIT TRAIL=  $$ (NUMBER, WHEN, WHO, WHERE, WHAT)
(   1,<2006-05-22 12:26:12.66 +100>,<MAYBRIDGE\nmr>,<NMR_250MHZ>,
      <created by zg, POWCHK disabled, PULCHK disabled
       configuration hash MD5:
       84 BC 41 DB A1 6E 1D 46 DA 25 12 A5 C1 ED C5 3A
       data hash MD5: 64K
       F5 6F 33 D6 97 F7 73 13 BE 85 54 B3 94 25 8B 74>)
(   2,<2006-05-22 12:26:26.94 +100>,<MAYBRIDGE\nmr>,<NMR_250MHZ>,
      <Start of raw data processing
       ef LB = 0.3 FT_mod = 6 PKNL = 1 SI = 32K 
       data hash MD5: 32K
       60 D9 F4 55 75 A9 A9 69 77 2A 64 F6 2B E2 C2 DF>)
(   3,<2006-05-22 12:26:28.66 +100>,<MAYBRIDGE\nmr>,<NMR_250MHZ>,
      <apk 
       data hash MD5: 32K
       69 20 5D 1D BB E4 FB 52 DF AD DD 2C B5 E2 52 D1>)
(   4,<2006-05-22 12:26:29.42 +100>,<MAYBRIDGE\nmr>,<NMR_250MHZ>,
      <abs ABSG = 5 
       data hash MD5: 32K
       CC CB 1B 39 85 C1 B8 66 73 CA 72 9B 95 8B 7E 98>)
$$ ##END=
$$ 
$$ hash MD5
$$ DF 13 3B C8 1B 5A 8F 7A 8C 77 DF 04 27 3D AD 28
##$RELAX= 
##$RELAX= 
##$RELAX= 
##$RELAX= 
##$RELAX= 
##$RELAX= 
##$RELAX= 
$$ Bruker specific parameters
$$ --------------------------
##$DU= <C:\u>
##$EXPNO= 4870
##$NAME= <ADRS>
##$PROCNO= 1
##$TYPE= <nmr>
##$USER= <dgb>
##$AMP= (0..31)
100 100 100 100 100 100 100 100 100 100 100 100 100 100 100 100 100 100 
100 100 100 100 100 100 100 100 100 100 100 100 100 100 
##$AQSEQ= 0
##$AQ_mod= 3
##$AUNM= <au_zg>
##$AUTOPOS= <25 >
##$BF1= 250.13
##$BF2= 250.13
##$BF3= 250.13
##$BF4= 250.13
##$BF5= 500.13
##$BF6= 500.13
##$BF7= 500.13
##$BF8= 500.13
##$BYTORDA= 1
##$CFDGTYP= 0
##$CFRGTYP= 5
##$CHEMSTR= <none>
##$CNST= (0..31)
1 1 145 1 1 1 1 1 1 1 1 1 1 1 1 1 1 1 1 1 1 1 1 1 1 1 1 1 1 1 1 1 
##$CPDPRG= <>
##$CPDPRG1= <>
##$CPDPRG2= <>
##$CPDPRG3= <>
##$CPDPRG4= <mlev>
##$CPDPRG5= <mlev>
##$CPDPRG6= <mlev>
##$CPDPRG7= <mlev>
##$CPDPRG8= <mlev>
##$CPDPRGB= <>
##$CPDPRGT= <>
##$D= (0..31)
0 1 0 0 0 0 0 0 0 0.06 0 0 0 0 0 0 0.0002 0 0 0 0 0 0 0 0 0 0 0 0 0 0 
0 
##$DATE= 1148297171
##$DBL= (0..7)
120 120 120 120 120 120 120 120 
##$DBP= (0..7)
150 150 150 150 150 150 150 150 
##$DBP07= 0
##$DBPNAM0= <>
##$DBPNAM1= <>
$$ [...]
##$SUBNAM7= <"">
##$SUBNAM8= <"">
##$SUBNAM9= <"">
##$SW= 20.6930455092707
##$SWIBOX= (0..15)
0 0 3 0 0 0 0 0 0 0 0 0 0 0 0 0 
##$SW_h= 5175.983436853
##$TD= 65536
##$TD0= 1
##$TE= 294.16
##$TE2= 300
##$TE3= 300
##$TEG= 300
##$TL= (0..7)
0 120 120 120 120 120 120 120 
##$TP= (0..7)
150 150 150 150 150 150 150 150 
##$TP07= 0
##$TPNAME0= <>
##$TPNAME1= <>
##$TPNAME2= <>
##$TPNAME3= <>
##$TPNAME4= <>
##$TPNAME5= <>
##$TPNAME6= <>
##$TPNAME7= <>
##$TPOAL= (0..7)
0.5 0.5 0.5 0.5 0.5 0.5 0.5 0.5 
##$TPOFFS= (0..7)
0 0 0 0 0 0 0 0 
##$TUNHIN= 0
##$TUNHOUT= 0
##$TUNXOUT= 0
##$USERA1= <user>
##$USERA2= <user>
##$USERA3= <user>
##$USERA4= <user>
##$USERA5= <user>
##$V9= 5
##$VALIST= <valist>
##$VCLIST= <CCCCCCCCCCCCCCC>
##$VD= 0
##$VDLIST= <DDDDDDDDDDDDDDD>
##$VPLIST= <PPPPPPPPPPPPPPP>
##$VTLIST= <TTTTTTTTTTTTTTT>
##$WBST= 1024
##$WBSW= 4
##$XGAIN= (0..3)
0 0 0 0 
##$XL= 0
##$YL= 0
##$YMAX_a= 262069
##$YMIN_a= -581860
##$ZGOPTNS= <>
##$ZL1= 120
##$ZL2= 120
##$ZL3= 120
##$ZL4= 120
##$ABSF1= 16.44251
##$ABSF2= -4.250662
##$ABSG= 5
##$ABSL= 3
##$ALPHA= 0
##$AQORDER= 0
##$ASSFAC= 0
##$ASSFACI= 0
##$ASSFACX= 0
##$ASSWID= 0
##$AUNMP= <proc_1d>
##$AZFE= 0.1
##$AZFW= 0.1
##$BCFW= 0
##$BC_mod= 0
##$BYTORDP= 0
##$COROFFS= 0
##$CY= 12.5
##$DATMOD= 1
##$DC= 0
##$DFILT= <>
##$DTYPP= 0
##$F1P= 14.0000005364418
##$F2P= -0.99999901652339
##$FCOR= 0.5
##$FTSIZE= 32768
##$FT_mod= 6
##$GAMMA= 0
##$GB= 0
##$INTBC= 1
##$INTSCL= 1
##$ISEN= 128
##$LB= 0.3
##$LEV0= 0
##$LPBIN= 0
##$MAXI= 10000
##$MC2= 0
##$MEAN= 0
##$ME_mod= 0
##$MI= 0
##$NCOEF= 0
##$NC_proc= -4
##$NLEV= 6
##$NOISF1= 0
##$NOISF2= 0
##$NSP= 0
##$NTH_PI= 0
##$NZP= 0
##$OFFSET= 16.44251
##$PC= 1
##$PHC0= 166.5363
##$PHC1= 9.55292
##$PH_mod= 1
##$PKNL= yes
##$PPARMOD= 0
##$PSCAL= 4
##$PSIGN= 0
##$REVERSE= no
##$SF= 250.130019880596
##$SI= 32768
##$SIGF1= 0
##$SIGF2= 0
##$SINO= 400
##$SIOLD= 32768
##$SREGLST= <1H.CDCl3>
##$SSB= 0
##$STSI= 32768
##$STSR= 0
##$SW_p= 5175.98343685301
##$SYMM= 0
##$S_DEV= 0
##$TDeff= 65536
##$TDoff= 0
##$TI= <Analysis number 999999
Compound Code 99
Book Reference 9
Project Code 9>
##$TILT= no
##$TM1= 0
##$TM2= 0
##$TOPLEV= 0
##$USERP1= <user>
##$USERP2= <user>
##$USERP3= <user>
##$USERP4= <user>
##$USERP5= <user>
##$WDW= 1
##$XDIM= 32768
##$YMAX_p= 378297831
##$YMIN_p= -141323
$$ End of Bruker specific parameters
$$ ---------------------------------
##NTUPLES= NMR SPECTRUM
##VAR_NAME=  FREQUENCY,     SPECTRUM/REAL,   SPECTRUM/IMAG
##SYMBOL=    X,             R,               I
##VAR_TYPE=  INDEPENDENT,   DEPENDENT,       DEPENDENT
##VAR_FORM=  AFFN,          ASDF,            ASDF
##VAR_DIM=   32768,         32768,           32768
##UNITS=     HZ,            ARBITRARY UNITS, ARBITRARY UNITS
##FACTOR=    0.157963299565203, 1,           1
##FIRST=     4112.76550448014, 0,            0
##LAST=      -1063.21793237287, 0,           0
##MIN=       -1063.21793237287, -141323,     0
##MAX=       4112.76550448014, 378297831,    0
$$ Real data points
##PAGE= N=1
##DATA TABLE= (X++(R..R)), XYDATA
$$ [...]
$$ plain form
20281 -66553 -4274 6898 -27077 -36981 -59158 -67629 -48936 -71798 -61334 -38699 -3057 -4493
20269 -4493 -36909 -56090 -47184 -12523 -8679 -2810 8238 39248 21088 -11099 -566 -10498 -60994
20256 -60994 -88201 -91270 -54772 -25783 -29728 -7850 -7314 19455 -6981 -23689 -10888 -8849 -19074
20243 -19074 -19921 -65793 -85176 -79974 -54812 -42938 -24425 -11278 4469 -17652 -48316 -65778
20231 -65778 -54466 -68833 -73597 -64098 -23231 8494 11116 -17735 -20107 -21244 11922 1662 -21087
20218 -21087 -3476 -12466 -36285 -28829 -28008 -47950 -69614 -42616 -21365 -14682 -4016 -35722 -18544
20205 -18544 41907 13360 9737 55791 83660 79403 39369 8165 -18019 -32406 -59823 -67083
20193 -67083 -30946 6885 1419 26135 58628 58167 39413 19869 5548 21879 18815 27498 25793
$$ packed form
20281f6553O2279J1172l3975r904k2177q471J8693k2862J0464K2635L5642j436
20269d493l2416j9181Q906L4661L844N869J1048L1010j8160l2187J0533r932n0496
20256f0994k7207l069L6498K8989l945K1878N36K6769k6436j6708J2801K039j0225
20243a9074q47m5872j9383N202K5162J1874J8513J3147J5747k2121l0664j7462
20231f5778J1312j4367m764R499M0867L1725K622k8851k372j137L3166j0260k2749
20218b1087J7611q990k3819P456Q21j9942k1664K6998K1251O683J0666l1706J7178
20205a8544O0451k8547l623M6054K7869m257m0034l1204k6184j4387k7417p260
20193f7083L6137L7831n466K4716L2493m61j8754j9544j4321J6331l064Q683j705
$$ plain form
20180 25793 3252 -6183 -7350 3678 8232 4501 -26937 -46431 -34373 -24739 -33178 -19343 -83122
20167 -83122 -89882 -59610 -25774 -20954 -11203 -18111 -16136 -18712 -25661 -43629 -73955 -60798 -38895
20154 -38895 -68509 -87322 -49994 3097 31780 37797 25364 27524 46626 27618 -2194 3964
20142 3964 19113 19220 -29053 -18328 -31154 -47974 -63650 -90658 -95958 -103615 -67502 -27158 -42913
20129 -42913 -64946 -38714 29868 75018 80238 39586 40971 25389 20282 19136 10085 13418 2650
20116 2650 1117 23659 20904 33503 36850 63349 48276 39969 12051 5456 -5879 -2630 -13929
20103 -13929 -6555 -7355 -33084 -52394 -55379 -32962 4887 16602 -14127 -29163 -23879 -15573 10725
20090 10725 26974 -18654 -67594 -78103 -51062 -23297 -6530 7103 13813 -23569 -54108 -7219
$$ packed form
20180B5793k2541r435j167J1028M554l731l1438j9494J2058R634q439J3835o3779
20167h3122o760L0272L3836M820R751o908J975k576o949j7968l0326J3157K1903
20154c8895k9614j8813L7328N3091K8683O017j2433K160J9102j9008k9812O158
20142C964J5149J07m8273J0725j2826j6820j5676k7008n300p657L6113M0344j5755
20129d2913k2033K6232O8582M5150N220m0652J385j5582n107j146r051L333j0768
20116B650j533K2542k755J2599L347K6499j5073q307k7918o595j1335L249j1299
20103a3929P374q00k5729j9310k985K2417L7849J1715l0729j5036N284Q306K6298
20090A0725J6249m5628m8940j0509K7041K7765J6767J3633O710l7382l0539M6889
$$ plain form
20078 -7219 -8956 -6803 51955 74826 55943 62084 68634 54625 27117 16583 39759 21425 23594
20065 23594 26779 14663 13728 -16622 -37022 -78897 -76264 -76772 -64777 -28029 -14918 -39056 -42718
20052 -42718 -38635 -32206 -27974 -10336 -58753 -63191 -35578 -32293 4593 9290 -14692 -15186 -36166
20039 -36166 -36530 1990 979 -30225 -70712 -48335 -25292 4 -11013 -8556 6669 625 18237
20026 18237 18911 13540 32971 4415 -23635 -21962 -20075 -11053 4103 9815 -3080 -19268 -9246
20013 -9246 -20121 -19013 -24853 -16364 -54206 -50253 -57944 -52135 -82655 -51448 -22859 -25233 -52942
20000 -52942 -21824 -11927 17904 29346 4603 -5174 -5002 -8568 -12136 -13851 -50775 -2818 19388
19987 19388 24863 -39828 -69635 -66198 -37568 18239 -5530 -32336 -69482 -81738 -85130 -54469
$$ packed form
20078g219j737K153N8758K2871j8883O141O550j4009k7508j0534K3176j8334K169
20065B3594L185j2116r35l0350k0400m1875K633n08J1995L6748J3111k4138l662
20052d2718M083O429M232J7638m8417m438K7613L285L6886M697k3982m94k0980
20039c6166l64L8520j011l1204m0487K2377K3043K5296j1017K457J5225o044J7612
20026A8237O74n371J9431k8556k8050J673J887R022J5156N712j2895j6188J0022
20013i246j0875J108n840Q489l7842L953p691N809l0520L1207K8589k374k7709
20000e2942L1118R897K9831J1442k4743r777J72l566l568j715l6924M7957K2206
19987A9388N475o4691k9807L437K8630N5807k3769k6806l7146j2256l392L0661
$$ plain form
19975 -54469 -42582 1855 32485 12875 47362 62639 70159 24347 14960 -23316 -26807 -44534
19963 -44534 -28059 13081 38403 47949 65156 72163 40063 2207 13386 14526 -19210 -62502
19951 -62502 -44581 -28292 -17349 -26866 -50611 -32474 -8746 -5526 21707 16147 6709 38608
19939 38608 50578 34684 493 -2041 49373 95958 84698 42458 7744 -1278 21684 2117
19927 2117 2723 12751 10770 19281 23563 7168 -15557 -40176 -16240 7990 16916 20503 -23079
19914 -23079 -48624 -38697 -18519 -14257 -40013 -48282 7686 -1506 -23106 -29246 -43462 -12158 -21582
19901 -21582 -27988 -43526 -9399 4850 -5684 -37782 -59530 -43716 -29938 12954 29244 22689
19889 22689 36068 26852 54855 37564 10838 -20883 -31459 -12672 -3480 -1544 17909 33938
$$ packed form
19975e4469J1887M4437L0630j9610L4487J5277P520m5812r387l8276l491j7727
19963d4534J6475M1140K5322R546J7207P007l2100l7856J1179J140l3736m3292
19951f2502J7921J6289J0943r517k3745J8137K3728L220K7233n560r438L1899
19939C8608J1970j5894l4191k534N1414M6585j1260m2240l4714r022K2962j9567
19927B117O06J0028j981Q511M282j6395k2725k4619K3936K4230Q926L587m3582
19914b3079k5545R927K0178M262k5756q269N5968r192k1600o140j4216L1304r424
19901b1582o406j5538L4127J4249j0534l2098k1748J5814J3778M2892J6290o555
19889B2689J3379r216K8003j7291k6726l1721j0576J8787R192J936J9453J6029
$$ plain form
19877 33938 -12931 -1511 11204 -18047 -41479 -19092 -9280 -14332 -34844 -23861 30419 61272
19865 61272 54217 38922 51151 29831 -11417 -20306 -17278 -60613 -60190 -33000 -44191 -13507 4799
19852 4799 -4737 -3307 -11806 7758 -2974 -44027 -57094 -24619 -34728 -47758 -30385 -33909 -25736
19839 -25736 -31663 -37146 -34453 -17238 19720 -23744 -37201 -20478 -27963 -45873 -29611 -53505
19827 -53505 -61823 -62323 -51326 -66430 -48338 -15687 22810 33273 23874 -18545 -26353 -44298 -15839
19814 -15839 34285 51906 38610 29129 19233 28725 27742 -3460 -41373 -42571 -34538 -6597 -16401
19801 -16401 -48887 -40766 22006 52319 28007 -21061 -48405 -29686 -18888 -10296 -39698 -67139
19789 -67139 -73022 -29499 7846 2016 -12361 -13912 16720 -24335 -60265 -10408 4609 -2222
$$ packed form
19877C3938m6869J1420J2715k9251k3432K2387R812n052k0512J0983N4280L0853
19865F1272p055j5295J2229k1320m1248q889L028m3335M23K7190j1191L0684J8306
19852D799r536J430q499J9564j0732m1053j3067L2475j0109j3030J7373l524Q173
19839b5736n927n483K693J7215L6958m3464j3457J6723p485j7910J6262k3894
19827e3505q318n00J0997j5104J8092L2651L8497J0463r399m2419p808j7945K8459
19814a5839N0124J7621j3296r481r896R492r83l1202l7913j198Q033K7941r804
19801a6401l2486Q121O2772L0313k4312m9068k7344J8719J0798Q592k9402k7441
19789f7139n883M3523L7345n830j4377j551L0632m1055l5930M9857J5017o831
$$ plain form
19777 -2222 25530 23100 20150 31330 41425 57068 58083 36126 60338 70137 54897 55471 35147
19764 35147 35250 83099 113154 114812 140483 154298 155598 134990 111560 93790 68876 35831
19752 35831 -1931 19303 39880 81067 107122 96529 43479 18779 25431 35635 42006 37195
19740 37195 38236 43848 30397 12217 -20009 -38257 -17563 9270 15224 -30774 -39963 -17271
19728 -17271 -15461 -38508 11202 49863 30010 43585 74392 64828 99762 125819 126158 162788
19716 162788 223589 270168 283396 288024 341561 387539 463287 428705 357792 302242 276099 228381
19704 228381 196156 143198 116917 97443 92878 102837 108327 123642 117988 97130 36190 15916
19692 15916 7523 -13442 -12073 22911 45846 44502 60650 53580 67743 92158 101238 101667 70674
$$ packed form
19777b222K7752k430k950J1180J0095J5643J015k1957K4212R799j5240N74k0324
19764C5147J03M7849L0055J658K5671J3815J300k0608k3430j7770k4914l3045
19752C5831l7762K1234K0577M1187K6055j0593n3050k4700O652J0204O371m811
19740C7195J041N612j3451j8180l2226j8248K0694K6833N954m5998r189K2692
19728a7271J810k3047M9710L8661j9853J3575L0807r564L4934K6057L39L6630
19716A62788O0801M6579J3228M628N3537M5978P5748l4582p0913n5550k6143m7718
19704B28381l2225n2958k6281j9474m565R959N490J5315n654k0858o0940k0274
19692A5916q393k0965J369L4984K2935j344J6148p070J4163K4415R080M29l0993
$$ plain form
19679 70674 32866 7496 5389 57406 75151 106295 130990 130894 97227 63218 53283 56140 65227
19666 65227 79382 57097 41114 57943 58044 25711 -10217 -1276 12268 33611 43051 28399
19654 28399 22676 25916 47206 59612 63495 46006 44011 13786 -11922 -12488 3843 23359 53271
19641 53271 68582 6943 -3391 -14682 -28559 -39130 -17924 12883 43270 24598 -5428 -7490
19629 -7490 3182 16182 30115 42131 76628 50805 27368 29110 20774 -10491 -11593 3341
19617 3341 26513 15546 11001 12521 12941 57054 53944 8111 9560 29237 61749 56498 5270
19604 5270 -16179 -41992 -24933 23798 40342 8850 -8838 -33503 -19697 8458 36549 58431
19592 58431 40452 29427 19703 -9635 -11111 -26483 -50922 -75802 -69252 -45407 -56165 -71477
$$ packed form
19679G0674l7808k5370k107N2017J7745L1144K4695r6l3667l4009r935K857R087
19666F5227J4155k2285j5983J6829J01l2333l5928Q941J3544K1343R440j4652
19654B8399n723L240K1290J2406L883j7489j995l0225k5708n66J6331J9516K9912
19641E3271J5311o1639j0334j1291j3877j0571K1206L0807L0387j8672l0026k062
19629g490J0672J3000J3933J2016L4497k5823k3437J742q336l1265j102J4934
19617C341K3172j0967m545J520M20M4113l110m5833J449J9677L2512n251n1228
19604E270k1449k5813J7059M8731J6544l1492j7688k4665J3806K8155K8091K1882
19592E8431j7979j1025r724k9338j476j5372k4439k4880O550K3845j0758j5312
$$ plain form
19580 -71477 -18837 20386 21460 10711 38810 30572 14642 24829 50055 32085 4724 7530
19568 7530 34492 71445 75541 23104 44939 96259 94703 56258 56208 35758 15914 -22886 -1634
19555 -1634 6718 17888 5840 2160 28736 42686 46438 46721 48532 40394 1584 5607 915 -50786
19541 -50786 -103866 -96443 -86425 -72640 -67630 -30914 -14675 -1884 26660 12340 18301 6111
19529 6111 -6377 11004 17367 42447 47095 30012 42596 62852 38408 -26969 -61125 -29642
19517 -29642 -7707 -6644 9079 11991 -15731 -41981 -27805 -33527 -25797 6044 28900 17989
19505 17989 9255 22127 14757 5652 8550 -9040 -21970 -18367 -11407 20255 20835 28316 24499 24239
19491 24239 12680 44620 57258 43245 4926 -8534 -1216 1322 20616 38728 18421 -9265
$$ packed form
19580g1477N2640L9223J074j0749K8099q238j5930J0187K5226j7970k7361K806
19568G530K6962L6953M096n2437K1835N1320j556l8445n0k0450j9844l8800K1252
19555a634Q352J1170j2048l680K6576J3950L752K83J811q138l8810M023m692n1701
19541e0786n3080P423J0018J3785N010L6716J6239J2791K8544j4320N961j2190
19529F111j2488J7381O363K5080M648j7083J2584K0256k4444o5377l4156L1483
19517b9642K1935J063J5723K912k7722k6250J4176n722P730L1841K2856j0911
19505A7989q734J2872p370r105K898j7590j2930L603O960L1662N80P481l817k60
19491B4239j1559L1940J2638j4013l8319j3460P318K538J9294J8112k0307k7686
$$ plain form
19479 -9265 -13803 16273 11171 6773 1263 -15040 11598 22940 36203 23176 -30261 -46721 -34519
19466 -34519 -18660 5145 19087 26104 17282 -19513 -8745 -8275 -7902 -9488 -32663 -45126 -48280
19453 -48280 -42797 -56320 -79358 -68204 -45070 -34055 -45281 -27283 -40320 -40312 -18932 -3782 -39086
19440 -39086 -83884 -83559 -86056 -79413 -96305 -74856 -31702 -33724 -15294 7767 -9633 20338 16527
19427 16527 15638 -363 44261 64517 54214 70144 97908 89112 77581 30988 30955 49970 39982
19414 39982 47792 56600 38965 8449 -4504 -40653 -27246 -41126 -31644 -31627 -17191 23906 33336
19401 33336 315 33804 -22051 -50859 -42780 -40833 -51188 -37383 -10561 -10607 3124 14798 -21210
19388 -21210 -29174 -30288 -21793 -44357 -29022 -26083 -57342 -47164 -30207 -43884 -33234 -33800 -4712
$$ packed form
19479i265m538L0076n102m398n510j6303K6638J1342J3263j3027n3437j6460J2202
19466c4519J5859K3805J3942P017q822l6795J0768M70L73j586k3175j2463l154
19453d8280N483j3523k3038J1154K3134J1015j1226J7998j3037QK1380J5150l5304
19440c9086m4798L25k497O643j6892K1449M3154k022J8430K3061j7400K9971l811
19427A6527q89j6001M4624K0256j0303J5930K7764q796j1531m6593l3J9015r988
19414C9982P810Q808j7635l0516j2953l6149J3407j3880R482J7J4436M1097R430
19401C3336l3021L3489n5855k8808Q079J947j0355J3805K6822m6J3731J1674l6008
19388b1210p964j114Q495k2564J5335K939l1259J0178J6957j3677J0650n66K9088
$$ plain form
19375 -4712 24600 27254 5585 387 -1809 -18742 -33547 -29368 -16258 -19121 -5004 26753 19629
19362 19629 23658 31156 33755 2470 -16617 -18153 -34522 -69848 -79549 -30258 15012 20883 -41001
19349 -41001 -49511 -4740 6432 -20455 -54529 -45307 -17390 27391 77722 61405 40819 16372
19337 16372 -3220 22144 79541 71497 16243 6682 11869 14655 4105 -3053 -22881 -39559 -59793
19324 -59793 -41430 -5207 15293 11646 348 -14300 2169 -20133 -35225 -20517 -96 6209
19312 6209 -1351 -14539 -48617 -45270 -10147 -28169 364 44910 -3817 8647 -6948 -49288
19300 -49288 -21099 30052 29628 32380 17913 18481 16017 -11959 -40850 -37648 -39988 5974 2051
19287 2051 220 20377 27502 10112 -1084 -14517 15789 23176 -10150 -18008 11539 40251 1155
$$ packed form
19375d712K9312K654k1669n198k196j6933j4805M179J3110k863J4117L1757p124
19362A9629M029P498K599l1285j9087j536j6369l5326r701M9291M5270N871o1884
19349d1001q510M4771J1172k6887l4074R222K7917M4781N0331j6317k0586k4447
19337A6372j9592K5364N7397q044n5254r561N187K786j0550p158j9828j6678k0234
19324e9793J8363L6223K0500l647j1298j4648J6469k2302j5092J4708K0421O305
19312F209p560j3188l4078L347L5123j8022K8533M4546m8727J2464j5595m2340
19300d9288K8189N1151m24K752j4467N68k464k7976k8891L202k340M5962l923
19287B051j831K0157P125j7390j1196j3433L0306P387l3326p858K9547K8712l9096
$$ plain form
19274 1155 -23216 -3880 4885 17585 -18689 -27226 -3237 14485 54408 36670 39867 35538 73283
19261 73283 36668 46493 37086 29630 -1353 2675 11249 -2421 -20269 4606 14271 21523 -3209
19248 -3209 -30128 -38103 -30837 -10529 10230 4050 11034 50103 74872 54293 29885 27198 12867
19235 12867 3297 -3763 1442 -25657 -15248 1051 -353 24241 45244 26612 -5250 -22878
19223 -22878 -4238 20903 62277 58017 53475 43090 9879 53517 129953 116570 96922 76464
19211 76464 97206 100694 86578 110578 120338 81740 62408 45863 28467 25497 82924 64033
19199 64033 -23562 -39167 6750 14992 14717 15084 30292 36018 83692 65840 57854 39072 68944
19186 68944 82681 80311 55592 72542 101530 102007 64785 28517 38829 54321 40909 50829
$$ packed form
19274A155k4371J9336Q765J2700l6274q537K3989J7722L9923j7738L197m329L7745
19261G3283l6615R825r407p456l0983M028Q574j3670j7848K4875R665P252k4732
19248c209k6919p975P266K0308K0759o180O984L9069K4769k0579k4408k687j4331
19235A2867r570p060N205k7099J0409J6299j404K4594K1003j8632l1862j7628
19223b2878J8640K5141M1374m260m542j0385l3211M3638P6436j3383j9648k0458
19211G6464K0742L488j4116K4000R760l8598j9332j6545j7396k970N7427j8891
19199F4033q7595j5605M5917Q242k75L67J5208N726M7674j7852p986j8782K9872
19186F8944J3737k370k4719J6950K8988M77l7222l6268J0312J5492j3412R920
$$ plain form
19174 50829 23601 71365 106578 100420 77281 77183 74609 83236 98688 42172 49194 41147 4402
19161 4402 20910 30097 30728 14076 12936 34840 23484 -7681 8136 41923 86789 81138 64824
19148 64824 60890 65078 87720 91298 72586 73034 53769 69211 68200 64727 71581 128814 111607
19135 111607 67403 23312 21623 5512 1548 29321 57040 92305 86714 70426 64033 91017
19123 91017 89329 99930 92620 131208 146433 177412 210097 234034 224107 277778 370569 435727
19111 435727 481710 494201 483263 496446 475936 436941 420575 422950 464124 484690 526905 577866
19099 577866 615771 647309 627274 561634 491984 437680 413701 354041 319575 266625 208569
19088 208569 175671 190868 168234 159605 151163 134799 152753 146011 130319 88901 103912 124349
$$ packed form
19174E0829k7228M7764L5213o158k3139r8k574Q627J5452n6516P022q047l6745
19161D402J6508R187O31j6652j140K1904j1356l1165J5817L3787M4866n651j6314
19148F4824l934M188K2642L578j8712M48j9265J5442j011l473O854N7233j7207
19135A11607m4204m4091j689j6111l964K7773K7719L5265n591j6288o393K6984
19123I1017j688J0601p310L8588J5225L0979L2685K3937r927N3671R2791O5158
19111D35727M5983J2491j0938J3183k0510l8995j6366K375M1174K0566M2215N0961
19099E77866L7905L1538k0035o5640o9650n4304k3979n9660l4466n2950n8056
19088B08569l2898J5197k2634q629q442j6364J7954o742j5692m1418J5011K0437
$$ plain form
19076 124349 124651 125644 117317 99258 55479 53885 68342 103073 80322 98825 139098 125587 92913
19063 92913 60238 73623 101727 71444 25886 -2571 4407 30114 35953 30019 28143 45172
19051 45172 70720 96597 102336 117240 129315 141032 129293 83104 92041 92439 124740 123156 109913
19038 109913 81234 28515 8886 34192 10638 18432 60861 64808 69203 27256 17410 41792
19026 41792 106020 131760 120438 124756 114529 101647 97072 89442 117288 97187 58651 53023
19014 53023 48284 55607 36285 13165 17040 33012 48566 57921 18532 -13640 -1415 -15167
19002 -15167 -7952 -11489 -18540 -43706 -8850 23325 26456 19183 50689 29318 -22549 -15511 -1639
18989 -1639 30619 50719 74539 65839 27159 6748 62349 90406 118280 97358 88942 92603
$$ packed form
19076A24349L02R93q327j8059m3779j594J4457L4731k2751J8503M0273j3511l2674
19063I2913l2675J3385K8104l0283m5558k8457O978K5707N839n934j876J7029
19051D5172K5548K5877N739J4904J2075J1717j1739m6189Q937L98L2301j584j3243
19038A09913k8679n2719j9629K5306k3554P794M2429L947M395m1947r846K4382
19026D1792O4228K5740j1322M318j0227j2882m575p630K7846k0101l8536n628
19014E3023m739P323j9322k3120L875J5972J5554R355l9389l2172J2225j3752
19002a5167P215l537p051k5166L4856L2175L131p273L1506k1371n1867P038J3872
18989a639L2258K0100K3820q700l8680k0411N5601K8057K7874k0922q416L661
$$ plain form
18977 92603 81296 48538 47300 -13059 -11143 23258 51442 41107 61552 87920 82925 69035
18965 69035 60188 41656 57270 105324 103790 58091 24442 38457 34961 11144 14457 67778
18953 67778 83890 62318 75917 110764 121029 108484 110446 70028 38780 26927 15578 30633
18941 30633 58791 17252 24417 40654 19049 -2501 -13837 853 52064 52348 41182 49243
18929 49243 40447 71488 60508 20256 28038 28545 35679 29186 44042 65117 77828 71121 75255
18916 75255 64478 35025 38856 83996 125815 134393 106194 71821 70781 58197 46692 75366
18904 75366 83664 50505 71652 101537 97711 99667 98843 105554 82327 76594 78714 112556 142219
18891 142219 158922 132465 164174 172630 130552 114887 88771 55019 81931 93349 84355 79807
$$ packed form
18977I2603j1307l2758j238o0359J916L4401K8184j0335K0445K6368m995j3890
18965F9035q847j8532J5614M8054j534m5699l3649J4015l496k3817L313N3321
18953F7778J6112k1572J3599L4847J0265j2545J962m0418l1248j1853j1349J5055
18941C0633K8158m1539P165J6237k1605k1550j1336J4690N1211K84j1166Q061
18929D9243q796L1041j0980m0252P782N07P134o493J4856K1075J2711o707M134
18916G5255j0777k9453L831M5140M1819Q578k8199l4373j040j2584j1505K8674
18904G5366Q298l3159K1147K9885l826J956q24O711k3227n733K120L3842K9663
18891A42219J6703k6457L1709Q456m2078j5665k6116l3752K6912J1418q994m548
$$ plain form
18879 79807 92229 116493 132138 127568 87230 98424 123177 108516 91255 107162 138622 114253
18867 114253 113588 103555 77075 89680 121414 144937 110581 112809 136916 154008 160098 140746
18855 140746 168787 174046 129528 107920 108544 89999 158559 193863 157646 139483 161107 176747
18843 176747 179600 155461 114334 116890 164636 166936 149205 159750 192998 255104 313766 341967
18831 341967 351595 345838 316095 273420 228514 242769 254573 253792 238458 249193 254366 313597
18819 313597 375834 439065 492157 508405 479214 419790 368935 359031 330908 320954 346318 332482
18807 332482 337842 325203 335691 350263 404434 431272 423422 422167 415841 450443 503274 565509
18795 565509 687051 771995 797183 811675 792325 766279 745823 719703 697721 680508 688197
$$ packed form
18879G9807J2422K4264J5645m570m0338J1194K4753j4661j7261J5907L1460k4369
18867A14253o65j0033k6480J2605L1734K3523l4356K228K4107J7092O090j9352
18855A40746K8041N259m4518k1608O24j8545O8560L5304l6217j8163K1624J5640
18843A76747K853k4139m1127K556M7746K300j7731J0545L3248O2106N8662K8201
18831C41967R628n757k9743m2675m4906J4255J1804p81j5334J0735N173N9231
18819C13597O2237O3231N3092J6248k9191n9424n0855r904k8123r954K5364j3836
18807C32482N360j2639J0488J4572N4171K6838p850j255o326L4602N2831O2235
18795E65509J21542Q4944K5188J4492j9350k6046k0456k6120k1982j7213P689
$$ plain form
18784 688197 652226 686599 761854 844433 944742 1047437 1075814 1099774 1128722 1096239 1058261
18773 1058261 960100 841986 779852 768925 757546 810889 853632 894528 891634 851389 830968
18762 830968 813833 790830 764469 685290 613420 575581 521815 472396 467533 431683 410392 387440
18750 387440 388118 399684 409235 418014 421306 401938 400166 392231 409776 407300 355774 275186 276454
18737 276454 300442 338154 281489 260134 259652 250428 179689 218437 289065 317588 274028 288212
18725 288212 284185 282841 283146 283163 258310 239822 250704 266416 259068 286952 275969 235023 246357
18712 246357 249542 264901 286970 326648 296646 270070 255744 242332 229179 226245 254891 266813
18700 266813 261292 282126 259949 253369 214205 230369 244602 262775 274122 287781 300561 288253
$$ packed form
18784F88197l5971L4373P5255Q2579J00309J02695K8377K3960K8948l2483l7978
18773A058261r8161j18114o2134j0927j1379N3343M2743M0896k894m0245k0421
18762H30968j7135k3003k6361p9179p1870l7839n3766m9419m863l5850k1291k2952
18750C87440O78J1566R551Q779L292j9368j772p935J7545k476n1526q0588J268
18737B76454K3988L7712n6665k1355m82r224p0739L8748P0628K8523m3560J4184
18725B88212m027j344L05J7k4853j8488J0882J5712p348K7884j0983m0946J1334
18712B46357L185J5359K2069L9678l0002k6576j4326j3412j3153k934K8646J1922
18700B66813n521K0834k2177o580l9164J6164J4233J8173J1347J3659J2780j2308
$$ plain form
18688 288253 276632 289613 274349 284485 279578 285312 334876 360396 350475 378627 393470 405566
18676 405566 434234 437518 458973 443016 435135 432528 401797 408213 402677 337038 332885 347378 390095
18663 390095 435095 434609 434376 461046 460389 496223 489543 466757 471000 505032 511518 474245 420383
18650 420383 416394 419862 470273 460412 465702 446079 447357 487716 559429 526141 501953 478041
18638 478041 448029 462588 498245 483916 452150 442003 479364 521182 555803 572266 572582 552810
18626 552810 521133 512997 546809 569697 557832 554136 583929 618949 641867 637604 649211 627999
18614 627999 642036 677164 681340 690205 717529 720374 711218 702239 750648 775907 763653 786586
18602 786586 812899 883777 903199 882605 890376 904696 930729 969754 1010048 993434 977968 1007117
$$ packed form
18688B88253j1621J2981j5264J0136m907N734M9564K5520r921K8152J4843J2096
18676D05566K8668L284K1455j5957p881k607l0731O416n536o5639m153J4493M2717
18663C90095M5000m86k33K6670o57L5834o680k2786M243L4032O486l7273n3862
18650D20383l989L468N0411r861N290j9623J278M0359P1713l3288k4188k3912
18638D78041l0012J4559L5657j4329l1766j0147L7361M1818L4621J6463L16j9772
18626E52810l1677q136L3812K2888j1865l696K9793L5020K2918m263J1607k1212
18614F27999J4037L5128M176Q865K7324K845r156q979M8409K5259j2254K2933
18602G86586K6313P0878J9422k0594P771J4320K6033L9025M0294j6614j5466K9149
$$ plain form
18590 1007117 1073924 1132152 1202311 1271700 1301390 1364339 1410967 1397840 1441708 1488063 1503058
18579 1503058 1514384 1550322 1595114 1641745 1668657 1766654 1895714 2006967 2105445 2205392 2273747
18568 2273747 2346964 2436318 2489427 2609323 2708215 2839577 2976239 3128659 3299140 3473417
18558 3473417 3669127 3845537 4022383 4197402 4392594 4615659 4901950 5236032 5591791
18549 5591791 5958639 6393442 6920933 7494845 8193969 9005725 9897290 10974352 12319618
18540 12319618 14005515 16157480 18958059 22695657 27618510 34101619 42386941 52268902
18532 52268902 62868475 72965867 81134877 86253579 88723933 89864558 89881771 87848606
18524 87848606 83897670 80539690 80105909 82986718 88049828 93554765 97569381 98682905
$$ packed form
18590A007117O6807N8228P0159O9389K9690O2949M6628j3127M3868M6355J4995
18579A503058J1326L5938M4792M6631K6912R7997J29060J11253R8478R9947O8355
18568B273747P3217Q9354N3109J19896R8892J31362J36662J52420J70481J74277
18558C473417J95710J76410J76846J75019J95192K23065K86291L34082L55759
18549E591791L66848M34803N27491N73912O99124Q11756Q91565J077062J345266
18540A2319618J685897K151965K800579L737598M922853O483109Q285322R881961
18532E2268902J0599573J0097392Q169010N118702K470354J140625J7213k033165
18524H7848606l950936l357980m33781K880809N063110N504937M014616J113524
$$ plain form
18516 98682905 97315995 94543368 90092776 82752651 72592607 61887205 52663371 45474762
18508 45474762 40058400 35948575 32823989 30348876 28299073 26558852 24987466 23594059
18500 23594059 22338756 21169125 20070748 19036065 18130848 17292125 16561858 15855313 15214745
18491 15214745 14614820 14065561 13563050 13062761 12655825 12263215 11854256 11477820 11084389
18482 11084389 10729736 10397627 10039688 9662196 9317343 9023450 8720317 8410244 8146351
18473 8146351 7904770 7668714 7448483 7179292 6959760 6766799 6556139 6380056 6233224
18464 6233224 6008500 5802130 5620080 5476000 5323088 5147928 5019890 4868256 4744215
18455 4744215 4598656 4460367 4356994 4277616 4152205 4025060 3930081 3863497 3741372 3623206
$$ packed form
18516I8682905j366910k772627m450592p340125j0160044j0705402r223834p188609
18508D5474762n416362m109825l124586k475113k049803j740221j571386j393407
18500B3594059j255303j169631j098377j034683r05217q38723p30267p06545o40568
18491A5214745n99925n49259n02511n00289m06936l92610m08959l76436l93431
18482A1084389l54653l32109l57939l77492l44853k93893l03133l10073k63893
18473H146351k41581k36056k20231k69191k19532j92961k10660j76083j46832
18464F233224k24724k06370j82050j44080j52912j75160j28038j51634j24041
18455D744215j45559j38289j03373p9378j25411j27145r4979o6584j22125j18166
$$ plain form
18445 3623206 3551706 3479870 3367833 3254723 3167169 3087020 3003369 2957787 2921255 2849482 2784097
18434 2784097 2716631 2641122 2569346 2465097 2396534 2339582 2299972 2234564 2181919 2132081 2081870
18423 2081870 2049690 1948031 1872464 1833141 1829330 1826072 1767559 1710993 1650619 1598480 1582148
18412 1582148 1571823 1531819 1456599 1423928 1398749 1394641 1361105 1300426 1247379 1217997 1150052
18401 1150052 1102784 1049683 1046242 1032404 995972 964787 922850 858042 857760 873298 842468 822636
18389 822636 835647 815508 767061 706990 697527 662577 616705 588934 582110 541474 534148 520691
18377 520691 498461 467767 466528 461915 423127 413090 406788 426542 455367 430789 426742 475636
18365 475636 489565 478085 480208 517221 568935 537596 506841 505606 488368 465007 492409 503838
$$ packed form
18445C623206p1500p1836j12037j13110q7554q0149q3651m5582l6532p1773o5385
18434B784097o7466p5509p1776j04249o8563n6952l9610o5408n2645m9838n0211
18423B081870l2180j01659p5567l9323l811l258n8513n6566o0374n2139j6332
18412A582148j0325m0004p5220l2671k5179m108l3536o0679n3047k9382o7945
18401A150052m7268n3101l441j3838l6432l1185m1937o4808k82J5538l0830j9832
18389H22636J3011k0139m8447o0071r463l4950m5872k7771o824m0636p326j3457
18377E20691k2230l0694j239m613l8788j0037o302J9754K8825k4578m047M8894
18365D75636J3929j1480K123L7013N1714l1339l0755j235j7238k3361K7402J1429
$$ plain form
18353 503838 504159 509571 549857 566221 540391 540185 583887 578385 541986 529889 541327 597184 578520
18340 578520 564932 557896 559688 549280 572373 585819 584070 588034 593125 565933 588885 561212
18328 561212 571236 597346 601814 621700 626476 629073 654305 694427 761534 784740 828525 862780
18316 862780 914647 958886 982354 997515 1001977 1040881 1067851 1074665 1126343 1145650 1162664 1183757
18304 1183757 1217673 1234193 1252694 1280359 1301512 1300178 1344116 1404883 1415200 1380725 1332371
18293 1332371 1314435 1281489 1233402 1193535 1179850 1152818 1181373 1218967 1205982 1205189 1168135 1117128
18281 1117128 1071295 1039741 984223 959498 941219 967273 1009740 1081793 1088110 1047418 1038198 1050819
18269 1050819 1129990 1221553 1287719 1310498 1265621 1275345 1345332 1348181 1309278 1345839 1388768 1421753
$$ packed form
18353E03838L21N412M0286J6364k5830k06M3702n502l6399j2097J1438N5857j8664
18340E78520j3588p036J792j0408K3093J3446j749L964N091k7192K2952k7673
18328E61212J0024K6110M468J9886M776K597K5232M0122O7107K3206M3785L4255
18316H62780N1867M4239K3468J5161M462L8904K6970O814N1678J9307J7014K1093
18304A183757L3916J6520J8501K7665K1153j334M3938O0767J0317l4475m8354
18293A332371j7936l2946m8087l9867j3685k7032K8555L7594j2985p93l7054n1007
18281A117128m5833l1554n5518k4725j8279K6054M2467P2053O317m0692r220J2621
18269A050819P9171R1563O6166K2779m4877R724O9987K849l8903L6561M2929L2985
$$ plain form
18257 1421753 1476848 1520525 1577342 1612878 1670790 1758307 1848080 1908110 1948654 1949763 1956707 1968520
18245 1968520 2033161 2068291 2148113 2288427 2443918 2567671 2742099 2964471 3144368 3325465
18235 3325465 3463051 3573446 3685822 3771483 3876055 3971774 4060160 4204013 4504017 4883832
18225 4883832 5358190 5969470 6699030 7592868 8659868 9960041 11561144 13748575 16794037
18216 16794037 21233683 27751969 36952903 48812782 62577242 76179264 87426016
18209 87426016 94472585 96949694 96832551 94267527 89052639 80234818 69832044 61287922
18201 61287922 57061264 58354280 64643095 74778849 86686702 97555220 105322593 108213666
18193 108213666 107440454 104153184 98133676 88663923 75494673 61717239 49722320 40967957
$$ packed form
18257A421753N5095M3677N6817L5536N7912Q7517Q9773O0030M0544J109O944J1813
18245A968520O4641L5130P9822J40314J55491J23753J74428K22372J79897J81097
18235C325465J37586J10395J12376Q5661J04572R5719Q8386J43853L00004L79815
18225D883832M74358O11280P29560Q93838J067000J300173J601103K187431L045462
18216A6794037M439646O518286R200934J1859879J3764460J3602022J1246752
18209H7426016P046569K477109j17143k565024n214888q817821j0402774q544122
18201F1287922m226658J293016O288815J0135754J1907853J0868518P767373K891073
18193A08213666p73212l287270o019508r469753j3169250j3777434j1994919q754363
$$ plain form
18185 40967957 35196255 31359982 28755893 26888236 25383770 24105806 22875995 21688522
18177 21688522 20578324 19479512 18386838 17349086 16437120 15594473 14879455 14355711 13917970
18168 13917970 13526367 13159377 12778909 12369700 11979038 11561702 11082408 10632737 10126855
18159 10126855 9678386 9254110 8898534 8565237 8265542 7977438 7724210 7510228 7312469
18150 7312469 7123790 6959138 6789444 6606814 6473580 6299825 6152792 6000513 5816601
18141 5816601 5622728 5462547 5287959 5147024 5010633 4851899 4688717 4576120 4505388 4420608
18131 4420608 4352847 4284426 4203486 4168998 4134037 4129012 4113855 4077808 4098505 4119036 4206209
18120 4206209 4352256 4541959 4842010 5224736 5776891 6628176 7892288 10107389 14109906
$$ packed form
18185D0967957n771702l836273k604089j867657j504466j277964j229811j187473
18177B1688522j110198j098812j092674j037752r11966q42647p15018n23744m37741
18168A3917970l91603l66990l80468m09209l90662m17336m79294m49671n05882
18159A0126855m48469m24276l55576l33297k99695k88104k53228k13982j97759
18150G312469j88679j64652j69694j82630j33234j73755j47033j52279j83912
18141E816601j93873j60181j74588j40935j36391j58734j63182j12597p0732q4780
18131D420608o7761o8421q0940l4488l4961n025j5157l6047K0697K0531Q7173
18120D206209J46047J89703L00051L82726N52155Q51285J264112K215101M002517
$$ plain form
18111 14109906 20948137 30259151 38782450 46330879 48008855 35126978 22299679 15430271
18103 15430271 11831851 9765949 8399909 7465634 6876990 6465879 6137161 5848888 5593269
18094 5593269 5406928 5190502 4925127 4632599 4386897 4153132 3978509 3816523 3659694
18085 3659694 3514494 3374059 3274138 3176184 3097931 3036276 2978900 2838935 2707481 2621803
18075 2621803 2532766 2467393 2410742 2345574 2231879 2159364 2074602 1962965 1858030 1801042 1801587
18064 1801587 1756163 1732988 1713564 1668777 1607189 1568526 1476087 1357876 1280022 1211043 1196713
18053 1196713 1220677 1155377 1136478 1153646 1121179 1083057 1077341 1059233 1019225 1030497 1043203
18042 1043203 1054060 1059184 1022672 960340 970308 941637 930613 940284 964523 968349 983647 953645
$$ packed form
18111A4109906O838231R311014Q523299P548429J677976j2881877j2827299o869408
18103A5430271l598420k065902j366040r34275n88644m11111l28718k88273k55619
18094E593269j86341k16426k65375k92528k45702k33765j74623j61986j56829
18085C659694j45200j40435r9921r7954p8253o1655n7376j39965j31454q5678
18075B621803q9037o5373n6651o5168j13695p2515q4762j11637j04935n6988N45
18064A801587m5424k3175j9424m4787o1588l8663r2439j18211p7854o8979j4330
18053A196713K3964o5300j8899J7168l2467l8122n716j8108m0008J1272J2706
18042A043203J0857N124l6512o2332R968k8671j1024R671K4239L826J5298l0002
$$ plain form
18030 953645 920210 924743 962676 997521 1025713 1037582 1036483 1059005 1055935 1088208 1122909 1128034
18018 1128034 1147241 1164045 1154078 1099997 1007604 935316 885998 900635 870946 844899 848911 873992
18006 873992 810740 836161 864256 864240 825223 802300 807269 802754 821434 805071 780491 780278 745840
17993 745840 736373 703905 712237 737398 745996 749378 724593 702390 710824 749308 767996 771632 760845
17980 760845 723363 700803 643093 579553 565843 547789 492745 496425 543872 556346 524044 566182
17968 566182 591102 601744 627032 640555 652922 647149 662745 689289 685341 722224 735645 758076
17956 758076 791841 792738 805830 854174 895892 914187 963446 971344 952436 1006946 1086433 1157945
17944 1157945 1260639 1376622 1478496 1604636 1683476 1746090 1771911 1760935 1775917 1841743
$$ packed form
18030I53645l3435M533L7933L4845K8192J1869j099K2522l070L2273L4701N125
18018A128034J9207J6804r967n4081r2393p2288m9318J4637k9689k6047M012K5081
18006H73992o3252K5421K8095j6l9017k2923M969m515J8680j6363k4580k13l4438
17993G45840r467l2468Q332K5161Q598L382k4785k2203Q434L8484J8688L636j0787
17980G60845l7482k2560n7710o3540j3710j8054n5044L680M7447J2474l2302M2138
17968E66182K4920J0642K5288J3523J2367n773J5596K6544l948L6883J3421K2431
17956G58076L3765Q97J3092M8344M1718J8295M9259P898j8908N4510P9487P1512
17944A157945J02694J15983J01874J26140P8840O2614K5821j0976J4982O5826
$$ plain form
17934 1841743 1892107 1950921 2007162 2128860 2190948 2195996 2085512 1998774 1929372 1876002 1776282
17923 1776282 1663753 1565374 1471914 1382974 1276337 1257876 1233689 1196721 1153686 1131321 1152465
17912 1152465 1161362 1120437 1083630 1093372 1063339 1064727 1094717 1130090 1113241 1080289 1124676 1185923
17900 1185923 1221988 1262617 1286279 1292379 1293714 1331435 1371345 1444335 1485557 1533384 1569287 1611530
17888 1611530 1647153 1665292 1673276 1733136 1773310 1846786 1915458 1978104 2021503 2115676 2173184
17877 2173184 2161872 2104027 2045205 1894611 1756101 1647680 1557722 1488450 1425391 1419523 1423416
17866 1423416 1411685 1433607 1490733 1489998 1516565 1555034 1603070 1660778 1714733 1728457 1757140 1819739
17854 1819739 1875630 1947217 2008637 2079818 2171721 2294954 2434762 2602283 2841230 3042411
$$ packed form
17934A841743N0364N8814N6241J21698O2088N048j10484q6738o9402n3370r9720
17923A776282j12529r8379r3460q8940j06637j8461k4187l6968m3035k2365K1144
17912A152465Q897m0925l6807R742l0033J388K9990L5373j6849l2952M4387O1247
17900A185923L6065M0629K3662O100J335L7721L9910P2990M1222M7827L5903M2243
17888A611530L5623J8139P984N9860M0174P3476O8672O2646M3399R4173N7508
17877B173184j1312n7845n8822j50594j38510j08421q9958o9272o3059n868L893
17866A423416j1731K1922N7126p35K6567L8469M8036N7708N3955J3724K8683O2599
17854A819739N5891P1587O1420P1181R1903J23233J39808J67521K38947K01181
$$ plain form
17844 3042411 3249526 3509110 3692425 3886770 4035762 4239206 4447070 4609838 4824933
17835 4824933 5104457 5486090 6006262 6814380 7914151 9291331 10895178 12616710 14157148
17826 14157148 15432461 16620647 17361373 17212766 16892044 16923362 17198923 17942732 19766298
17817 19766298 23187629 28797927 37412114 49210885 63873079 81390186 99166456
17810 99166456 113806607 126713616 136922015 136931656 128277463 118771622 108375394 94574723
17802 94574723 80999072 71582883 66117179 63228845 62327074 62339613 62330715 62306768 60841720
17793 60841720 56443268 50998878 46143284 41208050 36190906 32097716 29292571 27357212
17785 27357212 26022260 25159845 24557191 24097329 23776190 23586481 23468790 23545929 24063307
$$ packed form
17844C042411K07115K59584J83315J94345J48992K03444K07864J62768K15095
17835D824933K79524L81633N20172Q08118J099771J377180J603847J721532J540438
17826A4157148J275313J188186P40726j48607l20722L1318K75561P43809J823566
17817A9766298L421331N610298Q614187J1798771J4662194J7517107J7776270
17810I9166456J4640151J2907009J0208399R641q654193r505841j0396228j3800671
17802I4574723j3575651r416189n465704k888334r01771J2539q898k3947j465048
17793F0841720m398452n444390m855594m935234n017144m093190k805145j935359
17785B7357212j334952q62415o02654m59862l21139j89709j17691P7139N17378
$$ plain form
17776 24063307 25165813 27054635 30018128 34064143 39074405 44791450 50235314 54586150
17768 54586150 58373097 61201981 61412796 60679313 61773377 65006621 70598726 80146899
17760 80146899 93832424 110318923 128857355 147218572 159758556 165324659 167472058
17753 167472058 162791526 145564915 124552099 106960892 89974964 72873396 59772930
17746 59772930 51405450 46401271 43562868 42110714 41509147 41481272 41532222 41143705 40523120
17737 40523120 39425025 37124745 34208742 31609489 29115728 26593984 24420906 22795006
17729 22795006 21516639 20531035 19680638 18895210 18120341 17340491 16570634 15844691 15090875
17720 15090875 14365808 13733709 13178002 12680799 12225683 11845918 11491392 11110189 10783883
$$ packed form
17776B4063307J102506J888822K963493M046015N010262N717045N443864M350836
17768E4586150L786947K828884K10815p33483J094064L233244N592105R548173
17760H0146899J3685525J6486499J8538432J8361217J2539984N566103K147399
17753A67472058m680532j7226611k1012816j7591207j6985928j7101568j3100466
17746E9772930q367480n004179k838403j452154o01567k7875N0950l88517o20585
17737D0523120j098095k300280k916003k599253k493761k521744k173078j625900
17729B2795006j278367r85604q50397p85428p74869p79850p69857p25943p53816
17720A5090875p25067o32099n55707m97203m55116l79765l54526l81203l26306
$$ plain form
17711 10783883 10485502 10226204 9970044 9722589 9475801 9175828 8892511 8630759 8377473
17702 8377473 8088972 7831300 7568468 7304116 7064629 6824861 6631588 6502517 6322620
17693 6322620 6133047 6001582 5860328 5732454 5579946 5390269 5212660 5030678 4876543
17684 4876543 4733826 4610548 4475055 4285636 4146427 4052630 3927069 3809946 3663647 3490594
17674 3490594 3381985 3280770 3221781 3156599 3044017 2923060 2849740 2789129 2741544 2639248
17664 2639248 2550780 2466231 2429348 2394982 2341210 2275862 2243236 2206044 2168237 2164421 2165092 2174882
17652 2174882 2248882 2321213 2415304 2517546 2540011 2496336 2389740 2276469 2130063 1987630
17642 1987630 1895953 1851593 1802845 1706051 1671363 1662189 1678006 1744639 1805684 1875220 1887017
$$ packed form
17711A0783883k98381k59298k56160k47455k46788k99973k83317k61752k53286
17702H377473k88501k57672k62832k64352k39487k39768j93273j29071j79897
17693F322620j89573j31465j41254j27874j52508j89677j77609j81982j54135
17684D876543j42717j23278j35493j89419j39209r3797j25561j17123j46299j73053
17674C490594j08609j01215n8989o5182j12582j20957p3320o0611m7585j02296
17664B639248q8468q4549l6883l4366n3772o5348l2626l7192l7807l816O71R790
17652B174882P4000P2331R4091J02242K2465m3675j06596j13271j46406j42433
17642A987630r1677m4360m8748r6794l4688r174J5817O6633O1045O9536J1797
$$ plain form
17631 1887017 1852839 1783986 1677460 1644757 1611430 1561375 1550961 1526969 1449109 1305728 1212141
17620 1212141 1196355 1224055 1254730 1232141 1233151 1186597 1162235 1127273 1067232 1044781 1015045
17609 1015045 990215 1010384 1070254 1079518 1113926 1132626 1182209 1227349 1202244 1167775 1132160
17598 1132160 1068447 997621 977524 971578 972465 1023134 1111523 1121468 1059467 947274 840948 806801
17586 806801 823723 854394 839155 881669 899995 904655 854674 844996 877942 865034 832718 788404
17574 788404 741783 709654 689634 678103 628924 579668 581834 551241 526379 537910 483340 430509
17562 430509 438864 457790 457948 460404 436275 444214 454646 440078 455338 467437 457693 423049 407192
17549 407192 379839 352091 380921 449013 432105 447855 433005 372031 323473 313863 340630 363938
$$ packed form
17631A887017l4178o8853j06526l2703l3327n0055j0414k3992p7860j43381r3587
17620A212141j5786K7700L0675k2589J010m6554k4362l4962o0041k2451k9736
17609A015045k4830K0169N9870R264L4408J8700M9583M5140k5105l4469l5615
17598A132160o3713p0826k0097n946Q87N0669Q8389R945o2001j12193j06326l4147
17586H06801J6922L0671j5239M2514J8326M660m9981r678L2946j2908l2316m4314
17574G88404m6621l2129k0020j1531m9179m9256K166l0593k4862J1531n4570n2831
17562D30509Q355J8926J58K456k4129P939J0432j4568J5260J2099r744l4644j5857
17549D07192k7353k7748K8830O8092j6908J5750j4850o0974m8558r610K6767K3308
$$ plain form
17537 363938 378851 385639 395156 401182 407395 404491 356554 333427 357325 385183 370212 376740 369872
17524 369872 369487 316509 325964 323797 336691 361325 340375 309048 309405 286711 255791 309841 308776
17511 308776 285286 298727 315633 296410 282933 254879 243771 250695 274765 275484 264004 228743
17499 228743 205636 182151 170687 145491 119001 115732 125860 146860 181162 208169 197357 159398
17487 159398 181260 187650 150464 133902 133593 107352 95297 120455 151898 190738 180514 165222
17475 165222 172195 172365 153056 167165 180880 205318 162945 150919 151500 124472 119359 143822 144646
17462 144646 147406 152259 187775 216024 203001 209436 194037 171944 165256 154320 149341 153849 129020
17449 129020 105292 102215 169997 208440 197075 193991 226719 257385 276834 275002 198175 159358
$$ packed form
17537C63938J4913O788R517O026O213k904m7937k3127K3898K7858j4971O528o868
17524C69872l85n2978R455k167J2894K4634k0950l1327L57k2694l0920N4050j065
17511C08776k3490J3441J6906j9223j3477k8054j1108O924K4070P19j1480l5261
17499B28743k3107k3485j1464k5196k6490l269J0128K1000L4302K7007j0812l7959
17487A59398K1862O390l7186j6562l09k6241j2055K5158L1443L8840j0224j5292
17475A65222O973J70j9309J4109J3715K4438m2373j2026N81k7028n113K4463Q24
17462A44646K760M853L5516K8249j3023O435j5399k2093o688j0936m979M508k4829
17449A29020k3728l077O7782L8443j1365l084L2728L0666J9449j832p6827l8817
$$ plain form
17437 159358 151797 130519 101887 97792 114982 134362 136845 120214 102303 36872 79871 130079
17425 130079 127832 104423 91884 93635 112418 109178 116759 132048 150302 161621 196747 200007
17413 200007 177892 208937 202060 149225 125412 133640 149998 158610 126815 106762 144871 148198
17401 148198 123347 158131 163263 160067 162539 184300 201136 177604 145757 130954 143938 157611
17389 157611 191357 238157 266976 265066 231299 219872 202385 191602 132745 115955 125645 125572
17377 125572 103088 118964 140161 136088 123525 133751 125708 154807 158922 137869 84576 76061
17365 76061 89611 96033 116187 95908 107063 150455 174656 171441 191849 196951 185609 199984
17353 199984 211907 204083 197236 231972 225764 222519 236044 240338 256394 224614 249763 290526
$$ packed form
17437A59358p561k1278k8632m095J7190J9380K483j6631j7911o5431M2999N0208
17425A30079k247k3409j2539J751J8783l240P581J5289J8254J1319L5126L260
17413B00007k2115L1045o877n2835k3813Q228J6358Q612l1795k0053L8109L327
17401A48198k4851L4784N132l196K472K1761J6836k3532l1847j4803J2984J3673
17389A57611L3746M6800K8819j910l3767j1427j7487j0783n8857j6790R690p3
17377A25572k2484J5876K1197m073j2563J0226q043K9099M115k1053n3293q515
17365G6061J3550O422K0154k0279J1155M3392K4201l215K0408N102j1342J4375
17353A99984J1923p824o847L4736o208l245J3525M294J6056l1780K5149M0763
$$ plain form
17341 290526 299999 321518 328401 302489 281308 255797 269168 277590 237399 236828 254257 235833
17329 235833 232581 233123 258837 326100 348142 367737 400082 423537 462541 485228 464757 472942
17317 472942 482062 472514 472834 443109 447332 497232 557918 585547 610949 609430 604143 664611 654508
17304 654508 572367 526339 457851 394041 418099 450635 459269 462050 468804 415459 420890 462926
17292 462926 497292 541823 530518 501380 525342 503822 492266 536418 552026 539519 530859 544020
17280 544020 574180 598227 627061 654342 663426 688779 759696 852145 937303 980649 1022048 1057772
17268 1057772 1082819 1163715 1174021 1125115 1084024 1021878 972053 958854 1002017 1035548 1058902
17257 1058902 1057288 1121096 1202745 1242149 1296699 1378717 1464325 1531050 1520856 1539189 1529532 1435864
$$ packed form
17341B90526R473K1519O883k5912k1181k5511J3371Q422m0191n71J7429j8424
17329B35833l252N42K5714O7263K2042J9595L2345K3455L9004K2687k0471Q185
17317D72942R120r548L20k9725M223M9900O0686K7629K5402j519n287O0468j0103
17304F54508q2141m6028o8488o3810K4058L2536Q634K781O754n3345N431M2036
17292D62926L4366M4531j1305k9138K3962k1520j1556M4152J5608j2507q660J3161
17280E44020L0160K4047K8834K7281R084K5353P0917R2449Q5158M3346M1399L5724
17268A057772K5047Q0896J0306m8906m1091o2146m9825j3199M3163L3531K3354
17257A058902j614O3808Q1649L9404N4550Q2018Q5608O6725j0194J8333r657r3668
$$ plain form
17245 1435864 1323900 1205572 1138955 1067773 1042755 993403 950096 973574 970453 953141 916160
17234 916160 899231 884356 855411 844846 869828 913718 875410 847458 857739 850882 861272 866848
17222 866848 889347 859645 856826 871878 894320 902739 916862 962660 996105 945284 911150 909991
17210 909991 907138 961434 1056997 1161596 1220629 1235853 1270847 1277438 1316860 1383512 1392839 1392938
17198 1392938 1436601 1515912 1575595 1614581 1675185 1785379 1874844 1933129 2001103 2050735 2081826
17187 2081826 2078903 2104063 2130327 2226563 2374189 2543173 2680149 2906338 3210909 3576488
17177 3576488 4074741 4724274 5464195 6275792 7179293 8120406 9254022 10743217 12836023
17168 12836023 15593770 18859404 21843966 23644412 23636977 21914238 19827998 18377735
$$ packed form
17245A435864j11964j18328o6617p1182k5018m9352m3307K3478l121j7312l6981
17234I16160j6929j4875k8945j0565K4982M3890l8308k7952J0281o857J0390N576
17222H66848K2499k9702k819J5052K2442Q419J4123M5798L3445n0821l4134j159
17210I09991k853N4296R5563J04599N9033J5224L4994O591L9422O6652R327R9
17198A392938M3663P9311N9683L8986O0604J10194Q9465N8285O7974M9632L1091
17187B081826k923K5160K6264R6236J47626J68984J36976K26189L04571L65579
17177C576488M98253O49533P39921Q11597R03501R41113J133616J489195K092806
17168A2836023K757747L265634K984562J800446p435j722739k086240j450263
$$ plain form
17160 18377735 18233727 19249580 21260637 24470586 29479349 37384207 49875567 68827474
17152 68827474 95232803 127769151 161146792 186981527 197433267 187515197 164632712
17145 164632712 137278464 112403774 91663786 76199887 66246692 61708449 61809473
17138 61809473 65307850 70647061 75458567 77095483 73716953 65403835 55298332 46209211
17130 46209211 39442572 34850472 31752743 29627021 28218615 27215483 26484880 25927382
17122 25927382 25483829 25158668 24935746 24809354 24731037 24726101 24908312 25572268 27123674 30084549
17112 30084549 34823680 41417428 49415468 57406651 63112259 64815435 61959459 57094793
17104 57094793 53461317 53441121 57981273 67107999 80916672 99068180 120518526 142444500
$$ packed form
17160A8377735j44008J015853K011057L209949N008763P904858J2491360J8951907
17152F8827474K6405329L2536348L3377641K5834735J0451740r918070k2882485
17145A64632712k7354248k4874690k0739988j5463899r953195m538243J01024
17138F1809473L498377N339211M811506J636916l378530q313118j0105503r089121
17130D6209211o766639m592100l097729k125722j408406j003132p30603n57498
17122B5927382m43553l25161k22922j26392p8317m936J82211O63956J551406K960875
17112C0084549M739131O593748P998040P991183N705608J703176k855976m864666
17104E7094793l633476k0196M540152R126726J3808673J8151508K1450346K1925974
$$ plain form
17096 142444500 161222380 172421432 171068265 155376983 127714286 99023481 75731823
17089 75731823 60231684 50600101 44479457 40478691 37872560 36192221 35229897 34960368
17081 34960368 35313669 36131616 36867366 36864250 35637114 32962966 29602450 26511203 24130099
17072 24130099 22481094 21316077 20416471 19661947 18942157 18218405 17453384 16706830 15975212
17063 15975212 15221115 14483090 13860851 13340704 12895733 12495204 12118318 11810196 11503149
17054 11503149 11148402 10769257 10407654 10111279 9833855 9591445 9387462 9208336 9081086
17045 9081086 8932998 8761942 8608336 8386746 8074844 7761566 7437245 7121250 6857620
17036 6857620 6624045 6467144 6356176 6216586 6115149 6043960 5964758 5848412 5726499 5568487
$$ packed form
17096A42444500J8777880J1199052j353167j5691282k7662697k8690805k3291658
17089G5731823j5500139r631583o120644m000766k606131j680339r62324k69529
17081C4960368L53301Q17947P35750l116j227136k674148l360516l091247k381104
17072B4130099j649005j165017q99606p54524p19790p23752p65021p46554p31618
17063A5975212p54097p38025o22239n20147m44971m00529l76886l08122l07047
17054A1503149l54747l79145l61603k96375k77424k42410k03983j79126j27250
17045I081086j48088j71056j53606k21590l11902l13278l24321l15995k63630
17036F857620k33575j56901j10968j39590j01437p1189p9202j16346j21913j58012
$$ plain form
17026 5568487 5361842 5167462 4965899 4740441 4562072 4420603 4281438 4146543 4077548 4039367
17016 4039367 4042491 4079137 4114648 4112633 4030409 3865752 3647582 3401338 3157128 2936252 2787531
17005 2787531 2677496 2612057 2523676 2443686 2351257 2272442 2229654 2157631 2094720 2033887 1956347
16994 1956347 1900751 1867831 1849969 1843800 1820066 1814516 1784215 1752633 1671603 1641526 1618217 1568125
16982 1568125 1533736 1489663 1408222 1361487 1292119 1233652 1164557 1130430 1110351 1108780 1073077
16971 1073077 1029906 1002497 952261 917373 881533 838643 785264 748908 708636 616464 571024
16960 571024 526341 506528 498676 482468 444117 406425 414428 459224 502046 519408 534071 532090
16948 532090 536761 512240 520410 515591 515720 522041 501004 523699 556455 573086 558504 548750 499977
$$ packed form
17026E568487k06645j94380k01563k25458j78369j41469j39165j34895o8995l8181
17016D039367L124L6646L5511k015q2224j64657k18170k46244k44210k20876j48721
17005B787531j10035o5439q8381p9990r2429p8815m2788p2023o2911o0833p7540
16994A956347n5596l2920j7862o169k3734n550l0301l1582q1030l0077k3309n0092
16982A568125l4389m4073q1441m6735o9368n8467o9095l4127k0079j571l5703
16971A073077m3171k7409n0236l4888l5840m2890n3379l6356m0272r2172m5440
16960E71024m4683j9813p852j6208l8351l7692Q003M4796M2822J7362J4663j981
16948E32090M671k4521Q170m819J29O321k1037K2695L2756J6631j4582r754m8773
$$ plain form
16935 499977 468284 460176 436085 451681 461708 487858 514726 489621 488331 462213 414435 404330
16923 404330 438887 439956 437157 427002 407183 390076 394188 429890 444079 439186 441627 447546 429731
16910 429731 417949 372141 329615 319042 327115 352914 359160 381221 378183 345495 324285 358070
16898 358070 382230 367733 369430 387631 369534 340092 323520 300640 297782 336698 383917 368833
16886 368833 357491 333913 286240 261826 230068 228361 244809 256343 290475 290227 302109 227856
16874 227856 224376 223892 240818 243758 212493 187111 167882 160123 181560 239921 285163 306522
16862 306522 318296 300331 264119 278678 275206 243948 235144 250936 251904 245858 243478 261790 248467
16849 248467 199321 176100 179466 166842 179933 167646 112220 87147 102288 83964 66524 110884
$$ packed form
16935D99977l1693q108k4091J5596J0027K6150K6868k5105j290k6118m7778j0105
16923D04330L4557J069k799j0155j9819j7107M112L5702J4189m893K441N919j7815
16910D29731j1782m5808m2526j0573Q073K5799O246K2061l038l2688k1210L3785
16898C58070K4160j4497J697J8201j8097k9442j6572k2880k858L8916M7219j5084
16886C68833j1342k3578m7673k4414l1758j707J6448J1534L4132k48J1882p4253
16874B27856l480m84J6926K940l1265k5382j9229p759K1437N8361M5242K1359
16862C06522J1774j7965l6212J4559l472l1258q804J5792R68o046k380J8312j3323
16849B48467m9146k3221L366j2624J3091j2287n5426k5073J5141j8324j7440M4360
$$ plain form
16837 110884 124324 118635 119346 104699 98622 142354 182744 164801 147013 124741 109852 92743
16825 92743 62865 67858 87918 81595 36888 52531 43912 56851 54074 34371 53238 85120
16813 85120 81484 103663 117585 95014 99910 109071 126911 94365 69668 64037 79046 40440
16801 40440 39435 44159 50453 71641 56295 47456 61322 51406 55634 58134 33736 29118 35435
16788 35435 21616 -520 -17006 -13696 1716 47855 84956 50914 82553 120901 113387 96046
16776 96046 83661 93697 74241 69658 52838 37189 33958 53193 52368 56424 71636 97456 68389
16763 68389 47534 40448 39534 69282 107060 75610 31378 53096 105276 118370 101831 102530 96436
16750 96436 72294 76833 79101 110277 117300 122568 140027 130681 147696 198952 241505 227679 182618
$$ packed form
16837A10884J3440n689P11j4647o077M3732M0390j7943j7788k2272j4889j7109
16825I2743k9878M993K0060o323m4707J5643q619J2939k777j9703J8867L1882
16813H5120l636K2179J3922k2571M896R161J7840l2546k4697n631J5009l8606
16801D0440j005M724O294K1188j5346q839J3866r916M228K500k4398m618O317
16788C5435j3819k2136j6486L310J5412M6139L7101l4042L1639L8348p514j7341
16776I6046j2385J0036j9456m583j6820j5649l231J9235q25M056J5212K5820k9067
16763F8389k0855p086r14K9748L7778l1450m4232K1718N2180J3094j6539O99o094
16750I6436k4142M539K268L1176P023N268J7459r346J7015N1256M2553j3826m5061
$$ plain form
16737 182618 184624 161773 130134 142168 100746 111268 108481 109628 110662 108761 59257 66457 59333
16724 59333 60401 81533 104376 94962 62771 69524 67289 71499 55942 43167 54230 78424 85849
16711 85849 108244 91738 45516 30458 41443 23688 -9536 7327 49111 48116 53799 68217
16699 68217 67198 92057 86565 113492 144166 150345 122861 104299 58852 34773 45476 48444
16687 48444 79555 66293 65417 130812 196429 212981 167984 119895 73886 74817 127989 111750
16675 111750 76269 56276 123406 181444 181485 186211 213840 233649 228484 263946 313112 301735
16663 301735 291160 349478 413323 486720 558689 610397 627242 623611 604036 570817 595165 621952
16651 621952 667660 636113 563342 518500 534629 593477 633554 719796 747397 736391 675118
$$ packed form
16737A82618K006k2851l1639J2034m1422J0522k787J147J034j901m9504P200p124
16724E9333J068K1132K2843r414l2191O753k235M210j5557j2775J1063K4194P425
16711H5849K2395j6506m6222j5058J0985j7755l3224J6863M1784r95N683J4418
16699F8217j019K4859n492K6927L0674O179k7484j8562m5447k4079J0703K968
16687D8444L1111j3262q76O5395O5617J6552m4997m8089m6009R31N3172j6239
16675A11750l5481j9993O7130N8038M1M726K7629J9809n165L5462M9166j1377
16663C01735j0575N8318O3845P3397P1969N1708J6845l631j9575l3219K4348K6787
16651F21952M5708l1547p2771m4842J6129N8848M0077Q6242K7601j1006o1273
$$ plain form
16640 675118 632851 544297 463593 417123 396691 447263 444127 434050 426835 421714 450489 419752
16628 419752 430414 446071 440198 421434 422045 425432 421269 411964 386425 402497 415639 417950 397083
16615 397083 390467 377908 408712 458016 547038 621548 657075 674748 705338 736565 768179 806079
16603 806079 817899 822040 768450 711976 655597 566919 500008 499262 494454 512812 562667 601677
16591 601677 647962 709979 803155 861254 904235 926147 864309 779777 731723 697331 632551
16580 632551 581525 565507 598442 625050 632179 624369 672734 678616 719986 746410 704468 666605
16568 666605 640330 649172 683223 726210 788961 827421 869560 900262 926703 936664 884349 859623
16556 859623 856309 836933 806274 768936 764205 789188 838027 921968 958728 967661 1018004 1054253
$$ packed form
16640F75118m2267q8554q0704m6470k0432N0572l136j0077p215n121K8775l0737
16628D19752J0662J5657n873j8764O11L387m163r305k5539J6072J3142K311k0867
16615C97083o616j2559L0804M9304Q9022P4510L5527J7673L0590L1227L1614L7900
16603H06079J1820M141n3590n6474n6379q8678o6911p46m808J8358M9855L9010
16591F01677M6285O2017R3176N8099M2981K1912o1838q4532m8054l4392o4780
16580F32551n1026j6018L2935K6608P129p810M8365N882M1370K6424m1942l7863
16568F66605k6275Q842L4051M2987O2751L8460M2139L0702K6441R961n2315k4726
16556H59623l314j9376l0659l7338m731K4983M8839Q3941L6760Q933N0343L6249
$$ plain form
16544 1054253 1047598 1017715 1033738 1017947 1004967 1000449 1031859 1104400 1152727 1175984 1225985 1280034
16532 1280034 1367667 1509814 1638351 1747653 1875618 1965972 2014441 2046683 2105793 2244699
16522 2244699 2462565 2697980 3013955 3402498 3786521 4148707 4465423 4801141 5213003
16513 5213003 5736602 6359343 7246698 8483009 10142044 12474287 15866745 20805265 28163090
16504 28163090 38454102 50739773 62597712 71351393 72329468 63176649 50859864 42283427
16496 42283427 38384254 38337444 41957572 49677657 62044668 78297436 96525002 113802906
16488 113802906 123715769 122294469 113416740 98324906 79345107 63467500 53402657
16481 53402657 48149175 46618586 48592001 54317901 63230464 73024517 81040448 83545557
$$ packed form
16544A054253o655k9883J6023j5791j2980m518L1410P2541M8327K3257N0001N4049
16532A280034Q7633J42147J28537J09302J27965R0354M8469L2242N9110J38906
16522B244699K17866K35415L15975L88543L84023L62186L16716L35718M11862
16513E213003N23599O22741Q87355J236311J659035K332243L392458M938520P357825
16504B8163090J0291012J2285671J1857939Q753681R78075r152819j2316785q576437
16496D2283427l899173m6810L620128P720085J2367011J6252768J8227566J7277904
16488A13802906R912863j421300q877729j5091834j8979799j5877607j0064843
16481E3402657n253482j530589J973415N725900Q912563R794053Q015931K505109
$$ plain form
16473 83545557 76094617 61808122 48799194 39811837 33796220 29545731 26399120 24002959
16465 24002959 22145956 20723310 19668012 18810546 18125513 17571872 17049816 16508483 15843270
16456 15843270 15132939 14349445 13551936 12796249 12110795 11529339 11008943 10583365 10217244
16447 10217244 9934777 9685965 9412130 9132008 8816861 8487886 8193850 7896483 7620932
16438 7620932 7381459 7151139 6902457 6673342 6434310 6237704 6054821 5863257 5698786
16429 5698786 5574326 5449714 5346456 5179293 5019597 4854354 4723869 4619357 4425354
16420 4425354 4278491 4156777 4019357 3882899 3741530 3662124 3565702 3437657 3320236 3268810
16410 3268810 3193861 3113572 3023028 2969313 2935994 2830673 2714418 2618490 2542443 2505951 2426755
$$ packed form
16473H3545557p450940j4286495j3008928q987357o015617m250489l146611k396161
16465B4002959j857003j422646j055298q57466o85033n53641n22056n41333o65213
16456A5843270p10331p83494p97509p55687o85454n81456n20396m25578l66121
16447A0217244k82467k48812k73835k80122l15147l28975k94036k97367k75551
16438G620932k39473k30320k48682k29115k39032j96606j82883j91564j64471
16429E698786j24460j24612j03258j67163j59696j65243j30485j04512j94003
16420D425354j46863j21714j37420j36458j41369p9406r6422j28045j17421n1426
16410C268810p4949q0289r0544n3715l3319j05321j16255r5928p6047l6492p9196
$$ plain form
16399 2426755 2356694 2274360 2211176 2147476 2093850 2085475 2029667 1968815 1894703 1872320 1822517
16388 1822517 1810629 1748008 1667143 1605868 1582925 1536048 1485483 1474397 1469970 1468226 1455499 1414745
16376 1414745 1350659 1285375 1264712 1201495 1129756 1086698 1085743 1075567 1022958 958674 915767 872904
16364 872904 836562 792956 753896 706668 670265 634547 585942 555748 540989 536930 526365 536183
16352 536183 478739 465550 418994 365241 384145 381579 362541 321791 291715 312490 295539 239161
16340 239161 163224 140223 161917 196237 208128 163190 160218 175089 158892 156166 197185 203244
16328 203244 189883 169303 152855 175653 161507 147510 163220 189660 198941 217994 198166 189969
16316 189969 193150 217454 227653 210483 185935 179086 150443 138319 131525 143631 111972 126453
$$ packed form
16399B426755p0061q2334o3184o3700n3626q375n5808o0852p4112k2383m9803
16388A822517j1888o2621q0865o1275k2943m6877n0565j1086m427j744j2727m0754
16376A414745o4086o5284k0663o3217p1739m3058r55j0176n2609o4284m2907m2863
16364H72904l6342m3606l9060m7228l6403l5718m8605l0194j4759m059j0565R818
16352E36183n7444j3189m6556n3753J8904k566j9038m0750l0076K0775j6951n6378
16340B39161p5937k3001K1694L4320J1891m4938k972J4871j6197k726M1019O059
16328B03244j3361k0580j6448K2798j4146j3997J5710K6440R281J9053j9828q197
16316A89969L181K4304J0199j7170k4548o849k8643j2124o794J2106l1659J4481
$$ plain form
16304 126453 149409 190291 217856 237282 226107 172227 153303 102871 104230 117077 95532 72415
16292 72415 86338 99145 70359 94368 156526 180577 168409 164247 171618 174565 153875 105060
16280 105060 104371 87569 133419 155815 147885 140462 137317 92417 74596 75570 77692 103111 106325
16267 106325 97211 109568 126015 170656 171534 148312 143883 149098 147035 145468 103019 104220 145146
16254 145146 156597 154428 136597 113887 116542 124372 101897 87453 84979 87145 83073 73549 25580
16241 25580 36462 33401 29986 55621 47245 58589 51190 39101 75737 97410 109938 100952 104247
16228 104247 96769 64403 16043 -40644 -26970 -6960 561 25499 6505 -22990 5728 33231
16216 33231 32379 36869 37857 41650 50704 29313 9272 3535 -12539 -60505 -64412 -66618 -63453 -29291
$$ packed form
16304A26453K2956M0882K7565J9426j1175n3880j8924n0432J359J2847k1545k3117
16292G2415J3923J2807k8786K4009O2158K4051j2168m162P371K947k0690m8815
16280A05060o89j6802M5850K2396p930p423l145m4900j7821R74K122K5419L214
16267A06325r114J2357J6447M4641Q78k3222m429N215k063j567m2449J201M0926
16254A45146J1451k169j7831k2710K655P830k2475j4444k474K166m072r524m7969
16241B5580J0882l061l415K5635q376J1344p399j2089L6636K1673J2528q986L295
16228A04247p478l2366m8360n6687J3674K0010P521K4938j8994k9495K8718K7503
16216C3231q52M490R88L793R054k1391k0041n737j6074m7966l907k206L165L4162
$$ plain form
16202 -29291 -4098 -845 26850 47311 -15913 6222 6225 31196 33549 -4905 -14969 -31049 -40538
16189 -40538 -7528 -6736 -22392 -22007 -28866 -66832 -65386 -66187 -49959 -55603 -31114 10894 61976
16176 61976 36307 12898 -19378 -19133 -11200 -4890 -8512 -7317 1330 -5754 -6929 -30138 -68383
16163 -68383 -91572 -71545 1068 9794 -9758 -258 27438 52785 58760 64917 52081 62974
16151 62974 69825 51831 53299 39002 9465 -18412 -39149 -53214 -63196 -50509 -23778 -20257
16139 -20257 17294 31292 13681 -13565 16852 -9736 -35596 -37655 -89644 -95437 -56262 -37925
16127 -37925 4408 46802 61301 48661 7017 -8676 1979 -21019 -40775 -37919 2763 36725
16115 36725 22892 8106 12059 9314 30089 8028 -27490 -17771 -30129 -58269 -41808 -4667
$$ packed form
16202b9291K5193L253K7695K0461o3224K2135LK4971K353l8454j0064j6080r489
16189d0538L3010P92j5656L85o859l7966J446q01J6228n644K4489M2008N1082
16176F1976k5669k3409l2276K45P933O310l622J195Q647p084j175k3209l8245
16163f8383k3189K0027P2613Q726j9552R500K7696K5347N975O157j2836J0893
16151F2974O851j7994J468j4297k9537k7877k0737j4065r982J2687K6731L521
16139b0257L7551J3998j7611k7246L0417k6588k5860k059n1989n793L9175J8337
16127c7925M2333M2394J4499j2640m1644j5693J0655k2998j9756K856M0682L3962
16115C6725j3833j4786L953k745K0775k2061l5518R719j2358k8140J6461L7141
$$ plain form
16103 -4667 7288 -360 -24568 15339 16067 -17309 -34325 -62961 -49131 -58412 -16292 32734 44965
16090 44965 -303 -17360 -12132 -3776 -73282 -91435 -49085 186 26470 28075 53682 72081
16078 72081 79541 62699 40327 -12187 -8818 -29599 -55610 -55445 -48872 -53016 -63460 -32739 -21528
16065 -21528 1611 12058 8124 28084 14282 6006 22999 18141 -17890 -33577 -34146 -17094 10859
16052 10859 31342 17015 -18551 -80352 -74148 -45898 -64761 -38988 -25568 -22389 5371 26744
16040 26744 6886 -34845 -56360 -81228 -71746 -24482 -14147 -15639 7003 50306 40751 17544
16028 17544 -14480 -4917 -4399 15129 27484 4438 -18657 -26350 -38650 -47470 -69791 -91596 -81536
16015 -81536 -106376 -99257 -73095 -81835 -72643 -41720 -46016 -26057 -12122 5965 -11001 -20843 -34634
$$ packed form
16103d667J1955p648k4208L9907P28l3376j7016k8636J3830r281M2120M9026J2231
16090D4965m5268j7057N228Q356o9506j8153M2350M9271K6284J605K5607J8399
16078G2081P460j6842k2372n2514L369k0781k6011J65O573m144j0444L0721J1211
16065b1528K3139J0447l934J9960j3802q276J6993m858l6031j5687n69J7052K7953
16052A0859K0483j4327l5566o1801O204K8250j8863K5773J3420L179K7760K1373
16040B6744j9858m1731k1515k4868R482M7264J0335j492K2642M3303r555k3207
16028A7544l2024R563N18J9528J2355k3046k3095p693j2300q820k2321k1805J0060
16015h1536k4840P119K6162q740R192L0923m296J9959J3935J8087j6966r842j3791
$$ plain form
16002 -34634 -43133 -63748 -70167 -53505 -22355 9859 13036 -7026 -30666 -36201 -25472 -20981 -32951
15989 -32951 -42817 -26117 -40502 -94849 -94567 -47212 -6147 -62883 -52416 -28370 -44095 -82665
15977 -82665 -53182 -34287 -93011 -116668 -77056 -49805 -36013 -20009 16440 27518 10704 -6488
15965 -6488 -44887 -48465 -52038 -46255 -35873 -15214 -15680 -14422 11166 -1801 7805 45990 51404
15952 51404 43227 38096 43591 6651 -11967 29019 49531 46810 78597 121788 165320 236299
15940 236299 318420 350438 344726 300434 255175 223929 225745 219470 231418 290585 386136 487563
15928 487563 606547 676869 666405 594027 549604 474939 349559 274731 238670 204266 187082
15917 187082 191206 221144 285886 340038 408092 431353 409673 366718 253462 193430 119281
$$ packed form
16002c4634q499k0615o419J6662L1150L2214L177k0062k3640n535J0729M491j1970
15989c2951r866J6700j4385n4347K82M7355M1065n6736J0467K4046j5725l8570
15977h2665K9483J8895n8724k3657L9612K7251J3792J6004L6449J1078j6814j7192
15965f488l8399l578l573N783J0382K0659m66J258K5588j2967R606L8185N414
15952E1404q177n131N495l6940j8618M0986K0512k721L1787M3191M3532P0979
15940B36299Q2121L2018n712m4292m5259l1246J816o275J1948N9167R5551J01427
15928D87563J18984P0322j0464p2378m4423p4665j25380p4828l6061l4404j7184
15917A87082M124K9938O4742N4152O8054K3261k1680m2955j13256o0032p4149
$$ plain form
15906 119281 67217 47280 80480 91309 73249 74027 81489 88661 95685 76223 62592 46810
15894 46810 2445 -10662 44287 58055 27416 -2715 -965 34727 54872 34007 -4520 -13701
15882 -13701 -35582 -16865 2045 -16638 -49310 -47087 -14036 -11965 -16054 3928 26686 23706
15870 23706 36695 41999 58378 57601 72939 32122 -31145 -23075 10033 -48291 -103810 -49987
15858 -49987 -12244 3471 15281 13 1252 -27053 -22604 -18628 -36724 -35132 -18523 -48958
15846 -48958 -54885 -56201 -25720 -38344 -47839 -57733 -23657 -4035 -53229 -65060 -82111 -85026 -51909
15833 -51909 -906 30471 52331 35475 8576 33537 23254 -3697 -8282 -20869 -53885 -47882
15821 -47882 -52841 -70802 -25088 -15485 -26261 -41423 -33415 -43777 -48085 -20934 5255 -4028 -9415
$$ packed form
15906A19281n2064j9937L3200J0829j8060P78P462P172P024j9462j3631j5782
15894D6810m4365j3107N4949J3768l0639l0131J750L5692K0145k0865l8527r181
15882a3701k1881J8717J8910j8683l2672K223L3051K071m089J9982K2758k980
15870B3706J2989N304J6379p77J5338m0817o3267Q070L3108n8324n5519N3823
15858d9987L7743J5715J1810j5268J239k8305M449L976j8096J592J6609l0435
15846d8958n927j316L0481j2624r495r894L4076J9622m9194j1831j7051k915L3117
15833e1909N1003L1377K1860j6856k6899K4961j0283k6951m585j2587l3016O003
15821d7882m959j7961M5714R603j0776j5162Q008j0362m308K7151K6189r283n387
$$ plain form
15808 -9415 -29333 -44527 -58928 -49934 -10258 6136 -3855 -22632 -62054 -73053 -13484 -14912
15796 -14912 -40779 -64782 -62566 -31903 -47492 -8722 11112 -18874 -21065 -60402 -69113 -63092
15784 -63092 -86766 -111868 -127014 -104598 -65116 -54180 -51128 -64978 -37175 33822 34695 18940
15772 18940 23037 -24090 -25046 -20567 3279 22882 33511 10805 -61595 -37473 24852 30427 5470
15759 5470 -31139 -39934 -19730 -14428 7465 19113 11675 4573 2954 62059 32726 -17504 -42701
15746 -42701 -72826 -78413 -72286 -67175 -79885 -85737 -74746 -86207 -69557 -3441 17645 -25540
15734 -25540 -28358 -36212 -51308 -71189 -101421 -81703 -50950 -80877 -71305 -69504 -38383 -22482
15722 -22482 -26665 -19030 -13668 -30394 -4662 8217 -3096 -18780 -43018 -2584 -21864 -79638
$$ packed form
15808i415j9918j5194j4401Q994L9676J6394r991j8777l9422j0999N9569j428
15796a4912k5867k4003K216L0663j5589L8770J9834k9986k191l9337q711O021
15784f3092k3674k5102j5146K2416L9482J0936L052j3850K7803P0997Q73j5755
15772A8940M097m7127r56M479K3846J9603J0629k2706p2400K4122O2325N575k4957
15759E470l6609q795K0204N302K1893J1648p438p102j619N9105k9333n0230k5197
15746d2701l0125n587O127N111j2710n852J0991j1461J6650O6116K1086m3185
15734b5540k818p854j5096j9881l0232J9718L0753k9927R572J801L1121J5901
15722b2482m183P635N362j6726K5732J2879j1313j5684k4238M0434j9280n7774
$$ plain form
15710 -79638 -95354 -64178 -86757 -104394 -103797 -77061 -52903 -52425 -38957 -7208 -10573 -54571 -59483
15697 -59483 -54839 -34413 9784 23304 -11230 -13229 4461 31508 18760 6661 23251 15301
15685 15301 -10018 -18374 20628 23905 -24878 -26760 -38105 -80695 -93124 -84242 -51032 -39863
15673 -39863 -80918 -84475 -88693 -87591 -27308 -22930 -33951 -22745 -14135 -35130 -48590 -55932 -61116
15660 -61116 -76142 -77772 -60915 -65368 -46880 -40959 -47217 -51090 -85369 -87472 -69407 -12799 29395
15647 29395 9473 -1159 -25426 -68700 -61605 -40736 -4237 -6147 -56465 -33422 -5088 -24013
15635 -24013 -16826 -13086 -33273 -32435 4910 36004 27338 -11054 -17790 -26386 -38865 -19383 -27155
15622 -27155 -52061 -35040 -6 1606 -24904 -70148 -101958 -88552 -71749 -65838 -65987 -44891
$$ packed form
15710g9638j5716L1176k2579j7637N97K6736K4158M78J3468L1749l365m3998m912
15697e9483M644K0426M4197J3520l4534j999J7690K7047j2748j2099J6590p950
15685A5301k5319q356L9002L277m8783j882j1345m2590j2429Q882L3210J1169
15673c9863m1055l557m218J102O0283M378j1021J1206Q610k0995j3460p342n184
15660f1116j5026j630J6857m453J8488N921o258l873l4279k103J8065N6608M2194
15647B9395j9922j0632k4267m3274P095K0869L6499j910n0318K3043K8334j8925
15635b4013P187L740k0187Q38L7345L1094q666l8392o736q596j2479J9482p772
15622b7155k4906J7021L5034J612k6510m5244l1810J3406J6803N911j49K1096
$$ plain form
15610 -44891 -18150 -15563 -33108 -34192 -40519 -22259 -21637 -25669 -40041 -19342 18381 44770 17502
15597 17502 -4895 2178 -5772 13098 39394 41006 23483 -20686 -15118 -17504 -21621 2932 25533
15584 25533 5407 -28221 -35603 -64265 -40731 -11284 -30760 -31280 3131 11642 2732 -50128 -65017
15571 -65017 -80750 -88065 -68686 -45855 -20192 -11445 -17070 -40453 -61810 -98112 -103370 -70070
15559 -70070 -103432 -130651 -113749 -59004 -33344 -47646 -36055 -44119 -49397 -46934 -39236 -29520 9616
15546 9616 66756 39902 -1194 -28175 -31834 -50996 -31864 -5420 -20178 -38222 -32065 -62854
15534 -62854 -51976 -20884 -6328 -7238 17478 -9578 -7096 18534 14405 -4945 -6429 -31245 -25472
15521 -25472 23539 -8674 -32025 3795 6229 -44264 -72556 -66977 -25041 302 3152 -9144
$$ packed form
15610d4891K6741K587j7545j084o327J8260O22m032j4372K0699L7723K6389k7268
15597A7502k2397P073p950J8870K6296J612j7523m4169N568k386m117K4553K2601
15584B5533k0126l3628p382k8662K3534K9447j9476n20L4411Q511q910n2860j4889
15571f5017j5733p315J9379K2831K5663Q747n625k3383k1357l6302n258L3300
15559g0070l3362k7219J6902N4745K5660j4302J1591q064n278K463P698R716L9136
15546I616N7140k6854m1096k6981l659j9162J9132K6444j4758j8044O157l0789
15534f2854J0878L1092J4556r10K4716k7056K482K5630m129j9350j484k4816N773
15521b5472M9011l2213k3351L5820K434n0493k8292N579M1936K5343K850j2296
$$ plain form
15509 -9144 13112 824 -33286 -53914 -47600 -26737 -37820 -47078 -69547 -82901 -35550 -2490
15497 -2490 -1181 -28157 -44075 -20818 27295 33815 13628 44608 43828 38634 52961 91768 85802
15484 85802 82753 99138 65878 10453 10686 8509 -15231 -26350 -26298 -36049 -33470 -2442 -968 -7572
15470 -7572 23326 488 -20085 -24117 -14231 -1909 14730 1689 13859 41222 21954 1747
15458 1747 10072 -694 -16101 10966 5092 -71606 -83427 -22473 8775 43466 36904 63367
15446 63367 98928 53114 26400 11538 -25457 -34591 -73397 -52725 7070 6564 -5564 -5475 22255
15433 22255 25031 42361 55182 41952 -21689 -41174 -19536 -33156 -36129 -44434 -64515 -68187
15421 -68187 -36823 -7102 8068 13030 57774 62877 7831 -37132 -36846 -11522 -8154 -6170 8088
$$ packed form
15509i144K2256j2288l4110k0628O314K0863j1083r258k2469j3354M7351L3060
15497b490J309k6976j5918K3257M8113O520k0187L0980p80n194J4327L8807n966
15484H5802l049J6385l3260n5425K33k177k3740j1119N2r751K579L1028J474o604
15470g572L0898k2838k0573m032R886J2322J6639j3041J2170K7363j9268k0207
15458A747Q325j0766j5407K7067n874p6698j1821O0954L1248L4691o562K6463
15446F3367L5561m5814k6714j4862l6995r134l8806K0672N9795n06j2128Q9K7730
15433B2255K776J7330J2821j3230o3641j9485K1638j3620k973q305k0081l672
15421f8187L1364K9721J5170M962M4744N103n5046m4963K86K5324L368J984J4258
$$ plain form
15408 8088 39323 48713 42531 74232 73202 44939 46914 63398 89572 69188 33566 -3427 -23508
15395 -23508 -53083 2478 13792 16848 12825 78 8595 25496 15101 1186 -12848 -39115
15383 -39115 -45306 -35910 -34742 -21586 2657 -4456 -30061 -33532 -34378 13339 37192 69891 49056
15370 49056 9304 -5791 -20333 -37942 -30638 -3530 13112 9766 649 20510 36686 18616
15358 18616 46147 62580 70666 64484 5101 -21131 10776 40866 28392 31611 52784 40710
15346 40710 16349 27648 8199 5522 -9056 -28024 -41975 -24980 19299 29535 7416 26051
15334 26051 39063 54117 83483 62081 46160 -1998 19030 5282 2443 -20025 -43834 -14118
15322 -14118 -14548 -28686 8097 -14909 -16989 53787 71803 84935 64640 12551 -11541 -18455
$$ packed form
15408H088L1235R390o182L1701j030k8263J975J6484K6174k0384l5622l6993k0081
15395b3508k9575N5561J1314L056m023j2747Q517J6901j0395j3915j4034k6267
15383c9115o191R396J168J3156K4243p113k5605l471q46M7717K3853L2699k0835
15370D9056l9752j5095j4542j7609P304K7108J6642l346r117J9861J6176j8070
15358A8616K7531J6433Q086o182n9383k6232L1907L0090j2474L219K1173j2074
15346D0710k4361J1299j9449k677j4578j8968j3951J6995M4279J0236k2119J8635
15334B6051J3012J5054K9366k1402j5921m8158K1028j3748k839k2468k3809K9716
15322a4118m30j4138L6783k3006k080P0776J8016J3132k0295n2089k4092o914
$$ plain form
15310 -18455 335 1114 -5260 -11839 1039 -17322 -30704 -51427 -51947 -27200 -18664 -14245 -2349
15297 -2349 -28133 -17716 5485 9847 11611 22600 12545 37832 45986 44282 68342 112570 129429
15284 129429 108692 73948 83601 86513 91009 140526 188096 217256 254499 244303 257440 355313
15272 355313 476041 655428 866909 1083883 1344429 1569812 1785435 1944687 1995591 1935142
15262 1935142 1786963 1578128 1386502 1205187 979878 761799 609817 540306 476661 466265
15252 466265 449231 374726 342306 311817 296130 307373 284744 243123 231664 201367 200209 199525
15240 199525 183552 186436 185502 188018 231712 224812 196570 146286 144244 158015 151099 106205 73992
15227 73992 81813 89591 63737 42919 61762 133952 134769 120733 112860 93270 81048 102260 147379
$$ packed form
15310a8455J8790P79o374o579J2878j8361j3382k0723n20K4747Q536M419J1896
15297b349k5784J0417K3201M362J764J0989j0055K5287Q154j704K4060M4228J6859
15284A29429k0737l4744R653K912M496M9517M7570K9160L7243j0196J3137R7873
15272C55313J20728J79387K11481K16974K60546K25383K15623J59252N0904o0449
15262A935142j48179k08835j91626j81315k25309k18079j51982o9511o3645j0396
15252D66265j7034p4505l2420l0489j5687J1243k2629m1621j1459l0297j158o84
15240A99525j5973K884r34K516M3694o900k8242n0284k042J3771o916m4894l2213
15227G3992P821P778k5854k0818J8843P2190Q17j4036p873j9590j2222K1212M5119
$$ plain form
15214 147379 130150 109846 94242 116996 137976 129584 103151 121018 68464 32948 60493 31680
15202 31680 37006 49245 55812 49704 38937 38410 25976 61343 145322 167506 131760 101722 48496
15189 48496 22978 26140 33444 42672 70347 92406 71614 84912 107999 110249 116426 108594 76708
15176 76708 32350 24691 36157 37860 39295 33424 49563 48014 40567 48471 46900 41682 26367
15163 26367 52414 55454 82458 57461 -7403 -15475 -12104 -16019 -17068 15334 33965 46527 53780
15150 53780 47854 53786 63233 50055 16052 33289 60770 96807 75922 48178 42356 50466 44891
15137 44891 74227 49045 30868 31013 17593 10291 1860 -5702 -6351 10428 15628 30993 46634
15124 46634 48648 -7741 -34365 -23929 20025 15809 1315 -13193 -8753 -28603 -4407 28159
$$ packed form
15214A47379j7229k0304j5604K2754K0980q392k6433J7867n2554l5516K7545k8813
15202C1680N326J2239O567o108j0767n27j2434L5367Q3979K2184l5746l0038n3226
15189D8496k5518L162P304R228K7675K2059k0792J3298K3087K250O177p832l1886
15176G6708m4358p659J1466J703J435n871J6139j549p447P904j571n218j5315
15163B6367K6047L040K7004k4997o4864q072L371l915j049L2402J8631J2562P253
15150E3780n926N932R447j3178l4003J7237K7481L6037k0885k7744n822Q110n575
15137D4891K9336k5182j8177J45j3420p302q431p562o49J6779N200J5365J5641
15124D6634K014n6389k6624J0436M3954m216j4494j4508M440j9850K4196L2566
$$ plain form
15112 28159 5559 4539 4458 -14307 -7330 -35827 -42750 -7507 78631 70416 85414 89982 104053
15099 104053 119631 114974 90260 62358 40256 65812 151664 200785 220645 247924 282964 244875
15087 244875 236590 269221 284364 262314 259682 281050 290375 287452 284052 242466 247322 230522 242478
15074 242478 252313 229931 250566 259192 216513 200707 215695 220962 223760 231870 231824 187853 161874
15061 161874 121633 140027 153368 172468 177207 158805 143921 146788 165628 159836 153998 141042
15049 141042 117492 111718 153963 193207 258033 311886 363605 400921 483917 559508 631498 676401
15037 676401 648226 617479 599674 547982 503701 445281 373771 299635 257584 248139 277063 286002
15025 286002 305021 296459 331162 367443 359775 351610 330418 351626 339554 294495 264881 252004
$$ packed form
15112B8159k2600j020q1j8765O977k8497o923L5243Q6138q215J4998M568J4071
15099A04053J5578m657k4714k7902k2102K5556Q5852M9121J9860K7279L5040l8089
15087B44875q285L2631J5143k2050k632K1368R325k923l400m1586M856j6800J1956
15074B42478R835k2382K0635Q626m2679j5806J4988N267K798Q110m6m3971k5979
15061A61874m0241J8394J3341J9100M739j8402j4884K867J8840n792n838j2956
15049A41042k3550n774M2245L9244O4826N3853N1719L7316Q2996P5591P1990M4903
15037F76401k8175l0747j7805n1692m4281n8420p1510p4136m2051r445K8924Q939
15025B86002J9019q562L4703L6281p668q165k1192K1208j2072m5059k9614j2877
$$ plain form
15013 252004 254788 234152 195617 165052 152364 177741 216838 242117 246307 280915 277882 285350
15001 285350 281901 293920 314887 292617 284510 321699 349422 372564 396980 432538 541277 695529
14989 695529 933431 1208620 1465179 1597905 1385029 1060730 855080 712797 612177 567539
14979 567539 578634 574323 570604 563595 543409 555576 557584 537623 514843 526114 565252 577892
14967 577892 585048 602696 637653 698274 707178 690475 681439 688091 695351 685865 641454 600313 566822
14954 566822 542202 482128 467958 480575 484011 489151 458845 499528 528778 536664 508155 463110
14942 463110 473368 513439 555520 544298 509288 506258 483418 462279 468080 465606 499099 521503
14930 521503 535153 565893 599107 620131 616441 634205 700358 723416 706846 683175 693044 744840
$$ packed form
15013B52004K784k0636l8535l0565j2688K5377L9097K5279M190L4608l033P468
15001B85350l449J2019K0967k2270q107L7189K7723K3142K4416L5558J08739J54252
14989F95529K37902K75189K56559J32726k12876l24299k05650j42283j00620m4638
14979E67539J1095m311l719p009k0186J2167K008j9961k2780J1271L9138J2640
14967E77892P156J7648L4957O0621Q904j6703r036O652P260r486m4411m1141l3491
14954E66822k4620o0074j4170J2617L436N140l0306M0683K9250P886k8509m5045
14942D63110J0258M0071M2081j1222l5010l030k2840k1139N801k474L3493K2404
14930E21503J3650L0740L3214K1024l690J7764O6153K3058j6570k3671R869N1796
$$ plain form
14918 744840 793427 831255 820993 811844 781883 757413 747906 774358 778126 723776 720406 720989 737797
14905 737797 766284 778011 813276 831040 835197 860354 887727 900400 913529 933797 946444 968634
14893 968634 972480 1004976 1043681 1047859 1029498 1030307 1029051 1071000 1098679 1111429 1094326 1151959
14881 1151959 1230518 1239114 1287336 1304192 1336624 1375000 1386306 1470153 1567247 1663671 1756244
14870 1756244 1869520 1967018 2045264 2103947 2190626 2286439 2397799 2545321 2667698 2767935
14860 2767935 2912573 3136921 3378507 3649630 3976949 4316148 4691715 5080845 5569093
14851 5569093 6198532 6942840 7796808 8844322 10171354 11743460 13544754 15556872 17764686
14842 17764686 20252790 23039725 26251188 30174286 35203061 42210270 52377325 67330064
$$ packed form
14918G44840M8587L7828j0262r149k9961k4470r507K6452L768n4350l370N83J6808
14905G37797K8487J1727L5265J7764M157K5157K7373J2673J3129K0268J2647K2190
14893I68634L846L2496L8705M178j8361Q09j256M1949K7679J2750j7103N7633
14881A151959P8559Q596M8222J6856L2432L8376J1306Q3847R7094R6424R2573
14870A756244J13276R7498P8246N8683Q6679R5813J11360J47522J22377J00237
14860B767935J44638K24348K41586K71123L27319L39199L75567L89130M88248
14851E569093O29439P44308Q53968J047514J327032J572106J801294K012118K207814
14842A7764686K488104K786935L211463L923098N028775P007209J0167055J4952739
$$ plain form
14834 67330064 88857972 118562574 156897027 202183294 250866933 297883704 338051258
14827 338051258 366179696 378297831 372027051 348917199 313056712 270493219 226353658
14820 226353658 185151478 150106215 123149398 104217584 91661885 83166477 76974943
14813 76974943 72046121 67741953 63692962 59786925 55914048 52131409 48599077 45350866
14805 45350866 42378633 39772508 37545609 35620187 33977338 32571947 31245430 30008549
14797 30008549 28830880 27683570 26583323 25508514 24460372 23414823 22421866 21500362
14789 21500362 20638540 19871468 19200762 18554147 17992798 17491654 17071283 16701100 16329128
14780 16329128 15938898 15557318 15178193 14740462 14300933 13842626 13354209 12865541 12396713
$$ packed form
14834F7330064K1527908K9704602L8334453M5286267M8683639M7016771M0167554
14827C38051258K8128438J2118135o270780k3109852l5860487m2563493m4139561
14820B26353658m1202180l5045263k6956817j8931814j2555699q495408o191534
14813G6974943m928822m304168m048991l906037l872877l782639l532332l248211
14805D5350866k972233k606125k226899j925422j642849j405391j326517j236881
14797C0008549j177669j147310j100247j074809j048142j045549r92957r21504
14789B1500362q61822p67072o70706o46615n61349n01144m20371l70183l71972
14780A6329128l90230l81580l79125m37731m39529m58307m88417m88668m68828
$$ plain form
14771 12396713 11991372 11570584 11193907 10851026 10518942 10208952 9948676 9712307 9514429
14762 9514429 9299431 9072976 8821136 8606873 8361494 8102398 7871652 7595221 7342765
14753 7342765 7132967 6901658 6702804 6540482 6323580 6126505 5970665 5842950 5736828
14744 5736828 5630797 5549949 5490372 5351427 5192010 5035013 4881403 4753681 4611796 4480036
14734 4480036 4329127 4234669 4111899 4031624 3942271 3810202 3706228 3615480 3552710 3495585
14724 3495585 3433663 3332197 3284139 3252382 3232606 3229628 3187669 3157492 3099952 2999743 2871322
14713 2871322 2754422 2643066 2554268 2463502 2361202 2253439 2147641 2042374 1990434 1921305
14703 1921305 1875036 1836359 1739386 1655749 1617978 1542087 1417338 1341223 1248533 1149731 1059202
$$ packed form
14771A2396713m05341m20788l76677l42881l32084l09990k60276k36369j97878
14762I514429k14998k26455k51840k14263k45379k59096k30746k76431k52456
14753G342765k09798k31309j98854j62322k16902j97075j55840j27715j06122
14744E736828j06031q0848n9577j38945j59417j56997j53610j27722j41885j31760
14734D480036j50909r4458j22770q0275q9353j32069j03974r0748o2770n7125
14724C495585o1922j01466m8058l1757j9776k978m1959l0177n7540j00209j28421
14713B871322j16900j11356q8798r0766j02300j07763j05798j05267n1940o9129
14703A921305m6269l8677r6973q3637l7771p5891j24749p6115r2690r8802r0529
$$ plain form
14692 1059202 969777 887565 801587 705460 641127 583127 576395 605987 651143 633613 591247
14681 591247 548401 546033 522366 500448 541307 569525 534908 552399 545294 538313 519028 456362
14669 456362 422471 444561 500275 478534 443192 463637 506268 508490 500396 515567 529127 517474
14657 517474 465279 472800 489089 473356 460001 487748 480444 503510 507394 487777 459694 478233
14645 478233 471394 472531 497503 495965 434791 361429 323150 330456 325872 333962 334327 343841 348774
14632 348774 316316 278173 277767 272694 281540 319606 319033 352618 364424 362001 395400 437630 465958
14619 465958 515154 477563 431400 411830 431613 453359 475850 447689 424482 400987 413153
14608 413153 408148 395717 415049 412128 402107 391250 390898 344411 298717 312312 296886 280902
$$ packed form
14692A059202q9425q2212q5978r6127o4333n8000o732K9592M5156j7530m2366
14681E91247m2846k368k3667k1918M0859K8218l4617J7491p105o981j9285o2666
14669D56362l3891K2090N5714k1741l5342K0445M2631K222q094J5171J3560j1653
14657E17474n2195P521J6289j5733j3355K7747p304K3066L884j9617k8083J8539
14645D78233o839J137K4972j538o1174p3362l8279P306m584Q090L65R514M933
14632C48774l2458l8143m06n073Q846L8066n73L3585J1806k423L3399M2230K8328
14619D65958M9196l7591m6163j9570J9783K1746K2491k8161k3207k3495J2166
14608D13153n005j2431J9332k921j0021j0857l52m6487m5694J3595j5426j5984
$$ plain form
14596 280902 288304 293222 288254 285200 314191 348059 318733 306455 301193 280461 292723 298529 287927
14583 287927 275579 274308 275013 293717 307139 312775 313967 279308 268861 207364 211229 272345 273094
14570 273094 215380 218872 196620 162075 127601 97654 101546 116605 82338 71185 80143 90041
14558 90041 75740 83694 128149 90367 75990 126482 143087 123655 138035 160681 182016 189100
14546 189100 160144 114460 106531 88579 72780 82064 94993 87906 77951 61389 80272 66804
14534 66804 88713 107356 131703 97593 90961 133017 112297 97435 81362 47912 81955 132666
14522 132666 121051 70940 44808 29700 39356 64300 59474 46266 73017 81317 81337 34937 39217
14509 39217 60729 99652 92260 73923 77841 56020 39010 35806 48695 44822 94668 89424 105417
$$ packed form
14596B80902P402M918m968l054K8991L3868k9326j2278n262k0732J2262N806j0602
14583B87927j2348j271P05J8704J3422N636J192l4659j0447o1497L865O1116P49
14570B73094n7714L492k2252l4545l4474k9947L892J5059l4267j1153Q958R898
14558I0041j4301P954M4455l7782j4377N0492J6605j9432J4380K2646K1335P084
14546A89100k8956m5684p929j7952j5799R284J2929p087r955j6562J8883j3468
14534F6804K1909J8643K4347l4110o632M2056k0720j4862j6073l3450L4043N0711
14522A32666j1615n0111k6132j5108R656K4944m826j3208K6751Q300K0m6400M280
14509C9217K1512L8923p392j8337L918k1821j7010l204J2889l873M9846n244J5993
$$ plain form
14496 105417 116175 90429 68985 71869 48745 22964 48254 62770 53896 22474 -28298 2169
14484 2169 31522 39442 16717 -2535 -26694 -8448 30856 55310 55501 78329 119271 149282
14472 149282 112621 77846 43514 44211 83504 82668 68883 96845 104921 93542 94679 117340 121635
14459 121635 80526 62738 30619 -32605 -25162 19640 46759 35720 20065 31687 18680 -2918
14447 -2918 -7186 -33702 -14136 40961 41640 49264 38072 8793 2561 -5081 11460 38545 33862
14434 33862 43866 16484 32782 44010 26105 -5552 -20341 -58 26063 28164 24788 38465
14422 38465 68100 52294 40409 11054 33598 69965 76527 68576 67896 72051 77516 46468 18095
14409 18095 25271 27851 14799 954 -15868 41547 70436 56344 94038 118907 99803 97763
$$ packed form
14496A05417J0758k5746k1444K884k3124k5781K5290J4516q874l1422n0772L0467
14484B169K9353P920k2725j9252k4159J8246L9304K4454J91K2828M0942L0011
14472A49282l6661l4775l4332O97L9293q36j3785K7962Q076j1379J137K2661M295
14459A21635m1109j7788l2119o3224P443M4802K7119j1039j5655J1622j3007k1598
14447b918m268k6516J9566N5097O79P624j1192k9279o232p642J6541K7085m683
14434C3862J0004k7382J6298J1228j7905l1657j4789K0283K6121K101l376J3677
14422C8465K9635j5806j1885k9355K2544L6367O562p951o80M155N465l1048k8373
14409A8095P176K580j3052j3845j6822N7415K8889j4092L7694K4869j9104k040
$$ plain form
14397 97763 101051 161649 181274 199612 218249 228638 329893 467317 569190 690863 927673
14386 927673 1216610 1476311 1697563 1863952 1962810 2022511 1984819 1770355 1572192 1327064
14376 1327064 1089965 879382 737469 640124 542349 528409 498810 469653 414389 363391 310484
14365 310484 266321 246531 266609 237881 189397 169275 186752 170530 162225 122237 143528 158784
14353 158784 169054 160504 161761 151144 164369 136707 130017 140047 138902 135949 112353 101553
14341 101553 61505 39266 54861 115395 109817 99924 90363 121081 140141 118988 121284 159300
14329 159300 138325 102221 118017 118933 90723 66600 66526 55246 57595 60092 64278 88775 84841
14316 84841 44338 14417 5639 22622 63903 110444 160262 123004 50830 77133 71383 74484
$$ packed form
14397I7763L288O0598J9625J8338J8637J0389J01255J37424J01873J21673K36810
14386I27673K88937K59701K21252J66389R8858N9701l7692k14464j98163k45128
14376A327064k37099k10583j41913r7345r7775j3940k9599k9157n5264n0998n2907
14365C10484m4163j9790K0078k8728m8484k0122J7477j6222q305l9988K1291J5256
14353A58784J0270q550J257j0617J3225k7662o690J0030j145k953k3596j0800
14341A01553m0048k2239J5595O0534n578r893r561L0718J9060k1153K296L8016
14329A59300k0975l6104J5796R16k8210k4123p4j1280K349K497M186K4497l934
14316H4841m0503k9921q778J6983M1281M6541M9818l7258p2174K6303n750L101
$$ plain form
14304 74484 61765 33282 19252 48549 116832 130618 81164 30625 5205 -9119 -18165 -10037
14292 -10037 20015 20070 43863 25544 4882 17463 31657 1729 9572 17808 17258 21684 21093 2171
14278 2171 -41703 -58462 -29446 -52292 -99417 -90257 -77648 -31988 -2002 6724 18198 64143
14266 64143 20469 -6743 16388 38266 1911 -39787 -33118 -22701 -33162 -72927 -11224 -6950
14254 -6950 7307 25744 39035 54340 45974 12509 -16869 -36492 -32823 -23433 -22991 -6338 -14982
14241 -14982 -33490 -6864 -37069 -68318 -28784 28834 36319 48290 6228 22406 40752 24982
14229 24982 -19601 -57668 -39217 7575 28887 23607 3979 11277 4319 15387 24428 10625
14217 10625 -10651 26695 20348 28158 13661 24461 56086 24005 -10245 -34505 -46461 -16919
$$ packed form
14304G4484j2719k8483j4030K9297O8283J3786m9454n0539k5420j4324r046Q128
14292a0037L0052N5K3793j8319k0662J2581J4194k9928P843Q236n50M426n91j8922
14278B171m3874j6759K9016k2846m7125R160J2609M5660K9986Q726J1474M5945
14266F4143m3674k7212K3131K1878l6355m1698O669J0417j0461l9765O1703M274
14254f950J4257J8437J3291J5305q366l3465k9378j9623L669R390M42J6653q644
14241a4982j8508K6626l0205l1249L9534N7618P485J1971m2062J6178J8346j5770
14229B4982m4583l8067J8451M6792K1312n280j9628P298o958J1068R041j3803
14217A0625k1276L7346o347P810j4497J0800L1625l2081l4250k4260j1956K9542
$$ plain form
14205 -16919 13352 24157 -6934 -10945 -14694 -1296 17879 34425 23361 -12091 -45243 -22438
14193 -22438 6953 13093 14679 -8935 -20335 -12916 -1680 61469 73155 61169 1708 -12252
14181 -12252 17393 36927 18209 -1741 -18499 -13561 -171 -849 -7143 14412 42699 18363
14169 18363 15326 24908 38227 22079 11579 3629 -24618 -37467 -16064 -4389 -15331 -6209
14157 -6209 13270 58621 72253 58844 51348 34115 46265 5122 -52684 -35483 -8380 7710
14145 7710 20366 26880 25634 -3757 -49489 -28490 13459 19793 -1680 -24990 -26806 -24576 -16632
14132 -16632 -9302 -1472 -7738 748 -19522 -34407 -6133 -34766 -4903 48726 82955 52893
14120 52893 66034 58610 55587 27451 3926 3050 30142 55845 11847 -38261 14725 46059
$$ packed form
14205a6919L0271J0805l1091m011l749J3398J9175J6546j1064l5452l3152K2805
14193b2438K9391O140J586k3614j1400P419J1236O3149J1686j1986n9461j3960
14181a2252K9645J9534j8718j9950j6758M938J3390o78o294K1555K8287k4336
14169A8363l037R582J3319j6148j0500p950k8247j2849K1403J1675j0942R122
14157f209J9479M5351J3632j3409p496j7233J2150m1143n7806J7201K7103J6090
14145G710J2656O514j246k9391m5732K0999M1949O334k1473k3310j816K230P944
14132a6632P330P830o266Q486k0270j4885K8274k8633K9863N3629L4229l0062
14120E2893J3141p424l023k8136k3525q76K7092K5703m3998n0108N2986L1334
$$ plain form
14108 46059 63660 49660 57171 52531 10010 -41434 -66995 -64284 -42772 -4008 -21803 -19542
14096 -19542 11399 -6299 12662 2662 -17759 3450 16799 9624 -2807 -20558 -41757 -44930
14084 -44930 -48186 -45789 -4536 4413 -26971 -32480 -34783 -16703 -40351 -62745 -20081 13353 -11633
14071 -11633 -50525 -37945 -48926 -67399 -37382 -18799 1591 21327 -16258 -14594 25076 28080
14059 28080 25856 -13369 -15392 18670 16348 17634 -1738 -60200 -87462 -94893 -88092 -49168 -19306
14046 -19306 -4490 26229 70243 15183 -15563 -4610 55178 87110 95630 88778 81851 89884
14034 89884 67872 36944 26601 23190 3489 -12395 -29993 -14466 -19565 -29103 10280 -9004
14022 -9004 -45208 -23117 -34418 -34088 -13177 7902 -14635 -12846 -32332 -52116 -62532 -34877
$$ packed form
14108D6059J7601j4000P511m640m2521n1444k5561K711K1512L8764j7795K261
14096a9542L0941j7698J8961j0000k0421K1209J3349p175j2431j7751k1199l173
14084d4930l256K397M1253Q949l1384n509k303J8080k3648k2394M2664L3434k4986
14071a1633l8892J2580j0981j8473L0017J8583K0390J9736l7585J664L9670L004
14059B8080k224l9225k023L4062k322J286j9372n8462k7262p431O801L8924K9862
14046a9306J4816L0719M4014n5060l0746J0953N9788L1932Q520o852o927Q033
14034H9884k2012l0928j0343l411j9701j5884j7598J5527n099r538L9383j9284
14022i004l6204K2091j1301L30K0911K1079k2537J789j9486j9784j0416K7655
$$ plain form
14010 -34877 -4742 16682 19601 48283 34272 -6407 16857 19416 -21120 -71683 -97889 -50628
13998 -50628 -27755 -46700 -66629 -16378 -10976 -20951 -11564 35694 80346 114296 115599 97372
13986 97372 61538 20191 14251 7275 56845 40058 -9861 -33479 -12246 26964 18696 -11147
13974 -11147 -5126 -9790 -26764 12006 27567 -8082 17963 20897 28736 38464 52102 29316 -21637
13961 -21637 15856 17208 11964 34090 58636 37801 8730 -18124 -34719 -25799 -16743 -11669 -28733
13948 -28733 -12208 7830 -27522 -55198 -81056 -75006 -51817 -17325 -32282 -37326 -41374 -69451
13936 -69451 -22756 -7479 -165 -3527 -23298 -23951 3768 17432 4417 -3165 41851 38612 63672
13923 63672 45902 19825 -11771 -32641 -50617 -15514 12018 -12604 -1590 11115 3954 1929
$$ packed form
14010c4877L0135K1424K919K8682j4011m0679K3264K559m0536n0563k6206M7261
13998e0628K2873j8945j9929N0251N402r975R387M7258M4652L3950J303j8227
13986I7372l5834m1347n940o976M9570j6787m9919k3618K1233L9210q268k9843
13974a1147O021m664j6974L8770J5561l5649K6045K934P839R728J3638k2786n0953
13961b1637L7493J352n244K2126K4546k0835k9071k6854j6595Q920R056N074j7064
13948b8733J6525K0038l5352k7676k5858O050K3189L4492j4957n044m048k8077
13936f9451M6695J5277P314l362j9771o53K7719J3664j3015p582M5016l239K5060
13923F3672j7770k6077l1596k0870j7976L5103K7532k4622J1014J2705p161k025
$$ plain form
13911 1929 6431 -4777 17723 22007 5421 13764 15109 39011 71281 45165 15437 -12659 -23232
13898 -23232 -46386 -52781 -13935 -7155 -11608 -9336 -52232 -75278 -78109 -99773 -79473 -37733 -34589
13885 -34589 -87428 -80390 -46207 -32367 -25436 -24626 -14901 3054 27091 57129 59002 11975 -19937
13872 -19937 -11464 14679 8524 6848 32941 27659 24328 17966 4095 3530 24517 58016 59030
13859 59030 21987 20759 18188 5501 16759 16153 14190 -16400 17737 50711 60713 59731 9553
13846 9553 -7546 1900 4897 21132 35799 45707 41010 20890 2148 -26612 -41657 -20680 -5070
13833 -5070 -26120 -51229 -41527 -45763 -38866 -11655 21377 50788 34048 31856 32915 28860 13549
13820 13549 17953 23260 27345 48815 65183 61560 30894 10043 -9342 4681 28585 43187
$$ packed form
13911A929M502j1208K2500M284j6586Q343J345K3902L2270k6116k9728k8096j0573
13898b3232k3154o395L8846O780m453K272m2896k3046k831k1664K0300M1740L144
13885c4589n2839P038L4183J3840O931Q10R725J7955K4037L0038J873m7027l1912
13872a9937Q473K6143o155j676K6093n282l331o362j3871n65K0987L3499J014
13859E9030l7043j228k571j2687J1258o06j963l0590L4137L2974J0002r82n0178
13846I553j7099R446K997J6235J4667R908m697k0120j8742k8760j5045K0977J5610
13833e070k1050k5109R702m236O897K7211L3032K9411j6740k192J059m055j5311
13820A3549M404N307M085K1470J6368l623l0666k0851j9385J4023K3904J4602
$$ plain form
13808 43187 28603 5006 -16524 -1055 7143 294 11346 7639 8588 29879 -19581 -41657 -26533
13795 -26533 -20006 -15789 2696 14751 36924 46427 66236 80860 50194 53010 76930 72063 49929
13782 49929 32089 10672 8240 16896 -8669 -27932 -6764 -23408 -54703 -25177 6380 34393
13770 34393 22187 27493 54690 39289 27891 -7639 -18696 6658 20424 26508 16556 -1004
13758 -1004 -3457 14712 29973 52903 19050 -4647 25160 35616 12869 2703 12592 17748
13746 17748 38259 25909 -8196 26392 50946 41611 33089 14393 1811 37357 44087 14944
13734 14944 2802 -3703 6342 -6111 12603 30367 -12271 -33918 2243 1087 10911 24296
13722 24296 26496 421 18387 33402 3359 781 28246 44196 38618 40812 25280 23955 42983
$$ packed form
13808D3187j4584k3597k1530J5469Q198o849J1052l707R49K1291m9460k2076J5124
13795b6533O527M217J8485J2055K2173R503J9809J4624l0666K816K3920m867k2134
13782D9929j7840k1417k432Q656k5565j9263K1168j6644l1295K9526L1557K8013
13770C4393j2206N306K7197j5401j1398l5530j1057K5354J3766O084r952j7560
13758a004k453J8169J5261K2930l3853k3697K9807J0456k2747j0166R889N156
13746A7748K0511j2350l4105L4588K4554r335q522j8696j2582L5546O730k9143
13734A4944j2142o505J0045j2453J8714J7764m2638k1647L6161j156R824J3385
13722B4296K200k6075J7966J5015l0043k578K7465J5950n578K194j5532j325J9028
$$ plain form
13709 42983 68127 40746 46251 71883 84754 71207 33467 30933 23556 -38588 -38804 -32034 -20770
13696 -20770 3525 12800 56389 109359 89274 102378 114295 84753 20492 6351 54748 77803
13684 77803 74783 102990 98718 57702 46393 49985 34639 22343 56204 66711 51300 17600
13672 17600 19185 49423 19482 12198 7826 -7695 -5440 -17148 -48733 -68962 -49641 -1737
13660 -1737 9438 37313 50199 16904 -18209 19213 26009 4086 -21100 -1661 41193 33817
13648 33817 59152 57604 39045 11819 18819 51548 54941 39332 54361 39967 52113 19813
13636 19813 5231 22560 62811 69054 18995 -18563 -31782 -35869 24665 33359 32652 67914 109356
13623 109356 122254 115703 87513 46474 -10387 -44492 -33801 37916 55687 53072 80874 61505
$$ packed form
13709D2983K5144k7381N505K5632J2871j3547l7740k534p377o2144k16O770J1264
13696b0770K4295R275M3589N2970k0085J3104J1917k9542o4261j4141M8397K3055
13684G7803l020K8207m272m1016j1309L592j5346j2296L3861J0507j5411l3700
13672A7600J585L0238k9941p284m372j5521K255j1708l1585k0229J9321M7904
13660a737J1175K7875J2886l3295l5113L7422O796k1923k5186J9439M2854p376
13648C3817K5335j548j8559k7226P000L2729L393j5609J5029j4394J2146l2300
13636A9813j4582J7329M0251O243n0059l7558j3219m087O0534Q694p07L5262M1442
13623A09356J2898o551k8190m1039n6861l4105J0691P1717J7771k615K7802j9369
$$ plain form
13611 61505 87851 66639 15723 10562 1276 13804 37556 16906 -9738 -10893 -57047 -33990
13599 -33990 1661 30891 33595 41794 58325 69977 46293 41247 24567 8243 1465 -8486 -1876
13586 -1876 5774 32903 95296 114739 119884 84136 53684 54292 12452 -24571 -37415 -3797 25446
13573 25446 24833 50302 70292 54578 12881 20344 36964 22388 6351 48628 34377 -4205
13561 -4205 5201 33916 32270 39762 23629 42268 101938 117862 141221 161605 162464 159676 150606
13548 150606 143700 164123 159922 122096 80046 54667 65618 67812 74599 28817 13365 11874
13536 11874 6902 9133 -1057 5517 20577 16083 38972 52171 86641 82175 39524 18925 62115
13523 62115 76325 85041 60460 39899 49054 39864 8822 14085 43614 36573 2547 19334 65244
$$ packed form
13611F1505K6346k1212n0916n161r286J2528K3752k0650k6644j155m6154K3057
13599c3990L5651K9230K704Q199J6531J1652k3684n046j6680j6324o778r951O610
13586a876P650K7129O2393J9443N145l5748l0452O08m1840l7023j2844L3618K9243
13573B5446o13K5469J9990j5714m1697P463J6620j4576j6037M2277j4251l8582
13561d205R406K8715j646P492j6133J8639N9670J5924K3359K0384Q59k788r070
13548A50606o906K0423m201l7826m2050k5379J0951K194O787m5782j5452j491
13536A1874m972K231j0190O574J5060m494K2889J3199L4470m466m2651k0599M3190
13523F2115J4210Q716k4581k0561R155r190l1042N263K9529p041l4026J6787M5910
$$ plain form
13510 65244 87573 40917 25878 46549 66307 73344 100367 79782 32087 5181 39646 58006
13498 58006 44542 66447 77988 47559 78677 69350 34452 39001 40856 24784 -14164 -22701
13486 -22701 -14162 8577 25154 53834 71622 87721 98418 86071 49067 31575 18460 35222
13474 35222 60862 72266 76165 50986 62905 84829 53548 27458 24113 35146 86196 119351
13462 119351 103953 95121 113143 95817 134911 166015 172536 182018 151393 140141 122220 98309
13450 98309 93825 85252 101400 132396 157160 178727 173314 165212 123929 108493 128956 171105
13438 171105 156455 99554 101375 139198 159286 182957 148622 102188 84715 98308 104535 99391
13426 99391 111570 106129 114439 140984 151354 131826 130436 155255 156225 143850 118757 76627 106269
$$ packed form
13510F5244K2329m6656j5039K0671J9758P037K7023k0585m7695k6906L4465J8360
13498E8006j3464K1905J1541l0429L1118r327l4898M549J855j6072l8948q537
13486b2701Q539K2739J6577K8680J7788J6099J0697j2347l7004j7492j3115J6762
13474C5222K5640J1404L899k5179J1919K1924l1281k6090l345J1033N1050L3155
13462A19351j5398q832J8022j7326L9094L1104O521R482l0625j1252j7921k3911
13450I8309m484q573J6148L0996K4764K1567n413q102m1283j5436K0463M2149
13438A71105j4650n6901J821L7823K0088K3671l4335m6434j7473J3593O227n144
13426I9391J2179n441Q310K6545J0370j9528j390K4819R70j2375k5093m2130K9642
$$ plain form
13413 106269 107738 96124 108073 123389 147209 151323 134125 107518 65846 65424 80631 91321
13401 91321 93555 79810 64749 69049 84241 82834 88492 77862 93749 89444 110936 134715 164438
13388 164438 162263 158230 109359 64499 85333 135272 144376 106391 111431 116947 116364 106639 116876
13375 116876 120283 120274 98282 126756 108213 142165 149405 122586 122337 117305 133905 112522 117117
13362 117117 121594 152821 149741 138361 179562 120702 97645 120517 124731 142700 127529 123802
13350 123802 112002 83775 45609 46686 51418 75227 75321 61649 56132 48745 9062 1369 -22398
13337 -22398 2699 32211 64169 80587 56380 14227 48850 90965 99901 79565 47877 46559
13325 46559 68124 115814 69119 45819 57883 89432 59856 59026 73138 68093 86754 80554
$$ packed form
13413A06269J469j1614J1949J5316K3820M114j7198k6607m1672m22J5207J0690
13401I1321K234j3745j5061M300J5192j407N658j0630J5887m305K1492K3779K9723
13388A64438k175m033m8871m4860K0834M9939R104l7985N040N516n83r725J0237
13375A16876L407rk1992K8474j8543L3952P240k6819k49n032J6600k1383M595
13362A17117M477L1227l080j1380M1201n8860k3057K2872M214J7969j5171l727
13350A23802j1800k8227l8166J077M732K3809R4j3672n517p387l9683p693k3767
13337b2398K5097K9512L1958J6418k4207m2153L4623M2115Q936k0336l1688j318
13325D6559K1565M7690m6695k3300J2064L1549k9576q30J4112n045J8661o200
$$ plain form
13313 80554 73633 91830 114680 82192 54240 59413 83777 121478 122310 136724 128184 122163 136412
13300 136412 155448 126440 95045 32492 33721 93611 85071 95166 126864 127301 126608 83761 105648
13287 105648 100700 98200 126646 124500 144927 116888 167451 182104 181252 159858 146688 124665
13275 124665 107071 132625 134654 92079 101039 86714 50565 64142 62258 89736 132207 134692
13263 134692 108594 128130 140140 174587 169696 169580 189549 188309 145369 136635 161059 159672 117747
13250 117747 95647 122350 136797 138654 132781 145399 131782 143650 159192 133031 150098 182586
13238 182586 206533 218335 260887 263493 261214 249902 264195 332968 376145 384517 409327 468608
13226 468608 526072 538359 547437 577948 610796 618716 634003 678980 694076 736901 796777 838825
$$ packed form
13313H0554o921J8197K2850l2488k7952N173K4364L7701Q32J4414q540o021J4249
13300A36412J9036k9008l1395o2553J229N9890q540J0095L1698M37o93m2847K1887
13287A05648m948k500K8446k146K0427k8039N0563J4653q52k1394j3170k2023
13275A24665j7594K5554K029m2575Q960j4325l6149J3577j884K7478M2471K485
13263A34692k6098J9536J2010L4447m891j16J9969j240m2940q734K4424j387m1925
13250A17747k2100K6703J4447J857n873J2618j3617J1868J5542k6161J7067L2488
13238A82586K3947J1802M2552K606k279j1312J4293O8773M3177Q372K4810N9281
13226D68608N7464J2287R078L0511L2848P920J5287M4977J5096M2825N9876M2048
$$ plain form
13214 838825 865114 867347 908624 929135 955255 969502 973318 962096 962003 944810 947654 971899 973358
13201 973358 966386 999950 999860 1025801 1000961 1016406 1011201 939901 898848 887721 871257 836355
13189 836355 782378 726556 673012 656289 646740 606364 567073 582180 558540 542952 514746 514142
13177 514142 514169 458429 420628 452191 478030 421696 377880 403296 427635 426334 424153 376855
13165 376855 346895 316004 293850 249159 238697 273920 326015 323569 272657 266695 294411 312836
13153 312836 280863 267786 277316 301541 271686 230478 223683 258185 314009 334294 294976 274183
13141 274183 264137 267890 282126 303319 275672 229492 240563 243161 247463 230358 205003 224280
13129 224280 255138 236386 251806 262754 253884 192596 194164 210678 224011 214802 233628 225819
$$ packed form
13214H38825K6289K233M1277K0511K6120J4247L816j1222r3j7193K844K4245J459
13201I73358o972L3564r0K5941k4840J5445n205p1300m1053j1127j6464l4902
13189H36355n3977n5822n3544j6723r549m0376l9291J5107k3640j5588k8206o04
13177E14142K7n5740l7801L1563K5839n6334m3816K5416K4339j301k181m7298
13165C76855k9960l0891k2154m4691j0462L5223N2095k446n0912n962K7716J8425
13153C12836l1973j3077R530K4225k9855m1208o795L4502N5824K0285l9318k0793
13141B74183j0046L753J4236K1193k7647m6180J1071K598M302j7105k5355J9277
13129B24280L0858j8752J5420J0948q870o1288J568J6514J3333r209J8826p809
$$ plain form
13117 225819 190863 190566 240615 234340 230298 259921 224780 214166 205268 195171 202545 200307 181789
13104 181789 206344 230511 228941 238465 233927 226690 196262 207294 181766 135465 137927 179571
13092 179571 209166 200363 235954 286883 270255 235067 274161 284434 275687 260993 207034 193762
13080 193762 209711 213038 251437 189755 170732 226663 252367 225139 191197 227708 244407 240690
13068 240690 250921 300004 309959 256868 251454 260891 263812 245045 227291 220795 198489 163261
13056 163261 185825 188747 212300 229959 254545 301424 306647 299566 266936 245472 274916 268277
13044 268277 241098 239528 260957 264809 232844 283003 321471 317352 307693 298808 347195 357314
13032 357314 337866 341527 328940 334699 320012 348764 342560 358272 405408 433755 423203 416611
$$ packed form
13117B25819l4956k97N0049o275m042K9623l5141j0614q898j0097P374k238j8518
13104A81789K4555K4167j570R524m538p237l0428J1032k5528m6301K462M1644
13092A79571K9595q803L5591N0929j6628l5188L9094J0273q747j4694n3959j3272
13080A93762J5949L327L8399o1682j9023N5931K5704k7228l3942L6511J6699l717
13068B40690J0231M9083R955n3091n414R437K921j8767j7754o496k2306l5228
13056A63261K2564K922K3553J7659K4586M6879N223p081l2630k1464K9444o639
13044B68277k7179j570K1429L852l1965N0159L8468m119r659q885M8387J0119
13032C57314j9448L661j2587N759j4687K8752o204J5712M7136K8347j0552o592
$$ plain form
13020 416611 424294 473342 464813 465664 495275 530659 507926 503451 522717 557890 558703 565030 551470
13007 551470 568405 574336 600543 618242 611337 623531 639220 631626 612580 590082 590799 632607
12995 632607 625710 595958 569113 584295 570385 567374 564973 579909 608780 566924 568711 587285
12983 587285 536145 551644 551222 486285 458850 462898 434197 428788 445599 450403 472430 471471 493846
12970 493846 503555 470755 451231 431270 432415 459768 445061 436024 419554 440198 427834 426228
12958 426228 402945 385973 422415 460373 457382 443040 437706 395410 399642 424009 473770 461645
12946 461645 439451 446448 427092 413368 411218 412306 406967 434964 463267 515173 523635 550000
12934 550000 581928 563084 504644 548422 575497 579659 589028 553717 518116 518962 507935 527757
$$ packed form
13020D16611P683M9048q529Q51K9611L5384k2733m475J9266L5173Q13O327j3560
13007E51470J6935N931K6207J7699o905J2194J5689p594j9046k2498P17M1808
12995F32607o897k9752k6845J5182j3910l011k401J4936K8871m1856J787J8574
12983E87285n1140J5499m22o4937k7435M048k8701n409J6811M804K2027r59K2375
12970D93846R709l2800j9524j9961J145K7353j4707r037j6470K0644j2364j606
12958D26228k3283j6972L6442L7958k991j4342n334m2296M232K4367M9761j2125
12946D61645k2194O997j9356j3724k150J088n339K7997K8303N1906Q462K6365
12934E50000L1928j8844n8440M3778K7075M162R369l5311l5601Q46j1027J9822
$$ plain form
12922 527757 581069 570508 552324 564954 542512 544246 533994 495341 478941 461785 435361 422457
12910 422457 478627 496856 489414 444043 432712 470376 510923 535427 545088 534830 526454 536113
12898 536113 522774 535619 573096 551358 542593 556327 544367 545436 556754 573147 568999 567067
12886 567067 583602 574340 574473 567345 555224 562208 603686 620023 620961 635720 613502 598263 596552
12873 596552 604558 575852 572369 589623 607414 604680 606196 637340 656268 586894 546004 553047
12861 553047 541050 533353 568460 568376 535951 543463 559455 570228 596648 573123 511868 494857
12849 494857 517114 517899 544259 562879 565740 568702 563147 557978 568481 563457 568414 593700 623810
12836 623810 579022 515110 491688 535750 584954 630012 644742 566509 524970 572823 596442
$$ packed form
12922E27757N3312j0561j8184J2630k2442J734j0252l8653j6400j7156k6424j2904
12910D22457N6170J8229p442m5371j1331L7664M0547K4504R661j0258q376R659
12898E36113j3339J2845L7477k1738q765J3734j1960J069J1318J6393m148j932
12886E67067J6535r262J33p128j2121O984M1478J6337R38J4759k2218j5239j711
12873E96552Q006k8706l483J7254J7791k734J516L1144J8928o9374m0890P043
12861E53047j1997p697L5107q4l2425P512J5992J0773K6420k3525o1255j7011
12849D94857K2257P85K6360J8620K861K962n555n169J0503n024M957K5286L0110
12836F23810m4788o3912k3422M4062M9204M5058J4730p8233m1539M7853K3619
$$ plain form
12825 596442 597984 603706 601594 618936 596961 551268 560594 619528 641794 636071 652103 629340
12813 629340 618961 622356 595088 571281 586860 609819 635721 645667 648383 665073 668457 676739
12801 676739 683957 708836 698341 676948 654092 703048 723985 683779 643050 647389 655830 682378
12789 682378 678763 686750 709762 712655 683963 665352 664817 689895 697965 714736 737056 747235 743714
12776 743714 798902 845278 862112 881276 858154 836802 806575 803850 834919 817177 797833 818856
12764 818856 805555 771899 765944 774010 783180 787451 805111 832777 846663 845164 816036 809391 828829
12751 828829 856386 894615 943654 946395 983957 999344 973412 972688 960138 986570 1041200 1047452
12739 1047452 1030379 1007892 1035042 1043218 1040847 1064969 1066632 1074434 1115470 1117033 1096838 1147354
$$ packed form
12825E96442J542N722k112J7342k1975m5693R326N8934K2266n723J6032k2763
12813F29340j0379L395k7268k3807J5579K2959K5902R946K716J6690L384Q282
12801F76739P218K4879j0495k1393k2856M8956K0937m0206m0729M339Q441K6548
12789F82378l615P987K3012K893k8692j8611n35K5078Q070J6771K2320J0179l521
12776G43714N5188M6376J6834J9164k3122k1352l0227k725L1069j7742j9344K1023
12764H18856j3301l3656n955Q066R170M271J7660K7666J3886j499k9128o645J9438
12751H28829K7557L8229M9039K741L7562J5387k5932p24j2550K6432N4630O252
12739A047452j7073k2487K7150Q176k371K4122J663P802M1036J563k0195N0516
$$ plain form
12727 1147354 1193305 1182995 1153489 1153250 1229215 1294503 1299600 1306430 1295591 1292614 1303339 1331620
12715 1331620 1350816 1371564 1389817 1418551 1443885 1440929 1434415 1466908 1482212 1445944 1465982 1479011
12703 1479011 1438039 1399768 1433265 1475040 1515315 1452267 1457764 1470601 1445748 1450591 1468340 1451290
12691 1451290 1469234 1500763 1508238 1509315 1521090 1528185 1532465 1569902 1637389 1650543 1578800 1521444
12679 1521444 1505805 1562368 1617841 1627494 1668195 1677972 1664896 1709072 1747603 1739095 1735117 1738759
12667 1738759 1760995 1818213 1810783 1835004 1857990 1891207 1905003 1882243 1922236 1930680 1927608 1939984
12655 1939984 1985065 1994226 1988169 2025293 2025020 2045531 2104611 2150215 2158353 2130429 2139409 2149720
12643 2149720 2153012 2188590 2218369 2243958 2251208 2296426 2324663 2372080 2368559 2349295 2378803 2443660
$$ packed form
12727A147354M5951j0310k9506k39P5965O5288N097O830j0839k977J0725K8281
12715A331620J9196K0748J8253K8734K5334k956o514L2493J5304l6268K0038J3029
12703A479011m0972l8271L3497M1775M0275o3048N497J2837k4853M843J7749j7050
12691A451290J7944L1529P475J077J1775P095M280L7437O7487J3154p1743n7356
12679A521444j5639N6563N5473R653M0701R777j3076M4176L8531q508l978L642
12667A738759K2236N7218p430K4221K2986L3217J3796k2760L9993Q444l072J2376
12655A939984M5081R161o057L7124k73K0511N9080M5604Q138k7924Q980J0311
12643B149720L292L5578K9779K5589P250M5218K8237M7417l521j9264K9508O4857
$$ plain form
12631 2443660 2459771 2485310 2493065 2541115 2587471 2632282 2649632 2679057 2758184 2779047 2746015
12620 2746015 2794734 2822609 2862226 2930567 2952175 2999460 3008037 3030646 3090983 3143580 3216355
12609 3216355 3254106 3308261 3351002 3381498 3420695 3443134 3488174 3539939 3565094 3593673 3666798
12598 3666798 3738682 3782968 3820891 3894025 3946001 4007632 4057754 4092140 4153047 4202708 4272569
12587 4272569 4301397 4361371 4437019 4482200 4546279 4643137 4715404 4794365 4851425 4906531 5006239
12576 5006239 5083626 5129472 5225742 5337863 5424729 5511470 5581264 5669540 5793030 5889990 6003494
12565 6003494 6127215 6259820 6393757 6517616 6605826 6684002 6806498 6935577 7082245 7219772
12555 7219772 7331795 7462422 7603915 7731806 7807068 7954228 8109257 8293728 8432737 8584766
$$ packed form
12631B443660J6111K5539P755M8050M6356M4811J7350K9425P9127K0863l3032
12620B746015M8719K7875L9617O8341K1608M7285Q577K2609O0337N2597P2775
12609C216355L7751N4155M2741L0496L9197K2439M5040N1765K5155K8579P3125
12598C666798P1884M4286L7923P3134N1976O1631N0122L4386O0907M9661O9861
12587D272569K8828N9974P5648M5181O4079R6858P2267P8961N7060N5106R9708
12576E006239P7387M5846R6270J12121Q6866Q6741O9794Q8276J23490R6960J13504
12565F003494J23721J32605J33937J23859Q8210P8176J22496J29079J46668J37527
12555G219772J12023J30627J41493J27891P5262J47160J55029J84471J39009J52029
$$ plain form
12545 8584766 8717807 8891565 9096137 9325511 9532156 9736036 9930182 10137747 10368116
12536 10368116 10638684 10867132 11082537 11326786 11590039 11827665 12103694 12383807 12656826
12527 12656826 12959485 13269465 13614001 13933821 14272568 14650608 14968164 15336802 15722889
12518 15722889 16151356 16583457 17007594 17418685 17868098 18334588 18866674 19416763 19941650
12509 19941650 20492835 21039029 21585377 22168756 22798252 23474328 24129969 24826294 25539548
12500 25539548 26250458 26959362 27700807 28502141 29321667 30118757 30977238 31890503 32797960
12491 32797960 33700662 34623789 35617566 36582659 37527312 38503172 39515694 40507906 41497508
12482 41497508 42494543 43495874 44512756 45504547 46463193 47394977 48322990 49207713 50097477
$$ packed form
12545H584766J33041J73758K04572K29374K06645K03880J94146K07565K30369
12536A0368116K70568K28448K15405K44249K63253K37626K76029K80113K73019
12527A2656826L02659L09980L44536L19820L38747L78040L17556L68638L86087
12518A5722889M28467M32101M24137M11091M49413M66490N32086N50089N24887
12509A9941650N51185N46194N46348N83379O29496O76076O55641O96325P13254
12500B5539548P10910P08904P41445Q01334Q19526P97090Q58481R13265R07457
12491C2797960R02702R23127R93777R65093R44653R75860J012522R92212R89602
12482D1497508R97035J001331J016882R91791R58646R31784R28013Q84723Q89764
$$ plain form
12473 50097477 50903960 51623448 52339035 53024765 53639021 54159789 54615092 55058064 55399604
12464 55399604 55620017 55799055 55908201 55939527 55901082 55768708 55554679 55325396 55078639 54738466
12454 54738466 54274001 53785227 53250975 52668087 51988585 51331611 50666819 49948528 49201523
12445 49201523 48423548 47609888 46794479 46004624 45211759 44408533 43582083 42734655 41908375
12436 41908375 41068331 40257027 39491332 38718331 37985664 37202610 36402532 35653530 34922445
12427 34922445 34216254 33517690 32770524 32083719 31440107 30789423 30130008 29515583 28917383
12418 28917383 28282166 27739141 27151816 26547498 25965229 25462453 24946134 24421284 23914873
12409 23914873 23443058 22976123 22514827 22045622 21609057 21204773 20779857 20356975 19909300
$$ packed form
12473E0097477Q06483P19488P15587O85730O14256N20768M55303M42972L41540
12464E5399604K20413J79038J09146L1326l8445j32374k14029k29283k46757l40173
12454E4738466m64465m88774n34252n82888o79502o56974o64792p18291p47005
12445D9201523p77975q13660q15409p89855p92865q03226q26450q47428q26280
12436D1908375q40044q11304p65695p73001p32667p83054q00078p49002p31085
12427C4922445p06191o98564p47166o86805o43612o50684o59415o14425n98200
12418B8917383o35217n43025n87325o04318n82269n02776n16319n24850n06411
12409B3914873m71815m66935m61296m69205m36565m04284m24916m22882m47675
$$ plain form
12400 19909300 19483247 19098427 18725809 18351485 17958458 17609446 17282414 16960088 16648076
12391 16648076 16358759 16043640 15752863 15423094 15107659 14826967 14581905 14291732 14024889
12382 14024889 13748520 13508535 13270232 13013813 12755226 12553098 12312187 12035997 11786304
12373 11786304 11559259 11378206 11189657 10981108 10780964 10592827 10434057 10230632 10057864
12364 10057864 9890976 9693309 9513419 9353951 9184259 9023519 8833317 8698848 8562239
12355 8562239 8411198 8265606 8135406 8004073 7841792 7691065 7571735 7472596 7359432 7222237
12345 7222237 7135669 7008721 6882471 6748611 6665599 6576916 6457050 6346478 6239513 6118624
12335 6118624 5973707 5880051 5802292 5754795 5665935 5571576 5469801 5354892 5275465 5198932 5145323
$$ packed form
12400A9909300m26053l84820l72618l74324l93027l49012l27032l22326l12012
12391A6648076k89317l15119k90777l29769l15435k80692k45062k90173k66843
12382A4024889k76369k39985k38303k56419k58587k02128k40911k76190k49693
12373A1786304k27045j81053j88549k08549k00144j88137j58770k03425j72768
12364A0057864j66888j97667j79890j59468j69692j60740j90202j34469j36609
12355H562239j51041j45592j30200j31333j62281j50727j19330r9139j13164j37195
12345G222237q6568j26948j26250j33860q3012q8683j19866j10572j06965j20889
12335F118624j44917r3656p7759m7497q8860r4359j01775j14909p9427p6533n3609
$$ plain form
12324 5145323 5099675 5053591 4985475 4883718 4790710 4724467 4645554 4566079 4491985 4438360 4377431
12313 4377431 4304201 4208090 4159354 4095643 4090476 4053473 3993894 3925376 3866592 3834299 3801056
12302 3801056 3772539 3722055 3654663 3592880 3550175 3541956 3520865 3487109 3473913 3397486 3307510
12291 3307510 3215883 3199127 3179306 3160067 3104339 3053642 3051230 3025920 3001623 2941969 2949256 2936321
12279 2936321 2851231 2788402 2770192 2756238 2698055 2650357 2657318 2695027 2663679 2594909 2593637 2585141
12267 2585141 2582397 2556269 2520755 2502752 2492766 2457519 2475550 2434804 2360847 2301905 2278011 2260120
12255 2260120 2240739 2216813 2181847 2161562 2165333 2141655 2110255 2066994 2036905 2026376 2015919
12244 2015919 2037597 2039298 1983562 1979743 1984089 1959765 1945620 1944792 1955594 1940059 1888988 1872665
$$ packed form
12324E145323m5648m6084o8116j01757r3008o6243p8913p9475p4094n3625o0929
12313D377431p3230r6111m8736o3711n167l7003n9579o8518n8784l2293l3243
12302C801056k8517n0484o7392o1783m2705q219k1091l3756j3196p6427q9976
12291C307510r1627j6756j9821j9239n5728n0697k412k5310k4297n9654P287j2935
12279B936321q5090o2829j8210j3954n8183m7698O961L7709l1348o8770j272q496
12267B585141k744k6128l5514j8003r986l5247J8031m0746p3957n8942k3894j7891
12255B260120j9381k3926l4966k0285L771k3678l1400m3261l0089j0529j0457
12244B015919K1678J701n5736l819M346k4324j4145q28J0802j5535n1071j6323
$$ plain form
12232 1872665 1897473 1889542 1859781 1810499 1790423 1831552 1820152 1770350 1766348 1772913 1782874 1743798
12220 1743798 1719827 1724692 1746327 1792238 1816374 1843421 1822426 1801112 1804632 1793820 1767382 1736486
12208 1736486 1675615 1632075 1630064 1639567 1663100 1647393 1588564 1549736 1517092 1486959 1490465 1477412
12196 1477412 1469810 1487849 1481869 1414840 1325897 1317886 1345970 1319748 1323647 1336787 1332639 1308644
12184 1308644 1291993 1308184 1283199 1252008 1230123 1221906 1196551 1158693 1143522 1160274 1158270 1158251
12172 1158251 1163949 1179495 1193532 1161093 1117029 1087336 1084169 1055691 1029597 1003209 1022192 997777
12160 997777 981521 936455 933737 919054 898913 906471 916394 904709 911849 923325 902309 864965
12148 864965 869640 923809 927723 881464 861970 858416 851075 838021 854320 893424 860475 846104
$$ packed form
12232A872665K4808p931k9761m9282k0076M1129j1400m9802m002O565R961l9076
12220A743798k3971M865K1635M5911K4136K7047k0995k1314L520j0812k6438l0896
12208A736486o0871m3540k011R503K3533j5707n8829l8828l2644l0133L506j3053
12196A477412p602J8039n980o7029q8943q011K8084k6222L899J3140m148k3995
12184A308644j6651J6191k4985l1191k1885q217k5355l7858j5171J6752k004j9
12172A158251N698J5546J4037l2439m4064k9693l167k8478k6094k6388J8983k4415
12160I97777j6256m5066k718j4683k0141P558R923j1685P140J1476k1016l7344
12148H64965M675N4169L914m6259j9494l554p341j3054J6299L9104l2949j4371
$$ plain form
12136 846104 829361 764974 767348 800902 803931 795400 797439 824086 855248 853183 844413 831391 832081
12123 832081 801873 803130 823753 822445 776121 750882 769916 752829 718433 699728 699046 700453
12111 700453 660234 708921 729525 671659 610814 621734 639276 643587 641766 643330 668684 651995
12099 651995 616747 577036 585889 617818 629735 599503 566106 543418 517971 533853 557977 595851
12087 595851 586499 534541 531681 599240 599178 572293 563360 581404 565228 550110 539623 572953 576305
12074 576305 552704 543603 561755 541503 557349 560125 516510 542966 572751 548469 507272 518307
12062 518307 560362 580408 569149 540146 535803 527199 522560 521541 490504 480198 478584 472904 501206
12049 501206 479372 461133 484711 483679 486919 469469 475497 490007 503127 474974 475898 481961 490732
$$ packed form
12136H46104j6743o4387K374L3554L029q531K039K6647L1162k065q770j3022O90
12123H32081l0208J257K0623j308m6324k5239J9034j7087l4396j8705o82J407
12111G00453m0219M8687K0604n7866o0845J0920J7542M311j821J564K5354j6689
12099F51995l5248l9711Q853L1929J1917l0232l3397k2688k5447J5882K4124L7874
12087E95851r352n1958k860O7559o2k6885q933J8044j6176j5118j0487L3330L352
12074E76305k3601r101J8152k0252J5846K776m3615K6456K9785k4282m1197J1035
12062E18307M2055K0046j1259k9003m343q604m639j019l1037j0306j614n680K8302
12049E01206k1834j8239K3578j032L240j7450O028J4510J3120k8153R24O063Q771
$$ plain form
12036 490732 468503 442367 477796 501339 490121 502012 469823 417418 440885 451549 429249
12025 429249 396028 418129 420929 430238 414038 410554 425330 437816 474618 474569 478880 472132 455606
12012 455606 464544 431390 390807 379631 363521 373373 384924 384395 416973 429177 386116 380582
12000 380582 414302 407128 383451 395296 393092 399098 399059 395707 417475 388761 386819 419940 402146
11987 402146 367358 346321 326153 356427 360456 366233 377938 356718 376508 348889 344666 316626
11975 316626 280320 276184 301197 310661 339597 382397 411453 400062 362595 325481 285669 265153
11963 265153 260289 294917 289157 256216 262408 274268 267102 266888 284575 276655 264747 245502 268179
11950 268179 288419 276215 274122 303502 336798 331198 293762 293088 277674 277350 254154 242269 253259
$$ packed form
12036D90732k2229k6136L5429K3543j1218J1891l2189n2405K3467J0664k2300
12025D29249l3221K2101K800R309j6200l484J4776J2486L6802m9M311o748j6526
12012D55606Q938l3154m0583j1176j6110R852J1551n29L2578J2204m3061n534
12000C80582L3720p174k3677J1845k204O006l9l352K1768k8714j942L3121j7794
11987D02146l4788k1037k0168L0274M029N777J1705k1220J9790k7619m223k8040
11975C16626l6306m136K5013R464K8936M2800K9056j1391l7467l7114l9812k0516
11963B65153m864L4628n760l2941O192J1860p166k14J7687p920j1908j9245K2677
11950B68179K0240j2204k093K9380L3296n600l7436o74j5414l24k3196j1885J0990
$$ plain form
11937 253259 283408 278604 250074 248037 237425 252677 270952 250087 232881 216432 240321 249311
11925 249311 259279 280412 294782 302339 307493 286787 277828 265797 224176 187360 170917 176181
11913 176181 224075 247116 258886 279133 254866 253012 242998 258592 289354 280777 261075 277293
11901 277293 258435 247301 269160 317623 325922 288160 290832 257314 227725 225892 227658 240036
11889 240036 234466 213678 168817 191098 236586 264183 248258 215136 213177 266895 292548 268543
11877 268543 226777 190536 197255 214983 180371 167215 191419 214314 239954 276193 294968 261247
11865 261247 256636 274000 270255 270519 276994 247691 221808 195070 179671 193336 183068 211115
11853 211115 180744 162198 185187 184888 199839 225640 230017 227937 250605 224947 213349 221631
$$ packed form
11937B53259L0149m804k8530k037j0612J5252J8275k0865j7206j6449K3889Q990
11925B49311R968K1133J4370P557N154k0706q959j2031m1621l6816j6443N264
11913A76181M7894K3041J1770K0247k4267j854j0014J5594L0762q577j9702J6218
11901B77293j8858j1134K1859M8463Q299l7762K672l3518k9589j833J766J2378
11889B40036n570k0788m4861K2281M5488K7597j5925l3122j959N3718K5653k4005
11877B68543m1766l6241O719J7728l4612j3156K4204K2895K5640L6239J8775l3721
11865B61247m611J7364l745K64O475k9303k5883k6738j5399J3665j0268K8047
11853B11115l0371j8546K2989k99J4951K5801M377k080K2668k5658j1598Q282
$$ plain form
11841 221631 176205 159816 203962 177733 160587 198878 200070 194964 196369 217708 223730 180240
11829 180240 163272 150879 140344 132350 169336 207454 196657 166725 171061 226612 230593 243728
11817 243728 233744 194738 201099 225379 241044 244984 226295 186410 140705 139181 140038 149264 164683
11804 164683 178715 141473 122997 138701 157804 137855 116146 120850 153816 178519 163239 126573
11792 126573 119547 118316 102091 85265 143019 166768 130887 108045 143566 139183 119910 109061
11780 109061 172284 221672 168968 146494 177222 190572 160961 142366 114091 131205 154998
11769 154998 163533 151277 162399 137282 134910 141202 165423 173757 164606 132639 120950 149128
11757 149128 141094 174179 200362 214416 207044 238669 201274 194974 198946 168582 169243 162099 128473
$$ packed form
11841B21631m5426j6389M4146k6229j7146L8291J192n106J405K1339O022m3490
11829A80240j6968j2393j0535p994L6986L8118j0797k9932M336N5551L981J3135
11817B43728r984l9006O361K4280J5665L940j8689l9885m5705j524Q57R226J5419
11804A64683J4032l7242j8476J5704J9103j9949k1709M704L2966K4703j5280l6666
11792A26573p026j231j6225j6826N7754K3749l5881k2842L5521m383j9273j0849
11780A09061O3223M9388n2704k2474L0728J3350k9611j8595k8275J7114K3793
11769A54998Q535j2256J1122k5117k372O292K4221Q334r151l1967j1689K8178
11757A49128q034L3085K6183J4054p372L1625l7395o300L972l0364O61p144l3626
$$ plain form
11744 128473 127723 153709 181995 183973 169550 148959 173392 152703 141308 127971 110185 101152
11732 101152 117429 135002 128805 124292 119233 94960 101919 152838 156802 153523 160343 144084 140491
11719 140491 157990 179482 179282 158767 109039 109882 95382 104948 108310 103098 113067 92135 88267
11706 88267 107975 104852 98846 91530 111896 95820 66533 71165 89121 62433 79581 135915
11694 135915 143383 165642 166300 167154 154957 141328 134242 137471 120752 94629 132991 159311 159893
11681 159893 183172 154655 126436 145199 144943 139946 125617 123643 138897 153958 132810 71879
11669 71879 61532 79380 41726 53469 89998 84631 97216 97752 106121 106036 123025 131191 125802
11656 125802 89414 101883 80859 60417 32462 90296 147052 164804 136183 109318 124051
$$ packed form
11744A28473p50K5986K8286J978j4423k0591K4433k0689j1395j3337j7786r033
11732A01152J6277J7573o197m513n059k4273O959N0919L964l279O820j6259l593
11719A40491J7499K1492k00k0515m9728Q43j4500R566L362n212R969k0932l868
11706H8267J9708l123o006p316K0366j6076k9287M632J7956k6688J7148N6334
11694A35915P468K2259O58Q54j2197j3629p086L229j6719k6123L8362K6320N82
11681A59893K3279k8517k8219J8763k56m997j4329j974J5254J5061k1148o0931
11669G1879j0347J7848l7654J1743L6529n367J2585N36Q369q5J6989Q166n389
11656A25802l6388J2469k1024k0442k7955N7834N6756J7752k8621k6865J4733
$$ plain form
11645 124051 86890 71102 103019 123837 95980 110741 87107 35389 28461 72073 113176 144249
11633 144249 114640 79753 90323 105748 140517 124289 112261 147757 121876 64067 84299
11622 84299 101729 79789 59195 67724 88820 63891 68200 95651 88411 69321 62391 58993 51345
11609 51345 94000 82900 77276 59597 46622 52013 29420 18134 8274 49893 44146 63718
11597 63718 60395 92646 124686 95745 71903 95434 75754 47536 14657 12944 27003 42991
11585 42991 18815 18997 9752 -18247 12553 37115 81540 93815 92521 74505 60644 11297
11573 11297 -14715 12149 38209 21298 22045 35314 7831 3752 2786 -11826 3192 -15252 -3620
11560 -3620 32527 41170 62992 83470 74740 56504 32625 36098 68861 80709 43391 -9922
$$ packed form
11645A24051l7161j5788L1917K0818k7857J4761k3634n1718o928M3612M1103L1073
11633A44249k9609l4887J0570J5425L4769j6228j2028L5496k5881n7809K0232
11622H4299J7430k1940k0594Q529K1096k4929M309K7451p240j9090o930l398p648
11609E1345M2655j1100n624j7679j2975N391k2593j1286r860M1619n747J9572
11597F3718l323L2251L2040k8941k3842K3531j9680k8218l2879j713J4059J5988
11585D2991k4176J82r245k7999L0800K4562M4425J2275j294j8016j3861m9347
11573A1297k6012K6864K6060j6911P47J3269k7483m079r66j4612J5018j8444J1632
11560c620L6147Q643K1822K0478q730j8236k3879L473L2763J1848l7318n3313
$$ plain form
11548 -9922 15222 53209 60132 42494 66348 88912 75897 56731 76722 119607 107202 77011
11536 77011 41087 7405 15848 46843 72925 39918 35085 43684 47018 42152 5505 -5221 10657
11523 10657 18594 -6387 -17390 7077 26814 57012 56680 61509 90039 87303 122754 119087 149825
11510 149825 153464 123800 77407 42065 16661 18676 32053 5106 -1556 24304 40369 44466
11498 44466 26992 13201 -20226 -3335 55752 24660 -32444 -31505 -7886 -5429 16999 42206
11486 42206 30542 44490 85643 97572 98884 47422 14453 57802 58025 45364 56481 52590
11474 52590 41767 51481 17667 -1805 -3051 14227 5888 14883 34113 32095 31197 63722 50223
11461 50223 77013 111843 99716 89930 58591 79211 73785 18099 -3846 35219 89493 93910
$$ packed form
11548i922K5144L7987O923j7638K3854K2564j3015j9166J9991M2885j2405l0191
11536G7011l5924l3682Q443L0995K6082l3007m833Q599L334m866l6647j0726J5878
11523A0657P937k4981j1003K4467J9737L0198l32M829K8530k736L5451l667L0738
11510A49825L639k9664m6393l5342k5404K015J3377k6947o662K5860J6065M097
11498D4466j7474j3791l3427J6891N9087l1092n7104R39K3619K457K2428K5207
11486D2206j1664J3948M1153J1929J312n1462l2969M3349K23j2661J1117l891
11474E2590j0823R714l3814j9472j246J7278q339Q995J9230k018q98L2525j3499
11461E0223K6790L4830j2127r786l1339K0620n426n5686k1945L9065N4274M417
$$ plain form
11449 93910 67412 28325 16565 25780 -14158 -45661 -27599 27635 35962 38764 31489 -1278
11437 -1278 -5932 -1061 14821 70065 89179 93964 95708 79848 79061 62192 59662 61433 53157 40262
11423 40262 25808 64575 85567 38896 32737 75051 51231 51138 97952 95528 92015 77408 73600
11410 73600 64276 39557 15403 25585 38757 45037 65615 47534 28687 28270 -7227 -26218
11398 -26218 -15662 12610 6681 10327 10134 -5266 -9380 9730 49933 72580 93833 50169 26633
11385 26633 13964 48995 21722 9052 13241 28434 19159 30238 40687 76742 51706 23062
11373 23062 -30931 -4929 30348 13221 -11763 2150 -844 35907 27107 11746 32482 5196
11361 5196 -35744 -26534 -15123 45336 72311 68661 55008 64080 84379 108088 98436 81359 18318
$$ packed form
11449I3910k6498l9087j1760R215l9938l1503J8062N5234Q327K802p275l2767
11437a278m654M871J5882N5244J9114M785J744j5860p87j6869k530J771q276j2895
11423D0262j4454L8767K0992m6671o159M2314k3820r3M6814k424l513j4607l808
11410G3600r324k4719k4154J0182J3172O280K0578j8081j8847m17l5497j8991
11398b6218J0556K8272n929L646j93j5400m114J9110M0203K2647K1253m3664k3536
11385B6633j2669L5031k7273j2670M189J5193r275J1079J0449L6055k5036k8644
11373B3062n3993K6002L5277j7127k4984J3913k994L6751q800j5361K0736k7286
11361E196m0940R210J1411O0459K6975l650j3653R072K0299K3709r652j7077o3041
$$ plain form
11348 18318 -9046 21481 8731 -16359 2209 16857 29703 16429 38529 108579 90829 87296
11336 87296 47868 -7025 -3840 30355 47623 21124 11356 25483 71882 83214 54226 30761
11324 30761 21655 21235 47626 61427 38151 35990 49014 49345 49082 56989 49205 12898 -30403 -29577
11310 -29577 -15474 -16896 -8330 31467 46 -3838 27549 48061 67042 79145 60735 42637
11298 42637 28864 31665 51883 44585 38205 31385 -14930 -8866 16108 46243 66465 39687 29848
11285 29848 69417 92964 51283 33685 -5385 882 18516 2240 8739 10438 -10019 -40102
11273 -40102 -12092 224 27808 18638 18600 25490 43569 56821 64577 44211 23420 28729 25059
11260 25059 17331 770 -14348 33337 74041 37252 15026 848 24119 28475 25917 43988
$$ packed form
11348A8318k7364L0527j2750k5090J8568J4648J2846j3274K2100P0050j7750l533
11336H7296l9428n4893L185L4195J7268k6499r768J4127M6399J1332k8988k3465
11324C0761r106m20K6391J3801k3276k161J3024L31k63P907p784l6307m3301Q26
11310b9577J4103j422Q566L9797l1421l884L1387K0512J8981J2103j8410j8098
11298D2637j3773K801K0218p298o380o820m6315O064K4974L0135K0222k6778r839
11285B9848L9569K3547m1681j7598l9070O267J7634j6276O499J699k0457l0083
11273d0102K8010J2316K7584r170l8O890J8079J3252P756k0366k0791N309l670
11260B5059p728j6561j5118M7685M0704l6789k2226j4178K3271M356k558J8071
$$ plain form
11248 43988 57792 49831 41399 36400 45335 57615 67056 34750 55968 70086 69487 51815 46874
11235 46874 20370 31055 47275 40915 44665 64227 78206 87959 23404 -7310 -4161 -42185
11223 -42185 -74434 -111022 -77655 -33283 -10283 6570 3699 14575 41754 48379 25043 6145
11211 6145 -9010 1155 -24838 -11790 41460 67102 94193 126345 125822 75654 74441 54691
11199 54691 48133 27158 2898 5779 20726 39902 30980 1568 44381 40953 41255 61221 54818
11186 54818 45967 57776 45626 61892 36178 41590 52457 58864 57669 24888 -5830 -24435
11174 -24435 -18051 -27672 -25685 -39136 -33132 3047 27748 22193 -375 -3621 10940 23812 44337
11161 44337 39844 18951 55732 73370 47603 4019 -55657 -62970 -40812 -40941 -78717 -49866
$$ packed form
11248D3988J3804p961q432m999Q935J2280R441l2306K1218J4118n99j7672m941
11235D6874k6504J0685J6220o360L750J9562J3979R753o4555l0714L149l8024
11223d2185l2249l6588L3367M4372K3000J6853k871J0876K7179O625k3336j8898
11211F145j5155J0165k5993J3048N3250K5642K7091L2152n23n0168j213j9750
11199E4691o558k0975k4260K881J4947J9176q922k9412M2813l428L02J9966o403
11186E4818q851J1809j2150J6266k5714N412J0867O407j195l2781l0718j8605
11174b4435O384r621J987j3451O004L6179K4701n555k2568l246J4561J2872K0525
11161D4337m493k0893L6781J7638k5767m3584n9676p313K2158j29l7776K8851
$$ plain form
11149 -49866 -10135 -11266 -30211 -21916 -2890 4841 -27918 -39126 7761 16875 15471 26518 33632
11136 33632 4647 -34507 -16139 22601 20726 3202 8026 34025 14830 26989 54208 74308
11124 74308 53708 53538 75620 63437 54823 44942 15916 11179 -4867 -16526 3273 1048 -44822
11111 -44822 -37209 -14561 -8790 11631 4812 29308 55089 47174 26966 23421 68687 91712 43305
11098 43305 27792 25342 -5897 -16827 30265 82548 -256 -21486 -16905 -29130 -36893 -30257
11086 -30257 -20762 13856 26597 29508 34257 32595 54029 46837 3264 -722 -10568 -3628 -23286
11073 -23286 5325 -3920 -24226 -28773 29201 47145 67937 78013 104142 94914 19420 10915
11061 10915 4341 23990 41846 27156 2083 17455 17758 -7745 6987 42382 55893 35936
$$ packed form
11149d9866L9731j131j8945Q295J9026P731l2759j1208M6887R114j404J1047P114
11136C3632k8985l9154J8368L8740j875j7524M824K5999j9195J2159K7219K0100
11124G4308k0600j70K2082j2183q614r881k9026m737j6046j1659J9799k225m5870
11111d4822P613K2648N771K0421o819K4496K5781p915k0208l545M5266K3025m8407
11098D3305j5513k450l1239j0930M7092N2283q2804k1230M581j2225p763O636
11086c0257R495L4618J2741K911M749j662K1434p192m3573l986r846O940j9658
11073b3286K8611r245k0306m547N7974J7944K0792J0076K6129r228p5494q505
11061A0915o574J9649J7856j4690k5073J5372L03k5503J4732L5395J3511j9957
$$ plain form
11049 35936 32909 31465 -2674 -22674 -15789 -45637 -52178 -34817 4103 6748 -15070 -35636 8609
11036 8609 41464 25383 34686 24411 -157 41222 26531 -18768 8079 41467 55986 74357
11024 74357 31558 1390 -17426 -57417 -30961 -2438 6638 10388 31028 36399 39363 9485
11012 9485 24968 50438 61828 51899 29806 38347 79324 71529 31177 16122 27499 31866 -8431
10999 -8431 -28152 437 23886 37341 -22097 -15074 6391 31974 55786 64917 53409 35288
10987 35288 36106 1867 12988 42286 13354 -15146 33056 45394 52706 70198 72391 49108
10975 49108 43902 34552 62782 70618 70418 36378 41614 56265 59996 45032 30869 41909 57211
10962 57211 62121 55934 54102 15670 -7339 -3031 -8145 -19727 -18096 10868 -4085 -45833 -48245
$$ packed form
11049C5936l027j444l4139k0000O885k9848o541J7361L8920K645k1818k0566M4245
11036H609L2855j6081R303j0275k4568M1379j4691m5299K6847L3388J4519J8371
11024G4357m2799l0168j8816l9991K6456K8523R076L750K0640N371K964k9878
11012I485J5483K5470J1390r929k2093Q541M0977p795m0352j5055J1377M367m0297
10999h431j9721K8589K3449J3455n9438P023K1465K5583K3812R131j1508j8121
10987C5288Q18l4239J1121K9298k8932k8500M8202J2338P312J7492K193k3283
10975D9108n206r350K8230P836k00l4040N236J4651L731j4964j4163J1040J5302
10962E7211M910o187j832l8432k3009M308n114j1582J631K8964j4953m1748k412
$$ plain form
10949 -48245 -7288 30731 6165 -26839 -18051 28482 47861 -4767 -54001 -75938 -67083 -52096
10937 -52096 -31926 -45557 -69288 -103589 -112996 -49594 -4821 33246 42820 26886 53980 36074
10925 36074 34067 44398 28455 19842 16405 -12320 -25180 6965 23104 26455 -32963 -16008
10913 -16008 13988 18109 8039 -25229 -24095 7668 6541 -4636 6348 35490 16850 -424
10901 -424 -25846 -38276 -23146 -26695 -44720 -308 56375 4238 -14882 -8047 -2706 -16376 -26591
10888 -26591 -44831 -45187 -32243 -46065 -25162 11132 -7815 -22560 3592 4745 -22979 2080
10876 2080 -15888 -18477 -17365 870 -14798 -15872 -22996 -24143 -18338 -40262 -54080 -29867 -257
10863 -257 -5561 -27344 -7583 -13869 -47080 -49378 -60869 -30542 -15726 -28000 -2788 -9595 -4954
$$ packed form
10949d8245M0957L8019k4566l3004Q788M6533J9379n2628m9234k1937Q855J4987
10937e2096K0170j3631k3731l4301r407O3402M4773L8067R574j5934K7094j7906
10925C6074k007J0331j5943q613l437k8725j2860L2145J6139L351n9418J6955
10913a6008K9996M121j0070l3268J134L1763j127j1177J0984K9142j8640j7274
10901d24k5422j2430J5130l549j8025M4412N6683n2137j9120O835N341j3670j0215
10888b6591j8240l56J2944j3822K0903L6294j8947j4745K6152J153k7724K5059
10876B080j7968k589J112J8235j5668j074p124j147N805k1924j3818K4213K9610
10863b57n304k1783J9761o286l3211k298j1491L0327J4816j2274K5212o807M641
$$ plain form
10850 -4954 1401 3882 38050 48950 63184 39106 46045 63882 11789 6738 18907 23122 11943
10837 11943 -14720 -7499 -6809 4088 7000 543 -6167 -5662 8657 -3931 9591 33883 -1597
10824 -1597 8870 6116 -12577 -52948 -53173 -40745 -22511 -19766 -15351 -8398 29672 28411 -8242
10811 -8242 1485 -26369 -50394 -44088 -9076 -45999 -38886 -35098 -1791 1153 -17146 12963 21093
10798 21093 15796 27130 358 -54786 -78687 -79345 -15839 15304 15056 40558 54937 49811 50570
10785 50570 34959 -484 -7757 -16476 -349 14899 -10097 -26088 -12203 9683 20386 14345
10773 14345 -14993 -2864 45086 41231 26168 31631 50915 51341 2765 -11759 13535 -15686
10761 -15686 -47553 -36118 22852 56882 48071 29180 -11461 7103 -4675 -30419 -67705 -60954
$$ packed form
10850d954O355K481L4168J0900J4234k4078O939J7837n2093n051J2169M215j1179
10837A1943k6663P221O90J0897K912o457o710N05J4319j2588J3522K4292l5480
10824a597J0467k754j8693m0371k25J2428J8234K745M415O953L8070j261l6653
10811h242R727k7854k4025O306L5012l6923P113L788L3307K944j8299L0109Q130
10798B1093n297J1334k6772n5144k3901o58O3506L1143k48K5502J4379n126P59
10785E0570j5611l5443p273q719J6127J5248k4996j5991J3885K1886J0703o041
10773A4345k9338J2129M7950l855j5063N463J9284M26m8576j4524K5294k9221
10761a5686l1867J1435N8970L4030q811j8891m0641J8564j1778k5744l7286O751
$$ plain form
10749 -60954 -14944 3596 1185 -22764 -2169 22073 -9337 15978 1936 -24252 -29610 -7380
10737 -7380 -12477 -56779 -80054 -59357 -47674 -14990 -2867 -18542 7078 19833 54089 68381
10725 68381 64052 22738 -1022 709 28917 26023 9778 11828 -15605 -3615 -23639 -45034
10713 -45034 -38477 -24035 -33235 4178 28707 35934 25232 1818 -15016 -16506 -26025 -28451 -44015
10700 -44015 -23242 -26714 -27812 -40968 -48124 -56616 -31162 -8371 -26075 -11684 -17426 -20395 6708
10687 6708 40191 72489 72947 51487 9897 17219 29207 40944 26803 18233 -1730 -5985 8730
10674 8730 37305 13733 -4255 -23724 -44959 -88592 -65007 -10549 -2150 1296 12709 24289
10662 24289 -191 -8179 -9459 -19400 2258 7830 -15774 -29985 -36595 -14908 -3802 -7235 12431
$$ packed form
10749f0954M6010J8540k411k3949K0595K4242l1410K5315j4042k6188n358K2230
10737g380n097m4302k3275K0697J1683L2684J2123j5675K5620J2755L4256J4292
10725F8381m329m1314k3760J731K8208k894j6245K050k7433J1990k0024k1395
10713d5034O557J4442r200L7413K4529P227j0702k3414j6834j490r519k426j5564
10700d4015K0773l472j098j3156p156q492K5454K2791j7704J4391n742k969K7103
10687F708L3483L2298M58k1460m1590P322J1988J1737j4141q570j9963m255J4715
10674H730K8575k3572j7988j9469k1235m3633K3585N4458Q399L446J1413J1580
10662B4289k4480p988j280r941K1658N572k3604j4211o610K1687J1106l433J9666
$$ plain form
10649 12431 49370 82071 64931 24887 9353 -31347 -51981 -36866 -13236 11918 18033 -14137
10637 -14137 -24352 -16039 -32098 -72274 -71277 -70681 -56226 -23959 -4173 13404 41634 23641 -7760
10624 -7760 -1389 18063 48268 25297 -16842 -26946 -26353 -53971 -70638 -43631 -6147 13567
10612 13567 -20592 -45046 -19984 -1464 5577 3534 -19737 -39086 -11208 -4677 7842 19595
10600 19595 2128 -3338 -31033 -20979 26393 23111 -8273 -26030 -25200 -12887 -27706 3333
10588 3333 9830 26321 62405 24328 -3963 -30759 -28832 -31319 -29882 -41796 -54510 -52181 1164
10575 1164 16340 2863 16858 38615 23448 -31212 -20778 21536 -978 -2192 -1191 19711
10563 19711 24710 -3062 -40373 -26574 -11363 -44758 -30599 13841 16189 -4663 -30045 10544
$$ packed form
10649A2431L6939L2701j7140m0044j5534m0700k0634J5115K3630K5154O115l2170
10637a4137j0215Q313j6059m0176R97N96J4455L2267J9786J7577K8230j7993l1401
10624g760O371J9452L0205k2971m2139j0104N93k7618j6667K7007L7484J9714
10612A3567l4159k4454K5062J8520P041k043k3271j9349K7878O531J2519J1753
10600A9595j7467n466k7695J0054M7372l282l1384j7757Q30J2313j4819L1039
10588C333O497J6491L6084l8077k8291k6796J927k487J437j1914j2714K329N3345
10575A164J5176j3477J3995K1757j5167n4660J0434M2314k2514j214J001K0902
10563A9711M999k7772l7311J3799J5211l3395J4159M4440K348k0852k5382M0589
$$ plain form
10551 10544 45276 31991 -30166 -32502 -14927 -42700 -52354 -39989 -19903 -13380 5656 6206 -26443
10538 -26443 -12200 -16103 -11693 -13721 -19530 -54397 -72116 -19078 -10709 -46732 -58821 -24587 -8325
10525 -8325 -45433 -48663 -31419 -19341 5593 -23672 -29105 -38572 -71033 -26360 39602 29440
10513 29440 10069 32579 48722 27488 13628 18902 -20766 -48457 -7509 22177 20436 -16346
10501 -16346 -33927 -45500 -47230 -66948 -84181 -70069 -59245 -71981 -63853 -19517 -20711 -31811
10489 -31811 -14000 -20729 -13088 -21180 -18914 -2216 -13747 -24966 -8945 -7118 -19250 -73152 -50837
10476 -50837 -37802 -26787 -2270 24704 6061 7820 -16086 -19600 -23199 -61735 -64139 -47124
10464 -47124 -25281 -55600 -61337 -57236 -61505 -43883 24899 35203 12530 5137 22786 13061 14626
$$ packed form
10551A0544L4732j3285o2157k336J7575k7773r654J2365K0086O523J9036N50l2649
10538b6443J4243l903M410k028n809l4867j7719N3038Q369l6023j2089L4234J6262
10525h325l7108l230J7244J2078K4934k9265n433r467l2461M4673O5962j0162
10513B9440j9371K2510J6143k1234j3860N274l9668k7691M0948K9686j741l6782
10501a6346j7581j1573j730j9718j7233J4112J0824j2736Q128M4336j194j1100
10489c1811J7811o729P641q092K266J6698j1531j1219J6021J827j2132n3902K2315
10476e0837J3035J1015K4517K6974j8643J759k3906l514l599l8536k404J7015
10464d7124K1843l0319n737M101m269J7622O8782J0304k2673p393J7649r725J565
$$ plain form
10451 14626 61509 62259 40902 -2714 -25847 -18787 -3428 -44253 -43493 -38053 -32760 -28950 32189
10438 32189 39377 42737 59181 58141 28691 53510 47046 33175 21029 18975 7359 -9726 -27007
10425 -27007 1798 -18074 -25772 -28292 -47006 -52730 -24494 24483 5791 -6967 8063 -5403
10413 -5403 -5810 -42483 -57684 -25229 1919 20074 9906 51422 65403 49724 32576 30285
10401 30285 -2397 -57825 -49802 -31108 -12937 23788 48177 46436 46824 18982 16231 -1199 -13305
10388 -13305 10930 36443 33986 3384 -20235 15067 70142 95432 78991 76743 14096 -12807
10376 -12807 39887 31384 -3777 692 -22161 -25947 12745 15663 -1533 -31483 -27050 -8136 -38908
10363 -38908 -95853 -98729 -77969 -69945 -52086 -58012 -37389 -26629 -11206 -31231 -9753 9641
$$ packed form
10451A4626M6883P50k1357m3616k3133P060J5359m0825P60N440N293L810O1139
10438C2189P188L360J6444j040k9450K4819o464j3871j2146k054j1616j7085j7281
10425b7007K8805j9872p698k520j8714n724K8236M8977j8692j2758J5030j3466
10413e403m07l6673j5201L2455K7148J8155j0168M1516J3981j5679j7148k291
10401C0285l2682n5428Q023J8694J8171L6725K4389j741L88k7842k751j7430j2106
10388a3305K4235K5513k457l0602k3619L5302N5075K5290j6441k248o2647k6903
10376a2807N2694q503l5161M469k2853l786L8692K918j7196k9950M433J8914l0772
10363c8908n6945k876K0760Q024J7859n926K0623J0760J5423k0025K1478J9394
$$ plain form
10351 9641 41354 40791 45603 -5855 -46365 -43494 -16448 -7446 19866 14228 -2990 8232 24640
10338 24640 29247 -19485 -46845 -66117 13004 64815 59850 2898 -12597 -3604 10917 3510
10326 3510 19915 23579 19096 48610 73720 57417 52916 23820 11097 30281 24550 12865 -20442
10313 -20442 -12081 31127 26061 12530 11914 451 22178 -7117 9926 8676 -7869 1072 -30057
10300 -30057 -51816 -23599 -22389 1032 5804 10563 33904 4417 4034 19346 -6066 -27333 -44979
10287 -44979 -32837 9784 52451 50224 15587 -41971 -53528 -42044 -37472 -56289 -64624 -83689
10275 -83689 -99271 -108475 -104416 -97345 -81295 -70728 -25021 13953 37480 60898 67930 88595
10263 88595 58929 -33733 -60186 -43437 -49100 -74284 -41752 -25315 -34226 -34461 -36471 -18085 22219
$$ packed form
10351I641L1713n63M812n1458m0510K871K7046R002K7312n638j7218J1222J6408
10338B4640M607m8732k7360j9272P9121N1811m965n6952j5495Q993J4521p407
10326C510J6405L664m483K9514K5110j6303m501k9096j2723J9184n731j1685l3307
10313b0442Q361M3208n066j3531o16j1463K1727k9295J7043j250j6545Q941l1129
10300c0057k1759K8217J210K3421M772M759K3341k9487l83J5312k5412k1267j7646
10287d4979J2142M2621M2667k227l4637n7558j1557J1484M572j8817q335j9065
10275h3689j5582r204M059P071J6050J0567M5707L8974K3527K3418P032K0665
10263H8595k9666r2662k6453J6749n663k5184L2532J6437q911k35k010J8386M0304
$$ plain form
10250 22219 21170 38471 32552 26257 7198 5397 -5144 -6431 -29346 -10180 23291 -823 -49678
10237 -49678 -40993 -27334 -34766 -27998 -20201 -11266 50071 104006 99701 75860 87181 90665 92638
10224 92638 67853 66291 48303 24427 9857 1483 26625 36589 47156 66498 67794 38147
10212 38147 55638 26317 6009 7113 16347 39138 24662 -20763 -16784 -10503 -33809 -3281
10200 -3281 -14797 -2666 28064 17431 12648 18054 -13589 -4800 1936 -11795 -8664 -34140 -55453
10187 -55453 -59574 -47500 -63731 -69402 -45294 -46949 -63816 -33240 23997 48844 39623 15133
10175 15133 6800 -24937 -61283 -77425 -39808 2326 3078 -859 -47152 -110882 -116394 -86324 -57334
10162 -57334 -23007 5952 6994 38355 52175 13738 -5016 11681 36156 -11496 -32767 -24430
$$ packed form
10250B2219j049J7301n919o295j9059j801j0541j287k2915J9166L3471k4114m8855
10237d9678Q685J3659p432O768P797Q935O1337N3935m305k3841J1321L484J973
10224I2638k4785j562j7988k3876j4570q374K5142R964J0567J9342J296k9647
10212C8147J7491k9321k0308J104R234K2791j4476m5425L979O281k3306L0528
10200c281j1516J2131L0730j0633m783N406l1643Q789O736j3731L131k5476k1313
10187e5453m121J2074j6231n671K4108j655j6867L0576N7237K4847r221k4490
10175A5133q333l1737l6346j6142L7617M2134P52l937m6293o3730n512L0070K8990
10162e7334L4327K8959J042L1361J3820l8437j8754J6697K4475m7652k1271Q337
$$ plain form
10150 -24430 -19753 11744 -6624 -38174 -40448 -45501 -30956 -7168 12346 9165 38007 12545
10138 12545 -10543 6621 40809 16524 15313 3156 -35063 -35917 -7435 1307 -2680 -23087 -31621
10125 -31621 -24601 -57949 -79682 -73337 -42778 -24481 1704 932 43392 51734 26821 -10357 -850
10112 -850 40052 36002 39858 23217 14817 56001 99102 66076 69841 56116 60881 58065 15895
10099 15895 22196 27826 -9968 -25901 -10887 5686 21617 44925 54672 32039 12715 -22283
10087 -22283 -729 -11978 -11424 -47056 -48437 -18532 7197 -21387 -48615 -32761 9769 16015
10075 16015 46387 42344 -32757 -49692 -35982 6111 8597 -10359 -15883 -47125 -64467 -10765
10063 -10765 35532 22984 11102 5966 -3058 -2569 -23052 -6771 28172 33085 45328 54417 56382
$$ packed form
10150b4430M677L1497j8368l1550k274n053J4545K3788J9514l181K8842k5462
10138A2545k3088J7164L4188k4285j211j2157l8219q54K8482Q742l987k0407q534
10125c1621P020l3348k1733O345L0559J8297K6185p72M2460Q342k4913l7178R507
10112h50M0902m050L856j6641q400M1184M3101l3026L765j3725M765k816m2170
10099A5895O301N630l7794j5933J5014J6573J5931K3308R747k2633j9324l4998
10087b2283K1554j1249N54l5632j381K9905K5729k8584k7228J5854M2530O246
10075A6015L0372m043p5101j6935J3710M2093K486j8956n524l1242j7342N3702
10063a0765M6297j2548j1882n136r024M89k0483J6281L4943M913J2243R089J965
$$ plain form
10050 56382 38910 63060 71045 63873 104046 147368 108496 97921 96955 126162 127468 73819 60106
10037 60106 48718 35679 29722 12799 16327 14725 22398 49827 15707 -6825 -36806 -58574
10025 -58574 -92663 -84695 -7438 19347 4720 7153 41790 41269 27765 -4097 -17738 -4686
10013 -4686 -23747 -10074 16196 14813 9964 23436 23570 2171 -12188 -4055 20485 29219 27602
10000 27602 -19061 -16782 19763 38726 34539 25282 41165 40234 68947 52632 17137 33241 59954
9987 59954 79372 55546 36451 48594 92651 124041 109885 89937 68340 -5920 -27117 25810
9975 25810 33007 37789 28015 23145 8631 3710 11116 17519 11842 14151 -7096 -29034 -1714 46961
9961 46961 98665 134364 118398 125258 109392 99826 36674 2724 -31078 -17918 32426 10011
$$ packed form
10050E6382j7472K4150P985p172M0173M3322l8872j0575r66K9207J306n3649j3713
10037F0106j1388j3039n957j6923L528j602P673K7429l4120k2532k9981k1768
10025e8574l4089P968P7257K6785j4627K433L4637n21j3504l1862j3641J3052
10013d686j9061J3673K6270j383m849J3472J34k1399j4359Q133K4540Q734j617
10000B7602m6663K279L6545J8963m187r257J5883r31K8713j6315l5495J6104K6713
9987E9954J9418k3826j9095J2143M4057L1390j4156j9948k1597p4260k1197N2927
9975B5810P197M782r774m870j4514m921P406O403n677K309k1247k1938K7320M8675
9961D6961N1704L5699j5966O860j5866r566o3152l3950l3802J3160N0344k2415
$$ plain form
9949 10011 18551 22628 36613 34080 47906 45345 36694 13854 -26379 -12930 -2011 3718 11611
9936 11611 2814 426 -8549 7222 24993 16934 24400 52959 59089 66695 54261 64581 61160
9923 61160 26394 27459 19715 -29649 -51221 -75273 -81044 -53482 -38917 -30986 -34800 -55555 -54611
9910 -54611 -59280 -13904 4571 -932 212 -5930 -23394 -23518 -22147 2250 62680 78854 48165
9897 48165 59579 72829 34893 20161 16607 17166 -27379 -15127 29799 79148 59012 46762
9885 46762 45627 48843 48591 49204 61349 17431 26249 15984 -8780 11949 16729 779 -5607 15671
9871 15671 -13672 -9405 -11650 -26730 -22716 2415 38192 44791 30145 15849 31661 33155 25525
9858 25525 23695 21987 36136 38540 52214 60960 73092 54454 -5522 3011 4882 25833 13888
$$ packed form
9949A0011Q540M077J3985k533J3826k561q651k2840m0233J3449J0919N729P893
9936A1611q797k388q975J5771J7771q059P466K8559O130P606j2434J0320l421
9923F1160l4766J065p744m9364k1572k4052n771K7562J4565P931l814k0755R44
9910e4611m669M5376J8475n503J144o142j7464j24J371K4397O0430J6174l0689
9897D8165J1414J3250l7936j4732l554N59m4545J2252M4926M9349k0136j2250
9885D6762j135L216k52O13J2145m3918Q818j0265k4764K0729M780j5950o386K1278
9871A5671k9343M267k245j5080M014K5131L5777O599j4646j4296J5812J494p630
9858B5525j830j708J4149K404J3674Q746J2132j8638n9976Q533J871K0951j1945
$$ plain form
9845 13888 23413 6193 21395 19409 37010 33153 31965 58974 77016 109757 144665 143092 137420
9832 137420 148492 140862 135596 152813 124955 104434 132275 95571 74495 66073 101258 106047
9820 106047 103300 103506 71869 58789 44503 59039 46693 5590 -1924 8263 17239 -1411 -1577
9807 -1577 21215 37971 31555 12639 -28118 -58926 -19115 -4842 -3633 14389 28540 34078 8809
9794 8809 -6761 -8473 -7974 -28644 -39586 -36841 -44787 -4704 -11249 -4225 -13674 -19724 4574 -20214
9780 -20214 -9715 31333 21595 -10056 22038 37903 10400 -21967 -1265 22088 4199 16718
9768 16718 37660 17194 -32216 -24315 -9231 -3818 21844 -19118 -71107 -54384 6191 51689
9756 51689 60370 40781 7612 -14924 29955 45974 59130 59605 58278 72540 43792 25301 38003
$$ packed form
9845A3888R525j7220J5202j986J7601l857j188K7009J8042L2741L4908j573n672
9832A37420J1072p630n266J7217k7858k0521K7841l6704k1076q422L5185M789
9820A06047k747K06l1637j3080j4286J4536j2346m1103p514J0187Q976j8650j66
9807a577K2792J6756o416j8916m0757l0808L9811J4273J209J8022J4151N538k5269
9794H809j5570j712M99k0670j0942K745p946M0083o545P024r449o050K4298k4788
9780b0214J0499M1048r738l1651L2094J5865k7503l2367K0702K3353j7889J2519
9768A6718K0942k0466m9410P901J5084N413K5662m0962n1989J6723O0575M5498
9756E1689Q681j9589l3169k2536M4879J6019J3156M75j327J4262k8748j8491J2702
$$ plain form
9743 38003 7942 -8740 8762 5544 32160 27304 36287 43751 7214 -8483 39777 6466 9954
9730 9954 2074 2838 1937 26485 41808 59956 65042 66984 11613 26302 45251 29775 48110
9717 48110 46407 36202 34689 24231 5003 -4750 -10191 -1049 2308 19000 7022 -16269 -32142
9704 -32142 -3928 30966 78463 53877 12558 -5198 -30242 -45003 -33647 -19675 -6737 7923
9692 7923 33837 42752 34771 42406 47051 52213 62340 30315 29851 43637 33991 22013 -4267 16247
9678 16247 25994 27952 55809 69206 61379 37712 166 41859 67012 88432 93288 76533 112409
9665 112409 106091 49899 45273 38546 27069 10627 11901 62692 87636 85529 35516 53899 81432
9652 81432 61650 27406 59078 100638 60280 66924 53999 58847 50675 71116 89821 86410 83822
$$ packed form
9743C8003l0061j6682J7502l218K6616m856Q983P464l6537j5697M8260l3311L488
9730I954p880P64r01K4548J5323J8148N086J942n5371J4689J8949j5476J8335
9717D8110j703j0205j513j0458j9228r753n441R142L357J6692j1978k3291j5873
9704c2142K8214L4894M7497k4586m1319j7756k5044j4761J1356J3972J2938J4660
9692G923K5914Q915p981P635M645N162J0127l2025m64J3786r646j1978k6280K0514
9678A6247R747J958K7857J3397p827k3667l7546M1693K5153K1420M856j6755L5876
9665A12409o318n6192m626o727j1477j6442J274N0791K4944k107n0013J8383K7533
9652H1432j9782l4244L1672M1560m0358O644j2925M848q172K0441J8705l411k588
$$ plain form
9639 83822 107290 138919 120681 109410 130353 119879 87251 84687 93317 103367 130537 141175
9627 141175 116535 107714 133262 139595 111614 134872 172312 189458 175171 187849 196917 198779
9615 198779 213949 215529 187995 204528 248408 248811 278518 270249 261919 282832 258005 270217 265779
9602 265779 290131 347167 399721 416407 383747 374141 377984 415893 437420 470824 479426 483651
9590 483651 506161 528546 586435 623484 627604 668585 704208 726993 748411 764992 796077 798690
9578 798690 828046 877152 986983 1094240 1181330 1220908 1247760 1320355 1434972 1549875 1624540
9567 1624540 1702764 1802253 1951759 2083430 2179626 2325123 2469272 2596524 2689860 2805982
9557 2805982 2960625 3076999 3173217 3266750 3359262 3394941 3440803 3496447 3504359 3463262 3422989
$$ packed form
9639H3822K3468L1629j8238j1271K0943j0474l2628k564Q630J0050K7170J0638
9627A41175k4640q821K5548O333k7981K3258L7440J7146j4287J2678R068J862
9615A98779J5170J580k7534J6533M3880M03K9707q269q330K0913k4827J2212m438
9602B65779K4352N7036N2554J6686l2660r606L843L7909K1527L3404Q602M225
9590D83651K2510K2385N7889L7049M120M0981L5623K2785K1418J6581L1085K613
9578G98690K9356M9106J09831J07257Q7090L9578K6852P2595J14617J14903P4665
9567A624540P8224R9489J49506J31671R6196J45497J44149J27252R3336J16122
9557B805982J54643J16374R6218R3533R2512L5679M5862N5644P912m1097m0273
$$ plain form
9546 3422989 3345246 3231493 3119019 3032482 2943605 2842360 2740915 2664715 2578942 2453682
9536 2453682 2320376 2229234 2124321 2043419 1960910 1905885 1876881 1801871 1701586 1618099 1543967
9525 1543967 1481086 1444175 1375012 1328049 1255419 1263424 1264598 1206553 1124468 1033251 1021614 1011877
9513 1011877 983265 973993 926607 900386 859068 817772 778888 728969 709156 712996 721300 683494
9501 683494 639974 630687 599337 580766 592791 589214 552930 530072 545100 531796 493635 475763
9489 475763 474501 447062 440575 446327 423816 435328 431261 349964 364151 367469 341642 346687 382016
9476 382016 353930 358349 346937 299318 292829 324541 337404 332584 352730 305413 253283 258369
9464 258369 255309 250514 275761 271958 243705 219218 256702 261791 227332 191344 135578 164472
$$ packed form
9546C422989p7743j13753j12474q6537q8877j01245j01445p6200q5773j25260
9536B453682j33306r1142j04913q0902q2509n5025k9004p5010j00285q3487p4132
9525A543967o2881l6911o9163m6963p2630Q005J174n8045q2085r1217j1637r737
9513A011877k8612r272m7386k6221m1318m1296l8884m9919j9813L840Q304l7806
9501F83494m3520r287l1350j8571J2025l577l6284k2858J5028j3304l8161j7872
9489D75763j262k7439o487N752k2511J1512m067q1297J4187L318k5827N045L5329
9476C82016k8086M419j1412m7619o489L1712J2863m820K0146m7317n2130N086
9464B58369l060m795K5247l803k8253k4487L7484N089l4459l5988n5766K8894
$$ plain form
9452 164472 234665 258526 260247 229935 185639 184893 171017 138655 116294 106450 105095 112073 118775
9439 118775 68758 71045 93521 99216 89229 113739 104746 102536 110852 102415 88267 107075 98926
9426 98926 94061 115379 96730 91458 84631 47856 63569 113265 141945 154452 152436 93161 72916
9413 72916 78626 57903 35822 60312 95507 102450 78435 71023 75970 92663 103118 90870 94847
9400 94847 86908 71258 80052 60183 48903 80176 54683 51678 60660 92968 52009 26589 44177
9387 44177 41321 7255 -25568 -32868 -36958 23141 82222 86299 85209 74933 51983 53639 25940
9374 25940 -4075 11974 32497 18044 19411 -2392 -6040 17729 6917 15516 36997 34858 9153
9361 9153 39873 109849 123297 102643 118879 143117 114364 57234 65172 90269 79115 111741
$$ packed form
9452A64472P0193K3861J721l0312m4296p46j3876l2362k2361r844j355O978O702
9439A18775n0017K287K2476N695r987K4510q993k210Q316q437j4148J8808q149
9426I8926m865K1318j8649n272o827l6775J5713M9696K8680J2507k016n9275k0245
9413G2916N710k0723k2081K4490L5195O943k4015p412M947J6693J0455j2248L977
9400I4847p939j5650Q794j9869j1280L1273k5493l005Q982L2308m0959k5420J7588
9387D4177k856l4066l2823p300m090O0099N9081M077j090j0276k2950J656k7699
9374B5940l0015J6049K0523j4453J367k1803l648K3769j0812Q599K1481k139k5705
9361I153L0720O9976J3448k0654J6236K4238k8753n7130P938K5097j1154L2626
$$ plain form
9349 111741 106003 54293 25645 25723 -4861 1902 5259 -1172 26880 36640 35348 58546 63726 11632
9335 11632 -50032 -57046 -5276 57758 75113 69794 85134 75861 72729 62527 46765 28428 37318
9322 37318 47634 56044 94440 68827 61999 42864 41995 41804 82051 87629 52145 4761 3776 6522
9308 6522 -14776 8285 55843 39802 79650 101285 91448 88381 59482 63518 62430 53284 27929
9295 27929 14631 16425 29051 39775 37921 35705 37640 54141 58777 82839 68949 60985 51829
9282 51829 47276 63536 27102 -22860 28293 28470 16039 37219 -1330 14634 33134 12715
9270 12715 28771 93810 95004 67714 59054 48581 70374 73894 54160 72254 90069 41560
9258 41560 26881 48754 50010 21256 38919 84507 66508 85576 100065 96971 65179 66833
$$ packed form
9349A11741n738n1710k8648P8l0584O763L357o431K8052R760j292K3198N180n2094
9335A1632o1664p014N1770O3034J7355n319J5340r273l132j0202j5762j8337Q890
9322C7318J0316Q410L8396k5613o828j9135q69j91M0247N578l5484m7384r85K746
9308F522k1298K3061M7558j6041L9848K1635r837l067k8899M036j088r146k5355
9295B7929j3298J794J2626J0724j854k216J935J6501M636K4062j3890p964r156
9282E1829m553J6260l6434m9962N1153J77j2431K1180l8549J5964J8500k0419
9270A2715J6056O5039J194k7290q660j0473K1793L520j9734J8094J7815m8509
9258D1560j4679K1873J256k8754J7663M5588j7999J9068J4489l094l1792J654
$$ plain form
9246 66833 62673 36608 48211 60572 56666 64515 62543 5801 19909 45708 49602 37345 19088
9233 19088 15266 19817 3165 12536 -2103 -26594 -15313 17434 44059 37570 19946 -2779 48805
9220 48805 67138 66393 48282 21382 -4510 27418 11261 34369 8155 -2956 715 -550 29225
9207 29225 71102 79794 37890 -13146 -20010 5290 25606 43374 23905 38695 61347 44910
9195 44910 18168 -28344 -22586 -6876 16960 698 -37274 -35721 -54826 -69120 -32785 23350
9183 23350 34589 22207 44863 52690 52647 5593 7479 17469 -35423 -80708 -72041 -71248 -51958 -37065
9169 -37065 -48053 -54327 -42051 -58966 -53776 -27562 -10073 -12218 35596 32233 -6500 -22554 5576
9156 5576 6175 -25762 -28153 -26209 -22529 -16541 -33257 -16523 -6900 10793 14582 -9306 36602 51555
$$ packed form
9246F6833m160k6065J1603J2361l906P849j972n6742J4108K5799L894j2257j8257
9233A9088l822M551j6652R371j4639k4491J1281L2747K6625o489j7624k2725N1584
9220D8805J8333p45j8111k6900k5892L1928j6157K3108k6214j1111L671j265K9775
9207B9225M1877Q692m1904n1036o864K5300K0316J7768j9469J4790K2652j6437
9195D4910k6742m6512N758J5710K3836j6262l7972J553j9105j4294L6335N6135
9183B3350J1239j2382K2656P827m3m7054J886R990n2892m5285Q667P93J9290J4893
9169c7065j0988o274J2276j6915N190K6214J7489k145M7814l363l8733j6054K8130
9156E576N99l1937k391J944L680N988j6716J6734R623J7693L789k3888M5908J4953
$$ plain form
9142 51555 4249 21817 52773 50668 1285 -21287 -50703 -58189 -37661 -32931 -12092 -1626
9130 -1626 -11404 18675 -8748 -36371 -61163 -46621 -48201 -16215 13069 15356 20345 26802 62304
9117 62304 70259 53133 63982 55191 17753 -4045 -18943 2223 -2422 -6065 -11232 24415 33423
$$ packed form
9142E1555m7306J7568L0956k105m9383k2572k9416p486K0528M730K0839J0466
9130a626r778L0079k7423k7623k4792J4542j580L1986K9284K287M989O457L5502
9117F2304P955j7126J0849q791l7438k1798j4898K1166m645l643n167L5647R008
$$ [...]
##END NTUPLES=NMR SPECTRUM
##END=
