##TITLE=Analysis number 318767
Compound Code cc 56016
Book Reference 438/122
Project Code adrs
Chemist Name antons
##JCAMPDX= 6.0         $$ Bruker NMR JCAMP-DX V2.0
##DATA TYPE= NMR SPECTRUM
##DATA CLASS= NTUPLES
##ORIGIN= Bruker BioSpin GmbH
##OWNER= nmr
$$ XWIN-NMR		Version 3.5
$$ Thu Apr 13 09:48:21 2006 GMT Daylight Time (UT+1h)  MAYBRIDGE\nmr@NMR_250MHZ
##.OBSERVE FREQUENCY= 250.131544655141
##.OBSERVE NUCLEUS= ^1H
##.ACQUISITION MODE= SIMULTANEOUS (DQD)
##.ACQUISITION SCHEME= undefined
##.AVERAGES= 16
##.DIGITISER RES= 18
##SPECTROMETER/DATA SYSTEM= dpx250
##.PULSE SEQUENCE= zg30
##.SOLVENT NAME= CDCl3
##.SHIFT REFERENCE= (INTERNAL, CDCl3, 0, 16.522)
##AUDIT TRAIL= $$ (NUMBER, WHEN, WHO, WHERE, WHAT)
$$ ##TITLE= Audit trail, XWIN-NMR		Version 3.5
$$ ##JCAMPDX= 5.01
$$ ##ORIGIN= Bruker BioSpin GmbH
$$ ##OWNER= nmr
$$ C:\u/data/dgb/nmr/ADRS/2630/pdata/1/auditp.txt
$$ ##AUDIT TRAIL=  $$ (NUMBER, WHEN, WHO, WHERE, WHAT)
(   1,<2006-04-13 09:47:40.04 +100>,<MAYBRIDGE\nmr>,<NMR_250MHZ>,
      <created by zg, POWCHK disabled, PULCHK disabled
       configuration hash MD5:
       84 BC 41 DB A1 6E 1D 46 DA 25 12 A5 C1 ED C5 3A
       data hash MD5: 64K
       8A 67 BF 68 24 5B 78 31 15 9D EE 35 44 AC 97 D2>)
(   2,<2006-04-13 09:48:01.12 +100>,<MAYBRIDGE\nmr>,<NMR_250MHZ>,
      <Start of raw data processing
       ef LB = 0.3 FT_mod = 6 PKNL = 1 SI = 32K 
       data hash MD5: 32K
       4D 83 DF 64 4A 5F 80 BA 93 56 A3 8E 70 15 6B E7>)
(   3,<2006-04-13 09:48:05.08 +100>,<MAYBRIDGE\nmr>,<NMR_250MHZ>,
      <apk 
       data hash MD5: 32K
       D4 4E F8 0F A0 70 08 6E F9 D2 FD 59 B9 A4 B4 1B>)
(   4,<2006-04-13 09:48:06.52 +100>,<MAYBRIDGE\nmr>,<NMR_250MHZ>,
      <abs ABSG = 5 
       data hash MD5: 32K
       28 4A 1A 27 A9 84 E0 A6 77 7D 7B 3E B9 04 34 9E>)
$$ ##END=
$$ 
$$ hash MD5
$$ 65 04 3B ED AD C1 50 E4 71 10 EB 24 47 40 C4 11
##$RELAX= 
##$RELAX= 
##$RELAX= 
##$RELAX= 
##$RELAX= 
##$RELAX= 
##$RELAX= 
$$ Bruker specific parameters
$$ --------------------------
##$DU= <C:\u>
##$EXPNO= 2630
##$NAME= <ADRS>
##$PROCNO= 1
##$TYPE= <nmr>
##$USER= <dgb>
##$AMP= (0..31)
100 100 100 100 100 100 100 100 100 100 100 100 100 100 100 100 100 100 
100 100 100 100 100 100 100 100 100 100 100 100 100 100 
##$AQSEQ= 0
##$AQ_mod= 3
##$AUNM= <au_zg>
##$AUTOPOS= <56 >
##$BF1= 250.13
##$BF2= 250.13
##$BF3= 250.13
##$BF4= 250.13
##$BF5= 500.13
##$BF6= 500.13
##$BF7= 500.13
##$BF8= 500.13
##$BYTORDA= 1
##$CFDGTYP= 0
##$CFRGTYP= 5
##$CHEMSTR= <none>
##$CNST= (0..31)
1 1 145 1 1 1 1 1 1 1 1 1 1 1 1 1 1 1 1 1 1 1 1 1 1 1 1 1 1 1 1 1 
##$CPDPRG= <>
##$CPDPRG1= <>
##$CPDPRG2= <>
##$CPDPRG3= <>
##$CPDPRG4= <mlev>
##$CPDPRG5= <mlev>
##$CPDPRG6= <mlev>
##$CPDPRG7= <mlev>
##$CPDPRG8= <mlev>
##$CPDPRGB= <>
##$CPDPRGT= <>
##$D= (0..31)
0 1 0 0 0 0 0 0 0 0.06 0 0 0 0 0 0 0.0002 0 0 0 0 0 0 0 0 0 0 0 0 0 0 
0 
##$DATE= 1144918057
##$DBL= (0..7)
120 120 120 120 120 120 120 120 
##$DBP= (0..7)
150 150 150 150 150 150 150 150 
##$DBP07= 0
##$DBPNAM0= <>
##$DBPNAM1= <>
$$ [...]
##$SUBNAM7= <"">
##$SUBNAM8= <"">
##$SUBNAM9= <"">
##$SW= 20.6930455092707
##$SWIBOX= (0..15)
0 0 3 0 0 0 0 0 0 0 0 0 0 0 0 0 
##$SW_h= 5175.983436853
##$TD= 65536
##$TD0= 1
##$TE= 294.16
##$TE2= 300
##$TE3= 300
##$TEG= 300
##$TL= (0..7)
0 120 120 120 120 120 120 120 
##$TP= (0..7)
150 150 150 150 150 150 150 150 
##$TP07= 0
##$TPNAME0= <>
##$TPNAME1= <>
##$TPNAME2= <>
##$TPNAME3= <>
##$TPNAME4= <>
##$TPNAME5= <>
##$TPNAME6= <>
##$TPNAME7= <>
##$TPOAL= (0..7)
0.5 0.5 0.5 0.5 0.5 0.5 0.5 0.5 
##$TPOFFS= (0..7)
0 0 0 0 0 0 0 0 
##$TUNHIN= 0
##$TUNHOUT= 0
##$TUNXOUT= 0
##$USERA1= <user>
##$USERA2= <user>
##$USERA3= <user>
##$USERA4= <user>
##$USERA5= <user>
##$V9= 5
##$VALIST= <valist>
##$VCLIST= <CCCCCCCCCCCCCCC>
##$VD= 0
##$VDLIST= <DDDDDDDDDDDDDDD>
##$VPLIST= <PPPPPPPPPPPPPPP>
##$VTLIST= <TTTTTTTTTTTTTTT>
##$WBST= 1024
##$WBSW= 4
##$XGAIN= (0..3)
0 0 0 0 
##$XL= 0
##$YL= 0
##$YMAX_a= 417579
##$YMIN_a= -617766
##$ZGOPTNS= <>
##$ZL1= 120
##$ZL2= 120
##$ZL3= 120
##$ZL4= 120
##$ABSF1= 16.522
##$ABSF2= -4.171173
##$ABSG= 5
##$ABSL= 3
##$ALPHA= 0
##$AQORDER= 0
##$ASSFAC= 0
##$ASSFACI= 0
##$ASSFACX= 0
##$ASSWID= 0
##$AUNMP= <proc_1d>
##$AZFE= 0.1
##$AZFW= 0.1
##$BCFW= 0
##$BC_mod= 0
##$BYTORDP= 0
##$COROFFS= 0
##$CY= 12.5
##$DATMOD= 1
##$DC= 0
##$DFILT= <>
##$DTYPP= 0
##$F1P= 14.0000005364418
##$F2P= -0.99999901652339
##$FCOR= 0.5
##$FTSIZE= 32768
##$FT_mod= 6
##$GAMMA= 0
##$GB= 0
##$INTBC= 1
##$INTSCL= 1
##$ISEN= 128
##$LB= 0.3
##$LEV0= 0
##$LPBIN= 0
##$MAXI= 10000
##$MC2= 0
##$MEAN= 0
##$ME_mod= 0
##$MI= 0
##$NCOEF= 0
##$NC_proc= -4
##$NLEV= 6
##$NOISF1= 0
##$NOISF2= 0
##$NSP= 0
##$NTH_PI= 0
##$NZP= 0
##$OFFSET= 16.522
##$PC= 1
##$PHC0= 166.3739
##$PHC1= 6.256597
##$PH_mod= 1
##$PKNL= yes
##$PPARMOD= 0
##$PSCAL= 4
##$PSIGN= 0
##$REVERSE= no
##$SF= 250.13
##$SI= 32768
##$SIGF1= 0
##$SIGF2= 0
##$SINO= 400
##$SIOLD= 32768
##$SREGLST= <1H.CDCl3>
##$SSB= 0
##$STSI= 32768
##$STSR= 0
##$SW_p= 5175.98343685301
##$SYMM= 0
##$S_DEV= 0
##$TDeff= 65536
##$TDoff= 0
##$TI= <Analysis number 999999
Compound Code 99
Book Reference 9
Project Code 9>
##$TILT= no
##$TM1= 0
##$TM2= 0
##$TOPLEV= 0
##$USERP1= <user>
##$USERP2= <user>
##$USERP3= <user>
##$USERP4= <user>
##$USERP5= <user>
##$WDW= 1
##$XDIM= 32768
##$YMAX_p= 441451021
##$YMIN_p= -231568
$$ End of Bruker specific parameters
$$ ---------------------------------
##NTUPLES= NMR SPECTRUM
##VAR_NAME=  FREQUENCY,     SPECTRUM/REAL,   SPECTRUM/IMAG
##SYMBOL=    X,             R,               I
##VAR_TYPE=  INDEPENDENT,   DEPENDENT,       DEPENDENT
##VAR_FORM=  AFFN,          ASDF,            ASDF
##VAR_DIM=   32768,         32768,           32768
##UNITS=     HZ,            ARBITRARY UNITS, ARBITRARY UNITS
##FACTOR=    0.157963299565203, 1,           1
##FIRST=     4132.6476996994, 0,             0
##LAST=      -1043.33573715361, 0,           0
##MIN=       -1043.33573715361, -231568,     0
##MAX=       4132.6476996994, 441451021,     0
$$ Real data points
##PAGE= N=1
##DATA TABLE= (X++(R..R)), XYDATA
$$ [...]
20442b6942M9513l2305n2276Q450J5307O2683k4992j4200K2633k43j5862K7933
20430A9699J4216p0692K0729L9714O69j2201k3091l832l464J7424L4098k0970
20418A2299j2318j5406N7403K459K9705m4424n1714L9511K1669O1797r670q678
20406H2633m0626j099l3915n0525M427n139o003m924M5060Q9961J2119n1265m4712
20393d008O2777k377l1537r660M7889m0594J3363K1696k791K0063k3714l7599
20381A3508M3l533n3218m3074j5358K9880O5413P5765m9804J4943P6944m7493
20369F4016o5052j4464K1175j8116L6565j496m9068K473L9460q859l1486L3583
20357H731M1619M8795m6378l6677J2887K6668r405j0591n3438k1272k0607m1691
$$ plain form
20442 -26942 22571 -9734 -62010 -53560 -38253 24430 -562 -14762 7871 7628 -8234 19699
20430 19699 33915 -36777 -16048 23666 24335 12134 -10957 -14789 -18253 -829 33269 12299
20418 12299 -19 -15425 41978 44437 74142 29718 -21996 17515 39184 100981 91311 82633
20406 82633 42007 40908 6993 -43532 -39105 -44244 -50247 -55171 -10111 79850 91969 40704 -4008
20393 -4008 58769 56392 24855 15195 63084 22490 35853 57549 54758 74821 51107 13508
20381 13508 13551 10018 -43200 -86274 -101632 -71752 -6339 69426 19622 34565 111509 64016
20369 64016 -1036 -15500 5675 -12441 24124 22628 -26440 -23967 15493 6634 -24852 8731
20357 8731 50350 99145 52767 16090 28977 55645 46240 35649 -17789 -39061 -59668 -101359
20345a01359m4781J3731m413K5766O1342J6405J1418K8012O2043k6384n7084K2002
20333F698N0048L3744o9869o7712N410O1850J9621l5970l6774k3189O0697K9710
20321C4264k5880K6798J5399l5842j847m4273l9865l246q942J12146L5678o535
20309E7855k1373l8774l5780L8200M518m2531K3156R6388k4989l0280r014l9710
20297b2334k0308p5408P8659P0908k1952o6683l1685O4817M5485m1108m4125n0146
20285a13880K5566R820n255R947K7156L833J278K7653M5942K8296P229k8829K999
20272D1755j3161k8041L1012L0460L1879l2114l4946k5058P247q1472P8523P8772
20260H4856Q47m9422m7867l5369j4616k243N0196Q191K0768k3j5247K1090o5055
$$ plain form
20345 -101359 -146140 -132409 -136822 -111056 -49714 -33309 -21891 6121 68164 41780 -15304 6698
20333 6698 56746 90490 20621 -47091 -41681 20169 39790 3820 -32954 -56143 4554 34264
20321 34264 8384 35182 50581 14739 12892 -31381 -71246 -74492 -83434 28712 64390 57855
20309 57855 36482 -2292 -38072 128 4646 -37885 -14729 81659 56670 26390 17376 -22334
20297 -22334 -42642 -118050 -39391 31517 9565 -57118 -88803 -23986 21499 -19609 -63734 -113880
20285 -113880 -88314 -78494 -83749 -73802 -46646 -42813 -41535 -13882 32060 60356 67585 38756 41755
20272 41755 28594 553 31565 62025 93904 61790 26844 1786 9033 -72439 6084 84856
20260 84856 85703 36281 -11586 -46955 -61571 -63814 -13618 -5427 15341 15318 71 21161 -43894
20247d3894o9827K8314Q5178N7225m4959K0767M3837L0612o1726p1154J4027L4893
20235B3293m5506o7422j6628J04421Q0465J047m015J3995m0778L949K4450L1069
20223A08340l4170J0900n3961l7050Q111Q920K4946M3674R376n7338m1218m2620
20211e2090J4555K9399j5999j1923P4750N990j05242K7488P7096J3737l7752j6493
20199C516J1378R903L2461j9523p9080m031K9532L0902L3808j7394k8255L8782
20187D1999j284j285o0385N7910n055J0545L8366p103j8577J920J3623m723j8547
20174D7404m356L1651P933m6232R667k3726m3634k7532k3315K2646N3644N56r076
20161d370K296r693n3721q84M9279L9126M4511L2652P7888n6031p0044k2216k910
$$ plain form
20247 -43894 -113721 -85407 -229 56996 12037 32804 76641 107253 45527 -25627 -11600 23293
20235 23293 -22213 -89635 -106263 -1842 78623 79670 75655 89650 48872 52821 77271 108340
20223 108340 74170 85070 31109 -5941 2170 11090 36036 79710 89086 31748 -9470 -52090
20211 -52090 -37535 -8136 -24135 -36058 38692 44682 -60560 -33072 44024 57761 20009 3516
20199 3516 14894 24797 57258 37735 -41345 -45376 -15844 15058 48866 31472 3217 41999
20187 41999 40715 39430 -20955 36955 31900 42445 80811 73708 55131 57051 70674 65951 47404
20174 47404 43048 74699 82632 36400 46067 22341 -21293 -48825 -72140 -49494 4150 4706 -4370
20161 -4370 -2074 -11767 -65488 -66372 -17093 22033 66544 99196 177084 121053 51009 28793 25883
20148B5883o6240k0197j4644O8068K3010J2180J6797m7512N2501l76K4732j2464
20136F1738j2379k3803l3624m7100L2081K3149L5663N45k659R893k1732L1737
20124E3509j3466k7253l3887P742R531j3938j550M534O7643L5988l7321j207N491
20111E5816J0409l6191m1451k8479m3485N314N5845M0785N2146m7025J0439r526
20099B4597l4075k9855Q657k0349k1650j9810J6793M6150P0529m103j3622j9483
20087C779j6022L9932M5558P0742K0587n2433j1925M1542j787n6390j7714j2625
20075E3244L0526K2219l5352o692j3495r1618n5521Q459K8303j4843N5146N9823
20063D0199P113K755l7604q0642m4855L5988k4239K6123J5115j2972N8579O3387
$$ plain form
20148 25883 -40357 -60554 -75198 -7130 15880 28060 44857 -2655 49846 49470 74202 61738
20136 61738 49359 25556 -8068 -55168 -23087 62 35725 36270 33611 43504 21772 53509
20124 53509 40043 12790 -21097 -13355 -3824 -17762 -19312 -14778 52865 88853 51532 50325 55816
20111 55816 66225 30034 -11417 -39896 -83381 -78067 -22222 18563 70709 23684 34123 24597
20099 24597 -9478 -39333 -30676 -51025 -72675 -92485 -75692 -29542 40987 36884 23262 3779
20087 3779 -12243 27689 73247 143989 164576 112143 100218 141760 139973 83583 65869 53244
20075 53244 83770 105989 70637 63945 50450 -41168 -96689 -88230 -59927 -74770 -19624 40199
20063 40199 47312 50067 12463 -68179 -113034 -77046 -101285 -75162 -60047 -73019 -14440 48947
20051D8947L8114l6125k0215p54J5235P559J9437N0812N1306j3737n7888k3190
20039G9501k7250L0224k6962M4217J8626m0260j0062L2401M1161j243J1462k0516
20027A31299p7018j3777M4383l3044k8963k5086L4381M9915j0690K1404N3214
20016A46018o7691k3883M4221O948J0371N7957m670p4612o3009J693P0343j2179
20004I1507j4483N1723l3230l3722M9554L8531L6535J07815L8468J4577M3669
19993C90944J6977n0655k8003l3287m1629J7689J1771m9865n547N1522l3709n2165
19981A94043Q104j6764K0994J9230n829M7984k3483p8177p463o53n3935l6188
19969F7863L0372K0811l52q7090j0201M9401N5852L8307l5818k1900Q1015l3741
$$ plain form
20051 48947 87061 50936 30721 29967 45202 52761 72198 123010 174316 160579 102691 79501
20039 79501 52251 82475 55513 99730 118356 78096 68034 100435 141596 140353 151815 131299
20027 131299 54281 40504 84887 51843 22880 -2206 32175 82090 71400 92804 146018
20016 146018 78327 54444 98665 105613 115984 173941 169271 94659 31650 33343 103686 91507
20004 91507 77024 128747 95517 61795 111349 149880 186415 294230 332698 347275 390944
19993 390944 407921 357266 329263 295976 254347 272036 283807 233942 228395 279917 246208 194043
19981 194043 202147 185383 206377 225607 219778 267762 244279 166102 158639 157986 104051 67863
19969 67863 98235 119046 118694 31604 21403 70804 126656 164963 129145 107245 188260 154519
19957A54519n1565J2409n839l1684K9181o564K897N523k6002J3141l0937N486
19945G0565k1540O83L3125k3843n0849k6962k0878N0331K0110Q546R796o696k8115
19932A4273m073K6895K5598j6686n5309R4138P6091k2348l8365o4154l0250L9291
19920D5101J549n2292J1921K5795J228N2567L7421J3911R064j13589q8393J3531
19908d2186N3354P5428N3270J2212n545K0402q023k5655m0934j6793l3463K0165
19896F2232L0593O2971L101q1613O281J6736L1645J5469m4267m7100m5270j9298
19884h520N488k7182K6700L5714m8863M2962J8649M2914M2133K827k5260j1878
19872I5684L8524R883M2611j751p1017J3590o78p2561n5210M7775N0840O367l3484
$$ plain form
19957 154519 102954 115363 109524 77840 107021 100457 103354 108877 82875 96016 65079 70565
19945 70565 49025 49708 82833 58990 8141 -18821 -39699 10632 30742 39288 49084 42388 14273
19932 14273 10200 37095 62693 46007 -9302 84836 160927 138579 100214 36060 5810 45101
19920 45101 46650 -5642 6279 32074 33302 85869 123290 137201 146265 32676 -55717 -42186
19908 -42186 11168 86596 139866 152078 146533 166935 158912 133257 92323 75530 42067 62232
19896 62232 92825 155796 158897 77284 83565 100301 131946 147415 103148 56048 10778 -8520
19884 -8520 -3032 -30214 -3514 32200 -16663 26299 44948 87862 129995 132822 107562 95684
19872 95684 134208 144091 186702 184951 113934 127524 126846 54285 -925 46850 97690 104057 70573
19859G0573K1032J2241k2926j9324j7715K031K6032L3743j1815l0219k0404M5925
19847H9174Q4532n0261l6302j7739p406M8894O16k8548o2552K7367J1807L3453
19835I3035k8572m2242K3431j2987N175P1917M0646k5070k8210k6887l2529K7977
19823F5684K3934l4463j5602J322J7828M0961N1952J0142m7913l9254n2580M1949
19811F3960J3992m7418k1360j0514l9129M4748P7526K8473M53n007J0747J7590
19799A34061k0375p9091j1035l701K4578J2949l5928K6684N422L8262J7681M5895
19787A55402M687j7676l1871k5301j3100L224k1433K1804n6341Q4070O3214n8028
19775A08651j02047M117N3541k1157J5399L5217l933k6495M912N145J2969p0236
$$ plain form
19859 70573 91605 103846 80920 61596 43881 45912 71944 105687 93872 63653 43249 89174
19847 89174 173706 123445 87143 69404 61998 110892 111508 82960 20408 47775 59582 93035
19835 93035 64463 22221 45652 32665 37840 109757 150403 125333 97123 70236 37707 65684
19823 65684 89618 55155 39553 40875 58703 99664 151616 161758 113845 74591 22011 63960
19811 63960 77952 30534 9174 -1340 -40469 4279 81805 110278 110731 105724 116471 134061
19799 134061 113686 34595 23560 19859 44437 57386 21458 48142 53564 91826 109507 155402
19787 155402 160089 142413 110542 85241 72141 75365 53932 75736 19395 103465 166679 108651
19775 108651 6604 10721 64262 43105 58504 93721 89788 63293 68205 73350 86319 16083
19763A6083l2314P0371M7054M8377m5530o1973J2535J7841j1318o520l472J7825
19751F8959J2178j9747j1931j0515J1421J9221K5703R93j1925j8066P426l6666
19739C7051m8585J6953j702j3025K2093K3271m01m413J7482m8515K9147M2107
19727G1463Q249k8015M734l098L4535L8872j7863m1558l2948k2215o6716j0173
19715f4733Q7053J5711l2707k070M4009L6985J4512O936r246M055N3944M0566
19703A95015j9617k3445l1293M9833N3861l186p5868L8257o4372p475N4982l1075
19691A35617o1835l6351R190M1658p630L9957O6443J6644l3923n4840l1945K2464
19679A05449n6992K6928L2448n007k669J8241J3563M747q0909M172N1393O0334
$$ plain form
19763 16083 -16231 54140 101194 149571 104041 42068 54603 72444 61126 54606 51134 68959
19751 68959 81137 61390 49459 38944 50365 69586 95289 96282 84357 66291 73717 37051
19739 37051 -11534 5419 3717 -9308 12785 36056 35655 31242 48724 209 29356 71463
19727 71463 79712 51697 56431 53333 87868 126740 108877 67319 34371 12156 -54560 -64733
19715 -64733 22320 38031 5324 3254 47263 84248 98760 105696 96450 100505 154449 195015
19703 195015 175398 151953 120660 170493 224354 221168 145300 183557 119185 111710 166692 135617
19691 135617 73782 37431 46621 88279 80649 120606 187049 203693 169770 114930 82985 105449
19679 105449 48457 75385 107833 102826 100157 118398 131961 136708 55799 59971 111364 171698
19667A71698P956l7075n5049j8332J8370j5583L9178J5667L2482O744K3067O9689
19655B58812j2075n0326j7015j960q734N4493J4187l5912n1662j6372j919l296
19643A28221j9137J1535J2201j977K0298r604O918k0731n02N552m825k005M9026
19630A74970j6280n9072N624K9933p5211O287M4661K0117j2196L12Q679n6263
19618G1561k3996K5871N2100l1554m0018k0932J0702k1591J5565L4972N2993J3444
19606A39117n740K3389k843J821P757K8154l9569n9268L8224N355j7399L3190
19594A52188m9932q2998K6728P3950J254p5371o967L8948o8550p1089N2661O1764
19582E2586N5124N4163L8008j6668o9243J5851M2283j3137n10o6550n1727Q373
$$ plain form
19667 171698 179654 142579 87530 69198 87568 71985 111163 126830 159312 166056 189123 258812
19655 258812 246737 196411 179396 177436 168702 223195 237382 201470 149808 133436 131517 128221
19643 128221 109084 120619 132820 130843 151141 141537 148455 127724 127222 132774 127949 125944 174970
19630 174970 158690 99618 105242 135175 59964 66251 110912 131029 118833 119145 127824 71561
19618 71561 47565 73436 125536 93982 53964 33032 43734 22143 37708 72680 125673 139117
19606 139117 133377 156766 153923 155744 163501 191655 152086 92818 131042 136397 118998 152188
19594 152188 102256 19258 45986 119936 121190 45819 38852 77800 9250 -61839 -9178 52586
19582 52586 107710 161873 199881 183213 113970 129821 172104 158967 158457 91907 40180 48553
19570D8553M2112N1331N7693J5022k9864r82n8857m6462l0771j3465M6999L527
19558H4836L9495L7427j5747k1507j2657P993M901P7525L2995l5367n8590l3751
19546A07553k6830K8774K2667R877J6638L3990q4951j6287j0396L2625K6832M2908
19534A83400J6838L6886L9123j7053l5877m1947k7403O498M3268J1343L8805q86
19522B52995k479M3957k1479l5693j3291O951M1586K1896l988n885l433m1031
19510B40106j3314l7397l894k6067j3477m2162J3531q46J4125L7848P86m0683
19498A28556o1960m5880m281K4900M6940k0359j6117K2877O0614M1227l316L2662
19486B05863r180k0403j921J4858l1770k7536O3964Q16p5081m0186n6017l2458
$$ plain form
19570 48553 90665 141996 199689 214711 184847 183865 125008 78546 47775 34310 81309 84836
19558 84836 124331 161758 146011 124504 111847 119840 124741 202266 235261 199894 141304 107553
19546 107553 80723 109497 132164 142041 158679 192669 107718 91431 81035 113660 140492 183400
19534 183400 200238 237124 276247 259194 223317 181370 153967 160465 203733 215076 253881 252995
19522 252995 250516 294473 272994 237301 224010 230961 272547 294443 290455 284570 281137 240106
19510 240106 226792 189395 185501 159434 145957 103795 117326 116480 130605 168453 169239 128556
19498 128556 66596 20716 16435 41335 88275 67916 51799 74676 135290 176517 173201 205863
19486 205863 196683 176280 174359 189217 157447 129911 193875 194691 119610 79424 23407 -9051
19474i051R6577Q2937P6502L0675j6390q6370m5521m7484j667J5343M5453n837
19462A35167k5890j1854l3199M6875M1736n088j022m3223K7470N0247M1326j06982
19450A15563k311q680n2314j4714L1955O5455L7213m447k6991L0400J8657p46
19438A89040k7114L398O1208l2578k9227L8849m6263M139M7319k8229l7992O3599
19426B06149L2463n3779L999L0970j2162J8857m3387L2195k9434o677L5120L2710
19414B47024L1667m925k1647k4968j8541p052L2617N5755J0136p9789k4048K5872
19402B22101M6701K1134m8585k1979j9422k4897k0632L5830j4518K7248L9697
19391B42678m510K0340O70n1420K3546M3761l8322j8219k347n1473J7898j5690
$$ plain form
19474 -9051 87526 170463 246965 277640 261250 174880 129359 81875 80208 95551 141004 135167
19462 135167 109277 97423 64224 111099 152835 147747 146725 103502 130972 181219 222545 115563
19450 115563 113252 104572 52258 37544 69499 134954 172167 167720 140729 171129 189786 189040
19438 189040 161926 165324 226532 193954 164727 203576 157313 161452 208771 180542 142550 206149
19426 206149 238612 184833 188832 219802 207640 226497 183110 215305 185871 179194 214314 247024
19414 247024 278691 273766 252119 227151 208610 201558 234175 289930 300066 220277 196229 222101
19402 222101 268802 289936 241351 219372 199950 175053 154421 190251 175733 202981 242678
19391 242678 238168 258508 259178 207758 231304 275065 236743 218524 216177 164704 182602 166912
19379A66912m4612K8052J1585J2704l2181m3354K2454L7565J3504j0175o263P119
19367A63310M152l0683m2309p605L9050N5087k829j06M9804M3035q756m0600q592
19354B12958k4943M336K7280r396K3370J3767j9156j9721n7384L1904L4695k5844
19342A91866r071o9907j4791J6782k2430K7224O6795N3379P4282k6839m9495k8126
19330B09669q158r599n545k1876j2151j751M1919j2698N965o868N8433O181k8403
19317B15118L1865L4940k0179p8872q987O308k5233m3175L798R5239O2454j2659
19305B60617j9500j3710Q483k8027K6899N0596L9353J3702J2321N648R2119Q8880
19293E37381O0720J59661J57379J46748J68374Q6129k3734p1603r9764j31359
$$ plain form
19379 166912 122300 150352 161937 174641 142460 99106 121560 159125 172629 162454 156191 163310
19367 163310 167462 136779 94470 86865 125915 181002 178173 178067 227871 270906 262150 221550 212958
19354 212958 188015 192351 219631 210235 233605 247372 228216 208495 151111 183015 217710 191866
19342 191866 182795 112888 98097 114879 92449 119673 186468 239847 314129 287290 237795 209669
19330 209669 201511 191912 186367 164491 152340 150589 192508 179810 185775 178907 237340 243521 215118
19317 215118 246983 281923 261744 182872 173885 180193 154960 111785 115583 210822 273276 260617
19305 260617 241117 227407 235890 207863 234762 285358 324711 338413 350734 356382 448501 537381
19293 537381 598101 757762 915141 1061889 1230263 1316392 1292658 1221055 1121291 989932
19283I89932r9443m6564j10396q7579m4120j16767n4066K0725j6418k5449J2438
19272D22293r079M503r422p4765k1273j3460n1600j3462O3914M3349J1330j7398
19260C34930j9495l2994K3912M7337k7600J4099q0206j5655J9270P0098P5182
19249D08878K6467Q680m586l0660L9530J754J9046M1957K5070m3778R373K1934
19237E23665L3196j5346P716k7309p4581k1391N478J8671J23274J27451J30152
19226H30976R9385J00535K4588k7684l5639o8551o2207q6871m7805K5920O0213
19215H12860P1345O8781P7852O9781L8245k5864j8177m7290l4516M1709J9819
19204A074545L4649m157k0375M099J0887M0380N6977P178l7933o9539p8382j4684
$$ plain form
19283 989932 890489 843925 733529 645950 601830 485063 430997 451722 435304 409855 422293
19272 422293 413214 417717 408295 333530 312257 298797 247197 233735 297649 340998 352328 334930
19260 334930 315435 282441 306353 353690 326090 340189 259983 244328 263598 333696 408878
19249 408878 435345 444025 439439 408779 448309 450063 469109 511066 536136 492358 501731 523665
19237 523665 556861 541515 549231 521922 447341 425950 431428 450099 573373 700824 830976
19226 830976 930361 1030896 1055484 1027800 992161 923610 861403 774532 726727 752647 812860
19215 812860 884205 952986 1030838 1100619 1138864 1113000 1094823 1047533 1013017 1054726 1074545
19204 1074545 1109194 1105037 1084662 1088761 1099648 1140028 1197005 1204183 1166250 1096711 1018329 1003645
19192A003645N0320O7569J1386O5148m6071N9136M3053L8237K7144j9117j01633
19181A198817j49451j22691q8117k8078j0701j3192N0052N3575R8483J78567J72156
19170A339420J68087Q7097n3207p0410q7046j06474p9433r6163n5734o3670R9529
19159A081996P2217n227o8510j10306j03134m7405k708P509L6005L032k8426j6814
19147H18229j7798m6024n4468R105M6127J04970R638K8216p824j05821m0466o5103
19135F78781n9296K5756L0475q712M1759p7360n7559L7307P551m7907o4363n5224
19123D51208O6632O2379K3954n733m3361M7417M0737l7421k413k8216k9019J657
19111E47821j7991k6172K0434K2938j9505J907M4973l095j1203L4706J6852q90
$$ plain form
19192 1003645 1053965 1121534 1132920 1198068 1151997 1211133 1254186 1292423 1319567 1300450 1198817
19181 1198817 1049366 926675 838558 810480 799779 786587 836639 890214 988697 1167264 1339420
19170 1339420 1507507 1594604 1541397 1470987 1383941 1277467 1198034 1101871 1046137 982467 1081996
19159 1081996 1154213 1148986 1080476 970170 867036 819631 816923 824432 860437 863469 835043 818229
19147 818229 800431 754407 699939 709044 755171 860141 869779 897995 890171 784350 743884 678781
19135 678781 619485 645241 675716 667004 708763 631403 573844 611151 618702 570795 506432 451208
19123 451208 517840 580219 604173 598440 555079 602496 643233 605812 603399 575183 546164 547821
19111 547821 529830 503658 524092 547030 527525 529432 574405 571310 560107 594813 611665 610775
19099F10775j7888m2442o9903k1628j8280R467R8556O3819O4736O5052O9370L0131
19087H41765L5199n4285l5109n9818j27175n5528N0899M0526O785M7058m925n8663
19075F26729n6813j9236Q627k2227L2167j0312k9357m871j127N9950M5601l4047
19063E95084K2130n3049J0016J9531n1331j10M4261l564k7803j0928l2067l5152
19051D77018J0752M7140P7137l1268m4303j6010k5270l6517l4455k8183K9405
19040D25446Q3898O8267O4232l1841o1485n0444k6442k3460j3306K3625L1166
19029D89656p650J0527l1440n904l501K5402R8r266j8329K4266n601l1559j8867
19016D17832k2560j7869M13M064J0360K4576k6668m853P8435Q1165O8431K8192
$$ plain form
19099 610775 592887 550445 480542 458914 440634 450101 548657 612476 677212 742264 811634 841765
19087 841765 876964 822679 787570 727752 600577 545049 595948 636474 643259 690317 685392 626729
19075 626729 569916 550680 559307 537080 569247 558935 529578 524707 523580 583530 629131 595084
19063 595084 617214 564165 574181 593712 542381 542271 586532 582968 555165 544237 512170 477018
19051 477018 487770 534910 612047 580779 536476 520466 495196 458679 424224 396041 425446
19040 425446 509344 577611 641843 610002 548517 498073 471631 448171 434865 458490 489656
19029 489656 482006 492533 461093 455189 451688 477090 477188 467922 449593 473859 468258 436699 417832
19016 417832 395272 377403 377816 381880 392240 416816 390148 385295 463730 544895 613326 641518
19004F41518j7457n2446l655O7117M6736J6278k2297k0665l7992O763J19443J47243
18992H90586K10190K33203K18141J39869J12752N1367k3130j14345j51590j20859
18982A446184j20167q4548o3916N341M6496R8318J81235J01425m1150p3050q351
18971A487817m1340j09410j93820j54033j14190l0077L8586n1431J6485K7036
18961H75623o0661m2366j3402Q8830R6955k7517n0468n5055k7204K4424Q7101
18950H96260J01161P8355J13516J7109k9925n6366k3857n4721r1095q737P2640
18939A014340R8690J49605K11267J40393J22832J10810O8975n4486r8168j16346
18929A647912r3427p7354j23808j30452r1337j16586k4022k7442j2668m916L8679
$$ plain form
19004 641518 624061 571615 567960 635077 681813 698091 675794 655129 617137 623900 743343 890586
18992 890586 1100776 1333979 1552120 1691989 1804741 1856108 1832978 1718633 1567043 1446184
18982 1446184 1326017 1241469 1177553 1182894 1229390 1327708 1508943 1610368 1569218 1496168 1487817
18971 1487817 1446477 1337067 1143247 989214 875024 844947 883533 832102 848587 875623
18961 875623 814962 772596 759194 848024 944979 917462 866994 811939 784735 809159 896260
18950 896260 997421 1075776 1189292 1206401 1176476 1120110 1096253 1041532 950437 941700 1014340
18939 1014340 1113030 1262635 1473902 1614295 1737127 1847937 1916912 1862426 1764258 1647912
18929 1647912 1554485 1477131 1353323 1222871 1131534 1014948 990926 963484 950816 945900 984579
18918I84579l3400k7592N602k6594n9058j1775K7855N2962L695M72m3292m4926
18906H28528O0310K5033M973j9662k3535J3471r13N7418J8343N9386M6092m3713
18894A025731K7601l866l1237o7627n5719l1938p630m8343J3314p294N2502L7497
18882I02991j0957p286M9170l191l2416P5731M5887J4324K4692Q0822K6544j9679
18870A146632K7770Q2618J00972J05651Q9417K5338J2722j7670m6897p6470q6386
18859A363697k7780m2994r936m443R840j0444Q140Q580q6582j30148j1361J4632
18847A081201j2578K5392M3924j8913j8178O6989N8354N0861M1482J5583M426
18836A338543J4801N8415M4149K8473L3569J13233J60474K10394K87757K46637
$$ plain form
18918 984579 951179 923587 929189 902595 843537 831762 859617 912579 916274 916746 873454 828528
18906 828528 888838 913871 918844 899182 875647 889118 888205 945623 963966 1023352 1069444 1025731
18894 1025731 1053332 1049466 1018229 950602 894883 862945 855315 806972 820286 812992 865494 902991
18882 902991 892034 884748 933918 930727 898311 974042 1019929 1034253 1058945 1139767 1166311 1146632
18870 1146632 1174402 1257020 1357992 1463643 1553060 1578398 1591120 1573450 1526553 1450083 1363697
18859 1363697 1335917 1292923 1282987 1278544 1288384 1277940 1286080 1294660 1208078 1077930 1066569 1081201
18847 1081201 1068623 1094015 1137939 1119026 1100848 1167837 1226191 1277052 1318534 1334117 1338543
18836 1338543 1353344 1411759 1455908 1484381 1517950 1631183 1791657 2002051 2289808 2536445
18826B536445L02519K35610N9391r5405j36967j18290j51552j18480q092K63J7614
18815B523056J3780K1359Q6432k7743n6137p8771j13237o5549o0367l3862q5773
18804B123188m9828o4379j3111m4821j6556m2675l9334o4012m0551O3036N3970
18793A864927J1322Q1062J04354Q2123N1070M0457P9398N6265R6126L9521M8019
18782B554644L8976K5705k3057M0805N7979P5724J45554J55507J56425J82731
18772C410993J94829J04901O6332N1061J4023L2247l43j76410m5665J0110m8878
18761C613200N4310M9825N0900O7307K716j4856L0416N807o1925K0284R2970J17408
18749D028362P2426L9292P9556R8980M5227P090O9275N7813P4433Q6456K00134
$$ plain form
18826 2536445 2838964 3074574 3133965 3038560 2901593 2783303 2631751 2513271 2505179 2505442 2523056
18815 2523056 2536836 2558195 2644627 2616884 2560747 2481976 2368739 2303190 2242823 2208961 2123188
18804 2123188 2073360 2008981 1995870 1951049 1934493 1891818 1852484 1788472 1747921 1810957 1864927
18793 1864927 1876249 1957311 2061665 2143788 2194858 2235315 2314713 2370978 2467104 2506625 2554644
18782 2554644 2593620 2619325 2596268 2637073 2695052 2770776 2916330 3071837 3228262 3410993
18772 3410993 3605822 3710723 3777055 3828116 3842139 3874386 3874043 3697633 3651968 3662078 3613200
18761 3613200 3667510 3717335 3768235 3835542 3838258 3823402 3853818 3859625 3797700 3817984 3910954 4028362
18749 4028362 4100788 4140080 4219636 4318616 4363843 4370933 4440208 4498021 4572454 4658910 4859044
18738D859044K13799R4565Q3630J44189J19719J08485K96790K14694J35224Q9310
18728F359449R0351J56578K28147L98062L89232K13301K01701J16611J90749K69574
18718H613755L18107M64821O47942R02930J232362J760201K481472L459034M527487
18709B4408111M922539M079403K607145K23438n41823Q97773M388350J0265128
18701E1250064J8182009K7481169L5422938L5672319K7569632J2563926p599018
18694B00543039j5391569j9813295k1544714k3219438j9645539j3881004o102031
18687H0945449J367604N133869M350379K13271o592578j1193809j1462252r933674
18679E2828259p022327m591586l016546k028795j414077j070437p77742o28316
$$ plain form
18738 4859044 5072843 5167408 5251038 5395227 5514946 5623431 5920221 6134915 6270139 6359449
18728 6359449 6449800 6606378 6834525 7232587 7621819 7835120 8036821 8153432 8344181 8613755
18718 8613755 8931862 9396683 10044625 10947555 12179917 13940118 16421590 19880624 24408111
18709 24408111 29330650 33410053 36017198 36240636 35698813 36596586 40984936 51250064
18701 51250064 69432073 96913242 132336180 168008499 195578131 208142057 200543039
18694 200543039 185151470 165338175 143793461 120574023 100928484 87047480 80945449
18687 80945449 82313053 87446922 91797301 92010572 85417994 74224185 62761933 52828259
18679 52828259 45805932 41214346 38197800 36169005 34754928 33684491 32906749 32278433
18671C2278433n91762m75537m93713m58690l77003k34026o6709M25057J091212
18662C1097262K233086L684017N720166Q392852J1239430J2632667J0720692O090435
18654I1810607p31835n820860n038052m44808P839058J7591555K6655195L2182157
18646A64043017L4161755L1530771K2967878J0915721n834222k8828036m2048285
18639A86908599l9739435l2647204k0404043j0303894l911045l64828N11263n12901
18631G9536512k978575n481120n446152m473281k724147r08922P65549K549738
18623F0839602M824533P726854J1340557J4839868J6557679J4836565R508873
18616A40474531L838523J408829m8497m235141r709588j0954557o445772N49532
$$ plain form
18671 32278433 31686671 31211134 30717421 30258731 29881728 29647702 29580993 30006050 31097262
18662 31097262 33330348 37014365 42734531 51127383 62366813 74999480 85720172 91810607
18654 91810607 91078772 85257912 80219860 79775052 87614110 105205665 131860860 164043017
18646 164043017 198204772 229735543 252703421 263619142 257784920 228956884 186908599
18639 186908599 147169164 114521960 94117917 83814023 79902978 79538150 80049413 79536512
18631 79536512 76557937 71076817 65630665 61157384 58433237 57524315 58289864 60839602
18623 60839602 65664135 73390989 84731546 99571414 116129093 130965658 140474531
18616 140474531 144313054 145721883 145673386 141438245 131728657 120774100 114328328 114877860
18608A14877860P066900J0946731J0671732O186814O86969j901862l485215q095280
18600A36954649j4745171j7989694j6238849j2442436r067376o577997m917766
18593E4975360l831307l031574k519063k105950j809968j635505j559981j359079
18585C7122933j293925j203047j143650j091752j044960r41347r31987q54565
18577B8617700p81625p33698o11812n54016o24490n45627n38359n72961m97088
18568B3158024n57530n36141n66382m95001m06241m82839m36302l89235m69054
18559A8819299m10272m03049l37276k75036l15913k35830k01263j75584k51801
18550A6213275l41716m13986l74612l43263l13966k73868l35962l17439k02680
$$ plain form
18608 114877860 121944760 132891491 143563223 149750037 150437006 148535144 145049929 136954649
18600 136954649 122209478 104219784 87980935 75538499 66471123 59893126 54975360
18593 54975360 51144053 48112479 45593416 43487466 41677498 40041993 38482012 37122933
18585 37122933 35829008 34625961 33482311 32390559 31345599 30404252 29472265 28617700
18577 28617700 27836075 27102377 26490565 25936549 25312059 24766432 24228073 23655112 23158024
18568 23158024 22600494 22064353 21497971 21002970 20596729 20113890 19677588 19288353 18819299
18559 18819299 18409027 18005978 17668702 17393666 17077753 16841923 16640660 16465076 16213275
18550 16213275 15871559 15457573 15082961 14739698 14425732 14151864 13815902 13498463 13295783
18541A3295783j80309k83457k42426j68375j65615j58166j90070j07063j25011
18532A1675291j52729j35286p3620j7949m6309r9905o2298m6651p5016j82829
18522A0782699j09387m0172l2709r216r2753j75627j46487j93327j85389k47603
18512I550029k17464j07230k17000k73701j78465j76492j34374q8570j00837j53710
18502G902186n2801k9533p4729q3237p5590j07209k08531j47646j441j0572n7994
18491G052903j15536n9690k6353l4384o9433o374n3573j44839p9471m6145K6391
18480F443496J1244Q864R856M1311Q8206Q6242P0146N6887j016j03472j52307
18469F559457j43322r8364j15212o9342q7933j8501J434M7134N2028j9572r5895
$$ plain form
18541 13295783 13115474 12832017 12589591 12421216 12255601 12097435 11907365 11800302 11675291
18532 11675291 11522562 11387276 11313656 11295707 11249398 11149493 11087195 11040544 10965528 10782699
18522 10782699 10673312 10633140 10600431 10591215 10498462 10322835 10176348 9983021 9797632 9550029
18512 9550029 9332565 9225335 9008335 8734634 8556169 8379677 8245303 8156733 8055896 7902186
18502 7902186 7849385 7819852 7745123 7661886 7586296 7479087 7270556 7122910 7121469 7110897 7052903
18491 7052903 6937367 6877677 6851324 6816940 6747507 6741133 6687560 6542721 6463250 6417105 6443496
18480 6443496 6454740 6463604 6473460 6514771 6602977 6689219 6759365 6816252 6815236 6711764 6559457
18469 6559457 6416135 6317771 6202559 6133217 6045284 6026783 6028217 6075351 6127379 6107807 6011912
18458F011912k3152j5664K3262p0647j52016j39974r4685j15141j50435j81374
18448E092086p2945k3102o1411p9791o9464p1997p488k0326l0545j2187m0153
18437D602677K1848J15439K12243K78038K12959K15873K53022J97379P6576R6218
18427F282272L5362N096m6664J9141J69340L49371N43046O09864P27428R25448
18417I619704J029967J050656J281702J836707K518814L808085O130129J0050220
18409C7325984J5703291K1884686K5212830K1807624J2172229K230105k69748
18402A36067001j268280p591013j8131734k1878235j7118386q742152o25150O820778
18394F7532829J4409899K0934523K2933929J7340277O463317j329038k338652
$$ plain form
18458 6011912 5988760 5973096 5996358 5925711 5773695 5633721 5539036 5423895 5273460 5092086
18448 5092086 5019141 4996039 4934628 4854837 4785373 4713376 4705888 4685562 4655017 4642830 4602677
18437 4602677 4624525 4739964 4952207 5230245 5443204 5659077 5912099 6109478 6186054 6282272
18427 6282272 6317634 6322730 6276066 6295207 6464547 6813918 7356964 7966828 8694256 9619704
18417 9619704 10649671 11700327 12982029 14818736 17337550 21145635 27275764 37325984
18409 37325984 53029275 74913961 100126791 121934415 134106644 136336749 136067001
18402 136067001 134798721 127207708 109075974 87197739 70079353 61337201 60712051 67532829
18394 67532829 81942728 102877251 125811180 143151457 149614774 148285736 145947084
18387A45947084m751043j3169091k2935272k4146210j8712390j1987205p363040
18380D2882833m772037l288080k500421k063517j727646j394565j250393j176724
18372B4709450j127865j019584r00161p96702p29710o73321m91481m08330l16958
18363A8245338l87787m87687n69997n46734n35520n45251o33017n37352n09245
18354A3492748l86349l24475l19152k64785l14511l28477k20970k51303k48099
18345A0834627k36999k78145k01535k15452k78451k50906k24589j60468j32447
18336H855635j79111j53977j10278m1842j04581j67147q7675q7804j76351k01745
18326G545124j86125j61657j56553q9761p0385j83478j71707j43699j74955j66421
$$ plain form
18387 145947084 141196041 128026950 105091678 80945468 62233078 50245873 42882833
18380 42882833 38110796 34822716 32322295 30258778 28531132 27136567 25886174 24709450
18372 24709450 23581585 22562001 21661840 20865138 20135428 19462107 18970626 18562296 18245338
18363 18245338 17857551 17369864 16799867 16253133 15717613 15172362 14539345 14001993 13492748
18354 13492748 13106399 12781924 12462772 12197987 11883476 11554999 11334029 11082726 10834627
18345 10834627 10597628 10319483 10117948 9902496 9624045 9373139 9148550 8988082 8855635
18336 8855635 8676524 8522547 8412269 8370427 8265846 8098699 8011024 7923220 7746869 7545124
18326 7545124 7358999 7197342 7040789 6951028 6880643 6697165 6525458 6381759 6206804 6040383
18316F040383j38913j04158j07943j69865j47976l1854k5703n5480n5872j06129
18306E096490j04565p5693k7656L074q8191J7832K5427o6019j18153j02542m7631
18295D512373j48069j18719k5843n8866j00531m8629k2677j1433j6717m5568k8365
18284C886956L0861K1001N7145P1134K8468M4335k0518p6861r2529o1144l7253
18273C851595o8649j18095j25411p5712p0783M8625K7426n7289K8905K1374m8179
18262C413807n0170l4877o9789k0403o8828r4783j49801r8601j8974K8782n8219
18251B778144m4352l7944n4113L7160J5600K2174J9008R242k4273n0768k7522
18240B642356o1239j06410n6516k8647N1337l1985n3247m8082M1767k3088l2952
$$ plain form
18316 6040383 5901470 5797312 5689369 5519504 5371528 5339674 5313971 5258491 5202619 5096490
18306 5096490 4991925 4916232 4888576 4891650 4803459 4821291 4846718 4780699 4662546 4560004 4512373
18295 4512373 4364304 4245585 4219742 4160876 4060345 4011716 3989039 3977606 3960889 3915321 3886956
18284 3886956 3917817 3938818 3995963 4067097 4095565 4139900 4119382 4042521 3949992 3888848 3851595
18273 3851595 3782946 3664851 3539440 3463728 3392945 3441570 3468996 3411707 3440612 3461986 3413807
18262 3413807 3363637 3328760 3258971 3238568 3169740 3074957 2925156 2826555 2807581 2836363 2778144
18251 2778144 2733792 2695848 2641735 2678895 2694495 2716669 2735677 2744919 2720646 2669878 2642356
18240 2642356 2581117 2474707 2418191 2389544 2440881 2408896 2355649 2307567 2349334 2326246 2293294
18229B293294k4755r198q452k4734l0635N1166Q6870K0637L3879R5208J00219
18218B583499J14866K0393l8680o822K9396l1081p6712l5722K5400l5889n3417
18207B495231r0046j0219N5485j3185o9124p3145K4459M7350l0546o6794r5702
18196B173764Q871j7317L8037L454q5963o3458K9785J0769l0246P371l1836L7991
18184B081222L4496P2685J00775N6032M9149p84k9466L8643J21111N2664L2479
18173B609006J37439N5051O492N5609J00868J01606Q1659j5250q3127p7793j2034
18162B959526q0621q0886L8990N6029j6862o5203j23820n5883J832k3415k7952
18151B581735k784O5838M2080J6395l0013n1663j3002j5007J1526L7144O9552
$$ plain form
18229 2293294 2268539 2259341 2250889 2226155 2195520 2246686 2333556 2354193 2388072 2483280 2583499
18218 2583499 2698365 2718758 2680078 2673256 2702652 2671571 2594859 2559137 2584537 2548648 2495231
18207 2495231 2405185 2394966 2450451 2437266 2368142 2294997 2319456 2366806 2336260 2269466 2173764
18196 2173764 2182635 2165318 2203355 2206809 2120846 2057388 2087173 2097942 2067696 2075067 2043231 2081222
18184 2081222 2115718 2188403 2289178 2345210 2394359 2393575 2364109 2402752 2523863 2576527 2609006
18173 2609006 2746445 2801496 2807988 2863597 2964465 3066071 3147730 3132480 3049353 2971560 2959526
18162 2959526 2878905 2798019 2837009 2893038 2876176 2810973 2687153 2631270 2633102 2609687 2581735
18151 2581735 2578951 2644789 2686869 2703264 2673251 2621588 2608586 2593579 2605105 2642249 2711801
18140B711801O0314L9528N0932J44348J69113J76175K31329J88987J43239J80995
18130D096761J51164J39102J35086K92368L04898K45184L03957K63063K35793
18121F167376L37039N25759Q12942J029085J125469J319909J781278K630868M301292
18112B0031017P809167J4035778K1041646K4060691J6679457j1736567k7475318
18105F4445871j5287415o160891k409190M86932K992579L930633K979095M222484
18097E5200098R976782J6151511J9449815J7761582J3418147J7245880K5862825
18090A75066640K4030249M446997j4354076p433724N76704q465346k1305025j9736590
18082A32825829j1089599q519963j0661067q043647k746118j013663n002226r012278
$$ plain form
18140 2711801 2772115 2811643 2862575 3006923 3176036 3352211 3583540 3772527 3915766 4096761
18130 4096761 4247925 4387027 4522113 4814481 5119379 5364563 5668520 5931583 6167376
18121 6167376 6504415 7030174 7843116 8872201 9997670 11317579 13098857 15729725 20031017
18112 20031017 27840184 41875962 62917608 86978299 103657756 91921189 64445871
18105 64445871 49158456 42997565 40588375 41075307 44067886 47998519 50977614 55200098
18097 55200098 65176880 81328391 100778206 118539788 131957935 149203815 175066640
18090 175066640 199096889 203543886 189189810 181756086 182332790 173867444 152562419 132825829
18082 132825829 121736230 113216267 102555200 94511553 91765435 90751772 85749546 76737268
18074G6737268p183214m470838m257535n993681o436375m952108l382676k345993
18066C7714848j779525j333923j080929p69390o77849p11431n66920j43788M53988
18057C1105081R68996J770773L013264M375803N209217M913659L895117M581221
18049E9833131O739348P386859M737336J859542M663949R032514J0380975J0422804
18041A15056458J4567607J8440069J3007213Q01161J134151J0258907P560885
18034A80826451j4001356k6451007j6975961q184644r607916j5796011j4685548
18027G5124008r189780m662557k491446k907636m479157l982929k626225k295400
18019D2488878k932156l256089k612763j928960j521112j314011j138768q89933
$$ plain form
18074 76737268 69554054 65083216 60825681 54832000 48395625 43443517 40060841 37714848
18066 37714848 35935323 34601400 33520471 32751081 32073232 31361801 30794881 30651093 31105081
18057 31105081 32074077 33844850 36858114 41233917 46443134 51356793 55251910 59833131
18049 59833131 66572479 73959338 78696674 80556216 85220165 94252679 104633654 115056458
18041 115056458 129624065 148064134 161071347 161872508 163006659 173265566 180826451
18034 180826451 166825095 140374088 123398127 115213483 105605567 89809556 75124008
18027 75124008 65934228 61271671 58780225 55872589 51393432 47410503 44784278 42488878
18019 42488878 39556722 36300633 33687870 31758910 30237798 28923787 27785019 26895086
18011B6895086q36057q78313q79149p12303p41542q06371q40742p04837o06310
18002A9889462o13834o06795o51837n43298m64001m58235m14686m42033m45679
17993A5249064l76379l37225l42634k86712l32325l50040k52958k06637k42998
17984A2521156k62402l00005k42057j74261k74491l00446k83532k39470j78459
17975A0266033j78129j94286j47900p7315r3924j18734j51468j02498j2353q0029
17965I109397j32272j29150p6700m1658r8582j47093k5101K9384k8340j23381
17955H336504j64238j72941k02561j74658k68714l32940j90221j58927j38193
17946F533111j01861j24872j45852j79069j33744j64370j97680j51927j60595
$$ plain form
18011 26895086 26059029 25180716 24301567 23589264 22847722 22041351 21200609 20495772 19889462
18002 19889462 19275628 18668833 18016996 17473698 17009697 16551462 16136776 15694743 15249064
17993 15249064 14872685 14535460 14192826 13906114 13573789 13223749 12970791 12764154 12521156
17984 12521156 12258754 11958749 11716692 11542431 11267940 10967494 10683962 10444492 10266033
17975 10266033 10087904 9893618 9745718 9668403 9574479 9455745 9304277 9201779 9189426 9109397
17965 9109397 8977125 8847975 8771275 8729617 8631035 8483942 8458841 8488225 8459885 8336504
17955 8336504 8172266 7999325 7796764 7622106 7353392 7020452 6830231 6671304 6533111
17946 6533111 6431250 6306378 6160526 5981457 5847713 5683343 5485663 5333736 5173141
17937E173141p8465j7931j07301j04512j44417r4632j13784o2858k8734q9675
17927D330832m7764o8674q3659p9891p9112l360L6908N8484P5835L6864O5832
17916D242295N0229l8955n7853L4789O1927m5258p1213m0512M4753M2940l5277
17905D187865j38758m2432M6010j24663k15927j40169j49952j55903j24366j37840
17895C003865r7561o7036q3684o2486J2475M1435n2898p848p5015q1685m655n5285
17883B469622o3704r8948r1947n1458j6507n5452r9447p2872n975K5810o1062
17872A878060o7451M803l329o7911j00901j5917K6536n8409J3611l1739N902P3428
17860A656683p47q5057q5361k9525o932J6598r133n4403o627m0577o4571o8215
$$ plain form
17937 5173141 5094676 5076745 4969444 4864932 4720515 4625883 4512099 4449241 4420507 4330832
17927 4330832 4283068 4214394 4130735 4050844 3971732 3968372 4005280 4063764 4139599 4176463 4242295
17916 4242295 4292524 4253569 4195716 4230505 4292432 4247174 4175961 4135449 4180202 4223142 4187865
17905 4187865 4049107 4006675 4052685 3928022 3712095 3571926 3421974 3266071 3141705 3003865
17895 3003865 2906304 2839268 2755584 2693098 2705573 2747008 2694110 2686262 2611247 2529562 2524907 2469622
17883 2469622 2405918 2306970 2215023 2163565 2147058 2091606 1992159 1919287 1913312 1939122 1878060
17872 1878060 1810609 1815412 1812083 1744172 1643271 1627354 1653890 1595481 1609092 1577353 1583255 1656683
17860 1656683 1655936 1570879 1485518 1455993 1449061 1465659 1456526 1402123 1395496 1354919 1290348 1222133
17848A222133j5595k2961j3712O1712N9994l6460q1539l9574k2674l6114n0106
17837A025104j5365K5748J0675k1006J101K6260m0923q6327l3937m1557N752N6509
17825I12034q9392p1509k018Q994j0486J2793M4877J17647N3677N0333J39098
17814A166048J08247k8172o381M6442l2721k8413p9611j30131j25517l7927P753
17803H59617L6765P2880J12154K7663J21278O1976k4602j0234l4619p6680j73145
17792I73053j58396r7096m7093l1700p4547r0573m0863O9920l0219k0781L3983
17781D85688n7368q0333N0021o1893m4331n5687N0583R7708R390J0718N7140p0784
17769C90852j11177j0834K4500m1845j6664j0185O6562N5022l4352m3899K0683
$$ plain form
17848 1222133 1206538 1183577 1169865 1231577 1291571 1255111 1173572 1133998 1111324 1075210 1025104
17837 1025104 1009739 1035487 1046162 1025156 1026257 1052517 1011594 925267 891330 849773 855525 912034
17825 912034 822642 751133 749115 758109 747623 760416 805293 922940 976617 1026950 1166048
17814 1166048 1274295 1246123 1239742 1286184 1253463 1225050 1145439 1015308 889791 851864 859617
17803 859617 896382 969262 1081416 1109079 1230357 1292333 1267731 1257497 1222878 1146198 973053
17792 973053 814657 717561 670468 638768 564221 473648 432785 502705 472486 451705 485688
17781 485688 428320 347987 398008 336115 291784 236097 286680 384388 393778 404496 461636 390852
17769 390852 279675 268841 293341 251496 234832 224647 291209 346231 311879 267980 288663
17758B88663k0428n1844J3161M300j3610m0712L7835L0160k9220R613L858P181
17746B38957l0641p0397O0089L4100J3555j0222p9349o7144k2917J6056J2615
17735I4702N707k3099L255N2074R495m5395k5011j8984j5220K0264j0786L4900
17723H1902j1088J0602o979J7201l1870M82l067M1358K2368O1103K6584k6081
17711A82515l5367j1021R490m9247k8432j8439M0309j8610P299M5476k9181o0017
17699C4775M105r567k4275q734j6222n732K5041M6385j8573N0909l9768p3072
17687c4728l2339M2963L214j5623O0785P750L697k0701k008j3206M7152P557m6136
17674H377m4983K9548j0517n4438l2532O9319K8819k154j6210r145o7407p481
$$ plain form
17758 288663 268235 216391 229552 233852 220242 179530 217365 247525 218305 227918 231776 238957
17746 238957 208316 137919 198008 232108 245663 235441 156092 88948 66031 82087 94702
17735 94702 100409 77310 80565 132639 142134 96739 71728 52744 37524 57788 47002 81902
17723 81902 70814 81416 74437 91638 59768 60250 57183 98541 120909 182012 208596 182515
17711 182515 147148 136127 145617 96370 67938 49499 89808 71198 78497 123973 94792 34775
17699 34775 38880 29313 5038 -3696 -19918 -25650 -609 45776 27203 78112 38344 -34728
17687 -34728 -67067 -24104 -20890 -36513 24272 32022 35719 15018 13010 -196 46956 54513 8377
17674 8377 -36606 -7058 -17575 -72013 -104545 -35226 -6407 -8561 -24771 -33916 -101323 -108804
17662a08804O4713J17595j747l3820j5328J9111l6801m4201J8574M075m456k5793
17650d6882j7922L0633N721n5463j6767R3240L9523K1391j2364m1709j5564k1670
17638c7833j7270M1789K425J0940l6614m7059k8260O420K9418Q753k1993j9965
17626a09249Q339j8798R3303J7435o2395j9710k5987J0505P1679j7323j4858J9714
17614d7345M4197j4613o3015j1617K3026J8810n4347j8171O6806N0154k4950q4175
17602a15240o201P1719j529L0648O7526l8088l9829l096l308M5077L3799N8653
17590A00131Q3394l7827m3106L3078J05662O2377J7404J7402L8008k3907R1128
17579D43744J07820L8715n0594L397O1301N3458J857M715n1573l1492Q5914K4260
$$ plain form
17662 -108804 -44091 73504 71757 37937 22609 41720 4919 -39282 -20708 -16633 -21089 -46882
17650 -46882 -64804 -34171 -28450 -83913 -100680 -7440 32083 53474 41110 -599 -16163 -37833
17638 -37833 -55103 -13314 -10889 51 -36563 -83622 -111882 -105462 -76044 -67291 -89284 -109249
17626 -109249 -100910 -119708 -26405 -8970 -71365 -91075 -117062 -106557 -34878 -52201 -67059 -47345
17614 -47345 -3148 -17761 -80776 -92393 -69367 -50557 -104904 -123075 -56269 -6115 -31065 -115240
17602 -115240 -121441 -49722 -51251 -20603 46923 8835 -30994 -34090 -37398 7679 41478 100131
17590 100131 183525 145698 102592 135670 241332 303709 321113 338515 376523 352616 443744
17579 443744 551564 590279 539685 543082 604383 657841 659698 664413 612840 581348 667262 691522
17567F91522n9240p9645n9656l7295k4458k2577q4332m5404p4061k2980L2031
17556B13905k4096N2356R5883J7498l9190n0276P4j13004m7884N7485j375o816
17544A54560m6225J740j6046Q812L3580O8568J0467j1158m3790N0895J15510J22064
17532D48977M1316K3400O038k5576l4807L9226J2908J2198j32N2025L3561k5061
17520E84073J8757K1221o821j7974l0030O6607M3238m3585j13697j05811P4611
17509D90589m7038j39732j03293l8249n037J1675l1422o4952j091Q815m7617p39
17497C1909Q1539K5425n4774p7466k9351K4094K141N0983j4954k4220K2891r012
17485B9205K1475o433K2783J4019j5566j4219l2865j2780K2437j1511J5383K8578
$$ plain form
17567 691522 632282 552637 492981 455686 431228 408651 324319 278915 204854 181874 213905
17556 213905 189809 242165 338048 355546 316356 266080 266154 153150 105266 162751 161376 154560
17544 154560 108335 110075 94029 102841 136421 204989 215456 204298 160508 211403 326913 448977
17532 448977 490293 513693 519731 494155 459348 498574 511482 523680 523548 575573 609134 584073
17520 584073 602830 624051 617230 599256 569226 635833 679071 635486 521789 415978 490589
17509 490589 443551 303819 200526 162277 157240 168915 137493 72541 71450 80265 32648 31909
17497 31909 113448 138873 84099 6633 -22718 1376 3517 54500 39546 15326 38217 29205
17485 29205 50680 44247 67030 81049 65483 51264 18399 5619 28056 16545 31928 60506
17473F0506m4867m6887L6037m51M9605R059j7661J658m9194P103O5922N969m4667
17460C2132k9760l7985L6318J10702P7179p0711n0131j630k3563l9787K3922O0773
17448H7459L1460j6954j2188O3228Q6631Q4342J23501R8489j30376j98221j05428
17437A11943l357l6212o1897l6579N0166L0256Q621k5947K2951J1910p9117p9302
17425h6564l2826P6327M8433j0310o203j4881J9021k662L9055L1046l166j8702
17413C8568N7338M0738n2874l1582n3112l1038L1881K3013j5331q160m3717o2848
17401a07124K4096J7521K394J1186L0205R251Q077k4899O1641N3521N9238K0100
17389A65207n5991q9468l7198N106r755l5622N7451M6654L2825n517j9492Q906
$$ plain form
17473 60506 15639 -31248 4789 4338 53943 63002 45341 46999 -2195 4908 70830 76799 32132
17460 32132 2372 -35613 705 111407 188586 117875 67744 66114 42551 2764 26686 87459
17448 87459 118919 101965 89777 153005 239636 323978 447479 545968 415592 217371 111943
17437 111943 108586 72374 10477 -26102 24064 54320 62941 36994 59945 71855 -7262 -86564
17425 -86564 -119390 -43063 5370 -4940 -11143 -26024 -7003 -9665 29390 60436 57270 38568
17413 38568 95906 136644 83770 52188 -924 -31962 -81 22932 7601 -559 -44276 -107124
17401 -107124 -83028 -65507 -63113 -51927 -21722 -12471 -4394 -29293 32348 85869 145107 165207
17389 165207 109216 19748 -17450 -12344 -22099 -57721 -270 46384 79209 73692 54200 63106
17377F3106Q520o145Q378J8677r95k8757j5474K6334L5152k7848p6197l2932j5853
17364d4034j7102R144J7597M985N847K9897J5404k4392J2990J4669L61r803L465
17351A9028m0982l3249O951L5387L7320K3443J3887j8386k3626K6349l6670m5773
17339c6321N45K3665L063K246K5853L559K3131N3233o3385m1105J0910l3115P137
17326b0584Q9556J1975n9838o4642L6313K3262Q477j4731n1097k3246k9448L991
17314i0012L9252N1729L2408K4067l1066j1597o0582O299m331J2594M5469p7794
17302f3564m3417O6185m791K292j3597K8784k2469l3997q803Q003l6282j7484
17290a39140M8303J9427l6101K1949K433M887L2547K3754j6758P220N163K9617
$$ plain form
17377 63106 71626 65481 73859 92536 91541 62784 47310 73644 108796 80948 4751 -28181 -44034
17364 -44034 -61136 -51992 -34395 -29410 -23563 6334 21738 -2654 10336 25005 25366 15563 19028
17351 19028 -21954 -55203 -48252 -12865 24455 47898 61785 43399 19773 46122 9452 -36321
17339 -36321 -35776 -12111 -9048 -6802 19051 22610 45741 98974 35589 -5516 5394 -27721 -20584
17326 -20584 68972 80947 21109 -43533 -7220 16042 24519 9788 -41309 -64555 -94003 -90012
17314 -90012 -50760 969 33377 57444 26378 14781 -45801 -39502 -43833 -31239 14230 -63564
17302 -63564 -106981 -40796 -45587 -43295 -56892 -28108 -50577 -84574 -93377 -85374 -121656 -139140
17290 -139140 -90837 -71410 -107511 -85562 -83129 -78242 -45695 -21941 -38699 -31479 -26316 3301
17278C301k4015r8919l5457O3902O9775K7567J882J3653m563m0430l9843m637
17266f7784oM3536n586o6681k6120L4965J8818N8305J4271l092j5061r873L0688
17253F380J2270l2129P743J2429J0433L0209m3809M7148l6873k4431j9722J8752
17241a1600l8262L9573j3661k6935j2292J9708K9957k1979m6620p1670k5690N0972
17229a28499J1838K0458k687m1646m739o063J0049P9982Q1304k0817j115q194
17217a0129n1273O854l8974k2241M6130Q2504L9163N0927J31300J41773R1172
17206D67206K5198n3854q6883m4854l4250m3216m1988K495P1673R4716J33209
17195D89452J75279J23191O9117o1046q3652r0506j78000o3035r8772o784L2156
$$ plain form
17278 3301 -20714 -119633 -155090 -91188 -21413 6154 8036 21689 17126 -23304 -63147 -67784
17266 -67784 -67790 -24254 -29840 -96521 -122641 -87676 -68858 -10553 3718 626 -14435 -24308 6380
17253 6380 18650 -13479 -5736 6693 17126 47335 3526 50674 13801 -10630 -30352 -11600
17241 -11600 -49862 -10289 -23950 -50885 -63177 -43469 -13512 -35491 -82111 -153781 -179471 -128499
17229 -128499 -116661 -96203 -98890 -140536 -145275 -151338 -141289 -61307 19997 -820 -1935 -10129
17217 -10129 -61402 -54548 -93522 -115763 -69633 12871 52034 102961 234261 376034 467206
17206 467206 492404 438550 351667 306813 272563 229347 187359 189854 261527 356243 489452
17195 489452 664731 787922 857039 795993 712341 621835 443835 380800 282028 275244 307400
17184C07400j542J4661R9970M9344q369r016l7322j47069j27153n0696N720k7161
17172F8767j6881K8113J0485N9485J9711j3596p3154o2838K342J3537q781j0597
17160A6593L3778K6570K4005l6983r5416q1933l408L9022K0411L1622K6812M6227
17148D7300J5336N251j2438M0365n5356n9134m97k2283J755k4195n772K1583p5680
17135a23765L4202J04782J9295j1413K0623L6332k2880q1657M0962M8829J0306
17124G5616n3701j7072R403m401N0696o390p3248J3718J6469M8342M2022R657
17112A11111q474j7249k1262J0007J1812k4728l5104o1262M794J6640L9742K4883
17100E0910j1179m2084R383L9782K7950j0543l5883k6577q4766N909P8656M6112
$$ plain form
17184 307400 305858 320519 420489 469833 461464 452448 415126 268057 140904 90208 95928 68767
17172 68767 51886 79999 90484 149969 169680 156084 82930 20092 22434 35971 27190 16593
17160 16593 50371 76941 100946 63963 -31453 -113386 -116794 -77772 -57361 -25739 1073 47300
17148 47300 62636 67887 55449 95814 40458 -18676 -19173 -41456 -39701 -63896 -69668 -48085 -123765
17135 -123765 -89563 15219 34514 23101 43724 80056 57176 -24481 16481 65310 75616
17124 75616 21915 4843 14246 9845 60541 54151 -19097 -5379 11090 59432 101454 111111
17112 111111 102637 85388 64126 74133 85945 61217 26113 -35149 -30355 -13715 26027 50910
17100 50910 39731 -2353 7030 46812 74762 64219 28336 1759 -83007 -77098 1558 47670
17088D7670k3719K0613m8450m8179m490K5420K6406j568J6229N3227j7666o6754
17076b1261j008K0709o463M0144l5728K9701K347p97m2935j477q778J8006N3316
17063D5776k2920o1980J976Q6111N4010k4355p9771k1453m862L8927L5783j8076
17051B9166m9410P328R335L8771n3103J9561J4277n9983L7214K1218j7154l7881
17039d0661m2858l6891K5270N3948L7676j7360m5576J7691N9360l8646P178L6871
17027A6002q369L6045J9793L318K5235k873m7310l9237n8702M8127L7928p7554
17015d7597k410J1017l6150O1586O1844l0l6118j9169K6315j7920k4J0224l580
17002G988J0176J9474p1027p40J2275J0403j962J5481o192L2121L3882n349m6422
$$ plain form
17088 47670 23951 44564 -3886 -52065 -56555 -31135 -4729 -6297 9932 63159 45493 -21261
17076 -21261 -22269 -1560 -8023 32121 -3607 26094 28441 27644 -15291 -16768 -25546 -7540 45776
17063 45776 22856 -39124 -37148 48963 102973 78618 -1153 -22606 -27468 11459 47242 29166
17051 29166 -20244 -12916 -3581 35190 -17913 1648 15925 -44058 -6844 14374 -2780 -40661
17039 -40661 -83519 -120410 -95140 -41192 -3516 -20876 -66452 -48761 10599 -28047 -20869 16002
17027 16002 7633 43678 63471 66789 92024 89151 41841 2604 -56098 -7971 29957 -47597
17015 -47597 -50007 -38990 -75140 -13554 48290 48260 12142 -7027 19288 1368 1344 11568 7988
17002 7988 18164 37638 -33389 -34129 -21854 -11451 -13413 2068 -4124 27997 61879 56530 10108
16989A0108L5019k5766j5217o9961p2319L1870P7210M1201l6202k2573L6678K4841
16977A4889j6472P106j732J9804o2401l9767L6372L8251o008m5141m5332J9659
16965h0772m7397M9038M0197N0065Q7566J0359n2928l913n1189K6622N9017p83
16953H5882l346m9497o3378k33J1323J9976l1558J6232j4195k580M4265M0977
16941E3868P735l82k5157K0903q069l9872m7332J7145K4046j0579k5924k0989
16929e4607K2217M3976O0280L6094J5203n5144k9414J9035q464L4250r1054K146
16917e482O596l3855j770l7281J9543K1653O466J0367M056K7204M147M3924l846
16904F1722l575J4319j7370O258N5305j4129n9487m1885J25917O6815P115o7033
$$ plain form
16989 10108 45127 19361 4144 -65817 -138136 -106266 -29056 12145 -24057 -46630 -9952 14889
16977 14889 -1583 5523 3791 23595 -38806 -78573 -42201 -3950 -9958 -55099 -100431 -80772
16965 -80772 -128169 -79131 -38934 11131 98697 109056 56128 52215 1026 27648 86665 85882
16953 85882 82536 33039 -30339 -30572 -19249 727 -30831 -14599 -28794 -31374 12891 53868
16941 53868 61603 61221 36064 56967 48898 9026 -38306 -21161 2885 -7694 -33618 -54607
16929 -54607 -32390 11586 71866 107960 123163 68019 38605 57640 49176 83426 -7628 -5482
16917 -5482 1114 -32741 -34511 -71792 -52249 -30596 -24130 -13763 -9707 17497 21644 65568 61722
16904 61722 58147 72466 55096 61354 116659 102530 43043 1158 127075 193890 201005 133972
16892A33972j4458M2470l8242K8744O0323K4518j0228l3434m0476l7728j4351
16881A01110K3644L4859o292k5040j3050K7152M784j9661K545K3082R456p9906
16869H2683p2120L4740J17421K7589l0448k0347J2769m070k7692O656p8922m7226
16857A033j6601K2465p353N4504Q0571J5802J2180J1632p480m8482K2647J3078
16845A53996k1660l3580l0480J1537K6717k8903J8421k1538k6808M1476k3679
16834F5499j5823K5606L8770K6583k4719j8694K5711r592m9929M8575N4532K0239
16822A86758o3222o1847k1473m5690J5659L2243R850p838M3014K1873J032m417
16810A05942K2355l8494j4171J1016n595R478J1803L7480l374j9069r28l982r352
$$ plain form
16892 133972 119514 161984 123742 152486 212809 237327 227099 193665 153189 115461 101110
16881 101110 124754 159613 153321 128281 115231 142383 147167 127506 130051 153133 162589 82683
16869 82683 10563 45303 162724 190313 159865 139518 152287 148217 120525 127181 48259 1033
16857 1033 -15568 6897 -456 54048 134619 150421 162601 174233 166753 118271 140918 153996
16845 153996 132336 98756 68276 79813 106530 77627 96048 74510 47702 89178 65499
16834 65499 49676 75282 114052 140635 115916 97222 122933 113341 63412 111987 166519 186758
16822 186758 123536 61689 40216 -5474 10185 42428 52278 44440 87454 109327 110359 105942
16810 105942 128297 89803 75632 86648 81053 90531 102334 139814 136440 117371 116443 112461 103109
16797A03109m0365n7164r47P236j8930j6507L4826L7490J8466K5050P2387J9849
16785A84500L0081J3893L5314M7537N3847L8372N0054N9830R9164j1099n0394
16774E51099n9311m933P433K4719P5548L5467L7888P8853Q4796P5166N3689L5561
16762I95975k0601K5766J3467k7320N26j4846o9709o4967k8281k0828K4220K0960
16750H34362Q6519L7689p5740o5200N0253M499k6984l5917k025J1686j4674l5399
16738G69069N2590K831o1367L5760M6425L0181l4297m940o0218q0051K8310M1397
16726G65690l2263k6415L8685L5082P4811J5388m0977L694K3112J6191J1032k6043
16714H57987j3807K6090k989l1412K420O5488k4302J2033J437k5326k027L640
$$ plain form
16797 103109 62744 5580 4633 11869 -7061 -23568 11258 48748 67214 92264 164651 184500
16785 184500 214581 228474 263788 311325 365172 403544 453598 513428 612592 601493 551099
16774 551099 491788 486855 494288 519007 594555 630022 667910 746763 831559 906725 960414 995975
16762 995975 975374 1001140 1014607 987287 987813 972967 903258 838291 810010 789182 813402 834362
16750 834362 920881 958570 882830 817630 867883 872382 845398 809481 807456 819142 804468 769069
16738 769069 821659 824490 763123 798883 845308 875489 841192 836252 776034 695983 724293 765690
16726 765690 733427 707012 745697 780779 855590 870978 830001 833695 856807 872998 884030 857987
16714 857987 844180 870270 867281 835869 838289 903777 879475 891508 892945 867619 865592 869232
16702H69232J1001K5539O917p4698k171J09296N1944J8590P2129N2990j6859j4491
16690A109419M3372P2840L3345J7203K9944K5691K301R3763O9929M0160J47523
16679A685490J54217K02493K13239J99067J11830K7708k016N8237R7770J71031
16669B919066K65167L42748M23256M33615M62599L67728M04649L80950L58367
16660F358145M18406N84167R58164J415973K200285L485432N430101Q583741J3675745
16651D3110159J9603896K3005977J8317209P99463j9408914k2524689j4325724
16644D8577377o766194j492277K829000P809249J4611778K3029349L0278285L1486630
16636A50363197K0419889J518996j0998746k3564025l2254994k6192498j5793045
$$ plain form
16702 869232 880233 905772 912689 837991 835820 945116 997060 1015650 1087779 1140769 1123910 1109419
16690 1109419 1152791 1225631 1258976 1276179 1306123 1331814 1334115 1427878 1497807 1537967 1685490
16679 1685490 1839707 2042200 2255439 2454506 2566336 2594044 2592028 2650265 2748035 2919066
16669 2919066 3184233 3526981 3950237 4383852 4846451 5214179 5618828 5999778 6358145
16660 6358145 6776551 7360718 8318882 9734855 11935140 15420572 20850673 29434414 43110159
16651 43110159 62714055 85720032 104037241 104836704 85427790 62903101 48577377
16644 48577377 41811183 40318906 43147906 50957155 65568933 88598282 118876567 150363197
16636 150363197 170783086 172302082 161303336 137739311 105484317 79291819 63498774
16629F3498774q327441l448840O98460N518546J1565560J7509358J9483826J1761700
16621A18259943p711738k3859186k2404171j4310864q544630n465257l764835
16614C2199262k840472k458567k010789j522237j127869r42839p80624n30671
16606A9985194n91667n84717m89328o30451p59771p37104o73276o78699n77598
16597A4262583m38575l54840l68250k87762k63796l18961l58194m66951m26979
16588A0978275l13315k75431k73067k06116k70340k69844k47970k05649k21434
16579H695109k14300k63519k16135j88434j11689j20172j98385j82320j62890
16570G037265j32021k31775j81073p9186j11080j63593j92388j32086j29862j69301
$$ plain form
16629 63498774 55171333 51722493 52420953 57939499 69505059 87014417 106498243 118259943
16621 118259943 110548205 86689019 64284848 49973984 41429354 35964097 32199262
16614 32199262 29358790 26900223 24889434 23367197 22239328 21296489 20515865 19985194
16606 19985194 19393527 18808810 18319482 17689031 16929260 16192156 15518880 14840181 14262583
16597 14262583 13824008 13469168 13100918 12813156 12549360 12230399 11872205 11405254 10978275
16588 10978275 10664960 10389529 10116462 9910346 9640006 9370162 9122192 8916543 8695109
16579 8695109 8480809 8217290 8001155 7812721 7701032 7580860 7382475 7200155 7037265
16570 7037265 6905244 6673469 6492396 6413210 6302130 6138537 5946149 5814063 5684201 5514900
16560E514900j10945j00438r5247j09542j19422j22032q3768o0308m7559m3090
16550D622549p5218j40848j34349j44466j18267k9137p7674q3399j08170p7197
16540C633824k5662q7669q7389j5119l2865o6051j48398o9552n2222j5807j9479
16529C013611l3387l2717N1417l0532j8315M6362j8300k8502n9329q6126o3932
16518B740250J4384K6285j1030p7602m8834J2275P9570L6839m2236n3438k7606
16507B648857j01117n9569o5617k0066r1107n5728O3545k4002o2715o646M0873
16496B266708q5499j29343J0499k0100p9983n9035r808m1581o1823n0520m6491
16485A693024J8942m3252q2644m6488o474j1482n3342l7756n4061J5969j735M904
$$ plain form
16560 5514900 5403955 5303517 5208270 5098728 4979306 4857274 4773506 4713198 4665639 4622549
16550 4622549 4547331 4406483 4272134 4127668 4009401 3980264 3902590 3819191 3711021 3633824
16540 3633824 3608162 3520493 3433104 3417985 3385120 3319069 3170671 3101119 3048897 3033090 3013611
16529 3013611 2980224 2947507 2998924 2968392 2950077 2996439 2978139 2949637 2890308 2804182 2740250
16518 2740250 2754634 2780919 2769889 2692287 2643453 2655728 2735298 2772137 2729901 2676463 2648857
16507 2648857 2547740 2488171 2422554 2402488 2311381 2255653 2319198 2295196 2232481 2225835 2266708
16496 2266708 2181209 2051866 2062365 2042265 1962282 1903247 1893439 1851858 1790035 1739515 1693024
16485 1693024 1711966 1668714 1586070 1539582 1533108 1521626 1468284 1430528 1376467 1392436 1390701 1395605
16473A395605l8548q4143m5203r5937r8406J0683Q7312K4522j0600k9075L1885
16462A148095j01601p7380n6845j4286M124j4491k6909J6538K5993l0858K0859
16451H93239m778K7801N0862N8088p8429r4617o9633p887J7227k5056O5126L351
16439H35294o9551l2246Q610r17K7673j9744o1720m0872n5967l7269j599r47J8836
16426E69581K2111m5584p9507n1946m5782L4844L5327J7835J5040q565q667K022
16414D56709O8566l757l4132n8761l899O093j5196j4132k1301j611k6533o624
16402C45422j9695M152K8037M6530L8537J8651M245q3648k5159l4194m2667m8614
16390B31597n674L420Q8328N4580k6947o9586k3060q711j1758K7342q520m8415
$$ plain form
16473 1395605 1357057 1272914 1227711 1131774 1033368 1044051 1131363 1155885 1145285 1116210 1148095
16462 1148095 1046494 969114 912269 897983 902107 887616 860707 877245 903238 872380 893239
16451 893239 888461 916262 967124 1025212 946783 852166 782533 774646 791873 766817 831943 835294
16439 835294 765743 733497 742107 741190 768863 749119 687399 646527 590560 553291 551692 550745 569581
16426 569581 591692 546108 466601 414655 368873 403717 439044 456879 471919 463354 454687 456709
16414 456709 525275 521518 487386 428625 424726 430819 415623 401491 380190 378579 352046 345422
16402 345422 325727 329879 357916 404446 442983 461634 465879 382231 357072 322878 280211 231597
16390 231597 225923 229343 317671 372251 345304 275718 252658 243947 232189 259531 251011 202596
16378B02596M1669L8277k806q2971j0451J2551M270L0948l1280m4561M0746K7265
16366B26253k4511l7750n430l1542J7625K1212J3229j6344o5026k219N2978L0813
16354A79288l6538l1557k0386K1158K1541K4156K9626r2638l8969k627J5179J6818
16342H5051N8289J076j7652m7284J7955K9977L1996L0161m6326l2638M321l0630
16330H4296p9143J323O6695j2753l352Q815k2161l9676r4487n428M5026K5252
16318b5593N1427M1496k0789R734p0083j4970L0948K3056R1712o7948p4313k9063
16306e4386j2596O3940M589k0814L3666P146j7619L6125k633r167k3302j5645
16294a0696L365o9375L4240l232k9628j4099j7201J4141N9731K9732j6672L524
$$ plain form
16378 202596 244265 282542 279736 196765 186314 198865 203135 234083 202803 158242 198988 226253
16366 226253 201742 163992 158562 127020 144645 165857 179086 162742 97716 95497 148475 179288
16354 179288 142750 111193 90807 111965 133506 157662 187288 94650 55681 53054 68233 85051
16342 85051 143340 144416 126764 79480 97435 127412 159408 189569 143243 110605 114926 84296
16330 84296 5153 6476 73171 60418 57066 65881 43720 4044 -90443 -95871 -50845 -25593
16318 -25593 25834 67330 46541 56275 -13808 -28778 2170 25226 116938 48990 -25323 -54386
16306 -54386 -66982 -3042 1547 -19267 14399 21545 3926 40051 37418 28251 4949 -10696
16294 -10696 -7331 -76706 -42466 -45698 -75326 -89425 -106626 -92485 -32754 -3022 -19694 -16170
16282a6170p8373K1793M0312l5972L0984j5330l5082O5698M3913j5598l1965m1871
16270f7661q374J5468L5973k0264L7187P911j2905M2089O2185K9808p8922o4130
16258b1635k6748N3230N2946k7212l940L8662K4726m0680R901l5901k6447j9662
16246b2760M018K5675K8668J0854o8385l0616K109L6508K6153J9324P2374L2992
16234A36914j1768n5942m9212L1735n2237p9260k0994L7242O2550j6155O833P7132
16222F6838J6065m4560j00907J1374L7621o492n3454l488j8520m451J8471k9889
16210a11392o874K8184n864Q206L3762l1290j1079K6585J9062M5437K2183K8069
16198D4989k7693j8487m5630L6088r408J2515l5844Q449l0794K3086L3024l5433
$$ plain form
16282 -16170 -94543 -72750 -32438 -68410 -37426 -52756 -87838 -22140 21773 6175 -25790 -67661
16270 -67661 -76035 -60567 -24594 -44858 -7671 240 -12665 29424 91609 121417 42495 -21635
16258 -21635 -48383 4847 57793 30581 26641 65303 90029 49349 59250 23349 -3098 -22760
16246 -22760 -18742 6933 35601 46455 -21930 -52546 -50437 -13929 12224 31548 103922 136914
16234 136914 125146 69204 19992 51727 -510 -79770 -100764 -63522 -972 -17127 -10294 66838
16222 66838 82903 38343 -62564 -51190 -13569 -20061 -73515 -77003 -95523 -99974 -81503 -111392
16210 -111392 -118266 -90082 -95946 -87740 -53978 -85268 -96347 -69762 -50700 -5263 16920 44989
16198 44989 17296 -1191 -46821 -10733 -20141 -7626 -43470 -35021 -65815 -42729 -9705 -45138
16186d5138j5814j8003l6209l5803j1392P045K3647o830N9337R235J8331m5022
16174i6616j2939K2652J7296L0509M0517M7436m8916m9698j01811L0607K6325
16163i4638M4807J723j9973o2736n300L5907j0256M4846J0843J1917q541j5825
16151f7226k9270J6166j2974K329l068K8091M5416j5874l4697M5405k9767J100
16139e4369O69k6899o1740M1453N7544K2003k6875l4322N4963M0139m8777l6957
16127g3168P7923Q8591m5295p4790j5551J6112l994K6761J1363n6250K2727O0046
16115C4475n4387q0834K3352M2575M3056R604j7005j4259P864k1250L3095l5604
16103b9318j4572J168p9409J3868M3318J8994o3455o9921N9735J4149J4737Q7518
$$ plain form
16186 -45138 -60952 -78955 -115164 -150967 -162359 -155314 -131667 -138497 -79160 -69925 -51594 -96616
16174 -96616 -109555 -86903 -69607 -39098 1419 48855 -61 -49759 -151570 -120963 -94638
16163 -94638 -49831 -48108 -68081 -130817 -136117 -100210 -110466 -65620 -54777 -42860 -51401 -67226
16151 -67226 -96496 -80330 -93304 -90975 -94043 -65952 -20536 -36410 -71107 -25702 -55469 -54369
16139 -54369 -53700 -80599 -142339 -100886 -43342 -21339 -48214 -82536 -27573 12566 -36211 -73168
16127 -73168 4755 93346 48051 -26739 -42290 -26178 -30172 -3411 7952 -48298 -25571 34475
16115 34475 -19912 -100746 -77394 -34819 8237 17841 836 -13423 -5559 -26809 6286 -29318
16103 -29318 -43890 -42722 -122131 -108263 -64945 -45951 -109406 -179327 -119592 -105443 -90706 -3188
16091c188k0343P7712O6689k066O469J18394R5897K4457J4925p6083q9006o6430
16079A47427K5324Q8320l0012M5950Q6800J17476J93065K16742Q7550k1895j02523
16068H54224j80202j08420j49906j29940l3853J2836l3929L8232J27771J72622
16058E69435Q1009o208j01092j20100q6296r8840m0717m6621k3757k9761j0062
16047H6990j0610N3457p75o1040k0978n0256j2757L2611N2192P297j4061l267
16035E8803j0473o170n5825o22M3772K7721l3299j6665K6154M4882m0396o1326
16023b3444k9172J267L2685L5731q8n8155Q307O4781q313j2763N9016k7989n3173
16010a1310j3999j3422P6393j3544K2182j5506n5559n4137m300K711j501K4316
$$ plain form
16091 -3188 -23531 54181 120870 118804 125273 243667 339564 364021 378946 302863 213857 147427
16079 147427 172751 261071 231059 277009 363809 481285 674350 891092 978642 956747 854224
16068 854224 674022 565602 415696 285756 251903 264739 230810 269042 396813 569435
16058 569435 650444 644236 543144 423044 336748 237908 197191 150570 126813 97052 86990
16047 86990 76380 129837 129062 68022 47044 -3212 -15969 16642 68834 76131 62070 58803
16035 58803 48330 42160 -13665 -14287 29485 57206 23907 7242 33396 78278 37882 -23444
16023 -23444 -52616 -51349 -18664 17067 16979 -41176 -32869 31912 23599 10836 69852 41863 -11310
16010 -11310 -25309 -38731 37662 24118 46300 30794 -24765 -78902 -83202 -80491 -81992 -57676
15998e7676l0016J3883O2946O7794K9079j3258m5303J3376m9352Q714l0812j1386
15986d2011L6927m7593K2641j4735m1731j0022N624O344p985J1345N7172M3356
15974A9332k2520M90j1261K0828Q348l3353r543p593K7585K9367K696J5173q963
15961C0586n1088k2400J3305N4500L8292n2080j08629K1966J13316L7015p6565
15950a782k2458k0061j9500n3970p365M9442L4012N8191l6899Q815K574Q622K256
15937A877K1906J3105j4393Q37q2433o0845K8279N5002j069o3528J1986K9404
15925e9872L0991O963N2706K0182m0088o4000L6241K2490q352J9641k074Q541
15913B3369j7959m2906n0302J3306L21j7203M9063J9879m534M366Q590L5569k5991
$$ plain form
15998 -57676 -87692 -73809 -10863 56931 86010 72752 27449 40825 -8527 187 -30625 -42011
15986 -42011 -5084 -52677 -30036 -44771 -86502 -96524 -90900 -84556 -92541 -81196 -24024 19332
15974 19332 -3188 -2698 -13959 6869 15217 -18136 -27679 -35272 -7687 21680 24376 39549 30586
15961 30586 -20502 -42902 -29597 24903 63195 11115 -97514 -75548 37768 74783 -1782
15950 -1782 -24240 -44301 -63801 -117771 -125136 -75694 -41682 16509 -20390 -11575 -9001 -379 1877
15937 1877 23783 36888 22495 23332 -59101 -119946 -91667 -36665 -37734 -101262 -89276 -59872
15925 -59872 -28881 -21918 30788 50970 10882 -53118 -16877 5613 -2739 16902 14828 23369
15913 23369 5410 -37496 -87798 -74492 -74171 -91374 -42311 -22432 -26966 -22600 -14010 21559 -4432
15900d432k5746l3032k8358L7030O5021k8811k0008J0676p392p3K2033N2786J2253
15887E1947n7706j0412m5865J3260N6559M8427L1635o6482n2560J2713j2924k3772
15875e5180J553J1206m7426P2397M8690l7639k8498J4434K9186j8631l2205k2042
15863f4155L6724O5174r3994n5392K9652k9920r627N6646O7303N9704N2066l3103
15851H1078n3602n9069K0995M2970j5719P724k1855J8592J118j1788Q587n4388
15839c5357l6617R1507K2128k9907l3898J2901K1324R9411k2520j7345j0088n0603
15827A0936r299k276m9639j1576M3064O4843o3475Q365N1531J1270n8613o835
15815a1704N455o838N2329P1680K6694l0466j4175n9102m6613K4550j6516K6746
$$ plain form
15900 -4432 -30178 -63210 -91568 -54538 10483 -18328 -38336 -27660 -35052 -35125 -13092 39694 51947
15887 51947 -5759 -16171 -62036 -48776 7783 56210 87845 21363 -31197 -18484 -31408 -55180
15875 -55180 -53627 -42421 -89847 -17450 31240 -6399 -34897 -20463 8723 -9908 -42113 -64155
15863 -64155 -27431 37743 -56251 -111643 -81991 -111911 -121538 -64892 2411 62115 114181 81078
15851 81078 27476 -31593 -10598 32372 16653 24377 2522 21114 22232 10444 19031 -35357
15839 -35357 -71974 19533 41661 11754 -22144 -9243 12081 111492 88972 71627 61539 10936
15827 10936 1637 -639 -50278 -61854 -18790 46053 -17422 -9057 42474 53744 -4869 -11704
15815 -11704 -6249 -13087 39242 110922 137616 107150 92975 33873 -12740 11810 -4706 22040
15803B2040n757m4776j0022P6131J6927j6065J13020p286J699l1030o1K634n9339
15790E8115n5645Q924O312r42L9370J7721K4821q793p4387n4974J407J681q465
15777d4855M0508L7379J3739o923m402m3282l9639N4170M887K2153k0816K6433
15765C9352m507n1272k9601k777J690J9675j9821N001M8671P7105L7621m5991
15753G5146k2412l5793k1208l800N862Q7108L9806K6768l573k0008R089j3653
15741A23332j7886J6638o2701K8988M6993n3929m295k7837o0283N7374R141m3223
15729A2312m6643r511J6111j0588J7118Q5622P3046k412j6122n9536n3593O008
15717A1812M2749j4594M764J1302o012j2691r800O316L0616L5183O0539m2114
$$ plain form
15803 22040 16283 -28493 -38515 37616 54543 38478 151498 144212 145911 114881 114820 117454 58115
15790 58115 2470 11394 17706 16764 56134 73855 98676 89883 15496 -39478 -38071 -36390 -44855
15777 -44855 -4347 33032 46771 39848 35446 -7836 -47475 6695 11582 33735 12919 39352
15765 39352 34845 -16427 -46028 -48805 -47115 -27440 -47261 -42260 6411 83516 121137 75146
15753 75146 52734 16941 -4267 -8067 -2205 84903 124709 151477 147904 127896 136985 123332
15741 123332 105446 122084 59383 88371 135364 81435 77140 49303 -10980 46394 55535 12312
15729 12312 -34331 -43842 -27731 -38319 -21201 64421 137467 135055 118933 59397 5804 11812
15717 11812 54561 39967 44731 56033 50021 37330 27530 33846 64462 99645 160184 118070
15705A18070o2189o6001M2545Q181J489O297q5224P056K5256k5044O293K4525
15693A254P0065R6274K4930m1346m7769k2960J9234q2n141J2428l8592l9935k4111
15680D249p402K427R3575j4586l9635k6425k3345M8310K6203J117J3590m340j8106
15667E5632l7064R829j6811p5438k7812j6485M9399O0325o753m2354M5409N4443
15655E2320n0419n1491J1165J8023O4259p7886l5129M1223J9170J7170k1207m3671
15643e6473R959R5232J9282l0613k244L1009l2188m5972L9058N6275o2829j7393
15631C103N5048K3318N1593K3734J0992m5507j23217l4401j1591k4520K7387P158
15619c6903O1931L233k0031L7487J4550m5535Q410m6307K639N4366K2710L3481
$$ plain form
15705 118070 55881 -10120 32425 40606 42095 48392 -36832 -29776 -4520 -29564 -23271 1254
15693 1254 71319 167593 192523 151177 103408 80448 99682 99600 94459 106887 68295 28360 4249
15680 4249 -3153 -726 92849 78263 38628 12203 -11142 37168 63371 64488 78078 73738 55632
15667 55632 18568 28397 11586 -63852 -91664 -108149 -58750 1575 -5178 -47532 -2123 52320
15655 52320 1901 -49590 -38425 -20402 43857 -34029 -69158 -27935 -8765 8405 -12802 -56473
15643 -56473 -46514 48718 68000 37387 35143 66152 33964 -12008 27050 83325 20496 3103
15631 3103 58151 81469 133062 156796 167788 122281 -936 -35337 -46928 -71448 -44061 -36903
15619 -36903 25028 28261 8230 45717 60267 14732 23142 -23165 -20526 33840 56550 90031
15607I0031J6558M9155O3046J9846J0489O475n3306M3846K6381J2415q2029J1953
15595B14860M6838O4716P801l9874J4752K1621L0632L6690J15059K46099J93853
15584I53047J87423K79405K46533J86327J62348K00129J69469p1705j27936j16218
15574B068822k40783j89256j48260j69470k39168j65723k7716q3193j42780r2100
15564E70373n29j4224l1150q6875O829L8854n9900j24618M499n1772q754K5639
15552B68372r436l7330K3543o798j2140N8445L5348J7780P760o5077q761j8128
15540B53578n4856L8667L7799k1927l2094m4616n2884K6185m3988j9542O0633
15529A46955O2715J3707K765k3332K3898n2461j066j7477l5982n02K4934j6430
$$ plain form
15607 90031 106589 155744 218790 238636 249125 255600 202294 246140 272521 284936 202907 214860
15595 214860 261698 326414 334215 294341 309093 330714 361346 398036 513095 759194 953047
15584 953047 1140470 1419875 1666408 1852735 2015083 2215212 2384681 2312976 2185040 2068822
15574 2068822 1828039 1638783 1490523 1321053 1081885 916162 888446 805253 662473 570373
15564 570373 569844 555620 524470 437595 444424 483278 423378 298760 303259 251487 242733 268372
15552 268372 258936 221606 245149 238351 226211 284656 320004 337784 345544 280467 271706 253578
15540 253578 198722 237389 275188 253261 221167 176551 123667 149852 105864 86322 146955
15529 146955 209670 223377 226142 202810 226708 174247 173181 155704 119722 119220 144154 127724
15517A27724l7264p448L507o6O1283m0332m6659L5554p11j5509N4705L554j4753
15504A23585L8612K2578l036l4365o614o133k5605K7516r3285j5048N4211M8618
15492A31034K2683k9380k7734k1365j2813J5620J02058j3563j5473J4630J8295
15481A83992K444j8754O424l1792k4993m0416N2970K8725K4222R3762n7078m3503
15469A76003q1713k3689j9034l6674N7991P2130K3357l1164j110P5600l8594m4528
15457A28575o143M0563K1567N2367R6896J7457K615p5686m5897K75P528o9630
15445A70487q262K0440O1632K9776J1647l8706o5033j7185J0141o4886J67L7985
15433A48203O3M9997O8076J4436n0983m9190K3820o3079o5263o2510K7049Q0553
$$ plain form
15517 127724 90460 83012 86519 86453 147736 107404 60745 96299 95588 80079 134784 138338 123585
15504 123585 162197 184775 181739 147374 140760 134627 109022 136538 43253 28205 82416 131034
15492 131034 153717 124337 96603 75238 62425 78045 180103 166540 151067 165697 183992
15481 183992 186436 167682 174106 142314 117321 76905 129875 158600 182822 276584 219506 176003
15469 176003 94290 70601 51567 14893 72884 145014 168371 137207 136097 211697 173103 128575
15457 128575 122432 162995 184562 236929 333825 351282 353897 278211 232314 232589 240117 170487
15445 170487 162225 182665 244297 274073 285720 247014 181981 164796 174937 110051 110218 148203
15433 148203 148266 198263 266339 280775 229792 180602 204422 141343 76080 13570 40619 121172
15421A21172M2001J7930p5066k5749k0123K4636J239K5948N3675o786j1507M6587
15409A93957K1744L3191K551k9082j1655j8207K2490k3165O762P8589N7102O796
15397C41073L3208M0263k0757L3604K8188K849o2443R568N5757l0381q6678k1458
15385C22793K5862K1311j199j9401n9742p8301M208K8446k8146k0603J1104J9424
15373B25756j2574j4833J484j8285K9563P0108M470l0423m7956K1771P9007M5422
15361C53510q1696K5625r171L2701K5379k187j4447j7534m1398J3184N0612o0463
15349B74115K0460K1794M1622l0170J5326K2797K0417R98p2013j5093N92J989
15337C02834n298K4023M4952k1939m1973m300K3545L2299j7817l4972M5819M8812
$$ plain form
15421 121172 163173 181103 106037 80288 60165 84801 86040 111988 165663 158877 147370 193957
15409 193957 215701 248892 251443 222361 210706 192499 214989 191824 198586 277175 334277 341073
15397 341073 374281 414544 393787 427391 455579 458428 395985 405553 461310 430929 344251 322793
15385 322793 348655 369966 368767 349366 289624 211323 215531 243977 215831 195228 206332 225756
15373 225756 213182 198349 199833 181548 211111 281219 285689 255266 207310 229081 308088 353510
15361 353510 271814 297439 288268 320969 346348 344161 329714 312180 270782 283966 334578 274115
15349 274115 294575 316369 357991 327821 343147 365944 386361 387359 315346 300253 300845 302834
15337 302834 297536 321559 366511 344572 302599 298299 321844 354143 336326 301354 347173 395985
15325C95985l2997k5248q588j227r325J4893l9456J9532N6369M0304L1955k0021
15313D22176n2782k2198O040j888K9519J1783K9112J6035K8946K9564o3548m7488
15301C85271j9266j9657q529P1965J7519l8757l4953j5734J0632K7306J4348R919
15289D00064M0012L6740R509J07967j2108k7408K0278R1834Q9938J9622o5569
15278G10879L5451Q4181O1806J13503J88459J37240J98232J39861K15542K26016
15268B111170J81584K09053J10709L5430K462L7504j4157n8275j42376j08486
15258B364618j20040r7713q5261r3367j06767R756n495k4397l4383l0682R813
15247A786082j3624l2473L7845p2650l4609j6225k9155L178j495m11J0605N7981
$$ plain form
15325 395985 362988 337740 329152 327925 318600 333493 294037 313569 369938 410242 442197 422176
15313 422176 369394 347196 353236 351348 380867 392650 421762 437797 466743 496307 432759 385271
15301 385271 366005 346348 337819 409784 427303 388546 353593 337859 348491 375797 390145 400064
15289 400064 440076 476816 486325 594292 582184 554776 575054 666888 756826 776448 710879
15278 710879 746330 830511 892317 1005820 1194279 1331519 1529751 1669612 1885154 2111170
15268 2111170 2292754 2501807 2612516 2647946 2650408 2687912 2673755 2615480 2473104 2364618
15258 2364618 2244578 2146865 2061604 1968237 1861470 1871226 1865731 1841334 1806951 1776269 1786082
15247 1786082 1772458 1739985 1777830 1705180 1670571 1654346 1625191 1628369 1626874 1626463 1637068 1695049
15235A695049k7904q8708l611J6114l5666K8604K6748o377r987K9808l1783j9694
15223A572593R7875O1334k9646J9421r39N5485M505j0093O6032O3523m682j6648
15211A878760p1111p4453m966k0118j515L0197j6787J0772J2550K0634l5619k241
15199A726103N5757J10630N0211Q469O6984J9466J4260J10156K5479K4293L2549
15188B244357M9197J08884J27443L6353O8786O3777R6251Q5134R0072N3452R7625
15177C121331J06983N9697J49814J52295J39002J03365J71673K69342L09874L29898
15167D913274M04218M65147N38589O11086P28498Q08757J020109J267102J515115
15158A2271895J836542K203642K523071K864218L257581L837972M743961O177888
$$ plain form
15235 1695049 1667145 1578437 1574826 1590940 1555274 1583878 1610626 1604249 1594262 1624070 1592287 1572593
15223 1572593 1670468 1731802 1702156 1721577 1720638 1776123 1780628 1770535 1836567 1900090 1895408 1878760
15211 1878760 1807649 1733196 1728230 1708112 1706597 1736794 1720007 1730779 1743329 1763963 1728344 1726103
15199 1726103 1781860 1892490 1942701 1951170 2018154 2037620 2051880 2162036 2187515 2211808 2244357
15188 2244357 2293554 2402438 2529881 2566234 2635020 2698797 2795048 2880182 2970254 3023706 3121331
15177 3121331 3228314 3288011 3437825 3590120 3729122 3832487 4004160 4273502 4583376 4913274
15167 4913274 5317492 5782639 6321228 6932314 7660812 8469569 9489678 10756780 12271895
15158 12271895 14108437 16312079 18835150 21699368 24956949 28794921 33538882 39716770
15150C9716770Q493269J2408395J8402948K6522739L5639090M3369536M7891395
15143B32444142M8795599M7074410M3525137L6443888K5042685Q125160r992818
15136D31458203k5344078l5283715m0131620m2828341m3396417m1913948l6899080
15129A65661004k9370503k1173510j4427652j0123446p572358o101898n161317
15122G1730320m483389m026990l679244l371824l111817k904721k555078k280570
15114D5316687k156578j963009j671934j484008j474805j310902j172571j104537
15106C2978343j043868r73120r68681q84863q33767q42427p38387p34086p22418
15097B5236726o96295o76452o00401o07091o43666n45972m35842m89776m96420
$$ plain form
15150 39716770 48210039 60618434 79021382 105544121 141183211 184552747 232444142
15143 232444142 281239741 328314151 371839288 408283176 433325861 441451021 431458203
15136 431458203 406114125 370830410 330698790 287870449 244474032 202560084 165661004
15129 165661004 136290501 115116991 100689339 90565893 82993535 76891637 71730320
15122 71730320 67246931 63219941 59540697 56168873 53057056 50152335 47597257 45316687
15114 45316687 43160109 41197100 39525166 38041158 36566353 35255451 34082880 32978343
15106 32978343 31934475 30961355 29992674 29107811 28274044 27431617 26693230 25959144 25236726
15097 25236726 24540431 23863979 23263578 22656487 22012821 21466849 21031007 20541231 20044811
15088B0044811m89145m09180l87343m14374m90796l97346l54227l65245l99306
15079A6337849m18999m19516m05090m18044l55662l06226k98260l20150l52100
15070A3043802l43404k96772k73953k61274k74604k40589k18051k33097k38743
15061A0663315j07551j37158j99178j97635k15553k47462j78002j87706j55157
15052I037913j95126k24108k04918j95713j33855k32147k29662j04969q6738j47761
15042G282916j87598j53084j13855j34018j91208j13549j20224j47930j47172
15033E974278j50840j64890o8553k8422R215r9541j08886l0767k9234K30k6556
15022E276034j2021R8906J55826J41131J24767J44290J01033M4436J07874J06324
$$ plain form
15088 20044811 19555666 19146486 18759143 18344769 17853973 17456627 17102400 16737155 16337849
15079 16337849 15918850 15499334 15094244 14676200 14320538 14014312 13716052 13395902 13043802
15070 13043802 12700398 12403626 12129673 11868399 11593795 11353206 11135155 10902058 10663315
15061 10663315 10555764 10418606 10219428 10021793 9806240 9558778 9380776 9193070 9037913
15052 9037913 8842787 8618679 8413761 8218048 8084193 7852046 7622384 7517415 7430677 7282916
15042 7282916 7095318 6942234 6828379 6694361 6503153 6389604 6269380 6121450 5974278
15033 5974278 5823438 5658548 5589995 5561573 5570788 5471247 5362361 5331594 5302360 5302590 5276034
15022 5276034 5264013 5362919 5518745 5659876 5784643 5928933 6029966 6074402 6182276 6288600
15012F288600l1354j00498j08299k02157j77960j44937r1373j36389j73302j47563
15002D974768j20683j96268k05400j12088j15963j34438j03540j53277r6551o9110
14992C667450p0354q7959j22418n9729k5198j695k7289m3418j59102j15097q2624
14981B872567k5782k2369j91j6896l9723o7452o7062j0020r2389o1497M0573j7394
14969B492365p3115p5622n3926m1034j4077o7240l8647k0839J193n0053Q264m1720
14957B025549m8803j0419m9265j7030J4634j9268l0960n7626p0581n1565k5160
14946A659506m4886n4107l4472q0426k9523K8935O2634Q282o2055k7683j19194
14935A307011l4595L0712l6847l5208m1301p9471j041J4968J8633j9461l4268
$$ plain form
15012 6288600 6257246 6156748 6048449 5846292 5668332 5523395 5432022 5295633 5122331 4974768
15002 4974768 4854085 4657817 4452417 4340329 4224366 4089928 3986388 3833111 3736560 3667450
14992 3667450 3597096 3509137 3386719 3326990 3301792 3300097 3272808 3229390 3070288 2955191 2872567
14981 2872567 2846785 2824416 2824225 2807329 2767606 2700154 2633092 2623072 2530683 2469186 2509759 2492365
14969 2492365 2419250 2343628 2289702 2248668 2234591 2167351 2128704 2107865 2109058 2059005 2067269 2025549
14957 2025549 1976746 1966327 1917062 1900032 1914666 1895398 1864438 1806812 1736231 1684666 1659506
14946 1659506 1614620 1560513 1526041 1445615 1416092 1445027 1507661 1515943 1453888 1426205 1307011
14935 1307011 1272416 1303128 1266281 1231073 1189772 1110301 1109260 1124228 1142861 1123400 1089132
14924A089132k7555o4305L1134K0875J4457m885K9354o1805K127k6135r3064n0648
14912H58682j9161L922m5781m080K6446j4260K7314K0160p4126n0858m5956O8169
14900G50471M2261J9550J700k3592P149n1266K9816m2621M388P0271p0362j07092
14888F30673K864l4927M830j1138M087q307L16O647K4749m5668m6107O4044j1104
14875E80959r0555j4916K8877J0589p7347q7636L0686m3336M9494j2301j6841
14864C57673J515J4955O34k9911n7373J1200Q4638k275k2687m5148j2369J1276
14852C12128j3524n8658j591N3451j2119j084L4571j0791N733m8964k710R532
14840B65974j7086m4560r3375m686n346o2818n1348l9537l5932J164Q3060N4661
$$ plain form
14924 1089132 1061577 997272 1028406 1049281 1063738 1058853 1088207 1026402 1028529 1002394 909330 858682
14912 858682 839521 843443 797662 793582 820028 805768 833082 853242 779116 728258 682302 750471
14900 750471 792732 812282 813982 790390 797539 746273 776089 733468 737856 808127 737765 630673
14888 630673 633537 598610 603440 592302 596389 588082 588398 595045 619794 574126 528019 592063 580959
14875 580959 490404 475488 504365 514954 437607 349971 380657 337321 386815 374514 357673
14864 357673 359188 374143 374777 344866 287493 298693 383331 381056 358369 313221 300852 312128
14852 312128 298604 239946 238355 291806 279687 278603 313174 302383 308116 259152 256442 265974
14840 265974 248888 204328 110953 106267 100921 38103 -13245 -52782 -88714 -87550 -4490 50171
14828E0171K0043K0120j2286j7984l3031m296J5201J4125P12N4164j0781k2506
14816G3652K0136l5325K1646L7102N669m8162r069n168K4692j655q6491O495M9022
14803E2544L1976M2971m1798k0678N0664k2891l7548l9768M576J3820l737N622
14791C5753K5122k9780k3868l2740J1603K8150Q4159L8304J6429j7250n2266k3075
14779F0541J8103K9629k9863J3786k1551J332m9293k4060o638K5326l6377M5264
14767B6199l7141M2462r97j3590m7595P657M2399j3186q791j03591M3535J56402
14755I3763O8014J571P5167o0427j56202k8677R0313L6635l1323k1084K3308L9596
14743A30654M5205O5973P1814j9455p4587r5002n8940n7613j0516k5411N8378
$$ plain form
14828 50171 70214 90334 78048 60064 27033 22737 37938 52063 52775 106939 96158 73652
14816 73652 93788 58463 80109 117211 122880 74718 65649 60481 85173 83518 -2973 3522 52544
14803 52544 84520 127491 85693 65015 115679 92788 55240 15472 20048 33868 30131 35753
14791 35753 60875 31095 7227 -25513 -13910 14240 98399 136703 153132 135882 83616 60541
14779 60541 78644 108273 78410 92196 70645 71977 22684 -1376 -8014 17312 -19065 26199
14767 26199 -10942 31520 30523 16933 -30662 -23005 19394 6208 -2583 -106174 -62639 93763
14755 93763 161777 163348 238515 178088 21886 -6791 83522 120157 88834 67750 91058 130654
14743 130654 175859 241832 313646 294191 219604 124602 65662 8049 -2467 -27878 30500
14732C0500K6324k2949R670M5269o8616k4168K6505l3040l3180l685J9532M2842
14720A5004l9473l988J7247l5532Q495M0756O4884j438j8641N3809J5317J0073
14708A26513J07332M2871q6122j8807O5135J00780J23222J25291J64496K33023
14698I83734K84819L08254L39361K11708J23581R9307n4265q8243j01721j38249
14688A968286k57022j75595j73448j91484j93532j65673j43627j48563q9993m1068
14678C88281j828k4696j08588p9691n0658p41K2549n655o9423m5842M0147J36084
14666A99939K0141p027m6776p2634k8272N3354L6744Q952k8481j1911K6081k9967
14654A20143L424k3261L66K3137k7968p1806l7764M4937J8822l3435L884K3288
$$ plain form
14732 30500 56824 33875 43545 88814 20198 -3970 22535 -10505 -43685 -47370 -27838 15004
14720 15004 -24469 -28457 -11210 -46742 -38247 2509 67393 65955 47314 101123 116440 126513
14708 126513 233845 276716 190594 171787 236922 337702 460924 586215 750711 983734
14698 983734 1268553 1576807 1916168 2127876 2251457 2350764 2296499 2208256 2106535 1968286
14688 1968286 1711264 1535669 1362221 1170737 977205 811532 667905 519342 429349 388281
14678 388281 386453 361757 253169 173478 122820 122079 144628 138973 69550 23708 63855 199939
14666 199939 220080 213053 166277 93643 65371 118725 155469 164421 135940 124029 150110 120143
14654 120143 123567 100306 100672 123809 95841 24035 -13729 31208 50030 16595 20479 43767
14642D3767j2248o7986k2342N1010l6579o0504l369L0926j8457j7343J1094O2331
14630c9700J269L9512J5288K1803N649m8581m2157O924M9927N458N7746l109L066
14617G3095k0079l5970j9568j4802k8764J2011M2543M0410J3975L2207L9179O674
14605A40911k2674r1579k2909k777j1360l5052k9185N9202J5629j6491n0970K4843
14593d2412J7481J5653j058j8972n3699j1813K8638M4761M7150j4995J9880J8528
14581D9142j6844n7610K9544n654n5091k2631O005j7175k4993n8223J9944M4422
14569a09164R6312K0903n6824J4831Q8908k0233p325j4877j5278j9620L7546l2630
14557a7451q7164J9712O3339K5128K8588l474m7405J4967L2271J1525j3843n0761
$$ plain form
14642 43767 31519 -36467 -58809 -7799 -44378 -104882 -108251 -77325 -95782 -113125 -102031 -39700
14630 -39700 -38431 1081 16369 38172 43821 -4760 -46917 -39993 9934 15392 73138 70029 73095
14617 73095 53016 17046 -2522 -17324 -46088 -34077 8466 48876 62851 95058 134237 140911
14605 140911 118237 26658 3749 972 -10388 -45440 -74625 -15423 206 -16285 -67255 -42412
14593 -42412 -24931 -9278 -10336 -29308 -83007 -94820 -66182 -21421 25729 10734 30614 49142
14581 49142 32298 -25312 4232 -1422 -56513 -79144 -73139 -90314 -115307 -173530 -153586 -109164
14569 -109164 -12852 8051 -48773 -33942 54966 34733 27408 12531 -2747 -22367 15179 -17451
14557 -17451 -104615 -84903 -21564 3564 32152 28678 -18727 -3760 28511 40036 26193 -24568
14545b4568j8447R120q939L3716K1142M8652j609j8431j5341j2682k9452m5186
14533f2025K7904k9091L7507L5819O947j7910J4858K2120j6115p2148m2536P2444
14521b2226j3160o7422M2921M9441K6925n8958o7662K7544K8662l0289m3051j287
14509a28562L262k3221K6038M179p352m5604q282P981N9907N3015k0577n9511
14497a38727k6462L9116L9721Q192J5659j4622r987K0219K4065P6k7197j9391
14485h9338K3218k1873o2367M298m1088o396L243J913L6814L981j8015k1638M6056
14472a41192O4826j2493j2941M1532M518j7560n7528L4224K7880n60L3868m014
14460c9440j0880m3367L7267J6892L846j0804J2640O0930j740R649m2268p4809
$$ plain form
14545 -24568 -43015 -33895 -42834 -9118 12024 60676 59067 40636 25295 12613 -16839 -62025
14533 -62025 -34121 -63212 -25705 10114 17061 -849 14009 36129 20014 -52134 -94670 -22226
14521 -22226 -35386 -102808 -59887 -10446 16479 -42479 -110141 -82597 -53935 -84224 -127275 -128562
14509 -128562 -125300 -148521 -122483 -118304 -125656 -171260 -179542 -171561 -111654 -58639 -79216 -138727
14497 -138727 -165189 -126073 -86352 -78160 -62501 -77123 -87110 -66891 -42826 -42750 -69947 -89338
14485 -89338 -66120 -87993 -150360 -146062 -187150 -193546 -190303 -188390 -151576 -147595 -165610 -187248 -141192
14472 -141192 -76366 -88859 -101800 -60268 -55750 -73310 -130838 -96614 -68734 -69294 -35426 -39440
14460 -39440 -50320 -93687 -56420 -39528 -35682 -46486 -33846 27084 25344 34993 -7275 -82084
14448h2084q9781O1963N5667P947l2325k7386k7733N3K9909l3481k0275L3032
14436a24494l1541K6792K4359r9907L3413N9861N1262n4769K6706J03572j6186
14425i32p5953l6795j1737Q5540Q124o4850j1112k957K4847M0915L7864m520o5478
14412g7044m8086K7722M5167Q089o7872m3295P0813M6625K6505J4993k7128M3273
14400A9762j0138n3825P664l9930j8871j178m8378n4950j2393Q1801N4860l5692
14388a11268p970L7838O0048L7573p143o0735O1850J9948q1741L6467K8627j398
14376A2096Q0469N5460N7721N9693O948J5505k2379K7056J3274N5906M862k9732
14364C36879j4632K0134K8104o154M557l2749o3339n7514k5073p6746m6387M5905
$$ plain form
14448 -82084 -171865 -109902 -54235 -46288 -78613 -105999 -133732 -133679 -103770 -137251 -157526 -124494
14436 -124494 -156035 -129243 -104884 -204791 -171378 -111517 -60255 -115024 -88318 15254 -932
14425 -932 -76885 -113680 -125417 -39877 -31753 -96603 -107715 -110672 -85825 -44910 -7046 -11566 -77044
14412 -77044 -125130 -97408 -52241 -44152 -112024 -155319 -84506 -37881 -11376 3617 -23511 19762
14400 19762 9624 -44201 -36537 -76467 -95338 -96516 -144894 -199844 -212237 -130436 -75576 -111268
14388 -111268 -119238 -81400 -21352 16221 9078 -51657 10193 30141 -51600 -15133 13494 12096
14376 12096 92565 148025 205746 265439 272387 287892 265513 292569 305843 361749 366611 336879
14364 336879 322247 342381 370485 364331 368888 336139 272800 215286 190213 113467 67080 112985
14352A12985K2542l750k8071j15746j2580K5554K4210P0367L6013k1328l6543
14341G3653n0662n5837K2911K8440O665j4172R642j7173n3432n0491M1581N5633
14329c242J0577N479N5493m6720l0228j0341l2455j0974K0399M5682j2687n3741
14317f2758n1572P395l5541K4257N4183P492n035K590l607p166Q47m874L9433
14304c4356p1066q990k9335J7728L4831R0103m900k8372J3373l9266J1101L1808
14292a7341M6634n1235k6573k7928K6202O414k2016n262n0244M741K4824j5080
14280a06864P1048O9921l8733J7929m0860n2904K8603N4579J2227j7261J2082
14269I767J502l6589m3753k7075P027Q500j5914k074K0206O052j1575K5128K430
$$ plain form
14352 112985 135527 131777 103706 -12040 -24620 934 25144 95511 131524 110196 73653
14341 73653 22991 -32846 -9935 18505 25170 10998 20640 3467 -49965 -100456 -58875 -3242
14329 -3242 7335 12814 68307 21587 -8641 -18982 -51437 -62411 -42012 3670 -9017 -62758
14317 -62758 -114330 -106935 -142476 -118219 -64036 -56544 -61579 -58989 -62596 -69762 -68915 -73789 -34356
14304 -34356 -105422 -114412 -143747 -126019 -91188 -1085 -5985 -34357 -20984 -60250 -49149 -17341
14292 -17341 29293 -21942 -48515 -76443 -50241 -43827 -65843 -71105 -121349 -116608 -91784 -106864
14280 -106864 -35816 34105 -4628 13301 -27559 -80463 -51860 2719 14946 -2315 9767
14269 9767 11269 -25320 -69073 -96148 -89121 -80621 -96535 -98609 -78403 -72351 -83926 -58798 -56368
14256e6368K3660k7380P237p605N6252R910J3218J4832p0895n4214O122O5364
14244a9867j4349n3890K0903M7434N5336j3929p1588k9816J5243K7785l2153J2360
14232e6531K1896l8074K8961L1693L4438J997N8404j6415n9129l9604k5515L353
14220e4526K0704L7930n2222J2813J4632l9021m5178L6891n2735K0708L8279N490
14208e6235k7726p336J4487O718J8575M5327L3812l6099J67l6235j8762o754o503
14195g6564r557Q0118M8136m0902l9161n447k401K823q944k1523N3157J3928l3261
14182c9598p121j9524K2128j1049P2570j8004m7120m1166P628J5161l7279q311
14170a11685O132K1169j550K6942j6012o6157r202L6396N4932N0620M1049P528
$$ plain form
14256 -56368 -32708 -60088 -52851 -60456 -4204 5706 18924 33756 -37139 -91353 -85231 -19867
14244 -19867 -34216 -88106 -67203 -19769 35567 21638 -49950 -79766 -64523 -36738 -68891 -56531
14232 -56531 -34635 -72709 -43748 -12055 22383 24380 82784 66369 7240 -32364 -57879 -54526
14220 -54526 -33822 4108 -48114 -35301 -20669 -59690 -104868 -67977 -120712 -100004 -61725 -56235
14208 -56235 -83961 -91297 -76810 -70092 -51517 -6190 27622 -8477 -8310 -44545 -63307 -70061 -76564
14195 -76564 -86121 -6003 42133 1231 -37930 -43377 -45778 -42955 -51899 -73422 -20265 -6337 -39598
14182 -39598 -46719 -66243 -44115 -55164 17406 -598 -47718 -88884 -81256 -66095 -103374 -111685
14170 -111685 -105553 -84384 -85934 -58992 -75004 -141161 -150363 -113967 -59035 -8415 32634 40162
14158D0162Q0683J14465Q8588J24958J84305J56357J37358J66420J59275J46307
14148A398878J90001J09275N0622o7368o9196p7223j74414k49220j64958j91448
14138G54949j16283j45813p4829n4250J6420m6971r2237l947L0695k8863n6056
14127A82815n2732m0080J5299P1054o1344J3949j9426L0034j0789n1897m2839
14116C4044R398J2514r175k5429N8017K3401q8087p1114N7979q47o937q408L8156
14103B3512N9531k9598n6740o0734L1253M2541L5406k2596l1144R090q5330j6325
14091a01134L7985N8547O4304j9608K7323l2836o193M1206Q232k5030O48L3908
14079H7352k2953l9772j2388r638l2863k8978P3154K1668l700L2408J6976o1730
$$ plain form
14158 40162 120845 235310 323898 448856 633161 789518 926876 1093296 1252571 1398878
14148 1398878 1588879 1698154 1748776 1681408 1612212 1534989 1360575 1111355 946397 754949
14138 754949 638666 492853 418024 363774 380194 333223 240986 237039 267734 238871 182815
14127 182815 130083 90003 105302 176356 115012 128961 109535 139569 128780 76883 34044
14116 34044 43442 55956 46781 21352 79369 102770 14683 -56431 1548 701 -6236 -14644 23512
14103 23512 83043 53445 -3295 -64029 -32776 9765 45171 22575 -8569 521 -84809 -101134
14091 -101134 -63149 -4602 59702 40094 67417 34581 28388 69594 77826 52796 53444 87352
14079 87352 64399 24627 12239 2601 -30262 -59240 13914 35582 31882 64290 81266 19536
14067A9536m4387Q55m250p8987k4895R3196O9100j3399q3812L5742N8795o230
14055B1264l6650j6706O1858n613m5511l9205o4043N3001P0014M291m5587J5073
14043b7814k081K8742J6773M420k1190k1641N5125n765j3585l1827k5794j0375
14031e5012k6936l0774L0381O6683M2535L6482j3384m8456n7662n4770L6766L3150
14019d0997K3909L1271m7065k6097m0858j8591j9606K1538j4729L8235L7613J8672
14007c6705L8894k5937l1494k229J2121K973R956K1103O033L0787m1936q816j3073
13994c8323L1428M4814n6675J629l669o2307M560J5574M7236l07o610m3079l3841
13981i9570L4586M5802m4973m9816q4191R399m2784K2121K1336P4254N5601K1698
$$ plain form
14067 19536 -24851 -23996 -28246 -107233 -132128 -38932 30168 16769 -67043 -31301 27494 21264
14055 21264 -15386 -32092 29766 24153 -21358 -60563 -124606 -71605 -1591 2700 -42887 -27814
14043 -27814 -29895 -1153 15620 20040 -1150 -22791 32334 26569 12984 -18843 -44637 -55012
14031 -55012 -81948 -112722 -82341 -15658 26877 63359 49975 1519 -56143 -110913 -74147 -40997
14019 -40997 -17088 14183 -32882 -58979 -99837 -118428 -138034 -116496 -131225 -92990 -55377 -36705
14007 -36705 2189 -23748 -55242 -57471 -45350 -42377 -32421 -11318 -5285 25502 -16434 -25250 -38323
13994 -38323 -6895 37919 -18756 -17127 -20796 -83103 -78543 -62969 -15733 -16040 -22650 -65729 -99570
13981 -99570 -64984 -19182 -64155 -113971 -198162 -188763 -231547 -209426 -188090 -113836 -58235 -36537
13969c6537O8431Q157q0063l9135l1797P885J1017M3185m3658m7231O1682m50
13957g8514n8m221m0468l9337j7296l0531M4892O8997L3639J237n8934j3006J8464
13944a15136N9409Q461K2450L6715j4506q1606L181J3387l432k8221j327J0236
13932i0389O252K9631L4269j9542o5320k8693O718k8053o1911N2833J7367M0659
13920a06179L6453O3442R0607k3108l3522O8678P897p2577q8150l9276K275P0367
13908b3093J8419L2776P571K0444n571l5114l1313J3644m1519j7584L550K3347
13896c4443Q848m272m383l6826j09500J6080N7836n998N9487P0127N917k6203
13884c330K7281k7044m6629j8083J1683N7287N0964o193N8106P5089M3687J7505
$$ plain form
13969 -36537 31894 40051 -40012 -79147 -110944 -103059 -92042 -48857 -92515 -139746 -78064 -78514
13957 -78514 -78572 -82793 -123261 -162598 -179894 -210425 -165533 -96536 -62897 -61660 -120594 -133600 -115136
13944 -115136 -55727 -47266 -24816 11899 -2607 -84213 -81032 -67645 -71077 -99298 -100625 -90389
13932 -90389 -84137 -54506 -20237 -39779 -105099 -133792 -127074 -155127 -217038 -164205 -146838 -106179
13920 -106179 -69726 -6284 84323 61215 27693 96371 104268 31691 -56459 -95735 -93460 -23093
13908 -23093 -4674 28102 35673 56117 50546 15432 -15881 -2237 -43756 -61340 -57790 -34443
13896 -34443 -25595 -29867 -34250 -71076 -180576 -164496 -106660 -112658 -53171 16956 22873 -3330
13884 -3330 23951 -3093 -49722 -67805 -56122 1165 52129 45936 104042 179131 222818 240323
13872B40323m2138l4716n130O333O754k2701r712J9621m6858k3648o920m611l0077
13859D6520j9795N2996j2763o5721J7603M5663L0239k8866k6806k15K7975j8249
13847D8581n7297K8615L4194P496j4469J3199N6054N4170j0807k2417K8448J7253
13835A83020K1181J4101M1375J5218N8848O7589N0473K0928m7555o5073K7090
13824C87195M7881n9338j10846p5816j18885n6447j3795P8378J7646k6192Q497
13813G8278N3724K7110j1746P467M611j6804j4183k7028n870o688R528K6014m333
13800A20080k5171j2649q7602J4386K7252L1165j779P5856M050j3178o4205K2836
13788I1041N1554K3540J6112l7953N619m0645K4016j1614M7066L0410l4172r5653
$$ plain form
13872 240323 198185 163469 158339 164672 171426 148725 139013 158634 111776 88128 81208 76597 46520
13859 46520 26725 79721 66958 1237 18840 64503 94742 65876 39070 38855 66830 48581
13847 48581 -8716 19899 54093 61589 47120 60319 116373 170543 159736 137319 165767 183020
13835 183020 204201 218302 259677 274895 333743 401332 451805 472733 425178 360105 387195
13824 387195 435076 375738 264892 189076 70191 13744 -51 78327 95973 69781 78278
13813 78278 132002 159112 147366 154833 159444 142640 128457 101429 95559 88871 98399 124413 120080
13800 120080 94909 82260 -5342 9044 36296 67461 65682 141538 145588 132410 68205 91041
13788 91041 142595 166135 182247 144294 149913 109268 133284 121670 168736 199146 164974 69321
13776F9321m1295J17622J15268q605m8199j4134n8664j6575l7690l1986j644l9378
13764D041M3118j7983j4874M8620M5840K6405k3375r4877m1550P3341L9846n3459
13752C5093o0507O816Q2728r477M3014k6818m2955J7606M999n1315K1598O2816
13740H3598O603k0436n3311l473J4296P912j0063N2853r107n1689m3188M677J2884
13727h444M2354N2539J7389j914J1509j2859m7230m3284j4266l037M584L8343
13715C5684O687l391K1959N8513N6963l316L3260J02843N3523j6842N3162R0354
13703D89399N0072k5342j2401K937k2470o2465m0648k76n3278r6472p014l6635
13691A85407k1533J5248k8229n6972l713K205L763N299l4651J7784M2240O346
$$ plain form
13776 69321 28026 145648 260916 252311 204112 189978 131314 114739 77049 45063 43419 4041
13764 4041 47159 29176 14302 62922 108762 135167 111792 16915 -24635 48706 88552 35093
13752 35093 -25414 -18598 64130 54653 97667 70849 27894 45500 50499 -816 20782 83598
13740 83598 90201 69765 16454 12981 27277 35189 25126 77979 68872 17183 -26005 -21328 -8444
13727 -8444 33910 86449 103838 101924 113433 100574 53344 10060 -4206 -7243 -2659 35684
13715 35684 42371 38980 60939 119452 176415 173099 206359 309202 362725 345883 399045 489399
13703 489399 539471 514129 501728 504665 482195 419730 379082 378806 325528 229056 222042 185407
13691 185407 163874 179122 150893 93921 90208 92413 96176 101475 66824 84608 126848 133194
13679A33194k5955q285N0216J0173J0525K9015K7186K3790L260J7318N5729P4931
13667D01097M5456M0774P4950M9375k374m6230m4463J6413L555p3838K874j2702
13655D54887m4533q6230k0770m1969o7966o473P483J5238Q2257P654n1291m3950
13643B04337J7357m4894k7490p101p0578J3548J1721j4966K2267M235o6418L3764
13631G5782O0297J1124l0719n7727J9805N366j9088n6366m0666L7390K4030K2384
13619E1612J2637q43L0533n7251n681L394m6697M1335Q15L1894N6984k0314p3373
13606B5045J4951P2764J26217o2658j23047j2099K1605m6649l4927r905O9691
13595D0988n153L5941M4267M101m114o04O835P936N1848N0307J00079O9732k862
$$ plain form
13679 133194 107239 98954 149170 159343 169868 198883 226069 249859 253119 270437 326166 401097
13667 401097 446553 487327 562277 611652 609278 563048 518585 534998 538553 464715 467589 454887
13655 454887 410354 324124 303354 261385 193419 186946 194429 209667 291924 299578 248287 204337
13643 204337 221694 176800 149310 142209 71631 85179 96900 81934 104201 108436 42018 75782
13631 75782 136079 147203 116484 58757 78562 83928 64840 8474 -32192 5198 29228 51612
13619 51612 64249 63406 93939 36688 31007 34401 -12296 29039 29854 61748 118732 98418 25045
13606 25045 39996 112760 238977 176319 53272 41173 62778 16129 -18798 -28703 40988
13595 40988 35835 71776 116043 120144 116030 115426 122261 130197 182045 232352 332431 402163 399301
13582C99301n248o725K2796j9255j123m3127l1315m6373N099L805J5288m0337
13570B52786n9888l9980L7341L7183J5325p4091n7653J9132K4861K3154K0247
13559A98417k9835j5247k2511J7832l494j5468N6252P4271l231P2812N4470N355
13547C89623p0311m5512j186M9498M3725M4773j6467j1097k3294R066K6274k4135
13535C70957p0035o7944M2968O218k1282p1270J03374M0772m3077n5534P220j3225
13523B29142l3354o458p555o3297M594k550m077l2969l3621L3200l7553j2408
13511C3094K8361J0561J3386M3194l1314m849j4453k5460J0675M5832R398n5640
13499F2785m7450j2642J9522L683m8266n0808l6525O4338O4235P461n9761j9525
$$ plain form
13582 399301 394053 387328 410124 390869 389746 346619 315304 268931 274030 277835 293123 252786
13570 252786 192898 152918 190259 227442 242767 168676 111023 130155 155016 178170 198417
13559 198417 168582 153335 130824 148656 145162 129694 185946 260217 256986 329798 384268 389623
13547 389623 319312 273800 272614 322112 365837 410610 394143 383046 359752 368818 395092 370957
13535 370957 300922 232978 275946 282164 260882 189612 292986 333758 290681 235147 242367 229142
13523 229142 195788 189330 181775 118478 123072 120522 116445 83476 49855 83055 45502 33094
13511 33094 61455 72016 85402 128596 97282 92433 77980 52520 63195 109027 118425 62785
13499 62785 15335 2693 22215 25898 -22368 -73176 -109701 -45363 18872 26333 -33428 -52953
13487e2953L6254j1417j1551k2814j1703N2965J0474p3302q886k7861K7497N9298
13475c3999j5468q856J8613l5329M8450P8360j8771o0760k6543n4198m33L6195
13463g2739J3203R7O430L9948M7224K3952m6059k8833J2135J8690L0855O291k634
13450D8560k3251q1073l9580K736j2370J0987N233K9803K1003J1149M0389l9993
13438b6407p2266K6355J1570l6757O960j7592m2696O4174J3336l2794M3715L8194
13426b4208l8628o4372n500K97J3505R7115m8310k9970K2185M7755k3187J9828
13414c3490Q5168k0521j3150J7656N128k0676k4910N638R184o3294l1549m26P9441
13401e801N108p9236j7658k8099l5434J7501P7864P6354k9287p1841M6905Q7023
$$ plain form
13487 -52953 -16699 -28116 -39667 -62481 -74184 -21219 -10745 -84047 -92933 -120794 -93297 -33999
13475 -33999 -49467 -58323 -39710 -75039 -26589 51771 33000 -27760 -54303 -108501 -108934 -72739
13463 -72739 -59536 -59439 -53009 -13061 34163 58115 12056 -16777 -4642 14048 44903 51194 48560
13450 48560 25309 -55764 -95344 -92608 -104978 -93991 -88758 -58955 -37952 -26803 13586 -26407
13438 -26407 -98673 -72318 -60748 -97505 -90545 -108137 -150833 -86659 -73323 -106117 -62402 -24208
13426 -24208 -62836 -127208 -132708 -132411 -118906 -21791 -70101 -100071 -77886 -30131 -53318 -33490
13414 -33490 51678 31157 18007 35663 40791 20115 -4795 843 10027 -53267 -84816 -85242 -5801
13401 -5801 -693 -79929 -97587 -125686 -161120 -143619 -65755 10599 -18688 -90529 -43624 43399
13389D3399K9218m1378k6926N6231L2254p230P384p3446k4224m7521p7254n790
13377a35283N6652J3726L2286L2198J7625k5241j0839j7544J6943L0972J1152
13366B2647j2514l6089m9056L0742m0875j5526O6758j5468K7005n0991k1124J2046
13354h2445M6839l5452k9119p42k6055J6028j8213K3124L7830l0687N3470K2710
13342b2712K9428k4663o4545l2211N0734L471J4571l8558m2743K7368L406K5183
13330g1271J714N146n290J1266l615O3217J0111O951K4041n4267m2618J6816P889
13317b9910K8209L7009L8263k3315n4796k1919j3229j2719l6783N7524Q5922M3956
13305I8212p581k5104n4498q7530l3750L6274K0842L5995K2346K0615n724o3885
$$ plain form
13389 43399 72617 31239 4313 60544 92798 85568 92952 19506 -4718 -52239 -129493 -135283
13377 -135283 -78631 -64905 -32619 -421 17204 -8037 -18876 -36420 -19477 11495 22647
13366 22647 10133 -25956 -75012 -44270 -85145 -100671 -33913 -49381 -22376 -73367 -94491 -82445
13354 -82445 -35606 -71058 -100177 -100919 -126974 -110946 -129159 -106035 -68205 -98892 -45422 -22712
13342 -22712 6716 -17947 -82492 -114703 -63969 -60498 -45927 -84485 -127228 -99860 -96454 -71271
13330 -71271 -69557 -64411 -69701 -58435 -62050 1167 11278 18229 42270 -11997 -54615 -37799 -29910
13317 -29910 -1701 35308 73571 50256 -4540 -26459 -39688 -52407 -89190 -31666 54256 98212
13305 98212 90631 65527 11029 -76501 -110251 -73977 -53135 -17140 5206 25821 20097 -43788
13293d3788m1351N2768L0791J8464n847p69j5791M740N9703L1904o0378o5541
13281c5095l8764m359K007q209l6427j2001L4494N8481k3368n842P101M3127N9992
13268D1137j7267m0594j1023P532O4473N4076l8339j2873j0618m5406k5630J4198
13256b0334N6704k4130l488n7442l4091N1668R751N705k3749j7952M029O4278
13244A0949M7607K760r0459p7483L9102P5211L711m3109M1782Q980J07l7674J4849
13231c667N3867j93m663l1776J3558M0445K7793j4956k0489K2658k9139r2808
13219c9370m6256L8349K4664M658j6006M325l5654l7491J9219M8513N7474l0522
13207h097q1289L2567L1968n8531m414N1446J763m880k1502Q969N3545J4115k4350
$$ plain form
13293 -43788 -85139 -32371 -1580 16884 11037 10268 -5523 -783 58920 90824 30446 -35095
13281 -35095 -73859 -78218 -76211 -84420 -120847 -132848 -98354 -39873 -63241 -69083 -61982 -18855 41137
13268 41137 23870 -16724 -27747 -20215 44258 98334 59995 47122 36504 -8902 -34532 -20334
13256 -20334 36370 12240 8752 -48690 -82781 -31113 -21362 -15657 -39406 -57358 -53329 10949
13244 10949 58556 61316 -29143 -106626 -67524 7687 11398 -31711 10071 19051 19158 -18516 -3667
13231 -3667 50200 50007 45344 13568 27126 67571 95364 80408 59919 82577 53438 -39370
13219 -39370 -85626 -47277 -22613 -17955 -33961 -29636 -65290 -102781 -83562 -35049 22425 -8097
13207 -8097 -89386 -56819 -24851 -83382 -87796 -36350 -34587 -39467 -60969 -52000 1545 15660 -8690
13194h690k2672J8469J3185q000J1193J3533j3971k622q176n4181j9715J3938
13182f7709n679L6297j1832m1629k767l387P423k9918l4614J8153j2722K3269
13170a25115K7277O5479N3625P796j7669k9153J5170j1728J3275M264M9254L250
13158E5725k8346o908l4161l6985m8911o0765K4873P3722j5553k8191J21468J9283
13146C5251l2700l1480o059J7867L2770o9597j4645L3632M269l9401m6361j7967
13134a34421O1323M2147O861l4940J9311J7866J8587j1351n4406o9399N7841J9950
13122f0631P1380k990p3638J3692k4158k8355k2171k0363k6919j5858Q630P6730
13110a04651O2651O9079j3446p116J8828L5324k9444j3411l0968M9299k815j7751
$$ plain form
13194 -8690 -31362 -12893 292 -7708 3485 17018 3047 425 -7751 -61932 -81647 -67709
13182 -67709 -73388 -37091 -48923 -90552 -93319 -96706 -89283 -119201 -153815 -135662 -148384 -125115
13170 -125115 -97838 -32359 21266 29062 11393 -17760 -2590 -14318 -1043 3221 52475 55725
13158 55725 27379 20471 -13690 -50675 -99586 -160351 -135478 -61756 -77309 -105500 15968 35251
13146 35251 2551 -28929 -34988 -17121 15649 -53948 -68593 -34961 -30692 -70093 -116454 -134421
13134 -134421 -73098 -30951 -24090 -59030 -39719 -21853 -3266 -14617 -69023 -138422 -80581 -60631
13122 -60631 10749 7759 -65879 -52187 -76345 -104700 -126871 -147234 -174153 -190011 -181381 -104651
13110 -104651 -42000 27079 13633 6517 25345 60669 31225 17814 -13154 36145 33330 15579
13098A5579k1599J528k4915q80L8088L4388J0420j6330r5281M187N4819M4353
13086D4357j04103J9134M1225j1715j2125O1220L8571l1386n1082l4863l0372
13075g1139N681k1383K6409j0181k6012j1670K1746k4157L08Q017J3589J3615
13063g5177J5129J3785k6480l2648n834p5253l0786K7633J50255Q1155L253N283
13051E0315j9800m5853J5903n1220J808k1562n1361o067j9227M9551K8473k3420
13039i2460o442L7047K0041M3243M893K9789K3654M83j4046M0702J3617o7638
13027C2883l4032l2596m6692n8121M1047M8308K5199K9918K1734j1410m7579P304
13015b4037K9758l5946l092M5629o434J3461k0799J281k5118n8146L2250L4223
$$ plain form
13098 15579 -6020 -4492 -29407 -30287 7801 42189 52609 36279 -59002 -54815 4 44357
13086 44357 -59746 -40612 613 -11102 -23227 37993 76564 45178 -5904 -40767 -71139
13075 -71139 -65458 -86841 -60432 -70613 -96625 -108295 -86549 -110706 -110398 -102381 -88792 -75177
13063 -75177 -60048 -46263 -72743 -105391 -111225 -186478 -217264 -189631 -39376 41779 45032 50315
13051 50315 30515 -15338 565 -50655 -48847 -70409 -121770 -127837 -147064 -97513 -69040 -92460
13039 -92460 -98902 -61855 -41814 1429 6322 36111 59765 60248 46202 86904 100521 32883
13027 32883 -1149 -33745 -80437 -138558 -97511 -49203 -24004 5914 27648 16238 -31341 -24037
13015 -24037 5721 -30225 -33317 12312 5878 19339 -1460 -179 -25297 -83443 -51193 -16970
13003a6970J9590P675L1963M3207m3248r6205l0137J1630K6875L4094o0353n1522
12991a23401j5409K9893J3057N7314J2240l3034J3454J1712n423r4927k062R9478
12979c7108m150o1686p58P1744O3821l4122n4333n200n7933J9573K7502P647m350
12966f9353J1131K1062j0352L399K979j7846n3514K2084N2911M1600M7836p826
12954D4111m3316k5927k5466k9852q694O8388P4360j8622o2997l0571l7872M2754
12942e3704N4164P3011M7578j60l3113j2907l8850j6770n22m603K3874n0555n6233
12929f8790M111K2296L8702k3342j1928j8749O635o1791O092p104m1414J352N4533
12916i9397P5583j5215M992k1740k9931o672L9757j0928J0272J5299K4132K6586
$$ plain form
13003 -16970 2620 10295 42258 85465 42217 -53988 -84125 -72495 -45620 -11526 -71879 -123401
12991 -123401 -138810 -108917 -95860 -38546 -26306 -59340 -45886 -34174 -39597 -134524 -136586 -37108
12979 -37108 -41258 -102944 -103702 -31958 31863 -2259 -56592 -61792 -119725 -100152 -72650 -65003 -69353
12966 -69353 -58222 -37160 -47512 -44113 -41134 -58980 -112494 -90410 -37499 4101 51937 44111
12954 44111 795 -25132 -50598 -80450 -89144 -20756 53604 34982 -28015 -58586 -96458 -53704
12942 -53704 460 73471 121049 120889 87776 74869 36019 19249 18727 14124 37998 -12557 -68790
12929 -68790 -64679 -42383 -3681 -27023 -38951 -57700 -51065 -112856 -106764 -113868 -155282 -153930 -99397
12916 -99397 -23814 -39029 -34037 -55777 -85708 -92380 -52623 -63551 -53279 -37980 -13848 12738
12904A2738k5900m3990K3151j5805m4401j8894J5924N6260J0216o0101j7136J9206
12892h8732K1109K57J726M2626k6531p0411J5867N427J7149P2940Q51L6554J3808
12879D2640j1879K4817k2357p8476j3142n4224l8055J1372L0835k4824M3509L9224
12867e0560L382k7141p97r731o131l4304n070K8137J974L4018J3082j5575k9582
12854i8298l752J0393J2882P1358n127l4421j1615k0051K082J9082k387J1395
12842d8459K9848n6590O9673N5917L1621p0955o1201m3606o637M5708L5075l3710
12830e3316k863L3734k9019J8438K1687j2353m134L9340J1246m4041j13830j0258
12818a45369K0060K67n489L1276M9492N1528M3604k3128j8644n6963j8885M7862
$$ plain form
12904 12738 -13162 -57152 -34001 -49806 -94207 -113101 -97177 -40917 -30701 -90802 -107938 -88732
12892 -88732 -67623 -67366 -65640 -23014 -49545 -119956 -104089 -98662 -81513 -8573 -7722 28832 42640
12879 42640 30761 55578 33221 -45255 -58397 -112621 -150676 -139304 -108469 -133293 -89784 -50560
12867 -50560 -47178 -74319 -75116 -84847 -90978 -125282 -130352 -102215 -100241 -66223 -53141 -68716 -98298
12854 -98298 -102050 -91657 -78775 -7417 -12544 -46965 -58580 -78631 -76549 -57467 -59854 -48459
12842 -48459 -18611 -75201 -5528 50389 82010 11055 -50146 -93752 -100389 -54681 -19606 -53316
12830 -53316 -56179 -22445 -51464 -33026 -11339 -23692 -27826 11514 22760 -21281 -135111 -145369
12818 -145369 -125309 -125042 -130531 -99255 -49763 1765 45369 22241 3597 -53366 -72251 -24389
12806b4389r905m050M975J1660j4704K984j7159n8722m7616K834M2920j7981k6214
12793a55367K0220j6099M4539M4916o0744K730P5429K5136n5951n8138m821M1756
12781i6394L8783k3162j8377k4931M4290M4283k5680n1987K2600K6663r966Q239
12769f5639k2153L7282K6004m4152K2328m7662q8607O7463O0324k6988K2687L3559
12757b5554O1695K5602j099K3089n1792p7628q642k1676n2835j9637l066R571
12745a41972K3086P1106M1080O1418o252l0408k8949k1471L9792l3218J5357M1301
12733C0870j630k8437J9341k8586j6796J0287Q773L1524M2615L1459J0397j1013
12721I8804k1939J2840J0241p1564j5971P7299j6136m8673m9464o5017k4295M1464
$$ plain form
12806 -24389 -34294 -38344 -33369 -21709 -36413 -33429 -50588 -109310 -156926 -154092 -111172 -129153 -155367
12793 -155367 -135147 -151246 -106707 -61791 -122535 -119805 -44376 -19240 -75191 -133329 -138150 -96394
12781 -96394 -57611 -80773 -99150 -124081 -79791 -35508 -61188 -113175 -90575 -63912 -73878 -65639
12769 -65639 -87792 -50510 -24506 -68658 -46330 -93992 -182599 -115136 -54812 -81800 -59113 -25554
12757 -25554 36141 61743 60644 83733 31941 -45687 -54329 -76005 -128840 -148477 -151543 -141972
12745 -141972 -118886 -47780 -6700 54718 48466 18058 -10891 -32362 7430 -25788 -10431 30870
12733 30870 29240 803 20144 -8442 -25238 -14951 -6178 25346 67961 99420 109817 98804
12721 98804 76865 89705 99946 28382 12411 89710 73574 24901 -24563 -89580 -113875 -72411
12709g2411J4561l629K6989L3219n754L865L5048l4973k6634O4170J8461q5587
12697c2675N1744M8096k5488l6143m0029q797L7661J8544p0877j124K6689j5912
12685d8311M3032K0095m5269p4359o1337L4091P091K6511K5065j5848k0262M6336
12673f3165O6085J9438p573l637k0444l1139N97L5698J2450K0849j9276j011J9982
12660B8854J313J9164Q543n0322o9202Q945j2141J9049O8014M0846K9445k2934
12648F9574j29706k1842o162k4922J0419M7275m719m5732J4218M0751L5067m567
12636b0346K902J9760L1316q158j30882J90J8534o242N39M0032m5140k5735k7939
12623a51169J7160J8472L7523N5851J4095L6376P753J3485K6459o960m7539l1172
$$ plain form
12709 -72411 -57850 -61479 -34490 -1271 -7025 -3160 31888 -3085 -29719 34451 52912 -32675
12697 -32675 19069 67165 41677 5534 -34495 -43292 -5631 12913 -57964 -59088 -32399 -48311
12685 -48311 -5279 14816 -30453 -104812 -166149 -132058 -124967 -98456 -73391 -89239 -109501 -63165
12673 -63165 2920 22358 14785 11148 -9296 -40435 -39838 -4140 8310 29159 9883 8872 28854
12660 28854 30167 49331 57874 7552 -61650 -52705 -64846 -45797 22217 63063 92508 69574
12648 69574 -60132 -81974 -88136 -113058 -102639 -55364 -60083 -105815 -91597 -50846 -15779 -20346
12636 -20346 -17444 2316 33632 25474 -105408 -105218 -86684 -92926 -92387 -52355 -97495 -123230 -151169
12623 -151169 -134009 -115537 -78014 -22163 -8068 28308 36061 49546 76005 69045 21506 -9666
12611i666q99K5187J1221R999L0621L8352k5203k9463j024l7526Q312n3468q2157
12598a15714L0190N6359N6482m83l1427j8353j7466R33L3632j8664M0337P141
12586B2967o011m4546j9668n717j4586N0591J095m541k4995L579R86p902l1815
12573h0563K9172l0611k1596J8156N833L1431Q0550K5236L1534J4001r819o0366
12561C2958q5787m9929p000L82N0089L9354Q535O1154p276q780j983o2019p2036
12548a02338J9610J11361M100q3136n9771N9318K0930k5668p304l3415K1702J6853
12536e7758k3727L8688q329n1814k9420O9106K2401m6744k0214P208K2168O271
12524g2164o4511K8087J9326K6951n186O3371M1108j2702n1543P485K6735m3511
$$ plain form
12611 -9666 -10565 14622 25843 35842 66463 104815 79612 50149 49125 11599 19911 -33557 -115714
12598 -115714 -85524 -29165 27317 26834 -4593 -22946 -40412 -39479 -5847 -24511 15826 22967
12586 22967 16956 -27590 -47258 -52975 -67561 -16970 -15875 -20416 -45411 -41832 -40846 -48748 -80563
12573 -80563 -51391 -82002 -103598 -85442 -79609 -48178 32372 57608 89142 103143 93324 32958
12561 32958 -52829 -102758 -109758 -109376 -59287 -19933 -11398 49756 42480 33700 31717 -30302 -102338
12548 -102338 -82728 28633 32733 -50403 -110174 -50856 -29926 -55594 -62898 -96313 -74611 -57758
12536 -57758 -81485 -42797 -51126 -102940 -132360 -63254 -40853 -87597 -107811 -100603 -78435 -72164
12524 -72164 -136675 -108588 -89262 -62311 -67497 -4126 36982 24280 -27263 -19778 6957 -36554
12512c6554m3240J0940J6977L692r522j4236l443N3544J3403K3755l4449p625
12500b6758K3081m2045K6147K8814j8819J5668N6222L315K019j8627k8423Q779
12488B9373J1774J328j3119k0438m730R88p9022q353M7597K4162M3826J0427r352
12475C4461o9190l8490l3974J1876P4214q330n2015R1735k90l9665j1608p388
12463d8664M5817q717j55M5113L9676O371k9686o5410J2794k3830N7508j1695
12451A9122l3665n0097M4147J1047m7839n9325j9088J0640L2907L1432j7459j141
12439g9319O9456P2312k3734n2255l1663L6970N6023l2583j0587M010m4608j3997
12427d9975N6052M8132p9346j5998O64O1069L7212O418l8530n3055O971j4439
$$ plain form
12512 -36554 -79794 -68854 -51877 -48185 -57707 -71943 -75386 -21842 -8439 15316 -19133 -26758
12500 -26758 -3677 -45722 -19575 9239 -9580 6088 62310 65625 67644 49017 20594 29373
12488 29373 41147 42475 29356 8918 4188 5176 -73846 -82199 -34602 -10440 33386 43813 34461
12475 34461 -34729 -73219 -107193 -95317 -21103 -29433 -81448 10287 9997 -29668 -41276 -48664
12463 -48664 -2847 -11564 -11719 33394 73070 79441 49755 -15655 -2861 -26691 30817 19122
12451 19122 -14543 -64640 -20493 -9446 -57285 -116610 -135698 -125058 -92151 -60719 -78178 -79319
12439 -79319 -9863 62449 38715 -13540 -45203 -8233 47790 15207 4620 8630 -35978 -49975
12427 -49975 6077 54209 -25137 -41135 -40471 20598 57810 64228 25698 -27357 -20386 -34825
12415c4825j8499N7420q496l4683M7066j3408J9614j5320n6848L391N2220J9747
12403A7379l246J1959r790o0830Q253L2008P4550N078n9613L51J6316O9801P7469
12390A79685k5044j37939m4903L063o0925P455M8026N838M1540J4239K1072k7803
12378B4304n6292o395N1822K7876K3037j02819o600J07789K996l5956l4968J9544
12366A4338j4020J5497Q992k3917l5336l6583j8490k9644m3501M600K5013K3875
12354a09176L9109K2440L2986j6677m5713J2261J7196o101J313L1444j7438K5860
12342a2496L7684J9467q35L6893r90m3490L0593r991m363M428k4285l3109L627
12329C133N5074K3062M4871l3372K3622J4384k7475p5884m355L8235N2711m2021
$$ plain form
12415 -34825 -53324 4096 -4400 -39083 7983 -5425 14189 -1131 -57979 -54588 -2368 17379
12403 17379 14133 26092 16302 -44528 -36275 -4267 70283 75361 15748 16099 32415 102216 179685
12390 179685 154641 16702 -28201 -25138 -86063 -78608 -30582 -24744 16796 31035 52107 24304
12378 24304 -31988 -38383 13439 41315 64352 -38467 -45067 62722 65718 29762 -5206 14338
12366 14338 318 15815 24807 890 -34446 -71029 -89519 -119163 -162664 -158064 -133051 -109176
12354 -109176 -70067 -47627 -14641 -31318 -77031 -64770 -47574 -53675 -52362 -20918 -38356 -12496
12342 -12496 25188 44655 43820 80713 79723 36233 66826 56835 52472 56900 32615 -494 3133
12329 3133 58207 81269 126140 92768 116390 130774 103299 27415 23060 61295 114006 71985
12317G1985M2210J7154K333M9818K2766M4698O4246O6728l0810k7511O4629N9162
12305D47408J05781J31759J51848Q3616O1586L7383K3892j973j13256j19457o4178
12294G44409r2069j09069j09631l6879q1385o8253m1768M4256J4537p6865n0056
12283A37227l3837L9844J7368J7154r084n760M2108l9344k7544K6473j1633j8477
12271A34495j1641k9550r812l1142k1579k7459M931J7704K7904J7591N6993m849
12259A23586q7943j0595N2769J7123N2315J5453j8615p662k1697p772l0662P145
12247H3445j2102n078M5587k38m7344j0669n0288k0319K487O6667N4835N3017
12235A60000n8943q4686l8705R414O6530N0684j5737l4457M9611O118j0556L597
$$ plain form
12317 71985 114195 131349 133682 183500 206266 250964 315210 381938 351128 323617 388246 447408
12305 447408 553189 684948 836796 920412 981998 1019381 1043273 1041300 928044 808587 744409
12294 744409 652340 543271 433640 396761 315376 247123 205355 249611 264148 187283 137227
12283 137227 103390 143234 160602 177756 168672 162912 205020 165676 138132 164605 152972 134495
12271 134495 122854 93304 83492 52350 30771 3312 8243 25947 53851 71442 128435 123586
12259 123586 35643 25048 77817 94940 147255 162708 144093 136431 114734 106962 76300 83445
12247 83445 71343 66265 111852 111614 64270 53601 3313 -17006 -14519 52148 106983 160000
12235 160000 101057 16371 -22334 -12920 53610 104294 88557 54100 103711 109829 99273 102870
12223A02870l3894Q218m4780o7574L1093J4602J8729K7534n0826J8484J2005j6660
12211A9801L3268K6170j203m9363o5601K3115M9943o731n585l4836n3665n3235
12199a17922N8609L8977l9456j6126L351L0673M1943J8766l9549k1363l652Q5600
12187C9851l6439l4326N7379O0232M4220j5465r548j5025j7158N648j8466q1103
12175b0200m923M8595M1762L8218m276m2354j6686m69q8035k0532L7769O6074
12163C4943l4176n7392j4215J8509L5254M3381L8464m6201o1819N916j4353l9994
12151i1683O0282M4438J6151l3740q2948l1163L1733L7346J01003J7261m7742
12140B0938o2611k7630J1720O3834M33J2860R773L862K9385j3507m4492L4520
$$ plain form
12223 102870 68976 77194 32414 -35160 -4067 10535 29264 56798 5972 24456 36461 19801
12211 19801 53069 79239 78036 28673 -36928 -13813 36130 29399 23814 -11022 -64687 -117922
12199 -117922 -59313 -20336 -59792 -75918 -72567 -41894 49 18815 -20734 -42097 -45749 39851
12187 39851 3412 -30914 26465 86697 130917 115452 105904 90879 73721 79369 60903 -20200
12175 -20200 -25123 23472 65234 103452 99176 56822 40136 39667 -48368 -68900 -31131 34943
12163 34943 767 -56625 -70840 -52331 -17077 26304 64768 18567 -43252 -37336 -51689 -91683
12151 -91683 -31401 13037 29188 -4552 -87500 -118663 -86930 -49584 51419 68680 20938
12140 20938 -41673 -69303 -57583 6251 6684 19544 29317 33179 62564 49057 4565 39085
12128C9085K7376K866r300p0137R714J3209J745k7855k6469R681L7541n642n2272
12115e0458l2961M1091L653P61O026l3907N0488Q7828l4077k3684k6120l7793
12103d9153o135m756K7017j7268O505R799l521n9936j2871q254J1213m0086J2738
12090a34708R0770J5362O192L2426L0066K4550N792l0868l2803L1939j3998o5642
12078d0922n9218M1855J5262J4271l243J8104l576p810M9443k8356n7245Q7630
12066B6195M6104l2050j8708k1070l9998m373j256J9114J6962k0653K1099K2758
12054A4124O396j7697j0184k8618J9961M9719N7944m9756k5902L968m0524L5117
12042A4548n954J091k7117P069l8715m8760J2967k7653r138P1665L514M1285P1823
$$ plain form
12128 39085 66461 69327 60027 -10110 -396 12813 14558 -13297 -39766 -30085 7456 1814 -50458
12115 -50458 -83419 -42328 -38675 -37914 -31888 -65795 -15307 72521 38444 14760 -11360 -49153
12103 -49153 -55288 -60044 -33027 -50295 -43790 -33991 -37512 -97448 -110319 -118573 -107360 -147446 -134708
12090 -134708 -43938 -28576 -22384 10042 40108 64658 70450 39582 6779 38718 24720 -40922
12078 -40922 -100140 -58285 -43023 -28752 -31995 -13891 -17467 -25277 24166 -4190 -61435 26195
12066 26195 72299 40249 21541 471 -39527 -43900 -45156 -26042 -9080 -29733 -8634 14124
12054 14124 20520 2823 -7361 -35979 -16018 33701 91645 41889 15987 19955 -20569 14548
12042 14548 8594 9685 -17432 -10363 -49078 -97838 -84871 -112524 -121662 -49997 -46483 -5198 66625
12029F6625n543k2733j7224J3084J0119k8858m1679p8939j4260Q114N0813J1587
12017d8894O27Q689n4418j2589K5245L3408N086O2873J7775o326p285Q699M2587
12004G5477n2719l5134J1457o2018J7706O0124n714j0453N62j7589o0430M307
11992g4424J241K1990j9766L080R7510P5765j0843l2083l2134l3723j0191K9383
11980A5805J9311n7560k2460K706j5505M7348J6522l1603m4501j7969L1573M1823
11968a4510J90n315L1440r364j5974k5418L091O1898R27N976l2752J9366Q1337
11955A00892J1708j7029M7572k9280n2042n6146j5915j2551J5643J9549J0433
11944B2834K9217k5898o9381l7195m398j9846m035J1213J8879N0621J02321k4756
$$ plain form
12029 66625 61082 38349 21125 34209 44328 15470 -26209 -105148 -119408 -111294 -60481 -48894
12017 -48894 -48267 -39578 -93996 -106585 -81340 -47932 -42846 20027 37802 31476 24191 32890 75477
12004 75477 22758 -12376 -919 -62937 -45231 14893 9179 -1274 -712 -18301 -78731 -74424
11992 -74424 -73183 -51193 -70959 -67879 29631 105396 94553 62470 30336 -3387 -13578 15805
11980 15805 35116 -22444 -44904 -42198 -57703 -10355 6167 -25436 -69937 -87906 -56333 -14510
11968 -14510 -14320 -19635 11805 2441 -13533 -38951 -35860 26038 26965 32941 189 19555 100892
11955 100892 112600 95571 143143 113863 61821 5675 -10240 -22791 -7148 12401 22834
11944 22834 52051 26153 -43228 -80423 -84821 -104667 -108702 -97489 -78610 -27989 74332 49576
11932D9576l8254J2379l3276P648l4819m8103m8590j0518M5180O2926K279Q096
11920b5476k7994j783J277n533M3814k2166p0075m0060O3528K5127L1896K1483
11908e962j2365M4645K7232j3939p7866m7769j3390L4105l1543l3864j2248M5539
11896i7425k2333K3076N6050J2709n1238J9482M2802K9538M9395J2356q960l2579
11884C2873l600m097k679k9760J2779K2025j5858M1821M8859K3969m2358k7319
11872E6655l9140J19196j8390r789l5661q8364n6980o682l5204M8837J987l3005
11860i6540K9643l2056k4714P1753O3177R635L5656p1895j387J4937r904k8720
11848d0415N2754J358k4835K4770j294l5478K1416j5715q974O9035J7406m2447
$$ plain form
11932 49576 11322 23701 -9575 -1927 -36746 -84849 -133439 -143957 -98777 -35851 -33572 -25476
11920 -25476 -53470 -55253 -53976 -59509 -15695 -37861 -107936 -147996 -84468 -59341 -27445 -5962
11908 -5962 -18327 26318 53550 39611 -38255 -86024 -99414 -65309 -96852 -130716 -142964 -97425
11896 -97425 -119758 -96682 -40632 -27923 -79161 -59679 -16877 12661 62056 74412 65452 32873
11884 32873 29273 25176 22497 -7263 5516 27541 11683 53504 102363 126332 83974 56655
11872 56655 17515 136711 118321 108532 72871 -15493 -72473 -79155 -114359 -65522 -63535 -96540
11860 -96540 -66897 -98953 -123667 -51914 11263 20898 56554 -15341 -16728 -1791 -11695 -40415
11848 -40415 12339 13697 -11138 13632 12338 -23140 -1724 -17439 -26413 42622 60028 17581
11836A7581p5255K7189K6823j5910j100r92K228n060m5067K3271O6887o3913Q867
11823c4451j5562k3503L5463k4388m0634K1567N9287o909J0673M9807P722R509
11811D8581R069J0690K7349k4426J9316L9763o4013l9314Q714O275L5281L667
11799H0952Q079n4417n4005l3615k1808J6204P3075J8543K1489j6381l4984K4743
11787B7875O5143N6335P957n4725J0121J6259m0553m2368j9001m88m8933K113
11775b0265P1718k6918L0621R226j9541M3448M6738n53M297K1159O8678M4336
11763B72944N7729R3960J49641J21228R0041J7583P649r0738j37505p2067k2380
11752D88085l4130m0898r2252r8481j1091L718J6122m1n6091k6214l5863O4948
$$ plain form
11836 17581 -57674 -30485 -3662 -19572 -20672 -21664 -19436 -24496 -69563 -46292 20595 -43318 -34451
11823 -34451 -50013 -73516 -38053 -62441 -103075 -81508 -22221 -29130 -18457 31350 39072 48581
11811 48581 57650 68340 95689 71263 90579 130342 66329 27015 35729 42004 77285 80952
11799 80952 89031 34614 -19391 -53006 -74814 -58610 14465 33008 54497 38116 3132 27875
11787 27875 93018 149353 157310 102585 112706 128965 88412 46044 27043 26555 -22378 -20265
11775 -20265 51453 24535 55156 64382 44841 88289 135027 134474 138771 159930 228608 272944
11763 272944 330673 424633 574274 695502 785543 803126 810775 720037 582532 510465 488085
11752 488085 453955 413057 320805 222324 211233 214951 231073 231032 174941 148727 112864 177812
11740A77812M4675j06607j3048R876n252l4156r477J09286L6775j1671l859J2730
11728B07084J3216K3287m441K7471L1196l6406J7580J00389J37831J47613P1077
11717G35897P2448l8795k3122m7840l1354r3766o3329l8562p0255r7636k8068
11706B75618k3320k7400k9593K2403j7423k5690n803p09L3674N7379k1498m5602
11694A92036o228l3484k0074J5144J952r6639m6269L0577L4139j6227o1697J8922
11682A2152M1313O221j4030K3516K6310M9791l5998m9015p0248p468J12134M8130
11670A42808K7983l1079r3337o1186l2152P570K8942J7671Q3962j5804p8684m6568
11658d9874j6800N3889M2225j9343l6310J05739O8746n4738O567l0115Q404n499
$$ plain form
11740 177812 222487 115880 102832 112708 107456 73300 63823 173109 209884 198213 194354 207084
11728 207084 220300 243587 239146 266617 297813 261407 278987 379376 517207 664820 735897
11717 735897 808345 769550 746428 698588 667234 573468 510139 471577 401322 303686 275618
11706 275618 252298 224898 195305 217708 200285 174595 168792 168083 201757 259136 237638 192036
11694 192036 185808 152324 132250 147394 149346 52707 6438 37015 71154 54927 -6770 12152
11682 12152 53465 59686 45656 69172 95482 145273 109275 60260 -9988 -17456 94678 142808
11670 142808 170791 139712 46375 -14811 -46963 -39393 -10451 7220 91182 75378 -3306 -49874
11658 -49874 -66674 -12785 29440 10097 -26213 79526 148272 93534 100101 69986 78390 72891
11646G2891K0774l9634l0727k1786L7688L8450j9593P8666j0806n124m869k5822
11634I0108K4756m0552J339m2968l5192J1804K2175k5837M3848K9120l397m5454
11622B9750j2430l6448N5972q67r0350K9885N2175m5954j8939j1406N5602K7177
11610C4167k1624o799k4111K3999o4403K3687j7400j6269M4128O159k0477K4060
11598a4883p514p96N0572j490j2959l1087n577O6871q147K8001o51m3421J8233
11585C7152N2655J7163m0415k4150J6629O105l4991j7013K2254m3977n0569j0551
11573f9708j5167m6036K5918K8078k1552K7063M3551L8869L753l6955l0507K2706
11561b9987K0706J8094l0965o949M2365L0115p1992m3979k8983k0570M9314M7019
$$ plain form
11646 72891 93665 54031 23304 1518 39206 77656 58063 136729 125923 120799 115930 90108
11634 90108 114864 74312 75651 32683 -2509 9295 31470 5633 49481 78601 75204 29750
11622 29750 17320 -19128 36844 35977 -54373 -24488 27687 -18267 -37206 -48612 6990 34167
11610 34167 12543 5744 -18367 5632 -58771 -35084 -52484 -68753 -24625 -18466 -38943 -14883
11598 -14883 -22397 -23193 27379 25889 12930 -18157 -23734 43137 34990 62991 62340 18919 37152
11585 37152 89807 106970 66555 42405 59034 65139 30148 13135 35389 -8588 -59157 -69708
11573 -69708 -84875 -130911 -104993 -76915 -98467 -71404 -27853 11016 14769 -22186 -52693 -29987
11561 -29987 -9281 8813 -22152 -29101 13264 43379 -28613 -72592 -101575 -122145 -72831 -25812
11549b5812L7563J5355R320J1950l65K0480j604j1457j5256k4042K0913N045j2785
11536B9305k9755j8619o8042l824K0175P05K5700M7741P474Q160j4982n8652p0456
11523a25070O542P0461J857O5345j8822N820M8467M5139n0272n3025J6136R2628
11511A05206l5316j1150K3602k1982p784p294K8618K1161p2999P120k4086l0444
11499b5348J7032K5457k2084k1019M6845k0496l7020k7019r583L4237K3444n4987
11487g0541l0908M8361k1635L7311L8630K9432n083L1960k0816m5260l1426k9537
11475f9512O854j1225L104O8589m232m4287J9650M5450K3148M2909O5713l4346
11463A11815q7027o1462J7941j2557m04q808P616j9370j6459M5444N1627j277
$$ plain form
11549 -25812 11751 27106 36426 48376 48011 68491 66887 55430 40174 16132 37045 42090 29305
11536 29305 -450 -19069 -87111 -90935 -70760 -70055 -44355 3386 10860 19020 4038 -54614 -125070
11523 -125070 -118528 -48067 -46210 19135 313 6133 54600 99739 49467 -3558 12578 105206
11511 105206 69890 58740 82342 60360 52576 45282 73900 95061 22062 29182 5096 -25348
11499 -25348 -8316 17141 -4943 -25962 20883 387 -36633 -63652 -73235 -38998 -15554 -70541
11487 -70541 -101449 -53088 -74723 -37412 1218 30650 25567 57527 36711 -8549 -39975 -69512
11475 -69512 -62658 -73883 -70779 -2190 -6422 -50709 -31059 14391 37539 80448 146161 111815
11463 111815 24788 -36674 -18733 -31290 -31694 -40502 -32886 -52256 -68715 -23271 28356 27079
11451B7079n1070L7032j5340M0161J8637O8194k7357q0847n1751j9274j093j5355
11439g0984M4973Q238K1062M237n3291k3758J986J8434k4947j7575o3896j6530
11427a72051k0263k679M3409R46J6217P6432Q83p6288K6299M9448j1834R4250
11415B4769K6608n7389N442P9783k2563j5350j9122j675n0540K7942P8316m8214
11403B8007l1956k5686j7305K9416L2240j3448n975l4393o4600J101k6526J1436
11391a17689M7399k8469j2546J5408N16P0063N8898Q583O26J5613j6987J4150
11379E5565j3536n7085K374J9645M5336J0080k1572Q90m5031p3154M1546M5526
11367A0584Q336j3785J6591l0726k4329L9003N0523o0015o0491J5267K763k9590
$$ plain form
11451 27079 -23991 13041 -2299 37862 56499 124693 97336 16489 -35262 -54536 -55629 -70984
11439 -70984 -26011 -17773 3289 7526 -45765 -69523 -67537 -49103 -74050 -91625 -155521 -172051
11427 -172051 -192314 -194993 -151584 -150638 -134421 -57989 -57106 -133394 -107095 -57647 -69481 24769
11415 24769 51377 -6012 -570 79213 56650 41300 22178 20503 -30037 -2095 76221 28007
11403 28007 -3949 -29635 -46940 -17524 14716 1268 -4707 -39100 -103700 -102599 -129125 -117689
11391 -117689 -70290 -98759 -111305 -95897 -95381 -25318 33580 42163 42789 58402 41415 55565
11379 55565 42029 -15056 -12682 6963 52299 62379 40807 41697 -3334 -76488 -34942 10584
11367 10584 18920 5135 21726 -9000 -33329 5674 56197 -3818 -64309 -49042 -46279 -75869
11355g5869l9943J6981L5322K496J934J9294n7595R083O2773n438j7465N5285
11343F858j701j8865j3243M9735N791k8573K887J2906O253K9729J5156n1130M7685
11330F3488L3365k8675m9176j6757n708n9067J4394J0932L0881R5690J5038q4404
11318B0001l4148K8412M8835k6321K0513O1105J0359k9543M8897n2209j05510
11307i609J0068K8785O14m0607O0508R643m1337Q942N4596L3637l8795o9641l6745
11294b9941L4933K6853J6705j6217m0718j7714M698P9184L6636k366j8487l1282
11282D2284j3953l5798k9693l707O56L2244q817j7482K836n9256L7143k549k5022
11269h1114k3203J2651P4091L4699l1M5170K2402j9004k3598m959r981o4118R687
$$ plain form
11355 -75869 -115812 -98831 -63509 -61013 -59079 -39785 -97380 -88297 -25524 -30962 -48427 6858
11343 6858 5157 -13708 -26951 22784 28575 2 2889 15795 22048 51777 66933 15803 63488
11330 63488 96853 68178 19002 2245 -3463 -62530 -48136 -37204 -6323 89367 104405 20001
11318 20001 -14147 14265 63100 36779 57292 118397 128756 99213 148110 95901 -9609
11307 -9609 459 29244 29858 -10749 49759 59402 18065 27007 81603 115240 76445 6804 -29941
11294 -29941 4992 31845 48550 32333 -8385 -26099 -21401 57783 94419 92053 73566 42284
11282 42284 28331 -7467 -37160 -40867 -40211 -7967 -16784 -34266 -31430 -90686 -53543 -56092 -81114
11269 -81114 -104317 -91666 -17575 17124 17093 62263 84665 65661 42063 37104 27123 -36995 -27308
11256b7308J4623O072m0712K1598M6196j0634j7607M5906R996k356m7162l6087
11244c7475j3980k5481J9609j5953j9545O0821J7246j0303j5257O0648L041o4041
11232d0670R5486M8312k6396p687J1058J3420k3226q9432o3942j6665m164O3192
11220d0714K1637J1742J2793j6790M8698J419J3820J820O537l2240k2076L9605
11208D6251k4801k8435L5795N2101m63m5738r5113P7321N5398m4459r7473K8249
11196d1367J4588j1744J1368J9055k2034J7848K8451o6877m9864P569k3110K1007
11184i5110k7695K1225K554L1196J3121L5322J8977O800p1980n8566j6865m1805
11172a82826Q6577Q1793Q7137J1694q2658p6450q278L2322m249K2423j6370L3105
$$ plain form
11256 -27308 -12685 -6613 -47325 -25727 20469 9835 -7772 38134 48130 45774 -1388 -37475
11244 -37475 -51455 -76936 -57327 -73280 -92825 -32004 -14758 -25061 -40318 20330 23371 -40670
11232 -40670 54816 103128 76732 69045 80103 93523 70297 -19135 -83077 -99742 -103906 -40714
11220 -40714 -19077 -7335 5458 -11332 37366 38785 52605 54425 60962 28722 6646 46251
11208 46251 21450 -6985 28810 80911 80448 34710 -60403 16918 72316 27857 -69616 -41367
11196 -41367 -26779 -38523 -27155 -8100 -30134 -12286 16165 -50712 -100576 -93007 -116117 -95110
11184 -95110 -122805 -101580 -99026 -67830 -54709 -19387 -410 6390 -65590 -124156 -141021 -182826
11172 -182826 -96249 -14456 72681 84375 1717 -74733 -83011 -50689 -54938 -32515 -48885 -15780
11160a5780K1094K2313J5930K3907j8890K6683k27o8025o9747r492R0933L0416
11148D9115m6411J1046m2174l8454J1723Q999j8749Q851p8932L8021P2492k2459
11136d6932P4866L8339l5628j7003o2367l638N5836M2025L5763j8547m8398l8611
11124b4295p3163K1797O7277K1569o5466k2836L8009M0991n9564m7994M9842J6564
11112c7269l3534p4149N4048N2228p1190J9595N9436O326L5930m6328Q185L6595
11100I873p283o0466L0519P1003m167q5017j404J4019n3199L7165O3799J9910
11088C4752N5103J8348m9755n771l6668K0823K2742j2081M34k761k2879r8777
11076g6490j9807R6429N1742N0313l6736m4907N4785K744L6543P404n6325m7612
$$ plain form
11160 -15780 5314 27627 43557 67464 48574 75257 75030 7005 -62742 -72234 18699 49115
11148 49115 2704 13750 -28424 -66878 -55155 -46156 -64905 -56054 -134986 -96965 -24473 -46932
11136 -46932 27934 66273 30645 13642 -48725 -52363 3473 45498 81261 62714 14316 -24295
11124 -24295 -97458 -75661 -8384 13185 -52281 -75117 -37108 3883 -55681 -103675 -53833 -37269
11112 -37269 -70803 -144952 -90904 -38676 -109866 -90271 -30835 -24509 11421 -34907 -26722 9873
11100 9873 2590 -57876 -27357 43646 39479 -45538 -46942 -32923 -86122 -48957 14842 34752
11088 34752 89855 108203 58448 52677 16009 36832 59574 47493 47927 45166 22287 -76490
11076 -76490 -96297 132 51874 102187 65451 20544 75329 78073 114616 122020 65695 18083
11064A8083m3073J7585P1851n4635o8356K7840J17926m4587p7590K945J8729j4906
11052b8188k0314l808J343N5200O7385k3213j1669j6143P839K2378o468L0395
11040G4737L7344k4835l5177o3600l3588n287K1540M458L2957L913k2736K0035
11028I761J8294Q558j3215P6898m5776j5329j5698n1079k8060M3463K6776L4662
11016D9255o888L8487L0642r2153l6369K3083p04l2147j4540N322N6871q3705
11004f2846O4122L7421K9596L0449k2167o8444k4318o992k0912J833j336K6463
10992a7131M1817J4062M7867k8509j1134j8414R022l0965M066M6077k3139r263
10980B4356J482m1348K4154M453M2139l0787P551k9040j3364o4776l2000k8682
$$ plain form
11064 18083 -24990 -7405 64446 9811 -58545 -30705 87221 42634 -34956 -32011 -13282 -28188
11052 -28188 -48502 -52310 -50967 4233 71618 48405 36736 20593 28432 50810 44342 74737
11040 74737 112081 87246 52069 -11531 -45119 -50406 -28866 -24408 8549 12462 -10274 9761
11028 9761 28055 36613 23398 100296 54520 39191 23493 -27586 -55646 -12183 14593 49255
11016 49255 42367 80854 111496 19343 -17026 6057 5353 -26794 -41334 -36012 20859 -62846
11004 -62846 1276 38697 68293 98742 76575 8131 -16187 -23179 -44091 -42258 -43594 -17131
10992 -17131 24686 38748 86615 58106 46972 28558 37580 6615 10681 56758 33619 24356
10980 24356 25838 -15510 8644 13097 55236 24449 32000 2960 -10404 -75180 -107180 -135862
10968a35862n780L4415P2839O8673n2829l5052L1618P3361L5040K3883j3347l6083
10956F0876K4612M192k1354n6383l1620K2715q079N2609L0830L0558J8542l6857
10944I0641p3672K101N5459J0708l3731n816J613o184j0745j6296K3556R600K0875
10931F8109o6703o7443j4206R707L2012j4509j6789N805L9456R0341M469n8077
10919A2172k3530K6769N1491n1907k7217L6518K2921J8735J2751q143j7523j3501
10907C9536l8171k5360k2967O5152O082K8207k2368j0197K403L5295M3307K8519
10895A29438j080j20806o4574o1119K6356N3112J9883R1677j3423n4949n6496
10884e1981k1747l6502K3940k836l8039M088J5790M8044M4770l7175L8109J8409
$$ plain form
10968 -135862 -141642 -107227 -34388 34285 -18544 -53596 -21978 51383 86423 110306 96959 60876
10956 60876 85488 89680 68326 11943 -19677 3038 -5041 47568 78398 108956 127498 90641
10944 90641 16969 19070 74529 85237 51506 45690 47303 41119 30374 14078 37634 47234 68109
10931 68109 1406 -66037 -80243 -70536 -38524 -53033 -69822 -64017 -24561 65780 70249 12172
10919 12172 -11358 15411 66902 14995 -12222 24296 47217 65952 78703 70560 53037 39536
10907 39536 1365 -23995 -46962 18190 24272 52479 30111 19914 22317 57612 100919 129438
10895 129438 128358 7552 -57022 -118141 -91785 -38673 -18790 72887 59464 4515 -51981
10884 -51981 -73728 -110230 -86290 -89126 -127165 -123077 -107287 -59243 -14473 -51648 -13539 4870
10872D870k4272K4902J7216l2307M8843N9849L9437k1259n4476l3189p726j3682
10860H206l2307J522K0941L5003p084m0161l6647J5822L6856N9436o0841k0754
10848b0008M4669O6657k8811r5044k3697r400O014k0146M0410K9878J1255j5538
10836a3761m6321rn476L9741K1996k2646J1493K8270K910l4145R254L8863L4155
10823F4324J5305k648o7581j2023L8681J7476L4238j989k146K6169k3923l2519
10811E3364l5117l4133J5163K411K9725K5306K5237m9691J5316K9n0214k5360
10799b7964k1425J3413j9296K7542O5449q133j1511J07562n992n0110j8337n430
10787D5768n9463L7117J4826n3279K5973l1376k65M5883j747p3912N6409k5849
$$ plain form
10872 4870 -19402 5500 22716 -9591 39252 99101 138538 117279 62803 29614 21888 8206
10860 8206 -24101 -22579 -1638 33365 26281 -13880 -50527 -34705 2151 61587 746 -20008
10848 -20008 24661 91318 62507 -32537 -56234 -65634 -59620 -79766 -39356 -9478 1777 -13761
10836 -13761 -60082 -60091 -65567 -25826 -3830 -26476 -14983 13287 16197 -17948 -8694 30169 64324
10823 64324 79629 76981 9400 -2623 36058 53534 87772 85783 83637 109806 85883 53364
10811 53364 18247 -15886 -723 1688 31413 56719 81956 32265 47581 47610 -2604 -27964
10799 -27964 -49389 -35976 -55272 -27730 37719 29586 18075 125637 119645 69535 51198 45768
10787 45768 -13695 23422 38248 -15031 10942 -20434 -20699 25184 23437 -50475 5934 -19915
10775a9915J089L1010L2487O661o4461j7160N5012l5885K59L1443M9522L497j9315
10762E4244o4009o6691o898K1023R3873O8732J9586l077k0783k0076l4852k0706
10750B0366l2906j3359j2386j3167L294P6598L8984L8235O319m7510q555l8680
10738A7233l5215K192j6827j6073M6996L3230l4781l2437j7198J2804j1769k0164
10726g2009j5395m8731k4089M9192K0864L9120J1144l0700l6106K8489l377J6343
10714f5255J9660J7451M6097m3153m4809J4143R4982L2802L2723k3882m9636k6528
10702D595M991L0869M7678K6219j09036k5144j60k4L3798J5269k4288J3434j1693
10689F508J7352J4798p7448l3146M2266K9222L4395j5366j9934L8010J4479O117
$$ plain form
10775 -19915 -18826 12184 44671 51332 -13129 -30289 24723 -11162 -10903 20540 70062 73559 54244
10762 54244 -9765 -76456 -83354 -62331 31542 100274 119860 116783 96000 75924 41072 20366
10750 20366 -12540 -25899 -38285 -51452 -48158 28440 67424 105659 111978 64468 55913 17233
10738 17233 -17982 -15790 -32617 -48690 -1694 31536 -3245 -35682 -52880 -40076 -51845 -72009
10726 -72009 -87404 -136135 -160224 -111032 -90168 -51048 -39904 -70604 -106710 -78221 -81598 -65255
10714 -65255 -45595 -28144 17953 -25200 -70009 -55866 39116 71918 104641 80759 31123 4595
10702 4595 9586 40455 88133 114352 5316 -19828 -19988 -20012 13786 29055 4767 18201 6508
10689 6508 23860 38658 -38790 -71936 -29670 -448 33947 18581 -1353 36657 51136 57253
10677E7253J897N5623j6180l739M5049o3564m1016k8818l74L4081L6788K5534
10665A02534M8591m50r8250K420M8195J6209m9132K3163L0940k7957P5654K2213
10653A94130p0461l8671R74j2582p2893r7614m7983K331L2247M1466j1133M3075
10641c7114J5083l037n9243m751M3345k3828L5935M2279J1541m932p208l9359
10629c1289k0092J0969L8562N0657r9868l5072O603J2225k5759L3552K3156j2429
10617d8785L0621P0396J5125K484n549n580j9392m608N8193M1438k9709l3648
10605G0986k1541L115M3334M0097m7847r6764O552p017l0925J2875J3690k2089
10593c5534J6049J5963J9892L4542K9326J3248m3831k218N4610O6139l7210k0164
$$ plain form
10677 57253 59150 114773 98593 94854 139903 76339 35323 6505 6131 40212 77000 102534
10665 102534 151125 150675 52425 54845 103040 119249 70117 93280 124220 96263 171917 194130
10653 194130 123669 84998 85972 73390 497 -97117 -145100 -142769 -110522 -69056 -80189 -37114
10641 -37114 -22031 -25068 -84311 -89062 -45717 -69545 -33610 8669 20210 15278 8070 -31289
10629 -31289 -51381 -40412 -1850 48807 -51061 -86133 -79530 -67305 -93064 -59512 -36356 -48785
10617 -48785 -18164 52232 67357 69841 64292 58712 39320 34712 92905 134343 104634 70986
10605 70986 49445 52560 95894 135991 88144 -8620 -2068 -9085 -40010 -27135 -13445 -35534
10593 -35534 -19485 -3522 16370 50912 80238 93486 49655 47437 102047 168186 130976 110812
10581A10812k0397K9306R01r7853R482K2972K6028k1254K4110R8731L2168o7802
10569A47204o3531j643p007l9020K2072K5114L6887k3526q6036J2970K1711k7867
10557A7328J6273j17144m1625K4485P6688R5025R242K3464J5207n0402r495o3384
10545d338J8913l2022k3495M3047Q7662Q8108l3748k0041k8566m4589l3313K0146
10533C7764n11k6250P038J2669P0912O0393p4281k0464O7877N8851K765o8271
10521A28492o4991j7412l0838K3747k1407l4887j0592J830K2514K6673J2656k0813
10509A4972j7868l4146J845L8197M3013J4437n52o4205j4440k8193L5031Q818
10497c091l9835L1574j8033L4751J8009R565m9239j7817L8970j5131L1298M6165
$$ plain form
10581 110812 90415 119721 120622 22769 32251 55223 81251 59997 84107 182838 215006 147204
10569 147204 83673 82030 75023 36003 58075 83189 120076 96550 10514 23484 45195 17328
10557 17328 33601 -83543 -125168 -100683 -23995 71030 80272 103736 118943 68541 59046 -4338
10545 -4338 14575 -17447 -40942 2105 89767 177875 144127 124086 95520 50931 17618 37764
10533 37764 37253 11003 18041 30710 101622 162015 87734 67270 135147 193998 196763 128492
10521 128492 63501 46089 15251 38998 17591 -17296 -27888 -26058 -3544 23129 35785 14972
10509 14972 -2896 -37042 -35197 3000 46013 60450 59898 -4307 -18747 -46940 -11909 -3091
10497 -3091 -42926 -11352 -29385 5366 23375 32940 -16299 -34116 4854 -10277 21021 67186
10485F7186J3840k7643m9319m3471N7729O878k9628R0545K0017j8599l0892l0394
10473B6249Q12K4409j2219R6426k6715l6476N4936m9879o6513k7485J14631M1710
10461A39886k6278j6538n121L8458p291l0953k2238k9365M820P5809r828p8175
10449C3186m6984O6618M3455r4232m050P5117J7999j01600p0067N7797j3211r967
10437d5939R734K655o565O1955K4297K2523j6966j7607K8730n684k2626m7345
10425a2838m5888J0913K2592p325O7488J1169R560m9625j6774L6197k2804m0857
10413c8192L8892J9433J8424L8265J4145k5002M5924J6420n1423m2967j7954q329
10401G636k725M9406J3442k5422M9820M0935k144p0581k0762L8175j665J1622
$$ plain form
10485 67186 81026 53383 4064 -39407 18322 25200 -4428 86117 106134 87535 56643 26249
10473 26249 27061 51470 39251 135677 108962 72486 127422 77543 11030 -16455 98176 139886
10461 139886 113608 97070 91949 130407 123116 92163 69925 40560 45380 121189 111361 33186
10449 33186 -13798 52820 96275 2043 -2007 73110 91109 -10491 -80558 -22761 -35972 -45939
10437 -45939 -36205 -33550 -40115 21840 46137 68660 51694 34087 62817 57133 34507 -12838
10425 -12838 -58726 -47813 -25221 -32546 34942 46111 55671 6046 -10728 25469 2665 -38192
10413 -38192 700 20133 38557 76822 90967 65965 111889 128309 76886 33919 15965 7636
10401 7636 4911 54317 67759 42337 92157 133092 130948 60367 39605 77780 76115 87737
10389H7737k476j8500l6997O264J711N1216k4183l3017P3503J2200m794n7436
10377E5228k7160r570R714K3375l5366m273M6647O0757M5098j4185K131m6954
10365A05442m733m561q257M2103O2256K0896r1665l3013N1547n6525n5429K0914
10353D8975l1960j6095L5988L3006O522k6014k0471n9214k2396O9613O106r500
10341A4560n1733o293L6921L6316M057j4607L2873j1666k6195N1928j7406N864
10329E4619k6934k1950O5866K7024K2943Q2890R409q8990l1301n8054j8069J4257
10317C1710k1310k1520O2448q171l6076o4434K980P2429N112M610L713L3048n7910
10304F629J9760M0976K6001K671p5634m7464M3592P7200J1028n5606J9842L9077
$$ plain form
10389 87737 85261 66761 29764 36028 37739 88955 64772 31755 105258 117458 112664 55228
10377 55228 28068 18498 28212 51587 16221 11948 58595 119352 164450 150265 152396 105442
10365 105442 100709 96148 87891 129994 192250 213146 121481 88468 140015 83490 28061 48975
10353 48975 17015 920 36908 69914 76436 50422 29951 -29263 -51659 17954 24060 14560
10341 14560 -37173 -43466 -6545 29771 33828 19221 52094 40428 14233 66161 48755 54619
10329 54619 27685 5735 71601 98625 121568 204458 213867 124877 93576 35522 17453 31710
10317 31710 10400 -11120 51328 43157 7081 -57353 -54373 18056 23168 27778 31491 64539 6629
10304 6629 26389 67365 93366 96037 20403 -27061 16531 93731 104759 49153 68995 108072
10292A08072N7073L3176l7616q9124O566j3284M55J0082J2752L590L7278j4926
10280A14094q572N4752o712r861k5904q428l8381j3452J5813K4768m1585o4171
10268g639O4423P7528J0316o8105J8524N3878K7839j3846l7050k8281o1336o0652
10256b4401M278L7002K9228j1547j6607K6n21O664n452k587j9991k2253Q265J02997
10242H5101N7760K520M7830M123k4768q019K8657k3602m2213q2946l3290k1350
10230a0197n903O5353R0910J3865N4497p4467l5247M2318n970k5173N469m2966
10218G2489l2995m1982j9119N5457P7076m6653m1438k1431J3007M4378L1587k8116
10206F2260J437L5098Q4447l0930j2209m0942P3499J6230o4543m9633M6342K8083
$$ plain form
10292 108072 165145 198321 160705 71581 78147 64863 65318 75400 88152 91742 129020 114094
10280 114094 105522 160274 153562 143701 117797 109369 70988 57536 73349 98117 56532 -7639
10268 -7639 56784 134312 144628 76523 95047 148925 176764 162918 125868 97587 36251 -24401
10256 -24401 -20123 16879 46107 34560 17953 17979 17458 24122 18670 16083 -3908 -26161 -17896 85101
10242 85101 142861 145381 193211 197334 172566 164547 193204 169602 127389 44443 11153 -10197
10230 -10197 -16100 49253 140163 154028 208525 134058 98811 141129 135159 109986 115455 72489
10218 72489 39494 -2488 -21607 33850 110926 64273 22835 1404 14411 58789 90376 62260
10206 62260 63697 98795 183242 152312 140103 99161 172660 188890 124347 74714 121056 149139
10194A49139J7389J674l3618p1070m9172O3671J5528j0317n4294J3581M0516j8845
10182F4182k6936N4641J5029l705L742m1354n0397P4923L1929k4792m7031j8801
10170C1430M2116K2457N1453L335J9787K0588k1672j9319m3999J695j6390L5400
10158A26881n637j2395p398L5952O249P228l8415k3248j8925L4831R519j3708
10146A00934r4028J7874J13866q309p626J3955J5466l5200j8986k0635m3547r970
10134B3794q984K5997o718K1100L1982j569j2370k1998M1521P4624l7980q236
10122A21163K354L9529N9702o850q7845q386P7866K1371K1292p8896m8511l616
10110A09173J3226M0706K4507j3359l7529n6974K3848l759J5637M0529M6121j0371
$$ plain form
10194 149139 166528 168202 134584 63514 14342 78013 93541 83224 28930 42511 83027 64182
10182 64182 37246 91887 106916 103211 106953 65599 15202 90125 122054 97262 50231 31430
10170 31430 73546 96003 147456 150791 170578 191166 169494 150175 106176 107871 91481 126881
10158 126881 121244 108849 101451 137403 143652 150880 112465 89217 70292 105123 114642 100934
10146 100934 6906 24780 138646 130337 122711 136666 152132 116932 97946 77311 33764 23794
10134 23794 14810 40807 34089 55189 87171 85602 73232 51234 92755 167379 129399 121163
10122 121163 123517 163046 222748 215898 128053 119667 197533 218904 240196 161300 112789 109173
10110 109173 122399 163105 187612 174253 136724 79750 103598 99839 115476 156005 202126 191755
10098A91755k096P453o7699n589J4274J5012N6424m6312l6895K5266M268j8502
10086A37359l750n6044m2381j1446L0400m495L4464L3615j7183n894j692o489
10074H6464N6500j4288j6882j5397J9817p71k617j6126Q482R287K9797q379k799
10061A33088m036l3889n8835N6951M7046r74P2232N0843j5627M86J8352O941l7832
10048B34746p2996l9973o6481M2872N6981k8736O613N1694O32m9220l8214K1006
10036A18924N24o4442j1079K1716J4190K0890M972q319j2713r257P990K4876L0562
10023A38834p1864J1156M6241N6065M4730r061k4533l0361p2090o7662M7620O9278
10011A38353L7125l892q4239j407Q4207q399k3528K5750P254l5303l7106K106
$$ plain form
10098 191755 189659 197112 129413 123824 138098 153110 209534 163222 126327 151593 155861 137359
10086 137359 133609 77565 35184 23738 54138 49643 84107 117722 100539 94645 92953 86464
10074 86464 142964 128676 111794 96397 116214 115443 112826 96700 105182 114469 144266 135887 133088
10061 133088 129052 95163 36328 93279 140325 139351 211583 262426 246799 247285 265637 272578 234746
10048 234746 161750 121777 55296 98168 155149 126413 133026 184720 185352 136132 97918 118924
10036 118924 119448 55006 43927 65643 79833 100723 105695 97376 84663 75406 83396 108272 138834
10023 138834 66970 78126 124367 180432 225162 216101 191568 161207 89117 21455 69075 138353
10011 138353 175478 171586 87347 85940 170147 161748 138220 163970 171224 135921 98815 100921
9999A00921N492K2189j5373l573K3227j016j8738j214M9854K8310K4364l6293
9987A78150q519k723m302J3655j5100k9285K306r322J3133K075M5883q761k3404
9974A53786K9905k6234n4578o068k8003Q974L2174J3406M150L8999J4099M0763
9962B21373k6796l9705k5609Q868l170l9625J2848M9294L5841q78Q307j2452l0419
9949A57877K1893P7051O1460l8806k082L8625Q185J035J0204o525o7842r6244
9937A64831m8487P4051M6916n8095l6107K7553J9412L1699J730p5725j6491M1199
9925A72486N4146k6460o456J628j1634k7511l2423k7058N3814O3387J9777p404
9913B26292j1297j4755k7761L706O1968L3864o8595k9532M8008L2819Q0430P5845
$$ plain form
9999 100921 106413 128602 113229 109656 132883 131867 113129 111915 161769 190079 214443 178150
9987 178150 169631 166908 162606 176261 161161 131876 134182 124860 137993 140068 185951 177190 153786
9974 153786 183691 157457 102879 96811 68808 77782 109956 123362 127512 166511 180610 221373
9962 221373 194577 154872 129263 138131 134961 95336 108184 157478 193319 192441 200748 188296 157877
9949 157877 179770 256821 318281 279475 277393 316018 324203 325238 335442 328917 261075 164831
9937 164831 116344 190395 237311 179216 143109 170662 190074 221773 223503 147778 131287 172486
9925 172486 226632 200172 193716 195344 183710 156199 123776 96718 150532 213919 233696 226292
9913 226292 214995 200240 172479 176185 238153 272017 203422 173890 221898 254717 335147 410992
9901D10992j9979p8740j6240m9092k0579o93l3816j0282k6827l1061O5533L2068
9889B21284m8561j320L1635M517j1316l2254L1398K2769L0743j6352o0717l0390
9877A41436J6867M0801l428L171R094J7693N6611l6808j560J5968J2785K1764
9865B94394m5580n2777m0620L6910m794r372l2455N2452j1219o0162j14J06485
9853B33148M4026l396J6932k3218j1520R719Q3797k8720q9788k0221m8805J531
9841A63485J0464k574o729K4259P4454k5363n29l1016J9185N739M3J5776J6869
9828B64063n945q9186l6145R1217M5290j1101k8630l4686M0375m6923L4236m149
9816B18416j8995m4616O742p6253p621J01468L0308n2620p2892m0181O6106N1314
$$ plain form
9901 410992 391013 312273 296033 246941 226362 225669 191853 181571 154744 123683 189216 221284
9889 221284 172723 171403 203038 207555 196239 163985 195383 218152 248895 232543 171826 141436
9877 141436 158303 199104 195676 198847 207941 225634 282245 245437 243877 259845 272630 294394
9865 294394 248814 196037 155417 192327 187533 178161 145706 198158 186939 126777 126663 233148
9853 233148 277174 273778 290710 267492 255972 265691 349488 320768 230980 210759 161954 163485
9841 163485 173949 171375 164646 188905 263359 237996 237467 206451 225636 231375 231418 247194 264063
9828 264063 258118 168932 132787 224004 269294 258193 229563 194877 235252 188329 222565 218416
9816 218416 199421 154805 161547 85294 77673 179141 209449 156829 83937 43756 109862 161176
9804A61176J7518L6740k7193n8677J4611J40949M1718m845o1902L5475J399k0554
9792B76415o4278m3723M6329L6469L6086m1807l5903l5980j5044j4137Q943J3021
9780A66391k4179L921K1082J618j4094M6515L804k0122l1724M21M8524m4053j6339
9767A41765O0677j5278J280M6674K154M693o6323j2986K8866N1066j3726q1277
9755A47585m02L337N6209L1833l808Q170K1707l5430R479m000n2981k8990k9347
9742A23362j812N0410j5746M2693m0945m4J7270j82L0989K764l0884P923j8296
9729A67502O9878L5638J5398r996j6764K6781l0934k7460m2169l1194J9479O1506
9717B37665L3138O6839k9483m6837m2464m2925J2955N8202M901K6569j6440p041
$$ plain form
9804 161176 178694 215434 188241 129564 144175 285124 326842 321997 260095 295570 296969 276415
9792 276415 212137 168414 214743 251212 287298 245491 209588 173608 158564 144427 153370 166391
9780 166391 142212 146133 167215 168833 154739 201254 205058 184936 153212 153633 202157 158104 141765
9767 141765 202442 187164 188444 235118 237272 241965 175642 162656 191522 242588 228862 147585
9755 147585 147183 150520 206729 238562 234754 242924 264631 229201 238680 234680 181699 152709 123362
9742 123362 121550 171960 156214 198907 157962 157918 175188 175006 205995 208759 177875 185798 167502
9729 167502 237380 273018 288416 278420 261656 288437 257503 230043 187874 156680 176159 237665
9717 237665 270803 337642 308159 261322 218858 175933 188888 247090 251991 278560 262120 255079
9705B55079k5653m9708L119j4664l437L6504L6782L2178K2363m974O70l5813l2667
9692B19779k356J3974L5010k716l39K6848l4149n085J3272o1074m2471j97O0345
9679B20841M454J3354M8105K068j0319L521O931n2680r795m48J3532n977K2259
9666B55846j2390n4232L00l4819M2851J8955l2103n2930k898R1651K2968l333
9654B39866L653K8202p6059j2854L5616L2359K5470o4366k4016L1623j1923q2338
9642A25233o9127O2547Q2405k0239j4744k9296N2595L4905m4007m9529R6478j7868
9630B09353m902J9076J0312n1325l1119J0279q461m199m28O4926n79J19n9770
9617A53282O438N4926M0045J0214j7396k7309M6015l9036K6288k0012n3311J0471
$$ plain form
9705 255079 229426 179718 182837 168173 164736 201240 238022 270200 292563 287589 288259 252446 219779
9692 219779 217423 231397 266407 263691 263352 290200 256051 250966 264238 203164 160693 160496 220841
9679 220841 225295 238649 286754 288822 278503 282024 288955 236275 226480 226032 239564 233587 255846
9666 255846 243456 189224 189524 154705 197556 216511 184408 131478 128580 220231 243199 239866
9654 239866 243519 271721 195662 182808 218424 250783 276253 211887 187871 219494 207571 125233
9642 125233 56106 118653 201058 180819 166075 136779 189374 224279 180272 130743 227221 209353
9630 209353 204451 223527 233839 182514 151395 161674 153213 149014 148586 213512 212933 213052 153282
9617 153282 159720 214646 254691 264905 247509 220200 266215 227179 253467 233455 180144 190615
9605A90615O1118Q0358k0033l3653L6803O4678m9552k9232M159q389l8048o3681
9593A95143j0727l4922r694P994J3008k5124k2764Q5294R1431l425L6078n8932
9581B63360n9361R051O6814J5284M741r0669p8131r35J4019J5275L7335J8740
9569B15523J9839k3012k829k8986M209K0367J382m050M3238Q035N167L0284M198
9556B93365m8856k8770K8081l4142M4211J2002l5897M5850m8313o4703n0337Q767
9544A21258J9383L5437l2761J5946P8274L0726N1807l3750p538N4727J9176j1378
9532C41307r162n4826L538n5196n7453N345L17k5094M7577k0812l0948j709O2537
9519B05421J5901N586l3723j4225j6585M6382K3050n2501j9034l5667l5804M5107
$$ plain form
9605 190615 251733 332091 312058 278405 315208 379886 330334 301102 305261 296872 258824 195143
9593 195143 184416 149494 139800 147794 160802 135678 112914 198208 289639 286214 322292 263360
9581 263360 203999 213050 279864 295148 299889 209220 131089 130154 144173 159448 196783 215523
9569 215523 235362 212350 209521 180535 184744 205111 206493 202443 245681 253716 258883 289167 293365
9556 293365 244509 215739 243820 209678 253889 265891 229994 275844 227531 162828 112491 121258
9544 121258 140641 176078 143317 159263 237537 268263 320070 286320 278782 333509 352685 341307
9532 341307 332145 277319 280857 225661 168208 173553 173870 148776 196353 175541 144593 142884 205421
9519 205421 221322 226908 193185 178960 162375 208757 231807 179306 160272 124605 88801 133908
9507A33908J275j7944P712L3013l1501L61R4737j1036n2955r763P6167l4610k3547
9494A65817J3202k6218K6229k6962k9423N6784M2791L5574k5460p935j988M81
9482B22892K5204m1936L198l957l7984q3793k5994k6025N6647L7586K1128j0899
9470A36067l450L6299L6240K7439l6565m3753n3779J7887m6115p1343k4901M4217
9458A8243P5889k4492k9153M1274O6673p777L2365J1884n8800k4934L4357J848
9446A37377N5473k4201l2450K7399L8203l423l0341k7280k7825l7011K9610m0821
$$ plain form
9507 133908 135183 117239 124951 157964 126463 126824 221561 210525 157570 147807 223974 189364 165817
9494 165817 179019 152801 179030 152068 122645 179429 222220 257794 232334 224399 222411 222892
9482 222892 248096 206160 209358 205401 167417 83624 57630 31605 88252 125838 146966 136067
9470 136067 132617 168916 205156 232595 196030 152277 98498 116385 70270 -1073 -25974 18243
9458 18243 94132 69640 40487 81761 148434 140657 173022 184906 126106 101172 135529 137377
9446 137377 192850 168649 136199 163598 201801 198378 168037 140757 112932 75921 105531 64710
$$ [...]
##END NTUPLES=NMR SPECTRUM
##END=
