##TITLE=Analysis number 319752
Compound Code cc 56101
Book Reference 458/130
Project Code adrs
Chemist Name stevem
##JCAMPDX= 6.0         $$ Bruker NMR JCAMP-DX V2.0
##DATA TYPE= NMR SPECTRUM
##DATA CLASS= NTUPLES
##ORIGIN= Bruker BioSpin GmbH
##OWNER= nmr
$$ XWIN-NMR		Version 3.5
$$ Thu May 25 12:59:46 2006 GMT Daylight Time (UT+1h)  MAYBRIDGE\nmr@NMR_250MHZ
##.OBSERVE FREQUENCY= 250.131544655141
##.OBSERVE NUCLEUS= ^1H
##.ACQUISITION MODE= SIMULTANEOUS (DQD)
##.ACQUISITION SCHEME= undefined
##.AVERAGES= 16
##.DIGITISER RES= 18
##SPECTROMETER/DATA SYSTEM= dpx250
##.PULSE SEQUENCE= zg30
##.SOLVENT NAME= DMSO
##.SHIFT REFERENCE= (INTERNAL, DMSO, 0, 16.522)
##AUDIT TRAIL= $$ (NUMBER, WHEN, WHO, WHERE, WHAT)
$$ ##TITLE= Audit trail, XWIN-NMR		Version 3.5
$$ ##JCAMPDX= 5.01
$$ ##ORIGIN= Bruker BioSpin GmbH
$$ ##OWNER= nmr
$$ C:\u/data/dgb/nmr/ADRS/5150/pdata/1/auditp.txt
$$ ##AUDIT TRAIL=  $$ (NUMBER, WHEN, WHO, WHERE, WHAT)
(   1,<2006-05-25 12:59:06.13 +100>,<MAYBRIDGE\nmr>,<NMR_250MHZ>,
      <created by zg, POWCHK disabled, PULCHK disabled
       configuration hash MD5:
       84 BC 41 DB A1 6E 1D 46 DA 25 12 A5 C1 ED C5 3A
       data hash MD5: 64K
       F2 BA F4 FE 9D 26 B5 3C 04 9E 08 75 D5 24 FA F4>)
(   2,<2006-05-25 12:59:27.52 +100>,<MAYBRIDGE\nmr>,<NMR_250MHZ>,
      <Start of raw data processing
       ef LB = 0.3 FT_mod = 6 PKNL = 1 SI = 32K 
       data hash MD5: 32K
       B9 46 97 27 57 14 64 F3 80 AB 5C 14 67 C2 36 A2>)
(   3,<2006-05-25 12:59:29.94 +100>,<MAYBRIDGE\nmr>,<NMR_250MHZ>,
      <apk 
       data hash MD5: 32K
       E1 6E 3B B6 1A C5 F7 E8 82 23 1B 6D 35 D9 34 9D>)
(   4,<2006-05-25 12:59:31.63 +100>,<MAYBRIDGE\nmr>,<NMR_250MHZ>,
      <abs ABSG = 5 
       data hash MD5: 32K
       C4 30 6D 5D 4E 1D D7 4C E9 13 CD 80 F8 D9 E8 2E>)
$$ ##END=
$$ 
$$ hash MD5
$$ 15 7E DA 99 6E BB AB E4 20 34 C9 41 DF 4C 57 00
##$RELAX= 
##$RELAX= 
##$RELAX= 
##$RELAX= 
##$RELAX= 
##$RELAX= 
##$RELAX= 
$$ Bruker specific parameters
$$ --------------------------
##$DU= <C:\u>
##$EXPNO= 5150
##$NAME= <ADRS>
##$PROCNO= 1
##$TYPE= <nmr>
##$USER= <dgb>
##$AMP= (0..31)
100 100 100 100 100 100 100 100 100 100 100 100 100 100 100 100 100 100 
100 100 100 100 100 100 100 100 100 100 100 100 100 100 
##$AQSEQ= 0
##$AQ_mod= 3
##$AUNM= <au_zg>
##$AUTOPOS= <53 >
##$BF1= 250.13
##$BF2= 250.13
##$BF3= 250.13
##$BF4= 250.13
##$BF5= 500.13
##$BF6= 500.13
##$BF7= 500.13
##$BF8= 500.13
##$BYTORDA= 1
##$CFDGTYP= 0
##$CFRGTYP= 5
##$CHEMSTR= <none>
##$CNST= (0..31)
1 1 145 1 1 1 1 1 1 1 1 1 1 1 1 1 1 1 1 1 1 1 1 1 1 1 1 1 1 1 1 1 
##$CPDPRG= <>
##$CPDPRG1= <>
##$CPDPRG2= <>
##$CPDPRG3= <>
##$CPDPRG4= <mlev>
##$CPDPRG5= <mlev>
##$CPDPRG6= <mlev>
##$CPDPRG7= <mlev>
##$CPDPRG8= <mlev>
##$CPDPRGB= <>
##$CPDPRGT= <>
##$D= (0..31)
0 1 0 0 0 0 0 0 0 0.06 0 0 0 0 0 0 0.0002 0 0 0 0 0 0 0 0 0 0 0 0 0 0 
0 
##$DATE= 1148558343
##$DBL= (0..7)
120 120 120 120 120 120 120 120 
##$DBP= (0..7)
150 150 150 150 150 150 150 150 
##$DBP07= 0
##$DBPNAM0= <>
##$DBPNAM1= <>
$$ [...]
##$SUBNAM7= <"">
##$SUBNAM8= <"">
##$SUBNAM9= <"">
##$SW= 20.6930455092707
##$SWIBOX= (0..15)
0 0 3 0 0 0 0 0 0 0 0 0 0 0 0 0 
##$SW_h= 5175.983436853
##$TD= 65536
##$TD0= 1
##$TE= 295.16
##$TE2= 300
##$TE3= 300
##$TEG= 300
##$TL= (0..7)
0 120 120 120 120 120 120 120 
##$TP= (0..7)
150 150 150 150 150 150 150 150 
##$TP07= 0
##$TPNAME0= <>
##$TPNAME1= <>
##$TPNAME2= <>
##$TPNAME3= <>
##$TPNAME4= <>
##$TPNAME5= <>
##$TPNAME6= <>
##$TPNAME7= <>
##$TPOAL= (0..7)
0.5 0.5 0.5 0.5 0.5 0.5 0.5 0.5 
##$TPOFFS= (0..7)
0 0 0 0 0 0 0 0 
##$TUNHIN= 0
##$TUNHOUT= 0
##$TUNXOUT= 0
##$USERA1= <user>
##$USERA2= <user>
##$USERA3= <user>
##$USERA4= <user>
##$USERA5= <user>
##$V9= 5
##$VALIST= <valist>
##$VCLIST= <CCCCCCCCCCCCCCC>
##$VD= 0
##$VDLIST= <DDDDDDDDDDDDDDD>
##$VPLIST= <PPPPPPPPPPPPPPP>
##$VTLIST= <TTTTTTTTTTTTTTT>
##$WBST= 1024
##$WBSW= 4
##$XGAIN= (0..3)
0 0 0 0 
##$XL= 0
##$YL= 0
##$YMAX_a= 198271
##$YMIN_a= -362821
##$ZGOPTNS= <>
##$ZL1= 120
##$ZL2= 120
##$ZL3= 120
##$ZL4= 120
##$ABSF1= 16.522
##$ABSF2= -4.171173
##$ABSG= 5
##$ABSL= 3
##$ALPHA= 0
##$AQORDER= 0
##$ASSFAC= 0
##$ASSFACI= 0
##$ASSFACX= 0
##$ASSWID= 0
##$AUNMP= <proc_1d>
##$AZFE= 0.1
##$AZFW= 0.1
##$BCFW= 0
##$BC_mod= 0
##$BYTORDP= 0
##$COROFFS= 0
##$CY= 12.5
##$DATMOD= 1
##$DC= 0
##$DFILT= <>
##$DTYPP= 0
##$F1P= 14.0000005364418
##$F2P= -0.99999901652339
##$FCOR= 0.5
##$FTSIZE= 32768
##$FT_mod= 6
##$GAMMA= 0
##$GB= 0
##$INTBC= 1
##$INTSCL= 1
##$ISEN= 128
##$LB= 0.3
##$LEV0= 0
##$LPBIN= 0
##$MAXI= 10000
##$MC2= 0
##$MEAN= 0
##$ME_mod= 0
##$MI= 0
##$NCOEF= 0
##$NC_proc= -5
##$NLEV= 6
##$NOISF1= 0
##$NOISF2= 0
##$NSP= 0
##$NTH_PI= 0
##$NZP= 0
##$OFFSET= 16.522
##$PC= 1
##$PHC0= 160.8278
##$PHC1= 15.67707
##$PH_mod= 1
##$PKNL= yes
##$PPARMOD= 0
##$PSCAL= 4
##$PSIGN= 0
##$REVERSE= no
##$SF= 250.13
##$SI= 32768
##$SIGF1= 0
##$SIGF2= 0
##$SINO= 400
##$SIOLD= 32768
##$SREGLST= <1H.DMSO>
##$SSB= 0
##$STSI= 32768
##$STSR= 0
##$SW_p= 5175.98343685301
##$SYMM= 0
##$S_DEV= 0
##$TDeff= 65536
##$TDoff= 0
##$TI= <Analysis number 999999
Compound Code 99
Book Reference 9
Project Code 9>
##$TILT= no
##$TM1= 0
##$TM2= 0
##$TOPLEV= 0
##$USERP1= <user>
##$USERP2= <user>
##$USERP3= <user>
##$USERP4= <user>
##$USERP5= <user>
##$WDW= 1
##$XDIM= 32768
##$YMAX_p= 368456469
##$YMIN_p= -1216307
$$ End of Bruker specific parameters
$$ ---------------------------------
##NTUPLES= NMR SPECTRUM
##VAR_NAME=  FREQUENCY,     SPECTRUM/REAL,   SPECTRUM/IMAG
##SYMBOL=    X,             R,               I
##VAR_TYPE=  INDEPENDENT,   DEPENDENT,       DEPENDENT
##VAR_FORM=  AFFN,          ASDF,            ASDF
##VAR_DIM=   32768,         32768,           32768
##UNITS=     HZ,            ARBITRARY UNITS, ARBITRARY UNITS
##FACTOR=    0.157963299565203, 1,           1
##FIRST=     4132.6476996994, 0,             0
##LAST=      -1043.33573715361, 0,           0
##MIN=       -1043.33573715361, -1216307,    0
##MAX=       4132.6476996994, 368456469,     0
$$ Real data points
##PAGE= N=1
##DATA TABLE= (X++(R..R)), XYDATA
$$ [...]
$$ plain form
15519 -107208 -90729 4257 -68529 -123360 -232549 -112712 114876 333719 358187 43918
15509 43918 110926 -49547 -123667 14383 -172299 -106922 -141260 -158630 -147158 -100959 -110219
15498 -110219 54478 75164 -331404 -564440 -610563 -401775 -374248 -307056 -171373 -366807
15488 -366807 -179053 -5755 -115564 -9884 214098 148878 198996 171235 298427 32767
15478 32767 155745 351511 368678 529534 692258 560608 235704 -93607 -259571 -241326
15468 -241326 -149892 -235873 -466979 -382610 -335981 -378678 -274908 -299191 -232506 -88547 -16146
15457 -16146 -11174 303371 259145 119738 15472 -64097 -155075 247668 271532 -147778 -316333
15446 -316333 -478653 -175422 34740 16062 -157514 8258 -55583 -294843 -249246 -77653
$$ packed form
15519a07208J6479R4986p2786n4831j09189J19837K27588K18843K4468l14269
15509D3918O7008j60473p4120J38050j86682O5377l4338j7370J1472M6199r260
15498a10219J64697K0686m06568k33036m6123K08788K7527O7192J35683j95434
15488c66807J87754J73298j09809J05680K23982o5220N0118k7761J27192k65660
15478C2767J22978J95766J7167J60856J62724j31650l24904l29311j65964J8245
15468b41326R1434q5981k31106Q4369M6629m2697J03770k4283O6685J43959P2401
15457a6146M972L14545m4226j39407j04266p9569r0978M02743K3864m19310j68555
15446c16333j62320L03231K10162j8678j73576J65772o3841k39260M5597J71593
$$ plain form
15436 -77653 -2137 -40276 1746 91056 -175526 -307576 -33001 30737 48680 71640 186760
15425 186760 95332 -116544 -71875 -98441 -251544 -247310 -345493 -44412 -35565 -97771 26146
15414 26146 90677 380567 619685 513110 457319 221813 -21304 -96038 -23995 38549 30828
15403 30828 -50891 89133 149562 100053 293894 78880 -200802 -19429 90471 -165301
15393 -165301 -95951 193815 366889 422608 143131 -35378 -53375 -205058 -162394 86384
15383 86384 94295 9730 283334 340560 349388 337309 551 15142 285310 393606 90625
15372 90625 -217614 59143 312612 451376 485186 506339 427756 437810 462383 371367 50674
15361 50674 196090 -20402 -180847 -188025 -220455 -239838 -48567 -85634 -163800 -289943 -241382
$$ packed form
15436g7653P5516l8139M2022Q9310k66582j32050K74575O3738J7943K2960J15120
15425A86760r1428k11876M4669k6566j53103M234r8183L01081Q847o2206J23917
15414B6146O4531K89890K39118j06575n5791k35506k43117p4734P2043O2544p721
15403C0828q1719J40024O0429m9509J93841k15014k79682J81373J09900k55772
15393a65301O9350K89766J73074N5719k79477j78509j7997j51683M2664K48778
15383H6384P911q4565K73604N7226Q828j2079l36758J4591K70168J08296l02981
15372I0625l08239K76757K53469J38764L3810K1153p8583J0054K4573r1016l20693
15361E0674J45416k16492j60445p178l2430j9383J91271l7067p8166j26143M8561
$$ plain form
15350 -241382 151359 513526 608145 264395 325914 301589 214295 32600 -154676 -169281
15340 -169281 -274773 -290156 -360624 -154845 -36961 -107970 -224542 -95479 -57503 -311646
15330 -311646 -311899 -416163 -327686 -536902 -618718 -681211 -719689 -362502 -330601 -433711 -577078
15319 -577078 -469231 -27027 489759 670716 581634 339392 397551 401137 196445 168622
15309 168622 118272 240529 553876 450183 329950 320927 291438 417714 511838 245974
15299 245974 297422 357759 354092 750708 815040 605742 317221 455536 583023 196948
15289 196948 -46183 142401 -85198 -183630 150418 69468 102453 248013 462687 395309
15279 395309 135499 -67147 37296 305534 381385 143708 -141117 -81912 39951 244776
$$ packed form
15350b41382L92741L62167R4619l43750O1519k4325q7294j81695j87276j4605
15340a69281j05492j5383p0468K05779J17884p1009j16572J29063L7976k54143
15330c11646k53j04264Q8477k09216q1816o2493l8478L57187L1901j03110j43367
15319e77078J07847M42204N16786J80957q9082k42242N8159L586k04692k7823
15309A68622n0350J22257L13347j03693j20233r023k9489J26276R4124k65864
15299B45974N1448O0337l667L96616O4332k09298k88521J38315J27487l86075
15289A96948k43131J88584k27599r8432L34048q0950L2985J45560K14674o7378
15279C95309k59810k02646J04443K68238P5851k37677k84825N9205J21863K04825
$$ plain form
15269 244776 357415 412404 275682 164824 403531 495487 384152 613908 677543 996840
15259 996840 955663 954073 1054771 905665 855626 1142538 960591 820005 785701 945404
15249 945404 651107 783442 785841 625539 709409 1049070 1362236 1359840 1454977 1535407 1538357
15238 1538357 1400272 1119860 1023632 885678 1069254 1278511 1430349 1629282 1631096 1756020
15228 1756020 1683023 1453487 1207329 1189827 1271424 1491515 1822733 1585838 1639413 2101749
15218 2101749 1786713 1910575 2135462 2297892 2760391 2974767 2934592 3007341 3480193 3598135
15208 3598135 3855712 4533030 5306317 5788925 6153178 6506821 7493997 8626697 9936823
15199 9936823 11093132 12541749 14173287 16203085 18231635 20989648 24353243 28024430
$$ packed form
15269B44776J12639N4989j36722j10858K38707R1956j11335K29756O3635L19297
15259I96840m1177j590J00698j49106n0039K86912j81947j40586l4304J59703
15249I45404k94297J32335K399j60302Q3870L39661L13166k396R5137Q0430K950
15238A538357j38085k80412r6228j37954J83576K09257J51838J98933J814J24924
15228A756020p2997k29536k46158j7502Q1597K20091L31218k36895N3575M62336
15218B101749l15036J23862K24887J62430M62499K14376m0175P2749M72852J17942
15208C598135K57577O77318P73287M82608L64253L53643R87176J132700J310126
15199I936823J156309J448617J631538K029798K028550K758013L363595L671187
$$ plain form
15191 28024430 32854681 38663414 46012530 55760172 67970833 82925310 100401400 120388655
15183 120388655 141729021 163187173 181710670 195213053 202564737 203650645 198798798
15176 198798798 187803129 171263728 151506115 131069937 111884239 94964309 80666887
15169 80666887 69097039 60243432 53562956 48553375 44634489 41570175 38762226 36277342
15161 36277342 34058281 32095310 30188436 27782841 26076144 24640981 23349428 21999827
15153 21999827 20967992 20121376 19020115 18176073 17697755 17109167 15910921 14949102 14230889
15144 14230889 13953726 13337622 12760171 12615286 12229649 11604150 11272568 10988532 10761644
15135 10761644 10482844 10311618 10157059 9694884 9144821 9009661 8881998 8733924 8344993
$$ packed form
15191B8024430M830251N808733P349116R747642J2210661J4954477J7476090J9987255
15183A20388655K1340366K1458152J8523497J3502383P351684J085908m851847
15176A98798798j0995669j6539401j9757613k0436178j9185698j6919930j4297422
15169H0666887j1569848q853607o680476n009581l918886l064314k807949k484884
15161C6277342k219061j962971j906874k405595j706697j435163j291553j349601
15153B1999827j031835q46616j101261q44042m78318n88588j198246r61819p18213
15144A4230889k77163o16104n77451j44885l85637o25499l31582k84036k26888
15135A0761644k78800j71226j54559m62175n50063j35160j27663j48074l88931
$$ plain form
15126 8344993 7925030 7886812 7727168 7585777 7480529 7056939 6657847 6348505 6392638 6334801
15116 6334801 6232802 6299266 5939756 5388361 5440528 5699039 5532687 5362357 5098439 4861193
15106 4861193 4433323 4268018 4221703 4013879 3983010 3785625 3802784 3776824 3596066 3506454
15096 3506454 3607153 3675272 3708766 3529884 3167214 3232443 3199704 3127411 2861935 2617572
15086 2617572 2619963 2537304 2609179 2511519 2414467 2574959 2760211 2558938 2269750 2165215
15076 2165215 2296560 2385237 2216524 1991731 1974753 1842556 1505024 1251170 1519878 1703043
15066 1703043 1307085 1182799 1399875 1383927 1484519 1447702 1226911 1070093 930253 881373
15056 881373 1075021 1266385 1445630 1499928 1157848 1090066 1315940 1284694 1186841 981964
$$ packed form
15126H344993m19963l8218j59644j41391j05248m23590l99092l09342M4133n7837
15116F334801j01999O6464l59510n51395N2167K58511j66352j70330k63918k37246
15106D861193m27870j65305m6315k07824l0869j97385J7159k5960j80758q9612
15096C506454J00699O8119L3494j78882l62670O5229l2739p2293k65476k44363
15086B617572K391q2659P1875r7660r7052J60492J85252k01273k89188j04535
15076B165215J31345Q8677j68713k24793j6978j32197l37532k53854K68708J83165
15066A703043l95958j24286K17076j5948J00592l6817k20791j56818j39840m8880
15056H81373J93648J91364J79245N4298l42080o7782K25874l1246r7853k04877
$$ plain form
15046 981964 1089903 1165922 1216659 1115015 1077530 1122704 973136 719189 376520 384607 768880
15035 768880 772093 578111 667913 604860 589546 595485 925108 940717 779159 718962 593089
15024 593089 676828 423349 360822 166616 309685 258208 89224 412235 636862 608009
15014 608009 374959 290296 134779 1397 106361 40478 202084 278337 566376 715145
15004 715145 649374 725952 580556 540060 421729 374682 488680 383929 174372 131286
14994 131286 153576 317069 534686 656805 646901 568142 590909 591474 651332 708269 320957
14983 320957 65544 191742 500829 531224 609534 595464 503077 404729 238958 218787 547517
14972 547517 847598 730812 646821 36164 22031 106241 -5057 -62018 -74455 -81266 9181
$$ packed form
15046I81964J07939P6019N0737j01644l7485M5174j49568k53947l42669Q087L84273
15035G68880L213j93982Q9802o3053j5314N939L29623J5609j61558o0197j25873
15024E93089Q3739k53479o2527j94206J43069n1477j68984L23011K24627k8853
15014F08009k33050q4663j55517j33382J04964o5883J61606P6253K88039J48769
15004G15145o5771P6578j45396m0496j18331m7047J13998j04751k09557m3086
14994A31286K2290J63493K17617J22119r904p8759K2767N65N9858N6937l87312
14983C20957k55413J26198L09087L0395P8310j4070r2387r8348j65771k0171L28730
14972E47517L00081j16786q3991o10657j4133Q4210j11298n6961j2437o811R0447
$$ plain form
14961 9181 298343 492573 480325 323415 99001 -43521 -153211 -32588 -16530 114874
14951 114874 2784 -75175 15105 247013 421471 414129 182503 -20969 -185892 -346167
14941 -346167 -308912 -34164 -52318 -94692 7445 76798 -137962 -251872 -41846 198998
14931 198998 384688 349169 168925 139301 406674 545234 837219 865642 899046 1031614
14921 1031614 845620 704654 581266 559921 709425 924460 770233 216009 127779 80464
14911 80464 21386 66740 387158 877758 931911 895400 735734 385470 347690 369875 439355
14900 439355 258336 187809 470196 721317 585809 214129 28233 -39720 14567 188240
14890 188240 175599 60513 -43571 84608 289218 290384 -162000 -304683 -98238 48880
$$ packed form
14961I181K89162J94230j2248j56910k24414j42522j09690J20623J6058J31404
14951A14874j12090p7959R0280K31908J74458p342k31626k03472j64923j60275
14941c46167L7255K74748j8154m2374J02137O9353k14760j13910K10026K40844
14931A98998J85690l5519j80244k9624K67373J38560K91985K8423L3404J32568
14921A031614j85994j40966j23388k1345J49504K15035j54227n54224q8230m7315
14911H0464n9078M5354L20418M90600N4153l6511j59666l50264l7780K2185O9480
14900D39355j81019p0527K82387K51121j35508l71680j85896o7953N4287J73673
14890A88240j2641j15086j04084J28179K04610J166m52384j42683K06445J47118
$$ plain form
14880 48880 213010 407063 325335 213740 274039 3681 -83480 -300307 -103062 331633
14870 331633 402535 521385 459097 447219 193728 103538 22291 -11439 -211754 -370778 -67734
14859 -67734 156331 125470 -8176 -226572 -517187 -407116 -210289 -58029 -2233 -9971
14849 -9971 4346 -47008 134748 168701 236102 564787 452775 204435 313401 425955 348518
14838 348518 121113 -92136 -168746 -171899 -200802 -163986 -193150 -173945 -188885 -148130 -49160
14827 -49160 -159646 -9715 51573 210915 171212 211573 143499 -100366 4179 238719
14817 238719 549594 640456 426109 362088 140138 293826 428499 228542 94567 -45537
14807 -45537 -303497 -471329 -486495 -434251 -301203 64710 366297 347229 303642 272588 35160
$$ packed form
14880D8880J64130J94053q1728j11595O0299k70358q7161k16827J97245M34695
14870C31633P0902J18850o2288j1878k53491r0190q1247l3730k00315j59024L03044
14859f7734K24065l0861j33646k18396k90615J10071J96827J52260N5796p738
14849i971J4317n1354J81756L3953O7401L28685j12012k48340J08966J12554p7437
14838C48518k27405k13249p6610l153k8903L6816k9164J9205j4940M0755R8970
14827d9160j10486J49931O1288J59342l9703M0361o8074k43865J04545K34540
14817B38719L10875R0862k14347o4021k21950J53688J34673j99957j33975j40104
14807d5537k57960j67832j5166N2244J33048L65913L01587j9068m3587l1054k37428
$$ plain form
14796 35160 -325073 -224556 50504 82780 24866 -21945 31164 -321228 -626611 -842157
14786 -842157 -575557 -329329 -161843 -57980 -116420 -37815 97603 57796 109924 310028
14776 310028 -82289 -466572 -212090 -108844 -82704 -64534 -32718 100523 50812 -34353
14766 -34353 -75873 138428 211783 128303 -80008 -1494 75072 42946 180347 -37978 -15145
14755 -15145 87178 89350 -62652 -15825 -55812 -31629 114483 12308 -56105 -56826 -51244 122377
14743 122377 448623 557543 291021 422526 457219 549349 774376 903727 890878 867487
14733 867487 833115 833785 919406 1032028 1032091 736022 552337 483293 69618 -913 79082 171419
14721 171419 259468 346094 324523 274217 240325 267747 590149 763973 701061 683945 777867
$$ packed form
14796C5160l60233J00517K75060L2276n7914m6811N3109l52392l05383k15546
14786h42157K66600K46228J67486J03863n8440P8605J35418l9807N2128K00104
14776C10028l92317l84283K54482J03246K6140J8170L1816J33241m9711q5165
14766c4353m1520K14301P3355q3480k08311P8514P6566l2126J37401k18325K2833
14755a5145J02323K172j52002M6827l9987K4183J46112j02175o8413p21N582J73621
14743A22377L26246J08920k66522J31505L4693R2130K25027J29351j2849k3391
14733H67487l4372O70Q5621J12622O3k96069j83685o9044m13675p0531P9995R2337
14721A71419Q8049Q6626k1571n0306l3892K7422L22402J73824o2912j7116R3922
$$ plain form
14710 777867 604344 498925 499732 402550 467438 526967 268570 514983 671031 709910 520075
14699 520075 267469 -14535 110866 127557 -279215 -216367 -364761 -547856 -479083 -395082
14689 -395082 -113361 6376 245883 26255 27772 217372 217519 193902 -26607 16873 187241
14678 187241 40268 121918 -111494 -174067 41355 272727 248697 210185 75967 277478
14668 277478 241706 -18888 -32579 -27621 -287688 -499064 -326689 -42339 236295 335494
14658 335494 324315 56695 113958 32451 161466 222426 295765 328376 182257 -95758 -203486
14647 -203486 -374764 -323671 -151538 -172397 -173790 -209269 -334098 -163372 -364726 -577456
14637 -577456 -34295 391391 363775 346128 467980 322678 147087 22882 -6059 -5733 -12775
$$ packed form
14710G77867j73523j05419Q07r7182O4888N9529k58397K46413J56048L8879j89835
14699E20075k52606k82004J25401J6691m06772O2848j48394j83095O8773Q4001
14689c95082K81721J19737K39507k19628J517J89600J47k3617k20509M3480J70368
14678A87241j46973Q1650k33412o2573K15422K31372k4030l8512j34218K01511
14668B77478l5772k60594j3691M958k60067k11376J72375K84350K78634R9199
14658C35494j1179k67620N7263q1507J29015O0960P3339L2611j46119k78015j07728
14647b03486j71278N1093J72133k0859j393l5479j24829J70726k01354k12730
14637e77456N43161M25686k7616j7647J21852j45302j75591j24205k8941L26p042
$$ plain form
14626 -12775 -161746 142436 220955 -135406 -120295 1883 164073 175555 20466 -5314
14616 -5314 380197 320266 112682 38116 97 -126431 -188012 -100843 -77503 -230915 -144256
14605 -144256 -40735 146257 350352 242787 286960 494492 601035 380279 457261 515430
14595 515430 138381 -93213 25909 41676 -72880 -54516 -340465 -391567 -299901 -516615
14585 -516615 -569242 -736988 -670179 -425749 -287394 -97174 -43003 -105520 -54920 340049
14575 340049 331273 154296 333720 491905 722369 712279 270115 53305 -372920 -309570
14565 -309570 -231802 -233097 -37023 -83289 -46053 -97625 186606 448495 375518 219863 143789
14554 143789 52988 6146 -46852 -70792 -296893 -112065 -148687 -248140 -324627 -582942 -572860
$$ packed form
14626a2775j48971L04182P8519l56361J5111J22178J62190J1482j55089k5780
14616e314L85511n9931k07584p4566l8019j26528o1581Q7169K3340j53412Q6659
14605a44256J03521J86992K04095j07565M4173K07532J06543k20756P6982N8169
14595E15430l77049k31594J19122J5767j14556J8364k85949n1102R1666k16714
14585e16615n2627j67746O6809K44430J38355J90220N4171o2517N0600L94969
14575C40049q776j76977J79424J58185K30464j0090m42164k16810m26225O3350
14565c09570P7768j295J96074m6266L7236n1572K84231K61889p2977j55655p6074
14554A43789r0801m6842n2998k3940k26101J84828l6622r9453p6487k58315J0082
$$ plain form
14543 -572860 -513241 -482440 -490597 -442613 -203052 -23551 101359 220556 142475 108853 -1954
14532 -1954 -238486 -103027 -236258 -95976 -38343 51391 145934 202151 94810 -370816 -555204
14521 -555204 -423709 -399651 -464155 -244207 -133114 -293026 -130682 -35438 23801 139137
14511 139137 238639 383373 276493 -66582 -86056 85691 111117 -256799 -386601 -371399
14501 -371399 -396907 -411386 -235644 -9708 116625 224891 242698 72048 -75293 -130146
14491 -130146 38525 141577 259114 45885 -238451 -262460 4988 98519 294131 372713
14481 372713 192992 205173 540010 713068 542809 255356 -116821 -201695 -169923 -330685
14471 -330685 -444045 -510495 -581930 -409659 -88719 -117752 -44801 125732 295244 283143
$$ packed form
14543e72860N9619L0801q157M7984K39561J79501J24910J19197p8081l3622j10807
14532a954k36532J35459j33231J40282N7633Q9734R4543N6217j07341m65626j84388
14521e55204J31495K4058o4504K19948J11093j59912J62344R5244N9239J15336
14511A39137R9502J44734j06880l43075j9474J71747K5426l67916j29802J5202
14501c71399k5508j4479J75742K25936J26333J08266J7807j70650j47341n4853
14491a30146J68671J03052J17537k13229k84336k4009K67448R3531J95612P8582
14481C72713j79721J2181L34837J73058j70259k87453l72177q4874L1772j60762
14471c30685j13360o6450p1435J72271L20940k9033P2951J70533J69512j2101
$$ plain form
14461 283143 118814 42752 31388 120477 -55530 -11619 195709 197666 454474 526865 278826
14450 278826 177681 205058 9382 -300361 -273474 -3900 375463 185808 6451 23508
14440 23508 -17822 -61483 -317935 -301077 3899 29878 60581 -142438 127313 367495 294990
14429 294990 18760 -125334 -43996 133248 284019 297364 399556 381209 382444 399876 412594
14418 412594 100385 -230569 -180585 -267659 192946 287635 226525 64437 182785 393981
14408 393981 407949 554220 582803 378192 94206 6186 265255 237239 36785 3017
14398 3017 -371306 -430530 -195318 102034 48766 -107136 62495 180008 176615 221382 191936
14387 191936 123695 21291 445950 636915 653872 444569 495421 529650 595797 267594
$$ packed form
14461B83143j64329p6062j1364Q9089j76007M3911K07328J957K56808P2391k48039
14450B78826j01145K7377j95676l09743K6887K69574L79363j89655j79357J7057
14440B3508m1330m3661k56452J6858L04976K5979L0703k03019K69751K40182p2505
14429B94990k76230j44094Q1338J77244J50771J3345J02192j8347J235J7432J2718
14418D12594l12209l30954M9984q7074M60605R4689o1110j62088J18348K11196
14408C93981J3968J46271K8583k04611k83986q8020K59069k8016k00454l3768
14398C017l74323n9224K35212K97352n3268j55902J69631J17513l393M4767k9446
14387A91936o8241j02404M24659J90965J6957k09303N0852L4229O6147l28203
$$ plain form
14377 267594 -31796 89711 514807 585989 201053 126272 71732 3818 79249 3274 120020
14366 120020 166382 265684 332147 180415 16492 -252742 -253917 -150967 -9394 31361 -60499
14355 -60499 -173673 -200432 -54699 35443 70026 4900 6935 269112 354962 278911 277204
14344 277204 370912 508391 472734 299829 219465 94429 126010 208163 525741 507829 481819
14333 481819 406233 285732 50931 43293 193404 187390 189863 51711 -190985 -191280 -128178
14322 -128178 -144086 -90303 382207 402262 8535 176318 267631 140969 -137819 -230504
14312 -230504 -151774 107260 176273 310301 103763 13036 255446 150524 -110936 -232996
14302 -232996 -209541 -496181 -468999 -184048 40689 169213 270723 170732 493022 548486
$$ packed form
14377B67594k99390J21507M25096P1182l84936p4781n4540o7914P5431p5975J16746
14366A20020M6362R9302O6463j51732j63923k69234j175J02950J41573M0755r1860
14355f0499j13174k6759J45733R0142L4583o5126K035K62177Q5850p6051j707
14344B77204R3708J37479l5657j72905q0364j25036L1581Q2153L17578j7912k6010
14333D81819p5586j20501k34801p638J50111o014K473j38152k42696k95O3102
14322a28178j5908N3783M72510K0055l93727J67783R1313j26662k78788r2685
14312b30504P8730K59034O9013J34028k06538r0727K42410j04922k61460j22060
14302b32996K3455k86640K7182K84951K24737J28524J01510r9991L22290N5464
$$ plain form
14292 548486 421454 329737 18309 -317398 -168579 -169559 -226067 -226111 -194859 -260422 134654
14281 134654 -77683 -114778 -117957 -166831 -114991 133372 53363 -380689 -378453 36532 77348
14270 77348 -152283 -157808 -118005 -186746 -3803 -5478 -110237 140688 55042 -6612 -70479
14259 -70479 -238556 -310815 -189285 137291 220176 245261 341518 317066 244757 262040 235570
14248 235570 196989 145359 203400 294951 510080 446804 451196 384885 287445 381034 191252
14237 191252 -14381 -62743 68662 108622 144523 -206128 -354720 85401 563196 589224
14227 589224 764200 912071 649006 201230 206428 385426 155125 192713 153803 20786
14217 20786 -315799 -535529 -290301 -235214 68207 198063 103255 181840 484478 417302
$$ packed form
14292E48486j27032r1717l11428l35707J48819r80n6508m4L1252o5563L95076
14281A34654k12337l7095l179m8874N1840K48363q0009m34052K236M14985M0816
14270G7348k29631n525L9803o8741J82943j675j04759K50925q5646o1654o3867
14259g0479j68077p2259J21530L26576Q2885K5085R6257k4452p2309J7283k6470
14248B35570l8581n1630N8041R1551K15129o3276M392o6311r7440R3589j89782
14237A91252k05633m8362J31405L9960L5901l50651j48592M40121M77795K6028
14227E89224J74976J47871k63065m47776N198J78998k30301L7588l8910j33017
14217B0786l36585k19730K45228N5087L03421J29856r4808P8585L02638o7176
$$ plain form
14207 417302 429448 455007 93121 -141885 -130954 -256935 -290241 -179012 -200337 -196639 -254944
14196 -254944 -225270 -118619 -197315 -295850 -286957 84337 241928 -49646 -254330 -305318 -245087
14185 -245087 -209022 -228309 -155569 147689 206296 170203 117630 27 106794 510489 397271
14174 397271 18004 -461571 -546618 -278696 10239 -127193 -193051 -371181 -263038 -46000
14164 -46000 -120695 -134015 -31971 243134 232050 157601 -32009 98104 159226 134631 189794
14153 189794 174153 83487 282570 413484 231982 262496 280399 177116 -229624 -345208
14143 -345208 -24156 -18050 81953 98574 61326 73287 -84027 -209254 -463836 -299455
14133 -299455 -48232 -5804 -296250 -352546 -124909 11017 76957 43690 -105748 -186642
$$ packed form
14207D17302J2146K5559l61886k35006J0931j25981l3306J11229k1325L698n8305
14196b54944K9674J06651p8696r8535Q893L71294J57591k91574k04684n0988O0231
14185b45087L6065j9287P2740L03258N8607l6093n2573j17603J06767M03695j13218
14174C97271l79267m79575q5047K67922K88935j37432o5858j78130J08143K17038
14164d6000p4695j3320J02044K75105j1084p4449j89610J30113O1122k4595N5163
14153A89794j5641r0666J99083J30914j81502L0514J7903j03283m06740j15584
14143c45208L21052O106J00003J6621l7248J1961j57314j25227k54582J64381
14133b99455K51223M2428k90446n6296K27637J35926O5940l3267j49438q0894
$$ plain form
14123 -186642 -331227 -387478 -99152 22257 114375 52846 -276371 -122167 61753 59577
14113 59577 72196 347801 362254 527318 446957 450198 289117 207076 173591 12132 87964
14102 87964 195621 -11925 -127376 123319 250523 197189 -98911 -379382 -721512 -843570
14092 -843570 -608630 -282089 -224870 -25250 35543 -265929 -266584 -15026 51621 116206 155632
14081 155632 -189659 -33356 307216 417001 443361 246215 172493 67457 -118409 -143628
14071 -143628 252837 589558 435924 284656 -2114 17068 226602 54488 159123 318025
14061 318025 136034 -156931 -122644 -431119 -384620 -390261 -283641 -116180 128074 295942
14051 295942 -92234 -129307 87879 198755 -155699 -391710 -402673 3209 257775 93179
$$ packed form
14123a86642j44585n6251K88326J21409R2118o1529l29217J54204J83920k176
14113E9577J2619K75605J4453J65064q0361L241j61081q2041l3485j61459P5832
14102H7964J07657k07546j15451K50695J27204n3334k96100k80471l42130j22058
14092h43570K34940L26541N7219J99620O0793l01472o55K51558O6647O4585L9426
14081A55632l45291J56303L40572J09785K6360j97146p3722j05036j85866k5219
14071a43628L96465L36721j53634j51268k86770J9182K09534j72114J04635J58902
14061C18025j81991k92965L4287l08475M6499n641J06620J67461K44254J67868
14051B95942l88176l7073K17186J10876l54454k36011j0963M05882K54566j64596
$$ plain form
14041 93179 -314183 -412196 -152617 -293569 17617 299157 107739 -117976 -130501 -18754
14031 -18754 126070 222974 218756 89081 -279632 -7301 140276 11677 196969 296452
14021 296452 220872 101052 321490 289341 79276 -11013 17074 -106426 -12231 222037
14011 222037 160814 -30318 -133917 -47391 38320 -118014 54858 252081 217385 291297
14001 291297 264922 129601 120952 351991 171739 -214023 -327687 -192100 65666 120783
13991 120783 -31282 217771 220670 445015 536977 431730 206268 -136965 -348786 -250832
13981 -250832 -369284 -45661 388306 394257 239619 -31867 -55951 120002 38328 22613
13971 22613 97028 141154 208875 75102 273301 299348 214907 384908 524793 480752 515789
$$ packed form
14041I3179m07362r8013K59579j40952L11186K81540j91418k25715j2525J11747
14031a8754J44824R6904m218j29675l68713K72331J47577j28599J85292R9483
14021B96452p5580j19820K20438l2149k10065r0289K8087j23500R4195K34268
14011B22037o1223j91132j03599Q6526Q5711j56334J72872J97223l4696P3912
14001B91297k6375j35321q649K31039j80252l85762j13664J35587K57766N5117
13991A20783j52065K49053K899K24345R1962j05247k25462l43233k11821R7954
13981b50832j18452L23623M33967N951j54638k71486k4084J75953q1674j5715
13971B2613P4415M4126O7721j33773J98199K6047q4441J70001J39885m4041L5037
$$ plain form
13960 515789 589697 553218 442114 526954 478370 299831 173221 150665 -139086 -184886 13421
13949 13421 115813 76412 -317696 -374855 -467349 -134986 -253416 -188672 -174766 -320265 -366857
13938 -366857 -367121 -294412 -108518 -468536 -554322 -715021 -398629 -209572 -117304 -162147 -90721
13927 -90721 -88496 -37806 79980 -81547 -181660 58590 -152460 -395927 -454346 -349971
13917 -349971 -248272 9683 9237 -93024 -94146 -91226 -64192 -306657 -394038 -209173 -45141
13906 -45141 -165048 -289755 -404709 -417686 -302354 -42939 -102435 -141042 -306448 -253766
13896 -253766 -94996 125551 -42540 -414841 -255744 -32974 -122521 -191287 42390 9128
13886 9128 138079 302269 -59224 -194468 -101771 -23829 288105 269946 353034 299444 505880
$$ packed form
13960E15789P3908l6479j11104Q4840m8584j78539j26610k2556k89751m5800J98307
13949A3421J02392l9401l94108n7159r2494L32363j18430O4744J3906j45499m6592
13938c66857k64P2709J85894l60018q5786j60699L16392J89057R2268m4843P1426
13927i0721K225N0690J17786j61527j00113K40250k11050k43467n8419J04375
13917c49971J01699K57955m46j02261j122K920K7034k42465q7381J84865J64032
13906d5141j19907j24707j14954j2977J15332K59415n9496l8607j65406N2682
13896b53766J58770K20547j68091l72301J59097K22770q9547o8766K33677l3262
13886I128J28951J64190l61493j35244R2697P7942L11934j8159Q3088n3590K06436
$$ plain form
13875 505880 320431 322851 181806 149304 144858 212430 63712 -91161 -449948 -548139 -275115
13864 -275115 -75774 -59413 -73536 113179 53282 89004 139489 273041 190720 19402 -209396
13853 -209396 -201318 -169330 -254095 -197213 223516 402112 130125 5428 241283 222367 190041
13842 190041 359865 552126 417107 432593 388355 41399 -80736 -74005 283863 483069
13832 483069 252198 254391 64738 357918 525540 390086 458152 366297 261024 373164
13822 373164 457286 534442 513896 462615 432190 301316 219651 178570 105927 8744 48511
13811 48511 -114358 -37503 99826 140290 49910 162612 160966 260205 442897 795631 628411
13800 628411 360132 200547 87116 -394417 -73354 436789 519661 226889 -121525 -81203
$$ packed form
13875E05880j85449K420j41045l2502m446O7572j48718j54873l58787r8191K73024
13864b75115J99341J6361j4123J86715n9897L5722N0485J33552q2321j71318k28798
13853b09396Q078L1988q4765N6882M20729J78596k71987j24697K35855j8916l2326
13842A90041J69824J92261j35019J5486m4238l46956j22135O731L57868J99206
13832D83069k30871K193j89653K93180J67622j35454O8066r1855j05273J12140
13822C73164Q4122P7156k0546n1281l0425j30874q1665m1081p2643r7183L9767
13811D8511j62869P6855J37329M0464r0380J12702j646R9239J82692L52734j67220
13800F28411k68279j59585j13431m81533L21063N10143Q2872k92772l48414M0322
$$ plain form
13790 -81203 184405 171738 281798 638508 744343 636459 355264 317658 150900 -316
13780 -316 171974 324319 515219 447275 344106 322434 254875 178809 52221 72765 237450
13769 237450 486708 808693 1105596 761459 571128 438425 228194 115823 181993 55125
13759 55125 69846 410533 327126 90066 -88875 48924 69887 -41723 -356674 -265654
13749 -265654 8185 -219106 -241061 -82505 223284 297764 296882 229706 176071 255336 494382
13738 494382 761113 516874 454667 107522 -50008 397502 299963 81833 342983 311461
13728 311461 289880 174533 -105038 -405107 -217954 26628 68048 131202 111857 -81278
13718 -81278 6479 123627 163620 367783 278232 164455 61498 107423 134885 -93452 240001
$$ packed form
13790h1203K65608j2667J10060L56710J05835j07884k81195l7606j66758j51216
13780c16J72290J52345J90900o7944j03169k1672o7559p6066j26588K0544J64685
13769B37450K49258L21985K96903l44137j90331j32703k10231j12371O6170j26868
13759E5125J4721L40687q3407k37060j78941J37799K0963j11610l14951R1020
13749b65654K73839k27291k1955J58556L05789P4480q82o7176n3635P9265K39046
13738D94382K66731k44239o2207l47145j57530M47510r7539k18130K61150l1522
13728C11461k1581j15347k79571l00069J87153K44582M1420O3154j9345j93135
13718h1278Q7757J17148L9993K04163q9551j13777j02957M5925K7462k28337L33453
$$ plain form
13707 240001 364870 306244 419653 401385 241675 337202 497151 545650 391149 264381
13697 264381 -6398 94949 251503 383213 523111 359299 247691 116962 37766 78137
13687 78137 -97394 -411108 -338793 -86441 126646 -141182 -329371 -37269 1809 -200078
13677 -200078 -161497 32901 -88082 -206374 -48756 188201 156433 284603 302557 9812
13667 9812 122943 446837 682404 630367 541673 118009 59961 65035 283749 263553 108490
13656 108490 9171 -88650 17030 199931 217753 -10199 -167688 -119568 31675 -131931
13646 -131931 -313144 -239141 -215007 -307057 -208966 -8123 -153901 -134547 104403 143622 219355
13635 219355 52280 133830 403826 554328 501754 655554 624612 588600 418757 107484
$$ packed form
13707B40001J24869n8626J13409j8268j59710R5527J59949M8499j54501j26768
13697B64381k70779J01347J56554J31710J39898j63812j11608j30729p9196M0371
13687G8137j75531l13714P2315K52352K13087k67828j88189K92102L9078k01887
13677b00078L8581J94398j20983j18292J57618K36957l1768J28170J7954k92745
13667I812J13131L23894K35567n2037q8694m23664n8048N074K18714k0196j55063
13656A08490r9319r7821J05680J82901J7822k27952j57489M8120J51243j63606
13646a31931j81213P4003K4134r2050R8091K00843j45778J9354K38950L9219P5733
13635B19355j67075Q1550K69996J50502n2574J53800l0942l6012j69843l11273
$$ plain form
13625 107484 -29717 -89292 40340 54611 -137201 -56481 20271 -75278 -362301 -469808
13615 -469808 -238057 51448 146965 -23370 10855 -67469 -161576 3317 129418 231575
13605 231575 363762 268658 325287 268137 286217 149380 255832 191233 -44618 51872 35806
13594 35806 129116 -15582 68424 305425 300152 264864 366146 306475 212195 -206786 -356728
13583 -356728 -137909 33210 234254 233512 -115420 -39801 229775 383268 570576 471699
13573 471699 487448 527679 190544 -26393 -61151 -119829 -92603 78884 147490 206765 227044
13562 227044 401913 592432 854166 430243 149547 248322 530784 647731 411228 414088
13552 414088 103205 -29940 75423 299294 324042 867 -5287 6611 181461 397942
$$ packed form
13625A07484j37201n9575J29632J4271j91812Q0720P6752r5549k87023j07507
13615d69808K31751K89505R5517j70335L4225p8324r4107J64893J26101J02157
13605B31575J32187r5104N6629n7150J8080j36837J06452o4599k35851R6490j6066
13594C5806R3310j44698Q4006K37001n273l5288J01282n9671r4280m18981j49942
13583c56728K18819J71119K01044p42l48932P5619K69576J53493J87308r8877
13573D71699J5749M0231l37135k16937l4758n8678K7226J71487O8606N9275K0279
13562B27044J74869J90519K61734m23923k80696R8775K82462J16947k36503K860
13552D14088l10883j33145J05363K23871K4748l23175o154J1898J74850K16481
$$ plain form
13542 397942 555327 396239 81503 233576 316065 192513 159125 254233 385913 289303
13532 289303 260730 313355 404185 432325 561779 652140 463702 63909 -266998 -290115 105122
13521 105122 269863 313924 438117 373129 468646 563424 519348 514394 363550 236395 53356
13510 53356 170742 123865 216398 176992 121702 98751 172554 19893 163725 414512 254916
13499 254916 160728 328840 378962 333881 754050 616380 699899 570764 579836 533558 450812
13488 450812 263119 20172 93766 87606 127210 -32837 35408 143719 -1915 281966
13478 281966 186963 -62779 105481 88503 69504 356963 359452 -9440 -15688 -101758 82443
13467 82443 217727 471442 504548 503208 452868 250029 -19575 -219655 -78709 111221
$$ packed form
13542C97942J57385j59088l14736J52073Q2489j23552l3388R5108J31680r6610
13532B89303k8573N2625R0830K8140J29454R0361j88438l99793l30907k3117L95237
13521A05122J64741M4061J24193o4988R5517R4778m4076m954j50844j27155j83039
13510E3356J17386m6877R2533l9406n5290k2951P3803j52661J43832K50787j59596
13499B54916r4188J68112N0122m5081M20169j37670Q3519j29135R072m6278q2746
13488D50812j87693k42947P3594o160L9604j60047O8245J08311j45634K83881
13478B81966r5003k49742J68260j6978j8999K87459K489l68892o248q6070J84201
13467H2443J35284K53715L3106j340n0340k02839k69604k00080J40946J89930
$$ plain form
13457 111221 374936 673581 523020 174093 -137241 -61567 -62468 216302 557880 591568
13447 591568 573432 745133 604943 329691 286719 149439 43869 -805 36216 16348
13437 16348 187476 243690 157448 507692 787572 573985 560597 150860 -80907 -147972
13427 -147972 86235 225965 135800 115570 72424 -33335 -192241 -249544 -167466 -233097 -79763
13416 -79763 347196 250871 351144 522191 380004 291445 40705 -26126 161452 350510
13406 350510 306505 108979 352183 368599 151185 257796 437250 515389 613962 563847
13396 563847 451476 498024 460527 409402 159318 -11475 209184 340918 56994 -49879
13386 -49879 115917 326220 75391 3646 -45055 60805 271834 532189 449716 208117
$$ packed form
13457A11221K63715K98645j50561l48927l11334P5674r01K78770L41578L3688
13447E91568j8136J71701j40190k75252m2972j37280j05570m4674L7021j9868
13437A6348J71128N6214q6242L50244K79880k13587j3388m09737k31767o7065
13427a47972K34207J39730r0165k0230m3146j05759j58906n7303Q2078o5631J53334
13416g9763M26959r6325J00273J71047j42187q8559k50740o6831J87578J89058
13406C50510m4005j97526K43204J6416k17414J06611J79454P8139R8573n0115
13396E63847j12371M6548l7497n1125k50084j70793K20659J31734k83924j06873
13386d9879J65796K10303k50829p1745m8701J05860K11029K60355q2473k41599
$$ plain form
13376 208117 -248860 12286 378618 486642 486541 543653 194657 61627 144702 255601
13366 255601 323552 108215 -33627 250668 545055 254092 100393 325845 494017 401963
13356 401963 220639 158616 283486 593268 612731 441793 261709 79072 -3208 -265444
13346 -265444 -357600 -278368 21981 4498 -127478 -170987 6786 -73013 164498 326304
13336 326304 372282 467924 204944 196480 588411 555633 157316 -111131 -269250 -80771
13326 -80771 264934 343941 167009 36392 38375 184732 364278 544076 410843 2851
13316 2851 -237058 -146762 -259198 -19173 227190 226501 375467 401836 402272 383690 121843
13305 121843 -15539 -111412 -82371 50472 121359 -60420 177152 376611 34706 6268
$$ packed form
13376B08117m56977K61146L66332J08024j01N7112l48996j33030Q3075J10899
13366B55601O7951k15337j41842K84295K94387k90963j53699K25452J68172r2054
13356D01963j81324o2023J24870L09782J9463j70938j80084j82637q2280k62236
13346b65444r2156P9232L00349j7483j31976m3509J77773p9799K37511J61806
13336C26304M5978R5642k62980q464L91931l2778l98317k68447j58119J88479
13326h0771L45705P9007j76932j30617J983J46357J79546J79798j33233m07992
13316B851k39909R0296j12436K40025K46363o89J48966K6369M36j8582k61847
13305A21843j37382r5873K9041J32843P0887j81779K37572J99459l41905k8438
$$ plain form
13295 6268 424422 522293 153564 55104 -145740 19698 218106 21935 -239265 -85059
13285 -85059 -99491 -100989 221652 404482 483204 453145 357002 700577 562220 350163 473629
13274 473629 552787 235307 194531 21661 222947 410390 740655 679908 403327 255038
13264 255038 369640 360184 463201 478859 228678 291429 607021 493300 340460 238255
13254 238255 147835 61657 124350 51256 75282 239774 408329 216411 243034 82943 88321
13243 88321 315175 724118 773596 443084 290838 134276 167970 82632 -69964 -111190
13233 -111190 52885 126488 -19070 -131416 -91808 39061 314411 325998 256599 365542
13223 365542 198190 323842 165566 201494 416460 306993 251700 473655 611832 662387
$$ packed form
13295F268M18154R7871l68729r8460k00844J65438J98408j96171k61200J54206
13285h5059j4432j498L22641J82830P8722l0059r6143L43575j38357k12057J23466
13274D73629P9158l17480m0776j72870K01286J87443L30265o0747k76581j48289
13264B55038J14602r456J03017J5658k50181O2751L15592j13721j52840j02205
13254B38255r0420q6178O2693p3094K4026J64492J68555j91918K6623j60091N378
13243H8321K26854M08943M9478l30512j52246j56562L3694q5338j52596m1226
13233a11190J64075P3603j45558j12346L9608J30869K75350J1587o9399J08943
13223C65542j67352J25652j58276L5928K14966j09467n5293K21955J38177N0555
$$ plain form
13213 662387 610382 565908 381432 244859 158780 -29140 32259 203366 371903 376377 374663
13202 374663 668418 703279 399527 288962 302253 683285 714172 469180 530526 692593
13192 692593 581759 628218 675000 643320 436987 408938 338313 89593 101353 214756 293737
13181 293737 508505 154422 -4157 398656 299471 165282 319448 482495 481627 482858 369302
13170 369302 254332 217059 170145 319246 501516 401312 294572 158501 280851 406697
13160 406697 508129 304240 435089 307862 357512 380956 371156 599009 696035 473913
13150 473913 523953 478052 389250 515592 658673 478852 344022 249408 172097 179833 47362
13139 47362 56577 492870 475800 204752 208232 159263 262925 386024 54117 72246 147763
$$ packed form
13213F62387n2005m4474j84476j36573q6079j87920O1399J71107J68537M474j714
13202C74663K93755L4861l03752j10565J3291L81032L0887k44992O1346J62067
13192F92593j10834M6459M6782l1680k06333k8049p0625k48720J1760J13403P8981
13181B93737K14768l54083j58579M02813r9185j34189J54166J63047q68J231j13556
13170C69302j14970l7273m6914J49101J82270j00204j06740j36071J22350J25846
13160D06697J01432k03889J30849j27227M9650K3444r800K27853R7026k22122
13150D73913N0040m5901q8802J26342J43081j79821j34830r4614p7311P736j32471
13139D7362R215M36293j7070k71048L480m8969J03662J23099l31907J8129P5517
$$ plain form
13128 147763 426974 342411 48096 192910 594684 610355 806640 845983 691158 788897
13118 788897 586068 221870 226813 426214 397388 277059 257323 80745 55397 300020
13108 300020 312300 477685 608241 515272 548105 623298 464511 610875 798130 956638
13098 956638 782748 627044 744310 672474 728616 632213 728127 664825 312369 184815
13088 184815 390446 640948 429913 390569 345946 285289 285913 541297 628042 383378 282209
13077 282209 630459 826371 832539 1013745 1086557 859831 569136 441705 386772 344020
13067 344020 457270 517292 490439 380936 441569 121136 59122 364692 764281 665337
13057 665337 460907 350487 161531 201803 351145 249213 460975 486794 642366 432546
$$ packed form
13128A47763K79211q4563k94315J44814M01774J5671J96285L9343j54825R7739
13118G88897k02829l64198M943J99401k8826j20329j9736j76578k5348K44623
13108C00020J2280J65385J30556r2969L2833P5193j58787J46364J87255J58508
13098I56638j73890j55704J17266p1836N6142r6403R5914o3302l52456j27554
13088A84815K05631K50502k11035l9344m4623o0657O24K55384Q6745k44664j01169
13077B82209L48250J95912O168J81206P2812k26726k90695j27431n4933m2752
13067C44020J13250O0022k6853j09503O0633l20433o2014L05570L99589r8944
13057F65337k04430j10420j88956M0272J49342j01932K11762K5819J55572k09820
$$ plain form
13047 432546 287729 420560 549943 335097 548844 650002 501525 538557 512487 404218
13037 404218 157204 343843 591060 578394 385187 457278 272794 271393 608874 759398
13027 759398 746821 608163 712272 829656 703126 607550 639207 660433 767005 798542
13017 798542 675886 787118 1048820 1070390 863689 770547 980443 1054507 847946 782018
13007 782018 871240 950190 1059147 960410 893332 693403 418581 484138 745911 635946
12997 635946 865711 817399 609023 579661 389967 537223 657864 529528 527801 477270
12987 477270 574975 462841 554746 682695 767880 860607 877884 839754 690166 743073 1103437
12976 1103437 1107850 581743 228356 309519 450052 498404 516747 368227 88973 194686
$$ packed form
13047D32546j44817J32831J29383k14846K13747J01158j48477L7032k6070j08269
13037D04218k47014J86639K47217j2666j93207P2091j84484j401L37481J50524
13027G59398j2577j38658J04109J17384j26530r5576L1657K1226J06572L1537
13017G98542j22656J11232K61702K1570k06701r3142K09896P4064k06561o5928
13007G82018Q9222P8950J08957r8737o7078j99929k74822O5557K61773j09965
12997F35946K29765m8312k08376k9362j89694J47256J20641j28336j727n0531
12987D77270R7705j12134R1905J27949Q5185R2727J7277l8130j49588N2907L60364
12976A103437M413n26107l53387Q1163J40533M8352J8343j48520k79254J05713
$$ plain form
12966 194686 329000 413960 436926 349571 628317 1007359 1013481 959819 962488 813687 788295
12955 788295 729255 599213 601003 685707 350259 143671 379116 622852 577154 338823
12945 338823 613127 948639 1007758 792157 706401 660219 550670 285153 348560 233842
12935 233842 428227 680376 1060453 1071456 1101888 833389 622271 501327 542020 439617
12925 439617 703967 1021730 852818 427462 438101 533987 749404 625392 634082 656657
12915 656657 686628 861351 915915 955846 795391 624099 616376 671225 437535 417042 688126
12904 688126 654618 795351 1114588 1247516 1167776 940510 906605 811496 645926 281412
12894 281412 406462 426034 277615 238660 640179 803978 729984 543761 620764 819377
$$ packed form
12966A94686J34314Q4960K2966q7355K78746L79042O122n3662K669j48801k5392
12955G88295n9040j30042J790Q4704l35448k06588K35445K43736m5698k38331
12945C38823K74304L35512N9119k15601q5756m6182j09549k65517O3407j14718
12935B33842J94385K52149L80077J1003L0432k68499k11118j20944M0693j02403
12925D39617K64350L17763j68912m25356J0639R5886K15417j24012Q690K2575
12915F56657K9971J74723N4564L9931j60455j71292p723N4849k33690k0493K71084
12904F88126l3508J40733L19237J32928p9740k27266l3905r5109j65570l64514
12894B81412J25050J9572j48419l8955M01519J63799p3994j86223P7003J98613
$$ plain form
12884 819377 763469 864794 938553 803351 860165 928653 1110300 1173362 884195 867576 1015928
12873 1015928 1042825 937671 1050857 1153181 776675 767733 955390 877838 862339 662057
12863 662057 641772 686550 695077 843099 729278 717209 834664 755434 670994 705069 725628
12852 725628 799811 892509 548765 387701 437871 432330 435156 489694 668276 533549 742532
12841 742532 1019445 880653 868343 770853 910536 774040 609553 448470 552468 530973
12831 530973 332868 487942 666695 743868 929304 928825 991085 1081172 905585 860027 836322
12820 836322 728159 561944 553327 499622 377142 356334 338839 102053 126185 -69923 -159095
12809 -159095 -3438 154120 449376 708580 877964 912100 857238 470371 61554 92766
$$ packed form
12884H19377n5908J01325P3759j35202N6814O8488J81647O3062k89167j6619J48352
12873A015928K6897j05154J13186J02324l76506q942J87657p7552j5499k00282
12863F62057k0285M4778Q527J48022j13821j2069J17455p9230q4440L4075K0559
12852G25628P4183R2698l43744j61064N0170n541K826N4538J78582j34727K08983
12841G42532K76913j38792j2310r7490J39683j36496j64487j61083J03998k1495
12831E30973j98105J55074J78753P7173J85436m79O2260R0087j75587m5558k3705
12820H36322j08163j66215q617n3705j22480k0808j7495k36786K4132j96108q9172
12809a59095J55657J57558K95256K59204J69384L4136n4862l86867m08817L1212
$$ plain form
12799 92766 631642 850734 641434 504942 841472 1035314 998889 685630 312788 600961
12789 600961 794616 1064020 924299 919254 689490 572246 743355 808839 1034923 1050907
12779 1050907 890703 943626 1011868 693071 532822 857466 933459 848697 664094 415699
12769 415699 287375 301905 472494 491778 565596 909040 1024711 969251 1025644 1045654 1059482
12758 1059482 919696 952933 701930 509393 472192 733992 540011 369731 361638 668552
12748 668552 814434 835155 882228 778548 751518 835692 1083591 1107893 1263309 1157463
12738 1157463 679800 624601 734971 801712 914902 775560 857190 1027811 867786 1037559
12728 1037559 1017731 1111604 1140750 1153586 946122 951961 669121 764907 922107 951262 1058014
$$ packed form
12799I2766N38876K19092k09300j36492L36530J93842l6425l13259l72842K88173
12789F00961J93655K69404j39721n045k29764j17244J71109O5484K26084J5984
12779A050907j60204N2923O8242l18797j60249L24644P5993q4762j84603k48395
12769D15699j28324J4530J70589J9284P3818L43444J15671n5460N6393K0010J3828
12758A059482j39786L3237k51003j92537l7201K61800j93981j70280q093L06914
12748F68552J45882K0721M7073j03680k7030Q4174K47899K4302J55416j05846
12738A157463m77663n5199J10370O6741J13190j39342Q1630J70621j60025J69773
12728A037559j9828R3873K9146J2836k07464N839k82840R5786J57200K9155J06752
$$ plain form
12717 1058014 1087276 1132923 1137933 1129889 1164043 805938 670190 547712 441614 585848 627882
12706 627882 560505 571341 933446 1204225 1303987 1408390 1581770 1291580 1127216 1235129
12696 1235129 1173589 1127596 905508 938547 1043280 928527 1014759 743696 403588 314609
12686 314609 767342 1295227 1463606 1630787 1454457 1202993 1345519 1499362 1276405 972159
12676 972159 986457 941247 1312682 1150114 1172349 1284507 1244788 1181056 1521555 1855593
12666 1855593 1563848 1395766 1404234 1259811 1145212 1235464 1283193 1407200 1344330 1312787
12656 1312787 1358528 1053928 960553 878563 865008 1062823 1252873 1289632 1189591 1137728
12646 1137728 1181065 1303960 1371864 1455154 1540614 1503134 1632681 1746736 1602420 1371666
$$ packed form
12717A058014K9262M5647N010q044L4154l58105j35748j22478j06098J44234M2034
12706F27882o7377J0836L62105K70779R9762J04403J73380k90190j64364J07913
12696A235129o1540m5993k22088L3039J04733j14753Q6232k71063l40108q8979
12686C14609M52733N27885J68379J67181j76330k51464J42526J53843k22957l04246
12676I72159J4298m5210L71435j62568K2235J12158l9719o3732L40499L34038
12666A855593k91745j68082Q468j44423j14599R0252M7729J24007o2870l1543
12656A312787M5741l04600r3375q1990j3555J97815J90050L6759j00041n1863
12646A137728M3337J22895O7904Q3290Q5460l7480J29547J14055j44316k30754
$$ plain form
12636 1371666 1632723 1719513 1623795 1787966 1898082 1538944 1356561 1317454 1518013 1679082
12626 1679082 1628258 1553903 1429229 1330777 1433806 1324964 1190286 1351863 1558571 1556797
12616 1556797 1347613 1518063 1661327 1704243 1575444 1352203 1376866 1366784 1098052 893087
12606 893087 1036381 1248700 1244039 1443959 1634205 1599019 1632437 1576296 1606728 1644937 1750703
12595 1750703 1607936 1542456 1512981 1400767 1723850 1449933 1149008 1164822 1071595 1081003
12585 1081003 1178702 1260521 1082844 1028846 1135522 1136022 1443410 1477932 1239923 1155251 1258743
12574 1258743 1472279 1737017 1848626 1629182 1370272 1518478 1423717 1413876 1265144 1076284
12564 1076284 1248194 1450756 1539757 1599192 1543309 1522483 1808516 2096731 2354667 2406030
$$ packed form
12636A371666K61057Q6790r5718J64171J10116l59138j82383l9107K00559J61069
12626A679082n0824p4355j24674r8452J03029j08842j34678J61577K06708j774
12616A556797k09184J70450J43264M2916j28799k23241K4663j0082k68732k04965
12606H93087J43294K12319m661J99920J90246l5186L3418n6141L0432L8209J05766
12595A750703j42767o5480k9475j12214L23083k73917l00925J5814r3227R408
12585A081003R7699Q1819j77677n3998J06676N00L07388L4522k38009q4672J03492
12574A258743K13536K64738J11609k19444k58910J48206r4761r841j48732j88860
12564A076284J71910K02562Q9001N9435n5883k0826K86033K88215K57936N1363
$$ plain form
12554 2406030 2064665 1810801 1847169 1897889 1941324 1632420 1521296 1595367 1635124 1849247
12544 1849247 1836784 1699485 1465582 1538613 1796486 1802646 1948772 1908658 1739111 1931554
12534 1931554 2082573 2126099 1965893 1911450 1888031 1538930 1746504 2006251 1854633 1815453
12524 1815453 1813762 1804631 1776375 1736444 1675939 1794336 1547581 1570607 1837771 1694668 1818331
12513 1818331 2077671 2014185 1840036 1828602 1725779 1784165 1999727 1916972 1838365 1837854 1706285
12502 1706285 1677617 1703904 1829522 1994279 1960576 2173600 2035012 2030269 2112879 2004751
12492 2004751 1970516 2259249 2510335 2454783 1854466 1517052 1683068 1427201 1606848 2179486
12482 2179486 2426671 2364980 2403219 2261196 2036127 2006699 2017210 2027076 1986038 1952916 2079839
$$ packed form
12554B406030l41365k53864L6368N0720M3435l08904j11124P4071L9757K14123
12544A849247j2463j37299k33903P3031K57873O160J46126m0114j69547J92443
12534A931554J51019M3526j60206n4443k3419l49101K07574K59747j51618l9180
12524A815453j691r131k8256l9931o0505J18397k46755K3026K67164j43103J23663
12513A818331K59340o3486j74149j1434j02823N8386K15562q2755p8607n11j31569
12502A706285k8668K6287J25618J64757l3703K13024j38588m743Q2610j08128
12492B004751l4235K88733K51086n5552o00317l37414J66016k55867J79647N72638
12482B179486K47185o1691L8239j42023k25069k9428J0511R866m1038l3122J26923
$$ plain form
12471 2079839 2098735 1737321 1729350 1930632 2029488 2143330 2153977 2080026 2032558 1922338 2118033
12460 2118033 2293701 2220079 2345825 2426605 2153194 2009217 1963254 2246539 2380059 2421514
12450 2421514 2457584 2530196 2523063 2206523 2149915 2285970 2150378 2091950 2459880 2672675
12440 2672675 2405032 2108499 2227913 2304637 2100324 2051808 1996295 1879330 2087537 2659275
12430 2659275 2621817 2705547 2863614 2412672 2370541 2635017 2738265 2597739 2523909 2449647
12420 2449647 2662325 2384607 2108108 2313009 2494747 2908383 2826370 2715910 2488905 2600245
12410 2600245 2850978 2788625 2818999 2849184 2607435 2654605 2541550 2301500 2249357 2310986
12400 2310986 2563317 2648911 2523447 2522031 2600476 2598823 2701051 2863377 3058756 3085302 3232671
$$ packed form
12471B079839J8896l61414p971K01282R8856J13842J0647p3951m7468j10220J95695
12460B118033J75668p3622J25746Q0780k73411j43977m5963K83285J33520M1455
12450B421514L6070P2612p133l16540n6608J36055j35592n8428L67930K12795
12440B672675k67643k96533J19414P6724k04313m8516n5513j16965K08207N71738
12430B659275l7458Q3730J58067m50942m2131K64476J03248j40526p3830p4262
12420B449647K12678k77718k76499K04901J81738M13636q2013j10460k27005J11340
12410B600245K50733o2353L0374L0185k41749M7170j13055k40050n2143O1629
12400B310986K52331Q5594j25464j416P8445j653J02228J62326J95379K6546J47369
$$ plain form
12389 3232671 3176600 2992982 2933787 2884545 2717393 2627824 2676910 3040078 3118463 3144316 3035301
12378 3035301 3260469 3370859 3347141 3122716 3070181 3276997 3287145 3196364 3240669 3074110
12368 3074110 2949087 2793900 2514627 2616710 2775659 2817410 2870772 3057233 2896011 3014110
12358 3014110 3282130 3210531 2886684 2731728 2885043 3122292 3152713 3014129 2956621 3313157
12348 3313157 3370160 3252419 3426706 3559707 3449556 3314656 3592009 3642228 3409912 3334252
12338 3334252 3194629 3116880 3285058 3361000 3386687 3071318 3129373 3412209 3517121 3646817
12328 3646817 3752030 3775327 3660670 3554686 3382270 3586582 3834478 3815366 3905306 3794220
12318 3794220 3899124 4068455 4018073 4159898 4016989 3984421 3965425 3492157 3424463 3458010
$$ packed form
12389C232671n6071j83618n9195m9242j67152q9569M9086L63168P8385K5853j09015
12378C035301K25168J10390k3718k24425n2535K06816J0148r0781M4305j66559
12368C074110j25023j55187k79273J02083J58949M1751N3362J86461j61222J18099
12358C014110K68020p1599l23847j54956J53315K37249L0421j38584n7508L56536
12348C313157N7003j17741J74287J33001j10151j34900K77353N0219k32316p5660
12338C334252j39623p7749J68178P5942K5687l15369N8055K82836J04912J29696
12328C646817J05213K3297j14657j05984j72416K04312K47896j9112Q9940j11086
12318C794220J04904J69331n0382J41825j42909l2568j8996m73268o7694L3547
$$ plain form
12308 3458010 3335530 3590274 3829950 3938135 3989981 3842702 3803720 3663902 3402986 3343280
12298 3343280 3253827 3397744 3746197 3939331 3997045 3976552 4033175 3939738 3746392 3988118
12288 3988118 4388332 4337157 4278235 4370861 4479857 4444624 4284124 4267703 4280906 4364371 4319028
12277 4319028 4185122 3989890 4251126 4331755 4157821 4289231 4494757 4677843 4755653 4710582
12267 4710582 4804712 4861616 4806508 4683177 4623894 4392336 4551900 4605129 4698166 4565847
12257 4565847 4383719 4316647 4521514 4898544 5268603 5272008 5255707 5033627 4909157 4852753
12247 4852753 4869426 4985746 4922470 4774872 4776690 4867387 5144941 5215024 5079272 5151800 5207099
12236 5207099 5233785 5195000 5165740 5352016 5732925 5899699 5811882 5647508 5479218 5394921
$$ packed form
12308C458010j22480K54744K39676J08185N1846j47279l8982j39818k60916n9706
12298C343280q9453J43917L48453J93134N7714k0493N6623r3437j93346K41726
12288C988118M00214n1175n8922R2626J08996l5233j60500j6421J3203Q3465m5343
12277D319028j33906j95232K61236Q0629j73934J31410K05526J83086P7810m5071
12267D710582R4130N6904n5108j23331n9283k31558J59564N3229R3037j32319
12257D565847j82128o7072K04867L77030L70059L405j6301k22080j24470n6404
12247D852753J6673J16320o3276j47598J818R0697K77554P0083j35752P2528N5299
12236E207099K6686l8785k9260J86276L80909J66774q7817j64374j68290q4297
$$ plain form
12226 5394921 5680978 5651217 5444397 5254879 5396806 5350869 5337608 5483842 5527858 5664299
12216 5664299 5847227 5674754 5636138 5661474 5541109 5579468 5742814 5746859 5795472 6007756
12206 6007756 6078053 6087995 6252748 6336418 6254561 6397571 6340269 5812313 6078730 6487575
12196 6487575 6388366 6285398 6487346 6727723 6587675 6416184 6243313 6114434 5908402 5924558
12186 5924558 5989010 5994659 6092666 6359095 6310208 6135423 5996243 6022136 6238067 6705699
12176 6705699 6840941 6754058 6799119 6978103 6706241 6915027 7082988 6988171 7122462 7384597
12166 7384597 7635507 7652369 7482047 7460493 7472978 7123021 7017877 7272969 7420130 7626641
12156 7626641 7629260 7575496 7656366 7717928 7761240 7646230 7328830 7539633 7729371 7627853
$$ packed form
12226E394921K86057k9761k06820j89518J41927m5937j3261J46234M4016J36441
12216E664299J82928j72473l8616K5336j20365L8359J63346M045M8613K12284
12206F007756P0297R942J64753Q3670q1857J43010n7302n27956K66417M08845
12196F487575r9209j02968K01948K40377j40048j71491j72871j28879k06032J6156
12186E924558O4452N649R8007K66429m8887j74785j39180K5893K15931M67632
12176F705699J35242q6883M5061J78984k71862K08786J67961r4817J34291K62135
12166G384597K50910J6862j70322k1554J2485l49957j05144K55092J47161K06511
12156G626641K619n3764Q0870O1562M3312j15010l17400K10803J89738j01518
$$ plain form
12146 7627853 7621636 7734827 7702809 7611936 7816712 7870496 8067369 8306397 8531427 8451702
12136 8451702 8235445 8072329 8061214 7982806 8233008 8422954 8357458 8040448 7953841 8211105
12126 8211105 8393400 8427635 8682883 8626156 8790840 8981509 8997194 8991603 9248327 9126800
12116 9126800 9088208 9168501 9083210 9086598 9028324 8936520 9046108 9378073 9156032 9268322 9474397
12105 9474397 9537428 9355931 9448403 9754683 9831712 9901668 10142896 10344335 10236188 9883157
12095 9883157 9689836 9903667 10161028 9988679 10014071 10389377 10172501 10135515 10184829 10189160
12085 10189160 10141718 10247071 10410443 10391134 10347909 10305430 10267369 10236503 10290935 10365722 10033764
12074 10033764 9930716 10209000 10349838 10851541 11011230 10869944 10673381 10668786 11027971 11251389
$$ packed form
12146G627853o217J13191l2018r0873K04776N3784J96873K39028K25030p9725
12136H451702k16257j63116j1115p8408K50202J89946o5496l17010q6607K57264
12126H211105J82295L4235K55248n6727J64684J90669J5685n591K56724j21527
12116I126800l8592Q0293q5291L388n8274r1804J09588L31965k22041J12290K06075
12105I474397O3031j81497R2472L06280P7029O9956K41228K01439j08147l53031
12095I883157j93321K13831K57361j72349K5392L75306k16876l6986M9314M331
12085A0189160m7442J05353J63372j9309m3225m2479l8061l0866N4432P4787l31958
12074A0033764j03048K78284J40838N01703J59689j41286j96563m595L59185K23418
$$ plain form
12064 11251389 10866571 10737436 10993060 11133434 11038671 11023339 10889199 10827276 11004220 11127792
12054 11127792 11039082 11171695 11111378 11003137 11128977 11276417 11474610 11932714 12136132 12096897
12044 12096897 12018603 11972750 11907515 11713333 11796304 11547124 11446313 11637499 12121387 12230634
12034 12230634 12343210 12197276 12271591 12030943 12022418 12438849 12196463 11974544 11977400 11934954
12024 11934954 12226145 12337183 12558990 12507272 12450693 12729488 13053057 13105182 12989420 12937174
12014 12937174 12951904 12859331 12925371 13090904 13262952 13544860 13665771 13475849 13324978 13489574
12004 13489574 13554306 13551385 13632291 13447262 13324818 13387856 13483720 13721678 14034013 14049532
11994 14049532 13547046 13519626 13580445 13452084 13585301 14051059 14479582 14440223 14339327 14245850
$$ packed form
12064A1251389l84818j29135K55624J40374r4763j5332j34140o1923J76944J23572
12054A1127792q8710J32613o0317j08241J25840J47440J98193M58104K03418l9235
12044A2096897p8294m5853o5235j94182Q2971k49180j00811J91186M83888J09247
12034A2230634J12576j45934P4315k40648q525M16431k42386k21919K856m2446
12024A1934954K91191J11038K21807n1718n6579K78795L23569N2125j15762n2246
12014A2937174J4730r2573O6040J65533J72048K81908J20911j89922j50871J64596
12004A3489574O4732k921Q0906j85029j22444O3038R5864K37958L12335J5519
11994A4049532n02486k7420O0819j28361J33217M65758M28523l9359j00896r3477
$$ plain form
11984 14245850 14172435 13933902 13989231 13921711 14291011 14412144 14422904 14550427 14478209 14320449
11974 14320449 14265026 14567518 14563804 14398108 14130669 14314235 14334892 14028029 14250504 14508752
11964 14508752 14499994 14690355 14566258 14393965 14523882 14392718 14523679 14712622 14811219 14784702
11954 14784702 14906329 14978842 14989683 14740489 14446795 14546979 14973877 15026084 14602162 14688295
11944 14688295 14921363 14823397 14730194 14733950 14889037 15045616 15156537 15147608 15120389 15203979 15178976
11933 15178976 15201014 15356644 15435805 15342877 15135908 15054316 15157658 15177888 14909383 14858768
11923 14858768 14865564 14886045 14787785 14709927 14503389 14676107 14838781 15180741 15399666 15137883
11913 15137883 15058608 15014274 15146877 15432462 15361427 15337942 15250952 14975668 14650680 14838482
$$ packed form
11984A4245850p3415k38533N5329o7520L69300J21133J0760J27523p2218j57760
11974A4320449n5423L02492l714j65696k67439J83566K0657l06863K22475K58248
11964A4508752q758J90361j24097j72293J29917j31164J30961J88943R8597k6517
11954A4784702J21627P2513J0841k49194k93694J00184M26898N2207m23922Q6133
11944A4688295K33068r7966r3203L756J55087J56579J10921q929k7219Q3590k5003
11933A5178976K2038J55630P9161r2928k06969q1592J03342K0230k68505n0615
11923A4858768O796K0481r8260p7858k06538J72718J62674L41960K18925k61783
11913A5137883p9275m4334J32603K85585p1035k3485q6990k75284l24988J87802
$$ plain form
11903 14838482 15130725 14902638 14908799 15076028 15234552 15326915 15376040 15148782 14925184 15001955
11893 15001955 15077271 15176638 15317292 15386327 14946560 14805352 14863058 14565320 14584202 14527092
11883 14527092 14175322 14328128 14414824 14167286 14113176 13980887 14113110 14259208 14260471 14391252
11873 14391252 14526026 14647521 14394204 14278182 14077701 13877911 14065939 14020600 13843004
11864 13843004 14051870 14094541 14129201 14037974 13897788 13925191 13953276 14053029 14075013 14068664 14030814
11853 14030814 13586636 13448544 13487594 13583084 13708127 13747768 13556237 13483407 13790125 13813096
11843 13813096 13636644 13585217 13556112 13285821 13186907 13229259 13113666 13026970 13157054 13344692
11833 13344692 13328814 13293609 13279061 13195119 13251599 13301082 12937332 12594789 12543270 12694438
$$ packed form
11903A4838482K92243k28087O161J67229J58524R2363M9125k27258k23598P6771
11893A5001955P5316R9367J40654O9035m39767j41208N7706k97738J8882n7110
11883A4527092l51770J52806Q6696k47538n4110j32289J32223J46098J263J30781
11873A4391252J34774J21495k53317j16022k00481j99790J88028m5339j77596
11864A3843004K08866M2671L4660r1227j40186K7403K8085R9753K1984o349l7850
11853A4030814m44178j38092L9050R5490J25043L9641j91531p2830L06718K2971
11843A3813096j76452n1427k9105k70291r8914M2352j15593q6696J30084J87638
11833A3344692j5878l5205j4548q3942N6480M9483l63750l42543n1519J51168
$$ plain form
11823 12694438 12877578 12898384 12522019 12096092 12070991 12057008 11963556 12159795 12168270 12262870
11813 12262870 12538126 12403607 11927443 11832978 11998484 12405655 12526156 12124163 12036994 12212681
11803 12212681 12057489 12190264 12294631 11903645 11681994 11687682 11491688 11438799 11420213 11404780
11793 11404780 11413472 11508941 11609040 11594395 11472726 11516266 11436992 11253782 10918441 10922676 11253195
11782 11253195 11077831 10994290 11158206 11227881 10981703 11098818 11009269 10755216 10829889 10984830
11772 10984830 10819565 10517507 10515164 10771257 10902365 10850878 10402074 10185885 10160578 10197631
11762 10197631 10385830 10335847 10269575 10403035 10331920 10233596 10192265 9952067 10041899 9954514
11752 9954514 9760666 9544861 9646380 9722127 9634468 9627830 9372834 9235703 9451507 9649641
$$ packed form
11823A2694438J83140K0806l76365m25927k5101j3983r3452J96239Q475R4600
11813A2262870K75256j34519m76164r4465J65506M07171J20501m01993q7169J75687
11803A2212681j55192J32775J04367l90986k21651N688j95994n2889j8586j5433
11793A1404780Q692R5469J00099j4645j21669M3540p9274j83210l35341M235L30519
11782A1253195j75364q3541J63916O9675k46178J17115q9549k54053P4673J54941
11772A0984830j65265l02058k343K56093J31108n1487m48804k16189k5307L7053
11762A0197631J88199m9983o6272J33460p1115r8324m1331k40198Q9832q7385
11752I954514j93848k15805J01519P5747q7659o638k54996j37131K15804J98134
$$ plain form
11742 9649641 9586291 9318285 8992501 9083782 9143217 8969723 9070977 9175401 9101334 8744588
11732 8744588 8952646 9010238 8991063 8941750 8526596 8261729 8298819 8684919 8868632 9008354
11722 9008354 8883305 8679451 8484416 8693708 8694081 8573692 8710527 9033820 8863817 8584865
11712 8584865 8435783 8366825 8389976 8537205 8553546 8384390 8168058 7961132 7953907 8063260
11702 8063260 8027792 7778936 7885303 8146868 7917851 7740166 7954322 8417900 8213693 7747544
11692 7747544 7778975 7850910 7720924 7583437 7644033 7711264 7503918 7254150 7423949 7276291
11682 7276291 7184564 7201903 7391307 7354305 7346020 7121954 7122124 7274379 7293981 7081051 6985936
11671 6985936 7314322 7282390 7260466 7152597 7050549 7067530 7158175 7019903 6900766 6573836
$$ packed form
11742I649641o3350k68006l25784R1281N9435j73494J01254J04424p4067l56746
11732H744588K08058N7592j9175m9313m15154k64867L7090L86100J83713J39722
11722I008354j25049k03854j95035K09292L73j20389J36835L23293j70003k78952
11712H584865j49082o8958K3151J47229J6341j69156k16332k06926p225J09353
11702H063260l5468k48856J06367K61565k29017j77685K14156M63578k04207m66149
11692G747544L1431P1935j29986j37487O0596O7231k07346k49768J69799j47658
11682G276291r1727J7339J89404l7002q285k24066J70J52255J9602k12930r5115
11671F985936L28386l1932k1924j07869j02048J6981R0645j38272j19137l26930
$$ plain form
11661 6573836 6565610 6594662 6572145 6674009 6620408 6530297 6627863 6735661 6702021 6450523 6285895
11650 6285895 6493837 6638188 6819333 6734049 6517501 6403398 6069300 5927854 5955354 6109988
11640 6109988 6094050 6145490 6389520 6101230 6130379 6031586 5916672 5987982 5907970 5842970 5817566
11629 5817566 6063430 6273020 5984181 5894812 5789702 5729548 5834104 5825005 5566711 5346645
11619 5346645 5400252 5311194 5446695 5491557 5255550 5297663 5368435 5470470 5475162 5496697 5361893
11608 5361893 5047145 4977792 5031297 4815673 4571529 4597757 4503582 4683542 4886005 4830669
11598 4830669 4744702 4849369 5082934 4991715 5011911 4766136 4497245 4525863 4701689 4705673
11588 4705673 4897560 4859366 4603229 4475323 4572023 4326100 4147743 4281519 4334197 4246169
$$ packed form
11661F573836q226K9052k2517J01864n3601r0111R7566J07798l3640k51498j64628
11650F285895K07942J44351J81145q5284k16548j14103l34098j41446K7500J54634
11640F109988j5938N1440K44030k88290K9149r8793j14914P1310q0012o5000k5404
11629E817566K45864K09590k88839q9369j05110o0154J04556r099k58294k20066
11619E346645N3607q9058J35501M4862k36007M2113P0772J02035M692K1535j34804
11608E361893l14748o9353N3505k15624k44144K6228r4175J79960K02463n5336
11598D830669q5967J04667K33565r1219K0196k45775k68891K8618J75826L984
11588D705673J91887l8194k56137j27906R6700k45923j78357J33776N2678q8028
$$ plain form
11578 4246169 4337621 4412428 4234808 4101884 4283491 4417192 4125930 4223951 4445853 4316350
11568 4316350 4229547 4450995 4312745 4244127 4282196 4429014 4632620 4574609 4294981 4099518
11558 4099518 4202702 4718567 4780959 4722522 4618792 4185532 3718619 3608854 4032690 4253269
11548 4253269 4158034 3988569 3696904 3464050 3604321 3829970 3702850 3676172 3832693 4056102
11538 4056102 4125586 3922775 3839230 3784915 4020244 4032766 4237082 4273037 3944345 3623084
11528 3623084 3527466 3805696 3871643 3851091 4112478 4134295 3872946 3706849 3557982 3358807
11518 3358807 3369153 3643775 3810203 3666226 3488857 3335835 3225694 3253679 3289604 3476146
11508 3476146 3790237 3797654 3567579 3479320 3496373 3386083 3331814 3422567 3529804 3490207 3439298
$$ packed form
11578D246169R1452P4807j77620j32924J81607J33701k91262R8021K21902j29503
11568D316350q6803K21448j38250o8618L8069J46818K03606n8011k79628j95463
11558D099518J03184N15865O2392n8437j03730m33260m66913j09765M23836K20579
11548D253269r5235j69465k91665k32854J40271K25649j27120k6678J56521K23409
11538D056102O9484k02811q3545n4315K35329J2522K04316L5955l28692l21261
11528C623084r5618K78230O5947k0552K61387K1817k61349j66097j48867j99175
11518C358807J0346K74622J66428j43977j77369j53022j10141K7985L5925J86542
11508C476146L14091P417k30075q8259J7053j10290n4269R0753J07237l9597n0909
$$ plain form
11497 3439298 3363608 3136768 3193855 3609566 3554125 3228808 3574625 3932801 3684218 3338668
11487 3338668 3267454 3147291 3245776 3202830 3262008 3318534 3065040 2932420 2957479 2923760 2980741
11476 2980741 3066139 3039950 2940327 2918531 3013264 3125558 3013789 2869095 2874183 2830356 2737920
11465 2737920 2803901 2940708 3016922 3067905 2996688 2784715 2865789 2708164 2464941 2681496
11455 2681496 3107103 3013432 2838926 2880714 2897835 2598828 2442807 2547121 2474703 2605999
11445 2605999 2616240 2729526 2805361 2631417 2687774 2753600 2887291 3001710 2759949 2463681
11435 2463681 2724588 2836301 2613013 2576108 2633827 2492476 2449564 2241586 1980291 2392250
11425 2392250 2564046 2449780 2689905 2673075 2376858 2587424 2617218 2833128 2939980 2581839
$$ packed form
11497C439298p5690k26840N7087M15711n5441l25317L45817L58176k48583l45550
11487C338668p1214j20163R8485m2946N9178N6526k53494j32620K5059l3719N6981
11476B980741Q5398k6189r9623k1796R4733J12294j11769j44694N088m3827r2436
11465B737920O5981J36807P6214N0983p1217k11973Q1074j57625k43223K16555
11455B681496M25607r3671j74506M1788J7121k99007j56021J04314p2418J31296
11445B605999J0241J13286P5835j73944N6357O5826J33691J14419k41761k96268
11435B463681K60907J11713k23288l6905N7719j41351m2912k07978k61295M11959
11425B392250J71796j14266K40125j6830k96217K10566K9794K15910J06852l58141
$$ plain form
11415 2581839 2416923 2377652 2365946 2485318 2367809 2144827 2110112 2139976 2064073 2341833
11405 2341833 2412961 2269825 2303971 2306346 2445950 2382084 2468681 2426470 2080094 1829575 1804953
11394 1804953 1977415 2174219 1925766 2196461 2392881 2278976 2389747 2283579 2090538
11385 2090538 2200884 2137968 2073327 2113891 2088715 2285846 2387833 2353927 2342211 2204968
11375 2204968 2012811 1992313 2243790 2044595 1893089 1995399 2162367 2210155 2230945 2379545
11365 2379545 2281319 2237464 2192868 2142670 1973461 1945794 1746744 1874043 2035809 1975782
11355 1975782 1872335 2221539 2356120 2329180 2020458 2057480 2163365 2353216 2234369 2282730
11345 2282730 2233842 1868959 1559683 1450786 1547554 1727902 1722649 1909109 2115180 2237462
$$ packed form
11415B581839j64916l9271j1706J19372j17509k22982l4715K9864p5903K77760
11405B341833P1128j43136L4146K375J39604o3866Q6597m2211l46376k50519k4622
11394A804953J72462J96804k48453K70695J96420j13905J10771j06168j93041
11385B090538J10346o2916o4641M0564k5176J97131J01987l3906j1716j37243
11375B204968j92157k0498K51477j99195j51506J02310J66968M7788K0790J48600
11365B379545r8226m3855m4596n0198j69209k7667j99050J27299J61766o0027
11355A975782j03447L49204J34581k6940l08722L7022J05885J89851j18847M8361
11345B282730m8888l64883l09276j08897R6768J80348n253J86460K06071J22282
$$ plain form
11335 2237462 2100370 1624090 1448264 1619306 1637496 1935511 2265655 2144016 1862759 1487504
11325 1487504 1368045 1622053 1736727 1800095 1594548 1516742 1309860 1531902 1697070 1941670
11315 1941670 1792953 1505390 1541969 1542225 1371885 1313918 1643705 1555917 1502797 1730927 1787444
11304 1787444 1800105 1759534 1484383 1432214 1739550 2024826 1968553 1820356 1661213 1631267
11294 1631267 1367628 1295979 1292346 1192452 1526306 1566486 1533686 1456357 1326699 1395698 1437601
11283 1437601 1136823 1057440 1402828 1476033 1406588 1236172 1248151 1539876 1719086 1620714
11273 1620714 1766680 1722179 1705293 1668727 1639579 1425189 1145334 1187991 1344418 1488999
11263 1488999 1697864 1697019 1509841 1348776 1292592 1151470 1187363 1530441 1867227 1713687
$$ packed form
11335B237462j37092m76280j75826J71042J8190K98015L30144j21639k81257l75255
11325A487504j19459K54008J14674O3368k05547p7806k06882K22042J65168K44600
11315A941670j48717k87563L6579K56j70340n7967L29787q7788n3120K28130N6517
11304A787444J2661m0571k75151n2169L07336K85276n6273j48197j59143k9946
11294A631267k63639p1649l633r9894L33854M0180l2800p7329j29658O8999M1903
11283A437601l00778p9383L45388P3205o9445j70416J1979K91725J79210r8372
11273A620714J45966m4501j6886l6566k9148k14390k79855M2657J56427J44581
11263A488999K08865q45j87178j61065n6184j41122L5893L43078L36786j53540
$$ plain form
11253 1713687 1667556 1667041 1367792 1246813 1289265 1454865 1417664 1403008 1287345 1269759 1046836
11242 1046836 764295 1088801 1411441 1309007 1124653 1250392 1369431 1203972 1085614
11233 1085614 1342995 1282441 1190635 1250036 1330126 1246839 1508079 1660409 1493011 1461757
11223 1461757 1251100 1031844 750687 525906 617837 838557 1069966 945238 910130 1228036
11213 1228036 1226038 1115517 992534 1339108 1505866 1396234 1175014 1100621 929212 862249
11203 862249 841420 781112 901516 1190993 1068631 1146922 1255295 1222959 860145 537991
11193 537991 588886 734925 701070 951136 1247932 1323695 1139327 913545 857333 849409 960219
11182 960219 1216588 1337919 943115 976223 1266900 1171463 1200048 1132955 742270 732010
$$ packed form
11253A713687m6131n15k99249j20979M2452J65600l7201j4656j15663j7586k22923
11242A046836k82541L24506L22640j02434j84354J25739J19039j65459j18358
11233A085614K57381o0554r1806N9401Q0090q3287K61240J52330j67398l1254
11223A461757k10657k19256k81157k24781R1931K20720K31409j24728l5108L17906
11213A228036j998j10521j22983L46574J66758j09632k21220p4393j71409o6963
11203H62249k0829o0308J20404K89477j22362P8291J08373l2336l62814l22154
11193E37991N0895J46039l3855K50066K96796P5763j84368k25782n6212p924J10810
11182I60219K56369J21331l94804L3108K90677r5437K8585o7093l90685j0260
$$ plain form
11172 732010 724464 631194 522959 566977 746702 589578 563414 649219 909484 1013323 876756
11161 876756 804772 759513 644247 755554 726403 713550 900576 803490 594398 615960 754682
11150 754682 971314 1100643 928855 956293 1040459 893995 1074881 1178892 1301544 1459397
11140 1459397 1326598 967673 617734 336031 268046 338104 417186 604462 764540 728762
11130 728762 657450 705237 961246 1093013 1056641 872054 860226 737783 861157 876945
11120 876945 757107 902151 1106189 1194293 1002964 896017 963532 882707 805656 377140
11110 377140 398262 332105 459027 529356 317449 403822 535689 356301 254930 237264
11100 237264 127754 212416 258499 432998 608445 646703 630105 373684 400720 514966
$$ packed form
11172G32010p546r3270j08235M4018J79725j57124k6164Q5805K60265J03839j36567
11161H76756p1984m5259j15266J11307k9151j2853J87026r7086k09092K1562J38722
11150G54682K16632J29329j71788K7438Q4166j46464J80886J04011J22652J57853
11140A459397j32799l58925l49939k81703o7985P0058P9082J87276J60078l5778
11130G28762p1312M7787K56009J31767l6372j84587j1828j22443J23374J5788
11120H76945j19838J45044K04038Q8104j91329j06947O7515q0825p7051m28516
11110C77140K1122o6157J26922P0329k11907Q6373J31867j79388j01371j7666
11100B37264j09510Q4662M6083J74499J75447L8258j6598k56421K7036J14246
$$ plain form
11090 514966 720625 609003 362341 378566 588990 460476 157933 331516 461490 559313
11080 559313 701616 971435 838776 970607 945819 365132 274732 842231 974880 624001
11070 624001 422975 564565 495798 315864 532014 697863 841225 900129 985584 946448
11060 946448 745075 842768 843586 1076149 1315058 1180065 1106543 1001447 903701 662042 548836
11049 548836 527806 855997 992984 1127339 1060880 1007202 1073549 1104552 1208165 1528071
11039 1528071 1644320 1355471 1236708 1468348 1426780 1451415 1586469 1518307 1407204 1398413
11029 1398413 1652170 1694829 1838490 1940249 1698642 1719074 1916196 2049973 1796531 1546438
11019 1546438 1378008 1480572 1637797 1916637 2219397 2317878 2370735 2399290 2365624 2265046
$$ packed form
11090E14966K05659j11622k46662J6225K10424j28514l02543J73583J29974R7823
11080E59313J42303K69819j32659J31831k4788n80687r0400N67499J32649l50879
11070F24001k01026J41590o8767j79934K16150J65849J43362N8904Q5455l9136
11060I46448k01373R7693Q18K32563K38909j34993p3522j05096r7746k41659j13206
11049E48836k1030L28191J36987J34355o6459n3678O6347L1003J03613L19906
11039A528071J16249k88849j18763K31640m1568K4635J35054o8162j11103q791
11029A398413K53757M2659J43661J01759k41607K0432J97122J33777k53442k50093
11019A546438j68430J02564J57225K78840L02760R8481N2857K8555l3666j00578
$$ plain form
11009 2265046 2207767 2193415 2226295 2160003 2139257 2342282 2323886 2217671 2048705 2033026 1967395
10998 1967395 1864007 1633353 1146576 1095830 987037 1046325 1144787 1314066 1453363 1401112
10988 1401112 1271762 1175630 1251686 1509210 1337076 1299778 1207023 901656 714892 628545
10978 628545 636808 731231 764817 983887 1042138 860093 776337 870871 582493 365179 304078
10967 304078 253170 150230 219882 391589 188092 192815 309283 623205 793847 933294
10957 933294 1040327 916095 883107 785662 522100 115371 98046 174146 450728 788551
10947 788551 807892 582454 705927 769211 846599 751805 749050 793134 762050 892634 884548
10936 884548 884277 940424 962196 662441 497710 344604 458496 279073 247899 308703 395856
$$ packed form
11009B265046n7279j4352L2880o6292k0746K03025j8396j06215j68966j5679o5631
10998A967395j03388k30654m86777n0746j08793N9288R8462J69279J39297n2251
10988A401112j29350r6132P6056K57524j72134l7298r2755l05367j86764q6347
10978F28545Q263R4423L3586K19070N8251j82045q3756R4534k88378k17314o1101
10967C04078n0908j02940O9652J71707k03497M723J16468L13922J70642J39447
10957I33294J07033j24232l2988r7445k63562m06729j7325P6100K76582L37823
10947G88551J9341k25438J23473O3284P7388r4794k755M4084l1084J30584q086
10936H84548k71N6147K1772k99755j64731j53106J13892j79423l1174O0804Q7153
$$ plain form
10925 395856 266527 64819 246971 370794 430133 426704 414651 580371 701593 481583
10915 481583 346096 54996 -188153 44301 325402 291011 437691 553058 504814 424717
10905 424717 448517 460780 492493 595406 608106 642470 374003 154886 100708 204865 266759
10894 266759 163796 122584 308702 109574 105189 83617 299416 367201 339730 37020 -17550
10883 -17550 386099 340256 332576 527724 304717 -122991 -144563 -112880 142693 374258 416674
10872 416674 302105 456807 775357 547851 605925 264432 176144 238902 207806 151274
10862 151274 272304 454312 552464 493072 456687 492592 662117 402750 311613 536828
10852 536828 555698 447940 291901 184099 169498 120445 59796 160446 251404 351543
$$ packed form
10925C95856j29329k01708J82152J23823N9339l429j2053J65720J21222k20010
10915D81583j35487k91100k43149K32454K81101l4391J46680J15367m8244q0097
10905D24717K3800J2263L1713J02913J2700L4364k68467k19117n4178J04157O1894
10894B66759j02963m1212J86118j99128m385k1572K15799O7785k7471l02710n4570
10883a7550M03649m5843p680J95148k23007m27708k1572L1683K55573K31565M2416
10872D16674j14569J54702L18550k27506N8074l41493q8288O2758l1096n6532
10862A51274J21030J82008R8152n9392l6385L5905J69525k59367r1137K25215
10852E36828J8870j07758j56039j07802j4601m9053o0649J00650R0958J00139
$$ plain form
10842 351543 344519 142383 185188 393749 182881 211775 376716 362624 309804 91116 -51278
10831 -51278 59683 349450 388214 421145 416001 417782 264096 356888 374903 538101 466827
10820 466827 263968 -42028 -74588 241753 309457 225885 353929 216279 251093 304533
10810 304533 360862 400777 517875 349604 439044 359421 92161 61903 47717 125032 159002
10799 159002 -228171 -598380 -741375 -543823 -27190 122339 286477 151883 -78953 -124537
10789 -124537 20714 -92859 -88397 -159180 -114473 -335846 -112244 -151198 -452577 -569206
10779 -569206 -511191 -362010 -271892 -187569 -43784 -86196 -32814 -220903 -216858 -7803 -112267
10768 -112267 -292419 154914 214738 -82156 -91205 -267169 -371212 -456424 -180057 251220
$$ packed form
10842C51543p024k02136M2805K08561k10868K8894J64941j4092n2820k18688j42394
10831e1278J10961K89767L8764L2931n144J781j53686R2792J8015J63198p1274
10820D66827k02859l05996l2560L16341O7704q3572J28044j37650L4814N3440
10810C04533N6329L9915J17098j68271Q9440p9623k67260l0258j4186P7315L3970
10799A59002l87173l70209j42995J97552N16633J49529J64138j34594k30836m5584
10789a24537J45251j13573M462p0783M4707k21373K23602l8954l01379j16629
10779e69206N8015J49181R0118Q4323J43785m2412N3382j88089M045K09055j04464
10768a12267j80152M47333N9824k96894r049j75964j04043q5212K76367M31277
$$ plain form
10758 251220 123282 -171110 -142691 -273494 -302706 -143934 -83594 -143486 -39355 -147647
10748 -147647 -134324 48462 -11953 -18711 -253673 -52932 127254 73609 40290 2627 -96877
10737 -96877 -85454 -101102 -46526 -263611 -205011 123734 543679 217314 31096 44501 -122111
10726 -122111 -566535 -828127 -861074 -879729 -838441 -687557 -374710 -149326 19198 19770 257269
10715 257269 317147 257591 368536 381731 250222 332607 306531 181968 251102 275929 301968
10704 301968 286221 70728 -126194 -45423 153669 324102 279180 69364 138679 514289
10694 514289 579079 752899 496741 111126 55742 148448 -38048 -107683 -2651 77650
10684 77650 105710 259552 222740 188190 472823 696878 620673 331343 24252 96638 333314
$$ packed form
10758B51220j27938k94392K8419j30803k9212J58772O0340n9892J04131j08292
10748a47647J3323J82786o0415o758k34962K00741J80186n3645l3319l7663r9504
10737i6877J1423j5648N4576k17085N8600L28745M19945l26365j86218J3405j66612
10726a22111m44424k61592l2947j8655M1288J50884L12847K25384J68524N72K37499
10715B57269N9878n9556J10945J3195j31509Q2385k6076j24563O9134K4827K6039
10704C01968j5747k15493j96922Q0771J99092J70433m4922k09816O9315L75610
10694E14289O4790J73820k56158l85615n5384R2706j86496o9635J05032Q0301
10684G7650K8060J53842l6812l4550K84633K24055p6205k89330l07091P2386K36676
$$ plain form
10673 333314 245141 153130 382242 691648 538234 538992 526887 387458 256963 141017 238304
10662 238304 601971 800987 881764 689323 675208 618887 681860 687474 669368 744203 1231144
10651 1231144 1671349 2175729 2155730 2351510 2435200 2877639 3237684 3738612 3543907 3274666
10641 3274666 2871197 2557761 2758994 2928473 2840385 2835360 2955352 3031068 3312530 3656444
10631 3656444 3927077 4343607 4551353 4910593 5519451 6586297 7640297 8745486 9666387
10622 9666387 10793026 11675846 12650234 14039954 15802120 18245064 21079761 24947695
10614 24947695 30054810 36380330 44623793 54926041 66709863 78934159 91573674
10607 91573674 104266778 115305877 122406015 125081451 125200126 126719411 131794163 141161060
$$ packed form
10673C33314q8173r2011K29112L09406j53414P58j2105j39429j30495j15946R7287
10662B38304L63667J99016Q0777j92441j4115n6321O2973N614j8106P4835M86941
10651A231144M40205N04380j9999J95780Q3690M42439L60045N00928j94705k69241
10641C274666m03469l13436K01233J69479q8088n025J19992P5716K81462L43914
10631C656444K70633M16530K07746L59240O08858J066846J054000J105189R20901
10622I666387J126639Q82820R74388J389720J762166K442944K834697L867934
10614B4947695N107115O325520Q243463J0302248J1783822J2224296J2639515
10607I1573674J2693104J1039099P100138K675436J18675J519285N074752R366897
$$ plain form
10599 141161060 155694334 174664659 196268118 219227927 241567734 259155622 265510839
10592 265510839 258979899 246915094 237900354 236440452 243633333 258961630 280473813
10585 280473813 304678096 330229732 353801364 368456469 364750138 341396741 310087231
10578 310087231 283272559 265597595 257557612 257512746 263431339 272286736 282251470 290492243
10570 290492243 291975991 280722349 256870546 229120396 205624272 188811678 178200253
10563 178200253 172640146 170009441 168794308 168059056 166512509 161680000 151617837 137101933
10555 137101933 121633644 107451688 95622406 86237000 78948833 72800951 67917311
10548 67917311 63832874 60657016 57751434 55058304 52748490 50458014 48417199 46539118
$$ packed form
10599A41161060J4533274J8970325K1603459K2959809K2339807J7587888O355217
10592B65510839o530940j2064805r014740j459902P192881J5328297K1512183
10585B80473813K4204283K5551636K3571632J4655105l706331k3353397l1309510
10578C10087231k6814672j7674964q039983m4866N918593Q855397R964734Q240773
10570B90492243J483748j1253642k3851803k7750150k3496124j6812594j0611425
10563A78200253n560107k630705j215133p35252j546547m832509j0062163j4515904
10555A37101933j5468289j4181956j1829282r385406p288167o147882m883640
10548F7917311m084437l175858k905582k693130k309814k290476k040815j878081
$$ plain form
10540 46539118 44914767 43372169 41760430 40098572 38323174 37215037 36291256 35306095
10532 35306095 34343061 33240915 32339980 31468402 30238055 29334329 28739587 27728771 26766770
10523 26766770 25861504 25289381 24660707 24008566 23742131 23275715 22687577 22048238 21218793
10514 21218793 20788280 20379177 19769031 19041006 18327554 18033014 17680718 17243833 16982402
10505 16982402 16847705 16490824 15773030 15239802 14968403 14755253 14300909 13488241 13301515
10496 13301515 13025580 12733856 12411613 11829349 11642648 11583749 11309109 11155478 11164872 10919692
10486 10919692 10462297 10188690 9761584 9726018 9682244 9594826 9385701 8895975 8764573 8604843
10476 8604843 8273400 7998405 8040717 8101471 8013959 7920250 7555038 7302689 7098035 7089518
$$ packed form
10540D6539118j624351j542598j611739j661858j775398j108137r23781r85161
10532C5306095r63034j102146r00935q71578j230347r03726n94742j010816r62001
10523B6766770r05266n72123o28674o52141k66435m66416n88138o39339q29445
10514B1218793m30513m09103o10146p28025p13452k94540l52296m36885k61431
10505A6982402j34697l56881p17794n33228k71399k13150m54344q12668j86726
10496A3301515k75935k91724l22243n82264j86701n8899k74640j53631R394k45180
10486A0919692m57395k73607m27106l5566m3774q7418k09125m89726j31402j59730
10476H604843l31443k74995M2312O0754q7512r3709l65212k52349k04654q517
$$ plain form
10466 7089518 7022534 6724101 6428200 6362856 6234605 6145823 6352286 6055023 5735659 5552608
10456 5552608 5650789 5599754 5727988 5956359 5758185 5497770 5374286 5254041 5173628 4875202
10446 4875202 4716673 4611379 4430490 4571820 4506783 4642541 4581986 4521843 4363436 4192884
10436 4192884 3958590 3730810 3535398 3828382 3663069 3598865 3489955 3591559 3807057 3813834
10426 3813834 3509058 3080322 2722233 2688445 2884704 2984885 2958656 3113084 2899116 2744315
10416 2744315 2837917 2657198 2486873 2482498 2537904 2472218 2221610 2009188 1921168 2246349
10406 2246349 2294447 2094051 1754514 1689683 1798997 1913914 1970284 2081731 1909363 1826083
10396 1826083 1916916 2064056 1792689 1836199 1968574 2196286 1988522 1797521 1931889 1833679
$$ packed form
10466G089518o6984k98433k95901o5344j28251q8782K06463k97263l19364j83051
10456E552608R8181n1035J28234K28371j98174k60415j23484j20245q0413k98426
10446D875202j58529j05294j80889J41330o5037J35758o0555o0143j58407j70552
10436D192884k34294k27780j95412K92984j65313o4204j08910J01604K15498O777
10426C813834l04776m28736l58089l3788J96259J00181k6229J54428k13968j54801
10416B744315R3602j80719j70325m375N5406o5686k50608k12422q8020L25181
10406B246349M8098k00396l39537o4831J09314J14917N6370J11447j72368q3280
10396A826083R0833J47140k71367M3510J32375K27712k07764j91001J34368r8210
$$ plain form
10386 1833679 1966487 2341491 2218983 1780512 1474278 1667989 1927704 2117736 2014393
10377 2014393 1882390 1760588 1705003 1754323 1707142 1621926 1693338 1520429 1231114 1180601
10367 1180601 1483794 1624928 1479795 1462381 1402412 1271150 1155449 1358823 1431568 1446173
10357 1446173 1512758 1421468 1315904 1345712 1369179 1172591 1236717 1307098 1264248 1326076 1308321
10346 1308321 1490782 1462748 1393083 1221978 1167399 1046667 1157993 917120 716977 724207
10336 724207 936274 1080449 988085 1055861 998202 1251208 1180499 898214 928731 1047492
10326 1047492 1235947 1381832 1430572 1426499 1293737 1363253 1202500 1026166 939403 846501
10316 846501 669643 784164 1151873 1059575 855558 802982 798397 1120251 1069741 841674
$$ packed form
10386A833679J32808L75004j22508m38471l06234J93711K59715J90032j03343
10377B014393j32003j21802n5585M9320m7181q5216P1412j72909k89315n0513
10367A180601L03193J41134j45133j7414n9969j31262j15701K03374P2745J4605
10357A446173O6585r1290j05564K9808K3467j96588O4126P0381m2850O1828j7755
10346A308321J82461k8034o9665j71105n4579j20732J11326k40873k00143P230
10336G24207K12067J44175r2364O7776n7659K53006p0709k82285L0517J18761
10326A047492J88455J45885M8740m073j32762O9516j60753j76334q6763r2902
10316H46501j76858J14521L67709r2298k04017n2576m585L21854n0510k28067
$$ plain form
10306 841674 1210601 1279633 1283294 1111990 1018967 1029738 1147850 1150174 961969 968434 915854
10295 915854 1131837 1361991 995416 897373 1185468 950971 649641 696279 802992 1060724
10285 1060724 1012581 905636 982346 1017970 1019169 1002690 888084 997841 1071555 914967 747059
10274 747059 842547 985968 910704 985751 916270 899105 1123360 918731 789825 852593 1011950
10263 1011950 809901 669340 636477 887372 717324 512613 603869 820492 566187 316305
10253 316305 150876 428585 630369 622227 643750 687539 716013 854468 886384 968727 911663
10242 911663 729556 654719 714017 666866 470518 613431 1022318 991297 829365 538333
10232 538333 285497 241115 446415 665092 705393 734995 697698 707822 702413 727044 890789
$$ packed form
10306H41674L68927O9032L661j71304r3023J0771J18112K324j88205O465n2580
10295I15854K15983K30154l66575r8043K88095k34497l01330M6638J06713K57732
10285A060724m8143j06945P6710L5624J199j6479j14606J09757P3714j56588j67908
10274G47059R5488J43421p5264P5047o9481j7165K24255k04629j28906O2768J59357
10263A011950k02049j40561l2863K50895j70048k04711R1256K16623k54305k49882
10253C16305j65429K77709K01784q142K1523M3789K8474J38455L1916Q2343n7064
10242I11663j82107p4837N9298m7151j96348J42913M08887l1021j61932k91032
10232E38333k52836m4382K05300K18677M0301K9602l7297J0124n409K4631J63745
$$ plain form
10221 890789 1030990 675047 469535 654178 691082 519865 437570 409140 451209 457690 155145
10210 155145 131448 5618 289287 501477 740102 525936 226222 192012 284909 375128
10200 375128 395317 407820 641683 489634 390469 400259 530076 535993 337024 378491 476270
10189 476270 498076 386841 496607 670282 892971 1062745 922690 737291 589243 886792
10179 886792 979705 682084 630817 688516 677654 662556 1010026 942919 998105 1200541 1304484
10168 1304484 1333071 1328027 1401204 1369943 1467070 1387971 1427659 1716103 1765516 1663898 1791588
10157 1791588 2057027 1850589 1815139 1760567 1715441 1409802 1457462 1965543 2183539 2256653
10147 2256653 2511388 2655357 2700015 2568545 2195855 1773479 1874617 1969775 1892853 1832451
$$ packed form
10221H90789J40201l55943k05512J84643L6904j71217q2295k8430M2069O481l02545
10210A55145k3697j25830K83669K12190K38625k14166k99714l4210R2897R0219
10200C75128K0189J2503K33863j52049r9165R790J29817N917j98969M1467R7779
10189D76270K1806j11235J09766J73675K22689J69774j40055j85399j48048K97549
10179H86792R2913k97621n1267N7699j0862j5098L47470o7107N5186K02436J03943
10168A304484K8587n044P3177l1261R7127p9099L9688K88444M9413j01618J27690
10157A791588K65439k06438l5450n4572m5126l05639M7660N08081K17996P3114
10147B256653K54735J43969M4658j31470l72690m22376J01138R5158p6922o0402
$$ plain form
10137 1832451 1937159 1898534 1769081 1749218 1705969 1383842 1022050 854755 865741 1110115
10127 1110115 1277833 1329943 1339850 1422057 1554432 1593769 1634458 1441713 1118610 1223205
10117 1223205 1288222 1457296 1364492 1313628 1245652 984044 655430 631212 777863 699358
10107 699358 528215 454319 586570 464887 446346 404972 490668 573788 567805 436501 572112
10096 572112 498793 337003 399650 520381 621365 519499 554733 863374 690804 692218
10086 692218 612688 421423 62122 41351 222074 133823 -85005 186388 241721 330511
10076 330511 357831 133297 69088 -84946 139480 459514 818229 966122 904905 735237
10066 735237 848043 586092 483324 517277 429847 116240 -255493 -269732 -81491 -55373
$$ packed form
10137A832451J04708l8625j29453j9863m3249l22127l61792j67295J0986K44374
10127A110115J67718N2110R907Q2207J32375L9337M0689j92745l23103J04595
10117A223205O5017J69074r2804n0864o7976k61608l28614k4218J46651p8505
10107F99358j71143p3896J32251j21683j8541m1374Q5696Q3120n983j31304J35611
10096E72112p3319j61790O2647J20731J00984j01866L5234L08641j72570J414
10086F92218p9530j91265l59301k0771J80723q8251k18828K71393N5333Q8790
10076C30511K7320k24534o4209j54034K24426L20034L58715J47893o1217j69668
10066G35237J12806k61951j02768L3953q7430l13607l71733j4239J88241K6118
$$ plain form
10056 -55373 99945 232697 359783 414952 311303 160811 123835 367832 358916 385292 369907
10045 369907 390824 364134 160192 39502 1450 83343 247896 231554 233599 -10184 12913
10034 12913 63694 105554 176273 301407 392742 559978 661726 602373 528733 512627 296540
10023 296540 318423 182965 189406 481270 536473 411488 322026 12165 -159578 -26646
10013 -26646 7364 188799 153564 249790 466843 266398 421556 587194 543374 349982
10003 349982 289982 255824 120739 229425 367223 285200 184635 493182 665766 607147
9993 607147 653106 400591 292559 205072 100728 317647 435170 482268 497837 550043 726711
9982 726711 589606 380124 465797 368639 191419 2990 -168084 164805 619080 967805
$$ packed form
10056e5373J55318J32752J27086N5169j03649j50492l6976K43997q916K6376j5385
10045C69907K0917k6690k03942j20690l8052Q1893J64553j6342K045k43783K3097
10034A2913N0781M1860P0719J25134R1335J67236J01748n9353p3640j6106k16087
10023B96540K1883j35458O441K91864N5203j24985q9462l09861j71743J32932
10013b6646L4010J81435l5235R6226K17053k00445J55158J65638m3820j93392
10003C49982o0000l4158j35085J08686J37798q2023j00565L08547J72584n8619
9993F07147M5959k52515j08032q7487j04344K16919J17523M7098J5569N2206J76668
9982G26711j37105k09482Q5673r7158j77220j88429j71074L32889M54275L48725
$$ plain form
9972 967805 764258 666655 474820 489770 627762 386385 424278 450137 334494 701981
9962 701981 711333 545465 467274 311595 363691 518303 413085 325257 138805 314257 642859
9951 642859 563600 226321 141907 93382 87183 66812 178194 377204 285117 550550 782279
9940 782279 1027806 716391 285039 221024 587732 628420 349952 509617 399219 241601
9930 241601 442818 453748 603318 861494 836136 1012829 1030650 654839 309318 41328
9920 41328 185222 201879 251434 281562 69685 106964 202564 253630 421065 383574 113424
9909 113424 127598 259220 463790 436595 255786 77598 190487 187519 189166 335004 282348
9898 282348 271503 142498 52952 -46391 135587 174284 -238548 -517080 -79238 37647
$$ packed form
9972I67805k03547r7603j91835J4950J37992k41377L7893K5859j15643L67487
9962G01981R352j65868p8191j55679N2096J54612j05218q7828j86452J75452L28602
9951F42859p9259l37279q4414m8525o199k0371J11382J99010r2087K65433K31729
9940G82279K45527l11415m31352o4015L66708M0688k78468J59665j10398j57618
9930B41601K01217J0930J49570K58176k5358J76693J7821l75811l45521k67990
9920D1328J43894J6657M9555L0128k11877L7279R5600N1066J67435l7491k70150
9909A13424J4174J31622K04570k7195j80809j78188J12889k968J647J45838n2656
9898B82348j0845j29005q9546r9343J81978L8697m12832k78532M37842J16885
$$ plain form
9888 37647 19844 176503 441636 366056 442550 488656 573084 448575 461533 464168 398345
9877 398345 307824 348158 464133 396385 372589 618507 429331 175597 53167 23146 -49152
9866 -49152 -11142 278947 245854 290449 98069 45744 123366 133811 306063 504872 512004
9855 512004 579945 582043 497894 581200 515409 242419 161944 193011 -5664 -300145 -317756
9844 -317756 -184712 -40763 155164 111539 208529 385381 531252 476872 456362 452719 503000
9833 503000 415247 462017 437494 279510 204628 425530 339146 267612 554648 520125 328731
9822 328731 506975 627938 198342 88882 194853 423589 749175 742145 840464 916172
9812 916172 891239 1010559 993882 687274 131283 49571 222675 222281 264103 218523 -29329
$$ packed form
9888C7647j7803J56659K65133p5580P6494M6106Q4428j24509J2958K635o5823
9877C98345r0521M0334J15975o7748k3796K45918j89176k53734j22430l0021p2298
9866d9152L8010K90089l3093M4595j92380n2325P7622J0445J72252J98809P132
9855E12004O7941K098q4149Q3306o5791k72990q0475L1067j98675k94481j7611
9844c17756J33044J43949J95927m3625R6990J76852J45871n4380k0510l643N0281
9833E03000q7753M6770k4523j57984p4882K20902q6384p1534K87036l4523j91394
9822C28731J78244J20963m29596j09460J05971K28736L25586p030R8319P5708
9812I16172k4933J19320j6677l06608n55991q1712J73104l94M1822m5580k47852
$$ plain form
9801 -29329 73929 296598 268387 102284 94673 202851 167208 499962 530334 562401 496788
9790 496788 288478 104364 69894 112526 304473 230679 344109 381216 241592 164031 301686
9779 301686 337437 380869 371134 484658 419786 482566 401470 327440 474711 676705 382138
9768 382138 252226 209248 244964 453609 501815 193409 74541 82156 -16614 -75208 50451
9757 50451 84633 83997 322144 571111 620457 461006 217843 261910 191599 -38034 -142687
9746 -142687 -153480 -314328 -299547 -217745 -152658 -77275 128517 203669 247956 54765 152532
9735 152532 374574 280023 327543 329892 283547 355222 351108 250501 256480 470204 311873
9724 311873 -72083 -205988 -100673 -156617 13302 115995 346831 177525 32625 121102
$$ packed form
9801b9329J03258K22669k8211j66103p611J08178l5643L32754L0372L2067o5613
9790D96788k08310j84114l4470M2632J91947p3794J13430L7107j39624p7561J37655
9779C01686L5751M3432r735J13524o4872O2780q1096p4030J47271K01994k94567
9768C82138j29912m2978L5716K08645M8206l08406j18868P615r8770n8594J25659
9757E0451L4182o36K38147K48967M9346j59451k43163M4067p0311k29633j04653
9746a42687j0793j60848J4781Q1802O5087P5383K05792P5152M4287j93191R7767
9735A52532K22042r4551M7520K349m6345P1675m114j00607N979K13724j58331
9724C11873l83956j33905J05315n5944J69919J02693K30836j69306j44900Q8477
$$ plain form
9714 121102 280093 215495 311822 445915 394631 304558 129995 -35773 -21657 -54524 114133
9703 114133 -37710 -14253 33086 -231105 -220097 -89837 -204756 -117203 -238032 -92478
9693 -92478 8935 -223481 -258243 125597 240281 251231 154434 82822 -83034 -333322 -134912
9682 -134912 123958 -17462 -211772 -284486 30694 214783 147468 95625 124903 418577
9672 418577 120875 -76937 -82345 109110 164991 255435 477344 449788 406360 803675 837081
9661 837081 384310 447976 276818 -8035 45979 499079 911419 789917 970321 1275785
9651 1275785 1456551 1821329 2589557 3473949 4691499 6335109 7646979 8934407 10785366
9642 10785366 13116198 13237707 10161552 6893697 4907869 3806797 2952563 2285583 2070118
$$ packed form
9714A21102J58991o4598R6327J34093n1284r0073j74563j65768J4116l2867J68657
9703A14133j51843K3457M7339k64191J1008J30260j14919Q7553j20829J45554
9693i2478J01413k32416l4762L83840J14684J0950r6797p1612j65856k50288J98410
9682a34912K58870j41420j94310p2714L15180J84089o7315n1843K9278K93674
9672D18577k97702j97812n408J91455N5881R0444K21909k7556m3428L97315L3406
9661H37081m52771O3666j71158k84853N4014M53100M12340j21502J80404L05464
9651A275785J80766L64778P68228Q84392J217550J643610J311870J287428J850959
9642A0785366K330832J21509l076155l267855j985828j101072q54234o66980k15465
$$ plain form
9633 2070118 2328661 2105069 1920108 1713690 1306233 1244348 1229235 844366 730952 776906
9623 776906 705355 851165 754254 720595 447412 770160 930147 801776 685374 771049
9613 771049 790997 546902 557782 706742 947050 577585 689686 735121 838647 934146
9603 934146 817279 703180 688387 459804 377088 444476 401665 623138 547464 89017 -213000
9592 -213000 -175333 31500 190087 138398 255458 446643 528288 495896 300433 128169
9582 128169 160913 223386 209464 612869 329404 -172670 -260695 -39668 196065 142257 277947
9571 277947 252560 510411 619318 635654 432916 265939 189339 55262 32215 212549
9561 212549 312418 311700 338429 404850 499849 371487 278974 537755 377475 300602 -3112
$$ packed form
9633B070118K58543k23592j84961k06418m07457o1885j5113l84869j13414M5954
9623G76906p1551J45810r6911l3659k73183L22748J59987j28371j16402Q5675
9613G71049J9948k44095J0880J48960K40308l69465J12101M5435J03526R5499
9603I34146j16867j14099j4793k28583q2716O7388m2811K21473p5674m58447l02017
9592b13000L7667K06833J58587n1689J17060J91185Q1645l2392j95463j72264
9582A28169L2744O2473j3922M03405k83465n02074q8025K21027K35733n3808J35690
9571B77947k5387K57851J08907J6336k02738j66977p6600j34077k3047J80334
9561B12549R9869p18K6729O6421R4999j28362r2513K58781j60280p6873l03714
$$ plain form
9550 -3112 -295377 -318768 -290736 -175416 -328969 -444268 -397298 -144880 -195277 -193819 31997
9539 31997 313902 346832 302287 103492 26052 -247731 -507534 -460156 -67067 290061 313062
9528 313062 134526 272914 346270 471009 275061 -2248 25760 38646 111379 63160 -183436
9517 -183436 -254088 -274212 -172923 183830 204748 81336 258620 314114 179087 -13300
9507 -13300 127475 265543 253272 225338 461864 589890 400211 215503 -2072 119495
9497 119495 318938 117229 -200863 -81872 -9379 20602 193352 93766 134911 -84074
9487 -84074 -38291 54888 118774 58182 280537 462498 547798 240079 199122 232442 370576
9476 370576 424740 271648 217428 471745 519072 651058 246378 -298406 -375086 -228116
$$ packed form
9550c112k92265k3391K8032J15320j53553j15299M6970K52418n0397J458K25816
9539C1997K81905L2930m4545j98795p7440k73783k59803M7378L93089L57128K3001
9528C13062j78536J38388P3356J24739j95948k77309K8008J2886P2733m8219k46596
9517a83436p0652k0124J01289L56753K0918j23412J77284N5494j35027j92387
9507a3300J40775J38068j2271k7934K36526J28026j89679j84708k17575J21567
9497A19495J99443k01709l18092J18991P2493K9981J72750r9586M1145k18985
9487h4074M5783R3179O3886o0592K22355J81961Q5300l07719m0957L3320J38134
9476C70576N4164j53092n4220K54317M7327J31986m04680n44784p6680J46970
$$ plain form
9466 -228116 -215295 -372728 -316686 -108899 -321042 -135989 -115454 -83392 225130 105977
9456 105977 -69716 -82586 -201528 -158814 -261756 59378 232939 182027 72497 115305
9446 115305 88535 184235 392943 279038 253157 103908 119899 198581 223655 201721 81748
9435 81748 181246 35090 -211760 -228287 -234831 -281065 -63883 241267 537883 442956 106097
9424 106097 -110795 -132855 -87612 -34897 87647 -1126 34162 196832 361858 308217 490252
9413 490252 385881 103766 118285 311962 353561 184714 221565 270305 135144 645
9403 645 13961 19282 46401 58597 128089 39961 -256207 -582765 -441412 -324480 -225744 -206277
9391 -206277 -214101 -19349 -66460 -518718 -403665 -240308 -305015 -297794 -313629 -243096 -19811
$$ packed form
9466b28116J2821j57433N6042K07787k12143J85053K0535L2062L08522j19153
9456A05977j75693j2870j18942M2714j02942L21134J73561n0912j09530M2808
9446A15305k6770R5700K08708j13905k5881j49249J5991P8682K5074k1934j19973
9435H1748R9498j46156k46850j6527o544m6234K17182L05150K96616r4927l36859
9424A06097k16892k2060M5243N2715J22544q8773L5288J62670J65026n3641J82035
9413D90252j04371k82115J4519J93677M1599j68847L6851M8740j35161j34499
9403F45J3316N321K7119J2196O9492q8128k96168l26558J41353J16932R8736J9467
9391b06277p824J94752m7111m52258J15053J63357o4707P221j5835P0533K23285
$$ plain form
9380 -19811 -158104 -365384 -470224 -198835 201667 88267 168548 42065 -115366 -100877
9370 -100877 -31773 96144 147472 -36959 21804 -31387 144043 245571 311696 51199 275809
9359 275809 448143 178300 -83757 -229805 84136 168263 246252 139596 104823 145066
9349 145066 -28647 -136131 -152507 -128923 -38071 -260988 -313375 -275747 -31997 189313 244117
9338 244117 206996 126168 318154 196859 -167932 -657506 -520028 -174368 -182183 -155197 -102144
9327 -102144 -83218 -180382 -154639 80539 34220 -248586 -112525 259382 370693 215031
9317 215031 363996 731336 893939 1147553 952543 418257 -115187 -414257 -570026 -701175
9307 -701175 -616260 -589826 -399780 -279960 -277813 -371285 -245787 -179229 -148786 46370 88890
$$ packed form
9380a9811j38293k07280j04840K71389M00502j13400Q0281j26483j57431J4489
9370a00877O9104J27917N1328j84431N8763n3191J75430J01528O6125k60497K24610
9359B75809J72334k69843k62057j46048L13941Q4127P7989j06656l4773M0243
9349A45066j73713j07484j6376K3584R0852k22917n2387L7628K43750K21310N4804
9338B44117l7121q0828J91986j21295l64791m89574J37478L45660p815K6986N3053
9327a02144J8926r7164K5743K35178m6319k82806J36061L71907J11311j55662
9317B15031J48965L67340J62603K53614j95010n34286n33444k99070j55769j31149
9307g01175Q4915K6434J90046J19820K147r3472J25498O6558L0443J95156M2520
$$ plain form
9296 88890 280244 171957 345026 277054 201706 31294 -81608 110056 184780 -154243
9286 -154243 -309331 -172395 17776 106498 -291154 -149644 101420 -28669 -218613 -139695
9276 -139695 56577 157048 171443 252160 71185 95895 173873 72368 -1237 -24843 -179837
9265 -179837 -182685 -89081 -181449 -188196 43451 266990 237327 103915 45098 203837 186482
9254 186482 -33294 -117894 385407 544097 390017 -56909 -213448 226425 341372 158307
9244 158307 8222 8385 -40916 -92211 -208814 -581045 -764674 -523352 -70315 511040 288965
9233 288965 -61877 -336648 -241532 122399 262300 345498 281906 117301 -18837 -128896
9223 -128896 -57040 -190259 -203126 -135625 -116923 136636 401336 282538 153317 -12388
$$ packed form
9296H8890J91354j08287J73069o7972p5348j70412j12902J91664P4724l39023
9286a54243j55088J36936J90171Q8722l97652J41510K51064j30089j89944P8918
9276a39695J96272J00471J4395Q0717j80975K4710P7978j01505p3605k3606j54994
9265a79837k848R3604r2368o747K31647K23539k9663j33412n8817J58739j7355
9254A86482k19776q4600N03301J58690j54080m46926j56539M39873J14947j83065
9244A58307j50085J63m9301n1295j16603l72231j83629K41322M53037N81355k22075
9233B88965l50842k74771R5116L63931J39901Q3198o3592j64605j36138j10059
9223a28896P1856j33219j2867O7501J8702K53559K64700j18798j29221j65705
$$ plain form
9213 -12388 -74108 139136 -2072 -197997 -208469 144690 23570 -147715 -185067 -8752
9203 -8752 46571 -35358 -27653 -328554 -340169 -149640 -97820 -105473 -83602 -226842 -290867 -444656
9191 -444656 -356993 -212401 152725 285081 238082 135167 52019 -64246 -135154 -150954 -323578
9180 -323578 -241846 -97903 -54840 -154181 -221668 -586711 -661787 -294583 -215027 -55678 -8785
9169 -8785 -82931 -12592 -82562 -394856 -553426 -293082 -530071 -703953 -579599 -375498 -175626
9158 -175626 -97725 -4635 133554 92247 21125 -86619 -302730 -259482 -185060 -208444 -85104
9147 -85104 161748 102205 198410 26304 -131755 -85546 -256133 -544066 -447733 -89577 140685
9136 140685 26221 -85481 -136384 -142223 -120524 -128124 -129810 -266473 -248378 -172930 -32734
$$ packed form
9213a2388o1720K13244j41208j95925j0472L53159j21120j71285l7352J76315
9203h752N5323q1929P705l00901j1615J90529N1820p653K1871j43240o4025j53789
9191d44656Q7663J44592L65126J32356m6999j02915q3148j16265p0908j5800j72624
9180c23578Q1732J43943M3063r9341o7487l65043p5076L67204P9556J59349M6893
9169h785p4146P0339o9970l12294j58570K60344k36989j73882J24354K04101J99872
9158a75626P7901R3090J38189m1307p1122j07744k16111M3248P4422k3384J23340
9147h5104K46852n9543R6205j72106j58059M6209j70587k87933R6333L58156K30262
9136A40685j14464j11702n0903n839K1699p600j686j36663J8095P5448J40196
$$ plain form
9125 -32734 72718 243540 105902 244317 130741 -7484 60538 -79499 -291038 -414067
9115 -414067 -253146 -21500 64134 105344 29500 19544 10650 -11386 -163715 82302 263196
9104 263196 434553 82492 -8274 -119707 -128965 -59320 -115157 16514 199448 278637 67078
9093 67078 -241414 -528755 -255689 26008 160628 190563 350758 126312 47304 148887
9083 148887 164533 155487 196877 -77653 -110376 -123790 83283 361939 524746 565575 247593
9072 247593 228955 136297 56925 42450 -212610 -176872 102338 106776 33472 261303 496522
9061 496522 435629 406273 88450 177219 9838 -25186 -21887 202189 239474 514761 435526
9050 435526 357026 230148 -131338 -257337 49297 -312997 -619353 -503063 -317175 -82795
$$ packed form
9125c2734J05452J70822j37638J38415j13576j38225O8022j40037k11539j23029
9115d14067J60921K31646Q5634M1210p5844r956q894k2036j52329K46017J80894
9104B63196J71357l52061r0766j11433r258O9645n5837J31671J82934P9189k11559
9093F7078l08492k87341K73066K81697J34620K9935J60195k24446p9008J01583
9083A48887J5646r046M1390k74530l2723j3414K07073K78656J62807M0829l17982
9072B47593j8638r2658p9372j4475k55060L5738K79210M438p3304K27831K35219
9061D96522o0893k9356l17823Q8769j67381l5024L299K24076L7285K75287p9235
9050D35526p8500j26878l61486j25999L06634l62294l06356J16290J85888K34380
$$ plain form
9040 -82795 -40176 73272 136957 -148837 -144376 -367880 -101063 265474 182639 13621 49281
9029 49281 164035 228834 -22469 -72511 4318 -109839 -96212 -282334 -425114 -389676 -377797
9018 -377797 -449166 -111460 176432 160881 145173 120067 501088 526578 282798 137787 -24014
9007 -24014 -194899 -234551 276411 511057 453990 377589 171610 -72553 -73886 -220796 -304206
8996 -304206 -427369 -290668 -222052 29556 419 89619 212024 125882 67619 -64367 -155816
8985 -155816 -54245 -22267 33148 193721 71688 33091 107867 108715 37040 -8495 -201917
8974 -201917 -139423 -80600 248320 237391 -184154 -55387 -144614 -303080 -124268 92235
8964 92235 384652 431644 259550 -7230 -139402 -17318 183750 234629 185798 118224 -98632
$$ packed form
9040h2795M2619J13448O3685k85794M461k23504K66817L66537q2835j69018L5660
9029D9281J14754O4799k51303n0042P6829j14157J3627j86122j42780L5438J1879
9018c77797p1369L37706K87892j5551j5708k5106L81021K5490k43780j45011j61801
9007b4014j70885l9652N10962K34646n7067p6401k05979k44163j333j46910q3410
8996c04206j23163J36701O8616K51608k9137Q9200J22405q6142n8263j31986r1449
8985a55816J01571L1978N5415J60573j22033l8597P4776Q48p1675m5535j93422
8974b01917O2494N8823L28920j0929m21545J28767q9227j58466J78812K16503
8964I2235K92417M6992j72094k66780j32172J22084K01068N0879m8831o7574k16856
$$ plain form
8953 -98632 -293309 -123599 107944 8794 -93394 -157518 -462962 -569876 -295691 -67539
8943 -67539 223301 123492 -36950 185869 72711 251016 324977 118365 -38793 67346
8933 67346 49788 -255830 -421194 -67242 194678 -44071 -360253 -339686 95744 278540
8923 278540 279859 181617 -198899 -281190 -206039 -23468 67322 -156417 -322732 -389010 -256251
8912 -256251 -109480 -281928 -387990 -306053 -273383 -461592 -702380 -438810 -343603 69353
8902 69353 77088 -127300 141574 -8522 -132716 -303415 -377134 -431832 -384515 -449929 -82391
8891 -82391 171411 358251 461265 164910 87928 359532 122524 44538 234225 131201
8881 131201 272280 291883 157348 144472 87399 87707 196940 -15895 -307583 -395716 -182688
$$ packed form
8953i8632j94677J69710K31543r9150j02188o4124l05444j06914K74185K28152
8943f7539K90840r9809j60442K22819j13158J78305P3961k06612j57158J06139
8933F7346j7558l05618j65364L53952K61920k38749l16182K0567M35430J82796
8923B78540J319r8242l80516q2291P5151J82571R0790k23739j66315o6278J32759
8912b56251J46771j72448j06062Q1937L2670j88209k40788K63570R5207M12956
8902F9353P735k04388K68874j50096j24194j70699p3719n4698M7317o5414L67538
8891h2391K53802J86840J03014k96355p6982K71604k37008p7986J89687j03024
8881A31201J41079J9603j34535j2876n7073L08J09233k12835k91688q8133K13028
$$ plain form
8870 -182688 28965 -63323 -250607 -330408 -988 47387 16841 113552 246174 277201 35477
8859 35477 -300723 -281098 135665 221438 163407 184423 190918 115652 -108765 -224437 -162698
8848 -162698 -160433 56434 346044 434117 415798 558420 602179 365366 148059 -12981 -212584
8837 -212584 -404048 -311793 -128618 -35585 -67735 -38602 -185677 -298785 -204882 -122078 71280
8826 71280 333404 507866 406072 97020 295373 351783 -43312 -386735 -29793 28193
8816 28193 -274531 -275607 -259155 -328840 -336122 -470516 -604069 -585189 -588631 -610449 -293412 -27353
8804 -27353 63457 72653 295522 149199 91918 -59085 10078 -106752 8867 21460 -55815
8793 -55815 224966 476532 272876 196092 86359 87473 12749 101339 -36463 -71124 14564
$$ packed form
8870a82688K11653r2288j87284p9801L29420M8375l0546R6711J32622L1027k41724
8859C5477l36200J9625M16763Q5773n8031K1016O495p5266k24417j15672O1739
8848a62698K265K16867K89610Q8073j8319J42622M3759k36813k17307j61040j99603
8837b12584j91464R2255J83175R3033l2150K9133j47075j13108R3903Q2804J93358
8826G1280K62124J74462j01794l09052J98353N6410l95095l43423L56942N7986
8816B8193l02724j076J6452o9685p282j34394j33553J8880l442k1818L17037K66059
8804b7353R0810R196K22869j46323n7281j51003O9163j16830J15619J2593p7275
8793e5815K80781K51566k03656p6784j09733J114p4724Q8590j37802l4661Q5688
$$ plain form
8782 14564 107272 114960 333246 354644 353233 462140 411230 -34849 -346603 -176360 81189
8771 81189 -26196 -126213 30513 168933 401135 495684 463773 488139 393549 98551 -379797
8760 -379797 -738602 -700479 -524342 -466686 -298651 -355970 -344438 -315655 -29175 135740 -51637
8749 -51637 -235707 -177630 -25527 207070 176797 116497 92891 38484 34886 -93135 -392827
8738 -392827 -514611 -500840 -183633 16977 223483 362988 257978 250029 191438 -159600
8728 -159600 -370275 -344288 154863 279291 197564 287609 324751 79908 -250750 -399346
8718 -399346 -538255 -355492 54031 286655 385977 442352 281317 37642 -77191 -110659
8708 -110659 197779 368396 82595 16317 148945 -96897 -250199 -223757 -245361 -22713
$$ packed form
8782A4564R2708P688K18286K1398j411J08907n0910m46079l11754J70243K57549
8771H1189j07385j00017J56726J38420K32202R4549l1911K4366r4590k94998m78348
8760c79797l58805L8123J76137N7656J68035n7319J1532K8783K86480J64915j87377
8749e1637j84070N8077J52103K32597l0273o0300k3606n4407l598j28021k99692
8738c92827j21784J3771L17207K00610K06506J39505j05010p949n8591l51038
8728a59600k10675K5987M99151J24428q1727R0045L7142k44843l30658j48596
8718c99346j38909J82763M09523K32624R9322N6375j61035k43675j14833l3468
8708a10659L08438J70617k85801o6278J32628k45842j53302K6442k1604K22648
$$ plain form
8698 -22713 -43512 -139924 2141 -73845 117981 294746 319962 729503 952198 492350 340157
8687 340157 360750 316344 265101 -14536 -32628 169662 39443 -71609 -344584 -64902
8677 -64902 187874 23967 292048 336846 333627 371767 44703 -199240 61416 -48719 -98256
8666 -98256 -309548 -441448 -186409 126217 -132469 -362299 -243173 -94364 -241429 -208374
8656 -208374 -347129 -393058 -353107 -32140 -64328 -207644 154436 487605 162908 81812
8646 81812 116448 204432 200074 233787 18681 143661 234785 -63799 -11606 142034 75636
8635 75636 140792 332703 357392 266899 339093 370403 25758 56200 1961 -225753 -250089
8624 -250089 -131027 -40860 -128188 138904 102634 -181063 -196141 114393 72506 -161264 -138310
$$ packed form
8698b2713k0799r6412J42065p5986J91826J76765K5216M09541K22695m59848j52193
8687C40157K0593m4406n1243k79637j8092K02290j30219j11052k72975K79682
8677f4902K52776j63907K68081M4798l219L8140l27064k43943K60656j10135m9537
8666i8256k11292j31900K55039L12626k58686k29830J19126J48809j47065L3055
8656b08374j38755m5929L9951L20967l2188j43316L62080L33169l24697q1096
8646H1812L4636Q7984m358L3713k15106J24980R1124k98584N2193J53640o6398
8635G5636O5156J91911K4689r0493P2194L1310l44645L0442n4239k27714k4336
8624b50089J19062R0167q7328K67092l6270k83697j5078L10534m1887k33770K2954
$$ plain form
8613 -138310 -196607 -435284 -544665 -407910 -257209 -257882 -291107 -246202 -34330 -470029 -458676
8602 -458676 -301717 -105262 19352 -3594 -154120 -278366 -520709 -686320 -526402 -397078
8592 -397078 -205815 -63239 44950 38722 65433 256778 192494 -5622 -169957 -152555 -106027
8581 -106027 -49221 145929 393056 295856 -180574 -454078 -112730 139045 277189 422224
8571 422224 435208 410479 -35598 -363772 -303566 -298750 -462301 -267220 -89006 196307 316859
8560 316859 645493 640083 571701 175198 175120 67703 19569 49038 94460 -78912 -195069
8549 -195069 -23415 16703 548661 545126 623815 336866 200826 -187743 -46327 10514 -113291
8538 -113291 -150870 -236822 -130388 -95256 -251663 -207933 -50580 -159116 29423 129446
$$ packed form
8613a38310n8297k38677j09381J36755J50701o73l3225M4905K11872m35699J1353
8602d58676J56959J96455J24614k2946j50526j24246k42343j65611J59918J29324
8592c97078J91263J42576J08189o228K6711J91345o4284j98116j64335J7402M6528
8581a06027N6806J95150K47127r7200m76430k73504L41348K51775J38144J45035
8571D22224J2984k4729m46077l28174O0206M816j63551J95081J78214K85313J20552
8560C16859L28634n410o8382l96503p8j07417m8134K9469M5422j73372j16157
8549a95069J71654M0118N31958l535P8689k86949j36040l88569J41416N6841j23805
8538a13291l7579q5952J06434L5132j56407M3730J57353j08536J88539J00023
$$ plain form
8528 129446 -14010 -288053 -310900 -198605 -275024 -91895 143717 150665 33623 -261648
8518 -261648 -507813 -481975 -152670 114631 -210430 -206012 -27542 19948 272961 231591 208781
8507 208781 136448 164036 242064 331938 171995 218547 331022 212727 275854 328700 105526
8496 105526 -313169 -66354 336591 424767 289138 144523 -54160 25347 203282 153982
8486 153982 120844 -72417 -128987 -150392 -19621 37335 -182957 -308274 -350041 -388686 -314057
8475 -314057 -131554 39897 137741 -2948 96661 -21705 -193085 -412485 -654297 -509380
8465 -509380 -321324 -298948 -282753 -379785 -388884 -189473 -51704 131277 118642 -1295 -194051
8454 -194051 -8348 161836 -103464 -91957 326063 704554 877175 724247 457308 370352
$$ packed form
8528A29446j43456k74043k2847J12295p6419J83129K35612O948j17042k95271
8518b61648k46165K5838L29305K67301l25061M418J78470M7490K53013m1370k2810
8507B08781p2333K7588P8028Q9874j59943M6552J12475j18295O3127N2846k23174
8496A05526m18695K46815M02945Q8176j35629j44615j98683P9507J77935m9300
8486A53982l3138j93261n6570k1405J30771N6956k20292j25317m1767l8645P4629
8475c14057J82503J71451R7844j40689R9609j18366j71380k19400k41812J44917
8465e09380J88056K2376J6195r7032r099J99411J37769J82981j2635j19937j92756
8454a94051J85703J70184k65300J1507M18020L78491J72621j52928k66939q6956
$$ plain form
8444 370352 430212 522195 711433 672678 716177 669121 632105 352631 239218 -19476 195387
8433 195387 265142 245324 162310 149167 177620 116461 118920 292634 482721 317226 46269
8422 46269 -121163 -217309 -5893 -40578 163106 100726 211758 315735 252945 172612 -105716
8411 -105716 -187028 -123371 93196 53428 200906 24257 -27692 179069 417206 330458 -77065
8400 -77065 -186524 -93221 -209289 -349219 -208903 -146075 -17646 169100 395237 614732
8390 614732 175925 -122524 -168619 -145923 -236939 -207388 -27854 36920 7490 -21613 -115068
8379 -115068 -425942 -493901 -16129 340887 357716 405030 148980 -136784 -124526 -283457
8369 -283457 -413075 -487318 -345979 -153409 73495 -5241 -248174 -316459 -320546 -551175 -399973
$$ packed form
8444C70352N9860R1983J89238l8755M3499m7056l7016k79474j13413k58694K14863
8433A95387O9755j9818q3014j3143K8453o1159K459J73714J90087j65495k70957
8422D6269j67432r6146K11416l4685K03684o2380J11032J03977o2790q0333k78328
8411a05716q1312O3657K16567l9768J47478j76649n1949K06761K38137q6748m07523
8400g7065j09459R3303j16068j39930J40316O2828J28429J86746K26137K19495
8390F14732m38807k98449m6095K2696r1016K9551J79534O4774k9430k9103r3455
8379a15068l10874o7959M77772L57016J6829M7314k56050k85764J2258j58931
8369b83457j29618p4243J41339J92570K26904p8736k42933o8285m087k30629J51202
$$ plain form
8358 -399973 -424539 -519588 -554754 -264246 -160485 -235161 -209944 -62836 14699 137298 591362
8347 591362 695907 592012 383936 405798 575555 254120 178276 267788 150812 81624
8337 81624 29935 176045 235835 28236 -247998 -243598 -219861 -53561 -15791 -209489 -360801
8326 -360801 -272915 -267647 -305847 -77346 90913 -6610 -247423 -224271 -360266 -381101 -334589
8315 -334589 -240852 -122683 -239633 -300304 -303883 21898 65648 154539 194200 236272 274785
8304 274785 436119 605293 514680 359549 385222 436268 257375 -176466 -257302 -86983
8294 -86983 24533 192494 244485 200247 532516 448587 65517 -217766 -531708 -658301
8284 -658301 -350072 198824 409185 252325 327602 154512 196672 -57455 -270835 -108145
$$ packed form
8358c99973k4566r5049l5166K90508J03761p4676K5217J47108P7535J22599M54064
8347E91362J04545j03895k08076K1862J69757l21435p5844Q9512j16976o9188
8337H1624n1689J46110N9790k07599k76234M400K3737J66300L7770j93698j51312
8326c60801Q7886N268l8200K28501J68259r7523k40813K3152j35995k0835M6512
8315c34589R3737J18169j16950o0671l579L25781M3750Q8891L9661M2072L8513
8304B74785J61334J69174r0613j55131K5673N1046j78893m33841q0836J70319
8294h6983J11516J67961N1991m4238L32269q3929l83070k83283l13942j26593
8284f58301L08229N48896K10361j56860P5277j73090M2160k54127k13380J62690
$$ plain form
8274 -108145 -215167 -248648 -305294 -273369 -78853 -268152 -322311 -289511 -247858 -263599 -476017
8263 -476017 -325197 -482387 -349268 -293542 -355950 -37110 -113848 -343113 -98393 253352
8253 253352 183880 36672 -109534 24795 241576 210606 169442 56617 -146814 -100810
8243 -100810 -31466 -72715 -102824 -183875 128728 307977 158753 -215958 -147205 -44768 -101449
8232 -101449 -208488 -354974 -384262 -334760 -360063 -449629 -533417 -314099 100333 175154 -246822
8221 -246822 -435827 -165620 176091 131868 53267 -118320 -88653 91562 53014 -256591
8211 -256591 -206789 114560 358923 180497 -52278 -77818 24845 41778 110938 306317
8201 306317 -60747 -183983 55543 139947 155914 -120635 -200917 -39585 -26477 81633
$$ packed form
8274a08145j07022l3481n6646L1925J94516j89299n4159L2800M1653j5741k12418
8263d76017J50820j57190J33119N5726o2408L18840p6738k29265K44720L51745
8253B53352o9472j47208j46206J34329K16781l0970m1164j12825k03431M6004
8243a00810O9344m1249l0109q1051L12603J79249j49224l74711O8753J02437n6681
8232a01449j07039j46486k9288M9502k5303q9566q3788K19318M14432P4821m21976
8221b46822j89005K70207L41711m4223p8601j71587K9667J80215l8548l09605
8211b56591M9802L21349K44363j78426k32775k5540J02663J6933O9160J95379
8201C06317l67064j23236K39526Q4404J5967k76549q0282J61332J3108J08110
$$ plain form
8191 81633 -83045 -199741 -304529 -318219 -359408 -330337 -158135 -65526 -200044 -91906 -93468
8180 -93468 -235120 -334963 -372886 -154695 -77886 -111006 -38129 80066 147090 28455 64625
8169 64625 159675 126631 162568 132654 241576 112259 -201517 -549137 -342047 -133189 58560
8158 58560 61288 92326 -113115 -576805 -615623 -419576 -157876 35065 -13523 -219235 58531
8147 58531 220097 247733 343541 515172 228339 308045 129158 89684 246335 247719 85441
8136 85441 -57319 -82518 -110796 -63933 139224 20725 83891 338376 533811 368109 -150876
8125 -150876 -238369 23006 356606 181693 221641 4774 -213284 -168314 -174493 -290468 -136265
8114 -136265 190245 295805 10829 160696 180888 -98136 -142334 -142950 -157180 -285989 -433939
$$ packed form
8191H1633j64678j16696j04788j3690m1189K9071J72202R2609j34518J08138j562
8180i3468j41652r9843l7923K18191P6809l3120P2877J18195O7024j18635L6170
8169F4625R5050l3044L5937k9914J08922j29317l13776l47620K07090K08858J91749
8158E8560K728L1038k05441m63690l8818J96047K61700J92941m8588k05712K77766
8147E8531J61566K7636R5808J71631k86833P9706j78887l9474J56651J384j62278
8136H5441j42760k5199k8278M6863K03157j18499O3166K54485J95435j65702n18985
8125a50876q7493K61375L33600j74913L9948k16867k18058M4970o179j15975J54203
8114a36265L26510J05560k84976J49867K0192k79024m4198o16j4230j28809j47950
$$ plain form
8103 -433939 -404269 -285852 -167725 90195 106292 125301 -217606 -208941 -369371 -309428 -68272
8092 -68272 -120364 -86545 194357 71168 31220 -7081 82237 131800 -41468 -403966 -533122
8081 -533122 -215032 180447 224462 155972 -201425 -154841 -49183 73549 120662 36611 -114615
8070 -114615 60194 -177286 -75679 229936 313261 432838 244533 198246 152673 83748
8060 83748 -162364 -90288 -105922 79374 116020 -295999 -745490 -514729 17176 137090
8050 137090 134608 -128034 -24619 -17910 -145 90693 119661 -128053 -416470 -500549 -352041
8039 -352041 -205026 -28315 5805 -25008 155206 98501 112646 27582 211721 -5812 -79979
8028 -79979 277816 264048 163069 223264 -67222 -253532 -164511 -31508 29576 -170975 -344061
$$ packed form
8103d33939K9670J18417J18127K57920J6097J9009l42907Q665j60430N9943K41156
8092f8272n2092L3819K80902j23189l9948l8301Q9318M9563j73268l62498j29156
8081e33122L18090L95479M4015o8490l57397M6584J05658J22732M7113q4051j51226
8070a14615J74809k37480J01607L05615Q3325J19577j88305m6287m5573o8925
8060H3748k46112P2076j5634J85296L6646m12019m49491K30761N31905J19914
8050A37090k482k62642J03415O709J7765R0838K8968k47714k88417q4079J48508
8039c52041J47015J76711L4120l0813J80214n6705J4145q5064J84139k17533p4167
8028g9979L57795j3768j00979O0195k90486j86310Q9021J33003O1084k00551j73086
$$ plain form
8017 -344061 -152072 -103722 -99737 -87085 -156960 -110983 62756 158660 80323 -22553 -17385
8006 -17385 -232906 -333432 -359986 -441339 -424483 -284477 -46648 -191025 -378371 -434630 -405004
7995 -405004 -490263 -298887 -214442 -387183 -472907 -361301 -176148 40948 232911 61795
7985 61795 129188 506017 830850 656875 405546 63507 -82833 -128885 -203857 -267697 -110286
7974 -110286 -169341 -187606 -55996 -3337 209800 193889 171578 97843 21329 -151957 -69925
7963 -69925 -43089 86602 165870 30401 -232824 -335745 -260714 -204296 -146144 -216153 -247329
7952 -247329 -200895 -101116 -21623 42834 90456 -98774 -98350 -173892 -112851 -55822 -322431 -388979
7940 -388979 -471008 -384867 -292084 -147077 -175786 -193302 -287134 -185351 61982 285657 272153
$$ packed form
8017c44061J91989M8350L985J2652o9875M5977J73739R5904p8337j02876N168
8006a7385k15521j00526k6554q1353J6856J40006K37829j44377j87346n6259K9626
7995d05004q5259J91376Q4445j72741q5724J11606J85153K17096J91963j71116
7985F1795O7393L76829L24833j73975k51329l42039j46340m6052p4972o3840J57411
7974a10286n9055j8265J31610N2659K13137j5911k2311p3735p6514j73286Q2032
7963f9925K6836J29691P9268j35469k63225j02921P5031N6418N8152p0009l1176
7952b47329M6434R9779P9493O4457M7622j89230M24p5542O1041N7029k66609o6548
7940c88979q2029Q6141R2783J45007k8709j7516r3832J01783K47333K23675j3504
$$ plain form
7929 272153 272885 -3841 -207333 -139214 2087 177422 17722 -162658 -258117 -167713 -88923
7918 -88923 48407 181048 305814 142005 46602 36242 -206083 -465224 -440251 -249409
7908 -249409 -213036 -213928 -114614 -237153 -433478 -305255 -20537 30794 34363 221397 2065
7897 2065 -240527 -220439 117493 97551 -170137 -267517 -527724 -502411 -332256 -212217 -58201
7886 -58201 -46309 -6584 60675 42110 -79525 -38476 -99164 -177441 -232329 -255727 -178935 -152152
7874 -152152 -200830 -239891 -275892 -196989 -127528 -195746 -205594 -63943 -21099 258811 358511
7863 358511 157100 243349 258483 20404 -56153 -181744 -308842 -424995 -615151 -565046
7853 -565046 -326861 24989 91123 87956 194440 85978 -193395 -268186 99226 384741
$$ packed form
7929B72153P32k76726k03492O8119J41301J75335j59700j80380r5459R0404P8790
7918h8923J37330J32641J24766j63809r5403j0360k42325k59141K4973J90842
7908b49409L6373q92R9314j22539j96325J28223K84718N1331L569J87034k19332
7897B065k42592K0088L37932j9942k67688r7380k60207K5313J70155J20039J54016
7886e8201J1892L9725O7259j8565j21635M1049o0688p8277n4888k3398P6792K6783
7874a52152m8678l9061l6001P8903O9461o8218r848J41651M2844K79910R9700
7863C58511k01411Q6249J5134k38079p6557j25591j27098j16153j90156N0105
7853e65046K38185L51850O6134l167J06484j08462k79373p4791L67412K85515
$$ plain form
7843 384741 463813 373645 334722 -93950 -300025 -215877 -278884 -88882 69621 296456 297034
7832 297034 506172 606887 457723 118196 106486 60386 -213192 -313153 -159366 -278589
7822 -278589 -266308 -159762 90036 282169 180395 19764 -153175 -192765 31697 108149
7812 108149 -2704 87432 45032 158517 428275 400363 314540 223580 -211501 -285039 -70745
7801 -70745 50671 99703 -32641 -117715 -112064 -156579 -328827 -508197 -511603 -467274 -85680
7790 -85680 169507 110073 -68641 22197 1285 -77268 -318429 -585314 -552636 -590466 -565789
7779 -565789 -366346 -238122 -80952 -137905 -297659 -144793 3134 36937 -195852 -160041
7769 -160041 -46768 73754 -12965 -46578 -1403 158765 210101 121443 58968 -249041 -429931
$$ packed form
7843C84741P9072r0168l8923m28672k06075Q4148o3007J90002J58503K26835N78
7832B97034K09138J00715j49164l39527j1710m6100k73578r9961J53787j19223
7822b78589J2281J06546K49798J92133j01774j60631j72939l9590K24462P6452
7812A08149j10853R0136m2400J13485K69758k7912q5823r0960m35081p3538K14294
7801g0745J21416M9032j32344q5074N651m4515j72248j79370l406M4329L81594
7790h5680K55187n9434j78714R0838k0912p8553k41161k66885L2678l7830K4677
7779e65789J99443J28224J57170n6953j59754J52866J47927L3803k32789L5811
7769a60041J13273J20522q6719l3613M5175J60168N1336q8658o2475l08009j80890
$$ plain form
7758 -429931 -402489 -406086 -477931 -485701 -269578 165158 263920 198961 126153 -103756 -94392 -137341
7746 -137341 -307480 -426859 -164353 34577 -73208 -464750 -485085 -109988 27518 -159811
7736 -159811 -52309 -48026 -50458 73775 32869 237891 136323 -42445 -10794 -152052 -205805
7725 -205805 175541 249887 196360 115690 -48383 -241486 -55609 -53526 -268278 -354865 -560002
7714 -560002 -488912 -358991 -42078 248503 405006 413552 187914 74175 -176558 -216452
7704 -216452 -408678 -513428 -586272 -384534 -512838 -305159 115003 345392 161345 71025
7694 71025 -425954 -687842 -370230 -292128 -363602 -190986 -101258 166934 -141411 -425078
7684 -425078 -314712 -83376 30756 -4888 130761 181588 11035 -124505 -206572 -501642
$$ packed form
7758d29931K7442l597p1845p770K16123M34736R8762o4959p2808k29909R364m2949
7746a37341j70139j19379K62506J98930j07785l91542k0335L75097J37506j87329
7736a59811J07502M283k432J24233m0906K05022j01568j78768L1651j41258n3753
7725b05805L81346P4346n3527q0670j64073j93103J85877K083k14752q6587k05137
7714e60002P1090J29921L16913K90581J56503Q546k25638j13739k50733l9894
7704b16452j92226j04750p2844K01738j28304K07679M20162K30389j84047r0320
7694G1025m96979k61888L17612P8102p1474J72616Q9728K68192l08345k83667
7684d25078J10366K31336J14132l5644J35649N0827j70553j35540q2067k95070
$$ plain form
7674 -501642 -932732 -1049149 -889719 -586044 -433036 -305656 71319 167048 220444 485445
7664 485445 443690 138218 146885 137566 160539 129091 87989 -154081 -274479 -269095 -311508 -132468
7652 -132468 -11192 -18442 -91147 -8761 12198 20779 37502 -96545 110277 31092 -275639
7641 -275639 -560750 -156245 178699 -62168 -201362 -16306 376225 337008 -69654 5781
7631 5781 102037 168850 27413 -175750 -141547 -237459 -98517 162488 279076 254682 59767
7620 59767 -182562 -241820 -451582 -564457 -542946 -478586 -277141 -285659 -435960 -737022 -671237
7609 -671237 -567839 -413612 -281208 33364 -100546 -131293 -159018 -113209 70377 22134
7599 22134 -116895 -454766 -389724 -454577 -330024 109771 113595 -158229 -199233 -125110 -103902
$$ packed form
7674e01642m31090j16417J59430L03675J53008J27380L76975R5729N3396K65001
7664D85445m1755l05472Q667r319K2973l1448m1102k42070j20398N384m2413J79040
7652a32468J21276p250p2705Q2386K0959Q581J6723j34047K06822p9185l06731
7641b75639k85111M04505L34944k40867j39194J85056L92531l9217m06662P5435
7631E781R6256O6813j41437k03163L4203r5912J38942K61005J16588k4394j94915
7620E9767k42329n9258k09762j12875K1511O4360K01445q518j50301l01062O5785
7609f71237J03398J54227J32404L14572j33910l0747k7725M5809J83586m8243
7599B2134j39029l37871O5042o4853J24553M39795L824k71824m1004P4123K1208
$$ plain form
7588 -103902 8616 -26264 -303086 -89077 4912 -251426 -142435 29826 105886 244660
7578 244660 243592 381589 227066 -123286 -369472 -267801 -184488 -657 124669 -24296
7568 -24296 -529867 -653579 -123027 305612 103979 -365972 -428124 -263567 -190470 -110847
7558 -110847 -174796 -171034 -89321 47578 42115 -93010 37861 -108815 -76234 92211 205066
7547 205066 278768 -132558 -334212 -124323 5063 -202430 -216206 -223944 -330088 -191892
7537 -191892 120771 -119475 -243261 -166587 -156441 -373513 -277825 -26913 305360 261083
7527 261083 313350 56077 -380566 -519763 -226331 -60416 333 -206412 -191383 -143914
7517 -143914 -462473 -470956 -374120 -402076 -356968 -568122 -726866 -511212 -205683 139563 131709
$$ packed form
7588a03902J12518l4880k76822K14009R3989k56338J08991J72261P6060J38774
7578B44660j068J37997j54523l50352k46186J01671Q3313J83831J25326j48965
7568b4296n05571j23712N30552M28639k01633m69951o2152J64557P3097P9623
7558a10847o3949L762Q1713J36899n463j35125J30871j46676L2581J68445J12855
7547B05066P3702m11326k01654K09889J29386k07493j3776p738j06144J38196
7537a91892L12663k40246j23786P6674J0146k17072R5688K50912L32273m4277
7527B61083N2267k57273m36643j39197K93432J65915O0749k06745J5029M7469
7517a43914l18559q483R6836k7956M5108k11154j58744K15654L05529L45246p854
$$ plain form
7506 131709 37599 159754 223803 283379 212065 -248314 -309212 -114538 -323596 -350113 -345577
7495 -345577 -76631 119639 -101805 -218280 -120077 -264804 -407257 -469775 -121637 223652
7485 223652 61350 -155916 -122132 180977 381670 193352 160194 132650 -165967 -114013
7475 -114013 215107 478503 422492 33800 -220681 -320419 -436410 -465919 -476484 -269545
7465 -269545 -65167 -31163 -286162 -521076 -490035 -284292 -160836 -313742 -384142 -171721
7455 -171721 -11463 -29510 83381 144212 173067 133943 244679 200446 33930 -154871 346593
7444 346593 334601 99824 -108358 -18431 9100 -111617 -101186 -126078 127983 84973 -387601
7433 -387601 -307563 -152376 -217942 -148099 -26526 -179997 -72749 -33753 -247518 -392935
$$ packed form
7506A31709r4110J22155O4049N9576p1314m60379o0898J94674k09058k6517M536
7495c45577K68946J96270k21444j16475R8203j44727j42453o2518L48138L45289
7485B23652j62302k17266L3784L03109K00693j88318l3158k7544k98617N1954
7475a14013L29120K63396n6011l88692k54481r9738j15991k9509j0565K06939
7465b69545K04378L4004k54999k34914L1041K05743J23456j52906p0400K12421
7455a71721J60258j8047J12891O0831K8855l9124J10736m4233j66516j88801N01464
7444C46593j1992k34777k08182Q9927K7531j20717J0431k4892K54061m3010m72574
7433c87601Q0038J55187o5566O9843J21573j53471J07248L8996k13765j45417
$$ plain form
7423 -392935 -452798 -428456 -404786 -374939 -361586 -274759 -444780 -433577 -258098 -133545 -56084
7412 -56084 74808 3196 52284 -58401 -422464 -727711 -602491 -433518 -358678 -271834 -154819
7401 -154819 -144392 109355 97182 15368 -323812 -211391 -202534 -363844 -214813 29237 106766
7390 106766 -64126 -16885 448316 454418 248694 153378 -136622 -562562 -558286 -338592 -196888
7379 -196888 -504562 -795398 -747946 -741746 -610623 -437278 -91187 -263468 -692010 -814624
7369 -814624 -455543 -146953 110260 423046 400357 244217 383130 202090 -139510 -267328
7359 -267328 -277368 -421501 -304964 -238618 -216074 -88296 135117 297834 161900 123308
7349 123308 281962 217530 33958 80307 45870 -219227 -371955 -261869 19008 30422
$$ packed form
7423c92935n9863K4342K3670K9847J3353Q6827j70021J1203J75479J24553P7461
7412e6084J30892p1612M9088j10685l64063l05247J25220J68973P4840Q6844J17015
7401a54819J0427K53747j2173q1814l39180J12421Q857j61310J49031K44050P7529
7390A06766j70892M7241M65201O102k05724r5316k90000m25940M276K19694J41704
7379a96888l07674k90836M7452O200J31123J73345L46091j72281m28542j22614
7369h14624L59081L08590K57213L12786k2689j56140J38913j81040l41600j27818
7359b67328j0040j44133J16537O6346K2544J27778K23413J62717j35934l8592
7349A23308J58654o4432j83572M6349l4437k65097j52728J10086K80877J1414
$$ plain form
7339 30422 220247 172536 172917 79541 89630 140967 -7956 -200948 -124605 -97692 -197619 -171340
7327 -171340 -377532 -353489 -274832 -171779 -237601 -437988 -233893 2084 -103890 -146771
7317 -146771 -487695 -465434 -256974 -385759 -642715 -506366 -281225 -102146 -13084 12138
7307 12138 76101 224519 80112 35812 342078 270790 -47606 -464377 -514663 -378253 -81181
7296 -81181 40898 -3705 -230768 -325999 -548852 -631689 -426363 -566282 -646218 -488584 -431776
7285 -431776 -71311 131985 132086 141974 417120 66116 -171015 -335429 -442446 -115154 134760
7274 134760 192968 83371 1969 -131727 -138397 -88267 8309 245103 175037 -99093 191374
7263 191374 344572 405172 473462 269499 50580 86887 177714 234869 387304 240407 311801
$$ packed form
7339C0422J89825m7711L81r3376J0089N1337j48923j92992P6343K6913r9927K6279
7327a71340k06192K4043P8657J03053o5822k00387K04095K35977j05974m2881
7317a46771l40924K2261K08460j28785k56956J36349K25141J79079Q9062K5222
7307A2138O3963J48418j44407m4300L06266p1288l18396m16771n0286J36410K97072
7296h1181J22079m4603k27063r5231k22853q2837K05326j39919p9936J57634N6808
7285d31776L60465K03296J01R888K75146l51004k37131j64414j07017L27292K49914
7274A34760N8208j09597q1402j33696o670N0130R6576K36794p0066k74130K90467
7263A91374J53198O0600O8290k03963k18919L6307R0827N7155J52435j46897P1394
$$ plain form
7252 311801 215799 58073 -86230 -167850 -267470 -371965 -474265 -406033 -499218 -444342 -347243
7241 -347243 -329033 -251719 35271 -76594 -101071 108915 -266631 -282692 -118546 -351580
7231 -351580 -222760 -166851 -587764 -343553 -457015 -253909 -179218 -78212 -7088 -131088
7221 -131088 -189384 47905 45690 -69237 -17274 169108 -1401 -23263 89511 104661 28201
7210 28201 -156582 -175015 -137447 96493 -198377 -360501 -220645 -410907 -397813 -353719 -590748
7199 -590748 -494036 -581566 -518420 -451647 -145152 19045 -150343 -100899 -179908 -233048 -565277
7188 -565277 -719419 -554859 -764661 -647862 -253985 -125293 -283505 -422013 -464442 -477469
7178 -477469 -520187 -571457 -345980 -295525 -460979 -487206 -221734 -148532 -235598 -223827 -77466
$$ packed form
7252C11801r6002j57726j44303q1620r9620j04495j02300O8232r3185N4876R7099
7241c47243J8210P7314K86990j11865k4477K09986l75546j6061J64146k33034
7231c51580J28820N5909m20913K44211j13462K03106P4691J01006P1124j24000
7221a31088n8296K37289k215j14927N1963J86382j70509k1862J12774J5150p6460
7210B8201j84783j8433L7568K33940k94870j62124J39856j90262J3094M4094k37029
7199e90748R6712q7530O3146O6773L06495J64197j69388M9444p9009n3140l32229
7188e65277j54142J64560k09802J16799L93877J28692j58212j38508m2429j3027
7178d77469m2718n1270K25477N0455j65454k6227K65472P3202q7066J1771J46361
$$ plain form
7167 -77466 -65981 85289 271849 -9166 -267215 -79017 -20269 -284999 -684078 -553449
7157 -553449 -263768 -19812 3806 792 -240745 -272763 -279353 -398251 -234570 107083 281324
7146 281324 55958 10502 110440 -93847 -165465 48885 18556 -40354 -137577 -132879 -410084
7135 -410084 -483562 -345706 -161506 -95269 -309982 -578611 -694805 -774151 -520172 -459162
7125 -459162 15116 303430 264630 301284 250970 185138 -38552 69629 -42651 -117593 -297516
7114 -297516 -370312 -223587 -331571 -86936 -89360 -96734 -329566 -460092 -408738 -156925 -21946
7103 -21946 212353 70936 95766 255346 189428 406881 290569 -138041 -404157 -128776
7093 -128776 -28446 43739 209497 397297 173825 -192755 -220653 -221313 -90757 123301 49051
$$ packed form
7167g7466J1485J51270J86560k81015k58049J88198N8748k64730l99079J30629
7157e53449K89681K43956K3618l014k41537l2018o590j18898J63681L41653J74241
7146B81324k25366m5456R9938k04287p1618K14350l0329n8910r7223M698k77205
7135d10084p3478J37856J84200O6237k14713k68629j16194p9346K53979O1010
7125d59162M74278K88314l8800L6654n0314o5832k23690J08181j12280p4942j79923
7114b97516p2796J46725j07984K44635k424p374k32832j30526N1354K51813J34979
7103b1946K34299j41417K4830J59580o5918K17453j16312m28610k66116K75381
7093a28776J00330P2185J65758J87800k23472l66580k7898o60J30556K14058p4250
$$ plain form
7082 49051 -126805 -54614 187671 197697 298642 128012 -80050 12181 104859 -96954 88528
7071 88528 310263 416126 115649 -105652 -325954 -376167 -181453 -83465 -138710 -134505 -70261
7060 -70261 -136512 -7926 86210 415742 229249 -26493 -89616 -89033 -23434 -79318 -432262
7049 -432262 -569698 -505122 -380938 -220211 98740 199725 212112 115713 54111 -153072
7039 -153072 -275760 -441790 -355055 -123342 -263891 -296154 -138521 54843 -115646 -212202
7029 -212202 -427006 -446831 -60523 101727 -184676 -150056 117698 -92319 -326658 -223788
7019 -223788 -592677 -510456 -345387 -276180 -269353 -310677 -497986 -311612 -333076 -167424 -12514
7008 -12514 48051 177731 221043 491922 668992 684875 623663 441991 -5545 -191328 -306324
$$ packed form
7082D9051j75856P2191K42285J0026J00945j70630k08062R2231R2678k01813J85482
7071H8528K21735J05863l00477k21301k20302n0213J94714R7988n5245M205O4244
7060g0261o6251J28586R4136L29532j86493k55742o3123N83O5599n5884l52944
7049d32262j37436O4576J24184J60727L18951J00985J2387r6399o1602k07183
7039a53072j22688j66030Q6735K31713j40549l2263J57633J93364j70489r6556
7029b12202k14804j9825L86308J62250k86403L4620K67754k10017k34339J02870
7019b23788l68889Q2221J65069O9207O827m1324j87309J86374k1464J65652J54910
7008a2514O0565J29680M3312K70879J77070J5883o1212j81672m47536j85783j14996
$$ plain form
6997 -306324 -47967 4610 -26049 -33311 -143375 -20579 7873 -145971 -287733 -164949 -146569
6986 -146569 -103350 -64471 -73496 -31738 144379 341518 192626 311771 92892 -55477 -128722
6975 -128722 -50433 1138 42935 383131 440082 338043 -104056 -221909 -262369 -373762 -250815
6964 -250815 -195295 -131405 -113316 -204358 -377486 -480910 -309894 -74521 -222546 -251823 -315725
6953 -315725 -240699 -275008 -568023 -242491 -261101 -348556 -386755 -353035 -462742 -295059 -405943
6942 -405943 -392525 -449436 -471826 -355163 -424360 -498412 -567857 -801473 -793939 -461735 -393704
6931 -393704 -199538 -434920 -637874 -342055 -114565 -137317 -63236 -226602 -246400 -335814
6921 -335814 -393110 -259943 -348222 -221616 -157285 -136993 -119815 -229241 -241297 53262 164429
$$ packed form
6997c06324K58357N2577l0659p262j10064J22796K8452j53844j41762J22784J8380
6986a46569M3219L8879r025M1758J76117J97139j48892J19145k18879j48369p3245
6975a28722P8289N1571M1797L40196N6951j02039m42099j17853m0460j11393J22947
6964b50815N5520O3890J8089r1042j73128j03424J71016K35373j48025k9277o3902
6953c15725P5026l4309k93015L25532j8610q7455l8199L3720j09707J67683j10884
6942d05943J3418n6911k2390J16663o9197p4052o9445k33616P534L32204O8031
6931c93704J94166k35382k02954K95819K27490k2752P4081j63366j9798q9414
6921c35814n7296J33167q8279J26606O4331K0292J7178j09426j2056K94559J11167
$$ plain form
6910 164429 140466 -18627 -168700 -229150 -95448 -145040 -100816 -72255 128453 -83565 -312049
6899 -312049 -155117 33728 -200162 -223241 -418181 -453834 -216831 197154 161929 168842 313042
6888 313042 358213 248466 28412 -231023 -115548 -203901 -219000 -294666 -333333 -227890 -306757
6877 -306757 -167771 -145978 -431825 -556137 -672029 -535001 -323826 -12972 284780 394113
6867 394113 220910 160316 -238513 -422450 -334816 -158187 -33710 8036 24588 -38855 -124087
6856 -124087 59115 33598 -90991 -130013 -539937 -408683 -77553 57967 56833 142387 36438
6845 36438 -91313 -125811 -156160 54390 133464 -171268 -311307 -299652 -310620 -252316 -176616
6834 -176616 -95678 -305401 -388182 -158486 -258161 -48232 89393 43733 108174 294694 236533
$$ packed form
6910A64429k3963j59093j50073o0450J33702m9592M4224K8561K00708k12018k28484
6899c12049J56932J88845k33890k3079j94940l5653K37003M13985l5225O913J44200
6888C13042M5171j09747k20054k59435J15475q8353j5099p5666l8667J05443p8867
6877c06757J38986K1793k85847j24312j15892J37028K11175L10854K97752J09333
6867C94113j73203o0594l98829j83937Q7634J76629J24477M1746J6552o3443q5232
6856a24087J83202k5517j24589l9022m09924J31254L31130J35520j134Q5554j05949
6845C6438j27751l4498l0349K10550P9074l04732j40039J1655j0968N8304P5700
6834a76616Q0938k09723q2781K29696r9675K09929J37625m5660O4441J86520n8161
$$ plain form
6823 236533 198175 299428 -235981 -377780 -352972 -271698 -205024 -180683 -229174 -313967 -155342
6812 -155342 -22416 57612 71848 -9127 -216086 -547886 -709927 -683154 -700617 -648736 -240098
6801 -240098 -38080 108574 175810 -161183 -239511 -89440 247662 268407 -58642 -168279
6791 -168279 -254790 -147280 -241812 -269488 -157798 -94921 -265982 -488707 -552544 -482615 -774788
6780 -774788 -882097 -485077 -220239 -24334 -82980 -226573 -110017 156059 223174 271481
6770 271481 194739 -125958 -278663 -454810 -364239 -339014 -146823 -144810 -249505 -489313 -514474
6759 -514474 -265607 -272269 -542283 -230671 -161720 67143 150486 14440 -324909 -353418 -233406
6748 -233406 55987 271551 357576 162782 5392 -156058 -280135 -459407 -605120 -596079
$$ packed form
6823B36533l8358J01253n35409j41799K4808Q1274O6674K4341m8491q4793J58625
6812a55342J32926Q0028J4236q0975k06959l31800j62041K6773j7463N1881M08638
6801b40098K02018J46654O7236l36993p8328J50071L37102K0745l27049j09637
6791a68279q6511J07510r4532k7676J11690O2877j71061k22725o3837O9929k92173
6780g74788j07309L97020K64838J95905n8646j43593J16556K66076O7115M8307
6770B71481p6742l20697j52705j76147R0571K5225J92191K013j04695k39808k5161
6759e14474K48867o662k70014L11612O8951K28863Q3343j36046l39349k8509J20012
6748b33406K89393K15564Q6025j94794j57390j61450j24077j79272j45713R041
$$ plain form
6738 -596079 -300760 -117072 -65170 -16187 -109644 -41920 -840 118867 272639 491589 545716
6727 545716 361159 85239 -99493 -84191 85340 -54722 -55602 -201371 -235080 -125744 -260740
6716 -260740 -394397 -120479 45719 267110 512990 613017 499681 422165 410477 7115
6706 7115 -245884 -202615 -1698 -1592 -96359 222793 510673 414322 311879 287703 78103
6695 78103 -91645 -350436 -279756 -19923 274115 117357 -38791 -194524 -165629 -215653
6685 -215653 -537349 -302809 -269181 -424475 -286073 -73481 -67866 -265519 -551594 -524352
6675 -524352 -556757 -354031 -18244 -65023 13965 -45048 -39476 -18806 57209 9780 76718
6664 76718 240794 152142 196470 327740 151205 303523 406050 211377 115013 -10872
$$ packed form
6738e96079K95319J83688N1902M8983r3457O7724M1080J19707J53772K18950N4127
6727E45716j84557k75920j84732J5302J69531j40062q80j45769l3709J09336j34996
6716b60740j33657K73918J66198K21391K45880J00027j13336p7516j1688m03362
6706G115k52999M3269K00917J06r4767L19152K87880r6351j02443k4176k09600
6695G8103j69748k58791P0680K59833K94038j56758j56148j55733K8895n0024
6685b15653l21696K34540L3628j55294J38402K12592N615j97653k86075K7242
6675e24352l2405K02726L35787m6779P8988n9013N572K0670P6015m7429O6938
6664G6718J64076q8652M4328J31270j76535J52318J02527j94673r6364j25885
$$ plain form
6654 -10872 119210 222607 55615 -117793 105407 227373 328140 138575 220855 -71243
6644 -71243 -478562 -622986 -483312 -208736 -132727 -106089 -21758 -70341 -164386 59549 55364
6633 55364 -93701 -104872 -302876 -349544 -635159 -866707 -789385 -521539 -45339 37898 265447
6622 265447 274847 383207 339313 -21569 -9701 390842 642325 611631 108903 -312567 -348098
6611 -348098 -266368 -148875 -198880 -170866 -78274 -146456 -147336 -91210 -258578 -123779 183745
6600 183745 -17691 -289764 -353399 -266224 -176438 -56144 255389 174112 -133528 -312676
6590 -312676 -192170 -410632 -544430 -227536 -128482 -123310 108891 384726 619675 713716
6580 713716 414662 -62663 -203 333841 340110 522077 288765 52627 -124828 -210255
$$ packed form
6654a0872J30082J03397j66992j73408K23200J21966J00767j89565Q2280k92098
6644g1243m07319j44424J39674K74576P6009K6638Q4331m8583r4045K23935m185
6633E5364j49065j1171j98004m6668k85615k31548P7322K67846M76200Q3237K27549
6622B65447R400J08360m3894l60882J1868M00543K51483l0694n02728m21470l5531
6611c48098Q1730J17493n0005K8014R2592o8182q80N6126j67368J34799L07524
6600A83745k01436k72073o3635Q7175Q9786J20294L11533q1277l07640j79148
6590c12676J20506k18462j33798L16894R9054N172K32201K75835K34949R4041
6580G13716k99054m77325O2460L34044O269J81967k33312k36138j77455q5427
$$ plain form
6570 -210255 -115514 31540 111642 175630 34947 -18390 79687 502810 604526 636322 303146
6559 303146 5883 -241677 -129665 -268634 -320288 -421086 -434828 -430151 -450408 -469801 -232007
6548 -232007 205673 190241 212804 -276406 -437192 -442538 -388655 -88469 76243 -2088 -280049
6537 -280049 -422785 -483828 -313321 69853 188013 148750 25830 -60865 -128222 -439005
6527 -439005 -408584 -364995 -257020 294286 738709 738395 278132 -65019 -9536 36295 179515
6516 179515 -138120 -96667 -21841 91429 43052 76095 74487 210085 182525 108834 90343
6505 90343 111316 34014 98186 66479 -89839 -68181 -41066 55951 -4981 110429 87884
6494 87884 -380736 -607389 -596096 -561512 -496557 -431513 -129631 -29445 117888 142938 116442
$$ packed form
6570b10255R4741J47054Q0102O3988j40683n3337R8077M23123J01716L1796l33176
6559C03146k97263k47560J12012j38969n1654j00798j3742M677k0257j9393K37794
6548b32007M37680j5432K2563m89210j60786n346N3883L00186J64712p8331k77961
6537b80049j42736o1043J70507L83174J18160l9263j22920q6695o7357l10783
6527d39005L0421M3589J07975N51306M44423l14m60263l43151N5483M5831J43220
6516A79515l17635M1453P4826J13270m8377L3043j608J35598k7560p3691j8491
6505I0343K0973p7302O4172l1707j56318K1658K7115R7017o0932J15410k2545
6494H7884m68620k26653J1293L4584O4955O5044L01882J00186J47333K5050k6496
$$ plain form
6483 116442 212836 252761 158760 79720 107116 192132 -103592 -101875 7865 188747 219001
6472 219001 110014 4574 -111219 -73842 -130919 -213988 -265339 -71846 163965 88098 -5347
6461 -5347 -69741 -40170 -15996 37103 77861 173907 14105 1022 -77004 -234996 -237878 -135842
6449 -135842 -253104 -79519 322807 572998 372813 -100887 -296873 -520885 -766485 -681193
6439 -681193 -547104 -510581 -478928 -405939 -498499 -712689 -611251 -780449 -807200 -908983 -704505
6428 -704505 -172052 -156192 -589517 -632805 -482517 -493523 -282933 -187383 -136643 -247922 -721953
6417 -721953 -632801 -615435 -758802 -581658 -485998 -231073 -215069 -250208 -99583 -95036 303009
6406 303009 340920 94164 10064 -120331 -91541 -183654 -119942 -149997 -302038 -327570 -532880
$$ packed form
6483A16442R6394L9925r4001p9040K7396Q5016k95724J717J09740J80882L0254
6472B19001j08987j05440j15793L7377n7077q3069n1351J93493K35811p5867r3445
6461e347o4394K9571K4174N3099M0758R6046j59802j3083p8026j57992k882J02036
6449a35842j17262J73585M02326K50191k00185m73700j95986k24012k45600Q5292
6439f81193J34089L6523L1653P2989r2560k14190J01438j69198k6751j01783K04478
6428g04505N32453J5860m33325m3288J50288j1006K10590R5550N0740j11279m74031
6417g21953Q9152J7366j43367J77144R5660K54925J6004l5139J50625M547L98045
6406C03009L7911k46756q4100j30395K8790r2113O3712l0055j52041k5532k05310
$$ plain form
6395 -532880 -326877 -88674 -69447 -124455 -227959 -184439 -262098 -184807 118542 169076 49989
6384 49989 -351543 -382117 -249836 -174337 -45796 14485 68430 4890 -117338 -193970 -90128
6373 -90128 -289460 -222343 -161650 -281496 -336007 -236687 -122803 -289245 -284647 -134681 -136970
6362 -136970 66707 122110 -337501 -808149 -825363 -559195 -327319 -202572 -241713 -117055
6352 -117055 146850 156913 313652 -141310 -235956 -279336 -217519 54646 284292 251805 157319
6341 157319 121069 76395 -225901 -410050 -412928 -391208 -488522 -175470 -52372 118989 -36073
6330 -36073 -185704 28635 149904 -6271 -237596 -154220 -67129 -168398 -317025 -680897
6320 -680897 -912871 -531810 -209010 14486 -163904 -187974 -22761 141077 180511 128165
$$ packed form
6395e32880K06003K38203J9227n5008j03504M3520p7659P7291L03349N0534j19087
6384D9989m01532l0574J32281P5499J28541O0281N3945o3540j22228p6632J03842
6373i0128j99332O7117O0693j19846n4511R9320J13884j66442M598J49966k289
6362a36970K03677N5403m59611m70648j7214K66168K31876J24747l9141J24658
6352a17055K63905J0063J56739m54962r4646m3380O1817K72165K29646l2487r4486
6341A57319l6250m4674l02296j84149k878K1720r7314L13052J23098J71361j55062
6330c6073j49631K14339J21269j56175k31325Q3376Q7091j01269j48627l63872
6320f80897k31974L81061L22800K23496j78390k4070J65213J63838L9434n2346
$$ plain form
6310 128165 -5210 -111165 -111818 -291607 -396260 -233586 -8989 -90093 -107881 -207078 154384
6299 154384 236390 219667 12895 -298820 -459501 -360000 -371868 -236205 -271638 -200954 -175406
6288 -175406 -224238 -523173 -602013 -480251 -501758 -457781 -273647 67107 254536 181683 263362
6277 263362 228660 231511 95645 112263 236486 8170 -211798 -320691 -374311 -504473 -420905
6266 -420905 -104393 105398 -156404 -221224 -23855 120940 192032 87792 229421 73398
6256 73398 -95622 -4740 33021 68019 37404 -33825 -1975 -26965 -56605 -165509 -214656
6245 -214656 144404 259674 237726 251207 271090 136670 149013 224488 169628 163089 252319
6234 252319 259035 -30989 -197270 -138456 2696 -13592 -122922 -53813 -27285 -27632 -251559
$$ packed form
6310A28165j33375j05955o53j79789j04653J62674K24597q1104j7788r9197L61462
6299A54384Q2006j6723k06772l11715j60681R9501j1868J35663l5433P0684K5548
6288a75406m8832k98935p8840J21762k1507M3977J84134L40754J87429p2853Q1679
6277B63362l4702K851j35866J6618J24223k28316k19968j08893n3620j30162Q3568
6266d20905L16512K09791k61802o4820J97369J44795P1092j04240J41629j56023
6256G3398j69020R0882L7761L4998l0615p1229L1850k4990k9640j08904m9147
6245b14656L59060J15270k1948J3481J9883j34420J2343P5475n4860o539Q9230
6234B52319O716k90024j66281N8814J41152j6288j09330O9109K6528l47k23927
$$ plain form
6223 -251559 -325252 -383665 -274263 -592423 -686446 -706177 -592156 -360358 -323424 -324586 -559857
6212 -559857 -677081 -529440 -411543 -436224 -594108 -537010 -322183 -445679 -182798 287814
6202 287814 218640 -80864 -240759 -222902 -307221 -461918 -365904 -149068 -280146 -279638 -90924
6191 -90924 -142021 -197588 -162169 120962 370906 -136773 -651214 -445171 -75224 9835 13300
6180 13300 -213274 -514063 -609624 -373626 -341064 -449603 -411206 6622 171396 -134787
6170 -134787 -202413 135631 81327 133985 194218 257664 -49838 -162014 -61503 -142808 -444727
6159 -444727 -320948 -79925 -113502 -224083 931 -156939 -64323 43015 45703 56723 -55611
6148 -55611 -59972 106478 99157 -167981 -315106 -122355 -75730 -52347 -44279 56412 114651
$$ packed form
6223b51559p3693n8413J09402l18160r4023j9731J14021K31798L6934j162k35271
6212e59857j17224J47641J17897k4681j57884N7098K14827j23496K62881M70612
6202B87814o9174k99504j59895J7857q4319j54697R6014K16836j31078N08J88714
6191i0924n1097n5567L5419K83131K49944n07679n14441K06043L69947Q5059L465
6180A3300k26574l00789r5561K35998L2562j08539L8397M17828J64774l06183
6170a34787o7626L38044n4304N2658O0233O3446l07502j12176J00511q1305l01919
6159d44727J23779K41023l3577j10581K25014j57870R2616J07338K688J1020j12334
6148e5611m361J66450p321k67138j47125J92751M6625K3383Q068J00691N8239
$$ plain form
6137 114651 88701 202246 254779 357487 569735 710148 393495 -112149 -305657 -233445
6127 -233445 72406 311072 437127 655079 361435 141864 -49138 54919 -72610 -140361
6117 -140361 -178943 -108096 26824 -63891 -246774 -316681 -143216 -83248 -56783 -144906 -54585
6106 -54585 -163912 -249634 -321993 -28677 190762 85484 -228597 -252502 5957 299423
6096 299423 530297 426684 407740 368476 353099 360367 245762 22071 130813 -25937 -185640
6085 -185640 -111167 -140719 43458 107985 -66350 119315 267906 134707 46953 106945 97297
6074 97297 297372 404449 124633 -58460 -46742 -350208 -418247 -387556 12445 198170
6064 198170 15553 -25761 -70545 -215879 -202605 -100356 -147752 -102722 -290199 -253218 -352156
$$ packed form
6137A14651k5950J13545N2533J02708K12248J40413l16653n05644j93508P2212
6127b33445L05851K38666J26055K17952k93644k19571j91002J04057j27529o7751
6117a40361l8582P0847J34920r0715j82883o9907J73465N9968K6465q8123R0321
6106e4585j09327q5722p2359K93316K19439j05278l14081k3905K58459K93466
6096B99423K30874j03613j8944l9264j5377P268j14605k23691J08742j56750j59703
6085a85640P4473k9552J84177O4527j74335J85665J48591j33199q7754N9992r648
6074I7297K00075J07077k79816j83093J1718l03466o8039L0691M00001J85725
6064A98170j82617m1314m4784j45334J3274J02249m7396M5030j87477L6981r8938
$$ plain form
6053 -352156 -495354 -363150 -456739 -313315 -91733 -159795 -209567 -285687 -133951 -60192 90318
6042 90318 174907 143581 67603 -15107 119624 328941 492076 426659 251829 286249 450271
6031 450271 201974 -47527 219060 175855 -84805 -129190 -132824 -96385 -38351 25887 -61074
6020 -61074 -178824 -175712 -80681 -194662 -10253 293478 329711 204515 59018 42922 -232138
6009 -232138 -480871 -290016 111956 225078 274631 129972 164087 -35281 30678 -123907
5999 -123907 -192857 -182114 -330078 -50720 248240 37053 -180646 120846 305605 -589
5989 -589 -596787 -576203 -522315 -497562 -358309 -248921 -47497 175178 184725 -4442 111191
5978 111191 356652 166070 -134408 -187834 -126431 -171095 -177081 -158434 -275701 -497821 -642068
$$ packed form
6053c52156j43198J32204r3589J43424K21582o8062m9772p6120J51736P3759J50510
6042I0318Q4589l1326p5978q2710J34731K09317J63135o5417j74830L4420J64022
6031D50271k48297k49501K66587m3205k60660m4385l634L6439N8034O4238q6961
6020f1074j17750L112R5031j13981J84409L03731L6233j25196j45497j6096k75060
6009b32138k48733J90855M01972J13122M9553j44659L4115j99368O5959j54585
5999a23907o8950J0743j47964K79358K98960k11187k17699L01492J84759l06194
5989e89n96198K0584N3888K4753J39253J09388K01424K22675R547j89167J15633
5978A11191K45461j90582l00478n3426O1403m4664n986J8647j17267k22120j44247
$$ plain form
5967 -642068 -682188 -388954 -219515 -111315 -13164 -81348 -78045 -139116 -206990 -98547 43804
5956 43804 -38362 -37054 56048 65614 33503 86202 118660 97592 16146 23955 -16690 -85867
5944 -85867 65556 -14354 -201403 38893 109095 -63627 -216653 -392736 -234896 -74684
5934 -74684 -36471 19651 37494 -85217 -208871 -112574 -70541 -78277 -42391 -115697 -38514 -12581
5922 -12581 -155367 -78590 36280 -161164 -202313 -259102 -354157 -301163 -46857 145082 328803
5911 328803 198978 334575 298353 148789 -203939 -376761 -268572 -338128 -421183 -276876
5901 -276876 -166069 -253384 -138232 -421127 -487635 -325560 -309794 -172828 106844 113766 23112
5890 23112 342892 370107 61479 -318118 -199195 -147997 -334186 -132664 -208053 -14828
$$ packed form
5967f42068m0120K93234J69439J08200R8151o8184L303o1071o7874J08443J42351
5956D3804q2166J308R3102R566l2111N2699L2458k1068q1446P809m0645o9177
5944h5867J51423p9910j87049K40296P0202j72722j53026j76083J57840J60212
5934g4684L8213N6122J7843j22711j23654R6297M2033p736L5886p3306P7183K5933
5922a2581j42786P6777J14870j97444m1149n6789r5055N2994K54306J91939J83721
5911C28803j29825J35597l6222j49564l52728j72822J08189o9556q3055J44307
5901b76876J10807q7315J15152k82895o6508J62075J5766J36966K79672O922r0654
5890B3112L19780K7215l08628l79597J18923N1198j86189K01522p5389J93225
$$ plain form
5880 -14828 153401 41928 -165342 -64595 95420 -130454 -75044 -134666 65951 -123682
5870 -123682 -36635 38922 13781 98323 -91904 -67128 295207 295330 293139 292287 184720 -106575
5858 -106575 66800 177999 223537 195915 65406 -9123 -107570 -93000 -79828 157962 308202
5847 308202 291515 251028 324224 476479 335214 101393 -109664 -151732 -188560 -334712 -590847
5836 -590847 -587367 -502623 -179816 -238526 -202527 -8458 -150560 -197574 -367577 -216272 -355605
5825 -355605 -428036 -629846 -495755 -331200 -44978 -40608 -319809 -231988 -217110 -283270 -133160
5814 -133160 42909 325896 358501 28131 -224038 -411187 -454822 -492378 -421757 -117916
5804 -117916 20125 -246849 -452989 -168985 83498 -69943 -99588 48746 131541 -79588
$$ packed form
5880a4828J68229j11473k07270J00747J60015k25874N5410n9622K00617j89633
5870a23682Q7047P5557k5141Q4542j90227K4776L62335J23k191q52j07567k91295
5858a06575J73375J11199M5538k7622j30509p4529r8447J4570J3172K37790J50240
5847C08202j6687m0487P3196J52255j41265k33821k11057m2068l6828j46152k56135
5836e90847L480Q4744L22807n8710L5999J94069j42102m7014j70003J51305j39333
5825c55605p2431k01810J34091J64555K86222M370k79201Q7821J4878o6160J50110
5814a33160J76069K82987L2605l30370k52169j87149m3635l7556P0621L03841
5804a17916J38041k66974k06140K84004K52483j53441k9645J48334Q2795k11129
$$ plain form
5794 -79588 -191397 -187750 -234290 -376679 -607872 -459145 -278562 -406145 -187489 -256345 -192233
5783 -192233 -176947 -533760 -508720 -420648 -63985 -81875 -306468 -272354 -56021 176281 64873
5772 64873 -169949 -370011 -182422 -94495 4850 256630 355515 293573 89299 15627 91036
5761 91036 104831 -143662 -409994 -397788 -324841 -198040 -13544 -12308 -44023 -193938 -160616
5750 -160616 120094 215880 -172279 -463749 -300419 -408527 -279088 -191253 -121149 216046
5740 216046 192546 29634 -85123 -62706 -6462 -146293 -287060 -329826 -301902 -238522 -116617
5729 -116617 -220257 -86039 161156 175434 -9862 -13179 98727 253766 371191 149744
5719 149744 186817 30730 -104405 111567 347559 186987 -45243 22067 111177 134699
$$ packed form
5794g9588j11809L647m6540j42389k31193J48727J80583j27583K18656o8856O4112
5783a92233J5286l56813K5040Q8072L56663j7890k24593L4114K16333K32302j11408
5772F4873k34822k00062J87589Q7927R9345K51780R8885o1942k04274p3672P5409
5761I1036J3795k48493k66332J2206P2947J26801J84496J236l1715j49915L3322
5750a60616K80710R5786l88159k91470J63330j08108J29439Q7835P0104L37195
5740B16046k3500j62912j14757K2417N6244j39831j40767m2766K7924O3380J21905
5729a16617j03640J34218K47195J4278j85296l317J11906J55039J17425k21447
5719A49744L7073j56087j35135K15972K35992j60572k32230O7310Q9110K3522
$$ plain form
5709 134699 340540 427893 122626 256725 393168 432262 318335 406051 310856 109357
5699 109357 -56945 -119463 135316 285449 458887 477033 207456 163297 83667 127651 -8596
5688 -8596 -114551 -343028 -77020 -226750 -438154 -75309 307146 200218 12501 7765
5678 7765 -205994 -303925 -132107 -33564 217232 423369 434458 323011 165098 180463 625489
5667 625489 513173 600902 485609 50997 -408666 -265360 -34784 -180298 -213662 -240333
5657 -240333 -276627 -292159 -148188 -96288 1410 8893 -36108 -217746 -2492 382536 394995
5646 394995 238925 80784 371806 463632 72176 -44783 -162408 -158800 -151993 -167508 -251339
5635 -251339 259251 364764 226785 100028 311380 526826 608993 291395 141370 287987
$$ packed form
5709A34699K05841Q7353l05267J34099J36443L9094j13927Q7716r5195k01499
5699A09357j66302o2518K54779J50133J73438J8146k69577m4159p9630M3984j36247
5688h596j05955k28477K66008j49730k11404L62845L82455j06928j87717m736
5678G765k13759r7931J71818R8543K50796K06137J1089j11447j57913J5365M45026
5667F25489j12316Q7729j15293m34612m59663J43306K30576j45514l3364k6671
5657b40333l6294j5532J43971N1900R7698P483m5001j81638K15254L85028J2459
5646C94995j56070j58141K91022R1826l91456j16959j17625L608O807j5515q3831
5635b51339N10590J05513j37979j26757K11352K15446Q2167l17598j50025J46617
$$ plain form
5625 287987 313631 484273 448468 223912 -36637 -84747 -85982 -260398 -283602 -150980 4703
5614 4703 -183494 -481285 -392202 -254804 -209124 -452361 -398669 -326537 -258324 35863 -111469
5603 -111469 -182515 -380542 -267639 56992 175814 182320 125684 -26209 164284 328758
5593 328758 82286 18684 13984 21218 98858 -62646 334316 665243 440643 35247 -85692
5582 -85692 -55030 66977 -13403 130384 237710 125641 272121 450401 293142 242098
5572 242098 93518 -97508 -345641 -254047 -168391 -138157 -351963 -391874 -461024 -128939 300782
5561 300782 329880 141224 353935 47050 -323273 -517031 -270011 34654 -89248 -39165
5551 -39165 -67418 -124445 170669 375750 292924 225016 -130483 -255128 -288769 -93579 -176979
$$ packed form
5625B87987K5644J70642l5805k24556k60549m8110j235j74416k3204J32622J55683
5614D703j88197k97791Q9083J37398M5680k43237N3692P2132O8213K94187j47332
5603a11469p1046j98027J12903L24631J18822O506n6636j51893J90493J64474
5593C28758k46472o3602m700P234P7640j61504L96962L30927k24600m05396j20939
5582h5692L0662J22007q0380J43787J07326j12069J46480J78280j57259n1044
5572B42098j48580j91026k48133R1594Q5656L0234k13806l9911o9150L32085M29721
5561C00782K9098j88656K12711l06885l70323j93758K47020L04665j23902N0083
5551c9165k8253n7027K95114K05081q2826o7908l55499j24645l3641J95190q3400
$$ plain form
5540 -176979 -451639 23388 275841 286234 284562 78890 44854 -321393 -407141 -48434 -70842
5529 -70842 -149292 -234877 -151360 97333 23470 50029 44801 -6097 -248564 -333878 -115690
5518 -115690 -167218 -216078 -207303 -10757 29840 -120005 -235776 -324410 -194998 -201626 -280042
5507 -280042 -132016 60469 26459 -37600 58427 -33476 -33844 103837 215397 174045 323503
5496 323503 200524 74360 -158810 -601098 -574829 -281866 -178457 36573 190281 107092
5486 107092 57641 27873 -183718 -345755 -274218 -278287 -267830 -237398 -388743 -560812 -331017
5475 -331017 -212608 -289662 -168416 -191572 -222023 -309511 -123945 -287805 -53109 116511
$$ packed form
5540a76979k74660M75027K52453J0393j672k05672l4036l66247q5748L58707k2408
5529g0842p8450q5585Q3517K48693p3863K6559n228n0898k42467q5314K18188
5518a15690n1528m8860Q775J96546M0597j49845j15771q8634J29412o628p8416
5507b80042J48026J92485l4010o4059R6027r1903l68J37681J11560m1352J49458
5496C23503j22979j26164k33170m42288K6269K92963J03409K15030J53708q3189
5486A07092m9451k9768k11591j62037P1537m069J0457L0432j51345j72069K29795
5475c31017J18409p7054J21246k3156l0451q7488J85566j63860K34696J69620
$$ [...]
##END NTUPLES=NMR SPECTRUM
##END=
