##TITLE=Analysis number 318665
Compound Code cc 57102
Book Reference 488/4
Project Code adrs
Chemist Name miguelg
##JCAMPDX= 6.0         $$ Bruker NMR JCAMP-DX V2.0
##DATA TYPE= NMR SPECTRUM
##DATA CLASS= NTUPLES
##ORIGIN= Bruker BioSpin GmbH
##OWNER= nmr
$$ XWIN-NMR		Version 3.5
$$ Mon Apr 10 10:36:33 2006 GMT Daylight Time (UT+1h)  MAYBRIDGE\nmr@NMR_250MHZ
##.OBSERVE FREQUENCY= 250.131544655141
##.OBSERVE NUCLEUS= ^1H
##.ACQUISITION MODE= SIMULTANEOUS (DQD)
##.ACQUISITION SCHEME= undefined
##.AVERAGES= 16
##.DIGITISER RES= 18
##SPECTROMETER/DATA SYSTEM= dpx250
##.PULSE SEQUENCE= zg30
##.SOLVENT NAME= CDCl3
##.SHIFT REFERENCE= (INTERNAL, CDCl3, 0, 16.522)
##AUDIT TRAIL= $$ (NUMBER, WHEN, WHO, WHERE, WHAT)
$$ ##TITLE= Audit trail, XWIN-NMR		Version 3.5
$$ ##JCAMPDX= 5.01
$$ ##ORIGIN= Bruker BioSpin GmbH
$$ ##OWNER= nmr
$$ C:\u/data/dgb/nmr/ADRS/2390/pdata/1/auditp.txt
$$ ##AUDIT TRAIL=  $$ (NUMBER, WHEN, WHO, WHERE, WHAT)
(   1,<2006-04-10 10:36:10.29 +100>,<MAYBRIDGE\nmr>,<NMR_250MHZ>,
      <created by zg, POWCHK disabled, PULCHK disabled
       configuration hash MD5:
       84 BC 41 DB A1 6E 1D 46 DA 25 12 A5 C1 ED C5 3A
       data hash MD5: 64K
       15 C1 37 F6 1B 96 97 A9 76 95 92 76 54 6E B8 DF>)
(   2,<2006-04-10 10:36:23.87 +100>,<MAYBRIDGE\nmr>,<NMR_250MHZ>,
      <Start of raw data processing
       ef LB = 0.3 FT_mod = 6 PKNL = 1 SI = 32K 
       data hash MD5: 32K
       8C CD F2 3E 33 1F 18 00 25 BA 8A 24 3A 2B 7D 2C>)
(   3,<2006-04-10 10:36:25.51 +100>,<MAYBRIDGE\nmr>,<NMR_250MHZ>,
      <apk 
       data hash MD5: 32K
       53 B8 86 3D 43 6B E6 26 FB BF 3F 37 49 74 F7 5C>)
(   4,<2006-04-10 10:36:26.31 +100>,<MAYBRIDGE\nmr>,<NMR_250MHZ>,
      <abs ABSG = 5 
       data hash MD5: 32K
       07 C2 B8 B8 5F 90 24 36 02 DB D7 0F AB 38 72 A5>)
$$ ##END=
$$ 
$$ hash MD5
$$ 27 82 D1 3C 48 F0 21 14 9D F0 76 2E FD 73 8B C1
##$RELAX= 
##$RELAX= 
##$RELAX= 
##$RELAX= 
##$RELAX= 
##$RELAX= 
##$RELAX= 
$$ Bruker specific parameters
$$ --------------------------
##$DU= <C:\u>
##$EXPNO= 2390
##$NAME= <ADRS>
##$PROCNO= 1
##$TYPE= <nmr>
##$USER= <dgb>
##$AMP= (0..31)
100 100 100 100 100 100 100 100 100 100 100 100 100 100 100 100 100 100 
100 100 100 100 100 100 100 100 100 100 100 100 100 100 
##$AQSEQ= 0
##$AQ_mod= 3
##$AUNM= <au_zg>
##$AUTOPOS= <30 >
##$BF1= 250.13
##$BF2= 250.13
##$BF3= 250.13
##$BF4= 250.13
##$BF5= 500.13
##$BF6= 500.13
##$BF7= 500.13
##$BF8= 500.13
##$BYTORDA= 1
##$CFDGTYP= 0
##$CFRGTYP= 5
##$CHEMSTR= <none>
##$CNST= (0..31)
1 1 145 1 1 1 1 1 1 1 1 1 1 1 1 1 1 1 1 1 1 1 1 1 1 1 1 1 1 1 1 1 
##$CPDPRG= <>
##$CPDPRG1= <>
##$CPDPRG2= <>
##$CPDPRG3= <>
##$CPDPRG4= <mlev>
##$CPDPRG5= <mlev>
##$CPDPRG6= <mlev>
##$CPDPRG7= <mlev>
##$CPDPRG8= <mlev>
##$CPDPRGB= <>
##$CPDPRGT= <>
##$D= (0..31)
0 1 0 0 0 0 0 0 0 0.06 0 0 0 0 0 0 0.0002 0 0 0 0 0 0 0 0 0 0 0 0 0 0 
0 
##$DATE= 1144661768
##$DBL= (0..7)
120 120 120 120 120 120 120 120 
##$DBP= (0..7)
150 150 150 150 150 150 150 150 
##$DBP07= 0
##$DBPNAM0= <>
##$DBPNAM1= <>
$$ [...]
##$SUBNAM7= <"">
##$SUBNAM8= <"">
##$SUBNAM9= <"">
##$SW= 20.6930455092707
##$SWIBOX= (0..15)
0 0 3 0 0 0 0 0 0 0 0 0 0 0 0 0 
##$SW_h= 5175.983436853
##$TD= 65536
##$TD0= 1
##$TE= 294.16
##$TE2= 300
##$TE3= 300
##$TEG= 300
##$TL= (0..7)
0 120 120 120 120 120 120 120 
##$TP= (0..7)
150 150 150 150 150 150 150 150 
##$TP07= 0
##$TPNAME0= <>
##$TPNAME1= <>
##$TPNAME2= <>
##$TPNAME3= <>
##$TPNAME4= <>
##$TPNAME5= <>
##$TPNAME6= <>
##$TPNAME7= <>
##$TPOAL= (0..7)
0.5 0.5 0.5 0.5 0.5 0.5 0.5 0.5 
##$TPOFFS= (0..7)
0 0 0 0 0 0 0 0 
##$TUNHIN= 0
##$TUNHOUT= 0
##$TUNXOUT= 0
##$USERA1= <user>
##$USERA2= <user>
##$USERA3= <user>
##$USERA4= <user>
##$USERA5= <user>
##$V9= 5
##$VALIST= <valist>
##$VCLIST= <CCCCCCCCCCCCCCC>
##$VD= 0
##$VDLIST= <DDDDDDDDDDDDDDD>
##$VPLIST= <PPPPPPPPPPPPPPP>
##$VTLIST= <TTTTTTTTTTTTTTT>
##$WBST= 1024
##$WBSW= 4
##$XGAIN= (0..3)
0 0 0 0 
##$XL= 0
##$YL= 0
##$YMAX_a= 462157
##$YMIN_a= -541233
##$ZGOPTNS= <>
##$ZL1= 120
##$ZL2= 120
##$ZL3= 120
##$ZL4= 120
##$ABSF1= 16.522
##$ABSF2= -4.171173
##$ABSG= 5
##$ABSL= 3
##$ALPHA= 0
##$AQORDER= 0
##$ASSFAC= 0
##$ASSFACI= 0
##$ASSFACX= 0
##$ASSWID= 0
##$AUNMP= <proc_1d>
##$AZFE= 0.1
##$AZFW= 0.1
##$BCFW= 0
##$BC_mod= 0
##$BYTORDP= 0
##$COROFFS= 0
##$CY= 12.5
##$DATMOD= 1
##$DC= 0
##$DFILT= <>
##$DTYPP= 0
##$F1P= 14.0000005364418
##$F2P= -0.99999901652339
##$FCOR= 0.5
##$FTSIZE= 32768
##$FT_mod= 6
##$GAMMA= 0
##$GB= 0
##$INTBC= 1
##$INTSCL= 1
##$ISEN= 128
##$LB= 0.3
##$LEV0= 0
##$LPBIN= 0
##$MAXI= 10000
##$MC2= 0
##$MEAN= 0
##$ME_mod= 0
##$MI= 0
##$NCOEF= 0
##$NC_proc= -5
##$NLEV= 6
##$NOISF1= 0
##$NOISF2= 0
##$NSP= 0
##$NTH_PI= 0
##$NZP= 0
##$OFFSET= 16.522
##$PC= 1
##$PHC0= 171.6302
##$PHC1= 6.433625
##$PH_mod= 1
##$PKNL= yes
##$PPARMOD= 0
##$PSCAL= 4
##$PSIGN= 0
##$REVERSE= no
##$SF= 250.13
##$SI= 32768
##$SIGF1= 0
##$SIGF2= 0
##$SINO= 400
##$SIOLD= 32768
##$SREGLST= <1H.CDCl3>
##$SSB= 0
##$STSI= 32768
##$STSR= 0
##$SW_p= 5175.98343685301
##$SYMM= 0
##$S_DEV= 0
##$TDeff= 65536
##$TDoff= 0
##$TI= <Analysis number 999999
Compound Code 99
Book Reference 9
Project Code 9>
##$TILT= no
##$TM1= 0
##$TM2= 0
##$TOPLEV= 0
##$USERP1= <user>
##$USERP2= <user>
##$USERP3= <user>
##$USERP4= <user>
##$USERP5= <user>
##$WDW= 1
##$XDIM= 32768
##$YMAX_p= 341484466
##$YMIN_p= -305786
$$ End of Bruker specific parameters
$$ ---------------------------------
##NTUPLES= NMR SPECTRUM
##VAR_NAME=  FREQUENCY,     SPECTRUM/REAL,   SPECTRUM/IMAG
##SYMBOL=    X,             R,               I
##VAR_TYPE=  INDEPENDENT,   DEPENDENT,       DEPENDENT
##VAR_FORM=  AFFN,          ASDF,            ASDF
##VAR_DIM=   32768,         32768,           32768
##UNITS=     HZ,            ARBITRARY UNITS, ARBITRARY UNITS
##FACTOR=    0.157963299565203, 1,           1
##FIRST=     4132.6476996994, 0,             0
##LAST=      -1043.33573715361, 0,           0
##MIN=       -1043.33573715361, -305786,     0
##MAX=       4132.6476996994, 341484466,     0
$$ Real data points
##PAGE= N=1
##DATA TABLE= (X++(R..R)), XYDATA
$$ [...]
22979a07264M2395R3103Q7751l2348l0872l3503J1447M3557L4357N309l3838o3353
$$ -107264 -64869 28234 115985 83637 52765 19262 30709 74266 108623 113932 80094 16741
22967A6741r5828l616O1492L4465n6343n7409O5567N3441r468l4054N2473J1658
$$ 16741 -79087 -82703 -21211 13254 -43089 -100498 -34931 18510 9042 -25012 27461 39119
22955C9119L5910k6471p1903m3922q623K316J4963M2744N0230L5144K3131P749
$$ 39119 75029 48558 -23345 -67267 -75890 -73574 -58611 -15867 34363 69507 92638 100387
22943A00387R139o8779n5006O317l0482R149R9317K2207j03544m1782J53670j244
$$ 100387 109526 40747 -14259 -7942 -38424 -29275 70042 92249 -11295 -53077 100593 99349
22931I9349r2060q040p05L4792q9903k3018L9077R5436o5980j1080K594K9265
$$ 99349 7289 -751 -1456 33336 -56567 -79585 -40508 54928 -11052 -22132 -19538 9727
22919I727L4404m5749K9050L8081M8612j12607J2511J6429N2202j5604l2286o9884
$$ 9727 44131 -1618 27432 65513 114125 1518 14029 30458 82660 67056 34770 -35114
22907c5114L3374K4466j3578N5677J4569j13191p3336N2025P6979N2110m9084
$$ -35114 -1740 22726 9148 64825 79394 -33797 -107133 -55108 21871 73981 24897
22896B4897p2187K15M7538n4455M6577N4799k7972K017r6822q1030L0176L8221
$$ 24897 -47290 -47075 463 -53992 -7415 47384 19412 21429 -75393 -156423 -126247 -88026
22884h8026O3344N8642o1304J7008k9712k2960N5607l7377j5298p745N3422L812
$$ -88026 -24682 33960 -27344 -10336 -40048 -63008 -7401 -44778 -60076 -67821 -14399 -10587
22872a0587J4894j0520L3506K4328K5725j1166o248j969k0026l4437m8729J22412
$$ -10587 4307 -6213 27293 51621 77346 66180 59932 57963 37937 3500 -45229 77183
22860G7183p1747l4715M273j3586M9047j7087m4001J047m3077L9796P6768O5792
$$ 77183 5436 -29279 -25006 -38592 10455 -6632 -50633 -49586 -92663 -52867 23901 89693
22848H9693m1238j07412k5419l46N087N2348j642L0845k1204r5015j4343N8675
$$ 89693 48455 -58957 -84376 -84722 -79635 -27287 -28929 1916 -19288 -114303 -128646 -69971
22836f9971J6936L5053M3498j5525q0068l049L8578O4582O1401Q950o8285m2485
$$ -69971 -53035 -17982 25516 9991 -70077 -73126 -34548 30034 91435 100385 32100 -10385
22824a0385N1976m3061o4593j7738P8060N7492m5694r9205n6409Q3574N2538p002
$$ -10385 41591 -1470 -66063 -83801 -5741 51751 6057 -93148 -149557 -65983 -13445 -20447
22812b0447j5690O5278P4920k9681l9273R4249j8293l3708p9383j14294n9305
$$ -20447 -36137 29141 104061 74380 35107 129356 111063 77355 -2028 -116322 -175627
22801a75627R5392O2782K4501o5041k5911J6075j1762R2352r461J3077k7746L7306
$$ -175627 -80235 -17453 7048 -57993 -83904 -67829 -79591 12761 3300 16377 -11369 25937
22789B5937K6272j1411m2885K4568J6532o395m4329K0564k9673o3516k0045M1198
$$ 25937 52209 40798 -2087 22481 39013 32618 -11711 8853 -20820 -84336 -104381 -63183
22777f3183P6371K6043k2469l0526N9690L7129J2205k9172m4251K0000m9473M7899
$$ -63183 13188 39231 16762 -13764 45926 83055 95260 66088 21837 41837 -7636 40263
22765D0263M6239n7629N3804M9232k4708j498q0044n807R0280n9872r7508n231
$$ 40263 86502 28873 82677 131909 107201 105703 25659 19852 110132 50260 -47248 -52479
22753e2479P8233O34q5868k4151L4955L150k776j5147M1419r512j02109l9253
$$ -52479 25754 26388 -59480 -83631 -48676 -45526 -48302 -63449 -22030 -31542 -133651 -172904
22741a72904P2619O5719j8369K5894N3160J4030k9906n7364l2695o877L2645l0659
$$ -172904 -100285 -34566 -52935 -27041 26119 40149 10243 -47121 -79816 -86693 -54048 -84707
22729h4707k5267N4222O5111k3080Q154L4308m428r2959K2251j3609K2007p6674
$$ -84707 -109974 -55752 9359 -13721 -5567 28741 24313 -68646 -46395 -60004 -37997 -114671
22717a14671o1703L5473Q3098M0134J9444l0360l4305q9037L2738r437R44O198
$$ -114671 -176374 -140901 -57803 -17669 1775 -28585 -62890 -151927 -119189 -128626 -127682 -121484
22705a21484O455K1966J8699K5660P2246J7135l6864j5695J4733q2433m9010L7372
$$ -121484 -115029 -93063 -74364 -48704 23542 40677 3813 -11882 2851 -79582 -128592 -91220
22693i1220P1306N284N0004M1098J658k446m4380N22j438J186p34l6652N5048
$$ -91220 -19914 -14630 35374 76472 78130 75684 31304 31826 30388 31574 30840 -5812 49236
22680D9236N8738o613o4012j03330k9264M1629Q9580n6235p4791j9507J99M7800
$$ 49236 107974 101361 37349 -65981 -95245 -53616 35964 -20271 -95062 -114569 -114370 -66570
22668f6570P7882M071L772N1686j7634q820m9808n0398n065m8973j3300O8268
$$ -66570 11312 15383 19155 70841 53207 44387 -5421 -55819 -60884 -109857 -123157 -54889
22656e4889O2779O2796J528l0463k7778L1565Q196q9860O1124O0395j1078R75
$$ -54889 7890 70686 72214 41751 13973 45538 53734 -36126 24998 85393 74315 75290
22644G5290p1691N215K3852j2837m2237l0077R46l6623K7166J9556N1235j5557
$$ 75290 3599 8814 32666 19829 -22408 -52485 -51539 -88162 -60996 -41440 9795 -5762
22632e762n7408j1056J3787j586P3378m334j14861L8066o692O847L4940l4926
$$ -5762 -63170 -74226 -60439 -62025 11353 7019 -107842 -69776 -76468 -69621 -34681 -69607
22620f9607K1582O2324p3352l8593L9339M2163o1642m3463k3542K3185M0180L6978
$$ -69607 -48025 14299 -59053 -97646 -58307 -16144 -77786 -121249 -144791 -121606 -81426 -44448
22608d4448M8418k9416K4633M777j7307L3529l3755K5895o985j9235L210L5976
$$ -44448 3970 -25446 -813 3964 -13343 20186 -13569 12326 5341 -13894 -10684 25292
22596B5292p709j8007M6426K9881l8319o6541j4418k1498L7543J3492n9745j1424
$$ 25292 17583 -424 46002 75883 37564 -28977 -43395 -64893 -27350 -13858 -73603 -85027
22584h5027K758K9254P814P868p8207L9182L0521p2513o661R9388J51132n3306
$$ -85027 -82269 -53015 -45201 -37333 -115540 -76358 -45837 -118350 -125011 -25623 125509 72203
22572G2203m1657J2913k8452q1667O72p7002N6519K0135J2583M9151L490j1380
$$ 72203 30546 43459 15007 -66660 -65988 -142990 -86471 -66336 -53753 -4602 -1112 -12492
22560a2492m6114j21416n8121M9490L8806M4011K979O3690m1881q1712k3455M6198
$$ -12492 -58606 -180022 -238143 -188653 -149847 -105836 -102857 -39167 -81048 -162760 -186215 -140017
22548a40017M9588K2430M1664j1884Q582J2911m4438k7936N3839N246L8313j5801
$$ -140017 -90429 -67999 -26335 -38219 -29637 -16726 -61164 -89100 -35261 -30015 8298 -7503
22536g503m721O774O0325L3332p452m9111o5209P949K3972M9337k5954k206K0589
$$ -7503 -12224 -5450 54875 88207 80755 31644 -33565 -25616 -1644 47693 21739 19533 40122
22523D0122m2058j2358M1150L2623M395n3334n3308Q5370O5630Q441l7394k4342
$$ 40122 -1936 -14294 26856 59479 63874 10540 -42768 42602 108232 116673 79279 54937
22511E4937j6547l0792J1799j07207J2157j8977M6272N005J0692J3261j5180N2053
$$ 54937 38390 7598 19397 -87810 -75653 -94630 -48358 -43353 -32661 -19400 -34580 17473
22499A7473J6474J7190J0163j0036m0313m6952j0026O122m2657k7517K4374M9815
$$ 17473 33947 51137 61300 51264 10951 -36001 -46027 -39905 -82562 -110079 -85705 -35890
22487c5890J8577J2570N7889L7144j9102N8818Q459p0567p1371J1641N5624p5799
$$ -35890 -17313 -4743 53146 90290 71188 130006 138465 67898 -3473 8168 63792 -12007
22475a2007o3084J3817J5645j8712j5319M7495R0579q454N4143k9365m3344J0208
$$ -12007 -75091 -61274 -45629 -64341 -79660 -32165 58414 49960 104103 74738 31394 41602
22463D1602K76r497k6066n3881M0002K0710K4659j0278p458Q3742o4566j03579
$$ 41602 41878 32381 6315 -47566 -7564 13146 37805 27527 20069 103811 39245 -64334
22451f4334o0646M612J27104P0385j12008l2177P3929k8527n3350J722K6284O5085
$$ -64334 -124980 -120368 6736 77121 -34887 -67064 6865 -21662 -75012 -73290 -47006 18079
22439A8079m8082l9306n3219O3425M3437P278k446N8031L932l1942m2826N0806
$$ 18079 -30003 -69309 -122528 -59103 -15666 -8388 -10834 47197 51129 19187 -23639 27167
22427B7167P5806J5274l8963o2904K153J0649J5718p847p6787L303R2775K6964
$$ 27167 102973 118247 79284 16380 18533 29182 44900 37053 -39734 -36431 56344 83308
22415H3308r7498k4572P3045J3981k3536L3154l995J7353n0990l3791j8216O5181
$$ 83308 -14190 -38762 34283 48264 24728 57882 53887 71240 20250 -13541 -31757 33424
22403C3424j4729P9329k2771k712J4948J00617K338k2232l6374p6788k786J38706
$$ 33424 18695 98024 75253 72541 87489 188106 190444 168212 131838 55050 52264 190970
22391A90970O7483l1252o7255q605j12743j05349m7171L9614j4168k8627k1956
$$ 190970 258453 227201 159946 151341 38598 -66751 -113922 -74308 -88476 -117103 -139059
22380a39059l3700m4870j9147P0237M4832P2730N0210N086m8464l1270J4043L8695
$$ -139059 -172759 -217629 -236776 -166539 -121707 -48977 1233 6319 -42145 -73415 -59372 -20677
22368b0677r9155M19J8214J07689L4243p192o147O172j7230J1399l5690l5409
$$ -20677 -119832 -119413 -101199 6490 40733 33541 27394 33566 16336 27735 -7955 -43364
22356d3364J9934L3336J943p614l1984L0254L3314j2103J3547J04755J5240L0175
$$ -43364 -23430 9906 11849 4235 -27749 2505 35819 23716 37263 142018 157258 187433
22344A87433n1733o3253o2941j6444N4355j6687n1281l0793q2130N5376j5549
$$ 187433 135700 72447 9506 -6938 47417 30730 -20551 -51344 -133474 -78098 -93647
22333i3647J5951Q058l8262O101m246K0991M9183M0485L6302n7683p4182L3192
$$ -93647 -77696 -69638 -107900 -101799 -106045 -85054 -35871 4614 40916 -16767 -90949 -57757
22321e7757P0333k8167N7357K2864M724J2953o4726n9236K3695L8834R0193J4943
$$ -57757 12576 -15591 41766 64630 69354 82307 17581 -41655 -17960 20874 111067 126010
22309A26010p022j6561n8794n6687K8514K5262K3308l1883K895P5586l8966k4155
$$ 126010 118988 102427 43633 -13054 15460 40722 64030 32147 35042 110628 71662 47507
22297D7507J4465J7443m1594k2002l3194k2658o101M2047L0033O5454P1641o2395
$$ 47507 61972 79415 37821 15819 -17375 -40033 -46134 -4087 25946 91400 163041 100646
22285A00646r2366M1561o8869l7555N4648R7967P1148o0317o7128r4335j3295
$$ 100646 8280 49841 -19028 -56583 -1935 96032 167180 106863 39735 -54600 -67895
22274f7895M7585l6631j3632p4741J4635L7497j3392p5448n896Q334P334j2643
$$ -67895 -20310 -56941 -70573 -145314 -130679 -93182 -106574 -182022 -187918 -179584 -172250 -184893
22262a84893j3525J49494J07107k8040r8509k7553J1240k4394p4955Q8938J06030
$$ -184893 -198418 -48924 58183 30143 -68366 -95919 -84679 -109073 -184028 -95090 10940
22251A0940K3785L8922l3433n6723L1061m2559j3097N8132j7358j07249j5064
$$ 10940 34725 73647 40214 -16509 14552 -28007 -41104 17028 -330 -107579 -122643
22240a22643M8310J202j6164L4550M8240k0738J1307m6617r5197q6225L8410J00068
$$ -122643 -74333 -73131 -89295 -54745 -6505 -27243 -15936 -62553 -157750 -243975 -205565 -105497
22228a05497J33157K6626k9788m4932j0120j9092J319n5562Q313O4748L0517k0609
$$ -105497 27660 54286 24498 -20434 -30554 -49646 -48327 -103889 -95576 -30828 -311 -20920
22216b0920M4385J9416Q093K0601o2888m8765O5409o943m2637j2336j9912L6838
$$ -20920 23465 42881 50974 71575 8687 -40078 25331 18388 -24249 -36585 -56497 -19659
22204a9659l786J3034P699r849p377j1465O265j6773M9152K4994k0596J6037k7726
$$ -19659 -23445 -10411 -2712 -12561 -19938 -31403 -25138 -41911 7241 32235 11639 27676 -50
22191e0k1605j1854l7308k599r910M203j4233K6292P9922o935j07847k8413L266
$$ -50 -21655 -33509 -70817 -73416 -83326 -79123 -93356 -67064 12858 5923 -101924 -130337 -127071
22178a27071J2525N259K4998L7503K2369O0661L1813k4624j2688P96p8048l5319
$$ -127071 -114546 -109287 -84289 -46786 -24417 36244 68057 43433 30745 31541 -46507 -81826
22166h1826M375J079l0265j5105P2417J9940l472l106K5495M9869P577o9746L1432
$$ -81826 -77451 -76372 -106637 -121742 -49325 -29385 -32857 -35963 -10468 39401 46978 -22768 8664
22153H664K8581o1926j7990O6076J6864r20J658j4458o6718l176J565o7787m4911
$$ 8664 37245 -24681 -42671 23405 40269 39349 41007 26549 -40169 -43345 -41780 -109567 -154478
22140a54478J3237M9826J9066n7962J6290O8732m375M2973K3119n5429P4352M3747
$$ -154478 -141241 -91415 -72349 -130311 -114021 -45289 -49664 -6691 16428 -39001 35351 79098
22128G9098K4597m4347n5274K7985n5220J1283K3687n9033o443k2354Q1001R8474
$$ 79098 103695 59348 4074 32059 -23161 -11878 11809 -47224 -53667 -76021 4980 103454
22116A03454P144J2178K2055j34575m3086L7731O246R110L8071o2055m423J2709
$$ 103454 110598 122776 144831 10256 -32830 4901 11147 20257 58328 -3727 -8150 4559
22104D559J0947J0156m8569P0612O6552J3402j12713j15579j8738J5687k3873
$$ 4559 15506 25662 -22907 47705 114257 127659 14946 -100633 -119371 -103684 -127557
22093a27557l103O6417Q5207Q095q4316O7906J9183N6365j4351K9624m6633p4122
$$ -127557 -130660 -64243 20964 29059 -55257 12649 31832 88197 73846 103470 56837 -17285
22081a7285l2026J9222J703L3641O0069J0229o4485k1714J1171o390r684N2981
$$ -17285 -49311 -30089 -28386 5255 65324 75553 11068 -10646 525 -5865 -15549 37432
22069C7432K6442J7810M3350l2436k5353j7326J7456R3773o987o0674k0243k0417
$$ 37432 63874 81684 125034 92598 67245 49919 67375 161148 154161 93487 73244 52827
22057E2827o5604k15K5906k2412k477M669k8679P51m2144j2222j1604j9309k3189
$$ 52827 -12777 -12992 12914 -9498 -11975 -7306 -35985 -35234 -77378 -89600 -101204 -120513 -143702
22044a43702J02000K9758J2835R3069J3548N8392J2246m1829j66549o8865J9203
$$ -143702 -41702 -11944 891 93960 107508 165900 178146 136317 -30232 -99097 -79894
22033g9894J02604m2134n1825K9450M9023q936q0744p2023Q0639l8440O3186J37285
$$ -79894 22710 -19424 -71249 -41799 7224 -1712 -82456 -154479 -73840 -112280 -49094 88191
22021H8191K9161n2069q8444M6785l8153l0107R0651m0567k9920L8936M5053L691
$$ 88191 117352 65283 -23161 23624 -14529 -44636 46015 5448 -24472 14464 59517 63208
22009F3208l9256j2750L1080K5818j7035l7008O0812J942m2144O914k3141p2823
$$ 63208 23952 11202 42282 68100 51065 14057 74869 76811 34667 41581 18440 -54383
21997e4383k7093N0107J4278L811j7124M569m9504K296P0669L9637l488k6102
$$ -54383 -81476 -31369 -17091 -13280 -30404 -25835 -75339 -73043 -2374 37263 33775 7673
21985G673l7791k315l2441m8130l5557J0906K7074M0813l5114J2490N0116M7693
$$ 7673 -30118 -32433 -64874 -113004 -148561 -137655 -110581 -69768 -104882 -92392 -42276 5417
21973E417m5236j4369K5092Q1440J9357k1923k2089J373O7696O761q4686N885
$$ 5417 -39819 -54188 -29096 52344 71701 49778 27689 29062 96758 103519 18833 24718
21961B4718J6549J9121l7730r4874k1745O2050l3238l8156M5286P7065R872Q644
$$ 24718 41267 60388 22658 -72216 -93961 -31911 -65149 -103305 -58019 19046 28918 37562
21949C7562l6046L5775O4259J3108K749l2811p748o5020K8078j2718l7344m0207
$$ 37562 1516 37291 101550 114658 117407 84596 76848 11828 39906 27188 -10156 -50363
21937e0363J07390N5345J4564l0866o0648K5338q1438j09169k8789N9141O9560
$$ -50363 57027 112372 126936 96070 35422 60760 -20678 -129847 -158636 -99495 -29935
21926b9935J04860L7478q6689m3083M108K5740l6355k9754N5726N386o6107o4796
$$ -29935 74925 112403 25714 -17369 -13261 12479 -23876 -53630 2096 7482 -58625 -123421
21914a23421k5099l947N5846K3034r758K1895K4431j9847l20J8240L9773N6948
$$ -123421 -148520 -152467 -96621 -73587 -83345 -61450 -37019 -56866 -57186 -38946 827 57775
21902E7775n91l1509J3300K4541J4932J3578m5726r3401j5932N2379M8656j0461
$$ 57775 57184 25675 38975 63516 78448 92026 46300 -47101 -63033 -10654 38002 27541
21890B7541j9980R309k7190J775l1163q1761r0508M5977O3949M5185q415k8634
$$ 27541 7561 16870 -10320 -8545 -39708 -121469 -211977 -166000 -102051 -56866 -65281 -93915
21878i3915M3707M5355j4405J3165o1340m6373j7016L7160R6973L8366j0884q0834
$$ -93915 -50208 -4853 -19258 -6093 -67433 -113806 -130822 -93662 3311 41677 30793 -50041
21866e0041k1625J2632R812J3565n1621N5043J03556n989q5673N8296R430n863
$$ -50041 -71666 -59034 -49222 -35657 -87278 -32235 71321 65332 -20341 37955 47385 41522
21854D1522m2298r652L9912m422q6326J1755P3912J0043J3926K3186m6044p2936
$$ 41522 -776 -10428 29484 25062 -61264 -49509 24403 34446 48372 71558 25514 -47422
21842d7422K6746N3699q5111r5137J138J9920M3573O7990O60K393r1014l8654
$$ -47422 -20676 33023 -52088 -147225 -146087 -126167 -82594 -14604 -13944 -11551 -102565 -141219
21830a41219K5039R5920k8238p812N1649J3875o420j0089L7704k847L9756M2905
$$ -141219 -116180 -20260 -48498 -56310 -4661 9214 2794 -7295 30409 27562 67318 110223
21818A10223o9149j0001N0813k2288m3369l8983m4576k9243J02030M2960M3470
$$ 110223 41074 31073 81886 59598 16229 -22754 -67330 -96573 5457 48417 91887
21807I1887m3070L0049q229n2197Q233J7520J44339J20093j18993q7645p5357
$$ 91887 48817 78866 70637 18440 26673 44193 188532 308625 189632 101987 26630
21796B6630j182J4511J5252M460k0414m3672j6324j5144O248J692n8381n656K8147
$$ 26630 25448 39959 55211 59671 39257 -4415 -20739 -35883 -29635 -27943 -86324 -91980 -63833
21783f3833l0511L8541L0710J3140Q091l9705J02685Q9029l220p4755p5786j0865
$$ -63833 -94344 -55803 -25093 -11953 -3862 -43567 59118 148147 144927 70172 -5614 -16479
21771a6479J33053k5096j17825q0958J9804j9100M2969r3138r379K2823P6660
$$ -16479 116574 91478 -26347 -107305 -87501 -106601 -63632 -156770 -166149 -143326 -66666
21760f6666K6535j0407L5103O8647m7149l1688k5986L725q4169M3031Q3528l9389
$$ -66666 -40131 -50538 -15435 53212 6063 -25625 -51611 -47886 -132055 -89024 -5496 -44885
21748d4885J2432m966K1481P9071M7428J083p7186m1067N642Q108m996j8983k3648
$$ -44885 -32453 -37419 -15938 63133 110561 111644 34458 -6609 -967 7141 2145 -16838 -40486
21735d0486M4489q6430n6572K0049j3828n2412n5558M9566K9419k265O4671J9240
$$ -40486 4003 -82427 -138999 -118950 -132778 -185190 -240748 -191182 -161763 -164028 -99357 -80117
21723h0117m8390M9163k8451j1764J2653m670Q585J7666k9062K8465Q3659N7758
$$ -80117 -128507 -79344 -107795 -119559 -106906 -111576 -102991 -85325 -114387 -85922 -2263 55495
21711E5495K9473o1664l6797K0887K6576m5827l4126J1741Q7276k7406j25657
$$ 55495 84968 23304 -13493 7394 33970 -11857 -45983 -34242 53034 25628 -100029
21700a00029k3181N7021M2720O8387L6047j01064m8785J0065J2796P2495O9592
$$ -100029 -123210 -66189 -23469 44918 80965 -20099 -68884 -58819 -46023 26472 96064
21689I6064P27l1461n219j00850m4485o278j6140K0919L0388K2259k3251k8700
$$ 96064 96791 65330 60111 -40739 -85224 -91502 -107642 -86723 -56335 -34076 -57327 -86027
21677h6027K5275L0494J127N4105M6510J7901J0772p9683m7320P1297J7578m5159
$$ -86027 -60752 -30258 -29131 24974 71484 89385 100157 20474 -26846 44451 62029 16870
21665A6870r3256l1310R3279M8061M6026j0793m8091K4663q0602o9175J03917
$$ 16870 -76386 -107696 -14417 33644 79670 68877 20786 45449 -35153 -104328 -411
21654d11O8125o5230o8740m587m4768N726Q4674K6060J2899J9165L7478m4152
$$ -411 67714 2484 -66256 -70843 -115611 -109885 -25211 849 13748 32913 70391 26239
21642B6239p0739j8714j885P2389P4705j1574J0540m0784j7232N5870p787q1649
$$ 26239 -44500 -63214 -65099 7290 81995 70421 80961 40177 22945 78815 71028 -10621
21630a0621m9269k5682N127J6983m417L3365L8192O8033n4582K9122K7409j10888
$$ -10621 -59890 -85572 -80445 -63462 -67879 -34514 3678 71711 17129 46251 73660 -37228
21618c7228o2249L5511L6819O1260n715J7069M1993j0447L7796J4325l5728p6395
$$ -37228 -99477 -63966 -27147 34113 28398 45467 87460 77013 114809 129134 93406 17011
21606A7011j3728J5909j3022K7237L3275K387k6313K4221p5301j8295Q2765N6591
$$ 17011 3283 19192 6170 33407 66682 69069 42756 66977 -8324 -26619 56146 112737
21594A12737n669j35646n5969J3229M1310J5383r0544j27823J1333M7315N6216
$$ 112737 107068 -28578 -84547 -71318 -30008 -14625 -105169 -232992 -221659 -174344 -118128
21583a18128R4591J200M4981Q615r6388r2851O0937J21238n1116k8796Q3837J646
$$ -118128 -23537 -22337 22644 31259 -65129 -157980 -97043 24195 -26921 -55717 28120 29766
21571B9766l5439M2490k2965j0952K018J439l0930J7954J02407k2628n1822K9439
$$ 29766 -5673 36817 13852 2900 4918 6357 -24573 -6619 95788 73160 21338 50777
21559E0777N1204l5675j04589l7669j04841K7776J26747L9729M0646n642J5585
$$ 50777 101981 66306 -38283 -75952 -180793 -153017 -26270 13459 54105 48463 64048
21548F4048R859Q1092K0967l2116q5580k8231L2457J7865r4307K3724l5480m4187
$$ 64048 73907 154999 175966 143850 58270 30039 62496 80361 -13946 9778 -25702 -69889
21536f9889Q119J3283o1441o387N6169j3872q6647n7638M0206J214R343O1019
$$ -69889 -61770 -48487 -109928 -116315 -60146 -74018 -160665 -218303 -178097 -176883 -167540 -106521
21524a06521N1358J2060J8896q6689n2025K7398J35743N3506j0016n1828k3424
$$ -106521 -55163 -43103 -24207 -110896 -162921 -135523 220 53726 43710 -8118 -31542
21513c1542J6473k0262L3776l950l579L2070Q3244N1413q4132k4440r099p4669
$$ -31542 -15069 -35331 -1555 -5505 -9084 22986 106230 157643 73511 49071 39972 -34697
21501c4697m1292J6868K6298l7273m3037K9184R3303N4583J5871l4877q999O6076
$$ -34697 -75989 -59121 -32823 -70096 -113133 -83949 9354 63937 79808 44931 35932 102008
21489A02008N0468m0376n7350j3883j058k9899o243M3977M7794K211O728p7786
$$ 102008 152476 112100 54750 40867 39809 9910 3667 47644 95438 97649 104377 26591
21477B6591n6208j32763m7803O4180R8626p627j9503m7808J6115O5063O0836M1230
$$ 26591 -29617 -162380 -210183 -146003 -47377 -55004 -74507 -122315 -106200 -41137 19699 60929
21465F0929J355n2747j846K4496M8322n0325n2753M8605M2120j2822k8982j0389
$$ 60929 62284 9537 7691 32187 80509 30184 -22569 26036 68156 55334 26352 15963
21453A5963k269j8423n7338q222L0072M8384o0626L1938O1351j9083o3057J2103
$$ 15963 13694 -4729 -62067 -70289 -40217 8167 -52459 -20521 40830 21747 -41310 -29207
21441b9207K4042k2408m5467N0424l4316l9712m6014o0882R424J0503M6353n975
$$ -29207 -5165 -27573 -73040 -22616 -56932 -96644 -142658 -203540 -194116 -183613 -137260 -143235
21429a43235M6376P5069L0376J5514r877o5444K608K9007P1221P7732k0302j60760
$$ -143235 -96859 -21790 8586 24100 14223 -51221 -48613 -19606 51615 129347 109045 -51715
21417e1715k4005L7034J5074L240J8415n009N8165M356J8109K8393l3762j6293
$$ -51715 -75720 -38686 -23612 -20372 -1957 -6966 51199 55555 73664 102057 68295 52002
21405E2002N524J4010j9688r5069K388O491l816L6501Q404l9286j3371p348l2544
$$ 52002 57526 71536 51848 -43221 -40833 -34342 -38158 -1657 6747 -32539 -45910 -53258 -85802
21392h5802N1408L3285K9107o583K8075j0306k1119n5230J00427m4217n2183k1640
$$ -85802 -34394 -1109 27998 21415 49490 39184 18065 -37165 63262 19045 -33138 -54778
21380e4778L1253N5217J2139J2169L7138m7866J684p648j6828K3223o866l5914
$$ -54778 -23525 31692 43831 56000 93138 45272 46956 39308 22480 45703 38837 2923
21368B923l5054P795P843N4938n0389l2544j14110l8444N7086L7710K4902K8683
$$ 2923 -32131 -24336 -16493 38445 -11944 -44488 -158598 -197042 -139956 -102246 -77344 -48661
21356d8661k3540O565O5151J2646m8711o7336n8360J4472O9485P9546J5906o3431
$$ -48661 -72201 -65636 -485 12161 -36550 -103886 -162246 -147774 -78289 1257 17163 -46268
21344d6268k7375P9453L4680j2462L7930j7135L9279q781n0521l7531r752r21
$$ -46268 -73643 5810 40490 28028 65958 48823 88102 79321 28800 -8731 -18483 -19404
21332a9404J4266k7078J8950j0979N049R2480k6837j17422N095J6230K3880M5242
$$ -19404 -5138 -32216 -13266 -24245 -19196 73284 46447 -70975 -65880 -49650 -25770 19472
21320A9472l2288O078k5393m886n205N5733J2486k0203Q4694L0386n3103j19237
$$ 19472 -12816 -6738 -32131 -37017 -42222 13511 25997 5794 90488 120874 67771 -51466
21308e1466j08761O6172N5366j7254J09681K3198M0439j6262q8858r2899N5294
$$ -51466 -160227 -94055 -38689 -55943 53738 76936 117375 101113 12255 -80644 -25350
21297b5350K2402Q4069p10q1038j00694K3570k1336K4088l2185J5394Q8973N301
$$ -25350 -2948 81121 80411 -627 -101321 -77751 -99087 -74999 -107184 -91790 -2817 2484
21285B484k1271J4059k4954n9899n5935M3869K6098m4910M3693L3660K7820J2562
$$ 2484 -18787 -4728 -29682 -89581 -145516 -101647 -75549 -120459 -76766 -43106 -15286 -2724
21273b724j6042l3375n4714K1025L5587k0802m4970J4863K4196N9022O3122j6794
$$ -2724 -18766 -52141 -106855 -85830 -50243 -71045 -116015 -101152 -76956 -17934 45188 28394
21261B8394p5208n6659M1383M7382L8060K9034L4521L202k9940o7846l8199n8969
$$ 28394 -46814 -103473 -62090 -14708 23352 52386 86907 90109 60169 -7677 -45876 -104845
21249a04845j9889M0334N1353o795k1282l2242L0078R4064N0101o0923Q316j4106
$$ -104845 -124734 -84400 -33047 -39842 -61124 -93366 -63288 30776 80877 19954 28270 14164
21237A4164r9193N2834R5985L9299q365J244k3200O7969p8911m8935K3899m4111
$$ 14164 -85029 -32195 63790 103089 94724 95968 72768 140737 61826 12891 36790 -7321
21225g321m3928l2015J4316O7173P33k4332l2527j7004P6155l3839k1752N485
$$ -7321 -51249 -83264 -68948 -1775 -1042 -25374 -57901 -74905 1250 -32589 -54341 -48856
21213d8856m929M616M9623M2604j468p3241k0484J10310M2183N0280n8534k7210
$$ -48856 -53785 -49169 454 43058 41590 -31651 -52135 58175 100358 150638 92104 64894
21201F4894l4943p3178l5771L6912L3172K3857l1891l1357l7134P4357J03923
$$ 64894 29951 -43227 -78998 -42086 -8914 14943 -16948 -48305 -85439 -11082 92841
21190I2841n9904o6055Q196k332m2610L9102K8940l718q436j08829m5132Q3925
$$ 92841 32937 -33118 -24922 -27254 -69864 -30762 -1822 -5540 -13976 -122805 -167937 -84012
21178h4012K6887M2119Q8506q577m2272J15659j050k7937o0238l4110K370N9701
$$ -84012 -57125 -15006 73500 64923 22651 138310 137260 109323 49085 14975 17345 77046
21166G7046j8243q3733l5437m9869N0882O9355J0698J02568O390j26640k1238
$$ 77046 58803 -24930 -60367 -110236 -59354 10001 20699 123267 129657 3017 -18221
21155a8221m4995n572m0059R407M1922J3808j412L1418l7889r1851l6083N0051
$$ -18221 -63216 -68788 -108847 -99440 -57518 -43710 -45122 -13704 -51593 -143444 -179527 -129476
21143a29476K1846J472K7116n8170L2566q746J0100P9023J0456j4402j7552o0806
$$ -129476 -107630 -106158 -79042 -137212 -104646 -113392 -103292 -24269 -13813 -28215 -45767 -106573
21131a06573k4959L1950N8612J9528N755k8266m9175j0872l7655k1564L3794K1022
$$ -106573 -131532 -99582 -40970 -21442 -15687 -43953 -93128 -104000 -141655 -163219 -129425 -108403
21119a08403K9894O9187N9405J06624j7008q7177j4455p2125n9655L6607J04500
$$ -108403 -78509 -9322 50083 156707 139699 52522 38067 -34058 -93713 -57106 47394
21108D7394O8611n6578r1042o3310R376J8648N4493J292k2679O304K229O0922
$$ 47394 116005 59427 -31615 -94925 -85549 -66901 -12408 -11116 -33795 -27491 -25262 35660
21096C5660P7849J9322K1495K324l4034l8026K9188m1543o2875j6202L6943k434
$$ 35660 113509 132831 154326 156650 122616 84590 113778 72235 9360 -6842 30101 27667
21084B7667J0645m201K0920n1961K6018J01220k8203q0437r8660M8234P6437L9778
$$ 27667 38312 34111 55031 3070 29088 130308 102105 21668 -76992 -28758 47679 87457
21072H7457k1163k0284n8042J5148N765k9443K1827r443k7092p9530N9457N5376
$$ 87457 66294 46010 -12032 3116 8881 -20562 1265 -8178 -35270 -114800 -55343 33
21060C3M859j531k2863m1559j7022j1934P8453L1562J0955J3958m7666p1770M2946
$$ 33 4892 3361 -19502 -61061 -78083 -90017 -11564 19998 30953 44911 -2755 -74525 -31579
21047c1579R1103J3753R067o2770n9312J0367J93q174K8132J1678o146m2320l3930
$$ -31579 59524 73277 82344 19574 -39738 -29371 -29178 -37352 -9220 2458 -3688 -46008 -79938
21034g9938L8989K6956L1701j0501l1193k2411L3633q352m2039O0163k7278j0816
$$ -79938 -40949 -13993 17708 7207 -23986 -46397 -12764 -21116 -63155 -2992 -30270 -41086
21022d1086o5267J0062J01317L2359r0383p4987N1209Q612R4895L9273o4224K3834
$$ -41086 -106353 -96291 5026 37385 -52998 -127985 -76776 -68164 26731 66004 1780 25614
21010B5614n614q2536J7853R4560Q9065K5963N369j470k1683q1974l2365m7802
$$ 25614 20000 -62536 -44683 49877 138942 164905 170274 168804 147121 65147 32782 -15020
20998a5020j2940L3894J6928n789n194o726m9984R200K6873M827k9732j5905P9602
$$ -15020 -27960 5934 22862 17073 11879 5153 -44831 -35631 -8758 -3931 -33663 -49568 30034
20985C0034K137o8890K3649M7681K4959N1289j8673l0995l8100K5613J6722J2726
$$ 30034 32171 -36719 -13070 34611 59570 110859 92186 61191 23091 48704 65426 78152
20973G8152P9885J3636n5076o3809o6862k1783L5935M2936n6568m1987j7498J06644
$$ 78152 158037 171673 116597 52788 -14074 -35857 78 43014 -13554 -55541 -73039 33605
20961C3605K7885q7641k5448o2337j1423l1839l4055O1780N3009l0857l6618M4547
$$ 33605 61490 -26151 -51599 -113936 -125359 -157198 -191253 -129473 -76464 -107321 -143939 -99392
20949i9392K8794J2304j6030Q2718N4297o6882l4491j5199p7279M3394R0849N2717
$$ -99392 -70598 -58294 -74324 8394 62691 -4191 -38682 -53881 -131160 -87766 3083 55800
20937E5800j33115m8980R8536N4385p6486L118R1445Q5338k0779n6114q7020p8857
$$ 55800 -77315 -126295 -27759 26626 -49860 -46742 44703 130041 109262 53148 -33872 -112729
20925a12729l164M75Q2953N5455K4155k9665l0769k6665m7256N6690M7309N462
$$ -112729 -115893 -115418 -32465 22990 47145 17480 -13289 -39954 -87210 -30520 16789 22251
20913B2251P259k7364K4756O751j04936j7825N347L241K8647J0712l6001m7125
$$ 22251 29510 2146 26902 33653 -71283 -89108 -83761 -80520 -51873 -41161 -77162 -124287
20901a24287j6772Q0211K1382N3782j822m1870m4350p973K2341K3139q3772J4660
$$ -124287 -141059 -60848 -39466 14316 12494 -29376 -73726 -81699 -59358 -36219 -119991 -105331
20889a05331J03828J7931j14311P1771p452N8190K101K4781j6551R846J0511K3843
$$ -105331 -1503 16428 -97883 -26112 -33564 24626 26727 51508 34957 44803 55314 79157
20877G9157j1209p3813M515O2055k3093k4728k7395j8836L2099L1563J7147k0787
$$ 79157 67948 -5865 -1350 60705 37612 12884 -14511 -33347 -1248 30315 47462 26675
20865B6675m3409l2167n9291j0497M7447O3582O5538M744L4482P312j51975J485
$$ 26675 -16734 -48901 -108192 -118689 -71242 -7660 57878 62622 97104 104416 -47559 -46074
20853d6074R1280m9183r5740n9060N4937J26964l3704l5754k4070j179M4082J3179
$$ -46074 45206 -3977 -99717 -158777 -103840 23124 -10580 -46334 -70404 -71583 -27501 -14322
20841a4322l0225N48J0077n0859J7072p374o3400M2095L2773k7152m4914R4917
$$ -14322 -44547 -43999 -33922 -84781 -67709 -75083 -138483 -96388 -63615 -90767 -135681 -40764
20829d0764j5117M5287L1390l5356p4213K7588K8536k7666K7922O5052P2749K1748
$$ -40764 -55881 -10594 20796 -14560 -88773 -61185 -32649 -60315 -32393 32659 105408 127156
20817A27156p0043p8908J8710M2004l319l8789j9276K8805n8072n5021Q2602J59356
$$ 127156 57113 -21795 -3085 38919 35600 -3189 -22465 6340 -51732 -106753 -24151 135205
20805A35205L4916j20175j19310J8877R680k527P5066K3512k3104M6604j030p3728
$$ 135205 170121 49946 -69364 -50487 -40807 -43334 31732 55244 32140 78744 77714 3986
20793C986L681N8056q538L5432J4373j3961k1504k0952m5595M759l6565r7439
$$ 3986 7667 65723 57185 92617 106990 93029 71525 50573 4978 9737 -26828 -124267
20781a24267n5077k3626O2991N1067O251j8757n74M4823N831K003L0397L0155
$$ -124267 -179344 -202970 -139979 -88912 -82661 -101418 -101992 -57169 -51338 -49335 -18938 11217
20769A1217J899K2997j2562n3934j7601j2510o2560j04131P7184P3328N1742M4399
$$ 11217 13116 36113 23551 -30383 -47984 -60494 -123054 -227185 -150001 -76673 -24931 19468
20757A9468Q5544R2041k1764l9501r292o2333m9033J4653m868p889J1005M946
$$ 19468 105012 197053 175289 135788 126496 64163 15130 29783 24915 17026 28031 32977
20745C2977j5142O9232n543k5020l2651j1922O0701m1691l1643j9173r783M5940
$$ 32977 17835 87067 81524 56504 23853 11931 72632 30941 -702 -19875 -29658 16282
20733A6282L9379o3434r806o7122m3276K9117M8596O7020Q227n3717m8380J3272
$$ 16282 55661 -7773 -17579 -84701 -127977 -98860 -50264 16756 24983 -28734 -77114 -63842
20721f3842K1073J1144k072K1311j6256k1544j6190l3720l6653O0072L7642K1625
$$ -63842 -42769 -31625 -33697 -12386 -28642 -50186 -66376 -100096 -136749 -76677 -39035 -17410
20709a7410N1535O57j06253J5367R2523j6236p1001M0640l9642o7726J5615J8292
$$ -17410 34125 34782 -71471 -56104 36419 20183 -50818 -10178 -49820 -117546 -101931 -83639
20697h3639J03534M4374m0268J466k9822K9728L072j02137k362k915J7570O4037
$$ -83639 19895 64269 24001 25467 -4355 25373 28445 -73692 -76054 -78969 -61399 2638
20685B638L7591k7824l3127l3975j9286n8197j2173M1835j4417N7576M1183k9997
$$ 2638 40229 12405 -20722 -54697 -73983 -132180 -144353 -102518 -116935 -59359 -18176 -48173
20673d8173P84P7638l3874k7053Q3950P6606j38148r3737l9952L528J6617K2770
$$ -48173 -47389 30249 -3625 -30678 53272 129878 -8270 -102007 -141959 -138431 -121814 -99044
20661i9044J5184K2080O2975M1085k4168K4102j5126o4975p0155Q6203O7614J722
$$ -99044 -83860 -61780 1195 42280 18112 42214 27088 -37887 -108042 -21839 45775 47497
20649D7497j5609o6616n3847R778L8592L8432O2367O2529l4779j8140J4646N2077
$$ 47497 31888 -34728 -88575 -78797 -40205 -1773 60594 123123 88344 70204 84850 136927
20637A36927m6693p0792O576o9890m647R9104o6362R558L7505M2832j9289m9691
$$ 136927 90234 19442 26018 -43872 -48519 50585 -15777 -6219 31286 74118 54829 5138
20625E138l3369k547k9508n0723jJ8015N4051o195l1062K7704q721J4092N4171
$$ 5138 -28231 -30778 -60286 -111009 -111010 -92995 -38944 -45139 -76201 -48497 -57218 -43126 11045
20612A1045r4371k4012O5520L9940j5130K252O7354J0020j08330k3821n1503K5584
$$ 11045 -83326 -107338 -41818 -1878 -17008 -14756 52598 62618 -45712 -69533 -121036 -95452
20600i5452J23803L7308L1818K0465J7061m6848j01530j05675m0014R2758R1187
$$ -95452 28351 65659 97477 117942 135003 88155 -13375 -119050 -159064 -66306 24881
20589B4881K3688j9294j9642r2033J0982M5061L9432j437o9896n33L9724N2995
$$ 24881 48569 29275 9633 -82400 -71418 -26357 13075 11638 -58258 -58791 -19067 33928
20577C3928L0853P0005l4853n9618J2213M5397k3599l8125K3343q4117j3810N0121
$$ 33928 64781 134786 99933 40315 52528 97925 74326 36201 59544 -24573 -38383 11738
20565A1738k4328k584N6035Q9694n5885j28181J1281K6452k1138L5246O9839l8798
$$ 11738 -12590 -15174 40861 130555 74670 -53511 -42230 -15778 -36916 -1670 68169 29371
20553B9371L4138M6846j2706L3825j3317r2374q3003j8656P627l7796n8083o949
$$ 29371 63509 110355 97649 131474 118157 25783 -57220 -75876 -68249 -106045 -164128 -171077
20541a71077M0266j8455K7245O507o650M4825N7806J576N2184M2860j2291n2952
$$ -171077 -130811 -149266 -122021 -115514 -122164 -77339 -19533 -17957 34227 77087 64796 11844
20529A1844n4937J04298K5608n1878K4552L6932J4802p1993Q885L574l6452l2467
$$ 11844 -43093 61205 86813 34935 59487 96419 111221 39228 48113 51687 15235 -17232
20517a7232r183N035O0975N4725n0602o8708k5660K0906N8742l9271k3742M7429
$$ -17232 -26415 -21380 39595 94320 43718 -24990 -50650 -29744 28998 -10273 -34015 13414
20505A3414q469n6114L3567L1187j553j5734p2942J8834J579K8295K9556m2765
$$ 13414 4945 -51169 -17602 13585 12032 -3702 -76644 -57810 -56231 -27936 1620 -41145
20493d1145n2440k501n5513N3872O5568L006P251n7344m6740O3498P7832K5559
$$ -41145 -93585 -96086 -151599 -97727 -32159 -29153 -21902 -79246 -125986 -62488 15344 40903
20481D0903p5078L8633r579l8886R0351m5764k302l355K1944m393l3001j13686
$$ 40903 -34175 4458 -5121 -44007 46344 580 -1722 -5077 16867 12474 -20527 -134213
20469a34213M3065J58494J5976l6365J5884K2438m2899m5259R5767N5144Q768
$$ -134213 -91148 67346 83322 46957 62841 85279 42380 -2879 92888 148032 156800
20458A56800j6562m8933n0244j3982k6759k3794N7788Q573Q120q8994M9556m4083
$$ 156800 140238 91305 41061 27079 320 -23474 34314 42887 51007 -37987 11569 -32514
20446c2514J5283J9089j2744M638n634j057P48O0255n3871j08799m8983l4355
$$ -32514 -17231 1858 -10886 -6248 -11882 -12939 -12191 48064 -5807 -114606 -163589 -197944
20434a97944N3617J21013M3772k18n7089m4226L0013k269m5396Q941N602O5930
$$ -197944 -144327 -23314 20458 20240 -36849 -81075 -51062 -53331 -98727 -89786 -84184 -18254
20422a8254J32377N7539k8196l9723k0403K7505l3335l564l9056l840J3966n4802
$$ -18254 114123 171662 143466 103743 83340 110845 77510 73946 34890 31050 45016 -9786
20410i786l669K9795j2727l9791O2098M7745R601L695q6366j04497K5721o413
$$ -9786 -13455 16340 3613 -36178 25920 73665 83266 86961 595 -103902 -78181 -84594
20398h4594Q645J9902N2134N6711l1818R25K7664M140r79j37L090K1702m7289
$$ -84594 -75949 -56047 -3913 52798 20980 21905 49569 53709 52730 52593 55683 77385 30096
20385C0096q8507J0110P907o4662l3368K1741M0550O3308j0434K9825R6875L0914
$$ 30096 -58411 -48301 -40394 -105056 -138424 -116683 -76133 -12825 -23259 6566 103441 134355
20373A34355N4173n8471p6113o2618n437M754k5891R620m035n09K1586l4178O4175
$$ 134355 188528 130057 53944 -8674 -14111 -9357 -35248 -25628 -29663 -30172 -8586 -42764 21411
20360B1411J5490n4061l5864N1911L3227k6630J4177M842Q4347j0414q6712j2853
$$ 21411 36901 -17160 -53024 -1113 32114 5484 19661 24503 108850 98436 11724 -1129
20348a129L3509M2021m6996K9293L3672k1689n3120j5100k2646n9587J2826q254
$$ -1129 32380 74401 27405 56698 90370 68681 15561 461 -22185 -81772 -68946 -77200
20336g7200P3980M1176K1166j5383L1402l6265L9087P2284n2820k4817n3580j04564
$$ -77200 -3220 37956 59122 43739 75141 38876 77963 150247 97427 72610 19030 -85534
20324h5534l0235J74489N7066m0205k9354o1805k5279p0026o0092j0336K4804
$$ -85534 -115769 58720 115786 75581 46227 -15578 -40857 -110883 -170975 -181311 -156507
20313a56507O9135R3062J7505j7973m0411j4214j7218j1899J4770K7126M1651
$$ -156507 -87372 5690 23195 5222 -35189 -49403 -66621 -78520 -63750 -36624 5027
20302E027N8784p9724K4921K5350M875n8013o8955K6315O5325L785l2802n9277
$$ 5027 63811 -15913 9008 34358 39233 -18780 -87735 -61420 3905 7690 -25112 -84389
20290h4389P589N7991K1087k3921l8073O713K7256l1386L173L9148l7410l4085
$$ -84389 -76800 -18809 2278 -21643 -59716 -53003 -25747 -57133 -53960 -14812 -52222 -86307
20278h6307L725O4405O4989M3923k8377q5888l2054L061p5254M4548O9767Q9066
$$ -86307 -82582 -18177 46812 90735 62358 -23530 -55584 -52523 -127777 -83229 -13462 75604
20266G5604J5710o6563m7737M9151P3605N412k1925l2906j22978l562L4107K739
$$ 75604 91314 24751 -22986 26165 99770 105182 83257 50351 -72627 -76189 -42082 -39343
20254c9343J1100K1265L9412N5956j0344r6008l9254J7294l607j909k0403j4370
$$ -39343 -28243 -6978 32434 88390 78046 -17962 -57216 -39922 -43529 -45438 -65841 -80211
20242h0211O7683N5810K2221o6238o0871P5527L9741M8635o8504j25190R084P2284
$$ -80211 -12528 43282 65503 -735 -61606 13921 53662 102297 33793 -91397 -82313 -10029
20230a0029J169m9393n8359O1570J1603N3219l5121p0413p690M049L6336K4446
$$ -10029 -8860 -58253 -116612 -55042 -43439 9780 -25341 -95754 -103444 -99395 -63059 -38613
20218c8613L7022K6857j6461n5984l2160o057Q9522M4445L0733m0711o5633m2890
$$ -38613 -1591 25266 8805 -47179 -79339 -85396 4126 48571 79304 38593 -27040 -69930
20206f9930j4847m4063n008J26869K8943J967m4717l5322k072k8990l2240J1963
$$ -69930 -84777 -128840 -133848 -6979 21964 23931 -20786 -56108 -58180 -87170 -119410 -107447
20194a07447k8448k8392M3809O2017R0910l3400j32307J5774L3092P6809Q4166
$$ -107447 -135895 -164287 -120478 -58461 32449 -951 -133258 -117484 -84392 -7583 76583
20183G6583N6834p7402l4463k5517K0105N709L9200L4186l1093q1897l5162L8976
$$ 76583 133417 56015 21552 -3965 16140 21849 61049 95235 64142 -17755 -52917 -13941
20171a3941L3397Q9506j21866j2675K7273J1638k4816O655L314K2658O714n6270
$$ -13941 19456 108962 -12904 -25579 1694 13332 -11484 -4829 -1515 21143 27857 -28413
20159b8413K024J7477J8997k6617j7463n8072O412J01717L6997j0469L7505J6460
$$ -28413 -26389 -8912 10085 -16532 -33995 -92067 -85655 16062 53059 42590 80095 96555
20147I6555m5206m7422O3142P8625J0777J5740p4290j0205K3033l5946M749q951
$$ 96555 51349 3927 67069 145694 156471 172211 97921 87716 110749 74803 79552 70601
20135G0601k7431j9015L1753K7114N6641r2322k3913N3786q070Q011K6910J7852
$$ 70601 43170 24155 55908 83022 139663 47341 23428 77214 69144 77155 104065 121917
20123A21917L0673j5061k1119J9206j00131P9844O1712l1953n2371m8947M3566
$$ 121917 152590 137529 116410 135616 35485 115329 177041 145088 92717 43770 87336
20112H7336N1039O0961r886k7428r2473k2980n1447L0931J22058o3586l5182N2926
$$ 87336 138375 199336 189450 162022 69549 46569 -4878 26053 148111 84525 49343 102269
20100A02269R984o2262j6253j0691J9775J1209K168Q420K2539L3537K571m5637
$$ 102269 112253 49991 33738 23047 42822 54031 56199 64619 87158 120695 123266 77629
20088G7629p7874n5105K7899Q1858J25132k7822r7217L0414J0599n4254r348L431
$$ 77629 -245 -55350 -27451 54407 179539 151717 54500 84914 95513 41259 31911 35342
20076C5342n1333o256M1277L5251l1515k3918M9442N8909K4262p525l0055n3584
$$ 35342 -15991 -22247 19030 54281 22766 -1152 48290 107199 131461 123936 93881 40297
20064D0297j0463m695k0702n7149N6852N5277q7446j4911J5303J6058Q5120P8845
$$ 40297 29834 25139 4437 -52712 4140 59417 -28029 -42940 -27637 -11579 73541 152386
20052A52386L843l3028k2864N56o477R4209l0842k4298k8895L0818O1566o0332
$$ 152386 156229 123201 100337 100893 94416 188625 157783 133485 104590 135408 196974 136642
20040A36642q214L2148j16185j33112O9895P1559O5134J4997n9348j8344L0830
$$ 136642 128428 160576 44391 -88721 -18826 52733 117867 132864 73516 55172 86002
20029H6002l541L1885k2554r596k1040r638m4131k5171l897M4889Q3068Q5488
$$ 86002 82461 114346 91792 82196 61156 51518 7387 -17784 -21681 23208 106276 191764
20017A91764L303r2326o3317K7310N1186K4438j7929l3564L3427R369k2566j5688
$$ 191764 195067 102741 39424 66734 117920 142358 124429 90865 124292 133661 111095 95407
20005I5407l2522k5320m2039Q3354Q7464o0843l3368o9526J6967R0088l2230L2510
$$ 95407 62885 37565 -4474 78880 166344 105501 72133 2607 19574 109662 77432 109942
19993A09942L5129J7597l646q9811p6600K0997L7770m0580r4317K7356J09963
$$ 109942 145071 162668 159022 69211 -7389 13608 51378 10798 -83519 -56163 53800
19982E3800p563N4239j763k6116N007o376J2788m0404q8318N0226K0450m8224
$$ 53800 46237 100476 98713 72597 77604 71228 84016 43612 -44706 5520 25970 -22254
19970b2254m3728P3717O8279n521j12940j9481P8540J5273L5548K3838n7360j05589
$$ -22254 -65982 7735 76014 70493 -42447 -61928 16612 31885 67433 91271 33911 -71678
19958g1678j09418j9020Q6016P6840m2345m3116K6659J17414J14472j7377r4662
$$ -71678 -181096 -200116 -114100 -37260 -79605 -122721 -96062 21352 135824 118447 23785
19947B3785p0539M8078K4917k5532q0760n1409P7422J03816N4718M1514k7474
$$ 23785 -46754 1324 26241 709 -80051 -131460 -54038 49778 104496 146010 118536
19936A18536l2287n0716l374m2105N8103K5746q1117N1931L7906m7887j7656j9186
$$ 118536 86249 35533 32159 -9946 48157 73903 -7214 44717 82623 34736 17080 -2106
19924b106J8342N023J5446L0412n4796o5966l6744K7337j6431o0283N1267o265
$$ -2106 16236 21259 36705 67117 12321 -53645 -90389 -63052 -79483 -139766 -88499 -94764
19912i4764j6496l0146L8048L7467J9818j4251L9428L9358J7835K3295l7272k2433
$$ -94764 -111260 -141406 -103358 -65891 -46073 -60324 -20896 18462 36297 59592 22320 -113
19900a13l0178J4716j6489l2316K7408M7368J6015J4731Q672K4869K6376r6682
$$ -113 -30291 -15575 -32064 -64380 -36972 10396 26411 41142 49814 74683 101059 4377
19888D377p5808n8870n12L846L4845Q1601L1421L825l3738l9359L5922M9040N2773
$$ 4377 -71431 -130301 -130813 -126967 -92122 -10521 20900 24725 -9013 -48372 -12450 36590 89363
19875H9363k4608o0204J1972N2668M9904K229l9271j4377j8662o410n2132J1386
$$ 89363 64755 4551 16523 69191 119095 121324 82053 67676 49014 42604 -9528 1858
19863A858L8217K1886R391L1758k3241O3484J7595M1027J7221q6672q5520n3163
$$ 1858 40075 61961 71352 103110 79869 143353 160948 201975 219196 132524 47004 -6159
19851f159j7351M8507m8576K2550N2714j1574K6920J6940O2094n086j5399m6680
$$ -6159 -23510 24997 -23579 -1029 51685 40111 67031 83971 146065 140979 125580 78900
19839G8900n160K9278M6174M0318n653o7014l8790o944N6978n0178k5095K826
$$ 78900 73740 103018 149192 189510 183857 116843 78053 71109 128087 77909 52814 55640
19827E5640j1588j7360n8714l6310L2471M8757Q7040j6520q997l781J5362n088
$$ 55640 44052 26692 -32022 -68332 -35861 12896 99936 83416 74419 70638 86000 80912
19815H0912n2187L350L8772L576j2911o9200p0329K836k054P588K9142N0467O3138
$$ 80912 28725 32075 70847 74423 61512 -7688 -78017 -75181 -77235 -69647 -40505 9962 73100
19802G3100P9166l1950m3976N7235L2827j1110o2233L384M8163j01709l7603J1808
$$ 73100 152266 120316 76340 133575 166402 155292 93059 96443 144606 42897 5294 17102
19790A7102Q0045N2203K7644k369m1739k5833m0178m3177k9455L0307L5247o1860
$$ 17102 97147 149350 176994 174625 132886 107053 66875 23698 -5757 24550 59797 -2063
19778b063k417L0695N607k0474J0537o3222K220P5492O1552j939l1271k1048L9828
$$ -2063 -4480 26215 31822 11348 21885 -41337 -39117 36375 97927 95988 64717 43669 83497
19765H3497M7885K5335j8012k9905K0611R9213m3098j12896q1026j6118K1735
$$ 83497 131382 156717 138705 108800 129411 228624 185526 72630 -8396 -24514 -2779
19754b779j6543j439L9613J9151k4913M7935J5818p7894Q6908J389J8885Q0668
$$ -2779 -19322 -20761 18852 38003 13090 61025 76843 -1051 85857 87246 106131 186799
19742A86799M6638j1662p403j5207j5231k0532o0096o0234L9550L5835L9537j1318
$$ 186799 233437 221775 214372 199165 183934 163402 103306 43072 82622 118457 157994 146676
19730A46676l032L2341l8740l4391n8487j2364O0651P3256r4972q648K5523j2191
$$ 146676 143644 175985 137245 102854 44367 32003 92654 165910 70938 62290 87813 75622
19718G5622K2167K4725p7091J4183l6976L4966N4961O3150j2892m7193J2494m4414
$$ 75622 97789 122514 45423 59606 22630 57596 112557 175707 162815 115622 128116 83702
19706H3702M9766j5372k4160j2240K3898J734n042J2093M436q6252q1835L9061
$$ 83702 133468 118096 93936 81696 105594 107328 102286 114379 118815 32563 -49272 -10211
19694a0211J25292J0163p9657J1891R1994p542r359Q4756L7677o3569k8450K9440
$$ -10211 115081 125244 45587 57478 149472 141930 132571 217327 255004 191435 162985 192425
19682A92425l0358J266N7656M0643l5864r072j2332J2901J5152J809k4360m1630
$$ 192425 162067 163333 220989 261632 225768 216696 204364 217265 232417 234226 209866 168236
19670A68236J765Q9J4788P8407o676o1393l8558r233p2853R691L7187J805j39410
$$ 168236 170001 170090 184878 263285 256609 195216 156658 147425 74572 84263 121450 123255 -16155
19657a6155p9386J76828J1449p4792R718P3407j8762r0901J0575R6425L1746k7243
$$ -16155 -95541 81287 92736 17944 27662 101069 82307 -8594 1981 98406 130152 102909
19645A02909n0249J3132J9418P2624N7886m5762n2770L4197R5915O63q6652p3072
$$ 102909 52660 65792 85210 157834 215720 169958 117188 151385 247300 247963 161311 88239
19633H8239K4733j49961p4879R4930L8196J06783P6919M1796r14k8922k8782J1240
$$ 88239 112972 -36989 -111868 -16938 21258 128041 204960 246756 245842 216920 188138 199378
19621A99378M4798L8937K7154L4846R5977M1505O0824O8476K6863l6440J1820
$$ 199378 244176 283113 310267 345113 441090 482595 543419 611895 638758 602318 614138
19610F14138j0312o4686J4583R2730J19967k3030L3231l323o4673j14890K6666
$$ 614138 603826 539140 553723 646453 766420 743390 776621 773298 708625 593735 620401
19599F20401P3403L3565m1606J1540p4233j16565o7566p5430L9070k0253k8495
$$ 620401 693804 727369 685763 697303 623070 506505 438939 363509 402579 382326 353831
19588C53831j4241j3971l1187k4559k4641j4829j6545k4922P3977M813n8963l5284
$$ 353831 339590 325619 294432 269873 245232 230403 213858 188936 262913 267726 208763 173479
19576A73479l4821P5058p909K0108Q5456J31953J2910J1392M2731J08182J05347
$$ 173479 138658 213716 205807 225915 311371 443324 456234 467626 510357 618539 723886
19565G23886M5639o3216k9967j6825l1207N6641J13686K5394k9294m6503p3453
$$ 723886 769525 706309 676342 659517 628310 684951 798637 824031 794737 748234 674781
19554F74781M1133J23611k0181n2494j16030k4635J16640Q8089m9724j22601j10145
$$ 674781 715914 839525 819344 766850 650820 626185 742825 830914 781190 658589 548444
19543E48444r5988o5595n3254n0328J642k316l7270N9065M2483J3758l5420R095
$$ 548444 452456 386861 333607 283279 284921 282605 245335 304400 346883 360641 325221 334316
19531C34316m7635j4195M7679n7888m5589j2090L5191M3693l218o5880m2930L5770
$$ 334316 286681 272486 320165 262277 216688 204598 239789 283482 280264 214384 171454 207224
19519B07224N4153j4725L824O3706k3029o8254O1794j7498L0636j8285m8157m6168
$$ 207224 261377 246652 250476 314182 291153 222899 284693 267195 297831 279546 231389 185221
19507A85221m140O9612L4563n456p908l4240l7375K2306O4300r7125j25067M5075
$$ 185221 181081 250693 285256 279800 271892 237652 200277 222583 286883 189758 64691 109766
19495A09766M7627Q1224R790O2729Q095j0559j8652J6032n3552j9996l2442j1201
$$ 109766 157393 238617 248407 311136 319231 308672 290020 306052 252500 232504 200062 188861
19483A88861K4205M3276k5986L8224K9814n5752j4568j7346p4502l6193Q3935
$$ 188861 213066 256342 230356 268580 298394 242642 228074 210728 136226 100033 183968
19472A83968P7627j8024k5464L0531J8894N8266k9023L1579j5749r6105r9095
$$ 183968 261595 243571 218107 248638 267532 325798 296775 328354 312605 216500 117405
19461A17405m438O3895O3993K0609m0270J3825k8470L5125j3025j7540l4161P5574
$$ 117405 112967 176862 240855 261464 221194 235019 206549 241674 228649 211109 176948 252522
19449B52522P4837O991m2110o2355R281M3246O8281N101k4433o9260k684N0001
$$ 252522 327359 334350 292240 229885 239166 282412 350693 355794 331361 262101 259417 309418
19437C09418J5613K1190r9257m1587O9918P3698P2093m710j4039k5844o3643M5908
$$ 309418 325031 346221 246964 205377 275295 348993 421086 416376 402337 376493 312850 358758
19425C58758J5732q5819j3833l4091M2562j4107n9754J0372K3582j9583l3834
$$ 358758 374490 288671 274838 240747 283309 269202 209448 219820 243402 223819 189985
19414A89985M9003O2260j3029m6914k8845j0059K2071N2476m226l3400J9816j6318
$$ 189985 238988 301248 288219 241305 212460 202401 224472 276948 272722 239322 259138 242820
19402B42820m5571J0098L7005n0524J8653O2211o1199n9237J06237M4440j14575
$$ 242820 197249 207347 244352 193828 212481 274692 213493 154256 260493 304933 190358
19391A90358m6193P4161n8890M7167L2062l857k23l4589l2057j4653N9355L4280
$$ 190358 144165 218326 159436 206603 238665 234808 234585 199996 167939 153286 212641 246921
19379B46921O3944l0773M3175k1966K2966L1577j6393m4970k7859K6909k1374
$$ 246921 310865 280092 323267 301301 324267 355844 339451 294481 266622 293531 272157
19368B72157O7941M3987l4061j444R4742R4646J59360J53644J90068J04745J03898
$$ 272157 340098 384085 350024 348580 443322 537968 697328 850972 1041040 1145785 1249683
19357A249683M026j89791k23046j26057k6301R9019J43079J29788R3840J15021
$$ 1249683 1253709 1063918 840872 714815 688514 787533 930612 1060400 1154240 1269261
19347A269261J32290N9523K4158j384n0118j05969j80455r2532m5159j20056N755
$$ 1269261 1401551 1461074 1485232 1483848 1433730 1327761 1147306 1054774 1009615 889559 895314
19336H95314N1432N1576R4987R0103J23303m041j10119o0171r4771j72145j21283
$$ 895314 946746 998322 1093309 1183412 1306715 1302674 1192555 1132384 1037613 865468 744185
19325G44185m5121r6016l5687l1802q3020L0917K0505m923q444M6042L0566j8077
$$ 744185 699064 603048 567361 535559 452539 483456 503961 499038 490594 536636 567202 549125
19313E49125q7138n9253L7318k3808M6566j3804J3484m4018j993k4157n221L466
$$ 549125 461987 402734 440052 416244 462810 449006 462490 418472 416479 392322 387101 390567
19301C90567J5001j26742j5524K2008O2443n4299m8362Q5250N6403j9760Q0208
$$ 390567 405568 278826 263302 285310 347753 293454 245092 330342 386745 366985 447193
19290D47193J3652J3436Q6750n1615l2035J1008l5992K1996l6628K6529L9886
$$ 447193 460845 474281 561031 509416 477381 488389 452397 474393 437765 464294 504180
19279E04180Q719l0996k5545k2476m13J17335J0733k9593j3844m7436n975N4572
$$ 504180 512899 481903 456358 433882 433469 550804 561537 531944 518100 470664 464689 519261
19267E19261r4165k652l7903p9218l8295J17824L3413j3992l8610k1903k2985
$$ 519261 425096 422444 384541 305323 267028 384852 418265 404273 365663 343760 320775
19256C20775N8239j2867L0397K6732m5442p8079k8955R2102K9414o790m184k0860
$$ 320775 379014 366147 396544 423276 377834 299755 270800 362902 392316 385526 381342 360482
19244C60482N7871j5962K9474J5525J7702J4218k9217p9367k4368K1296k4008
$$ 360482 418353 402391 431865 447390 465092 479310 450093 370726 346358 367654 343646
19233C43646M358J3966j8177k911L4559l9961L4666J26907j450J2299M4105o81
$$ 343646 348004 361970 343793 340882 375441 335480 370146 497053 495603 507902 552007 551326
19221E51326J8009o6684k2436R1004O4822K8446K4k4122J7754J01439q755m6911
$$ 551326 569335 502651 480215 571219 636041 664487 664511 640389 658143 759582 750827 703916
19209G03916K0591J21445P7420P9823q406q360L6253j04542J7771O5538j3294
$$ 703916 724507 845952 923372 1003195 994789 986429 1022682 918140 935911 1001449 988155
19198I88155k2008j7581M4182j0711R169J8594o0966l0273q3847j00072K2N6759
$$ 988155 966147 948566 992748 982037 991206 1009800 948834 918561 834714 734642 734664 791423
19186G91423l7161O6046J3712k9987J1575j6324k0637J7218N5314J10693l1718
$$ 791423 754262 820308 834020 804033 815608 799284 778647 795865 851179 961872 930154
19175I30154p6851N4848M4854L1885N8352P0538M4064K0657p5760k6061R3861
$$ 930154 853303 908151 953005 984890 1043242 1113780 1157844 1178501 1102741 1076680 1170541
19164A170541R0475R0869J31729N904k5285P8699O8562k0658o540k6778k3031
$$ 1170541 1261016 1351885 1483614 1489518 1464233 1542932 1611494 1590836 1584296 1557518 1534487
19153A534487l3768l0106Q1137K5218j37260J6499M3777J1762M2593k3378l8748
$$ 1534487 1500719 1470613 1551750 1576968 1439708 1456207 1499984 1511746 1554339 1530961 1492213
19142A492213j6569o8059j8471p4969r5249L1169L1840k9178M6611K7164Q8286
$$ 1492213 1475644 1407585 1389114 1314145 1218896 1250065 1281905 1252727 1299338 1326502 1414788
19131A414788O1023q2k3154N6500R1088P0270L6570K7674O2664M1748o097Q129
$$ 1414788 1475811 1475729 1452575 1509075 1600163 1670433 1707003 1734677 1797341 1839089 1832992 1841121
19119A841121R6930J41709J91106J96424J66052J03833J87246K20876K82936L07332
$$ 1841121 1938051 2079760 2270866 2467290 2633342 2737175 2924421 3145297 3428233 3735565
19109C735565L73608L39961K28780J96154K87578L60944M91562N11764O67424
$$ 3735565 4109173 4449134 4677914 4874068 5161646 5522590 6014152 6525916 7193340
19100G193340R30155J119944J442582J960677K660418M115309P223519J2151192
$$ 7193340 8123495 9243439 10686021 12646698 15307116 19422425 26645944 38797136
19092C8797136J6949670J6054712J1575820M195628r148443p920967L364691J2126333
$$ 38797136 55746806 71801518 83377338 87572966 78424523 70503556 73868247 85994580
19084H5994580J3306184J2084588P787460r91636m98478J235754j751027j4333683
$$ 85994580 99300764 111385352 119172812 118181176 117682698 118918452 117167425 102833742
19076A02833742j3660404j212044Q197895Q351392L818105n713228k0724458k0113749
$$ 102833742 89173338 87961294 96159189 104510581 108328686 102615458 81891000 61777251
19068F1777251j2406825p262653m537790l248427k349055j883618j596062j198601
$$ 61777251 49370426 42107773 37569983 34321556 31972501 30088883 28492821 27294220
19060B7294220p70494m61809m33286m74631l36275k61989j91780p2161m0787K24055
$$ 27294220 26523726 26061917 25628631 25154000 24817725 24555736 24363956 24291795 24251008 24475063
19050B4475063Q02548J312089J763937K495610L751796O617986J1971359J8508009
$$ 24475063 25277611 26589700 28353637 30849247 34601043 41219029 53190388 71698397
19042G1698397J9542322J4524705P752164q740949j2631182M2535J2062038J5575225
$$ 71698397 91240719 105765424 113517588 104776639 92145457 92187992 104250030 119825255
19034A19825255J3852723J1004408R37497l26691J630364O80553j3499996k0317926
$$ 119825255 133677978 144682386 145619883 145293192 146923556 147604109 134104113 113786187
19026A13786187o704928P094191J0994466O094677k082667k0473279k6203070
$$ 113786187 107081259 114175450 125169916 131264593 129181926 108708647 82505577
19019H2505577j7637198j0393474o335109m397838l298641k701727k490926k165747
$$ 82505577 64868379 54474905 48139796 43741958 40443317 37741590 35250664 33084917
19011C3084917j695071j259806r54655q05571q11118r49460r01449q29526q41814
$$ 33084917 31389846 30130040 29175385 28369814 27558696 26609236 25707787 24878261 24036447
19002B4036447q55762p27384o15726n77902n23516n86732r46213j084467q96417
$$ 24036447 23180685 22453301 21837575 21259673 20736157 20149425 19203212 18118745 17222328
18993A7222328p29337n85982n20948m39223l96520l52980k79189k07871k69180
$$ 17222328 16492991 15907009 15386061 14946838 14550318 14197338 13918149 13710278 13441098
18984A3441098j72182k72742k76932l54482k86104k01844j84690j37015j35171
$$ 13441098 13268916 12996174 12719242 12364760 12078656 11876812 11692122 11555107 11419936
18975A1419936j07908k32686k24715k07285k64363k03494r4874O9098O3292j6190
$$ 11419936 11312028 11079342 10854627 10647342 10382979 10179485 10084611 10153709 10217001 10200811
18965A0200811m8709k21425k83197k57976j43047q8191o1868N1330n7395j08680
$$ 10200811 10152102 9930677 9647480 9389504 9246457 9158266 9096398 9147728 9090333 8981653
18955H981653k131N652J67400J63602Q8052K7414k4896j18288l30606m62003m24651
$$ 8981653 8979522 8985174 9152574 9316176 9404228 9431642 9406746 9288458 8957852 8495849 8071198
18944H071198l82875k78980j43763j67523j44496j94848j50096j06419q7673j39080
$$ 8071198 7688323 7409343 7265580 7098057 6953561 6758713 6608617 6502198 6414525 6275445
18934F275445j84172j10580j83360j05911p8761j23538j09175n4491n6800p9335
$$ 6275445 6091273 5980693 5797333 5691422 5612661 5489123 5379948 5325457 5268657 5189322
18924E189322n068p0435j53160l9498M620k5047M8469L70l3143L8640K6950m2276
$$ 5189322 5184254 5113819 4960659 4921161 4925781 4900734 4949203 4949573 4916430 4955070 4982020 4939744
18912D939744k2717L6978K2229R7547N5080j29297l1397M9853O5441l3998r4262
$$ 4939744 4917027 4954005 4976234 5073781 5128861 4999564 4968167 5018020 5083461 5049463 4955201
18901D955201N156J1786K3636L0348n6904j47765k12140p2914m0116M5530m0986
$$ 4955201 4960357 4972143 4995779 5026127 4969223 4821458 4609318 4536404 4496288 4541818 4500832
18890D500832q8831q585m0417O3947J39118k4920j18979r0718n5889k9277r2402
$$ 4500832 4412001 4403416 4362999 4426946 4566064 4541144 4422165 4331447 4275558 4246281 4153879
18879D153879J1045Q1800J85359J48863J11357M9288M8393J06018Q7663K17530
$$ 4153879 4164924 4246724 4432083 4580946 4692303 4741591 4789984 4896002 4983665 5201195
18869E201195L91714L72423L20939J41331R3256J21914j04918p3613J82176N52726
$$ 5201195 5592909 5965332 6286271 6427602 6520858 6642772 6537854 6464241 6646417 7199143
18859G199143P09387P56249P44813P15982N62697N63220N11511M02701O77886
$$ 7199143 7908530 8664779 9409592 10125574 10688271 11251491 11763002 12165703 12843589
18850A2843589Q39532J081898J492557K032123K875964M485127P006175J1613890
$$ 12843589 13683121 14765019 16257576 18289699 21165663 25650790 32656965 44270855
18842D4270855J8288825K4532876K6701873K6171152J7350039j149058j0025787
$$ 44270855 62559680 87092556 113794429 139965581 157315620 156166562 146140775
18835A46140775j7382548k3650185j5430369k264539R647123J9374795K4194415
$$ 146140775 128758227 105108042 89677673 87413134 97060257 116435052 140629467
18828A40629467K6781071K4866218J5012182J2899514R590434Q69770o525942
$$ 140629467 167410538 192276756 207288938 220188452 229778886 230648656 224122714
18821B24122714j7249073k0496404k5828916k8944944j8643899m913928P366450
$$ 224122714 206873641 186377237 160548321 131603377 112959478 108045550 115412000
18814A15412000J6420081J9354440J8723024R356462q298192j5792659k1755685
$$ 115412000 131832081 151186521 169909545 179266007 170967815 155175156 133419471
18807A33419471k7573944k2030819j3858116q880123o190507m585235l660492
$$ 133419471 105845527 83814708 69956592 61076469 54885962 50300727 46640235
18800D6640235l048768k411744j747118j446331j319650j290747j384527j478880
$$ 46640235 43591467 41179723 39432605 37986274 36666624 35375877 33991350 32512470
18792C2512470j310368j181507j174036j082985j019549q57362p68216q10473
$$ 32512470 31202102 30020595 28846559 27763574 26744025 25886663 25118447 24307974
18784B4307974p43889p53180p79511o78218o44241o65260o06975m81554l39263
$$ 24307974 23564085 22810905 22031394 21353176 20708935 20043675 19436700 18955146 18615883
18775A8615883l08004l55314l83213l99359m98216m92672m23131k89701k87039
$$ 18615883 18307879 17952565 17569352 17169993 16671777 16179105 15755974 15466273 15179234
18766A5179234k33148l26962n40536m85301m20212l61424k84790l37483l66871
$$ 15179234 14946086 14619124 14078588 13593287 13173075 12811651 12526861 12189378 11822507
18757A1822507k74216j70812k4576p2956l02938l17337k54272k65467k15623j86960
$$ 11822507 11548291 11377479 11352903 11279947 10977009 10659672 10405400 10139933 9924310 9737350
18747I737350j16771q2993j93858k03146k59430k66352k41228j79210j24002j10241
$$ 9737350 9620579 9537586 9343728 9140582 8881152 8614800 8373572 8194362 8070360 7960119
18737G960119q5290j32143k60983k38543j90455j26497k7917j6245p7459j27265
$$ 7960119 7874829 7742686 7481703 7243160 7052705 6926208 6898291 6882046 6804587 6677322
18727F677322j64650k31553r8484o2503j36510k19889j07996j3146l7036M8882
$$ 6677322 6512672 6281119 6182635 6120132 5983622 5763733 5655737 5642591 5605555 5654437
18717E654437j1875j1879P509Q8025J5306n1378q3666j71694j71155j09501o6427
$$ 5654437 5642562 5630683 5638192 5726217 5741523 5690145 5606479 5434785 5263630 5154129 5087702
18706E087702J7064M6610J99855K70487J33198Q5591N0080r700p0473l7270L1608
$$ 5087702 5104766 5151376 5351231 5621718 5754916 5840507 5890587 5880887 5810414 5773144 5804752
18695E804752m9281j33098j86785j59937n3714n8136r1309R013O2834L2674j6188
$$ 5804752 5755471 5622373 5435588 5275651 5221937 5163801 5072492 5081505 5144339 5177013 5160825
18684E160825j44490k83501k79064j55779K7181O2573m0932j31534j60482j46983
$$ 5160825 5016335 4732834 4453770 4297991 4325172 4387745 4346813 4215279 4054797 3907814
18674C907814j90134j00856o8250P42q2200r1114q8944j08430l9085M2781m6189
$$ 3907814 3717680 3616824 3548574 3549316 3467116 3376002 3287058 3178628 3139543 3182324 3136135
18663C136135p9562K3548N2985o826L9189l8183o0062l8841M3629J8300K1865
$$ 3136135 3056573 3080121 3133106 3126280 3165469 3127286 3067224 3028383 3072012 3090312 3112177
18652C112177K4951o613q4696p0170J7730L811M4846N6868K9284j50450j10464
$$ 3112177 3137128 3130515 3045819 2975649 2993379 2997190 3042036 3098904 3128188 2977738 2867274
18641B867274q4215n6707n6290p8650m7736p2739j78491j27906q8198l866N4354
$$ 2867274 2783059 2726352 2670062 2591412 2543676 2470937 2292446 2164540 2076342 2072476 2126830
18630B126830k7316m1159P947j21105n3147K5463N7212L6552M5984L4132r7227
$$ 2126830 2099514 2058355 2066302 1945197 1892050 1917513 1974725 2011277 2057261 2091393 1994166
18619A994166N6234J5338M65j2758m1067l4649M0807j1961l8746K5665N4330l9805
$$ 1994166 2050400 2065738 2066203 2053445 2012378 1977729 2018536 2006575 1967829 1993494 2047824 2008019
18607B008019n3554P4754K6599J0073l8687p9252m8546K7283m7887n0091o7907
$$ 2008019 1954465 2029219 2055818 2065891 2027204 1947952 1899406 1926689 1878802 1828711 1760804
18596A760804q7530O6172P1093j0988k0752j01147l3605k7321J0376j3643L3610
$$ 1760804 1673274 1739446 1810539 1799551 1778799 1677652 1644047 1616726 1627102 1613459 1647069
18585A647069l4759k2302L6792J6131M6764J08184p886O5148L7111J0929l4452
$$ 1647069 1612310 1590008 1626800 1642931 1689695 1797879 1789993 1855141 1892252 1903181 1868729
18574A868729R681Q0547O8070R3439J78529K57221J80401J63201o6172j91186
$$ 1868729 1878410 1958957 2027027 2120466 2298995 2556216 2736617 2899818 2833646 2642460
18564B642460k8507N8217O0847m461k7155p2412J4380j8794n5484o7004p4403
$$ 2642460 2613953 2672170 2733017 2728556 2701401 2628989 2643369 2624575 2569091 2502087 2427684
18553B427684j22004m5775k6379j12850L1420J7276P2625R2522j922m9859n2499
$$ 2427684 2305680 2259905 2233526 2120676 2152096 2169372 2241997 2334519 2332597 2282738 2230239
18542B230239j9790k598n3660J7998M6317m7580N1216R3425J28840P6462N1032
$$ 2230239 2210449 2207851 2154191 2172189 2218506 2170926 2222142 2315567 2444407 2520869 2571901
18531B571901Q7125R9887P7234J25601J63726K08504K34744L13796J51376K26045
$$ 2571901 2659026 2758913 2836147 2961748 3125474 3333978 3568722 3882518 4033894 4259939
18521D259939K33913J87143K51762K54425J58236P1042K4280k688M3488L6835
$$ 4259939 4493852 4680995 4932757 5187182 5345418 5416460 5440740 5438052 5481540 5518375
18511E518375J43414K05957K34957M02318M43815K87981L17507N98524R31410
$$ 5518375 5661789 5867746 6102703 6505021 6948836 7236817 7554324 8152848 9084258
18502I084258J391964K068629K803040L992550O221790J0248257J6319773K1628615
$$ 9084258 10476222 12544851 15347891 19340441 25562231 35810488 52130261 73758876
18494G3758876K2167820K1663065J1716636o595658j0953355j8413319k4664477
$$ 73758876 95926696 117589761 129306397 122710739 111757384 93344065 68679588
18487F8679588j7845638j0721141o650791m499319l214977k442041j952769j441778
$$ 68679588 50833950 40112809 33462018 28962699 25747722 23305681 21352912 19911134
18479A9911134r79502q28025o62198n26367k15757k15141k26755r6862j27929
$$ 19911134 18931632 18103607 17441409 16915042 16699285 16484144 16257389 16160527 16032598
18470A6032598j96763j57458l23068l35399l47583l42466l2064J07998J23181
$$ 16032598 15835835 15678377 15355309 15019910 14672327 14329861 14297797 14405795 14528976
18461A4528976K38667J46329J70850K21386L08201N45060Q47086J166213J735462
$$ 14528976 14767643 14913972 15084822 15306208 15614409 16159469 17006555 18172768 19908230
18452A9908230K420124L362067M753958P136670J1157508J7573040K5725841L2643182
$$ 19908230 22328354 25690421 30444379 37581049 48738557 66311597 92037438 124680620
18444A24680620M0827838M3902861K9707008K2359334M808239k8988971l2887484
$$ 124680620 165508458 209411319 239118327 261477661 266285900 237296929 204409445
18437B04409445l6446641m1281460k9861636j8413941j1912347q337134o249675
$$ 204409445 167962804 126681344 96819708 78405767 66493420 58156286 51906611
18430E1906611m875172l910118l192633k595545k184674j846347j404369j109341
$$ 51906611 47031439 43121321 39928688 37333143 35148469 33302122 31897753 30788412
18422C0788412r77651r78228q89424q44100p88441n60511m83704l76372j50999
$$ 30788412 29810761 28832533 27943109 27099009 26310568 25750057 25266353 24889981 24738982
18413B4738982M0583K49022J51840l1407j13039l75058l16425r4020O5992K37571
$$ 24738982 24779565 25028587 25180427 25149020 25035981 24660923 24344498 24250478 24316470 24554041
18403B4554041O28585J158129J603250K305386L311283M960551P666436J2562428
$$ 24554041 25182626 26340755 27944005 30249391 33560674 38521225 46187661 58750089
18395E8750089K0541316K9206728L2276212L1307931K2673808k802547j5772184
$$ 58750089 79291405 108498133 140774345 172082276 194756084 191953537 176181353
18388A76181353k2188220l2633072k6319368j4659716o376316K5660O367012J3184219
$$ 176181353 153993133 121360061 95040693 80380977 74004661 74030321 80397333 93581552
18380I3581552J7301839J8289146J7493581Q940100J926662j848404m920559j3168944
$$ 93581552 110883391 129172537 146666118 155606218 157532880 155684476 150763917 137594973
18372A37594973j6439993j2277381j2966430j4139292r149159l429215J505320
$$ 137594973 121154980 108877599 95911169 81771877 72622718 69193503 70698823
18365G0698823N676730O729325M246095o8428p783965j1837874r273202n781905
$$ 70698823 76375553 83104878 87350973 87282545 79498580 67660706 58387504 52605599
18357E2605599l507932k468100j920143j460757j194869r60451m41180M95053
$$ 52605599 49097667 46629567 44709424 43248667 42053798 41093347 40652167 41147220
18349D1147220J720635L049431L873834L358947K390523J43895j756200k9081
$$ 41147220 42867855 45917286 49791120 53150067 55540590 55684485 53928285 53899204
18341E3899204L072371O652592J0414273J2618621J2084458J0929707Q985653
$$ 53899204 56971575 63624167 74038440 86657061 98741519 109671226 118656879
18334A18656879J1974158K4453200L5817549M0938158L4402851J5657899J798580
$$ 118656879 130631037 155084237 190901786 231839944 266242795 281900694 283699274
18327B83699274p870735m919963k909035O26068k488362j2397397j0042672p404564
$$ 283699274 275828539 270908576 267999541 268625609 266137247 253739850 243697178 236292614
18319B36292614r510232k0749452k4299466k4977338k5428494j9345499j2223204
$$ 236292614 226782382 206032930 181733464 156756126 131327632 111982133 99758929
18312I9758929o636104k324363O9151j22603j398154m604788p998502o818130
$$ 99758929 93122825 90798462 90867613 90745010 89346856 84742068 76743566 69925436
18304F9925436m495801k908977j667117r95194q59206o25201n32129o32968l46359
$$ 69925436 65429635 62520658 60853541 59858347 58999141 58373940 57841811 57208843 56862484
18295E6862484L35955J510396L384632O446155J0841973J4909613J4794470J0542557
$$ 56862484 57198439 58708835 62093467 68539622 79381595 94291208 109085678 119628235
18287A19628235L186348p895251j0643184l258409O548655J3819900J7822277
$$ 119628235 122814583 114919332 104276148 101017739 107566394 121386294 139208571
18280A39208571K3190283K5740906K5050019K7173060K3613492K522528k0685341
$$ 139208571 162398854 188139760 213189779 240362839 263976331 266498859 245813518
18273B45813518l0808108l9282806l8850062k6834135j6628285j0664513p299324
$$ 245813518 215005410 175722604 136872542 110038407 93410122 82745609 75446285
18266G5446285n039158l268963j515018O16618K506499K523494J048583j472916
$$ 75446285 70407127 67138164 65623146 66239764 68746263 71269757 72318340 70845424
18258G0845424n866362o829544m704590k821649j993800j635790j404277j268726
$$ 70845424 64979062 58149518 53444928 50623279 48629479 46993689 45589412 44320686
18250D4320686j213310j036441n10559j47102J61014N82571R39901J319653K196694
$$ 44320686 43107376 42070935 41560376 41413274 41574288 42156859 43096760 44416413 46613107
18241D6613107L919786O873845J2146139J8811069K2405396J8704763J1165455
$$ 46613107 50532893 57406738 69552877 88363946 110769342 129474105 140639560
18234A40639560k865933j4909422q207113O156808J3924523J1603287M140840
$$ 140639560 137773627 122864205 114657092 120813900 134738423 146341710 150482550
18227A50482550j1901505k3967644j7949671o470112L929874J3111879J7532955
$$ 150482550 138581045 114613401 96663730 90193618 94123492 107235371 124768326
18220A24768326J4337746P511970n918403j5509028p627717N539574J1364876
$$ 124768326 139106072 146618042 140699639 125190611 117562894 123102468 134467344
18213A34467344Q181295N8323j6369592k5923073k0028046j2450965p812111n152842
$$ 134467344 142648639 142706962 126337370 100414297 80386251 67935286 60123175 54970333
18205E4970333l520222k539760k074908j762634j569761j531679j526995j250018
$$ 54970333 51450111 48910351 46835443 45072809 43503048 41971369 40444374 39194356
18197C9194356p99156o25211l72617j22905q5156j6509L30167J064801K367701
$$ 39194356 38395200 37769989 37397372 37274467 37189311 37172802 37502969 38567770 40935471
18188D0935471M619925Q019548J2404727J4823868J2287466P295412k148823j0806647
$$ 40935471 45555396 53574944 65979671 80803539 93091005 100386417 98237594 87430947
18180H7430947o490831K984368Q029316O692090K215296p557498j5020929j1020640
$$ 87430947 80940116 83924484 91953800 98645890 100861186 93303688 78282759 67262119
18172F7262119l638918L117019R323742J2172762R921020N430748l898177j1012101
$$ 67262119 63623201 66740220 76063962 88236724 98157744 103588492 99690315 88678214
18164H8678214n680449L267631P166537M848933l54456j0922337j7199817j3383700
$$ 88678214 82997765 86265396 93431933 98280866 97926410 87004073 69804256 56420556
18156E6420556q232862n238401l433283k276764j727648j436290j328620j309537
$$ 56420556 48187694 42949293 39516010 37239246 35511598 34075308 32746688 31437151
18148C1437151j290555j127102r02718p35591p15446n80759o06392o57942o77939
$$ 31437151 30146596 29019494 28116776 27381185 26665739 26084980 25478588 24820646 24142707
18139B4142707p24078n99526m39482l71385m35070n63420m54703n52580m60112
$$ 24142707 23418629 22819103 22379621 22008236 21573166 21009746 20555043 20002463 19542351
18130A9542351k77398r2480j62718l9840o6893j3498Q4270J24826J47345L40841
$$ 19542351 19264953 19172473 19009755 18969915 18903022 18889524 18973794 19098620 19245965 19586806
18120A9586806L39734M28151O21112R12148J217061J697952K250962L208157O028527
$$ 19586806 19926540 20354691 20975803 21887951 23105012 24802964 27053926 30262083 36290610
18111C6290610J1802410K0242841K3500454J5647763Q964017j4249427l0685719
$$ 36290610 48093020 68335861 91836315 107484078 116448095 102198668 71512949
18104G1512949k0172551j0965734o484090m324654l078526k167800j682099j372821
$$ 71512949 51340398 40374664 33890574 29565920 26487394 24319594 22637495 21264674
18096B1264674j018439p44858n88030n75087n63969m24166l20638p3374J8306
$$ 21264674 20246235 19501377 18913347 18338260 17774291 17350125 17029487 16956113 16974419
18087A6974419j57397l67186n52606n76050m73415m40175l78192k02463J10604
$$ 16974419 16817022 16449836 15897230 15321180 14847765 14407590 14029398 13826935 13937539
18078A3937539J86194J80063M26347N70978O69533R95578J163725J159151P37112
$$ 13937539 14123733 14303796 14730143 15301121 15970654 16966232 18129957 19289108 20026220
18069B0026220K10764k98371m47423m48331l59091l70651l17648j55667R0482
$$ 20026220 20236984 19938613 19491190 19042859 18683768 18313117 17995469 17839802 17930284
18060A7930284M44681Q73569J253254K031220L559564O084786R502896J1639550
$$ 17930284 18374965 19248534 20501788 22533008 26092572 32177358 41680254 53319804
18052E3319804J0130174P138101O34009m205764J398297J1182974J8672477J7501487
$$ 53319804 63449978 70588079 71222088 67016324 68414621 79597595 98270072 115771559
18044A15771559J0730954j353623j9147445j9198502p706140J776912M887158
$$ 115771559 126502513 125148890 106001445 86802943 79096803 80873715 85760873
18037H5760873K748877k178721j2262757j6010912j1414374p055600m465912k978930
$$ 85760873 88509750 86331029 74068272 58057360 46642986 39587386 35121474 32142544
18029C2142544k037094j517832j221284r88271q27088q08536o39342l17027q8705
$$ 32142544 30105450 28587618 27366334 26378063 25550975 24742439 24103097 23786070 23697365
18020B3697365J16246K17126M14884N52822P85782J098325J633594K675820M429216
$$ 23697365 23813611 24030737 24445621 24998443 25784225 26882550 28516144 31191964 35621180
18011C5621180O887052R437658J0250131Q528434N976477K43627o79932N710503
$$ 35621180 42508232 51945890 62196021 70724455 76700932 76944559 76264627 81975130
18003H1975130J2120730J6718731K1350944K2286907J9925187J6601899O808358
$$ 81975130 94095860 110814591 132165535 154452442 174377629 190979528 197787886
17996A97787886m430950j6283579k2270373k1224576k1358146j8741280j0409881
$$ 197787886 193356936 177073357 154802984 133578408 112220262 93478982 83069101
17989H3069101l181990P79320Q17541j089710n717003j0591841r549435o588874
$$ 83069101 79887111 80666431 81483972 80394262 74677259 64085418 54535983 47947109
17981D7947109m539855l436508k751765k086214j542407j229706j039529q41888
$$ 47947109 43407254 39970746 37218981 35132767 33590360 32360654 31321125 30479237
17973C0479237n22618l24375k63618j85307j93320o3261K24988M61273O14497
$$ 30479237 29956619 29632244 29368626 29183319 28989999 28926738 29151726 29612999 30227496
17964C0227496Q41786J453245K526196M259955O395149P147865N569375L479469
$$ 30227496 31069282 32522527 35048723 39308678 45703827 52851692 58421067 61900536
17956F1900536j581863l348355J419556P545220J0858219Q381998M124114n176996
$$ 61900536 60318673 56970318 58389874 65935094 76793313 85175311 89299425 84122429
17948H4122429j3936007j0269034l301909J043584J322242j68667l688036q736811
$$ 84122429 70186422 59917388 56615479 57659063 58981305 58812638 55124602 46387791
17940D6387791q408137n740810l692858k496707j818497j359753j011073q19508
$$ 46387791 37979654 32238844 28545986 26049279 24230782 22871029 21859956 21040448
17932B1040448o51164n70845o02601o05888m27672l18763l34086m79169l87856
$$ 21040448 20389284 19818439 19215838 18609950 18182278 17863515 17529429 17050260 16662404
17923A6662404k38041j99680j69565M0561J41280J13972m9358j56874j57630k47228
$$ 16662404 16424363 16224683 16055118 16095679 16236959 16350931 16301573 16144699 15987069 15739841
17913A5739841l96950l07293l02581l57768m36031m74074l50558k60327l50936
$$ 15739841 15342891 15035598 14733017 14375249 13939218 13465144 13114586 12854259 12503323
17904A2503323k87778j62499k95485m68920l60759k39446k17127j75945j3052
$$ 12503323 12215545 12053046 11757561 11288641 10927882 10688436 10471309 10295364 10282312
17895A0282312j33565k52153k45206k61645k16937k05368k84366k56611j13155
$$ 10282312 10148747 9896594 9651388 9389743 9172806 8967438 8683072 8426461 8313306
17886H313306j48048r5412l4740n0900n0968m2584j7152j2659K5036J20848Q9317
$$ 8313306 8165258 8069846 8035106 7984206 7933238 7890654 7873502 7860843 7885879 8006727 8096044
17875H096044P7098J41104N7309o562l4647j54786o9447P0455J74668J9738L2817
$$ 8096044 8173142 8314246 8371555 8364993 8330346 8175560 8106113 8176568 8351236 8370974 8403791
17864H403791J9421r1719j73624j55027k46709l23124l15191j35005q2606k16181
$$ 8403791 8423212 8331493 8157869 8002842 7756133 7433009 7117818 6982813 6900207 6684026
17854F684026k69637k5377r0244j32039j81855m6716o5503J5596l4727k8781m0429
$$ 6684026 6414389 6389012 6298768 6166729 5984874 5938158 5872655 5888251 5853524 5824743 5784314
17843E784314n6761l1105K9108J15211N4315k8852L7902J61604Q2824O9429J7500
$$ 5784314 5727553 5696448 5725556 5840767 5895082 5866230 5904132 6065736 6148560 6217989 6235489
17832F235489O8852P9496J41653K47553K17519K42334J60593J10822J96170K73932
$$ 6235489 6304341 6383837 6525490 6773043 6990562 7232896 7393489 7504311 7700481 7974413
17822G974413M54868O84237P43771Q12412P56827O45345O15289P08066R00772
$$ 7974413 8429281 9113518 9857289 10669701 11426528 12071873 12687162 13395228 14296000
17813A4296000J239562J685889K175566L152469N040855P159729Q865933R327831
$$ 14296000 15535562 17221451 19397017 22549486 27590341 34750070 43616003 52943834
17805E2943834Q530389M622171K56877r90129p53471K762581J0654114K1573627
$$ 52943834 61474223 66096394 66353271 65363142 64609671 67372252 78026366 99599993
17797I9599993L3930560M4215220M3191925K7238813P229582j9664848k8432127
$$ 99599993 133530553 177745773 220937698 248176511 255406093 235741245 207309118
17790B07309118n667701K4532082M3247781M2588712K9474474j566835l3624674
$$ 207309118 201641417 226173499 269421280 312009992 341484466 339917631 306292957
17783C06292957l8314771l0981870k9070018l2649789l0347429k0878451j1052978
$$ 306292957 267978186 236996316 207926298 175276509 144929080 124050629 112997651
17776A12997651l564953K027736M741788L666563m44991p321465j3981227j3979481
$$ 112997651 109432698 111460434 116202222 119868785 119423794 112102329 98121102 84141621
17768H4141621j0069946o589541m198798k828052k159198j724553j385699j225424
$$ 84141621 74071675 67482134 63283336 60455284 58296086 56571533 55185834 53960410
17760E3960410r59934m23750M90443J625618L507877O139446R841537J2866084
$$ 53960410 53000476 52576726 53067169 54692787 58200664 64340110 74181647 87047731
17752H7047731J3187067J1654302Q565405O206335R705349J3196576J1540638
$$ 87047731 100234798 111889100 120454505 126660840 136366189 149562765 161103403
17745A61103403M668777m951795m713747J0231771K7774267L4182211L0723492
$$ 161103403 165772180 160820385 156106638 166338409 194112676 228294887 259018379
17738B59018379J7219181r614555j6345358n849259L257901O577193o63487j2713686
$$ 259018379 276237560 266623005 250277647 244428388 247686289 254263482 253599995 240886309
17730B40886309l1983351m0114223k9467905j8795067j4191159j2862211j0389729
$$ 240886309 208902958 168788735 139320830 120525763 106334604 93472393 83082664
17723H3082664p579711n428499l933469k880053j924833p08584M54284P45952
$$ 83082664 75502953 70074454 66140985 63260932 61336099 60627515 61081799 61827751
17715F1827751l0878j513500l924260n294072m439775l218085k340671j810316
$$ 61827751 61796873 60283373 56359113 51065041 46625266 43407181 41066510 39256194
17707C9256194j594308j465059j356711j170214j075903r46206r86165q68810
$$ 39256194 37661886 36196827 34840116 33669902 32593999 31647793 30661628 29792818
17699B9792818q28026p68872p54644p46836p03434p25065p39769o84942n98069
$$ 29792818 28964792 28195920 27441276 26694440 25991006 25265941 24526172 23841230 23243161
17690B3243161n13272n06731n64541m90023n29725m89180m45418m60936l92725
$$ 23243161 22729889 22223158 21658617 21168594 20638869 20149689 19704271 19243335 18850610
17681A8850610m17489l91069l72790l76575m09398l39759k36772k82457k53728
$$ 18850610 18433121 18042052 17669262 17292687 16883289 16543530 16306758 16024301 15770573
17672A5770573q4412p4502o1817j4500j44964k33476l13580l18025j49046L5399
$$ 15770573 15686161 15611659 15549842 15535342 15390378 15156902 14843322 14525297 14376251 14411650
17662A4411650K6024r2092j87690m66735n20875m51967l74590l11376k51263k20072
$$ 14411650 14437674 14345582 14157892 13691157 13170282 12718315 12343725 12032349 11781086 11561014
17652A1561014j57623j74644j92726k06851j62239k24238k04871k83081k73517
$$ 11561014 11403391 11228747 11036021 10829170 10666931 10442693 10237822 9954741 9681224
17643I681224k44448k58024k26141k87827k93731j82335k03515j51324j39804
$$ 9681224 9436776 9178752 8952611 8664784 8371053 8188718 7985203 7833879 7694075
17634G694075j13039n4930n7194k4072k0242j4993o7838j47043q9855K0902k5570
$$ 7694075 7581036 7526106 7468912 7444840 7424598 7409605 7341767 7194724 7104869 7125771 7100201
17623G100201L3212J0490k1968l1789n0238j42235j49094P0525O3895O5553l43
$$ 7100201 7133413 7143903 7121935 7090146 7039908 6897673 6748579 6819104 6882999 6948552 6948209
17612F948209j03021k32220j51913m0941n3280n5820j06026j32493j85907k12443
$$ 6948209 6845188 6612968 6461055 6420114 6366834 6311014 6204988 6072495 5886588 5674145
17602E674145j42612j15120j78510k14978j46505j36081j38719r7305m6344n6715
$$ 5674145 5531533 5416413 5237903 5022925 4876420 4740339 4601620 4504315 4457971 4401256
17592D401256r2606o9234j03946j8756o8147j68921n6364p2490m5902K8977K087
$$ 4401256 4308650 4239416 4135470 4116714 4048567 3879646 3823282 3750792 3704890 3733867 3735954
17581C735954j13933j48451m7131q364m0382l6361p3788p042J9164q388Q526l6062
$$ 3735954 3622021 3473570 3426439 3418075 3377693 3341332 3267544 3260502 3279666 3271278 3279804 3243742
17569C243742l7931o2797j15870r2533j4079r690p9135j07135L5308l3481p5659
$$ 3243742 3205811 3143014 3027144 2934611 2920532 2910842 2831707 2724572 2759880 2726399 2650740
17558B650740j11532l9323o2243o9437L2496l9227q8758k7894K4852j6620q8146
$$ 2650740 2539208 2499885 2437642 2368205 2400701 2361474 2272716 2244822 2269674 2253054 2164908
17547B164908q3222k6826p327M2291N795k5751l9305R2870K7790k7446K1014j4766
$$ 2164908 2081686 2054860 2047533 2089824 2095619 2069868 2030563 2123433 2151223 2123777 2144791 2130025
17535B130025j7225P9207N1743m6482j72971j18488k6248n7836K0122Q0810l9116
$$ 2130025 2112800 2192007 2243750 2197268 2024297 1905809 1879561 1821725 1841847 1922657 1883541
17524A883541j92784j10632p6372k8265k9007j03037j3005L7796l692L7147j00201
$$ 1883541 1690757 1580125 1503753 1475488 1446481 1343444 1330439 1368235 1364543 1401690 1301489
17513A301489l1973p1676m3290l9790L6513L749L1101L8394k9038q3573L4583
$$ 1301489 1269516 1197840 1154550 1114760 1151273 1155022 1186123 1224517 1195479 1111906 1146489
17502A146489O780J776N7210K3268o3484n6108K9150Q8645R3991J63561M1815
$$ 1146489 1153269 1155045 1212255 1235523 1172039 1115931 1145081 1233726 1327717 1491278 1533093
17491A533093m8634j0095J5104P5486J29547J15276K9347j30765j38456q3379
$$ 1533093 1484459 1474364 1489468 1564954 1694501 1809777 1839124 1708359 1569903 1486524
17481A486524o8758o1255j0190l0339m3531o3336o6684j09383j26043l8800o814
$$ 1486524 1417766 1356511 1346321 1315982 1272451 1209115 1142431 1033048 907005 868205 861391
17470H61391j15971j311k7271m0174J6824M5918K4217o7783O940R6899O4182j21923
$$ 861391 745420 744109 716838 676664 693488 739406 763623 695840 702780 799679 863861 741938
17458G41938m9513q4072l7025m3782J9327Q0640Q732n7918l733K9644J17931O2433
$$ 741938 692425 608353 571328 527546 546873 627513 636245 578327 574594 604238 722169 784602
17446G84602L1995J21953O8404M4995J19817J95602M4277n8281p8416j57830p3444
$$ 784602 816597 938550 1006954 1051949 1171766 1367368 1411645 1353364 1274948 1117118 1043674
17435A043674n6555j27705j29199p0664j2938J4161L6850l7379k2948o6016j09094
$$ 1043674 987119 859414 730215 659551 646613 660774 697624 660245 637297 571281 462187
17424D62187r5853o5326J4750P6299J12187o1885p9747m0144J6261l1118l7185
$$ 462187 366334 301008 315758 392057 504244 442359 362612 322468 338729 307611 270426
17413B70426Q751J0469j3248k7247L3371N9972K5290j5155k543O41j3227j2428
$$ 270426 279177 289646 276398 249151 282522 342494 367784 352629 350086 350727 337500 325072
17401C25072n189n5447P7308L2653k3347q9987M1813j6408m519j4153k3104N595
$$ 325072 319883 264436 341744 374397 351050 261063 302876 286468 281949 267796 244692 250287
17389B50287l334m6635N2497l0648n0037M2111N8960n1891j05946m0328M0413
$$ 250287 246953 200318 252815 222167 172130 214241 273201 221310 115364 75036 115449
17378A15449J1566N4707R320l2358L5720l3902m6627K5800M5356J328K0920j5268
$$ 115449 127015 181722 191042 158684 194404 160502 113875 139675 185031 186359 207279 192011
17366A92011m7110k5395N7899J532n653l8725m7382m9135L4824p912M5685M3224
$$ 192011 144901 119506 177405 178937 173284 134559 87177 38042 72866 64954 110639 153863
17354A53863j0943Q000J4761l0154n8806k6156J0559p7459M079N7105M4866k8938
$$ 153863 142920 150920 165681 135527 76721 50565 61124 -16335 -12256 44849 89715 60777
17342F0777r288N4143K8653L2177N7008j1376l8117p7783k9113m4593N0183L9092
$$ 60777 51489 105632 134285 166462 223470 212094 173977 96194 67081 22488 72671 111763
17330A11763n6509l6424k754m9298M7289K6631P181n4145o9599l7064K7935N3779
$$ 111763 55254 18830 16076 -33222 14067 40698 47879 -6266 -75865 -112929 -84994 -31215
17318c1215N7486M7437P9870m4375m9155j6404l8540k7481m0784n2578R45J23308
$$ -31215 26271 73708 153578 109203 60048 43644 5104 -22377 -63161 -115739 -114794 8514
17306H514J33158K2304m1974j7794O181J4971k5369J4607K5803L6517J07484P8807
$$ 8514 141672 163976 122002 104208 110389 125360 99991 114598 140401 176918 284402 363209
17294C63209N7008J09419L5942J04993N6933R2600M7192O4686K3651L2117j2983
$$ 363209 420217 529636 565578 670571 727504 820104 867296 931982 955633 987750 974767
17283I74767n3165J772o8764R0N9075J32316P5567J3862P2943M1696J4208o7426
$$ 974767 921602 923374 854610 854700 913775 1046091 1121658 1135520 1208463 1250159 1264367 1196941
17271A196941o8229n1997k8301j9916L3114k3259j39094j88680j69362n9547j6075
$$ 1196941 1128712 1076715 1048414 1028498 1061612 1038353 899259 710579 541217 481670 465595
17260D65595m8552j40n8680R273L5995M1564l7166k1506M6897k6167J121N695
$$ 465595 417043 416903 358223 367496 403491 445055 407889 386383 433280 407113 408234 413929
17248D13929m3201j7144L9233M3564L7370Q4921O3597r037Q5077M9698O1761R6432
$$ 413929 370728 353584 392817 436381 473751 558672 622269 613232 698309 748007 809768 906200
17236I06200J15133J23818K9797P439m1918j33972q7167j1561J03290j5006j22624
$$ 906200 1021333 1145151 1174948 1182387 1140469 1006497 919330 907769 1011059 996053 873429
17225H73429q8657l4806M2051N076N6533J52905R3040o7344j42031j02983J5050
$$ 873429 784772 749966 792017 797093 853626 1006531 1099571 1032227 890196 787213 802263
17214H02263N76j5485L7376R5780n0876o1323k07505k03929j11712J5727L965
$$ 802263 802839 787354 824730 920510 869634 808311 600806 396877 285165 300892 304857
17203C04857O1240K3606j0890l7924m504k7548m4648q891p1424j00987m4314J45
$$ 304857 366097 389703 378813 340889 336385 308837 264189 255298 183874 82887 38573 38718
17191C8718R090K6443R9783J0299q9439q2478J3922j4846J125K3898k2440j0297
$$ 38718 47808 74251 174034 184333 94894 12416 26338 11492 12617 36515 14075 3778
17179C778P2473k0118q9479l0607O1572J11652j5626q3165K7684Q0116J34107
$$ 3778 76251 56133 -33346 -63953 -2381 109271 93645 10480 38164 118280 252387
17168B52387j5686k8496k3751J843o4573l4504J9221k9894j5188O272J0012L5352
$$ 252387 236701 208205 184454 186297 121724 87220 106441 76547 61359 67631 77643 112995
17156A12995J7484j5087O2285L0006L3427l4142m4654K0353o46R036J718O4829
$$ 112995 130479 115392 177677 207683 241110 206968 162314 182667 182021 191057 192775 257604
17144B57604M610l9087k9320p4711k3364q41K6592k5545p6053n6439n0890K0737
$$ 257604 262214 223127 193807 119096 95732 94891 121483 95938 19885 -36554 -87444 -66707
17132f6707L4286j6399p1153K4057N3670L1203K0510Q4231o3227r7832P1299R6794
$$ -66707 -32421 -48820 -119973 -95916 -42246 -11043 9467 93698 30471 -67361 3938 100732
17120A00732o6358p1424J8401M81J4379n4613j1470L9578j1516j7707k1880p9206
$$ 100732 34374 -37050 -18649 -18168 -3789 -58402 -69872 -30294 -41810 -59517 -81397 -160603
17108a60603K4088J33106J9912j4183K3030l4867j02893n3983O6150M1208M0500
$$ -160603 -136515 -3409 16503 2320 25350 -9517 -112410 -166393 -100243 -59035 -18535
17097a8535m0304n8901n0304J5561L5057L8399Q5320L6706M406J6062k1475J7571
$$ -18535 -58839 -117740 -168044 -152483 -117426 -79027 6293 42999 47405 63467 41992 59563
17085E9563k4527o3304j3381R397K5852m9884L4470Q9922L7282J581q0697n3454
$$ 59563 35036 -28268 -41649 -32252 -6400 -56284 -21814 68108 105390 106971 26274 -27180
17073b7180K0758M5705M3914n197k917L1286m3860l4711o4676K2031K5999l502
$$ -27180 -6422 39283 83197 78000 75083 106369 62509 27798 -36878 -14847 11152 7650
17061G650Q618o139L0254l3795o6579N1799L0036m248o99L918J378m268m2275
$$ 7650 16268 10129 40383 6588 -59991 -8192 21844 17596 16897 20815 22193 17925 -24350
17048b4350p4566j5980N2081l0555k5744J9776k6196L7268R4689K1063o2778l9758
$$ -24350 -98916 -114896 -62815 -93370 -119114 -99338 -125534 -88266 6423 27486 -35292 -75050
17036g5050k2302k9288M2640J57528K5439n2445p627k5806M7429o9210m299N0723
$$ -75050 -97352 -126640 -84000 73528 98967 46522 38895 13089 60518 -8692 -12991 37732
17024C7732K4815L5752q0706q0535r9617J7694J7521n1867J5925J26361N7190
$$ 37732 62547 98299 17593 -62942 -162559 -144865 -127344 -179211 -163286 -36925 20265
17013B0265j6134Q924k8965j658J8031P4461o0438r9930J5987J4150l2126J5794
$$ 20265 4131 13055 -15910 -17568 463 74924 14486 -85444 -69457 -55307 -87433 -71639
17001g1639o985l119P0577L1272O6807J6049L303k4344r2617n6556k0507r063
$$ -71639 -78624 -81743 -11166 20106 86913 102962 106265 81921 -10696 -67252 -87759 -96822
16989i6822o2078n2556j6541j2596J2387R7237N9109L3935O7581o0023p7175J05521
$$ -96822 -158900 -211456 -227997 -240593 -228206 -130969 -71860 -37925 29656 -30367 -107542 -2021
16977b021l7838o6115L8239R1855K3179o5999k8675M9494J01445l2715m7235J3662
$$ -2021 -39859 -105974 -67735 24120 47299 -18700 -47375 2119 103564 70849 23614 37276
16965C7276m6046N6479J8846m5050k7206l9774k9873N0920p37j5402J7034N791
$$ 37276 -8770 47709 66555 21505 -5701 -45475 -75348 -24428 -25165 -40567 -23533 -17742
16953a7742J4102L0247l7671k7210L8363L3693p9526l71O6162L1367r313l2734
$$ -17742 -3640 26607 -11064 -38274 89 33782 -45744 -46115 20047 51414 42101 9367
16941I367j6519k1643M4423j9909j14351p8665N5999J12077j9790j0958K3511
$$ 9367 -7152 -28795 15628 -4281 -118632 -197297 -141298 -29221 -49011 -59969 -36458
16930c6458Q8950m0131j01000j9844M8864Q1633J0105k9539o8262O1514L4499
$$ -36458 52492 12361 -88639 -108483 -59619 22014 32119 2580 -65682 -4168 30331
16919C0331o0651M4903Q1367l8317L0484j9765q0057M8482l3781p0372j280o6683
$$ 30331 -30320 14583 95950 57633 88117 68352 -11705 36777 2996 -67376 -68656 -135339
16907a35339m5262K9649O0674K7303P3916N1440K8876j34740o5627P1834p303
$$ -135339 -180601 -150952 -90278 -62975 10941 62381 91257 -43483 -109110 -37276 -44579
16896d4579n4464k3745m6112P0126O7434R590k3046j2329Q1759J18425p781l9171
$$ -44579 -99043 -122788 -168900 -98774 -31340 -21750 -44796 -57125 24634 143059 135278 96107
16884I6107K2088m6508k1544q8540J4684J9625m0040m6432k4597J6164n971N6643
$$ 96107 118195 71687 50143 -38397 -23713 -4088 -44128 -90560 -115157 -98993 -104964 -48321
16872d8321N8681j14954j26312Q9561P7878k9166M8036J6316m4206K530L5191
$$ -48321 10360 -104594 -230906 -141345 -63467 -92633 -44597 -28281 -72487 -69957 -34766
16861c4766k0761k1440L1200J7538J7043M3829P7923p5864L9043r9689K032L0130
$$ -34766 -55527 -76967 -45767 -28229 -11186 32643 110566 34702 73745 -25944 -23912 6218
16849F218r553j7548n8088m0277L1130M9798N920M2816P0229m5766j09663l8975
$$ 6218 -3335 -20883 -78971 -119248 -88118 -38320 -32400 10416 80645 34879 -74784 -113759
16837a13759j9932j9968K139N5046n5880j1929N3803Q7740N9100N1775N9769l8473
$$ -113759 -133691 -153659 -151520 -96474 -152354 -164283 -110480 -22740 36360 88135 147904 109431
16825A09431o3005j667P5619n298j02119j02301J1253M9330p732m1396m3933k2727
$$ 109431 46426 44759 120378 115080 12961 -89340 -78087 -28757 -36489 -77885 -121818 -144545
16813a44545K1154j6547k2604O0563R0361M4874m4862k3111L2860m1752p7023
$$ -144545 -123391 -139938 -162542 -101979 -11618 33256 -11606 -34717 -1857 -43609 -120632
16802a20632k7769M0239J34684l039j07161j0541l0521p5621o8442J421J35769
$$ -120632 -148401 -108162 26522 23483 -83678 -94219 -124740 -200361 -268803 -267382 -131613
16791a31613M3457L442J5447K4414J7111L3535K086j0434J0544k7070l6725Q333
$$ -131613 -88156 -84714 -69267 -44853 -27742 5793 7879 -2555 7989 -19081 -55806 -47473
16779d7473O5201N7991m6020j289J0545l6937m3572K2160K7909J11131N7514j20896
$$ -47473 17728 75719 29699 28410 38955 2018 -41554 -19394 8515 119646 177160 56264
16767E6264n5055k0639K1385o507J8784l5324l8689l9171Q9996l981n5749r615
$$ 56264 1209 -19430 1955 -4552 14232 -21092 -59781 -98952 -8956 -12937 -68686 -78301
16755g8301J905M9750k3216j4032p510M1576q902n4974N0170P6500L5428J7063
$$ -78301 -76396 -26646 -49862 -63894 -71404 -29828 -38730 -93704 -43534 32966 68394 85457
16743H5457K7904j1326j5881K0378k1839m3693l2651K460J02113K872l2040r2194
$$ 85457 113361 102035 86154 106532 84693 41000 8349 10809 112922 115794 83754 -8440
16731h440k3144P6865P314n1262J5316r10j2851O602p5077l111J6448q028J0422
$$ -8440 -31584 45281 52595 1333 16649 15739 2888 9490 -65587 -68698 -52250 -60278 -49856
16718d9856N4216K3275p2195J5596R4826N2242k5276L897n2137k0052q0861k8976
$$ -49856 4360 27635 -44560 -28964 65862 118104 92828 96725 44588 24536 -56325 -85301
16706h5301M3102l2210K4801q657Q407L1171k8352l7950Q1876J9682o0842L683
$$ -85301 -42199 -74409 -49608 -58265 -49858 -18687 -47039 -84989 -3113 16569 -44273 -40590
16694d0590l2679j1218K1530R889p1420k8761K3602R7499M6799k336j4699K749
$$ -40590 -73269 -84487 -62957 -53068 -124488 -153249 -129647 -32148 14651 12315 -2384 365
16682C65n958l1650m3254m820Q9045M669k1675N4033J9813j7358p5302k8896L1874
$$ 365 -5593 -37243 -80497 -85317 3728 8397 -13278 40755 60568 43210 -32092 -60988 -29114
16669b9114J13157k3025r8348j0728N3813j7347p0565k0834O3815M0819O9257
$$ -29114 84043 61018 -37330 -48058 5755 -11592 -82157 -102991 -39176 1643 70900
16658G0900M721r9687n4999n5989K8678J7326Q1638O8134n243o9648j0287L142
$$ 70900 75621 -24066 -79065 -135054 -106376 -89050 -7412 60722 55479 -14169 -24456 -21314
16646b1314L8470L2711o7362k3030n9513l3740L5684P6437n125p1422j1659J9004
$$ -21314 17156 49867 -17495 -40525 -100038 -133778 -98094 -21657 -26782 -98204 -109863 -90859
16634i0859N7650j331m9054l1420o79J4650O7995j6679l7274L2784K0321m7576
$$ -90859 -33209 -34540 -83594 -115014 -115693 -101043 -33048 -49727 -87001 -54217 -33896 -81472
16622h1472j7295J3422Q2589R1250K0187n1837r7005N2168N180l0885K4045P1893
$$ -81472 -98767 -85345 -2756 88494 108681 56844 -40161 12007 17187 -13698 10347 82240
16610H2240k751J1088n6802o1052m1689k0230n5061L6310Q4625K0810K0376L3710
$$ 82240 79489 90577 33775 -27277 -68966 -89196 -144257 -107947 -23322 -2512 17864 51574
16598E1574l7386m0843J5203J7983j8112r5913R2552K6500J1816M839j16221p2437
$$ 51574 14188 -26655 -11452 6531 -11581 -107494 -14942 11558 23374 28213 -88008 -160445
16586a60445K922l008j9237P2192l185K6185L3709Q376R399o426m8069M3389J2353
$$ -160445 -157523 -160531 -179768 -107576 -110761 -84576 -50867 -42491 -33092 -39518 -87587 -44198 -31845
16573c1845K9100K6182M451p1777K7856L7109K9366L3138o0474p4413m8230J8556
$$ -31845 -2745 23437 27888 -43889 -16033 21076 50442 83580 23106 -51307 -99537 -80981
16561h0981O7906L6329J9751K5815M0730l1406p4856J3751N2547n5685k2632O6726
$$ -80981 -13075 23254 43005 68820 109550 78144 3288 17039 69586 13901 -8731 57995
16549E7995K7760p2383m2219q7686K261P0253M4832M8420K5191k1571L3750m359
$$ 57995 85755 13372 -28847 -116533 -114272 -44019 813 49233 74424 52853 86603 82244
16537H2244r250m9194j579p4253m0694L7380O6535M7922j1506j9192l4422K224
$$ 82244 72994 23800 22221 -52032 -92726 -55346 11189 59111 47605 28413 -6009 -3785
16525c785k847J4123o824l5694J0058M6778j1858J3028R167j2509M6852k6497
$$ -3785 -6632 7491 667 -35027 -24969 21809 9951 22979 32146 19637 66489 39992
16513C9992l8061m074O1957l2975r377o7694j3667M5781O7273L1264L4395j5909
$$ 39992 1931 -2143 59814 26839 17462 -50232 -63899 -18118 49155 80419 114814 98905
16501I8905k3891k8208J44j1960k8052l3139m6074m557j625m0866N628J13968
$$ 98905 75014 46806 46950 34990 6938 -26201 -72275 -76832 -78457 -119323 -113695 273
16489B73L9798o3809l5520j5506L6554P6051l1864q1271K6874j3353k4446M1804
$$ 273 40071 -23738 -59258 -74764 -38210 37841 5977 -75294 -48420 -61773 -86219 -44415
16477d4415O4062n5457p6611r82K4277R8537m9091o5428k9745k9398J7649L3035
$$ -44415 19647 -35810 -112421 -113403 -89126 9411 -39680 -105108 -134853 -164251 -146602 -113567
16465a13567N1914o26J7602O1380M579M574m3000n5947n0269l1804L5673l7617
$$ -113567 -61653 -62279 -44677 16703 21282 25856 -17144 -73091 -123360 -155164 -119491 -157108
16453a57108K4602K0599J10716k2915m7063P6884N0664J094j0302R447m9097l7270
$$ -157108 -132506 -111907 -1191 -24106 -71169 5715 56379 57473 47171 56618 7521 -29749
16441b9749o0360J3144J4173J5137L66N2181l7112j8265k927J7249Q072J0222
$$ -29749 -90109 -76965 -62792 -47655 -47289 4892 -32220 -50485 -53412 -36163 -28091 -17869
16429a7869L0480l240J1369l1394k9717K3639N9398N5734m0582r192k811k140
$$ -17869 12611 9371 20740 -10654 -40371 -16732 42666 98400 57818 48626 45815 43675
16417D3675k8623l1651J6524L9222L654n6720N9572j805k4044J2125L7310P717
$$ 43675 15052 -16599 -75 39147 42801 -13919 45653 43848 19804 31929 69239 76956
16405G6956l6096j50786J03508P9484l69L7475k2536j29252p4912K1444N7501
$$ 76956 40860 -109926 -6418 73066 72697 110172 87636 -41616 -116528 -95084 -37583
16394c7583K9419n119n6514R9525O0814n8220k5481l7960j4516N9789l7936q4365
$$ -37583 -8164 -13283 -69797 29728 90542 32322 6841 -31119 -45635 14154 -23782 -108147
16382a08147P1330P4200k6855j27189M5064K6995k8529M241l547L7862K3765K0555
$$ -108147 -36817 37383 10528 -116661 -71597 -44602 -73131 -68890 -72437 -34575 -10810 9745
16370I745L0877J2795j6730r6069l6458L9058p353o2560L1605L461j4982j1676
$$ 9745 40622 53417 36687 -59382 -95840 -56782 -64135 -126695 -95090 -91629 -106611 -118287
16358a18287O6522O6808j8905K5582K4063K7314L4638p0180l3810j4401k9000
$$ -118287 -51765 15043 -3862 21720 45783 73097 107735 37555 3745 -10656 -39656
16347c9656L5338q679K6181m6316k4070M3103j2592o6225Q401P1794N4050P3344
$$ -39656 -4318 -12997 13184 -33132 -57202 -14099 -26691 -92916 -84515 -12721 41329 114673
16335A14673o2071j5772J1067k6195l9047n8552M4283M7716J6116m6321n1833
$$ 114673 52602 36830 47897 21702 -17345 -75897 -31614 16102 32218 -14103 -65936
16324f5936P512r152l8998R1303J32530q5774q5575p5892j7167p431L3768P3922
$$ -65936 -58424 -67576 -106574 -15271 117259 31485 -54090 -129982 -147149 -154580 -120812 -46890
16312d6890j6642k5914j5611L580P1412M8682P962J6628l6415o6141n5703P9242
$$ -46890 -63532 -89446 -105057 -101477 -30065 18617 26579 43207 6792 -59349 -115052 -35810
16300c5810k4402m529J9648Q0959l6282q4197J2352M8426J08321R0688j6047q3177
$$ -35810 -60212 -64741 -45093 35866 -416 -84613 -72261 -23835 84486 175174 159127 75950
16288G5950n8560k2748j00551K0337n780m175R1654P16m2898R977N2445l286m7802
$$ 75950 17390 -5358 -105909 -85572 -91352 -95527 -3873 -3157 -46055 -36078 16367 13081 -34721
16275c4721k275J02047K5205L4275m0888l7963p8200n1146N7859M1240q6741o829
$$ -34721 -36996 65051 90256 124531 83643 45680 -32520 -83666 -25807 15433 -71308 -78137
16263g8137Q9274j0794j02597r6641M9110J4220L0593j7801O5482M109l5759N557
$$ -78137 11137 343 -102254 -198895 -149785 -135565 -104972 -122773 -57291 -53182 -88941 -83384
16251h3384J9536P243K5117k9112K0140M0065K2559N8793m8702n8539j1182l3309
$$ -83384 -63848 -56605 -31488 -60600 -40460 -395 22164 80957 32255 -26284 -37466 -70775
16239g0775l861P4815K8774p1314n298N4687j2161l2838M663m938K3084Q4818
$$ -70775 -74636 179 28953 -42361 -47659 7028 -5133 -37971 -33308 -38246 -15162 69656
16227F9656k1044l9849k2520k1307P919k5608m1580L9881P3023q4074J0990N3390
$$ 69656 48612 8763 -13757 -35064 -27145 -52753 -94333 -54452 18571 -65503 -54513 -1123
16215a123K7357J5609k004L6613j9769j35607m6138p0594J3612J9600n7835l0242
$$ -1123 26234 41843 39839 76452 56683 -78924 -125062 -195656 -182044 -162444 -220279 -250521
16203b50521j0423L2919K3456j20K2472N5634M0362J8674N2041O5937o1903j9047
$$ -250521 -260944 -228025 -204569 -204689 -182217 -126583 -86221 -67547 -15506 50431 -11472 -30519
16191c0519J2337L1503k4183o0675j6645j2123k3771l5923O424j4026q382J5055
$$ -30519 -18182 13321 -10862 -71537 -88182 -100305 -124076 -159999 -153575 -167601 -175983 -160928
16179a60928M2090M2929O8669N9408r5744j00384J9478P5180n6o6234k8023P5748
$$ -160928 -118838 -75909 -7240 52168 -43576 -143960 -124482 -49302 -49358 -115592 -143615 -67867
16167f7867q3432J04872N6744p728n5117O7232N1016l2421o9641m9643Q5626R994
$$ -67867 -151299 -46427 10317 2589 -52528 14704 65720 33299 -36342 -85985 -359 9635
16155I635o8215O6348J7840j8121M2812L9091L5177N0532l5274M037l9620p6700
$$ 9635 -58580 7768 25608 7487 50299 89390 124567 175099 139825 143862 104242 27542
16143B7542q8659m1758N0268K2367L7157j353p2371l4677M7395r299K6058q460
$$ 27542 -61117 -102875 -52607 -30240 6917 5564 -66807 -101484 -54089 -63388 -37330 -45790
16131d5790j8173l7005O7271r833Q633m0982K424M0435J9060L4393M6776j30o1941
$$ -45790 -63963 -100968 -33697 -43530 -34897 -75879 -73455 -33020 -13960 20433 67209 67079 5138
16118E138J0305j3787k5426M5670j8438Q350j6858p1339K0586L213M6412o2920
$$ 5138 15443 1656 -23770 21900 3462 11812 -5046 -76385 -55799 -52586 -6174 -69094
16106f9094k3576P3510J3784L2079J3064R925l0006j2412k9195L6831L7531l9954
$$ -69094 -92670 -19160 -5376 26703 39767 49692 19686 7274 -21921 14910 52441 12487
16094A2487n9290J6844n4873k1988M5350j4930K8603l9012M3057P4837J3655J9585
$$ 12487 -46803 -29959 -84832 -106820 -61470 -76400 -47797 -86809 -43752 31085 44740 64325
16082F4325K5672r7170M2194l8236r3003M3242P2438k3108m2341p2102m6385P6753
$$ 64325 89997 -7173 35021 -3215 -96218 -52976 19462 -3646 -45987 -118089 -164474 -87721
16070h7721M6043M8671K6272n2695n8889l9936O149L9838Q5250M5199J6305m0403
$$ -87721 -41678 6993 33265 -19430 -78319 -118255 -112106 -72268 12982 58181 74486 34083
16058C4083j0314o1858J201r272K5402l0286j744K9619l12q234O771L4302N8709
$$ 34083 23769 -38089 -36888 -46160 -20758 -51044 -52788 -23169 -23481 -31715 -24944 9358 68067
16045F8067J7442q2611m2658n7342l5567k2202N3607L973M6276Q7087Q842L5501
$$ 68067 85509 2898 -39760 -97102 -132669 -154871 -101264 -97291 -51015 36072 44914 80415
16033H0415n792q1716J654N8054M2553o037k3211p628L2061O5426r290m6642J5343
$$ 80415 74623 -7093 -5439 52615 95168 89131 65920 58292 90353 155779 146489 99847 115190
16020A15190j683q472o8773r7287l5890L4307K0854P295O5444p2688r2086J6290
$$ 115190 113507 105035 36262 -61025 -96915 -62608 -41754 -34459 30985 -41703 -133789 -117499
16008a17499P1435P2835L8847k4729j399L6607R284l8115k2493j8771n9240K0838
$$ -117499 -46064 26771 65618 40889 39490 76097 85381 47266 24773 6002 -53238 -32400
15996c2400M1220M8687R0797n283m1955o5265j00162j4985k7190l468j5940P343
$$ -32400 8820 57507 148304 143021 101066 35801 -64361 -79346 -106536 -110004 -125944 -118601
15984a18601M3643k2449j0309L8371J3799M142Q0880R0842j0004j02819m9322
$$ -118601 -74958 -97407 -107716 -69345 -55546 -51404 29476 120318 110314 7495 -41827
15973d1827J8749j363J8153L1342P8477l6730o5725p473M3909l6552j10812R671
$$ -41827 -23078 -24441 -6288 25054 103531 66801 1076 -6397 37512 960 -109852 -100181
15961a00181O2765M9663j1799o0040L3550j6416m0095J4502N9820Q08m8310j2785
$$ -100181 -37416 12247 448 -59592 -26042 -42458 -82553 -68051 -8231 -7423 -55733 -68518
15949f8518m0774k5326J7729R9467L2988r993K1789P9652j2813o6628m5491K2944
$$ -68518 -109292 -134618 -116889 -17422 15566 5573 27362 107014 94201 27573 -17918 5026
15937E026j3565l9554R6960O7821m7347k5985m7101J7205M108q3706N1149P098
$$ 5026 -8539 -48093 48867 116688 69341 43356 -3745 13460 17568 -66138 -14989 -7891
15925g891j2832J2732l6778M557L5866M78M895O4222K8075j6219q5711L8818J1879
$$ -7891 -20723 -7991 -44769 -40212 -4346 -3868 1027 65249 93324 77105 -8606 30212 42091
15912D2091n878n476j0536o8348J2126P800m2935q2943J9065Q9842L9970M9724
$$ 42091 36213 30737 20201 -48147 -36021 -28221 -71156 -154099 -135034 -45192 -5222 44502
15900D4502k2123p5531j072j9828O0230J02309L8427k0102q3945l1540K4797m3744
$$ 44502 22379 -53152 -54224 -74052 -13822 88487 126914 106812 22867 -8673 16124 -27620
15888b7620j1084J7855J1384m3721K0433n4719m7091k2637M1408J13382P9532
$$ -27620 -38704 -20849 -9465 -53186 -32753 -87472 -134563 -157200 -115792 -2410 77122
15877G7122k5345Q0369K54q1310m5442K038n525k865k2499j552p1158n3882P608
$$ 77122 51777 132146 132400 51090 5648 7686 2161 -704 -23203 -24755 -95913 -149795 -142187
15864a42187k1875Q3969Q1334M9401N684o0112k3872N3345k622q9740k3813P4554
$$ -142187 -164062 -80093 1241 50642 56326 -3786 -27658 25687 23065 -66675 -90488 -15934
15852a5934p412k2200Q1655j6662m7471j0911N1033j4485m7626J0470j0938J03253
$$ -15934 -23346 -45546 36109 19447 -28024 -38935 12098 -2387 -50013 -39543 -50481 52772
15840E2772M302q9350k8065J6716M0916K9441j3520q3193L2863J02604M9012n4242
$$ 52772 57074 -32276 -60341 -43625 -2709 26732 13212 -69981 -37118 65486 114498 60256
15828F0256L8405k2292Q139l9340j3039l1236K712j296J1792N3744L2753m4453
$$ 60256 98661 76369 84508 45168 32129 893 3605 2309 14101 67845 100598 56145
15816E6145q5897L498m6815p8843m5128K7577J00462J21863k190j3934m2147j2212
$$ 56145 -29752 -26254 -73069 -151912 -197040 -169463 -69001 52862 50672 36738 -5409 -17621
15804a7621k3404L4743O8519L1509L3312m795o9883l9458k3L2953j331J2526K5572
$$ -17621 -41025 -6282 62237 93746 127058 122263 52380 12922 12899 45852 44521 57047 82619
15791H2619N826m5737Q266P3860j9716j00831l3598J4133M5182M7370j3083m0776
$$ 82619 88445 42708 50974 124834 105118 4287 -29311 -15178 30004 77374 64291 23515
15779B3515j1358K4740l5655j7999M658K082N0242J2987p0079o154k3101R307
$$ 23515 12157 36897 1242 -16757 -12099 -10017 40225 53212 -16867 -23021 -46122 -36815
15767c6815m1224M8323l3793l0679K4715P4144M1161l5129j18687n2827L7305
$$ -36815 -78039 -29716 -63509 -94188 -69473 4671 45832 10703 -107984 -160811 -123506
15756a23506J053l7692P7309J53991L674j9194N0586k7922k5258l6401J8174j01042
$$ -123506 -122453 -160145 -82836 71155 74829 55635 106221 78299 53041 16640 34814 -66228
15744f6228m0998K9332j0152j6558R1732p5725k4462L8943M5000o9693K9143R1545
$$ -66228 -107226 -77894 -88046 -104604 -12872 -88597 -113059 -74116 -29116 -98809 -69666 21879
15732B1879l8745k4832Q554J4682M5454P246J7513K2753J5624N652k8101j07193
$$ 21879 -16866 -41698 -33144 -18462 26992 34238 51751 74504 90128 95780 67679 -39514
15720c9514n8616K0638O0141L8996K5140j16419P307l5729K5877L1441N6192l6153
$$ -39514 -98130 -77492 -17351 21645 46785 -69634 -62327 -98056 -72179 -40738 15454 -20699
15708b0699P2898J0595M448k3362m9184l6384M8313J4768K3368L8576r646j52979
$$ -20699 52199 62794 67242 43880 -5304 -41688 6625 21393 44761 83337 73691 -79288
15696g9288k0660J8226R308K0087M4269J03173K5253K319q6500k0220m123n549
$$ -79288 -99948 -81722 -72414 -52327 -8058 95115 120368 122687 36187 15967 11844 6295
15684F295k9987n433K6319k4090P0166J9374m6735n7303L940j4278N4100R9013
$$ 6295 -23692 -29125 -2806 -26896 43270 62644 15909 -41394 -37454 -51732 2368 101381
15672A01381k2914j14691o4772L3828m789J2475O5364m8970m6309o4937l5107
$$ 101381 78467 -36224 -100996 -67168 -71957 -59482 5882 -43088 -89397 -154334 -189441
15661a89441J26276J40059Q8684o286j12715k5497o6204l2602P853r572J7879
$$ -189441 -63165 76894 165578 159292 46577 21080 -45124 -77726 -69873 -79445 -61566
15650f1566O3979O5073m0946L8034K8617o8822q270n5061j03149R163Q8148K9337
$$ -61566 2413 67486 26540 64574 93191 24369 16099 -38962 -142111 -132948 -44800 -15463
15638a5463Q550P2629m632p0130l9510l2287L3904P3280n3858j6250q753R0949
$$ -15463 -6913 65716 61084 -9046 -48556 -80843 -46939 26341 -27517 -43767 -52520 38429
15626C8429K9408o9261J2258p9029j05586N6833O5296j659j8014Q489M3596K5173
$$ 38429 67837 -1424 10834 -68195 -173781 -116948 -51652 -53311 -71325 -62836 -19240 5933
15614E933N593l034M2238o8347n4503M9690R7284K16n2188n3181J4026R527m87
$$ 5933 11526 8492 50730 -17617 -72120 -22430 74854 75070 22882 -30299 -16273 -6746 -7233
15601g233Q77p2284l7038P3937M1635m6629j07678L0094N3124L4830L9392K2659
$$ -7233 -6356 -78640 -115678 -41741 -106 -46735 -154413 -124319 -71195 -36365 3027 25686
15589B5686R521q840J3724n3059R852M0740m841j4499j0487Q2480L1831q202L8702
$$ 25686 35207 26367 40091 -12968 -3116 37624 32783 18284 7797 90277 122108 113906 152608
15576A52608o802j16960p6559k3736m8372l691P4415M0667O570o523j0958M8327
$$ 152608 145806 28846 -47713 -71449 -119821 -123512 -49097 -8430 -1860 -8383 -19341 28986
15564B8986R0093O0959k4366k8837M0285m2356q9228n0708K3762O3712J0890p0202
$$ 28986 119079 180038 155672 126835 167120 124764 35536 -15172 8590 72302 83192 12990
15552A2990k2337R239j4891n577L9705J5790p6367k7727M3229R0815k2550p1342
$$ 12990 -9347 -108 -14999 -20576 19129 34919 -41448 -69175 -25946 64869 42319 -29023
15540b9023q5294k8731k4434j2539K5292O3565N1084K6499L2221J5112M3266j6177
$$ -29023 -114317 -143048 -167482 -180021 -154729 -91164 -40080 -13581 18640 33752 77018 60841
15528F0841j010J7765o8855o7453K3120M9850O7972J4904l0397r6691r91P9984
$$ 60841 59831 77596 8741 -58712 -35592 14258 82230 97134 66737 -29954 -30945 49039
15516D9039N798l9101q588l7047j9320J8504O3899L120j8653J0921j607M2686
$$ 49039 54837 15736 7148 -29899 -49219 -30715 33184 36304 17651 28572 26965 69651
15504F9651j8760N68m1179K3439M3594J2508j17023q257L2400M2071J0549j6948
$$ 69651 50891 51459 10280 33719 77313 89821 -27202 -35459 -3059 39012 49561 32613
15492C2613L060l3237M4388p0461J3073K1903j05309J8996L5232j3882m2113N019
$$ 32613 35673 2436 46824 -23637 -10564 11339 -93970 -74974 -39742 -53624 -95737 -90718
15480i0718O6697L2823l1940q1245l4551K4000q074O8346L8854K8707m4688l8198
$$ -90718 -24021 8802 -23138 -104383 -138934 -114934 -123008 -54662 -15808 12899 -31789 -69987
15468f9987J0001l2712k403J1031L9095P072o3716L8600J22100L9683o2058J429
$$ -69987 -59986 -92698 -95101 -84070 -44975 -37903 -101619 -63019 59081 98764 36706 38135
15456C8135r07L6840N1286l8538K2521N3733l0298j17049j3144o3554l6591J30381
$$ 38135 37228 74068 125354 86816 109337 163070 132772 15723 2579 -60975 -97566 32815
15444C2815K7113q9277n5746J26415K0192K1988P166j5399J9513j3545k695M667
$$ 32815 59928 -29349 -85095 41320 61512 83500 90666 75267 94780 81235 78540 83207
15432H3207P1708k200r0549p7241n6355J9320J14330Q586l3115o984L2518o486
$$ 83207 154915 152715 62166 -15075 -71430 -52110 62220 70806 37691 30707 63225 56739
15420E6739r755N4443r3368n0184k1535M9848J20684k0328n7415j3912j01959
$$ 56739 46984 101427 8059 -42125 -63660 -13812 106872 86544 29129 15217 -86742
15409h6742O1982L5381J544J2104J851Q081M3762J2425l0100j11119p5946p702
$$ -86742 -24760 10621 12165 24269 26120 34201 77963 90388 60288 -50831 -126777 -134479
15397a34479L9953M2744L938Q816K9865J1134l8415L3621M3114J4775q5663l4438
$$ -134479 -94526 -51782 -47844 -39028 -9163 1971 -36444 -2823 40291 55066 -30597 -65035
15385f5035O9096N0851o4502n8144k5835k5462k104J7884L7323L5971M4101l1612
$$ -65035 4061 54912 -9590 -67734 -93569 -119031 -121135 -103251 -65928 -29957 14144 -17468
15373a7468k0240k767j9434j3637Q768O104J9519L0076Q041J4254l3789j2288
$$ -17468 -37708 -40475 -59909 -73546 -64778 -58674 -39155 -9079 -1038 13216 -20573 -32861
15361c2861n6382l4601j9964N4671n4162M5217P6851N5824M8064M4059J8260Q373
$$ -32861 -89243 -123844 -143808 -89137 -143299 -98082 -21231 34593 82657 126716 144976 153349
15349A53349J8072m2079p3655q9226M4591m0807l8343k1680K3673J603n8205Q2108
$$ 153349 171421 129342 55687 -33539 11052 -29755 -68098 -89778 -66105 -64502 -122707 -40599
15337d0599L1490k843P8392R723n2425n9839L5039r582N693J6428L3337j0303
$$ -40599 -9109 -11952 66440 76163 23738 -36101 -1062 -10644 -4951 11477 44814 34511
15325C4511j113k6667L7406J8286k0411k3336l4572l3978K9294R153Q929j7513
$$ 34511 33398 6731 44137 62423 42012 18676 -15896 -49874 -20580 -11427 -2498 -20011
15313b0011J2713O2620J8407K5799M3006k5783l0650Q8660Q9355j07944j11811
$$ -20011 -7298 55322 73729 99528 142534 116751 86101 174761 264116 156172 44361
15302D4361K6986k9614L212L9681j0813m6807k8713r208j3320N633k8492k6548
$$ 44361 71347 41733 44945 84626 73813 27006 -1707 -10915 -24235 -18602 -47094 -73642
15290g3642Q0586N3645L8361l5501K689n9718r1798L9204K9731l7900l0425N672
$$ -73642 6944 60589 98950 63449 66138 6420 -85378 -46174 -16443 -54343 -84768 -79096
15278g9096O1377Q4763Q1723l2780l1146j6044l6974R078l0495n3373p6976O0556
$$ -79096 -17719 67044 148767 115987 84841 68797 31823 40901 10406 -42967 -119943 -59387
15266e9387R288K9540M9344J7118o3266J840J09842O5419O73N364l5255p3844
$$ -59387 -50099 -20559 28785 45903 -17363 -15523 94319 159738 160411 165775 130520 56676
15254E6676p8057J919j00419j4076L5829j6370K8328M3983m5188K7457L5136K2724
$$ 56676 -21381 -19462 -119881 -133957 -98128 -114498 -86170 -42187 -87375 -59918 -24782 -2058
15242b058k2128n2522k9673J166k0367k1968K3026Q3213l577j0246j019K5991
$$ -2058 -24186 -76708 -106381 -105215 -125582 -147550 -124524 -41311 -44888 -55134 -56153 -30162
15230c0162O3491K2943j6142K6581o617q0510R890O1718m3411K0467J9242O4781
$$ -30162 33329 56272 40130 66711 60094 -20416 -10526 51192 7781 28248 47490 112271
15218A12271L1974L7317q4926j30087n1331Q4721J16784K5157o7553k6851Q078
$$ 112271 144245 181562 96636 -33451 -84782 -61 116723 141880 74327 47476 55554
15207E5554l9334M4110N1619m7180R359j4425j8408j6400L2024n1868J9560m0559
$$ 55554 16220 60330 111949 64769 74128 59703 41295 24895 56919 5051 24611 -15948
15195a5948M7565L0492J2102n7108n6955K2532k4553J9560l5572k0169N4761k1286
$$ -15948 31617 62109 74211 17103 -39852 -17320 -41873 -22313 -57885 -78054 -23293 -44579
15183d4579L7219m5380K7588P3217J1795O456o4214q0116N776k0839k321M8528
$$ -44579 -7360 -52740 -25152 48065 59860 66316 2102 -78014 -72238 -93077 -95398 -46870
15171d6870N8372J6128J1551m3420j4979L8789O8624M915m3400n9858O900J2146
$$ -46870 11502 27630 39181 -4239 -19218 19571 88195 93110 49710 -10148 -3248 8898
15159H898O7170l2123k6758p5355N369M5391L888M1556k2200q4335p943K9257
$$ 8898 76068 43945 17187 -58168 -52799 -7408 -3520 38036 15836 -68499 -76442 -47185
15147d7185L2535J653l3821n1123m5136K9277J00157M9948J4818l6928J5887m417
$$ -47185 -14650 -12997 -46818 -97941 -143077 -113800 -13643 36305 51123 14195 30082 25665
15135B5665K1214J8560L5306p0740o1129m0181o9084l3231K5354k7777J3100J25603
$$ 25665 46879 65439 100745 30005 -31124 -71305 -140389 -173620 -148266 -176043 -162943 -37340
15123c7340J1977M0801k2087k5419m8455P792K5095r0687k4401Q9049J27577J01826
$$ -37340 -25363 15438 -6649 -32068 -80523 -72731 -47636 -138323 -162724 -73675 53902 155728
15111A55728L6436o4494l4151r9080l0988k5767P3200K3268k9461n1061m1780
$$ 155728 192164 127670 93519 -5561 -36549 -62316 10884 34152 4691 -46370 -88150
15100h8150j9727N0437J4240K4132M0336m7425M6501M9690M1490l8987q4645J2413
$$ -88150 -107877 -57440 -43200 -19068 21268 -26157 20344 70034 111524 72537 -12108 305
15088C05K2065j6584J3016m5673q1160N7264R319K0654K9595L5474n4194R947
$$ 305 22370 5786 18802 -26871 -108031 -50767 -41448 -20794 8801 44275 -9919 28
15076B8J8875L6522k5428n5362q618N1766m5845j670J3561J6500p7928J2242O674
$$ 28 18903 55425 29997 -25365 -33983 17783 -28062 -29732 -16171 329 -77599 -65357 -58683
15063e8683P3848M3630j973m1665K2045L491k7306K5376k3281j4613l5241l6099
$$ -58683 15165 58795 56822 15157 37202 40693 13387 38763 15482 869 -34372 -70471
15051g0471J00720L3506Q640n8849o5608o4681O776J37692o5054o1946L5268L3736
$$ -70471 30249 63755 72395 13546 -52062 -116743 -109967 27725 -37329 -99275 -64007 -30271
15039c0271m782Q191J4491j4187q684O9672M1906L1260J3106n6452R6118L6361
$$ -30271 -35053 -26862 -12371 -26558 -35242 34430 76336 107596 120702 64250 160368 196729
15027A96729q9052o0967k4176j9494l1652l5645j0237K4648K3112L1132r880j1861
$$ 196729 107677 46710 22534 3040 -28612 -64257 -74494 -49846 -26734 4398 -5482 -17343
15015a7343j20679m341P1410R216k2613O050M0652P311k0755P2127Q8246M1638
$$ -17343 -138022 -142363 -70953 -61737 -84350 -78300 -37648 -30337 -51092 21035 109281 150919
15003A50919L86m1835m9439K1647M6616k8243K607m120j09356M840m8226l8648
$$ 150919 151305 109470 60031 81678 128294 100051 102658 98538 -10818 -5978 -54204 -92852
14991i2852r597N3743O7019m02l2553J4386N8745N0707m6535j09414J7357O9642
$$ -92852 -102449 -48706 18313 17911 -14642 -256 58489 109196 62661 -46753 -29396 40246
14979D0246q0764n4268K2907L4050J0754M0237J702n8650j2683K9068j7310L7295
$$ 40246 -40518 -94786 -71879 -37829 -27075 13162 14864 -43786 -56469 -27401 -44711 -7416
14967g416l5184p0050l0423M834R7372m4821n173l1065O3554J25239O1779j882
$$ -7416 -42600 -112650 -143073 -138239 -40867 -85688 -90861 -121926 -58372 66867 128646 126764
14955A26764n7505m0002j7308O931j4017o0179L5367P1314m0455k0994R721l4202
$$ 126764 69259 29257 11949 18880 4863 -55316 -19949 51365 10910 -10084 -363 -34565
14943c4565K9454q0284l6832L268L086M9234L4783N4361L9010p6746j6364j4091
$$ -34565 -5111 -85395 -122227 -118959 -115873 -66639 -31856 22505 61515 -15231 -31595 -45686
14931d5686N1309K3506l8505q5906l8757l1348j6183M4086j2306R125P0362N3674
$$ -45686 5623 29129 -9376 -95282 -134039 -165387 -181570 -137484 -149790 -140665 -70303 -16629
14919a6629L2257J9382J0131K5641J18381m1514r0872p2215q3575L2688P958K0657
$$ -16629 15628 35010 45141 70782 189163 147649 56777 -15438 -99013 -66325 -58367 -37710
14907c7710J0503n5900r218N5674j0000r3668M7142J5437L712n8482N1158M0346
$$ -37710 -27207 -83107 -92325 -36651 -46651 -140319 -93177 -77740 -74028 -132510 -81352 -41006
14895d1006K2438K3746n5921m8005O9854L089m3103P280N679N8209n0419j6339
$$ -41006 -18568 5178 -50743 -98748 -28894 -25805 -68908 -61628 -55949 2260 -48159 -64498
14883f4498L9139J5830l648M0284M6686j3630o0552j9455J07948j4612k6659n5770
$$ -64498 -25359 -9529 -13177 27107 73793 60163 -389 -19844 88104 73492 46833 -8937
14871h937J13599L4205n6688l2112j0025M5590N7951m4388p2619N3928m7986o0559
$$ -8937 104662 138867 82179 50067 40042 85632 143583 99195 26576 80504 32518 -28041
14859b8041m225J8965j2140o017O7796M1971k2484K6122l5446n1163N6019J7919
$$ -28041 -32266 -13301 -25441 -31458 36338 78309 55825 81947 46501 -4662 51357 69276
14847F9276L3955m8421j9045p4362p351J8346k0304L5254P5894p1068p6811K3686
$$ 69276 103231 54810 35765 -38597 -45948 -27602 -47906 -12652 63242 -7826 -84637 -60951
14835f0951M0696Q3389K0737n870j9354L1238q22q136J79k1571n1417j8275L6295
$$ -60951 -20255 63134 83871 78001 58647 89885 89063 80927 81106 59535 8118 -10157 26138
14822B6138p980J9290k2968J1628j4415M7607j353p5931r0537m8290O5936N0519
$$ 26138 18158 37448 14480 26108 11693 59300 57947 -17984 -108521 -156811 -90875 -40356
14810d0356Q597l1880K4297M872R8N7782J3435n3419L5203k0211O986q9521n7073
$$ -40356 -31759 -63639 -39342 -34470 -34372 23410 36845 -16574 18629 -1582 5404 -84117 -141190
14797a41190R2333M2543M772j3514M0607Q0944p78n1873J7195m8895P7926K0048
$$ -141190 -48857 -6314 -1542 -15056 25551 106495 105717 53844 71039 22144 100070 120118
14785A20118J8275k0768k9407m8835o866K2458l4504k9619L2856j3164M3362j5313
$$ 120118 138393 117625 88218 39383 32517 54975 20471 -9148 23708 10544 53906 38593
14773C8593K0884k3833m5315N3569m7094M013k5207m9934J8351N1988J4847M3900
$$ 38593 59477 35644 -9671 43898 -3196 817 -24390 -74324 -55973 -3985 10862 54762
14761E4762K5428m0196l1404m3370q5190j1173R8489L4043j3550O2070P2121o9393
$$ 54762 80190 39994 8590 -34780 -119970 -131143 -32654 1389 -12161 49909 122030 52637
14749E2637P920l3297p2485p4077N6633K5959J2408j1142m0148Q898K3704K7831
$$ 52637 60557 27260 -45225 -119302 -62669 -36710 -24302 -35444 -75592 -66694 -42990 -15159
14737a5159M4685l8423N101j734m559P942n4592r038Q6793Q1187j09872q890N7334
$$ -15159 29526 -8897 -3796 -5530 -10089 -2147 -56739 -65777 21016 102203 -7669 -16559 40775
14724D0775Q2499Q77K60k1678o356P2737k7983l5276R599o4618P482j6581J0875
$$ 40775 123274 124151 124411 102733 96377 169114 141131 105855 115454 50836 58318 41737 52612
14711E2612o288k1887N9694m0815n7774j4047j9007l0995J13734P0256j13231
$$ 52612 46324 24437 84131 43316 -14458 -28505 -47512 -78507 35227 105483 -7748
14700g748l5444P2496J4366J9308K4400M2715j4035q201l9504o9302q3012L8443
$$ -7748 -43192 29304 43670 62978 87378 130093 116058 107857 68353 -949 -83961 -45518
14688d5518M2384o6702J4838n0795L922M0612n6570q166M9949l5255k8216K9027
$$ -45518 -3134 -69836 -54998 -105793 -101871 -61259 -117829 -125995 -76046 -111301 -139517 -110490
14676a10490N1268j570J1528l6507K8300K0674j7907n8299l5167m84K2425L0290
$$ -110490 -59222 -60792 -49264 -85771 -57471 -36797 -54704 -113003 -148170 -148654 -126229 -95939
14664i5939O2719M6719L1454M059m1118n8075K9813R7605M2o6759n4861K9477
$$ -95939 -33220 13499 44953 49012 7894 -50181 -20368 77237 77279 10520 -44341 -14864
14652a4864L9406k5106O6354M0417q0879n5777k7349M3393j775q256K4765J0596
$$ -14864 24542 -564 65790 106207 25328 -30449 -57798 -14405 -16180 -24436 329 10925
14640A0925K1919K2733m4639k8757J2541K1106q3209l1453o810j6580N918J231
$$ 10925 32844 55577 10938 -17819 -5278 15828 -67381 -98834 -105644 -122224 -116306 -115075
14628a15075k8876j6734o803N3103K4244O9695k5421k7482n2824k275M0741O9903
$$ -115075 -143951 -160685 -167488 -114385 -90141 -20446 -45867 -73349 -126173 -128448 -87707 -17804
14616a7804M1788L9533N0972O0363q7123n7023J3386k4688j9144m0109K8095M0664
$$ -17804 23984 63517 114489 174852 87729 30706 44092 19404 260 -39849 -11754 28910
14604B8910j1057o5066N9949L7605M0725k3730L4274O9893M7159j25863j09095
$$ 28910 17853 -47213 12736 50341 91066 67336 101610 171503 218662 92799 -16296
14593a6296M6208N091m8426J0986M5682K0223J9662n5189p0227N4607L167j3152
$$ -16296 29912 35003 -13423 -2437 43245 63468 83130 27941 -42286 12321 15488 2336
14581B336N6707M0351l9058n0934L0928J7136k1265n8268L1924l8066j13835l6795
$$ 2336 59043 99394 60336 9402 40330 57466 36201 -22067 9857 -28209 -142044 -178839
14569a78839J01440N4343l4893n586K1511P9671K4559R932k6122r2640L5566R2550
$$ -178839 -77399 -23056 -57949 -63535 -42024 37647 62206 72138 46016 -46624 -11058 81492
14557H1492Q0799k3600k5601l2839O646l1433o4327k0794l0055l1519k1547o3838
$$ 81492 162291 138691 113090 80251 86897 55464 -8863 -29657 -59712 -91231 -112778 -176616
14545a76616N283k0063O0544O4298p2682o8755O291J07612K8495l9064k0605m0463
$$ -176616 -171333 -191396 -130852 -66554 -139236 -207991 -201700 -94088 -65593 -104657 -125262 -165725
14533a65725O5445K6769L6783M5873j13416r028L6019M7183k3427M7558J0820
$$ -165725 -100280 -73511 -36728 9145 -104271 -113299 -77280 -30097 -53524 -5966 4854
14522D854j922m3034O8420K1420j1378K1906l9774r8411K8653Q1987M6050m197
$$ 4854 2932 -40102 28318 49738 38360 60266 20492 -77919 -49266 32721 78771 74574
14510G4574l4487k6615j8420k8089N3677R6292j6362r2075j7464Q504P0494m037
$$ 74574 40087 13472 -4948 -33037 20640 116932 100570 8495 -8969 -465 70029 65992
14498F5992k151Q673K6123J8620j9199l0530p0187p1837l748J3667L252k7698
$$ 65992 63841 72514 98637 117257 98058 67528 -2659 -74496 -78244 -64577 -61325 -89023
14486h9023l6492J9927J8773Q7059K8263m5361o7192L923J04146N7227n468p6591
$$ -89023 -125515 -105588 -86815 244 28507 -16854 -84046 -80123 24023 81250 75782 -809
14474h09N5267P7468k2023j07423m1573K0571L0863P6063p7197J2322K9642K6495
$$ -809 54458 131926 109903 2480 -39093 -18522 12341 88404 11207 23529 53171 79666
14462G9666k8776L4168n615j07614l7906M5333L673M641N155R2774R968r3940
$$ 79666 50890 85058 79443 -28171 -66077 -20744 -17071 -12430 -7275 85499 95467 1527
14450A527o2508j0054P2430K0917L9122P845L1703L0024n276n4222j04724p0819
$$ 1527 -60981 -71035 1395 22312 61434 69279 100982 131006 125730 71508 -33216 -104035
14438a04035q972K5344K991L8947p8392m1188K3953P3913J30607J0569l0302J0195
$$ -104035 -113007 -87663 -84672 -45725 -124117 -165305 -141352 -67439 63168 73737 43435 53630
14426E3630L7228j1198l131r1314k4186J15039O0090p8428o4808J7924k7483J8360
$$ 53630 90858 79660 76529 -14785 -38971 76068 136158 57730 -7078 10846 -16637 1723
14414A723k7517K2192M2079j9955k5082l1005r448l2356k812O7367O0096N8911
$$ 1723 -25794 -3602 38477 18522 -6560 -37565 -47013 -79369 -82181 -14814 45282 104193
14402A04193r4715p1613m2773K2725j190M7246L599J0947M3284O4703K754l5752
$$ 104193 9478 -62135 -104908 -82183 -83373 -36127 -32528 -21581 21703 86406 89160 53408
14390E3408n7132l3794l0017M9276j7800K3631l2503J6479Q223r0329l6115J1534
$$ 53408 -3724 -37518 -67535 -18259 -36059 -12428 -44931 -28452 -20229 -110558 -146673 -135139
14378a35139m051Q8973N0980L9767N4166k0188l5153L8461J1762m8880n6352r707
$$ -135139 -139190 -50217 763 40530 94696 74508 39355 77816 89578 40698 -15654 -25361
14366b5361o9033n9529J9198q010r692O5762N9835R3350K2059m5050q1194K8507
$$ -25361 -94394 -153923 -134725 -142735 -152427 -86665 -26830 66520 88579 43529 -37665 -9158
14354i158M6090q3593n9380j0281K7423J4938O0442M3186J5337L164k1198k2649
$$ -9158 36932 -46661 -106041 -116322 -88899 -73961 -13519 29667 45004 48168 26970 4321
14342D321J0756l2063n8260k9557J1615K4108l8622M5282K8647J4373k0132j6635
$$ 4321 15077 -16986 -75246 -104803 -93188 -69080 -107702 -62420 -33773 -19400 -39532 -56167
14330e6167j5633k8213P6017M7992L6206L7647k5657k0361m7873l9080J1406N5660
$$ -56167 -71800 -100013 -23996 23996 60202 97849 72192 51831 3958 -35122 -23716 31944
14318C1944K4657l841L023m114L181m4275o12O8787L5174N3682O007n6302p2841
$$ 31944 56601 52760 55783 51669 54850 10575 9963 78750 113924 167606 173613 117311 44470
14305D4470j06060l9606J3830N2753M9252K3732k4819j41130n4519L5909J13856
$$ 44470 -61590 -101196 -87366 -34613 14639 38371 13552 -127578 -182097 -146188 -32332
14294c2332J02762O701K6367r161N0201j7413N917m3113o4152L8362n3147o3673
$$ -32332 70430 77131 103498 94337 144538 127125 133042 89929 25777 64139 10992 -52681
14282e2681m5717m945L3369P2201Q558N701M3853O5200k6843o3694n1255p966
$$ -52681 -98398 -103343 -69974 2227 10785 16486 60339 125539 98696 35002 -16253 -24219
14270b4219k3907J1077k4831j9368j0982Q231j2406O6533k1941n4870O7487O2163
$$ -24219 -48126 -37049 -61880 -81248 -92230 -83999 -96405 -29872 -51813 -106683 -39196 22967
14258B2967O0845J6033L969N783j0656q8915k1678R494l5293n2715q243O1425
$$ 22967 83812 99845 103814 109597 98941 10026 -11652 -2158 -37451 -90166 -98409 -36984
14246c6984m0136m0827M4133K2256K6236M2057q091k9886p1802N7908M2921K3708
$$ -36984 -77120 -117947 -73814 -51558 -25322 16735 8644 -21242 -93044 -35136 7785 31493
14234C1493K3609P703n1864k8780p1956J2110J3141j2907p9608O7812j691q365
$$ 31493 55102 62805 10941 -17839 -89795 -77685 -64544 -77451 -157059 -89247 -90938 -99303
14222i9303Q2020O7176k0150k0858k70L4661P6457r1103p803O7072o086k5353
$$ -99303 -17283 49893 29743 8885 8615 43276 119733 28630 20827 87899 81813 56460
14210E6460k8181r392K294j213o5514O1374N441n158M6378m882o5622J7353j2078
$$ 56460 28279 18887 21181 19968 -45546 15828 21269 16111 62489 57607 -8015 9338 -2740
14197b740l8053k4668p4084k461O3033L2277l6687J6865L950m9902R0250P6620
$$ -2740 -40793 -65461 -139545 -142006 -78973 -46696 -83383 -66518 -62568 -112470 -22220 54400
14185E4400o20l9368p3649p04N0082O4491K7537k495L3845l110q1423m0397J2616
$$ 54400 53780 14412 -59237 -59941 -9859 54632 82169 79674 113519 110409 28986 -11411 1205
14172A205L3711L2327m4463o5938M5522K1989N8752J1031J0725k8671l169m8648
$$ 1205 34916 67243 22780 -43158 2364 24353 83105 94136 104861 76190 73021 24373
14160B4373k9752l4900L7989P6716k9892j8342o6855K5123L534K2406m5279m3565
$$ 24373 -5379 -40279 -2290 74426 44534 26192 -40663 -15540 -12006 10400 -34879 -78444
14148g8444j2682j4138L3338P6396J8058Q5815j05709j5597P7432L1913o9395
$$ -78444 -91126 -105264 -71926 4470 22528 108343 2634 -12963 64469 96382 26987
14137B6987m526k9044m3108N0458O7228n5624P46l849N474R222L9337k0893J5896
$$ 26987 22461 -6583 -49691 767 67995 12371 13117 9268 14742 23964 63301 42408 58304
14124E8304N9127q1179j11916j33880l0640J40266J27306J13806J8402o5849n2869
$$ 58304 117431 36252 -75664 -209544 -240184 -99918 27388 141194 159596 93747 40878
14113D0878j9112q1115J00995j3922j09052k7912O1842L6569j5500m3000m4706
$$ 40878 21766 -59349 41646 27724 -81328 -109240 -47398 -10829 -26329 -69329 -114035
14102a14035O1409K8939n1884R501m8252K2453N6812K0147N8754Q174k6185j7738
$$ -114035 -52626 -23687 -75571 -66070 -114322 -91869 -35057 -14910 43844 52018 25833 8095
14090H095J0608L6990n2456j33490o1219J01275m7184J6384M5906p758J1142J8309
$$ 8095 18703 55693 3237 -130253 -191472 -90197 -137381 -120997 -75091 -82849 -71707 -53398
14078e3398Q6292J7061N8418N6956n3449n3723j09199K0175L3614L6266O746K420
$$ -53398 32894 49955 108373 165329 111880 58157 -51042 -30867 2747 39013 45759 48179
14066D8179J4994n6925n0484r557K3778J5892q6017o0310J6001K0425r725L5358
$$ 48179 63173 6248 -44236 -53793 -30015 -14123 -100140 -160450 -144449 -124024 -133749 -98391
14054i8391N204K6864N1577J6280M5426k763j14782Q4496J8156j746l1470p3030
$$ -98391 -93187 -66323 -14746 1534 46960 44197 -70585 13911 32067 30321 -1149 -74179
14042g4179N7728l1155k8741n3684j10938L5910N7724R2909L6626P9704O7517
$$ -74179 -16451 -47606 -76347 -130031 -240969 -205059 -147335 -54426 -17800 61904 129421
14031A29421l3585L7417M1544J680r9889p1609j3726m9620L366K8630m0665N330
$$ 129421 95836 133253 174797 176477 76588 4979 -8747 -58367 -55001 -26371 -67036 -61706
14019f1706M9025J3427q6768J0710N1717L2806N5361K1152p8293n518O2438j7180
$$ -61706 -12681 746 -86022 -75312 -23595 9211 64572 85724 7431 1913 64351 47171
14007D7171m742j6879p613o994L4206m317k4650q057m0532p729P2210m6234l1436
$$ 47171 42429 25550 17937 10943 45149 40832 16182 8125 -32407 -40136 32074 -14160 -45596
13994d5596J8440M0979j99j7887m2711j7094L1458k5821q2241n94R321R3910J268
$$ -45596 -27156 13823 13624 -4263 -46974 -64068 -32610 -58431 -140672 -141266 -131945 -38035 -36767
13981c6767M453J536L3626P4372p640p7919n6041m8894o71J0637L3587R494q4100
$$ -36767 -32314 -30778 2848 77220 69580 -8339 -64380 -113274 -113945 -103308 -69721 -60227 -144327
13968a44327K9043R6511N6777j6518L8954M346n1259o630n5630N459Q026M2537
$$ -144327 -115284 -18773 38004 21486 60440 64786 13527 6897 -48733 -43274 -35248 7289
13956G289L941o1261J5144m2019m4126L2019J8561L0817M4377K3515k4780M0082
$$ 7289 11230 -50031 -34887 -76906 -121032 -89013 -70452 -39635 4742 28257 3477 43559
13944D3559Q390J102J193q2010N7996M6278k7024q1327q2743J6685R714k1412
$$ 43559 51949 53051 54244 -27766 30230 76508 49484 -31843 -114586 -97901 -88187 -109599
13932a09599P935O2793O291l7618m0539J1846l061j583Q78N6286k370M9758j0662
$$ -109599 -101664 -38871 -32580 -70198 -110737 -98891 -101952 -103535 -102657 -46371 -48741 1017 -9645
13919i645N3287J11004J3059j2771q0290j01235r2874j37161o816L9306M4900
$$ -9645 43642 154646 167705 154934 74644 -26591 -119465 -256626 -263442 -224136 -179236
13908a79236P8031R1310L6262j8312J6339N552O1916k8596J6093J2147j0049O6723
$$ -179236 -101205 -9895 26367 8055 24394 29946 91862 63266 79359 91506 81457 148180
13896A48180K953n1405K0346O4865N1088L9443o8330m5882k1320p1060r8882J303
$$ 148180 151133 99728 120074 184939 236027 275470 207140 161258 139938 68878 -30004 -28701
13884b8701N2205k2230J1797k6980m9729k3390m4181J3798J08302J5796n6518
$$ -28701 23504 1274 13071 -13909 -63638 -87028 -131209 -117411 -9109 6687 -49831
13873d9831l9464M4851J1358o9397l713M3250P793J4391p7389Q682O1081k2252
$$ -49831 -89295 -44444 -33086 -102483 -106196 -62946 -55153 -40762 -118151 -109469 -48388 -70640
13861g0640J31778Q4610k294o325K8637P177K149K982j05303j57702l523J6020
$$ -70640 61138 145748 143454 137129 165766 172943 175092 178074 72771 -84931 -88454 -72434
13849g2434l3785K9413K2196P5978j7843P075r2206j0521K9101m4349l1167L7468
$$ -72434 -106219 -76806 -54610 21368 3525 10600 -81606 -92127 -63026 -107375 -138542 -101074
13837a01074J14432J06861n4311j89k3045p136l3247o2518K2246L6520O094N8242
$$ -101074 13358 120219 65908 65719 42674 35538 2291 -60227 -37981 -1461 4633 62875
13825F2875O637r16n6458m5987m1351O6159M0801J8385O6953R0613n5474p8041
$$ 62875 69512 68596 12138 -33849 -75200 -9041 31760 50145 117098 207711 152237 74196
13813G4196l7238N2747k0114M5832J7402k0431K4458q5883Q236j5696J9861P260
$$ 74196 36958 89705 69591 115423 132825 112394 136852 50969 59205 43509 63370 70630
13801G0630o5102n637Q894n0391n738J0719L9316Q5601l8213o0713n2569q133
$$ 70630 5528 -109 8785 -41606 -47344 -36625 2691 88292 50079 -10634 -63203 -71336
13789g1336O7429k8160j06351m854L3434k8169m9525O2210R9983k8764R1637J11754
$$ -71336 -3907 -32067 -138418 -143272 -109838 -138007 -187532 -125322 -25339 -54103 37534 149288
13777A49288J2072p5911j08953p6566l8055M8572P1229k3441k2871L5441M1247
$$ 149288 161360 85449 -23504 -100070 -138125 -89553 -18324 -41765 -64636 -29195 12052
13766A2052J4390L4980n4060k1094q4037K667O8590N8769K0691l1114p2284l7854
$$ 12052 26442 61422 7362 -13732 -97769 -95102 -26512 32257 52948 21834 -50450 -88304
13754h8304l4249J7663R0684J505k186L6396R0410K0334n7071J7517N0975j103
$$ -88304 -122553 -104890 -14206 -12701 -14887 21509 111919 132253 75182 92699 143674 142571
13742A42571k6611n3033n2414K425M373k6258K6023J2355k7634r218K4749j2028
$$ 142571 115960 62927 10513 12938 17311 -8947 17076 29431 1797 -7421 17328 5300
13730E300P1841N1877j6101j25148r124L4825K010k1841N6658J8726l3045k5899
$$ 5300 77141 129018 112917 -12231 -21355 13470 15480 -6361 50297 69023 35978 10079
13718A0079o0363j0742N4822n679O812k192K2650M2795L6016j0070k3924q6459
$$ 10079 -50284 -61026 -6204 -11883 -5071 -7263 15387 58182 94198 84128 60204 -26255
13706b6255m673K1676n847L3020Q1615j28989j28402Q7763J14037k2038p4273
$$ -26255 -30928 -9252 -15099 17921 99536 -29453 -157855 -70092 43945 21907 -52366
13695e2366j13249O6851R2945n1457j02515p295J5595J9528P4188J16161o4548
$$ -52366 -165615 -98764 -5819 -57276 -159791 -167086 -151491 -131963 -57775 58386 -6162
13684f162j32908N3969N4374R3506N2265m958p6618l0804K9750k2092o1852m4791
$$ -6162 -139070 -85101 -30727 62779 115044 110086 33468 2664 32414 10322 -51530 -96321
13672i6321M147l5108P1712O7687Q336J1694l6121L8874L6513m8419M0636J5219
$$ -96321 -92174 -127282 -55570 12117 20453 32147 -3974 34900 71413 22994 63630 78849
13660G8849m0914J3187r596o2247J1365k5935n8870J1895Q9438O5508K1373K2533
$$ 78849 37935 51122 41526 -20721 -9356 -35291 -94161 -82266 7172 72680 94053 116586
13648A16586L1879k258j14399l9033J8966j1479l4148m9401j2519O7797O9193
$$ 116586 148465 146207 31808 -7225 11741 262 -33886 -83287 -95806 -28009 41184
13637D1184J2779p2109j07672M580K5411J15473K1814l1766o6220j052L6345l3732
$$ 41184 53963 -18146 -125818 -121238 -95827 19646 41460 9694 -56526 -57578 -21233 -54965
13625e4965K0408J0404N6185l4000l0059K6176j21651m2876Q4493p737P929J07267
$$ -54965 -34557 -24153 32032 -1968 -32027 -5851 -127502 -170378 -85885 -93622 -85693 21574
13613B1574k636k3465J4627j1320J9644p4275J0991J10050O9585L0773r8264m1069
$$ 21574 18938 -4527 10100 -1220 18424 -55851 -44860 65190 134775 165548 67284 26215
13601B6215k2468r6734n477L9626M4017n7147j1117L6087K1510l4001m2387n105
$$ 26215 3747 -92987 -98464 -58838 -14821 -71968 -83085 -46998 -25488 -59489 -101876 -106981
13589a06981j9864J4146K7018L3527l1837n0636R6512O2608J4931j1405M0028
$$ -106981 -126845 -112699 -85681 -52154 -83991 -134627 -38115 24493 39424 28019 68047
13578F8047j6403P680j9264j2291P0658r797N68M4249O3030k4324p2372k1693
$$ 68047 51644 59324 40060 27769 98427 88630 89198 133447 196477 172153 99781 78088
13566G8088K398K3820J0830k2413l541P382P3586P4521k5229j27383o4266o7520
$$ 78088 80486 104306 115136 92723 89182 96564 170150 244671 219442 92059 27793 -39727
13554c9727o7706m2363J12859K4700l5374o2365L321P133J5628J0156m6621J09402
$$ -39727 -107433 -149796 -36937 -12237 -47611 -109976 -106655 -99522 -83894 -73738 -120359 -10957
13542a0957M1578m4008o7019k5580M9781k7290l4055O0848R8170j6492q26l0824
$$ -10957 30621 -13387 -80406 -105986 -56205 -83495 -117550 -56702 41468 24976 24150 -6674
13530f674m5936L1131J03765Q52p6456J8429K5651k7838J7207p2660m4228k2423
$$ -6674 -52610 -21479 82286 83138 6682 25111 50762 22924 40131 -32529 -76757 -99180
13518i9180m1321J998M0607R4801L3709j2921m1256k2371k7657L9041J13778m6338
$$ -99180 -140501 -138503 -97896 -3095 30614 17693 -23563 -45934 -73591 -34550 79228 32890
13506C2890o2366K1679m3445N122j1421K751K4638L0414O4427m504l0575j3308
$$ 32890 -29476 -7797 -51242 -46120 -57541 -54790 -30152 262 64689 60185 29610 16302
13494A6302n1716J9966Q727q337l8545K5804O3098o2141N518n9357n2508K7290
$$ 16302 -35414 -15448 -6721 -15058 -53603 -27799 35299 -26842 -21324 -80681 -133189 -105899
13482a05899R134K0445L4756K9947l4315n6602N7720M4660J1026P2925j5882J2326
$$ -105899 -96765 -76320 -41564 -11617 -45932 -102534 -44814 -154 10872 83797 67915 80241
13470H0241n3506j424p2020n2984J3522M924N7503O7193m2170K0315P2688j7632
$$ 80241 26735 25311 -46709 -99693 -86171 -81247 -23744 43449 1279 21594 94282 76650
13458G6650K54j1229q673L917r0725m6426J5438N7681j4600o1121j8338m6246
$$ 76650 76904 65675 57002 60919 -29806 -76232 -60794 -3113 -17713 -78834 -97172 -143418
13446a43418m3553K7386M9724M8649J4726l2868j2545P2968L5292l7510k4045
$$ -143418 -186971 -159585 -109861 -61212 -46486 -79354 -91899 -18931 16361 -21149 -45194
13435d5194M9441L0916l154l4343R59Q332k977K596n9492j4672q976J18562R034
$$ -45194 4247 35163 32009 -2334 -1375 6957 3980 6576 -52916 -67588 -76564 41998 51032
13422E1032q7230M068o347O0522N4621M1677k1374Q68p5666o6793j0423L4417
$$ 51032 -36198 -32130 -38477 22045 76666 118343 96969 97837 22171 -44622 -55045 -20628
13410b0628j6121K7471l791j4354J17442k2775k5896N907m8283L618M4015J3725
$$ -20628 -36749 -9278 -13069 -27423 90019 67244 41348 47255 -1028 2590 46605 60330
13398F0330k1202p356l4455k0079L6625l0319O2809M8997k4109J1728M5606l8463
$$ 60330 39128 31772 -2683 -22762 13863 -16456 46353 95350 71241 82969 128575 90112
13386I0112k1516K0642K3409k4917j4097k8659m2328K6503M360J0609O5043O5487
$$ 90112 68596 89238 112647 87730 73633 44974 2646 29149 33509 44118 109161 174648
13374A74648K9096j04106k1859q7791n3970K994N6173k0101O158r1609k1794M6274
$$ 174648 203744 99638 77779 -10012 -63982 -60988 -4815 -24916 -18758 -110367 -132161 -85887
13362h5887j4542L9938J1914j335N3138J3905o410M5127O1419o532K3229j9991
$$ -85887 -100429 -60491 -48577 -49912 3226 17131 10721 55848 117267 110735 133964 113973
13350A13973m6963k1986J0453m7950M736l9749j9868J4175M8012K1330j335P463
$$ 113973 67010 45024 55477 7527 12263 -27486 -47354 -33179 14833 36163 34828 42291
13338D2291Q295P3672m05P197k3053L2672L4873l4058o689j6726l3188R879l2667
$$ 42291 50586 124258 123853 131050 107997 140669 175542 141484 134795 118069 84881 94760 62093
13325F2093L8794m744o7659j0467R7589l7657l6874P3603k0639O5747k1703l1769
$$ 62093 100887 96143 28484 18017 115606 77949 41075 114678 94039 159786 138083 106314
13313A06314K842k8371J46o3n8250j19041o6845L2176R3911k0979o2437k7289
$$ 106314 109156 80785 80931 80868 22618 -96423 -163268 -131092 -37181 -58160 -120597 -147886
13301a47886P0257K8833K2814k8832k543M2464j6589M4589J6468q8268o0228J18220
$$ -147886 -77629 -48796 -25982 -54814 -57357 -14893 -31482 13107 29575 -58693 -118921 -701
13289g01o323k0558M398O4373K6947q2687p3910k6762R544k223O2355L7991O644
$$ -701 -7024 -27582 -23184 41189 68136 -14551 -88461 -115223 -105679 -107902 -45547 -7556 -912
13276i12M0988N8058j03743l6504L7875l6471J0968j6215k4415o6777L8039M086
$$ -912 40076 98134 -5609 -42113 -4238 -40709 -29741 -45956 -70371 -137148 -99109 -95023
13264i5023J441r79L6654K009n9104L8150N486l9143m1369Q8986N1792M1564j9145
$$ -95023 -93582 -94561 -57907 -55898 -115002 -76852 -71366 -110509 -151878 -62892 -11100 30464 11319
13251A1319K278l7209p0298R608Q0224J2816n6581m078Q1652l8928p659r69K7298
$$ 11319 13597 -23612 -93910 -84302 -4078 8738 -47843 -51921 29731 -9197 -16856 -17825 9473
13238I473j1083l3919P6700K0053o6427n6043J6573L5108n5158l2860Q7842M791
$$ 9473 -1610 -35529 41171 61224 -5203 -61246 -44673 -9565 -64723 -97583 -9741 -4950
13226d950l3552M3543N785l736J2381m8077M554K2475m8860o0087N8827J4657
$$ -4950 -38502 5041 10826 7090 19471 -28606 -24052 -1577 -50437 -110524 -51697 -37040
13214c7040j1182m8683M8475M1838J3588j1457m4042J48637R4158o3416j35063
$$ -37040 -48222 -96905 -48430 -6592 6996 -4461 -48503 100134 194292 130876 -4187
13203d187l2778j760N0588j6250j01819K593K2918N9796J989q257o7295k4209
$$ -4187 -36965 -38725 11863 -4387 -106206 -103613 -80695 -20899 -18910 -27167 -94462 -118671
13191a18671J8093Q9647j7827L8537k0021R4351N8338k3143n9654j5854M2314
$$ -118671 -100578 -10931 -28758 9779 -10242 84109 142447 119304 59650 43796 86110
13180H6110l7735j4407m3757m9220j6844l5274p6268L1448L6697K5755q402M223
$$ 86110 48375 33968 -9789 -59009 -75853 -111127 -187395 -155947 -119250 -93495 -101897 -97674
13168i7674J7197M7826J7619K7457J8515l8075m836O5707M568O013o6783m4655
$$ -97674 -80477 -32651 -15032 12425 30940 -7135 -11971 53736 58304 64317 -2466 -47121
13156d7121K3104N2980n0989o2131L7164L1362M8760m8602m7591N9830L0582l5396
$$ -47121 -24017 28963 -22026 -84157 -46993 -15631 33129 -15473 -63064 -3234 27348 -8048
13144h048j9951Q279k8881j6137J5775p0928q7668l084J04934N4362q3773j4185
$$ -8048 -27999 -19720 -48601 -64738 -48963 -119891 -207559 -210643 -105709 -51347 -135120 -149305
13132a49305P2587R8776Q0445j9714n056L068m6883J0338l436r3896J6900J5993
$$ -149305 -76718 22058 102503 82789 77733 80801 33918 44256 40820 -53076 -36176 -20183
13120b0183P185J36496O9568O793l9103R53p5873L4856K8564M772j0083l4032
$$ -20183 -12998 123498 193066 199859 160756 161709 85836 120692 149256 154028 143945 109913
13108A09913r07k5923K373k0465j2570l7390K278J525J3308K2272k0739l3437
$$ 109913 109006 83083 85456 64991 52421 15031 17309 18834 32142 54414 33675 238
13096B38J6668J9738L2853m9383m3484M1987O725j4627J6542O8291J8865j818
$$ 238 16906 36644 69497 20114 -23370 18617 25342 10715 27257 95548 114413 112595
13084A12595K6k7569N961n9494r1742m2914Q5103J08735P8997o6752l6395J416
$$ 112595 112621 85052 91013 31519 -60223 -103137 -18034 90701 169698 102946 66551 67967
13072F7967n4219m4171l949M9344j6145K3103N5824O3355N8326p9951m3186n7141
$$ 67967 13748 -30423 -34372 14972 -1173 21930 77754 141109 199435 119484 76298 19157
13060A9157N7897m5845o0886l9926J2978R0065K6154q8239p2881P3100P8191M0598
$$ 19157 77054 31209 -29677 -69603 -56625 33440 59594 -28645 -101526 -28426 49765 90363
13048I0363l2065j0456n9689q1039r8122J840J2802M8262N5149L384p7635n668
$$ 90363 58298 47842 -11847 -92886 -191008 -189168 -176366 -128104 -72955 -69571 -147206 -152874
13036a52874Q9903O5017k171k5051n919Q33P432k8725o281j0167J2197J3060n7
$$ -152874 -62971 2046 -125 -25176 -31095 -30262 -22830 -51555 -57836 -68003 -55806 -42746 -42803
13023d2803K1072K688N2397N6019O780J5415k0168r1437L0015K0573o3449j836
$$ -42803 -21731 -19043 33354 89373 96153 111568 91400 -37 29978 50551 -12898 -14734
13011a4734n6023j0378Q5624L8193l6073q6067Q0423R6500m4997J4450m056m9209
$$ -14734 -70757 -81135 4489 42682 6609 -79458 965 97465 52468 66918 62862 13653
12999A3653o6208m6912L4139M497O016R9284L164r741o083j4804O2706m5185j06646
$$ 13653 -52555 -99467 -65328 -60831 -54815 44469 47633 37892 31809 17005 79711 34526 -72120
12986g2120Q3n7444J8598k6885k6880k8833N3996J28316J3209j8630k0642J8712
$$ -72120 -72037 -129481 -110883 -137768 -164648 -193481 -139485 -11169 2040 -16590 -37232 -18520
12974a8520l008p1918l8157Q305L4201J6830K0565M0476Q0863m4881l7157m4109
$$ -18520 -21528 -93446 -131603 -123298 -89097 -72267 -51702 -11226 69637 24756 -12401 -56510
12962e6510m3982p4066l1371J08796J28588L9593N3p866j690J2575L5061k3996
$$ -56510 -100492 -174558 -205929 -97133 31455 71048 71101 63235 61545 74120 109181 85185
12950H5185k3166M4091J04n9823j767l3948j9995j8297Q487O6314o4915L2739
$$ 85185 62019 106110 106214 46391 44624 10676 -9319 -27616 -19129 47185 -17730 15009
12938A5009P024M9935J5537r9338k6724J11948L0596k5347K1041K3554j9583o7467
$$ 15009 22033 71968 87505 -11833 -38557 73391 103987 78640 99681 123235 103652 36185
12926C6185q7345p3460Q8058Q2324p753L7811n1365j1826n038o382L251L4441
$$ 36185 -51160 -124620 -36562 45762 38009 75820 24455 12629 7591 1209 4460 38901
12914C8901k3906k7427K0477k8234J4801N518o5141k6806n98N1009O4441o365
$$ 38901 14995 -12432 8045 -20189 -5388 130 -65011 -91817 -92415 -41406 23035 16670
12902A6670l9298j296k4496L0987M907Q379L7721l5405m7941O9480r0409J7283
$$ 16670 -22628 -23924 -48420 -17433 -12526 -4147 33574 -1831 -49772 19708 -70701 -53418
12890e3418n319P6105L5671K1975k3884J5341L417n596L4413L2166L5435o6459
$$ -53418 -58737 17368 53039 75014 51130 66471 69888 64292 98705 130871 166306 99847
12878I9847j14149Q188J05548J5669J3874l7223l4966k7910l97M8560k2319q9635
$$ 99847 -14302 -6114 99434 115103 128977 91754 56788 28878 28481 77041 54722 -34913
12866c4913J5991K208J4782Q59N243j4416N4353o9552k0307L3122J23178J10216
$$ -34913 -18922 -16714 -1932 -1073 4170 -10246 44107 -25445 -45752 -12630 110548 220764
12854B20764m1159p5370n2630L2115r689n8159j7866j993N5152K7052l3461N3940
$$ 220764 179605 104235 51605 83720 74031 15872 -1994 -3987 51165 78217 44756 98696
12842I8696m9566p2366L2278L2959O8749k8860m5711J6981j8885k8630M7384L5006
$$ 98696 49130 -23236 9042 42001 110750 81890 36179 53160 34275 5645 53029 88035
12830H8035q747M4765l3561J6573n1417o0401n6514j8528j1874l5957R01P1802
$$ 88035 79288 124053 90492 107065 55648 -4753 -61267 -79795 -91669 -127626 -126725 -54923
12818e4923O138K9801o061M1670j025K1719n4860m4072j8859J10608J21392k7692
$$ -54923 -48785 -18984 -25045 16625 15600 37319 -17541 -61613 -80472 30136 151528 123836
12806A23836o5968m6858n3195J35o1015l590P5355M2721N5821M38p4277j01682
$$ 123836 57868 11010 -42185 -42050 -103065 -106655 -31300 11421 67242 67680 -6597 -108279
12794a08279N9312P6308L7017P6923L4879p4436J204l3329j9010j8640L714O324
$$ -108279 -48967 27341 64358 141281 176160 101724 102928 69599 50589 31949 35663 41987
12782D1987q3408p4851n8473J4497Q2351P6348N7932J5071Q565N4942N4080n2042
$$ 41987 -41421 -116272 -174745 -160248 -77897 -1549 56383 71454 80019 134961 189041 136999
12770A36999m5512J23K0520J2088j8140o0757o1790P3246Q5907n7726q837N995
$$ 136999 91487 91610 112130 124218 106078 45321 -16469 56777 142684 84958 76121 82116
12758H2116k835J8556o0491r5438m359j699P3858N3489m9502m0048n0124n29O3598
$$ 82116 79281 97837 37346 -58092 -62451 -64150 9708 63197 13695 -26353 -76477 -77006 -13408
12745a3408J3859k0975l389J5903J9132N5105j6048J5572k7041j0329r7m8666
$$ -13408 451 -20524 -23913 -8010 11122 66227 50179 65751 38710 28381 28284 -20382
12733b0382q980K5757K3936l41p038P431r1l1612n3602p1642q882N0686K2417
$$ -20382 -29362 -3605 20331 19990 12952 20383 20292 -11320 -64922 -136564 -145446 -94760 -72343
12720g2343P641M3003L4895l8309o7057N4789L9840p0167l916n1629k7419N7555
$$ -72343 -64702 -21699 13196 -25113 -92170 -37381 2459 -67708 -71624 -123253 -150672 -93117
12708i3117L8583N806r498P3455J04851J8748p3895j3392O9309l2348j09400j34432
$$ -93117 -54534 -48728 -58226 15229 120080 138828 64933 51541 120850 88502 -20898 -155330
12696a55330Q8974M7882o6507J3413M2207R267P99J2579P3385J8639K6728q2724
$$ -155330 -66356 -18474 -84981 -71568 -29361 -20094 -19295 -6716 66669 85308 112036 29312
12684B9312p0821J7991k5552l1839N587N2308N0527J5317Q8265O0935p742j34995
$$ 29312 -41509 -23518 -49070 -80909 -75322 -23014 27513 42830 131095 192030 184288 49293
12672D9293l9768M6653P0577J0212k2290k2662J247o2264j5807k132L2122k4618
$$ 49293 9525 56178 126755 136967 114677 92015 93262 30998 15191 13059 45181 20563
12660B0563j0793j6651l4537M630j2875J9611o3573l4439p4014M8616J33102N5168
$$ 20563 9770 -6881 -41418 -36788 -49663 -30052 -93625 -128064 -202078 -153462 -20360 34808
12648C4808m1951L41L6667j423p050o856n3580k4056K5127P3771k2066k409o1676
$$ 34808 -7143 -6802 29865 28442 21392 14536 -39044 -63100 -37973 35798 13732 11323 -50353
12635e0353l637J5250m3256o845j0236K3685L1784q7519N442L9800R8837K4275
$$ -50353 -53990 -38740 -81996 -88841 -99077 -75392 -43608 -131127 -125685 -85885 12952 37227
12623C7227o2188q1308J4394Q5632P22j9214l994N8704N1125m0627J0430j3365
$$ 37227 -24961 -106269 -91875 -6243 -5521 -24735 -28729 29975 81100 40473 50903 37538
12611C7538k3021n5080o8529O0424Q3037M5987q6544J3793L4996q83J7563m5811
$$ 37538 14517 -40563 -109092 -48668 34369 80356 -6188 7605 42601 41718 59281 13470
12599A3470m1696K8822K9579j5747k4600j5113R6622M8104q0400j08142k7341
$$ 13470 -28226 596 30175 14428 -10172 -25285 71337 119441 39041 -69101 -96442
12588i6442M7608L5143O943k2829k664r064J1498L6227J3970o9418K967m7193
$$ -96442 -48834 -13691 -6748 -29577 -32241 -41305 -29807 6420 20390 -49028 -46061 -93254
12576i3254M2536P1842j0787k5135M207J37767P1035o1180q1694o1219o40M3946
$$ -93254 -50718 21124 10337 -14798 -10591 127176 198211 137031 55337 -5882 -6522 37424
12564C7424R443J9268k5956j0047j6989K4578n0729j01158K8479N5209K6731M3758
$$ 37424 46867 66135 40179 30132 13143 37721 -13008 -114166 -85687 -30478 -3747 40011
12552D0011K2452m7328o6739L7485N0482k5793J7161k3515J3743k6898K8479k7919
$$ 40011 62463 15135 -51604 -14119 36363 10570 27731 4216 17959 -8939 19540 -8379
12540h379m2295k0857m998m0845P0521M2961j8987m7327P160J4534q5021N0668
$$ -8379 -50674 -71531 -76529 -117374 -46853 -3892 -22879 -70206 -63046 -48512 -133533 -82865
12528h2865J24568l9505M7455k319m0344o5610l2762o740r966P5182M6324k669
$$ -82865 41703 2198 49653 47334 6990 -58620 -91382 -98122 -108088 -32906 13418 10749
12516A0749O301k270l2132n6774m6706R7271L5854p6121m013M2260N3866k2548
$$ 10749 17050 14780 -17352 -74126 -120832 -23561 12293 -63828 -67841 -25581 28285 5737
12504E737Q304K3312M122r1693L764O7684J7527m3923q731M0555m450m4371L2314
$$ 5737 14041 37353 41475 -50218 -46454 21230 38757 -5166 -13897 26658 22208 -22163 10151
12491A0151L6236o022l5526q3607m2769J453L2981M1959N5952j9279p886k850
$$ 10151 46387 40365 4839 -78768 -121537 -120084 -87103 -45144 10808 -8471 -16357 -19207
12479a9207R159n2803Q2599P2885n77o4142m0583K359K7441k4420N757O2462p8595
$$ -19207 -10048 -62851 19748 92633 92056 27914 -12669 -10310 17131 -7289 -1532 60930 -17665
12466a7665j00624k4030K4765K6553N0493L0422M735Q85O598o6914q9865r530
$$ -17665 -118289 -142319 -117554 -91001 -40508 -10086 -5351 -4466 2132 -64782 -154647 -164177
12454a64177R9769J12591l8697N444K6020P742O0974K7556m4383r6994j2557j3587
$$ -164177 -64408 48183 9486 14930 40950 48692 109666 137222 92839 -4155 -16712 -30299
12442c0299p2734p791M1284O6721j2857P1774k4639p0381l157j1653j1017m2497
$$ -30299 -103033 -110824 -69540 -2819 -15676 56098 31459 -38922 -42079 -53732 -64749 -107246
12430a07246k058J02080N9615N4412k8770p1465P2940j981Q000K1022m5273m1737
$$ -107246 -109304 -7224 52391 106803 78033 6568 79508 77527 85527 106549 61276 19539
12418A9539j9883p809m4322l4296L2746J6351L0623o4004q6866j6390L3323O7751
$$ 19539 -344 -8153 -52475 -86771 -54025 -37674 -7051 -71055 -157921 -174311 -140988 -73237
12406g3237M6791R370l9655R089L5209o2842j2866M8512q5838j4793J66314Q7199
$$ -73237 -26446 -17076 -56731 -47642 -12433 -75275 -88141 -39629 -125467 -140260 26054 113253
12394A13253K2718p4289j5206q8135j02242Q3599J00009l728o8472j19976p640
$$ 113253 135971 61682 46476 -41659 -143901 -60302 39707 35979 -32493 -152469 -160109
12383a60109M7849R0039M6820j5116J1160k9166m2146j8752M3627O1307K0393
$$ -160109 -112260 -22221 24599 9483 20643 -8523 -50669 -69421 -25794 35513 55906
12372E5906K1525K2822j07002L6540j2832q1224Q513j2756r557J1888N532J6168
$$ 55906 77431 100253 -6749 29791 16959 -64265 -55752 -68508 -78065 -66177 -60645 -44477
12360d4477J3604K1226l804L4609N784j9J0391K2594n7247m8782j2220J2126P0612
$$ -44477 -30873 -9647 -13451 21158 26942 26923 37314 59908 2661 -46121 -58341 -46215 24397
12347B4397J2575m1230M0104o1273N5124M5797K1056m6025j21230P504l4132k4879
$$ 24397 36972 -4258 35846 -25427 29697 75494 96550 50525 -70705 -63201 -97333 -122212
12335a22212P4497N7225j129k9541m9844k9942O3498M0679l0370n3352j4019J4655
$$ -122212 -47715 9510 8381 -21160 -71004 -100946 -37448 3231 -27139 -80491 -94510 -79855
12323g9855M7490P1710J8079k9494M6270M6809q1150k5582N7924K7343l8580M0025
$$ -79855 -32365 39345 57424 27930 74200 121009 39859 14277 72201 99544 60964 100989
12311A00989K3272o3159p7606J9050J2527L6919p302l3627j6990R8411K212q4275
$$ 100989 124261 61102 -16504 2546 15073 51992 44690 11063 -5927 92484 94696 10421
12299A0421k6784M963J6032M4285j3645n9547L9843N5717m2902K8197n0388l8223
$$ 10421 -16363 -11400 4632 48917 35272 -24275 15568 71285 28383 56580 6192 -32031
12287c2031K6845k6755n77N51K1159Q8051J5591k431l6453o8526j4889K4252N9041
$$ -32031 -5186 -31941 -32518 -31967 -10808 77243 92834 90403 53950 -14576 -29465 -5213 53828
12274E3828q605l7792J5936Q5319p8513o8572k9653M5936j3798j2568M0433j3119
$$ 53828 45223 7431 23367 108686 30173 -38399 -68052 -22116 -35914 -48482 -8049 -21168
12262b1168M8276l583k6467m1089p207P0210m2224k6681P0230O3978m5913l6640
$$ -21168 27108 23525 -2942 -44031 -51238 18972 -23252 -49933 20297 84275 38362 1722
12250A722n814J5638n4669L1286J2260k7923p2425k3309L4224R384L6987k9295
$$ 1722 -4092 11546 -43123 -11837 423 -27500 -99925 -123234 -89010 -79626 -42639 -71934
12238g1934p3416j5620J14587N371j01213k2691o447K8975O1351O2823n305K6700
$$ -71934 -145350 -160970 -46383 -41012 -142225 -164916 -171363 -142388 -81037 -18214 -23519 3181
12226C181j7141L2506O1620n4268j8875J795j9744J3519n5610j02683k6475J26784
$$ 3181 -13960 18546 80166 25898 7023 8818 -10926 2593 -53017 -155700 -182175 -55391
12214e5391O6782j9547r9874k5570M7166K6060K4965P7778M4742O4124q8325p7427
$$ -55391 11391 -8156 -108030 -133600 -86434 -60374 -35409 42369 87111 151235 62910 -14517
12202a4517k6428Q2868M8034k5890K8300l3602O0693m3808k9939j2294O340q6067
$$ -14517 -40945 41923 89957 64067 92367 58765 119458 75650 45711 33417 39757 -46310
12190d6310J5352j0063p839L3778l3361j9943R1159J9140m2067O4718P4298m8948
$$ -46310 -30958 -41021 -48860 -15082 -48443 -68386 22773 41913 -154 64564 138862 89914
12178H9914l127o357o8180o0668J0505L6393l4198J3802Q9079K094m7307j0615
$$ 89914 86787 80430 12250 -48418 -37913 -1520 -35718 -21916 67163 69257 21950 11335
12166A1335O7039o4455r1769o2222m9664P2566P9834k4667R0486P4646k5343n2978
$$ 11335 78374 13919 -77850 -140072 -189736 -117170 -37336 -62003 28483 103129 77786 24808
12154B4808k07J7416m6511n0995N310J9647j34352j765p9331Q1425J04557L5670
$$ 24808 24601 42017 -4494 -55489 -50179 -30532 -164884 -166649 -245980 -164555 -59998 -24328
$$ [...]
##END NTUPLES=NMR SPECTRUM
##END=
