##TITLE=Analysis number 319484
Compound Code cc 58110
Book Reference 488/24
Project Code adrs
Chemist Name miguelg
##JCAMPDX= 6.0         $$ Bruker NMR JCAMP-DX V2.0
##DATA TYPE= NMR SPECTRUM
##DATA CLASS= NTUPLES
##ORIGIN= Bruker BioSpin GmbH
##OWNER= nmr
$$ XWIN-NMR		Version 3.5
$$ Tue May 16 14:42:07 2006 GMT Daylight Time (UT+1h)  MAYBRIDGE\nmr@NMR_250MHZ
##.OBSERVE FREQUENCY= 250.131544655141
##.OBSERVE NUCLEUS= ^1H
##.ACQUISITION MODE= SIMULTANEOUS (DQD)
##.ACQUISITION SCHEME= undefined
##.AVERAGES= 16
##.DIGITISER RES= 18
##SPECTROMETER/DATA SYSTEM= dpx250
##.PULSE SEQUENCE= zg30
##.SOLVENT NAME= CDCl3
##.SHIFT REFERENCE= (INTERNAL, CDCl3, 0, 16.4524)
##AUDIT TRAIL= $$ (NUMBER, WHEN, WHO, WHERE, WHAT)
$$ ##TITLE= Audit trail, XWIN-NMR		Version 3.5
$$ ##JCAMPDX= 5.01
$$ ##ORIGIN= Bruker BioSpin GmbH
$$ ##OWNER= nmr
$$ C:\u/data/dgb/nmr/ADRS/4510/pdata/1/auditp.txt
$$ ##AUDIT TRAIL=  $$ (NUMBER, WHEN, WHO, WHERE, WHAT)
(   1,<2006-05-16 14:41:31.41 +100>,<MAYBRIDGE\nmr>,<NMR_250MHZ>,
      <created by zg, POWCHK disabled, PULCHK disabled
       configuration hash MD5:
       84 BC 41 DB A1 6E 1D 46 DA 25 12 A5 C1 ED C5 3A
       data hash MD5: 64K
       F8 AF 03 C1 FE 68 A7 96 58 54 8D 93 F7 CD CC 63>)
(   2,<2006-05-16 14:41:49.91 +100>,<MAYBRIDGE\nmr>,<NMR_250MHZ>,
      <Start of raw data processing
       ef LB = 0.3 FT_mod = 6 PKNL = 1 SI = 32K 
       data hash MD5: 32K
       B7 BE 26 BB 16 38 6D 22 44 E0 57 64 9B DF 4F CB>)
(   3,<2006-05-16 14:41:54.27 +100>,<MAYBRIDGE\nmr>,<NMR_250MHZ>,
      <apk 
       data hash MD5: 32K
       CA 97 53 25 5B 01 F0 87 2A 20 FB 11 46 81 74 96>)
(   4,<2006-05-16 14:41:55.67 +100>,<MAYBRIDGE\nmr>,<NMR_250MHZ>,
      <abs ABSG = 5 
       data hash MD5: 32K
       DC CD FB 1E 15 52 F6 2D 57 E5 1B 29 65 2E 91 B2>)
$$ ##END=
$$ 
$$ hash MD5
$$ 81 7C 56 02 7F CC 06 02 A8 92 BC 5A CF 43 3B 12
##$RELAX= 
##$RELAX= 
##$RELAX= 
##$RELAX= 
##$RELAX= 
##$RELAX= 
##$RELAX= 
$$ Bruker specific parameters
$$ --------------------------
##$DU= <C:\u>
##$EXPNO= 4510
##$NAME= <ADRS>
##$PROCNO= 1
##$TYPE= <nmr>
##$USER= <dgb>
##$AMP= (0..31)
100 100 100 100 100 100 100 100 100 100 100 100 100 100 100 100 100 100 
100 100 100 100 100 100 100 100 100 100 100 100 100 100 
##$AQSEQ= 0
##$AQ_mod= 3
##$AUNM= <au_zg>
##$AUTOPOS= <46 >
##$BF1= 250.13
##$BF2= 250.13
##$BF3= 250.13
##$BF4= 250.13
##$BF5= 500.13
##$BF6= 500.13
##$BF7= 500.13
##$BF8= 500.13
##$BYTORDA= 1
##$CFDGTYP= 0
##$CFRGTYP= 5
##$CHEMSTR= <none>
##$CNST= (0..31)
1 1 145 1 1 1 1 1 1 1 1 1 1 1 1 1 1 1 1 1 1 1 1 1 1 1 1 1 1 1 1 1 
##$CPDPRG= <>
##$CPDPRG1= <>
##$CPDPRG2= <>
##$CPDPRG3= <>
##$CPDPRG4= <mlev>
##$CPDPRG5= <mlev>
##$CPDPRG6= <mlev>
##$CPDPRG7= <mlev>
##$CPDPRG8= <mlev>
##$CPDPRGB= <>
##$CPDPRGT= <>
##$D= (0..31)
0 1 0 0 0 0 0 0 0 0.06 0 0 0 0 0 0 0.0002 0 0 0 0 0 0 0 0 0 0 0 0 0 0 
0 
##$DATE= 1147786889
##$DBL= (0..7)
120 120 120 120 120 120 120 120 
##$DBP= (0..7)
150 150 150 150 150 150 150 150 
##$DBP07= 0
##$DBPNAM0= <>
##$DBPNAM1= <>
$$ [...]
##$SUBNAM7= <"">
##$SUBNAM8= <"">
##$SUBNAM9= <"">
##$SW= 20.6930455092707
##$SWIBOX= (0..15)
0 0 3 0 0 0 0 0 0 0 0 0 0 0 0 0 
##$SW_h= 5175.983436853
##$TD= 65536
##$TD0= 1
##$TE= 295.16
##$TE2= 300
##$TE3= 300
##$TEG= 300
##$TL= (0..7)
0 120 120 120 120 120 120 120 
##$TP= (0..7)
150 150 150 150 150 150 150 150 
##$TP07= 0
##$TPNAME0= <>
##$TPNAME1= <>
##$TPNAME2= <>
##$TPNAME3= <>
##$TPNAME4= <>
##$TPNAME5= <>
##$TPNAME6= <>
##$TPNAME7= <>
##$TPOAL= (0..7)
0.5 0.5 0.5 0.5 0.5 0.5 0.5 0.5 
##$TPOFFS= (0..7)
0 0 0 0 0 0 0 0 
##$TUNHIN= 0
##$TUNHOUT= 0
##$TUNXOUT= 0
##$USERA1= <user>
##$USERA2= <user>
##$USERA3= <user>
##$USERA4= <user>
##$USERA5= <user>
##$V9= 5
##$VALIST= <valist>
##$VCLIST= <CCCCCCCCCCCCCCC>
##$VD= 0
##$VDLIST= <DDDDDDDDDDDDDDD>
##$VPLIST= <PPPPPPPPPPPPPPP>
##$VTLIST= <TTTTTTTTTTTTTTT>
##$WBST= 1024
##$WBSW= 4
##$XGAIN= (0..3)
0 0 0 0 
##$XL= 0
##$YL= 0
##$YMAX_a= 206626
##$YMIN_a= -274486
##$ZGOPTNS= <>
##$ZL1= 120
##$ZL2= 120
##$ZL3= 120
##$ZL4= 120
##$ABSF1= 16.45241
##$ABSF2= -4.240763
##$ABSG= 5
##$ABSL= 3
##$ALPHA= 0
##$AQORDER= 0
##$ASSFAC= 0
##$ASSFACI= 0
##$ASSFACX= 0
##$ASSWID= 0
##$AUNMP= <proc_1d>
##$AZFE= 0.1
##$AZFW= 0.1
##$BCFW= 0
##$BC_mod= 0
##$BYTORDP= 0
##$COROFFS= 0
##$CY= 12.5
##$DATMOD= 1
##$DC= 0
##$DFILT= <>
##$DTYPP= 0
##$F1P= 14.0000005364418
##$F2P= -0.99999901652339
##$FCOR= 0.5
##$FTSIZE= 32768
##$FT_mod= 6
##$GAMMA= 0
##$GB= 0
##$INTBC= 1
##$INTSCL= 1
##$ISEN= 128
##$LB= 0.3
##$LEV0= 0
##$LPBIN= 0
##$MAXI= 10000
##$MC2= 0
##$MEAN= 0
##$ME_mod= 0
##$MI= 0
##$NCOEF= 0
##$NC_proc= -3
##$NLEV= 6
##$NOISF1= 0
##$NOISF2= 0
##$NSP= 0
##$NTH_PI= 0
##$NZP= 0
##$OFFSET= 16.45241
##$PC= 1
##$PHC0= 172.2499
##$PHC1= 4.286418
##$PH_mod= 1
##$PKNL= yes
##$PPARMOD= 0
##$PSCAL= 4
##$PSIGN= 0
##$REVERSE= no
##$SF= 250.130017404165
##$SI= 32768
##$SIGF1= 0
##$SIGF2= 0
##$SINO= 400
##$SIOLD= 32768
##$SREGLST= <1H.CDCl3>
##$SSB= 0
##$STSI= 32768
##$STSR= 0
##$SW_p= 5175.98343685301
##$SYMM= 0
##$S_DEV= 0
##$TDeff= 65536
##$TDoff= 0
##$TI= <Analysis number 999999
Compound Code 99
Book Reference 9
Project Code 9>
##$TILT= no
##$TM1= 0
##$TM2= 0
##$TOPLEV= 0
##$USERP1= <user>
##$USERP2= <user>
##$USERP3= <user>
##$USERP4= <user>
##$USERP5= <user>
##$WDW= 1
##$XDIM= 32768
##$YMAX_p= 521788526
##$YMIN_p= -312031
$$ End of Bruker specific parameters
$$ ---------------------------------
##NTUPLES= NMR SPECTRUM
##VAR_NAME=  FREQUENCY,     SPECTRUM/REAL,   SPECTRUM/IMAG
##SYMBOL=    X,             R,               I
##VAR_TYPE=  INDEPENDENT,   DEPENDENT,       DEPENDENT
##VAR_FORM=  AFFN,          ASDF,            ASDF
##VAR_DIM=   32768,         32768,           32768
##UNITS=     HZ,            ARBITRARY UNITS, ARBITRARY UNITS
##FACTOR=    0.157963299565203, 1,           1
##FIRST=     4115.24153567288, 0,            0
##LAST=      -1060.74190118013, 0,           0
##MIN=       -1060.74190118013, -312031,     0
##MAX=       4115.24153567288, 521788526,    0
$$ Real data points
##PAGE= N=1
##DATA TABLE= (X++(R..R)), XYDATA
$$ [...]
$$ plain form
19003 -53475 3900 21208 14839 149951 88751 -106289 -214493 -156632 -81858 21545 57313
18992 57313 -28094 -142674 -160166 -200568 -217149 -190128 -158408 -104533 -121165 -194455 -114281
18981 -114281 -144439 -129847 -169467 -146968 -101794 -97895 -16974 133533 57259 33157 31547 68885
18969 68885 80861 -41002 -114819 -101923 2062 -4342 -88100 -29670 89955 69168 55730
18958 55730 37548 33616 85475 90995 125695 106102 -18291 -64526 -34556 -2659 -12799 -73640
18946 -73640 -4070 71003 95953 58543 96906 74624 85535 159358 140674 114823 145991 135210
18934 135210 70036 -38684 -51256 -53801 28214 -9478 -65775 -38505 -3345 -55860 -45536
18923 -45536 -10 48010 63001 83030 43042 7604 -58970 -15451 -64058 -32512 14330 69809
$$ packed form
19003e3475N7375J7308o369J35112o1200j95040j08204N7861P4774J03403L5768
18992E7313q5407j14580j7492m0402j6581K7021L1720N3875j6632p3290Q0174
18981a14281l0158J4592l9620K2499M5174L899Q0921J50507p6274k4102j610L7338
18969F8885J1976j21863p3817J2896J03985o404q3758N8430J19625k0787j3438
18958E5730j8182l932N1859N520L4700j9593j24393m6235K9970L1897j0140o0841
18946g3640O9570P5073K4950l7410L8363k2282J0911P3823j8684k5851L1168j0781
18934A35210o5174j08720j2572k545Q2015l7692n6297K7270L5160n2515J0324
18923d5536M5526M8020J4991K0029l9988l5438o6574M3519m8607L1546M6842N5479
$$ plain form
18911 69809 54647 26384 -44063 -133109 -114769 -76311 -77617 -85917 -73741 -22738 27060 16790
18899 16790 41453 58265 64316 90649 15050 77262 55354 27243 -79307 -104828 -91945 -20820
18887 -20820 100815 -21908 -71654 -82770 -5391 -30240 -57181 -7870 -39686 10830 46687
18876 46687 66676 93906 127229 187445 138721 49814 -11961 -9025 -123869 -32948 14539 -2294
18864 -2294 -33723 11631 73714 467 -66733 2542 48948 31169 -75846 -84106 -5598 23702
18852 23702 -2788 35393 -3314 -23938 -22269 -5243 45830 91434 216007 221109 167844 48314
18840 48314 -13446 -103714 -51091 29614 54950 55996 47210 68184 111111 99278 90062 91061 96583
18827 96583 32857 -50170 -123616 -82901 11452 19848 -21653 5691 -5813 69687 44158 93178
$$ packed form
18911F9809j5162k8263p0447q9046J8340L8458j306q300J2176N1003M9798j0270
18899A6790K4663J6812O051K6333p5599O2212k1908k8111j06550k5521J2883P1125
18887b0820J21635j22723m9746j1116P7379k4849k6941M9311l1816N0516L5857
18876D6687J9989K7230L3323O0216m8724q8907o1775K936j14844R0921M7487j6833
18864b294l1429M5354O2083p3247o7200O9275M6406j7779j07015q260P8508K9300
18852B3702k6490L8181l8707k0624J669J7026N1073M5604J24573N102n3265j19530
18840D8314o1760r0268N2623Q0705K5336J046q786K0974M2927j1833r216R99N522
18827I6583o3726q3027p3446M0715R4353Q396m1501K7344j1504P5500k5529M9020
$$ plain form
18815 93178 51311 100331 101325 105845 103858 61446 3969 -56213 -3382 22783 17959 73047 108171
18802 108171 71981 32467 57929 66804 137374 173550 158511 106065 43486 20531 -27959 -101109
18790 -101109 -177449 -157733 -97180 -86702 -150473 -141079 -107081 19667 13930 15197 54415 34025
18778 34025 -29889 -56301 -40696 35895 46617 19542 12911 -12473 14737 9755 -34309 48155
18766 48155 191075 391874 487846 500816 311415 129740 97830 35070 -36417 -81948 -90818
18755 -90818 40539 138454 110438 134124 137326 81250 40790 65634 50031 63644 93897 57532
18743 57532 58071 33098 7083 31059 35499 116132 85787 54273 84731 128483 139296 105056
18731 105056 70964 31270 -12374 40036 100097 163049 177593 97485 75694 60097 58140 146573
$$ packed form
18815I3178m1867M9020R94M520j987m2412n7477o0182N2831K6165m824N5088L5124
18802A08171l6190l9514K5462Q875P0570L6176j5039n2446o2579k2955m8490p3150
18790a01109p6340J9716O0553J0478o3771R394L3998J26748n737J267L9218k0390
18778C4025o3914k6412J5605P6591J0722k7075o631k5384K7210m982m4064Q2464
18766D8155J42920K00799R5972J2970j89401j81675l1910o2760p1487m5531q870
18755i0818J31357R7915k8016K3686L202n6076m0460K4844j5603J3613L0253l6365
18743E7532N39k4973k6015K3976M440Q0633l0345l1514L0458M3752J0813l4240
18731A05056l4092l9694m3644N2410O0061O2952J4544q0108k1791j5597j957Q8433
$$ plain form
18719 146573 197273 123609 78387 104290 180610 225770 188322 117862 165291 130974 -15447
18708 -15447 -13297 83778 75852 75219 58493 25488 20644 -10017 -73559 -78599 -51717 -121996 -191029
18695 -191029 -193351 -151813 -117754 -67475 -46501 -82 17344 -20253 -57261 -30651 37597 73341
18683 73341 40979 36891 48471 25537 -45353 -61172 -29596 -1097 -63822 -25318 -60916 -87079
18671 -87079 7217 135138 151186 105488 -32538 -49931 -37895 -64111 -62370 -41535 15929
18660 15929 -22002 -47592 22250 36890 -52548 -97619 -133165 -80620 -86788 -117150 -198851 -203686
18648 -203686 -105648 -17696 -14064 35246 64703 82856 94966 85080 113857 41134 -23794 -41800
18636 -41800 -39430 -6488 49549 49530 33999 51954 12690 33635 70193 47812 26860 40753
$$ packed form
18719A46573N0700p3664m5222K5903P6320M5160l7448p0460M7429l4317j46421
18708a5447K150R7075p926o33j6726l3005m844l0661o3542n040K6882p0279o9033
18695a91029k322M1538L4059N0279K0974M6419J7426l7597l7008K6610O8248L5744
18683G3341l2362m088J1580k2934p0890j5819L1576K8499o2725L8504l5598k6163
18671h7079R4296J27921J6048m5698j38026j7393J2036k6216J741K0835N7464
18660A5929l7931k5590O9842J4640q9438m5071l5546N2545o168l0362q1701m835
18648b03686R8038Q7952L632M9310K9457J8153J2110r886K8777p2723o4928j8006
18636d1800K370L2942N6037j9j5531J7955l9264K0945L6558k2381k0952J3893
$$ plain form
18624 40753 113024 76275 -32001 -43070 -34347 -86229 -100095 -94761 -118462 -56423 -71559 -116415
18612 -116415 -167486 -121424 -23285 36189 71797 -4122 -85211 -90553 -29922 -53835 -163983
18601 -163983 -136732 -65030 -9205 -2482 21724 49680 -29196 -31237 20708 46151 35591 12649
18589 12649 -57038 -94219 -19853 -35141 -69849 -47475 -44166 -98453 -46056 -27840 -69866 1600
18577 1600 52103 -255 -102676 -67468 44997 30942 36580 4377 10147 67102 29362 -111193
18565 -111193 -91574 -98678 -59510 56598 128619 32057 -25954 -66352 -41802 -67225 -65607 -61410
18553 -61410 -72789 -56485 -15595 2700 -11238 4131 -81751 -120316 -79682 -52754 -90181 -65703
18541 -65703 -46398 10800 10677 -63895 -52699 -56827 -79593 -42127 -59510 -152274 -128326 -42570
$$ packed form
18624D0753P2271l6749j08276j1069Q723n1882j3866N334k3701O2039j5136m4856
18612a16415n1071M6062R8139N9474L5608p5919q1089n342O0631k3913j10148
18601a63983K7251P1702N5825O723K4206K7956p8876k041N1945K5443j0560k2942
18589A2649o9687l7181P4366j5288l4708K2374L309n4287N2397J8216m2026P1466
18577A600N0503n2358j02421L5208J12465j4055N638l2203N770N6955l7740j40555
18565a11193J9619p104L9168J16108P2021r6562n8011m0398K4550k5423J618M197
18553f1410j1379J6304M0890J8295j3938J5369q5882l8565M0634K6928l7427K4478
18541f5703J9305N7198j23p4572J1196m128k2766L7466j7383r2764K3948Q5756
$$ plain form
18529 -42570 -43611 -148780 -126918 -33670 29006 72344 32909 -82760 -136048 -56283 -7496
18518 -7496 -1290 17663 115046 26794 -80747 -82475 -109994 -58841 31085 66652 -415 22099
18506 22099 91425 108181 107257 82748 -66332 -78058 -20706 57325 35817 59030 61692 39316
18494 39316 44008 42000 -26175 -149312 -128694 -49741 -62452 -24477 77579 52833 50995 -33351
18482 -33351 -125962 -12765 62994 47202 14150 21940 63925 5704 16957 -7733 -41527 37732
18470 37732 87081 105163 30514 23125 40902 55407 32919 63590 104643 98279 25353 50216
18458 50216 71214 34461 42874 107762 47218 -9870 -16091 -20573 -52146 -78391 -119974 -101595
18446 -101595 -76657 -76988 -24716 -1381 -17322 46852 7627 -2975 -10283 24228 -1850 -49888
$$ packed form
18529d2570j041j05169K1862R3248O2676M3338l9435j15669n3288P9765M8787
18518g496O206J8953R7383q8252j07541j728k7519N1153Q9926L5567o7067K2514
18506B2099O9326J6756r24k4509j49080j1726N7352P8031k1508K3213K662k2376
18494C9316M692k008o8175j23137K0618P8953j2711L7975J02056k4746j838q4346
18482c3351r2611J13197P5759j5792l3052P790M1985n8221J1253k4690l3794P9259
18470C7732M9349J8082p4649p389J7777J4505k2488L0671M1053o364p2926K4863
18458E0216K0998l6753Q413O4888o0544n7088o221m482l1573k6245m1583J8379
18446a01595K4938l31N2272K3335j5941O4174l9225j0602p308L4511k6078m8038
$$ plain form
18434 -49888 -64414 -55205 -118856 -175727 -134353 -68920 30333 73701 -39164 -90738 -128880 -113120
18422 -113120 16002 62356 24334 67994 194882 214549 150202 71341 -72179 -64617 40331
18411 40331 105201 197025 147495 6835 7888 98301 73927 31516 53325 69545 10694 46224
18399 46224 101641 95296 129109 74614 24693 851 55638 108955 201648 109152 -38987 -48875
18387 -48875 -68910 -62407 -49794 -47305 -73185 -58012 -4377 -35994 -1539 70762 53976 6033
18375 6033 -3550 8503 38427 1641 -41545 14940 18546 -121244 -81899 -22196 26396 -9202
18363 -9202 32652 50541 29998 1115 25269 8493 -12536 -16143 -31746 10350 -29162 -44204
18351 -44204 -132944 -167378 -196587 -140249 -100087 -8487 41733 20567 -29867 -43900 5687 22116
$$ packed form
18434d9888j4526R209o3651n6871M1374O5433R9253M3368j12865n1574l8142J5760
18422a13120J29122M6354l8022M3660J26888J9667o4347p8861j43520P562J04948
18411D0331O4870R1824m9530j40660J053R0413k4374m2411K1809J6220n8851L5530
18399D6224N5417o345L3813n4495m9921k3842N4787N3317R2693r2496j48139r888
18387d8875k0035O503J2613K489k5880J5173N3635l1617L4455P2301j6786m7943
18375F033r583J2053K9924l6786m3186N6485L606j39790L9345N9703M8592l5598
18363i202M1854J7889k0543k8883K4154j6776k1029l607j5603M2096l9512j5042
18351d4204q8740l4434k9209N6338M0162R1600N0220k1166n0434j4033M9587J6429
$$ plain form
18339 22116 78215 21372 -2502 9660 34373 59419 57476 1688 -81179 -72909 -79866 -93715
18327 -93715 3440 74266 84645 98971 147425 158105 19315 -8700 60542 158416 143651
18316 143651 94436 -12822 -14934 47170 62610 83359 477 41097 46159 -7309 -50529 -20362
18304 -20362 36559 154790 176203 171252 92520 5472 -20637 -10869 42781 34962 -26385 -14289
18292 -14289 2784 32788 43475 -81274 -129846 -102946 -117153 -134516 -117711 -17786 -36290
18281 -36290 -43635 -60776 -17490 -37215 -133931 -159674 -93433 -88714 -83122 -19280 -38206 -58325
18269 -58325 -87540 -184937 -162519 -145723 -183784 -134792 -98822 -9332 107287 180907 71012
18258 71012 -85860 -1245 34148 49748 69803 144042 165725 168712 129749 22093 3676
$$ packed form
18339B2116N6099n6843k3874J2162K4713K5046j943n5788q2867Q270o957j3849
18327i3715R7155P0826J0379J4326M8454J0680j38790k8015O9242R7874j4765
18316A43651m9215j07258k112O2104J5440K0749q2882M0620N062n3468m3220L0167
18304b0362N6921J18231K1413m951p8732q7048k6109R768N3650p819o1347J2096
18292a4289J7073L0004J0687j24749m8572K6900j4207j7363J6805R9925j8504
18281c6290p345j7141M3286j9725r6716k5743O6241M719N592O3842j8926k0119
18269e8325k9215r7397K2418J6796l8061M8992L5970Q9490J16619P3620j09895
18258G1012j56872Q4615L5393J5600K0055P4239K1683K987l8963j07656j8417
$$ plain form
18247 3676 42644 -32793 -83087 -51479 23394 84511 70722 69045 -51850 -60368 -24526 123625
18235 123625 151089 145805 132263 66819 15318 5451 107688 69898 -1134 -56109 -13961 -1318
18223 -1318 100514 91385 40993 -9114 -78741 -85827 -82994 -106597 -73006 -88516 -37545 -86218
18211 -86218 -70125 -47936 32243 9614 -179546 -240103 -203977 -197671 -220675 -102293 -80036
18200 -80036 -50896 -112147 -97249 15046 87986 103720 112065 77381 13858 -91364 -134099
18189 -134099 -128278 -32393 -62837 19562 100167 110124 106321 108761 39357 29413 54007 12138
18177 12138 -34936 -38308 -36385 -27291 -49603 -34495 52687 22328 -26784 -37230 -43362 11660
18165 11660 26159 53602 151007 178298 207276 176750 135992 75753 -29279 -21858 2263 5056
$$ packed form
18247C676L8968p5437n0294L1608P4873O1117j3789j677j20895q518L5842J48151
18235A23625K7464n284j3542o5444n1501r867J02237l7790p1032n4975M2148J2643
18223a318J01832r129n0392n0107o9627p086K833k3603L3591j5510N0971m8673
18211h6218J6093K2189Q0179k2629j89160o0557L6126O306k3004J18382K2257
18200h0036K9140o1251J4898J12295P2940J5734Q345l4684o3523j05222m2735
18189a34099N821R5885l0444Q2399Q0605R957l803K440o9404r944K4594m1869
18177A2138m7074l372J923R094k2312J5108Q7182l0359m9112j0446o132N5022
18165A1660J4499K7443R7405K7291K8978l0526m0758o0239j05032P421K4121K793
$$ plain form
18153 5056 36153 103282 75372 55334 73203 76996 66223 47356 61979 32085 -26646 -48570
18141 -48570 2545 8663 34818 63141 88453 186397 293656 262012 267642 218936 236137 275248
18129 275248 322810 422310 431442 383522 471642 658835 844029 994305 1035473 1109222 1265767
18118 1265767 1519336 1882128 2315372 2767317 3428928 4502481 6060924 8489072 12691660
18109 12691660 20354344 36110879 65561782 97274141 109355160 87697004 57351329
18102 57351329 38837181 28226926 21724550 17761666 15192357 13424875 12034772 10982175
18094 10982175 10202357 9518876 8923900 8444763 8024472 7609046 7262649 6923468 6626549
18085 6626549 6351482 6003776 5646199 5516015 5409642 5274206 5058850 4864857 4781729 4621603
$$ packed form
18153E056L1097O7129k7910k0038J7869L793j0773j8867J4623k9894n8731k1924
18141d8570N1115O118K6155K8323K5312R7944J07259l1644N630m8706J7201L9111
18129B75248M7562R9500R132m7920Q8120J87193J85194J50276M1168P3749J56545
18118A265767K53569L62792M33244M51945O61611J073553J558443K428148M202588
18109A2691660P662684J5756535K9450903L1712359J2081019k1658156l0345675
18102E7351329j8514148j0610255o502376l962884k569309j767482j390103j052597
18094A0982175p79818o83481n94976m79137m20291m15426l46397l39181k96919
18085F626549k75067l47706l57577j30184j06373j35436k15356j93993q3128j60126
$$ plain form
18075 4621603 4442797 4309095 4153952 4099886 4071070 3987679 3865777 3783106 3728301 3676637
18065 3676637 3653629 3528223 3393404 3276239 3107010 2978060 2930590 2865274 2785616 2609954
18055 2609954 2480265 2499362 2438755 2322770 2226849 2232775 2233593 2258088 2247448 2127627 1955494
18044 1955494 1911893 1885390 1799822 1764316 1765312 1823429 1755040 1752982 1631839 1537997 1572007 1558081
18032 1558081 1516038 1450282 1432217 1431060 1407848 1315731 1226056 1204301 1207415 1158272 1203980 1142699
18020 1142699 1089182 1084816 1070368 998588 975851 1000963 1010190 973237 887763 940072 908757 857190
18008 857190 875329 921563 872126 840869 746461 628945 644723 733976 675035 663366 645426
17997 645426 604691 641784 746832 761091 709443 710805 741922 639112 599199 612917 556479
$$ packed form
18075D621603j78806j33702j55143n4066k8816q3391j21902q2671n4805n1664
18065C676637k3008j25406j34819j17165j69229j28950m7470o5316p9658j75662
18055B609954j29689J9097o0607j15985r5921N926Q18K4495j0640j19821j72133
18044A955494m3601k6503q5568l5506R96N8117o8389k058j21143r3842L4010j3926
18032A558081m2043o5756j8065j157k3212r2117q9675k1755L114m9143M5708o1281
18020A142699n3517m366j4448p1780k2737K5112R227l6953q5474N2309l1315n1567
18008H57190J8139M6234m9437l1257r4408j17516J5778Q9253n8941j1669j7940
17997F45426m0735L7093J05048J4259n1648J362L1117j02810l9913J3718n6438
$$ plain form
17986 556479 496000 483338 408281 398923 424476 467349 516895 499971 440783 389489 332641 316160
17974 316160 312723 394499 482363 488701 495473 520916 445646 443247 495017 415085 390346 423280
17962 423280 426719 353753 202440 207257 276731 259294 208675 237876 178771 127959 171100 215386
17950 215386 239424 232728 190874 198563 110708 14830 16923 29941 106180 61440 50028 -22051
17938 -22051 -56134 17710 59893 183667 241623 205282 99611 59509 80562 126950 246452
17927 246452 288458 252765 204372 107278 103209 152308 207841 275884 259857 189904 150451 47734
17915 47734 -59047 -404 39943 66161 29917 14267 -17796 54669 93979 155353 174618
17904 174618 70621 30110 20903 92792 81866 16070 95578 116248 60241 141609 249486
$$ packed form
17986E56479o0479j2662p5057r358K5553M2873M9546j6924n9188n1294n6848j6481
17974C16160l437Q1776Q7864O338O772K5443p5270k399N1770p9932k4739L2934
17962D23280L439p2966j51313M817O9474j7437n0619K9201n9105n0812M3141M4286
17950B15386K4038o696m1854P689q7855r5878K093J3018P6239m4740j1412p2079
17938b2051l4083P3844M2183J23774N7956l6341j05671m0102K1053M6388J19502
17927B46452M2006l5693m8393r7094m069M9099N5533O8043j6027o9953l9453j02717
17915D7734j06781N8643M0347K6218l6244j5650l2063P2465L9310O1374J9265
17904A74618j03997m0511r207P1889j0926o5796P9508K0670n6007Q1368J07877
$$ plain form
17893 249486 224071 140884 138847 123167 81177 39762 75024 204933 128827 -4785 -17163
17882 -17163 35735 10643 101881 24546 -47963 -6549 -35291 -94225 -29718 88331 157590
17871 157590 156261 105205 62709 -11367 26688 124591 65147 -31159 35832 121278 40947 -12433
17859 -12433 -13053 -52806 -50862 -10739 -41718 -2616 77792 32167 -32557 27779 20855 -21004
17847 -21004 35755 86111 129141 145951 83453 -12311 21648 83172 77411 54420 9675 -15875
17835 -15875 -5128 20839 64910 147814 137246 69997 59579 64488 46041 45038 97030 149414
17823 149414 111434 119113 121563 67205 97798 99496 35091 -2599 89825 124236 93574 109054
17811 109054 48168 10375 25820 -14912 11076 41879 48244 23788 -9437 -38562 -11009 -62700
$$ packed form
17893B49486k5415q3187k037j5680m1990m1415L5262J29909p6106j33612j2378
17882a7163N2898k5092R1238p7335p2509M1414k8742n8934O4507J18049O9259
17871A57590j329n1056m2496p4076L8055R7903n9444r6306O6991Q5446q0331n3380
17859a2433o20l9753J944M0123l0979L9102Q0408m5625o4724O0336o924m1859
17847b1004N6759N0356M3030J6810o2498r5764L3959O1524n761k2991m4745k5550
17835a5875J0747K5967M4071Q2904j0568o7249j0418M909j8447j003N1992N2384
17823A49414l7980P679K450n4358L0593J698o4405l7690R2424L4411l0662J5480
17811A09054o0886l7793J5445m0732K5988L0803O365k4456l3225k9125K7553n1691
$$ plain form
17799 -62700 -101565 -91594 -65039 -116101 -153722 -74393 27242 32979 70426 -32178 -136007
17788 -136007 -131237 -156131 -122491 -104498 -199159 -170464 -80994 -54160 -40019 19058 80159 75296
17776 75296 -10087 46347 35231 9322 -8349 -18195 -10539 -118711 -161681 -129201 -167751 -119458
17764 -119458 -20083 -81541 -102290 -47194 -123954 -154637 -53285 -10847 -13927 -23053 -55435 -44503
17752 -44503 -20733 7043 110541 104964 163210 100119 21938 19367 17438 -16565 -97835 -106872
17740 -106872 -67744 -61134 -87474 -12951 68679 38439 -4336 -23752 -386 23613 -3339 -103603
17728 -103603 -104592 -130806 -224210 -156970 -91438 3838 16953 -20471 -17778 -70637 -53794 1530
17716 1530 23489 62551 158354 116316 62363 -28092 -129011 -150126 -108237 -76510 -13356 -3335
$$ packed form
17799f2700l8865R971K6555n1062l7621P9329J01635N737L7447j02604j03829
17788a36007M770k4894L3640J7993r4661K8695Q9470K6834J4141N9077O1101m863
17776G5296q5383N6434j1116k5909j7671r846P656j08172m2970L2480l8550M8293
17764a19458R9375o1458k0749N5096p6760l0683J01352M2438l080r126l2382J0932
17752d4503K3770K7776J03498n577N8246o3091p8181k571j929l4003q1270r037
17740a06872L9128O610k6340P4523Q1630l0240m2775j9416K3366K3999k6952j00264
17728a03603r89k6214r3404O7240O5532R5276J3115l7424K693n2859J6843N5324
17716A530K1959L9062R5803m2038n3953r0455j00919k1115M1889L1727O3154J0021
$$ plain form
17704 -3335 2312 64193 71790 17458 3780 -37651 -67251 -71157 72720 200319 146447 90869
17692 90869 81398 68095 83453 103152 179504 167075 76935 -33333 22118 -5097 -10994 -5323
17680 -5323 -7019 -14352 21772 51490 -2121 -32059 13842 106313 159225 77092 3722 8608
17668 8608 1319 8519 -24418 41014 -6858 60359 3262 -12985 31803 98696 97254 47670
17656 47670 -70984 -99624 -57752 -66615 -21884 42906 77027 12953 18305 114639 53433 -9641
17644 -9641 -28621 -16292 8811 -65389 28369 93566 10310 -9801 -2316 -5374 39856 46180
17632 46180 97438 202764 251544 163883 135341 145757 161552 95482 18156 -18474 -121811
17621 -121811 -210148 -115432 24864 103114 65469 34243 11679 764 21838 16987 -392
$$ packed form
17704c335N647O1881P597n4332j3678m1431k9600l906J43877J27599n3872n5578
17692I0869r471j3303J5358J9699P6352j2429r0140j10268N5451k7215n897N671
17680e323j696p333L6124K9718n3611k9938M5901R2471N2912q2133p3370M886
17668H608p289P200l2937O5432m7872O7217n7097j6247M4788O6893j442m9584
17656D7670j18654k8640M1872q863M4731O4790L4121o4074N352R6334o1206o3074
17644i641j8980J2329K5103p4200R3758O5197q3256k0111P485l058M5230O324
17632D6180N1258J05326M8780q7661k8542J0416J5795o6070p7326l6630j03337
17621a21811q8337R4716J40296P8250l7645l1226k2564j0915K1074m851j7379
$$ plain form
17610 -392 -55479 39334 12216 1085 47592 56855 -12119 -37695 -19026 -51003 -7178 107521
17598 107521 151686 69396 44810 39835 57257 -41682 -145428 -153668 -25716 51474 76043
17587 76043 155435 203395 130893 70516 62950 74296 111094 22225 -26232 -36598 -55878 -32762
17575 -32762 -14622 4540 14602 -26571 25728 5737 -45899 -83092 -33429 -788 -4816 -3295
17563 -3295 76593 84415 90698 40401 52617 24818 -51008 5292 -12891 -86626 -35869 -30556
17551 -30556 -68925 -167274 -67397 2659 -2920 37660 35335 -17557 45075 107949 43498 14955
17539 14955 4634 10884 -108617 -131777 -148406 -80807 -10353 -8720 154160 253983 168993 62183
17527 62183 14481 2802 9289 -4677 -59954 -103719 -111107 -76193 25714 64735 35408 -13048
$$ packed form
17610c92n5087R4813k7118j1131M6507R263o8974k5576J8669l1977M3825J14699
17598A07521M4165q2290k4586m975J7422r8939j03746q240J27952P7190K4569
17587G6043P9392M7960p2502o0377p566J1346L6798q8869m8457j0366j9280K3116
17575c2762J8140J9162J0062m1173N2299j9991n1636l7193M9663L2641m028J521
17563c295P9888P822O283n0297J2216k7799p5826N6300j8183p3735N0757N313
17551c0556l8369r8349R9877P0056n579M0580k325n2892O2632O2874o4451k8543
17539A4955j0321O250j19501k3160j6629O7599P0454J633J62880R9823q4990j06810
17527F2183m7702j1679O487j3966n5277m3765p388L4914J01907L9021k9327m8456
$$ plain form
17515 -13048 -68601 -90166 -40799 1895 33343 57661 -24744 -44474 4618 -3174 -52021 -68451
17503 -68451 -104418 -143444 -73580 -32488 27884 91942 110132 29432 -17508 -48955 -48987 16814
17491 16814 -39008 -47963 55120 9534 57728 55643 71146 125172 66132 54951 82753 59382
17479 59382 42173 11677 -9506 -60366 -82748 -91798 -105704 -64141 -27789 -3336 19948 12215
17467 12215 26014 5401 -46914 -38343 61258 18397 80713 121736 31789 87375 100492 77587
17455 77587 -59430 -91350 -99740 -44854 -65564 -10862 -6128 -71627 -61602 79399 194088
17444 194088 198866 182916 164094 344625 510197 582751 476228 288906 210838 142533 111326
17433 111326 94527 53696 118130 142481 114394 132063 184813 146622 77433 94280 99178 39224
$$ packed form
17515a3048n5553k1565M9367M2694L1448K4318q2405j9730M9092p792m8847j6430
17503f8451l5967l9026O9864M1092O0372O4058J8190q0700m6940l1447l2O5801
17491A6814n5822q955J03083m5586M8194k085J5503N4026n9040j1181K7802k3371
17479E9382j7209l0496k1183n0860k2382r050j3906M1563L6352K4453K3284p733
17467A2215J3799k0613n2315Q571R9601m2861O2316M1023q9947N5586J3117k2905
17455G7587j37017l1920q390N4886k0710N4702M734o5499J0025J41001J14689
17444A94088M778j5950j8822J80531J65572P2554j06523j87322p8068o8305l1207
17433A11326j6799m0831O4434K4351k8087J7669N2750l8191o9189J6847M898n9954
$$ plain form
17421 39224 9662 -13864 -35498 -55626 -40048 -12358 72158 68572 93840 57520 82633 135218
17409 135218 45533 -66124 -8654 31453 55001 -11843 1871 15815 38267 51306 14502
17398 14502 10477 30620 -3892 -47410 -20226 43653 25264 -80124 -28852 -2161 6459 31695
17386 31695 52634 39123 55519 -13551 -5201 37411 -38569 -59263 -9802 -21010 31053 40669
17374 40669 -16689 -79366 -77031 -8784 -6196 -47628 -63153 -98948 -160600 -79762 4663 81471
17362 81471 20026 -117 -4434 23032 12957 19742 74615 18085 42820 29513 10605 -88242
17350 -88242 -110735 -7284 -49282 -74817 -123745 -109705 -99970 21194 60547 34331 39151 39781
17338 39781 99753 60776 61755 52161 49933 4871 -64394 -82266 -39156 50149 18009 -8190
$$ packed form
17421C9224k9562k3526k1634k0128J5578K7690Q4516l586K5268l6320K5113N2585
17409A35218q9685j11657N7470M0107K3548o6844J3714J3944K2452J3039l6804
17398A4502m025K0143l4512m3518K7184O3879j8389j05388N1272K6691Q620K5236
17386C1695K0939j3511J6396o9070Q350M2612p5980k0694M9461j1208N2063R616
17374D0669n7358o2677K335O8247K588m1432j5525l5795o1652Q0838Q4425P6808
17362H1471o1445k0143m317K7466j0075O785N4873n6530K4735j3307j8908r8847
17350h8242k2493J03451m1998k5535m8928J4040R735J21164L9353k6216M820O30
17338C9781N9972l8977R79r594k228m5062o9265j7872M3110Q9305l2140k6199
$$ plain form
17326 -8190 100201 138686 46440 -45695 -126791 -164822 -58205 -77912 -26194 52930 -3973
17315 -3973 -3945 18488 51720 109204 80379 -51472 -157952 -124509 -75982 -14987 6476 -2704
17303 -2704 -7370 37592 17541 26525 -12784 -8489 21256 -14604 -15072 10950 10861 19190 11228 -5676
17289 -5676 60054 46707 -24289 -48532 35166 32611 8308 21130 57779 34873 25589 16921
17277 16921 81777 20664 -11386 -41593 -36822 -136665 -186680 -110476 -59748 -78296 -48956 -20992
17265 -20992 -63948 -162374 -92734 12549 30343 110399 215008 132579 37270 -11239 121270
17254 121270 93024 18273 4655 33349 54205 61677 56745 181 -4561 -58468 -102953 -99170
17242 -99170 -79393 32761 35524 32397 -30599 -59556 -57230 26010 -19384 -87837 -16921 6055
$$ packed form
17326h190J08391L8485r2246r2135q1096l8031J06617j9707N1718P9124n6903
17315c973K8K2433L3232N7484k8825j31851j06480L3443M8527O0995K1463r180
17303b704m666M4962k0051Q984l9309M295K9745l5860m68K6022q9Q329p962j6904
17289e676O5730j3347p0996k4243Q3698k555k4303J2822L6649k2906r284q668
17277A6921O4856o1113l2050l0207M771r9843n0015P6204N0728j8548K9340K7964
17265b0992m2956r8426O9640J05283J7794Q0056J04609q2429r5309m8509J32509
17254A21270k8246p4751j3618K8694K0856P472m932n6564m742n3907m4485L783
17242i9170J9777J12154K763l127o2996k8957K326Q3240m5394o8453P0916K2976
$$ plain form
17230 6055 57977 46032 35886 -16068 55635 1522 -86704 -46850 -41889 -17204 -14929 -41057
17218 -41057 -10922 11050 87386 210598 257598 192236 127755 63556 88174 56785 81040
17207 81040 -36418 -18475 14214 62511 60247 95590 14336 -3165 85294 144866 89922 50851
17195 50851 97227 70836 -17702 -19391 49232 -1647 -56643 -117936 -100432 -43638 22586 50150
17183 50150 14878 -9555 -41404 -50093 7923 57452 96296 53610 59613 90770 89058 -7117
17171 -7117 -67072 5134 -7753 8806 -24884 -25351 24858 42640 -6147 82026 133433 106290
17159 106290 100695 55502 47352 98560 -49652 -195261 -217695 -246564 -249805 -208666 -204130 -133796
17147 -133796 -72280 -66210 -7826 -9712 -61937 -111535 -19420 32371 10328 -83718 -160753 -146405
$$ packed form
17230F055N1922j1945j0146n1954P1703n4113q8226L9854M961K4685K275k6128
17218d1057L0135K1972P6336J23212M7000o5362o4481o4199K4618l1389K4255
17207H1040j17458J7943L2689M8297k264L5343q1254j7501Q8459N9572n4944l9071
17195E0851M6376k6391q8538j689O8623n0879n4996o1293J7504N6794O6224K7564
17183E0150l5272k4433l1849q689N8016M9529L8844m2686O003L1157j712r6175
17171g117n9955P2206j2887J6559l3690m67N0209J7782m8787Q8173N1407k7143
17159A06290n595m5193q150N1208j48212j45609k2434k8869l241M1139M536P0334
17147a33796O1516O070N8384j886n2225m9598R2115N1791k2043r4046p7035J4348
$$ plain form
17135 -146405 7948 97160 100241 99954 54170 40711 94470 129010 45631 -50733 -16954 -34616
17123 -34616 -75173 -16330 -19684 11210 -20630 -7290 11320 45034 94140 94398 -6988 -57508
17111 -57508 -115782 -31093 27286 -83522 -43698 7511 -26121 -13629 43362 77334 43122
17100 43122 76660 26152 -33142 -85619 -145462 -112546 -100843 -22876 33785 22076 8211 -118674
17088 -118674 -197577 -144029 -63995 48295 90125 -6888 -13324 42151 79015 42351 5014
17077 5014 24996 -43827 -70114 -108684 -142388 -212011 -204122 -56439 3199 -136193 -129274 -70680
17065 -70680 -66888 -94993 -70905 43924 7713 -140449 -218521 -143526 -82337 -76202 -122184 -33649
17053 -33649 14056 47856 20678 7503 63573 210927 242164 181835 125905 127453 101067 -58745
$$ packed form
17135a46405J54353Q9212L081k87m5784j3459N3759L4540q3379r6364L3779j7662
17123c4616m0557N8843l354L0894l1840J3340J8610L3714M9106K58j01386n0520
17111e7508n8274Q4689N8379j10808L9824N1209l3632J2492N6991L3972l4212
17100D3122L3538n0508n9294n2477n9843L2916J1703P7967N6661j1709j3865j26885
17088a18674p8903N3548Q0034J12290M1830r7013o436N5475L6864l6664l7337
17077E014J9982o8823k6287l8570l3704o9623P889J47683N9638j39392O919N8594
17065g0680L792k8105K4088J14829l6211j48162p8072P4995O1189O135m5982Q8535
17053c3649M7705L3800k7178j3175N6070J47354L1237o0329n5930J548k6386j59812
$$ plain form
17041 -58745 -30733 29120 70084 44754 -26757 -68332 -75257 -33939 40585 18965 -80594 -37668
17029 -37668 57636 80932 -15640 -68931 -75801 -54117 -26896 -90911 -68926 44181 102040 108378
17017 108378 77961 84732 79865 41225 21510 -81860 -117075 -53333 29105 40200 63286 24517
17005 24517 -56337 -2272 56645 91172 109716 159822 74214 -20135 -59626 7750 65789 -48083
16993 -48083 -32228 12382 49019 43322 -57574 -83874 -90127 -54415 -2266 -19439 -83257 -59446
16981 -59446 12486 25943 149565 116563 3218 -51961 53536 -31918 -86433 -88170 -131974
16970 -131974 -95872 -30344 -38233 -17373 67822 60040 36886 12883 -18727 -83652 -146517 -137698
16958 -137698 -144211 -21201 36418 77228 18625 -34054 -25 31813 97173 19331 -16008
$$ packed form
17041e8745K8012N9853M0964k5330p1511m1575o925M1318P4524k1620r9559M2926
17029c7668R5304K3296r6572n3291o870K1684K7221o4015K1985J13107N7859O338
17017A08378l0417O771m867l8640j9715j03370l5215O3742Q2438J1095K3086l8769
17005B4517q0854N4065N8917L4527J8544N0106q5608r4349l9491O7376N8039j13872
16993d8083J5855M4610L6637n697j00896k6300o253L5712N2149j7173o3818K3811
16981e9446P1932J3457J23622l3002j13345n5179J05497q5454n4515j737m3804
16970a31974L6102O5528p889K0860Q5195p782k3154k4003l1610o4925o2865Q819
16958a37698o513J23010N7619M0810n8603n2679L4029L1838O5360p7842l5339
$$ plain form
16947 -16008 -7878 8234 23552 30725 38365 66872 89723 110069 15101 -53104 -13249 11242
16935 11242 -32015 -60131 -38944 32624 36962 102193 161799 181073 208706 45025 -7815 -13207
16923 -13207 -45243 -20334 34813 -13481 10792 14739 -58145 -93228 -127179 -202613 -224797 -139154
16911 -139154 -54686 -48083 15028 72435 93403 14857 -6345 38641 109072 10711 17034 -8684
16899 -8684 33892 55181 59078 86652 13709 -85348 -63077 -68948 -53653 -116328 -60330 -49706
16887 -49706 5684 -28286 -81987 -28136 -3666 -26531 13558 33177 41085 20678 86888 71999
16875 71999 18679 -56294 -91764 -111079 33392 67371 115901 63771 3713 30973 39469 42225
16863 42225 49574 63690 10269 43195 164742 176377 83971 13560 -82020 -95380 -52259 -36669
$$ packed form
16947a6008Q130J6112J5318P173P640K8507K2851K0346r4968o8205L9855K4491
16935A1242m3257k8116K1187P1568M338O5231N9606J9274K7633j63681n2840n392
16923a3207l2036K4909N5147m8294K4273L947p2884l5083l3951p5434k2184Q5643
16911a39154Q4468O603O3111N7407K0968p8546k1202M4986P0431r8361O323k5718
16899h684M2576K1289L897K7574p2943r9057K2271n871J5295o2675N5998J0624
16887d9706N5390l3970n3701N3851K4470k2865M0089J9619P908k0407O6210j4889
16875G1999n3320p4973l5470j9315J44471L3979M8530n2130o0058K7260Q496K756
16863D2225P349J4116n3421L2926J21547J1635r2406p0411r5580j3360M3121J5590
$$ plain form
16851 -36669 -87401 -64360 16658 -34997 -47328 25076 93023 155881 178377 191069 166956 105304
16839 105304 26996 10095 3331 -49633 -126014 -88194 -68794 -22779 -8198 5655 -92544 -92969
16827 -92969 -57712 -99024 -81108 -32222 -79926 -52578 -74819 -102543 -97510 -47154 -54226 39213
16815 39213 -7964 -9927 -12328 -98199 -148744 -129338 -60871 -50118 -110797 -182724 -88841 -47794
16803 -47794 -54695 -18701 -2496 105486 121094 39404 22995 39151 -16282 2579 32848 50901
16791 50901 91585 96462 130820 107701 62637 6674 -7093 7864 112461 57856 20667 -29534
16779 -29534 19071 14580 -89804 -137550 -117241 -102717 -105061 -116540 -142972 -189164 -140809 2715
16767 2715 114557 89906 48137 15898 13985 -61732 -95905 -135991 -125646 -147818 -118522 -139733
$$ packed form
16851c6669n0732K3041Q1018n1655j2331P2404O7947O2858K2496J2692k4113o1652
16839A05304p8308j6901o764n2964p6381L7820J9400M6015J4581J3853r8199m25
16827i2969L5257m1312J7916M8886m7704K7348k2241k7724N033N0356p072R3439
16815C9213m7177j963k401q5871n0545J9406O8467J0753o0679p1927R3883M1047
16803d7794o901L5994J6205J07982J5608q1690j6409J6156n5433J8861L0269J8053
16791E0901M0684M877L4358k3119m5064n5963j3767J4957J04597n4605l7189n0201
16779b9534M8605m491j04384m7746K0309J4524k344j1479k6432m6192M8355J43524
16767B715J11842k4651m1769l2239j913p5717l4173m0086J0345k2172K9296k1211
$$ plain form
16755 -139733 -100029 14524 61475 42120 -10688 -20954 29079 115042 109755 120185 114795 72390
16743 72390 -3890 -50610 -124379 -74259 -24938 -66392 -22639 -11113 -54964 -102672 -81657 -16200
16731 -16200 65100 51652 -75990 -85345 -8969 -5046 -17680 -59547 -57374 -38860 31051 50732
16719 50732 73361 82513 -7018 -14315 17845 -123290 -120499 -62166 -45995 -64793 -95242 -117744
16707 -117744 -92582 -44799 -75177 -83780 -77347 -47247 -16000 -85599 -68614 -62300 -6180 -85811
16695 -85811 -156088 -151713 -14993 8327 -59144 -123488 -85819 -44168 -80468 -69297 -38890 -29338
16683 -29338 -31702 -22707 24594 -5015 -7546 28670 35110 16099 22783 -20648 -50702 -102620 -172502
16670 -172502 -110915 -119511 -105406 -69974 -86706 -53187 -74140 -53025 -32361 -21885 83815
$$ packed form
16755a39733L9704J14553M6951j9355n2808j0266N0033Q5963n287J0430n390m2405
16743G2390p6280m6720p3769N0120M9321m1454M3753J1526m3851m7708K1015O5457
16731a6200Q1300j3448j27642r355P6376L923j2634m1867K173J8514O9911J9681
16719E0732K2629R152q9531p297L2160j41135K791N8333J6171j8798l0449k2502
16707a17744K5162M7783l0378q603O433L0100L1247o9599J6985O314N6120p9631
16695h5811p0277M375J36720K3320o7471o4344L7669M1651l6300J1171L0407R552
16683b9338k364Q995M7301k9609k531L6216O440j9011O684m3431l0054n1918o9882
16670a72502O1587q596J4105L5432j6732L3519k0953K1115K0664J0476J05700
$$ plain form
16659 83815 19174 -36547 -30735 -90615 -168173 -204074 -258672 -206394 -113598 -140815 -169843 -198088
16647 -198088 -90551 69222 129831 147587 139607 4974 -30536 -32368 79245 99541 92812
16636 92812 79128 23675 107142 137683 135289 66505 6823 60608 48244 -23116 -26683 -3664
16624 -3664 53825 17785 -19350 -8501 -92336 -87959 -74055 3310 -9309 -46703 -24458 -48015
16612 -48015 -48866 -61299 -75060 -97067 -47706 3632 -25394 -25807 -57616 -27573 71675 103054
16600 103054 50302 49436 126319 111926 10043 -101696 -57308 20073 74097 4068 -13838
16589 -13838 871 43668 32734 106400 124423 36445 52115 88620 18520 27309 -6509 28019
16577 28019 54584 6530 -5792 58693 98952 37821 16923 37151 -37423 -64061 -38392 -24063
$$ packed form
16659H3815o4641n5721N812n9880p7558l5901n4598N2278R2796k7217k9028k8245
16647a98088J07537J59773O0609J7756p980j34633l5510j832J11613K0296o729
16636I2812j3684n5453Q3467L0541k394o8784n9682N3785j2364p1360l567K3019
16624c664N7489l6040l7135J0849q3835M377J3904P7365j2619l7394K2245k3557
16612d8015q51j2433j3761k2007M9361N1338k9026m13l1809L0043R9248L1379
16600A03054n2752q66P6883j4393j01883j11739M4388P7381N4024p0029j7906
16589a3838J4709M2797j0934P3666J8023q7978J5670L6505p0100Q789l3818L4528
16577B8019K6565m8054j2322O4485M0259o1131k0898K0228p4574k6638K5669J4329
$$ plain form
16565 -24063 -95449 -101759 -69604 -27013 34494 41193 82759 224626 224627 143163 126802 96080 32969
16552 32969 -10219 -66454 -84683 -67341 -57263 -71393 -27173 -14445 -21321 -25665 10881 25767
16540 25767 -81793 -158744 -114745 -95293 -40393 -90392 -13587 86361 111209 -27863 -125929
16529 -125929 -75789 54125 161546 183097 94409 -5633 -101158 -117709 -121765 -128596 -88139
16518 -88139 30444 113326 72040 -12361 -666 32256 19784 16432 55199 81294 65252 29531
16506 29531 -17122 30178 124187 137175 127895 158012 130326 12428 -60631 2962 43050 37348
16494 37348 51453 51185 44352 51838 15306 -19280 -31795 -84804 -108498 -72841 -13220 -23993
16482 -23993 -12113 25739 82 -24707 5564 -51635 -73205 -107341 -52780 -19930 -88037 -109955
$$ packed form
16565b4063p1386o310L2155M2591O1507O699M1566J41867Jq1464j6361l0722o3111
16552C2969m3188n6235j8229J7342J0078j4130M4220J2728o876m344L6546J4886
16540B5767j07560p6951M3999J9452N4900m9999P6805R9948K4848j39072r8066
16529a25929N0140J29914J07421K1551q8688j00042r5525j6551m056o831M0457
16518h8139J18583Q2882m1286q4401J1695L2922j2472l352L8767K6095j6042l5721
16506B9531m6653M7300R4009J2988r280L0117k7686j17898p3059O3593M0088n702
16494C7348J4105k68o833P486l6532l4586j2515n3009k3694L5657N9621j0773
16482b3993J1880L7852k5657k4789L0271n7199k1570l4136N4561L2850o8107k1918
$$ plain form
16470 -109955 -80055 -34968 -99144 -180019 -180373 -86264 -21226 2190 -8018 -6780 50806 65150
16458 65150 -949 53553 114849 43093 -19226 -51489 55267 95049 -26229 -33153 57628
16447 57628 75111 18449 -24715 15777 90769 17166 -128209 -154420 -80709 -16064 8016
16436 8016 19774 3938 -83582 -89829 -55759 -15416 -60191 -98744 -159790 -138765 -112139 -93465
16424 -93465 -4336 55786 140529 133712 26007 -51703 -108019 17468 76893 24079 -43978
16413 -43978 -50227 49310 15537 -39510 490 -10405 -39728 -77919 -104139 -78013 -145647 -129929
16401 -129929 -77554 9561 25830 20841 11865 9057 -8019 -31539 20178 60522 90993 -4052
16389 -4052 -9326 21623 -10889 -90875 -167231 -189385 -153418 -120208 -83216 -120403 -114257 -121138
$$ packed form
16470a09955K9900M5087o4176q0875l54R4109O5038K3416j0208J238N7586J4344
16458F5150o6099N4502O1296p1756o2319l2263J06756L9782j21278o924R0781
16447E7628J7483n6662m3164M0492P4992p3603j45375k6211P3711O4645K4080
16436H016J1758j5836q7520o247L4070M0343m4775l8553o1046K1025K6626J8674
16424i3465Q9129O0122Q4743o817j07705p7710n6316J25487N9425n2814o8057
16413d3978o249R9537l3773n5047M0000j0895k9323l8191k6220K6126o7634J5718
16401a29929N2375Q7115J6269m989q976k808j7076k3520N1717M0344L0471r5045
16389d052n274L0949l2512p9986p6356k2154L5967L3210L6992l7187O146o881
$$ plain form
16377 -121138 -2912 -8360 -35302 -16883 4160 -46276 -64709 -105347 -123341 -102761 -48795
16366 -48795 -17460 -92978 -177696 -157627 -90435 -91439 55711 162396 93981 11986 -146528
16355 -146528 -159137 -55980 43934 16357 -68370 -104142 -45335 -124240 -99252 -83128 -53978
16344 -53978 -31541 -13184 -26874 15615 -9525 13591 19447 943 -16826 8438 62436 49978
16332 49978 13646 47295 130651 112389 114501 105687 93512 42134 -16219 -35429 -85988 -46072
16320 -46072 -14975 65949 130594 113885 45727 -3154 4558 -33511 -58601 37099 75107 15982
16308 15982 -27305 -50019 -55515 -56270 -83897 15884 -16020 -83879 -10841 92752 87056 72580
16296 72580 73094 33560 -76999 -116449 -100166 -64782 10267 -36186 -117309 -66555 -15966 35447
$$ packed form
16377a21138J18226n448k6942J8419K1043n0436j8433m0638j7994K0580N3966
16366d8795L1335p5518q4718K0069O7192j004J47150J06685o8415q1995j58514
16355a46528j2609J03157R9914k7577q4727l5772N8807p8905K4988J6124K9150
16344e3978K2437J8357j3690M2489k5140K3116N856j8504j7769K5264N3998j2458
16332D9978l6332L3649Q3356j8262K112q814j2175n1378n8353j9210n0559L9916
16320d6072L1097Q0924O4645j6709o8158m8881P712l8069k5090R5700L8008n9125
16308A5982m3287k2714n496p55k7627R9781l1904o7859P3038J03593n696j4476
16296G2580N14l9534j10559l9450J6283L5384P5049m6453q1123N0754N0589N1413
$$ plain form
16284 35447 87483 113432 117875 88079 -48190 -60344 -67872 -83424 -94624 -10551 35694 47775
16272 47775 54158 24189 -91810 -157117 -115263 -92743 17750 91862 176417 61649 81402
16261 81402 101366 112664 93162 56979 62728 111599 135959 100876 11166 13298 20922 75529
16249 75529 60200 2305 -59710 -6883 -133 44141 42854 -4365 6501 1311 -9963 -12402
16237 -12402 29485 -33 -59428 -57014 -40628 -52330 -26515 -62718 -65664 62682 86607 79909
16225 79909 69864 47950 92223 81219 33760 40889 -3496 30398 37840 43769 118611 101564
16213 101564 95737 101044 41593 43509 12762 -25962 -4670 7605 -61358 -83354 44748 68801
16201 68801 68883 81286 63370 -18814 -35978 73726 113971 63182 -21213 -28641 8022 12205
$$ packed form
16284C5447N2036K5949M443k9796j36269j2154p528j5552j1200Q4073M6245J2081
16272D7775O383k9969j15999o5307M1854K2520J10493P4112Q4555j14768J9753
16261H1402J9964J1298j9502l6183N749M8871K4360l5083q9710K132P624N4607
16249G5529j5329n7895o2015N2827O750M4274j287m7219J0866n190j1274k439
16237a2402M1887k9518n9395K414J6386j1702K5815l6203k946J28346K3925o698
16225G9909j0045k1914M4273j1004m7459P129m4385L3894P442N929P4842j7047
16213A01564n827N307n9451J916l0747l8724K1292J2275o8963k1996J28102K4053
16201F8801Q2J2403j7916q2184j7164J09704M0245n0789q4395p428L6663M183
$$ plain form
16189 12205 -41568 -146406 -137209 -129334 -123960 -90933 -79655 -122113 -100836 -3792 20691 -82170
16177 -82170 -154510 -185236 -164180 -121445 -101752 -65509 -54973 -15316 -13862 3201 -65813 11766
16165 11766 46097 -21881 2558 46308 54179 -15223 -28919 -6530 29366 52589 41060 26857
16153 26857 15106 -19573 -25121 19340 59895 97189 68935 59748 16698 -65625 -91814 -49348
16141 -49348 -48161 -41566 -17904 10664 3077 25063 122162 82432 -12863 -26582 -7527 -38557
16129 -38557 -34071 -37899 -136062 -115903 -80392 -67685 -19662 45637 37267 -43608 -112858 -61482
16117 -61482 49403 19541 51798 -24316 -88609 -3502 84372 51042 -24375 -62566 27761
16106 27761 6333 28685 44439 39041 -39645 -20871 44796 9802 -41408 -50000 -50081 6905 10607
$$ packed form
16189A2205n3773j04838R197P875N374L3027J1278m2458K1277R7044K4483j02861
16177h2170p2340l0726K1056M2735J9693L6243J0536L9657J454J7063o9014P7579
16165A1766L4331o7978K4439M3750P871o9402j3696K2389L5896K3223j1529j4203
16153B6857j1751l4679n548M4461M0555L7294k8254r187m3050q2323k6189M2466
16141d9348J187O595K3662K8568p587K1986R7099l9730r5295j3719J9055l1030
16129c8557M486l828r8163K0159L5511J2707M8023O5299q370q0875o9250N1376
16117f1482J10885k9862L2257p6114o4293Q5107Q7874l3330p5417l8191R0327
16106B7761k1428K2352J5754n398p8686J8774O5667l4994n1210q592q1N6986L702
$$ plain form
16093 10607 -25432 -71185 -60116 -30801 -48727 -52842 -50877 -185257 -197234 -79217 -59336 -126333
16081 -126333 -108181 54009 74178 -61556 -29896 39510 -44299 -31897 18225 2013 55791
16070 55791 32537 21903 21247 59171 84705 90794 24993 -101929 -131240 -138193 -159940 -198712
16058 -198712 -159771 -79936 -90977 -79943 28204 37762 14793 52096 132097 135557 166787 154197
16046 154197 116786 117571 115684 21981 -111528 -133067 -26389 103225 197883 147479 110991
16035 110991 150269 126688 102406 36884 75037 127632 115383 69152 -14194 -57346 1791
16024 1791 10955 -87654 -109776 -82570 -111977 -88327 -121211 -154294 -97944 -29229 6250 -37136
16012 -37136 -114018 -118257 -82717 -121303 -106754 -42124 -96254 -116694 -100249 -104037 -132849 -14910
$$ packed form
16093A0607l6039m5753J1069K9315j7926m115J965j34380j1977J18017J9881o6997
16081a26333J8152J62190K0169j35734L1660O9406q3809J2402N0122j6212N3778
16070E5791k3254j0634o56L7924K5534O089o5801j26922k9311o953k1747l8772
16058a98712L8941P9835j1041J1034J08147R558k2969L7303Q0001L460L1230j2590
16046A54197l7411P85j887r3703j33509k1539J06678J29614R4658n0404l6488
16035A10991L9278k3581k4282o5522L8153N2595j2249m6231q3346m3152N9137
16024A791R164r8609k2122K7206k9407K3650l2884l3083N6350O8715L5479m3386
16012c7136p6882m239L5540l8586J4549O4630n4130k0440J6445l788k8812J17939
$$ plain form
16000 -14910 76230 89367 45651 -14402 -51089 -103098 -159850 -101534 -75272 -3975 -56779 -184026
15988 -184026 -186825 -135085 18033 -7839 -55879 -20771 -6158 -21843 90476 100834 107598
15977 107598 59015 41741 32422 21232 14147 -6580 -527 -23802 35026 52792 -37538 -88030
15965 -88030 -63034 -67074 -35974 -4307 2678 -48686 9528 53138 -44354 -165895 -135016 -135380
15953 -135380 -140436 -34176 20558 -37454 -8710 15329 85057 118265 103561 81750 51255
15942 51255 13039 -95407 -446 22520 -148862 -175976 -79740 44242 78845 39008 30511
15931 30511 -27395 -94066 -31758 -18673 -74745 -74909 -89009 -96099 29811 89527 74425 -28535
15919 -28535 -71806 -68926 -111074 -71773 21189 -52665 -123136 -66281 -87658 -115131 -74083 -26119
$$ packed form
16000a4910R1140J3137m3716o0053l6687n2009n6752N8316K6262P1297n2804j27247
15988a84026k799N1740J53118k5872m8040L5108J4613j5685J12319J0358O764
15977A07598m8583j7274r319j1190p085k0727O053k3275N8828J7766r0330n0492
15965h8030K4996m040L1100L1667O985n1364N8214M3610r7492j21541L0879l64
15953a35380n056J06260N4734n8012K8744K4039O9728L3208j4704k1811l0495
15942E1255l8216j08446R4961K2966j71382k7114R6236J23982L4603l9837q497
15931C0511n7906o6671O2308J3085n6072j64j4100p090J25910N9716j5102j02960
15919b8535m3271K880m2148L9301R2962p3854p0471N6855k1377k7473M1048M7964
$$ plain form
15907 -26119 22833 70136 42225 79325 93113 55353 25176 64885 38468 -10619 -68594 -143600
15895 -143600 -100963 -34101 -10931 -38355 3412 -9594 46624 -18905 -87065 -40971 -62023
15884 -62023 -60801 -81249 27978 67569 -6881 -15149 2866 18945 27754 -6212 -63098 -63416
15872 -63416 14974 5202 -56373 22969 46337 -17847 -22481 -5312 32896 62708 47834 21696
15860 21696 33334 89783 77531 57596 48381 23166 -4610 24963 113731 102532 77624 -21254
15848 -21254 -58491 -137236 -163010 -123089 -128150 24372 167104 87773 20592 -5615 7482
15837 7482 -42202 35441 7185 -33092 -53189 18782 140935 224658 159700 110009 137517 92358
15825 92358 71306 -948 26886 24348 -36817 -47461 -583 69006 103265 72208 44179 42010
$$ packed form
15907b6119M8952M7303k7911L7100J3788l7760l0177L9709k6417m9087n7975p5006
15895a43600M2637O6862K3170k7424M1767j3006N6218o5529o8160M6094k1052
15884f2023J222k0448J09227L9591p4450q268J8015J6079Q809l3966n6886l18
15872f3416P8390r772o1575P9342K3368o4184m634J7169L8208K9812j4874k6138
15860B1696J1638N6449j2252j9935r215k5215k7776K9573Q8768j1199k4908r8878
15848b1254l7237p8745k5774L9921n061J52522J42732p9331o7181k6207J3097
15837G482m9684P7643k8256m0277k0097P1971J22153Q3723o4958m9691K7508m5159
15825I2358k1052p2254K7834k538o1165j0644M6878O9589L4259l1057k8029k169
$$ plain form
15813 42010 56291 25262 -39821 -70398 -24726 -35945 -17861 30417 67553 23913 -33840 -32040
15801 -32040 9398 8650 41645 -3511 -119396 -92229 -11512 -7573 -64281 -57451 69179 35512
15789 35512 -5196 13261 106615 141791 194856 209754 151978 57445 80065 90044 81408 18695
15777 18695 -50996 -28264 -84600 -45025 79735 56860 69027 80884 -3446 -17502 9583
15766 9583 85468 104002 76536 66715 29216 -44798 -101227 -66924 -48476 -120992 -117315 -60245
15754 -60245 -52437 -154557 -210650 -124264 -45519 -43853 -85200 -126813 -79187 -56439 -104132 -24510
15742 -24510 7636 -52110 24000 20310 22422 36137 -18426 -77750 -136926 -124637 -92851 -57465
15730 -57465 -74804 -124598 -173890 -85309 14791 -27110 1327 22171 73231 56561 -23934
$$ packed form
15813D2010J4281l1029o5083l0577M5672j1219J8084M8278L7136m3640n7753J800
15801c2040M1438p48L2995m5156j15885K7167Q0717L939n6708O830J26630l3667
15789C5512m0708J8457R3354L5176N3065J4898n7776r4533K2620R979q636o2713
15777A8695o9691K2732n6336L9575J24760k2875J2167J1857q4330j4056K7085
15766I583P5885J8534k7466r821l7499p4014n6429L4303J8448p2516L677N7070
15754f0245P808j02120n6093Q6386P8745J666m1347m1613M7626K2748m7693P9622
15742b4510L2146n9746P6110l690K112J3715n4563n9324n9176J2289L1786L5386
15730e7465j7339m9794m9292Q8581J00100m1901K8437K0844N1060j6670q0495
$$ plain form
15719 -23934 -113270 -153270 -75531 -43028 21442 41875 -11705 -123452 -121737 31203 118677
15708 118677 130137 116902 78967 97994 87973 5199 -50890 -53766 -50238 21182 73809 82916
15696 82916 70576 58371 31252 -14539 138477 200814 151589 157680 167569 92643 79922 56324
15684 56324 70570 126432 68258 -29939 -100110 -68719 44715 34689 38750 21180 -19013 13411
15672 13411 67112 76522 59564 15550 -41704 -98295 -144429 -100699 -72779 -82341 -36686 -2501
15660 -2501 -10029 63450 124223 69332 43359 -20487 -37999 -55187 -73426 -155016 -122241 -95422
15648 -95422 -79877 -36140 33742 78401 88215 85874 59442 39664 48165 79736 86050 84960 95705
15635 95705 40189 -23604 -10241 7527 55412 41158 91876 73157 37469 -28361 -48913 -110834
$$ packed form
15719b3934q9336m0000P7739L2503O4470K0433n3580j11747J715J52940Q7474
15708A18677J1460j3235l7935J9027j0021q2774n6089k876L528P1420N2627R107
15696H2916j2340j2205k7119m5791J53016O2337m9225O091R889p4926j2721k3598
15684E6324J4246N5862n8174r8197p0171L1391J13434j0026M061j7570m0193L2424
15672A3411N3701R410j6958m4014n7254n6591m6134M3730K7920r562M5655L4185
15660b501p528P3479O0773n4891k5973o3846j7512j7188j8239q1590L2775K6819
15648i5422J5545M3737O9882M4659R814k341k6432j9778Q501L1571O314j090J0745
15635I5705n5516o3793J3363J7768M7885j4254N0718j8719l5688o5830k0552o1921
$$ plain form
15623 -110834 -117572 -93683 -61691 75776 158301 104761 63319 -86 -86368 -170197 -87831
15612 -87831 62518 127957 37617 65139 38719 17503 38962 30283 -13190 -72987 -94633 -110798
15600 -110798 -89327 -89985 -27952 -35425 -18284 -2310 -120021 -134283 -155804 -99869 -94657 -181365
15588 -181365 -153137 -51980 -70832 -87299 -71798 -68270 -69346 11622 23996 113919 76536 23814
15576 23814 69335 123126 124688 109339 94896 100715 140709 83545 72740 18566 -25345 -89900
15564 -89900 -143123 -145125 -68777 -18832 47793 -1004 -24091 82821 240651 184809 104422
15553 104422 43799 19625 69607 111673 116169 -19461 -97210 -24150 44340 75871 17639
15542 17639 -15974 60023 90425 93044 44705 46007 52072 89675 104568 91910 65489 -25276
$$ packed form
15623a10834o738K3889L1992J37467Q2525n3540m1442o3405q6282q3829Q2366
15612h7831J50349O5439r0340K7522k6420k1216K1459q679m3473n9797k1646j6165
15600a10798K1471o58O2033p473J7141J5974j17711j4262k1521N5935N212q6708
15588a81365K8228J01157j8852j6467J5501L528j076Q0968J2374Q9923l7383n2722
15576B3814M5521N3791J562j5349j4443N819L9994n7164j0805n4174m3911o4555
15564h9900n3223k002P6348M9945O6625m8797k3087J06912J57830n5842q0387
15553A04422o0623k4174M9982M2066M496j35630p7749P3060O8490L1531n8232
15542A7639l3613P5997L0402K619m8339J302O065L7603J4893j2658k6421r0765
$$ plain form
15530 -25276 -21633 -5537 2097 -43092 -60368 -103467 -159672 -152826 -53705 81940 111658 40319
15518 40319 66371 125679 164371 100927 41152 51745 25268 32307 84402 80393 56868 24050
15506 24050 -3059 91109 149269 134260 129914 159011 188358 130330 132453 161933 175657 127136
15494 127136 89448 67391 8520 -7138 22568 -56329 -79197 -92132 -96760 -62767 -44367 -35292
15482 -35292 51837 164856 168525 120189 105037 136078 100613 91722 87285 -55313 -52093 -50542
15470 -50542 73031 37788 -32123 -15405 -7962 -6138 39188 53662 76556 131184 24704 -39032
15458 -39032 -131759 -157902 -100430 -90620 -54693 -21162 -37702 39868 33808 -1906 -54722 -135743
15446 -135743 -159355 -136374 -90801 -158656 -155664 -125132 -119975 -138214 -118032 -118073 -89954 -47974
$$ packed form
15530b5276L643J6096P634m5189j7276m3099n6205O846R9121J35645K9718p1339
15518D0319K6052N9308L8692o3444n9775J0593k6477P039N2095m009k3525l2818
15506B4050k7109R4168N8160j5009m346K9097K9347n8028K123K9480J3724m8521
15494A27136l7688k2057n8871j5658K9706p8897k2868j2935m628L3993J8400R075
15482c5292Q7129J13019L669m8336j5152L1041l5465q891m437j42598L220J551
15470e0542J23573l5243o9911J6718P443J824M5326J4474K2894N4628j06480o3736
15458c9032r2727k6143N7472R810L5927L3531j6540P7570o060l5714n2816q1021
15446a35743k3612K2981M5573o7855K992L0532N157j8239K0182m1K8119M1980
$$ plain form
15434 -47974 -38062 -73119 -31498 -7587 2519 40797 79129 102467 127066 -21481 -110533 -81984
15422 -81984 -14088 -59601 -27981 13076 9158 26006 32876 807 -24241 -72480 -56871 -95351
15410 -95351 -154992 -117112 -219525 -213584 -34590 -54918 -54049 75839 124261 171266 153441 126576
15398 126576 19048 -17847 -10248 -31736 -13388 32661 66677 32561 -9821 13122 8569 -97909
15386 -97909 -127970 -104822 -139900 -194955 -144142 -185821 -169914 -6213 97214 145614 93408
15375 93408 96787 55697 15641 86060 72537 -38100 -99872 -68134 -45357 -66260 -88908 -71673
15363 -71673 -32037 -43384 -7907 -171 -101037 -146622 -131867 -53715 66812 173485 244457
15352 244457 189082 143667 151349 73324 23703 51949 45309 17122 48108 14635 -37775 -3907
$$ packed form
15434d7974R912l5057M1621K3911J0106L8278L8332K3338K4599j48547q9052K8549
15422h1984O7896m5513L1620M1057l918J6848O870l2069k5048m8239J5609l8480
15410i5351n9641L7880j02413N941J78994k0328Q69J29888M8422M7005j7825k6865
15398A26576j07528l6895P599k1488J8348M6049L4016l4116m2382K2943m553j06478
15386i7909l0061K3148l5078n5055N0813m1679J5907J63701J03427M8400n2206
15375I3408L379m1090m0056P0419j3523j10637o1772L1738K2777k0903k2648J7235
15363g1673L9636j1347L5477P736j00866m5585J4755P8152J20527J06673P0972
15352B44457n5375m5415P682p8025m9621K8246o640k8187L0986l3473n2410L3868
$$ plain form
15340 -3907 -9014 11964 15202 6655 -8086 -82392 -97074 -61755 -70162 -97863 -176709 -100834 -24616
15327 -24616 -27557 8193 -10705 -16684 1848 -37297 -67617 -59332 23969 74422 -5813 -42249
15315 -42249 37416 159 28768 2507 -103011 -40923 72729 64375 64636 57417 59001 50869
15303 50869 23201 4307 -74881 -117166 -203440 -121465 -93915 -89062 -24007 -37222 -88742 -25512
15291 -25512 -25238 -66515 -72445 -41759 -25851 -16639 29512 96955 109590 61581 45029 109847
15279 109847 90441 60510 66649 32554 -1715 43173 10603 19462 3272 -35022 -32727 172
15267 172 55001 126485 128219 145968 54134 57349 78919 88910 59851 18172 -7845 27988 60257
15254 60257 124917 69621 24731 45731 4227 -68228 58317 102432 86668 -736 3529 -69330
$$ packed form
15340c907n107K0978L238q547j4741p4306j4682L5319q407k7701p8846P5875P6218
15327b4616k941L5750j8898n979J8532l9145l0320Q285Q3301N0453q0235l6436
15315d2249P9665l7257K8609k6261j05518O2088J13652q354K61p219J584q132
15303E0869k7668j8894p9188m2285q6274Q1975K7550M853O5055j3215n1520O3230
15291b5512K74m1277n930L0686J5908R212M6151O7443J2635m8009j6552O4818
15279A09847j9406k9931O139l4095l4269M4888l2570Q859j6190l8294K295L2899
15267A72N4829P1484J734J7749r1834L215K1570R991k9059m1679k6017L5833L2269
15254F0257O4660n5296m4890K1000m1504p2455J26545M4115j5764q7404M265p2859
$$ plain form
15242 -69330 -31100 80407 155688 156557 113241 85921 15836 -12032 4231 21666 64855 106593
15230 106593 80934 -19740 -40520 -12837 47194 33956 43909 88773 108059 84732 159067
15219 159067 165825 164963 124405 6343 33947 -47357 -150925 -89547 -23483 -22366 -27935 16987
15207 16987 97547 78615 78561 77317 99856 156323 129214 70308 -33828 -87649 65 22054
15195 22054 -101764 -131234 -68261 -73344 -20196 27001 47313 106677 92232 14081 50696 88104
15183 88104 -51660 -25658 15212 409 -9311 11697 43547 3870 -44339 30674 105298 39276
15171 39276 -11442 -51315 -126772 -35943 37395 42298 30675 4078 -25496 -56094 38364 83107
15159 83107 147459 109650 52913 -50444 -44506 -48142 30822 87368 133773 113176 21632 -19446
$$ packed form
15242f9330L8230J11507P5281Q69m3316k7320p0085k7868J6263J7435M3189M1738
15230A06593k5659j00674k0780K7683O0031j3238R953M4864J9286k3327P4335
15219A59067O758q62m0558j18062K7604q1304j03568O1378O6064J117n569M4922
15207A6987Q0560j8932n4j244K2539N6467k7109n8906j04136n3821Q7714K1989
15195B2054j23818k9470O2973n083N3148M7197K0312N9364j4445p8151L6615L7408
15183H8104j39764K6002M0870j4803r720K1008L1850l9677m8209P5013P4624o6022
15171C9276n0718l9873p5457R0829P3338M903j1623k6597k9574l0598R4458M4743
15159H3107O4352l7809n6737j03357N938l636P8964N6546M6405k0597r1544m1078
$$ plain form
15147 -19446 -14571 5944 11812 52981 73996 -12539 3316 58321 5171 -25646 -59003 -66675
15135 -66675 -71356 -88168 -33940 -34858 -25515 20711 47944 15681 50134 18345 -70339 -102316
15123 -102316 -137634 -122320 -41614 -45921 -78395 -119096 -150688 -190410 -263571 -133055 61396
15112 61396 77015 -21770 -22086 10778 35486 130076 117638 55248 -33448 -101690 -137693 -79029
15100 -79029 -85045 -37668 12767 -17506 -25645 24195 -15975 -18925 1825 49776 94393 8273
15088 8273 15078 52640 72857 41311 -10330 -37285 -62884 -30952 53072 28676 -19677 -89247
15076 -89247 -14690 -73596 -170028 -163429 -127960 -62439 -135710 -155626 -103780 -7141 -43 1818
15064 1818 13781 10630 3926 9147 5939 36531 -39293 -106405 -85291 -79734 -157716 -179390 -199282
$$ packed form
15147a9446M875K0515N868M1169K1015q6535J5855N5005n3150l0817l3357p672
15135f6675m681j6812N4228r18R343M6226K7233l2263L4453l1789q8684l1977
15123a02316l5318J5314Q0706m307l2474m0701l1592l9722p3161J30516J94451
15112F1396J5619r8785l16L2864K4708R4590j2438o2390q8696o8242l6003N8664
15100g9029o016M7377N0435l0273q139M9840m0170k950K0750M7951M4617q6120
15088H273O805L7562K0217l1546n1641k6955k5599L1932Q4024k4396m8353o9570
15076h9247P4557n8906r6432O599L5469O5521p3271j9916N1846R6639P098J861
15064A818J1963l151o704N221l208L0592p5824o7112K1114N557p7982k1674j9892
$$ plain form
15051 -199282 -116334 -78351 -49994 -742 76228 26883 -13359 -42579 -29557 -70932 -78084 -46753
15039 -46753 -56860 -84650 -24991 -15856 -1775 38007 105126 52088 64249 64683 13758 9249
15027 9249 60505 39862 -41051 8869 -770 -31667 -39165 -8466 -14890 -47615 -5449 40395
15015 40395 -15503 -72078 -128368 -73849 -71936 -134220 -135351 -124430 -2565 24276 80456 156452
15003 156452 174779 179599 176186 124365 115423 50952 -7617 45493 33583 60178 55223 52640
14991 52640 103094 117261 44719 36762 90327 77057 10747 -19066 16863 5326 48251 108441
14979 108441 105402 15916 -38550 17232 68411 154937 113941 68615 91629 98565 119879 76686
14967 76686 34357 -16345 -111432 -147119 -45137 92717 90379 -14199 29965 -92088 -165612
$$ packed form
15051a99282Q2948L7983K8357M9252P6970m9345m0242k9220J3022m1375p152L1331
15039d6753j0107k7790N9659R135J4081L9782O7119n3038J2161M34n0925m509
15027I249N1256k0643q0913M9920r639l0897p498L0699o424l2725M2166M5844
15015D0395n5898n6575n6290N4519J913o2284j131J0921J21865K6841N6180P5996
15003A56452J8327M820l413n1821q942o4471n8569N3110j1910K6595m955k583
14991E2640N0454J4167p2542p957N3565j3270o6310k9813L5929j1537M2925O0190
14979A08441l039q9486n4466N5782N1179Q6526m0996m5326K3014O936K1314m3193
14967G6686m2329n0702r5087l5687J01982J37854k338j04578M4164j22053p3524
$$ plain form
14956 -165612 -139222 -128661 -94460 -141154 -193806 -177487 -71033 -54551 -61836 -62963 -12488 48064
14944 48064 125686 104564 98118 80488 110254 80495 99322 120943 17115 -20045 -17594 10591
14932 10591 76691 63429 13524 -69327 -138049 -132050 -86902 -43150 45562 90116 92754 165584
14920 165584 135045 83029 50535 -70236 -52869 31421 94744 125086 190365 157173 96192
14909 96192 112832 178608 162995 73101 11872 75819 74320 68948 81608 59604 122763 94134
14897 94134 50901 104754 1781 -61723 47347 31888 -72145 -66572 -97027 -138200 -135716
14886 -135716 -143298 -129106 -34412 126978 70656 34834 -23550 -46755 -17510 -8978 -101098 -46812
14874 -46812 -8897 -30744 -43975 -76006 -50937 -52605 -85919 -53851 -22433 -20177 -42960 -26760
$$ packed form
14956a65612K6390J0561L4201m6694n2652J6319J06454J6482p285j127N0475O0552
14944D8064P7622k1122o446j7630K9766k9759J8827K1621j03828l7160K451K8185
14932A0591O6100j3262m9905q2851o8722N999M5148M3752Q8712M4554K638P2830
14920A65584l0539n2016l2494j20771J7367Q4290O3323L0342O5279l3192o0981
14909I6192J6640O5776j5613q9894o1229O3947j499n372J2660k2004O3159k8629
14897I4134m3233N3853j02973o3504J09070j5459j04033N573l0455m1173K484
14886a35716p582J4192R4694J61390n6322l5822n8384k3205K9245Q532r2120N4286
14874d6812L7915k1847j3231l2031K5069j668l3314L2068L1418K256k2783J6200
$$ plain form
14862 -26760 10345 2395 -9990 -18842 -41716 -64888 -72305 -29757 -5839 -23924 40854 150732
14850 150732 179311 153970 75508 -36164 -25875 -2349 25116 8990 23103 88431 69293
14839 69293 56450 80028 128982 176701 127652 -7531 -39143 -122437 -180407 -113686 -116237 -91378
14827 -91378 -70110 -70275 -73055 19398 93258 70581 149029 117303 18297 750 -38682 6086
14815 6086 79474 95214 69877 -62010 -132622 -76827 -8775 55608 98123 95083 -19847 -144141
14803 -144141 -34625 62506 51809 55442 59418 104422 114393 139009 92001 83406 31069 -49484
14791 -49484 -141537 -159693 -21529 68936 32815 -25037 -62313 -60953 18090 102504 94075 -3659
14779 -3659 -23313 10992 3178 57763 36342 56378 77563 5477 -24718 32402 63592 92633
$$ packed form
14862b6760L7105p950j2385q852k2874k3172p417M2548K3918j8085O4778J09878
14850A50732K8579k5341p8462j11672J0289K3526K7465j6126J4113O5328j9138
14839F9293j2843K3578M8954M7719m9049j35183l1612q3294n7970O6721k551K4859
14827i1378K1268j65k780R2453P3860k2677P8448l1726r9006j7547l9432M4768
14815F086P3388J5740k5337j31887p0612N5795O8052O4383M2515l040j14930j24294
14803a44141J09516R7131j0697L633L976M5004R971K4616m7008q595n2337q0553
14791d9484r2053j8156J38164R0465l6121n7852l7276J360P9043Q4414q429r7734
14779c659j9654L4305p814N4585k1421K0036K1185p2086l0195N7120L1190K9041
$$ plain form
14767 92633 146898 176835 206361 120347 64833 89481 36338 27124 36715 -15892 -25287 -71052
14755 -71052 -68878 -126095 -95065 -55818 -75950 -33729 14904 57902 -8817 -82923 -23098 -56226
14743 -56226 -148973 -160766 -45020 -8106 56854 36823 39416 -4096 -33153 -48361 -81140 -36704
14731 -36704 64870 117118 148284 186760 185997 63997 34273 -20723 -50626 -5353 -2322 16041
14719 16041 -71196 -81275 -70217 -100100 -163800 -167290 -101297 -93626 -77975 -123436 -85351 -68842
14707 -68842 -97118 -122671 -28591 -1205 -79143 -97940 -117504 -78399 -139400 -117941 21332
14696 21332 18792 -75746 -97030 -45921 -45560 -108848 -132953 -93289 -12210 -32462 -37892 -48217
14684 -48217 9338 74987 147054 76747 28252 -46130 -2857 42918 -24886 -66304 18840 6118
$$ packed form
14767I2633N4265K9937K9526q6014n5514K4648n3143r214R591n2607r395m5765
14755g1052K174n7217L1030L9247k0132M2221M8633M2998o6719p4106N9825l3128
14743e6226r2747j1793J15746L6914O4960k0031K593m3512k9057j5208l2779M4436
14731c6704J01574N2248L1166L8476p63j22000k9724n4996k9903M5273L031J8363
14719A6041q7237j0079J1058k9883o3700l490O5993P671J5651m5461L8085J6509
14707f8842k8276k5553R4080K7386p7938j8797j9564L9105o1001K1459J39273
14696B1332k540r4538k1284N1109L61o3288k4105L9664Q1079k0252n430j0325
14684d8217N7555O5649P2067p0307m8495p4382M3273M5775o7804m1418Q5144j2722
$$ plain form
14672 6118 -3881 -32729 -11998 29978 6555 54052 42542 43578 89095 49343 -40254 13416
14660 13416 26211 39740 61967 -33008 -41580 -29672 -90903 -171490 -148505 -75612 -58800 -45287
14648 -45287 -96342 -66402 -69482 -83645 -141919 -94498 -32176 -58441 -36170 -23730 -60618 -109145
14636 -109145 -51716 15826 -15569 -77931 -82899 17444 101543 115822 95201 70758 26321
14625 26321 -37405 -79704 -151898 -141439 -43029 37312 69906 101629 90088 -615 -23528 18604
14613 18604 21121 32870 53154 39284 6984 32078 14752 -17819 -80081 -28690 -55980 -28041
14601 -28041 5799 33194 -24974 -112589 -120287 -165113 -203769 -48881 40175 -7868 -16965 -34480
14589 -34480 -9819 9002 -50929 -131246 -104466 -25996 18792 48262 71760 -11156 -102141 -124171
$$ packed form
14672F118r999k8848K0731M1976k3423M7497j1510J036M5517l9752q9597N3670
14660A3416J2795J3529K2227r4975q572J1908o1231q0587K2985P2893J6812J3513
14648d5287n1055K9940l080j4163n8274M7421O2322k6265K2271J2440l6888m8527
14636a09145N7429O7542l1395o2362m968J00343Q4099J4279k0621k4443m4437
14625B6321o3726m2299p2194J0459R8410Q0341L2594L1723j1541r0703k2913M2132
14613A8604K517J1749K0284j3870l2300K5094j7326l2571o2262N1391k7290K7939
14601b8041L3840K7395n8168q7615p698m4826l8656J54888Q9056m8043r097j7515
14589c4480K4661J8821n9931q0317K6780P8470M4788K9470K3498q2916r0985k2030
$$ plain form
14577 -124171 -152670 -197457 -183501 -147726 -30303 -32210 -43444 -26515 -33640 -58259 -51195 -60763
14565 -60763 -12750 33656 108137 199546 111666 121103 144314 136621 134354 136933 132304 78599 60747
14552 60747 132659 118737 169476 123161 108107 42215 19358 37924 86037 65507 -45576
14541 -45576 -117066 -93334 -35801 45580 5440 -89086 -89106 -24847 -7975 37437 115088 50011
14529 50011 50542 -13401 -67683 37125 92231 85703 162470 81939 106356 99067 55538 38219
14517 38219 96355 115290 103984 86216 111273 17214 -48093 23202 39883 63877 56796 11279
14505 11279 27010 60378 122523 190156 16332 -105697 -90860 -24368 49860 -10221 -65580
14494 -65580 -77801 -90532 -87102 -67794 -61010 -35718 -9962 -56962 -55496 -95563 -133783 -88111
$$ packed form
14577a24171k8499m4787J3956L5775J17423j907j1234J6929p125k4619P064r568
14565f0763M8013M6406P4481R1409q7880R437K3211p693k267K579m629n3705j7852
14552F0747P1912j3922N0739m6315j5054o5892k2857J8566M8113k0530j11083
14541d5576p1490K3732N7533Q1381m0140r4526k0O4259J6872M5412P7651o5077
14529E0011N31o3943n4282J04808N5106o528P6767q0531K4417p289m3529j7319
14517C8219N8136J8935j1306j7768K5057r4059o5307P1295J6681K3994p081m5517
14505A1279J5731L3368O2145O7633j73824j22029J4837O6492P4228o0081n5359
14494f5580j2221j2731L430J9308O784K5292K5756m7000J466m0067l8220M5672
$$ plain form
14482 -88111 -17538 88142 123378 131086 74789 -17321 -34420 -109286 -186714 -189895 -88405 -82139
14470 -82139 -70643 39422 72427 41613 67544 76502 47625 80606 78232 -22663 -65486 -43335
14458 -43335 38366 99097 107575 42051 -21784 -105196 -73633 -90450 -120829 -84079 -24314 -19435
14446 -19435 -4218 58762 67664 27198 -51659 -26318 96953 73532 19643 15721 22499 35813
14434 35813 84617 1097 -72752 22568 61591 94220 39882 -28290 -25407 30676 1063 -12625
14422 -12625 -28293 -11157 24949 57127 -9273 30922 25325 73200 109504 149310 125672 120836
14410 120836 111578 133636 168014 201500 197509 174519 147908 116949 38252 54156 86655 96587
14398 96587 19895 -122952 -102967 -18515 10940 86310 85142 4252 4278 20602 40697 21632
$$ packed form
14482h8111P0573J05680L5236P708n6297r2110j7099p4866p7428l181J01490O266
14470h2139J1496J10065L3005l0814K5931Q958k8877L2981k374j00895m2823K2151
14458d3335Q1701O0731Q478o5524o3835q3412L1563j6817l0379L6750N9765M879
14446a9435J5217O2980Q902m0466p8857K5341J23271k3421n3889l922O778J3314
14434C5813M8804q3520p3849R5320L9023L2629n4338o8172K883N6083k9613j3688
14422a2625j5668J7136L6106L2178o6400M0195n597M7875L6304L9806k3638m836
14410A20836r258K2058L4378L3486l991k2990k6611l0959p8697J5904L2499R932
14398I6587p6692j42847J9985Q4452K9455P5370j168q0890K6J6324K0095j9065
$$ plain form
14386 21632 -108881 -129980 -70516 -7231 44834 -19560 -15564 -39796 -80099 -45466 -22307 -63840
14374 -63840 -43391 15545 44803 70441 81505 60052 -22781 -44614 -14261 -42818 -14042 47535
14362 47535 21664 21685 67008 69263 66305 -2546 42342 132108 69624 90561 131485 179332 141364
14349 141364 36144 54993 67931 -15448 68179 113909 49400 -10297 24282 78543 33500
14338 33500 -30166 -9995 41347 29842 -26519 -72111 -10916 61724 66217 19131 -29198 -80069
14326 -80069 -93770 -45006 14278 10296 29011 -26007 -122360 -129946 -116638 -58184 -18724 -57980
14314 -57980 -33003 52857 81598 122468 101255 88497 110278 25172 -30461 18922 38105 -4432
14302 -4432 48668 17465 55 -4202 -40074 4797 47576 -62631 -86131 -109773 -118641 -130760
$$ packed form
14386B1632j30513k1099N9464O3285N2065o4394L996k4232m0303L4633K3159m1533
14374f3840K0449N8936K9258K5638J1064k1453q2833k1833L0353k8557K8776O1577
14362D7535k5871K1M5323K255k958o8851M4888Q9766o2484K0937M0924M7847l7968
14349A41364j05220J8849J2938q3379Q3627M5730o4509n9697L4579N4261m5043
14338C3500o3666K0171N1342j1505n6361m5592O1195P2640M493m7086m8329n0871
14326h0069j3701M8764N9284l982J8715n5018r6353p586J3308N8454L9460l9256
14314e7980K4977Q5860K8741M0870k1213j2758K1781q5106n5633M9383J9183m2537
14302d432N3100l1203j7410m257l5872M4871M2779j10207k3500k3642q868j2119
$$ plain form
14290 -130760 -45784 -4271 69149 113112 160785 80651 -24852 -44245 2233 86419 58204
14279 58204 511 -65888 -56772 -38178 -60244 -189279 -286783 -200786 -64662 30227 45163
14268 45163 -34653 -2936 -5461 -100549 -200893 -260710 -264859 -155834 -5703 39698 88993
14257 88993 53785 -44591 -123639 -112251 -86924 -96535 -114233 -84713 -117290 -114140 -47890 53688
14245 53688 107706 92890 93721 10364 38255 73127 59334 9847 26370 60824 16873 94912
14233 94912 128935 25504 -4589 -36413 -70191 -64723 -11887 8099 -23409 -10205 23923 70959
14221 70959 13469 25236 -44866 -29033 18415 47586 69065 50644 42772 83978 51099 96457
14209 96457 40075 19397 -3165 1451 -32790 -27159 -61980 -56448 16447 13166 44095 -5182
$$ packed form
14290a30760Q4976M1513P3420M3963M7673q0134j05503j9393M6478Q4186k8215
14279E8204n7693o6399R116J8594k2066j29035r7504Q5997J36124R4889J4936
14268D5163p9816L1717k525r5088j00344n9817m149J09025J50131M5401M9295
14257H8993l5208r8376p9048J1388K5327r611j7698K9520l2577L150O6250J01578
14245E3688N4018j4816Q31q3357K7891L4872j3793m9487J6523L4454m3951P8039
14233I4912L4023j03431l0093l1824l3778N468N2836J9986l1508J3204L4128M7036
14221G0959n7490J1767p0102J5833M7448K9171K1479j8421p872M1206l2879M5358
14209I6457n6382k0678k2562M616l4241N631l4821N532P2895l281L0929m9277
$$ plain form
14197 -5182 -45105 -101536 -73450 -9527 -4996 -38847 -68615 -34020 -35116 -19398 -49659 -119316
14185 -119316 -36678 61224 82126 44546 -77926 -166332 -98658 -364 45622 74079 77068
14174 77068 25664 16831 36127 -34777 -70093 -70526 -92903 -20030 39434 -54895 -31664 18162
14162 18162 83581 138964 162049 146537 89210 28422 76437 106206 58130 16006 -10534 -10633
14150 -10633 -46101 -126838 -74333 -81307 -55429 1853 8660 7400 49869 114658 122528 96782
14138 96782 47649 127024 136485 82359 64307 52366 21483 -13261 19843 8220 20295 -36803
14126 -36803 -111019 -136959 -97100 -75832 14196 80771 26435 -3434 -130022 -107825 -74574
14115 -74574 -14221 19521 9808 62530 70825 43836 70245 82367 43137 22617 -916 -22508
$$ packed form
14197e182l9923n6431K8086O3923M531l3851k9768L4595j096J5718l0261o9657
14185a19316Q2638R7902K0902l7580j22472q8406O7674R8294M5986K8457K989
14174G7068n1404q833J9296p0904l5316m33k2377P2873N9464r4329K3231M9826
14162A8162O5419N5383K3085j5512n7327o0788M8015K9769m8076m2124k6540r9
14150a0633l5468q0737N2505o974K5878N7282O807j260M2469O4789P870k5746
14138I6782m9133P9375R461n4126j8052j1941l0883l4744L3104j1623J2075n7098
14126c6803p4216k5940L9859K1268R0028O6575n4336k9869j26588K2197L3251
14115g4574O0353L3742r713N2722Q295k6989K6409J2122l9230k0520k3533k1592
$$ plain form
14103 -22508 -120674 -107217 -19580 30523 41364 72270 -17024 -73518 -137369 -110055 -27064 -11324
14091 -11324 -11689 -4617 -1944 -6698 10201 31108 4264 2755 -80418 -154541 -113338 -73810 -69628
14078 -69628 -61644 -144168 -92857 -35280 -58 29548 44834 24994 7417 -24101 -22182 -11488
14066 -11488 -34630 -56129 -51197 -21270 34078 -60015 -57691 -27471 -7019 -46954 -23848 92553
14054 92553 136050 154476 145436 92277 2233 -58415 -115569 -66699 49211 66037 62378 97724
14042 97724 76209 -31864 -59436 77507 98790 68681 56968 32026 54354 85976 47360
14031 47360 88196 101350 172058 32376 -37401 53160 -5350 -30096 22180 48733 22149
14020 22149 -18338 -25417 -51370 -9637 -10342 15195 -23928 -35623 1004 -47931 -78558 -1415
$$ packed form
14103b2508r8166J3457Q7637N0103J0841L0906q9294n6494o3851K7314Q2991J5740
14091a1324l65P072K673m754J6899K0907k6844j509q3173p4123M1203L9528M182
14078f9628P984q2524N1311N7577L5222K9606J5286j9840j7577l1518J919J0694
14066a1488k3142k1499M932K9927N5348r4093K324L0220K0452l9935K3106J16401
14054I2553M3497J8426r040n3159r0044o0648n7154M8870J15910J6826l659L5346
14042I7724k1515j08073k7572J36943K1283l0109j1713k4942K2328L1622l8616
14031D7360M0836J3154P0708j39682o9777R0561n8510k4746N2276K6553k6584
14020B2149m0487p079k5953M1733p05K5537l9123j1695L6627m8935l0627P7143
$$ plain form
14008 -1415 9953 -6194 95644 21079 -566 33228 -46899 -101867 -76075 -17223 14856 90714
13996 90714 17221 493 -64380 -60946 -106483 -99826 -12177 -61966 -104183 -67957 -9690 -30199
13984 -30199 -76103 -44386 14051 42525 118115 82202 -17536 -54505 -9310 87681 125215 86588
13972 86588 -11195 -27535 -1602 -84177 -36582 43087 -46559 -85208 -91704 -28200 33322 21305
13960 21305 -39563 -61704 -70426 -82001 -131096 -55723 -5319 33315 4378 -127137 -191480 -135237
13948 -135237 -49696 -78050 -200484 -235524 -126264 -80050 -12818 -32100 -46572 -47098 -3026
13937 -3026 61974 29170 -21622 9959 -25872 -77199 -12541 -10560 -10676 -37793 -83000 -35618
13925 -35618 11268 -35040 -56972 -45185 -59265 -39182 -13646 -47811 -74150 -89697 -79511 -4120
$$ packed form
14008a415J1368j6147J01838p4565k1645L3794q0127n4968K5792N8852L2079P5858
13996I0714p3493j6728o4873L434m5537O657Q7649m9789m2217L6226N8267k0509
13984c0199m5904L1717N8437K8474P5590l5913r9738l6969M5195R6991L7534l8627
13972H6588r7783j6340K5933q2575M7595P9669q9646l8649o496O3504O1522j2017
13960B1305o0868k2141q722j1575m9095P5373N0404L8634k8937j31515o4343N6243
13948a35237Q5541k8354j22434l5040J09260M6214O7232j9282j4472n26M4072
13937c026O5000l2804n0792L1581l5831n1327O4658J981j16k7117m5207M7382
13925c5618M6886m6308k1932J1787j4080K0083K5536l4165k6339j5547J0186P5391
$$ plain form
13913 -4120 41134 85476 96766 49328 45613 34797 -29936 34943 51782 5865 62931 51699
13901 51699 60007 27400 43087 8907 -29171 -95601 -112346 -64346 -8979 72471 96651 107527
13889 107527 5850 -29815 -26115 -12110 54749 54147 35785 82636 85583 -55390 -88445 -60036
13877 -60036 -33377 -27587 5533 76414 55353 57643 132604 163778 179874 283910 321040 241344
13865 241344 180603 192124 145620 128449 151743 235137 197780 179811 190451 250857 273585
13854 273585 386152 495002 550553 516517 518675 393637 263367 313444 384137 418649 445748
13843 445748 441281 450415 450978 448410 468587 461734 443806 347581 289995 270623 153272 173870
13831 173870 167204 217881 265563 348016 452259 417523 402699 499579 575116 499389 338997
$$ packed form
13913d120M5254M4342J1290m7438l715j0816o4733O4879J6839m5917N7066j1232
13901E1699Q308l2607J5687l4180l8078o6430j6745M8000N5367Q1450K4180J0876
13889A07527j01677l5665L700J4005O6859o02j8362M6851K947j40973l3055K8409
13877f0036K6659N790L3120P0881k1061K290P4961L1174J6096J04036L7130p9696
13865B41344o0741J1521m6504j7171K3294Q3394l7357j7969J0640O0406K2728
13854B73585J12567J08850N5551l4036K158j25038j30270N0077P0693L4512K7099
13843D45748m467R134N63k568K0177o853j7928r6225n7586j9372j17351K0598
13831A73870o666N0677M7682Q2453J04243l4736j4824R6880P5537p5727j60392
$$ plain form
13820 338997 250306 190273 258485 325114 460665 664588 811323 778010 719027 572126 391142
13809 391142 281324 193900 139003 159298 177491 196252 225364 199497 102962 183486 189351
13798 189351 137757 173242 116080 169576 148023 139012 109601 21465 -29207 34393 -18236 -45973
13786 -45973 -70867 -5666 143862 172555 136012 174365 171633 166032 143030 133567 131989 146387
13774 146387 255209 236972 179255 133271 91603 122194 143444 192071 330954 375100 302107
13763 302107 203828 150164 111858 107058 62736 118055 197033 274489 303375 218087 163249 156612
13751 156612 199945 145362 102143 104601 60504 94211 136412 122057 78578 36010 -9672 -124662
13739 -124662 -111513 -98415 -82343 -76140 -48104 -143079 -67826 23570 47768 114763 129946 86930
$$ packed form
13820C38997q8691o0033O8212O6629J35551K03923J46735l3313n8983j46901j80984
13809C91142j09818q7424n4897K0295J8193J8761K9112k5867r6535Q0524N865
13798A89351n1594L5485n7162N3496k1553r011k9411q8136n0672O3600n2629k7737
13786d5973k4894O5201J49528K8693l6543L8353k732n601k3002r463j578J4398
13774A46387J08822j8237n7717m5984m1668L0591K1250M8627J38883M4146p2993
13763C02107r8279n3664l8306m800m4322N5319P8978P7456K8886q5288n4838o637
13751A56612M3333n4583m3219K458m4097L3707M2201j4355m3479m2568m5682j14990
13739a24662J3149J3098J6072O203K8036r4975P5253R1396K4198O6995J5183m3016
$$ plain form
13727 86930 20925 62898 67029 90790 111740 98136 117755 111427 163548 205585 229745 220331
13715 220331 162686 142611 107956 117002 96270 -34484 -26475 -3286 -44747 52802 135368 126763
13703 126763 64426 150204 115733 56872 44835 51716 40999 15274 18817 37874 32465 49983
13691 49983 84919 68812 67694 50298 44317 52580 -11817 -21669 -49994 -22541 44541 30618
13679 30618 770 -42283 -66589 -23850 29980 52531 75019 107992 56235 47916 45191 8581
13667 8581 -45057 -37545 16526 62444 72705 52048 64656 22090 -1891 53961 11912 12431
13655 12431 63151 123955 137818 40125 65083 88941 55987 47682 59232 72387 19346 20809
13643 20809 -9629 7610 -11107 -100351 -106914 -51915 4635 40926 114323 49418 -22411 5396
$$ packed form
13727H6930o6005M1973M131K3761K0950j3604J9619o328N2121M2037K4160r414
13715B20331n7645k0075l4655R046k0732j30754Q009K3189m1461R7549Q2566q605
13703A26763o2337Q5778l4471n8861j2037O881j0717k5725L543J9057n409J7518
13691D9983L4936j6107j118j7396n981Q263o4397r852k8325K7453O7082j3923
13679C0618k9848m3053k4306M2739N3830K2551K2488L2973n1757q319k725l6610
13667H581n3638P512N4071M5918J0261k0657J2608m2566k3981N5852m2049N19
13655A2431N0720O0804J3863r7693K4958K3858l2954q305J1550J3155n3041J463
13643B0809l0438J7239j8717q9244o563N4999N6550L6291P3397o4905p1829K7807
$$ plain form
13631 5396 -11557 -70515 -142239 -71918 28494 75023 10852 21014 57082 42300 148153
13620 148153 213163 216123 146465 15893 12683 -1438 -81104 -103985 -24714 7696 32043 37309
13608 37309 142434 187012 144601 19419 -23507 53488 106182 97525 80048 -934 -97886
13597 -97886 -57527 -32827 -64567 10574 19434 -38612 -9393 6569 -40684 -65550 -67080 -54555
13585 -54555 -25145 105 -37109 -115815 -114895 -100459 -74592 -75364 -50957 -35949 -39891 -53581 -9089
13572 -9089 -4555 22855 -8300 -55974 2414 37102 80372 5242 -19379 -6573 -33246 -69262
13560 -69262 -109785 -161358 -145036 -36034 2392 16315 61399 -3248 -46191 31499 43996
13549 43996 24932 -26960 -92609 -40924 54975 118357 96062 -30797 -84097 -44074 2999
$$ packed form
13631E396j6953n8958p1724P0321J00412M6529o4171J0162L6068j4782J05853
13620A48153O5010K960o9658j30572l210j4121p9666k2881P9271L2410K4347N266
13608C7309J05125M4578m2411j25182m2926P6995N2694q657j7477q0982r6952
13597i7886M0359K4700l1740P5141Q860n8046K9219J5962m7253k4866j530J2525
13585e4555K9410K5250l7214p8706R20J4436K5867p72K4407J5008l942j3690M4492
13572i089M534K7410l1155m7674N8388L4688M3270p5130k4621J2806k6673l6016
13560f9262m0523n1573J6322J09002L8426J3923M5084o4647m2943P7690J2497
13549D3996j9064n1892o5649N1685R5899O3382k2295j26859n3300M0023M7073
$$ plain form
13538 2999 1873 13337 -13861 35004 86670 172928 180674 121269 70765 69816 46178 -9173 -137137
13525 -137137 -71033 91670 131531 174445 194158 156781 109366 11769 65545 76620 91419
13514 91419 211596 199375 114798 59096 77355 77424 60319 60341 73408 13997 -71315 -47936 12332
13501 12332 -16523 23303 20823 -20923 -59119 -151045 -141627 1747 202688 319406 270404
13490 270404 149701 179850 334924 388541 415297 320123 194103 199237 324903 322508 246357
13479 246357 173334 142758 54072 -2314 -16548 -36343 -34080 -27570 -97266 -148125 -103536 21023
13467 21023 17961 -10596 -70414 27366 169050 175618 192283 239224 297104 360322 384951 272779
13455 272779 274095 319181 419156 459094 461978 489806 513132 516674 452819 485753 514886 479520
$$ packed form
13538B999j126J1464k7198M8865N1666Q6258P746n9405n0504r49k3638n5351j27964
13525a37137O6104J62703L9861M2914J9713l7377m7415r7597N3776J1075J4799
13514I1419J20177j2221q4577n5702J8259O9j7105K2J3067n9411q5312K3379O0268
13501A2332k8855L9826k480m1746l8196r1926R418J43374K00941J16718m9002
13490B70404j20703L0149J55074N3617K6756r5174j26020N134J25666k395p6151
13479B46357p3023l0576q8686n6386j4234j9795K263O510o9696n0859M4589J24559
13467B1023l062k8557n9818R7780J41684O568J6665M6941N7880O3218K4629j12172
13455B72779J316M5086R9975L9938K884K7828K3326L542o3855L2934K9133l5366
$$ plain form
13443 479520 440982 417875 419690 569007 598301 630030 695824 718611 722023 660645 566536 534840
13431 534840 518255 547937 684561 810223 769526 699134 624315 667758 622330 585840 632409
13420 632409 685903 677372 708274 722220 693522 737183 896407 1036597 1193815 1308206 1354730
13409 1354730 1376155 1293759 1337464 1453641 1548279 1713634 1892500 2183125 2338115 2382386
13399 2382386 2481223 2631853 2884068 2942033 3018897 3230175 3575238 4108353 4540438 5052779
13389 5052779 5646392 6419804 7200365 7955053 8710885 9699743 11093241 13036361 15801472
13380 15801472 19360455 23864374 30407510 39909951 53100864 72288888 103440321 160249986
13372 160249986 264934440 411764854 521788526 515318833 393840966 275327092
$$ packed form
13443D79520l8538k3107J815J49317K9294L1729O5794K2787L412o1378r4109l1696
13431E34840j6585K9682J36624J25662m0697p0392p4819M3443m5428l6490M6569
13420F32409N3494q531L0902J3946k8698M3661J59224J40190J57218J14391M6524
13409A354730K1425q2396M3705J16177R4638J65355J78866K90625J54990M4271
13399B382386R8837J50630K52215N7965P6864K11278L45063N33115M32085N12341
13389E052779N93613P73412P80561P54688P55832R88858J393498J943120K765111
13380A5801472L558983M503919O543136R502441J3190913J9188024L1151433N6809665
13372A60249986J04684454J46830414J10023672o469693j21477867j18513874
$$ plain form
13366 275327092 199740929 153280350 123696623 103923316 89859127 79261717 71011504
13359 71011504 64482305 59400058 55251488 51635127 48526812 45739330 43319971 41390943
13351 41390943 39748535 38294235 36849133 35393667 34178451 33158880 32033869 30721647
13343 30721647 29400822 28348914 27453159 26725014 26149957 25638131 25032933 24423932 23822084
13334 23822084 23045904 22172834 21400072 20786840 20164854 19595760 19069843 18606796 18125691
13325 18125691 17571982 17012957 16499343 16098073 15643245 15204673 14834122 14494043 14132242
13316 14132242 13707547 13271265 12886959 12571962 12266994 11948920 11653197 11346145 11085166
13307 11085166 10789217 10530286 10226768 10033761 9923615 9729396 9416592 9093533 8822295
$$ packed form
13366B75327092p5586163m6460579k9583727j9773307j4064189j0597410q250213
13359G1011504o529199n082247m148570l616361l108315k787482k419359j929028
13351D1390943j642408j454300j445102j455466j215216j019571j125011j312222
13343C0721647j320825j051908q95755p28145n75057n11826o05198o09001o01848
13334B3822084p76180q73070p72762o13232o21986n69094n25917m63047m81105
13325A8125691n53709n59025n13614m01270m54828m38572l70551l40079l61801
13316A4132242m24695m36282l84306l14997l04968l18074k95723l07052k60979
13307A1085166k95949k58931l03518j93007j10146j94219l12804l23059k71238
$$ plain form
13298 8822295 8597979 8406913 8253859 8133478 7951360 7668502 7413722 7175828 7025800
13289 7025800 6891520 6743205 6559894 6295325 6096559 5936033 5821839 5682338 5593356 5558104
13279 5558104 5506233 5400657 5393911 5412215 5348511 5230278 5033835 4899009 4732703 4608180
13269 4608180 4509959 4482117 4389458 4248594 4192319 4136005 4087906 3992638 3900817 3814300 3721738
13258 3721738 3599019 3501306 3453662 3366836 3293442 3194132 3139958 3061193 3056389 2907977 2723608
13247 2723608 2594590 2391667 2399610 2558879 2466419 2397149 2417359 2407310 2399351 2358081 2289863
13236 2289863 2244265 2256983 2216002 2154228 2138638 2047766 2014944 2021233 1977111 1907215 1854710
13225 1854710 1786670 1590447 1578953 1577784 1488826 1417265 1279022 1116301 1096426 1112009 1079421
$$ packed form
13298H822295k24316j91066j53054j20381j82118k82858k54780k37894j50028
13289G025800j34280j48315j83311k64569j98766j60526j14194j39501q8982l5252
13279E558104n1871j05576o746J8304o3704j18233j96443j34826j66306j24523
13269D608180r8221k7842r2659j40864n6275n6314m8099r5268r1821q6517r2562
13258C721738j22719r7713m7644q6826p3394r9310n4174p8765m804j48412j84369
13247B723608j29018k02923P943J59269r2460o9270K0210j0049p959m1270o8218
13236B289863m5598J2718m0981o1774j5590r0872l2822O289m4122o9896n2505
13225A854710o8040j96223j1494j169q8958p1561j38243j62721j9875J5583l2588
$$ plain form
13214 1079421 1044480 1007941 933450 869495 868457 819550 808316 859817 763010 642801 646574
13203 646574 699319 783423 770817 727347 725111 651745 576421 593239 579601 546593 558151 527379
13191 527379 538827 556238 525165 603373 669805 573439 491948 422747 435680 573475 676380
13180 676380 639220 544427 433503 411833 460884 472918 437679 392889 427395 460106 413748
13169 413748 420335 519798 520262 487740 491918 498529 482564 468350 346501 336963 400975 396306 396053
13156 396053 405440 387763 318516 300799 382240 395115 414993 357561 386556 448840 385267 355328
13144 355328 322888 279813 328379 390369 399646 340594 366465 430597 414736 427355 443462 445650
13132 445650 384106 339566 263356 234828 271282 432724 416359 432274 399553 404819 329087
$$ packed form
13214A079421l4941l6539p4491o3955j038m8907j1234N1501r6807j20209L773
13203F46574N2745Q4104j2606m3470k236p3366p5324J6818j3638l3008J1558l0772
13191E27379J1448J7411l1073P8208O6432r6366q1491o9201J2933J37795J02905
13180F76380l7160r4793j10924k1670M9051J2034l5239m4790L4506L2711m6358
13169D13748O587R9463M64l2522M178O611j5965j4214j21849r538O4012m669k53
13156C96053R387j7677o9247j7717Q1441J2875J9878n7432K8995O2284o3573k9939
13144C55328l2440m3075M8566O1990R277n9052K5871O4132j5861J2619J6107K188
13132D45650o1544m4540p6210k8528L6454J61442j6365J5915l2721N266p5732
$$ plain form
13121 329087 271096 293911 379992 362772 355085 357649 301904 185664 144472 109459 92570 85128
13109 85128 161283 243343 236552 207250 187060 101290 -22002 65482 89114 196217 245405
13098 245405 215887 241755 206080 277332 233747 132496 171676 222337 267443 258977 269631
13087 269631 254472 117034 -8951 12495 1031 35390 129201 213416 293163 242807 254382
13076 254382 334483 337541 373477 339154 260136 201505 123942 12693 -76898 -85590 -15342 119792
13064 119792 238685 334655 274082 164859 111649 189039 188225 159407 246661 279023 140111
13053 140111 9667 -12194 13204 32365 92114 170628 133762 124583 63320 65897 50375 143586
13041 143586 91427 44000 36047 45704 101932 119870 93207 21607 60927 48808 9745 -51703
$$ packed form
13121C29087n7991K2815Q6081j7220p687K564n5745j16240m1192l5013j6889p442
13109H5128P6155Q2060o791k9302k0190q5770j23292Q7484K3632J07103M9188
13098B45405k9518K5868l5675P1252m3585j01251L9180N0661M5106q466J0654
13087B69631j5159j37438j25985K1446j1464L4359R3811Q4215P9747n0356J1575
13076B54382Q0101L058L5936l4323p9018n8631p7563j11249q9591q692P0248J35134
13064A19792J18893R5970o0573j09223n3210P7390q14k8818Q7254L2362j38912
13053A40111j30444k1861K5398J9161N9749P8514l6866r179o1263K577j5522R3211
13041A43586n2159m7427p953R657N6228J7938k6663p1600L9320j2119l9063o1448
$$ plain form
13029 -51703 -28418 57036 148366 257351 195778 25812 30564 34574 51608 159677 149336
13018 149336 53752 48656 70242 155216 110301 70071 -1522 29923 130202 122156 81014 89229
13006 89229 100805 126794 110030 60854 76781 119415 221392 226260 113051 50143 116060
12995 116060 166813 113088 -3380 -25309 93379 182822 229371 195988 166641 133837 70785
12984 70785 66492 131101 169146 125624 31261 -29720 -56563 9288 30079 64759 74852 145065
12972 145065 218654 220256 216497 187305 107505 125410 124313 127118 87394 139934 81157 -28216
12960 -28216 -36274 -23713 1678 85899 150576 298511 256237 116290 74761 22529 65117
12949 65117 -33443 -21054 35381 24420 17546 16133 39705 55138 94809 74903 38122 5842
$$ packed form
13029e1703K3285Q5454R1330J08985o1573j69966M752M010J7034J08069j0341
13018A49336r5584n096K1586Q4974m4915m0230p1593L1445J00279q046m1142Q215
13006H9229J1576K5989j6764m9176J5927M2634J01977M868j13209o2908O5917
12995A16060N0753n3725j16468k1929J18688Q9443M6549l3383k9347l2804o3052
12984G0785m293O4609L8045m3522r4363o0981k6843O5851K0791L4680J0093P0213
12972A45065P3589J602l759k9192p9800J7905j097K805l9724N2540n8777j09373
12960b8216q058J2561K5391Q4221O4677J47935m2274j39947m1529n2232M2588
12949F5117r8560J2389N6435j0961o874j413K3572J5433L9671j9906l6781l2280
$$ plain form
12937 5842 24460 55802 53935 73027 105548 161287 184169 226421 194999 128774 116512 126612
12925 126612 220257 245072 319366 467544 535893 644459 804923 817321 755814 586829 402003
12914 402003 343298 281110 270022 327446 382439 445877 455368 420719 494967 518024 548308 426585
12902 426585 282598 250736 190684 234439 301050 261203 402601 582756 606236 630090 615928
12891 615928 524596 439878 421891 353311 320662 366607 287374 259676 274662 284533 325760 381737
12879 381737 438136 481611 405082 300867 198919 142196 116985 168139 285983 367206 452814
12868 452814 465542 552998 597084 576532 437590 379848 420951 384993 340274 316931 247536
12857 247536 184847 132229 177774 209788 245273 311668 349766 345864 306097 278578 239436 185211
$$ packed form
12937E842J8618L1342j867J9092L2521N5739K2882M2252l1422o6225j2262J0100
12925A26612R3645K4815P4294J48178O8349J08566J60464J2398o1507j68985j84826
12914D02003n8705o2188j1088N7424N4993O3438R491l4649P4248K3057L0284j21723
12902D26585j43987l1862o0052M3755O6611l9847J41398J80155K3480K3854j4162
12891F15928r1332q4718j7987o8580l2649M5945p9233k7698J4986R871M1227N5977
12879C81737N6399M3475p6529j04215j01948n6723k5211N1154J17844Q1223Q5608
12868D52814J2728Q7456M4086k0552j38942n7742M1103l5958m4719k3343o9395
12857B47536o2689n2618M5545L2014L5485O6395L8098l902l9767k7519l9142n4225
$$ plain form
12845 185211 251388 331848 324334 260547 183577 151729 241035 409487 466061 408528 250974
12834 250974 183880 165638 158428 195462 79701 -4031 126536 165877 85911 56933 49948
12823 49948 22679 -45123 -76211 9898 -16825 -389 -45402 -73021 -75353 51521 207447
12812 207447 183547 123604 147979 160943 167824 168849 173697 207466 180762 244498 161729 71850
12800 71850 62772 43906 -11231 -25199 35740 120414 193355 137470 116633 161858 67887 -3882
12788 -3882 -94324 -84097 -105314 -96000 -128934 -67916 4316 12743 13350 -836 109837 117360 -6371
12775 -6371 -73566 -48443 -50522 -18098 50360 64338 55336 55638 36188 34039 43977 32414 79398
12762 79398 79267 106458 189796 209834 103728 14071 37374 -28530 2966 24884 5458 27148
$$ packed form
12845A85211O6177Q0460p514o3787p6970l1848Q9306J68452N6574n7533j57554
12834B50974o7094j8242p210L7034j15761q3732J30567L9341p9966k8978o985
12823D9948k7269o7802l1088Q6109k6723J6436m5013k7619k332J26874J55926
12812B07447k3900n9943K4375J2964O881J025M848L3769k6704O3736q2769q9879
12800G1850r078j8866n5137j3968O0939Q4674P2941n5885k0837M5225r3971p1769
12788c882r0442J0227k1217R314l2934O1018P2232Q427O07j4186J10673P523j23731
12775f371o7195K5123k079L2424O8458J3978r002L02j9450k149R938j1563M6984
12762G9398j31K7191Q3338K0038j06106q9657K3303o5904L1496K1918j9426K1690
$$ plain form
12750 27148 56822 94492 111983 165913 165928 129655 69944 93327 38672 15462 75116 53552
12738 53552 39631 36130 72871 65234 98808 60340 -70668 -18014 29182 -12485 -32002 -16732
12726 -16732 28557 51827 103732 53553 69393 77436 33687 13682 28443 78192 58095 35161
12714 35161 -1741 -54611 -59580 38491 32016 29535 -39156 -93335 -152924 -16943 45291 5413
12702 5413 26446 -15681 -13761 -18849 80402 96432 119190 123754 75810 45913 73083 76422 71268
12689 71268 65943 9688 -18512 -54 57971 37301 -6998 26622 14342 -81489 -86542 -84438
12677 -84438 -76234 -99970 -53819 -21218 -24702 -64965 -92954 -114858 -43590 58841 73686 -5602
12665 -5602 14378 65382 44735 -88382 -145993 -114673 -50949 10302 81315 73324 59849 -13327
$$ packed form
12750B7148K9674L7670J7491N3930J5l6273n9711K3383n4655k3210N9654k1564
12738E3552j3921l501L6741p637L3574l8468j31008N2654M7196m1667j9517J5270
12726a6732M5289K3270N1905n0179J5840Q043m3749k0005J4761M9749k0097k2934
12714C5161l6902n2870m969R8071o475k481o8691n4179n9589J35981O2234l9878
12702E413K1033m2127J920n088R9251J6030K2758M564m7944k9897K7170L339n154
12689G1268n325n6255k8200J8458N8025k0670m4299L3620j2280r5831n053K104
12677h4438Q204k3736M6151L2601l484m0263k7989k1904P1268J02431J4845p9288
12665e602J9980N1004k0647j33117n7611L1320O3724O1251P1013p991j3475p3176
$$ plain form
12653 -13327 -8198 -57212 -29288 73426 81440 56026 -2656 -6881 4626 44729 71328 65641
12641 65641 -8490 -58507 22003 81997 86823 91879 98384 49041 141611 179135 124533 82130
12629 82130 27108 31341 13438 3184 145898 151118 32305 27874 88045 52069 7950 45534
12617 45534 16198 -21473 -123779 -125997 -58712 -21697 -41968 -146130 -218762 -206132 -186159
12606 -186159 -132896 -150782 -77877 80678 148023 178095 184124 158524 101675 132976 109722
12595 109722 90490 49729 37629 28269 4226 57143 49801 91139 30458 2865 41640 58288
12583 58288 64319 41299 -74820 -126340 -117098 -62907 -40339 -4942 14386 51294 69720 49655
12571 49655 -8619 -90501 -121083 -40441 -17592 54179 99426 26317 -60750 -28503 -20594 -7144
$$ packed form
12653a3327N129m9014K7924J02714Q014k5414n8682m225J1507M0103K6599n687
12641F5641p4131n0017Q0510N9994M826N056O505m9343R2570L7524n4602m2403
12629H2130n5022M233j7903j0254J42714N220j18813m431O0171l5976m4119L7584
12617D5534k9336l7671j02306k218O7285L7015k0271j04162p2632J2630J9973
12606a86159N3263j7886P2905J58555O7345L0072O029k5600n6849L1301k3254
12595A09722j9232m0761j2100r360k4043N2917p342M1338o0681k7593L8775J6648
12583E8288O031k3020j16119n1520R242N4191K2568L5397J9328L6908J8426k0065
12571D9655n8274q1882l0582Q0642K2849P1771M5247p3109q7067L2247P909J3450
$$ plain form
12559 -7144 -68625 -68321 -29869 48449 13868 3108 17245 134126 155674 148345 74065 -44464
12547 -44464 -92644 -75879 -139995 -150629 -124913 -113564 -41853 -35591 -27145 9071 -63305 -83153
12535 -83153 -80997 7933 79454 55710 26380 27730 39683 29795 62731 111394 94794 99652
12523 99652 74340 50313 52949 23641 -25750 38703 36228 57476 61079 64826 72594 117277 141553
12510 141553 128446 120418 144560 89391 39474 -61202 -21568 14896 -37629 -143088 -99200
12499 -99200 26741 16331 10701 -9610 -91576 -12886 -30692 -134100 -218191 -214114 -123736 -100171
12487 -100171 -95195 -88133 -62286 -18910 17168 362 -117888 -94882 -24199 -62169 -26408 64976
12475 64976 51591 24209 -38194 -64355 1620 78225 87300 135858 146207 136481 164445 138684
$$ packed form
12559g144o1481L04L8452P8318l4581j0760J4137J16881K1548p329p4280j18529
12547d4464m8180J6765o4116j0634K5716J1349P1711O262Q446L6216p2376j9848
12535h3153K156Q8930P1521k3744k9330J350J1953r888L2936M8663j6600M858
12523I9652k5312k4027K636k9308m9391O4453k475K1248L603L747P768M4683K4276
12510A41553j3107q028K4142n5169m9917j00676L9634L6464n2525j05459M3888
12499i9200J25941j0410n630k0311q1966P8690j7806j03408q4091M077R0378K3565
12487a00171M976P062K5847M3376L6078j6806j18250K3006P0683l7970L5761R1384
12475F4976j3385k7382o2403k6161O5975P6605R075M8558J0349r726K7964k5761
$$ plain form
12463 138684 110481 18362 73877 188265 162585 36787 -28664 -76501 -170497 -196596 -189996
12452 -189996 -108232 -39901 52425 101054 66998 63688 12841 58203 130623 120975 90471 44517
12440 44517 -50743 -116995 -45013 55234 100625 35194 3469 -23184 -51272 -74707 -88742
12429 -88742 -3350 -3291 -46179 -48691 3461 9854 -4406 -645 14715 43348 -20625 9948 55884
12416 55884 14921 -33251 -67990 -51412 -62447 -70115 4214 179485 247608 72782 -39595
12405 -39595 13926 40515 91059 55151 -16082 -46336 40912 118016 145686 87391 98882 60085
12393 60085 33048 -50463 -27270 -118337 -137169 -91894 -73088 10094 136263 216602 198035
12382 198035 135642 145408 105897 5689 -33269 12119 404 15492 44862 -3565 51240
$$ packed form
12463A38684k8203r2119N5515J14388k5680j25798o5451m7837r3996k6099O600
12452a89996Q1764O8331R2326M8629l4056l310n0847M5362P2420r648l0504m5954
12440D4517r5260o6252P1982J00247M5391o5431l1725k6653k8088k3435j4035
12429h8742Q5392N9m2888k512N2152O393j4260L761J5360K8633o3973L0573M5936
12416E5884m0963m8172l4739J6578j1035p668P4329J75271O8123j74826j12377
12405c9595N3521K6589N0544l5908p1233l0254Q7248P7104K7670n8295J1491l8797
12393F0085k7037q3511K3193r1067j8832M5275J8806Q3182J26169Q0339j8567
12382A98035o2393R766l9511j00208l8958M5388j1715J5088K9370m8427N4805
$$ plain form
12371 51240 49192 -24942 -73170 -152355 -54975 -76204 -49623 -12684 -18357 72158 72513 99138
12359 99138 179054 148092 79718 65051 83919 137241 4681 -90234 -62185 -94713 -87932 -103569
12347 -103569 -120944 -63864 4755 31825 -35560 -132670 -186760 -156071 -128264 -51332 -110913
12336 -110913 -100705 -36385 -25085 -69927 -119321 -150680 -63217 -47069 -34051 -15804 41171
12325 41171 -22504 -48285 -812 -21416 -56555 -22113 -60417 -78999 -59185 -47530 -73854 -91937
12313 -91937 -72454 -130405 -88360 86128 135553 8863 -67162 -78352 -24118 12265 -14656
12302 -14656 22286 -31449 -61934 -15824 -260 37987 65394 17545 2889 -65880 -85274 -52446
12290 -52446 -82879 -51534 -78048 -93931 -115624 -54272 26351 15760 3563 -17593 -99681 -152535
$$ packed form
12371E1240k048p4134m8228p9185R7380k1229K6581L6939n673R0515L55K6625
12359I9138P9916l0962o8374j4667J8868N3322j32560r4915K8049l2528O781j5637
12347a03569j7375N7080O8619K7070o7385r7110n4090L0689K7807P6932n9581
12336a10913J0208O4320J1300m4842m9394l1359Q7463J6148J3018J8247N6975
12325D1171o3675k5781M7473k0604l5139L4442l8304j8582J9814J1655k6324j8083
12313i1937J9483n7951M2045J74488M9425j26690p6025j1190N4234L6383k6921
12302a4656L6942n3735l0485M6110J5564L8247K7407m7849j4656o8769j9394L2828
12290e2446l0433L1345k6514j5883k1693O1352Q0623j0591j2197k1156q2088n2854
$$ plain form
12278 -152535 -85913 -114564 -105565 51030 78178 43977 112284 56005 29857 47703 38948 8667
12266 8667 -60251 -65243 -28694 30956 47654 -53227 -39680 30986 -30888 -68765 -74158 -29590
12254 -29590 -123938 -163895 -182334 -172577 -154017 -99715 -63512 -120096 -194764 -197988 -85028 6659
12242 6659 64410 -46768 -128312 -55223 -164 35801 58811 19030 72637 122949 140285 81518
12230 81518 -45207 -37578 -41386 -100144 -85677 -58990 -83479 -6497 89682 -10878 -17017 86845
12218 86845 142991 92190 142770 19482 39547 39737 53108 84848 116103 124406 163878 90306
12206 90306 2912 -64934 -53362 -23061 71709 137646 156269 167723 159532 75191 58081 65407
12194 65407 65398 117747 154517 136442 169903 120263 60107 59607 5472 -100956 -177218 -133271 -77387
$$ packed form
12278a52535O6622k8651Q999J56595K7148l4201O8307n6279k6148J7846q755l0281
12266H667o8918m992L6549N9650J6698j00881J3547P0666o1874l7877n393M4568
12254b9590r4348l9957j8439R757J8560N4302L6203n6584p4668l224J12960R1687
12242F659N7751j11178q1544P3089N5059L5965K3010l9781N3607N0312J7336n8767
12230H1518j26725P629l808n8758J4467K6687k4489P6982R6179j00560o139J03862
12218H6845N6146n0801N0580j23288K0065J90J3371L1740L1255Q303L9472p3572
12206I0306q7394o7846J1572L0301R4770O5937J8623J1454q191q4341j7110P326
12194F5407rN2349L6770j8075L3461m9640o0156n00n4135j06428p6262M3947N5884
$$ plain form
12181 -77387 35982 60238 21020 -16544 -10956 2337 -46786 -33369 -32576 -106315 -50469 11183
12169 11183 -95748 -186298 -189114 -85748 -33076 -25536 83726 82103 80465 98580 113162 55307
12157 55307 50584 100376 134173 96918 2281 -14896 -353 4782 -12770 -1848 71088 22166
12145 22166 -18258 33833 38365 46197 -5377 -48924 -126477 -152812 -83192 -54197 274 18278
12133 18278 5382 34039 79157 80351 113351 67976 2966 -33898 -2085 12889 39167 32373
12121 32373 85274 57456 39935 95059 53013 48952 -31688 -16177 64885 181359 139359 60213
12109 60213 -20832 -92576 -109790 -55291 71589 99123 -26363 -38873 -63677 -44475 -46263
12098 -46263 -90250 12412 39678 -53720 -110860 -101123 -14402 -21332 47233 59141 16037 79542
$$ packed form
12181g7387J13369K4256l9218l7564N588J3293m9123J3417P93p3739N5846O1652
12169A1183j06931r0550k816J03366N2672P540J09262j623j638J8115J4582n7855
12157E5307m723M9792L3797l7255r4637j7177J4543N135j7552J0922P2936m8922
12145B2166m0424N2091M532P832n1574m3547p7553k6335O9620K8995N4471J8004
12133A8278j2896K8657M5118J194L3000m5375o5010l6864L1813J4974K6278o794
12121C2373N2901k7818j7521N5124m2046m061q0640J5511Q1062J16474m2000p9146
12109F0213q1045p1744j7214N4499J26880K7534j25486j2510k4804J9202j788
12098d6263m3987J02662K7266r3398n7140R737Q6721o930O8565J1908m3104O3505
$$ plain form
12086 79542 139017 195850 177725 74846 97255 91625 35453 -67020 -54860 -24410 -21451 -67482
12074 -67482 -95681 28568 47642 66013 93245 62227 73904 113738 88758 3789 -109973
12063 -109973 -68287 41669 40886 15919 72312 75266 62934 -32240 -77086 -125704 -131099 -21745
12051 -21745 -52466 -78226 -79681 8765 60451 -1215 -13550 -63919 -69435 -46514 -43306 -62785
12039 -62785 -52767 -58782 10329 99029 60728 44983 -4046 -55196 -68090 -69936 -124463 -107718
12027 -107718 -80443 -82541 -78406 -46947 -10515 12530 -28401 -40135 -65617 -83250 -75131 -33609
12015 -33609 16128 -38340 -56059 -109368 -129043 -68413 28164 43374 -8418 90234 131559 25676
12003 25676 16224 -12403 -6831 -116427 -162108 -80131 -15830 8568 -39555 -19345 -9571 -41867
$$ packed form
12086G9542N9475N6833j8125j02879K2409n630n6172j02473J2160L0450K959m6031
12074f7482k8199J24249J9074J8371K7232l1018J1677L9834k4980q4969j13762
12063a09973M1686J09956p83k4967N6393K954j2332r5174m4846m8618n395J09354
12051b1745l0721k5760j455Q8446N1686o1666j2335n0369n516K2921L208j9479
12039f2785J0018o015O9111Q8700l8301j5745m9029n1150j2894j846n4527J6745
12027a07718K7275k098M135L1459L6432K3045m0931j1734k5482j7633Q119M1522
12015c3609M9737n4468j7719n3309j9675O0630R6577J5210n1792R8652M1325j05883
12003B5676r452k8627N572j09596m5681Q1977O4301K4398m8123K0210R774l2296
$$ plain form
11991 -41867 -25536 -64413 -109007 -9394 101656 133997 95415 76476 137985 168765 53849
11980 53849 115159 165110 122293 33720 1884 29316 -92378 -52102 36205 101641 139519
11969 139519 157109 241798 179187 121224 81088 60361 96358 199813 227979 206277 222119
11958 222119 239470 207935 168029 61578 16659 -32057 -39771 -7532 -1167 -117285 -89936
11947 -89936 8263 37878 70259 115667 109978 110775 19808 -69461 14634 16947 -39969 -69747
11935 -69747 -90723 -109813 -30441 36188 91598 65807 -61330 39414 52094 -30877 -127378
11924 -127378 -105760 -25260 -89301 -176162 -225336 -146176 -105887 -34786 52731 -17126 -68783
11913 -68783 8455 42712 11602 -21523 -458 94827 93238 76976 40953 -13303 4761 -31140
$$ packed form
11991d1867J6331l8877m4594R9613J11050L2341l8582j8939O1509L0780j14916
11980E3849O1310M9951m2817q8573l1836K7432j21694M0276Q8307O5436L7878
11969A39519J7590Q4689o2611n7963m0136k0727L5997J03455K8166k1702J5842
11958B22119J7351l1535l9906j06451m4919m8716p714L2239O365j16118K7349
11947h9936R8199K9615L2381M5408n689P97r0967q9269Q4095K313n6916k9778
11935f9747k0976j9090P9372O6629N5410k5791j27137J00744J2680q2971r6501
11924a27378K1618Q0500o4041q6861m9174P9160M0289P1101Q7517o9857n1657
11913f8783P7238L4257l1110l3125K1065R5285j589j6262l6023n4256J8064l5901
$$ plain form
11901 -31140 -49608 87210 201485 161451 89532 -2643 -25965 -1089 48573 72634 95293
11890 95293 63755 74566 111073 129341 93453 57193 105380 144502 95154 32700 24842 65873
11878 65873 36032 25327 -19240 -46088 -75274 -66510 -56733 -62895 -109908 -88420 -116481 -154063
11866 -154063 -131285 -35418 82366 103118 57080 -37469 -51815 16838 53002 -50140 -112973
11855 -112973 -97031 13291 -15084 -67551 -106612 -132502 -173635 -146845 -97987 3555 75986
11844 75986 42322 43722 97001 -18409 -144650 -215695 -136130 -67636 -23883 17123 -32752
11833 -32752 -46497 -136560 -172994 -209052 -162039 -94323 -110724 -80891 -39791 -65910 -98634 -88818
11821 -88818 -43138 -76792 -152452 -176531 -51404 8111 47804 22457 -39092 -32542 -13622 17906
$$ packed form
11901c1140j8468J36818J14275m0034p1919r2175k3322K4876M9662K4061K2659
11890I5293l1538J0811L6507J8268l5888l6260M8187L9122m9348o2454p858M1031
11878F5873k9841j0705m4567k6848k9186Q764R777o162m7013K1488k8061l7582
11866a54063K2778R5867J17784K0752m6038r4549j4346O8653L6164j03142o2833
11855a12973J5942J10322k8375n2467l9061k5890m1133K6790M8858J01542P2431
11844G5986l3664J400N3279j15410j26241p1045P9565O8494M3753M1006m9875
11833c2752j3745r0063l6434l6058M7013O7716j6401K9833M1100k6119l2724R816
11821h8818M5680l3654p5660k4079J25127N9515L9693k5347o1549O550J8920L1528
$$ plain form
11809 17906 16818 -34819 32547 118282 130128 60753 -24384 -77963 -130185 -113231 -85984 -18607
11797 -18607 55867 79798 -9975 -106300 22884 112484 45629 -19354 6267 -39067 -136036
11786 -136036 -97047 -72160 -139246 -154382 -80888 -28108 4409 -1937 46991 148086 101295
11775 101295 -29510 -140517 -105788 -91608 -118621 -104426 -137002 -81717 -83766 -160304 -107504
11764 -107504 24978 48273 58218 28817 -45652 -54596 -80293 -43402 31214 -10123 -51309 -39321
11752 -39321 9544 47560 101274 22401 -7837 -30708 -24921 26891 31252 39876 14196 33221
11740 33221 -4998 -50593 -13852 -128923 -185662 -119578 -44271 -97265 -37355 -17290 -87106
11729 -87106 -74407 13388 77047 42016 9721 27896 -1365 -8098 -2000 -59338 -75255 -45444
$$ packed form
11809A7906j088n1637O7366Q5735J1846o9375q5137n3579n2222J6954K7247O7377
11797a8607P4474K3931q9773r6325J29184Q9600o6855o4983K5621m5334r6969
11786a36036L8989K4887o7086j5136P3494N2780L2517o346M8928J01095m6791
11775A01295j30805j11007L4729J4180k7013J4195l2576N5285k049p6538N2800
11764a07504J32482K3295R945k9401p4469q944k5697L6891P4616m1337m1186J1988
11752c9321M8865L8016N3714p8873l0238k2871N787N1812M361Q624k5680J9025
11740C3221l8219m5595L6741j15071n6739O6084P5307n2994N9910K0065o9816
11729h7106J2699Q7795O3659l5031l2295J8175k9261o733O098n7338j5917K9811
$$ plain form
11717 -45444 -46127 -63483 -1235 30697 21917 -21235 -63488 -52677 -100774 -37738 -28029 30784
11705 30784 108981 39096 -31487 -7163 -30141 -66383 -79501 -44778 75794 101148 116485
11694 116485 61707 89171 120461 137744 87606 -18237 -22774 30640 46356 18089 36421
11683 36421 -836 -14823 15354 -101589 -260241 -189069 -63941 -34456 -37877 -105922 -137151
11672 -137151 -79383 -113108 -89866 -39150 65207 130628 20096 46797 140206 101359 -18847
11661 -18847 -54908 -46665 -9206 62208 40764 -42169 -101966 -124588 -87184 -21480 -16903 65699
11649 65699 150045 150016 9424 -56523 2821 -23197 16324 -8638 2867 2381 21482 37513
11637 37513 35928 83369 -18476 -65548 54229 94587 42083 -35154 -14379 46046 36977 30562
$$ packed form
11717d5444o83j7356O2248L1932q780m3152m2253J0811m8097O3036R709N8813
11705C0784P8197o9885p0583K4324k2978l6242j3118L4723J20572K5354J5337
11694A16485n4778K7464L1290J7283n0138j05843m537N3414J5716k8267J8332
11683C6421l7257j3987L0177j16943j58652P1172J25128K9485l421o8045l1229
11672a37151N7768l3725K3242N0716J04357O5421j10532K6701R3409l8847j20206
11661a8847l6061Q243L7459P1414k1444q2933n9797k2622L7404O5704M577Q2602
11649F5699Q4346k9j40592o5947N9344k6018L9521k4962J1505m86J9101J6031
11637C7513j585M7441j01845m7072J19777M0358n2504p7237K0775O0425r069o415
$$ plain form
11625 30562 1859 -10587 3977 29592 -35446 -87229 -119856 -193842 -158766 -70839 -43262 -19588
11613 -19588 -30745 -25139 -98086 -84712 -48586 -86385 -48490 22762 74907 101432 147676 99419
11601 99419 62148 66358 4893 -16756 -25979 42973 102941 204123 187369 188833 134417 42804
11589 42804 26566 74867 47327 -4935 -82149 -153302 -138298 -118353 -57408 -21118 1632 -51123
11577 -51123 -86514 -38975 -86577 -198050 -119342 35825 -2728 -88336 -128850 -108783 -87174
11566 -87174 -63722 -108122 -74210 -74220 -89137 -33710 33828 31866 -121554 -114983 9809 33541
11554 33541 -22 -91964 -124509 -63212 -34637 -32245 -18321 6093 28330 5397 36924 57599
11542 57599 81251 30343 -23982 -63563 -36541 -48149 -81230 7166 -22776 -96043 -111682 -53570
$$ packed form
11625C0562k8703j2446J4564K5615o5038n1783l2627p3986L5076Q7927K7577K3674
11613a9588j1157N606p2947J3374L6126l7799L7895P1252N2145K6525M6244m8257
11601I9419l7271M210o1465k1649r223O8952N9968J01182j6754J464n4416r1613
11589D2804j6238M8301k7540n2262p7214p1153J5004J9945O0945L6290K2750n2755
11577e1123l5391M7539m7602j11473P8708J55167l8553q5608m0514K0067K1609
11566h7174K3452m4400L3912j0j4917N5427O7538j962j53420O571J24792K3732
11554C3541l3563r1942l2545O1297K8575K392J3924K4414K2237k2933L1527K0675
11542E7599K3652n0908n4325l9581K7022j1608l3081Q8396k9942p3267j5639N8112
$$ plain form
11530 -53570 19391 37498 -44039 -53867 16570 -6315 1752 1850 33724 -9788 -14949 -34943 -64518
11517 -64518 -163873 -182169 -116728 -81571 -137829 -133939 -146342 -121747 -112777 -126248 -84665 -54774
11505 -54774 5517 19680 -30007 31199 11234 -65674 -98297 -66862 -68381 -122030 -156104 -92263
11493 -92263 -101269 -97486 -84611 -115280 -176646 -59386 51509 71654 123556 28120 -78254
11482 -78254 -53914 -39877 14126 66724 96078 94588 126073 119178 134937 185793 181613 130475
11470 130475 140081 116071 127081 70247 -38881 -115993 -54689 52672 33475 88715 86587
11459 86587 88080 125318 67243 -17798 -52952 -82425 -24040 -12146 30816 46087 60239 103823
11447 103823 102370 8346 -39376 -39872 -57232 -14855 4973 27956 88026 108665 74480 12762
$$ packed form
11530e3570P2961J8107q1537r828P0437k2885Q067R8L1874m3512n161j9994k9575
11517f4518r9355j8296O5441L5157n6258L890j2403K4595Q970j3471M1583K9891
11505e4774O0291J4163m9687O1206j9965p6908l2623L1435j519n3649l4074O3841
11493i2263r006L783J2875l0669o1366J17260J10895K0145N1902r5436j06374
11482g8254K4340J4037N4003N2598K9354j490L1485o895J5759N0856m180n1138
11470A30475R606k4010J1010n6834j09128p7112O1304J07361j9197N5240k128
11459H6587J493L7238n8075q5041l5154k9473N8385J1894M2962J5271J4152M3584
11447A03823j453r4024m7722m96j7360M2377J9828K2983O0070K0639l4185o1718
$$ plain form
11435 12762 -80726 -58304 89428 158715 135087 50765 25665 38805 49975 24260 -9127
11424 -9127 -62378 -74428 -25141 -37810 -50547 -24116 -40116 57247 109543 46997 52074 40697
11412 40697 -49164 -58296 -37778 -43651 -138991 -182482 -169895 -91390 -45375 -22833 13213 -25546
11400 -25546 -47404 -28374 35336 19739 1340 -46041 -127766 -105212 -73473 -31206 35913 7433
11388 7433 64332 77888 42217 13588 -35553 -70294 -113568 -92271 -35465 88668 62213 7282
11376 7282 -23680 -19921 -6052 289 6201 -92411 -67843 -9392 90529 68742 -25430 -27734 -20396
11363 -20396 50273 71092 -10426 -34556 -44777 -52571 -99703 -98069 -32380 4282 -12743 -46359
11351 -46359 18874 43103 -31077 -48225 -1889 101057 -2356 -79340 -52130 -79679 -46892
$$ packed form
11435A2762r3488K2422J47732O9287k3628q4322k5100J3140J1170k5715l3387
11424i127n3251j2050M9287j2669j2737K6431j6000R7363N2296o2546N077j1377
11412D0697q9861r132K0518n873r5340m3491J2587P8505M6015K2542L6046l8759
11400b5546k1858J9030O3710j5597j8399m7381q1725K2554L1739M2267O7119k8480
11388G433N6899J3556l5671k8629m9141l4741m3274K1297N6806J24133k6455n4931
11376G282l0962L759J3869O341N912r8612K4568N8451R9921k1787r4172k304P338
11363b0396P0669K0819q1518k4130j0221p794m7132J634O5689L6662j7025l3616
11351d6359O5233K4229p4180j7148M6336J02946j03413p6984K7210k7549L2787
$$ plain form
11340 -46892 -116716 -20142 41097 -30909 -80900 -113812 -109417 -37888 23267 -47225 -46842 -79788
11328 -79788 32352 110025 198165 80191 20229 8516 8582 -10264 13830 19946 27168 51206
11316 51206 10409 -88147 -51377 3507 8740 -50577 -74465 -69491 -112818 -47253 32214 83183
11304 83183 6641 47431 86205 23827 34185 -30544 -8082 134185 94443 53945 41097
11293 41097 -11461 -9580 -64645 -40367 35169 17026 -25343 -95146 -112305 -124628 -88542 -19410
11281 -19410 4229 -16452 -68624 -45831 5134 -5576 12775 -44599 18604 79196 11133 -51546
11269 -51546 64634 128906 102527 108288 103123 79261 72760 95562 100677 111706 104319 66976
11257 66976 16975 13415 -451 12367 35027 15687 -84860 -43913 -5922 39920 49477 32927
$$ packed form
11340d6892o9824R6574O1239p2006m9991l2912M395P1529O1155p0492L83l2946
11328g9788J12140P7673Q8140j17974n9962j1713O6j8846K4094O116P222K4038
11316E1206m0797r8556L6770N4884N233n9317k3888M974m3327O5565P9467N0969
11304H3183p6542M0790L8774o2378J0358o4729K2462J42267l9742m0498j2848
11293D1097n2558J881n5065K4278P5536j8143m2369o9803j7159j2323L6086O9132
11281a9410K3639k0681n2172K2793N0965j0710J8351n7374O3203O0592o8063o2679
11269e1546J16180O4272k6379N761n165k3862o501K2802N115J1029p387l7343
11257F6976n0001l560j3866J2818K2660j9340j00547M0947L7991M5842R557j6550
$$ plain form
11245 32927 8998 32011 24958 -68364 29391 60360 86423 17503 -50743 -11556 7273 37192
11233 37192 10181 -32879 -27277 -105205 -124085 -110949 -54355 -8100 8698 42845 67541 39733
11221 39733 -12991 -49685 -107300 -146230 -217368 -225337 -149449 -91519 -560 40103 46678 25649
11209 25649 9705 32977 37439 -63572 19972 120212 133285 146803 76906 79646 73830 105049
11197 105049 73655 100554 103878 62602 29799 85108 30035 -24714 -46568 -56046 -79010 -51518
11185 -51518 -22622 52415 -8826 -39647 35351 30177 76917 102069 74824 72088 38571 26932
11173 26932 74940 112304 42045 -9083 -104426 -94122 -107171 -22536 -6067 -10041 -96518 -160944
11161 -160944 -149822 -66125 -27446 -22274 21927 51044 71629 67236 -8388 14353 59900 51746
$$ packed form
11245C2927k3929K3013p053r3322R7755L0969K6063o8920o8246L9187J8829K9919
11233C7192k7011m3060N602p7928j8880J3136N6594M6255J6798L4147K4696k7808
11221C9733n2724l6694n7615l8930p1138p969P5888N7930R0959M0663O575k1029
11209B5649j5944K3272M462j01011Q3544J00240J3073J3518o9897K740n816L1219
11197A05049l1394K6899L324m1276l2803N5309n5073n4749k1854r478k2964K7492
11185e1518K8896P5037o1241l0821P4998n174M6740K5152k7245k736l3517j1639
11173B6932M8008L7364p0259n1128r5343J0304j3049Q4635J6469l974q6477o4426
11161a60944J1122Q3697L8679N172M4201K9117K0585m393p5624K2741M5547q154
$$ plain form
11149 51746 -1890 -102263 -148477 -159320 -166516 -148362 -208674 -99972 -26434 -41019 -63159
11138 -63159 -13603 -102455 -67563 -50384 -3261 35830 4595 10186 55939 77649 80016 149500
11126 149500 225315 174091 116362 91400 60300 62272 47101 79050 1502 -89051 -23358 44558
11114 44558 14052 40322 38667 45383 121241 159039 100964 60912 67014 -7060 9335 53349
11102 53349 63618 3656 -44273 -61093 -70680 -93121 -113056 -87227 -83103 -17222 -18631 8577
11090 8577 31679 -81080 -164321 -117050 -8279 6551 47460 113520 75852 27636 63613
11079 63613 11149 10153 56098 72916 23160 -21231 -52918 -58581 -26285 23028 80080 21580
11067 21580 -26680 -18929 -30104 -84245 -142411 -92673 83338 175876 17028 -55632 -114012
$$ packed form
11149E1746n3636j00373m6214j0843p196J8154o0312J08702P3538j4585k2140
11138f3159M9556q8852L4892J7179M7123L9091l1235N591M5753K1710K367O9484
11126A49500P5815n1224n7729k4962l1100J972j5171L1949p7548r0553O5693O7916
11114D4558l0506K6270j655O716P5858L7798n8075m0052O102p4074J6395M4014
11102E3349J0269n9962m7929j6820r587k2441j9935K5829M124O5881j409K7208
11090H577K3102j12759q3241M7271J08771J4830M0909O6060l7668m8216L5977
11079F3613n2464r96M5945J6818m9756m4391l1687n663L2296M9313N7052n8500
11067B1580m8260P751j1175n4141n8166M9738J76011R2538j58848p2660n8380
$$ plain form
11056 -114012 -82870 -85983 -61128 -82685 -111193 -35565 -51139 -155130 -169737 -103837 -12974
11045 -12974 -40893 -99997 -49625 -54609 -20957 -13399 -46097 -99173 -141281 -80273 7203 65012
11033 65012 178720 197992 128787 71807 47348 38815 -87030 -38508 -39274 -56716 -25781 -44223
11021 -44223 -65426 -144806 -111372 -98749 -131139 -66824 -61988 -42543 -48074 -56149 -29110 20892
11009 20892 73335 66551 77022 -31743 -7246 18064 39028 26302 22486 91051 124740 55522
10997 55522 -63607 -71828 8347 -46241 -73560 -88635 -37601 12382 -2028 -101009 -142561 -118822
10985 -118822 -155407 -143932 -91213 27318 40119 36342 21727 77597 109165 45146 -42026
10974 -42026 20337 -22655 -20051 21692 28416 -18029 -86 24448 -16384 -48305 -53084 -60368
$$ packed form
11056a14012L1142l113K4855k1557k8508P5628j5574j03991j4607O5900R0863
11045a2974k7919n9104N0372m984L3652P558l2698n3076m2108O1008Q7476N7809
11033F5012J13708J9272o9205n6980k4459q533j25845M8522p66j7442L0935j8442
11021d4223k1203p9380L3434J2623l2390O4315M836J9445n531q075K7039N0002
11009B0892N2443o784J0471j08765K4497K5310K0964j2726l816O8565L3689o9218
10997E5522j19129q221Q0175n4588k7319j5075N1034M9983j4410r8981m1552K3739
10985a18822l6585J1475N2719J18531J2801l777j4615N5870L1568o4019q7172
10974d2026O2363m2992K604M1743O724m6445J7943K4534m0832l1921m779p284
$$ plain form
10962 -60368 -33068 -5524 -54667 -67436 38295 49327 -50878 -22814 -29827 7942 -55219
10951 -55219 -152444 -114907 -65080 -72871 -40831 7714 -8735 -54780 -143242 -131092 -143423 -126027
10939 -126027 -191377 -74380 -17925 -44496 23546 113361 39417 -23317 -131456 -94801 -58157
10928 -58157 -152018 -72026 -38085 -10780 -74113 -107351 -141532 -123456 -44747 -99708 -92657 -11377
10916 -11377 -120540 -155841 -20792 -24377 13518 115759 61773 -49575 -3748 106665 129847
10905 129847 -7842 -12228 -52157 -19798 44663 39378 -58209 -104143 -22124 42062 27240 -30903
10893 -30903 -87960 -83014 28697 46988 20108 49460 96326 58553 9346 48735 27526 21370
10881 21370 -6341 -87797 -40314 -52063 -48138 -7773 30816 76483 119945 37685 -70587 -62718
$$ packed form
10962f0368K7300K7544m9143j2769J05731J1032j00205K8064p013L7769o3161
10951e5219r7225L7537M9827p791L2040M8545j6449m6045q8462J2150j2331J7396
10939a26027o5350J16997N6455k6571O8042Q9815p3944o2734j08139L6655L6644
10928e8157r3861P9992L3941K7305o3333l3238l4181J8076P8709n4961P051Q1280
10916a1377j09163l5301J35049l585L7895J02241n3986j11348M5827J10413K3182
10905A29847j37689m386l9929L2359O4461n285r7587m5934Q2019O4186j4822n8143
10893c0903n7057M946J11711J8291k6880K9352M6866l7773m9207L9389k1209o156
10881B1370k7711q1456M7483j1749L925M0365L8589M5667M3462q2260j08272P869
$$ plain form
10869 -62718 -70888 45038 152561 89476 26985 -18958 10910 -44475 -80938 -133367 -76980
10858 -76980 -13615 88537 53318 -76464 -126880 -183312 -129656 -131284 -54512 34155 62303
10847 62303 120464 51761 14433 -12322 -50989 -6997 3625 48676 59590 26227 1480 94320
10835 94320 131177 45267 -49721 -146844 -111011 -58667 -91562 -143033 -116282 -115773 -160860 -226965
10823 -226965 -221201 -170672 -76465 3034 32568 20233 -2100 19082 31484 34933 17151 52578
10811 52578 57609 63662 123315 46042 -41926 -53201 -60955 -14013 -5968 -34838 22118 140026
10799 140026 125986 36419 -35826 -112831 -126057 -147926 -119199 -39877 -46393 -86588 -7375 74436
10787 74436 61317 55068 29652 45741 91403 58197 72064 54730 -3848 -17362 6915 34586
$$ packed form
10869f2718q170J15926J07523o3085o2491m5943K9868n5385l6463n2429N6387
10858g6980O3365J02152l5219j29782n0416n6432N3656j628P6772Q8667K8148
10847F2303N8161o8703l7328k6755l8667M3992J0622M5051J0914l3363k4747R2840
10835I4320L6857q5910r4988r7123L5833N2344l2895n1471K6751N09m5087o6105
10823b26965N764N0529R4207P9499K9534j2335k2333K1182J2402L449j7782L5427
10811E2578N031O053N9653p7273q7968j1275p754M6942Q045k8870N6956J17908
10799A40026j4040q9567p2245p7005j3226k1869K8727P9322o516m0195P9213Q1811
10787G4436j3119o249k5416J6089M5662l3206J3867j7334n8578j3514K4277K7671
$$ plain form
10775 34586 58651 35606 41481 40446 16599 30736 -4550 -34068 -15878 -70678 -57293 -21426
10763 -21426 39896 -5609 -34278 -101092 -109602 -36124 -40716 -107012 -171625 -80207 -43416 -81361
10751 -81361 -128258 -132978 -73731 -13884 77848 100222 46347 108211 43725 -822 -30598 -21123
10739 -21123 -59026 -187822 -124410 27477 52931 -29789 -24738 16721 25147 16411 39742 -21019
10727 -21019 3699 47572 14017 -49825 -80527 -117415 -57451 15264 66814 58734 109105 96873
10715 96873 51621 -10026 -73113 -107066 -53621 -44250 -56475 -29580 -21920 114 40455 42739
10703 42739 -36767 -4903 98718 92358 2954 14236 -29388 14164 29243 7121 31687 22081
10691 22081 14307 103615 99407 109136 40049 35261 72182 34686 12186 -4573 19893 92243
$$ packed form
10775C4586K4065k3045N875j035k3847J4137l5286k9518J8190n4800J3385L5867
10763b1426O1322m5505k8669o6814q510P3478m592o6296o4613R1418L6791l7945
10751h1361m6897m720N9247N9847R1732K2374n3875O1864o4486m4547k9776R475
10739b1123l7903j28796O3412J51887K5454q2720N051M1459Q426q736K3331o0761
10727b1019K4718M3873l3555o3842l0702l6888N9964P2715N1550q080N0371j2232
10715I6873m5252o1647o3087l3953N3445R371j2225K6895P660K2034M0341K284
10703D2739p9506L1864J03621o360q9404J1282m3624M3552J5079k2122K4566r606
10691B2081p774Q9308m208R729o9087m788L6921l7496k2500j6759K4466P2350
$$ plain form
10679 92243 5538 -104944 -137257 -85771 56689 101565 87467 85580 112100 74695 78320 35451
10667 35451 5887 -1244 -2770 -5756 -47603 -102360 -99906 -106056 -69392 -8105 20836 60812 60226
10654 60226 19666 80316 160686 186807 141554 83659 90748 162991 124702 56832 40969 49581
10642 49581 7730 30981 -6449 -66040 -63783 -80569 -53744 -44683 -45434 -137338 -176876 -137375
10630 -137375 -88561 -68355 -31214 9858 -54385 -30959 9742 50743 10157 -46790 -50668 -50952
10618 -50952 -41480 -13098 464 -53576 31400 75911 -20773 -62936 -47757 -56434 -142034 -62298
10606 -62298 -41569 598 107557 101580 101078 44468 -25908 -52038 -37088 -32131 36280 35971 -10812
10593 -10812 -47839 -49071 6267 46324 32602 41544 58946 34898 -52714 -45910 -61065 -120888
$$ packed form
10679I2243q6705j10482l2313N1486J42460M4876j4098j887K6520l7405L625m2869
10667C5451k9564p131j526k986m1847n4757K454o150L6664O1287K8941L9976n86
10654F0226m0560O0650Q0370K6121m5253n7895P089P2243l8289o7870j5863Q612
10642D9581m1851K3251l7430n9591K257j6786K6825R061p51r1904l9538L9501
10630a37375M8814K0206L7141M1072o4243K3426M0701M1001m0586n6947l878k84
10618e0952R472K8382J3562n4040Q4976M4511r6684m2163J5179q677q5600P9736
10606f2298K0729M2167J06959n977n02n6610p0376k6130J4950M957O8411l09m6783
10593a0812l7027j232N5338M0057j3722Q942J7402k4048q7612O804j5155n9823
$$ plain form
10581 -120888 -145601 -135285 -27483 123277 222400 99788 99984 97226 93505 29383 -17402 -36832
10569 -36832 10549 65383 135807 191895 174278 156675 119917 69847 20211 -71495 -60789 -5752
10557 -5752 59184 130738 127321 53195 -542 18087 55088 89261 55500 48525 153369 114718
10545 114718 98349 114469 112513 -4695 -5337 24257 -10223 -40073 52962 106293 16076 -16602
10533 -16602 9457 1901 -41214 -60519 -103789 -65414 -75203 -85469 -41284 -43687 -87978 14382
10521 14382 31021 57883 73210 -46732 -79320 -58031 -43597 -51512 -54385 -48542 29338 93330
10509 93330 68645 18238 55602 -24645 -138785 -189839 -37034 -6789 60478 27092 46788
10498 46788 147479 152106 33647 18551 101706 104830 47119 74940 69284 102167 145133 105668
$$ packed form
10581a20888k4713J0316J07802J50760R9123j22612J96k758l721o4122m6785j9430
10569c6832M7381N4834P0424N6088j7617j7603l6758n0070m9636r1706J0706N5037
10557e752O4936P1554l417p4126n3737J8629L7001L4173l3761o975J04844l8651
10545A14718j6369J6120j956j17208o42K9594l4480k9850R3035N3331r0217l2678
10533a6602K6059p556m3115j9305m3270L8375r789j0266M4185k403m4291J02360
10521A4382J6639K6862J5327j19942l2588K1289J4434p915k873N843P7880O3992
10509I3330k4685n0407L7364q0247j14140n1054J52805L0245O7267l3386J9696
10498D6788J00691M627j18459j5096Q3155L124n7711K7821n656L2883M2966l9465
$$ plain form
10486 105668 79438 23097 11530 -23499 42021 51884 60587 33870 50918 61737 36383 -66111
10474 -66111 -138913 -121970 -52189 -65860 -77330 -54970 -47201 -26710 2201 6418 26940 32615
10462 32615 89694 95460 86189 82193 11276 16517 62902 82395 65232 19769 7093 -75559
10450 -75559 -117595 -112607 -85848 -68050 -76331 -50897 -58117 -80144 -42820 -5570 131325 131304 66942
10437 66942 6191 26113 71965 64682 82506 49143 6030 853 -27232 8008 -23031 -77929
10425 -77929 -131969 -90856 -92308 -129284 -66075 59944 114725 68103 -35085 -104033 -137414
10414 -137414 13173 73397 49113 33350 -10564 -117452 -209924 -230565 -224081 -137352 -64086
10403 -64086 -25416 -78121 -102112 -121078 -165150 -103605 -99839 -92934 -61910 -120432 -102637 -49119
$$ packed form
10486A05668k6230n6341j1567l5029O5520R863Q703k6717J7048J0819k5354j02494
10474f6111p2802J6943O9781j3671j1470K2360P769K0491K8911M217K0522N675
10462C2615N7079N766r271l996p0917N241M6385J9493j7163m5463j2676q2652
10450g5559m2036M988K6759J7798q281K5434p220k2027L7324L7250J36895k1o4362
10437F6942o0751J9922M5852p283J7824l3363m3113n177k8085L5240l1039n4898
10425g7929n4040M1113j452l6976O3209J26019N4781m6622j03188o8948l3381
10414a37414J50587O0224k4284j5763m3914j06888r2472k0641O484Q6729P3266
10403f4086L8670n2705k3991j8966m4072O1545L766O905L1024n8522J7795N3518
$$ plain form
10391 -49119 -12771 -29727 -105719 -65543 -136229 -119709 -88698 -52838 -63214 -7549 49343 99273
10379 99273 78172 128456 61080 117883 167286 66240 -6832 -95116 -105090 -61608 -17980 -32332
10367 -32332 -66212 -95845 -57946 -59567 -15897 1826 -8715 -22287 -134697 -123017 -77447 -21610
10355 -21610 50136 100615 156801 129132 81821 74975 116104 51183 101421 39281 -9945 -55009
10343 -55009 -126074 -114831 13008 47595 25796 -75111 -123991 -102960 -51864 -38724 803
10332 803 37767 87091 80331 21997 61611 214991 247579 180837 21495 -90766 -77710 -34019
10320 -34019 -29182 -61471 -60193 -115490 -94948 40817 53406 30023 31105 -20254 -65040 -32412
10308 -32412 -8591 92112 60688 68391 -27753 -69896 19710 87482 91383 5645 -76294 -125365
$$ packed form
10391d9119L6348j6956p5992M0176p0686J6520L1011L5860j0376N5665N6892M9930
10379I9273k1101N0284o7376N6803M9403j01046p3072q8284r974M3482M3628j4352
10367c2332l3880k9633L7899j621M3670J7723j0541j3572j12410J1680M5570N5837
10355b1610P1746N0479N6186k7669m7311o846M1129o4921N0238o2140m9226m5064
10343e5009p1065J1243J27839L4587k1799j00907m8880K1031N1096J3140L9527
10332H03L6964M9324o760n8334L9614J53380L2588o6742j59342j12261J3056M3691
10320c4019M837l2289J278n5297K0542J35765J2589k3383J082n1359m4786L2628
10308c2412K3821J00703l1424P703r6144m2143Q9606O7772L901q5738q1939m9071
$$ plain form
10296 -125365 -67600 -77146 -30353 -66575 -79198 -60325 -160651 -163519 -170295 -87512 -96093 -22294
10284 -22294 46070 -43736 -46438 5554 15715 37965 105195 85343 -821 -25646 -1937 -23283
10272 -23283 -25931 -40821 -4803 -33064 -48476 -40488 -102559 -113977 -136569 -160580 -153482 -97665
10260 -97665 -121591 -179970 -136913 -57386 -40813 -46484 -83835 19652 85278 3929 6096 -37657
10248 -37657 -42389 -57985 -103696 -198128 -264718 -161194 -140284 -107286 -147787 -213474 -163080 -31831
10236 -31831 20259 -110120 -233179 -207698 -108233 -43884 -20881 3101 -50994 -80418 -22041
10225 -22041 54293 68061 36294 80277 59472 8815 -13946 9416 58635 25800 25450 29354
10213 29354 37810 777 -47131 -37234 36118 -20858 -24033 6529 -73020 -82112 -7895 -93843
$$ packed form
10296a25365N7765r546M6793l6222j2623J8873j00326k868o776Q2783q581P3799
10284b2294O8364q9806k702N1992J0161K2250O7230j9852q6164k4825K3709k1346
10272b3283k648j4890L6018k8261j5412P988o2071j1418k2592k4011P098N5817
10260i7665k3926n8379M3057P9527J6573n671l7351J03487O5626q1349K167m3753
10248c7657m732j5596m5711r4432o6590J03524K0910L2998m0501o5687N0394J31249
10236c1831N2090j30379j23059K5481R9465O4349K3003K3982n4095k9424N8377
10225b2041P6334J3768l1767M3983k0805n0657k2761K3362M9219l2835l50L904
10213B9354Q456l7033m7908R897P3352n6976l175L0562p9549r092P4217q5948
$$ plain form
10201 -93843 -79242 -6432 3878 -368 -58950 1834 18761 -15072 -24856 37942 11797 34346
10189 34346 38702 77397 103786 37182 -24496 -71469 -77064 27947 16497 92981 99816 97609
10177 97609 141415 91183 80569 1751 -22566 -47381 3263 25597 -49889 -87232 -159630 -160200
10165 -160200 -113407 -186526 -162101 -64648 38852 29756 8095 -12435 27754 130618 162007
10154 162007 116191 -21854 -97376 -119946 -157543 -82575 15861 23000 14776 72835 21634 48739
10142 48739 95197 107750 118370 143983 54948 -56323 12430 -23898 -36746 -72606 -147437
10131 -147437 -95838 -125580 -53066 -9133 108558 72964 -27531 -64685 -72662 -97956 -94453
10120 -94453 4954 -6149 43819 19705 -55633 -92646 -18876 27635 51369 40319 71940 32246
$$ packed form
10201i3843J4601P2810J0310m246n8582O0784J6927l3833r784O2798k6145K2549
10189C4346M356L8695K6389o6604o1678m6973n595J05011j1450P6484O835k207
10177I7609M3806n0232j0614p8818k4317k4815N0644K2334p5486l7343p2398n70
10165a60200M6793p3119K4425R7453J03500r096k1661k0530M0189J02864L1389
10154A62007m5816j38045p5522k2570l7597P4968R8436P139q224N8059n1201K7105
10142D8739M6458J2553J0620K5613q9035j11271O8753l6328j2848l5860p4831
10131a47437N1599k9742P2514M3933J17691l5594j00495l7154p977k5294L503
10120i4453R9407j1103M9968k4114p5338l7013P3770M6511K3734j1050L1621l9694
$$ plain form
10108 32246 21447 34938 38048 73790 46149 -12625 -34917 -16297 -60796 -71993 -39482 -37026
10096 -37026 2549 24513 992 28577 136755 95914 31497 -8235 -42440 -50803 -78834 -106707
10084 -106707 -64612 -53544 -140127 -65278 -40665 7512 60913 58035 7937 -93241 -80763
10073 -80763 -62076 -95327 -86910 -75025 -62489 -4599 55482 75597 62700 106238 224922 207500
10061 207500 80636 -25146 -90189 -63473 -36956 -19659 -12032 -26633 46358 159156 331391
10050 331391 535790 683204 558237 295539 140429 39642 80584 79412 120011 145991
10040 145991 58291 81357 105963 140930 221186 324065 293980 249997 259867 189348 219256
10029 219256 204386 115613 94031 100815 122856 156766 118754 -12982 -48253 23242 50256
$$ packed form
10108C2246j0799J3491L110L5742k7641n8774k2292J8620m4499j1197L2511K456
10096c7026L9575K1964k3521K7585J08178m0841o4417l9732l4205q363k8031k7873
10084a06707M2095J1068q6583P4849K4613M8177N3401k878n0098j01178J2478
10073h0763J8687l3251Q417J1885J2536N7890O0081K0115j2897M3538J18684j7422
10061B07500j26864j05782o5043K6716K6517J7297P627j4601P2991J12798J72235
10050C31391K04399J47414j24967k62698j55110j00787M0942j172M0599K5980
10040A45991q7700K3066K4606L4967Q0256J02879l0085m3983R870p0519K9908
10029B19256j4870q8773k1582O784K2041L3910l8012j31736l5271P1495K7014
$$ plain form
10018 50256 -50942 -48864 40739 78612 20267 81227 55920 -37122 -139525 -81327 -82935 -150166
10006 -150166 -104377 23174 16128 -32676 -43286 -51515 -11651 61289 86052 89713 142564 172733
9994 172733 38318 -40865 40810 40333 57950 69027 55844 14112 -47942 6800 80694 68553
9982 68553 40268 51317 -59576 -92252 -131109 -149729 2024 72704 100113 158912 123082
9971 123082 42803 -34247 -65922 -61013 -31698 -48785 -152631 -196175 -102135 -19999 10686 95912
9959 95912 48483 -43206 -70078 -7470 12268 61013 45315 -53748 19792 86491 72675 84620
9947 84620 90188 93773 93139 93444 -35744 -126647 -113166 -149077 -137169 -59664 -30304 -2939 22373
9934 22373 -102633 -114863 -137818 -141397 -157603 -152850 -161225 -154465 -142693 -127795 -168615 -100861
$$ packed form
10018E0256j01198K078Q9603L7873n8345O0960k5307r3042j02403N8198j608o7231
10006a50166M5789J27551p046m8804j0610q229L9864P2940K4763L661N2851L0169
9994A72733j34415p9183Q1675m77J7617J1077j3183m1732o2054N4742P3894j2141
9982F8553k8285J1049j10893l2676l8857j8620J51753P0680K7409N8799l5830
9971A23082q0279p7050l1675M909K9315j7087j03846m3544R4040Q2136L0685Q5226
9959I5912m7429r1689k6872O2608J9738M8745j5698r9063P3540O6699j3816J1945
9947H4620N568L585o34L05j29188r0903J3481l5911J1908P7505K9360K7365K5312
9934B2373j25006j2230k2955l579j6206M753q375O760J1772J4898m0820O7754
$$ plain form
9922 -100861 -10884 9593 54730 55740 50725 81216 73159 -2966 -11064 -56476 -52902 -52415 -25563
9909 -25563 26243 70950 46092 41073 59341 -6643 -14518 -38298 -40912 -23997 44203 36972 32128
9896 32128 79120 104441 96879 40525 -82553 -16003 108730 149122 108036 74155 131834 96580
9884 96580 23332 -47254 -44766 -31319 -34398 48146 50302 1556 -34658 -70890 -53816 -76856
9872 -76856 -48487 -56726 -33927 -25656 -76920 -146814 -213961 -158081 -158354 -77076 -33450 -11585 92667
9859 92667 193621 231518 97378 66467 54571 57659 59247 43431 10197 -35397 -84089 -80290
9847 -80290 -119189 -145639 -28295 50004 64371 60648 122762 116981 110721 27827 42755 67561
9835 67561 67532 71596 53319 55809 127728 167839 63532 53587 69590 84709 126080 138251 138398
$$ packed form
9922a00861Q9977K0477M5137J010n015L0491q057p6125q098m5412L574M87K6852
9909b5563N1806M4707k4858n019J8268o5984p875k3780k614J6915O8200p231m844
9896C2128M6992K5321p562n6354j23078O6550J24733M0392m1086l3881N7679l5254
9884I6580p3248p0586K488J3447l079Q2544K156m8746l6214l6232J7074k3040
9872g6856K8369q239K2799Q271n1264o9894o7147N5880k73Q1278M3626K1865J04252
9859I2667J00954L7897j34140l0911j1896L088J588j5816l3234m5594m8692L799
9847h0290l8899k6450J17344P8299J4367l723O2114n781o260q2894J4928K4806
9835F7561k9M064j8277K490P1919M0111j04307r945J6003J5119M1371J2171J47
$$ plain form
9822 138398 74142 -35152 -41627 34827 141752 85608 85961 127716 15677 -25882 -46917 -47312
9810 -47312 -41332 -27190 -39257 4912 112059 120707 75227 64498 -47305 -98114 -23912 64632
9798 64632 140359 68883 -18582 -81845 -115016 -131960 -73764 -108971 -111236 76198 105145 44773
9786 44773 -57875 -99827 -55856 31300 -22991 -90883 -54980 -41865 -25915 -21443 -68810 -69521
9774 -69521 -67551 6379 23312 3494 25172 84216 35209 -47357 -23065 28889 8123 46178
9762 46178 58145 25372 -27453 -19938 -15782 -1741 -226 -10941 3731 67167 132980 91708
9750 91708 -40039 -125862 -100954 -98480 -32397 -92679 -139046 -51857 1311 -34158 3403 -100775
9738 -100775 -111845 -3963 33451 59868 105514 44110 40885 75176 29963 -92765 -134563
$$ packed form
9822A38398o4256j09294o475P6454J06925n6144L53M1755j12039m1559k1035l95
9810d7312N980J4142j2067M4169J07147Q648m5480j0729j11803n0809P4202Q8544
9798F4632P5727p1476q7465o3263l3171j6944N8196l5207k265J87434K8947o0372
9786D4773j02648m1952M3971Q7156n4291o7892L5903J3115J5950M472m7367p11
9774f9521J970P3930J6933j9818K1678N9044m9007q2566K4292N1954k0766L8055
9762D6178J1967l2773n2825P515M156J4041J515j0715J4672O3436O5813m1272
9750I1708j31747q5823K4908K474O6083o0282m6367Q7189N3168l5469L7561j04178
9738a00775j1070J07882L7414K6417M5646o1404l225L4291m5213j22728m1798
$$ plain form
9727 -134563 -112478 -100427 -22333 9395 -32528 -35746 -37636 -42055 7810 155583 104784 5174
9715 5174 55110 74941 -5253 13125 57680 92443 187018 238317 126512 61941 94174 74350
9703 74350 82144 75846 -25401 -43866 -13341 9539 -56945 4468 97784 85630 69797 133385
9691 133385 69601 12776 -52718 -41782 66422 54820 -13106 -9241 43269 -22142 -56901 -77502
9679 -77502 -91816 -74577 -30355 -80423 -107860 -87634 -58865 69381 53372 19684 1741 -797
9667 -797 -29813 10887 106613 94599 18632 9081 -3721 18732 41433 55662 85119 80753 51058
9654 51058 28100 937 -77835 -116246 -139209 -91290 -43297 -67582 -33831 -45873 -53713 5294
9642 5294 6341 27080 -26195 -45615 -51652 -11228 -11830 -103865 -130229 -89303 -59280 56037 71058
$$ packed form
9727a34563K2085J2051P8094L1728m1923l218j890m419M9865J47773n0799r9610
9715E174M9936J9831q0194J8378M4555L4763R4575N1299j11805o4571L2233j9824
9703G4350P794o298j01247j8465L0525K2880o6484O1413R3316j2154j5833O3588
9691A33385o3784n6825o5494J0936J08204j1602o7926L865N2510o5411l4759k0601
9679g7502j4314J7239M4222n0068k7437K0226K8769J28246j6009l3688j7943k538
9667g97k9016M0700R5726j2014p5967r551j2802K2453K2701J4229K9457m366k9695
9654E1058k2958k7163p8772l8411k2963M7919M7993k4285L3751j2042p840N9007
9642E294J047K0739n3275j9420o037M0424o02r2035k6364M0926L0023J15317J5021
$$ plain form
9629 71058 -2979 -25563 -54969 -15460 3967 142 -102995 -89458 -29719 36871 28368 -21421
9617 -21421 -51407 5516 139028 136681 46947 -13262 -1422 -92335 -97019 -47945 -30437 -40282
9605 -40282 13312 96375 90995 59468 26825 97422 90005 34009 -6388 -5985 23836 -91477
9593 -91477 -132553 -132014 -150803 -153419 -132368 -27150 -2074 13000 80583 70927 139889 132852 54279
9580 54279 60071 120418 130562 117052 -1932 -106040 -149459 -127783 -104886 -72123 -11122 -14748
9568 -14748 7498 102950 68402 -11388 -55380 -145226 -100950 -67876 55785 85313 79875 63165
9556 63165 18778 46987 116999 88753 22587 -72126 -98653 -127372 -152946 -96891 -46539 -4705
9544 -4705 -7761 -36053 -94894 -100984 -55454 3624 3516 -5554 47781 130408 55879 -12970 -40276
$$ packed form
9629G1058p4037k2584k9406L9509J9427l825j03137J3537N9739O6590q503m9789
9617b1421k9986N6923J33512k347q9734o0209J1840r0913m684M9074J7508r845
9605d0282N3594Q3063n380l1527l2643P0597p417n5996m0397M03K9821j15313
9593i1477m1076N39j8789k616K1051J05218K5076J5074O7583r656O8962p037p8573
9580E4279N792O0347J0144j3510j18984j04108m3419K1676K2897L2763O1001l626
9568a4748K2246R5452l4548p9790m3992q9846M4276L3074J23661K9528n438j6710
9556F3165m4387K8209P0012k8246o6166r4713k6527k8719k5574N6055N0352M1834
9544d705l056k8292n8841o090M5530N9078j08r070N3335Q2627p4529o8849k7306
$$ plain form
9531 -40276 -92317 -37653 126663 221437 175640 145091 140851 76547 125667 79845 81751 116764
9519 116764 178209 238127 149034 62470 19588 -66891 -57886 -45352 34212 7689 -45065 -54850
9507 -54850 -100516 -136403 -97475 -54739 -109999 -58106 -65741 -16140 46514 80605 72233 20874
9495 20874 -36075 -45391 -18140 -480 -62806 -150048 -128077 -138278 -151662 -99091 -15332 4471
9483 4471 42237 -27933 -124710 -157053 -140921 -131187 -103497 -99218 -133412 -125686 -127164 -112972 -7545
9470 -7545 1847 42275 76029 136681 144189 169223 88124 -35851 -69355 -52262 -50505 -45989 -63366
9457 -63366 -39569 1500 4401 21285 -33802 -92955 -18027 -16354 6196 -80865 -125295 -153178
9445 -153178 -42054 29381 33749 8009 116221 146159 161762 103896 2026 -39468 30333
$$ packed form
9531d0276n2041N4664J64316R4774m5797l0549m240o4304M9120m5822J906L5013
9519A16764O1445N9918q9093q6564m2882q6479R005J2534P9564k6523n2754r785
9507e4850m5666l5887L8928M2736n5260N1893p635M9601O2654L4091q372n1359
9495B0874n6949r316K7251J7660o2326q7242K1971j0201j3384N2571Q3759J9803
9483D471L7766p0170r6777l2343J6132R734K7690M279l4194P726j478J4192J05427
9470g545R392M0428L3754O0652P508K5034q1099j23975l3504J7093J757M516j7377
9457f3366K3797M1069K901J6884n5087n9153P4928J673K2550q7061m4430k7883
9445a53178J11124P1435M368k5740J08212K9938J5603n7866j01870m1494O9801
$$ plain form
9434 30333 -3561 -44273 64804 -22335 -63099 -61102 -102096 -101079 -52226 -5969 27155 17571
9422 17571 -1266 -24284 -41654 -1337 6600 -77147 -19218 3823 -14798 -19765 -42448 -12421
9410 -12421 -55085 -17847 34832 37798 -17575 -120523 -158213 -118724 -21006 10671 6456 -20067
9398 -20067 72066 7683 -39683 -53145 -62271 -90373 -130638 -61357 27934 11141 22824 25474
9386 25474 -2727 -863 78331 96133 39824 8198 5563 -29697 -87107 -99621 -54584 2595
9374 2595 -30161 -35083 -47799 -1097 -33596 5229 92934 57422 1615 48240 8184 -29532
9362 -29532 64278 116096 129934 152881 183848 44454 -117186 -123109 -69950 -4006 -94545 -125962
9350 -125962 -75332 -61474 -63944 -182768 -257082 -87059 -38798 11599 56316 20437 -22754
$$ packed form
9434C0333l3894m0712J09077q7139m0764J997m0994J017M8853M6257L3124r584
9422A7571j8837k3018j7370M0317P937q3747N7929K3041j8621m967k2683L0027
9410a2421m2664L7238N2679K966n5373j02948l7690L9489R7718L1677m215k6523
9398b0067R2133o4383m7366j3462r126k8102m0265O9281Q9291j6793J1683K650
9386B5474k8201J864P9194J7802n6309l1626k635l5260n7410j2514M5037N7179
9374B595l2756m922j2716M6702l2499L8825Q7705l5512n5807M6625m0056l7716
9362b9532R3810N1818J3838K2947L0967j39394j61640n923N3159O5944r0539l1417
9350a25962N0630J3858k470j18824p4314J70023M8261N0397M4717l5879m3191
$$ plain form
9339 -22754 -92489 -115776 -55329 22484 58488 12872 48892 17385 145 -14249 -21840 4901
9327 4901 -7789 -74049 -164630 -97482 -6577 107402 136879 7400 -28741 25714 67397 125103
9315 125103 127258 105050 24973 34059 37985 49868 42420 55943 -17711 -40560 -19283 54207
9303 54207 81867 80307 87875 74762 74836 -22434 -16060 56666 71897 -15456 -98050 -124675 -149015
9290 -149015 -103866 -49180 887 26531 17437 -26020 67476 161970 171128 115283 108635 75040
9278 75040 35499 145361 166785 151655 87195 54478 -7 -34865 -105748 -63446 19366 59209
9266 59209 130765 201056 32511 -87994 -64714 -48922 23640 -44426 -54391 -68447 -25874 -11511
9254 -11511 -30074 -16126 -19558 -4423 -51801 -58484 -2297 25446 40663 -57481 -56943 -102791 -89081
$$ packed form
9339b2754o9735k3287O0447P7813L6004m5616L6020l1507j7240j4394p591K6741
9327D901j2690o6260r0581O7148R0905J13979K9477j29479l6141N4455M1683N7706
9315A25103K155k2208q0077R086L926J1883p448J3523p3654k2849K1277P3490
9303E4207K7660j560P568j3113P4r7270O374P2726J5231q7353q2594k6625k4340
9290a49015M5149N4686N0067K5644r094m3457R3496R4494R158n5845o648l3595
9278G5040l9541J09862K1424j5130o4460l2717n4485l4858p0883M2302Q2812L9843
9266E9209P1556P0291j68545j20505K3280J5792P2562o8066r965j4056M2573J4363
9254a1511j8563J3948l432J5135m7378o683N6187K7743J5217r8144N38m5848J3710
$$ plain form
9241 -89081 2874 50382 67560 72711 -17022 10592 16239 -14500 -69682 -115949 -137566 -103062
9229 -103062 -6213 15407 39597 92196 111602 124775 83129 -41918 1868 -49101 -94762
9218 -94762 -119279 -126863 -113150 -137187 -152271 -90723 -113407 -129289 -105332 -53432 -100685 -44179
9206 -44179 33071 46712 102573 193524 199488 78605 17009 24204 3885 24007 -106 42121
9194 42121 94140 104127 80564 93252 165347 74334 85783 104699 102464 49334 69630 53889
9182 53889 46643 -47276 -102746 -62678 2656 755 -82981 -76138 -53094 -1699 73856 -12442
9170 -12442 -103809 -71041 -113123 -71481 4440 -19995 -30334 -51757 22109 45215 4646 -32276
9158 -32276 -52868 -8709 -30085 -50376 -64827 -11555 12879 -15682 -20218 3006 -35748 16281
$$ packed form
9241h9081R1955M7508J7178N151q9733K7614N647l0739n5182m6267k1617L4504
9229a03062R6849K1620K4190N2599J9406J3173m1646j25047M3786n0969m5661
9218i4762k4517p584J3713k4037j5084O1548k2684j5882K3957N1900m7253N6506
9206d4179P7250J3641N5861R0951N964j20883o1596P195k0319K0122k4113M2227
9194D2121N2019R987k3563J2688P2095r1013J1449J8916k235n3130K0296j5741
9182E3889p246r3919n5470M0068O5334j901q3736O843K3044N1395P5555q6298
9170a2442r1367L2768m2082M1642P5921k4435j0339k1423P3866K3106m0569l6922
9158c2276k0592M4159k1376k0291j4451N3272K4434k8561m536K3224l8754N2029
$$ plain form
9146 16281 138348 213561 97364 -47325 -82257 25262 84213 98367 170524 181638 155396
9135 155396 127596 124767 121083 116603 95032 159103 233029 177301 116458 132245 111547 79161
9123 79161 152688 179904 103649 63047 101824 104041 117192 -10088 -77974 -63156 -40505 -9120
9111 -9120 84973 105849 127079 215369 224528 116421 20780 102162 149526 132814 105339 99387
9099 99387 58510 -34794 55460 77127 107868 64179 403 13551 58134 62214 76379 104749
9087 104749 32380 -5594 -23665 15542 -57552 -63485 -19354 3438 16196 37251 76679 249761
9075 249761 387014 346923 267560 290188 337253 384416 485143 508380 605098 616325 654233
9064 654233 777806 819749 985300 1200558 1445780 1873067 2339654 3070744 4328666 6714069
$$ packed form
9146A6281J22067P5213j16197j44689l4932J07519N8951J4154P2157J1114k6242
9135A55396k7800k829l684m480k1571O4071P3926n5728o0843J5787k0698l2386
9123G9161P3527K7216p6255m0602L8777K217J3151j27280o7886J4818K2651L1385
9111i120R4093K0876K1230Q8290R159j08107r5641Q1382M7364j6712k7475n952
9099I9387m0877r3304R0254K1667L0741m3689o3776J3148M4583M080J4165K8370
9087A04749p2369l7974j8071L9207p3094n933M4131K2792J2758K1055L9428J73082
9075B49761J37253m0091p9363K2628M7065M7163J00727K3237R6718J1227L7908
9064F54233J23573M1943J65551K15258K45222M27287M66587P31090J257922K385403
$$ plain form
9054 6714069 11416668 21104289 33903621 41156113 36313790 24234102 16193598 11659638
9046 11659638 8902702 7177462 6130419 5482813 4881831 4298236 3905261 3734387 3546507
9037 3546507 3357688 3266664 3066680 2864269 2703446 2585001 2515348 2421601 2258501 2247781
9027 2247781 2153987 2066748 2052214 1901017 1770499 1744288 1678065 1592813 1566837 1593584 1559668
9016 1559668 1555665 1568973 1538475 1441770 1344187 1352491 1317879 1283196 1232234 1184766 1210144 1182404
9004 1182404 1070452 1050808 1066044 1022682 1024440 1005396 948869 916207 999335 921642 841860
8993 841860 752013 757363 836885 847249 820119 751062 769817 705904 640281 707267 737224 696174
8981 696174 572196 547848 544614 518258 544722 592236 580828 676490 602480 499130 498453 517139
$$ packed form
9054F714069M702599R687621J2799332P252492m842323j2079688q040504m533960
9046A1659638k756936j725240j047043o47606o00982n83595l92975j70874j87880
9037C546507j88819r1024j99984k02411j60823j18445o9653r3747j63100j0720
9027B247781r3794q7239j4534j51197j30518k6211o6223q5252k5976K6747l3916
9016A559668m003J3308l0498r6705r7583Q304l4612l4683n0962m7468K5378k7740
9004A182404j11952j9644J5236m3362J758j9044n6527l2662Q3128p7693p9782
8993H41860q9847N350P9522J0364k7130o9057J8755o3913o5623O6986K9957m1050
8981F96174j23978k4348l234k6356K6464M7514j1408R5662p4010j03350o77J8686
$$ plain form
8969 517139 595469 604656 582055 630138 602074 484225 405794 354896 351604 300825 330018 365567
8957 365567 359602 374959 386821 523388 555719 451466 388208 333321 276491 257217 320428
8946 320428 303846 260721 320424 352201 316950 281730 272765 164124 78851 75621 182741 81621
8934 81621 49600 140928 140889 96232 119615 190176 238216 260465 203520 276397 306565 239774
8922 239774 245751 214195 217989 228569 136962 187427 330420 371710 433488 379378 258915 226323
8910 226323 245659 270763 260849 284223 288142 196288 86829 -30403 27760 225054 279612
8899 279612 251891 214448 200219 100778 83719 56927 -41956 -119842 -45577 27307 27893 60928
8887 60928 70695 70324 -18949 -34108 9665 9758 -10016 -26128 -34342 9712 2 8318 -34884 71084
$$ packed form
8969E17139P8330R187k2601M8083k8064j17849p8431n0898l292n0779K9193L5549
8957C65567n965J5357J1862J36567L2331j04253o3258n4887n6830j9274O3211
8946C20428j6582m3125N9703L1777l5251l5220q965j08641q5273l230J07120j01120
8934H1621l2021R1328l9m4657K3383P0561M8040K2249n6945P2877L0168o6791
8922B39774N977l1556L794J0580r1607N0465J42993M1290O1778n4110j20463l2592
8910B26323J9336K5104r914K3374L919r1854j09459j17232N8163J97294N4558
8899B79612k7721l7443j4229r9441j7059k6792r8883p7886P4265P2884N86L3035
8887F0928R767l71q9273j5159M3773R3j9774j6112q214M4054r710Q316m3202J05968
$$ plain form
8873 71084 135392 240967 152743 -15174 -115172 -21347 72745 75296 87067 151550 170206 161816
8861 161816 224364 179455 184022 128997 48904 39227 61848 54281 16372 63807 62659 79735
8849 79735 73596 57832 60379 121616 106211 75992 77864 14725 -80371 -88469 9770 48882 84229
8836 84229 74083 50347 85807 99768 127651 166037 193800 204568 195102 191612 189171 176456
8824 176456 194212 134228 113307 124768 120544 105239 79050 56304 16237 -38783 -87232 -88473
8812 -88473 -52066 6938 72068 74343 61370 31593 42068 1192 78715 121662 135518 150883
8800 150883 205850 179211 198560 221629 142504 90197 77309 110667 93596 121243 143272 95746
8788 95746 -24800 -62320 76135 140023 50774 -64293 -85829 -28327 -52636 -38144 -32840
$$ packed form
8873G1084O4308J05575q8224j67917r9998R3825R4092K551J1771O4483J8656q390
8861A61816O2548m4909M567n5025q0093r677K2621p567l7909M7435j148J7076
8849G9735o139j5764K547O1237j5405l0219J872o3139r5096q098R8239L9112L5347
8836H4229j0146k3736L5460J3961K7883L8386K7763J0768r466l490k441j2715
8824A76456J7756n9984k0921J1461m224j5305k6189k2746m0067n5020m8449j241
8812h8473L6407N9004O5130K275j2973k9777J0475m0876P7523M2947J3856J5365
8800A50883N4967k6639J9349K3069p9125n2307j2888L3358j7071K7647K2029m7526
8788I5746j20546l7520J38455O3888q9249j15067k1536N7502k4309J4492N304
$$ plain form
8777 -32840 -84515 -15309 -5134 -44080 -18569 69357 64964 72378 110094 74652 109584 157606
8765 157606 115212 56046 125901 179354 152295 74400 105848 66232 -41724 4056 -62946
8754 -62946 -97877 -134335 -91263 60080 89518 24058 56336 151323 213007 188470 164828 218018
8742 218018 142197 61772 69820 124406 180291 117581 80774 16991 -25139 -75086 98560 109787
8730 109787 101272 129630 157610 93047 -17430 -40127 27034 78946 63405 76931 138673 133399
8718 133399 87638 186421 307037 300640 243136 79862 58899 125245 167553 127058 107188
8707 107188 188240 182146 162717 96671 110020 158090 127487 93146 123221 175912 218932 172353
8695 172353 183931 308641 294731 326989 321053 186703 122687 164576 199001 173507 217975
$$ packed form
8777c2840n1675O9206J0175l8946K5511Q7926m393P414L7716l5442L4932M8022
8765A57606m2394n9166O9855N3453k7059p7895L1448l9616j07956M5780o7002
8754f2946l4931l6458M3072J51343K9438o5460L2278R4987O1684k4537k3642N3190
8742B18018p5821q0425Q048N4586N5885o2710l6807o3783m2130m9947J73646J1227
8730A09787q515K8358K7980o4563j10477k2697O7161N1912j5541J3526O1742n274
8718A33399m5761R8783J20616o397n7504j63274k0963O6346M2308m0495j9870
8707A07188Q1052o094j9429o6046J3349M8070l0603l4341L0075N2691M3020m6579
8695A72353J1578J24710j3910L2258n936j34350o4016M1889L4425k5494M4468
$$ plain form
8684 217975 301530 249847 151877 160875 297383 320447 257383 97556 83437 86200 101808 134516
8672 134516 70388 85218 115361 111086 140499 184712 200169 181405 189281 208142 154480 190708
8660 190708 242258 203647 138162 209385 388293 383998 356884 337197 318152 274736 139892
8649 139892 52157 97387 242386 343776 313423 355793 326623 187341 126462 170937 249478
8638 249478 206229 183136 250709 298756 290418 268790 242608 255357 271886 368477 372073 352705
8626 352705 442411 385435 314227 307206 355912 429898 460591 504077 457979 502662 544021 555004
8614 555004 596147 654171 536038 510421 501773 558268 566443 562161 575782 697378 736930 750179
8602 750179 803060 885444 994300 1009516 974108 964795 1066449 1154046 1125667 1085977 1140233
$$ packed form
8684B17975Q3555n1683r7970Q998J36508K3064o3064j59827j4119K763J5608L2708
8672A34516o4128J4830L0143m275K9413M4213J5457j8764P876J8861n3662L6228
8660A90708N1550l8611o5485P1223J78908m295k7114j9687j9045m3416j34844
8649A39892q7735M5230J44999J01390l0353M2370k9170j39282o0879M4475P8541
8638B49478m3249k3093O7573M8047q338k1628k6182J2749J6529R6591L596j9368
8626C52705Q9706n6976p1208p021M8706P3986L0693M3486m6098M4683M1359J0983
8614E55004M1143N8024j18133k5617q648N6495Q175m282J3621J21596L9552J3249
8602G50179N2881Q2384J08856J5216l5408r313J01654Q7597k8379l9690N4256
$$ plain form
8591 1140233 1201681 1137959 1087234 967600 876332 835269 838691 817996 707553 684953 672512
8580 672512 615292 473713 377361 385718 387704 384044 338569 380404 417886 410625 344834 245395
8568 245395 258520 296044 328997 346305 340600 391083 390473 400227 441975 381852 263286 222227
8556 222227 300394 315139 249005 254738 302251 215020 124003 213486 203158 183979 188274 221713
8544 221713 267571 259798 209607 203485 241725 266295 228254 242234 283717 292931 325536 301494
8532 301494 213623 258561 288626 227721 210377 258879 305853 413582 293965 196989 119353
8521 119353 76936 174226 152796 171728 192803 243193 241192 159113 110980 178737 221693 239068
8509 239068 211327 237172 238425 183647 166412 226023 313611 371275 358750 326227 229180 226871
$$ packed form
8591A140233O1448o3722n0725j19634r1268m1063L422k0695j10443k2600j2441
8580F72512n7220j41579r6352Q357J986l660m5475M1835L7482p261o5791r9439
8568B45395J3125L7524L2953J7308n705N0483o10R754M1748o0123j18566m1059
8556B22227P8167J4745o6134N733M7513q7231r1017Q9483j0328j9179M295L3439
8544B21713M5858p773n0191o122L8240K4570l8041J3980M1483R214L2605k4042
8532C01494q7871M4938L0065o0905j7344M8502M6974J07729j19617r6976p7636
8521A19353m2417R7290k1430J8932K1075N0390k001q2079m8133O7757M2956J7375
8509B39068k7741K5845J253n4778j7235N9611Q7588N7664j2525l2523r7047k309
$$ plain form
8497 226871 254274 268375 182056 83050 88575 87476 126159 80032 44389 27270 93840 189037
8485 189037 231064 207779 97673 129145 71856 114716 211971 163694 142536 136004 126040 171145
8473 171145 66026 -41644 -35758 3509 29975 38148 92523 174343 156719 96437 103792 56409
8461 56409 77513 155740 101706 107111 33992 3712 7659 46705 30351 -74586 -35860 74471
8449 74471 72645 62483 108884 177723 217441 190601 96575 83971 128353 155808 189164 86699
8437 86699 39313 78395 54611 29073 57612 48279 32906 41121 -18943 -19713 -7580 -16287 -38333
8424 -38333 22314 103870 86086 21501 -2835 4357 54936 140875 206779 280766 205286 98298
8412 98298 118985 102137 58672 7474 -57096 -14146 53020 8268 32476 109446 1969 -1221
$$ packed form
8497B26871K7403J4101q6319r9006N525j099L8683m6127l5643j7119O6570R5197
8485A89037M2027k3285j10106L1472n7289M2860R7255m8277k1158o532r964M5105
8473A71145j05119j07670N886L9267K6466Q173N4375Q1820j7624o0282P355m7383
8461E6409K1104P8227n4034N405p3119l0280L947L9046j6354j04937L8726J10331
8449G4471j826j0162M6401O8839L9718k6840r4026j2604M4382K7455L3356j02465
8437H6699m7386L9082k3784k5538K8539r333j5373Q215o0064p70J2133q707k2046
8424c8333O0647Q1556j7784o4585k4336P192N0579Q5939O5904P3987p5480j06988
8412I8298K0687j6848m3465n1198o4570M2950O7166m4752K4208P6970j07477l190
$$ plain form
8400 -1221 2908 -21468 20626 17094 2866 101534 183025 109505 114975 153207 178400 150332 37820
8387 37820 -14639 7644 57515 51207 68256 83855 98779 67553 36031 174484 246330 129988
8375 129988 17751 34034 -20205 13425 17011 59562 146890 98451 39189 75148 51595 50062
8363 50062 122358 150670 48502 -78910 7892 -21798 14124 88133 55660 -17726 -27347 28341
8351 28341 69061 15853 48935 94594 84161 123080 66331 51833 40557 -35243 -22311 20264
8339 20264 38490 88751 190769 198883 155383 95047 88300 170471 197661 173447 108463 117711
8327 117711 187815 265915 169889 105854 140649 44603 -43201 -13097 141724 246531 192112
8316 192112 48311 -93942 -67870 15309 87229 149399 138532 100520 47971 121634 136693
$$ packed form
8400a221M129k4376M2094l532j4228R8668Q1491p3520N470L8232K5193k8068j12512
8387C7820n2459K2283M9871o308J7049J5599J4924l1226l1522J38453P1846j16342
8375A29988j12237J6283n4239L3630L586M2551Q7328m8439n9262L5959k3553j533
8363E0062P2296K8312j02168j27412Q6802k9690L5922P4009l2473p3386r621N5688
8351B8341M0720n3208L3082M5659j0433L8919n6749j4498j1276p5800J2932M2575
8339B0264J8226N0261J02018Q114m3500o0336o747Q2171K7190k4214o4984R248
8327A17711P0104P8100r6026o4035L4795r6046q7804L0104J54821J04807n4419
8316A92112j43801j42253K6072Q3179P1920O2170j0867l8012n2549P3663J5059
$$ plain form
8305 136693 51952 -25563 -51452 19993 139329 141676 111767 61175 24614 -216 -70285 -13459
8293 -13459 89874 113491 71422 35164 22014 51737 155449 173183 80971 46176 14333
8282 14333 -23803 -84844 -58555 -22789 -4663 52332 141744 196508 208167 213329 114212 54179
8270 54179 21804 21451 -29924 23573 77352 19969 51833 142022 76244 89870 27246 -2225
8258 -2225 31066 35090 77002 105606 62035 80041 100944 72746 46110 84814 153957 197929
8246 197929 179319 181813 118759 62307 45553 35571 33857 16545 28169 124346 83180 66111
8234 66111 107934 147705 186954 257330 240646 237228 230466 282413 213815 163427 153691 131413
8222 131413 119042 100965 57137 34191 49023 160709 168052 99520 95672 216888 246957 225271
$$ packed form
8305A36693q4741p7515k5889P1445J19336K347k9909n0592l6561k4830p0069N6826
8293a3459J03333K3617m2069l6258j3150K9723J03712J7734r2212l4795l1843
8282A4333l8136o1041K6289L5766J8126N6995Q9412N4764J1659N162r9117o0033
8270E4179l2375l53n1375N3497N3779n7383L1864R0189o5778J3626o2624k9471
8258b225L3291M024M1912K8604m3571J8006K0903k8198k6636L8704O9143M3972
8246A97929j8610K494o3054n6452j6754r982j714j7312J1624R6177m1166j7069
8234F6111M1823L9771L9249P0376j6684l418o762N1947o8598n0388r736k2278
8222A31413j2371j8077m3828k2946J4832J11686P343o8532l848J21216L0069k1686
$$ plain form
8210 225271 259701 244519 257188 271555 147759 108145 99526 141229 163551 115339 36540 -46102
8198 -46102 21159 29401 25312 38297 29733 -25641 -31790 -25832 -58157 -27880 -8585 32739 -20130
8185 -20130 3573 90790 174235 173934 154458 95503 22335 10628 35942 86131 26905 32510
8173 32510 67334 18581 78890 41973 3735 -45357 -12507 3859 -4165 27803 82674 39338
8161 39338 -6118 43257 102776 -19593 -20193 85853 148157 64417 -29455 -101142 -119981 -121095
8149 -121095 -100616 -110943 -158641 -167659 -142266 -145713 -160555 -164812 9931 137385 117348 -6337
8137 -6337 -62837 3660 17261 24415 18606 -21440 -53573 -59171 -88685 -63935 -47647 -62413 -98846
8124 -98846 3610 53783 34907 -3770 -73934 -101963 -119046 -95041 -66888 14530 116128
$$ packed form
8210B25271L4430j5182J2669J4367j23796l9614q619M1703K2322m8212p8799q2642
8198d6102O7261Q242m089J2985q564n5374o149N958l2325L0277J9295M1324n2869
8185b0130K3703Q7217Q3445l01j9476n8955p3168j1707K5314N0189n9226N605
8173C2510L4824m8753O0309l6917l8238m9092L2850J6366q024L1968N4871m3336
8161C9338m5456M9375N9519j22369o00J06046O2304q3740r3872p1687j8839j114
8149a21095K0479j0327m7698r018K5393l447j4842m257J74743J27454k0037j23685
8137f337n6500O6497J3601P154n809m0046l2133n598k9514K4750J6288j4766l6433
8124i8846J02456N0173j8876l8677p0164k8029j7083K4005K8153Q1418J01598
$$ plain form
8113 116128 114559 100749 -13019 56274 98697 72245 -12338 71567 126022 70316 20511 -92783
8101 -92783 -105147 -113137 -76477 -70667 -90867 46458 83483 31630 7113 2383 -113881 -62584
8089 -62584 27492 88271 126675 49554 135218 182973 149903 87314 81234 101951 71244 114818
8077 114818 89842 107760 133339 87232 93729 43816 38586 79607 46668 -28226 -40528 -73140
8065 -73140 -53466 70566 110233 73434 63094 43638 -75445 -72394 -32007 29755 91788 137643
8053 137643 131128 120546 36861 111369 216447 290030 248100 256407 221563 135291 159183 201045
8041 201045 195945 175951 171638 192285 181357 133086 67313 26756 49084 -2769 68848 118195
8029 118195 121553 153338 197182 218478 234486 330199 354348 256478 289219 337964 393633 358820
$$ packed form
8113A16128j569j3810j13768O9293M2423k6452q4583Q3905N4455n5706m9805j13294
8101i2783j2364p990L6660N810k0200J37325L7025n1853k4517m730j16264N1297
8089f2584R0076O0779L8404p7121Q5664M7755l3070o2589o080K0717l0707M3574
8077A14818k4976J7918K5579m6107O497m9913n230M1021l2939p4894j2302l2612
8065g3140J9674J24032L9667l6799j0340j9456j19083L051M0387O1762O2033M5855
8053A37643o515j0582q3685P4508J05078P3583m1930Q307l4844q6272K3892M1862
8041B01045n100j9994m313K0647j0928m8271o5773m0557K2328n1853P1617M9347
8029A18195L358L1785M3844K1296J6008R5713K4149r7870L2741M8745N5669l4813
$$ plain form
8017 358820 257146 226766 255417 287176 330450 389354 340199 250183 257054 289500 349817 434797
8005 434797 583131 548639 413663 383037 419748 473841 483659 462543 370041 332745 280525
7994 280525 317271 355293 341064 363563 313777 341898 217643 169773 244800 266873 240296
7983 240296 215074 256755 285829 268017 234297 205497 150005 93262 162258 235042 308898 313183
7971 313183 230287 287858 310912 313098 351790 299493 317278 427391 523361 573173 569526 497339
7959 497339 447748 423602 410624 425940 418228 458106 441111 473138 450019 478028 461491 501915
7947 501915 540836 464974 421133 456256 422561 387884 398532 381120 388389 357114 268810 245609
7935 245609 231592 349968 380546 374331 278654 260085 274014 157846 151048 272196 292817
$$ packed form
8017C58820j01674l0380K8651L1759M3274N8904m9155r0016O871L2446O0317Q4980
8005D34797J48334l4492j34976l0626L6711N4093R818k1116r2502l7296n2220
7994B80525L6746L8022j4229K2499m9786K8121j24255m7870P5027K2073k6577
7983B40296k5222M1681K9074j7812l3720k8800n5492n6743O8996P2784P3856M285
7971C13183q2896N7571K3054K186L8692n2297J7785J10113R5970M9812l647p2187
7959D97339m9591k4146j2978J5316p712L9878j6995L2027k3119K8009j6537M0424
7947E01915L8921p5862m3841L5123l3695l4677J0648j7412P269l1275q8304k3201
7935B45609j4017J18376L0578o215r5677j8569J3929j16168o798J21148K0621
$$ plain form
7924 292817 324129 316541 275483 289082 331183 328093 356925 269472 231974 279011 318290 340391
7912 340391 340879 372594 347986 294084 342238 308567 182010 175133 166704 160942 193996 257987
7900 257987 291361 271032 235084 149603 44247 91177 175168 210270 235123 279852 335168
7889 335168 347786 382243 312463 294888 337076 254481 263553 306782 256354 198452 183451 159106
7877 159106 192640 226857 233335 96019 31992 111173 186521 132470 140388 189857 121534 70723
7865 70723 30167 -17988 14588 84738 47792 140064 223838 209736 162959 158936 248962 239041
7853 239041 247460 198798 84008 -4076 71 29301 119354 190155 22525 -78471 16152
7842 16152 33577 -18356 -672 42289 27539 42862 115291 135026 135370 140664 156026 98779
$$ packed form
7924B92817L1312p588m1058J3599M2101l090K8832q7453l7498M7037L9279K2101
7912C40391M88L1715k4608n3902M8154l3671j26557o877q429n762L3054O3991
7900B57987L3374k0329l5948q5481j05356M6930Q3991L5102K4853M4729N5316
7889C35168J2618L4457o9780j7575M2188q2595R072M3229n0428n7902j5001k4345
7877A59106L3534L4217O478j37316o4027P9181P5348n4051P918M9469o8323n0811
7865G0723m0556m8155L2576P0150l6946R2272Q3774j4102m6777m023R0026r921
7853B39041Q419m8662j14790q8084M147K9230R0053P0801j67630j00996R4623
7842A6152J7425n1933J7684M2961j4750J5323P2429J9735L44N294J5362n7247
$$ plain form
7830 98779 118771 141365 65739 19950 -992 11664 23379 29568 3104 -4065 -57233 -73620
7818 -73620 -123979 -32629 5568 12027 14635 41790 75836 161972 213394 171530 65559 132615
7806 132615 167254 114083 114893 159700 55855 -57891 -131864 -139606 -96731 -47344 -9584 59929
7794 59929 1224 8899 28905 23591 112604 122300 70753 57518 107321 108575 31468 25866 -23063
7781 -23063 -89291 -83422 -93176 -71883 -113213 -45990 70853 70215 32496 -15278 -43566 -10717
7769 -10717 -49165 -29531 8494 27437 85975 95256 134493 123019 72984 25650 109054 78456
7757 78456 -26551 -75436 -105486 -72261 -68195 -55387 -164701 -204648 -231467 -131738 -1501
7746 -1501 24148 -26284 -67786 -76422 -1359 50275 -23716 -89941 -73933 -20077 -103258 -127130
$$ packed form
7830I8779J9992K2594p5626m5789k0942J2656J1715O189k6464p169n3168j6387
7818g3620n0359R1350L8197O459K608K7155L4046Q6136N1422m1864j05971O7056
7806A32615L4639n3171Q10M4807j03845j13746p3973p742M2875M9387L7760O9513
7794E9929n8705P675K0006n314Q9013R696n1547j3235M9803J254p7107n602m8929
7781b3063o6228N869r754K1293m1330O7223J16843o38l7719m7774k8288L2849
7769a0717l8448J9634L8025J8943N8538R281L9237j1474n0035m7334Q3404l0598
7757G8456j05007m8885l0050L3225M066J2808j09314l9947k6819R9729J30237
7746a501K5649n0432m1502q636P5063N1634p3991o6225J6008N3856q3181k3872
$$ plain form
7734 -127130 -142330 -171761 -92290 -59950 -84051 -92481 -25051 -19801 22752 45148 -27922 -39959
7722 -39959 22893 80195 56453 54473 6920 97739 87434 47643 -24081 -25119 39493 34123
$$ packed form
7734a27130j5200k9431P9471L2340k4101q430O7430N250M2553K2396p3070j2037
7722c9959O2852N7302k3742j980m7553R0819j0305l9791p1724j038O4612n370
$$ [...]
##END NTUPLES=NMR SPECTRUM
##END=
