##TITLE=Analysis number 313012
Compound Code cc 09509
Project Code adrs
Chemist Name fudan
##JCAMPDX= 6.0         $$ Bruker NMR JCAMP-DX V2.0
##DATA TYPE= NMR SPECTRUM
##DATA CLASS= NTUPLES
##ORIGIN= Bruker BioSpin GmbH
##OWNER= NMR
$$ XWIN-NMR		Version 3.5
$$ Tue Aug 23 11:58:59 2005 GMT Daylight Time (UT+1h)  MAYBRIDGE\NMR@NMR_250MHZ
##.OBSERVE FREQUENCY= 250.131544655141
##.OBSERVE NUCLEUS= ^1H
##.ACQUISITION MODE= SIMULTANEOUS (DQD)
##.ACQUISITION SCHEME= undefined
##.AVERAGES= 16
##.DIGITISER RES= 18
##SPECTROMETER/DATA SYSTEM= dpx250
##.PULSE SEQUENCE= zg30
##.SOLVENT NAME= CDCl3
##.SHIFT REFERENCE= (INTERNAL, CDCl3, 0, 16.522)
##AUDIT TRAIL= $$ (NUMBER, WHEN, WHO, WHERE, WHAT)
$$ ##TITLE= Audit trail, XWIN-NMR		Version 3.5
$$ ##JCAMPDX= 5.01
$$ ##ORIGIN= Bruker BioSpin GmbH
$$ ##OWNER= NMR
$$ C:\u/data/dgb/nmr/ADRS/8370/pdata/1/auditp.txt
$$ ##AUDIT TRAIL=  $$ (NUMBER, WHEN, WHO, WHERE, WHAT)
(   1,<2005-08-23 11:58:39.49 +100>,<MAYBRIDGE\NMR>,<NMR_250MHZ>,
      <created by zg, POWCHK disabled, PULCHK disabled
       configuration hash MD5:
       62 19 C7 07 E1 42 D1 B7 37 6C 3D D0 77 39 F9 E6
       data hash MD5: 64K
       5A 36 2D DE CD 69 3C 12 32 BC C0 86 1A D1 BB 93>)
(   2,<2005-08-23 11:58:50.28 +100>,<MAYBRIDGE\NMR>,<NMR_250MHZ>,
      <Start of raw data processing
       ef LB = 0.3 FT_mod = 6 PKNL = 1 SI = 32K 
       data hash MD5: 32K
       0B FB 61 9C 7D 26 93 D4 1F BB 16 26 A9 0E E8 14>)
(   3,<2005-08-23 11:58:52.58 +100>,<MAYBRIDGE\NMR>,<NMR_250MHZ>,
      <apk 
       data hash MD5: 32K
       47 C0 42 A1 93 CA 76 93 48 6E 2A 54 0A A4 D1 17>)
(   4,<2005-08-23 11:58:53.35 +100>,<MAYBRIDGE\NMR>,<NMR_250MHZ>,
      <abs ABSG = 5 
       data hash MD5: 32K
       22 E4 70 51 F9 A2 FB EA 0E 00 56 7F A4 B2 D7 89>)
$$ ##END=
$$ 
$$ hash MD5
$$ A2 E1 E9 E5 A7 CB 4A C7 B2 8B 5C 1F F5 48 7E 86
##$RELAX= 
##$RELAX= 
##$RELAX= 
##$RELAX= 
##$RELAX= 
##$RELAX= 
##$RELAX= 
$$ Bruker specific parameters
$$ --------------------------
##$DU= <C:\u>
##$EXPNO= 8370
##$NAME= <ADRS>
##$PROCNO= 1
##$TYPE= <nmr>
##$USER= <dgb>
##$AMP= (0..31)
100 100 100 100 100 100 100 100 100 100 100 100 100 100 100 100 100 100 
100 100 100 100 100 100 100 100 100 100 100 100 100 100 
##$AQSEQ= 0
##$AQ_mod= 3
##$AUNM= <au_zg>
##$AUTOPOS= <15 >
##$BF1= 250.13
##$BF2= 250.13
##$BF3= 250.13
##$BF4= 250.13
##$BF5= 500.13
##$BF6= 500.13
##$BF7= 500.13
##$BF8= 500.13
##$BYTORDA= 1
##$CFDGTYP= 0
##$CFRGTYP= 5
##$CHEMSTR= <none>
##$CNST= (0..31)
1 1 145 1 1 1 1 1 1 1 1 1 1 1 1 1 1 1 1 1 1 1 1 1 1 1 1 1 1 1 1 1 
##$CPDPRG= <>
##$CPDPRG1= <>
##$CPDPRG2= <>
##$CPDPRG3= <>
##$CPDPRG4= <mlev>
##$CPDPRG5= <mlev>
##$CPDPRG6= <mlev>
##$CPDPRG7= <mlev>
##$CPDPRG8= <mlev>
##$CPDPRGB= <>
##$CPDPRGT= <>
##$D= (0..31)
0 1 0 0 0 0 0 0 0 0.06 0 0 0 0 0 0 0.0002 0 0 0 0 0 0 0 0 0 0 0 0 0 0 
0 
##$DATE= 1124794718
##$DBL= (0..7)
120 120 120 120 120 120 120 120 
##$DBP= (0..7)
150 150 150 150 150 150 150 150 
##$DBP07= 0
##$DBPNAM0= <>
##$DBPNAM1= <>
##$DBPNAM2= <>
$$ [...]
##$SUBNAM7= <"">
##$SUBNAM8= <"">
##$SUBNAM9= <"">
##$SW= 20.6930455092707
##$SWIBOX= (0..15)
0 0 3 0 0 0 0 0 0 0 0 0 0 0 0 0 
##$SW_h= 5175.983436853
##$TD= 65536
##$TD0= 1
##$TE= 295.16
##$TE2= 300
##$TE3= 300
##$TEG= 300
##$TL= (0..7)
0 120 120 120 120 120 120 120 
##$TP= (0..7)
150 150 150 150 150 150 150 150 
##$TP07= 0
##$TPNAME0= <>
##$TPNAME1= <>
##$TPNAME2= <>
##$TPNAME3= <>
##$TPNAME4= <>
##$TPNAME5= <>
##$TPNAME6= <>
##$TPNAME7= <>
##$TPOAL= (0..7)
0.5 0.5 0.5 0.5 0.5 0.5 0.5 0.5 
##$TPOFFS= (0..7)
0 0 0 0 0 0 0 0 
##$TUNHIN= 0
##$TUNHOUT= 0
##$TUNXOUT= 0
##$USERA1= <user>
##$USERA2= <user>
##$USERA3= <user>
##$USERA4= <user>
##$USERA5= <user>
##$V9= 5
##$VALIST= <valist>
##$VCLIST= <CCCCCCCCCCCCCCC>
##$VD= 0
##$VDLIST= <DDDDDDDDDDDDDDD>
##$VPLIST= <PPPPPPPPPPPPPPP>
##$VTLIST= <TTTTTTTTTTTTTTT>
##$WBST= 1024
##$WBSW= 4
##$XGAIN= (0..3)
0 0 0 0 
##$XL= 0
##$YL= 0
##$YMAX_a= 280109
##$YMIN_a= -387733
##$ZGOPTNS= <>
##$ZL1= 120
##$ZL2= 120
##$ZL3= 120
##$ZL4= 120
##$ABSF1= 16.522
##$ABSF2= -4.171173
##$ABSG= 5
##$ABSL= 3
##$ALPHA= 0
##$AQORDER= 0
##$ASSFAC= 0
##$ASSFACI= 0
##$ASSFACX= 0
##$ASSWID= 0
##$AUNMP= <proc_1d>
##$AZFE= 0.1
##$AZFW= 0.1
##$BCFW= 0
##$BC_mod= 0
##$BYTORDP= 0
##$COROFFS= 0
##$CY= 12.5
##$DATMOD= 1
##$DC= 0
##$DFILT= <>
##$DTYPP= 0
##$F1P= 14.0000005364418
##$F2P= -0.99999901652339
##$FCOR= 0.5
##$FTSIZE= 32768
##$FT_mod= 6
##$GAMMA= 0
##$GB= 0
##$INTBC= 1
##$INTSCL= 1
##$ISEN= 128
##$LB= 0.3
##$LEV0= 0
##$LPBIN= 0
##$MAXI= 10000
##$MC2= 0
##$MEAN= 0
##$ME_mod= 0
##$MI= 0
##$NCOEF= 0
##$NC_proc= -3
##$NLEV= 6
##$NOISF1= 0
##$NOISF2= 0
##$NSP= 0
##$NTH_PI= 0
##$NZP= 0
##$OFFSET= 16.522
##$PC= 1
##$PHC0= -85.32253
##$PHC1= 21.76692
##$PH_mod= 1
##$PKNL= yes
##$PPARMOD= 0
##$PSCAL= 4
##$PSIGN= 0
##$REVERSE= no
##$SF= 250.13
##$SI= 32768
##$SIGF1= 0
##$SIGF2= 0
##$SINO= 400
##$SIOLD= 32768
##$SREGLST= <1H.CDCl3>
##$SSB= 0
##$STSI= 32768
##$STSR= 0
##$SW_p= 5175.98343685301
##$SYMM= 0
##$S_DEV= 0
##$TDeff= 65536
##$TDoff= 0
##$TI= <Analysis number 999999
Compound Code 99
Book Reference 9
Project Code 9>
##$TILT= no
##$TM1= 0
##$TM2= 0
##$TOPLEV= 0
##$USERP1= <user>
##$USERP2= <user>
##$USERP3= <user>
##$USERP4= <user>
##$USERP5= <user>
##$WDW= 1
##$XDIM= 32768
##$YMAX_p= 294572651
##$YMIN_p= -57638
$$ End of Bruker specific parameters
$$ ---------------------------------
##NTUPLES= NMR SPECTRUM
##VAR_NAME=  FREQUENCY,     SPECTRUM/REAL,   SPECTRUM/IMAG
##SYMBOL=    X,             R,               I
##VAR_TYPE=  INDEPENDENT,   DEPENDENT,       DEPENDENT
##VAR_FORM=  AFFN,          ASDF,            ASDF
##VAR_DIM=   32768,         32768,           32768
##UNITS=     HZ,            ARBITRARY UNITS, ARBITRARY UNITS
##FACTOR=    0.157963299565203, 1,           1
##FIRST=     4132.6476996994, 0,             0
##LAST=      -1043.33573715361, 0,           0
##MIN=       -1043.33573715361, -57638,      0
##MAX=       4132.6476996994, 294572651,     0
$$ Real data points
##PAGE= N=1
##DATA TABLE= (X++(R..R)), XYDATA
$$ [...]
20316C372l942q538j0867q084K245J3305m552p274Q355q785j1152P120L440P441
$$ 3372 -570 -9108 -19975 -28059 -25814 -12509 -17061 -24335 -15980 -24765 -35917 -28797 -25357 -17916
20302a7916P394L971q882o264K999L226L987J937p89n389O076O887O431O561L287
$$ -17916 -10522 -6551 -15433 -21697 -18698 -15472 -11485 -9548 -10337 -15726 -9650 -2763 3668 10229 13516
20287A3516j1539j0250l997k12Q880N184m057L728J150J097r599n799J4570N524
$$ 13516 1977 -8273 -12270 -12482 -3602 1582 -2475 1253 2403 3500 -6099 -11898 2672 8196
20273H196j308K854p668j1932k079n450n405N232m072R277m942M284p233L465
$$ 8196 6888 9742 2074 -9858 -11937 -17387 -22792 -17560 -21632 -12355 -17297 -13013 -20246 -16781
20259a6781N294j0130l230J3410J2556M808R610j808j9828L385N752j7670j0014
$$ -16781 -11487 -21617 -24847 -11437 1119 5927 15537 13729 -6099 -2714 3038 -14632 -24646
20246b4646M538N617N92L669K354N942p006q922N628n194k179Q62J0968j270j1310
$$ -24646 -20108 -14491 -13899 -10230 -7876 -1934 -8940 -17862 -12234 -17428 -19607 -18745 -7777 -9047 -20357
20231b0357N3J0764J3594l783n90l342j494N952p344k128J608J5447N414n644
$$ -20357 -20304 -9540 4054 271 -319 -3661 -5155 797 -6547 -8675 -7067 8380 13794 8150
20217H150j1041p17j1660r994K4333J7026j0164k2006j1912J316J797O514J268
$$ 8150 -2891 -3608 -15268 -25262 -929 16097 5933 -16073 -27985 -26669 -24872 -18358 -17090
20204a7090j1625N244O293j9713k505J1657J2665J7995l96k242j0836j9657o422
$$ -17090 -28715 -23471 -17178 -36891 -39396 -27739 -15074 2921 2525 283 -10553 -30210 -36632
20191c6632J0407O434j2424j352J0113m452L464r535O46R900P517M86j2088P81
$$ -36632 -26225 -19791 -32215 -33567 -23454 -27906 -24442 -33977 -33331 -23431 -15914 -15428 -27516 -26735
20177b6735O713j961q264P658J3275J753k556r668j5234K68J2984J3445J847o957
$$ -26735 -20022 -21983 -30247 -22589 -9314 -7561 -10117 -19785 -35019 -34751 -21767 -8322 -6475 -13432
20163a3432QQ04k33q05n473r934M844q90N243n037l68J378l330J2614K2700j1082
$$ -13432 -13424 -12620 -12853 -13658 -19131 -29065 -24221 -25111 -19868 -24905 -25273 -23895 -27225 -14611 8089 -2993
20147b993q801M996N703m695j213j889j2554j826J479o922j1125J5033K53k429
$$ -2993 -11794 -6798 -1095 -5790 -7003 -8892 -21446 -23272 -21793 -28715 -39840 -24807 -24554 -26983
20133b6983L527J1912R893J1512r157o536n445j4499l38J2176P459O114K482q181
$$ -26983 -23456 -11544 -1651 9861 704 -5832 -11277 -25776 -26114 -13938 -6479 -365 2117 -6064
20119f064M480L825l532j0942O078L628l00j468l168l527j4485p157J1425M948
$$ -6064 -1584 2241 -1291 -12233 -6155 -2527 -2827 -4295 -7463 -10990 -25475 -32632 -21207 -16259
20105a6259q776j1612K0201J2156o73N57q528p406L246J6782R982Q894J955j8413
$$ -16259 -25035 -36647 -16446 -4290 -4963 -4406 -12934 -20340 -17094 -312 9670 18564 20519 2106
20091B106L898J5815k390r449j2765m675R926L344j4800R205J813l488K017J26
$$ 2106 6004 21819 19429 9980 -2785 -7460 2466 5810 -8990 215 2028 -1460 557 683
20077F83j4406l861J2638L755r573N387L277n198R153j4465j0436K303j4905k184
$$ 683 -13723 -17584 -4946 -1191 -10764 -5377 -2100 -7298 1855 -12610 -23046 -20743 -35648 -37832
20063c7832R832L007L104K085J829K511J075j768L567n3l705q209P519Q500l454
$$ -37832 -28000 -24993 -21889 -19804 -17975 -15464 -14389 -16157 -12590 -12643 -16348 -24557 -17038 -8538 -11992
20048a1992o350J720m294O708J1825k4656j050R062j0336K765J5140K813K638
$$ -11992 -18342 -16622 -20916 -14208 -2383 -27039 -28089 -19027 -29363 -26598 -11458 -8645 -6007
20035f007K379j2128l409L904l193l205P385q66J5159K190Q707J958j0541Q27
$$ -6007 -3628 -15756 -19165 -15261 -18454 -21659 -14274 -15140 19 2209 10916 12874 2333 3160
20021C160J616J492p770k978j079l598R980l325j1171n450J3022M555j2055K726
$$ 3160 4776 6268 -1502 -4480 -5559 -9157 823 -2502 -13673 -19123 -6101 -1546 -13601 -10875
20007a0875P749r773L380o8l552L345J2235j1127q623q456m531J4180J2666R502
$$ -10875 -3126 -12899 -9519 -9587 -13139 -9794 2441 -8686 -17309 -25765 -30296 -16116 -3450 6052
19993F052J1092N153N184j0352r581J787J3542J058n458l892o788K110K191n10
$$ 6052 17144 22297 27481 17129 7548 9335 22877 23935 18477 14585 7797 9907 12098 11588
19979A1588R667n466M284R864j3069q825M670J744l300n520p24J0189j402q030
$$ 11588 21255 15789 20073 29937 16868 8043 12713 14457 11157 5637 4913 15102 13700 5670
19965E670L799m080m457m85N727j769j905Q008j4656j0825J162j1280R486J0462
$$ 5670 9469 5389 932 447 6174 4405 2500 10508 -4148 -14973 -13811 -25091 -15605 -5143
19951e143l663o46P258q66Q62r56J863m029M283P909K60m577o832p674j7P084
$$ -5143 -8806 -9452 -2194 -3060 -2198 -3154 -1291 -5320 -1037 6872 7132 2555 -4277 -11951 -11968 -4884
19935d884J3804p53j2135j272r21L316l851r224J0710r231r41M22k439K878J070
$$ -4884 8920 8167 -3968 -5240 -6161 -2845 -6696 -15920 -5210 -14441 -15382 -14960 -17399 -14521 -13451
19920a3451J0590j829K412L760O480M1l304p137l040J1981j4219J162N091R712
$$ -13451 -2861 -4690 -2278 1482 7962 8003 4699 -2438 -5478 6503 -7716 -6554 -1463 8249
19906H249j1338l065Q042K509q603j1655q361r71J0279Q31j183q407j916l581
$$ 8249 -3089 -6154 1888 4397 -4206 -15861 -24222 -25193 -14914 -14083 -15266 -23673 -25589 -29170
19892b9170K955P845N649Q201J262N416J3647O86n673q610K222j3593k1403o182
$$ -29170 -26215 -18370 -12721 -4520 -3258 2158 15805 16491 10818 2208 4430 -9163 -30566 -36748
19878c6748J3349Q010l66o03k697j615J028J2682J2253r58p23p24k174l054J5387
$$ -36748 -23399 -15389 -15755 -16358 -19055 -20670 -19642 -6960 5293 4335 3612 2888 714 -2340 13047
19863A3047j925q946R00O317q63l139n114R61l764j6933l740P213J4928P659l06
$$ 13047 11122 2176 3076 9393 8530 5391 277 1238 -2526 -19459 -23199 -15986 -1058 6601 6295
19848F295j4452l779J3011r713j8155J785K0140J3924j8316m168P01n00N158O687
$$ 6295 -8157 -11936 1075 -8638 -26793 -25008 -4868 9056 -9260 -13428 -12727 -13227 -8069 -1382
19834a382L122j0768k207L554L201J171P482o633p64n400o056K2856M319j3936
$$ -1382 1740 -9028 -11235 -7681 -4480 -3309 4173 -2460 -3224 -8624 -14680 8176 12495 -1441
19820a441n804k405P272O37k903L22l83m330j1064l969k907J719M672j0311L490
$$ -1441 -7245 -9650 -2378 -1741 -4644 -4322 -4705 -9035 -20099 -24068 -26975 -25256 -20584 -30895 -27405
19805b7405J1658o72n964J3233L598j2151k261K755O361q847O297N896n271p704
$$ -27405 -15747 -16419 -22383 -9150 -5552 -17703 -19964 -17209 -10848 -19695 -13398 -7502 -12773 -20477
19791b0477l393O790m537r815K841J3742K266o199j0959J0558j72m357k265k050
$$ -20477 -23870 -17080 -21617 -31432 -28591 -14849 -12583 -18782 -29741 -19183 -19355 -23712 -25977 -28027
19777b8027j22M08L541M217M406n089n02n42J089l113J2095R414K523p766k346
$$ -28027 -28149 -27741 -24200 -19983 -15577 -20666 -21168 -21710 -20621 -23734 -11639 -2225 298 -7468 -9814
19762i814K665r550o528O697J3199M377q12Q95o942j5729L284Q667Q994O26o097
$$ -9814 -7149 -16699 -23227 -16530 -3331 1046 234 1129 -5813 -21542 -18258 -9591 -597 29 -6068
19747f068l228r41n099j4741m018K1291J2783J0601K22n082Q293l98R790J80n540
$$ -6068 -9296 -10237 -15336 -30077 -34095 -12804 -21 10580 10802 5720 14013 13615 23405 23585 18045
19732A8045j1854j4039o925M527J0503o863j4713m08K256O177J6668p27J2441
$$ 18045 6191 -7848 -14773 -10246 257 -6606 -21319 -21727 -19471 -13294 3374 2647 15088
19719A5088j3003M252n300L670p409r286M755J3228j90n981r036R997M480k66
$$ 15088 2085 6337 1037 4707 -2702 -11988 -7233 5995 5805 -176 -9212 785 5265 4999
19705D999j4385l67N377j853j0070j0856J7782L235q140n563j4123j0035J6686
$$ 4999 -9386 -9753 -4376 -6229 -16299 -27155 -9373 -6138 -14278 -19841 -33964 -43999 -27313
19692b7313J2751l909Q800M630p365O766k890J0618j139J543o050p413m010k093
$$ -27313 -14562 -18471 -9671 -5041 -12406 -5640 -8530 2088 949 2492 -3558 -10971 -14981 -17074
19678a7074L679m578r487N672K189j547Q443K721j954N676j2285j3831r31N932
$$ -17074 -13395 -17973 -27460 -21788 -19599 -21146 -12703 -9982 -11936 -6260 -18545 -32376 -33307 -27375
19664b7375Q089P28j8854p113N860M502J0536K4318P929r696M57p887o162Q359
$$ -27375 -19286 -18558 -37412 -44525 -38665 -34163 -23627 691 8620 -1076 -619 -8506 -14668 -6309
19650f309o587j8762p697M02Q165P871R104J1643k586k91k451j7206j499J2134
$$ -6309 -12896 -31658 -39355 -38953 -30788 -22917 -13813 -2170 -4756 -5047 -7498 -24704 -26203 -14069
19636a4069N618K441Q382J035o37m200q828K723L763j3333j024J9235J2190n979
$$ -14069 -8451 -6010 2372 3407 2770 -1430 -10258 -7535 -3772 -17105 -18129 1106 13296 7317
19622G317q202K995M69q4n333n383P317j778O217l828P901J2500j742p544m317
$$ 7317 -885 2110 2579 2495 -2838 -8221 -904 -2682 3535 -293 7608 20108 18366 10822 6505
19607F505J0312J3194m57K471o087M753J7787J8913J2265J9412K2623J9905L7845
$$ 6505 16817 30011 29554 32025 25938 30691 48478 67391 79656 99068 121691 141596 179441
19594A79441N2452N6860L4034J9410j7130n3038p7166m7894k0643k3780j9803
$$ 179441 231893 288753 322787 342197 325067 272029 194863 146969 126326 102546 82743
19583H2743q415J3209K338J6588J5831K0029J5880L6613M9588N2436M6219K9909
$$ 82743 74328 87537 89875 106463 122294 142323 158203 194816 244404 296840 343059 372968
19571C72968q160o4599q0264o3813l1029k5303j0700j6883m5J544J094L678k379
$$ 372968 364808 300209 219945 156132 125103 99800 89100 72217 72172 73716 74810 78488 76109
19558G6109o291j9419j9776j6l924r714j680l54j385j883N326Q341K87q280l10
$$ 76109 69818 50399 30623 30607 26683 16969 15289 14935 13550 11667 16993 25334 25621 17341 17031
19543A7031J2807o338O875P463j616j5781j0563R528q522j0058n016m239n91j1279
$$ 17031 29838 23500 30375 37838 36222 20441 9878 19406 10884 826 -4190 -8429 -9020 -20299
19529b0299J1773o031N294J0011k932j378k118o950O686J2672j737Q890N47p133
$$ -20299 -8526 -14557 -9263 748 -2184 -3562 -5680 -12630 -5944 6728 4991 13881 14428 7295
19515G295l783K98K057l843o427M518k987j1922L566Q049l966k619p141k287Q383
$$ 7295 3512 3810 5867 2024 -4403 115 -2872 -14794 -11228 -3179 -7145 -9764 -16905 -19192 -10809
19500a0809N097J2258p4k629K289O825R040n907j4828l524m581k240n735R633
$$ -10809 -5712 6546 6472 3843 6132 12957 21997 16090 1262 -2262 -6843 -9083 -14818 -5185
19486e185N849R503K171j0636J036K904r870o461k636L054Q871K867j986O886
$$ -5185 664 10167 12338 1702 2738 5642 -4228 -10689 -13325 -10271 -1400 1467 -519 6367
19472F367J0829m864M467L022k619j546n390m731J355j38m477j7461K689O456
$$ 6367 17196 12332 16799 19821 17202 15656 10266 5535 6890 6752 2275 -15186 -12497 -6041
19458f041J482p434k764J0635P056K994l707k904k722p685m573J441O367K1467
$$ -6041 -4559 -11993 -14757 -4122 2934 5928 2221 -683 -3405 -11090 -15663 -14222 -7855 13612
19444A3612J303J181j731j3593L586R2M268j0303m22O914j108P26J3245J9473
$$ 13612 14915 16096 14365 772 4358 4450 8718 -1585 -2007 4907 3799 4525 17770 37243
19430C7243N76k4521j2828q990R961J1909m642r258O401P088m008q310j3037l670
$$ 37243 37819 13298 470 -8520 1441 13350 8708 -550 5851 12939 8931 621 -12416 -16086
19416a6086J4165R049Q988r75L462q598j9767l366M587o423J7223K3728J697p151
$$ -16086 -1921 7128 16116 15141 18603 10005 -9762 -13128 -8541 -14964 2259 25987 27684 20533
19402B0533o012o679j030l428O95J71J3505K0846J4061j4646k3231j6682K920
$$ 20533 14521 7842 6812 3384 4079 4250 17755 38601 52662 38016 14785 -1897 1023
19389A023P72o530N423K212Q003K1795M804N172o895j2258K981K1894M320l139
$$ 1023 1795 -4735 688 2900 10903 32698 37502 42674 35779 23521 26502 48396 52716 49577
19375D9577n392l221J625M003K1002K8568K3768K1745J3748K5668L1722M9253
$$ 49577 44185 40964 42589 46592 67594 96162 119930 141675 155423 181091 212813 262066
19363B62066P1629N7564L9405J9018j1900n4887p4954n1108m4630m0256j1559
$$ 262066 333695 391259 430664 449682 437782 382895 307941 256833 212203 171947 160388
19352A60388j788n873J1594J5256J500J2510L0542K6908K6262M7349O6370O5720
$$ 160388 158600 152727 164321 179577 181077 193587 224129 251037 277299 324648 391018 456738
19340D56738L1443J0256l3993o8077p9737p2292m8994k4577k5909k6556j2352
$$ 456738 488181 498437 464444 396367 316630 244338 195344 170767 144858 118302 105950
19329A05950q573j7174j0546O965J613j2385j4652N932o55o68r86M851R566n755
$$ 105950 97377 80203 69657 76622 78235 65850 51198 57130 56475 55807 54821 59672 69238 63483
19315F3483j0485j0183J661l718J1117R697n809j3068r789l333K519N178k209
$$ 63483 52998 42815 44476 40758 51875 61572 55763 42695 32906 29573 32092 37270 35061
19302C5061o687n458M166R139L165j4623j0893j0197R080J292o240r947L034R342
$$ 35061 28374 22916 27082 36221 39386 24763 13870 3673 12753 14045 7805 -2142 892 10234
19288A0234J4836P047J642j0245p187L673P595o805p025j475j1571K115R407q876
$$ 10234 25070 32117 33759 23514 16327 20000 27595 20790 13765 12290 719 2834 12241 3365
19274C365k691j2737L706j401m873J016J2203N117m562J4289n501K516R019k457
$$ 3365 674 -12063 -8357 -9758 -14631 -13615 -1412 3705 -857 13432 7931 10447 19466 17009
19260A7009J558l522j2699J240R096N056J767J23n44K553M228l102J3836N566
$$ 17009 18567 15045 2346 3586 12682 17738 19505 19628 19084 21637 25865 22763 36599 42165
19246D2165K741j08J702j5355j0178J1752P351j3817r186j5928j0388K933N100
$$ 42165 44906 44798 46500 31145 20967 32719 40070 26253 17067 1139 -9249 -6316 -1216
19233a216L970o084R47M833l571k515k844n962R656J0233M961k494K277P166P870
$$ -1216 2754 -3330 -2383 2450 -1121 -3636 -6480 -12442 -2786 7447 12408 9914 12191 19357 27227
19218B7227k668j8236o085j1794j2038P953J4479K2176r755k8503p619o860Q735
$$ 27227 24559 6323 238 -11556 -23594 -15641 -1162 21014 11259 -17244 -24863 -31723 -22988
19205b2988P298n51n967j955m430l406J308N86N773Q553R780R924m54m895l41
$$ -22988 -15690 -16241 -22208 -24163 -28593 -31999 -30691 -30105 -24332 -15779 -5999 3925 3471 -1424 -1765
19190a765j4589O249P758K468o011p580R774N066k3697o090P510q00L7o050M445
$$ -1765 -16354 -10105 -2347 121 -5890 -13470 -3696 1370 -22327 -28417 -20907 -21707 -21670 -27720 -23275
19175b3275K8238P574j3881n346o587n26k064J064p41K802j378O190j904K905
$$ -23275 4963 12537 -1344 -6690 -13277 -13803 -15867 -14803 -15544 -12742 -14120 -7930 -9834 -6929
19161f929R825K784J953j741l009r007J5010j189n27K477j220m511j1970K518
$$ -6929 2896 5680 7633 5892 2883 -6124 8886 7697 7170 9647 8427 3916 -8054 -5536
19147e536R197K374O031n843N488P563J357J549j0343j0682o345O680N459j025
$$ -5536 3661 6035 12066 6223 11711 19274 20631 22180 11837 1155 -5190 1490 6949 5924
19133E924J265p37r561N998k615m177K373N93O776K1298q441j3441j5523l537
$$ 5924 7189 6452 -3109 2889 274 -3903 -1530 -937 5839 27137 18696 5255 -10268 -13805
19119a3805N387M838N822P49L636L390m094k032j044l424O805N293R753L104q645
$$ -13805 -8418 -3580 2242 2991 6627 10017 5923 3891 2847 -577 6228 11521 21274 24378 15733
19104A5733p903M347J2924p213j5801j584R709N775n851n791O268K809N51M250
$$ 15733 7830 12177 25101 17888 2087 503 10212 15987 10136 4345 10613 13422 13973 18223
19090A8223p6r882j3991m297j156J3669R373j2711j5804k1272K193J8858J2861
$$ 18223 18147 8265 -5726 -10023 -11179 2490 11863 -848 -16652 -37924 -35731 -16873 -4012
19077d012K021Q88k605Q868r79K416M440l29j126j3290O067Q644l658p071n71
$$ -4012 -1991 -1103 -3708 5160 4181 6597 11037 10708 9582 -3708 2359 11003 7345 274 -297
19062b97K317n137P411J4063m409o149r67p872j1408K115P593O4l682p03P776
$$ -297 2020 -3117 4294 18357 13948 7799 6832 -1040 -12448 -10333 -2740 -2676 -6358 -7061 715
19047G15L395J2541K441R113J3217l709j0365L241j965j6181n158P435Q452L242
$$ 715 4110 16651 19092 28205 41422 37713 27348 30589 28624 12443 7285 14720 23172 26414
19033B6414N781J347K662m482J9276J3212J2038K2041J690p123p854K270j0638
$$ 26414 32195 33542 36204 31722 50998 64210 76248 98289 99979 92856 85002 87272 76634
19020G6634o770N497j5899j300o195o963m129O633J2161J8885J2803l61J6355
$$ 76634 69864 75361 59462 58162 51967 45004 40875 47508 59669 78554 91357 90996 107351
19007A07351Q983l651N042R260k837k410M367m192R949K731K36J5928L6231M3655
$$ 107351 116334 112683 117725 126985 124148 121738 126105 121913 131862 134593 134829 150757 186988 230643
18993B30643N4560O1659N2439L4886j2787q1031r1251p8657k6823j7507o638j3487
$$ 230643 285203 346862 399301 434187 421400 340369 249118 170461 143638 126131 119493 106006
18981A06006j7169m485J0914J5151K0715K1500K9939O2947P2327N3746K5099O794
$$ 106006 88837 84352 95266 110417 131132 152632 182571 245518 317845 371591 396690 403484
18969D03484n6214r8295q4240n2748k7399o432j1086m547J5890N196n982M471
$$ 403484 347270 248975 164735 111987 84588 78156 67070 62523 78413 83609 77627 82098
18957H2098L479j0537j7843k013j273j3260j372R927J1253j0245p669r646n275
$$ 82098 85577 75040 57197 55184 53911 40651 39279 49206 60459 50214 42545 32899 27624
18944B7624M969P620r399J3286P498J114M571Q819P763J2034Q917K648m756j037
$$ 27624 32593 40213 30814 44100 51598 52712 57283 66102 73865 85899 94816 97464 92708 91671
18930I1671p240j2981j1051n044j2935R103P839Q676J6558J758j049K1744J4307
$$ 91671 84431 71450 60399 55355 42420 51523 59362 68038 84596 86354 85305 107049 121356
18917A21356j1730N840K580R806J1066J0199P199K4146K1861K4420L7086N0704
$$ 121356 109626 115466 118046 127852 138918 149117 156316 180462 202323 226743 263829 314533
18905C14533Q0297J10032J15812R5484P1580L2442j9691q4700q5827o9776n1963
$$ 314533 394830 504862 620674 716158 787738 820180 800489 715789 629962 560186 508223
18894E08223l7628l7435j3439q342j4453l582J0147M3565M7604N0678Q0313J02270
$$ 508223 470595 433160 419721 411379 396926 393344 403491 447056 494660 545338 625651 727921
18882G27921J13756R6303M7780o662m9380r2253r9608q6680n2831m5663l4615
$$ 727921 841677 937980 985760 979098 929718 837465 737857 651177 598346 552683 518068
18871E18068j9320j4488l763R582j406j2820j7504j0382j2463p040j5296j9525
$$ 518068 498748 484260 480497 490079 488673 475853 458349 447967 435504 428464 413168 393643
18859C93643m198J9938K9835J3211O935J4003O810J2219J1637J5376J4537J3237
$$ 393643 389445 409383 439218 452429 459364 473367 480177 492396 504033 519409 533946 547183
18847E47183J3824J193J4312J1859K4265L279n912M600K2219J9572P345J5328
$$ 547183 561007 562200 576512 588371 612636 615915 610003 614603 636822 656394 663739 679067
18835F79067K0293K0661L2097K5031K0098K9783L8530M0953M1148M1255N6867
$$ 679067 699360 720021 752118 777149 797247 827030 865560 906513 947661 988916 1045783
18824A045783O5287P7918R8964J04491Q0731O4024M1052M3497O5295O4595L3437
$$ 1045783 1111070 1188988 1287952 1392443 1473174 1537198 1578250 1621747 1687042 1751637 1785074
18813A785074j7159j3262j675K8062O0079R3396J15069J46763J64738K11965K23469
$$ 1785074 1767915 1754653 1752978 1781040 1841119 1934515 2049584 2196347 2361085 2573050 2796519
18802B796519K29266K31612K22952K11693J96497K36493K83585L26220L65557
$$ 2796519 3025785 3257397 3480349 3692042 3888539 4125032 4408617 4734837 5100394
18793E100394L68045L52485L74890M34485N09728N84957O95657Q43777J056099
$$ 5100394 5468439 5820924 6195814 6630299 7140027 7724984 8420641 9264418 10320517
18784A0320517J341818J709801K193323K850854L730313M871826O324942Q154082
$$ 10320517 11662335 13372136 15565459 18416313 22146626 27018452 33343394 41497476
18776D1497476J0118522J1627245J1666194R142199L404728m845492j2053052
$$ 41497476 51615998 63243243 74909437 84051636 87456364 82610872 70557820
18769G0557820j4264242j1927605q259680n228788l148381j710974o69917K32225
$$ 70557820 56293578 44365973 36106293 30877505 27729124 26018150 25348233 25580458
18761B5580458J127530K110065L264482M663685O378937Q415093J0501026J1884531
$$ 25580458 26707988 28818053 32082535 36746220 43125157 51540250 62041276 73925807
18753G3925807J1513726Q233682J511397p404734j4350429j5656310j2757285
$$ 73925807 85439533 93673215 95184612 87779878 73429449 57773139 45015854
18746D5015854r031917o139763m267909l105137k358479j857578j506525j257625
$$ 45015854 35983937 29844174 25576265 22471128 20112649 18255071 16748546 15490921
18738A5490921j062707r12499p79961o54642n04527l98194l12558k42750j83223
$$ 15490921 14428214 13515715 12735754 12081112 11576585 11178391 10865833 10623083 10439860
18729A0439860j45507j50911j82727k18560k54175k81480l39674m03506m57639
$$ 10439860 10294353 10143442 9960715 9742155 9487980 9206500 8866826 8463320 8005681
18720H005681m80926m44998m07355m01176l68178l33777k84025k52809k16921
$$ 8005681 7524755 7079757 6672402 6271226 5903048 5569271 5285246 5032437 4815516
18711D815516j59271j27888j55040j78792j74508j88063k00619j64232j31183
$$ 4815516 4656245 4528357 4373317 4194525 4020017 3831954 3631335 3467103 3335920
18702C335920j16421j44054j60216j88876j87992j62860j46460j41655j23976
$$ 3335920 3219499 3075445 2915229 2726353 2538361 2375501 2229041 2087386 1963410
18693A963410j05306o8783p3118q3859p5094p7080p1718o2704n2206n4759l9691
$$ 1963410 1858104 1789321 1716203 1632344 1557250 1480170 1408452 1345748 1293542 1238783 1199092
18682A199092l9295l5599l4576l8611l8764m1304l4412l1937l7424l8208l7374
$$ 1199092 1159797 1124198 1089622 1051011 1012247 970943 936531 904594 867170 828962 791588
18671G91588k4826k4321k7636k1266j7426k7005l6170k6858k2498m1719l8064
$$ 791588 766762 742441 714805 693539 676113 649108 612938 586080 563582 521863 483799
18660D83799k6004j5117q859j8811j2727j1429r105j2455j0501j626q596J019
$$ 483799 457795 442678 433819 415008 402281 390852 381747 369292 358791 357165 348569 349588
18648C49588J3142P952M990L755o597L925j3617j0810r533k0749k7600l466l71
$$ 349588 362730 370682 375672 379427 372830 376755 363138 352328 342795 322046 294446 290980 290609
18635B90609L746l092o45j0978M97R987l916k205M869O380K7362K2941K8760J1809
$$ 290609 294355 291263 290618 279640 280137 290124 286208 284003 288872 295252 322614 345555 374315 386124
18621C86124k3813k1012o340k616m119j3557r457j1466p288j4471K05K6280J0776
$$ 386124 362311 341299 334959 332343 328224 314667 305210 293744 286456 271985 272190 298470 309246
18608C09246n532j040R659j0181M315O954j0144m099k126n871o606l982q680l182
$$ 309246 303714 302674 312333 302152 306467 313421 303277 299178 297052 291181 284575 280593 271913 268731
18594B68731r019m959j6333j5613n99p27j6828N801J1719o108J0558M024M688
$$ 268731 259712 254753 238420 222807 222208 221481 204653 210454 222173 216065 226623 230647 235335
18581B35335J3617L561k981k415j1056q790K014Q746p152j4573r069j7939J796
$$ 235335 248952 252513 249532 247117 236061 227271 229285 238031 230879 216306 207237 189298 191094
18568A91094k647l126J1235p034l808N990O3j492q931n104N48J2290j575L313
$$ 191094 188447 185321 196556 189522 185714 191704 191767 190275 181344 176240 176788 189078 187503 190816
18554A90816o690j2744q185Q490M785j0733r455j7123n292j7270j4197J295J0909
$$ 190816 184126 171382 163197 171687 176472 165739 156284 139161 133869 116599 102402 103697 114606
18541A14606l507o31L122j8840L815O026L703L09O383J0170p697L424k449j242
$$ 114606 111099 110468 113590 94750 98565 104591 108294 108603 114986 125156 117459 120883 118434 117192
18527A17192n445j3284m407J502J514j341j1251o342J743J228q568J4449j2723
$$ 117192 111747 98463 94056 95558 97072 95731 84480 78138 79881 81109 72541 86990 74267
18514G4267j6383K2K0207J3844m224r503r928k403L887K368l28k971k157n879
$$ 74267 57884 57906 78113 91957 87733 78230 68302 65899 69786 72154 71826 68855 66698 60819
18500F0819K843O697o669j914R4O893o541O668P234j76k915J265n378j5243k429
$$ 60819 63662 70359 63690 61776 61870 68763 62222 68890 76124 75948 73033 74298 68920 53677 51248
18485E1248P276O309O398j405q877j07m449k519L72O020j3102O8J3322K6561K61
$$ 51248 58524 64833 71231 69826 60949 60842 56393 53874 54246 60266 47164 47232 60554 87115 87376
18470H7376o233j693j9903k0653K873R21n1O924J385O80n82o706j1793o53P281
$$ 87376 81143 79450 59547 38894 41767 42688 42637 49561 50946 51626 51044 44338 32545 31892 39173
18455C9173J5352J1721k702K759J378j448j442p064r309m325q169p626J1630J0113
$$ 39173 54525 66246 63544 66303 67681 66233 64791 57727 48418 44093 35924 28298 39928 50041
18441E0041j4688n892N138k10R590q029j1948q887l001J5298K0423k909n619O575
$$ 50041 35353 29461 34599 34389 43979 35950 24002 15115 12114 27412 47835 44926 39307 45882
18427D5882N09K641m092o470m916Q87M08n127K1879J0137r607o071J3142J8299
$$ 45882 46391 49032 44940 38470 33554 34441 34849 29722 51601 61738 52131 46060 59202 77501
18413G7501J4616J7561o967j6008J6384K3914M626J537n862j9473j8949j9879
$$ 77501 92117 109678 102711 86703 103087 127001 131627 133164 127302 107829 88880 69001
18401F9001n973m139K197J300N978m270n022j048K5891K4869J7852j2368j7222
$$ 69001 63028 58889 61086 62386 68364 64094 59072 58024 83915 108784 126636 114268 97046
18388I7046k771K1504J4290r570q719r446q072r956k0029j5188r322p631J3565
$$ 97046 94275 115779 130069 120499 111780 102334 94262 84306 64277 49089 39767 32136 45701
18375D5701N060j651J0426J1289N995j0139Q541O319l212L182Q49l523p197m908
$$ 45701 50761 49110 59536 70825 76820 66681 75222 81541 78329 81511 82360 78837 71640 66732
18361F6732r65l00k039k512o586j5301o01q279l456R880P140K2479J418j7570
$$ 66732 65767 65467 63428 60916 54330 39029 38428 30149 26693 36573 43713 66192 67610 50040
18347E0040j5299k410o132K2730J6947k94j0426n675J6188n21J132l686m967j5072
$$ 50040 34741 32331 26199 48929 65876 65582 55156 49481 65669 65148 66280 62594 57627 42555
18333D2555r76j0299j697J194l505O436N78k360j5683J5262J4864L75J3995J0865
$$ 42555 41579 31280 29583 30777 27272 33708 34286 31926 16243 31505 46369 46744 60739 71604
18319G1604M92l768R946O065M063n466k2627l1308k0068k1868j5333R902R614
$$ 71604 72096 68328 78274 84339 88402 82936 60309 29001 8933 -12935 -28268 -18366 -8752
18306h752L974K218Q601O325q000N486J0725m463q618K3330L0103L060r995Q656
$$ -8752 -4778 -2560 6041 12366 4366 9852 20577 16114 7496 30826 60929 63989 53994 62650
18292F2650o954n475m686p55K2489K1957K6647L0776M0128N3097P2106R9910J08144
$$ 62650 55696 50221 45535 44780 67269 89226 115873 146649 186777 239874 311980 411890 520034
18279E20034J51242J28824J19745R2459Q760j30302k07365j85662j04998n6467
$$ 520034 671276 800100 919845 1012304 1021064 890762 683397 497735 392737 336270
18269C36270l5006j8061p483o532n26K1049L4728N1322P2183Q7651J25911J51534
$$ 336270 301264 283203 275720 269188 268662 289711 324439 375761 447944 535595 661506 813040
18257H13040J26145J12883P5537o960j46231j95426j55638q8939m2938k1915j7844
$$ 813040 939185 1052068 1127605 1120645 974414 778988 623350 534411 491473 469558 451714
18246D51714j6688j9342j7276m91r790q997o362M950Q829L14J5047R887J7461
$$ 451714 435026 415684 398408 397917 388127 379130 372768 377718 386547 386861 401908 411795 429256
18233D29256J2356J3254K3360K492j783J5663Q68m146M413J795N651k722p685
$$ 429256 441612 454866 478226 480718 478935 494598 495466 491320 495733 497528 503179 500457 492772
18220D92772J5875J4704J2940l671j406N354K1047K9371Q181M636J5911Q774J1767
$$ 492772 508647 523351 536291 532620 531214 536568 557615 586986 595167 599803 615714 624488 636255
18207F36255J3018J3172K2175L6090M5299K3422J9686L6544L1782K0302L3320
$$ 636255 649273 662445 684620 720710 766009 789431 809117 845661 877443 897745 931065
18196I31065M3176L6858M2368O6948P0852P4422O8003Q2278J04433J14854J43242
$$ 931065 974241 1011099 1053467 1120415 1191267 1265689 1333692 1415970 1520403 1635257 1778499
18185A778499J68037J83307K21642K48381K94584L35405L90353M56863N08909
$$ 1778499 1946536 2129843 2351485 2599866 2894450 3229855 3620208 4077071 4585980
18176D585980N32204N61222N50717M57909L12917K60277L49706N39085P61264
$$ 4585980 5118184 5679406 6230123 6688032 7000949 7261226 7610932 8150017 8911281
18167H911281J016633J372479J847919K510722L387870M557795O078490Q155401
$$ 8911281 9927914 11300393 13148312 15659034 19046904 23604699 29683189 37838590
18159C7838590J1135975J4763516J7502271J7484647J2748631J419862j7731550
$$ 37838590 48974565 63738081 81240352 98724999 111473630 112893492 95161942
18152I5161942k6900097j9956643j1654636o573402l807633k175745j085029k55707
$$ 95161942 68261845 48305202 36650566 30077164 26269531 24093786 23008757 22753050
18144B2753050M83444J358898K404692L682525N272918P404291J0423289J3829013
$$ 22753050 23236494 24595392 27000084 30682609 35955527 43359818 53783107 67612120
18136F7612120J6070253J5344060R899539k311991k0232106k5023911j7073927
$$ 67612120 83682373 99026433 108925972 106613981 86381875 61357964 44284037
18129D4284037r813988n855684l952083k877417k164210j700389j359893j145777
$$ 44284037 34470049 28614365 24662282 21784865 19620655 17920266 16560373 15414596
18121A5414596r36400p28588n57493l90777k08954l2455J17345K73408M60317
$$ 15414596 14478196 13749608 13192115 12801338 12592384 12559929 12677274 12950682 13410999
18112A3410999P09411J149657J805548K467774K791955K398626J012478j830039
$$ 13410999 14120410 15270067 17075615 19543389 22335344 24733970 25746448 23916409
18104B3916409m892693m532417k863893j752336j145874q39828o46978n31805
$$ 23916409 19023716 14491299 11627406 9875070 8729196 7889368 7242390 6710585
18096F710585m57070l92925l51711l06656k74226k60950k45054k27388j95974
$$ 6710585 6253515 5860590 5508879 5202223 4927997 4667047 4421993 4194605 3998631
18087C998631j74278j65023j35343j34806j15861j06592r0172p8850r2149j09602
$$ 3998631 3824353 3659330 3523987 3389181 3273320 3166728 3076556 2997706 2905557 2795955
18077B795955j30041j34143j19529j16790j21136j05111r7704p2315r3857q9666
$$ 2795955 2665914 2531771 2412242 2295452 2174316 2069205 1971501 1899186 1805329 1715663
18067A715663q0901p8558p7486o6259o7267o6510n9875m3955l9488l3496m0147
$$ 1715663 1634762 1556204 1478718 1412459 1345192 1278682 1218807 1174852 1135364 1101868 1061721
18056A061721m2151l2867l8703n2321k3425l1038l7060l5470l0924k9829k9997
$$ 1061721 1019570 986703 948000 895679 872254 841216 804156 768686 737762 707933 677936
18045F77936l4465k9309k6414k5861k2653k3973l3715k564J8981J4932q631j3977
$$ 677936 643471 614162 587748 561887 539234 515261 481546 478982 497963 512895 504264 490287
18033D90287k7483m4389k4983j8071J5043J7733M521J7964Q554j1683j0057j982
$$ 490287 462804 418415 393432 375361 390404 408137 412658 430622 439176 427493 417436 415454
18021D15454k0591l0915k0683r862j7191p879O016K665j2993j6703j4504J347
$$ 415454 394863 363948 343265 333403 316212 308333 314349 317014 304021 287318 272814 274161
18009B74161J8232J7071J4816J2261J3012J2491K5092K0550J0469k489j7417j7835
$$ 274161 292393 309464 324280 336541 349553 362044 387136 407686 418155 415666 398249 380414
17997C80414l9991l1000j9324j1168P937J3692j0291J617N913N541P831J2178
$$ 380414 340423 309423 290099 278931 286868 300560 290269 291886 297799 303340 311171 323349
17985C23349p85p993m304M202J1159J3515O981j163j3085k3066k2537k8454q860
$$ 323349 322564 314571 310267 314469 325628 339143 346124 344961 331876 308810 286273 257819 248959
17972B48959O145M600J7589O730J3125Q009n6p032J0753J6557j39j5602j6150
$$ 248959 255104 259704 277293 284023 297148 305157 305101 298069 308822 325379 325240 309638 293488
17959B93488p777m685r839O059K715j8220p963j236j0163J4884Q754q037l02j3526
$$ 293488 285711 281026 271187 277246 279961 261741 253778 252542 242379 257263 266017 257980 257678 244152
17945B44152p427J5110J1510p245O316o487j6153m845R207k439m218l583l486
$$ 244152 236725 251835 263345 256100 262416 255929 239776 234931 244138 241699 237481 233898 230412
17932B30412j0264o097r393M95m499o476J280j9241j7830j1426J0355o666j477
$$ 230412 220148 214051 204658 205153 200654 194178 195458 176217 158387 146961 157316 150650 149173
17919A49173O319q232J943M131J2406l225m833j4101k705J083O996o703n019j816
$$ 149173 155492 147260 149203 153334 165740 162515 157682 143581 140876 141959 148955 142252 137233 135417
17905A35417r911J0923O886j134L588o325p698p02L922K168j1053L659J0401M285
$$ 135417 125506 136429 143315 142181 145769 139444 131746 131044 134966 137134 126081 129740 140141 144426
17891A44426j4629l738m942K722l213K359P032Q210J056j6994n875k720p624l915
$$ 144426 129797 126059 121117 123839 120626 122985 130017 138227 139283 122289 116414 113694 106070 102155
17877A02155J3377K4060J0908k5995k7631j4522R708J491j1728K960O136j012
$$ 102155 115532 139592 150500 124505 96874 82352 92060 93551 81823 84783 90919 89907
17865H9907r399N840R019j853o593N285J1582k069K932Q113K132r900l002N95
$$ 89907 80508 86348 95367 93514 86921 92206 103788 101719 104651 112764 114896 104996 101994 102589
17851A02589L125j210J0137n145R450m951j8382q797N160N478J0309M161n427
$$ 102589 105714 104504 114641 109496 118946 113995 95613 86816 91976 97454 107763 111924 106497
17838A06497L620M15j1495p836J1685j1159n683Q832K835p583l100J4988Q414
$$ 106497 110117 110532 99037 91201 102886 91727 86044 94876 97711 90128 87028 102016 110430
17825A10430K701r97j763j2034n179j0641m915r988m773R899l984q70n793J272
$$ 110430 113131 112134 110371 98337 93158 82517 77602 67614 62841 72740 68756 67886 62093 63365
17811F3365M449L866k764j3221m589J0558J837J0886Q840P815k282p132m110l436
$$ 63365 67814 71680 68916 55695 51106 61664 63501 74387 83227 91042 88760 81628 77518 74082
17797G4082J3738N338l824n174R995m491M1P452Q038j8028j6855j234N079Q001
$$ 74082 87820 93158 89334 84160 94155 89664 89705 97157 105195 87167 70312 69078 74157 82158
17783H2158L354J2737J5889O4o379j4495r645M036r656r486r230K536P239P203
$$ 82158 85512 98249 114138 114202 107823 93328 83683 87719 78063 68577 59347 61883 69122 76325
17769G6325J6125r484j7523j514K186M507j5559P27R776m600n673K660l901R06
$$ 76325 92450 82966 65443 63929 66115 70622 55063 55790 65566 60966 55293 57953 54052 54958
17755E4958l075L898O631n0n936k481n668L035J2200N446p122r260m432J1101
$$ 54958 51883 55781 62412 62362 56426 53945 48277 51312 63512 68958 61836 52576 48144 59245
17741E9245J3855k183p315p027K297p41o879J682k938J125J5184q516k179J075
$$ 59245 73100 70917 63602 56575 58872 58131 51252 52934 49996 51121 66305 57789 55610 56685
17727E6685L557P915j793k165n499k851P114J3511q466K954L663m234m318l312
$$ 56685 60242 68157 66364 64199 58700 55849 62963 76474 68008 70962 74625 70391 66073 62761
17713F2761M437M708J156j23J897j336k677R455k470j9040p926j963R515J1498
$$ 62761 67198 71906 73062 72939 74836 73500 70823 80278 77808 58768 50842 48879 58394 69892
17699F9892J763Q227M129m137N141J350l031j0337j7745k239L306j4426k8026
$$ 69892 71655 79882 84011 79874 85015 86365 83334 72997 55252 53013 56319 41893 13867
17686A3867j9258l19J1333J1390M294L778O576J1937O515j545j05j1854o87O408
$$ 13867 -5391 -5710 5623 17013 21307 25085 31661 43598 50113 48568 48463 36609 35922 42330
17672D2330J2168j846j5241j0005q190j4808j5114j771M30n637l996K2688J1335
$$ 42330 54498 52652 37411 27406 19216 4408 -10706 -12477 -12047 -17684 -21680 1008 12343
17659A2343q845Q552O589J564O215J465J411j68J1701k574j3395r761K305J3228
$$ 12343 3498 12050 18639 20203 26418 27883 29294 29126 40827 38253 24858 15097 17402 30630
17645C0630j305M737J811q109j7576p2J101o176l081J2209J0132r403j0600L383
$$ 30630 29325 34062 35873 27764 10188 10116 11217 5041 1960 14169 24301 14898 4298 7681
17631G681O038O268J1012K2104o442j5583Q641n610n225j701K615l942J2616j10
$$ 7681 13719 19987 30999 53103 46661 31078 39719 34109 28884 27183 29798 25856 38472 38362
17617C8362j5378p283J3141J3222j1115j6874r825M922M940J97J07J2632n975
$$ 38362 22984 15701 28842 42064 30949 14075 4250 9172 14112 14309 14416 27048 21073
17604B1073K040J447O489j4082j5734p26J0220M994R979l998j973J1550P569j7864
$$ 21073 23113 24560 31049 16967 1233 507 10727 15721 25700 21702 19729 31279 38848 20984
17590B0984j1992N144J0424N581m248M726k187m573K900O457m436p173M815p111
$$ 20984 8992 14136 24560 30141 25893 30619 28432 23859 26759 33216 28780 21607 26422 19311
17576A9311j047j359J1578J1157J3993L823J1437m83k487L709j908N81Q079R79
$$ 19311 18264 16905 28483 39640 53633 57456 68893 68410 65923 69632 67724 68305 76384 77363
17562G7363J8104K5831J3990K8941K2861L3804N4952O7699Q3571R7734Q1714k948
$$ 77363 95467 121298 135288 164229 187090 220894 275846 343545 427116 524850 606564 603616
17550F03616p9036j26422j03403q1611m0247k4217l236o216M62l80K980R503L5926
$$ 603616 524580 398158 294755 213144 172897 148680 145444 139228 139690 139310 142290 151793 187719
17537A87719M7164L3921N2576O6225P3798Q0841N4305j1000q4172j36546q7033
$$ 187719 234883 268804 321380 387605 461403 542244 596549 585549 501377 364831 277798
17526B77798n2124m3274k8644j9283k5853j1329j0270o175j0641J2550J0382O5
$$ 277798 225674 182400 153756 134473 108620 97291 87021 80846 70205 82755 93137 93202
17514I3202K425p899j9629j2758j702N253N980J0377j1018j5298J789R598R101
$$ 93202 95627 87728 68099 55341 53639 58892 64872 75249 64231 48933 50722 60320 69421
17501F9421j7800m389R353l900q699n713q511R184O784j2932n550j64J4844j044
$$ 69421 51621 47232 56585 52685 43986 38273 29762 38946 45730 32798 27248 27084 41928 40884
17487D0884j2589P29n815o972o005P989K7368P605j0425p563j2439n447j212K248
$$ 40884 28295 29024 23209 16237 10232 18221 45589 53194 42769 35206 22767 17320 16108 18356
17473A8356L286N528o314n066po470l884m45l538M157K957p362M384J4201R049
$$ 18356 21642 27170 20856 15790 15783 9313 5429 4984 1446 5603 8560 1198 5582 19783 28832
17458B8832N683l428J7072P576j0276j3358j3496Q239P533K04K084n811K956R115
$$ 28832 34515 31087 48159 55735 45459 32101 18605 26844 34377 34581 36665 30854 33810 42925
17444D2925J8817R005J2252J8226J5288K273j1013l3280j7550k2789j4804L164
$$ 42925 61742 70747 82999 101225 116513 118786 107773 74493 56943 34154 19350 22514
17432B2514p68m217N407J8060Q329j1037n424L301j2271j29J0903P738p70m497
$$ 22514 21746 17529 22936 40996 49325 38288 32864 36165 23894 23765 34668 42406 41636 37139
17418C7139j3524J569p944M895o398j983P357Q159m987J548M042p740m661r272
$$ 37139 23615 25184 17240 22135 15737 13754 21111 29270 24283 25831 29873 22133 17472 8200
17404H200L905q703M685n214m917M46Q707Q399J1537J887j4309j5602K770J3501
$$ 8200 12105 3402 8087 2873 -2044 -1598 7109 15508 27045 28932 14623 -979 1791 15292
17390A5292L225k449M59o607l434J901J1581Q83m550j2754Q01J9992p306k2636
$$ 15292 18517 16068 16527 9920 6486 8387 19968 20851 16301 3547 4348 24340 17034 -5602
17376e602J494P093L850R479J2285j3647j9845Q35O092o85m202O94P83J2471K136
$$ -5602 -4108 2985 6835 16314 28599 14952 -4893 -4058 2034 1349 -2853 -2159 -1376 11095 13231
17361A3231j1537J2949M181j2337L843J1310N266q534j0924k808J0730R292K74
$$ 13231 1694 14643 18824 6487 10330 21640 26906 18372 7448 4640 15370 24662 24936
17348B4936m344K95O445j0201o984r556Q900P61n241J558Q319m202Q43Q709n238
$$ 24936 20592 20887 27332 17131 10147 591 9491 10252 5011 6569 14888 10686 11529 20238 15000
17333A5000o48o351j4315r017J2296J2807K0626j0445r537J1240J946M10M769
$$ 15000 14352 8001 -6314 -15331 -3035 9772 30398 19953 10416 21656 23602 24012 28781
17320B8781J2362r89j1291j4375j6336J832O020J3594K80j8815n149K367L013
$$ 28781 41143 40154 28863 14488 -1848 -16 6004 19598 19878 1063 -4086 -1719 1294
17307A294J2711R608M390o565q946m573J420K150J6645Q264p232R49l672L687
$$ 1294 14005 23613 28003 21438 12492 7919 9339 11489 28134 36398 29166 30115 26443 30130
17293C0130L747p214j2318p240j1817J038N022K045L427R050j0327o87q526n19
$$ 30130 33877 26663 14345 7105 -4712 -3674 1348 3393 6820 15870 5543 4856 -3670 -4189
17279d189J4270J783r459R47J4498N309r732l507M815j868n455O068Q061q698
$$ -4189 10081 11864 2405 3352 17850 23159 13427 9920 14735 12867 7412 13480 21541 12843
17265A2843j0905R301M025J0573P171o285k2743r316m381J6835O165L76P75J7208
$$ 12843 1938 11239 15264 25837 33008 26723 3980 -5336 -9717 7118 13283 13659 14434 31642
17251C1642n01j4401L063O743j6430j4613L655j0697m311M319J053O636l493n055
$$ 31642 31141 16740 19803 26546 10116 -4497 -842 -11539 -15850 -11531 -10478 -3842 -7335 -12390
17237a2390P184J3003R77p956p604N219J3688q250L037P569P113M54p494j727
$$ -12390 -5206 7797 8774 818 -6786 -1567 12121 3871 6908 14477 21590 22044 14550 12823
17223A2823L630n471l853r071l574K728L861r810m502J2286K531n475n481P148
$$ 12823 16453 10982 7129 -1942 -5516 -2788 1073 -8737 -13239 -953 1578 -3897 -9378 -2230
17209b230n832l574J2502N547j283J2502J2580l174l290n090n395m605O651p298
$$ -2230 -8062 -11636 866 6413 5130 17632 30212 27038 23748 18658 13263 8658 15309 8011
17195H011p513m528Q114l405m438M786J0804J1057J161j4570k071j727j732K68
$$ 8011 498 -4030 4084 679 -3759 1027 11831 22888 24049 9479 7408 5681 3949 4217
17181D217O903M05K844K846j3530m467K609K443n446M63J6293j1433r776J052
$$ 4217 11120 11525 14369 17215 3685 -782 1827 4270 -1176 -713 15580 4147 -5629 -4577
17167d577O894J704j731R835O081o917q082L001K462L240j2192J737J965n906
$$ -4577 2317 4021 2290 12125 18206 11289 3207 6208 8670 11910 -282 1455 3420 -2486
17153b486O82P429J5527P87M532R397j458n154m880o976M021J670N758o615L761
$$ -2486 -1804 5625 21152 21939 26471 35868 34410 29256 24376 17400 21421 23091 28849 22234 25995
17138B5995j4692k635K353j561K58o134M879N750j248j2147o487L912N549M658
$$ 25995 11303 8668 11021 9460 9718 3584 8463 14213 12965 818 -5669 -1757 3792 8450
17124H450k164k621K91K07p468k044O844j135M487J0675N000Q171r901q210L255
$$ 8450 6286 3665 3956 4163 -3305 -5349 1495 360 4847 15522 20522 28693 18792 10582 13837
17109A3837j788K256R132j175l112L589j23l090l737l79K213n835j857K928q164
$$ 13837 12049 14305 23437 22262 19150 22739 22616 19526 15789 15410 17623 11788 9931 12859 4695
17094D695Q610P220m973m116J3826K523q126O320M075l068p280r921n372P046
$$ 4695 13305 20525 15552 11436 25262 27785 19659 25979 30054 26986 19706 9785 4413 11459
17080A1459O804L031k133J257q484j2371M375J4805j440j0272M695J265J6545
$$ 11459 18263 21294 19161 20418 11934 -437 3938 18743 17303 7031 11726 12991 29536
17067B9536l139r839J221j166j576L110o313k27L399j058o989Q113k125p942j0901
$$ 29536 26397 16558 17779 16613 15037 18147 11834 11607 15006 13948 6959 15072 12947 5005 -5896
17052e896N968P920L270p167N147Q17R180K126p109k521J1824o410q112o987R492
$$ -5896 72 7992 11262 4095 9242 10059 19239 21365 14256 11735 23559 17149 9037 2050 11542
17037A1542j875k671l109l156J2914L48N911k489l402m340K436O49k082j1112
$$ 11542 9667 6996 3887 731 13645 13993 19904 17415 14013 9673 12109 12758 10676 -436
17023d36L440K1912r6j3426J773L624L08j6034m850J606r202k111K009K599M812
$$ -436 3004 24916 24820 11394 13167 16791 17099 1065 -3785 -2179 -11381 -13492 -11483 -8884 -4072
17008d072J701n342p171R813J9841K763l969k254M42m163P549P534M745K056q044
$$ -4072 -2371 -7713 -14884 -5071 14770 17533 13564 11310 11752 7589 15138 22672 27417 29473 21429
16993B1429L017p05P86J2554j64j8880k092p477r628Q759N358M046j2531r683
$$ 21429 24446 23741 24527 37081 36917 18037 15945 8468 -1160 7599 12957 17003 4472 -5211
16979e211P842Q527m736m322m502Q83j863j017l413p404M222n267M735k63J0480
$$ -5211 2631 11158 6422 2100 -2402 -1519 -3382 -4399 -7812 -15216 -10994 -16261 -11526 -11789 -1309
16964a309J4636J8101j5074j2346o172r38o857J1622J0311j8273j6131J3461J4361
$$ -1309 13327 31428 16354 4008 -2164 -3102 -9959 1663 11974 -6299 -22430 -8969 5392
16951E392K626j859l300r652j3831L771K1055R979j770N262p313j0535m101R893
$$ 5392 8018 6159 2859 -6793 -20624 -16853 4202 14181 12411 17673 10360 -175 -4276 5617
16937E617p94l581J30q402O519j0025J162M059P199j839Q51J3330P624n978j023
$$ 5617 4823 1242 1372 -7030 -511 -10536 -9374 -5315 1884 45 896 14226 21850 15872 14849
16922A4849j713J230q796o538n788o026R726K4796N305M456j2807k965J411j9252
$$ 14849 13136 14366 5570 -968 -6756 -12782 -3056 21740 27045 31501 18694 15729 17140 -2112
16908b112l61l7l780K966M45P099P575K357l958O537R099n644P354p433j56J0779
$$ -2112 -2473 -2510 -6290 -3324 -2879 4220 11795 14152 10194 16731 25830 20186 27540 20107 19951 30730
16892C0730J4537N515j279l636j1776j4480N527O638Q141N131j5148l135L569
$$ 30730 45267 50782 49503 45867 34091 19611 25138 31776 39917 45048 29900 26765 30334
16879C0334P20P452l499M489N900j798k161M732m122j6437l489K091L139l69m378
$$ 30334 31054 38506 35007 39496 45396 43598 41437 46169 42047 25610 22121 24212 27351 26982 22604
16864B2604L942j4237j4804L838J1149l486J5969K195j168l173j360Q155m51p339
$$ 22604 26546 12309 -2495 1343 12492 9006 24975 27170 26002 22829 21469 29624 29173 21834
16850B1834n110l133N097J6879J363o893p907j2089J104Q725P194o279p0J0696
$$ 21834 16724 13591 18688 35567 36930 30037 22130 10041 11145 19870 27064 20785 20715 31411
16836C1411j4247p222r172Q023N181m619n866p640Q508M95l045o01O426Q13j2983
$$ 31411 17164 9942 770 8793 13974 9355 3489 -4151 4357 4852 1807 1206 7632 8445 -4538
16821d538K336J7186N488m110m201m638L457Q658j3110o728L832q280k522M837
$$ -4538 -2202 14984 20472 16362 12161 7523 10980 19638 6528 -200 3632 -4648 -7170 -2333
16807b333m083J477P148K615L228m546l4J3393M260r057j0298n455P77J3689J2758
$$ -2333 -6416 -4939 2209 4824 8052 3506 3472 16865 21125 12068 1770 -3685 -2908 10781 23539
16792B3539k65q759q123j15m70j7317J7903J8149r596j0347o508J4349N149O148
$$ 23539 23274 14515 6392 6277 5807 -11510 6393 24542 14946 4599 -1909 12440 17589 23737
16778B3737K009l63P59p282n805n445L053P710N943j1116j1854o862k6N592Q89
$$ 23737 25746 25383 26142 18860 13055 7610 10663 18373 24316 13200 1346 -5516 -5542 50 939
16763I39J776q608o463m546J3424J1565q713j738j184P473M263M79j0226O348
$$ 939 2715 -5893 -12356 -16902 -3478 8087 -626 -2364 -3548 3925 8188 8667 -1559 4789
16749D789O464J0672r90n602J2433J53p807j4040K22L258J35n724j2263n275J2021
$$ 4789 11253 21925 20935 15333 27766 27919 20112 6072 6294 9552 9687 3963 -8300 -13575 -1554
16734a554R84K077j050j1208L628J6365R096j1147n3P309j3733o117J8078M503
$$ -1554 -570 1507 457 -10751 -7123 9242 18338 7191 7138 14447 714 -5403 12675 17178
16720A7178l066k94j386J0372N261o079o704p815j29Q409O310O985q600J1028
$$ 17178 14112 13818 12432 22804 28065 21986 15282 7467 7338 15747 22057 29042 20442 31470
16706C1470L019m380o022r175M596n263l673N380p720q72Q973J0839j1763j1858
$$ 31470 34489 30109 24087 14912 19508 14245 10572 15952 8232 7360 16333 27172 15409 3551
16692C551K094p940N313J1248N164o384L876k687j0011o111J800L478j767N768
$$ 3551 5645 -2295 3018 14266 19430 13046 16922 14235 4224 -1887 -87 3391 1624 7392
16678G392J6118J3542l851j8881J282O497Q111J0385j8274k7247L954R371k18
$$ 7392 23510 37052 33201 14320 15602 22099 30210 40595 22321 -4926 -972 8399 8181
16665H181R395R311q315k080J3491K892k267n294j0107L391Q047o129m76j749
$$ 8181 17576 26887 18572 16492 29983 32875 30608 25314 15207 18598 26645 20516 20040 18291
16651A8291j5855m732N420k331K016O417o70k78J5855K923o202j7064j2339J670
$$ 18291 2436 -2296 3124 793 2809 9226 8556 8278 24133 27056 20854 3790 -8549 -6879
16637f879N312o285j627J4713J6118L038J678k887l669j435o623J30k668j1283
$$ -6879 -1567 -7852 -9479 5234 21352 24390 26068 23181 19512 18077 11454 11584 8916 -2367
16623b367r842m802M522k743L222R029K524J758M531K503P50P047J22L492j2459
$$ -2367 -12209 -17011 -12489 -15232 -12010 -2981 -457 1301 5832 8335 9085 16132 16254 19746 7287
16608G287k33K0294k693r942j1922N008L513L512P243P442j357l733k0931j1314
$$ 7287 7054 27348 24655 14713 2791 7799 11312 14824 22067 29509 28152 24419 3488 -7826
16594g826O163L952J569Q621L59J84L210M445L121q488q800k573R660M311m904
$$ -7826 -1663 2289 3858 12479 12838 13022 16232 20677 23798 15310 6510 3937 13597 17908 13004
16579A3004J382L318l111j2209L810M053J133p61j3967j2186N559M193P528O129
$$ 13004 14386 17704 14593 2384 6194 10247 11380 10619 -3348 -15534 -9975 -5782 1746 7875
16565G875q866j8882M320K2939R862o384J183j0355J400P142J162m563n36j5290
$$ 7875 -991 -19873 -15553 7386 17248 10864 12047 1692 3092 10234 11396 6833 6297 -8993
16551h993j0635K108J2936J2136R483j0305J0453K244q216j538j305J349o46l802
$$ -8993 -19628 -17520 -4584 7552 17035 6730 17183 19427 11211 9673 8368 9717 9071 5269
16537E269k866m871J6887N743L33k441L433n5p298o646M278O295P668N412j4463
$$ 5269 2403 -2468 14419 20162 20495 18054 21487 21432 14134 7488 11766 18061 25729 31141 16678
16522A6678j5101j2822m97L613p836q484J0143J8737j718n622j0719l893J5665
$$ 16678 1577 -11245 -11742 -8129 -15965 -24449 -14306 4431 2713 -2909 -13628 -17521 -1856
16509a856L800j018k063K368O337J9770n40m027m345p030j874k27m561l427J5492
$$ -1856 1944 926 -1137 1231 7568 27338 26798 22771 18426 11396 9522 9295 4734 1307 16799
16494A6799O69m593M273R369K1216o726k3850l051j2762K474j4407j7196L607
$$ 16799 17468 12875 17148 26517 47733 41007 17157 14106 1344 3818 -10589 -27785 -24178
16481b4178L1220K6908L610j3338n82M449O70j1892n978P118J135P566m78q720
$$ -24178 7042 33950 37560 24222 23640 28089 28759 16867 10889 18007 19142 26708 26230 17510
16467A7510j0920m035l170P965l586j1521j906l000J3941J3449j869L387N544
$$ 17510 6590 2555 -615 7350 3764 -7757 -9663 -12663 1278 14727 12858 16245 21789
16454B1789k010l075q142L293j297j5387j0358K461O591J9259n391l121J554J0866
$$ 21789 19779 16704 8562 11855 10558 -4829 -15187 -12726 -6135 13124 7733 4612 6166 17032
16440A7032N545n317j0667l024o213N733J3026M439n123Q100J5753J3258p081
$$ 17032 22577 17260 6593 3569 -2644 3089 16115 20554 15431 23531 39284 52542 45461
16427D5461n226q521q652m731j3277q755L969P865j4420k0745p547J3946J4860
$$ 45461 40235 31714 23062 18331 5054 -3701 268 8133 -6287 -27032 -34579 -20633 -5773
16414e773o095J781R151J0979n372j5643N955J104o892N513J2827j289O97M368
$$ -5773 -11868 -10087 -936 10043 4671 -10972 -5017 -3913 -10805 -5292 7535 6246 6943 11311
16400A1311j3522O701J0318L514J5000j563p135q985k674O00M516R425n181p300
$$ 11311 -2211 4490 14808 18322 33322 31759 24624 15639 12965 13565 18081 27506 22325 15025
16386A5025L035Q554j139k1603l315j511o001N778Q914m757P537P670n689M207
$$ 15025 18060 26614 25475 3872 557 -954 -6955 -1177 7737 2980 10517 18187 12498 16705
16372A6705o5M92N503k931j0722N413k609j9959J58N354J1788L083k214K946n348
$$ 16705 16640 17132 22635 19704 8982 14395 11786 -8173 -8015 -2661 9127 12210 9996 12942 7594
16357G594n019P934M182k848L678J66J4684J990j1797j5871l95M148N548M828
$$ 7594 2575 10509 14691 11843 15521 15687 30371 32361 20564 4693 4298 8446 13994 18822
16343A8822P180l89j464n129j1289q955k0331J3226Q027j540J3916J1202j1850
$$ 18822 26002 25613 24149 19020 7731 -1224 -21555 -8329 -302 -1842 12074 23276 11426
16330A1426p218N693r23o273o315n32o396n211J0213J0868P434K451m316r002
$$ 11426 4208 9901 8978 2705 -3610 -4142 -10538 -15749 -5536 5332 12766 15217 10901 1899
16316A899j4263P078P948m938o251j757Q452J3015J3641j2033K270R487M427j864
$$ 1899 -12364 -5286 2662 -2276 -8527 -10284 -1832 11183 24824 12791 15061 24548 28975 27111
16302B7111l834K906N088J423J753N419k0310j5832O776J3391q79K727J2894Q66
$$ 27111 23277 26183 31271 32694 34447 39866 19556 3724 10500 23891 23012 25739 38633 39499
16288C9499j0761M63M947k756o308P59O804k624j7699r059L036Q866Q146N359
$$ 39499 28738 29201 34148 31392 25084 25843 32647 30023 12324 3265 6301 15167 23313 28672
16274B8672n74Q615n07o549q713k737j2838n04K181q123j1283j1720J7574K967
$$ 28672 28098 36713 36206 29657 20944 18207 5369 4865 7046 -1077 -12360 -24080 -6506 -3539
16260c539J558l116r728M325O088K4179J5094L369L027r144p855l968l888j1153
$$ -3539 -1981 -5097 -14825 -10500 -4412 19767 34861 38230 41257 32113 24258 20290 16402 5249
16246E249q278j1632L690k094k602O024J3796N804k581M581J5127M05k979n682
$$ 5249 -3029 -14661 -10971 -13065 -15667 -9643 4153 9957 7376 11957 27084 27489 24510 18828
16232A8828n105j0744j519K622N700J0660o053j4895R116K5708k162k772j14q523
$$ 18828 13723 2979 1460 4082 9782 20442 14389 -506 8610 34318 32156 29384 29270 20747
16218B0747j0346p683p742L054Q655J985J457J6732M867O144o970j4507n867N729
$$ 20747 10401 2718 -5024 -1970 6685 8670 10127 26859 31726 37870 30900 16393 10526 16255
16204A6255j113q40K354n889j2221L25K0628k101p596r27o695L571J2268J0177
$$ 16255 15142 14302 16656 10767 -1454 -1129 19499 17398 9802 8875 2180 5751 18019 28196
16190B8196M791Q003R974o040j6355j7134L55L691q839o590K366N249N182l684
$$ 28196 32987 40990 50964 44924 28569 11435 11790 15481 6642 52 2418 7667 12849 9165
16176I165l662K466j762K460J013n310l917R280M66m270n727J3023K3613K5383
$$ 9165 5503 7969 6207 8667 9680 4370 453 9733 10199 5929 202 13225 36838 62221
16162F2221p675k2967n512L897m826k288j1239r244n337N452P326L398J1001J393
$$ 62221 54546 31579 26067 29964 25138 22850 11611 2367 -2970 2482 9808 13206 24207 25600
16148B5600j2857j310O199j8252j5452k621K7576J3993p824J697k843p640L842
$$ 25600 12743 11433 17632 -620 -16072 -18693 8883 22876 15052 16749 13906 6266 10108
16135A0108R779L157J425K898m471j7473O415J2648p68m487M146o312j610m750
$$ 10108 19887 23044 24469 27367 22896 5423 11838 24486 23718 19231 23377 17065 15455 10705
16121A0705M500j1992m286N27o074o488M122J1860P680K633N38j4315j5859K985
$$ 10705 15205 3213 -1073 -546 -6620 -13108 -8986 2874 10554 13187 13725 -590 -16449 -13464
16107a3464J6284M140K767k3M954P591R09j1173m766R029J1795p441j1969P169
$$ -13464 2820 6960 9727 9704 14658 22249 23158 11985 7219 16248 28043 20602 8633 15802
16093A5802J3411j392k0426L543J1023J0730O489r482j2538K358L023j3157p43
$$ 15802 29213 27821 7395 10938 21961 32691 39180 29698 17160 19518 22541 9384 8641
16080H641Q645j4176K108R537j01J1080J679J0098P707j9947m594k282j3599n82
$$ 8641 17286 3110 5218 14755 14654 25734 27413 37511 45218 25271 20677 18395 4796 4214
16066D214K978N758J1759j283J3369M076r054j1406j3011p417Q734m604R729J5327
$$ 4214 7192 12950 24709 23426 36795 40871 31817 20411 7400 -17 8717 4113 13842 29169
16052B9169J8885r963j1763R12l610J0743j898k0791o766J1209J7819J3060L780
$$ 29169 48054 38091 26328 27240 23630 34373 32475 11684 4918 16127 33946 47006 50786
16039E0786o311o038M929Q623l287j6453r496j0525j60o022k379j0564O044J8590
$$ 50786 44475 38437 43366 51989 48702 32249 22753 12228 12068 6046 3667 -6897 -853 17737
16025A7737O792n96j2832j8031o11J5950K774o404l324P18l502K123M723j1566
$$ 17737 24529 23933 11101 -6930 -7541 8409 11183 4779 1455 2173 -1329 794 5517 -6049
16011f049J1421J1945m43J8074N139n93r304p570M164O640l073Q173k662k5676
$$ -6049 5372 17317 16874 34948 40087 39494 30190 22620 26784 33424 30351 38524 35862 10186
15997A0186j2280J0411N084Q542K418r801j2100N920J7052J3074j761l817l408
$$ 10186 -2094 8317 13401 21943 24361 14560 2460 8380 25432 38506 36745 32928 29520
15984B9520P205j0009M09L774j1832m23P385o971n156j498O426o355J0458O576
$$ 29520 36725 26716 27125 30899 19067 18644 26029 19058 13902 12404 18830 12475 22933 29509
15970B9509q805j2938j099K381r31j578R96P895N168J1139N91j824k742k725m571
$$ 29509 20704 7766 6667 9048 8117 6539 7535 15430 20598 31737 32328 30504 27762 25037 20466
15955B0466k162J1388l873o35j101k385O220K830M964j951o927n011J1161r38
$$ 20466 18304 29692 25819 25184 24083 21698 27918 30748 35712 33761 26834 21823 32984 32046
15941C2046N147M050j8646r852j3956l408m347P839J925O053P299M837M518L572
$$ 32046 37193 41243 22597 12745 -1211 -4619 -8966 -1127 798 6851 14150 18987 23505 27077
15927B7077N146L027m213r763l596J4903K321q110j2708O21N220M803J8667J2442
$$ 27077 32223 35250 31037 21274 17678 32581 34902 26792 14084 14705 19925 24728 43395 55837
15913E5837j1276j1775K523Q821o994j5470j795O617P882N618J93m140p74j0994
$$ 55837 44561 32786 35309 44130 37136 21666 19871 26488 34370 39988 40181 36041 35267 24273
15899B4273j4423m311P367Q135K523J555J7914j0632j0481j732n079P351J1104
$$ 24273 9850 5539 12906 21041 23564 25119 43033 32401 21920 20188 15109 22460 33564
15886C3564N048o210n998p441M808J0342J396M996j885k197j0685J5599o880r893
$$ 33564 38612 32402 26404 18963 23771 34113 35509 40505 38620 36423 25738 41337 34457 24564
15872B4564K018N020J3377j2118q919J1564M429n17O326L844j3573j3852L486
$$ 24564 26582 31602 44979 32861 23942 35506 39935 39418 45744 49588 36015 22163 25649
15859B5649j4524L432P017M192O009Q237m991j4500Q254L712k2536q893N501J2126
$$ 25649 11125 14557 21574 25766 31775 40012 35021 20521 28775 32487 9951 1058 6559 18685
15845A8685J3783J4099k316p469k210Q639j649L568M765j477K737K802j1635j1820
$$ 18685 32468 46567 44251 36782 34572 43211 41562 45130 49895 48418 51155 53957 42322 30502
15831C0502O61L397n802l408n54M306P416O087j1530j0036k121m416M063J989
$$ 30502 31163 34560 28758 25350 24796 29102 36518 42605 31075 21039 18918 14502 18565 20554
15817B0554r902j3576J2928J8250M225P607K83o498L936k245j472j832j614O934
$$ 20554 10652 -2924 10004 28254 32479 40086 40369 33871 37807 35562 34090 32258 30644 37578
15803C7578Q595p10j812q632P186M602j1570n479M291o898J849l335l492M652
$$ 37578 46173 45463 43651 35019 42205 46807 35237 29758 34049 27151 29000 25665 22173 26825
15789B6825P679L167J2546J320k2935j1418J681K114M671J641O147L171M60J1695
$$ 26825 34504 37671 50217 51537 28602 17184 18865 20979 25650 27291 33438 36609 37069 48764
15775D8764L863p150o238m593p873L422j639m778N575P315N117N85J120n404L046
$$ 48764 52627 45477 39239 34646 26773 30195 28556 23778 29353 36668 41785 42370 43490 38086 41132
15760D1132P71j34J222J1829L14l288j0298L572p04q039o569O252L005P113J15
$$ 41132 41903 41769 42991 54820 55134 51846 41548 45120 44416 36377 29808 36060 39065 46178 46293
15745D6293K337N119q021K008J0845P990m349R5O178L807j7161j7778L957J588
$$ 46293 48630 53749 45728 47736 58581 66571 62222 62317 68495 72302 55141 37363 41320 42908
15731D2908l868P148p255j0054Q527J1819p13j4843j77O553p59L188p39L477l860
$$ 42908 39040 46188 38933 28879 37406 49225 48512 33669 33492 40045 39286 42474 41735 45212 41352
15716D1352O078L133J7r022n994o115K1496J3643P456j2179o837J967j0545p954
$$ 41352 47430 50563 50580 41558 35564 29449 50945 64588 72044 59865 53028 54995 44450 36496
15702C6496k510q80r406l047j847L54J3718J2139M907K496p923J511J2405J461
$$ 36496 33986 33106 23700 20653 18806 19160 32878 45017 49924 52420 44497 46008 58413 59874
15688E9874J760K881M155P040n744j3054j8281m578O725J5678Q159K215k0036
$$ 59874 61634 64515 68670 75710 69966 56912 38631 34053 40778 56456 64615 66830 46794
15675D6794j0666j3477M731J4106l312L161Q193R959r338L73L257M018r35m676
$$ 46794 36128 22651 27382 41488 38176 41337 49530 59489 50151 50524 53781 57799 56864 52188
15661E2188j0573p468L062n094l480k060P811K1801k46O644n94r26j893j4276
$$ 52188 41615 34147 37209 32115 28635 26575 34386 56187 55941 62585 61991 61065 59172 44896
15647D4896N93M475J4706j052j1585j527p534m822n823P670L684N497P337k506
$$ 44896 45489 49964 64670 63618 52033 50506 42972 38150 32327 39997 43681 49178 56515 54009
15633E4009R142l877o372p467K298J6361N463n170k3545j6862K192k664J2506
$$ 54009 63151 59274 52902 45435 47733 64094 69557 64387 40842 23980 26172 23508 36014
15620C6014K2558J464J448k086J2803L000j1893q452m881R581j632p876L506m91
$$ 36014 58572 60036 61484 59398 72201 75201 63308 54856 49975 59556 57924 50048 53554 53063
15606E3063J093M400O039j0222J999K353O856o034j954m53m655J369P539L785
$$ 53063 54156 58556 64595 54373 56372 58725 65581 59547 57593 57140 52485 53854 61393 65178
15592F5178J0120N900l379P77j292P07J4335J1200K902J9651m118k1613j5324
$$ 65178 75298 81198 77819 78596 77304 78011 92346 103546 106448 126099 121981 100368 85044
15579H5044k1958k0986m931O014N983O240K794L275J300K58p691m690k477P97
$$ 85044 63086 42100 37169 43183 49166 55406 58200 61475 62775 63033 55342 50652 48175 48972
15565D8972n776j0158J1816J5203N714K785J315m396Q655P581J2396j005j0336
$$ 48972 43196 33038 44854 60057 65771 68556 69871 65475 74130 81711 94107 93102 82766
15552H2766p431j2941Q66o709n634n508o902L755J378J1598O116K439O715J63
$$ 82766 75335 62394 63260 56551 50917 45409 38507 42262 43640 55238 61354 63793 70508 70671
15538G0671k910J165L052m900J929R965K001q825j1234L400O098M722K460l128
$$ 70671 67761 68926 71978 67078 69007 78972 80973 72148 60914 64314 70412 75134 77594 74466
15524G4466j0594Q15K1884J2054j571r685q078j687N83r904j893L594Q127r821
$$ 74466 63872 64687 86571 98625 97054 87369 79291 77604 78187 68283 66390 69984 78111 68290
15510F8290l665r63K225j169j5218o34J4174M662J537k853r444p230R24Q55J4163
$$ 68290 64625 63662 65887 64718 49500 48866 63040 67702 69239 66386 56942 49712 50636 51491 65654
15495F5654P569M379N081k114L515N024j4635k9569o308J6757M346j2182l237
$$ 65654 73223 77602 82683 80569 84084 89108 74473 44904 38596 55353 59699 47517 44280
15482D4280R176J5725q335o088M979P424K703j2963o550J0133j651o879l14M26
$$ 44280 53456 69181 60846 54758 59737 67161 69864 56901 50351 60484 58833 51954 51640 52066
15468E2066P043J132n379J041p798m725K738J3507L971N6J4579Q624k320p415
$$ 52066 59109 60241 54862 55903 48105 43380 46118 59625 63596 63652 78231 86855 84535 77120
15454G7120Q244P752L522J027j6569p133M466l83o285p5N090L019K831k73p490
$$ 77120 85364 93116 96638 97665 81096 73963 78429 78046 71761 71686 76776 79795 82626 82353 74863
15439G4863j1803J059k236O799K820p162p926R483J4063J3670K700R25n122l806
$$ 74863 63060 64119 61883 68682 71502 64340 56414 65897 79960 93630 96330 97255 92133 88327
15425H8327l823O153L096k88p66P969j2584k4J3980r518q436P267O356M405j696
$$ 88327 84504 90657 93753 93465 92699 100668 88084 88060 102040 92522 84086 91353 97709 102114 100418
15410A00418M71J733K720q261K473o216j420k963L862O585p261k707K172L909
$$ 100418 100889 102622 105342 97081 99554 93338 91918 88955 92817 99402 92141 89434 91606 95515
15396I5515L438j0180q251J5759J2011m749K796J421p289O497L978K288O585Q897
$$ 95515 98953 88773 80522 96281 108292 103543 106339 107760 100471 106968 110946 113234 119819 128716
15382A28716P49j353m197l633O440R334J8581M719O033m571l436j4950O07p56
$$ 128716 129465 128112 123915 120282 126722 136056 154637 159356 165389 160818 157382 142432 143039 142283
15368A42283k375m493k025m113j3479n841M296k714j2252J395J1171M452M534
$$ 142283 139908 135415 133390 129277 115798 109957 114253 111539 99287 100682 111853 116305 120839
15355A20839j340l786k39J1783r088j2477q515k254j972Q971J124N790m625m452
$$ 120839 119499 115713 115474 127257 118169 105692 97177 94923 92951 101922 103046 108836 104211 99759
15341I9759J4018P193M369o68M855n247j6427o207P889O51K054j410j5260J6749
$$ 99759 113777 120970 125339 124671 129526 124279 107852 101645 109534 110185 112239 110829 95569 112318
15327A12318J3827M369j63q368j5367p150j974j1147q56O028L614m495J190K747
$$ 112318 126145 130514 130351 121983 106616 99466 97492 86345 85489 91517 95131 90636 91826 94573
15313I4573J3343J1618N052o445j0335q737M308oJ8796l554M587J0731j0079j4368
$$ 94573 107916 119534 124586 118141 107806 99069 103377 103371 122167 118613 123200 133931 123852 109484
15299A09484M993L980L496n392j0496J969J264p843l199R116J2026j160k369j6806
$$ 109484 114477 118457 121953 116561 106065 108034 109298 101455 98256 107372 119398 118238 115869 99063
15285I9063k002n35P328P306J622p343j0793M075J1490r424o120O138Q77J1184
$$ 99063 97061 96526 103854 111160 112782 105439 94646 98721 110211 100787 94667 100805 101682 112866
15271A12866J975K59J5949Q527j3616J964k115k091l986n350J442k243l054J3379
$$ 112866 114841 115100 131049 139576 125960 127924 125809 123718 119732 114382 115824 113581 110527 123906
15257A23906k056n984Q208O30p387O0J5501k183J956L654J81m755j2292o912J9441
$$ 123906 121850 115866 124074 124704 117317 117377 132878 130695 132651 136305 136486 131731 119439 112527 131968
15242A31968J901j3821m164l323L684K314R824J600J2008K239n055N344J1828
$$ 131968 133869 120048 115884 112561 116245 118559 128383 129983 141991 144230 139175 144519 156347
15229A56347n099l945M658j159k857p070j463j4295n205R072K57l107J451M040
$$ 156347 151248 147303 151961 150802 147945 140875 139412 125117 119912 128984 129241 126134 127585 131625
15215A31625L505J1636J6076J1698J0246K32j356q377n714j7373j6350J93J2907
$$ 131625 135130 146766 162842 174540 184786 185018 183662 175285 169571 152198 135848 136041 148948
15202A48948J0453L159J0410K116N073j956K360p529j2856p488O341N612J1349
$$ 148948 159401 162560 172970 175086 180159 178203 180563 173034 160178 152690 159031 164643 175992
15189A75992p529j1533l141J0181n543r480J4050L658n085O312m386k013j420
$$ 175992 168463 156930 153789 163970 158427 148947 162997 166655 161570 167882 163496 161483 160063
15176A60063J029M382n297J292J89L3j26j2461p638P051o535q921L589R873L019
$$ 160063 161092 165474 160177 161469 161658 161691 161565 149104 141466 148517 141982 133061 136650 146523 149542
15161A49542K033J782J2255l825j352k391j503N919Q615J2142M059l551J313j379
$$ 149542 151575 153357 165612 161787 160435 158044 156541 162460 171075 183217 187276 183725 185038 183659
15147A83659N019l339J8498m580j8596k572p049J965K0516m689M96K815P366O482
$$ 183659 188678 185339 203837 199257 180661 178089 171040 173005 193521 188832 189328 192143 199509 205991
15133B05991J4162J0919J999N846Q511K1220J2324J2928K3531K2159L4359L1805
$$ 205991 220153 231072 233071 238917 247428 268648 280972 293900 317431 339590 373949 405754
15121D05754K4962L0695K1466K8630L6768P1779J10687J27361J62333K35777L12330
$$ 405754 430716 461411 482877 511507 548275 620054 730741 858102 1020435 1256212 1568542
15110A568542M04661M78636M90750L94194J36051k35452n22992o32332n32704
$$ 1568542 1973203 2451839 2942589 3336783 3472834 3237382 2714390 2082058 1549354
15101A549354l52793k23504j27820r3777o6041n5949l3036l1140k7174j7144j7057
$$ 1549354 1196561 973057 845237 751460 685419 629470 596434 565294 538120 520976 503919
15090E03919k4913k8347k0443n706O326Q498J0870R898p000j817n632k0797M184
$$ 503919 479006 450659 430216 424510 430836 439334 450204 460102 453102 451285 445653 424856 429040
15077D29040N672j2634o093k1345l1456k5355j0427J283R947j2171m634j0965
$$ 429040 434712 422078 415985 394640 363184 337829 327402 328685 338632 326461 321827 310862
15065C10862q528O67l984j2955l013R899Q006o511k2084l256o499j0540j2055
$$ 310862 302334 303001 299017 286062 283049 292948 300954 294443 272359 269103 262604 252064 240009
15052B40009Q558M850J892o039j3323P561N640r344o475j0449m518Q32O468J2676
$$ 240009 248567 253417 255309 249270 235947 243508 249148 239804 233329 222880 218362 219194 225662 238338
15038B38338R147k30l982j4181r205O527M092Q200N429N231r841L091J3794R950
$$ 238338 247485 247255 243273 229092 219887 226414 230506 238706 244135 249366 239525 242616 256410 266360
15024B66360n635j723r86J245L174k3521k3603K609O123l96j0382N913Q5R01O683
$$ 266360 260725 259002 258016 259261 262435 238914 215311 217920 224043 223647 213265 219178 219263 220164 226847
15009B26847m702K1008J1724J0834J9142N731k3366j3672P095m525K528k6918
$$ 226847 222145 243153 254877 265711 284853 290584 267218 253546 260641 256116 258644 231726
14997B31726k4034O111J1114J7795o617q621P481K661m383p779n9l599P756K1929
$$ 231726 207692 213803 224917 242712 236095 227474 234955 237616 233233 225454 225395 221796 229552 251481
14983B51481O939J0807p428j538l637j1304r91j1K532P295N430J0383l242J455
$$ 251481 258420 269227 261799 260261 256624 245320 244329 244318 246850 254145 259575 269958 266716 268171
14969B68171p332M660N423r619j0429j261J3801R689M686j999j1031r869o538
$$ 268171 260839 265499 270922 261303 250874 249613 263414 273103 277789 275790 264759 254890 248352
14956B48352o18M112N191n94n646P570j1441N412K056L169K910l087O451J2620
$$ 248352 247734 251846 257037 256443 250797 258367 246926 252338 254394 257563 260473 257386 263837 276457
14942B76457L680j259j670q092O560L657q075M900R891J4472o923r121R66k165
$$ 276457 280137 278878 277208 269116 275676 279333 271258 276158 286049 300521 293598 284477 285443 283278
14928B83278k01J751K558R767k480j0052O1n463J336J7694L502j2912j1901K062
$$ 283278 283077 284828 287386 297153 294673 284621 284682 279219 280555 298249 301751 288839 276938 279000
14914B79000R797q542P8J4970J0816J925k628R799J669n610N360j0135m412R753
$$ 279000 288797 280255 280333 295303 306119 308044 305416 315215 316884 311274 316634 306499 302087 311840
14900C11840o944p105k506L090r85J5038R657M049j2072L550O553N074o124k87
$$ 311840 304896 297791 295285 298375 297390 312428 322085 326134 314062 317612 324165 329239 323115 322828
14886C22828K078K236P929J1087Q049J7212P825j1162j163J0043J1399J5422J174
$$ 322828 324906 327142 335071 346158 354207 371419 379244 368082 366919 376962 388361 403783 404957
14873D04957n370J5293P594p466n194J1589J2822J6887J9005J2837J3430J9743
$$ 404957 399587 414880 422474 415008 409814 421403 434225 451112 470117 482954 496384 516127
14861E16127K1334Q503J2021K8705M7340M1888J5785J8575L5883L5704L3123O0232
$$ 516127 537461 545964 557985 586690 634030 675918 691703 710278 746161 781865 814988 875220
14849H75220Q4435J24288J65890J87109J74265J39974Q0564l1862j30710j92128
$$ 875220 959655 1083943 1249833 1436942 1611207 1751181 1831745 1799883 1669173 1477045
14839A477045j97318j66095j41743j04424q8509o1792m7440k6153k4809j1049
$$ 1477045 1279727 1113632 971889 867465 778956 717164 669724 643571 618762 607713
14829F07713j7054p306j6145k4214k3150k4790j4477l940j323p819J8013L406
$$ 607713 590659 583353 567208 542994 519844 495054 480577 476637 475314 467495 485508 488914
14817D88914l772K399j9532j2332k007J946n84K706j94q518M803m174L359L637
$$ 488914 485142 487541 468009 455677 453670 455616 455032 457738 457544 449026 453829 449655 453014 456651
14803D56651n938o55n030k7111j5796K52n435j6999j0304j0200J2370K7988J7791
$$ 456651 450713 450058 445028 417917 402121 402373 396938 379939 369635 359435 371805 399793 417584
14790D17584J0442J3551K937j3927n084n204P973N237J928R054J1119M507L929
$$ 417584 428026 441577 444514 430587 425503 420299 428272 433509 435437 444491 455610 460117 464046
14777D64046J1186J399k191p822j7098L306R299K568M122o785j813j7121p271
$$ 464046 475232 476631 474440 466618 449520 452826 462125 464693 468815 462030 460217 443096 435825
14764D35825k603K087o39K0216J1524p283k6274n595P42l220m489o265n436J743
$$ 435825 433222 435309 434670 454886 466410 459127 432853 427258 428000 424780 420291 414026 408590 410333
14750D10333P582R481o425J9P283R72n180J0673m085o6K0749N886l673j4354l718
$$ 410333 417915 427396 420971 420990 428273 429245 424065 434738 430653 430587 451336 457222 453549 439195 435477
14735D35477J772r404m925K0693R503L229N088j1981k783P286L407Q595O158k070
$$ 435477 437249 427845 422920 443613 453116 456345 461433 449452 446669 453955 457362 465957 472115 470045
14721D70045r164M470O747j558r050j043J5237J4208k707P516N077j1101q414
$$ 470045 460881 465351 472098 470540 461490 460447 475684 489892 487185 494701 499778 488677 480263
14708D80263N346P321j6333j009L785M212l39J3669K119j9557j7420k102q094
$$ 480263 485609 492930 476597 475588 479373 483585 483246 496915 499034 479477 462057 459955 451861
14695D51861j3158O276N319J3558J1966J3186n460K989K017j155k970N722j4989
$$ 451861 438703 444979 450298 463856 475822 489008 483548 486537 488554 487399 484429 490151 475162
14682D75162j9226r218J499R583J5860O433J821j5022K61m726j555L567N168j354
$$ 475162 455936 446718 448217 457800 473660 480093 481914 466892 467153 462427 460872 464439 469607 468253
14668D68253P692L661k982M665L201N837Q814J3935j436m580j1832J1841J1102
$$ 468253 475945 479606 476624 481289 484490 490327 499141 513076 511640 507060 495228 507069 518171
14655E18171J4670L2066N238j5486l819J5569J7324J1303K8810L6947L3246L5733
$$ 518171 532841 564907 570145 554659 550840 566409 583733 595036 623846 660793 694039 729772
14643G29772K8597K9530K8061J9326O727p381k787q957k9960k8348k1473k3456
$$ 729772 758369 787899 815960 835286 842013 834632 831845 822888 792928 764580 743107 719651
14631G19651k9244k2498k5409K448L768k1280j0908j283k360o04l749J271m54
$$ 719651 690407 667909 642500 644948 648716 627436 616528 615245 612885 612281 608532 609803 609349
14618F09349l131j2941q034m417K0100J4201r728r867r479p302k785j913K106
$$ 609349 606218 593277 585243 580826 600926 615127 605399 595532 586053 578751 575966 574053 576159
14605E76159n702N604J4158J2369J4842l59N11P042j3198o408L285j5305q991
$$ 576159 570457 576061 590219 602588 617430 617071 617582 624624 611426 605018 608303 592998 584007
14592E84007j5080l989j505j3740r018P565O196m784q281k18P422O696J560m908
$$ 584007 568927 564938 563433 549693 540675 548240 554436 549652 541371 541153 548575 555271 556831 551923
14578E51923r706R166M305J1970J7197R763J489K8605K7475P341J3653K3503J9521
$$ 551923 542217 551383 555688 567658 584855 594618 596107 624712 652187 659528 673181 696684 716205
14565G16205l053j5722k2590j8064L226M81Q389j122J1980J657j8169j0317N667
$$ 716205 713152 697430 674840 656776 660002 660483 668872 667750 679730 681387 663218 652901 658568
14552F58568Q311J982O35J0340N553o332l2860k7519j6255m2381k8697k3929k8864
$$ 658568 666879 668861 669496 679836 685389 679057 646197 618678 602423 560042 531345 507416 478552
14539D78552r971K631K2483K4704M2784K4203j754P270J4923K1290Q315J1142
$$ 478552 468581 471212 493695 518399 561183 585386 583632 590902 605825 627115 635430 646572
14527F46572K1089J6436k401J2022K1244K5854K4823J7552O415J6289K0994K7522
$$ 646572 667661 684097 681696 693718 714962 740816 765639 783191 789606 805895 826889 854411
14515H54411N6946N3586N9567Q6629P5526M0753K3079N39l0649l3801m1170k9482
$$ 854411 911357 964943 1024510 1111139 1186665 1227418 1250497 1251036 1220387 1186586 1145416 1115934
14503A115934j0214j0515j4108p794j0258k122j2759p915J338o441K18J3605k505
$$ 1115934 1105720 1095205 1081097 1073303 1063045 1060923 1048164 1040249 1041587 1035146 1035364 1048969 1046464
14490A046464n01K347K5183L0843K1313L3139K1074J7102K2163K8831L5073L9096
$$ 1046464 1045963 1048310 1073493 1104336 1125649 1158788 1179862 1196964 1219127 1247958 1283031 1322127
14478A322127K1090L491K8029J6871l621J0642O208J4119L6125J7918R592J5790
$$ 1322127 1343217 1346708 1374737 1391608 1387987 1398629 1404837 1418956 1455081 1472999 1482591 1498381
14466A498381J7741L381Q328K8524J1767K3999K3263J0966P502J0294L8901L9836
$$ 1498381 1516122 1519503 1527831 1556355 1568122 1592121 1615384 1626350 1633852 1644146 1683047 1722883
14454A722883L9269K7607L5037M1441M3812N4245N6775N2756N1085M4903M6152
$$ 1722883 1762152 1789759 1824796 1866237 1910049 1964294 2021069 2073825 2124910 2169813 2215965
14443B215965N2014N0705N5034Q2927P6740P7011P0272Q1402Q2421Q7558R3632
$$ 2215965 2267979 2318684 2373718 2456645 2533385 2610396 2680668 2762070 2844491 2932049 3025681
14432C025681J09912J21482J09207J16056J38255J59066J66187J80717K12715
$$ 3025681 3135593 3257075 3366282 3482338 3620593 3779659 3945846 4126563 4339278
14423D339278K60090K83224K94283L32138L65591M09955M58111N26604N84763
$$ 4339278 4599368 4882592 5176875 5509013 5874604 6284559 6742670 7269274 7854037
14414G854037O54153P54329Q62773R80826J121450J288215J421327J572106J721794
$$ 7854037 8508190 9262519 10125292 11106118 12227568 13515783 14937110 16509216 18231010
14405A8231010J881274K062504K272298K526858K862765L274333L812735M530248
$$ 18231010 20112284 22174788 24447086 26973944 29836709 33111042 36923777 41454025
14397D1454025N497195O805071Q559229J0907663J3917748J7641188K2062750
$$ 41454025 46951220 53756291 62315520 73223183 87140931 104782119 126844869
14390A26844869K7008965L1795470L4919915L4149801K7156674J2696957p556082
$$ 126844869 153853834 185649304 220569219 254719020 281875694 294572651 287016569
14383B87016569k7367072l9030492l9810082l3665087k5894692j9277135j4364629
$$ 287016569 259649497 220619005 180808923 147143836 121249144 101972009 87607380
14376H7607380j0856648q346370o541531n231207m265628l542689l034345k655544
$$ 87607380 76750732 68404362 61862831 56631624 52365996 48823307 45788962 43133418
14368D3133418k313338j989676j701181j439345j187548r54770p79727o51911
$$ 43133418 40820080 38830404 37129223 35689878 34502330 33547560 32767833 32115922
14360C2115922n45978n42068o58008q38711j043976j194202j241211j238777j217281
$$ 32115922 31569944 31027876 30369868 29531157 28487181 27292979 26051768 24812991 23595710
14351B3595710j170712j137954j069196r87386r18349q52559q31181p72433p24164
$$ 23595710 22424998 21287044 20217848 19230462 18312113 17459554 16628373 15855940 15131776
14342A5131776o76376o49857o03989n59726n18389m88101m57774m27511m08913
$$ 15131776 14455400 13805543 13201554 12641828 12123439 11635338 11177564 10750053 10341140
14333A0341140l86119l62893l53955l15538l02391k73760k52536k51502k30186
$$ 10341140 9955021 9592128 9238173 8922635 8620244 8346484 8093948 7842446 7612260
14324G612260k27098k22076k15840j94607j93140j70248j65035j58515j51531
$$ 7612260 7385162 7163086 6947246 6752639 6559499 6389251 6224216 6065701 5914170
14315E914170j57445j55799j34192j17172j26958j23550j24440j15004r9848j12119
$$ 5914170 5756725 5600926 5466734 5349562 5222604 5099054 4974614 4859610 4759762 4647643
14305D647643j11136j10436r5096o8406p5658p7237o8814p2502p7258p4083p3722
$$ 4647643 4536507 4426071 4330975 4262569 4186911 4109674 4040860 3968358 3891100 3817017 3743295
14294C743295n6656n0166o5833m7740l8595n3630l8891k3159k2477k2976k6696
$$ 3743295 3686639 3636473 3570640 3522900 3484305 3430675 3391784 3368625 3346148 3323172 3296476
14283C296476k4861l0296k6596l6296l7574k9514l7323n3898m0938l8663l2785
$$ 3296476 3271615 3241319 3214723 3178427 3140853 3111339 3074016 3020118 2979180 2940517 2907732
14272B907732j9987j8467j5100j0689j9119k2669k1972l7740k1221q422k6515
$$ 2907732 2887745 2869278 2854178 2843489 2824370 2801701 2779729 2741989 2720768 2712346 2685831
14261B685831j8862J3262K7984M2446M9255L1274K8819J3401N674q552j0389j4729
$$ 2685831 2666969 2680231 2708215 2750661 2799916 2831190 2860009 2873410 2879084 2870532 2860143 2845414
14249B845414l1913j2778n544q372j2036j8921p815j228n267l903K4024R601J0579
$$ 2845414 2813501 2800723 2795179 2786807 2774771 2755850 2748035 2746807 2741540 2737637 2761661 2771262 2781841
14236B781841J4898J1379K0227J3793J8106K7791J7854k4356l0751m1778l1605
$$ 2781841 2796739 2808118 2828345 2842138 2860244 2888035 2905889 2881533 2850782 2809004 2777399
14225B777399l0850k4132j4287m439O810M476J1046J4347R088J5426n3P816j0740
$$ 2777399 2746549 2722417 2708130 2703691 2710501 2714977 2726023 2740370 2749458 2764884 2764831 2772647 2761907
14212B761907o144j4787m939l223j5445j9318j2787O065j975j20J3257K985L13
$$ 2761907 2755763 2740976 2736037 2732814 2717369 2698051 2685264 2691329 2689354 2689234 2702491 2705476 2705789
14199B705789K678J2025K1162K8058J8008q280j3612j5369j4112O349P466n806
$$ 2705789 2708467 2720492 2741654 2769712 2787720 2779440 2765828 2750459 2736347 2742696 2750162 2744356
14187B744356n732j5337p178j2713j0496j7415j9300j8562j5486j7197l087L12
$$ 2744356 2738624 2723287 2716109 2703396 2692900 2675485 2656185 2637623 2622137 2604940 2601853 2602165
14175B602165j6242q623l2654j3843m008J189J0008O063O177j6240k3855j724
$$ 2602165 2585923 2577300 2544646 2530803 2526795 2527984 2537992 2544055 2550232 2533992 2510137 2508413
14163B508413J2985P544j1648q808r474l214j3123j7266j5857q457q109O247k621
$$ 2508413 2521398 2528942 2517294 2508486 2499012 2495798 2482675 2465409 2449552 2441095 2432986 2439233 2436612
14150B436612q841L457J3920J6788Q401j014j4995j1701k536J4176J0490J5990
$$ 2436612 2427771 2431228 2445148 2461936 2470337 2469323 2454328 2442627 2440091 2454267 2464757 2480747
14138B480747j948J688m971O447O132j0773j3040p317N863M088l383J739j6052
$$ 2480747 2478799 2480487 2475516 2481963 2488095 2477322 2464282 2456965 2462828 2466916 2463533 2465272 2449220
14125B449220j1372j914l115j4982k1688j3339q175l506l271O989M132O121p807
$$ 2449220 2437848 2435934 2432819 2417837 2396149 2382810 2374635 2371129 2367858 2374847 2378979 2385100 2377293
14112B377293j5352J1396K0641K0773Q658n552m913m28N649N240l603o784K488
$$ 2377293 2361941 2373337 2393978 2414751 2423409 2417857 2412944 2412516 2418165 2423405 2419802 2413018 2415506
14099B415506l203q532N443M014K137M155q173m40n200J809p51R284J3114p790
$$ 2415506 2412303 2403771 2409214 2413228 2415365 2419520 2411347 2410907 2405707 2407516 2406765 2416049 2429163 2421373
14085B421373N69M027O870m835o584l7K721M133N775j127P04L989K724n809j3764
$$ 2421373 2421942 2425969 2432839 2428004 2421420 2421383 2424104 2428237 2434012 2432885 2433589 2437578 2440302 2434493 2420729
14070B420729k6566n267O246k055p912j459J2835M245l445p31O13R580k559l931
$$ 2420729 2394163 2388896 2395142 2393087 2385175 2383716 2396551 2400796 2397351 2396620 2397233 2406813 2404254 2400323
14056B400323n005l146q59K818J6974J2925J019q585J469l554j3273q664o837
$$ 2400323 2395318 2392172 2391313 2394131 2411105 2424030 2425049 2416464 2417933 2414379 2401106 2392442 2385605
14043B385605p450K662O744k358Q636j631k0050J113m815q395Q466J2442l478
$$ 2385605 2378155 2380817 2387561 2385203 2393839 2392208 2372158 2373271 2368456 2360061 2368527 2380969 2377491
14030B377491P085n855j2526j6388p943Q577J2883l085k1618o855L123P97N786
$$ 2377491 2384576 2378721 2366195 2349807 2341864 2350441 2363324 2360239 2338621 2331766 2334889 2335686 2341472
14017B341472L386p267M111J0140j1457q309j3907j4212N073J2042k790K662q414
$$ 2341472 2344858 2337591 2341702 2351842 2340385 2332076 2318169 2303957 2309030 2321072 2318282 2320944 2312530
14004B312530Q808O695M396J159p302m303l649l703M466l216l909n774m53J663
$$ 2312530 2321338 2328033 2332429 2333588 2326286 2321983 2318334 2314631 2319097 2315881 2311972 2306198 2305745 2307408
13990B307408J5255o116J831Q257J6592o255l0468j2722J4008M547N697j681p654
$$ 2307408 2322663 2316547 2318378 2326635 2343227 2336972 2306504 2293782 2307790 2312337 2318034 2316353 2308699
13977B308699o640j104l32n249O380N413q870Q495N487L109J1727M142j3882j2065
$$ 2308699 2302059 2300955 2300623 2295374 2301754 2307167 2298297 2306792 2312279 2315388 2327115 2331257 2317375 2305310
13963B305310R16J315j3996k968J5324J0231k38q427p574J000O26P0J5718J7454
$$ 2305310 2306226 2307541 2293545 2290577 2305901 2316132 2315894 2307467 2299893 2300893 2301519 2301589 2317307 2334761
13949B334761p11r518o600M685P512J311J4293R942J3527J7600J1479J349QJ9169
$$ 2334761 2334050 2324532 2317932 2322617 2330129 2331440 2345733 2355675 2369202 2386802 2398281 2399630 2399638 2418807
13935B418807L0280K9172K2913L6516M4129M4585M1035R1423J17269J34213J32239
$$ 2418807 2449087 2478259 2501172 2537688 2581817 2626402 2667437 2758860 2876129 3010342 3142581
13924C142581J55532J73151J53828R6520m568r5340j89510k31478k09575j73501
$$ 3142581 3298113 3471264 3625092 3721612 3717044 3621704 3432194 3200716 2991141 2817640
13914B817640j26824p9100m4958l2969l7404m0594j8290j2524k5257k8173j6766
$$ 2817640 2690816 2611716 2566758 2533789 2496385 2455791 2437501 2424977 2399720 2371547 2354781
13903B354781q777j3612j3860j6813J535J8396o52k1459j2003J687o147p467n824
$$ 2354781 2346004 2332392 2318532 2301719 2303254 2321650 2320998 2299539 2287536 2289223 2283076 2275609 2269785
13890B269785k189j6311j1817j1873q451j6062j5832k338l451o782m655j3228
$$ 2269785 2267596 2251285 2239468 2227595 2219144 2203082 2187250 2184912 2181461 2174679 2170024 2156796
13878B156796L007Q926j2162P476O682L379p815j4375k385j1028k897N62j2403
$$ 2156796 2159803 2168729 2156567 2164043 2170725 2174104 2166289 2151914 2149529 2138501 2135604 2136166 2123763
13865B123763n238L38n497l105n279j0009j1541o597K490L600O155M167j1444
$$ 2123763 2118525 2118863 2113366 2110261 2104982 2094973 2083432 2076835 2079325 2082925 2089080 2093247 2081803
13852B081803k177j120K379J68J4373R02j6449K823j0099m684n319n121j4267
$$ 2081803 2079626 2078506 2080885 2081053 2095426 2096328 2079879 2082702 2072603 2067919 2062600 2057479 2043212
13839B043212K76M006Q901j5062r160J2846j564q264q567j323j0508N284J7316
$$ 2043212 2043488 2047494 2056395 2041333 2032173 2045019 2043455 2035191 2026624 2025301 2014793 2020077 2037393
13826B037393Q924K47k2119r125O942l463m091O219j6485p943J0973k770j3930
$$ 2037393 2046317 2046564 2024445 2015320 2022262 2018799 2014708 2020927 2004442 1996499 2007472 2004702 1990772
13813A990772K384m845k674J0196m326j2119K491N535K446j2682L32L214M71j2304
$$ 1990772 1993156 1988311 1985637 1995833 1991507 1979388 1981879 1987414 1989860 1977178 1977510 1980724 1981195 1968891
13799A968891J258J281p699l153k490Q557n974M926N261n580p326m931n390j5006
$$ 1968891 1970149 1971430 1963731 1960578 1958088 1966645 1960671 1965597 1970858 1965278 1957952 1953021 1947631 1932625
13785A932625q491K756Q707k312j8038l174r374L212N942M548k978k705k780K631
$$ 1932625 1924134 1926890 1935597 1933285 1915247 1912073 1902699 1905911 1911853 1916401 1913423 1910718 1907938 1910569
13771A910569r18O794M477r863n136j1771p99o296m29m482n715o519l146O362
$$ 1910569 1909651 1916445 1920922 1911059 1905923 1894152 1893353 1887057 1886628 1882146 1876431 1869912 1866766 1873128
13757A873128Q000l498j651j4063j222q356J125q36j2670o26n736m994J2784P318
$$ 1873128 1881128 1877630 1875979 1861916 1860694 1852338 1853463 1852627 1839957 1839331 1833595 1828601 1841385 1848703
13743A848703l051n771k6013M752N871p501k999K492j364K146N139j0371j6863
$$ 1848703 1845652 1839881 1813868 1818620 1824491 1816990 1813991 1816483 1815119 1817265 1822404 1812033 1795170
13730A795170K154L800N455O631o980k6216q747K506J8480Q719p360l154j4173
$$ 1795170 1797324 1801124 1806579 1813210 1806230 1780014 1771267 1773773 1792253 1800972 1793612 1790458 1776285
13717A776285M789J719N42Q532n157k3170j711N232j1770j3840N973J0747J6333
$$ 1776285 1781074 1782793 1783335 1791867 1786710 1763540 1761829 1767061 1755291 1741451 1747424 1758171 1774504
13704A774504k280j4408m295O429j1641j6936M520J0572m567j8278j0075M047
$$ 1774504 1772224 1757816 1753521 1759950 1748309 1731373 1735893 1746465 1741898 1723620 1713545 1717592
13692A717592K536l522j2440j3035M255L098r673j3880O233K0017J0027j4079
$$ 1717592 1720128 1716606 1704166 1691131 1695386 1698484 1688811 1674931 1681164 1701181 1711208 1697129
13680A697129j1300O810R641k334q615q882l757j3480r757p070q512J363N081
$$ 1697129 1685829 1692639 1702280 1699946 1691331 1682449 1678692 1665212 1655455 1648385 1639873 1641236 1646317
13667A646317J4658j202j2446j366k619q849O221L452m195l689j0459o705J8548
$$ 1646317 1660975 1659773 1647327 1645961 1643342 1634493 1640714 1644166 1639971 1636282 1625823 1619118 1637666
13654A637666K344o408k356P831n620J1085n671j2843j3414Q189J5053j4329j6760
$$ 1637666 1640010 1633602 1631246 1639077 1633457 1644542 1638871 1626028 1612614 1620803 1635856 1621527 1604767
13641A604767o378L278Q095P322j2948k1529j4878L239P458P412l347N149J2158
$$ 1604767 1598389 1601667 1609762 1617084 1604136 1582607 1567729 1570968 1578426 1585838 1582491 1587640 1599798
13628A599798M62r777r484m727N876J1753m106j7525j7212M437L472j191j0368
$$ 1599798 1600260 1590483 1580999 1576272 1582148 1593901 1589795 1572270 1555058 1559495 1562967 1561776 1551408
13615A551408l667L641o476q321r112j0974N168J1054l447q069L314M387O944
$$ 1551408 1547741 1551382 1544906 1536585 1527473 1516499 1521667 1532721 1529274 1521205 1524519 1528906 1535850
13602A535850J010o759j7014q13k848R68j1454j911l418Q07j756j3599J0104J5814
$$ 1535850 1536860 1530101 1513087 1512274 1509426 1510394 1498940 1497029 1493611 1494418 1492662 1479063 1489167 1504981
13588A504981J63J834P272m450j6325j5661N810m174k206L253J0806L870k125
$$ 1504981 1505144 1506978 1514250 1509800 1493475 1477814 1483624 1479450 1477244 1480497 1491303 1495173 1493048
13575A493048Q460j1461j7258j7098j360N80o799r768q996q608J0040J2589J6941
$$ 1493048 1501508 1490047 1472789 1455691 1454331 1454911 1448112 1438344 1429348 1420740 1430780 1443369 1460310
13562A460310K826j3794Q958l651j8055l570l161o82M756p419k825l412j6364
$$ 1460310 1463136 1449342 1458300 1454649 1436594 1433024 1429863 1429181 1433937 1426518 1423693 1420281 1403917
13549A403917q319O416P372J964j2993K834j0830J341J3759L164n694j7255l268
$$ 1403917 1395598 1402014 1409386 1411350 1398357 1401191 1390361 1391702 1405461 1408625 1402931 1385676 1382408
13536A382408J256R356N799r740j2195q778M31R120j20p150j4192j0548J4109
$$ 1382408 1383664 1393020 1398819 1389079 1376884 1368106 1368537 1377657 1377537 1370387 1356195 1345647 1359756
13523A359756J801K805L550L771Q447m952j0634M02Q080j4998j1290j5711m774
$$ 1359756 1361557 1364362 1367912 1371683 1380130 1375178 1364544 1364946 1373026 1358028 1346738 1331027 1326253
13510A326253Q178J350j903M219J427j613j321J544m200p779q139J3300N790k2235
$$ 1326253 1334431 1335781 1333878 1338097 1339524 1337911 1336590 1338134 1333934 1326155 1318016 1331316 1337106 1314871
13496A314871j5561J687Q434R425O918m876p271n482R711N054o285J121k997p107
$$ 1314871 1299310 1300997 1309431 1318856 1325774 1320898 1313627 1308145 1317856 1322910 1316625 1317746 1314749 1307642
13482A307642j1184O934O24j42j2393j0738n681R14j748q639n483l663O972K684
$$ 1307642 1296458 1303392 1304016 1303874 1291481 1280743 1275062 1275976 1274228 1265589 1260106 1256443 1263415 1266099
13468A266099j1373P677J1293P126n948q292m701j9801L612P749M736K259J353
$$ 1266099 1254726 1262403 1273696 1280822 1274874 1266582 1261881 1242080 1245692 1253441 1258177 1260436 1261789
13455A261789l665j0433O696J804j069K198j4342j0210O258j006k687j7116R386
$$ 1261789 1258124 1247691 1254387 1256191 1255122 1257320 1242978 1232768 1239026 1238020 1235333 1218217 1227603
13442A227603M927J3460o90j3484n415N55J275Q164j222J225q818l667m397m65
$$ 1227603 1232530 1245990 1245300 1231816 1226401 1226956 1228231 1236395 1235173 1236398 1227580 1223913 1219516 1219051
13428A219051l30q590q876m320n556M588J338q848Q619L631p12j1009j898O387
$$ 1219051 1218721 1210131 1201255 1196935 1191379 1195967 1197305 1188457 1197076 1200707 1199995 1188986 1187088 1193475
13414A193475M029p095j0477O516K189j0134M295n628k724q62j58J248N275N489
$$ 1193475 1197504 1190409 1179932 1186448 1188637 1178503 1182798 1177170 1174446 1173584 1173426 1174674 1179949 1185438
13400A185438n619r699j1127O669l013j8131p124P461L146J7294O054o875k508
$$ 1185438 1179819 1170120 1158993 1165662 1162649 1144518 1137394 1144855 1148001 1165295 1171349 1164474 1161966
13387A161966N04O028j0481q947R937Q12j3414j2436o205J006n684j722p376P973
$$ 1161966 1162470 1168498 1158017 1149070 1159007 1159819 1146405 1133969 1127764 1128770 1123086 1121364 1113988 1121961
13373A121961J1749M082R910L588n378j8591M996K905q669m329o142N631L057
$$ 1121961 1133710 1137792 1147702 1151290 1145912 1127321 1132317 1135222 1126553 1122224 1116082 1121713 1124770
13360A124770L677k715j4460o481J743n664p880J64J1342K3938r085r391j0698
$$ 1124770 1128447 1125732 1111272 1104791 1106534 1100870 1092990 1093154 1104496 1128434 1119349 1109958 1099260
13347A099260o600O912L871r223j0046K810P928O2o123j01p741j1607J18J1715
$$ 1099260 1092660 1099572 1103443 1094220 1084174 1086984 1094912 1094974 1088851 1088750 1081009 1069402 1069520 1081235
13333A081235P555R371l321r073j646N5q163n149m082q257M337K600n592m773
$$ 1081235 1088790 1098161 1094840 1085767 1084121 1084176 1076013 1070864 1066782 1058525 1062862 1065462 1059870 1055097
13319A055097n170k352K836J6133k689q078K699R463L952j7857p191r556r77J3788
$$ 1055097 1049927 1047575 1050411 1066544 1063855 1055777 1058476 1067939 1071891 1054034 1046843 1037287 1036310 1050098
13305A050098Q943j0936k006o599m826k27L547j0326K416o928j398P148O964O16
$$ 1050098 1059041 1048105 1046099 1039500 1034674 1034447 1037994 1027668 1030084 1023156 1021758 1028906 1035870 1036486
13291A036486K862q604l337n177q102M228J4968j546n578l651J2236M049K965
$$ 1036486 1039348 1030744 1027407 1022230 1014128 1018356 1033324 1031778 1026200 1022549 1034785 1038834 1041799
13278A041799n359j7026j4390N6P598n881l115Q301Q090l789p002j3242j840k136
$$ 1041799 1036440 1019414 1005024 1005080 1012678 1006797 1003682 1011983 1020073 1016284 1009282 996040 994200 992064
13264I92064N622N215K51L245J0119j4997k058P050p996p438K205L373P139j001
$$ 992064 997686 1002901 1003152 1006397 1016516 1001519 999461 1006511 998515 991077 993282 996655 1003794 1002793
13250A002793P5J0573J842j348n55N09j6904M257R138K471r078L62j49R259k308
$$ 1002793 1002868 1013441 1015283 1013935 1013380 1013889 996985 1001242 1010380 1012851 1003773 1004135 1003986 1013245 1010937
13235A010937k0766r756O726J1568q99j162J0313O077p49J027q129m080l492k029
$$ 1010937 990171 980415 987141 998709 997810 996648 1006961 1013038 1012289 1013316 1005187 1001107 997615 995586
13221I95586N828j735j7831R627J4332k109m305k0699o101J1355j413j794L355
$$ 995586 1001414 999679 981848 991475 1005807 1003698 999393 978694 972593 983948 982535 980741 984096
13208I84096N10m341K13o334K788P795r457q117M843J804j1630l350O326l831
$$ 984096 984606 980265 980478 974144 976932 984727 975270 967153 971996 973800 962170 958820 965146 961315
13194I61315k319K175O477l579j0852Q063O621l026o650J700M62p188J422R905
$$ 961315 958996 961171 967648 964069 953217 961280 967901 964875 958225 959925 960387 953199 954621 964526
13180I64526r054Q785M143N182P877k741j1204k3421p468M459P470p337k050l151
$$ 964526 955472 964257 968400 973582 981459 978718 967514 944093 936625 941084 948554 941217 939167 936016
13166I36016n861m120n856n133K712j0689N332N435O291j0192m069k758K110P51
$$ 936016 930155 926035 920179 915046 917758 907069 912401 917836 924127 913935 909866 907108 909218 909969
13152I09969j858n189r178O227K089j1382l775j564n422K032Q39N510Q123m832
$$ 909969 908111 902922 893744 899971 902060 890678 886903 885339 879917 881949 882788 888298 896421 891589
13138H91589J453M769j0182l405J1555l5J0779M125j0444q729l044n726J541J0147
$$ 891589 893042 897811 887629 884224 895779 895744 906523 910648 900204 891475 888431 882705 884246 894393
13124H94393K730j3292k823M330j712n553j813N407k696J513j1307p666J1570
$$ 894393 897123 883831 881008 885338 883626 878073 876260 881667 878971 880484 869177 861511 873081
13111H73081J890p696O186N78n244p462j7675k378N059l799p049r453l586N380
$$ 873081 874971 867275 873461 874039 868795 861333 843658 841280 846339 842540 835491 826038 822452 827832
13097H27832l91R598P739P889l008j2550j3284R570R629O310L355M267j591j1042
$$ 827832 827441 837039 844778 852667 849659 837109 823825 833395 843024 849334 852689 856956 855365 844323
13083H44323j1398O173J3711Q40p390j0790p486j8531O259J0363k006j2097J249
$$ 844323 832925 839098 852809 853649 846259 835469 827983 809452 815711 826074 824068 811971 813220
13070H13220J8393O287j1829j7456J0383K2578N156j115j6995q214M609J4828
$$ 813220 831613 837900 826071 808615 818998 841576 846732 845617 828622 820408 825017 839845
13058H39845m03j501j4810l993m841J3845M863j2784N768L270o814j3300P396
$$ 839845 839442 837941 823131 819138 814297 828142 833005 820221 825989 829259 822445 809145 816541
13045H16541j582j2525J4448J2730j267q402l918M027J1662L675j1887n995J4706
$$ 816541 814959 802434 816882 829612 828345 819943 816025 820052 831714 835389 823502 817507 832213
13032H32213P238k808Q87M033l178K13P282m393j885j0902J8631J284P456L36
$$ 832213 839451 836643 837530 841563 838385 838598 845880 841487 839602 828700 847331 848615 856071 856407
13018H56407j6682O374j498j186n726m918o016o482J1222q756p921M338o063L133
$$ 856407 839725 846099 844601 843415 837689 832771 826755 820273 831495 822739 814818 819156 813093 816226
13004H16226J7433J3017j2615l840K2206l885j2032r009K335O374j57j667L629
$$ 816226 833659 846676 834061 830221 852427 848542 836510 827501 829836 836210 836053 834386 838015
12991H38015M113j4173j9954m046M613L501M062q104n250o870n048M421M752l912
$$ 838015 842128 827955 808001 803955 808568 812069 816131 808027 802777 795907 790859 795280 800032 796120
12977G96120J897O248m80J6928J8499K425j961k8036j0046K754J402j6169k567
$$ 796120 798017 804265 803785 820713 839212 841637 839676 811640 801594 804348 805750 789581 787014
12964G87014L469j3853j2291l755Q040O605J504L522j3632k3690j00J1046j07
$$ 787014 790483 776630 764339 760584 768624 775229 776733 780255 766623 742933 742833 753879 753772
12951G53772r124j230M77l072O478m98j0593j622l541m254q583J7239k646j5993
$$ 753772 744648 743418 743895 740823 747301 746803 736210 734588 731047 726793 718210 735449 732803 716810
12937G16810K502O386p596N347l607J749R583N300k920J3022R71n291J10q049
$$ 716810 719312 725698 718102 723449 719842 721591 731174 736474 733554 746576 747547 742256 742366 734317
12923G34317l745J6132l437p517Q117k498j6272J0619J4102l460j248K220L797
$$ 734317 730572 746704 743267 735750 743867 741369 725097 735716 749818 746358 745110 747330 751127
12910G51127k850j6142q769j5775j646Q331j552m863K845L488q743N944J4666
$$ 751127 748277 732135 723366 707591 705945 714276 712724 707861 710706 714194 705451 711395 726061
12897G26061j3519j866J2494l012j2210J921q66j920K261o041Q481o961j6492
$$ 726061 712542 710676 723170 720158 707948 709869 709003 707083 709344 703303 711784 704823 688331
12884F88331m454j29J4769q16j3117l687L172J372n416j521J248K354J0888q68
$$ 688331 683877 683748 698517 697701 684584 680897 684069 685441 680025 678504 679752 682106 692994 692126
12870F92126Q834J671R17n574n323J077J0536o72j0043p759L614j410P098k89
$$ 692126 700960 702631 703548 697974 692651 693728 704264 703592 693549 685790 689404 687994 695092 694803
12856F94803m709j1854j6423N081j127J5880P374j2674j4941K256J0669l912L382
$$ 694803 690094 678240 661817 666898 665771 681651 689025 676351 661410 663666 674335 670423 673805
12843F73805P842J850r654n587o181q845Q204J227R15o380p66O346k996j455o632
$$ 673805 681647 683497 673843 668256 662075 653230 661434 662661 663576 657196 656430 662776 659780 658325 651693
12828F51693J2424J4896L440J185L830p671r661l850j652J2103L551J656P062
$$ 651693 664117 679013 682453 683638 687468 679797 670136 666286 664634 676737 680288 681944 689006
12815F89006k617j17k0244M379m043j4709j7266J5886K2426l989o001m64J4507
$$ 689006 686389 686272 666028 670407 666364 651655 634389 650275 672701 668712 662711 662247 676754
12802F76754j516j8553N547P672k04J8777N627O80k95j0064J71l345j2134k429
$$ 676754 675238 656685 662232 669904 669700 688477 694104 694784 694489 684425 684596 681251 669117 666688
12788F66688p566L090J0205M305j386J2512J1531N125M346j4333q716j5257j107
$$ 666688 659122 662212 672417 676722 675336 687848 699379 704504 708850 694517 685801 670544 669437
12775F69437M826N29j2104L18R571J737j38Q303R537j4401R534R011P74j4475
$$ 669437 674263 674792 662688 663006 672577 674314 674176 682479 692016 677615 687149 696160 696934 682459
12761F82459J329R635R33j2225o357o16n44j3795O240J569K041N81n342Q072N350
$$ 682459 683788 693423 694356 682131 675774 675158 674614 660819 667059 668628 670669 671250 665908 673980 679330
12746F79330m006j1813n520m726Q802M560J2486p617m441p12R717J015r439J1175
$$ 679330 675324 663511 657991 653265 662067 666627 679113 671496 667055 666343 676060 677075 667636 678811
12732F78811J1580J443m45j9379m697m958R013m694n791k379J1533J5663j1775
$$ 678811 690391 691834 691389 672010 667313 662355 671368 666674 660883 658504 670037 685700 673925
12719F73925Q308R960J334L777q323p668P985P931k475J903J1749J090l292J1579
$$ 673925 682233 692193 693527 697304 688981 681313 689298 697229 694754 696657 708406 709496 706204 717783
12705G17783J131R609Q000j6163p173P263J5165p114j4823k641J1504M138n108
$$ 717783 718914 728523 736523 720360 713187 720450 735615 728501 713678 711037 722541 726679 721571
12692G21571j3294L911L230N340J4201J382j4239K277J5661J8456J3100J2823
$$ 721571 708277 712188 715418 720758 734959 736341 722102 724379 740040 758496 771596 784419
12680G84419k656p444k0108k141p547J0911J2045K2197O704m027n543N713k372
$$ 784419 781763 774319 754211 752070 744523 755434 767479 789676 796380 792353 786810 792523 790151
12667G90151q472K835j27J3872m631N65n368k557M427j1479j164O166J2391O714
$$ 790151 781679 784514 784387 798259 793628 794193 788825 786268 790695 779216 778052 784218 796609 803323
12653H03323j6664j6223k337N165L603o433O534M967J453P675Q932l467N403j395
$$ 803323 786659 770436 768099 773264 776867 770434 776968 781935 783388 791063 799995 796528 801931 800536
12639H00536r244M337K408j098K345j6959j6223J641R7k755J1007R227l42J5545
$$ 800536 791292 795629 798037 796939 799284 782325 766102 767743 767840 765085 776092 785319 784977 800522
12625H00522o419j9462j866o870L254n421K844M013K133j8495p114M239K554k756
$$ 800522 794103 774641 772775 765905 769159 763738 766582 770595 772728 754233 747119 751358 753912 751156
12611G51156o360p213m243j1319N371J7862J586M426J0856N686m709P163J1945
$$ 751156 744796 737583 733340 722021 727392 745254 746840 751266 762122 767808 763099 770262 782207
12598G82207L426k972Q6p822m175j0644k707P151P192J2344k227j649N84L827
$$ 782207 785633 782661 782747 774925 770750 760106 757399 764550 771742 784086 781859 780210 780794 784621
12584G84621R795R574J959O450q923J5243J7384j1240j1650Q141l251m868K681
$$ 784621 794416 803990 805949 812399 803476 818719 836103 824863 813213 821354 818103 813235 815916
12571H15916R236J5061Q427o922L947L54P409J2930J6631J2047J5475J8183M658
$$ 815916 825152 840213 848640 841718 845665 846019 853428 866358 882989 895036 910511 928694 933352
12558I33352J9843K7567J9341L522L995K973J4329P549K597J1437P943l839J789
$$ 933352 953195 980762 1000103 1003625 1007620 1010593 1024922 1032471 1035068 1046505 1054448 1050609 1052398
12545A052398j010L41L89r326k291P034r300L325R428J2560k791j4877M2M776
$$ 1052398 1051388 1051729 1052118 1042792 1040501 1047535 1038235 1041560 1050988 1063548 1060757 1045880 1045922 1050698
12531A050698K0555L1572J5334q55K4661L0062J6054J5199K8241J9439K6215K6298
$$ 1050698 1071253 1102825 1118159 1117304 1141965 1172027 1188081 1203280 1231521 1250960 1277175 1303473
12519A303473R925J9587J0976Q569O341r7J3927L562o638j1375k6947k0234k4904
$$ 1303473 1313398 1332985 1343961 1352530 1358871 1358774 1372701 1376263 1369625 1358250 1331303 1311069 1286165
12506A286165k3462o012j8377k0974j1465j9680j3322L395K114J721J476K919
$$ 1286165 1262703 1256691 1238314 1217340 1205875 1186195 1172873 1176268 1178382 1180103 1181579 1184498
12494A184498O658J829J2195J2994Q845J0496K6019J9776J0166K3227K1476J7026
$$ 1184498 1191156 1192985 1205180 1218174 1227019 1237515 1263534 1283310 1293476 1316703 1338179 1355205
12482A355205K6676J1716J0261J1427j5716r622j5628l6056m7013m5881k6930
$$ 1355205 1381881 1393597 1403858 1415285 1399569 1389947 1374319 1338263 1291250 1245369 1218439
12471A218439j1195p609q08O300J2874o819o607J6648J3578K353j8635m2138n6358
$$ 1218439 1207244 1199635 1198827 1205127 1218001 1211182 1204575 1221223 1234801 1237154 1218519 1176381 1120023
12458A120023l9434k1613k0014j6680j1347j8326k3779q083j1661j7493m654n124
$$ 1120023 1080589 1058976 1038962 1022282 1010935 992609 968830 960747 949086 931593 926939 921815
12446I21815j0840q318j0445r64J6091J4014R630o636l935J5565J7993O517Q379
$$ 921815 910975 902657 892212 891248 907339 921353 930983 924347 920412 935977 953970 960487 968866
12433I68866O044m820j012M894O61n123k3063j9179l554j306M929M252p228R964
$$ 968866 974910 970090 969078 973972 974633 969510 946447 927268 923714 922408 927337 931589 924361 934325
12419I34325J473j205p645j6197j2034k3544j3733j7032l4245q653q34j7591j0917
$$ 934325 935798 934593 926948 910751 898717 875173 861440 844408 810163 801510 800676 783085 772168
12406G72168p522Q743j718M847m414k0076o276J443R383Q272j1781j3765j4848
$$ 772168 764646 773389 771671 776518 772104 752028 745752 747195 756578 764850 753069 739304 724456
12393G24456j612k708j3840j771O73l241K678J5646j112l375p07J55j681J930
$$ 724456 722844 720136 706296 704525 705198 701957 704635 720281 719169 715794 715087 715242 713561 715491
12379G15491O747R205j500j646l768P700Q959k288K691j3682r559j0735J2358
$$ 715491 722238 731443 729943 728297 724529 732229 741188 738900 741591 727909 718350 707615 719973
12366G19973j567j0824j0751j532O915Q300k273l823N412J7057O059j959j4641
$$ 719973 718406 707582 696831 695299 702214 710514 708241 704418 709830 726887 732946 730987 716346
12353G16346k2854j0242J141J6647M780L005k496K197m44O596Q766j58R477j403
$$ 716346 693492 683250 684391 701038 705818 708823 706327 708524 708080 714676 723442 723284 732761 731358
12339G31358n386j1414m433J4215J0565l842m42o865K589K241j734m133N863Q216
$$ 731358 725972 714558 710125 724340 734905 731063 730621 723756 726345 728586 726852 722719 728582 736798
12325G36798J373j680j760k167n704n195q524L629q432j2294P837J0444j4977
$$ 736798 738171 736491 734731 732564 726860 721665 713141 716770 708338 696044 703881 714325 699348
12312F99348q609N93j241P809J9940K843p305L882P387r732k529k135K876n418
$$ 699348 690739 691332 690091 697900 717840 720683 713378 717260 724647 714915 712386 710251 713127 707709
12298G07709j1225N973j619L168K358K97m278l141L191l993j219R800O258m681
$$ 707709 696484 702457 700838 704006 706364 706661 702383 699242 702433 698440 697221 707021 713279 708598
12284G08598R386o298j3252P576J464n243n76J2427J6741J230M702j6436j4311
$$ 708598 717984 711686 698434 706010 707474 702231 701655 714082 730823 732053 736755 720319 706008
12271G06008j4195j2861J2967P780R076K910J393M356J3314J4140J7488M996m992
$$ 706008 691813 678952 691919 699699 708775 711685 713078 717434 730748 744888 762376 767372 762380
12258G62380p786Q00K949J5228Q14r025j8967j3881q515m123j4162j0888J5032
$$ 762380 754594 755394 758343 773571 774385 765360 746393 732512 723997 719874 705712 694824 709856
12245G09856J096K191L491m643j3866j5402j4305L918O525j0070R73L29q23l324
$$ 709856 710952 713143 716634 711991 698125 682723 668418 672336 678861 668791 669764 670093 669270 665946
12231F65946M932J2187J5195M934L373P921J6478J0581N180q138O004R936N127
$$ 665946 670878 683065 698260 703194 706567 714488 730966 741547 746727 738589 744593 754529 759656
12218G59656R532J4285K815J9025K2539J0221J4365r29L509P124R209M617jn579
$$ 759656 769188 783473 786288 805313 827852 838073 852438 851509 855018 862142 871351 875968 875967 870388
12204H70388j6450k0112r250q051q68p968k378J344o687l3298q709R76N969P65
$$ 870388 853938 833826 824576 816525 815657 807689 805311 806655 799968 766670 757961 758937 764906 765671
12190G65671k888j720M795k139j2870q564Q472J7513j7j229N628m272J1352K3351
$$ 765671 762783 761063 765858 763719 750849 742285 750757 768270 768253 767024 772652 768380 779732 803083
12176H03083K2187k106N886J9907J2344R42J7472J2827J7290J2760k994R781J8259
$$ 803083 825270 823164 829050 848957 861301 862243 879715 892542 909832 922592 919598 929379 947638
12163I47638R196K0837J3123m662J295n737r174l407N831j3602k3855n763K411
$$ 947638 956834 977671 990794 986132 987427 981690 972516 969109 974940 961338 937483 931720 934131
12150I34131j496m870k384m152j921k455R885j294L120m751j67J8352M259j0270
$$ 934131 932635 927765 925381 921229 919308 916853 926738 925444 928564 923813 923646 941998 946257 935987
12136I35987j89J386j0934j4435j41J1781J4274k295j0180j2226l952O834L058
$$ 935987 935798 937184 926250 911815 911674 923455 937729 935434 925254 913028 909076 915910 918968
12123I18968K129O542Q67j894o910j5485p547k585Q188J8461N556r839O436j750
$$ 918968 921097 927639 928506 926612 919702 904217 896670 894085 902273 920734 926290 916451 922887 921137
12109I21137r54P881q909j3234j2142J1832J4779J0414O768K628k589j6863j0337
$$ 921137 920183 928064 919155 905921 893779 905611 920390 930804 937572 940200 937611 920748 910411
12096I10411o155j2418j5855r372K665k28O481n03j5393k539N0m57j0900j2799
$$ 910411 904256 891838 875983 866611 869276 869048 875529 875026 859633 857094 857144 856687 845787 832988
12082H32988M304l287j8574J1173J3800j2952j6309o090J1823J722K268l164j142
$$ 832988 837292 834005 815431 826604 840404 827452 811143 805053 816876 818598 820866 817702 816560
12069H16560J4359Q777N499J925q302R026l774N438j4803j0080L045k926j2330
$$ 816560 830919 839696 845195 847120 838818 847844 844070 849508 834705 824625 827670 824744 812414
12056H12414J1065J1155M655m266j1039J308l365n326l93L450M218j4894j8743
$$ 812414 823479 834634 839289 835023 823984 825292 821927 816601 816208 819658 823876 808982 790239
12043G90239r108r91n039j3281Q39J3073k181j3701k787N851J1362L362q529j9435
$$ 790239 781131 780140 775101 761820 762659 775732 773551 759850 757063 762914 774276 777638 769109 749674
12029G49674p392N08j0098J680j8503j3880J502n390n510j0941j9610p078p801
$$ 749674 742282 742790 732692 734372 715869 701989 703491 698101 692591 681650 662040 654962 647161
12016F47161q084J635o93n111L518k014j5465j689R647J1175N151n870j2690L585
$$ 647161 639077 640712 640019 634908 638426 636412 620947 619258 628905 640080 645231 639361 626671 630256
12002F30256k486m590r042K617K59r456k806N783k936r582q646j1700O566O611
$$ 630256 627770 623180 614138 616755 617014 607558 604752 610535 607599 598017 589371 577671 584237 590848
11988E90848j794L186j1141r170M131J641n061l781j3876q882k4235J169L055
$$ 590848 589054 592240 581099 571929 576060 577701 572640 568859 554983 546101 521866 523035 526090
11975E26090O689R347m69j6672j3091M240Q766J2712L284R16m359O850l430N267
$$ 526090 532779 542126 541657 524985 511894 516134 524900 537612 540896 541812 537453 544303 540873 546140
11961E46140l309k266m207p775o939O1K814P800O44J800n360j0416p412o96P750
$$ 546140 542831 540565 536358 528583 521644 521705 524519 532319 532963 534763 529403 518987 511575 510879 518629
11946E18629O714K872j3665o906O293l13r106j4308m295N244N648k393Q151J4050
$$ 518629 525343 528215 514550 507644 513937 513624 504518 490210 485915 491159 496807 494414 502565 516615
11932E16615N27j2643l300O897Q916K530L636m969L704j0318L13K210l253j804
$$ 516615 517142 504499 501199 508096 517012 519542 523178 518209 521913 511595 511908 514118 510865 509061
11918E09061L032r949p479k319j4232L442M724R343L893K172P12q056r271q808
$$ 509061 512093 502144 494665 492346 478114 481556 486280 495623 499516 501688 502400 494344 485073 476265
11904D76265J274J0979M922j0983j454n613L887K279J710j57M537j0244J489Q699
$$ 476265 477539 488518 493440 482457 481003 475390 479277 481556 483266 483109 487646 477402 478891 487590
11890D87590O659k409k1025J990Q507K461m454l015j7079j5735J3248K556O171
$$ 487590 494249 491840 470815 472805 481312 483773 479319 476304 459225 443490 456738 459294 465465
11877D65465L099j052L975j3899j4198P984j179j1177q347J440k414R092Q610
$$ 465465 468564 467512 471487 457588 443390 451374 450195 439018 430671 432111 429697 438789 447399
11864D47399n466R685J7664k014l605j0692O200k997p474l730J4783j231o71j834
$$ 447399 441933 451618 469282 467268 463663 452971 459171 456174 448700 444970 459753 458522 457851 456017
11850D56017R293K215n867k438q561o636L336O715p975R468p553J432r860p664
$$ 456017 465310 467525 461658 459220 450659 444023 447359 454074 446099 455567 448014 449446 439586 431922
11836D31922J5918o35oQ547k052q689l917j935m869O234L853j1937j3554K1408
$$ 431922 447840 447205 447199 455746 453694 445005 441088 439153 434284 440518 444371 432434 418880 440288
11822D40288N797k061r06j6834p211j0075N854R806N631j1015o560Q963K0030
$$ 440288 446085 444024 443118 426284 419073 408998 414852 424658 430289 419274 412714 421677 441707
11809D41707K597j338k193p659j2457J0343L564Q701K694O27m87l824r251j2688
$$ 441707 444304 442966 440773 433114 420657 431000 434564 443265 445959 446586 446099 442275 433024 420336
11795D20336J0605J4808P810j2343l299j4077P922R463J4791P965j2804p916J453
$$ 420336 430941 445749 453559 441216 437917 423840 431762 441225 456016 463981 451177 443261 444714
11782D44714J1597J8081k324q733n218j398o222k0113N748O497K471L25L143O462
$$ 444714 456311 474392 472068 463335 458117 456719 450497 430384 436132 442629 445100 445425 448568 455030
11768D55030O4o435L184j1980J080J7936K53n853p282L749l621o386j952J3958
$$ 455030 455094 448659 451843 439863 440943 458879 459132 453279 445997 449746 446125 439739 437787 451745
11754D51745Q531J646M791J5582R784j1057j4306m157o470p580M413q120K133
$$ 451745 460276 461922 466713 482295 492079 481022 466716 462559 456089 448509 452922 444802 446935
11741D46935p253N148n53Q343j2211Q705J0379M893J1197J2401R370R088O490
$$ 446935 439682 444830 444277 452620 440409 449114 459493 464386 475583 487984 497354 506442 512932
11728E12932J415n967j7454p726q007k754J3125l855J288L365j721K312K385l952
$$ 512932 514347 508380 490926 483200 475193 472439 485564 481709 482997 486362 484641 486953 489338 485386
11714D85386p751j7832K095K4638K249M930L352J1115j7054k1271k1295J664K0082
$$ 485386 477635 459803 461898 486536 488785 493715 497067 508182 491128 469857 448562 450226 470308
11701D70308Q454O603O027j2336n119m774l691N785J0773m560j3266j0137N301
$$ 470308 478762 485365 491392 479056 473937 469163 465472 471257 482030 477470 464204 454067 459368
11688D59368J3275o749m861J5835L928p522L190N502j4545Q309J6075O983l771
$$ 459368 472643 465894 461033 476868 480796 473274 476464 481966 467421 475730 491805 498788 495017
11675D95017j3400j1545j4616j3320M033P616O127N817j1747k48Q909r591M268
$$ 495017 481617 470072 455456 442136 446169 453785 459912 465729 453982 453734 462643 453052 457320
11662D57320J2573l926L851r766M003p339k549q629n29m890j3004N970J2581J1493
$$ 457320 469893 465967 469818 460052 464055 456716 454167 445538 445009 440119 427115 433085 445666 457159
11648D57159L729M376J424l148k46j272j4741k226M85q651n834l649O370M181
$$ 457159 460888 465264 466688 463540 463294 462022 447281 445055 445540 436889 431055 427406 433776 437957
11634D37957L603K457J004n073M978J3090j0535r239M6p492p116M35r49J5465
$$ 437957 441560 444017 445021 439948 444926 458016 447481 438242 438288 430796 423680 424115 423166 438631
11620D38631J3676p197K112M406J268O948K418j2451K06N285m138L208J3719J1502
$$ 438631 452307 445110 447222 451628 452896 459844 462262 449811 450017 455302 451164 454372 468091 479593
11606D79593p836p509K855J1523M047n109j6052l695N550J272M485O054K89J051
$$ 479593 471757 464248 467103 478626 482673 477564 461512 457817 463367 464639 469124 475178 475467 476518
11592D76518L368Q127Q423K705J1860J1516j8620j0038q108q794R232L159j394
$$ 476518 479886 488013 496436 499141 511001 522517 503897 493859 485751 476957 486189 489348 487954
11579D87954k22q772j754P510k036Q08o85N563r220p419J3352J4692M590j7748
$$ 487954 487732 478960 477206 484716 482680 483488 482803 488366 479146 471727 485079 499771 504361 486613
11565D86613N677K711K17Q781J0835q03Q576O17n632J090K3027J3616j0668j6278
$$ 486613 492290 495001 495218 503999 514834 514031 522607 523224 517592 518682 541709 555325 544657 528379
11551E28379j7520k18J0897J1577M104p162p37Q328J843r675q927P666L740r999
$$ 528379 510859 510641 521538 533115 537219 530057 529320 537648 539491 529816 520889 528555 532295 522296
11537E22296m399k823O485L612L558N877o141l199l090R74q027l123O677M858
$$ 522296 517897 515074 521559 525171 528729 534606 528465 525266 522176 523150 515123 512000 518677 523535
11523E23535N928O96j3851r731N341j493J170N577M00l146j374R67N182m019O632
$$ 523535 529463 530159 516308 506577 511918 510425 511595 517172 517572 514426 513052 514019 519201 515182 521814
11508E21814L31J596J542M251P484o047N82J078o160K404R926O207j107j4857
$$ 521814 522145 523741 525283 529534 537018 530971 531553 532631 526471 528875 538801 545008 543901 529044
11494E29044l46q15j1890j3741o561O685L482m469P184O85J133J2186j5371j5305
$$ 529044 528698 527883 515993 502252 495691 502376 505858 501389 508573 509258 510391 522577 507206 491901
11480D91901n708J0306J4538m767p18j59j2176R792P64j143K415j0889P10K5J0160
$$ 491901 486193 496499 511037 506270 505552 505393 493217 503009 503773 502630 505045 494156 494866 494891 505051
11465E05051M715j51r982j472q53n310q466k950M185K415n032M040J8913R438
$$ 505051 509766 509615 499633 498161 497308 491998 483532 480582 484767 487182 482150 486190 505103 514541
11451E14541o148P480l828j0331j1348r40J0989K2902k842j8256m273j767K106
$$ 514541 508393 515873 512045 501714 490366 489426 500415 523317 520475 502219 497946 496179 498285
11438D98285o843r444N376L729O852L654P964N108o478o353l852J2405J3385J89
$$ 498285 491442 481998 487374 491103 497955 501609 509573 514681 508203 501850 497998 510403 523788 523977
11424E23977J0220p343j3823q287J167K217L932K95J0175R903J208k912P129J1886
$$ 523977 534197 526854 513031 504744 505911 508128 512060 512355 522530 532433 533641 530729 537858 549744
11410E49744M534M942O619k280n018q420J6206J1061j0229k5558J163M961L608
$$ 549744 554278 559220 565839 563559 558541 550121 566327 577388 567159 541601 542764 547725 551333
11397E51333J4551Q678R89n015j0904j1314k136O099P48m541m357J2158O689r018
$$ 551333 565884 574562 575551 570536 559632 548318 546182 552281 553029 548488 544131 556289 562978 553960
11383E53960n171q9n171o752O753M76l141l266k088J3126J4286l62j5303m900
$$ 553960 548789 548700 543529 536777 543530 544006 540865 537599 535511 548637 562923 562561 547258 542358
11369E42358n199M456L604N689Q42j165M087O546K4726j2493p282N997n721o53
$$ 542358 537159 541615 545219 550908 551750 550585 554672 561218 585944 573451 566169 572166 566445 565792
11355E65792K099K5477r02k1135r054J4473M955o398P443r4j1391P85J3791N850
$$ 565792 567891 593368 592466 571331 562277 576750 581705 575307 582750 582656 571265 572050 585841 591691
11341E91691l493J964J127l64J189n49j603N47J2450O269k3671j935k222L969
$$ 591691 588198 590162 591289 590925 592114 591565 589962 590509 602959 609228 585557 583622 581400 585369
11327E85369J6311O39o757k1095o535L530O254M757L41j2056J1209J5748m920
$$ 585369 601680 602319 595562 574467 567932 571462 577716 582473 582814 570758 581967 597715 592795
11314E92795m966o522j5727p90L821j443k257j736k646j1561O936O934L641J1659
$$ 592795 587829 581307 565580 564790 568611 567168 564911 563175 560529 548968 555904 562838 566479 578138
11300E78138N298l391m983j816r610Q849J2278J6347K2554m876j1690j2230N239
$$ 578138 583436 580045 575062 573246 563636 572485 584763 601110 623664 618788 607098 594868 600107
11287F00107Q136j932r030j0176l975k860J2474m554m167o442L03L442l79j5357
$$ 600107 608243 606311 597281 587105 583130 580270 592744 588190 584023 577581 577884 581326 580947 565590
11273E65590j3648K3154N608R39j3235J502p823k144J3987M577m170j210j1619
$$ 565590 551942 575096 580704 581643 568408 569910 562087 559943 573930 578507 574337 573127 561508
11260E61508j6602R806J0979j5541j824p61P374J0481O270Q493P420J110k211
$$ 561508 544906 554712 565691 550150 548326 547565 554939 565420 571690 580183 587603 588713 586502
11247E86502M216o99Q671o665L86N389J3049Q986l382j1407k844j653p506j0279
$$ 586502 590718 590019 598690 592025 592411 597800 610849 619835 616453 605046 602202 600549 593043 582764
11233E82764l917Q362j362n067L321L105j982l30R744N893j7354k1621j783L309
$$ 582764 578847 587209 585847 580780 584101 587206 585224 584894 594638 600531 583177 561556 559773 563082
11219E63082J066j0414j086J619J418j6371j4605J2395J3333J5738J2521j25p019
$$ 563082 564148 553734 552648 554267 555685 539314 524709 537104 550437 566175 578696 578571 571552
11206E71552j4381m919J6027p107P828J4182J8961N427m725P543J1348J4770n376
$$ 571552 557171 552252 568279 561172 569000 583182 602143 607570 602845 610388 621736 636506 631130
11193F31130L762N626K602J120Q35j94o607m264n430q762j202j8359r905l255
$$ 631130 634892 640518 643120 644240 645075 644881 638274 634010 628580 619818 618616 600257 590352 587097
11179E87097K221M502m908j1742q344M415K5237J3273j3435J416J0423L361j1300
$$ 587097 589318 593820 588912 577170 568826 573241 598478 611751 598316 599732 610155 613516 602216
11166F02216o514o57K0490K304m726J241J493oJ7289J7480n016m428O19R882J3049
$$ 602216 595702 595045 615535 617839 613113 614354 615847 615841 633130 650610 645594 641166 641785 651667 664716
11151F64716l211K770n964n956n555j217n445n492q75L255O397j2732j4590m340
$$ 664716 661505 664275 658311 652355 646800 645583 640138 634646 633771 637026 643423 630691 616101 611761
11137F11761O877q161j6357N561J1631J2824R076M68j1975N589J2462O446J9944
$$ 611761 618638 610477 594120 599681 611312 624136 633212 633680 621705 627294 639756 646202 666146
11124F66146N289o053j600L892r134R89R112O650R143P577J3104j501M358K071
$$ 666146 671435 665382 663782 667674 658540 659529 668641 675291 684434 692011 705115 703614 707972 710043
11110G10043r264O147J0983P561l476l963L0M363L571p675q727n245n59n642k067
$$ 710043 700779 706926 717909 725470 721994 718031 718061 722424 725995 718320 709593 704348 703789 698147 696080
11095F96080M944p226p828K85L936J841p606K504J0577Q738L857p18k649J1161
$$ 696080 701024 693798 685970 686255 690191 692032 684426 686930 697507 706245 710102 709384 706735 717896
11081G17896L232R150K8314J8251j1062k2232j5149j3843J2573R670p599O193
$$ 717896 721128 730278 758592 776843 765781 743549 728400 714557 727130 736800 729201 735394
11069G35394l42l849j565R643K2747J8279J116k136M596J553p348m331l67J848
$$ 735394 735052 731203 729638 739281 762028 780307 781423 779287 783883 785436 778088 773757 773390 775238
11055G75238j2670n32N027J880Q079j367r810r627r309J7184J017o411q573k413
$$ 775238 762568 762036 767063 768943 777022 775655 765845 756218 746909 764093 765110 758699 750126 747713
11041G47713n409P695J4486j879n652j1353m680O031J285q881o450n905j44j1675
$$ 747713 742304 749999 764485 762606 756954 745601 740921 746952 748237 739356 732906 727001 726857 715182
11027G15182O036J7690J076j2938o558N186l383O862o275O66k552L06L395M05
$$ 715182 721218 738908 739984 727046 720488 725674 722291 729153 722878 723544 720992 721298 724693 725098
11013G25098j5991q274m125O551j5554k1927j8804j5836k606m990N041k362r878
$$ 725098 709107 700833 696708 703259 687705 665778 646974 631138 628532 623542 628583 626221 616343
11000F16343p219o317l628J0862J3897Q297j5006J644J673r892j3183n099J1263
$$ 616343 609124 602807 599179 610041 623938 632235 617229 618873 620546 610654 597471 592372 603635
10987F03635M651J998p779M907m274j3847j5561k407j6190J011q136P221K974
$$ 603635 608286 610284 602505 607412 603138 589291 573730 571323 555133 556144 548008 555229 558203
10974E58203l861o347j4826j5549k927K311j330n933j1157L618r117m824j20j3432
$$ 558203 554342 547995 533169 517620 514693 517004 515674 509741 498584 502202 493085 488261 488141 474709
10960D74709J3198l1j1072j4234O816L338j3622N618p486j7609m007L963r25R427
$$ 474709 487907 487876 476804 462570 469386 472724 459102 464720 457234 439625 435618 439581 438656 448083
10946D48083q460R337J7548o003k5308j7707J1107O790K723N147j5925l023j4050
$$ 448083 439623 448960 466508 460505 435197 417490 428597 435387 438110 443257 427332 424309 410259
10933D10259K752J3742m492o159p823p762m386j719k435q323p935J387J0486J0116
$$ 410259 413011 426753 422261 416102 408279 400517 396131 394412 391977 383654 375719 377106 387592 397708
10919C97708N206n289j0064m254J810L939K299M439J6409J22j2071l228R466l393
$$ 397708 402914 397625 387561 383307 385117 389056 391355 395794 412203 412325 400254 397026 406492 403099
10905D03099r286r242r000l110m753K703L060r255O907J1336Q788j1750j7541
$$ 403099 393813 384571 375571 372461 367708 370411 373471 364216 371123 382459 391247 379497 361956
10892C61956o001P49J0379L890O294j4199J5240J0449j1492j3168p044Q457J3322
$$ 361956 355955 356704 367083 370973 377267 363068 378308 388757 377265 364097 357053 365510 378832
10879C78832J2367o543r191n656j3682r349N436n128P143J2254m92M72l180m557
$$ 378832 391199 384656 375465 369809 356127 346778 352214 347086 354229 366483 365991 366463 363283 358726
10865C58726j268J151J992p858l879Q96L186l701J485o72k435j838l802k372j0347
$$ 358726 357458 358609 360601 352743 348864 349760 352946 349245 350730 350058 347623 345785 341983 339611 329264
10850C29264J887J0217M326N780N0j4528J0797R271l297j8012J67L125K423o7
$$ 329264 331151 341368 345694 351474 351524 336996 347793 357064 353767 335755 335922 339047 341470 341403
10836C41403j2079n247J4803K4016j1311p314j3192j3010j143J2254J2681K008
$$ 341403 329324 324077 338880 362896 351585 344271 331079 318069 316926 329180 341861 343869
10824C43869l302j5469q861k189J0328O828J6577k79j0979K476K817K533J835
$$ 343869 340567 325098 316237 314048 324376 331204 347781 347502 336523 338999 341816 344349 346184
10811C46184O437M826o900N509j458j5050O897L890k863j18m248k8L366J1384
$$ 346184 352621 357447 350547 356056 354598 339548 346445 350335 347472 347354 343106 343078 346444 357828
10797C57828O545o398q878n044n201N21j1119M604R369k326l088O51K148o253
$$ 357828 364373 357975 349097 344053 338852 339373 328254 332858 342227 339901 336813 337464 339612 333359
10783C33359k299o505j1525n542l982M771L632J6257j737M831O561o51R730J2333
$$ 333359 331060 324555 313030 307488 303506 308277 311909 328166 326429 331260 337821 337170 346900 359233
10769C59233j590L789k181k9j1054q612k786r655n013r163o80L582j882J725J033
$$ 359233 357643 361432 359251 359222 348168 339556 336770 327115 322102 312939 312259 315841 313959 315684 316717
10754C16717J2794l051q667J0920l066j1115M487N30J335L154N765p755j6876
$$ 316717 329511 326460 317793 328713 325647 314532 319019 319549 320884 324038 329803 322048 305172
10741C05172q335J2437J5859K697k403J739k451j4087K267J8492j4833j2109J3126
$$ 305172 296837 309274 325133 327830 325427 327166 324715 310628 312895 331387 316554 304445 317571
10728C17571J6090j5457k2555r221J2283j041J114L925l51J0652l212o473r684
$$ 317571 333661 318204 295649 286428 298711 297670 298784 302709 302358 313010 309798 303325 293641
10715B93641J0095O936j0998R023R121j5617J1111O171k909K390j1003K641L539
$$ 293641 303736 310672 299674 308697 317818 302201 313312 319483 316574 318964 307961 310602 314141
10702C14141R497M358m711k6015j1850R243n307Q051m874M539J170k154j6728
$$ 314141 323638 327996 323285 297270 285420 294663 289356 297407 292533 297072 298242 296088 279360
10689B79360k367j319J3950J492m004n240L57O476J5867J1374j930n260L997M110
$$ 279360 276993 275674 289624 291116 287112 281872 282229 288705 304572 315946 314016 308756 312753 316863
10675C16863r308j1002n184r584m540k546J4533R377K63l254j349J1000q920j1585
$$ 316863 307555 296553 291369 281785 277245 274699 289232 298609 298872 295618 294269 305269 296349 284764
10661B84764o080N799P941m04j2849j795n559n350J3755K1429J1213j1956j8244
$$ 284764 278684 284483 292424 292020 279171 277376 271817 266467 280222 301651 312864 300908 282664
10648B82664k5595m972J6475P304p683Q521k03O846J040L042K0608J8507r006
$$ 282664 257069 252097 268572 275876 268193 276714 276511 283357 284397 287439 308047 326554 317548
10635C17548j8066r422j2156j2862j1877o442N96k90m859n017r85J8957J5243
$$ 317548 299482 290060 277904 265042 253165 246723 247319 247029 242170 237153 236168 255125 270368
10622B70368M518q222k51J4927K214J026K857m941L22Q036R44j0773j2223j2527
$$ 270368 274886 266664 266413 281340 283554 284580 287437 282496 282818 290854 291798 281025 268802 256275
10608B56275r706j3236l55J3039J7862k094K872q355j7001r501M332l985j428
$$ 256275 246569 233333 232978 246017 263879 261785 264657 256302 239301 229800 234132 230147 228719
10595B28719J5129M141O55p040j1882J2722J7474k751L931n624n118N512m749
$$ 228719 243848 247989 248644 241604 229722 242444 259918 257167 261098 255474 250356 255868 251119
10582B51119j0523M232j456K905K03N118M45l775L013j641r665J494k689O620
$$ 251119 240596 244828 243372 246277 246480 251598 252043 248268 251281 249640 239975 241469 238780 245400
10568B45400O331j1884j4748n518L773Q001R253l799j0790j031P217J1672J3318
$$ 245400 251731 239847 225099 219581 223354 231355 240608 236809 226019 224988 232205 243877 257195
10555B57195j3948M330o154J0538J73p836j3341p919R51R291J5885K670N425o176
$$ 257195 243247 247577 241423 251961 252134 244298 230957 223038 223989 233280 249165 251835 257260 251084
10541B51084j792n829p26q990m745j673Q817J4505j483q111j904M085Q142r509
$$ 251084 249292 243463 242737 233747 229002 227329 236146 250651 249168 241057 239153 243238 251380 241871
10527B41871p044n815o28p84J421J796L911p254j2410J2835Q871j454j0266k352
$$ 241871 234827 229012 228384 227600 229021 230817 234728 227474 215064 227899 236770 235316 225050 222698
10513B22698j1085j7078R963J5274O146r54J5464p299j1063N514N873K196k858
$$ 222698 211613 194535 204498 219772 225918 224964 240428 233129 222066 227580 233453 235649 232791
10500B32791j586J0966M246l896k914q528N098J1674o69o377o578n196K89k662
$$ 232791 231205 242171 246417 242521 239607 231079 236177 247851 247182 240805 234227 229031 229320 226658
10486B26658n688j4216L858Q216j5052K501K3978n538m353J406J1654P258j4482
$$ 226658 220970 206754 210612 218828 203776 206277 230255 224717 220364 221770 233424 240682 226200
10473B26200k420Q852k397k3409q217J6657n217K956r015o139J6040J60N886m262
$$ 226200 223780 232632 230235 206826 198609 215266 210049 213005 203990 197851 213891 214051 219937 215675
10459B15675l41o323L158K516N709j49J0376M625j819q025n321n448j1151Q76
$$ 215675 215334 209011 212169 214685 220394 220245 230621 235246 233427 225402 220081 214633 203482 204358
10445B04358j1004R156O604r98k47J1164k526M10J225J086M180J237r256j2586
$$ 204358 193354 202510 209114 208116 207869 219033 216507 216917 218142 219228 223408 224645 215389 202803
10431B02803n577M111J4880O431l397O176J26K920J158q912r379l56j855m130
$$ 202803 197226 201337 216217 222648 219251 225427 225553 228473 229631 220719 211340 210984 209129 204999
10417B04999l469m432m827O205R38k414o065J2323O877Q990p893R718K0035r425
$$ 204999 201530 197098 192271 198476 199414 197000 190935 203258 210135 219125 211232 220950 240985 231560
10403B31560j0711j395K631K399K199N95o421n140L088L042l511O22j9927j2575
$$ 231560 220849 219454 222085 224484 226683 227278 220857 215717 218805 221847 218336 218958 199031 186456
10389A86456R733Q924P280O937m827j8329q620R835J2293K48p56o400j6268j8277
$$ 186456 196189 205113 212393 219330 214503 196174 187554 197389 209682 209930 209174 202774 186506 168229
10375A68229Q685R360J623M276M431J2292Q91j756o901m219L747J275L359N935
$$ 168229 176914 186274 187897 192173 196604 208896 209787 208031 201130 196911 200658 201933 205292 211227
10361B11227N172J524k058l620j921J354p117J967o826J4447L879L243r555L894
$$ 211227 216399 217923 215865 212245 210324 211678 204561 206528 199702 214149 218028 221271 211716 215610
10347B15610k84O84L133R46n376j4154L192R577R561J1594r825j2501P586J0789
$$ 215610 215326 216010 219143 220089 214713 200559 203751 213328 222889 234483 224658 212157 219743 230532
10333B30532q333P7Q841j171l9j819j464M183j1963O805J575m234K527n698n045
$$ 230532 222199 222276 231117 229946 229907 228088 226624 230807 218844 225649 227224 222990 225517 219819 214774
10318B14774K52L955Q67P231l155o444j2444M74J3273J4839l387P75R266Q286
$$ 214774 215026 218981 219848 227079 223924 217480 205036 205510 218783 233622 230235 231010 240276 248562
10304B48562L029p501j880l672K338Q081r172j4164L795J2071N195j1754N297
$$ 248562 251591 244090 242210 238538 240876 248957 239785 225621 229416 241487 246682 234928 240225
10291B40225q982J476M949Q712j195l765k498K280k526M953J0467P321O948O407
$$ 240225 231243 232719 237668 246380 245185 241420 238922 241202 238676 243629 254096 261417 268365 274772
10277B74772J77q166q927j6590o748O524J1550j1099O154J744R763N380m119l78
$$ 274772 274949 266783 257856 241266 234518 241042 252592 241493 247647 249391 259154 264534 260415 260037
10263B60037L232L842k198N595j1637j1936R675N089K873j1246M642J5593m659
$$ 260037 263269 267111 264913 270508 258871 246935 256610 261699 264572 253326 257968 273561 268902
10250B68902k2237J450J6374m935q126n628L000p000o028R637k015J883N874L609
$$ 268902 246665 248115 264489 259554 251428 245800 248800 241800 235772 245409 243394 245277 251151 254760
10236B54760n939r916j923J815j6829j5768m129O821M525L409N011M59j1753p9
$$ 254760 248821 238905 236982 238797 221968 206200 202071 208892 213417 216826 221837 222296 210543 210464
10222B10464m27q002O684J2569p7j9278q815k514K380J0951Q113R389j9083q293
$$ 210464 210037 202035 208719 221288 221211 201933 193118 190604 192984 203935 212048 221437 202354 194061
10208A94061m100O631N346o658l646N602O176m373o815N987M134q733j1274q228
$$ 194061 189961 196592 201938 195280 191634 197236 203412 199039 192224 198211 202345 193612 182338 174110
10194A74110r332L426k18K285Q922r156n685J0546J3670j0881k887n009K814K255
$$ 174110 164778 168204 167986 170271 179193 170037 164352 174898 188568 177687 174800 169791 172605 174860
10180A74860K4745J754q772p831j1176K349j787o120j495J986L697J358J2407
$$ 174860 199605 201359 192587 184756 173580 175929 174142 168022 166527 168513 172210 173568 185975
10167A85975M740r309p601r283n747m081j2057O728K6208J0393j227M621L502
$$ 185975 190715 181406 173805 164522 158775 154694 142637 149365 175573 185966 184739 189360 192862
10154A92862N693j5293k5875o725J212r797q203O334O106j18m545M159Q979M440
$$ 192862 198555 183262 157387 150662 151874 142077 133874 140208 146314 146196 141651 145810 154789 159229
10140A59229m522j597K82K964J4108j27l926l163K767o417j9494q137J9926P412
$$ 159229 154707 153110 153392 156356 170464 170337 166411 163248 166015 159598 140104 131967 151893 159305
10126A59305m18J2211n338k1914j3305J996J9170J1835j3010J024R692N52o887
$$ 159305 158887 171098 165760 143846 130541 132537 151707 163542 150532 151556 161248 161800 154913
10113A54913J3544J511n230M59m155j495Q014q625j1791J094k419J8012q28q467
$$ 154913 168457 169968 164738 165197 161042 159547 167561 158936 147145 148239 145820 163832 163004 154537
10099A54537l976j2618Q902Q626P457J134J746o139j3692N936N75j7947n094M817
$$ 154537 150561 137943 146845 155471 162928 164062 165808 159669 145977 151913 152488 134541 129447 134264
10085A34264J199M066N152j427P001k227q384K022O072L375q75m415o288n657
$$ 134264 135463 139529 144681 143254 150255 148028 139644 141666 147738 151113 150238 145823 139535 133878
10071A33878j078Q18P008O06n571o55q470M104J3281N450k954o007j0957P300
$$ 133878 132800 133618 140626 141232 135661 135006 126536 130640 143921 149371 146417 140410 129453 136753
10057A36753j883r252l096o103j0060O35O47L606Q827K0399J5967o791n674j6973
$$ 136753 134870 125618 122522 116419 106359 106994 107641 111247 120074 140473 156440 149649 143975 127002
10043A27002L917M143K992j603p070j3202p503J3294J6498K1883q305r399n443
$$ 127002 130919 135062 138054 136451 129381 116179 108676 121970 138468 160351 152046 142647 137204
10030A37204M538J1219p854k181Q929j1009m868K1457J9730J2861K2806J8928
$$ 137204 141742 152961 145107 142926 151855 140846 135978 157435 177165 190026 212832 231760
10018B31760K856j2335m147R348J4970R614J9667K5762J1796K2570J4343J6042
$$ 231760 234616 222281 218134 227482 242452 252066 271733 297495 309291 331861 346204 362246
10006C62246M282J1323L1442L5480K8818M3262O4184R1571J27250J64477K20447
$$ 362246 366528 377851 409293 444773 473591 516853 581037 672608 799858 964335 1184782
9995A184782L10570M21855N94391P73188Q80888Q31681N19523j45664q96896j152759
$$ 1184782 1495352 1917207 2511598 3284786 4165674 4997355 5516878 5371214 4474318 3321559
9985C321559r13130n86821l55501k17426j29359p7132p1144o1084m0347j8844
$$ 3321559 2408429 1821608 1466107 1248681 1119322 1042190 971046 909962 869615 850771
9975H50771k9797k9185r369m721j5057P79K1400J5717J5496L1012K7806J3430
$$ 850771 820974 791789 782420 777699 762642 763421 784821 800538 816034 847046 874852 888282
9963H88282K3450M2040L7630L7217M7139M5206M9669M7047J6229K39k5023l9744
$$ 888282 911732 953772 991402 1028619 1075758 1120964 1170633 1217680 1233909 1234148 1209125 1169381
9951A169381m0360k8587j9971N375J5685J5510K1958M5937L9436M3225L1028K1109
$$ 1169381 1129021 1100434 1080463 1085838 1101523 1117033 1138991 1184928 1224364 1267589 1298617 1319726
9939A319726J0666J285r604O61N814L3217N3659Q2724R4210Q0098P5181O9468
$$ 1319726 1330392 1331677 1322073 1322734 1328548 1361765 1415424 1498148 1592358 1672456 1747637 1817105
9927A817105L6442K30m0049o4914p2726q1309p0275l9560k0830k0103n737l491
$$ 1817105 1853547 1853777 1813728 1748814 1676088 1594779 1524504 1484944 1464114 1444011 1438274 1434783
9915A434783q694j9711l3681m6248o4817n8718n2003n7716m5112l8961m6830n8198
$$ 1434783 1426089 1406378 1372697 1326449 1261632 1202914 1150911 1093195 1048083 1009122 962292 904094
9903I04094n0660l5511k5770l4551j1906j1967l2523k0291k0830k4966j5060q081
$$ 904094 853434 817923 792153 757602 745696 733729 701206 680915 660085 635119 620059 611978
9891F11978k3458r884Q86l165k0162k7365n978j2115j2593j4278o836m458m399
$$ 611978 588520 578636 579522 576357 556195 528830 522852 510737 498144 483866 477030 472572 468173
9878D68173j1479l844p563K599J2916K2028K4935J9000J9859L1572L1330j870
$$ 468173 456694 452850 445287 447886 460802 482830 507765 526765 546624 578196 609526 607656
9866F07656k5175j1450k0327j2332j875J41l890j8631p538R840K1068M7451M2113
$$ 607656 582481 571031 550704 538372 536497 536638 532748 514117 506579 516419 537487 584938 627051
9853F27051M3975O3958P8760R0953J27566J43018J44333R2243j3625j58305k11742
$$ 627051 671026 734984 813744 904697 1032263 1175281 1319614 1411857 1398232 1239927 1028185
9842A028185j80181j04928p0210m3457m4934l4462k8023j5570m941q187r823j6197
$$ 1028185 848004 743076 672866 629409 584475 550013 521990 506420 501479 493292 483469 467272
9830D67272q730q682J85m401p598J152k2563j8724J955o344m963k1222k0576j288
$$ 467272 458542 449860 450045 445644 438046 439198 416635 397911 399866 393522 388559 367337 346761 345473
9816C45473R411j0887r634K537j606j0922j0853p488j6387j7267r209o749K157
$$ 345473 354884 343997 334363 336900 335294 324372 313519 306031 289644 272377 263168 256419 258576
9803B58576q628r592l079L940L793j724j6644K197P798Q461j495n104m979q961
$$ 258576 249948 240356 237277 241217 245010 243286 226642 228839 236637 245098 243603 238499 233520 224559
9789B24559j4574J146m353j1134P359J1180N74P14j6208p443j6056O415N439l113
$$ 224559 209985 211131 206778 195644 203003 214183 214757 215471 199263 191820 175764 182179 187618 184505
9775A84505o754M356j612l666J6196n024k0677R765J783k609P202p235o156J0424
$$ 184505 177751 182107 180495 176829 193025 188001 167324 177089 178872 176263 183465 176230 170074 180498
9761A80498O866J4876l397j0404k1054J536J7288K673K713K180K002Q482L52k035
$$ 180498 187364 202240 198843 188439 167385 168921 186209 188882 191595 193775 195777 204259 204611 202576
9747B02576j2611m529N119R246L303n036q11m706j1124J3781q006j2417p139J858
$$ 202576 189965 185436 190555 199801 203104 198068 197257 192551 181427 195208 187202 174785 167646 169504
9733A69504J2680J862j0016j1328k888J0669P870m679r771J912k373M071p579
$$ 169504 182184 184046 174030 162702 159814 170483 178353 173674 163903 165815 163442 167513 159934
9720A59934m048l039kJ3545L942M18j45o560j347J1585Q736O721k17J306O850
$$ 159934 155886 152847 152845 166390 170332 170750 170605 164045 162698 174283 183019 189740 189523 190829 197679
9705A97679K114P970O453J9936M26j727J1387l979J213J1477J2508P275j4403
$$ 197679 199793 207763 214216 234152 234578 232851 244238 240259 241472 252949 265457 272732 258329
9692B58329q587j2506j3110r784j284n744j451O963r18j105m655K2488N042j2155
$$ 258329 249742 237236 224126 214342 213058 207314 205863 212826 211908 210803 206148 228636 233678 221523
9678B21523J295n814r582j6849o708n362o468Q6K859O704K210K605j0847L88L868
$$ 221523 222818 217004 207422 190573 183865 178503 172035 172121 174980 181684 183894 186499 175652 176040 179908
9663A79908M808q443k0779j896J6515N768m381l849j4259J257R818K268J0482
$$ 179908 184716 176273 155494 153598 170113 175881 171500 167651 153392 154649 164467 166735 177217
9650A77217M133o385j7616n478J0238P820P170J786M736j8645j6833L244P56k877
$$ 177217 181350 174965 157349 151871 162109 169929 177099 178885 183621 164976 148143 151387 152143 149266
9636A49266j6022j3816J1749J5659R385N692j138j8920n758M314N518n517r56
$$ 149266 133244 119428 131177 146836 156221 161913 160775 141855 136097 140411 145929 140412 139456
9623A39456j750j855N34K5K045L687J812n777m766p454j3083l808J931J4082J7080
$$ 139456 137706 135851 136385 136410 138455 142142 143954 138177 133411 125957 112874 109066 110997 125079 142159
9608A42159P853M101j0327j4986J782L192J419P344m827j4130j5225J9252J1583
$$ 142159 150012 154113 143786 128800 130582 133774 135193 142537 137710 123580 108355 127607 139190
9595A39190N706K621p680l777J4172N780n283j1285m476n827p161l774J5565j335
$$ 139190 144896 147517 139837 136060 150232 156012 150729 139444 134968 129141 121980 118206 133771 132436
9581A32436J025n7N918J2288J325k160J8405j570r593j1720j4909N475M562j4199
$$ 132436 133461 133404 139322 151610 152935 150775 169180 167610 158017 146297 131388 136863 141425 127226
9567A27226p734n706L04n384N774o585J3045J2765M660n880j521k17o570Q916
$$ 127226 119492 113786 114090 108706 114480 107895 120940 133705 138365 132485 130964 130747 124177 133093
9553A33093N002n919j507j0504p692J2260O422j103L138Q482p658m145O974k508
$$ 133093 138095 132176 130669 120165 112473 124733 131155 130052 133190 141672 134014 129869 136843 134335
9539A34335j761L336N596N222Q711j1424l670N295n956q511j3088r88L026M767
$$ 134335 132574 135910 141506 146728 155439 144015 140345 145640 139684 131173 118085 117097 120123 124890
9525A24890m36L22L7N01k2N58L673K487m833j669k20q946k432N299O510O798P443
$$ 124890 124454 124776 124813 125314 125292 125850 129523 132010 127177 125508 125288 116342 113910 119209 125719 132517 139960
9508A39960J537N314r656k1036l415J0983J0787Q428K735N52J1705O932j1473
$$ 139960 141497 146811 137155 116119 112704 123687 134474 142902 145637 146189 157894 164826 153353
9495A53353j0132n988r177k853M280J164N596q81j4181R35m218n078j841K096
$$ 153353 143221 137233 128056 125203 129483 130647 136243 135362 121181 122116 117898 112820 110979 113075
9481A13075o622j613q835N339o73j0738r36J1689Q398O019j502N213j93m061J0114
$$ 113075 106453 104840 96005 101344 100671 89933 88997 100686 109084 115103 113601 118814 118621 114560 124674
9466A24674m513q79m055K295J2389L669p128L105r505k93R187m881j3729m113
$$ 124674 120161 119282 115227 117522 129911 133580 126452 129557 120052 119759 128946 124065 110336 106223
9452A06223K588l615l895J2660M039l030M537j7592o866J0518Q379O451l61R134
$$ 106223 108811 105196 101301 113961 118000 114970 119507 101915 95049 105567 113946 120397 120036 129170
9438A29170Q901j1044p572M681p416M438J8991P784N800k8971j0425q93J585N798
$$ 129170 138071 127027 119455 124136 116720 121158 140149 147933 153733 124762 114337 113444 115029 120827
9424A20827M723j0386j5027P21O948n752J554P285P301j7979p265J3118M880L920
$$ 120827 125550 115164 100137 100858 107806 102054 103608 110893 118194 100215 92950 106068 110948 114868
9410A14868N842m730j4951L567q274K461Q751L004K964M6r298k005j199p477N968
$$ 114868 120710 115980 101029 104596 96322 98783 107534 110538 113502 113548 104250 102245 101046 93569 99537
9395I9537M22Q793L350q07q836K58J3816M372O095K212j9023r721j605N886o503
$$ 99537 99959 108752 112102 111295 102459 102717 116533 120905 127000 129212 110189 100468 98863 104749 98246
9380I8246j9476n256J4355O646N684J512P040P61L636P063j0837r271l313R754
$$ 98246 78770 73514 87869 94515 100199 101711 108751 109512 113148 120211 109374 100103 96790 106544
9366A06544p53j788O143r717R047Q58j1214j1181N473o722j2992M927L580j5493
$$ 106544 105791 104003 110146 100429 109476 110334 99120 87939 93412 86690 73698 78625 82205 66712
9352F6712j111m621O706J7148q817n022K0508K606P318O061K689l071l678p69
$$ 66712 65601 60980 67686 84834 76017 70995 91503 94109 101427 107488 110177 107106 103428 102659
9338A02659q909j2353j024K89J0899N689M905j263j1663J0111M201n115L589J6405
$$ 102659 93750 81397 80373 80662 91561 97250 102155 100892 89229 99340 103541 98426 102015 118420
9324A18420M857j2863r589J138J3216n424j4880k103O203o768M545J3951j0283
$$ 118420 123277 110414 100825 101963 115179 109755 94875 92772 98975 92207 96752 110703 100420
9311A00420j3342r515Q163J0319l384J5796Q514j4150j296m94N708O147n511k654
$$ 100420 87078 77563 85726 96045 92661 108457 116971 102821 101525 101031 106739 112886 107375 104721
9297A04721L052o651n447P088m952p966J2548J7031K286n709p785j1516O140p954
$$ 104721 107773 101122 95675 102763 97811 89845 102393 119424 121710 116001 108216 96700 102840 94886
9283I4886j1878n299l334J1542M999o378K356J955k300N220p82K662n336j363
$$ 94886 83008 77709 74375 85917 90916 84538 86894 88849 86549 91769 90987 93649 88313 86950
9269H6950P186n056j013J613P898k137j8291n63P385J2171j178jj501j2158K328
$$ 86950 94136 89080 88067 89680 97578 95441 77150 76587 83972 96143 94965 94964 93463 81305 83633
9254H3633J6335K388L806j5424j7333o457N585J481J1758K209j3511p957J223
$$ 83633 99968 102356 106162 90738 73405 66948 72533 74014 85772 87981 74470 66513 67736
9241F7736R136J0920R595n832l679J2168k619p083M674n132o599r659N599J0634
$$ 67736 76872 87792 97387 91555 87876 100044 97425 90342 95016 89884 83285 73626 79225 89859
9227H9859J1357n427O496j582j0404P124J0408n512n744k131l698m024L931J205
$$ 89859 101216 95789 102285 100703 90299 97423 107831 102319 96575 94444 90746 86722 90653 91858
9213I1858j0381k590K72n854n381P214L902m509k012J3935K072l254J736O029
$$ 91858 81477 78887 79159 73305 67924 75138 79040 74531 72519 86454 88526 85272 87008 93037
9199I3037K168p567Q94Q945R150j594m512l799j756q08l503r26o255k0360j862
$$ 93037 95205 87638 88532 97477 106627 105033 100521 96722 94966 94158 90655 89729 83474 63114 61252
9184F1252J0547J0504P852K975N94R38K569p145O028o767J217q287J363j0374
$$ 61252 71799 82303 90155 93130 93724 94662 97231 90086 96114 89347 90564 82277 83640 73266
9170G3266m020R011P175N366J0891K141p771j316m692K862M917j1593K620q209
$$ 73266 69246 78257 85432 90798 101689 103830 96059 94743 90051 92913 97830 86237 88857 80648
9156H0648L145P123Q467q626r268l881P97R167L382j5615P628N207J1046O358
$$ 80648 83793 90916 99383 90757 81489 77608 78405 87572 90954 75339 82967 88174 99220 105578
9142A05578J3531j2589k2016r895K246K520Q35j6988j6783Q606R665K1336P068
$$ 105578 119109 106520 84504 74609 76855 79375 80210 63222 46439 55045 64710 86046 93114
9129I3114j3143Q410q75J568m386J237J105r554l822J234J746O903j30N641k187
$$ 93114 79971 88381 87506 89074 84688 85925 87030 77476 73654 74888 76634 83537 83407 89048 86861
9114H6861j741P589k45j3471m600R040J211l592j243J1451J2122m040o08M368
$$ 86861 85120 92709 92464 78993 74393 83433 84644 81052 79809 91260 103382 99342 98734 103102
9100A03102J739K018J8312j41j1450K99k280j3151n552l63n924n167J0580N127
$$ 103102 104841 106859 125171 125030 113580 113879 111599 98448 92896 92533 86609 81442 92022 97149
9086I7149l78N966j0067j7733l036M741P16j9407L63j439R386N337P252p35k678
$$ 97149 96771 102737 92670 74937 71901 76642 77358 57951 58314 56875 66261 71598 78850 78115 75437
9071G5437m531j5399q048M384N714K0257J506L103J6218L800j2412K552o240j5245
$$ 75437 70906 55507 47459 51843 57557 77814 79320 82423 98641 102441 90029 92581 86341 71096
9057G1096M700J5983m677m957N913j0378j0207m743k620P542m462K269L589R767
$$ 71096 75796 91779 87102 82145 88058 77680 67473 62730 60110 67652 63190 65459 69048 78815
9043G8815O453l575j3624j0728Q319J1909K999k437J19r475p695m278m013p123
$$ 78815 85268 81693 68069 57341 65660 77569 80568 78131 78250 68775 61080 56802 52789 45666
9029D5666R62O475J8107N118J8372O636j5403J830N111o712r314j7671P296O245
$$ 45666 46628 53103 71210 76328 94700 101336 85933 87763 92874 86162 76848 59177 66473 72718
9015G2718k911r831M271J1302J4498J1170k117j2113k952j453j1071j0225J98
$$ 72718 69807 59976 64247 75549 90047 101217 99100 86987 84035 82582 71511 61286 61484
9002F1484P266K295K575J2746J3004j0538o299k33J760J2137l854j1572j7573
$$ 61484 68750 71045 73620 86366 99370 88832 82533 82300 84060 96197 92343 80771 63198
8989F3198J942M681N198O383M919o897l841q147J4674o832o043P91L245k539l864
$$ 63198 65140 69821 75019 81402 86321 79424 75583 67436 82110 75278 69235 70026 73271 70732 66868
8974F6868l02j633Q895l272Q00O501n576o492q837M782K1397Q319N609k878j0985
$$ 66868 66566 64933 73828 70556 71356 77857 72281 65789 56952 61734 83131 91450 97059 94181 83196
8959H3196o85o04l642J698M002L934m275j4502n011N319O409J3119k34j8789n280
$$ 83196 82511 81907 78265 79963 83965 87899 83624 69122 64111 69430 75839 88958 88724 69935 64655
8944F4655j530k415K849l274m833P237Q726m261J417n719p931M984P761O65K991
$$ 64655 63125 60710 63559 60285 55452 62689 71415 67154 68571 62852 54921 59905 67666 68331 71322
8929G1322J080r338J920J5327L360J900j3239j1783L631P669r227k422l09M476
$$ 71322 72402 63064 64984 80311 83671 85571 72332 60549 64180 71849 62622 60200 59891 64367
8915F4367J493O457r447j6011M415L761j73q51P594R546P498j409p347P41J1740
$$ 64367 65860 72317 62870 46859 51274 55035 54862 54011 61605 71151 78649 77240 69893 70634 82374
8900H2374K111j766J4550q269j6310j961J0320M359q114j2059r254o08k54M536
$$ 82374 84485 82719 97269 89000 72690 70729 81049 85408 77294 65235 55981 55373 55119 59655
8886E9655l595j03K057Q411l321q688J446j277J74O9J808K399N864J095J856k821
$$ 59655 56060 55957 58014 66425 63104 54416 55862 54585 54759 54828 56636 59035 64899 65994 67850 65029
8870F5029j3007n331k430k751O394R359J676P980r90O237M898R07J3121n129j1292
$$ 65029 52022 46691 44261 41510 47904 57263 58939 66919 65929 72166 77064 77971 91092 85963 74671
8855G4671l217L372P25q068J3523J1716n611l065r292P096J2024o282l108j3364
$$ 74671 71454 74826 75551 67483 81006 92722 87111 84046 74754 81850 93874 87592 84484 71120
8841G1120r106J766m923p544L401J503m848J7056J636m800j3027j1801O781M11
$$ 71120 62014 63780 58857 51313 54714 56217 51369 68425 70061 65261 52234 40433 47214 47625
8827D7625p557J4180J6560Q963Q819j4898p844Q54m365m14L372p642l821O882
$$ 47625 40068 54248 70808 79771 88590 73692 65848 66702 62337 61923 65295 57653 53832 60714
8813F0714n321l976J580o802J7869J1461L648p431j256J1824q619K468m707j0684
$$ 60714 55393 51417 52997 46195 64064 75525 79173 71742 70486 82310 73691 76159 71452 60768
8799F0768m520q658m77O883n953j1476R192P738O72O351J5823q07j1398j0741
$$ 60768 56248 47590 47113 53996 48043 36567 45759 53497 54169 60520 76343 75536 64138 53397
8785E3397j4153P06J3519M63j594M282J467L249k687n300j0012L65M618J6875
$$ 53397 39244 39950 53469 53932 52338 56620 58087 61336 58649 53349 43337 43702 48320 65195
8771F5195J3410L420q106j1903M573K149Q812j2545j4569J0100J8811m767q527
$$ 65195 78605 82025 73919 62016 66589 68738 77550 65005 50436 60536 79347 74580 66053
8758F6053p712J137K019o912q009k516o579M973Q885N920L857j87L633N615M25
$$ 66053 58341 59478 61497 54585 46576 44060 37481 42454 51339 57259 61116 60929 64562 70177 70602
8743G0602r223q054r836l220K143J4226R392J555o300j0385k2k796r44n25L002
$$ 70602 61379 53325 43489 40269 42412 56638 66030 67585 61285 50900 50878 48082 47138 46613 49615
8728D9615K945J919n129J1013R121Q47J61L9j4219p761J0710l336l073R114r63
$$ 49615 52560 54479 49350 60363 69484 70331 70492 70531 56312 48551 59261 55925 52852 61966 61003
8713F1003K2526O908o681p944o500R666J027m689o50O83m727p722p524k053J9739
$$ 61003 83529 90437 83756 75812 69312 78978 80005 75316 74666 75349 70622 62900 55376 53323 73062
8698G3062l64k176L809P017J432J8774L542n732n01n501q137j1537L300j976j1873
$$ 73062 72698 70522 74331 81348 82780 101554 105096 99364 98863 93362 85225 73688 76988 75012 63139
8683F3139l54N185M982p656K914n851M186J2686J5153o627q800q102q564R89J136
$$ 63139 62785 67970 72952 65296 68210 62359 66545 79231 94384 87757 78957 70855 62291 63280 64416
8668F4416j1575K0396P170k435r115M381R218N178J49l364n213K740o850j3809
$$ 64416 52841 73237 80407 77972 68857 73238 82456 87634 87783 84419 79206 81946 75096 61287
8654F1287J1999R042o667p469M909n969j54j1909Q872L316m280L458P336m233
$$ 61287 73286 82328 75661 68192 73101 67132 66978 55069 63941 67257 62977 66435 73771 69538
8640F9538j865K017L915q593j727O651J2360K731n991l281l765Q41N540J2088
$$ 69538 67673 69690 73605 65012 63285 69936 82296 85027 79036 75755 71990 72831 78371 90459
8626I0459j154j1027p788n086k588J9977R93j345m498J603L836r208j0598o09
$$ 90459 89305 78278 70490 65404 62816 82793 83786 82441 77943 79546 83382 74174 63576 62967
8612F2967J2996O640m633j2714m10J883m871R780M92p867l638J2942P254j510
$$ 62967 75963 82603 77970 65256 64846 66729 61858 71638 72130 64263 60625 73567 80821 79311
8598G9311M059j139J4137J3853k650j5947L060l980k0991j4371j639K2214J3809
$$ 79311 83370 82231 96368 110221 107571 91624 94684 90704 69713 55342 53703 75917 89726
8585H9726K0175J2472P573p417l120K044Q471j2920j0126K965J8905Q461J2235
$$ 89726 109901 122373 129946 122529 119409 121453 129924 117004 106878 109843 128748 137209 149444
8572A49444J70M416J2230M653J2954K3773J1292m2J923J1987J7523R397M016J357
$$ 149444 149614 154030 166260 170913 183867 207640 218932 218890 220813 232800 250323 259720 263736 265093
8558B65093j4566l4368k7668k0407k8009l3450j206J5078J235q848j1292n458
$$ 265093 250527 216159 188491 168084 140075 106625 105419 120497 121732 112884 101592 96134
8546I6134R992p003j256J261L270J0055M191o363j058p675j9172j1482J3749k18
$$ 96134 106126 99123 97867 99128 102398 112453 116644 110281 109223 101548 82376 70894 84643 84425
8532H4425m77Q769J3002r663p30R869J3928K776L394K103M301P152K0149L2695
$$ 84425 83948 92717 105719 96056 95326 105195 119123 121899 125293 127396 131697 138849 158998 191693
8518A91693M5527M4665L8782L4658O403m7417o5675l6230k9075k5748j4500k3740
$$ 191693 237220 281885 320667 355325 361728 314311 248636 212406 183331 157583 143083 119343
8506A19343k2106o789P104O492Q74k0489k243J3874l767n344n275m390m333r537
$$ 119343 97237 90448 97552 104044 104918 84429 82186 96060 92293 86949 81674 77284 72951 63414
8492F3414J2758J1046j1305k111J0695o409O398J1181N43j2931q314R640j15j1744
$$ 63414 76172 87218 75913 73802 84497 78088 84486 95667 96210 83279 74965 84605 84490 72746
8478G2746O044Q008P256J2667J7416K5916J8968L4340J0927k3661l0905k3933
$$ 72746 78790 86798 94054 106721 124137 150053 169021 203361 214288 190627 159722 135789
8466A35789p095j9060j7699p639Q807r656n146l004n631j5067J5958J2888P115
$$ 135789 128694 109634 91935 84296 93103 83447 78301 75297 69666 54599 70557 83445 90560
8453I0560J23k415k4373n74J324M796m96p833k60J1738O335j5735m784l485j3932
$$ 90560 90683 88268 63895 63321 64645 69441 68945 61112 60852 72590 78925 63190 58406 54921 40989
8438D0989R387J6201J631P269n730n864P668j5532R642J5386j5580j2192M377
$$ 40989 50376 66577 68208 75477 69747 63883 71551 56019 65661 81047 65467 53275 57652
8425E7652R668q205n103q919P984J3720N643K047j2861j6196j4834L206O042J176
$$ 57652 67320 59115 54012 45093 53077 66797 72440 74487 61626 45430 30596 33802 39844 41020
8411D1020r157r6Q478J890k172l05M557J1812P309o721k112m961Q352L049n300
$$ 41020 31863 31767 40245 42135 39963 39658 44215 56027 63336 56615 54503 49542 57894 60943 55643
8396E5643J0791L104j5709j0545j2150M126J8530J5928L35p527r918O424J1114
$$ 55643 66434 69538 53829 43284 31134 35260 53790 69718 70053 62526 52608 59032 70146
8383G0146l696j049j5956j6221N224M201J9985o373q856n719M232J3251J2366
$$ 70146 66450 65401 49445 33224 38448 42649 62634 56261 47405 41686 45918 59169 71535
8370G1535p323n551N004J4989l657q431N42j1580O152j343o659kO530J468l279
$$ 71535 64212 58661 63665 78654 74997 66566 67108 55528 61680 60337 53678 53676 60206 61674 58395
8355E8395m491j0313k862M952M226O175P360l560J618O316r997j2989N752J0955
$$ 58395 53904 43591 40729 45681 49907 56082 63442 59882 61500 67816 57819 44830 50582 61537
8341F1537K734K504J8281l266o165q074L256p079J393P572M108M237J439j262
$$ 61537 64271 66775 85056 81790 75625 67551 70807 63728 65121 72693 76801 81038 82477 81215
$$ [...]
##END NTUPLES=NMR SPECTRUM
##END=
