##TITLE=Analysis number 313199
Compound Code cc 23646
Book Reference 451/31
Project Code adrs
Chemist Name evam
##JCAMPDX= 6.0         $$ Bruker NMR JCAMP-DX V2.0
##DATA TYPE= NMR SPECTRUM
##DATA CLASS= NTUPLES
##ORIGIN= Bruker BioSpin GmbH
##OWNER= NMR
$$ XWIN-NMR		Version 3.5
$$ Fri Aug 26 09:43:16 2005 GMT Daylight Time (UT+1h)  MAYBRIDGE\NMR@NMR_250MHZ
##.OBSERVE FREQUENCY= 250.131544655141
##.OBSERVE NUCLEUS= ^1H
##.ACQUISITION MODE= SIMULTANEOUS (DQD)
##.ACQUISITION SCHEME= undefined
##.AVERAGES= 16
##.DIGITISER RES= 18
##SPECTROMETER/DATA SYSTEM= dpx250
##.PULSE SEQUENCE= zg30
##.SOLVENT NAME= CDCl3
##.SHIFT REFERENCE= (INTERNAL, CDCl3, 0, 16.522)
##AUDIT TRAIL= $$ (NUMBER, WHEN, WHO, WHERE, WHAT)
$$ ##TITLE= Audit trail, XWIN-NMR		Version 3.5
$$ ##JCAMPDX= 5.01
$$ ##ORIGIN= Bruker BioSpin GmbH
$$ ##OWNER= NMR
$$ C:\u/data/dgb/nmr/ADRS/8700/pdata/1/auditp.txt
$$ ##AUDIT TRAIL=  $$ (NUMBER, WHEN, WHO, WHERE, WHAT)
(   1,<2005-08-26 09:42:41.13 +100>,<MAYBRIDGE\NMR>,<NMR_250MHZ>,
      <created by zg, POWCHK disabled, PULCHK disabled
       configuration hash MD5:
       62 19 C7 07 E1 42 D1 B7 37 6C 3D D0 77 39 F9 E6
       data hash MD5: 64K
       AC 77 9E 5D CB 8B 71 B8 96 21 C4 4B 20 43 E5 2B>)
(   2,<2005-08-26 09:42:55.69 +100>,<MAYBRIDGE\NMR>,<NMR_250MHZ>,
      <Start of raw data processing
       ef LB = 0.3 FT_mod = 6 PKNL = 1 SI = 32K 
       data hash MD5: 32K
       FF 2B BE 29 D7 CD 16 0E C2 A3 3A 09 CD 38 75 EC>)
(   3,<2005-08-26 09:43:00.92 +100>,<MAYBRIDGE\NMR>,<NMR_250MHZ>,
      <apk 
       data hash MD5: 32K
       43 1C AE 48 54 81 F0 34 61 6E 86 B9 78 0D 45 8C>)
(   4,<2005-08-26 09:43:02.60 +100>,<MAYBRIDGE\NMR>,<NMR_250MHZ>,
      <abs ABSG = 5 
       data hash MD5: 32K
       51 7E 3A 5E 9E 3F 83 9A 85 DB 1A 65 08 7B 93 D9>)
$$ ##END=
$$ 
$$ hash MD5
$$ 0F 59 34 56 6D 84 2C 09 A7 9E 63 38 28 8A 05 9A
##$RELAX= 
##$RELAX= 
##$RELAX= 
##$RELAX= 
##$RELAX= 
##$RELAX= 
##$RELAX= 
$$ Bruker specific parameters
$$ --------------------------
##$DU= <C:\u>
##$EXPNO= 8700
##$NAME= <ADRS>
##$PROCNO= 1
##$TYPE= <nmr>
##$USER= <dgb>
##$AMP= (0..31)
100 100 100 100 100 100 100 100 100 100 100 100 100 100 100 100 100 100 
100 100 100 100 100 100 100 100 100 100 100 100 100 100 
##$AQSEQ= 0
##$AQ_mod= 3
##$AUNM= <au_zg>
##$AUTOPOS= <7 >
##$BF1= 250.13
##$BF2= 250.13
##$BF3= 250.13
##$BF4= 250.13
##$BF5= 500.13
##$BF6= 500.13
##$BF7= 500.13
##$BF8= 500.13
##$BYTORDA= 1
##$CFDGTYP= 0
##$CFRGTYP= 5
##$CHEMSTR= <none>
##$CNST= (0..31)
1 1 145 1 1 1 1 1 1 1 1 1 1 1 1 1 1 1 1 1 1 1 1 1 1 1 1 1 1 1 1 1 
##$CPDPRG= <>
##$CPDPRG1= <>
##$CPDPRG2= <>
##$CPDPRG3= <>
##$CPDPRG4= <mlev>
##$CPDPRG5= <mlev>
##$CPDPRG6= <mlev>
##$CPDPRG7= <mlev>
##$CPDPRG8= <mlev>
##$CPDPRGB= <>
##$CPDPRGT= <>
##$D= (0..31)
0 1 0 0 0 0 0 0 0 0.06 0 0 0 0 0 0 0.0002 0 0 0 0 0 0 0 0 0 0 0 0 0 0 
0 
##$DATE= 1125045759
##$DBL= (0..7)
120 120 120 120 120 120 120 120 
##$DBP= (0..7)
150 150 150 150 150 150 150 150 
##$DBP07= 0
##$DBPNAM0= <>
##$DBPNAM1= <>
$$ [...]
##$SUBNAM7= <"">
##$SUBNAM8= <"">
##$SUBNAM9= <"">
##$SW= 20.6930455092707
##$SWIBOX= (0..15)
0 0 3 0 0 0 0 0 0 0 0 0 0 0 0 0 
##$SW_h= 5175.983436853
##$TD= 65536
##$TD0= 1
##$TE= 295.16
##$TE2= 300
##$TE3= 300
##$TEG= 300
##$TL= (0..7)
0 120 120 120 120 120 120 120 
##$TP= (0..7)
150 150 150 150 150 150 150 150 
##$TP07= 0
##$TPNAME0= <>
##$TPNAME1= <>
##$TPNAME2= <>
##$TPNAME3= <>
##$TPNAME4= <>
##$TPNAME5= <>
##$TPNAME6= <>
##$TPNAME7= <>
##$TPOAL= (0..7)
0.5 0.5 0.5 0.5 0.5 0.5 0.5 0.5 
##$TPOFFS= (0..7)
0 0 0 0 0 0 0 0 
##$TUNHIN= 0
##$TUNHOUT= 0
##$TUNXOUT= 0
##$USERA1= <user>
##$USERA2= <user>
##$USERA3= <user>
##$USERA4= <user>
##$USERA5= <user>
##$V9= 5
##$VALIST= <valist>
##$VCLIST= <CCCCCCCCCCCCCCC>
##$VD= 0
##$VDLIST= <DDDDDDDDDDDDDDD>
##$VPLIST= <PPPPPPPPPPPPPPP>
##$VTLIST= <TTTTTTTTTTTTTTT>
##$WBST= 1024
##$WBSW= 4
##$XGAIN= (0..3)
0 0 0 0 
##$XL= 0
##$YL= 0
##$YMAX_a= 559368
##$YMIN_a= -493704
##$ZGOPTNS= <>
##$ZL1= 120
##$ZL2= 120
##$ZL3= 120
##$ZL4= 120
##$ABSF1= 16.522
##$ABSF2= -4.171173
##$ABSG= 5
##$ABSL= 3
##$ALPHA= 0
##$AQORDER= 0
##$ASSFAC= 0
##$ASSFACI= 0
##$ASSFACX= 0
##$ASSWID= 0
##$AUNMP= <proc_1d>
##$AZFE= 0.1
##$AZFW= 0.1
##$BCFW= 0
##$BC_mod= 0
##$BYTORDP= 0
##$COROFFS= 0
##$CY= 12.5
##$DATMOD= 1
##$DC= 0
##$DFILT= <>
##$DTYPP= 0
##$F1P= 14.0000005364418
##$F2P= -0.99999901652339
##$FCOR= 0.5
##$FTSIZE= 32768
##$FT_mod= 6
##$GAMMA= 0
##$GB= 0
##$INTBC= 1
##$INTSCL= 1
##$ISEN= 128
##$LB= 0.3
##$LEV0= 0
##$LPBIN= 0
##$MAXI= 10000
##$MC2= 0
##$MEAN= 0
##$ME_mod= 0
##$MI= 0
##$NCOEF= 0
##$NC_proc= -3
##$NLEV= 6
##$NOISF1= 0
##$NOISF2= 0
##$NSP= 0
##$NTH_PI= 0
##$NZP= 0
##$OFFSET= 16.522
##$PC= 1
##$PHC0= 130.8249
##$PHC1= 4.468482
##$PH_mod= 1
##$PKNL= yes
##$PPARMOD= 0
##$PSCAL= 4
##$PSIGN= 0
##$REVERSE= no
##$SF= 250.13
##$SI= 32768
##$SIGF1= 0
##$SIGF2= 0
##$SINO= 400
##$SIOLD= 32768
##$SREGLST= <1H.CDCl3>
##$SSB= 0
##$STSI= 32768
##$STSR= 0
##$SW_p= 5175.98343685301
##$SYMM= 0
##$S_DEV= 0
##$TDeff= 65536
##$TDoff= 0
##$TI= <Analysis number 999999
Compound Code 99
Book Reference 9
Project Code 9>
##$TILT= no
##$TM1= 0
##$TM2= 0
##$TOPLEV= 0
##$USERP1= <user>
##$USERP2= <user>
##$USERP3= <user>
##$USERP4= <user>
##$USERP5= <user>
##$WDW= 1
##$XDIM= 32768
##$YMAX_p= 529324743
##$YMIN_p= -38219
$$ End of Bruker specific parameters
$$ ---------------------------------
##NTUPLES= NMR SPECTRUM
##VAR_NAME=  FREQUENCY,     SPECTRUM/REAL,   SPECTRUM/IMAG
##SYMBOL=    X,             R,               I
##VAR_TYPE=  INDEPENDENT,   DEPENDENT,       DEPENDENT
##VAR_FORM=  AFFN,          ASDF,            ASDF
##VAR_DIM=   32768,         32768,           32768
##UNITS=     HZ,            ARBITRARY UNITS, ARBITRARY UNITS
##FACTOR=    0.157963299565203, 1,           1
##FIRST=     4132.6476996994, 0,             0
##LAST=      -1043.33573715361, 0,           0
##MIN=       -1043.33573715361, -38219,      0
##MAX=       4132.6476996994, 529324743,     0
$$ Real data points
##PAGE= N=1
##DATA TABLE= (X++(R..R)), XYDATA
$$ [...]
$$ plain form
16707 17010 15174 12465 11160 11701 11022 4795 5508 7469 7933 11616 10016 7926 8541 7182 11064 10456
16691 10456 9409 5678 1377 580 4019 7273 4824 363 -4387 -3350 -3073 -1997 3819 1030 -4722
16676 -4722 -5704 -3476 -266 -587 -2218 11 619 -3281 -3655 -1530 -3584 -1704 -1505 -5666 -5917 -7184
16660 -7184 -5305 1206 3095 2536 3933 5185 2257 -3198 -3881 -2751 -114 2663 2622 1503 4806 6316
16644 6316 3265 -404 -651 -3466 -4621 -3266 352 7555 8222 8671 4801 1463 -4875 -6568 -4534
16629 -4534 -4833 -3262 1826 1913 -4682 -7283 -4061 1748 7353 8229 5961 1487 -412 2329 6729 8781
16613 8781 3017 -1804 -5522 -6172 -6499 -3245 -670 -4097 -5638 -6141 -3504 -2255 -1804 -1152 2445 5212
16597 5212 1085 -4330 -5299 -2879 -584 722 4801 7216 7959 9388 7254 7030 4893 -14 -1741
$$ packed form
16707A7010j836k709j305N41o79o227P13J961M64L683j600k090O15j359L882o08
16691A0456j047l731m301p97L439L254k449m461m750J037K77J076N816k789n752
16676d722r82K228L210l21j631K229O08l900l74K125k054J880J99m161k51j267
16660g184J879O511J889n59J397J252k928n455o83J130K637K777m1j119L303J510
16644F316l051l669k47k815j155J355L618P203O67M49l870l338o338j693K034
16629d534k99J571N088Q7o595k601L222N809N605Q76k268m474j899K741M400K052
16613H781n764m821l718o50l27L254K575l427j541n03K637J249M51O52L597K767
16597E212m127n415r69K420K295J306M079K415P43J429k134k24k137m907j727
$$ plain form
16582 -1741 -7535 -7789 -3605 3601 2173 -757 2070 -1783 -963 1724 -40 1885 -807 -2274 -2750
16567 -2750 -2869 -2924 1093 5468 5708 3380 1237 571 1937 -2311 -8901 -15514 -12505 -14983 -14697 -8608
16551 -8608 -1766 747 -3076 -3361 -1442 -1612 -3538 -7004 -4617 1090 6642 9536 6951 8583 8314
16536 8314 8522 8504 7468 3310 -1138 -57 683 1930 2876 4777 1756 1654 2580 278 47 1703 5376
16519 5376 8714 3105 1027 -598 -2032 923 1478 1106 58 -2594 -2404 -1550 -4608 -3626 -2067 -1566
16503 -1566 -2604 -643 -3906 -7668 -4896 -1438 -2480 -6417 -4789 -1438 1706 2736 -1309 -2114 -2729
16488 -2729 1049 5249 6514 -611 499 1700 3334 -103 -3192 -6064 -1621 -346 -4075 -4907 -4317
16473 -4317 -5269 -6305 -5500 -3851 -3831 -1837 -3018 -3084 -3080 -3454 -2244 -1971 -3680 -251 -2296 -5424 -8402
$$ packed form
16582a741n794k54M184P206j428k930K827l853Q20K687j764J925k692j467m76
16567b750j19n5M017M375K40k328k143o66J366m248o590o613L009k478K86O089
16551h608O842K513l823k85J919j70j926l466K387N707N552K894k585J632k69
16536H314K08j8j036m158m448J081P40J247R46J901l021j02R26k302k31J656L673
16519E376L338n609k078j625j434K955N55l72j048k652J90Q54l058R82J559N01
16503a566j038J961l263l762K772L458j042l937J628L351L144J030m045q05o15
16488b729L778M200J265p125J110J201J634l437l089k872M443J275l729q32N90
16473d317r52j036Q05J649K0J994j181o6Ml74J210K73j709L429k045l128k978
$$ plain form
16456 -8402 -7595 -3813 -3165 -3253 -671 926 -2472 -6729 -11643 -11538 -10509 -7449 -7326 -5793 -6496 -1713
16440 -1713 1842 -411 -2356 -4403 -3558 -1912 -2522 -3702 -3483 -4152 -1507 -3412 -6955 -9437 -5509 -2930
16424 -2930 -3779 -10149 -8740 -3681 -5350 -2430 6146 5924 -929 -6821 -11533 -11453 -11233 -10185 -9152 -6691
16408 -6691 -3767 -3283 -8441 -6536 -1391 3332 3715 566 -1524 -1947 -1840 551 3655 -201 -6141 -6962
16392 -6962 -1450 2748 4441 3361 -1028 -5118 -2794 -1514 841 -796 -3162 -2876 -1736 -4859 -7612
16377 -7612 -8190 -9289 -8449 -7166 -1006 464 781 6449 7888 9312 4457 1757 1488 446 -3963 -7337
16361 -7337 -9372 -2125 4124 1548 -1874 -3693 -3351 -1103 -3629 -4383 -2873 -1381 1673 1182 -1652
16346 -1652 -2175 -2860 -3399 -2127 -6608 -5728 -3772 -6282 -6477 -5256 -8876 -8057 -9085 -6774 -1905 422
$$ packed form
16456h402Q07L782O48q8K582J597l398m257m914J05J029L060J23J533p03M783
16440a713L555k253j945k047Q45J646o10j180K19o69K645j905l543k482L928K579
16424b930q49o370J409N059j669K920Q576k22o853n892m712Q0K20J048J033K461
16408f691K924M84n158J905N145M723L83l149k090m23J07K391L104l856n940q21
16392f962N512M198J693j080m389m090K324J280K355j637k366K86J140l123k753
16377g612n78j099Q40J283O160J470L17N668J439J424m855k700k69j042m409l374
16361g337k035P247O249k576l422j819L42K248k526p54J510J492L054m91k834
16346a652n23o85n39J272m481Q80J956k510j95J221l620Q19j028K311M869K327
$$ plain form
16330 422 -451 -4522 -1266 989 1257 -2610 -3372 -6136 -10466 -7897 -8711 -6715 -3975 -3832 -4310 -5239 -6994
16313 -6994 -3188 -3296 -2838 49 -289 -1512 -3131 -3553 -3910 -4114 -1155 1965 1508 4907 7184 7414 5706
16296 5706 4113 7566 5987 -321 1417 2421 4093 5105 7244 11564 16048 20389 22311 24206 23980
16281 23980 26101 29728 41601 55534 74329 88975 96685 95128 92341 95033 102637 106521 96560
16268 96560 82176 68522 59353 52260 50720 60007 75370 104957 130326 146995 144769 129141 100911
16255 100911 72076 51763 42157 35559 27144 15556 13491 18816 19272 12294 15212 14787 5663 -207
16241 -207 -3512 -7340 -6798 -6510 -3886 -814 -3512 -3041 -4534 -3083 756 -4039 -5572 -12056 -12530 -14362
16225 -14362 -17206 -21726 -20648 -14816 -5157 -3027 -6748 -11911 -11237 -10946 -7378 -5422 -557 5774 3676
$$ packed form
16330D22q73m071L256K255K68l867p62k764m330K569q14J996K740J43m78r29j755
16313f994L806j08M58K887l38j223j619m22l57k04K959L120m57L399K277K30j708
16296E706j593L453j579o308J738J004J672J012K139M320M484M341J922J895k26
16281B3980K121L627J1873J3933J8795J4646P710j557k787K692P604L884r961
16268I6560j4384j3654r169p093j540R287J5363K9587K5369J6669k226j5628k8230
16255A00911k8835k0313r606o598q415j1588k065N325M56o978K918m25r124n870
16241b07l305l828N42K88K624L072k698M71j493J451L839m795j533o484m74j832
16225a4362k844m520J078N832R659K130l721n163O74K91L568J956M865O331k098
$$ plain form
16210 3676 987 -2607 -5221 -1190 355 1803 744 -2458 -3146 -2180 277 2564 1382 -1102 -5814
16195 -5814 -8132 -7035 -8928 -7385 -4371 1169 2708 4092 5480 -1295 -3736 -3538 -2987 -3964 -7611
16180 -7611 -12912 -12386 -9584 -10510 -5548 -1126 4381 3281 1553 2627 6067 9072 8224 -5777 -20446
16165 -20446 -20345 -18054 -20167 -29494 -36283 -36323 -25598 -16795 -18868 -11061 4544 13534 10129 3503 2760
16150 2760 1635 -2347 -5983 -6538 -2074 1154 3755 1664 1071 1316 -1000 -1375 -8267 -10170 -5422 -3747
16134 -3747 -1133 -974 -5129 -4640 -8608 -10515 -11041 -10712 -9452 -11581 -9377 -11556 -12655 -7555 -2905 -2309
16118 -2309 -7915 -8609 -4160 95 -4774 -6256 -5268 -5440 1979 1312 -7073 -8873 -5038 -6201 -10533 -11516
16102 -11516 -12701 -16481 -25128 -29855 -27969 -19058 -14220 -13397 -10961 3576 7096 -2067 -15569 -14598
$$ packed form
16210C676k689l594k614M031J545J448j059l202o88R66K457K287j182k484m712
16195e814k318J097j893J543L014N540J539J384J388o775k441J98N51r77l647
16180g611n301N26K802r26M962M422N507j100j728J074L440L005q48j4001j4669
16165b0446J01K291k113r327o789m0J0725Q803k073P807J5605Q990l405o626p43
16150B760j125l982l636n55M464L228K601k091n93K45k316l75o892j903M748J675
16134c747K614J59m155M89l968j907n26L29J260k129K204k179j099N100M650N96
16118b309n606o94M449M255m869j482R88j72P419o67q385j800L835j163m332r83
16102a1516j185l780q647m727J886Q911M838Q23K436J4537L520r163j3502R71
$$ plain form
16088 -14598 -7304 -9102 -12841 -9648 -8957 -13023 -14178 -12248 -10036 -9394 -15947 -18940 -16895 -12129 -13308
16073 -13308 -13959 -13259 -14795 -12076 -13012 -10227 -8693 -10652 -8851 -6737 -6633 -5840 -7861 -6710 -6306 -10825
16057 -10825 -12699 -12569 -9552 -8447 -10469 -5187 -4546 -8782 -13005 -12736 -7362 -1730 -4225 -8194 -4106
16042 -4106 -859 -2685 -432 -957 -2181 -2269 -5400 -7507 -8990 -5486 -6579 -6113 -8772 -11924 -13794 -12721
16026 -12721 -16570 -19560 -19383 -17138 -9630 -4277 -9247 -17348 -15156 -11800 -9022 -9712 -10991 -10861 -8693
16011 -8693 -5602 -2549 -8233 -15945 -15040 -12017 -7413 -7869 -10728 -15208 -19227 -18727 -20283 -19481 -17204 -13795
15995 -13795 -6760 -1873 -3693 -6469 -8152 -5441 -4179 -1641 -5494 -4709 -8571 -9325 -9183 -3259 -3634
15980 -3634 -6675 -7635 -7297 -689 1870 1063 1262 3867 1615 2011 2266 1460 1158 -320 -885 344 -810
$$ packed form
16088a4598P294j798l739L193O91m066j155J930K212O42o553k993K045M766j179
16073a3308o51P00j536K719r36K785J534j959J801K114J04P93k021J151M04m519
16057a0825j874J30L017J105k022N282O41m236m223K69N374N632k495l969M088
16042d106L247j826K253n25j224q8l131k107j483L504j093M66k659l152j870J073
16026a2721l849k990J77K245P508N353m970q101K192L356K778o90j279J30K168
16011h693L091L053n684p712R05L023M604m56k859m480m019N00j556Q02K277L409
15995a3795P035M887j820k776j683K711J262K538l853P85l862p54J42N924l75
15980c634l041r60L38O608K559q07J99K605k252L96K55q06l02j478n65J229j154
$$ plain form
15963 -810 -5767 -5618 -8332 -4730 -1875 168 -5880 -6100 -950 -4001 -6803 -8983 -10920 -9933 -5329 -2364
15947 -2364 -3935 -2712 -3166 -3624 -5694 -6158 -7541 -5850 -5264 -5034 -6842 -3636 -5070 -4216 -1336 3595
15931 3595 8922 14060 15855 13348 16056 12924 14280 9671 4682 4291 1139 -2941 -6892 -10995 -6431
15916 -6431 -7873 -8013 -9365 -9943 -10332 -10748 -14492 -11344 -6162 -6746 -9384 -13246 -12429 -6042 1746 4362
15900 4362 4464 3152 -1054 -3949 -2079 2175 3623 5472 1977 790 1258 7578 13699 11018 7552
15885 7552 7399 8266 9916 13473 11550 4432 1853 1881 984 720 -770 -2407 -2986 -6003 -10920 -9522
15869 -9522 -10219 -11900 -16244 -17845 -15669 -9294 -12237 -12402 -10279 -11077 -12969 -9887 -4267 3 -5318
15854 -5318 -8883 -5150 -4283 -4495 -6327 -4411 314 -901 -4762 -2002 105 3165 5556 308 -8119
$$ packed form
15963h10m957J49k714L602K855K043o048k20N150l051k802k180j937R87M604K965
15947b364j571J223m54m58k070m64j383J691N86K30j808L206j434Q54K880M931
15931C595N327N138J795k507K708l132J356m609m989l91l152m080l951m103M564
15916f431j442j40j352n78l89m16l744L148N182n84k638l862Q17O387P788K616
15900D362J02j312m206k895J870M254J448J849l495j187M68O320O121k681l466
15885G552j53Q67J650L557j923p118k579K8q97k64j490j637n79l017m917J398
15869i522o97j681m344j601K176O375k943j65K123p98j892L082N620M270n321
15854e318l565L733Q67k12j832J916M725j215l861K760K107L060K391n248q427
$$ plain form
15839 -8119 -12881 -11724 -6475 14 -1354 -6829 -6061 -1828 -1345 -2468 476 -410 -3179 -3130 -2271 -1141
15823 -1141 -9204 -9241 -7774 -10252 -8001 -8407 -10833 -6520 -5244 -3766 -1866 -1058 1090 409 -200 -2461
15807 -2461 -6184 -7835 -10761 -9919 -9137 -8499 -6099 -6514 -5601 -1603 -3406 -5498 -6199 -6894 -4228 -9152
15791 -9152 -14528 -11596 -11566 -8141 -6865 -8407 -9063 -8957 -6902 -7102 -8850 -10782 -7739 -3864 1147 7952
15775 7952 5363 -3313 -6211 -5572 -4688 -4422 -4134 -3289 -5993 -10457 -6069 -5555 -3641 -4669 -4521 -8523
15759 -8523 -8544 -8773 -10606 -12277 -11859 -10015 -13264 -7167 -5694 -6730 -4950 -4201 -2776 -278 263 -210
15743 -210 865 1611 -89 -731 -7154 -6354 -5399 -5272 -6826 -7767 -9210 -7318 -5731 -4143 -5475 -3918
15727 -3918 -7587 -7916 -10477 -7418 -5094 -696 -2396 -3185 -3861 -6591 -10621 -10530 -13865 -11900 -11762 -10055
$$ packed form
15839h119m762J157N249O489j368n475P68M233M83j123K944q86k769M9Q59J130
15823a141q063l7J467k478K251m06k426M313J276J478J900Q08K148o81o09k261
15807b461l723j651k926Q42P82O38K400m15R13L998j803k092p01o95K666m924
15791i152n376K932L0L425J276j542o56J06K055k00j748j932L043L875N011O805
15775G952k589q676k898O39Q84K66K88Q45k704m464M388N14J914j028J48m002
15759h523k1k29j833j671M18J844l249O097J473j036J780P49J425K498N41m73
15743b10J075P46j700o42o423Q00R55J27j554r41j443J892J587J588j332J557
15727c918l669l29k561L059K324M398j700p89o76k730m030R1l335J965J38J707
$$ plain form
15711 -10055 -8656 -8375 -6886 -4229 -4366 -9248 -7061 -6718 -7347 -3199 448 -3184 -5343 -4179 -8850
15696 -8850 -9909 -5546 -9261 -11164 -10129 -8577 -7595 -4721 -7494 -10060 -6617 -2534 -2475 -1365 -595 -3223
15680 -3223 -6681 -3550 1813 -109 -4767 -4930 -7522 -9119 -4733 -1821 -2100 -5927 -6951 -2499 595
15665 595 -285 832 -3666 -5348 -4643 -6848 -7110 -4021 -2048 4771 5784 -1390 -5915 -7975 -9204 -7830
15649 -7830 -5685 -8131 -11692 -14152 -10484 -8185 -6094 -3228 -2897 306 1641 -437 -2394 -4057 -6839
15634 -6839 -5850 -6614 -9373 -11332 -12923 -14674 -12134 -7670 -8785 -7649 -9608 -7109 -7969 -10042 -12200
15619 -12200 -9904 -13178 -14476 -9672 -6044 -5044 -7925 -12243 -14714 -10761 -8755 -7580 -8387 -10297 -10891
15604 -10891 -9374 -9129 -9682 -10408 -9756 -4623 -331 3303 1061 1618 1875 4077 -24 -5955 -6477 -1176
$$ packed form
15711a0055J399K81J489K657j37m882K187L43o29M148L647l632k159J164m671
15696h850j059M363l715j903J035J552R82K874k773k566L443M083N9J110P70k628
15680c223l458L131N363j922m658j63k592j597M386K912k79l827j024M452L094
15665E95q80J117m498j682P05k205k62L089J973O819J013p174m525k060j229J374
15649g830K145k446l561k460L668K299K091K866L31L203J335k078j957j663k782
15634f839R89p64k759j959j591j751K540M464j115J136j959K499q60k073k158
15619a2200K296l274j298M804L628J000k881m318k471L953K006J175q07j910n94
15604a0891J517K45n53p26O52N133M292L634k242N57K57K202m101n931n22N301
$$ plain form
15588 -1176 -1257 -2463 -1095 -3343 -8008 -15806 -17044 -13455 -13968 -13509 -10806 -9502 -12633 -12680 -12089 -7635
15572 -7635 -7680 -10306 -5062 -3706 -4106 -9078 -12333 -12241 -10087 -4720 -1959 -6185 -14752 -15923 -11727 -7245
15556 -7245 -6340 -7789 -8233 -7486 -7273 -7398 -13687 -16217 -11595 -11518 -15347 -12367 -7666 -5037 -561 1016
15540 1016 215 -1797 -5239 -7678 -8000 -3752 -1308 -5426 -4975 -4355 -2915 2675 3007 2714 4324 1261
15524 1261 -2929 -2437 -4706 -5894 -2952 -4777 -1378 -2106 -7217 -8293 -11026 -10466 -9353 -12377 -10126
15509 -10126 -9451 -10273 -9749 -11627 -18202 -16068 -7527 -10388 -13461 -13146 -13803 -14623 -11688 -10284 -11396 -14443
15493 -14443 -12616 -10801 -9892 -10901 -13295 -10379 -6683 -2938 -49 -2018 -4239 -6775 -10737 -6322 -3963
15478 -3963 -4788 -9282 -16391 -15963 -13813 -13545 -8370 -7057 -5868 -8154 -11896 -13826 -18002 -19923 -14124
$$ packed form
15588a176q1j206J368k248m665p798j238L589n13M59K703J304l131m7N91M454
15572g635m5k626N244J356m00m972l255R2K154N367K761m226q567j171M196M482
15556g245R05j449m44P47K13j25o289k530M622P7l829K980M701K629M476J577
15540A016q01k012l442k439l22M248K444m118M51O20J440N590L32k93J610l063
15524A261m190M92k269j188K942j825L399p28n111j076k733N60J113l024K251
15509a0126O75q22N24j878o575K134Q541k861l073L15o57q20K935J404j112l047
15493a4443J827J815R09j009k394K916L696L745K889j969k221k536l962M415K359
15478c963q25m494p109M28K150K68N175J313J189k286l742j930m176j921N799
$$ plain form
15463 -14124 -10735 -12511 -8539 -5082 -8704 -7886 -7425 -2446 -3402 -10215 -18473 -21624 -19482 -21315 -18449
15448 -18449 -15744 -13426 -7677 -9190 -12737 -10181 -8844 -5580 -2221 -2923 -3811 -6526 -7472 -4682 -3900
15433 -3900 -2858 -1189 -3677 -7405 -6735 -3935 -1336 -2865 -3019 -1337 -4001 -7355 -11202 -13095 -8622
15418 -8622 -10117 -10008 -9828 -11162 -11679 -5800 215 1159 1605 925 352 -6117 -11000 -7709 -1756 -2795
15402 -2795 -5017 -4011 -11454 -15708 -15615 -10361 -5891 -8253 -10277 -10404 -7766 -7146 -11145 -16242 -14509 -11685
15386 -11685 -7945 -9637 -8962 -5061 -6299 -8799 -3935 608 1451 -4399 -5526 -1286 -664 1023 -2071
15371 -2071 -3990 -10460 -8145 -6748 -2777 -455 1090 -1797 -6358 -8838 -9348 -10092 -9616 -9215 -5715 -4872
15355 -4872 -5292 -3364 -5395 -6079 -7188 -10169 -11665 -7723 -4094 -1742 -2393 -621 -6752 -13230 -11505
$$ packed form
15463a4124L389j776L972L457l622Q18M61M979r56o813q258l151K142j833K866
15448a8449K705K318N749j513l547K556J337L264L359p02q88k715r46K790P82
15433c900J042J669k488l728O70K800K599j529j54J682k664l354l847j893M473
15418h622j495J09J80j334n17N879O015R44M46o80n73o469m883L291N953j039
15402b795k222J006p443m254R3N254M470k362k024j27K638O20l999n097J733K824
15386a1685L740j692O75L901j238k500M864M543Q43n850j127M240O22J687l094
15371b071j919o470K315J397L971K322J545k887m561k480n10p44M76M01L500Q43
15355d872m20J928k031o84j109k981j496L942L629K352o51J772o131o478J725
$$ plain form
15340 -11505 -7011 -7827 -10081 -9941 -7988 -5668 -3901 -4507 -8128 -11688 -9765 -11529 -14475 -12122 -8417
15325 -8417 -6789 -5278 -5954 -9539 -5166 -5355 -6462 -8028 -9916 -3980 -983 -8008 -10883 -11149 -11196 -13126
15309 -13126 -16297 -13702 -11312 -14249 -14573 -15095 -15489 -10735 -10152 -11614 -16345 -13283 -6974 -3120 -1623
15294 -1623 -4502 -9114 -12055 -11871 -12019 -11460 -14227 -6256 -2666 -4003 -2575 -2292 -7761 -11231 -12446 -8495
15278 -8495 -8002 -6935 -3868 1294 2304 -1194 -8434 -9743 -5328 -2698 -2551 -5833 -9183 -9227 -13051 -11988
15262 -11988 -9060 -10705 -11712 -10665 -12670 -19741 -17840 -13176 -11381 -10281 -10316 -10197 -9473 -10600 -12318
15247 -12318 -9352 -9628 -11235 -9810 -12888 -16093 -12238 -12692 -14504 -13240 -16026 -11769 -11547 -11660 -11738 -11434
15231 -11434 -12097 -12110 -7015 -8677 -13717 -15420 -14157 -13511 -13721 -14505 -17044 -18981 -18092 -10868 -7240 -10255
$$ packed form
15340a1505M494q16k254J40J953K320J767o06l621l560J923j764k946K353L705
15325h417J628J511o76l585M373j89j107j566j888N936K997p025k875k66m7j930
15309a3126l171K595K390k937l24n22l94M754N83j462m731L062O309L854J497
15294a623k879m612k941J84j48N59k767P971L590j337J428K83n469l470j215L951
15278h495M93J067L067N162J010l498p240j309M415K630J47l282l350m4l824J063
15262a1988K928j645j007J047k005p071J901M664J795J100l5J19P24j127j718
15247a2318K966k76j607J425l078l205L855m54j812J264k786M257K22j13p8L04
15231a1434o63j3N095j662n040j703J263O46k10p84k539j937Q89P224L628l015
$$ plain form
15215 -10255 -4157 -2394 -4362 -4576 -6613 -12396 -10778 -14341 -16608 -15030 -12938 -10150 -13490 -13290 -10995
15200 -10995 -10059 -10425 -10413 -11740 -15749 -13898 -14217 -16713 -18693 -19261 -15397 -11088 -8622 -728 126 -3740
15184 -3740 -5079 -8161 -10854 -12396 -11559 -14702 -11357 -8231 -6922 -5262 -3731 -5208 -8788 -7341 -4264
15169 -4264 -3104 -5977 -4285 -3727 -7956 -8790 -3379 -3927 -1506 -4613 -5722 -8804 -7195 -3891 -4798 -4804
15153 -4804 -2061 -6803 -9974 -15592 -17785 -20808 -20400 -16651 -15160 -18458 -13494 -10456 -13407 -13762 -9869
15138 -9869 -11674 -12404 -9040 -9093 -12956 -18024 -18388 -13529 -12157 -13326 -7777 -7828 -5919 -5980 -5730 -7713 -12969
15121 -12969 -13392 -11537 -7886 -6943 -10711 -12151 -7646 -9847 -9693 -8762 -10835 -10683 -10259 -11056 -9328 -7453
15105 -7453 -7813 -7067 -8772 -13246 -15873 -16993 -15695 -15974 -17313 -18806 -21192 -20668 -21978 -21995 -11093 -6643
$$ packed form
15215a0255O098J763j968k14k037n783J618l563k267J578K092K788l340K00K295
15200a0995R36l66J2j327m009J851l19k496j980n68L864M309K466P894Q54l866
15184c740j339l082k693j542Q37l143L345L126J309J660J531j477l580J447L077
15169d264J160k873J692N58m229q34N411n48K421l107j109l082J609L304r07o
15153d804K743m742l171n618k193l023M08L749J491l298M964L038k951l55L893
15138i869j805p30L364n3l863n068l64M859J372j169N549n1J909o1K50j983n256
15121a2969m23J855L651R43l768j440M505k201J54R31k073J52M24p97J728J875
15105g453l60P46j705m474k627j120J298k79j339j493k386N24j310j7J0902M450
$$ plain form
15089 -6643 -7767 -7046 -9054 -9426 -9906 -6776 -9105 -7337 -7115 -13595 -14519 -9948 -6076 -8421 -13297 -17278
15073 -17278 -15530 -15985 -13241 -8017 -11982 -16947 -13499 -11107 -7830 -6771 -7924 -11370 -12981 -12338 -15511
15058 -15511 -11697 -5612 -7575 -8911 -8138 -8530 -10330 -14758 -12116 -4878 -8407 -14943 -15348 -14517 -14311 -15319
15042 -15319 -17298 -14987 -11085 -11159 -12738 -11331 -10684 -12583 -9765 -11218 -10340 -10302 -12476 -14516 -12358 -8953
15026 -8953 -8133 -15302 -19774 -14990 -11691 -11563 -11439 -11914 -17212 -16228 -11032 -5595 -5623 -10328 -10475 -8328 -8679
15009 -8679 -12599 -15271 -16009 -15307 -10327 -8853 -8975 -9178 -9501 -7263 -2485 -5723 -11343 -15425 -13248 -10583
14993 -10583 -12038 -9503 -11381 -13641 -13558 -15242 -12368 -9678 -14428 -14051 -9373 -4536 -9648 -11903 -11360
14978 -11360 -9646 -5955 -5550 -5592 -4680 -2786 -3215 -5947 -12094 -11042 -7166 -3851 -3921 -6914 -9629 -9923
$$ packed form
15089f643j124P21k008l72m80L130k329J768K22o480r24M571L872k345m876l981
15073a7278J748m55K744N224l965m965L448K392L277J059j153l446j611O43l173
15058a5511L814O085j963j336P73l92j800m428K642P238l529o536m05Q31K06j008
15042a5319j979K311L902p4j579J407O47j899K818j453Q78L8k174k040K158L405
15026h953Q20p169m472M784L299J28J24m75n298R84N196N437k8m705j47K147l51
15009h679l920k672p38P02M980J474j22k03l23K238M778l238n620m082K177K665
14993a0583j455K535j878k260Q3j684K874K690m750L77M678M837n112k255N43
14978a1360J714L691M05m2R12J894m29k732o147J052L876L315p0k993k715k94
$$ plain form
14962 -9923 -11076 -8560 -11201 -7865 -4395 -5742 -9241 -9317 -9572 -10173 -8844 -6765 -9626 -11576 -10923 -7865
14946 -7865 2290 2647 -2537 -5509 -4335 -4347 -7596 -9348 -10434 -10488 -12255 -13434 -14199 -14337 -12311 -10406
14930 -10406 -13201 -20545 -20390 -15226 -12949 -12862 -11707 -8182 -8175 -12897 -13668 -12451 -10448 -9864 -16671 -18161
14914 -18161 -13756 -13531 -10917 -9283 -10501 -9184 -5460 -4842 -10230 -14693 -16704 -18036 -20258 -26722 -20437
14899 -20437 -14851 -17361 -16612 -13075 -10999 -15245 -20304 -16308 -12401 -7186 -7929 -10672 -13845 -17682 -18762
14884 -18762 -17340 -18460 -14851 -10528 -9106 -4749 -956 -844 -4205 -3918 -5916 -5129 -5942 -5658 -9324 -11488
14868 -11488 -10515 -3800 -5815 -13382 -14183 -9713 -7255 -8671 -11380 -17623 -14646 -10903 -6557 -4746 -5847
14853 -5847 -1577 -2443 -5732 -4034 -7110 -7229 -7141 -9038 -8856 -7414 -5065 -9414 -9671 -10188 -11603 -8249
$$ packed form
14962i923j153K516k641L336L470j347l499p6k55o01J329K079k861j950O53L058
14946g865J0155L57n184k972J174j2l249j752j086n4j767j179p65j38K026J905
14930a0406k795p344J55N164K277Q7J155L525Pm722p71J217K003N84o807j490
14914a8161M405K25K614J634j218J317L724O18n388m463k011j332k222o464O285
14899b0437N586k510P49L537K076m246n059L996L907N215p43k743l173l837j080
14884a8762J422j120L609M323J422M357L793J12l361K87j998P87q13K84l666k164
14868a1488R73O715k015p567q01M470K458j416k709o243K977L743M346J811j101
14853e847M270q66l289J698l076j19Q8j897J82J442K349m349k57n17j415L354
$$ plain form
14837 -8249 -5866 -10921 -12358 -11288 -11324 -11356 -10326 -10860 -9772 -9954 -11412 -11986 -15370 -12316 -15761 -18018
14821 -18018 -15971 -16839 -16852 -12504 -13799 -16725 -12953 -11541 -8189 -7966 -8784 -8069 -3777 -7453 -11660 -11899
14805 -11899 -13597 -9902 -5802 -638 -395 -3301 -4159 -656 -1741 146 -1044 -6749 -9750 -10233 -12653
14790 -12653 -14072 -12826 -10103 -12464 -10134 -7961 -8352 -6045 -6433 -10359 -11939 -13677 -9878 -10037 -5485
14775 -5485 -1576 -1084 -3648 -3769 -2541 -724 -8633 -8606 -2022 -4434 -7299 -7457 -5218 -6008 -5306 -6025 -5544
14758 -5544 -6040 -5947 -4619 -2697 -6242 -11061 -10570 -9495 -7924 -8335 -8398 -8818 -11535 -14173 -14309 -14669 -13859
14741 -13859 -8749 -6888 -2405 683 -2879 -6173 -6872 -5595 -4627 -2608 -2211 -3639 -1806 -1372 -6564
14726 -6564 -6250 -4838 -6053 -8346 -9813 -12602 -12641 -9307 -7793 -5983 -909 1961 1044 -3159 -7573 -8830
$$ packed form
14837h249K383n055j437J070l6l2J030n34J088j82j458n74l384L054l445k257
14821a8018K047q68j3M348j295k926L772J412L352K23q18P15M292l676m207k39
14805a1899j698L695M100N164K43k906q58L503j085J887j190n705l001m83k420
14790a2653j419J246K723k361K330K173l91K307l88l926j580j738L799j59M552
14775e485L909M92k564j21J228J817p909K7O584k412k865j58K239p90P02p19M81
14758e544m96R3J328J922l545m819M91J075J571m11o3m20k717k638j36l60Q10
14741a3859N110J861M483L088l562l294o99J277R68K019L97j428J833M34n192
14726f564L14J412j215k293j467k789l9L334J514J810N074K870r17m203m414j257
$$ plain form
14710 -8830 -5560 -5780 -7335 -7270 -5857 -6879 -6724 -8125 -7930 -2073 -1796 -1633 3292 3026 -1407 -2720 -1148
14693 -1148 -2469 -6618 -6082 -10682 -11769 -5896 -5745 -3887 -2210 -2279 -2381 -5960 -6572 -8973 -9564 -8160
14677 -8160 -9242 -10162 -10409 -10453 -9721 -9332 -5934 -5347 -3386 -217 423 942 2425 3589 586 -4335 -4269
14660 -4269 -1564 -3232 -4662 -5308 -4313 -3366 -3878 -204 -1567 -6461 -5337 -1586 4185 1933 1434 1910
14644 1910 731 2277 1487 -3171 -4554 -8350 -7541 -10996 -8533 -9358 -7424 107 1589 -1543 -4284
14629 -4284 -651 -3219 -7058 -5351 149 1192 -850 -632 -3704 -1147 -3112 -5678 1543 5578 5477
14614 5477 6088 1455 -1640 -863 131 -3137 -7312 -5801 -932 -105 -4474 -6202 -3682 -279 2059 -739
14598 -739 -6282 -6915 -8954 -6727 -3506 -4429 -4882 -5144 -5065 -9549 -12271 -11326 -12266 -7715 -8704 -10373 -8957
$$ packed form
14710h830L270k20j555O5J413j022J55j401J95N857K77J63M925k66m433j313J572
14693a148j321m149N36m600j087N873J51J858J677o9j02l579o12k401n91J404
14677h160j082r20k47m4P32L89L398N87J961L169O40N19J483J164l003m921O6
14660d269K705j668j430o46R95R47n12L674j363m894J124L751N771k252m99M76
14644A910j179J546p90m658j383l796Q09l455K463q25J934P531J482l132k741
14629d284L633k568l839J707N500J043k042K18l072K557j965k566P221M035j01
14614E477O11m633l095P77R94l268m175J511M869Q27m369j728K520L403K338k798
14598g39n543o33k039K227L221r23m53k62P9m484k722R45r40M551r89j669J416
$$ plain form
14581 -8957 -8743 -8691 -8981 -6530 -10221 -13586 -16601 -12637 -3223 3228 2910 -2882 -9953 -10709 -9084 -9855
14565 -9855 -12208 -12696 -5289 -3133 -6885 -3054 -1127 -1401 -4178 -3436 -3050 -1501 326 5011 4070 -130
14549 -130 2410 -389 -2698 -8273 -8103 -4524 -5895 -4631 -1851 -1220 -164 -1631 -1134 -3997 -9540 -9695
14533 -9695 -12916 -9499 -6588 -6280 -5207 -4116 -4467 -5532 -2668 450 -5479 -8038 -8975 -5499 -2509
14518 -2509 -6005 -4183 703 614 -1018 -5066 -6892 -3299 -60 -453 -434 -866 761 -629 1472 8867
14502 8867 6970 3766 1900 8353 17424 19220 13960 15928 25912 35806 43189 46232 55146 65498
14488 65498 80230 94443 104183 122167 162050 212050 277398 357657 423766 473669 501006 499062
14476 499062 463260 406807 329186 249918 184312 138326 104182 80823 60612 45706 36986 35370
$$ packed form
14581h957K14N2k90K451l691l365l015L964R414O451l18n792p071p56J625p71
14565i855k353m88P407K156l752L831J927k74k777P42L86J549J827M685r41m200
14549a30K540k799k309n575J70L579j371J264K780O31J056j467M97k863n543j55
14533i695l221L417K911L08J073J091l51j065K864L118n929k559r37L476K990
14518b509l496J822M886q9j632m048j826L593L239l93J9m32J627j390K101P395
14502H867j897l204j866O453R071J796n260J968R984R894P383L043Q914J0352
14488F5498J4732J4213R740J7984L9883N0000O5348Q0259O6109M9903K7337j944
14476D99062l5802n6453p7621p9268o5606m5986l4144k3359k0211j4906q720j616
$$ plain form
14464 35370 29763 23716 19032 13237 7564 6172 6784 7625 5961 1473 3107 3570 3706 3815 -312 -2766
14448 -2766 -2475 -5215 -10597 -14161 -10813 -15248 -15343 -9837 -3140 -3110 -2535 633 -1840 -5884 -9348 -12071
14432 -12071 -14503 -11625 -7722 -7339 -8316 -6842 -5720 -9395 -7401 -6669 -5494 -3749 -82 -961 -4371
14417 -4371 -7804 -6741 -9258 -10277 -8140 -4419 -7125 -6785 -4076 -1683 -1044 -7442 -8318 -6912 -9934
14402 -9934 -9556 -6473 -4899 -8584 -12956 -12413 -10644 -9440 -8203 -7571 -4948 -5306 -6228 -7224 -5589 -5844
14386 -5844 -5604 -6463 -11795 -14933 -13006 -9975 -5817 -8563 -10531 -11208 -12179 -8854 -2519 -3894 -4954 -7221
14370 -7221 -4015 -6080 -6919 -5924 -8900 -8090 -4775 -5801 -8238 -11630 -10281 -6432 -4248 -6003 -8819
14355 -8819 -12382 -15021 -8348 -6819 -5211 -4481 -5160 -7784 -4451 -5648 -11416 -15283 -14216 -11902 -12982
$$ packed form
14464C5370n607o047m684n795n673j392O12Q41j664m488J634M63J36J09m127k454
14448b766K91k740n382l564L348m435r5N506O697L0N75L168k473m044l464k723
14432a2071k432K878L903L83r77J474J122l675J994P32J175J745L667q79l410
14417d371l433J063k517j019K137L721k706L40K709K393O39o398q76J406l022
14402i934L78L083J574l685m372N43J769J204J237O32K623l58r22r96J635k55
14386e844K40q59n332l138J927L031M158k746j968o77r71L325O335j375j060k267
14370g221L206k065q39R95k976Q10L315j026k437l392J349L849K184j755k816
14355h819l563k639O673J529J608P30o79k624L333j197n768l867J067K314j080
$$ plain form
14340 -12982 -11671 -13356 -12048 -6418 -4522 -2978 -8361 -10858 -9824 -8325 -4231 1984 1146 -1235 -5198
14325 -5198 -6643 -7097 -6063 -8668 -3647 -5396 -6333 -5378 -6430 -10829 -8923 -5230 -992 2458 -851
14310 -851 -4587 -5136 -6376 -6249 -6776 -7145 -4032 -1679 -1409 1011 1158 -4580 -8804 -13651 -12361 -10446
14294 -10446 -7915 -9536 -8597 -6846 -1226 3969 887 682 -1729 -1811 2796 6596 5680 -2094 -7990 -7983
14278 -7983 -3533 -1732 -4537 -7814 -9649 -9600 -4602 614 1577 -3703 -5521 -5345 -6307 -3697 -1687 -2980
14262 -2980 765 2445 6704 9227 11197 9286 3167 3226 2810 1118 -629 -3247 -2979 -1344 -5218 -5955
14246 -5955 -5853 -5676 -6110 -10257 -13670 -12498 -16240 -13866 -13438 -12092 -15118 -18931 -12251 -4133 2872 1257
14230 1257 -6992 -17619 -21838 -13363 -4087 5314 12153 20054 27215 30611 34546 38769 30891 16666
$$ packed form
14340a2982J311j685J308N630J896J544n383k497J034J499M094O215q38k381l963
14325e198j445m54J034k605N021j749r37R55j052m399J906L693M238L450l309
14310h51l736n49j240J27n27l69L113K353K70K420J47n738m224m847J290J915
14294a0446K531j621R39J751N620N195l082k05k411q2M607L800r16p774n896P
14278g983M450J801k805l277j835M9M998N216R63n280j818J76r62K610K010j293
14262b980L745J680M259K523J970j911o119N9m16j692j747k618K68J635l874p37
14246e955J02J77m34m147l413J172l742K374M28J346l026l813O680Q118P005j615
14230A257q249j0627m219Q475R276R401O839P901P161L396L935M223p878j4225
$$ plain form
14216 16666 3805 -1041 -2555 -11670 -22660 -22506 -15066 -7910 -8715 -12064 -10797 -9168 -6715 -10426
14202 -10426 -5948 -2379 1308 1025 2977 5029 3740 5893 4293 1168 2919 -1462 -2366 763 -2159
14187 -2159 -5089 -6828 -6154 -3848 -3463 -1682 -4896 -8128 -5941 -612 -2467 -3084 -4449 -5173 -3926 -5778
14171 -5778 -8350 -9571 -4439 -7427 -17706 -23137 -16067 -9312 -16265 -11782 18796 48158 44053 30139
14157 30139 40179 46622 18526 -10247 -13761 -12878 -21606 -24779 -12745 -3882 -3080 -4582 -5368 -4852
14143 -4852 -9826 -11299 -3967 2200 298 2678 5497 4985 915 -640 1712 3090 -616 -11326 -10067
14128 -10067 -8601 -4698 -6060 -7791 -5108 -4228 -511 1094 -3600 -5263 -2010 1559 325 2770 -575
14113 -575 -4551 -6469 -7480 -1653 1126 2141 4278 2402 6330 8329 1600 -6223 -3082 -622 -3622
$$ packed form
14216A6666j2861m846j514r115j0990J54P440P156q05l349J267J629K453l711
14202a0426M478L569L687k83J952K052j289K153j600l125J751m381r04L129k922
14187b159k930j739O74K306L85J781l214l232K187N329j855o17j365p24J247j852
14171e778k572j221N132k988j0279n431P070O755o953M483L0578K9362m105j3914
14157C0139J0040O443k8096k8773l514Q83q728l173J2034Q863Q02j502p86N16
14143d852m974j473P332O167j902K380K819n12m070j555K352J378l706j0710J259
14128a0067J466L903j362j731K683Q80L717J605m694j663L253L569j234K445l345
14113e75l976j918j011N827K779J015K137j876L928J999o729p823L141K460l000
$$ plain form
14098 -3622 -8872 -9727 -8906 -14131 -11365 -6564 -3108 -5134 -15044 -18979 -10996 -3677 -4698 -7944 -7917 -6104
14082 -6104 -7919 -8240 -6471 -6492 -6185 -2794 -3319 -9837 -9625 -9215 -7684 -3490 -8840 -10316 -12193 -17267
14066 -17267 -14110 -7167 -593 -338 -1034 -1793 -5068 -5122 -3960 -6571 -5863 -3925 -6653 -10247 -12150 -9593
14050 -9593 -7935 -7681 -7340 -7879 -4213 -783 -287 -4668 -2356 -6076 -10102 -14716 -16462 -18463 -17623 -16373
14034 -16373 -18350 -16871 -18665 -16948 -14132 -8796 -5796 2610 4722 1388 -672 -2704 -8379 -6890
14020 -6890 -4119 -5220 -6717 -4658 -6653 -5731 -831 -2020 -3886 -3191 -3554 -7762 -5469 -1784 -716
14005 -716 576 -738 -3013 -5104 -6676 -7358 -13029 -12111 -11343 -8084 -1157 1205 -2721 -4268 -5710 -8506
13989 -8506 -4854 -4494 -6011 -3040 -192 -3935 -3108 -2990 -4441 -6600 -6532 -5927 -7941 -10299 -7219 -3158
$$ packed form
14098c622n250q55Q21n225K766M801L456k026r910l935P983P319j021l246K7J813
14082f104j815l21J769k1L07L391n25o518K12M10J531M194n350j476j877n074
14066a7267L157O943O574K55o96p59l275n4J162k611P08J938k728l594j903K557
14050i593J658K54L41n39L666L430M96m381K312l720m026m614j746k001Q40J250
14034a6373j977J479j794J717K816N336L000Q406K112l334k060k032n675J489
14020f890K771j101j497K059j995R22M900j189j866O95l63m208K293L685J068
14005g16J292j314k275k091j572o82n671R18P68L259O927K362l926j547j442k796
13989h506L652L60j517K971K848l743Q27J18j451k159O8O05k014k358L080M061
$$ plain form
13973 -3158 -449 -2822 -5090 -8529 -10705 -13371 -14197 -7387 -3149 148 87 1757 -6960 -10333 -13299
13958 -13299 -16284 -13824 -11470 -8034 -4883 -9037 -13364 -13118 -10398 -10270 -7014 -5148 -7774 -4482 -5535
13943 -5535 -3227 -2875 -5961 -9249 -9569 -5646 -3090 -3903 -6366 -10384 -15148 -14851 -12416 -6389 -3722 -3827
13927 -3827 -4147 -2290 -4008 -5565 -4156 -6301 -6151 -725 933 -3236 -3326 -2145 -1522 -2216 -6354 -14806
13911 -14806 -10900 -4730 -1012 3841 4377 -963 -5006 -10222 -8094 -3964 -4886 -8550 -2402 -2710 -3473
13896 -3473 -5902 -6452 -6836 -7317 -6056 -5604 -4300 -1344 -1899 -9512 -9593 -10679 -9693 -8574 -8141 -6449 -4931
13879 -4931 -5000 -4689 -2287 -2365 -8249 -8875 -8412 -7487 -5438 -5594 -5037 -214 1066 751 3078 -148 -2531
13862 -2531 -405 -2074 1013 -1427 -2083 877 5855 5987 -1465 -3077 -4804 -12938 -13638 -10381 -7391
$$ packed form
13973c158K709k373k268l439k176k666q26O810M238L297o1J670q717l373k966
13958a3299k985K460K354L436L151m154m327K46K720J28L256J866k626L292j053
13943e535K308L52l086l288l20L923K556q13k463m018m764K97K435O027K667j05
13927c827l20J857j718j557J409k145J50N426J658m169r0J181O23o94m138q452
13911a4806L906O170L718M853N36n340m043n216K128M130r22l664O148l08p63
13896c473k429n50l84m81J261M52J304K956n55p613q1j086R86J119M33J692J518
13879d931o9L11K402p8n884o26M63R25K049j56N57M823J280l15K327l226k383
13862b531K126j669L087k440o56K960M978J32p452j612j727q134p00L257K990
$$ plain form
13847 -7391 -6982 -8246 -10341 -6843 -2278 -330 -240 -4512 -5659 -3963 -1480 1222 -409 -4194 -3307 -2597
13831 -2597 -208 941 3312 4226 3922 5046 3957 2658 -466 -30 -3066 -5293 -1032 2618 2406 1073
13815 1073 712 -4890 -6657 -4615 1662 -27 -2510 1 2158 2153 1578 1621 2724 2767 858 -660 -4553
13798 -4553 -5089 -6860 -6689 -9438 -9408 -9882 -8359 -8120 -7863 -5667 -6610 -10104 -10181 -7418 -9342 -13013 -10453
13781 -10453 -5899 -656 4131 9603 7396 3943 -5447 -6760 -2517 2118 -47 -3681 -1232 3173
13767 3173 7963 4339 2584 5807 4187 4325 2822 5656 10132 11710 15533 22537 24865 38209 60252
13752 60252 66579 60241 48508 33611 26166 18584 9949 8602 8416 5220 3891 2203 1892 2467 5691
13737 5691 7669 5165 4783 570 -2090 -6107 -10219 -6578 -6810 -7229 -4157 -2387 -3311 -2027 -3117 -2295
$$ packed form
13847g391M09j264k095L498M565J948R0m272j147J696K483K702j631l785Q87P10
13831b597K389J149K371R14l04J124j089j299l124M36l036k227M261L650k12j333
13815A073l61n602j767K042O277j689k483K511K157nn75M3J103M3j909j518l893
13798d553n36j771J71k749L0m74J523K39K57K196r43l494p7K763j924l671K560
13781a0453M554N243M787N472k207l453r390j313M243M635k165l634K449M405
13767C173M790l624j755L223j620J38j503K834M476J578L823P004K328J3344K2043
13752F0252O327o338j1733j4897p445p582q635j347j86l196j329j688l11N75L224
13737E691J978k504l82m213k660m017m112L641k32m19L072J770r24J284j090Q22
$$ plain form
13721 -2295 -2212 -3993 -2582 2519 11493 9973 4946 9906 10809 8770 6091 4177 5968 5903 9670 12768
13705 12768 7637 8015 8048 9334 9830 6059 2132 798 405 -1861 -2851 598 5598 7237 7462 8244
13689 8244 6468 8045 9386 4127 2436 1093 -1549 -1610 -3764 1468 3422 3428 4002 5148 10665 7938
13673 7938 -436 -66 -90 2950 10710 13911 7009 2074 -1543 -3437 -492 2810 2792 4767 1503 1551
13657 1551 -1241 -3688 -1248 1797 2030 785 -2832 -6726 -3868 1623 2585 1272 3736 2757 2086 1817
13641 1817 2125 2380 2755 545 3669 5455 8889 6666 2476 -92 850 2616 5029 3646 1861 -1995
13625 -1995 236 3355 5903 5369 -453 -3622 -2256 3404 2647 1210 2871 3320 10424 11600 11862 13423
13609 13423 15963 16636 16742 14036 14354 13076 15817 19070 12988 9739 2211 -1049 3539 7127 7840
$$ packed form
13721b295Q3j781J411N101Q974j520n027M960R03k039k679j914J791o5L767L098
13705A2768n131L78L3J286M96l771l927j334l93k266r90L449N000J639K25P82
13689H244j776J577J341n259j691j343k642o1k154N232J954ON74J146N517k727
13673G938q374L70k4L040P760L201o902m935l617j894K945L302j8J975l264M8
13657A551k792k447K440L045K33j245l617l894K858N491R62j313K464r79o71k69
13641A817L08K55L75k210L124J786L434k223m190k568R42J766K413j383j785l856
13625a995K231L119K548n34n822l169J366N660p57j437J661M49P104J176K62J561
13609A3423K540O73J06k706L18j278K741L253o082l249p528l260M588L588P13
$$ plain form
13594 7840 8565 6909 7390 11711 16697 9980 4239 5500 5104 3369 3187 5479 5539 7981 9865 11607
13578 11607 13293 14878 13676 12272 13570 14042 18872 19634 22444 20955 19466 12096 8364 9343 11334
13563 11334 11924 10059 14707 18639 14370 11673 12788 11713 12628 8112 6247 7103 10956 15477 13279
13548 13279 8473 7194 7731 8484 7511 1248 1770 803 1394 2957 8242 9946 6679 8075 14703 17334
13532 17334 19485 20014 16065 17631 14480 14405 12830 14163 15976 16264 14283 14667 10177 8574 9065 6252
13516 6252 1919 -801 3030 10691 9687 9993 9439 12203 13936 8490 7980 3027 2487 1885 760 4271
13500 4271 8375 12537 13991 16604 13735 11529 13049 11824 13553 14728 14028 10487 5958 5945 8003
13485 8003 8537 4908 -354 2768 3672 4593 7135 9014 6694 4401 5892 3524 -2227 -2726 -5103 -10542
$$ packed form
13594G840P25j656M81M321M986o717n741J261l96j735j82K292O0K442J884J742
13578A1607J686J585j202j404J298M72M830P62K810j489j489p370l732R79J991
13563A1334N90j865M648L932m269k697J115j075R15m516j865Q56L853M521k198
13548A3279m806j279N37P53r73o263N22r67N91J563N285J704l267J396O628K631
13532A7334K151N29l949J566l151p5j575J333J813K88j981L84m490j603M91k813
13516F252m333k720L831P661j004L06n54K764J733n446n10m953n40o02j125L511
13500D271M104M162J454K613k869k206J520j225J729J175p00l541m529j3K058
13485H003N34l629n262L122R04R21K542J879k320k293J491k368n751m99k377n439
$$ plain form
13469 -10542 -7673 -6621 -7913 -5281 -3716 -2756 1120 4865 9355 11092 9574 4314 437 3918 5888
13454 5888 5740 995 3516 1981 -2711 -4977 -1793 -2212 -5669 -3838 -3792 -4344 469 6100 7690 4317
13438 4317 -14 1077 1264 -670 4819 4639 3129 3020 1622 929 2310 1177 4379 8920 4780 3500
13422 3500 7320 6368 5947 6879 3738 5278 7845 2478 3050 3647 2338 1137 400 834 -1019 -2299
13406 -2299 -4084 -3543 -785 -3156 -4321 1808 1393 -1681 1844 6155 1572 -4629 -1197 7505 9863
13391 9863 8118 8002 6679 7407 4049 1216 -99 -351 2690 1907 2512 1688 -1366 -779 -3919 -6086
13375 -6086 -2238 4833 3951 -894 -2921 -3496 -5670 -1090 8020 4519 9140 7389 1433 -1824 -3966
13360 -3966 -4521 992 -4299 900 8169 7809 7199 8340 7992 9712 11367 15896 22431 22723 16942 9602
$$ packed form
13469a0542K869J052j292K632J565R60L876L745M490J737j518n260l877L481J970
13454E888j48m745K521j535m692k266L184m19l457J831M6n52M813N631J590l373
13438D317m331J091J87j934N489j80j510j09j398o93J381j133L202M541m140j280
13422C500L820r52m21R32l141J540K567n367N72N97j309j201p37M34j853j280
13406b299j785N41K758k371j165O129m15l074L525M311m583o201L432Q702K358
13391I863j745j16j323P28l358k833j315k52L041p83O05q24l054N87l140k167
13375f086L848P071q82m845k027n75k174M580R110l501M621j751n956l257k142
13360c966n55N513n291N199P269l60o10J141l48J720J655M529O535K92n781p340
$$ plain form
13344 9602 5742 6731 9523 9851 10857 9440 8298 4215 771 4550 10949 8213 4948 5330 1862
13329 1862 364 4386 6397 5675 9460 11397 10709 7009 7804 8800 5766 6025 10273 9132 7361 9057
13313 9057 5348 -180 -1120 4344 9092 11800 7663 2852 5471 1053 841 -1370 3398 7532 7043
13298 7043 8379 7636 6724 6400 3357 3656 1961 5659 6053 7807 5910 1994 9057 15293 18719 14565
13282 14565 9809 5537 7429 6870 3353 7712 13706 10885 6098 4712 9549 10537 8509 7504 10368
13267 10368 10670 11783 13676 13455 11870 12398 12747 12836 10731 9664 11061 11704 11922 14759 13388 10893
13251 10893 12695 17004 13195 7737 6477 10222 13710 14653 17008 17688 14985 10406 9505 13831 15702
13236 15702 14520 13497 11013 10246 11431 12584 12913 13321 12472 12904 9774 8391 11762 9771 8414 12871
$$ packed form
13344I602l860R89K792L28J006j417j142m083l444L779O399k736l265L82l468
13329A862j498M022K011p22L785J937o88l700P95R96l034K59M248j141j771J696
13313I057l709n528r40N464M748K708m137m811K619m418k12k211M768M134m89
13298G043J336p43r12l24l043K99j695L698L94J754j897l916P063O236L426m154
13282A4565m756m272J892n59l517M359N994k821m787j386M837R88k028j005K864
13267A0368L02J113J893k21j585N28L49Q9k105j067J397O43K18K837j371k495
13251A0893J802M309l809n458j260L745L488R43K355O80k703m579r01M326J871
13236A5702j182j023k484p67J185J153L29M08q49M32l130j383L371j991j357M457
$$ plain form
13220 12871 16522 14267 10040 3791 6184 8889 9981 15287 16336 18289 19543 17516 20235 16474
13206 16474 14362 13733 12780 14257 14365 13882 12457 13439 17649 19878 16131 16938 14985 13145 11766 16008
13190 16008 15145 16418 18411 17112 12378 11724 11322 8186 8426 9484 12221 17734 15915 17521 17234 13101
13174 13101 12637 12123 14956 13869 15250 12259 7550 9348 8864 7279 4420 5941 4212 -96 -1228
13159 -1228 5211 7859 10284 12280 11740 13744 13262 10165 10684 12963 13495 12102 5351 -1666 -3542 4291
13143 4291 6804 6400 6795 6834 9240 10981 14227 18975 19243 19312 15054 13557 16910 17615 8912 5707 9893
13126 9893 6568 9257 13136 12980 10569 10823 10783 10290 14837 12392 14458 20484 22160 23953 20289 16184
13110 16184 15802 18327 19389 15554 9043 12646 16373 13642 10271 11125 9773 8505 3387 6035 6829
$$ packed form
13220A2871L651k255m227o249K393K705J092N306J049J953J254k027K719l761
13206A6474k112o29r53J477J08m83j425R82M210K229l747Q07j953j840j379M242
13190A6008q63J273J993j299m734o54m02l136K40J058K737N513j819J606k87m133
13174A3101m64n14K833j087J381k991m709J798m84j585k859J521j729m308j132
13159a228O439K648K425J996n40K004m82l097N19K279N32j393o751p017j876P833
13143D291K513m04L95L9K406J741L246M748K68O9m258j497L353P05q703l205M186
13126I893l325K689L879j56k411K54m0m93M547k445K066O026J676J793l664m105
13110A6184l82K525J062l835o511L603L727k731l371Q54j352j268n118K648P94
$$ plain form
13095 6829 8116 7218 9844 5336 5277 3011 5845 8573 12473 7719 11297 13430 16083 17267 16818 21509
13079 21509 23860 18875 16314 18837 19474 19950 21802 22269 20283 19450 13074 9082 12978 19480 22357
13064 22357 20620 20956 26165 30034 30020 27718 28174 26751 22892 26646 27544 20351 17873 21195 22679 18413
13048 18413 15286 16309 21601 21860 23072 23642 20517 17478 18519 16718 13952 11494 16573 20020 23633
13033 23633 26767 24664 21047 19988 20087 20028 21330 20599 20048 21093 18171 16141 22646 24053 20749 18863
13017 18863 20038 17140 14732 14406 17129 18043 18074 19944 18736 18501 18698 21835 23877 26373 26194 24350
13001 24350 24322 22488 23064 25540 24266 21394 25675 24875 22897 26766 28356 22840 14815 16973 16332 16467
12985 16467 19409 19226 17556 15735 18725 27641 29869 29886 27459 20337 17619 18217 19893 19965 19385 18372
$$ packed form
13095F829J287q98K626m508n9k266K834K728L900m754L578K133K653J184m49M691
13079B1509K351m985k561K523O37M76J852M67j986q33o376l992L896O502K877
13064B2357j737L36N209L869j4k302M56j423l859L754Q98p193k478L322J484m266
13048A8413l127J023N292K59J212N70l125l039J041j801k766k458N079L447L613
13033B3633L134k103l617j059R9n9J302p31n51J045k922k030O505J407l304j886
13017A8863J175k898k408l26K723R14L1J870j208k35J97L137K042K496j79j844
13001B4350k8j834N76K476j274k872M281q00j978L869J590n516q025K158o41J35
12985A6467K942j83j670j821K990Q916K228J7k427p122k718N98J676P2n80j013
$$ plain form
12969 18372 17604 18577 14919 13327 12922 13224 19256 22518 21444 17549 18563 21217 24618 25434 21016 18516
12953 18516 20964 24665 25286 24902 27280 29783 26648 25247 24877 25543 28664 28965 26251 23757 19999 20374
12937 20374 22254 27295 25498 21741 22985 23326 24365 26580 30139 27835 27771 23814 23057 23269 21987 22409
12921 22409 22620 25780 26859 31922 35629 30105 30469 38994 37010 35196 32401 29917 32075 40737 44223
12906 44223 38498 33955 37546 36723 35554 33194 32747 30133 30482 30246 28589 26420 25851 29652 29051 27150
12890 27150 28294 29149 27964 30319 34670 37361 39932 45050 52130 55742 55489 61811 65133 71609 75401
12875 75401 83678 92485 100780 103542 99300 91219 84617 74434 65056 62814 59338 49977 47249 50247
12861 50247 52399 50543 46184 44896 42701 42787 48622 48674 44245 42161 45776 47619 45509 42761 41308
$$ packed form
12969A8372p68R73l658j592m05L02O032L262j074l895J014K654L401Q16m418k500
12953A8516K448L701O21l84K378K503l135j401l70O66L121L01k714k494l758L75
12937B0374J880N041j797l757J244L41J039K215L559k304o4l957p57K12j282M22
12921B2409K11L160J079N063L707n524L64Q525j984j814k795k484K158Q662L486
12906D4223n725m543L591q23j169k360m47k614L49k36j657k169n69L801o01j901
12890B7150J144Q55j185K355M351K691K571N118P080L612k53O322L322O476L792
12875G5401Q277Q807Q295K762m242q081o602j0183r378k242l476r361k728K998
12861E0247K152j856m359j288k195Q6N835N2m429k084L615J843k110k748j453
$$ plain form
12846 41308 41728 42554 46503 53982 58590 60213 63426 63266 58747 56621 65722 72630 76671 84013 93375
12831 93375 107773 127596 153135 186040 210270 220440 222604 210212 179818 149337 119703 100035
12819 100035 90296 82349 72839 63360 59754 61603 60746 60253 61583 58888 59681 60236 56417 60498 65501
12804 65501 63337 58566 56087 60850 63767 64958 69767 73057 67764 68767 69342 73933 83716 88243 92906
12789 92906 96805 102244 109074 117754 132474 150862 174401 202690 235152 250064 252545 239703 213808
12776 213808 173626 142906 124453 108168 99926 93819 96246 99912 102987 102273 100859 98692 94719
12763 94719 93267 98009 94841 89511 78147 70667 74566 73802 75457 77577 76908 76781 80731 81488 76129
12748 76129 71519 69929 69186 69113 67435 70791 72485 77075 83355 89209 98043 107148 123918 137788 151593
$$ packed form
12846D1308M20Q26L949P479M608J623L213j60m519k126R101O908M041P342R362
12831I3375J4398J9823K5539L2905K4230J0170K164j2392l0394l0481k9634j9668
12819A00035r739p947r510r479l606J849q57m93J330k695P93N55l819M081N003
12804F5501k164m771k479M763K917J191M809L290n293J003N75M591R783M527M663
12789I2906L899N439O830Q680J4720J8388K3539K8289L2462J4912K481j2842k5895
12776B13808m0182l0720j8453j6285q242o107K427L666L075p14j414k167l973
12763I4719j452M742l168n330j1364p480L899p64J655K120o69j27L950P57n359
12748G6129m610j590p43p3j678L356J694M590O280N854Q834R105J6770J3870J3805
$$ plain form
12733 151593 159558 158101 155285 150457 143315 137169 139086 143850 141254 138544 148373 161676 173323 188763
12719 188763 208466 227753 232626 244456 264101 279080 292691 316149 344248 379488 424524 483950
12707 483950 577049 703777 877381 1083151 1276009 1400186 1446529 1459759 1454991 1406189 1272042
12696 1272042 1071581 865454 692703 565977 472545 403652 356822 322711 295760 276102
12686 276102 261986 248992 233846 219574 202807 192094 190926 187647 185616 192048 199555 210296
12674 210296 222713 233027 248452 266257 288113 316372 349327 385426 423652 475400 540026
12663 540026 620625 732248 896196 1155050 1570876 2108789 2542669 2744419 2784503 2628982
12653 2628982 2212922 1689911 1259587 957315 740853 587929 482523 407483 352528 310874
$$ packed form
12733A51593P965j457k816m828p142o146J917M764k596k710R829J3303J1647J5440
12719A88763J9703J9287M873J1830J9645J4979J3611K3458K8099L5240M5036N9426
12707D83950R3099J26728J73604K05770J92858J24177M6343J3230m768m8802j34147
12696A272042k00461k06127j72751j26726r3432o8893m6830l4111k6951j9658
12686B76102j4116j2994j5146j4272j6767j0713j168l279k031O432P507J0741
12674B10296J2417J0314J5425J7805K1856K8259L2955L6099L8226N1748O4626
12663E40026Q0599J11623J63948K58854M15826N37913M33880K01750M0084j55521
12653B628982m16060n23011m30324l02272k16462j52924j05406p5040n4955m1654
$$ plain form
12643 310874 281841 255731 237111 218141 195367 176718 160352 147619 140009 139826 147710 151091
12631 151091 147568 144881 140565 135473 130628 123550 120363 116680 115606 109588 102198 104618 104661 103802 110977
12616 110977 120516 126064 126089 125945 129371 132904 138755 147046 163852 174500 168328 162482 152166 142150
12602 142150 139652 136068 135058 134688 129969 121758 118808 115859 115379 121144 118146 110394 111610 113334 116579
12587 116579 118624 118172 123749 130155 134279 136118 139461 138969 137089 137490 140197 139955 138961 137003 135866
12572 135866 135490 143932 145316 140939 138567 138829 137447 136919 132039 130102 126945 124835 124138 130585 132366
12557 132366 131875 130751 137295 142549 144790 149370 153261 156189 160082 164783 171880 176981 186167 192916
12543 192916 204506 218418 236384 250357 251880 245065 231384 219235 235908 273523 318408 340262
$$ packed form
12643C10874k9033k6110j8620j8970k2774j8649j6366j2733p610j83P884L381
12631A51091l523k687m316n092m845p078l187l683j074o018p390K420M3q59P175
12616A10977R539N548K5j44L426L533N851Q291J6806J0648o172n846j0316j0016
12602A42150k498l584j010l70m719q211k950k949m80N765k998p752J216J724L245
12587A16579K045m52N577O406M124J839L343m92j880M01K707k42r94j958j137
12572A35866l76Q442J384m377k372K62j382n28m880j937l157k110o97O447J781
12557A32366m91j124O544N254K241M580L891K928L893M701P097N101R186O749
12543A92916J1590J3912J7966J3973J523o815j3681j2149J6673L7615M4885K1854
$$ plain form
12531 340262 334320 330457 334567 346817 352472 335612 292356 246919 223512 217727 212100 213606 214371
12518 214371 215149 211388 205549 200392 205408 210831 207234 209259 215154 221199 224003 218217 214577 215819
12504 215819 211710 208447 209570 213160 215407 217940 220196 222419 227024 228408 227792 228240 228544 225701 230213
12489 230213 233492 241176 245750 253296 262975 275369 288725 295826 295901 299409 317844 348768 379805
12476 379805 411534 427425 395957 329896 304580 376055 456976 546760 691924 746320 690712
12465 690712 619325 523035 418362 370399 363669 359036 347518 330467 304139 288113 279071 277161
12453 277161 279165 278586 282667 293807 303751 305372 304564 305918 301555 298215 293372 292709 297490 307534
12439 307534 313298 321330 343127 369378 392979 410881 439914 463949 493980 523205 549039 572969
$$ packed form
12531C40262n942l863M110J2250N655j6860m3256m5437k3407n785n627J506P65
12518B14371P78l761n839n157N016N423l597K025N895O045K804n786l640J242
12504B15819m109l263J123L590K247K533K256K223M605J384o16M48L04k843M512
12489B30213L279P684M574P546R679J2394J3356P101P5L508J8435L0924L1037
12476C79805L1729J5891l1468o6061k5316P1475Q0921Q9784J45164N4396n5608
12465F90712p1387r6290j04673m7963o730m633j1518j7051k6328j6026r042j910
12453B77161K004n79M081J1140R944J621q08J354m363l340m843o63M781J0044
12439C07534N764Q032K1797K6251K3601J7902K9033K4035L0031K9225K5834K3930
$$ plain form
12427 572969 604578 640348 676142 714019 747710 773377 788411 804977 818555 818562 822374 841638
12415 841638 872765 901422 935597 995614 1098805 1226638 1362325 1483518 1527127 1445173 1307650
12404 1307650 1215606 1162714 1054753 857599 632318 459151 365576 330714 324839 327585 338468
12393 338468 354011 367284 378545 398989 417046 434537 452669 468898 488547 511916 529136
12382 529136 537151 546613 557423 565482 578024 586885 588461 599065 616647 643480 684739 734387
12370 734387 787015 837012 890662 937187 982323 1033762 1077528 1106680 1128790 1156536 1180776
12359 1180776 1203051 1227447 1262249 1313986 1378794 1463349 1562350 1673006 1779028 1855606 1933776
12348 1933776 2048490 2250514 2609158 3054831 3382596 3393073 3183617 2910186 2471892 1941789
$$ packed form
12427E72969L1609L5770L5794L7877L3691K5667J5034J6566J3578PL812J9264
12415H41638L1127K8657L4175O0017J03191J27833J35687J21193M3609q1954j37523
12404A307650r2044n2892j07961j97154k25281j73167r3575l4862n875K746J0883
12393C38468J5543J3273J1261K0444J8057J7491J8132J6229J9649K3369J7220
12382E29136Q015R462J0810Q059J2542Q861J576J0604J7582K6833M1259M9648
12370G34387N2628M9997N3650M6525M5136N1439M3766K9152K2110K7746K4240
12359A180776K2275K4396L4802N1737O4808Q4555R9001J10656J06022P6578P8170
12348A933776J14714K02024L58644M45673L27765J0477k09456k73431m38294n30103
$$ plain form
12338 1941789 1571962 1448815 1455578 1505837 1570021 1641648 1710513 1765195 1830565 1916505 2006793
12327 2006793 2100617 2202504 2310194 2433506 2580309 2736739 2894624 3060427 3241394 3447463
12317 3447463 3690890 3954693 4243978 4564170 4922065 5325978 5773306 6270680 6836112
12308 6836112 7468084 8184569 8991925 9889085 10883442 11999972 13263572 14711397 16385667
12299 16385667 18322044 20557068 23089452 25871085 28875127 32144069 35778182 39921529
12291 39921529 44715024 50348997 57160500 65854072 77703631 94715856 119482904 153536696
12283 153536696 193094559 227053596 245310004 249614877 250284064 250750133 242321649 217335143
12275 217335143 180068242 141632215 109569055 85245087 67403434 54537850 45231718
$$ packed form
12338A941789l69827j23147O763N0259O4184P1627O8865N4682O5370Q5940R0288
12327B006793R3824J01887J07690J23312J46803J56430J57885J65803J80967K06069
12317C447463K43427K63803K89285L20192L57895M03913M47328M97374N65432
12308F836112O31972P16485Q07356Q97160R94357J116530J263600J447825J674270
12299A6385667J936377K235024K532384K781633L004042L268942L634113M143347
12291C9921529M793495N633973O811503Q693572J1849559J7012225K4767048L4053792
12283A53536696L9557863L3959037J8256408M304873O69187M66069q428484k4986506
12275B17335143l7266901l8436027l2063160k4323968j7841653j2865584r306132
$$ plain form
12268 45231718 38317188 32991616 28724760 25117045 21960864 19233520 16968674 15131029
12260 15131029 13635018 12403813 11409308 10646005 10088957 9689771 9430104 9310889 9323517
12251 9323517 9483600 9788222 10159479 10548590 10997155 11484626 12023518 12703697 13573423
12242 13573423 14639780 15904711 17353470 18984029 20815945 22907209 25287903 27981226
12234 27981226 31049990 34557125 38650290 43525631 49239248 55904469 63916974 73552979
12226 73552979 84906289 98744209 117053088 143033178 182590794 245429617 333935810
12219 333935810 417634887 460302778 471821494 464351886 420296575 341019878 257921012
12212 257921012 194419688 148917732 114784843 89705956 71565392 58089195 47747973
$$ packed form
12268D5231718o914530n325572m266856l607715l156181k727344k264846j837645
12260A5131029j496011j231205r94505p63303n57048l99186k59667j19215J2628
12251I323517J60083L04622L71257L89111M48565M87471N38892O80179Q69726
12242A3573423J066357J264931J448759J630559J831916K091264K380694K693323
12234B7981226L068764L507135M093165M875341N713617O665221Q012505R636005
12226G3552979J1353310J3837920J8308879K5980090L9557616O2838823Q8506193
12219C33935810Q3699077M2667891J1518716p469608m4055311p9276697q3098866
12212B57921012o3501324m5501956l4132889k5078887j8140564j3476197j0341222
$$ plain form
12205 47747973 39735850 33413692 28218850 23928945 20539830 17937051 15899730 14251276
12197 14251276 12898631 11751947 10772970 9939156 9198695 8533280 7950378 7423433 6923701
12188 6923701 6460846 6051558 5681971 5354765 5064938 4806131 4562453 4322807 4113062
12179 4113062 3942793 3808583 3690907 3573614 3465193 3353745 3235970 3102506 2955534
12170 2955534 2813683 2685298 2572465 2478198 2397262 2325079 2267173 2218328 2161207 2103339 2060461
12159 2060461 2039945 2018621 1981055 1899265 1787469 1689050 1623780 1555796 1454445 1350153 1288630
12148 1288630 1262738 1250564 1253723 1279104 1306330 1315828 1310117 1291113 1245617 1178562 1112994 1056690
12136 1056690 1007105 959598 920464 884741 852046 829513 816177 806368 806010 803381 800901 800563 797721
$$ packed form
12205D7747973q012123o322158n194842m289905l389115k602779k037321j648454
12197A4251276j352645j146684r78977q33814p40461o65415n82902n26945m99732
12188F923701m62855m09288l69587l27206k89827k58807k43678k39646k09745
12179D113062j70269j34210j17676j17293j08421j11448j17775j33464j46972
12170B955534j41851j28385j12833r4267q0936p2183n7906m8845n7121n7868m2878
12159B060461k0516k1324l7566q1790j11796r8419o5270o7984j01351j04292o1523
12148A288630k5892j2174L159K5381K7226R498n711j9004m5496o7055o5568n6304
12136A056690m9585m7507l9134l5723l2695k2533j3336r809l58k629k480l38k842
$$ plain form
12123 797721 802790 808743 817490 821979 820728 810625 796314 780431 765753 756151 757568 759572 762407
12110 762407 770875 779121 782399 789827 792088 795651 803178 810799 812879 810608 812758 805846 779900 761148
12096 761148 767817 832051 904460 845983 705074 629516 494310 236035 58687 15077 5258
12085 5258 6355 24181 48031 67723 83673 89320 86955 81386 77286 72801 65095 61790 63927 67697
12071 67697 76373 95234 121831 142731 161304 184839 212309 246379 277774 297743 315613 332428
12059 332428 349433 363535 363705 365490 371293 368204 364619 367462 372093 375937 388728 411029 435014
12046 435014 464359 501778 546025 600132 659479 744376 860623 1006848 1139603 1234608 1320250
12035 1320250 1389632 1431431 1473133 1557648 1701174 1898572 2164744 2542899 3041408 3746972
$$ packed form
12123G97721N069N953Q747M489j251j0103j4311j5883j4678r602J417K004K835
12110G62407Q468Q246L278P428K261L563P527P621K080k271K150o912k5946j8752
12096G61148O669O4234P2409n8477j40909p5558j35206k58275j77348m3610r819
12085E258J097J7826K3850J9692J5950N647k365n569m100m485p706l305K137L770
12071F7697Q676J8861K6597K0900J8573K3535K7470L4070L1395J9969J7870J6815
12059C32428J7005J4102J70J785N803l089l585K843M631L844J2791K2301K3985
12046D35014K9345L7419M4247N4107N9347Q4897J16247J46225J32755R5005Q5642
12035A320250O9382M1799M1702Q4515J43526J97398K66172L78155M98509P05564
$$ plain form
12025 3746972 4875958 6508127 7975272 8671176 8846485 8429506 7099465 5339252 3897626
12016 3897626 2957326 2324778 1873464 1524995 1237698 1003668 832328 696340 584278
12007 584278 494231 424690 377586 335305 296754 269074 245020 229244 219299 213382 215988 218651
11995 218651 216475 210485 204667 201406 202970 200884 197008 186987 177442 165254 151175 139488 134166
11982 134166 129049 133278 136337 135010 133978 132992 133080 131620 133182 130445 135390 143615 150990 143870 135844
11967 135844 130018 117769 110941 124315 133249 145765 152590 148551 136707 123876 106904 95663
11955 95663 83769 74424 74206 73173 73606 78299 81605 85336 85101 89645 98303 104513 100988 102642 107437
11940 107437 107728 106784 104294 99804 92443 85471 82261 76290 72319 69013 62890 59036 58471 56276 54662
$$ packed form
12025C746972J128986J632169J467145O95904J75309m16979j330041j760213j441626
12016C897626r40300o32548m51314l48469k87297k34030j71340j35988j12062
12007E84278r0047o9541m7104m2281l8551k7680k4054j5776r945n917K606K663
11995B18651k176n990n818l261J564k086l876j0021r545j2188j4079j1687n322
11982A34166n117M229L059j327j032r86Q8j460J562k737M945Q225P375p120q026
11967A35844n826j2249o828J3374Q934J2516O825m039j1844j2831j6972j1241
11955I5663j1894r345k18j033M33M693L306L731k35M544Q658O210l525J654M795
11940A07437K91r44k490m490p361o972l210n971l971l306o123l854n65k195j614
$$ plain form
11925 54662 56289 59286 61690 66239 67325 73261 71963 61918 53369 45486 42164 40100 43237 50334
11911 50334 60225 68945 77404 88373 93861 100689 106110 106362 111391 112267 107784 104581 105607 101152 92740
11896 92740 86699 80388 69878 62432 65556 66548 62534 63932 71616 80782 85217 85793 86847 92026 98218
11881 98218 101259 105456 111909 119941 126153 134189 143977 148572 148161 152787 161524 173823 187117 197749
11867 197749 215823 242242 269534 296316 321021 354927 392595 449526 525154 636118 795449
11856 795449 1001387 1205855 1354751 1425406 1443262 1447326 1415381 1305291 1120166 906974
11846 906974 709171 551933 438374 359471 302842 264833 237833 226714 222496 215653 211749
11835 211749 205039 194952 184977 173503 161443 151922 143322 135794 133082 133638 129888 127933 123646 117339
$$ packed form
11925E4662J627K997K404M549J086N936j298j0045q549p883l322k064L137P097
11911E0334R891Q720Q459J0969N488O828N421K52N029Q76m483l203J026m455q412
11896I2740o041o311j0510p446L124R92m014J398P684R166M435N76J054N179O192
11881I8218L041M197O453Q032O212Q036R788M595m11M626Q737J2299J3294J0632
11867A97749J8074K6419K7292K6782K4705L3906L7668N6931P5628J10964J59331
11856G95449K05938K04468J48896P0655J7856M064l1945j10090j85125k13192
11846I06974j97803j57238j13559p8903n6629l8009k7000j1119m218o843l904
11835B11749o710j0087r975j1474j2060r521q600p528k712N56l750j955m287o307
$$ plain form
11821 117339 115972 116564 115700 109967 107631 100167 95662 93797 92589 81803 76291 69604 63929 55141
11807 55141 56369 56103 60966 71543 76782 83099 91115 99867 108373 108443 108971 111054 118038 129197 139187
11792 139187 149348 162003 178061 197772 218587 238262 264653 292030 317066 345162 377030
11781 377030 415499 469226 539034 646786 816911 1089775 1522279 2062273 2467192 2638935
11771 2638935 2660634 2480609 2047294 1535582 1127917 853220 648736 501642 399998 323150
11761 323150 264421 222982 197010 172888 154463 141720 128736 118580 107849 99713 86864 73485
11749 73485 63425 57538 51348 47875 46290 44201 48114 53822 64736 78318 91788 95045 93233
11736 93233 88114 80482 76454 74805 70735 70781 76375 86810 96162 109127 126144 145473 161388 178124
$$ packed form
11821A17339j367N92q64n733k336p464m505j865j208j0786n512o687n675q788
11807E5141J228k66M863J0577N239O317Q016Q752Q506P0N28K083O984J1159R990
11792A39187J0161J2655J6058J9711K0815J9675K6391K7377K5036K8096L1868
11781C77030L8469N3727O9808J07752J70125K72864M32504N39994M04919J71743
11771B638935K1699j80025m33315n11712m07665k74697k04484j47094j01644p6848
11761C23150n8729m1439k5972k4122j8425j2743j2984j0156j0731q136j2849j3379
11749G3485j0060n887o190l473j585k089L913N708J0914J3582J3470L257j812
11736I3233n119p632m028j649m070M6N594J0435R352J2965J7017J9329J5915J6736
$$ plain form
11722 178124 183010 181896 177224 163982 145709 130959 110985 90594 76556 60591 53738 49230
11710 49230 42906 41654 37890 36071 36296 29625 26091 22101 20245 18363 16444 15816 25049 27702 25547
11695 25547 24906 23405 23492 22238 22000 19848 21568 29671 36907 34209 29899 28346 27142 22792 18886
11680 18886 18143 22510 25082 23144 19309 17700 22323 23797 24794 23566 22744 25361 25814 25147 25605 26870
11664 26870 27929 29459 29777 29753 29817 30988 26348 22805 24970 21118 17580 9424 6608 6240 10026 10004
11648 10004 9420 13490 13927 13096 8489 11706 12908 14220 14896 15673 14344 12349 14348 17994 22360 16882
11632 16882 11790 6551 4202 2473 3351 9260 8906 9689 11705 9466 12202 16170 18594 22354 25729
11617 25729 25313 22983 22806 22102 19496 17111 17312 18418 20777 21802 21688 22732 21012 16791 13655 14161
$$ packed form
11722A78124M886j114m672j3242j8273j4750j9974k0391j4038j5965o853m508
11710D9230o324j252l764j819K25o671l534l990j856j882j919o28R233K653k155
11695B5547o41j501Q7j254k38k152J720Q103P236k698m310j553j204m350l906
11680A8886p43M367K572j938l835j609M623J474R97j228q22K617M53o67M58J265
11664B6870J059J530L18k4O4J171m640l543K165l852l538q156k816l68L786k2
11648A0004n84M070M37q31m607L217J202J312O76P77j329j995J999L646M366n478
11632A6882n092n239k349j729Q78N909l54P83K016k239K736L968K424L760L375
11617B5729m16k330j77p04k606k385K01J106K359J025j14J044j720m221l136N06
$$ plain form
11601 14161 19529 20286 17729 13809 14174 15184 16743 17349 16179 18283 17248 12893 16614 17607 14962
11586 14962 15403 14067 16958 26463 31624 39430 50913 61353 64385 65758 64273 58201 47833 44588
11572 44588 44776 36647 31047 25660 21877 19841 17650 10244 7524 12870 12976 11815 10120 12415 11267
11557 11267 6809 7790 7080 5873 8637 6724 5335 5543 5895 6235 9606 12932 14846 14285 12186 11782
11541 11782 12919 16891 16841 13725 12021 9458 8330 9732 10654 10876 10692 7642 4691 3677 409 -1804
11525 -1804 273 1979 7696 9504 8187 10875 5842 1736 5122 9157 11261 12680 8414 8601 9062
11510 9062 10381 11920 9187 11330 12404 13392 20324 20876 23440 20682 14297 15918 20805 18886 15815
11495 15815 13710 10696 9858 14791 19930 16474 13320 15072 9966 8050 10948 15801 19010 19564 18199
$$ packed form
11601A4161N368P57k557l920L65J010J559O06j170K104j035m355L721R93k645
11586A4962M41j336K891R505N161P806J1483J0440L032J373j485o072j0368l245
11572D4588J88q129n600n387l783k036k191p406k720N346J06j161j695K295j148
11557A1267m458R81p10j207K764j913j389K08L52L40L371L326J914n61k099m04
11541A1782J137L972n0l116j704k563j128J402R22K22j84l050k951j014l268k213
11525a804K077J706N717J808j317K688n033m106L386M035K104J419m266J87M61
11510I062J319J539k733K143J074R88O932N52K564k758o385J621M887j919l071
11495A5815k105l014q38M933N139l456l154J752n106j916K898M853L209N54j365
$$ plain form
11480 18199 17847 13123 7970 8381 11260 11579 13648 14152 17184 19804 19835 21425 20718 23284 23486 23499 21594
11463 21594 21059 25751 27708 23818 20385 24524 25391 28219 33409 34509 29695 27750 24556 25361 28923
11448 28923 33366 36369 36872 32998 29170 21633 16292 14571 15152 13360 12534 12955 9119 9679 13268 13619
11432 13619 13237 16480 10414 1099 1389 2252 3482 3436 7759 13047 12700 9048 11250 13294 15464 15241
11416 15241 15378 12764 11818 16170 15297 18760 16583 13350 10084 9258 12976 18019 21408 23439 26664
11401 26664 26415 26248 20216 11828 5856 7225 10881 14097 15196 15804 15646 15403 16238 20418 18858 12817
11385 12817 10201 14657 16732 12253 9662 8318 11387 11320 13916 18300 14661 14638 18260 21816 23691
11370 23691 28127 30534 29272 25761 21282 19627 22884 20488 18277 21573 27371 28480 30991 34657
$$ packed form
11480A8199l52m724n153M11K879L19K069N04L032K620L1J590p07K566K02J3j905
11463B1594n35M692J957l890l433M139Q67K828N190J100m814j945l194Q05L562
11448B8923M443L003N03l874l828p537n341j721N81j792q26M21l836N60L589L51
11432A3619l82L243o066r315K90Q63J230m6M323N288l47l652K202K044K170k23
11416A5241J37k614r46M352q73L463k177l233l266q26L718N043L389K031L225
11401B6664k49j67o032q388n972J369L656L216J099O08j58k43Q35M180j560o041
11385A2817k616M456K075m479k591j344L069o7K596M384l639k3L622L556J875
11370B3691M436K407j262l511m479j655L257k396k211L296N798J109K511L666
$$ plain form
11356 34657 33412 36097 38022 41022 48565 56658 62432 62660 59955 58965 54926 49079 49818 51472 50401
11341 50401 49238 44621 41440 37584 33153 28268 24529 29824 29544 24993 26621 24981 23054 18645 16282
11326 16282 15378 12328 13511 11563 9253 16294 23383 25147 21941 18242 15398 11996 6123 7038 11872
11311 11872 16278 16124 14245 14391 10534 4668 3688 540 -1065 3739 7274 6441 10418 8444 6321
11296 6321 10239 8453 12249 15097 12719 7487 8856 14779 14955 15743 16674 19004 17069 12247 7931
11281 7931 13440 16011 14010 7886 6375 10438 15639 18420 17909 16831 12224 6446 5420 8955 7986
11266 7986 6190 8282 17054 21640 20036 16135 13751 13535 13319 12481 13942 13864 13967 12263 12013 10385
11250 10385 15199 18756 18985 18515 17079 17661 14191 9149 12967 17328 18562 14918 9476 5806 5881 8929
$$ packed form
11356C4657j245K685J925L000P543Q093N774K28k705r90m039n847P39J654j071
11341E0401j163m617l181l856m431m885l739N295k80m551J628j640j927m409k363
11326A6282r04l050J183j948k310P041P089J764l206l699k844l402n873R15M834
11311A1872M406j54j879J46l857n866r80l148j605M804L535q33L977j974k123
11296F321L918j786L796K848k378n232J369N923J76P88R31K330j935m822m316
11281G931N509K571k001o124j511M063N201K781n11j078m607n778j026L535r69
11266G986j796K092Q772M586j604l901k384k16k16q38J461p8J03j704k50j628
11250A0385M814L557K29m70j436N82l470n042L818M361J234l644n442l670P5L048
$$ plain form
11234 8929 7219 2115 -1328 695 1140 9326 11136 4371 3288 3739 2683 3831 5988 8628 10945
11219 10945 9087 7523 9734 11423 10769 9796 7869 14637 16941 13564 11069 16378 18219 10739 8887
11204 8887 12776 21368 19396 15938 16025 13047 16069 20295 22038 20159 22804 27097 25235 27574 28154
11189 28154 28057 30773 36499 38015 39147 35390 29231 30603 31277 35250 41445 43556 42433 43213 44386
11174 44386 53212 59225 59701 60795 67294 73728 71925 64266 63673 62685 59912 56562 49294 41014 34884
11159 34884 31392 23744 19202 21619 24991 24990 21721 17564 16210 23312 26991 27846 25877 30180 34002
11144 34002 35557 39176 39193 34725 33593 33661 30233 23666 22037 21848 26255 32091 32655 26452 29998 30688
11128 30688 28345 26677 22230 17089 16579 19605 23918 26726 22237 17876 23006 24712 19829 16623 19486
$$ packed form
11234H929j710n104l443K023M45Q186J810o765j083M51j056J148K157K640K317
11219A0945j858j564K211J689o54r73j927O768K304l377k495N309J841p480j852
11204H887L889Q592j972l458Q7k978L022M226J743j879K645M293j862K339N80
11189B8154r7K716N726J516J132l757o159J372O74L973O195K111j123P80J173
11174D4386Q826O013M76J094O499O434j803p659n93r88k773l350p268q280o130
11159C4884l492p648m542K417L372jl269m157j354P102L679Q55j969M303L822
11144C4002J555L619J7m468j132O8l428o567j629j89M407N836N64o203L546O90
11128C0688k343j668m447n141n10L026M313K808m489m361N130J706m883l206K863
$$ plain form
11113 19486 21350 19420 13256 12766 13874 12757 13234 13437 19008 29107 31118 28645 28230 25998 31464
11098 31464 37521 35851 40442 35059 31609 31712 32525 35780 38363 36443 35120 35262 34145 34844 32588
11083 32588 27671 26305 29590 34525 40891 46564 50598 49402 50654 54160 57794 61531 67020 77980
11069 77980 85562 92057 98621 110525 117291 129767 147572 166523 183200 209382 239823 274210
11057 274210 313534 346558 368466 384433 375750 350804 318310 274470 232726 187104 147873 115514
11045 115514 91959 77456 74478 66169 60125 53536 49507 45103 49068 51364 52888 53970 53040 49840
11031 49840 58135 68584 78337 85206 94511 113495 138425 163905 176499 180248 176823 169039 154877
11018 154877 132256 111707 99997 95837 95179 91735 90134 85439 85449 79648 74562 71675 68960 67415
$$ packed form
11113A9486J864j930o164m90J108j117M77K03N571J0099K011k473m15k232N466
11098C1464O057j670M591n383l450J03Q13L255K583j920j323J42j117O99k256
11083C2588m917j366L285M935O366N673M034j196J252L506L634L737N489J0960
11069G7980P582O495O564J1904O766J2476J7805J8951J6677K6182L0441L4387
11057B74210L9324L3024K1908J5967q683k4946l2494m3840m1744m5622l9231l2359
11045A15514k3555j4503k978q309o044o589m029m404L965K296J524J082r30l200
11031D9840Q295J0449R753O869R305J8984K4930K5480J2594L749l425p784j4162
11018A54877k2621k0549j1710m160o58l444j601m695J0n801n086k887k715j545
$$ plain form
11004 67415 67173 64669 59423 58094 58568 58563 64394 72174 79331 87217 97083 120206 140588 145520 147106
10989 147106 149555 140273 120620 101288 86696 75077 73020 72854 68397 73524 69422 65470 66032 57781
10975 57781 53639 48223 42125 44703 48044 45521 41263 38023 33682 35025 37467 42557 42688 41202 40994
10960 40994 41494 37950 34927 34583 35456 33601 30435 27721 32638 39462 40555 38284 34971 32684 35982
10945 35982 41845 41821 46130 55705 59600 62024 59382 51926 51532 55826 60997 66569 66174 64290 69077
10930 69077 68740 70358 75863 83725 96381 112569 128381 143204 151995 156966 163185 177839 193879
10917 193879 197421 187346 172367 162540 158822 147495 129498 114233 100776 96698 96823 95526 95547
10904 95547 97938 100083 111124 115990 123299 135714 141161 144248 156289 175908 198650 224619 248493
$$ packed form
11004F7415k42k504n246j329M74nN831P780P157P886R866K3123K0382M932J586
10989A47106K449r282j9653j9332j4592j1619k057j66m457N127m102l952N62q251
10975E7781m142n416o098K578L341k523m258l240m341J343K442N090J31j486k08
10960D0994N00l544l023l44Q73j855l166k714M917O824J093k271l313k287L298
10945C5982N863k4M309R575L895K424k642p456l94M294N171N572l95j884M787
10930F9077l37J618N505P862J2656J6188J5812J4823Q791M971O219J4654J6040
10917A93879L542j0075j4979r827l718j1327j7997j5265j3457m078J25j297K1
10904I5547K391K145J1041M866P309J2415N447L087J2041J9619K2742K5969K3874
$$ plain form
10891 248493 274176 312171 367988 451191 584975 801895 1081383 1246788 1195275 1078914
10881 1078914 1077554 1200663 1287436 1162948 907497 683496 530304 429452 357630 301829
10871 301829 265865 239897 228598 217157 210134 212946 219089 228494 238917 256039 280591 304879
10859 304879 343192 395725 471725 591360 788342 1051188 1251266 1236686 1114451 1075957
10849 1075957 1177340 1291975 1210480 958951 715714 550300 434570 345846 277679 230270
10839 230270 202549 181706 167370 155866 147780 144436 134717 133512 135564 133951 139851 141855 136716
10826 136716 135487 142839 158890 180401 202178 233192 274921 326688 382244 429599 451325 455507
10814 455507 441301 395222 337024 284594 236841 195259 164770 146712 141124 142079 137910 133728
$$ packed form
10891B48493K5683L7995N5817Q3203J33784K16920K79488J65405n1513j16361
10881A078914j360J23109Q6773j24488k55451k24001j53192j00852p1822n5801
10871C01829l5964k5968j1299j1441p023K812O143R405J0423J7122K4552K4288
10859C04879L8313N2533P6000J19635J96982K62846K00078j4580j22235l8494
10849A075957J01383J14635q1495k51529k43237j65414j15730q8724o8167m7409
10839B30270k7721k0843j4336j1504q086l344r719j205K052j613N900K004n139
10826A36716j229P352J6051K1511K1777L1014M1729N1767N5556M7355K1726M182
10814D55507j4206m6079n8198n2430m7753m1582l0489j8058n588R55m169m182
$$ plain form
10802 133728 124925 123770 122698 127086 134307 135222 133537 140998 157032 168545 188268 219676 259633
10789 259633 310503 361407 409508 439536 448452 438950 403730 348217 293550 241889 195280 161778
10777 161778 142099 128285 114092 98366 91160 88910 90718 88571 81586 82061 82971 87091 84289 85576
10763 85576 86569 88796 86943 85544 85959 82643 78142 78490 78060 80028 85932 98208 108220 113740 114976
10748 114976 110488 105679 100880 94797 89509 85565 80635 70525 59007 50430 47660 51424 54337 65958
10734 65958 71323 70106 72630 78360 80065 74080 73136 81252 92084 98765 104724 111857 124057 134098
10720 134098 144770 158478 173658 193230 218401 247282 268797 276837 271732 270553 277371 293164
10708 293164 319047 349256 388025 428118 486625 555453 647226 767368 932909 1185562 1574118
$$ packed form
10802A33728q803j155j072M388P221R15j685P461J6034J1513J9723L1408L9957
10789B59633N0870N0904M8101L0028Q916r502l5220n5513n4667n1661m6609l3502
10777A61778j9679j3814j4193j5726p206k250J808k147o985M75R10M120k802J287
10763H5576R93K227j853j399M15l316m501L48m30J968N904J2276J0012N520J236
10748A14976m488m809m799o083n288l944m930j0110j1518q577k770L764K913J1621
10734F5958N365j217K524N730J705n985r44Q116J0832O681N959P133J2200J0041
10720A34098J0672J3708J5180J9572K5171K8881K1515Q040n105j179O818J5793
10708B93164K5883L0209L8769M0093N8507O8828R1773J20142J65541K52653L88556
$$ plain form
10697 1574118 2123152 2721776 3052300 2889892 2386704 1840168 1397345 1068147 829296
10688 829296 655869 528010 434366 366438 313406 268130 230410 199580 180008 169917 164808
10677 164808 160609 157809 156697 152551 146534 140956 137838 135401 130123 125574 123939 126671 127890 119677
10663 119677 112902 103361 93441 80981 73064 69484 69428 70922 66341 70388 76261 79378 76953 77286 81978
10648 81978 82975 79728 80621 80711 79129 79685 78206 74277 67606 69384 72285 73780 74667 77440 78920 76761
10632 76761 76266 76075 78864 87344 91185 88964 92217 93363 94890 90872 88307 85757 88276 87058 81408
10617 81408 85745 89284 91251 91724 95998 98831 96118 93924 94889 90658 90645 90511 88124 94312 99327 102987
10601 102987 104848 103773 105902 111199 116497 115811 121891 121089 114653 106066 101328 98867 98764 97787 101098
$$ packed form
10697A574118N49034N98624L30524j62408n03188n46536m42823l29198k38851
10688H29296j73427j27859r3644o7928n3032m5276l7720l0830j9572j0091n109
10677A64808m199k800j112m146o017n578l118k437n278m549j635K732J219q213
10663A19677o775r541r920j2460p917l580n6J494m581M047N873L117k425L33M692
10648H1978R97l247Q93R0j582N56j479l929o671J778K901J495Q87K773J480k159
10632G6761m95j91K789Q480L841k221L253J146J527m018k565k550K519j218n650
10617H1408M337L539J967M73M274K833k713k194R65m231j3j34k387O188N015L660
10601A02987J861j075K129N297N298o86O080q02o436q587m738k461j03r77L311
$$ plain form
10586 101098 106445 109895 122314 131695 140312 150808 158928 155867 143631 136392 134378 131069 130014
10573 130014 124298 125636 132423 137986 136191 129998 125722 125351 121340 116529 114809 110331 110076 114533 117270
10558 117270 109728 104386 101093 102387 103984 108202 107528 116489 126467 131405 128221 129369 130939 136091
10544 136091 147510 157674 170589 179279 178696 178450 186021 203023 237352 282397 308016 290765 214512
10531 214512 112542 97808 249904 487365 655238 691906 590656 410489 264440 199940
10521 199940 175854 156707 138355 124563 116649 112899 110517 115863 121193 125104 131046 133041 134252
10508 134252 131023 129034 127458 122310 114661 114011 115950 117714 122136 126109 138324 152004 160544 172841
10494 172841 186359 194300 193693 184902 179439 182406 176941 170324 167124 165551 167462 173013 178574 183302
$$ packed form
10586A01098N347L450J2419R381Q617J0496Q120l061j2236p239k014l309j055
10573A30014n716J338O787N563j795o193m276l71m011m811j720m478k55M457K737
10558A17270p542n342l293J294J597M218o74Q961R978M938l184J148J570N152
10544A36091J1419J0164J2915Q690n83k46P571J7002L4329M5045K5619j7251p6253
10531B14512j01970j4734J52096K37461J67873L6668j01250j80167j46049o4500
10521A99940k4086j9147j8352j3792p914l750k382N346N330L911N942J995J211
10508A34252l229j989j576n148p649o50J939J764M422L973J2215J3680Q540J2297
10494A72841J3518P941o07q791n463K967n465o617l200j573J911N551N561M728
$$ plain form
10480 183302 188212 189330 188234 183344 174342 174522 175771 175428 181170 197450 219899 241446 238665 193982
10466 193982 129223 77956 58513 64211 71931 84886 100466 115051 124166 134073 143552 156262
10454 156262 169581 178467 186909 186881 188621 201826 219221 229192 235577 246428 249913 256633 265239 267440
10440 267440 267819 277258 294416 310850 332689 339693 327914 319325 321407 336752 362874 393119 433943
10427 433943 481789 526842 566832 609938 652802 696235 720056 725639 723508 726875 736381 757598
10415 757598 792546 834359 890296 965050 1062991 1153298 1204536 1232862 1272887 1392779 1668754
10404 1668754 2129356 2637475 2876598 2575788 1839776 1087145 608952 392595 304558 263204
10394 263204 239814 230520 225400 224955 223358 229954 240309 259935 287939 310553 330214 345581 362073
$$ packed form
10480A83302M910J118j096m890r002J80J249l43N742J6280K2449K1547k781m4683
10466A93982o4759n1267j9443N698P720J2955J5580J4585R115R907R479J2710
10454A56262J3319Q886Q442k8J740J3205J7395R971O385J0851L485O720Q606K201
10440B67440L79R439J7158J6434K1839P004j1779q589K082J5345K6122L0245M0824
10427D33943M7846M5053L9990M3106M2864M3433K3821N583k131L367R506K1217
10415G57598L4948M1813N5937P4754R7941R0307N1238K8326M0025J19892K75975
10404A668754M60602N08119K39123l00810p36012p52631m78193k16357q8037m1354
10394B63204k3390r294n120m45j597O596J0355J9626K8004K2614J9661J5367J6492
$$ plain form
10381 362073 375450 398054 419926 431380 435836 438457 443675 457532 483010 507018 529255 553554
10369 553554 573922 585177 599402 615677 628397 639540 647023 649497 649108 649059 648888 654051 658976 664283
10355 664283 671534 689289 731951 774564 819274 866103 906311 939384 966289 1000894 1045311 1093210
10343 1093210 1143414 1198712 1249691 1293107 1336627 1387334 1443193 1500545 1559682 1630870 1698613
10332 1698613 1756040 1822055 1911957 2021723 2136197 2242109 2334346 2420292 2509118 2611205
10322 2611205 2721473 2837335 2964577 3127941 3360087 3655933 3984013 4308336 4619658
10313 4619658 4950176 5323752 5753139 6239316 6771655 7364538 8038917 8805564 9669652
10304 9669652 10650375 11778109 13106124 14638313 16349707 18250710 20410536 22922297
$$ packed form
10381C62073J3377K2604K1872J1454M456K621N218J3857K5478K4008K2237K4299
10369E53554K0368J1255J4225J6275J2720J1143P483K474l89m9j71N163M925N307
10355F64283P251J7755M2662M2613M4710M6829M0208L3073K6905L4605M4417M7899
10343A093210N0204N5298N0979M3416M3520N0707N5859N7352N9137P1188O7743
10332A698613N7427O6015Q9902J09766J14474J05912R2237Q5946Q8826J02087
10322B611205J10268J15862J27242J63364K32146K95846L28080L24323L11322
10313D619658L30518L73576M29387M86177N32339N92883O74379P66647Q64088
10304I669652R80723J127734J328015J532189J711394J901003K159826K511761
$$ plain form
10296 22922297 25759938 28666541 31415013 34110389 37083841 40590129 44787349 49897875
10288 49897875 56205893 64039761 73727870 85568245 100039882 118365462 143161409
10281 143161409 179077936 233326761 313803581 416499568 505049279 529324743 479031694
10274 479031694 388855686 300394020 230369745 176401049 134957225 104104634 81557992
10267 81557992 65014137 52655282 43242666 35967689 30304778 25927219 22621526 20249776
10259 20249776 18670523 17587028 16508679 15106714 13498958 11997891 10758731 9771689
10251 9771689 8941755 8207642 7544941 6953190 6438002 5985264 5584239 5218866 4889311
10242 4889311 4598745 4334638 4091505 3882081 3715583 3594049 3511617 3429501 3315999 3168626
$$ packed form
10296B2922297K837641K906603K748472K695376K973452L506288M197220N110526
10288D9897875O308018P833868R688109J1840375J4471637J8325580K4795947
10281A43161409L5916527N4248825Q0476820J02695987Q8549711K4275464n0293049
10274D79031694r0176008q8461666p0024275n3968696m1443824l0852591k2546642
10267H1557992j6543855j2358855r412616p274977n662911m377559l305693k371750
10259B0249776j579253j083495j078349j401965j607756j501067j239160r87042
10251I771689q29934p34113o62701n91751n15188m52738m01025l65373l29555
10242D889311k90566k64107k43133k09424j66498j21534q2432q2116j13502j47373
$$ plain form
10232 3168626 3006353 2841466 2680441 2530365 2384041 2253104 2139693 2043494 1968411 1907417
10222 1907417 1849566 1802918 1756474 1719598 1695634 1669306 1624563 1570768 1523150 1483365 1436410
10211 1436410 1375329 1316472 1275930 1242039 1208302 1184427 1168009 1151030 1139923 1129388 1127149
10200 1127149 1130391 1129010 1120624 1096909 1059131 1021320 990773 956617 917392 881119 846276 814128
10188 814128 793043 781494 772429 758986 756143 764892 780441 808686 827215 823033 808747 794966
10176 794966 777017 756983 742295 743080 761601 784458 811029 839091 868192 908622 959651 1033335
10164 1033335 1147755 1325470 1547276 1694777 1649358 1461207 1259996 1094446 948631 836078
10154 836078 796465 852549 934780 862032 574208 277006 121201 55800 37018 70229 142512
$$ packed form
10232C168626j62273j64887j61025j50076j46324j30937j13411r6199p5083o0994
10222A907417n7851m6648m6444l6876k3964k6328m4743n3795m7618l9785m6955
10211A436410o1081n8857m0542l3891l3737k3875j6418j6979j1107j0535k239
10200A127149L242j381q386k3715l7778l7811l0547l4156l9225l6273l4843l2148
10188H14128k1085j1549r065j3443k843Q749J5549K8245J8529m182j4286j3781
10176G94966j7949k0034j4688P85J8521K2857K6571K8062K9101M0430N1029P3684
10164A033335J14420J77715K21806J47501m5419j88151k01211j65550j45815j12553
10154H36078l9613N6084Q2231p2748k87824k97202j55805o5401j8782L3211P2283
$$ plain form
10143 142512 206096 225294 203673 169375 132265 102181 79075 59892 52159 41052 31997 25187
10131 25187 23526 40962 68823 95785 116206 140633 159854 180791 208139 232948 249841 257734
10119 257734 261167 257354 257345 255085 250328 243141 238673 236468 231759 225442 228150 238498 250487 255566
10105 255566 243817 225226 214928 212526 210156 200903 196197 195040 200699 206583 209975 212354 215988
10092 215988 227501 237303 249590 256382 251815 226527 186542 155375 130001 121530 125418 128211 127058
10079 127058 130815 126061 117597 111518 108112 105662 104572 104371 103538 107569 113675 112755 112265 112288 112256 111548
10063 111548 102855 95569 96683 95381 101296 116034 140862 163533 189611 223719 267941 331747
10051 331747 413245 492606 519278 488595 416813 344050 282112 230930 194053 166024 147934
$$ packed form
10143A42512O3584J9198k1621l4298l7110l0084k3106j9183p733j1107r055o810
10131B5187j661J7436K7861K6962K0421K4427J9221K0937K7348K4809J6893P893
10119B57734L433l813rk260m757p187m468k205m709o317K708J0348J1989N079
10105B55566j1749j8591j0298k402k370r253m706j157N659N884L392K379L634
10092B15988J1513R802J2287O792m567k5288l9985l1167k5374q471L888K793j153
10079A27058L757m754q464o079l406k450j090k01q33M031O106r20m90K3l2p08
10063A11548q693p286J114j302N915J4738K4828K2671K6078L4108M4222O3806
10051C31747Q1498P9361K6672l0683p1782p2763o1938n1182l6877k8029j8090
$$ plain form
10040 147934 136630 133556 137568 137074 132753 128711 130733 132633 134494 135540 139414 150651 153320 128305
10026 128305 102687 95119 107002 129102 144089 144755 142374 138050 134359 129834 122256 101009 78989
10013 78989 65503 66094 75637 92417 101127 98877 92895 93231 93237 85318 76801 72197 75196 72161 73248
9998 73248 72230 70626 70111 65940 59327 59658 61252 57976 51562 42548 33580 33924 35563 31916 25330
9983 25330 27644 28952 31119 38574 41073 38010 35938 31930 16192 1862 -1680 632 11992 23037
9969 23037 36101 48755 55923 60752 62389 68168 74898 78557 78367 78652 71427 64920 62543 64527 68588
9954 68588 65794 66506 70184 70227 72300 75277 76064 74862 76963 76748 78428 83836 83891 84531 88596 90280 95273
9937 95273 98464 100518 102841 110456 116056 117159 116029 116729 124806 130949 139776 152900 170547 190148
$$ packed form
10040A47934j1304l074M012m94m321m042K022J900J861J046L874J1237K669k5015
10026A28305k5618p568J1883K2100J4987O66k381m324l691m525p578k1247k2020
10013G8989j3486N91R543J6780Q710k250n982L36Op919q517m604K999l035J087
9998G3248j018j604n15m171o613L31J594l276o414r014q968L44J639l647o586
9983B5330K314J308K167P455K499l063k072m008j5738j4330l542K312J1360J1045
9969B3037J3064J2654P168M829J637N779O730L659j90K85p225o507k377J984M061
9954F8588k794P12L678M3K073K977P87j202K101k15J680N408N5O40M065J684M993
9937I5273L191K054K323P615N600J103j130P00Q077O143Q827J3124J7647J9601
$$ plain form
9923 190148 209647 230587 258367 288031 319379 349024 372846 401091 442411 487451 537193 598080
9911 598080 657173 721744 798333 898991 1028409 1203908 1429396 1720706 2096367 2577846
9901 2577846 3235237 4245216 5595730 6466731 6161141 5226508 4567658 4567080 5222899 6088956
9891 6088956 6113585 5054422 3710707 2707056 2033159 1541663 1191399 939509 757484
9882 757484 630301 540183 473049 426265 397656 380704 359561 343287 331317 328416 336688 352618
9870 352618 366379 367983 359381 351932 344196 351208 367017 390511 424828 468034 525185 599001 690288
9857 690288 805561 980170 1250115 1661187 2232396 2809871 3059349 2816690 2283503 1752210
9847 1752210 1333554 1023550 789055 620541 500097 414629 339736 274513 222980 200307
$$ packed form
9923A90148J9499K0940K7780K9664L1348K9645K3822K8245M1320M5040M9742O0887
9911E98080N9093O4571P6589J00658J29418J75499K25488K91310L75661M81479
9901B577846O57391J009979J350514Q71001l05590r34633o58850n78O55819Q66057
9891F088956K4629j059163j343715j003651o73897m91496l50264k51890j82025
9882G57484j27183r0118o7134m6784k8609j6952k1143j6274j1970k901Q272J5930
9870C52618J3761J604q602p449p736P012J5809K3494L4317M3206N7151P3816R1287
9857F90288J15273J74609K69945M11072N71209N77475K49478k42659n33187n31293
9847A752210m18656l10004k34495j68514j20444q5468p4893o5223n1533k2673
$$ plain form
9837 200307 191403 185209 183032 189997 198930 208953 201094 187622 169400 147359 133882 117319 107252
9824 107252 105147 107319 102099 103026 111678 124909 142593 153926 160213 161081 152841 127920 99635 81637
9810 81637 68465 61316 53345 46876 40333 29910 24282 23921 27148 33726 43479 48663 50645 54550
9796 54550 53937 59367 57783 47781 44719 46792 45405 45202 44720 45391 49372 50630 49021 53439 55926
9781 55926 58284 60637 64804 72698 80797 85861 91202 91541 81156 61748 44781 36603 33661 36144
9767 36144 35157 35108 30558 24074 20147 22920 19329 18931 20727 17343 21418 23325 19788 19045 21103 22986
9751 22986 22948 22358 23058 26101 27316 31151 37810 40150 44371 39447 38548 44385 53742 56671 54274 51629
9735 51629 47915 54404 58279 65167 68888 74046 83805 88898 91897 96264 93209 87616 87154 88377 89172
$$ packed form
9837B00307q904o194k177O965Q933J0023p859j3472j8222k2041j3477j6563j0067
9824A07252k105K172n220R27Q652J3231J7684J1333O287Q68q240k4921k8285j7998
9810H1637j3172p149p971o469o543j0423n628l61L227O578R753N184J982L905
9796E4550o13N430j584j0002l062K073j387k03m82O71L981J258j609M418K487
9781E5926K358K353M167P894Q099N064N341L39j0385j9408j6967q178k942K483
9767C6144r87m9m550o484l927K773l591l98J796l384M075J907l537p43K058J883
9751B2986l8n90P00L043J215L835O659K340M221m924q99N837R357K929k397k645
9735E1629l714O489L875O888L721N158R759N093K999M367l055n593m62J223P95
$$ plain form
9720 89172 92665 100219 110436 120567 134006 153652 170571 191931 212754 232988 264404 311622
9708 311622 402620 569240 816466 1074664 1181979 1062904 826791 618792 477603 374690
9698 374690 306941 262657 242792 244118 284460 350762 388333 356577 279709 203516 152648 116115
9686 116115 95439 84344 77358 68351 59708 59647 59927 60285 55973 55750 56575 58891 59075 62427 64382 66710
9670 66710 66703 67546 64494 61705 56810 55515 53241 51332 52530 53282 50026 45169 43882 45603 43229 36702
9654 36702 33633 32227 27428 23703 25245 23923 26237 24895 25265 27054 29491 27874 26789 26895 27115
9639 27115 30866 32902 28044 25163 29513 30335 28946 27555 28868 30815 33434 38722 46543 50386 48642
9624 48642 44614 41874 42384 46010 44841 42560 40598 40506 42826 45401 45008 49541 51731 48748 48259 45687
$$ packed form
9720H9172L493P554J0217J0131J3439J9646J6919K1360K0823K0234L1416M7218
9708C11622R0998J66620K47226K58198J07315j19075k36113k07999j41189j02913
9698C74690o7749m4284j9865J326M0342O6302L7571l1756p6868p6193n0868l6533
9686A16115k0676j1095o986r007q643o1K80L58m312k23Q25K316J84L352J955K328
9670F6710pQ43l052k789m895j295k274j909J198P52l256m857j287J721k374o527
9654C6702l069j406m799l725J542j322K314j342L70J789K437j617j085J06K20
9639B7115L751K036m858k881M350Q22j389j391J313J947K619N288P821L843j744
9624D8642m028k740N10L626j169k281j962r2K320K575l93M533K190k983m89k572
$$ plain form
9608 45687 37443 35348 35779 31623 29246 33047 34838 30077 24916 23730 21552 21224 18844 15934 15992 16335
9592 16335 18824 25085 24637 21858 23464 25395 25183 26545 20082 21782 21021 25103 26824 30141 31736
9577 31736 30954 30647 37507 45891 45394 45855 51368 50836 48261 51875 59703 76264 99107 116769 122618
9562 122618 125980 123893 114888 99573 82956 66337 60751 53636 43202 39573 37890 35726 35840 35118
9548 35118 35169 42034 46993 46035 43740 48438 48368 51439 56455 59680 59172 62674 70968 73020 78049 84594
9532 84594 92498 103125 116440 135637 155169 181873 221146 285506 368848 465863 577214 674886
9520 674886 744931 772816 752037 684024 584450 481384 378318 289529 219829 168834 133170
9509 133170 104800 89070 81634 70738 59121 50651 45621 39614 35889 36113 34346 30912 35703 38928
$$ packed form
9608D5687q244k095M31m156k377L801J791m761n161j186k178l28k380k910N8L43
9592A6335K489O261m48k779J606J931k12J362o463J700p61M082J721L317J595
9577C1736p82l07O860Q384m97M61N513n32k575L614P828J6561K2843J7662N849
9562A22618L362k087r005j5315j6617j6619n586p115j0434l629j683k164J14p22
9548C5118N1O865M959r58k295M698p0L071N016L225n08L502Q294K052N029O545
9532H4594P904J0627J3315J9197J9532K6704L9273O4360Q3342R7015J11351R7672
9520F74886P0045K7885k0779o8013r9574j03066j03066q8789o9700n0995l5664
9509A33170k8370j5730p436j0896j1617q470n030o007l725K24j767l434M791L225
$$ plain form
9495 38928 38393 36998 32946 40488 49667 52628 45979 38769 37973 42513 48206 50461 46450 45016 38052
9480 38052 33590 32102 24573 20248 21618 23899 31678 31637 26407 25231 28560 30051 24649 19641 20536
9465 20536 20508 20996 22118 21107 22849 24066 20661 18265 14388 17318 20047 24328 18595 14100 13303 15291
9449 15291 18435 18550 18266 21587 22147 18902 17898 17181 15884 17510 19469 17442 15102 14357 18128 18718
9433 18718 18048 18015 18264 23156 23814 18554 20173 27371 30789 26665 17277 16710 16221 16202 19347 22722 25890
9416 25890 26172 24975 20929 17038 23753 29699 34132 32937 29404 23836 20509 22943 26968 31808 32028
9401 32028 28579 23485 20144 21508 19984 23087 21595 17152 17933 23551 25869 22922 24421 24087 25184
9386 25184 28137 26855 13998 14404 20939 23348 25962 24162 25871 28478 27380 24636 22485 23125 22389
$$ packed form
9495C8928n35j395m052P542R179K961o649p210p96M540N693K255m011j434o964
9480C8052m462j488p529m325J370K281P779m1n230j176L329J491n402n008Q95
9465B0536k8M88J122j011J742J217l405k396l877K930K729M281n733m495p97J988
9449A5291L144J15k84L321N60l245j004p17j297J626J959k027k340p45L771N90
9433A8718o70l3K49M892O58n260J619P198L418m124r388n67m89j9L145L375L168
9416B5890K82j197m046l891O715N946M433j195l533n568l327K434M025M840K20
9401C2028l449n094l341J364j524L103j492m443P81N618K318k947J499l34J097
9386B5184K953j282j2857M06O535K409K614j800J709K607j098k744k151O40p36
$$ plain form
9371 22389 15607 15607 14424 17299 16079 13273 12791 13112 12209 10608 12097 14467 17516 17616 20025 19955 17101
9354 17101 14727 16133 16426 20430 26895 30463 29647 26826 20140 17760 17689 19021 20139 24074 26348 25450
9338 25450 23454 24365 26675 26922 24630 18414 17886 23887 27593 27566 23539 26219 24961 20778 19998 19319
9322 19319 24092 25932 20781 20777 22707 23455 20898 16208 19203 24539 23802 22540 20060 18689 14684 14942
9306 14942 17956 20857 25551 26590 25167 26557 23834 26470 24136 26587 26996 24078 20974 17741 21086
9291 21086 24959 22424 20866 15144 13886 19455 24827 31329 33676 34425 29962 28518 25123 19699 18881
9276 18881 20946 25064 22800 15097 14974 16685 21961 26447 22897 24360 25005 26025 25139 21960 21642 25791
9260 25791 23405 22955 24084 25342 29103 28382 29888 31250 25253 24651 25725 26964 28286 26344 31747
$$ packed form
9371B2389o782%j183K875j220k806m82L21r03j601J489K370L049J00K409p0k854
9354A7101k374J406K93M004O465L568q16k821o686k380p1J332J118L935K274q98
9338B5450j996R11K310K47k292o216n28O001L706k7m027K680j258m183p80o79
9322A9319M773J840n151mJ930P48k557m690K995N336p37j262k480j371m005K58
9306A4942L014K901M694J039j423J390k723K636k334K451M09k918l104l233L345
9291B1086L873k535j558n722j258N569N372O502K347P49m463j444l395n424q18
9276A8881K065M118k264p703j23J711N276M486l550J463O45J020q86l179l18M149
9260B5791k386m50J129J258L761p21J506J362n997o02J074J239J322j942N403
$$ plain form
9245 31747 29805 25507 25800 25141 29427 34314 31821 29090 27186 26524 30152 29261 28439 24052 24189 22456
9229 22456 27089 27240 26556 25370 24354 23999 28084 29671 28407 22081 21612 23994 17839 17682 15938 19780
9213 19780 22422 21050 22174 21392 22086 26691 27071 24556 24051 27178 31438 32837 25211 22535 21826 23935
9197 23935 27162 27042 27468 29535 27260 21941 19399 23250 26017 27908 28801 26707 25996 26268 27024 30631
9181 30631 33701 38577 41210 37242 38120 37372 33651 30030 30978 29339 27114 25227 28930 29914 31581 37682
9165 37682 37712 38672 39424 38293 36489 36709 33146 30742 34758 35154 32863 34734 32948 30855 35308 32997
9149 32997 32363 33183 36193 40687 40660 37510 36739 37547 36379 32798 34799 36589 37168 37871 35879 33796 29704
9132 29704 30705 35593 38053 38759 36118 36508 37051 37177 29411 27379 30206 34163 33008 36893 38521 36817
$$ packed form
9245C1747j942m298K93o59M286M887k493k731j904o62L628q91q22m387J37j733
9229B2456M633J51o84j186j016l55M085J587j264o326m69K382o155j57j744L842
9213A9780K642j372J124p82O94M605L80k515n05L127M260J399p626k676p09K109
9197B3935L227j20M26K067k275n319k542L851K767J891Q93k094p11K72P56L607
9181C0631L070M876K633l968Q78p48l721l621R48j639k225j887L703R84J667O101
9165C7682L0R60P52j131j804K20l563k404M016L96k291J871j786k093M453k311
9149C2997o34Q20L010M494k7l150p71Q08j168l581K001J790N79P03j992k083m092
9132B9704J001M888K460P06k641L90N43J26p766k032K827L957j155L885J628j704
$$ plain form
9116 36817 39670 45451 51919 53036 49426 48955 49736 43025 40665 44453 43354 41858 48299 48000 47037 47337
9100 47337 42842 40362 37742 38577 39173 36484 35018 35058 36782 35427 32296 32062 32459 30250 31421 30783
9084 30783 27630 26657 24213 24107 32040 33235 35848 36272 41030 47420 47186 44104 40015 40696 42594 40496
9068 40496 38721 37499 39527 41125 47005 48827 44562 39828 42452 40644 37372 39566 41958 43955 48988
9053 48988 50898 52542 47794 45645 50809 61800 62907 62855 64064 64665 68459 78855 89601 99922
9039 99922 120367 151531 173846 174182 153371 122526 101721 89696 76956 63316 58505 55566 49054
9026 49054 47917 44780 44772 45039 43049 44669 45952 41677 42031 48920 49926 46267 49676 55200 54586 51595
9010 51595 52725 55694 59296 58752 54598 54456 60812 69073 75954 78922 80663 93293 108363 122827
$$ packed form
9116C6817K853N781O468J117l610m71P81o711k360L788j099j496O441k99r63L00
9100D7337m495k480k620Q35N96k689j466M0J724j355l131k34L97k209J171o38
9084C0783l153r73k444j06P933J195K613M24M758O390k34l082m089O81J898k098
9068D0496j775j222K028J598N880J822m265m734K624j808l272K194K392J997N033
9053D8988J910J644m748k149N164J0991J107n2J209O01L794J0396J0746J0321
9039I9922K0445L1164K2315L36k0811l0845k0805j2025j2740j3640m811k939o512
9026D9054j137l137qK67j990J620J283m275L54O889J006l659L409N524o14k991
9010E1595J130K969L602n44m154j42O356Q261O881K968J741J2630J5070J4464
$$ plain form
8996 122827 149219 174382 176136 158169 134698 115696 97582 84931 71403 63011 63924 63143 59980
8983 59980 59227 60229 59188 53690 54498 57227 59035 54760 51796 55861 57774 55330 47784 46589 54867
8968 54867 55175 56320 59384 58231 62037 72978 79196 80861 76588 72541 72568 68998 61166 54015 53041
8953 53041 61964 62417 60351 59168 62016 58705 54298 58211 60120 56529 53868 54522 57451 61275 63180
8938 63180 67206 73357 67408 63216 62737 59831 61859 62199 67619 72445 71716 67439 65261 65387 68210 78681
8922 78681 86397 90518 94043 97113 95343 87679 80685 77370 73447 70213 60757 58942 60382 64380 66210
8907 66210 63844 65569 66215 69603 66885 64616 66851 65956 64022 62093 58238 59406 56654 56948 59821
8892 59821 61891 61693 61824 60761 64107 67872 72575 70797 67484 62821 61513 62516 64388 66976 64842
$$ packed form
8996A22827K6392K5163J754j7967k3471j9002j8114j2651j3528q392R13p81l163
8983E9980p53J002j041n498Q08K729J808m275k964M065J913k444p546j195Q278
8968E4867L08J145L064j153L806J0941O218J665m273m047K7l570p832p151r74
8953E3041Q923M53k066j183K848l311m407L913J909l591k661O54K929L824J905
8938F3180M026O151n949m192m79k906K028L40N420M826p29m277k178J26K823J0471
8922G8681P716M121L525L070j770p664o994l315l923l234r456j815J440L998J830
8907F6210k366J725O46L388k718k269K235q95j934j929l855J168k752K94K873
8892E9821K070j98J31j063L346L765M703j778l313m663j308J003J872K588k134
$$ plain form
8877 64842 67023 68518 71711 74629 73170 73196 76133 77642 78924 78081 81827 87581 93770 98050 97150 101026
8861 101026 105254 104911 102281 102136 100688 99361 93890 91785 89598 80927 78848 78315 79528 75962 71674
8846 71674 71026 70323 69645 70908 70822 67815 69305 66236 67498 70675 71842 75913 76150 75801 82861 83024 74444
8829 74444 74342 79106 86133 86467 83554 81508 77891 75721 78346 75976 77703 73245 70729 74990 81357
8814 81357 86191 82626 82644 80312 80842 81682 85033 83957 87542 92444 94137 91355 91319 95910 96933 99724
8798 99724 97202 95141 93981 95014 97788 98702 98645 96807 92748 94584 97247 97809 96709 92494 94599 99252
8782 99252 99874 98009 92212 90845 90877 92060 97588 98645 99212 95497 97027 93408 94634 92851 95050 101875
8766 101875 105928 105250 107966 105080 104914 99908 100471 103423 106971 112177 112799 111938 115017 118510 121250 127406
$$ packed form
8877F4842K181J495L193K918j459K6K937J509J282q43L746N754O189M280r00L876
8861A01026M228l43k630j45j448j327n471k105k187q671k079n33J213l566m288
8846G1674o48p03o78J263q6l007J490l069J262L177J167M071K37l49P060J63q580
8829G4444j02M764P027L34k913k046l617k170K625k370J727m458k516M261O367
8814H1357M834l565J8k332N30Q40L351j076L585M902J693k782l6M591J023K791
8798I9724k522k061j160J033K774R14n7j838m059J836K663N62j100m215K105M653
8782I9252O22j865n797j367L2J183N528J057N67l715J530l619J226j783K199O825
8766A01875M053o78K716k886j66n006N63K952L548N206O22q61L079L493K740O156
$$ plain form
8750 127406 129031 131948 140898 145689 154426 161952 171538 187128 207420 237062 283668 330798 353058
8737 353058 338540 303725 269940 239383 210394 193680 181709 169855 162405 162731 160592 157258 154542
8724 154542 156213 157113 155220 153860 156707 157890 163557 166253 168608 166595 171095 180409 189128 199330
8710 199330 201040 202417 218133 230406 239093 260190 285973 324980 376842 449594 552525 676226
8698 676226 770392 790883 763470 736135 749390 789821 785842 704417 581213 470470 386828
8687 386828 327227 287430 263282 243009 229590 217972 211346 204701 198383 193651 188704 186432 186032
8674 186032 181583 186413 188076 188788 189987 190768 195257 200072 206818 217849 224798 235840 254571 280507
8660 280507 315551 365640 446129 547703 612541 593456 521913 445845 385856 351176 336813
$$ packed form
8750A27406J625K917Q950M791Q737P526R586J5590K0292K9642M6606M7130K2260
8737C53058j4518l4815l3785l0557k8989j6714j1971j1854p450L26k139l334k716
8724A54542J671R00j893j360K847J183N667K696K355k013M500R314Q719J0202
8710A99330J710J377J5716J2273Q687K1097K5783L9007N1862P2752J02931J23701
8698F76226R4166K0491k7413k7335J3255M0431l979q1425j23204j10743q3642
8687C86828n9601l9797k4148k0273j3419j1618o626o645o318m732m947k272m00
8674A86032m449M830J663P12J199P81M489M815O746J1031O949J1042J8731K5936
8660B80507L5044N0089Q0489J01574O4838j9085p1543p6068n9989l4680j4363
$$ plain form
8649 336813 339329 357361 388856 407905 396491 356973 310443 274843 246347 228682 217000 211700
8637 211700 203926 202780 204894 212278 215766 214342 205125 200123 195919 184379 177952 175870 175030 173130
8623 173130 172640 167258 168377 173569 174589 175697 177459 179441 171676 168206 167718 170827 175055 176408 176676
8608 176676 180815 179826 179993 180980 177861 178447 181660 180835 184103 191082 195065 197603 200843 204223 205566 215779
8592 215779 226851 228063 225610 219342 216282 214377 207303 201014 200133 202294 201265 198405 201477 206948
8578 206948 209060 204881 205211 208641 213717 217969 215185 217271 216344 213985 211865 214212 221943 225440 228659
8563 228659 229352 231066 231567 232375 232130 228592 225988 225460 227822 230742 232579 237188 235179 230923 235095 240182
8547 240182 241409 239336 241763 240628 240905 241939 243292 248544 251748 249702 247494 250668 254360 259069 265398
$$ packed form
8649C36813K516J8032L1495J9049j1414l9518m6530l5600k8496j7665j1682n300
8637B11700p774j146K114P384L488j424r217n002m204j1540o427k082q40j900
8623A73130m90n382J119N192J020J108J762J982p765l470m88L109M228J353K68
8608A76676M139r89J67R87l119N86L213q25L268O979L983K538L240L380J343J0213
8592B15779J1072J212k453o268l060j905p074o289q81K161j029k860L072N471
8578B06948K112m179L30L430N076M252k784K086r27k359k120K347P731L497L219
8563B28659O93J714N01Q08k45l538k604n28K362K920J837M609k009m256M172N087
8547B40182J227k073K427j135K77J034J353N252L204k046k208L174L692M709O329
$$ plain form
8532 265398 263720 259794 259744 259939 257048 257982 261940 267267 271641 274998 279988 285540 286669 287273 286382 283520
8516 283520 285619 286256 287115 287460 291033 298625 299700 300490 297890 301701 309534 309227 309076 308480 304928 310742
8500 310742 316544 319806 323588 326936 327200 327747 328364 328161 329855 333908 337132 343604 350642 356010 361545
8485 361545 363108 369488 371579 381553 390974 408737 427591 453608 490389 527292 550213 544761 519593
8472 519593 491835 467555 449225 432885 422226 416453 411805 409677 413597 412032 415038 426280 430220
8459 430220 430906 429416 433890 438426 438224 435948 435536 441019 447713 451207 456314 461173 465776 470064 473174
8444 473174 478215 486723 496742 504674 516400 537954 565584 594685 632861 670335 688986 679954
8432 679954 654350 627826 602415 585401 572894 563364 562340 562700 562425 562413 559994 553309 553125 557117
$$ packed form
8532B65398j678l926n0J95k891R34L958N327M374L357M990N552J129O04q91k862
8516B83520K099O37Q59L45L573P592J075P90k600L811P833l07j51n96l552N814
8500C10742N802L262L782L348K64N47O17k03J694M053L224O472P038N368N535
8485C61545J563O380K091R974R421J7763J8854K6017L6781L6903K2921n452k5168
8472E19593k7758k4280j8330j6340j0659n773m648k128L920j565L006J1242L940
8459D30220O86j490M474M536k02k276m12N483O694L494N107M859M603M288L110
8444D73174N041Q508J0019P932J1726K1554K7630K9101L8176L7474J8651r032
8432F79954k5604k6524k5411j7014j2507r530j024L60k75j2k419o685j84L992
$$ plain form
8418 557117 558541 560238 560838 561396 562618 561927 565975 564801 571356 574281 574746 582872 596348 596894 595423
8403 595423 590535 592412 595219 593670 589815 591401 608285 625519 631542 634118 647992 666728 678442
8390 678442 679662 684616 689841 691484 694962 695478 699758 710140 721203 733696 736307 733013 732623 739735
8376 739735 742877 745682 752581 764848 775018 782788 790802 798869 804679 810407 818737 827049 833598 841854
8362 841854 848958 857954 868576 877196 885327 889859 898602 909353 920148 926812 941602 954251 958939
8349 958939 963326 972665 986381 1002322 1014259 1021199 1019758 1013911 1017877 1034089 1051504 1085112 1141653
8336 1141653 1184997 1193223 1172121 1152832 1142773 1137692 1143847 1164891 1196449 1221460 1239993 1246356
8324 1246356 1249010 1265443 1285183 1304853 1321218 1335585 1346503 1362408 1377838 1391477 1405823 1421906
$$ packed form
8418E57117J424J697O00N58J222o91M048j174O555K925M65Q126J3476N46j471
8403E95423m888J877K807j549l855J586J6884J7234O023K576J3874J8736J1714
8390F78442J220M954N225J643L478N16M280J0382J1063J2493K611l294l90P112
8376G39735L142K805O899J2267J0170P770Q014Q067N810N728Q330Q312O549Q256
8362H41854P104Q996J0622Q620Q131M532Q743J0751J0795O664J4790J2649M688
8349I58939M387R339J3716J5941J1937O940j441n847L966J6212J7415L3608N6541
8336A141653M3344Q226k1102j9289j0059n081O155K1044L1558K5011J8533O363
8324A246356K654J6433J9740J9670J6365J4367J0918J5905J5430J3639J4346J6083
$$ plain form
8312 1421906 1442465 1461510 1483389 1505862 1526857 1550608 1570044 1584109 1603800 1625954 1647884
8301 1647884 1665309 1684773 1707444 1730368 1752493 1782124 1805526 1826388 1844941 1873696 1904480
8290 1904480 1929737 1947397 1962179 1987772 2019772 2056341 2089387 2110164 2129075 2157961 2187278
8279 2187278 2221098 2259544 2293962 2321867 2345965 2374985 2415835 2458795 2501558 2534406 2566380
8268 2566380 2606989 2644628 2682966 2731456 2785279 2829562 2865564 2904622 2955096 3007184 3058569
8257 3058569 3108061 3153539 3205324 3261111 3318684 3375879 3436068 3498685 3555075 3614929 3681398
8246 3681398 3745398 3810475 3879905 3955803 4033337 4112228 4187693 4263778 4339274 4418228 4500287
8235 4500287 4587339 4675560 4767650 4857081 4949571 5046488 5143132 5233857 5331554 5430363 5536262
$$ packed form
8312A421906K0559J9045K1879K2473K0995K3751J9436J4065J9691K2154K1930
8301A647884J7425J9464K2671K2924K2125K9631K3402K0862J8553K8755L0784
8290A904480K5257J7660J4782K5593L2000L6569L3046K0777J8911K8886K9317
8279B187278L3820L8446L4418K7905K4098K9020M0850M2960M2763L2848L1974
8268B566380M0609L7639L8338M8490N3823M4283L6002L9058N0474N2088N1385
8257C058569M9492M5478N1785N5787N7573N7195O0189O2617N6390N9854O6469
8246C681398O4000O5077O9430P5898P7534P8891P5465P6085P5496P8954Q2059
8235D500287Q7052Q8221R2090Q9431R2490R6917R6644R0725R7697R8809J05899
$$ plain form
8224 5536262 5650221 5766567 5878473 5993616 6113833 6239921 6366147 6490775 6616121 6748726
8214 6748726 6888691 7022276 7154671 7295764 7441574 7591262 7738608 7887069 8047939 8209605
8204 8209605 8373372 8535656 8698439 8863252 9032867 9200173 9368233 9533602 9700506 9874944
8194 9874944 10052348 10226183 10396497 10560425 10726618 10889726 11046870 11196497 11349882 11505704
8184 11505704 11656838 11801498 11944008 12081833 12208520 12333272 12450634 12555771 12659218
8175 12659218 12755243 12841153 12916992 12985846 13050017 13101011 13141089 13167582 13188277 13198130 13192434 13181655
8163 13181655 13166176 13141926 13106656 13060361 12996129 12919541 12834295 12740077 12640832 12539191 12431244
8152 12431244 12310175 12180976 12051012 11911690 11765836 11616964 11464954 11310310 11149939
$$ packed form
8224E536262J13959J16346J11906J15143J20217J26088J26226J24628J25346J32605
8214F748726J39965J33585J32395J41093J45810J49688J47346J48461J60870J61666
8204H209605J63767J62284J62783J64813J69615J67306J68060J65369J66904J74438
8194I874944J77404J73835J70314J63928J66193J63108J57144J49627J53385J55822
8184A1505704J51134J44660J42510J37825J26687J24752J17362J05137J03447
8175A2659218R6025Q5910P5839O8854O4171N0994M0078K6493K0695R853n696j0779
8163A3181655j5479k4250l5270m6295o4232p6588q5246r4218r9245j01641j07947
8152A2431244j21069j29199j29964j39322j45854j48872j52010j54644j60371
$$ plain form
8143 11149939 10983759 10821229 10652684 10480364 10312581 10140970 9968548 9791367 9619730
8134 9619730 9452767 9285028 9113777 8944526 8777323 8612424 8448230 8286194 8132128 7976812
8124 7976812 7823160 7668152 7518558 7371310 7227020 7086724 6957023 6829241 6700414 6567262
8114 6567262 6434650 6300764 6168044 6040204 5920090 5801775 5682663 5562336 5455336 5346438
8104 5346438 5236691 5136606 5039893 4943276 4845711 4751829 4662900 4574904 4493537 4409364 4318097
8093 4318097 4233368 4157136 4083646 4017640 3952587 3883199 3816167 3747154 3674376 3603226 3530395
8082 3530395 3465426 3402896 3347294 3293708 3236975 3181870 3129376 3073904 3015663 2965900 2918639
8071 2918639 2875032 2833470 2790175 2745348 2699098 2649477 2605435 2565073 2525033 2484126 2439139
$$ packed form
8143A1149939j66180j62530j68545j72320j67783j71611j72422j77181j71637
8134I619730j66963j67739j71251j69251j67203j64899j64194j62036j54066j55316
8124G976812j53652j55008j49594j47248j44290j40296j29701j27782j28827j33152
8114F567262j32612j33886j32720j27840j20114j18315j19112j20327j07000j08898
8104E346438j09747j00085r6713r6617r7565r3882q8929q7996q1367q4173r1267
8093D318097q4729p6232p3490o6006o5053o9388o7032o9013p2778p1150p2831
8082C530395o4969o2530n5602n3586n6733n5105n2494n5472n8241m9763m7261
8071B918639m3607m1562m3295m4827m6250m9621m4042m0362m0040m0907m4987
$$ plain form
8060 2439139 2395099 2351165 2314133 2283685 2252765 2219925 2186763 2151910 2119363 2091042 2059834
8049 2059834 2030020 2006455 1985499 1959163 1923133 1888325 1862189 1838832 1805630 1776149 1747378
8038 1747378 1721274 1701301 1679924 1659078 1639900 1618379 1594074 1565265 1541772 1522133 1506257
8027 1506257 1490891 1468901 1445842 1425873 1404417 1388993 1373636 1358974 1344333 1329626 1312101
8016 1312101 1292722 1277281 1257998 1241965 1231858 1220338 1207757 1186196 1164826 1152698 1144146 1134492
8004 1134492 1118315 1104199 1093466 1086285 1073332 1057457 1043937 1035370 1024751 1007664 993497 978458
7992 978458 962401 952857 944806 944024 936900 925811 917384 908655 896813 885702 878266 870684 861206 852711
7978 852711 842889 834724 823756 812481 800439 791676 785537 781140 776796 771247 763907 757748 748490 731516
$$ packed form
8060B439139m4040m3934l7032l0448l0920l2840l3162l4853l2547k8321l1208
8049B059834k9814k3565k0956k6336l6030l4808k6136k3357l3202k9481k8771
8038A747378k6104j9973k1377k0846j9178k1521k4305k8809k3493j9639j5876
8027A506257j5366k1990k3059j9969k1456j5424j5357j4662j4641j4707j7525
8016A312101j9379j5441j9283j6033j0107j1520j2581k1561k1370j2128q552r654
8004A134492j6177j4116j0733p181j2953j5875j3520q567j0619j7087j4167j5039
7992I78458j6057r544q051p82p124j1089q427q729j1842j1111p436p582r478q495
7978H52711r822q165j0968j1275j2042q763o139m397m344n549p340o159r258j6974
$$ plain form
7964 731516 724141 720747 718017 714395 707470 702218 696066 689849 681785 675371 666695 659006 657961 654531
7950 654531 645396 634650 629611 625143 619207 617796 611569 606507 604317 594748 586865 584703 577019 572578
7936 572578 565096 557853 555024 550676 547633 545709 543237 539718 537691 536899 529349 524977 518993 510965 502474
7921 502474 494707 492636 491493 489285 487173 480337 476163 468815 466466 467666 472586 468536 459771 448976
7907 448976 444302 441222 439131 440874 436713 431087 426282 425361 425653 421804 415633 411725 403333 400467 396724
7892 396724 394347 393541 393992 390181 389070 391797 390974 383813 378472 375176 372332 369111 363939 362043 361858
7877 361858 362394 363308 359630 359684 359420 355881 353896 352448 345556 342688 337469 335817 333763 327511 322879 322486
7861 322486 322875 320940 318399 317347 316153 315144 310134 307692 305827 304712 301963 300624 296788 298134 295811
$$ packed form
7964G31516p375l394k730l622o925n252o152o217q064o414q676p689j045l430
7950F54531r135j0746n039m468n936j411o227n062k190r569p883k162p684m441
7936E72578p482p243k829m348l043j924k472l519k027p92p550m372n984q028q491
7921E02474p767k071j143k208k112o836m174p348k349J200M920m050q765j0795
7907D48976m674l080k091J743m161n626m805r21K92l849o171l908q392k866l743
7892C96724k377q06M51l811j111K727q23p161n341l296k844l221n172j896j85
7877C61858N36R14l678N4k64l539j985j448o892k868n219j652k054o252m632l93
7861C22486L89j935k541j052j194j009n010k442j865j115k749j339l836J346k323
$$ plain form
7846 295811 290730 291244 290833 285792 280786 278017 278448 280346 282506 281543 277080 278620 281515 276030 272601
7831 272601 270068 266321 262350 263296 263523 263317 260722 259934 261070 257476 255151 253912 253594 254742 250532 245104
7815 245104 241265 240608 240358 241542 241002 237316 236500 235961 234259 230348 225376 220382 223305 224836 223418 223270
7799 223270 226280 227139 223228 218847 216784 212608 210797 209638 210444 211180 210927 212179 209673 208656 208449 200088
7783 200088 193906 193064 191784 189721 187631 190502 190769 194368 194151 197948 199933 197084 195116 190377 187926
7768 187926 186129 185094 187696 183129 177632 175234 177645 179579 180601 174740 172931 177105 176349 172616 170701
7753 170701 173356 172149 174091 173254 171332 171140 171392 166655 165775 167721 164117 159988 163403 166059 164176
7738 164176 162807 165459 164028 161843 163111 158451 152181 152804 150200 148831 150216 147477 140153 140248 140099
$$ packed form
7846B95811n081N14m11n041n006k769M31J898K160r63m463J540K895n485l429
7831B72601k533l747l971R46K27k06k595p88J136l594k325j239l18J148m210n428
7815B45104l839o57k50J184n40l686q16n39j702l911m972m994K923J531j418j48
7799B23270L010Q59l911m381k063m176j811j159Q06P36k53J252k506j017k07q361
7783B00088o182q42j280k063k090K871K67L599k17L797J985k849j968m739k451
7768A87926j797j035K602m567n497k398K411J934J022n861j809M174p56l733j915
7753A70701K655j207J942q37j922j92K52m737q80J946l604m129L415K656j883
7738A64176j369K652j431k185J268m660o270O23k604j369J385k739p324R5j49
$$ plain form
7723 140099 135819 129992 130695 134686 137891 135546 136612 134466 132646 132049 132899 132320 133745 133274 130946 131393
7707 131393 134685 132809 127970 128125 123445 122035 124340 124349 127046 127759 127418 125320 124357 128384 131020 129711
7691 129711 124375 123755 122700 118667 113659 116958 118820 121024 121489 123611 119234 118014 117307 120120 123171
7676 123171 121467 114541 111740 112142 114289 114949 115981 119181 120154 119818 119638 120340 116037 114608 113232 115990
7660 115990 118907 117864 112139 112296 112650 110745 110236 112112 110211 107579 105342 106881 113767 114306 107635
7645 107635 104344 100926 96653 97929 101379 97559 95450 96272 97829 96233 98005 95818 97890 102223 103202
7630 103202 103101 96811 91529 92899 90516 89819 86523 86641 87956 89450 93830 94123 90615 90244 90856 89175
7614 89175 95566 96062 91322 89855 87745 88439 92449 91261 93517 95088 89757 84649 86134 87146 88813
$$ packed form
7723A40099m280n827P03L991L205k345J066k146j820n97Q50n79J425m71k328M47
7707A31393L292j876m839J55m680j410K305RK697P13l41k098r63M027K636j309
7691A29711n336o20j055m033n008L299J862K204M65K122m377j220p07K813L051
7676A23171j704o926k801M02K147O60J032L200R73l36j80P02m303j429j376K758
7660A15990K917j043n725J57L54j905n09J876j901k632k237J539O886N39o671
7645A07635l291l418m273J276L450l820k109Q22J557j596J772k187K072M333R79
7630A03202j01o290n282J370k383o97l296J18J315J494M380K93l508l71O12j681
7614H9175O391M96m740j467k110O94M010j188K256J571n331n108J485J012J667
$$ plain form
7599 88813 90051 87490 93400 94633 84387 77042 81990 81169 82905 83413 88119 88880 90051 90591 92677
7584 92677 91994 87010 85499 86367 80059 77406 75140 77981 82086 81054 77514 72043 70660 69641 70705
7569 70705 70345 73608 72839 72092 72433 72349 70724 75058 73081 70872 69284 63386 62458 66603 69045 63824
7553 63824 63002 64032 64428 63049 63294 62956 61669 66718 70343 68768 68929 64573 59541 60269 63806 65671
7537 65671 62414 61312 61367 62110 59112 54677 53473 52783 59233 62838 66858 65376 59418 61045 62885 60153
7521 60153 60528 67425 71260 67148 61994 54756 55517 54086 48649 49620 52871 55763 53534 48656 50045
7506 50045 55117 60518 62519 63301 62192 62953 57332 48714 50559 48919 52561 53909 51684 48887 47423
7491 47423 50935 52141 50845 55230 60666 57933 55716 54023 55197 57856 57828 58969 56946 57283 55781
$$ packed form
7599H8813J238k561N910J233j0246p345M948q21J736N08M706P61J171N40K086
7584I2677o83m984j511Q68o308k653k266K841M105j032l540n471j383j019J064
7569G0705l60L263p69p47L41q4j625M334j977k209j588n898r28M145K442n221
7553F3824q22J030L96j379K45l38j287N049L625j575J61m356n032P28L537J865
7537F5671l257j102N5P43k998m435j204o90O450L605M020j482n958J627J840k732
7521F0153L75O897L835m112n154p238P61j431n437R71L251K892k229m878J389
7506E0045N072N401K001P82j109P61n621q618J845j640L642J348k225k797j464
7491D7423L512J206j296M385N436k733k217j693J174K659k8J141k023L37j502
$$ plain form
7476 55781 51616 46745 41552 45091 53903 51134 49108 49110 52854 54947 50600 48911 53825 55434 52135
7461 52135 48282 48045 48286 46582 46269 52179 52244 49704 45321 46104 42915 42281 41318 39370 38638 42083 46900
7444 46900 46163 43680 43057 51116 52353 46800 44534 41859 43345 42951 40993 40389 41093 39151 39366 41579
7428 41579 41747 42231 42642 36279 36076 35656 41778 47207 43574 38065 41635 44045 42708 38878 34343 33541
7412 33541 33773 36966 39840 38653 36316 37493 37459 34522 33306 33246 35238 43020 45264 44847 40847 42166
7396 42166 49998 49526 47107 44542 43247 38235 39796 42504 35249 26528 25611 30267 29390 29614 32109 35133
7380 35133 35351 31856 32467 33549 30335 30040 32276 36667 35420 32634 31118 29204 31147 34629 35563 35643
7364 35643 35730 31829 29132 29624 29050 28769 29422 30419 31103 28638 28403 28292 30460 29880 30079 31873 34087 33673
$$ packed form
7476E5781m165m871n193L539Q812k769k026KL744K093m347j689M914J609l299
7461E2135l853k37K41j704l13N910O5k540m383P83l189o34r63j948p32L445M817
7444D6900p37k483o23Q059J237n553k266k675J486l94j958o04P04j942K15K213
7428D1579J68M84M11o363k03m20O122N429l633n509L570K410j337l830m535q02
7412C3541K32L193K874j187k337J177l4k937j216o0J992P782K244m17m000J319
7396D2166P832m72k419k565j295n012J561K708p255q721r17M656q77K24K495L024
7380C5133K18l495O11J082l214k95K236M391j247k786j516j914J943L482R34Q0
7364C5643Q7l901k697M92n74k81O53R97O84k465k35j11K168n80J99J794K214m14
$$ plain form
7346 33673 33276 34266 35126 38332 41216 42578 39965 33769 31472 30271 27641 31919 33502 29614 31662
7331 31662 33112 28113 23420 25586 26128 26434 30472 30547 32182 30346 31630 27422 27472 28450 27903 31737 35206
7314 35206 32841 32506 31094 30659 25698 28096 25335 24247 28753 32172 30475 28121 29258 31301 30443
7299 30443 29479 33124 31333 30040 28486 26318 27945 29260 29401 31083 30408 28458 29740 27734 25457
7284 25457 24213 27769 27926 26467 26694 26598 25909 25446 24812 21627 26709 29295 27138 23609 25833 23726
7268 23726 21272 18912 16070 10659 15082 21557 28393 27734 23741 24946 27618 28844 25421 23805 25614
7253 25614 29748 28436 26864 24187 20851 21059 19306 23461 24068 24585 22810 16489 16842 17795 20908 22240
7237 22240 23901 25823 25777 26615 21981 19562 21632 27115 25357 25397 25702 25900 23393 25840 26248 21846 22426
$$ packed form
7346C3673l97R90Q60L206K884J362k613o196k297j201k630M278J583l888K048
7331C1662J450m999m693K166N42L06M038P5J635j836J284m208N0R78n47L834L469
7314C5206k365l35j412m35m961K398k761j088M506L419j697k354J137K043q58
7299C0443r64L645j791j293j554k168J627J315J41J682o75j950J282k006k277
7284B5457j244L556J57j459K27r6o89m63o34l185N082K586k157l529K224k107
7268B3726k454k360k842n411M423O475O836o59l993J205K672J226l423j616J809
7253B5614M134j312j572k677l336K08j753M155O07N17j775o321L53R53L113J332
7237B2240J661J922m6Q38m634k419K070N483j758M0L05J98k507K447M08m402N80
$$ plain form
7220 22426 25428 23629 26250 29130 28158 30553 28266 27771 26134 23413 22199 21312 25300 30322 28017
7205 28017 25531 23796 25487 24940 22799 17971 18285 24144 23183 24814 25192 25437 26203 25639 24072 23589 24419
7188 24419 20464 17642 17737 18734 22752 22684 22576 19152 20181 20326 18818 15343 11337 14800 19437 23949
7172 23949 19670 16291 15568 14359 17333 15145 14747 19397 19532 20336 21551 23909 18910 13463 13788 15217
7156 15217 21336 19182 14633 11176 13583 22092 21517 17824 12693 14783 17154 15350 16355 16812 19398
7141 19398 19411 22274 26981 19176 16405 19042 18339 17306 18112 20761 21390 25719 23031 14667 9640 9498
7125 9498 14073 17526 18055 17923 16082 15267 14364 9516 7026 8832 9208 10626 13446 16275 17495 14188
7109 14188 14810 17328 11732 11537 11711 8059 6941 8841 14377 19992 18376 12488 15968 24684 27204
$$ packed form
7220B2426L002j799K621K880r72K395k287m95j637k721j214q87L988N022k305
7205B8017k486j735J691n47k141m828L14N859r61J631L78K45P66n64j567m83Q30
7188B4419l955k822R5R97M018o8j08l424J029J45j508l475m006L463M637M512
7172B3949m279l379p23j209K974k188l98M650J35Q04J215K358m999n447L25J429
7156A5217O119k154m549l457K407Q509n75l693n131K090K371j804J005M57K586
7141A9398J3K863M707p805k771K637p03j033Q06K649O29M329k688q364n027j42
7125I498M575L453N29j32j841q15r03m848k490J806L76J418K820K829J220l307
7109A4188O22K518n596j95J74l652j118J900N536N615j616n888L480Q716K520
$$ plain form
7094 27204 27572 30327 31480 25005 16086 17170 22121 17567 14745 22913 21558 13578 11254 10313 9077
7079 9077 6977 10050 14260 11408 9695 12467 16306 17901 17159 13703 12134 13713 16041 17209 17919
7064 17919 17293 15744 13543 13963 14015 17941 19961 17914 17654 17959 18384 15265 12577 14578 16472 12579
7048 12579 10426 6661 11254 11531 8610 13078 13541 11801 10140 9521 8535 5380 5709 9719 12831 12842
7032 12842 6961 5131 6436 8289 9198 12937 17510 14912 15481 14843 14365 15482 16147 15005 14814 12498
7016 12498 12870 9427 9093 12444 13321 15653 13897 11300 10656 13575 11592 7851 6377 8383 5396 3945
7000 3945 5006 4668 7244 8793 6952 5016 5592 7466 10640 12350 15056 16193 14979 12364 5584
6985 5584 -1920 3448 7210 8377 9537 5883 5797 5280 4483 2869 -1333 -1915 3855 5705 3508 3186
$$ packed form
7094B7204L68K755J153o475q919J084M951m554k822Q168j355p980k324r41j236
7079I077k100L073M210k852j713K772L839J595p42l456j569J579K328J168P10
7064A7919o26j549k201M20N2L926K020k047k60L05M25l119k688K001J894l893
7048A2579k153l765M593K77k921M468M63j740j661o19r86l155L29M010L112J1
7032A2842n881j830J305J853R09L739M573k598N69o38m78J117O65j142j91k316
7016A2498L72l443l34L351Q77K332j756k597o44K919j983l741j474K006k987j451
7000C945J061l38K576J549j841j936N76J874L174J710K706J137j214k615o780
6985E584p504N368L762J167J160l654q6n17p97j614m202n82N770J850k197l22
$$ plain form
6969 3186 7771 9406 8462 8608 5422 3545 6307 8282 10815 12051 9604 6968 10342 11426 8925
6954 8925 8807 8921 6742 8832 6436 6480 9551 13036 9719 9656 7383 6133 6912 4719 1375 3979 7856
6937 7856 8338 6531 8517 9539 7863 10928 9852 4844 -2547 -1363 1408 3338 5881 7190 3414
6922 3414 -1296 1242 2506 1265 4091 3616 1340 3025 6497 10721 14628 11389 10225 10628 12268
6907 12268 11384 15278 18152 15085 11334 10967 11475 13719 8154 4495 3812 2587 2805 -343 -6602 -2257
6891 -2257 5660 7251 11304 7644 4969 11968 16376 14682 11984 7782 7878 6462 3245 4591 8051
6876 8051 9023 5941 5570 5070 3322 1560 4777 3273 2087 3374 978 -1362 2093 1956 2825 4981
6860 4981 6131 6704 7358 3874 2316 8993 13381 11319 9346 9815 8775 8759 8999 9427 7216 6473 4201
$$ packed form
6969C186M585J635r44J46l186j877K762J975K533J236k447k636L374J084k501
6954H925j18J14k179K090k396M4L071L485l317o3k273j250P79k193l344K604L877
6937G856M82j807J986J022j676L065j076n008p391J184K771J930K543J309l776
6922C414m710K538J264j241K826m75k276J685L472M224L907l239j164M03J640
6907A2268q84L894K874l067l751l67N08K244n565l659o83j225K18l148o259M345
6891b257P917J591M053l660k675O999M408j694k698m202R6j416l217J346L460
6876H051R72l082l71n00j748j762L217j504j186J287k396k340L455j37Q69K156
6860D981J150N73O54l484j558O677M388k062j973M69j040j6K40M28k211p43k272
$$ plain form
6843 4201 5726 4370 7319 2380 -292 2975 6119 6048 3986 1466 1160 501 4007 6433 2708 -1616
6827 -1616 -2419 2206 2553 5809 7605 5209 8070 9139 8024 6172 4345 2635 825 3109 4969
6812 4969 4591 5597 8033 3598 -1920 -4335 -2561 -419 -2436 -1344 -1934 -184 6451 9186 11998
6797 11998 10238 6390 5576 5538 5961 1484 1391 5638 11297 11915 6259 -3154 -4414 -295 -3033 -1761
6781 -1761 507 6075 7444 5306 4813 2897 4696 5404 2036 1141 5105 5712 -1122 -3030 -826 5815
6765 5815 7646 8198 4868 5082 6845 6943 8646 9273 7133 5127 -746 354 2789 -17 -1478 2018
6749 2018 1982 4230 6547 9224 11087 14064 10735 13290 13499 12380 15263 16168 18110 17039 14608 9323
6733 9323 2216 5061 8893 6921 867 2117 4950 9080 11745 15033 10619 4177 3329 10260 16643
$$ packed form
6843D201J525j356K949m939k672L267L144p1k062k520l06o59L506K426l725m324
6827a616q03M625L47L256J796k396K861J069j115j852j827j710j810K284J860
6812D969l78J006K436m435n518k415J774K142k017J092n90J750O635K735K812
6797A1998j760l848q14l8M23m477r3M247N659O18n656r413j260M119k738J272
6781a761K268N568J369k138m93j916J799P08l368q95L964O07o834j908K204O641
6765E815J831N52l330K14J763R8J703O27k140k006n873J100K435k806j461L496
6749B018l6K248K317K677J863K977l329K555K09j119K883R05J942j071k431n285
6733I323p107K845L832j972o054J250K833M130K665L288m414o442q48O931O383
$$ plain form
6718 16643 12180 10475 8966 6192 8238 9928 9764 6626 4583 7681 9855 7963 5775 4353 2353
6703 2353 708 2950 4645 8555 7256 6161 3650 4744 3437 6367 7363 4956 6652 7262 8473
6688 8473 6902 3352 819 4369 5874 6519 6116 9138 5464 6277 11401 11300 7946 1231 -1053 3569
6672 3569 3142 2600 -1247 -2866 -419 561 2208 -2282 1268 1529 5459 8835 8835 6817 9049 9381 3045
6655 3045 155 1987 -4523 -8805 -1804 3736 1026 2432 5257 3213 6619 6464 7406 11088 11791 16153
6639 16153 15262 17192 21984 27565 27718 30382 34851 32064 23453 17754 14463 12894 11922 10545 9153
6624 9153 10811 9520 9720 10144 15241 15571 15812 16073 19610 24652 27787 32017 33268 35314 29430 26562
6608 26562 25937 24769 22324 21096 19128 19706 23238 30861 44230 51058 51627 54450 57031 50951 45678
$$ packed form
6718A6643m463j705j509k774K046J690j64l138k043L098K174j892k188j422k000
6703B353j645K242J695L910j299j095k511J094j307K930R96k407J696O10J211
6688H473j571l550k533L550J505O45m03L022l674Q13N124j01l354o715k284M622
6672C569m27n42l847j619K447R80J647m490L550K61L930L376%k018K232L32o336
6655C045k890J832o510m282P001N540k710J406K825k044L406j55R42L682P03M362
6639A6153q91J930M792N581J53K664M469k787q611n699l291j569r72j377j392
6624I153J658j291K00M24N097L30K41K61L537N042L135M230J251K046n884k868
6608B6562o25j168k445j228j968N78L532P623J3369O828N69K823K581o080n273
$$ plain form
6593 45678 40745 37402 32724 26398 25254 24476 24908 25620 27638 28614 29925 37526 41763 44454 40034 30874
6577 30874 25922 27377 22062 15803 15448 18004 20944 25789 22527 18453 20253 19896 15618 10812 9633
6562 9633 9788 11131 14483 17108 15856 16742 14871 15648 16853 15409 9282 8801 10257 13497 15352 11864
6546 11864 10720 9294 12027 14672 20351 23084 22932 21907 16426 17002 14741 8406 9032 9945 10620 7816
6530 7816 9504 5550 -1799 -830 4947 1062 -5820 -9408 -9753 -6963 -3085 -1793 -5348 -6440 -355
6515 -355 3168 4091 5070 5180 887 -247 1825 -1221 -5365 -2709 2128 4701 6169 1386 1254 1676
6499 1676 3877 809 -8867 -13897 -11868 -11815 -7753 -939 266 -1457 -396 899 2147 -1487 -8947
6484 -8947 -6873 2155 7344 5814 4746 5054 -126 -5222 -4922 1085 4262 2528 1732 -429 1908 2391
$$ packed form
6593D5678m933l343m678o326j144p78M32P12K018R76J311P601M237K691m420r160
6577C0874m952J455n315o259l55K556K940M845l262m074J800l57m278m806j179
6562I633J55J343L352K625j252Q86j871P77J205j444o127m81J456L240J855l488
6546A1864j144j426K733K645N679K733j52j025n481N76k261o335O26R13O75k804
6530G816J688l954p349R69N777l885o882l588l45K790L878J292l555j092O085
6515c55L523R23R79J10m293j134K072l046m144K656M837K573J468m783j32M22
6499A676K201l068r676n030K029N3M062O814J205j723J061J295J248l634p460
6484h947K074R028N189j530j068L08n180n096L00O007L177j734p96k161K337M83
$$ plain form
6468 2391 6382 5316 2576 1201 -2223 -3528 912 6033 7045 12080 13894 12788 12667 10985 6232
6453 6232 -1351 691 -409 -4998 -8906 -7983 -4587 -1119 1769 2042 3011 1715 1122 -2594 -52 3008
6437 3008 4861 6452 3018 606 -1376 -4870 -4750 -4717 -4726 -3568 -5482 -6031 -928 3471 4463 -1539 -5092
6420 -5092 -3754 -1742 -2167 786 -996 -4651 -4833 -5743 -5530 -7212 -7228 -6394 -3520 -303 -2085 -6345 -3770
6403 -3770 -3040 -546 6871 11079 6486 -6278 -17885 -28952 -35944 -38219 -32069 -12555 12617 22821
6389 22821 16112 8909 9222 5040 -1539 -3315 -3890 74 6997 7695 4849 2208 2070 7489 7247 2946
6373 2946 -1626 -765 4847 7326 7868 2068 -2317 -2943 -536 -1057 -1053 -744 -3539 -5057 -2592 -1324 -3902
6356 -3902 -38 809 -4538 -11228 -12751 -13524 -4771 3629 3226 -233 -1922 -2608 -2858 -1802 -716 315
$$ packed form
6468B391L991j066k740j375l424j305M440N121J012N035J814j106j21j682m753
6453F232p583K042j100m589l908R23L396L468K888K73R69j296n93l716K542L060
6437C008J853J591l434k412j982l494J20L3rJ158j914n49N103M399R92o002l553
6420e092J338K012m25K953j782l655j82r10K13j682j6Q34K874L217j782m260K575
6403c770P30K494P417M208m593j2764j1607j1067o992k275O150J9514K5172J0204
6389B2821o709p203L13m182o579j776n75L964O923O98k846k641j38N419k42m301
6373B946m572Q61N612K479N42n800m385o26K407n21ML09k795j518K465J268k578
6356c902L864Q47n347o690j523p73Q753Q400m03l459j689o86k50J056J086J031
$$ plain form
6340 315 6712 13534 5287 -7300 -12919 -15673 -9760 -6403 -12334 -23870 -20932 -5224 5494 9502
6326 9502 9854 7816 1501 -1231 -4367 -6158 -2378 1762 7148 13744 8306 3903 5008 8808 9792
6311 9792 7531 5859 4275 2917 -867 -1511 1292 6478 9095 7108 3654 4599 2994 2053 -5210 -7880
6295 -7880 -5531 -4865 -3661 -7570 -10015 -3755 5983 7594 4855 -1585 -8722 -8980 -4099 -603 3312
6280 3312 1672 -4616 -805 3337 4621 9102 10936 9537 9450 11693 18362 16139 11141 9106 7455
6265 7455 3548 -732 -4740 -4632 -2053 664 -55 -3070 -4917 -3349 -3860 -932 1418 4008 2669 6387
6249 6387 6113 7078 1079 -3386 -2305 -2851 4345 8483 4373 -982 -3761 -2068 4466 5313 2303 -2035
6233 -2035 -2937 377 1859 -1033 -7854 -10512 -9377 -7655 -8616 -8939 -4693 -2250 22 -851 -2592 -2824
$$ packed form
6340C15O397O822q247j2587n619k754N913L357n931j1536K938J5708J0718M008
6326I502L52k038o315k732l136j791L780M140N386O596n438m403J105L800R84
6311I792k261j672j584j358l784o44K803N186K617j987l454R45j605r41p263k670
6295g880K349O66J204l909k445O260R738J611k739o440p137k58M881L496L915
6280C312j640o288L811M142J284M481J834j399q7K243O669k223m998k035j651
6265G455l907m280m008J08K579K717p19l015j847J568n11K928K350K590j339L718
6249F387k74R65n999m465J081n46P196M138m110n355k779J693O534Q47l010m338
6233b035r02L314J482k892o821k658J135J722r61l23M246K443K272q73j741k32
$$ plain form
6217 -2824 -4477 -1587 6207 8501 3773 2747 2424 -2550 -7550 -7242 -6482 -4396 -471 3059 7610 7508
6201 7508 3635 339 -4525 -3654 -1028 -3968 -4372 1440 2095 3034 42 -886 -812 -3118 -1111 -1604 473
6184 473 -630 -4184 -3252 498 383 -3853 -2805 -3322 -7017 -5500 -833 976 -4831 -6822 -3593 -938
6168 -938 2531 -913 -2047 -2289 -5889 -3784 -5620 -8842 -8535 -5295 -6839 -8216 -6094 -7425 -6209 -2198
6152 -2198 2445 1611 2656 884 926 1503 -1536 -2709 -2957 -5250 -3415 -1536 5297 5434 503 229 2694
6135 2694 2711 4772 6210 5140 4760 -1700 -6810 -1669 1662 -4933 -8809 -12058 -15012 -12043 -7485 -2934
6119 -2934 -4327 -3871 -5977 -8751 -3445 -4031 -1163 153 -2051 -5174 -7149 -7339 -11753 -7501 -2742 -1388
6103 -1388 -1742 -2596 -1298 -1014 -3116 -4537 -6980 -10644 -11581 -14802 -19446 -18057 -13593 -9356 -2440 1079
$$ packed form
6217b824j653K890P794K294m728j026l23m974n000L08P60K086L925L530M551j02
6201G508l873l296m864Q71K626k940m04N812O55R39k992r28P4k306K007m93K077
6184D73j103l554R32L750j15m236J048n17l695J517M667J809n807j991L229K655
6168i38L469l444j134k42l600K105j836l222L07L240j544j377K122j331J216M011
6152b198M643q34J045j772M2N77l039j173k48k293J835J879O833J37m931k74K465
6135B694J7K061J438j070l80o460n110N141L331o595l876l249k954K969M558M551
6119b934j393M56k106k774N306n86K868J316k204l123j975j90m414M252M759J354
6103a388l54q54J298K84k102j421k443l664r37l221m644J389M464M237O916L519
$$ plain form
6087 1079 4338 3909 1455 1371 2940 813 -3561 2025 5789 5130 1674 -2951 -4000 -5732 -9015 -6084
6071 -6084 2359 2769 -2717 -3421 -5159 -8801 -7611 -6164 -4197 -5203 -4034 -1408 592 2238 4352
6056 4352 2445 -4025 -7611 -5063 -3137 -3524 -7067 -4638 -3117 -5719 -5852 -4879 -5029 -10348 -10060 -11279
6040 -11279 -13116 -6289 -4964 -3020 -2207 -4037 -6508 -7265 -7211 -7457 -1402 6230 7912 -1746 -8676 -6863
6024 -6863 -4636 -4642 -1245 -2157 -3396 -6898 -7327 -5740 -3756 461 868 484 -3712 -7191 -10370 -11018 -4670
6007 -4670 -4939 -4957 -7878 -9911 -7960 -5452 -5307 -9330 -7633 -9675 -6306 -5551 -3419 -5969 -7341 -5213
5991 -5213 -5433 -6515 -4570 -2800 -909 -385 -2410 -715 5155 192 -3259 -3890 -2222 -5230 -2626 -162
5975 -162 1359 1650 3007 4828 683 -2041 2426 4546 3449 2189 -333 -2499 -3987 -3224 1655 -969
$$ packed form
6087A079L259m29k454q4J569k127m374N586L764o59l456m625j049j732l283K931
6071f084Q443M10n486p04j738l642J190J447J967j006J169K626K000J646K114
6056D352j907o470l586K548J926l87l543K429J521k602j33R73j50n319K88j219
6040a1279j837O827J325J944Q13j830k471p57N4k46O055P632J682r658o930J813
6024f863K227oL397r12j239l502m29J587J984M217M07l84m196l479l179o48O348
6007d670k69j8k921k033J951K508J45m023J697k042L369P55K132k550j372K128
5991e213k20j082J945J770J891N24k025J695N870m963l451o31J668l008K604K464
5975a62J521K91J357J821m145k724M467K120j097j260k522k166j488P63M879k624
$$ plain form
5959 -969 -397 844 -2150 -2774 618 -4775 -6795 -2597 -4481 -7239 -8151 -3565 -2406 -971 -682 -2829
5943 -2829 -2454 -2234 -3566 -3677 -7736 -5327 -949 3108 654 2235 -800 -485 1701 -2847 -5731 -3358
5927 -3358 -1381 -1395 -2851 -3158 1412 -1650 -5125 -5810 -4436 -2399 -414 -2668 -5140 -841 -3437 -7855
5911 -7855 -8725 -5755 13 -2295 -1424 -1249 -3124 -5208 -7183 -10681 -5736 -1028 562 -424 -5302 -9007
5895 -9007 -8439 -3067 60 -2422 2369 3943 -2765 1916 1630 1013 5307 6207 5573 3841 806 -3832
5879 -3832 -4347 -1931 1735 -2108 -3799 -5539 -8849 -6258 -6068 -6792 -3640 -83 -3109 -2207 -2943 -5740
5863 -5740 -5477 -9387 -10160 -8303 -6628 -7421 -10205 -10559 -5604 -722 -458 -2308 -407 -995 2107 592
5847 592 -3689 -7801 -8373 -8972 -7165 -2727 -5697 -3814 -925 13 -640 2590 4459 -2310 -10515 -15352
$$ packed form
5959i69N72J241k994o24L392n393k020M198j884k758r12M586J159J435K89k147
5943b829L75K20j332j11m059K409M378M057k454J581l035L15K186m548k884K373
5927c358J977j4j456l07M570l062l475o85J374K037J985k254k472M299k596m418
5911g855q70K970N768k308Q71J75j875k084j975l498M945M708J590r86m878l705
5895i007N68N372L127k482M791J574o708M681k86o17M294R00o34j732l035m638
5879c832n15K416L666l843j691j740l310K591J90p24L152L557l026R02p36k797
5863e740K63l910p73J857J675p93k784l54M955M882K64j850J901n88L102j515
5847E92m281m112n72n99J807M438k970J883K889R38o53L230J869o769q205m837
$$ plain form
5831 -15352 -19121 -16079 -9922 -8380 -8311 -8609 -7111 -9696 -11949 -10754 -7261 -8172 -6140 -5486 -7928 -11039
5815 -11039 -12334 -12092 -12897 -9085 -2502 -825 -10139 -11506 -8635 -7001 -8001 -7366 -7798 -8342 -8490 -5410
5799 -5410 -1904 -1968 -4189 -5725 -4031 -3347 -2654 -546 1769 -1344 -2209 -3205 -1545 -3824 -4653 -2824 -4097
5782 -4097 2151 6122 3542 3840 -1419 -2610 -3008 -8094 -11295 -8339 -2267 -73 463 -2542 -4701 -6439
5766 -6439 -4615 682 879 -1242 260 -709 -1562 -2522 -2451 -4068 -2224 -1412 2200 1002 1285 5863 2872
5749 2872 4816 5764 2536 1189 1660 -442 -1536 -1 546 4844 4615 3155 1868 4324 3926 4502
5733 4502 2485 -14 -7648 -4299 -7015 -5942 -5128 -5641 -5201 -6085 -6897 -2502 1559 -2141 -740 -3950
5717 -3950 -11792 -9139 -9615 -6941 -3657 -4652 -4168 -7574 -8498 -6278 -3963 -5222 -8078 -6223 -2306 -3688
$$ packed form
5831a5352l769L042O157J542O9k98J498k585k253J195L493r11K032O54k442l111
5815a1039j295K42q05L812O583J677r314j367K871J634j000O35m32n44j48L080
5799e410L506o4k221j536J694O84O93K108K315l113q65r96J660k279q29J829j273
5782d097O248L971k580K98n259j191l98n086l201K956O072K194N36l005k159j738
5766f439J824N297J97k121J502r69q53r60P1j617J844Q12L612j198K83M578k991
5749B872J944R48l228j347M71k102j094J535N47M298k29j460j287K456l98N76
5733D502k017k499p634L349k716J073Q14n13M40q84q12M395M061l700J401l210
5717c950p842K653m76K674L284r95M84l406r24K220K315j259k856J855L917j382
$$ plain form
5701 -3688 -4135 -7166 -10014 -9822 -4219 -5142 -9227 -11387 -9259 -5111 104 13 -2330 -6663 -7987 -6533
5685 -6533 -4935 -3888 -5355 -6421 -4037 -3341 -6878 -7837 -6871 -6737 -6365 -6032 -2839 -786 -4541 -5077 -3961
5668 -3961 -4254 -6480 -6034 -3097 -5738 -8893 -12234 -3946 2984 1750 -2863 -2318 3013 -1094 -6942 -1733
5652 -1733 1229 -2598 -5977 -8244 -5772 -9249 -7666 -4812 -3992 -27 2546 -226 -6441 -12467 -9947
5637 -9947 -8371 -7906 -10449 -15043 -14549 -10405 -11243 -11765 -9015 -6993 -9111 -9410 -7076 -5866 -3860 183
5621 183 -1569 -4744 -5202 572 182 -2065 -4089 -6869 -7580 -6365 -6053 -2591 3061 2692 -2067 -6391
5605 -6391 -9622 -8739 -8257 -8067 -3363 -5426 -8546 -12864 -7760 -8696 -7199 -6448 -6218 -13442 -16923 -14226
5589 -14226 -8511 -4332 -2038 -4899 -4449 -2960 -544 -1955 -1784 -4001 1126 2209 -2587 -3981 -5085
$$ packed form
5701c688m47l031k848J92N603r23m085k160K128M148N215r1k343m333j324J454
5685f533J598J047j467j066K384O96l537r59R66J34L72L33L193K053l755n36J116
5668c961k93k226M46K937k641l155l341Q288O930j234m613N45N331m107n848N209
5652a733K962l827l379k267K472l477J583K854Q20L965K573k772o215o026K520
5637i947J576M65k543m594M94M144q38n22K750K022k118k99K334J210K006M043
5621A83j752l175m58N774l90k247k024k780p11J215L12L462N652l69m759m324
5605f391l231Q83M82J90M704k063l120m318N104r36J497P51K30p224l481K697
5589a4226N715M179K294k861M50J489K416j411J71k217N127J083m796j394j104
$$ plain form
5574 -5085 -4733 -4415 -3936 -2888 -5847 -8278 -7652 -4825 -6795 -6039 -4442 -9914 -14044 -14333 -10892 -7026
5558 -7026 -7617 -13673 -7541 -6757 -10353 -10098 -3455 -2497 -5321 -4078 -50 -1708 -2510 -824 -3950 -1990
5542 -1990 -987 2095 3558 7151 11169 4526 -2371 -5634 1965 831 -4149 -3504 -1933 -3294 -3562
5527 -3562 -518 -125 -2501 -7114 -6078 -5495 -3505 -6590 -9515 -9458 -3980 -3351 -1629 756 -1747 -2800
5511 -2800 -1022 -3698 -4126 -1401 -209 781 -3408 -11113 -12748 -8676 -3688 -2347 2528 4178 3240 961
5495 961 -2182 -8072 -9084 -4833 -1217 331 -722 -2546 -1586 258 -2279 -324 4242 3146 -3088
5480 -3088 -8787 -7694 -7646 -4904 -1384 -2765 -2209 -658 -4853 -10519 -12598 -14428 -8275 -1482 -119 -1925
5464 -1925 -5714 -5818 -5605 -4210 -6919 -3448 2849 4114 1511 -5514 -1570 -3197 -1600 -660 4024 3649
$$ packed form
5574e085L52L18M79J048k959k431O26K827j970P56J597n472m130k89L441L866
5558g026n91o056O132P84l596K55O643R58k824J243M028j658q02J686l126J960
5542a990J003L082J463L593M018o643o897l263P599j134m980O45J571j361k68
5527c562L044L93k376m613J036N83J990l085k925N7N478O29J722K385k503j053
5511b800J778k676m28K725J192R90m189p705j635M072M988J341M875J650r38k279
5495I61l143n890j012M251L616J548j053j824R60J844k537J955M566j096o234
5480c088n699J093M8K742L520j381N56J551m195n666k079j830O153O793J363j806
5464a925l789j04K13J395k709L471O297J265k603p025L944j627J597R40M684l75
$$ plain form
5448 3649 3593 -1888 -4707 -3991 -5804 -7297 -5268 -2273 719 1902 -127 1129 2290 2235 2351 3281 2290
5431 2290 -4116 -1995 -748 1241 -612 -1473 -4203 -2587 -2264 -5035 -4528 1485 -732 -78 -5080 -1965
5415 -1965 5005 5372 3983 2827 2393 2173 -2109 -7541 -6592 -2382 -3759 -4767 -6223 -2717 -2204 -972
5399 -972 -4455 -1709 3066 165 -2554 -5735 688 -1006 -5804 -7758 -7052 -1739 326 436 -1611 -2412
5383 -2412 954 1489 -2851 -2653 -176 -3456 -2284 -3272 -4810 -3860 -2145 -1528 -2998 -5608 -3944 -5978
5367 -5978 -7480 -3905 -9146 -13310 -13828 -13300 -8787 -4907 -3488 -4774 -2295 -1588 -8795 -8192 -8576 -10264
5351 -10264 -7684 -2648 -847 -5865 -11619 -10271 433 3620 2121 -573 -5393 -7692 -1200 -1633 -10002
5336 -10002 -13670 -8906 -4028 89 1405 -1140 -3628 -3627 -6637 297 5699 2677 -1097 -7908 -8389 -8602
$$ packed form
5448C649n6n481k819P16j813j493K029K995K992J183k029J256J161n5J16R30r91
5431B290o406K121J247J989j853q61k730J616L23k771N07O013k217O54n002L115
5415a965O970L67j389j156m34k20m282n432R49M210j377j008j456L506N13J232
5399i72l483K746M775k901k719l181O423j694m798j954P06N313K065J10k047q01
5383b412L366N35m340J98K477l280J172r88j538R50J715O17j470k610J664k034
5367e978j502L575n241m164n18N28M513L880J419j286K479P07p207O03l84j688
5351a0264K580N036J801n018n754J348J0704L187j499k694m820k299O492m33q369
5336a0002l668M764M878M117J316k545k488Jl010O934N402l022l774o811m81k13
$$ plain form
5320 -8602 -9591 -9826 -10702 -13329 -12502 -9119 -3136 1774 -1849 740 5411 8134 5479 1441 -1894 -4783
5304 -4783 -5596 -6135 -6981 -4763 -5073 -9938 -9997 -9555 -11310 -5332 946 1348 -2982 -5721 -4404 -4869 -1377
5287 -1377 -1018 -7216 -9952 -8303 -8757 -8878 -11042 -9420 -4241 -3200 -9519 -8906 -5254 -3720 -2165 -1672
5271 -1672 -6588 -6092 -1845 4705 7252 3723 -2446 -5095 -174 -1530 -2471 -6529 -11446 -14876 -12499
5256 -12499 -12681 -13263 -8719 -4513 1712 6557 7733 8591 4484 2479 2683 4228 2703 482 -1397 -3586
5240 -3586 -5435 -6509 -3717 487 3415 4711 692 -1431 305 2380 -619 -5508 -9294 -4391 -3241
5225 -3241 -801 -3210 -7112 -6492 -2023 4301 167 -2395 1401 32 399 5020 5097 5072 5327 5624 -800
5208 -800 -795 -963 -2629 -2415 1381 63 1541 -51 405 -2980 -7134 -3721 -5467 -5901 -5021 -8410 -8338 -9596
$$ packed form
5320h602r89k35q76k627Q27L383N983M910l623K589M671K723k655m038l335k889
5304d783q13n39q46K218l10m865n9M42j755N978O278M02m330k739J317m65L492
5287a377L59o198k736J649m54j21k164J622N179J041o319O13L652J534J555M93
5271a672m916M96M247O550K547l529o169k649M921j356r41m058m917l430K377
5256a2499j82n82M544M206O225M845J176Q58m107k005K04J545j525k221j879k189
5240c586j849j074K792M204K928J296m019k123J736K075k999m889l786M903J150
5225c241K440k409l902O20M469O324m134k562L796j369L67M621P7k5K55K97o424
5208h00Nj68j666K14L796j318J478j592M56l385m154L413j746m34Q80l389P2j258
$$ plain form
5190 -9596 -6998 -1775 1835 -502 -5143 -7136 -4993 -2482 -4128 -2106 -2867 -3067 -1860 -5523 -7029
5175 -7029 -6352 -6113 -9607 -12922 -12293 -11800 -11117 -5616 -3119 5575 784 -4970 -4990 -4379 -6587 -5811 -3170
5158 -3170 -2452 1604 -1710 -2838 -2760 654 5273 8163 8567 10385 9197 8069 9884 10488 9928 4737
5142 4737 1154 2748 -3217 -6686 -3108 2818 3259 -324 1098 3491 -3979 -6464 -4563 -8726 -11468
5127 -11468 -7478 -8392 -17242 -14376 -10699 -8108 -8059 -10882 -10869 -7096 -4567 -3155 -5841 -5227 -7809 -7284
5111 -7284 -3057 -311 -2229 -6117 -8740 -8409 -8416 -8539 -7773 -4045 -894 -2200 1029 1330 -1338 -1683 -3609
5094 -3609 -1696 -3059 -7408 -13378 -13439 -13684 -14138 -11568 -10988 -14511 -12831 -3820 1077 199 -2617 -558
5078 -558 3234 467 -3256 -3378 1526 1332 412 -2298 -1974 -1122 582 -2269 -281 991 -3675 -4159 -5208
$$ packed form
5190i596K598N223L610k337m641j993K143K511j646K022p61k00J207l663j506
5175g029O77K39l494l315O29M93O83N501K497Q694m791n754k0O11k208P76K641
5158c170P18M056l314j128P8L414M619K890M04J818j188j128J815O04n60n191
5142D737l583J594n965l469L578N926M41l583J422K393p470k485J901m163k742
5127a1468L990r14q850K866L677K591M9k823J3L773K529J412k686O14k582N25
5111g284M227K746j918l888k623L31pj23P66L728L151j306L229L01k668l45j926
5094c609J913j363m349n970o1k45m54K570N80l523J680R011M897q78k816K059
5078e58L792k767l723j22M904j94r20k710L24Q52J704k851J988J272m666m84j049
$$ plain form
5061 -5208 -7985 -8517 -5046 -884 -1948 -940 -2420 -5952 -4594 383 837 -6816 -12012 -9904 -3421
5046 -3421 2229 5638 9302 13801 14080 5220 -1364 -1374 -2869 -4233 -4602 276 2075 -4448 -5943 -7667
5030 -7667 -7712 -7117 -4960 -5719 -4480 -3460 -5536 -5347 -831 310 -238 99 -1024 -1936 -1656 -2026 -4447
5013 -4447 -3216 -146 4290 4413 818 1612 -3921 -6104 -4879 -8345 -9099 -8203 -9952 -13033 -11135 -8273
4997 -8273 -1355 -2839 -6133 -5348 -9015 -10193 -9675 -11095 -8441 -13443 -10670 -6720 446 -1831 -5890
4982 -5890 -8869 -5389 -7310 -5029 -4185 -5961 -7531 -6961 -5525 -3377 -2789 -5174 -5062 -2608 -4036 -2649
4966 -2649 -865 2258 4896 4529 4226 8921 12224 10424 10537 6382 731 -1651 -4895 -3573 -2940 -1999
4950 -1999 -170 1254 1188 1277 -3710 -1855 -4315 -3550 2911 4572 -1422 -891 775 289 -320 -3194 -3502
$$ packed form
5061e208k777n32L471M162j064J008j480l532J358M977M54p653n196K108O483
5046c421N650L409L664M499K79q860o584j0j495j364l69M878J799o523j495j724
5030g667m5N95K157p59J239J020k076J89M516J141n48L37j123r12K80l70k421
5013d447J231L070M436J23l595P94n533k183J225l466p54Q96j749l081J898K862
4997h273O918j484l294P85l667j178N18j420K654n002K773L950P166k277m059
4982e890k979L480j921K281Q44j776j570N70J436K148N88k385J12K454j428J387
4966b649J784L123K638l67l03M695L303j800J13m155n651k382l244J322O33R41
4950a999J829J424o6Q9m987J855k460P65O461J661n994N31J666m86o09k874l08
$$ plain form
4933 -3502 -1586 -695 171 -2539 -4440 -4413 -6968 -8468 -849 8373 3817 -1097 -923 1211 2901 483
4917 483 -7082 -10904 -14494 -9091 -5850 -2815 -3268 -678 3887 3154 -4158 -3170 -2024 -2270 -1971 -760
4901 -760 -2783 -7358 -10719 -5849 -3418 -6637 -5663 -154 -4238 -9236 -7791 -8390 -7897 -5212 -1324 -2128
4885 -2128 -5053 -2025 1157 -857 323 2435 675 -6730 -9190 -4021 -2270 -1808 -5589 -6837 -4569
4870 -4569 -4280 -4075 -4167 -3762 -6746 -11704 -8465 -5119 -2519 2216 439 -1277 -4601 -7927 -8371 -5791
4854 -5791 -2735 -5820 -7029 -5875 -4097 -3697 -2184 -3405 -383 710 -3039 -8456 -5745 -4035 -2528
4839 -2528 -296 460 624 -3233 -4772 -1561 360 -545 1566 -192 -5156 -5760 -5148 -2286 2067 -678
4823 -678 -37 -197 -1092 1053 260 1167 466 -2222 -1626 -3694 -1261 2294 -113 -1240 100 1128 -2142
$$ packed form
4933c502J916Q91Q66k710j901K7k555j500P619R222m556m914J74K134J690k418
4917D83p565l822l590N403L241L035m53K590M565p33p312R88J146k46K99J211
4901g60k023m575l361M870K431l219R74N509m084m998J445n99M93K685L888q04
4885b128k925L028L182k014J180K112j760p405k460N169J751M62l781j248K268
4870d569K89K05r2M05k984m958L239L346K600M735j777j716l324l326m44K580
4854e791L056l085j209J154J778M00J513j221L022J093l749n417K711J710J507
4839b528K232P56J64l857j539L211J921r05K111j758m964o04O12K862M353k745
4823f78O41j60q95K145p93R07p01k688N96k068K433L555k407j127J340J028l270
$$ plain form
4806 -2142 -2326 -3388 -1746 1911 -1622 -5552 -3226 -3808 -5493 -5521 -4330 -6767 -6296 -6230 -7474 -6179 -556
4789 -556 1402 1470 781 1171 3457 3454 -331 1992 456 -3455 -2293 -659 -2668 -8215 -8648 -4207 -8508
4772 -8508 -11409 -3465 1242 1171 -5951 -10767 -7715 -972 791 1633 -5143 -1387 -1986 -5395 -4157 -2326
4756 -2326 -2970 -5087 -7174 -4202 -1255 -2815 -5565 -2941 -2778 842 4540 2574 -1558 -2858 -3062 -4968
4740 -4968 -6190 -7567 -6994 -7453 -7385 -6270 -3627 -6590 -9111 -12302 -11916 -9130 -8414 -6384 -2406 -3996
4724 -3996 -3764 -856 907 1576 -206 5094 6590 1524 -1542 -5810 -4500 -4355 -3569 -1228 -1764 1748
4708 1748 5587 4862 1973 2006 1946 5454 7871 3544 -6322 -8014 -3588 -3796 -3370 -3873 -4785 -4478 -9406
4691 -9406 -12069 -10180 -7674 -4989 -7288 -5332 -3734 -1519 -1886 -3231 -5459 -5513 -4728 -4451 -2626 -4745
$$ packed form
4806b142j84j062J642L657l533l930K326n82j685k8J191k437M71O6j244J295N623
4789e56J958O8o89L90K286ll785K323j536l911J162J634k009n547m33M441m301
4772h508k901P944M707p1p122m816L052O743J763Q42o776L756n99l409J238J831
4756b326o44k117k087K972K947j560k750K624J63L620L698j966m132j300k04j906
4740d968j222j377N73m59O8J115K643k963k521l191L86K786P16K030L978j590
4724c996K32K908J763O69j782N300J496n066l066m268J310J45P86K341n36L512
4708A748L839p25k889L3o0L508K417m327r866j692M426k08M26n03r12L07m928
4691i406k663J889K506K685k299J956J598K215l67j345k228n4P85K77J825k119
$$ plain form
4675 -4745 -10313 -14133 -13036 -5784 -2828 -3102 -2688 -4589 -4818 -5304 -7037 -4695 -4445 -2342 2619 -2856
4659 -2856 -8339 -6286 -6053 -6877 -5897 -6705 -4018 608 4316 1620 1603 2307 -5358 -2504 -2104 -4149 -5091
4642 -5091 -4625 -5928 -6060 -3065 -5721 -2625 -618 16 -1514 -2699 -2771 -3125 -4882 -5419 -7741 -10302 -5282
4625 -5282 -4126 -7316 -4860 -4381 -4466 -6582 -3469 1912 884 6223 5187 2448 2582 3936 2060 -2895
4609 -2895 -5287 -7249 -6320 -9279 -11185 -16358 -16253 -8766 -6141 -5169 -9258 -11832 -11683 -5918 -7474 -8189
4593 -8189 -5609 -9433 -14356 -8647 -4259 1157 4064 5586 2450 3130 2547 -825 2898 7674 9446
4578 9446 8690 3760 -2623 -5953 -584 -17 -3159 -6087 -6534 -3647 -1159 -4551 -7462 -8084 -6039 -3807
4562 -3807 -3534 -5389 -2446 1555 3380 -3448 -8511 -8417 -5002 -1898 -149 3753 5194 3210 -2662 -7183
$$ packed form
4675d745n568l820J097P252K956k74M14j901k29m86j733K342K50K103M961n475
4659b856n483K053K33q24R80q08K687M626L708k696j7P04p665K854M00k045r42
4642e091M66j303j32K995k656L096K007O34j530j185p2l54j757n37k322k561N020
4625e282J156l190K456M79q5k116L113N381j028N339j036k739J34J354j876m955
4609b895k392j962R29k959j906n173J05P487K625R72m089k574J49N765j556p15
4593h189K580l824m923N709M388N416K907J522l136O80n83l372L723M776J772
4578I446p56m930o383l330N369N67l142k928m47K887K488l392k911o22K045K232
4562c807K73j855K943M001J825o828n063R4L415L104J749L902J441j984n872m521
$$ plain form
4546 -7183 -8285 -5089 -5792 -5155 -4845 -5711 -6067 -6323 -6536 -5699 -3060 258 -1768 -6123 -5629 -5870 -2797
4529 -2797 -2581 -1890 -3950 -3057 -3152 348 201 -1374 -2615 -4659 -8935 -13127 -11925 -14057 -11558 -8459
4513 -8459 -8153 -6006 -1327 333 7026 7001 1730 1754 3505 2591 -2954 -8542 -7897 -3752 -1735 -5118 -5372
4496 -5372 -4097 -8356 -10819 -8836 -10799 -10419 -11145 -9364 -5915 -6755 -2854 -935 1329 -3888 -6035 -9800
4480 -9800 -11052 -9868 -12645 -9952 -1015 2427 6305 10390 8114 493 -663 2921 2637 -1192 -1512
4465 -1512 -543 -971 -1384 -4222 -10178 -11417 -8557 -6032 -3174 -2012 4102 13902 12648 7337 2554 -1465
4449 -1465 -8089 -10763 -8442 -1172 2597 3351 -131 -1993 -9199 -8389 -7156 -8297 -5706 -2428 5074
4434 5074 4275 -62 2191 1077 -4489 -2212 -785 -2268 1358 440 -5226 -6367 1871 924 1233 -63
$$ packed form
4546g183j102L196p03O37L10q66l56k56k13Q37K639L318k026m355M94k41L073
4529b797K16O91k060Q93r5L500j47j575j241k044m276m192J202k132K499L099
4513h459L06K147M679J660O693k5n271K4J751r14n545n588O45M145K017l383k54
4496e372J275m259k463J983j963L80p26J781L449q40L901J919K264n217k147l765
4480i800j252J184k777K693Q937L442L878M085k276p621j156L584k84l829l20
4465a512R69m28m13k838n956j239K860K525K858J162O114R800j254n311m783m019
4449a465o624k674K321P270L769P54l482j862p206Q10J233j141K591L278P502
4434E074p99m337K253j114n566K277J427j483L626r18n666j141Q238r47L09j296
$$ plain form
4418 -63 -712 1389 -622 804 1517 531 -560 -2025 -4268 -4767 -4499 -3857 1776 5393 5711 3317 3777
4401 3777 1699 -2363 -5416 -8164 -10221 -9504 -4138 2164 9295 13835 16349 15205 14757 14387 9627 6823
4385 6823 4402 2637 5153 2360 -4549 -7400 -9495 -8797 -6563 -5432 -5473 -10787 -3083 3097 4425 5586
4369 5586 5711 1588 -699 4617 12824 11261 2059 -4074 1485 5992 4335 -427 -4659 -3429 -526
4354 -526 -3223 -2749 -2755 -6827 -9161 -6638 -3282 -873 -2946 -3295 -3228 -4491 -3593 -4997 -3449 -5936 -3020
4337 -3020 2269 4346 -13 -1026 -449 -7133 -8708 -4731 -3716 -7460 -7929 -1913 2470 -1759 -9663
4322 -9663 -7807 -1753 5922 6956 745 -2557 -2508 4607 8318 8899 3767 -3458 -5845 -3159 -1672 -5890
4306 -5890 -8723 -8742 -6775 -8085 -7331 -10225 -13802 -9275 -9455 -10081 -8712 -7409 -6519 -2401 -2991 -3494 -2401
$$ packed form
4418f3o49K101k011J426P13r86j091j465k243m99K68O42N633L617L18k394M60
4401C777k078m062l053k748k057P17N366O302P131M540K514j144m48l70m760k804
4385F823k421j765K516k793o909k851k095O98K234J131m1n314P704O180J328J161
4369E586J25m123k287N316Q207j563r202o133N559M507j657m762m232J230K903
4354e26k697M74om072k334K523L356K409k073l49O7j263Q98j404J548k487K916
4337c020N289K077m359j013N77o684j575L977J015l744m69O016M383m229p904
4322i663J856O054P675J034o211l302M9P115L711N81n132p225k387K686J487m218
4306e890k833j9J967j310P54k894l577M527j80o26J369J303Q90M118n90n03J093
$$ plain form
4289 -2401 -4097 -6084 -4998 -3689 -4427 -14370 -13772 -7279 -3179 -4064 -3896 -4571 -7526 -10955 -10163 -9309 -9647
4272 -9647 -6214 -3223 -3869 3081 3859 -248 69 -858 -4514 -5740 -1221 -1017 -4227 -5419 -4948 -1740
4256 -1740 -3075 843 2561 -686 -924 -1975 -4032 -5111 -5087 -2690 -5350 -8749 -6796 -7123 -6710 -8192
4240 -8192 -5369 -4829 -2843 -777 -2423 -4065 -1560 -1874 -3155 -7145 -9214 -6689 -2907 -133 8350
4225 8350 10781 8026 5980 1859 1410 -661 1043 -813 -3007 -4060 -3101 -1637 -718 157 -174 -8419
4209 -8419 -8855 -3428 -689 -330 468 -1238 808 1611 -501 -5216 -6157 -4075 -3272 876 -1182 -6416
4193 -6416 -1501 -622 -988 712 48 791 1981 5545 6347 3275 -1478 -1514 -1692 681 -1258 -1523 3697
4176 3697 785 -573 -2753 -778 3295 183 2191 4879 4985 196 -4738 -243 554 -1772 -4014
$$ packed form
4289b401j696j987J086J309p38r943N98O493M100q85J68o75k955l429P92Q54l38
4272i647L433K991o46O950P78m107L17r27l656j226M519K04l210j192M71L208
4256a740j335L918J718l247k38j051k057j079K4K397k660l399J953l27M13j482
4240h192K823N40J986K066j646j642K505l14j281l990k069K525L782K774Q483
4225H350K431k755k046m121m49k071J704j856k194j053R59J464R19Q75l31q245
4209h419m36N427K739L59P98j706K046Q03k112m715r41K082Q03M148k058n234
4193f416M915Q79l66J700o64P43J190L564Q02l072m753l6j78K373j939k65N220
4176C697k912j358k180J975M073l112K008K688J06m789m934M495P97k326k242
$$ plain form
4161 -4014 -1758 -462 36 5188 4696 3151 113 -1928 -3583 -2385 -1359 1396 -1936 -5657 -9335
4146 -9335 -10873 -8390 -5500 -2206 4685 5198 -1425 -1418 1418 -2396 -819 1454 1795 1246 3794 3792 3926
4129 3926 4729 5559 1209 -488 -1289 788 -1045 1573 2102 646 -363 -2441 -2547 -4565 -8613 -7358
4113 -7358 -6007 -5110 -2860 -316 2450 -376 -1873 -1760 1210 682 -1804 -6960 -8004 -8571 -12989 -11477
4097 -11477 -6144 -4733 440 3021 -456 -3010 -2794 -639 -1850 -1661 -3549 763 7212 3061 -1893
4082 -1893 -1141 3162 930 238 -106 175 -1898 -2300 -2745 -5306 -1902 -3482 -4321 -2738 -462 -17 1115
4065 1115 1529 4875 5416 976 -19 -2756 -6254 -7659 -5391 1579 3379 -1254 -791 2591 2798 726
4049 726 -3085 -3487 -4889 -3360 -519 -452 -545 4454 4724 1325 -4897 -4211 -1796 -647 610 -245 240
$$ packed form
4161d014K256J296M98N152m92j545l038k041j655J198J026K755l332l721l678
4146i335j538K483K890L294O891N13o623PK836l814J577K273L41n49K548kJ34
4129C926Q03Q30m350j697q01K077j833K618N29j456j009k078j06k018m048J255
4113g358J351Q97K250K544K766k826j497J13K970n28k486n156j044n67m418J512
4097a1477N333J411N173K581l477k554K16K155j211J89j888M312O449m151m954
4082a893P52M303k232o92l44K81k073m02m45k561L404j580q39J583K276M45J132
4065A115M14L346N41m440r95k737l498j405K268O970J800m633M63L382K07k072
4049G26l811m02j402J529K841O7r3M999K70l399o222O86K415J149J257q55M85
$$ plain form
4032 240 -1546 -3199 -2097 -1501 -870 -1336 -2586 -2652 -1792 -3269 -5121 -7179 -4000 1319 -1089 -1057 -5097
4015 -5097 -5224 -626 -457 -2079 -2786 -5814 -6047 -1288 -2304 -2903 -3830 -1957 1555 77 -367 -2630 592
3998 592 301 380 4182 1152 -5785 -8582 -5917 -13099 -19788 -14885 -10468 -10002 -12564 -7362 -3962 -5652
3982 -5652 -4056 -9400 -12571 -10590 -7967 -8267 -10015 -10367 -7449 -3678 -2763 -8242 -10386 -2463 3184 -238
3966 -238 1006 -3080 -3218 213 3134 -108 -3746 -4832 -4740 -6082 -7155 -6833 -4863 558 -2268 -2513
3950 -2513 -490 -2524 -3510 -89 -1583 -1789 -1164 1530 4489 3244 -197 1309 -1793 -2369 -39 -123
3934 -123 -2654 -3300 1304 -3904 -1488 6116 13130 12275 7091 2878 -3836 -6169 -3122 -1674 3891 3333
3918 3333 1961 -1658 -192 -1137 2069 -608 -5333 -3491 -4145 -3583 -1467 -1046 -1412 -5600 -7703 -9731
$$ packed form
4032B40j786j653J102N96O31m66j250o6Q60j477j852k058L179N319k408L2m040
4015e097j27M598J69j622p07l028k33M759j016n99r27J873L512j478m44k263L222
3998E92k91P9L802l030o937k797K665p182o689M903M417M66k562N202L400j690
3982e652J596n344l171J981K623l00j748l52K918L771R15n479k144P923N647l422
3966b38J244m086j38L431K921l242l638j086R2j342j073L22J970N421k826k45
3950b513K023k034r86L421j494k06O25K694K959j245l441J506l102n76K330q4
3934a23k531o46M604n208K416P604P014q55n184m213o714k333L047J448N565n58
3918C333j372l619J466r45L206k677m725J842o54N62K116M21l66m188k103k028
$$ plain form
3902 -9731 -5118 -537 3482 3580 2571 744 -42 365 6187 7398 6857 3672 4999 1786 -3371 -6436
3886 -6436 -4074 -3074 -4292 -2486 528 -307 -4465 -3787 754 -1051 -2795 -5559 -5374 -3608 243 -1679
3870 -1679 -2303 -4671 -3004 -3317 -8487 -7583 2571 4490 2510 2655 -64 768 979 -750 2319 4174
3854 4174 1468 -907 282 -2037 426 1870 -1978 -2802 -2062 -2495 -2730 451 -1807 -5608 -5544 -5855 -11994
3837 -11994 -12796 -3090 4536 2723 -1970 -4120 -2910 625 1261 2805 954 2973 2995 1574 -2804 -3427
3821 -3427 1587 4446 6815 7070 2776 -3311 -4844 570 3869 3300 -1386 1997 3905 -472 -4522
3806 -4522 -1316 543 5972 6093 601 933 2645 -14 -1541 -2894 -6244 -5114 -6775 -3469 5932
3791 5932 10136 6645 4512 5413 4583 1536 608 2982 -790 -6095 -1607 2862 2617 1966 3627 6424
$$ packed form
3902i731M613M581M019R8j009j827p86M07N822J211n41l185J327l213n157l065
3886f436K362J000j218J806L014q35m158O78M541j805j744k764J85J766L851j922
3870a679o24k368J667l13n170R04J0154J919j980J45k719Q32K11j729L069J855
3854D174k706k375J189k319K463J444l848q24P40m33k35L181k258l801O4l11o139
3837a1994q02R706P626j813m693k150J210L535O36J544j851K019K2j421m378o23
3821c427N014K859K369K55m294o087j533N414L299n69m686L383J908m377m050
3806d522L206J859N429J21n492L32J712k659j527j353l350J130j661L306R401
3791E932M204l491k133R01q30l047r28K374l772n305M488M469k45o51J661K797
$$ plain form
3775 6424 8289 6287 4474 3932 3006 3283 1965 -2768 -6259 -4322 -3409 -5076 565 1294 -274 1273
3759 1273 -648 -4026 -1693 -1608 -317 -1205 -2929 -1455 1104 3807 7494 8088 4798 470 -2597 -5500
3743 -5500 -4083 -8470 -7532 -5688 -2114 696 -322 2397 1604 3814 12316 14467 7928 2904 -2867
3728 -2867 -896 2899 2267 -778 2044 719 -1311 -4620 -4058 -457 1173 4727 2438 2444 3146 -873
3712 -873 -9878 -12810 -6973 -2117 4711 2525 -1711 -2650 510 5496 5002 1947 1289 -3875 -7073 -10127
3696 -10127 -6289 -2680 -1750 -2052 -4172 -5359 -6009 -5786 -5978 -1764 1491 1019 -3780 -3201 143 893 62
3679 62 -604 1523 -798 -3711 -1038 -1008 -2605 -3629 -7736 -5812 613 1077 -1239 -903 -3155 -2385 2573
3662 2573 1958 -618 -2491 834 -1594 -4072 -3719 -1789 -1659 -486 -2753 -5747 -8155 -8239 -8131 -9666
$$ packed form
3775F424J865k002j813n42r26K77j318m733l491J937R13j667N641P29j568J547
3759A273j921l378K333Q5J291q88j724J474K559K703L687N94l290m328l067k903
3743e500J417m387R38J844L574K810j018K719p93K210Q502K151o539n024n771
3728b867J971L795o32l045K822j325k030l309N62L601J630L554k289OP02m019
3712h73r005k932N837M856O828k186m236r39L160M986m94l055o58n164l198l054
3696a0127L838L609R30l02k120j187o50K23j92M214L255m72m799N79L344P50q31
3679F2o66K127k321k913K673L0j597j024m107J924O425M64k316L36k252P70M958
3662B573o15k576j873L325k428k478L53J930J30J173k267k994k408q4J08j535
$$ plain form
3646 -9666 -7492 -2269 3598 1135 -3716 -1681 -94 -2281 -2165 -2858 -6946 -4615 -1327 -3536 -2777 -839
3630 -839 1529 3177 5001 7937 9676 9314 4989 -322 -4423 -3542 -1213 -1115 -1592 -1766 -1996 -1246 -1558
3613 -1558 -3148 -4822 -10949 -10521 -7368 -4585 -3552 -3706 -7179 -5816 -2155 161 3022 395 -766
3598 -766 -2540 -4217 -2270 -3214 -3516 -6736 -6715 -5827 -5613 -2154 -1102 -3047 -7451 -459 3580 -94 6283
3581 6283 8324 8403 6700 6210 7463 7010 5107 2840 1674 -480 -1012 -1582 -2735 -2977 -935 2158 3969
3564 3969 3656 984 29 4938 1739 -1006 -2466 579 -391 -2496 844 3695 1469 -2147 -1878 2625
3548 2625 2332 3069 5561 6901 7311 5367 6206 6272 -197 -2896 -1165 -2983 -2814 -381 4379 4874 2817
3531 2817 7102 9788 12753 7388 6385 4632 1715 2682 4708 4721 5235 5115 468 -3408 -285 -635
$$ packed form
3646i666K174N223N867k463m851K035J587k187J16o93m088K331L288k209P59J938
3630h39K368J648J824K936J739l62m325n311m101Q81K329R8m77j74k30P50l12
3613a558j590j674o127M28L153K783J033j54l473J363L661K316K861k627j161
3598g66j774j677J947r44l02l220K1Q88K14L459J052j945m404O992M039l674O377
3581F283K041P9j703m90J253m53j903k267j166k154n32n70j153k42K042L093J811
3564C969l13k672r55M909l199k745j460L045r70k105L340K851k226l616K69M503
3548B625k93P37K492J340M10j944Q39O6o469k699J731j818J69K433M760M95k057
3531B817M285K686K965n365j003j753k917R67K026J3N14j20m647l876L123l50
$$ [...]
##END NTUPLES=NMR SPECTRUM
##END=
