##TITLE=Analysis number 313188
Compound Code cc 26804
Book Reference 382/108
Project Code adrs
Chemist Name simons
##JCAMPDX= 6.0         $$ Bruker NMR JCAMP-DX V2.0
##DATA TYPE= NMR SPECTRUM
##DATA CLASS= NTUPLES
##ORIGIN= Bruker BioSpin GmbH
##OWNER= NMR
$$ XWIN-NMR		Version 3.5
$$ Thu Aug 25 14:49:18 2005 GMT Daylight Time (UT+1h)  MAYBRIDGE\NMR@NMR_250MHZ
##.OBSERVE FREQUENCY= 250.131544655141
##.OBSERVE NUCLEUS= ^1H
##.ACQUISITION MODE= SIMULTANEOUS (DQD)
##.ACQUISITION SCHEME= undefined
##.AVERAGES= 16
##.DIGITISER RES= 18
##SPECTROMETER/DATA SYSTEM= dpx250
##.PULSE SEQUENCE= zg30
##.SOLVENT NAME= CDCl3
##.SHIFT REFERENCE= (INTERNAL, CDCl3, 0, 16.522)
##AUDIT TRAIL= $$ (NUMBER, WHEN, WHO, WHERE, WHAT)
$$ ##TITLE= Audit trail, XWIN-NMR		Version 3.5
$$ ##JCAMPDX= 5.01
$$ ##ORIGIN= Bruker BioSpin GmbH
$$ ##OWNER= NMR
$$ C:\u/data/dgb/nmr/ADRS/8660/pdata/1/auditp.txt
$$ ##AUDIT TRAIL=  $$ (NUMBER, WHEN, WHO, WHERE, WHAT)
(   1,<2005-08-25 14:48:44.83 +100>,<MAYBRIDGE\NMR>,<NMR_250MHZ>,
      <created by zg, POWCHK disabled, PULCHK disabled
       configuration hash MD5:
       62 19 C7 07 E1 42 D1 B7 37 6C 3D D0 77 39 F9 E6
       data hash MD5: 64K
       98 DD 04 75 21 54 6E 80 0E 82 A4 E8 FD DB 62 95>)
(   2,<2005-08-25 14:48:59.28 +100>,<MAYBRIDGE\NMR>,<NMR_250MHZ>,
      <Start of raw data processing
       ef LB = 0.3 FT_mod = 6 PKNL = 1 SI = 32K 
       data hash MD5: 32K
       2E 81 80 95 B0 D8 8E 0F 7C 66 2C 9C B6 4A 3B BE>)
(   3,<2005-08-25 14:49:04.08 +100>,<MAYBRIDGE\NMR>,<NMR_250MHZ>,
      <apk 
       data hash MD5: 32K
       6C 33 B2 E2 3E 97 09 4F 51 0D B9 07 FE CE 38 97>)
(   4,<2005-08-25 14:49:05.78 +100>,<MAYBRIDGE\NMR>,<NMR_250MHZ>,
      <abs ABSG = 5 
       data hash MD5: 32K
       4A B2 4E DD D1 DB 4F 91 34 C8 F9 C4 40 BB 98 5C>)
$$ ##END=
$$ 
$$ hash MD5
$$ 19 42 E0 A2 E5 4E FF F9 C3 26 D2 16 55 9B 74 55
##$RELAX= 
##$RELAX= 
##$RELAX= 
##$RELAX= 
##$RELAX= 
##$RELAX= 
##$RELAX= 
$$ Bruker specific parameters
$$ --------------------------
##$DU= <C:\u>
##$EXPNO= 8660
##$NAME= <ADRS>
##$PROCNO= 1
##$TYPE= <nmr>
##$USER= <dgb>
##$AMP= (0..31)
100 100 100 100 100 100 100 100 100 100 100 100 100 100 100 100 100 100 
100 100 100 100 100 100 100 100 100 100 100 100 100 100 
##$AQSEQ= 0
##$AQ_mod= 3
##$AUNM= <au_zg>
##$AUTOPOS= <25 >
##$BF1= 250.13
##$BF2= 250.13
##$BF3= 250.13
##$BF4= 250.13
##$BF5= 500.13
##$BF6= 500.13
##$BF7= 500.13
##$BF8= 500.13
##$BYTORDA= 1
##$CFDGTYP= 0
##$CFRGTYP= 5
##$CHEMSTR= <none>
##$CNST= (0..31)
1 1 145 1 1 1 1 1 1 1 1 1 1 1 1 1 1 1 1 1 1 1 1 1 1 1 1 1 1 1 1 1 
##$CPDPRG= <>
##$CPDPRG1= <>
##$CPDPRG2= <>
##$CPDPRG3= <>
##$CPDPRG4= <mlev>
##$CPDPRG5= <mlev>
##$CPDPRG6= <mlev>
##$CPDPRG7= <mlev>
##$CPDPRG8= <mlev>
##$CPDPRGB= <>
##$CPDPRGT= <>
##$D= (0..31)
0 1 0 0 0 0 0 0 0 0.06 0 0 0 0 0 0 0.0002 0 0 0 0 0 0 0 0 0 0 0 0 0 0 
0 
##$DATE= 1124977723
##$DBL= (0..7)
120 120 120 120 120 120 120 120 
##$DBP= (0..7)
150 150 150 150 150 150 150 150 
##$DBP07= 0
##$DBPNAM0= <>
##$DBPNAM1= <>
$$ [...]
##$SUBNAM7= <"">
##$SUBNAM8= <"">
##$SUBNAM9= <"">
##$SW= 20.6930455092707
##$SWIBOX= (0..15)
0 0 3 0 0 0 0 0 0 0 0 0 0 0 0 0 
##$SW_h= 5175.983436853
##$TD= 65536
##$TD0= 1
##$TE= 295.16
##$TE2= 300
##$TE3= 300
##$TEG= 300
##$TL= (0..7)
0 120 120 120 120 120 120 120 
##$TP= (0..7)
150 150 150 150 150 150 150 150 
##$TP07= 0
##$TPNAME0= <>
##$TPNAME1= <>
##$TPNAME2= <>
##$TPNAME3= <>
##$TPNAME4= <>
##$TPNAME5= <>
##$TPNAME6= <>
##$TPNAME7= <>
##$TPOAL= (0..7)
0.5 0.5 0.5 0.5 0.5 0.5 0.5 0.5 
##$TPOFFS= (0..7)
0 0 0 0 0 0 0 0 
##$TUNHIN= 0
##$TUNHOUT= 0
##$TUNXOUT= 0
##$USERA1= <user>
##$USERA2= <user>
##$USERA3= <user>
##$USERA4= <user>
##$USERA5= <user>
##$V9= 5
##$VALIST= <valist>
##$VCLIST= <CCCCCCCCCCCCCCC>
##$VD= 0
##$VDLIST= <DDDDDDDDDDDDDDD>
##$VPLIST= <PPPPPPPPPPPPPPP>
##$VTLIST= <TTTTTTTTTTTTTTT>
##$WBST= 1024
##$WBSW= 4
##$XGAIN= (0..3)
0 0 0 0 
##$XL= 0
##$YL= 0
##$YMAX_a= 567557
##$YMIN_a= -570116
##$ZGOPTNS= <>
##$ZL1= 120
##$ZL2= 120
##$ZL3= 120
##$ZL4= 120
##$ABSF1= 16.522
##$ABSF2= -4.171173
##$ABSG= 5
##$ABSL= 3
##$ALPHA= 0
##$AQORDER= 0
##$ASSFAC= 0
##$ASSFACI= 0
##$ASSFACX= 0
##$ASSWID= 0
##$AUNMP= <proc_1d>
##$AZFE= 0.1
##$AZFW= 0.1
##$BCFW= 0
##$BC_mod= 0
##$BYTORDP= 0
##$COROFFS= 0
##$CY= 12.5
##$DATMOD= 1
##$DC= 0
##$DFILT= <>
##$DTYPP= 0
##$F1P= 14.0000005364418
##$F2P= -0.99999901652339
##$FCOR= 0.5
##$FTSIZE= 32768
##$FT_mod= 6
##$GAMMA= 0
##$GB= 0
##$INTBC= 1
##$INTSCL= 1
##$ISEN= 128
##$LB= 0.3
##$LEV0= 0
##$LPBIN= 0
##$MAXI= 10000
##$MC2= 0
##$MEAN= 0
##$ME_mod= 0
##$MI= 0
##$NCOEF= 0
##$NC_proc= -2
##$NLEV= 6
##$NOISF1= 0
##$NOISF2= 0
##$NSP= 0
##$NTH_PI= 0
##$NZP= 0
##$OFFSET= 16.522
##$PC= 1
##$PHC0= 130.2836
##$PHC1= 5.639269
##$PH_mod= 1
##$PKNL= yes
##$PPARMOD= 0
##$PSCAL= 4
##$PSIGN= 0
##$REVERSE= no
##$SF= 250.13
##$SI= 32768
##$SIGF1= 0
##$SIGF2= 0
##$SINO= 400
##$SIOLD= 32768
##$SREGLST= <1H.CDCl3>
##$SSB= 0
##$STSI= 32768
##$STSR= 0
##$SW_p= 5175.98343685301
##$SYMM= 0
##$S_DEV= 0
##$TDeff= 65536
##$TDoff= 0
##$TI= <Analysis number 999999
Compound Code 99
Book Reference 9
Project Code 9>
##$TILT= no
##$TM1= 0
##$TM2= 0
##$TOPLEV= 0
##$USERP1= <user>
##$USERP2= <user>
##$USERP3= <user>
##$USERP4= <user>
##$USERP5= <user>
##$WDW= 1
##$XDIM= 32768
##$YMAX_p= 391577906
##$YMIN_p= -275624
$$ End of Bruker specific parameters
$$ ---------------------------------
##NTUPLES= NMR SPECTRUM
##VAR_NAME=  FREQUENCY,     SPECTRUM/REAL,   SPECTRUM/IMAG
##SYMBOL=    X,             R,               I
##VAR_TYPE=  INDEPENDENT,   DEPENDENT,       DEPENDENT
##VAR_FORM=  AFFN,          ASDF,            ASDF
##VAR_DIM=   32768,         32768,           32768
##UNITS=     HZ,            ARBITRARY UNITS, ARBITRARY UNITS
##FACTOR=    0.157963299565203, 1,           1
##FIRST=     4132.6476996994, 0,             0
##LAST=      -1043.33573715361, 0,           0
##MIN=       -1043.33573715361, -275624,     0
##MAX=       4132.6476996994, 391577906,     0
$$ Real data points
##PAGE= N=1
##DATA TABLE= (X++(R..R)), XYDATA
$$ [...]
17381g812M585K044J60k630k10K717N279j191n237l634k622j105L492K161J934
$$ -7812 -3227 -1183 -1023 -3653 -3863 -1146 4133 2942 -2295 -5929 -8551 -9656 -6164 -4003 -2069
17366b069m53j070j647j202M306Q77M75o141L08N617L639o84q62k607j924l516
$$ -2069 -2522 -3592 -5239 -6441 -2135 -1258 -783 -6924 -6616 -999 2640 1956 1094 -1513 -3437 -6953
17350f953k88J611K481J987j140k946o27O29J304K17k196k023l228m39J081L125
$$ -6953 -7241 -5630 -3149 -1162 -2302 -5248 -5875 -5246 -3942 -3725 -5921 -7944 -11172 -11611 -10530 -7405
17334g405L856J717o3Mk592J530j43j901N35q21j196l49J975k070m9O75K200K345
$$ -7405 -3549 -1832 -1895 -1891 -4483 -2953 -3096 -4997 -4462 -5283 -6479 -6828 -4853 -6923 -6972 -6297 -4097 -1752
17316a752J79k042O45J789L363o26j702l886r00j453J197n02J545m44l5J354l332
$$ -1752 -1573 -3615 -2970 -1181 2182 1556 -146 -4032 -4932 -6385 -5188 -5690 -4145 -4589 -4624 -3270 -6602
17299f602j035M82O112K420l786k330l432P61j95l421J45K021K400K812N67j300
$$ -6602 -7637 -7155 -1043 1377 -2409 -4739 -8171 -7410 -7605 -11026 -10881 -8860 -6460 -3648 -3081 -4381
17283d381n664J284j238K609J184j704N93L582Q8M56o3N31J738n739m141l878
$$ -4381 -10045 -8761 -9999 -7390 -6206 -7910 -7317 -3735 -3647 -3191 -3254 -2723 -985 -6724 -10865 -14743
17267a4743r36L527K901j26q86l738J866N336K107j300k800N091l93L498J415
$$ -14743 -15679 -12152 -9251 -9377 -10263 -14001 -12135 -6799 -4692 -5992 -8792 -3701 -4094 -596 819
17252H19k550j828K157K351n86k674j274M095l57k797J327O14K27K40k079j495
$$ 819 -1731 -3559 -1402 949 363 -2311 -3585 510 153 -2644 -1317 -703 -476 -236 -2315 -3810
17236c810l169k783L652m85l441k133L684m47L446M206J347J70P8n25j606P56
$$ -3810 -6979 -9762 -6110 -6595 -10036 -12169 -8485 -8932 -5486 -1280 67 237 315 -210 -1816 -1060
17220a060m58j82k551K89P83J686N14p59J080P19p84l08J520M30M562j748k162
$$ -1060 -1518 -1700 -4251 -3962 -3179 -1493 -979 -1738 -658 61 -723 -1031 489 919 5481 3733 1571
17203A571j667o969k037j92K266j736m358K891N322j43l908p94q95r07K7k02Q20
$$ 1571 -96 -7065 -9102 -9294 -7028 -8764 -13122 -10231 -4909 -5052 -8960 -9754 -10649 -11556 -11529 -11731 -10911
17186a0911L949l607N44M412N898J028k634K258l190m905R49L386k112l507J021
$$ -10911 -6962 -10569 -10025 -5613 285 1313 -1321 937 -2253 -7158 -6209 -2823 -4935 -8442 -7421
17171g421J738M347M88J413j281J787P20M056K587N76J052m434m430l731j699
$$ -7421 -5683 -1336 -848 565 -716 1071 1791 5847 8434 9010 10062 5628 1198 -2533 -4232
17156d232R43p95j920l107n22J263l51n605p97K767o15J703J280J28j727J255
$$ -4232 -3289 -4084 -6004 -9111 -9633 -8370 -8721 -14326 -15123 -12356 -12971 -11268 -9988 -9860 -11587 -10332
17140a0332R39R77r87L195M715K84q34l393l87Q71M952J084k184K885j613n917
$$ -10332 -9393 -8416 -9403 -6208 -1493 -1209 -2043 -5436 -5823 -4952 0 1084 -1100 1785 172 -5745
17124e745m397j209M265L995k720k671J138m367J461K521K096L285j447j306j286
$$ -5745 -10142 -11351 -7086 -3091 -5811 -8482 -7344 -11711 -10250 -7729 -5633 -2348 -3795 -5101 -6387
17109f387Q69j17j058M635r11k276J73J908m21r11q24R11P14J457k676J606L629
$$ -6387 -5518 -5635 -6693 -2058 -2969 -5245 -5072 -3164 -3585 -4496 -5320 -4409 -3695 -2238 -4914 -3308 321
17092C21j722J647l629l645K876L488J984O72j365j066L24O95j650k070k495l521
$$ 321 -1401 246 -3383 -7028 -4152 -664 1320 1992 627 -439 -115 580 -1070 -3140 -5635 -9156
17076i156O80M559L92k620j622L470K407j303k686k417K858N054J479j473n376
$$ -9156 -8476 -3917 -3525 -6145 -7767 -4297 -1890 -3193 -5879 -8296 -5438 -384 1095 -378 -5754
17061e754m331j803J8K279J951M096j251l684o01L685J525j020k98J497k145K084
$$ -5754 -10085 -11888 -11870 -9591 -7640 -3544 -4795 -8479 -9080 -5395 -3870 -4890 -5188 -3691 -5836 -3752
17045c752k939O71N193j440k914k849K443j80j144j858K82O089M172m781o380
$$ -3752 -6691 -6020 -827 -2267 -5181 -8030 -5587 -5767 -6911 -8769 -8487 -2398 1774 -3007 -9387
17030i387Q21j878K879K426r68J651l03L8J39L96J612M29L542J657l031k845l530
$$ -9387 -8566 -10444 -7565 -5139 -6107 -4456 -4759 -4721 -4582 -4186 -2574 -2145 1397 3054 23 -2822 -6352
17013f352O4O0J06j757J47L079M559m155j550M30k453J02J148j73O23j517L595
$$ -6352 -6288 -6228 -6122 -7879 -7732 -4653 -94 -4249 -5799 -5369 -7822 -7720 -6572 -6745 -6122 -7639 -4044
16996d044m18M86L216n097l457o24K70L225J449N355l862l082j380o28K999O85
$$ -4044 -4462 -3976 -760 -5857 -9314 -9938 -9668 -6443 -4994 361 -3501 -6583 -7963 -8591 -5592 -4907
16980d907J207q06K592J036J899k119m330J42j135k801K96M263R07p2J967K129
$$ -4907 -3700 -4506 -1914 -878 1021 -1098 -5428 -5286 -6421 -9222 -8926 -4663 -3756 -3828 -1861 268
16964B68j843n35P401J346q62j201Q15l125l593j718l077j624j083l842O03M625
$$ 268 -1575 -2110 5291 6637 5775 4574 5389 2264 -1329 -3047 -6124 -7748 -8831 -12673 -12070 -7445
16948g445N479k365k833K941J620p0p24J704k361j882j969p4Q69k544K292K733
$$ -7445 -1966 -4331 -7164 -4223 -2603 -2673 -3397 -1693 -4054 -5936 -7905 -7979 -7110 -9654 -7362 -4629
16932d629L71j713K106J504p45o57M050j146k918K976J417O32O31r16k259p43
$$ -4629 -4258 -5971 -3865 -2361 -3106 -3763 287 -859 -3777 -801 616 1248 1879 963 -1296 -2039
16916b039l27k951l089l77J29L780o73l25k471n19L060K168N0O44M994J106m939
$$ -2039 -2366 -5317 -8406 -8783 -8654 -4874 -5547 -5872 -8343 -8862 -5802 -3634 -3584 -2940 2054 3160 -1779
16899a779n162R50J44j616j783J621j868J521O948J609m132p0N49k267Q9O26l920
$$ -1779 -6941 -5991 -5847 -7463 -9246 -7625 -9493 -7972 -1024 585 -3547 -3617 -3068 -5335 -5246 -4620 -8540
16882h540P59r82R39R90J093J428K62J029J185K546q90k957o18m94L243k37k992
$$ -8540 -7781 -8763 -7824 -6834 -5741 -4313 -4051 -3022 -1837 709 -181 -3138 -3756 -4250 -1007 -1244 -4236
16865d236Q84j142r41r32m91L873K113m328r63p42j71k450R18N96K135L475j028
$$ -4236 -3352 -4494 -5435 -6367 -6858 -2985 -872 -5200 -6163 -6905 -7076 -9526 -8608 -8012 -5877 -2402 -3430
16848c430k082O33j176J252Q29k537l319m429k672L724L739K656J322K356R61
$$ -3430 -5512 -4879 -6055 -4803 -3974 -6511 -9830 -14259 -16931 -13207 -9468 -6812 -5490 -3134 -2173
16833b173K25l137l060j384M021L054l351k012K594K914Q64J323k463j383R88
$$ -2173 -1948 -5085 -8145 -9529 -5508 -2454 -5805 -7817 -5223 -2309 -1445 -122 -2585 -3968 -2980
16818b980J727K658L66m953j902l618l034L767J210J774j208o544R12N64m372
$$ -2980 -1253 1405 1771 -3182 -5084 -8702 -11736 -7969 -6759 -4985 -6193 -12737 -11825 -11261 -15633
16803a5633M957O73K986M949j184j087J940j636k96M003K128L765K089k70j418
$$ -15633 -10676 -10003 -7017 -2068 -3252 -4339 -2399 -4035 -4331 -328 1800 5565 7654 7384 5966
16788E966m066p481m811K278M363J395K709j855J411r83j085L98R46J344q59m504
$$ 5966 1900 -5581 -10392 -8114 -3751 -2356 353 -1502 -91 -1074 -2159 -1761 -815 529 -330 -4834
16772d834q283k516L135K518M204O84j875p98J090l50K870N385O47J1j814M358
$$ -4834 -13117 -15633 -12498 -9980 -5776 -5092 -6967 -7765 -6675 -7025 -4155 1230 1877 1888 74 4432
16756D432J806N15j149n627j705l755k129M399l6m037q93J223J203K137j189p64
$$ 4432 6238 6753 5604 -23 -1728 -5483 -7612 -3213 -3249 -7286 -8179 -6956 -5753 -3616 -4805 -5569
16740e569r23J073J58j642O80k275J950J253j381L149N77j388o24Q5L477j744
$$ -5569 -6492 -5419 -5261 -6903 -6223 -8498 -6548 -5295 -6676 -3527 -2950 -4338 -4962 -4877 -1400 -3144
16724c144l639n48l117k970L20L626J260O880Q22L038K091j563k687l036J825
$$ -3144 -6783 -7331 -10448 -13418 -13098 -9472 -8212 -1332 -510 2528 4619 3056 369 -2667 -842
16709h42J308L309k078k927j086l74m3m146K445R33o43k016l331K560K74J558
$$ -842 466 3775 1697 -1230 -2316 -2690 -2733 -6879 -4434 -3501 -4144 -6160 -9491 -6931 -6657 -5099
16693e099K160k668k267j931L063K202J772J090j584N0l391j870J353K161K575
$$ -5099 -2939 -5607 -7874 -9805 -6742 -4540 -2768 -1678 -3262 -3212 -6603 -8473 -7120 -4959 -2384
16678b384Q22k78P72J42j449J50K93J888p8k104m051M44L444m15K329K404l5j146
$$ -2384 -1562 -1840 -1068 -926 -2375 -2225 -1932 -44 -122 -2226 -6277 -5833 -2389 -2804 -475 1929 1894 748
16660G48l761m494L695k571m48L457J651J541O09j615m825J333Q42K78J362K962
$$ 748 -3013 -7507 -3812 -6383 -6831 -3374 -1723 -182 427 -1188 -6013 -4680 -3838 -3560 -2198 764
16644G64o27j531j378O07r90m025j338K540K070l626k541n74R91L216q95M19R15
$$ 764 137 -1394 -2772 -2165 -3155 -7180 -8518 -5978 -3908 -7534 -10075 -10649 -9658 -6442 -7337 -6918 -6003
16627f003J109J721J185O2l934N672J703m279m902j063J441j266J415L64J563
$$ -6003 -4894 -3173 -1988 -1926 -5860 -188 1515 -2764 -7666 -8729 -7288 -8554 -7139 -6775 -5212
16612e212J846r20J796n35J570k135j498q82M393L085j894r87J175j585k569l740
$$ -5212 -3366 -4286 -2490 -3025 -1455 -3590 -5088 -5970 -1577 1508 -386 -1373 -198 -1783 -4352 -8092
16596h092j211O76J652j393J734Q23J132K612J145k481J594j133l471K258J635
$$ -8092 -9303 -8627 -6975 -8368 -6634 -5811 -4679 -2067 -922 -3403 -1809 -2942 -6413 -4155 -2520
16581b520K05L586J171m850l278m55K395K690k349j04K670l893l352K29J670J243
$$ -2520 -2315 1271 2442 -2408 -5686 -6141 -3746 -1056 -3405 -3509 -839 -4732 -8084 -7855 -6185 -4942
16565d942m918j126J932K304l187k386j955J686K512l872K69K839J980K979J479
$$ -4942 -9860 -10986 -9054 -6750 -9937 -12323 -14278 -12592 -10080 -13952 -13683 -10844 -8864 -5885 -4406
16550d406R63l622j944J218L878J780m60n656p5R43R20j466K216J691J337J869
$$ -4406 -3443 -7065 -9009 -7791 -3913 -2133 -2593 -8249 -8324 -7381 -6461 -7927 -5711 -4020 -2683 -814
16534h14j69l513o28n68K57R40q69L288M433O2k59m757j074j569j241j210Q86
$$ -814 -983 -4496 -5124 -5692 -5435 -4495 -5364 -2076 2357 2419 2160 -2597 -3671 -5240 -6481 -7691 -6805
16517f805O201O541k420j442l924k236N08Q70j803O78j995l613J163L458L20p56
$$ -6805 -604 5937 3517 2075 -1849 -4085 -3577 -2707 -4510 -3832 -5827 -9440 -8277 -4819 -4499 -5255
16501e255L97l730j31N526J460j98J851J638j698O58Q55j895j900j320J337L343
$$ -5255 -4858 -8588 -8719 -3193 -1733 -1931 -80 1558 -140 518 1373 -522 -2422 -3742 -2405 938
16485I38J44J129L259R67k02k267n42n08J425k355j851l969q83O34p45M959k29
$$ 938 1082 2211 5470 6437 6235 3968 3426 2918 4343 1988 137 -3832 -4715 -4081 -4826 133 -96
16468i6l520q9K574k336L499K793j950j110k448P00Q03L716k724L00L7p1%l856
$$ -96 -3616 -3705 -1131 -3467 32 2825 875 -235 -2683 -1983 -1180 2536 -188 112 149 78 78 -3778
16450c778J661j202K554j006J029n58P06K238l410k438J998L888q20k678m62J686
$$ -3778 -2117 -3319 -765 -1771 -742 -1300 -594 1644 -1766 -4204 -2206 1682 862 -1816 -2278 -592
16434e92r63p76j102J6k920J74r0k934n9J442L209Q22r75K063n912j901J814L912
$$ -592 -1555 -2331 -3433 -3417 -6337 -6163 -6253 -9187 -9246 -7804 -4595 -3773 -4748 -2685 -8597 -10498 -8684 -4772
16416d772N637l3n852j680J60K138j28K515L148k322l404l306l81P16J010M7K117
$$ -4772 865 832 -5020 -6700 -6540 -4402 -4530 -2015 1133 -1189 -4593 -7899 -8280 -7564 -6554 -6507 -4390
16399d390J980j030K329J556k361q74L18j06Q82j977k232k188j410N422M735j892
$$ -4390 -2410 -3440 -1111 445 -1916 -2790 -2472 -2578 -1696 -3673 -5905 -8093 -9503 -4081 654 -1238
16383a238k428L032O127o095L36J803q44n2K42k127l345L305K547J908j856m120
$$ -1238 -3666 -634 5493 -602 -266 1537 693 641 883 -1244 -4589 -1284 1263 3171 1315 -2805
16367b805J130L550J727j927R56o268k699N899N914l29j994j560k37j552k749
$$ -2805 -1675 1875 3602 1675 2631 -3637 -6336 -437 5477 5148 3154 1594 1357 -195 -2944
16352b944L586K60r58J357k089l782J206q65k684J029L13J334K43P89m58J564
$$ -2944 642 902 -56 1301 -788 -4570 -3364 -4229 -6913 -5884 -5571 -4237 -3994 -3205 -3663 -2099
16336b099J44K89L145J19k367K822J669n19k082j782K565K983j122j15j771j933
$$ -2099 -1955 -1666 1479 1598 -769 2053 3722 3203 1121 -661 1904 4887 3765 3650 1879 -54
16320e4j519n40K278l299j925O064m5l607j838j663L445L620J414J45j032k826
$$ -54 -1573 -2113 165 -3134 -5059 1005 960 -2647 -4485 -6148 -2703 917 2331 2476 1444 -1382
16304a382K236Q09K212K189K457j237j641j804K60j737j182k962K010K206j680
$$ -1382 854 1663 3875 6064 8521 7284 5643 3839 4099 2362 1180 -1782 228 2434 754
16289G54q78K941J723j202k772n67L468K735j572n157l9n6Q63N858J12o70m090
$$ 754 -124 2817 4540 3338 566 -1 3467 6202 4630 -527 -566 -622 241 6099 6211 5541 1451
16272A451l395j145K297K0j28l8J711j092M89P05j07K74N245J244q257J106K954
$$ 1451 -1944 -3089 -792 -772 -900 -938 773 -319 170 875 768 1042 6287 7531 -726 380 3334
16255C334L494m660m341j531P63M88K131K653M927J527j538k762k777l689K649
$$ 3334 6828 2168 -2173 -3704 -2941 -2453 -322 2331 7258 8785 7247 4485 1708 -1981 668
16240F68O51j242M05j995J649K226k75J690k280k187K275R76J56Q43q18K31L147
$$ 668 1319 77 482 -1513 136 2362 2087 3777 1497 -690 1585 2561 2717 3560 2742 2973 6120
16223F120l414k16J719j209n4J265N054R33r70l588m16K219K895L608n56p158
$$ 6120 2706 2490 4209 3000 2946 4211 9265 10198 9228 5640 5224 7443 10338 13946 13390 6232
16207F232l462J248l24J38L554l559j10J851q64j822j962K530L548m296j226J809
$$ 6232 2770 4018 3694 3832 7386 3827 3717 5568 4704 2882 920 3450 6998 2702 1476 3285
16191C285q70L1L022J109m109l590o23o81L206j090J35J822N72l507k140R32l76
$$ 3285 2415 2446 5468 6577 2468 -1122 -1745 -2426 780 -310 -175 1647 2219 -1288 -3428 -2496 -2872
16174b872K486l082q55L293J13L173J227P80L73k55R7J195r08K516J732R75j49
$$ -2872 -386 -3468 -4323 -1030 -917 2256 3483 4263 4636 4381 4478 5673 4765 7281 9013 9988 9839
16157I839N22k455J032L05O18r09l310m87k457k037K886P7R14K423K673M14N75
$$ 9839 10361 7906 8938 9243 9861 8952 5642 5155 2698 661 3547 3624 4538 6961 9634 10048 10623
16140A0623m966K015K389J621j797l781k119J287Q84J593l84j766l31K509j122
$$ 10623 5657 7672 10061 11682 9885 6104 3985 5272 6156 7749 7365 5599 5268 7777 6655
16125F655R03J504J756L510Q55k701Q1L558l073k642J022j10p98M501L471n480
$$ 6655 7558 9062 10818 14328 15183 12482 12563 16121 13048 10406 11428 11318 10520 15021 18492 13012
16109A3012l712j104k45R72L296j42j822K5K222J035J107r5L30K809N9Q52j428
$$ 13012 9300 8196 7951 8923 12219 12077 10255 10280 12502 13537 14644 14549 14879 17688 17747 18599 17171
16092A7171l332j223k439k912l152l3M254J070p6L445L339K245J52n667l487m75
$$ 17171 13839 12616 10177 7265 4113 4080 8334 9404 9328 12773 16112 18357 18509 12842 9355 8880
16076H880O6N06K58j10p10l50M167Q93j978m620K241k68L320L252O48R17p75p7
$$ 8880 8946 9452 9710 9600 8890 8540 12707 13600 11622 7002 9243 8975 12295 15547 16195 17112 16337 16260
16058A6260k721k888K889M08l274m322k480j865K054M384J195L200l79J443K123
$$ 16260 13539 10651 13540 13948 10674 6352 3872 2007 4061 8445 9640 12840 12461 13904 16027
16043A6027P58k924J245n14J530J077j127l244P31l18r84M287J262O71n072n274
$$ 16027 16785 13861 15106 14592 16122 17199 16072 12828 13559 13241 12257 16544 17806 18477 13405 8131
16027H131L34N076l77K985P24K95K146m13m928R9L320J621m442J796L299K438
$$ 8131 8465 13541 13164 16149 16873 17168 19314 18901 13973 14072 17392 19013 14571 16367 19666 22104
16011B2104K97k673j119O47q92k653N05o97P27r81r60k411K27L857j736k284L271
$$ 22104 22401 19728 18609 19256 18364 15711 16216 15519 16246 15265 14305 11894 12121 15978 14242 11958 15229
15994A5229M225k72j614o41j707Q90L47L930L678L558m576k562J895R49j742L38
$$ 15229 19454 19182 17568 16927 15220 16110 16457 20387 24065 27623 23047 20485 22380 23329 21587 21925
15978B1925O66j211J706m716J1p71K358L416M64K626M98K516o68j253K05n328
$$ 21925 22591 21380 23086 18370 18381 17610 19968 23384 23848 26474 26972 29488 28820 27567 27772 22444
15962B2444j133K500J015P89k314N912J113L25q62r51j679l806q60J769Q22K178
$$ 22444 21311 23811 24826 25615 23301 29213 30326 30651 29789 28838 27159 23353 22493 24262 25084 27262
15946B7262m27k104J703R59O41L06K41M5K91r44l929L58K355J039o15j864k179
$$ 27262 26835 24731 26434 27393 28034 28340 28581 28626 28917 27973 24044 24402 26757 27796 27181 25317 23138
15929B3138l4L4k740j91K123K736K432k398j350J293j765j416k719J749q9M940
$$ 23138 23104 23138 20398 20207 22330 25066 27498 25100 23750 25043 23278 21862 19143 20892 20803 25743
15913B5743J819l60k84K426j222k264k37n35k208K257L798K725K132O16Q73m59
$$ 25743 27562 27202 26918 29344 28122 25858 25621 25086 22878 25135 28933 31658 33790 34406 35279 34820
15897C4820k614k012j295M377K01j185k27N120j50J075l514n17M553q92k298k695
$$ 34820 32206 30194 28899 33276 33477 32292 32065 37185 37035 38110 34596 34079 38632 37740 35442 32747
15881C2747M501Q554R78o627j824J541p16l26L030J901N46k480m24p008m488J125
$$ 32747 37248 45802 46780 40153 38329 39870 39154 38828 41858 43759 44305 41825 41401 34393 29905 31030
15865C1030N47l22j370k034K472M926J072l675m785l73K181J180R44K303K311
$$ 31030 31577 31255 29885 27851 30323 35249 36321 32646 27861 27488 29669 30849 31793 34096 36407
15850C6407o11K55k512l6K035Q28j63k54j824J199O352K102m224k337p42J568
$$ 36407 35796 36051 33539 33503 35538 36366 36203 35949 34125 35324 41676 43778 39554 37217 36475 38043
15834C8043l079l303k434N451M560M397m049o880k318L836L143j163J33L494n27
$$ 38043 34964 31661 29227 34678 39238 43635 39586 32706 30388 34224 37367 36204 36337 39831 39304
15819C9304j070m02k256Q25k66k355J18K263j956K84K532k723m309j585K058J432
$$ 39304 38234 37832 35576 36401 36135 33780 33898 36161 34205 34489 37021 34298 29989 28404 30462 31894
15803C1894N185M184l726j428l793j48K726R0p39m485l377J377N14M619P63n69
$$ 31894 37079 41263 37537 36109 32316 32168 34894 34984 34245 29760 26383 27760 28274 32893 33656 33087
15787C3087J517J865N75k185l75j770j583K195K716P12l71k641k797M691O41k015
$$ 33087 34604 36469 37044 34859 34484 32714 31131 33326 36042 36754 36383 33742 30945 35636 36277 34262
15771C4262o413K63O31m05l752J561Q17M447Q38k489p18P01J12L00j88l954R39
$$ 34262 27849 28112 28743 28338 24586 26147 26964 31411 32249 29760 29042 29743 29855 30155 29967 26013 26952
15754B6952N90K71L49N79K147O54m532k264q6J731o2j559k29L856J696l380K001
$$ 26952 27542 27813 28162 28741 30888 31542 27010 24746 24660 26391 26329 24770 24541 28397 30093 26713 28714
15737B8714j32k361n311j307K662Q05K402M155k391k413M43L23J967m40j188K63
$$ 28714 28582 26221 20910 19603 22265 23070 25472 29627 27236 24823 25266 25589 27556 27116 25928 26191
15721B6191K241K465K701p26j286j225l214K547l39j878j560q30j62l755Q36l557
$$ 26191 28432 30897 33598 32872 31586 30361 27147 29694 29355 27477 25917 25087 24925 21170 22006 18449
15705A8449j786J566q73L0L844K670M35m128o52L289k369j539r53M14K543O018
$$ 18449 16663 18229 17356 17386 21230 23900 24335 20207 19555 22844 20475 18936 17983 18397 20940 26958
15689B6958r87m650k248o109p69J494N445l31J709L160J191m796k685J784J411
$$ 26958 25971 21321 19073 12964 12195 13689 19134 18803 20512 23672 24863 20067 17382 19166 20577
15674B0577j104q63L157j670p88q81l008j203L611P283R14l968n082j289M15K448
$$ 20577 19473 18610 21767 20097 19309 18428 15420 14217 17828 25111 26025 22057 16975 15686 16101 18549
15658A8549k905l878J515k48J552J851J987O76m04m602M175J894L931j894n00
$$ 18549 15644 11766 13281 13033 14585 16436 18423 19099 18695 14093 18268 20162 24093 22199 21699
15643B1699L349j516l859j493k312q88J225j207K513L02K707Q32k490j963m474
$$ 21699 25048 23532 19673 18180 15868 14980 16205 14998 17511 17813 20520 21352 18862 16899 12425
15628A2425l06L195J949L02J450m024m111j133l694o4M475N534k126R8J402k18
$$ 12425 12119 15314 17263 17565 19015 14991 10880 9747 6053 5989 10464 15998 13872 13970 15372 15154
15612A5154J252o00m902l978M730J883l476r01J204P96J317K659Q92K682j817
$$ 15154 16406 15806 10904 6926 11656 13539 10063 9162 10366 11162 12479 15138 16030 18712 16895
15597A6895m510j741j792N88J068K069M115L099K924j880j580j81N36J327o3k598
$$ 16895 12385 10644 8852 9440 10508 12577 16692 19791 22715 20835 19255 19074 19610 20937 20874 18276
15581A8276m276J664k03K171L284j306k149j602M70L246q41j909q13j490N72Q01
$$ 18276 14000 15664 15461 17632 20916 19610 17461 15859 16329 19575 18734 16825 16012 14522 15094 15895
15565A5895k31j133l33m4j973K842l803n714J207L786k220M872P089m331l036
$$ 15895 15664 14531 14198 14154 12181 15023 11220 5506 6713 10499 8279 13151 20240 15909 12873
15550A2873j473J269O309J69k81Q60m652n730j153K568J650J46P41j439L09j225
$$ 12873 11400 12669 18978 19147 18866 19726 15074 9344 8191 10759 12409 12555 13296 11857 12166 10941
15534A0941N062j386R7j572j31O07k53j774j024J082J513L67j571O79K656P30
$$ 10941 16003 14617 14714 13142 13011 13618 13365 11591 10567 11649 13162 13529 11958 12637 15293 16023
15518A6023j318k934R8P8K676n00K232K620j127k902k137J749p12k938J547N76
$$ 16023 14705 11771 11869 11947 14623 14123 16355 18975 17848 14946 12809 14558 13846 10908 12455 13031
15502A3031J056m346m34L9k689k61L966J644J269J434L60K53j819l295L58J248
$$ 13031 14087 9741 9307 9346 6657 6396 10362 12006 13275 14709 15069 15322 13503 10208 10566 11814
15486A1814J180q14l172L212k22l53j109j111o05k257J118K64L29L861M06m40
$$ 11814 12994 12180 9008 12220 11998 11645 10536 9425 8820 6563 7681 7945 8274 12135 12541 12101
15470A2101q05J420k53r58j214l666n57r04L449j730N28N440J767l896J251j561
$$ 12101 11296 12716 12463 11505 10291 6625 6068 5164 8613 6883 7411 12851 14618 10722 11973 10412
15454A0412L895K938k014n838q54K046p15m108j481J054j949j113O26L423J471
$$ 10412 14307 17245 15231 9393 8539 10585 9870 5762 4281 5335 3386 2273 2899 6322 7793
15439G793K32M145J833k520l841M909P82L30j778l24L267K069P74o376k967n77
$$ 7793 8025 12170 14003 11483 7642 12551 13333 13663 11885 11561 14828 16897 17671 11295 8328 7751
15423G751J567K157o18J916K802J745l257n624l63K891l18O44L53p85J891j458
$$ 7751 9318 11475 10857 12773 15575 17320 14063 8439 8076 10967 10649 11293 11646 10861 12752 11294
15407A1294j379R48K109L600J916l897j107k37m4R50K928K287J246m051l457j024
$$ 11294 9915 10863 12972 16572 18488 14591 13484 13247 13203 14153 17081 19368 20614 16563 13106 12082
15391A2082l200K259J86R02K639M580J85j059j150k322L201J883L089p92o676
$$ 12082 8882 11141 11327 12229 14868 19448 19633 18574 17424 15102 18303 20186 23275 22483 15807
15376A5807j499n92L7J080J754j094p77J710K287n07j258q10K156k161j186k357
$$ 15807 14308 13716 13753 14833 16587 15493 14716 16426 18713 18206 16948 16138 18294 16133 14947 12590
15360A2590k611o94L914K809K403o91k003J073J751P73L635j051l896k727k6k412
$$ 12590 9979 9285 13199 16008 18411 17720 15717 16790 18541 19314 22949 21898 18002 15275 15249 12837
15344A2837K56J872O56K65m510k288M582L101l894k226J36Q26M243K352K091L26
$$ 12837 13093 14965 15621 15886 11376 9088 13670 16771 12877 10651 10787 11613 15856 18208 20299 20625
15328B0625k416m048K045j448n992j441K462M653L551M47N795O32k154l018j192
$$ 20625 18209 14161 16206 14758 8766 7325 9787 14440 17991 18438 24233 24865 22711 19693 18501
15313A8501r00M238N56o2j807l506k185J305q15j461M389J513r88j599P31M098
$$ 18501 17601 21839 22395 22333 20526 17020 14835 16140 15325 13864 18253 19766 18778 17179 17910 22008
15297B2008R77k020m195m420K773J10J47K502R79J202k616k172L180p75k106K742
$$ 22008 22985 20965 16770 12350 15123 15233 15380 17882 18861 20063 17447 15275 18455 17680 15574 18316
15281A8316m93j371M058O7N00J264J303j102K040j564j437K667j226l250M11j496
$$ 18316 17823 16452 20510 20577 21077 22341 23644 22542 24582 23018 21581 24248 23022 19772 20183 18687
15265A8687k778J750L223n11M56K527Q76J103k347N71j32J394l333N28k838k868
$$ 18687 15909 17659 20882 20371 20827 23354 24230 25333 22986 23557 23425 24819 21486 22014 19176 16308
15249A6308J824P98j620J365J849M606J184M32J726j931J566k94p92L03m275n35
$$ 16308 18132 18930 17310 18675 20524 25130 26314 26746 28472 26541 28107 27813 27021 27324 23049 22514
15233B2514n710j922O310K54j352M574L481k648k082j205L8N3L827j386j352J346
$$ 22514 16804 14882 21192 21446 20094 24668 28149 25501 23419 22214 22252 22305 26132 24746 23394 24740
15217B4740O55N45N63O37m58J256K19J235K242R55l592N58K791J466J711o506
$$ 24740 25395 25940 26503 27140 26682 27938 28157 29392 31634 32589 28997 29555 32346 33812 35523 29017
15201B9017n811J67L880K777k005O11M412K362p87l475J166j7l091J94o27L608
$$ 29017 23206 23373 27253 30030 28025 28636 33048 35410 34623 31148 32314 32297 29206 29400 28773 32381
15185C2381J584J46p347k864J945J859q72R38l67K840k336j564K399M612k538
$$ 32381 33965 34111 26764 23900 25845 27704 26832 27770 27403 30243 27907 26343 28742 33354 30816
15170C0816m253o02L21J209R42l922L770N836L54l245M97M948J901l031J318q72
$$ 30816 26563 25961 26282 27491 28433 24511 28281 34117 34471 31226 31723 36671 38572 35541 36859 35987
15154C5987j19J853m49R26J030j794k117J102j50K32Q4l563l83N918m1l757q25
$$ 35987 35868 37721 37272 38198 39228 37434 35317 36419 36269 36501 36585 33022 32639 38557 38516 34759 33934
15137C3934j497K337K040L225j199k808l937L558j265M84r98L87L850j667j278
$$ 33934 32437 34774 36814 40039 38840 36032 32095 35653 34388 34872 33874 34261 38111 36444 35166
15122C5166j201l100l187O05N588J496k094N38J594k548J847j795l094K690K268
$$ 35166 33965 30865 27678 28283 33871 35367 33273 33811 35405 32857 34704 32909 29815 32505 34773
15107C4773J531K032K238M56o923k438l295M09M44k150K830L188k515J501J305
$$ 34773 36304 38336 40574 41030 34107 31669 28374 28783 29227 27077 29907 33095 30580 32081 33386
15092C3386Jl632m84O018J524m285M80Q91j373J242K576J937K124q29l184K468
$$ 33386 33387 29755 29271 35289 36813 32528 33008 33899 32526 33768 36344 38281 40405 39576 36392 38860
15076C8860k19m045k170L921j808m824j825M24n178l581j779n75M513J183M002
$$ 38860 38641 34596 32426 36347 34539 29715 27890 28314 23136 19555 17776 17201 21714 22897 26899
15061B6899L595r07J464L675Q15j059J590j967K092l276k655K595L119N62l804
$$ 26899 30494 29587 31051 34726 35541 34482 36072 34105 36197 32921 30266 32861 35980 36542 32738
15046C2738j198M165k330J407N94m244m140n753J432K259k736j939K460N683J890
$$ 32738 31540 35705 33375 34782 35376 31132 26992 21239 22671 24930 22194 20255 22715 28398 30288
15031C0288K005n6l153m946R39J82l038L688M239j010k805q26J353l771L1K117
$$ 30288 32293 32237 29084 24138 25077 25259 22221 25909 30148 29138 26333 25507 26860 23089 23120 25237
15015B5237q04j079l241j221N018J829k907j997L04k09L606M962k35j096J689
$$ 25237 24433 23354 20113 18892 23910 25739 22832 20835 21139 20930 24536 29498 29263 28167 29856
15000B9856p85l072j868k486N66L663j576k184k904k406J970Q6o35j994k472Q93
$$ 29856 29071 25999 24131 21645 22211 25874 24298 22114 19210 16804 18774 18860 18225 16231 13759 14652
14984A4652N660O432r30j118m800o37K365K486j256O37j734j991J252J106m536
$$ 14652 20312 26744 25814 24696 19896 19259 21624 24110 22854 23491 21757 19766 21018 22124 17588
14969A7588k108L772j302o52J504o50j902l277O17J221J60L079M11j956k812K1
$$ 17588 15480 19252 17950 17298 18802 18152 16250 12973 13590 14811 14971 18050 18461 16505 13693 13714
14953A3714L569j81p89k017j763J132M938M176k976m902m10K239q63m087k22J893
$$ 13714 17283 17102 16313 14296 12533 13665 18603 22779 19803 14901 14491 16730 15867 11780 11558 13451
14937A3451K855k684K187l603j921p4L217o32M28R94Q14j563k336K659M241L134
$$ 13451 16306 13622 15809 12206 10285 10211 13428 12796 13224 14218 15032 13469 11133 13792 18033 21167
14921B1167P6m203m861j199J896N087K863k627j401n148l531K202L0J509K139
$$ 21167 21243 17040 12179 10980 12876 17963 20826 18199 16798 11650 8119 10321 10351 11860 13999
14906A3999m030n92j841L3J758J587M483N39j924j188J410M32j912j193p7k28
$$ 13999 9969 9377 7536 7569 9327 10914 15397 15936 14012 12824 14234 14666 12754 11561 11484 11256
14890A1256J591J69n32j914l435N899k209k446L711J242m44q1j358R50M259L280
$$ 11256 12847 13016 12484 10570 7135 13034 10825 8379 12090 13332 12888 12807 11449 12399 16658 19938
14874A9938N052l409q386o897J766K575O50L35J567j942j970K678n41n98J1l588
$$ 19938 24990 21581 13195 6298 8064 10639 11289 11624 13191 11249 9279 11957 11416 10818 10829 7241
14858G241r76P402j458k177L161j246k368J218K105k594j583j933j340K599N09
$$ 7241 6265 13667 12209 10032 13193 11947 9579 10797 12902 10308 8725 6792 5452 8051 8560
14843H560K416l036q65m63O60K40j879N22K018k148O60k14l110N130M469l439
$$ 8560 10976 7940 7075 6612 7272 7512 5633 6155 8173 6025 6685 6471 3361 8491 12960 9521
14827I521O3K300k788k930j100Q59k056q93l62M23L64J964k208K244K891J527
$$ 9521 9584 11884 9096 6166 5066 5925 3869 2976 2614 3037 3401 5365 3157 5401 8292 9819
14811I819j647l624j196K81M060J647K61k185j166J978j760p58K037q78j177J633
$$ 9819 8172 4548 3352 3633 7693 9340 9601 7416 6250 8228 6468 5710 7747 6869 5692 7325
14795G325j893l001K333j41J065j717k586j120J063N969K327j746q567k520L075
$$ 7325 5432 2431 4764 4623 5688 3971 1385 265 1328 7297 9624 7878 -689 -3209 -134
14780a34J045J359L683j455l296K905J988J743j473m959j116K846K33l45M087
$$ -134 911 2270 5953 4498 1202 4107 6095 7838 6365 1406 290 3136 3369 3024 7111
14765G111M87J802j630o271l727M53M180N931l526l681j411K045K529L041j271
$$ 7111 7598 9400 7770 1499 -2228 -1775 2405 8336 4810 1129 -282 1763 4292 7333 6062
14750F062j838r31P27k84p75l804m092J613O571Q93q81j302j618J054k240k526
$$ 6062 4224 3293 4020 3736 2961 -843 -4935 -3322 3249 4142 3261 1959 341 1395 -845 -3371
14734c371M577M352J040j64k497j039m167k895O817L208M342k087k031l982m130
$$ -3371 1206 5558 6598 6434 3937 2898 -1269 -4164 2653 5861 10203 8116 6085 2103 -2027
14719b027K847O67l969j767j737J147J269K209n468j787k1N025J352M156N378
$$ -2027 820 1487 -2482 -4249 -5986 -4839 -3570 -1361 -6829 -8616 -8637 -3612 -2260 1896 7274
14704G274l431l680j539J951K371Mj584J332J089j732m589l122L279j750M55N161
$$ 7274 3843 163 -1376 575 2946 2950 1366 2698 3787 2055 -2534 -5656 -2377 -4127 -3672 1489
14688A489N49J475k153q55J361J70p88K637L323n4m138n278J781K0J549K706o772
$$ 1489 2038 3513 1360 505 1866 2036 1248 3885 7208 7154 3016 -2262 -481 -461 1088 3794 -2978
14671b978K66p6K610j015K312r39L093L389P93j250o278n355Q49j936R55j334
$$ -2978 -2712 -2788 -178 -1193 1119 180 3273 6662 7455 6205 -73 -5428 -4579 -6515 -5560 -6894
14655f894L474k58k455J790K484P84o16j421L51j051J959p16l922n64O735K717
$$ -6894 -3420 -3678 -6133 -4343 -1859 -1075 -1691 -3112 -2761 -3812 -1853 -2569 -6491 -7055 -320 2397
14639B397m9J477l522l985K52L170O5J458N60j904k403j423N13N10J50N091K136
$$ 2397 2348 3825 303 -3682 -3430 -260 -195 1263 1823 -81 -2484 -3907 -3394 -2884 -2734 2357 4493
14622D493J042l063k389l69L603M19K720l232l329k86l93m64j575l583J051J989
$$ 4493 5535 2472 83 -286 3317 3736 6456 3224 -105 -391 -784 -1248 -2823 -6406 -5355 -3366
14606c366R36J424L5M214J752n128k154M055M713L632k965m31k593n258o269l62
$$ -3366 -2430 -1006 -971 3243 4995 -133 -2287 1768 6481 10113 7148 6717 4124 -1134 -7403 -7765
14590g765K62J966K88J71l117K651K857K928j05k837J734N99j2K747j365n469
$$ -7765 -7503 -5537 -5249 -5078 -8195 -5544 -2687 241 136 -2701 -967 -368 -380 2367 1002 -4467
14574d467k863L883M81j297L048k31k068k2K03J703L69K348K10Nj670j080o262
$$ -4467 -7330 -3447 -2966 -4263 -1215 -1446 -3514 -3536 -3333 -1630 -1261 1087 1297 1302 -368 -1448 -7710
14557g710K707O828K397p572n697O108K047l219k439L786L143J853j461k667n7
$$ -7710 -5003 1825 4222 -3350 -9047 -2939 -892 -4111 -6550 -2764 379 2232 771 -1896 -1953
14542a953R38j247k601j870K907K067R79N98j732j143l984m93K458Q64L208k699
$$ -1953 -1015 -2262 -4863 -6733 -3826 -1759 -780 -182 -1914 -3057 -7041 -7534 -5076 -4212 -1004 -3703
14526c703l588l512J33P50M425k03j20K235L104l162k525O17J486n730o125J07
$$ -3703 -7291 -10803 -10670 -9920 -5495 -5698 -5818 -3583 -479 -3641 -6166 -5549 -4063 -9793 -15918 -15811
14510a5811R88J463M729J596J908J354K846K801k708n606k500j119J836m80K414
$$ -15811 -14823 -13360 -8631 -7035 -5127 -3773 -927 1874 -834 -6440 -8940 -10059 -8223 -8703 -6289
14495f289L644l229m023K068M975l905K371K731j972O30p94l71l39J425k868q65
$$ -6289 -2645 -5874 -9897 -7829 -2854 -6759 -4388 -1657 -3629 -2999 -3793 -4164 -4503 -3078 -5946 -6811
14479f811j246K113L478j246l057l30R73L980J808k11o185J890L017l695k338
$$ -6811 -8057 -5944 -2466 -3712 -6769 -7099 -6126 -2146 -338 -549 -6734 -4844 -1827 -5522 -7860
14464g860m29j564k221j764M553J104K021M571R63o696j531P29P243O048k454
$$ -7860 -8289 -9853 -12074 -13838 -9285 -8181 -6160 -1589 -626 -7322 -8853 -8124 -881 5167 2713
14449B713m214r5l908l792K836L917J411k25J884L782k669k496M320j74k442L114
$$ 2713 -1501 -1596 -5504 -9296 -6460 -2543 -1132 -1357 527 4309 1640 -856 3464 3290 848 3962
14433C962p79q90j856j953J465J744q86J030O87k354k252r86j087J507J057K34
$$ 3962 3183 2293 437 -1516 -51 1693 807 1837 2524 170 -2082 -3068 -4155 -2648 -1591 -1357
14417a357q02J808J68j116n19j087p72j2k979J478L246n97j239n46K440K062m19
$$ -1357 -2159 -351 -183 -1299 -1818 -2905 -3677 -3689 -6668 -5190 -1944 -2541 -3780 -4326 -1886 176 -243
14400b43n87j650R06L018j261j950L13j810l832o02Q88M962p88m225j54L137K059
$$ -243 -830 -2480 -1574 1444 183 -1767 -1454 -3264 -7096 -7698 -6810 -1848 -2636 -6861 -7015 -3878 -1819
14383a819Q56j220k374j450P45L70j388q0J562N74k698j071L44j93k0L66L79M378
$$ -1819 -963 -2183 -4557 -6007 -5262 -4892 -6280 -6360 -4798 -4224 -6922 -7993 -7649 -7842 -7862 -7496 -7117 -2739
14365b739K436l55k631l044l490k075K041l93p51P021J1101J33o813j647r33k059
$$ -2739 -303 -658 -3289 -6333 -9823 -11898 -9857 -10250 -11001 -3980 7121 7254 441 -1206 -2139 -4198
14349d198m029k729k310K720P391K257K852L128J7q21m993m478j589J495L195
$$ -4198 -8227 -10956 -13266 -10546 -3155 -898 1954 5082 5099 4278 -715 -5193 -6782 -5287 -2092
14334b092j580k02p44L423J456j162N72J694k761K010M13r22m159j242K459K29
$$ -2092 -3672 -3874 -4618 -1195 261 -901 -329 1365 -1396 614 1027 105 -4054 -5296 -2837 -2608
14318b608K956j113l689j66J633k051k957o3K629l324j526K283j783m55k053K640
$$ -2608 348 -765 -4454 -4620 -2987 -5038 -7995 -8058 -5429 -8753 -10279 -7996 -9779 -10234 -12287 -9647
14302i647N028M642M494o98j803j811k890j624j710l19J165n67j30j10l117J589
$$ -9647 -4619 23 4517 3819 2016 205 -2685 -4309 -6019 -6338 -5173 -5740 -5870 -5980 -9097 -7508
14286g508J75J967J592J977j440j149O95M00P1K593K27o01PK031Q12k295R6L467
$$ -7508 -7333 -5366 -3774 -1797 -3237 -4386 -3691 -3291 -3220 -627 -400 -1001 -994 1037 1849 -446 -350 3117
14268C117j715j264P096K106O089J624M348K452K86j962k023m065k853q4l795
$$ 3117 1402 138 7234 9340 15429 17053 21401 23853 24139 22177 20154 16089 13236 13152 9357
14253I357k091K525J945m929l108K56q58k145K037Q32k311J20L752J47n128n726
$$ 9357 7266 9791 11736 6807 3699 3955 3097 952 2989 3821 1510 1630 5382 5529 401 -5325
14237e325m669K880J828j045L042l80j036l318k111J633L767N15k486J625K034
$$ -5325 -9994 -7114 -5286 -6331 -3289 -3669 -4705 -8023 -10134 -8501 -4734 -4219 -6705 -5080 -3046
14222c046o11K581L240n4j66m27m72j240o345J680J384m99l480P15O545J335o248
$$ -3046 -3657 -1076 2164 2110 1944 1517 1045 -195 -6540 -4860 -3476 -3975 -7455 -6740 -195 1140 -5108
14205e108j188K264o79l32J014j466P05m04m439k809J430K621J570K797M575K16
$$ -5108 -6296 -4032 -4711 -5043 -4029 -5495 -4790 -5194 -9633 -12442 -11012 -8391 -6821 -4024 551 767
14189G67l370l225j101m678K137M773J836K747K263m72j417j146n021j688J011
$$ 767 -2603 -5828 -6929 -11607 -9470 -4697 -2861 -114 2149 1677 260 -886 -5907 -7595 -6584
14174f584k163L603K306r02M839O332k248m723j749j72J030M836J121l729o786
$$ -6584 -8747 -5144 -2838 -3740 1099 7431 5183 460 -1289 -1461 -431 4405 5526 1797 -4989
14159d989k589K571l14J939J942j216K894M24J546r59K117p02j855j011l86l35
$$ -4989 -7578 -5007 -5321 -3382 -1440 -2656 238 662 2208 1249 3366 2664 809 -202 -588 -923
14143i23K182L759k913n386j373P5L47l584K903Q26j52j517j808P75J823j84K102
$$ -923 1259 5018 2105 -3281 -4654 -4579 -4232 -7816 -4913 -4087 -4239 -5756 -7564 -6789 -4966 -5150 -3048
14126c048K319r44k658j790K53J742M632J721M67k017n931L401o95J04q99l895
$$ -3048 -729 -1673 -4331 -6121 -5868 -4126 506 2227 2694 677 -5254 -1853 -2548 -2444 -3343 -7238
14110g238j966M677K352j331j983N26n90L1k225O07j243j338M200q56l810L178
$$ -7238 -9204 -4527 -2175 -3506 -5489 -4963 -5553 -5522 -7747 -7140 -8383 -9721 -5521 -6377 -10187 -7009
14094g009R22m286m102J613L831L906J858k151n032n10K236J358l51K568J629
$$ -7009 -6087 -10373 -14475 -12862 -9031 -5125 -3267 -5418 -10450 -10960 -8724 -7366 -7717 -5149 -3520
14079c520Q14k008j16K45P22j383J072j553m656J792K480o88K990K270k555p251
$$ -3520 -2706 -4714 -4830 -4585 -3863 -5246 -4174 -5727 -10383 -8591 -6111 -6799 -3809 -1539 -4094 -11345
14063a1345m033O29M740J776K907N001P16k027l985k245L361j402j844L141J563
$$ -11345 -15378 -14749 -10009 -8233 -5326 -325 391 -1636 -5621 -7866 -4505 -5907 -7751 -4610 -3047
14048c047K986j270m935L94j045q72k357M214J075O72j619j167K13k308J508N868
$$ -3047 -61 -1331 -6266 -5872 -6917 -7789 -10146 -5932 -4857 -4185 -5804 -6971 -6758 -9066 -7558 -1690
14032a690L11k80J454N13l651j081L75m79O50L3m779p76L327L542J955J696j139
$$ -1690 -1379 -1659 -205 308 -3343 -4424 -4049 -4528 -3878 -3845 -8624 -9400 -6073 -2531 -576 1120 -19
14015a9k880j256l77q96J319M697l206M91n63M62j690k06q80l215o5k22M48p81
$$ -19 -2899 -4155 -4532 -5428 -4109 588 -2618 -2127 -2690 -2228 -3918 -4124 -5004 -8219 -8284 -8506 -8058 -8839
13997h839o99Q56J917M140K323n25n976k160n9j234p5P602K747k119k064m198
$$ -8839 -9538 -8682 -6765 -2625 -302 -827 -6803 -8963 -9022 -10256 -10331 -2729 18 -2101 -4165 -8363
13981h363k918j375N508K192J51l119J959k415j923L250L853o7m818Q24J788M98
$$ -8363 -11281 -12656 -7148 -4956 -4805 -7924 -5965 -8380 -10303 -7053 -3200 -3267 -8085 -7261 -5473 -4975
13965d975Q31k833Q40r2J428R308K195k289j958j315k498m224j626q39l424k115
$$ -4975 -4144 -6977 -6137 -6229 -4801 4507 6702 4413 2455 1140 -1358 -5582 -7208 -8047 -11471 -13586
13949a3586N511M235l772k261J294M149M697J126K56n13l415k940j489J181M314
$$ -13586 -8075 -3840 -7612 -9873 -8579 -4430 267 1393 1649 1136 -2279 -5219 -6708 -5527 -1213
13934a213Q03K975k002m211n025R3k067p58N676M037k728o138j769r6M261M493
$$ -1213 -410 2565 563 -3648 -8673 -8580 -10647 -11405 -5729 -1692 -4420 -10558 -12327 -12423 -8162 -3669
13918c669J133R58J402J103j304k972l64J111p64J457L619k659l330j457j97j207
$$ -3669 -2536 -1578 -176 927 -377 -3349 -3713 -2602 -3366 -1909 1710 -949 -4279 -5736 -5933 -7140
13902g140M498O513L564o260l776j799p46Q60l35M818R66n38O93m461l000J254
$$ -7140 -2642 3871 7435 1175 -2601 -4400 -5146 -4286 -4621 197 1163 625 1318 -3143 -6143 -4889
13886d889K08l551L090J800L49J594J280N90m384l379r11J651N56J638M66K263
$$ -4889 -4681 -8232 -5142 -3342 -2993 -1399 -119 471 -3913 -7292 -8203 -6552 -5996 -4358 -3892 -1629
13870a629k647J690P23l247j186J6l806J620M697l598k701j207K005K828r70l459
$$ -1629 -4276 -2586 -1863 -5110 -6296 -6280 -10086 -8466 -3769 -7367 -10068 -11275 -9270 -6442 -7412 -10871
13854a0871j981M350N98K75J817k238j26o05K820J121J658n62l053J469M075Q74
$$ -10871 -12852 -8502 -7904 -7629 -5812 -8050 -8176 -8781 -5961 -4840 -3182 -3744 -6797 -5328 -1253 -379
13838c79J493j047l908J035J688n500m53j929Q79J431L479N997J283m459n745
$$ -379 1114 67 -3841 -2806 -1118 -6618 -7071 -9000 -8121 -6690 -3211 2786 4069 -390 -6135
13823f135k618p5J518K917L166j968n60K72m62L258M86l082k548K822J66K803
$$ -6135 -8753 -8828 -7310 -4393 -1227 -3195 -3755 -3483 -3945 -687 -201 -3283 -5831 -3009 -2843 -40
13807d0p50l720q31L461J121l016m160J269K247K224J308k330j976k782m244R21
$$ -40 -790 -4510 -5341 -1880 -759 -3775 -7935 -6666 -4419 -2195 -887 -3217 -5193 -7975 -12219 -11298
13791a1298K188r71K942J036m55j38r71K288Q39L35l375J038J862j847k244k07
$$ -11298 -9110 -10081 -7139 -6103 -6558 -6696 -7667 -5379 -4540 -4205 -7580 -6542 -4680 -6527 -8771 -8978
13775h978J939j148K779L036m87j288J885J334n073J399k251k477N269N47o86
$$ -8978 -7039 -8187 -5408 -2372 -2859 -4147 -2262 -928 -6001 -4602 -6853 -9330 -4061 -3514 -4200
13760d200k880j99l6M366L491J30j021k050j33K335J508l187j936j73J277j492
$$ -4200 -7080 -7279 -7315 -2949 542 672 -349 -2399 -2532 -197 1311 -1876 -3812 -3985 -2708 -4200
13744d200m835p47K923Q34j893j406j566k863J192L151K013l674l30L002M898
$$ -4200 -9035 -9782 -6859 -6025 -7918 -9324 -10890 -13753 -12561 -9410 -7397 -11071 -11401 -8399 -3501
13729c501j93n20p19l998l746j741M150J664j848O51L779L857k744j364r98o49
$$ -3501 -3694 -4214 -4933 -8931 -12677 -14418 -10268 -8604 -10452 -9801 -6022 -2165 -4909 -6273 -7271 -7920
13713g920j165M261J89l501j510J894M21L464J767J500K75Q84L624P45n362l275
$$ -7920 -9085 -4824 -4635 -8136 -9646 -7752 -7331 -3867 -2100 -600 -325 559 4183 4928 -434 -3709
13697c709K834J116N49J652L073k107m757n934j477p14r15Q58M746M144q57m549
$$ -3709 -875 241 790 2442 5515 3408 -1349 -7283 -8760 -9474 -10389 -9531 -4785 -641 -1498 -6047
13681f047J678q49J190k732K58R26j67N6j412p83J749j454l366j529L119R64o68
$$ -6047 -4369 -5218 -4028 -6760 -6502 -5576 -5743 -5687 -7099 -7882 -6133 -7587 -10953 -12482 -9363 -8399 -9067
13664i067m86J562M804j671k989j37j513j075j696j177j144L380K380J723K12
$$ -9067 -9553 -7991 -3187 -4858 -7847 -7984 -9497 -10572 -12268 -13445 -14589 -11209 -8829 -7106 -6894
13649f894p94j961P08K448L275k01l148J825J410j425l38M167k430o584K600J153
$$ -6894 -7688 -9649 -8941 -6493 -3218 -3419 -6567 -4742 -3332 -4757 -5095 -928 -3358 -9942 -7342 -6189
13633f189o22j330j689J187K931J438j143l814j636K322m1k251k041K432J956
$$ -6189 -6811 -8141 -9830 -8643 -5712 -4274 -5417 -9231 -10867 -8545 -8586 -10837 -12878 -10446 -8490
13618h490J277K889N27r46J673O88K812m200j03M389M591k088o99P50j951n184
$$ -8490 -7213 -4324 -3797 -4743 -3070 -2382 430 -3770 -3873 516 5107 3019 2320 3070 1119 -4065
13602d065m651M6N417M85m454l55J929j52j383j16N29j14J766j747o91k216k07
$$ -4065 -8716 -8670 -3253 -2768 -7222 -7577 -5648 -5800 -7183 -7299 -6770 -6884 -5118 -6865 -7556 -9772 -9979
13585i979N80j521J243P2K679n21r54P64J179K778l67k220L568q68l956L980M65
$$ -9979 -9399 -10920 -9677 -9605 -6926 -7447 -8401 -7637 -6458 -3680 -4047 -6267 -2699 -3567 -7523 -3543 -3078
13568c078k021N952R27m206n61J210j387l269j357p53K491L783L093j321l879
$$ -3078 -5099 853 1780 -2426 -2987 -1777 -3164 -6433 -7790 -8543 -6052 -2269 824 -497 -4376
13553d376k646M49K495k360R57L097L072j846j807J559L3p7J443q97J331M575
$$ -4376 -7022 -6573 -4078 -6438 -5481 -2384 688 -1158 -2965 -1406 -1373 -1450 -7 -904 427 5002
13537E002M195L427n000j334j578m294j332M031k197m849q17L046L450K827l466
$$ 5002 9197 12624 7624 6290 4712 418 -914 3117 920 -3929 -4746 -1700 1750 4577 1111
13522A111k043j775k350j78L780j508m70N2l571J4j472O81R37j075O339J371k103
$$ 1111 -932 -2707 -5057 -5235 -1455 -2963 -3433 -3381 -6952 -6938 -8410 -7729 -6792 -7867 -1528 -157 -2260
13505b260O43m286m121J245k735Q74M876J250n68j361J397k528K182J49k638K627
$$ -2260 -1617 -5903 -10024 -8779 -11514 -10640 -5764 -4514 -5082 -6443 -5046 -7574 -5392 -5243 -7881 -5254
13489e254M912J504o16m161n207K310p29K321P89L31K005K968J250L764L39j419
$$ -5254 -342 1162 546 -3615 -8822 -6512 -7241 -4920 -4131 -3800 -1795 1173 2423 6187 6526 5107
13473E107K527M624J385k065l463l139j759l466j317J832L160j452n321j459M321
$$ 5107 7634 12258 13643 11578 8115 4976 3217 -249 -1566 266 3426 1974 -3347 -4806 -485
13458d85R16j277N830K359j550o025o308n11J249J590J246J580j784J272K187
$$ -485 431 -846 4984 7343 5793 -232 -6540 -7051 -5802 -4212 -2966 -1386 -3170 -1898 289
13443B89J244m88M65j19J90K016j043L546O62p90j266M224P030N001R254J1340
$$ 289 1533 1045 1510 1391 1581 3597 2554 6100 6762 5972 4706 8930 15960 20961 30215 41555
13427D1555J5388J3922m26j4757j2409j2587p384p122o795k088l274m217j622
$$ 41555 56943 70865 70439 55682 43273 30686 23302 16180 9385 7297 4023 -194 -1816
13414a816L826R95o86k520r87K175L712j958M88m80J551j881k107J199o99J10
$$ -1816 2010 3005 2319 -201 -1188 987 4699 2741 3229 2749 4300 2419 312 1511 812 922
13398I22k849k831L17P72J302J072M168N381j000L296P88K007O287Q95Q795J5747
$$ 922 -1927 -4758 -4441 -3669 -2367 -1295 2873 8254 7254 10550 11338 13345 19632 20527 29322 45069
13382D5069J8655J5187K189n265j5113j7897o835m883p52J1692J5426J8344K1898
$$ 45069 63724 78911 81100 75835 60722 42825 35990 31107 30355 42047 57473 75817 97715
13369I7715J9446J4226N437n737j8183j8751j7725k0074j7117j0685r032l698
$$ 97715 117161 131387 136824 131087 112904 94153 76428 56354 39237 28552 19520 15822
13357A5822n056k481m454m466m73j9L067p26j825L459L634k118l990J714J759
$$ 15822 10766 8285 3831 -635 -1108 -1127 1940 1214 -611 2848 6482 4364 374 2088 3847
13342C847r36j170K259P375M226N363M242j85l099p820p556m113p51p67k582q58
$$ 3847 2911 1741 4000 11375 15601 20964 25206 25021 21922 14102 6546 2433 1682 915 -1667 -2525
13326b525j268m943K842L000J310j054k137l129J470L057Q94J265M283N68l312
$$ -2525 -3793 -8736 -5894 -2894 -1584 -2638 -4775 -7904 -6434 -3377 -2483 -1218 3065 3633 321
13311C21j874M468N4j557k192l990L24M614J439j137p46r9l675r44l67l539j576
$$ 321 -1553 2915 2969 1412 -780 -4770 -4446 168 1607 470 -276 -375 -4050 -4994 -5361 -8900 -10476
13294a0476J577mK01j78o77p13J502M199p38r57m14M357J916r87n06o26k674j939
$$ -10476 -8899 -8903 -8702 -8880 -9557 -10270 -8768 -4569 -5307 -6264 -6678 -2321 -405 -1392 -1898 -2524 -5198 -7137
13276g137K423j01L331k286j04O96P53L842L132L979l483p505m780N47M333L983
$$ -7137 -4714 -4815 -1484 -3770 -3874 -3178 -2425 1417 4549 8528 5045 -2460 -7240 -6693 -2360 1623
13260A623j145l26K733j41k567o29M048J786n123m704K404j431l200J381R67m458
$$ 1623 478 152 2885 2744 177 -452 3596 5382 259 -4445 -2041 -3472 -6672 -5291 -4324 -8782
13244h782j390M863q41R13J16M88J493k838k120J868K326k659j388l260n25q05
$$ -8782 -10172 -5309 -6150 -5237 -5121 -4633 -3140 -5978 -8098 -6230 -3904 -6563 -7951 -11211 -11736 -12541
13228a2541J983M84p73n72L932N530N11k754K09K2J713J451l235m006l070L532
$$ -12541 -10558 -10074 -10847 -11419 -7487 -1957 -1446 -4200 -3991 -3969 -2256 -805 -4040 -8046 -11116 -7584
13212g584L041J627j640m59N043M908n831j494r66j554M719P71j577m246Q2L223
$$ -7584 -4543 -2916 -4556 -5015 28 4936 -895 -2389 -3355 -4909 -190 581 -996 -5242 -5160 -1937
13196a937K552J794L33l015j212J619J5k553J738K826j522r80l033j850j783L181
$$ -1937 615 2409 2742 -273 -1485 134 149 -2404 -666 2160 638 -342 -3375 -5225 -7008 -3827
13180c827p19M34K710n004p18M445M470J807r42n63k324j53L100p56k556r07m89
$$ -3827 -4546 -4112 -1402 -6406 -7124 -2679 1791 3598 2656 2093 -231 -384 2716 1960 -596 -1503 -1992
13163a992k892K454M231Q02m403m443J959L479n081m22J274j97L904j145n782
$$ -1992 -4884 -2430 1801 2603 -1800 -6243 -4284 -805 -5886 -6308 -5034 -5231 -1327 -2472 -8254
13148h254q38L515k22M02K853k92l517j979N453K552k615k148J680K22M741P42
$$ -8254 -9092 -5577 -5799 -5397 -2544 -2836 -6353 -8332 -2879 -327 -2942 -5090 -3410 -3188 1553 2295
13132B295P28j425M20J464j146Q91L88M083m174q150j734J275j016J994j00l759
$$ 2295 3023 1598 2018 3482 2336 3227 3615 7698 3524 -4626 -6360 -5085 -6101 -4107 -4207 -7966
13116g966K870K766Q90K331M57o0M974J275j940k145M2J421J734j310n740l725
$$ -7966 -5096 -2330 -1440 891 1348 1288 6262 7537 5597 3452 3494 4915 6649 5339 -401 -4126
13100d126L05j680K118L560K579Mo270R57L885K465Q7O15Q25j959o16P27j130
$$ -4126 -3821 -5501 -3383 177 2756 2760 -3510 -2553 1332 3797 3884 4499 5324 3365 2749 3476 2346
13083B346M921m71k784n079o402p87R31o08o07m50L535L891K779j089k450j269
$$ 2346 7267 6796 4012 -1067 -7469 -8256 -7325 -7933 -8540 -8990 -5455 -1564 1215 126 -2324 -3593
13067c593j35Q3L541K225j162o81M214K158j996n297n799l284L789L82j167m06
$$ -3593 -3728 -3645 -104 2121 959 278 4492 6650 4654 -643 -6442 -9726 -5937 -5555 -6722 -7128
13051g128J033J575L318J631K698k258K049M56j760J312K922N527M519l870n172
$$ -7128 -6095 -4520 -1202 429 3127 869 2918 3374 1614 2926 5848 11375 15894 12024 6852
13036F852l302l105l201l431j082j826n82j488J053M318J993K587J452L75J561
$$ 6852 3550 445 -2756 -6187 -7269 -9095 -9677 -11165 -10112 -5794 -3801 -1214 238 613 2174
13021B174L475N061Q825M318K975k243k131k820k972o097k764k975m786m343j656
$$ 2174 5649 10710 19535 23853 26828 24585 22454 19634 16662 10565 7801 4826 40 -4303 -5959
13006e959J328L259j010K570J098p06n141m17J845o47k882k121K706K851L202
$$ -5959 -4631 -1372 -2382 188 1286 580 -4561 -4978 -3133 -3780 -6662 -8783 -6077 -3226 -24
12991b4M575L045j290r36k269P3k949k957p7K349M42n8N35R18m94k30K630J232
$$ -24 4551 7596 6306 5370 3101 3174 225 -2732 -2809 -460 -18 -76 459 1377 883 653 3283 4515
12973D515J107j347J637j173k134k836l757R96M169R10J188k189k987k128j31
$$ 4515 5622 4275 5912 4739 2605 -231 -3988 -2992 1177 2087 3275 1086 -1901 -4029 -4160
12958d160l64J732J47N607J107l64K87m090n461n67J522Q44j786K260j15k017
$$ -4160 -4524 -2792 -2645 2962 4069 3705 3992 -98 -5559 -6126 -4604 -3760 -5546 -3286 -3401 -5418
12942e418L703j015J448L09j355m08p81L482P26k379K567J483j052p37M891L562
$$ -5418 -1715 -2730 -1282 -973 -2328 -2736 -3517 -35 691 -1688 879 2362 1310 573 5464 9026
12926I026k555j850l12m248O96j534m692j738P25J049P364J414k572o80p52n528
$$ 9026 6471 4621 4309 61 757 -777 -5469 -7207 -6482 -5433 1931 3345 773 93 -659 -6187
12910f187k107j631K532q82J099l3J034L38R91j714k23M326k8J116Q104m47o264
$$ -6187 -8294 -9925 -7393 -8275 -7176 -7209 -6175 -5837 -4846 -6560 -6783 -2457 -2485 -1369 6735 6288 24
12893B4j944L12L711j924k395k690K349N852Q21k597k060m00n24N40l083J109
$$ 24 -1920 -1608 2103 179 -2216 -4906 -2557 3295 4116 1519 -541 -941 -1465 -925 -4008 -2899
12877b899r7R80l185J884K701j995J944K075K444j610r03j612M205j047k640J149
$$ -2899 -2996 -2016 -5201 -3317 -616 -2611 -667 1408 3852 2242 1339 -273 3932 2885 245 1394
12861A394J88j450k231m827m056M282O326k48R97K88M877q60J9J47J890J568j020
$$ 1394 1582 132 -2099 -6926 -10982 -6700 -374 -622 375 663 5540 4680 4699 4846 6736 8304 7284
12844G284k53m128n901n072J76O70n03M652L212J167j09j540k588K315K852m142
$$ 7284 7031 2903 -2998 -8070 -7894 -7224 -7727 -3075 137 1304 1195 -345 -2933 -618 2234 -1908
12828a908n298Q81J366J517L328k129k181K030L926J6o45n05q30p419m25L232
$$ -1908 -7206 -6325 -4959 -3442 -114 -2243 -4424 -2394 1532 1548 903 398 -432 -7851 -8276 -5044
12812e044J152N509k949k767J866N35K168o19N370P002k002j264l768k826O06
$$ -5044 -3892 1617 -1332 -4099 -2233 -1698 470 -149 5221 12223 10221 8957 5189 2363 2969
12797B969J093j850L9j777J184K282n164j45j346L621K594q90l038L164r13l068
$$ 2969 4062 2212 2251 474 1658 3940 -1224 -1369 -2715 906 3500 2610 -428 2736 1823 -1245
12781a245k542q93K998j012k513M040L398J611m18k822m843k101K151O174J739
$$ -1245 -3787 -4680 -1682 -2694 -5207 -1167 2231 3842 3424 602 -4241 -6342 -4191 1983 3722
12766C722k721j333k941K159J534j605J214q45j208M56J70J071M232k499n517
$$ 3722 1001 -332 -3273 -1114 420 -1185 29 -816 -2024 -1568 -1398 -327 3905 1406 -4111
12751d111Q92L786P38K886L899m405m592l130m08K401J88K627j656q198j725m05
$$ -4111 -3219 567 1305 4191 8090 3685 -907 -4037 -4445 -2044 -1856 771 -885 -9083 -10808 -11213
12735a1213M973M992J639K458L851j19K40j043k829K069r17p961l800J783p33
$$ -11213 -6240 -1248 391 2849 6700 6581 6821 5778 2949 5018 4101 -3860 -7660 -5877 -6610
12720f610k933l353j004J490J245K163N239M691j128j537k058k131K031K211j126
$$ -6610 -9543 -12896 -13900 -12410 -11165 -9002 -3763 928 -200 -1737 -3795 -5926 -3895 -1684 -2810
12705b810j129J405J674J049q85j64l349j120j478L772M182P19k446N83k33P25
$$ -2810 -3939 -2534 -860 189 -696 -860 -4209 -5329 -6807 -3035 1147 1866 -580 3 -230 495
12689D95K632K479k052n811m290j913n36L139j425J650J407k3K0j229L824K758
$$ 495 3127 5606 3554 -2257 -6547 -8460 -8996 -5857 -7282 -5632 -4225 -4248 -4228 -5457 -1633 1125
12673A125J81m027k217K81J845M8J691n27O21m04k518k268j557L94m83P366M800
$$ 1125 1306 -2721 -4938 -4657 -2812 -2764 -1073 -1600 -979 -1383 -3901 -6169 -7726 -7332 -7815 -449 4351
12656D351j217j881M74o46k382K120J030m539J310L232J51o299j838N799J483
$$ 4351 3134 1253 1727 1081 -1301 819 1849 -2690 -1380 1852 2003 -4296 -6134 -335 1148
12641A148m382r78Q19r15K155j066L348J915K50J623P97J744o187j775j25m208
$$ 1148 -3234 -4212 -3393 -4308 -2153 -3219 129 2044 2294 3917 4714 6458 271 -1504 -1629 -5837
12625e837m79n72K009K655K127K844j203j431L249l25k233l156j090P63P29j968
$$ -5837 -6316 -6888 -4879 -2224 -97 2747 1544 113 3362 3037 804 -2352 -3442 -2679 -1950 -3918
12609c918j362l98L395j510j749L461N927j955j120n85J460k32J615R46J944L04
$$ -3918 -5280 -5678 -2283 -3793 -5542 -2081 3846 1891 771 186 1646 1414 3029 3975 5919 6223
12593F223k643k272l626m20K559K630k308j519k04j742k411k415M635N546J674
$$ 6223 3580 1308 -2318 -2738 -179 2451 143 -1376 -1580 -3322 -5733 -8148 -3513 2033 3707
12578C707k038l956j293q60o67l461j569L682M024K497n37m403j256j798O11j810
$$ 3707 1669 -2287 -3580 -4440 -5107 -8568 -10137 -6455 -2431 66 -471 -4874 -6130 -7928 -7317 -9127
12562i127l295J224M843p22l521J085J899j527K770J351J640m485K714M203j127
$$ -9127 -12422 -11198 -6355 -7077 -10598 -9513 -7614 -9141 -6371 -5020 -3380 -7865 -5151 -948 -2075
12547b075J420K300k414K280K53k975o1R86J389k598K020L820J373q52j082k15
$$ -2075 -655 1645 -769 1511 1764 -1211 -1272 -286 1103 -1495 525 4345 5718 4866 3784 3569
12531C569O55K872Q47J459p50n192l365p59N335K618J655l809o55J142j258M31
$$ 3569 4224 7096 7943 9402 8652 3460 95 -664 4671 7289 8944 5135 4480 5622 4364 4795
12515D795J027L28J566j471J05k917n048j531j808k83Q67J252K385L848L264l242
$$ 4795 5822 6150 7716 6245 6350 3433 -1615 -3146 -4954 -5237 -4370 -3118 -733 3115 6379 3137
12499C137K716P19p30n46j463m2l455J03L653K237k259j753k080J547N698j215
$$ 3137 5853 6572 5842 5296 3833 3791 336 439 4092 6329 4070 2317 237 1784 7482 6267
12483F267m513k305K324L380L294j064k631Lk977K2l430J843R14L344L108O054
$$ 6267 1754 -551 1773 5153 8447 7383 4752 4755 1778 1800 -1630 213 1127 4471 7579 13633
12467A3633l848m922l879k584k62J879L29K501J641n15r4k40J018K228J189k080
$$ 13633 9785 4863 984 -1600 -1862 17 346 2847 4488 3973 3879 3639 4657 6885 8074 5994
12451E994J03n46m90k50J10j427J496K963j126k781l329n57J011k987j67P63k433
$$ 5994 6097 5551 5061 4811 4921 3494 4990 7953 6827 4046 717 160 1171 -1816 -1983 -1220 -3653
12434c653O42M186R77M120p14J92J58j49K48r46J298J832K645P64p2M161J181
$$ -3653 -3011 1175 2152 6272 5558 5750 5908 5759 6007 5061 6359 8191 10836 11600 11528 15689 16870
12417A6870O35L29j780k302j133K815Ql122l879k90M284N73k845J055J20l207
$$ 16870 17505 17834 16054 13752 12619 15434 15442 12320 8441 8151 12435 13008 10163 11218 11338 8131
12401H131n200o79K261J185M200Q7k288L500j302k153p42o50J987K424N550M594
$$ 8131 2931 2252 4513 5698 9898 9985 7697 11197 9895 7742 7000 6350 8337 10761 16311 20905
12385B0905q74m204j908n69l172o419L867P740L400m086J22R57j098q05j676K070
$$ 20905 20031 15827 13919 13350 10178 3759 7626 15366 18766 14680 14802 15759 14661 13856 12180 14250
12369A4250K641M240K709l315j424k371j846j435m466j030j579l159k879l437
$$ 14250 16891 21131 23840 20525 19101 16730 14884 13449 8983 7953 6374 3215 336 -3101
12355c101O134P592K701L004J421j643J68M090J603n402k431k40M530N649k713
$$ -3101 3033 10625 13326 16330 17751 16108 16276 20366 21969 16567 14136 13896 18426 24075 21362
12340B1362m846j521l585p237j815L517k512J679K468k395o119l414L863J529
$$ 21362 16516 14995 11410 4173 2358 5875 3363 5042 7510 5115 -1004 -4418 -555 974
12326I74K684M97j103J192N50J780L262J536k252j890K300K59j118J849L097J492
$$ 974 3658 4155 3052 4244 4794 6574 9836 11372 9120 7230 9530 9789 8671 10520 13617 15109
12310A5109k317p94L376P69l788K056K468j657j822N83n01k367K080L153k525
$$ 15109 12792 11998 15374 16143 12355 14411 16879 15222 13400 13983 13482 11115 13195 16348 13823
12295A3823n353l86N537K470k377k140k1M162P40O06J460R69m666n173m37J338
$$ 13823 8470 8084 13621 16091 13714 11574 11553 15715 16455 17061 18521 19490 14824 9651 9214 10552
12279A0552N259L090m556op49J08Q12j056J671j270K524P92l335n036j732K369
$$ 10552 15811 18901 14345 14339 13590 13698 14510 13454 15125 13855 16379 17171 13836 8800 7068 9437
12263I437L237L373J134j951m90K715k092k04l64Q62k792O38M803J536j697J212
$$ 9437 12674 16047 17181 15230 14740 17455 15363 15159 14795 15657 12865 13503 18306 19842 18145 19357
12247A9357K985K087k592L151p07J25J519k806j233l988lj515m27p27K70K247
$$ 19357 22342 24429 21837 24988 24281 24406 25925 23119 21886 17898 17895 16380 15953 15226 15496 17743
12231A7743M438O91l385j523K89n48M653L06k665l98P83R25o95K317j206J038
$$ 17743 22181 22872 19487 17964 18253 17705 22358 22664 19999 19601 20384 21309 20614 22931 21725 22763
12215B2763k301p34J7M16K309k925J121l445k296L195n2m64o3k016N411L748n410
$$ 22763 20462 19728 19745 20161 22470 19545 20666 17221 14925 18120 18068 17604 17541 15525 20936 24684 19274
12198A9274o8J683l477m06K92n72k666k90J723M62J413J727K390p27n309p062
$$ 19274 19206 20889 17412 17006 17298 16726 14060 13770 15493 15955 17368 19095 21485 20758 15449 8387
12182H387k967r34L112N105K531J296N73l839J02K681N351J130k319m98o08k168
$$ 8387 5420 4486 7598 12703 15234 16530 17103 13264 13366 16047 21398 22528 20209 19711 19103 16935
12166A6935J974M59J777p08n187l208N62K760j36m671k497l000J46L242M349K686
$$ 16935 18909 19368 21145 20437 15250 12042 12604 15364 15228 10557 8060 5060 5206 8448 12797 15483
12150A5483k958P29M940N01J297m175o167K788K340l20J293k810j976l324L14
$$ 15483 12525 13254 18194 18695 19992 15817 9650 12438 14778 14458 15751 12941 10965 7641 7955
12135G955j507J149j461j193L374O255j471p29M51k500m148l39J825n69n366K262
$$ 7955 6448 7597 6136 4943 8317 14572 13101 12372 12823 10323 6175 5836 7661 7092 1726 3988
12119C988M861J24l188m330L805p34o084j366L265o09j661j397L605L283L698
$$ 3988 8849 8973 5785 1455 5260 4526 -1558 -2924 341 -268 -1929 -3326 279 3562 7260
12104G260J606K0l109k969J195J229k189j868J083Q14k447j165K443J996M00m81
$$ 7260 8866 8886 5777 2808 4003 5232 3043 1175 2258 3072 625 -540 1903 3899 4299 3818
12088C818R31J344K222n057m304K072j411p32J934K692K572j0m75R38J982k520
$$ 3818 4749 6093 8315 3258 -1046 1026 -385 -1117 817 3509 6081 6071 5596 6534 8516 5996
12072E996l888m232M88L252K455l41j039j736j432j129L033L527J879m294k919
$$ 5996 2108 -2124 -1636 1616 4071 3730 2691 955 -477 -1606 1427 4954 6833 2539 -380
12057c80K264J393K521N469m987p719K535K373j576q79r04J793J725j152Q45K707
$$ -380 1884 3277 5798 11267 6280 -1439 1096 3469 1893 1014 110 1903 3628 2476 3321 6028
12041F028p10l73K179k230n14J747K516N79K552n34K364L170n62n713k010m135
$$ 6028 5318 4945 7124 4894 4380 6127 8643 9222 11774 11240 13604 16774 16212 10499 8489 4354
12025D354l926J739N10J599J3r7K332K222k748p39j376J323Q22n151m265N635
$$ 4354 428 2167 2677 4276 4289 4192 6524 8746 5998 5259 3883 5206 6028 877 -3388 2247
12009B247M569k342q45J020L162n543o718R50M785J396J678N21j489K007r03R21
$$ 2247 6816 4474 3629 4649 7811 2268 -4450 -3500 1285 2681 4359 4880 3391 5398 4495 5416
11993E416L663j192K0O08q64n569M80k214k438K300J35m08l701j694K536n8Q93
$$ 5416 9079 7887 7907 8515 7651 2082 2562 348 -2090 210 345 -63 -3764 -5458 -2922 -2980 -2087
11976b087N103M588K123m89l921L845j387j910K586j453l820J785J548k160j416
$$ -2087 3016 7604 9727 9238 5317 9162 7775 5865 8451 6998 3178 4963 6511 4351 2935
11961B935j72J708m72K073J385J246J254J838K003k159n494K25J422j61l436p30
$$ 2935 2763 4471 3999 6072 7457 8703 9957 11795 13798 11639 6145 6370 7792 7631 4195 3465
11945C465J279k054m234J112O492N086m519m663J057K933j700l767j614k144j619
$$ 3465 4744 2690 -1544 -432 6060 11146 6627 1964 3021 5954 4254 487 -1127 -3271 -4890
11930d890k15M508K012j887K882K172q34l729K015M88M321N794L28n210l626p14
$$ -4890 -5105 -597 1415 -472 2410 4582 3748 19 2034 2522 6843 12637 12965 7755 4129 3415
11914C415r59j584r98m23K929J75J231J365N020j735k254j758k778J692O23j593
$$ 3415 2456 872 -126 -549 2380 2555 3786 5151 10171 8436 6182 4424 1646 3338 3961 2368
11898B368K147k835j978r21M427j927l073K373N872L298m7k446Q16p63m629m125
$$ 2368 4515 1680 -298 -1219 3208 1281 -1792 581 6453 9751 9704 7258 8074 7311 2682 -1443
11882a443j540L426L262j560p6K566K691m124q56O4M139J775n838o79O319N82
$$ -1443 -2983 443 3705 2145 2069 4635 7326 3202 2346 2410 6549 8324 2486 1807 8126 8708
11866H708M74K519J283l619j686l674K817N469L24k327J096K258L368k037N71
$$ 8708 9182 11701 12984 9365 7679 4005 6822 12291 12615 10288 11384 13642 17010 14973 15544
11851A5544K169L852M713R005J0106L579o157q013n330q374p893k801J676M160
$$ 15544 17713 21565 26278 35283 45389 48968 42811 34798 29468 21094 13201 10400 12076 16236
11837A6236O03j873o405m898n35j914m100J936J235K861n76J990M217k332m665
$$ 16236 16839 14966 8561 3663 3128 1214 -2886 -950 285 3146 2570 4560 8777 6445 1780
11822A780l56m858p03j73O283M032j711K604J06m146Q97k211j85L250M127M147
$$ 1780 1424 -3434 -4137 -4310 1973 6005 4294 6898 7004 2858 3755 1544 1359 4609 8736 12883
11806A2883K260k803j498K661J69O82n51k24k129J405k988l079K328R35l67j789
$$ 12883 15143 12340 10842 13503 13672 14354 13803 13579 11450 12855 9867 6788 9116 10051 9684 7895
11790G895m323n81J623J319l84M221L070j423n093q71J257J002K75k995J822J095
$$ 7895 3572 2991 4614 5933 5549 9770 12840 11417 6324 5453 6710 7712 7987 4992 6814 7909
11774G909K677J948k86P31j866l302k812M055L617L030K471r17p590k755N81J65
$$ 7909 10586 12534 12248 12979 11113 7811 4999 9054 12671 15701 18172 17255 9665 6910 7491 7656
11758G656k273P21o24K750K618J759p18j541l18j649K435J918k583q378Q96J388
$$ 7656 5383 6104 5480 8230 10848 12607 11889 10348 10030 8381 10816 12734 10151 1773 2669 4057
11742D057k379K056k46J336L290K720N974J632j731l660R8J180k277k920l31K091
$$ 4057 1678 3734 3488 4824 8114 10834 16808 18440 16709 13049 13147 14327 12050 9130 8799 10890
11726A0890K736m274k217J123L02k07M422j110m322o11k869j941o15N787O257
$$ 10890 13626 9352 7135 8258 8560 8353 12775 11665 7343 6732 3863 1922 1307 7094 13351
11711A3351j058j367K878L672K62l906J468M370p79m385o22l422J417K91o90l485
$$ 13351 12293 10926 13804 17476 17738 13832 15300 19670 18891 14506 13884 10462 11879 12170 11480 7995
11695G995p09L781J208O79l063k555j571J855P200P72j46l577k333m870j935k789
$$ 7995 7286 11067 12275 12954 9891 7336 5765 7620 14820 15592 15446 11869 9536 4666 2731 -58
11679e8o97r34J027P85K419N32K959N745l67o275j679J782J24L472K644k403j080
$$ -58 -755 -1689 -662 123 2542 3074 6033 11778 11411 5136 3457 5239 5363 8835 11479 9076 7996
11662G996k931K348N286l194J400L524j063k583J19J899j676j25O498m05N03J770
$$ 7996 5065 7413 12699 9505 10905 14429 13366 10783 10902 12801 11125 11000 17498 17093 17596 19366
11646A9366q15l013Q40r70k373J386k698L60l93l676K218r75J501M58j997m711
$$ 19366 18551 15538 16378 15408 13035 14421 11723 12083 11690 8014 10232 9257 10758 11216 9219 4508
11630D508l892N593N952M559r54m489M4j035R97r76J156M28j331qJ473k277l001
$$ 4508 616 6209 12161 16720 15766 11277 11321 10286 11283 10307 11463 11891 10560 10552 12025 9748 6747
11613F747L076J037o87l516j871J782O379O63j088j395L71j718K923J045j1j59
$$ 6747 9823 10860 10173 6657 4786 6568 12947 13610 12522 11127 11498 9780 12703 13748 13737 13578
11597A3578j98P79m52J819K995M78m323k678Q03k033J443K010j5j829o47J153
$$ 13578 13380 14159 13707 15526 18521 18999 14676 11998 12801 10768 12211 14221 14206 12377 11730 12883
11581A2883K696j91kM80l92j997J65R00L662k981j247K285j001j950m395k459
$$ 12883 15579 15388 15386 15866 15474 13477 13642 14542 18204 15223 13976 16261 15260 13310 8915 6456
11565F456N59L43n41K004j0J83J13l027Q81M899J508j126M35L008J998j011j992
$$ 6456 7015 7358 6817 8821 8811 8994 9107 6080 6961 11860 13368 12242 12677 15685 17683 16672 14680
11548A4680O37k909M155q36n736J772j75j026J474J784O125L544j770n763m581
$$ 14680 15317 12408 16563 15727 9991 11763 11588 10562 12036 13820 19945 23489 21719 15956 11375
11533A1375k030K970R47k935k581r22K328M977J442j212L324K322K238j917j196
$$ 11375 9345 12315 13262 10327 7746 6824 9152 14129 15571 14359 17683 20005 22243 20326 19130
11518A9130o81j961j521k036n679k256M395J949J073J192J640K660k770Q06k502
$$ 19130 18449 16488 14967 12931 7252 4996 9391 11340 12413 13605 15245 17905 15135 15941 13439
11503A3439m354M5J74J79K550K52K883j697k13J221N078M56j497o08k520l328
$$ 13439 9085 9130 9304 9483 12033 12285 15168 13471 13258 14479 19557 20013 18516 17908 15388 12060
11487A2060j59j871j924J762P90J684p16J013k36m107N56K764M61M73n063l092
$$ 12060 11901 10030 8106 9868 10658 12342 11626 12639 12403 8296 8852 11616 12077 12550 7487 4395
11471D395M090Q886p86p07j37l045J042j400j79k160N44L15K542L078j078j671
$$ 4395 8485 17371 16585 15878 15741 12696 13738 12338 12159 9999 10543 10858 13400 16478 15400 13729
11455A3729R70O36l591L289q26k669k932M002P7j816m068k473J710J054j742K405
$$ 13729 14699 15335 11744 15033 14207 11538 8606 12608 12685 10869 6801 4328 6038 7092 5350 7755
11439G755M302J977M383o72l685r62k011n061j899N383K592N300N49J421j314
$$ 7755 12057 14034 18417 17745 14060 13098 11087 6026 4127 9510 12102 17402 17951 19372 18058
11424A8058k733m685j540J786J906j40j934l186K491M555P88l782J550j870o993
$$ 18058 15325 10640 9100 10886 12792 12652 10718 7532 10023 14578 15366 11584 13134 11264 4271
11409D271l162r4L846K451L919O535L760n22m001K155K443j912m246K280k85l563
$$ 4271 1109 1015 4861 7312 11231 17766 21526 21004 17003 19158 21601 19689 15443 17723 17438 13875
11393A3875L516K568j373J312K528k127l653r44J013L108L384J30l057m82k319
$$ 13875 17391 19959 18586 19898 22426 20299 16646 15702 16715 19823 23207 23337 20280 19798 17479
11378A7479m216k519K090K233k134K577J509m46K794j572k55K535L07Q46k066
$$ 17479 13263 10744 12834 15067 12933 15510 17019 16573 19367 17795 17540 20075 20382 21228 19162
11363A9162m31k052K98M603L858l346m339k239L45n90q90q76L563M527Q48l286
$$ 19162 18731 16679 16977 21580 25438 22092 17753 15514 15859 15269 14379 13503 17066 21593 22441 19155
11347A9155J277J196K354m008k414k794j413N000L315m8j771j142L718J776p9
$$ 19155 20432 21628 23982 19974 17560 14766 13353 18353 21668 21620 19849 18707 22425 24201 24122
11332B4122n83J24K250l141Q0R53j316j740j947q18m46O63K372J030M012K913
$$ 24122 23539 23663 25913 22772 22852 23805 22489 20749 18802 17984 17538 18201 20573 21603 25615 28528
11316B8528j146Q05n84k888p20O15j779P23P2j377k269l581K129J205n446l432
$$ 28528 27382 28187 27603 24715 23995 24610 22831 23554 23626 22249 19980 16399 18528 19733 14287 10855
11300A0855k010J046L654L740J916N137K81J411J580j430J243L356J286O84L005
$$ 10855 8845 9891 13545 17285 19201 24338 24619 26030 27610 26180 27423 30779 32065 32749 35754
11285C5754Q701J1305J9756K0100K2722J4001m065j8916k2433k0715j2638r414
$$ 35754 44455 55760 75516 95616 118338 132339 128274 109358 86925 66210 53572 44158
11273D4158q059j704m15l448J352j59m82k755r85J075K486L104l022k605P65n65
$$ 44158 36099 34395 33980 30532 31884 31725 31243 28488 27503 28578 31064 34168 31146 28541 29306 28741
11257B8741m364j99j77R42K643l458K93K188j947K43k336P3N878L173m186j764
$$ 28741 24377 24178 24001 24943 27586 24128 24421 26609 24662 24905 22569 22642 28520 31693 27507 25743
11241B5743j897L550L886j30j75J155o20m270j596J114L952K125M887L208K34
$$ 25743 23846 27396 31282 31152 30977 32132 31512 27242 25646 26760 30712 32837 37724 40932 41166
11226D1166L76k717l999r56m80M033O057m53j424K273j979n603J73l853k104k346
$$ 41166 41542 38825 34826 33870 33390 37423 43480 43027 41603 43876 41897 36294 36467 32614 30510 28164
11210B8164j043M976L192k020m404J475J386N72P83k009K12L500N651Q328J1616
$$ 28164 27121 32097 35289 33269 28865 30340 31726 32298 33081 31072 31284 34784 40435 48763 60379
11195F0379J0360M582M831l119o340j2683o638k421n683m082J296k495L732J005
$$ 60379 70739 75321 80152 77033 70693 58010 51372 48951 43268 39186 40482 37987 41719 42724
11181D2724k577k092l555m550o018j241L692J687J810N12l38j761R03J375J791
$$ 42724 40147 38055 34500 29950 23932 22691 26383 28070 29880 30392 30054 28293 29196 30571 32362
11166C2362K56J071j666K404K20J27K029q26K089q9l92m59O122P523K460J745
$$ 32362 32618 33689 32023 34427 34647 34774 36803 35977 38066 37977 37585 37126 43248 50771 53231 54976
11150E4976L531J0902J1564J1692J1658J0877J134o591p273o385r769q315p415
$$ 54976 58507 69409 80973 92665 104323 115200 116334 109743 102470 96085 86316 78001 70586
11137G0586p695o086m637l694q12l408j23k546r76r6K508N141j272l698j531o66
$$ 70586 62891 56805 52168 48474 47662 44254 44131 41585 40609 40513 43021 48162 46890 43192 41661 40995
11121D0995K149l41j129j725m139M34O670M943K630N964O390l68l388l177l138
$$ 40995 43144 42803 41674 39949 35810 36244 42914 47857 50487 56451 62841 62473 59085 55908 52770
11106E2770l647n580l679j027m90j401j31K270j764r24J987J731O36K126J796
$$ 52770 49123 43543 39864 38837 38347 36946 36815 39085 37321 36397 38384 40115 40751 42877 44673
11091D4673M485k072m000k188m90l128k459K359J262j292l13K594L00O48L64P60
$$ 44673 49158 47086 43086 40898 40408 37280 34821 37180 38442 37150 36837 39431 39731 40379 40743 41503
11075D1503Q73l90N342L784M256J881n143k102r46J582K053N75O000Q727J4351
$$ 41503 42376 41986 47328 51112 55368 57249 52106 50004 49058 50640 52693 53268 59268 67995 82346
11060H2346J2508J1123O184L126k101n413j0111j6784j2287q919k635m599l244
$$ 82346 94854 105977 112161 115287 113186 107773 97662 80878 68591 59672 57037 52438 49194
11047D9194k637J336R09k045n29J067k262k019Q969J0502J0070P998P633Q016
$$ 49194 46557 47893 48802 46757 46228 47295 45033 43014 51983 62485 72555 80553 88186 96202
11033I6202J831K315P447R337J0430J2283J0592J4977J9492K6529L5003L8735
$$ 96202 98033 100348 107795 117132 127562 139845 150437 165414 184906 211435 246438 285173
11021B85173N5549P8516J19901J94684K89762L87581M29111L48518J62566q5826
$$ 285173 340722 419238 539139 733823 1023585 1411166 1840277 2188795 2351361 2265535
11011B265535k89996l92946l93948l24246k44127j62067j06053p2084m4758l2747
$$ 2265535 1975539 1582593 1188645 864399 620272 458205 352152 280068 235310 202563
11001B02563k5231j9695j9532j5713j0244q107n149j570n11k290J37L266k083
$$ 202563 177332 157637 138105 122392 112148 104041 98892 97322 96811 94521 94658 97924 95841
10988I5841o572j698m120o7j328P64K655O557K99k445p8K19K529n476n980m65
$$ 95841 89269 87571 83451 83384 82056 82820 85475 92032 92331 89886 89808 90027 92556 87080 81100 80635
10972H0635L655K602p26o116l696j975k725j942j857p89j249j610k120J422J355
$$ 80635 84290 86892 86166 80050 76354 74379 71654 69712 67855 67066 65817 64207 62087 63509 64864
10957F4864k508k52J98l74l403k262P8L05J993j015l169J356L537M496L582J391
$$ 64864 62356 62104 62302 61928 58525 56263 56341 56646 58639 57624 54455 55811 59348 63844 67426 68817
10941F8817J389M474L287J639R24M701J1833L392J253j759p58m437n744Q16N10
$$ 68817 70206 74680 77967 79606 80530 85231 97064 100456 101709 99950 99192 94755 89011 89827 90337
10926I0337K0l176k76m569j131k87j615n664j4318j2362j3281r176q96N349J6936
$$ 90337 90357 87181 86905 82336 81205 80918 79303 73639 59321 46959 33678 24502 23606 28955 45891
10911D5891J5207J7665J1822M967J187o29o80k614K699o56n278o359o168p709
$$ 45891 61098 78763 90585 95552 96739 96110 95430 92816 95515 94859 89581 83222 77054 69345
10897F9345j0002r797m074o332q30J995N423J2190J4118J4832J1853P511N473
$$ 69345 59343 49546 45472 39140 38310 40305 45728 57918 72036 86868 98721 106232 111705
10884A11705O179K835o49l904q502j955j585o39M647N245P9r38K174j678N466
$$ 111705 117884 120719 120070 116166 107664 105709 104124 103485 108132 113377 113456 112518 114692 113014 118480
10869A18480P227M419O433j024K62J417N078R033J9270M5551M5056M7688M3224
$$ 118480 125707 130126 136559 135535 135797 137214 142292 151325 170595 216146 261202 308890 352114
10856C52114K6988L429k0506l5098l4886l1958k5439k7108j9083j1819o180n190
$$ 352114 379102 382531 362025 326927 292041 260083 234644 207536 188453 176634 170454 165264
10844A65264k078J88P33p95J714l40m018n357J943q59N277R745J2669J2999J4614
$$ 165264 163186 163374 164107 163312 165026 164686 160668 155311 157254 156395 161672 171417 184086 197085 211699
10829B11699J0192O724J1537J2969J3887O762P102Q043J5186K0313J9799K2141
$$ 211699 221891 228615 240152 253121 267008 273770 280872 288915 304101 324414 344213 366354
10817C66354K5960L6907M9265P4229J17104J76175K69821L77856M44719M11791
$$ 366354 392314 429221 478486 552715 669819 845994 1115815 1493671 1938390 2350181
10807B350181K57181K3318k19091l68273m02004l43941k48790j53507p8647k5651
$$ 2350181 2607362 2630680 2411589 2043316 1641312 1297371 1048581 895074 816427 790776
10797G90776r156k9298o7700j05006j45192j65018j50833j20700p8734l5339r919
$$ 790776 781620 752322 684622 579616 434424 269406 118573 -2127 -80861 -116200 -126119
10786a26119n45L992J4264J6277J8734J8531J4663J2174J1798P408L314J756Q927
$$ -126119 -126664 -122672 -108408 -92131 -73397 -54866 -40203 -28029 -16231 -8823 -5509 -3753 5174
10773E174J1113J5432J7269J4124J3300N614l068q731l187J237Q704K2007L5980
$$ 5174 16287 31719 48988 63112 76412 82026 78958 70227 67040 68277 76981 98988 134968
10760A34968N3512N7826M7843L2522P198j7440k2881k7779k4644k1577j3130q973
$$ 134968 188480 246306 294149 326671 333869 316429 293548 265769 241125 219548 206418 197445
10748A97445r506l065l769j649L373k11k766J408M564P567J5379K2372L2910M3894
$$ 197445 187939 184874 181105 179456 182829 182618 179852 181260 185824 193391 208770 231142 264052 307946
10734C07946N1091N6844O3884O8165M7322J5097o506j9764k0474j4077j3547k1967
$$ 307946 359037 415881 479765 547930 595252 610349 603843 584079 563605 549528 535981 514014
10722E14014l5842m0971l5114k8453k1137j4854j2495j981K080N363J0288J0568
$$ 514014 478172 437201 402087 373634 352497 337643 325148 323167 325247 330610 340898 351466
10710C51466K4408M0288O6682R7863P8276N204m6583o2534n6434m3956k5112r007
$$ 351466 375874 416162 482844 580707 658983 664187 617604 555070 498636 454680 429568 420561
10698D20561N328J0760J3378J3416R206N802L618N246O255J1310J0322M648O450
$$ 420561 425889 436649 450027 463443 472649 478451 482069 487315 493570 504880 515202 519850 526300
10685E26300R531J4072J6009J5906K3608J9169K2297K6023K8173L5325L1556L0502
$$ 526300 535831 549903 565912 581818 605426 624595 646892 672915 701088 736413 767969 798471
10673G98471K1605J6542R552J193L343P248R222K4041L8990M6570M8383M9327
$$ 798471 820076 836618 846170 847363 850706 857954 867176 891217 930207 976777 1025160 1074487
10661A074487M5004L3688L1967L0236M2112N5503P0743R0340J09380J20532J16041
$$ 1074487 1119491 1153179 1185146 1215382 1257494 1312997 1383740 1474080 1583460 1703992 1820033
10650A820033J00525O8367M6364K5603L0047L5067M8598P1095R3754J20402J44467
$$ 1820033 1920558 1988925 2035289 2060892 2090939 2126006 2174604 2245699 2339453 2459855 2604322
10639B604322J65876J79352J91385K03243K15480K38338K69850L18019L82051
$$ 2604322 2770198 2949550 3140935 3344178 3559658 3797996 4067846 4385865 4767916
10630D767916M65575N88936P26132Q39659Q49329P57068O20048N17201N44241
$$ 4767916 5233491 5822427 6548559 7388218 8237547 8994615 9614663 10131864 10676105
10621A0676105P00867R63558J297534J697156K177684K772136L490458M338796
$$ 10676105 11376972 12340530 13638064 15335220 17512904 20285040 23775498 28114294
10613B8114294N325349O555963Q392518J1478579J6958213K6445391M1066330
$$ 28114294 33439643 39995606 48388124 59866703 76824916 103270307 144336637
10606A44336637N8147692O9734647O5865431M2954965J0538534k4674852n1147480
$$ 144336637 202484329 272218976 338084407 381039372 391577906 366903054 315755574
10599C15755574o3946771o2830522n2427458l8975949k6830513j7818986j1857452
$$ 315755574 251808803 188978281 136550823 97574874 70744361 52925375 41067923
10592D1067923q172078n921826m493927l528019k834424k291042j832281j422384
$$ 41067923 32895845 26974019 22480092 18952073 16117649 13826607 11994326 10571942
10584A0571942j066459p54625m85319k77436j61520j77308l08632n12188o84382
$$ 10571942 9505483 8750858 8265539 7988103 7826583 7649275 7340643 6828455 6144073
10575F144073p53953p15884o11045m87950l80767l06887k44238j93214j51682
$$ 6144073 5390120 4674236 4063191 3575241 3194474 2887587 2643349 2450135 2298453
10566B298453j21759r9759r1333q9050r4637j04907j11218j12481j05462q1975
$$ 2298453 2176694 2076935 1985602 1896552 1801915 1697008 1585790 1473309 1367847 1285872
10556A285872n4307j8599J2188K3688J6373n12l1923m8714n2661n6931o0273n8288
$$ 1285872 1231565 1212966 1225154 1248842 1265215 1264703 1232780 1184066 1131405 1074474 1014201 955913
10544I55913n2437l5154k4097j4532r967p812j7751k9382l6507m0026l7353k5803
$$ 955913 903476 868322 844225 829693 819726 811914 794163 764781 728274 688248 650895 625092
10532F25092l664R055K6582M0887M7803N9228O6850O6923L4651O846j8137l4466
$$ 625092 621428 630483 657065 697952 745755 804983 871833 938756 973407 980253 962116 927650
10520I27650k1742k2320k3806l8685m9344n1244m5384k7825j4053j831J0641R767
$$ 927650 905908 883588 859782 821097 771753 720509 675125 647300 633247 631416 642057 651824
10508F51824O417k919q892o257j1492j4580j5009j6831o888n617r687n951j148
$$ 651824 658241 655322 646430 640173 628681 614101 599092 582261 575373 569756 560069 554118 552970
10495E52970Q886J9140K4517K9785L0843L3001K0546Q397J701p075p665K382P783
$$ 552970 561856 580996 605513 635298 666141 699142 719688 728085 729786 722711 715046 717428 725211
10482G25211N630J2054K0609N1222P9749R3974Q2375M5157j0022m8013n9205m8367
$$ 725211 730841 742895 763504 814726 894475 988449 1070824 1115981 1105959 1057946 998741 950374
10470I50374k2541M773J2661J1679Q229k127j2153j6230q982N456K1594L7875
$$ 950374 927833 932606 945267 956946 965175 963048 950895 934665 925683 931139 952733 990608
10458I90608M6302M6028L3182J8898O114M409N857O603J3603K3344N1111Q4343
$$ 990608 1036910 1082938 1116120 1135018 1141132 1145541 1151398 1158001 1171604 1194948 1246059 1330402
10446A330402J22165J45970J37247J08765P7532O3183N9572N9581O9787R4458
$$ 1330402 1452567 1598537 1735784 1844549 1922081 1985264 2044836 2104417 2174204 2268662
10436B268662J15843J33505J48981J73462J89808K00551K17204K45813K77009
$$ 2268662 2384505 2518010 2666991 2840453 3030261 3230812 3448016 3693829 3970838
10427C970838L32766M13210N23635O51708P54130P74674O83486N43226M13246
$$ 3970838 4303604 4716814 5240449 5892157 6646287 7420961 8104447 8647673 9060919
10418I060919M15134N62843P98793J051654J267663J460375J689998K008816K505461
$$ 9060919 9476053 10038896 10837689 11889343 13157006 14617381 16307379 18316195 20821656
10409B0821656L208226M152596N383363P025524R417278J3264187J9799595L0733234
$$ 20821656 24029882 28182478 33565841 40591365 50008643 63272830 83072425 113805659
10401A13805659M6667071O3042660P0801291O0604288L2914808r42236l4778854
$$ 113805659 160472730 223515390 294316681 354920969 387835777 386893541 352114687
10394C52114687n6554133o4603439n9762962m7889858l4824691k3891935j6077224
$$ 352114687 295560554 230957115 171194153 123304295 88479604 64587669 48510445
10387D8510445j0905881p569900n410232l985891l040456k381061j897753j523322
$$ 48510445 37604564 30034664 24624432 20638541 17598085 15217024 13319271 11795949
10379A1795949j211567r59476p38354n29636l17933r7519O0673J03343l4622k93479
$$ 11795949 10584382 9624906 8886552 8356916 8038983 7941464 8002137 8105480 8070858 7777379
10369G777379n78828p78080q31244p59436o25996m81421l51332k43922j74715
$$ 7777379 7198551 6420471 5589227 4829791 4203795 3722374 3371042 3127120 2952405
10360B952405j29790j13498j12875j30434j46258j57847j58617j46786j35322
$$ 2952405 2822615 2709117 2596242 2465808 2319550 2161703 2003086 1856300 1720978
10351A720978j11970q8684p4196n7157m2188l1469l4434m1737m5564m8338n2548
$$ 1720978 1609008 1520324 1446128 1388971 1346783 1315314 1280880 1239143 1193579 1145241 1092693
10340A092693m8849m6750m0387k1818j5462j3135j0801j4523k2646l5490l6836
$$ 1092693 1043844 997094 956707 934889 919427 906292 895491 880968 858322 822832 785996
10329G85996l9089l5356k8027k2857j5464j4554p737m536K135K82N86O263Q516
$$ 785996 746907 711551 683524 660667 645203 630649 622912 618376 620511 620793 621379 627642 636158
10316F36158K155r433r446q071j0255j2047j5644k0388k4245k4875k1390j2215
$$ 636158 638313 628880 619434 611363 601108 589061 573417 553029 528784 503909 482519 470304
10304D70304q46J847J715o255o45m595r14o528q727J200O730J2893K0068J9004
$$ 470304 469458 471305 473020 466765 466120 461525 460611 454083 445356 446556 453286 466179 486247 505251
10290E05251J5180P894M345N010J0376J6679K5812K6445J3767M554r794k5027
$$ 505251 520431 528325 532670 537680 548056 564735 590547 616992 630759 635313 625519 600492
10278F00492l1138k9137k1662q869M959L0304N1990N5481M3780O791l3461o2984
$$ 600492 569354 540217 518555 509686 514645 544949 596939 652420 696200 702991 669530 606546
10266F06546p5043o7487l7621j4380q203p142p468j3587j4831j1495j1807j0992
$$ 606546 531503 464016 426395 412015 403812 396670 389202 375615 360784 349289 337482 326490
10254C26490j0492j0520j6338j4301j6941j8205j4652k0804k7387l4862l7820
$$ 326490 315998 305478 289140 274839 257898 239693 225041 204237 176850 141988 104168
10243A04168k9490p433J2357L1272M7353N0448M3061K8460J3484L897k168q801
$$ 104168 74678 67245 79602 110874 158227 208675 251736 280196 293680 297577 295409 286608
10231B86608n890J875Q930J1406J2023N848Q569J0450P004M760J479O151J6103
$$ 286608 280718 282593 291523 302929 314952 320800 329369 339819 346823 351583 353062 359213 375316
10218C75316K1247J9109K4142K2543J9617J8814J5510J2470j0957m6400r9260
$$ 375316 396563 415672 439814 462357 481974 500788 516298 528768 517811 471411 372151
10207C72151j54656j68642j55730j06938n2019r790K8290M9782N6556N3215M8158
$$ 372151 217495 48853 -106877 -213815 -265834 -275624 -247334 -197552 -140996 -87781 -39623
10196c9623N1409N4559O5794Q3964J24074J86817K84543L87385M42072L90065
$$ -39623 11786 66345 132139 216103 340177 526994 811537 1198922 1640994 2031059
10186B031059K13144k6089k46698l76349l93975l38950k48843j73257j19096p7463
$$ 2031059 2244203 2218114 1971416 1595067 1201092 862142 613299 440042 320946 243483
10176B43483m9706k9615j5822j1419j2627j2137r739m029j442N20M420Q972O491
$$ 243483 193777 164162 148340 136921 124294 112157 102418 98389 96947 97467 101887 110859 117350
10163A17350k397j200p008m548o017m899K337M150M868R648Q871N768L175O548
$$ 117350 114953 113753 106745 102197 96180 91281 93618 97768 102636 112284 121155 126923 130098 136646
10149A36646J740l821n687n306l611m594R93O343N576J2201O698r065j6419j7166
$$ 136646 138386 134565 128878 123572 119961 115367 116360 122703 128279 140480 147178 138113 121694 104528
10135A04528j2894j2242k912m981J387J594p498k499P86l5K114J79J385K460J499
$$ 104528 91634 79392 76480 71499 72886 74480 66982 64483 65269 65234 67348 67527 68912 71372 72871
10120G2871k302l380J31R35K571j272J655O881R961N675N312J3285R426R261J6621
$$ 72871 70569 67189 67320 68255 70826 69554 71209 78090 88051 93726 99038 112323 121749 131010 147631
10105A47631J2038J0033Q440P033J5269K3207K2060K1167J0943k910j7042k4845
$$ 147631 159669 169702 178142 185175 200444 223651 245711 266878 277821 274911 257869 233024
10093B33024k7069l1067k6844k1553j5835n968M376J4315J0101K033m371j2786
$$ 233024 205955 174888 148044 126491 110656 104688 109064 123379 133480 135513 131142 118356
10081A18356j0060j0190r100j1369o546k898P86k856J209J379O418J091J263K463
$$ 118356 108296 98106 89006 77637 71091 68193 68979 66123 67332 68711 75129 76220 77483 79946
10067G9946J299p29J644M325L547L600O509J0379P557O985O276J2120J1007J5293
$$ 79946 81245 80516 82160 86485 90032 93632 100141 110520 118077 125062 131338 143458 154465 169758
10053A69758J3760J2249J2783J2103K0215K7171L0346L2956L5154M8885N7583
$$ 169758 183518 195767 208550 220653 240868 268039 298385 331341 366495 415380 472963
10042D72963P6735Q8039J04722J30599J48769J60752J58957J49208J24528P9103
$$ 472963 549698 637737 742459 873058 1021827 1182579 1341536 1490744 1615272 1694375
10032A694375L1502j7416o7222j06754j42076j63969j68616j58805j38991j18091
$$ 1694375 1725877 1708461 1641239 1534485 1392409 1228440 1059824 901019 762028 643937
10022F43937r7042p7274o3428m9954l7317k9162k6856j7295j6105j5192j4554
$$ 643937 546895 469621 406193 356239 318922 289760 262904 245609 229504 214312 199758
10011A99758j3040j5005n536l864k661L239K761o021p491o917n596k351J251J808
$$ 199758 186718 171713 166177 162313 159652 162891 165652 159631 152140 145223 139627 137276 138527 140335
9997A40335J906P703J1454P155J0171J5131K0571L4963M4824O5829J06597J73328
$$ 140335 142241 149944 161398 168553 178724 193855 214426 249389 294213 360042 466639 639967
9985F39967K67138L66532M24214L76046K03681l0078k52405l77160l97140l38117
$$ 639967 907105 1273637 1697851 2073897 2277578 2247500 1995095 1617935 1220795 882678
9975H82678k50462j73382j20641p9148n0604l4461k4146j8181j3227j0457j1443
$$ 882678 632216 458834 338193 259045 208441 173980 149834 131653 118426 107969 96526
9964I6526q304M27j070K6N662M307M576L567n393n546j308l577m288j572L991
$$ 96526 88222 88649 87579 87605 93267 97574 102150 105717 100324 94778 93470 89893 85605 84033 88024
9949H8024m415r392q846j2708k183j610n906l552j176K006j428m66J900J286k808
$$ 88024 83609 74217 65371 52663 50480 48870 42964 39412 38236 40242 38814 38348 40248 41534 38726
9934C8726l29L824R20j367q87k633pj52J72R36j619k034J957J047l422j692K084
$$ 38726 38397 42221 43141 41774 40887 38254 38247 38095 38267 39203 37584 35550 37507 38554 35132 33440 35524
9917C5524M305j525m704K763J061n180n201l947l961K219L947N583K301j7M72
$$ 35524 39829 38304 33600 36363 37424 32244 27043 23096 19135 21354 25301 30884 33185 33168 33640
9902C3640l158k562l649J945K852r37j060j973M71n423o942j725O88M098K881
$$ 33640 30482 27920 24271 26216 29068 28131 27071 25098 25569 20146 13204 11479 12167 16265 19146
9887A9146K244J630N032K38m446n926O12m152Q91J496J281j847k832R5k929m215
$$ 19146 21390 23020 28052 28290 23844 17918 18530 14378 15269 16765 18046 16199 13367 13462 10533 6318
9871F318N80M555r09o119n53J573O014K388J828J374R64K780J16K812L889k962
$$ 6318 6898 11453 10544 4425 3872 5445 11459 13847 15675 17049 18013 20793 20909 23721 27610 24648
9855B4648o463m48j403j650Q43J863L069p66k496j144N076L856p38m858l227L69
$$ 24648 18185 17737 16334 14684 15527 17390 20459 19693 17197 16053 21129 24985 24247 19389 16162 16531
9839A6531r19k767l131m258k997L553J432k939L508K940O829K100m188k218J836
$$ 16531 15612 12845 9714 5456 2459 6012 7444 4505 8013 10953 17782 19882 15694 13476 15312
9824A5312k34k889O38J461j088J172O361m97k362K475J054N376O154Q733R812
$$ 15312 15078 12189 12827 14288 13200 14372 20733 20236 17874 20349 21403 26779 32933 41666 51478
9809E1478J5249L0545L8000K8058Q06k1641k3924k0607j8131l928L903R463O693
$$ 51478 66727 97272 135272 163330 164136 142495 118571 97964 79833 75905 79808 89271 95964
9796I5964l92q614j195N740N132P350N791L92j103m155j656m12K526O229M920
$$ 95964 95572 86958 85763 91503 96635 103985 109776 110168 109065 104910 103254 102842 105368 111597 116517
9781A16517M416L586J43j3159j9608j9521j5970j6000r087k216o106o009k646
$$ 116517 120933 124519 124662 111503 91895 72374 56404 40404 31317 29101 22995 16986 14340
9768A4340p3Q1M902l282M7k694J18M731M864j995j939Q69K229J749J128J343O49
$$ 14340 14267 14348 19250 15968 16015 13321 13439 18170 23034 21039 19100 19969 22198 23947 25075 26418 27067
9751B7067J224m353k412J400L06J856L025L211K65n87m20K175K317J457j380M435
$$ 27067 28291 23938 21526 22926 23232 25088 28113 31324 31589 31002 30582 32757 35074 36531 35151 39586
9735C9586R0j019Q26k37M114K828l65j320K859L282M557p39M586R832P197O571
$$ 39586 39676 38657 39483 39246 43360 46188 45823 44503 47362 50644 55201 54462 59048 68880 76077 82648
9719H2648J0508N182O688N514M483J0862J0412J5656J5478J3486J8943K0113K7771
$$ 82648 93156 98338 105026 110540 115023 125885 136297 151953 167431 180917 199860 219973 247744
9706B47744L7857M7119N6010P2601R6965J32555J94430K97427M75863P52397R90947
$$ 247744 285601 332720 388730 461331 558296 690851 885281 1182708 1658571 2410968 3401915
9695C401915R16420O35692L25328K0319l54321p89909r69271q85903o81530m76906
$$ 3401915 4318335 4954027 5279355 5299674 4945353 4155444 3186173 2300270 1618740 1141834
9685A141834l15062k08070j41768r8754o9183n1025l6911k4071j8389j1698j1875
$$ 1141834 826772 618702 476934 378180 308997 257972 221061 196990 178601 166903 155028
9674A55028j3307p427q347j5579j1410j0322j0173j1129j0455q499k847O89j832
$$ 155028 141721 134294 125947 110368 98958 88636 78463 67334 56879 48380 45533 46222 44390
9661D4390k487J374K632N1m511j829n604l693o05M190L322k314j464J775J594
$$ 44390 41903 43277 45909 45960 41449 39620 34016 30323 29718 33908 37230 34916 33452 35227 36821
9646C6821P60M552L013n58l929M308P780Q531R886N705J33m550q918r005o44M079
$$ 36821 37581 42133 45146 44588 40659 44967 52747 61278 71164 76869 77002 72452 63534 54529 53885 57964
9630E7964M47k935K366J30q029m322o016n411J644M346k069j632N909L045n38
$$ 57964 58411 55476 57842 57972 49943 45621 39605 34194 35838 40184 38115 36483 42392 45437 44899
9615D4899Q101J1406Q383J074j952k214K732p02m727k748m758o835o801k031l155
$$ 44899 53000 64406 72789 73863 71911 69697 72429 71727 67000 64252 59494 52659 45858 43827 40672
9600D0672O18L537R71l699l281l272O72l335n344o31m10Q36k328j799J396M11
$$ 40672 41290 44827 45798 42099 38818 35546 36218 32883 27539 26908 26498 27334 25006 23207 24603 25014
9584B5014j548j948l976l438q81N68L053k111k118l959n401l57L584M693K915
$$ 25014 23466 21518 17542 14104 13223 13791 16844 14733 12615 8656 3255 2898 6482 11175 14090
9569A4090J703K271p18J651j494K340L965j794j348k408l894l39O544p71r61N598
$$ 14090 15793 18064 17346 18997 17503 19843 23808 22014 20666 18258 14364 14025 20569 19798 18837 24435
9553B4435j326k811J362Q18Q04k438R81K923j912L277j034o01M30j086L051M446
$$ 24435 23109 20298 21660 22478 23282 20844 21825 24748 22836 26113 25079 24478 24908 23822 26873 31319
9537C1319J112J585j688L08K506m87J258R34L027L057m23l075K581R26k740J058
$$ 31319 32431 34016 32328 32636 35142 34655 35913 36847 39874 42931 42508 39433 42014 42940 40200 41258
9521D1258K283O21k008o98J139j076l763j782M199K951K009K569Q26l81j808l804
$$ 41258 43541 44162 42154 41456 42595 41519 37756 35974 40173 43124 45133 47702 48528 48147 46339 42535
9505D2535j706j715k544k053K13N531L152K189K71K46K457J143q21o649N97P58
$$ 42535 40829 39114 36570 34517 34730 40261 43413 45602 45873 46119 48576 49719 48898 42249 42846 43604
9489D3604k06L462k302l515l252o480j669l08J660k307J706j938q01p19K697J584
$$ 43604 43398 46860 44558 41043 37791 31311 29642 29334 30994 28687 30393 28455 27654 26935 29632 31216
9473C1216k690J512O878K657L36L671m88l019J325k714n312R20j755l382j901
$$ 31216 28526 30038 36916 39573 39909 43580 43092 40073 41398 38684 33372 34292 32537 29155 27254
9458B7254q67L029q05j099k411k159p14o51k571N44N065J059J09K054j594M24
$$ 27254 26387 29416 28611 27512 25101 22942 22228 21577 19006 19550 24615 25674 25783 27837 26243 26667
9442B6667J231j464k70J07N3L290m41k556k288l328k403l574j268K818K44k614
$$ 26667 27898 26434 26164 26271 26324 29614 29173 26617 24329 21001 18598 15024 13756 16574 16818 14204
9426A4204l024J727j104m923l834J478N166K051J48r33K77P29J292j59m008j176
$$ 14204 11180 12907 11803 6880 3046 4524 9690 11741 11889 10956 11233 11962 13254 13095 9087 7911
9410G911l04j172J20L044j675n99j32k651K518J175k902R96o30j33m519j495K41
$$ 7911 7607 6435 6555 9599 7924 7325 7193 4542 7060 8235 5333 6329 5699 5566 1047 -448 -207
9393b07J820j309j128j410M743j25j707K831K904J983k47n068R56J941l192k025
$$ -207 1613 304 -824 -2234 2509 2384 677 3508 6412 8395 8148 3080 4036 5977 2785 760
9377G60K568N11Q40M757r19m544Q58m0m83J019m353m124L218L439j356j662j522
$$ 760 3328 3839 4679 9436 8517 3973 4831 4791 4308 5327 974 -3150 68 3507 2151 489 -1033
9360a033j668j132N3K542M633l368J79j05j67k845J093L645j517J038L24K95O363
$$ -1033 -2701 -3833 -3780 -1238 3395 27 206 101 -66 -2911 -1818 1827 310 1348 1672 1967 8330
9343H330k967j0211m187L714M334N690L140K973o63P5M17Q70j9j735N767L672
$$ 8330 5363 -4848 -9035 -5321 -987 4703 7843 10816 10153 10228 10645 11515 11496 9761 15528 19200
9327A9200l169m030k449l156o55J011q5l06j227N53M520L841L024j925J8J575
$$ 19200 16031 12001 9552 6396 5741 6752 6667 6361 5134 5687 10207 14048 17072 15147 15165 16740
9311A6740K331j553k203l214k071K820P701K180o282k737Q28j835j459J563J514
$$ 16740 19071 17518 15315 12101 10030 12850 20551 22731 16449 13712 14540 12705 11246 12809 14323
9296A4323K367J146K70K00M194M379J588J984Q273Q902J701L40j680k073J854
$$ 14323 16690 17836 18106 18306 22500 26879 28467 30451 38724 47626 49327 49667 47987 45914 47768
9281D7768m699r280p349j483K926j371k52k67q65m905L843N755j051o732q63j705
$$ 47768 43069 33789 26440 24957 27883 26512 26260 25993 25128 20223 24066 29821 28770 22038 21175 19470
9265A9470J349L999L294l704l645K00J544M509K963l620j728M14K422L061J827
$$ 19470 20819 24818 28112 24408 20763 20963 22507 27016 29979 26359 24631 25045 27467 30528 32355
9250C2355l078l576O17K791J374J203k16k649m360M36N713N273n12p04l452M436
$$ 32355 29277 25701 26318 29109 30483 31686 31470 28821 24461 24897 30610 35883 35371 34667 31215 35651
9234C5651K320O244O373o01k200m897J385L662N808m421l980K492K752l10q70
$$ 35651 37971 44215 50588 49987 47787 42890 44275 47937 53745 49324 45344 47836 50588 50278 49408
9219D9408l299l188k672j918r52l716n077J113K918K277L436K021j202p68k988
$$ 49408 46109 42921 40249 38331 37379 33663 28586 29699 32617 34894 38330 40351 39149 38381 35393
9204C5393r79J394j861j654J596j67j981R01O33j601M668R4n759n656q628k297
$$ 35393 34414 35808 33947 32293 33889 33722 31741 32642 33275 31674 36342 36436 30677 25021 16393 14096
9188A4096j187K782N214j049k658j802N91K399j770k319k032l896r61L773M608
$$ 14096 12909 15691 20905 19856 17198 15396 15987 18386 16616 14297 12265 8369 7408 11181 15789
9173A5789k62k093K11L011K355k581j973k211P47J126m978j703J464k402j948
$$ 15789 15527 13434 13645 16656 19011 16430 14457 12246 12993 14119 9141 7438 8902 6500 4552
9158D552K617M74k460M788K818k800l550J076j078O50N78O87l36m484K460K099
$$ 4552 7169 7643 5183 9971 12789 9989 6439 7515 6437 7087 7665 8352 8016 3532 5992 8091
9142H091j312k870k108K156L448p47Q00O44k183j334k036J620K896k61k570l453
$$ 8091 6779 3909 1801 3957 7405 6658 7458 8102 5919 4585 2549 4169 7065 6804 4234 781
9126G81P91M007J381j63j466k203j269j470q69K443K064m044R70N700J228l304
$$ 781 1572 5579 6960 6797 5331 3128 1859 389 -480 1963 4027 -17 953 6653 7881 4577
9110D577K460k123l433K040k539j556K289K808Q46j078l065l91M808K400j769
$$ 4577 7037 4914 1481 3521 982 -574 1715 4523 5369 4291 1226 835 5643 8043 6274
9095F274j511k29J480K682j994m598j444K451l046N1J274j850P13P36K092J455
$$ 6274 4763 4534 6014 8696 6702 2104 660 3111 65 116 1390 -460 253 989 3081 4536
9079D536j355l396J318M145p62L28m88k660O27O88j120l368n75K010n71k020j272
$$ 4536 3181 -215 1103 5248 4486 4814 4326 1666 2293 2981 1861 -1507 -2082 -72 -643 -2663 -3935
9062c935l645J932j059K127K268j72J147J326J38j92k134K20J488J157l324J604
$$ -3935 -7580 -5648 -6707 -4580 -2312 -2484 -1337 -11 127 -65 -2199 -1979 -491 666 -2658 -1054
9046a054J158K170K155R75m707N34L543K521L68l098o196n11K620R40j239k742
$$ -1054 104 2274 4429 5404 697 1231 4774 7295 7663 4565 -1631 -2142 478 1418 179 -2563
9030b563l704R65n56R16M960M619J530K160j18J559J781J947N92j838j788m48
$$ -2563 -6267 -5302 -5858 -4942 18 4637 6167 8327 8209 9768 11549 13496 14088 12250 10462 10014
9014A0014j814l280j930l78J727J692K021J522j800L073K810J449m100J473J410
$$ 10014 8200 4920 2990 2612 4339 6031 8052 9574 7774 10847 13657 15106 11006 12479 13889
8999A3889n261k372L136M576m13j385n1J131r63k312L483M379N566N0k279l359
$$ 13889 8628 6256 9392 13968 13555 12170 12119 13250 12287 9975 13458 17837 23403 23453 21174 17815
8983A7815j291k987K131N148J613L812N255m81j547P4j142j344j725j533j61M502
$$ 17815 16524 13537 15668 20816 22429 26241 31496 31015 29468 29542 28400 27056 25331 23798 23637 28139
8967B8139K980l820k245q61N92q97m086k043m214n423m325l74K509O112R55N11
$$ 28139 31119 27299 25054 24193 24785 23888 19802 17759 13545 8122 3797 3423 5932 12044 12999 13510
8951A3510L68J071n4l603j409L332K565K026M321k163k275l131l46N337L592j124
$$ 13510 13878 14949 14895 11292 9883 13215 15780 17806 22127 19964 17689 14558 14212 19549 23141 22017
8935B2017R42l27m391j757K935l773J601L029r56K96M62J928L836L699n2k324
$$ 22017 22959 22632 18241 16484 19419 15646 17247 20276 19320 19616 20078 22006 25842 29541 29489 27165
8919B7165k103K145j055n713Q97J486J262K510o54J050l439k240l077k082l46
$$ 27165 25062 27207 26152 20439 21336 22822 24084 26594 25940 26990 23551 21311 18234 16152 15806
8904A5806K914L202O11k330j032J126l731O4J183k385j355L128O20K475l30J617
$$ 15806 18720 21922 22533 20203 19171 20297 16566 16630 17813 15428 14073 17201 17821 20296 19966 21583
8888B1583L44M90n28j91j670m869j066J391K696j269j22j032o48j953K388M996
$$ 21583 21927 22417 21889 21698 20028 15159 14093 15484 18180 16911 16789 15757 15109 13156 15544 20540
8872B0540K935k229q98Q4k753n17j713m881o515J197O4j303l144j171M064j648
$$ 20540 23475 21246 20348 20432 17679 17162 15449 10568 4053 5250 5314 4011 867 -304 3760 2112
8856B112k587J028L919L160k674j554l167j384J74M18K082l577K83O082P77m453
$$ 2112 -475 553 4472 7632 4958 3404 237 -1147 -973 -555 1527 -2050 -1767 4315 5092 639
8840F39o06M082M654j153k756R03l079k497j647k271j633N138P458j383l712k053
$$ 639 33 4115 8769 7616 4860 5763 2684 187 -1460 -3731 -5364 -226 7232 5849 2137 84
8824H4L006O189l018j280m151j107L066J887k076m016j479L159K433R57J925J885
$$ 84 3090 9279 6261 4981 830 -277 2789 4676 2600 -1416 -2895 264 2697 3654 5579 7464
8808G464O23J540m704n420M322k536o91Q93m386J322N199L914Q74p35l184J159
$$ 7464 8087 9627 4923 -497 3825 1289 598 1491 -2895 -1573 3626 7540 8414 7679 4495 5654
8792E654k14J365j308m472P63L97l58J487j201k651m508o0J258J355L958L81j142
$$ 5654 5440 6805 5497 1025 1788 2185 1827 3314 2113 -538 -5046 -5106 -3848 -2493 1465 1846 704
8775G04j79K349j348j892k804k214l194L039P10N334P147L515n2l64J993l74m281
$$ 704 525 2874 1526 -366 -3170 -5384 -8578 -5539 -4829 505 7652 11167 11115 10751 12744 12370 8089
8758H089n699K594N147N711M755J780j244k736l229m104k971L177m07k922r91
$$ 8089 2390 4984 10131 15842 20597 22377 21133 18397 15168 11064 8093 11270 10863 7941 6950
8743F950J489l31Q14k27m55K381O552J0584J4193J4839J9082Q474P17j1025j8419
$$ 6950 8439 8108 8922 8695 8240 10621 17173 27757 41950 56789 75871 84345 85062 74037 55618
8728E5618j4709j2847n745m681n302j481o1L237K070l65L299J452j339j720O52
$$ 55618 40909 28062 22317 17636 12334 10853 10792 14029 16099 15734 19033 20485 19146 17426 18078
8713A8078j652k38J875K4k192j493k699k570o53k080L114O121J065L88K468k369
$$ 18078 16426 16188 18063 18087 15895 14402 11703 9133 8480 6400 9514 15635 16700 17088 19556 17187
8697A7187l052N335K184L286O016P567J3145J8839L0338M4703K6455m977k6944
$$ 17187 14135 19470 21654 24940 30956 38523 51668 70507 100845 145548 172003 167026 140082
8684A40082k9185j8847j0506j6160j4710j2294q631n301m85k461Q04K264l044
$$ 140082 110897 92050 81544 65384 50674 38380 29749 24448 23963 21502 22306 24570 21526
8671B1526j615k58K80R06P59M429J668j71j222k907l674l087J57k154n81K950
$$ 21526 19911 19653 19933 20839 21598 26027 27695 27524 26302 23395 19721 16634 16791 14637 14056 17006
8655A7006M26o80L591K486M10J308L98M14M655N481P945J3429J8430J5411l147
$$ 17006 17432 16752 20343 22829 23239 24547 24945 25359 30014 35495 43440 56869 75299 90710 87563
8640H7563j1640j3001n249K087N304L974K363o031q374r155j2222r492l582J848
$$ 87563 75923 62922 57673 59760 65064 69038 71401 65370 56996 47841 35619 26127 22545 24393
8626B4393K788J263J595O62L399K37k391m106l536m392r289J20K082J139k206
$$ 24393 27181 28444 30039 30701 34100 34337 31946 27840 24304 19912 10623 10743 12825 13964 11758
8611A1758J139J109r36j684m0J436o06l04J841O385J78N76J818J6L949L687N960
$$ 11758 12897 14006 13070 11386 11346 12782 12176 11872 13713 20098 20276 20852 22670 22686 26635 30322 36282
8594C6282M189l881q88l07k331J240Q894O514N024J652m730l294o250j38K77O69
$$ 36282 40471 36590 35702 35395 33064 34304 43198 49712 54736 56388 51658 48364 42114 41976 42253 42922
8578D2922p00L211K633n790j684M243K174l51j143k321j843J995K137M03j323
$$ 42922 42222 45433 48066 42276 40592 44835 47009 46658 45515 43194 41351 43346 45483 45886 44563
8563D4563K05m984J442O19p6j380l181M413L226j146k477N80j333J664q34O124
$$ 44563 44768 39784 41226 41845 41769 40389 37208 41621 44847 43701 41224 41804 40471 42135 41301 47425
8547D7425Q187P742j99k899l799n286K14j34l93m32J951O017j833k503m175n73
$$ 47425 55612 63354 63155 60256 56457 51171 51385 51251 50858 50426 52377 58394 56561 54058 49883 49310
8531D9310J724J834N019N155O886M642p81j958n62J284m08j37K619P299o11N962
$$ 49310 51034 52868 57887 63042 69928 74570 73789 71831 71269 72553 72145 72008 74627 81926 81315 87277
8515H7277L742r96K73L18j971m103l022L524J114K16K069q37K187M915P90L251
$$ 87277 91019 90023 90296 90614 88643 84540 81518 85042 86156 86372 88441 87604 89791 94706 95496 98747
8499I8747O254Q263J4469R957k013q968j5769j3851r182r616o438l206l009n506
$$ 98747 105001 113264 127733 137690 135677 126709 110940 97089 87907 78291 71853 68647 65638 60132
8485F0132J348Q873M466K860Q868R902K596r81l771m739q487p318m225k622m640
$$ 60132 61480 70353 74819 77679 86547 96449 99045 98064 94293 89554 81067 73749 69524 66902 62262
8470F2262m292K431L722l64O15K659R43j835K787R26J007r38j031M776J3213Q981
$$ 62262 57970 60401 64123 63759 64374 67033 67976 66141 68928 69854 70861 69923 68892 73668 86881 95862
8454I5862J4253K4928K9332R125j3314j8213j9701j4139j4854r481k937m034K77
$$ 95862 110115 135043 164375 173500 160186 141973 122272 108133 93279 83798 80861 76827 77104
8441G7104J632j519n242p115q193n445l566o764l934l415j944N32K100J608L47
$$ 77104 78736 77217 71975 64860 56667 51222 47656 40892 36958 33543 31599 32131 34231 35839 36186
8426C6186o2L646n039l696m45N218J992l54j732o80O32j498l687R60L320J445
$$ 36186 36124 39770 34731 31035 30590 35808 37800 37446 35714 35034 35666 34168 30481 31441 34761 36206
8410C6206O214J1168J1187R326O96p102j1696j0146q975l8j493n184k059j93l559
$$ 36206 42420 53588 64775 74101 74797 67695 55999 45853 36878 36840 35347 30163 28104 27911 24352
8395B4352j60J983K178K009N84r81k977Q15m749j29P491R33l467j086O87o580
$$ 24352 24192 26175 28353 30362 30946 29965 26988 27803 23054 22925 30416 31349 27882 26796 27483 20903
8379B0903n120K426P89j413J070Q65R54l535j214q63J481L94J931q67J40J492
$$ 20903 15783 18209 18998 17585 18655 19520 20474 16939 15725 14862 16343 16737 18668 17801 17941 19433
8363A9433K5j149j940J974L266R74k016K371N053J532k74k49J35o367m122L77
$$ 19433 19458 18309 16369 18343 21609 22583 20567 22938 27991 29523 29249 29000 29135 22768 18646 19023
8347A9023j432N37k28k242l3L113J202L043N273K163K059J416R37j010p24K540
$$ 19023 17591 18128 17900 15658 15625 18738 19940 22983 28256 30419 32478 33894 34831 33821 33097 35637
8331C5637l402q401k675k01J108q72m26o39J668J941k707m311r19j497M59J537
$$ 35637 32235 23834 21159 20958 22066 21194 20768 20129 21797 23738 21031 16720 15801 14304 14763 16300
8315A6300m515J580J03L536L875L157R419M644k755n435n555m517m382m070O19
$$ 16300 11785 13365 13468 17004 20879 24036 33455 38099 35344 29909 24354 19837 15455 11385 12004
8300A2004P77q68k682L12J39l364M114L919K476L565M952J0476P132m362m105
$$ 12004 12781 11913 9231 9543 9682 6318 10432 14351 16827 20392 25344 35820 42952 38590 34485
8285C4485j073j688p273n134K763Q912L515r7l534k319J372p903p586j890j258
$$ 34485 33412 31724 24451 19317 22080 30992 34507 34410 30876 28557 29929 22026 14440 12550 11292
8270A1292j103J344J668L655k326k063j963L261J384k998j090j675l226j811P20
$$ 11292 10189 11533 13201 16856 14530 12467 10504 13765 15149 12151 11061 9386 6160 4349 5069
8255E069l737K386Q70K042k534j657J13j94K914K019K020K138r27k212J558Q65
$$ 5069 1332 3718 4588 6630 4096 2439 2552 2358 5272 7291 9311 11449 10522 8310 9868 10733
8239A0733M18K922k194l645l51j505k458p99j913J287O42J779L572j072j466L85
$$ 10733 11151 14073 11879 8234 7883 6378 3920 3121 1208 2495 3137 4916 8488 7416 5950 6335
8223F335l124J656O53j096R93J249k042k750j767J379L148L887M079m231l713
$$ 6335 3211 4867 5520 4424 5417 6666 4624 1874 107 1486 4634 8521 12600 8369 4656
8208D656k463q04j776L453R22o26J078m4j204k316j678j928L397K700p99J774
$$ 4656 2193 1389 -387 3066 3988 3362 4440 4396 3192 876 -802 -2730 667 3367 2568 4342
8192D342j190N30j43k270k820k048Q09J68P56M866L591j746l342L201M019p84
$$ 4342 3152 3682 3539 1269 -1551 -3599 -2790 -2622 -1866 3000 6591 4845 1503 4704 8723 7939
8176G939l034k736n02j593P8j689K083K035K511K60j15k54Q46j90L52m247p381
$$ 7939 4905 2169 1667 74 152 -1537 546 2581 5092 5352 5237 4983 5829 5639 5991 1744 -5637
8159e637k127J2321L09l859l174o26Q51n61R61M24J76r61q71J051o84r00K854
$$ -5637 -7764 4557 4866 1007 -2167 -2793 -1942 -2503 -1542 -1118 -942 -1903 -2774 -1723 -2407 -3307 -453
8142d53M362n67q440l169l07P01O605J381k624L125L119J374q6m689l648J707
$$ -453 3909 3342 -5098 -8267 -8574 -7873 -1268 113 -2511 614 3733 5107 5021 332 -3316 -1609
8126a609M848L891j977n088P19K499M33j657l532k255j501r22j462j812O035P317
$$ -1609 3239 7130 5153 65 784 3283 3716 2059 -1473 -3728 -5229 -6151 -7613 -9425 -3390 3927
8110C927K423M815N505Q996P002r29k842R76j666r169o222l188k472k31k172j018
$$ 3927 6350 11165 16670 25666 32668 31739 28897 29873 28207 19038 12816 9628 7156 6925 4753 3735
8094C735k850m742k955k538k54M538J108J069J596L866M768J666j012j031M29
$$ 3735 885 -3857 -6812 -9350 -9604 -5066 -3958 -2889 -1293 2573 7341 9007 7995 6964 7393
8079G393J481p98k995K144k906k833p53J343n242P2R90M673J222o26K298N587
$$ 7393 8874 8076 5081 7225 4319 1486 733 2076 -3166 -3094 -2104 2569 3791 3165 5463 11050
8063A1050M988O162J4165J1959R405K102m245m590p119j2595q471q095o036m148
$$ 11050 16038 22200 36365 48324 57729 59831 55586 50996 43877 31282 22811 14716 8680 4532
8049D532J281L412K377m980m693M69J212K545O392j297k702k928k080J52N713
$$ 4532 5813 9225 11602 6622 1929 2398 3610 6155 12547 11250 8548 5620 3540 3692 9405
8034I405M672n396k918M03m193M96J430k214O8Q31j789J99j432n54J562l812Q04
$$ 9405 14077 8681 5763 6166 1973 2469 3899 1685 1753 2584 795 994 -438 -992 570 -3242 -2438
8017b438J951K560N568O367P215O704L968l025K705l062m966m291l247j69K366
$$ -2438 -487 2073 7641 14008 21223 27927 31895 28870 31575 28513 23547 19256 16009 15840 18206
8002A8206J078m963l817l483l511j101j332m96K558J233L018K250J837J187r16
$$ 18206 19284 14321 10504 7021 3510 2409 1077 581 3139 4372 7390 9640 11477 12664 11748
7987A1748k497J165M429L359m459k927k296j642l851j762j560m198L19M352J779
$$ 11748 9251 10416 14845 18204 13745 10818 8522 6880 3029 1267 -293 -4491 -4172 180 1959
7972A959J026q84J829k50L94L976O189N869M097K022J471l667K748j643o391o941
$$ 1959 2985 2101 3930 3680 4074 8050 14239 20108 24205 26227 27698 24031 26779 25136 18745 11804
7956A1804m882P82J714M42j523O88m143j912l492P56J103M275K614L13j77J567
$$ 11804 6922 7704 9418 9860 8337 9025 4882 2970 -522 234 1337 5612 8226 8539 8362 9929
7940I929j57L792L367j885m058l139j467K19L440K142l675k681l30J461K781J13
$$ 9929 9772 13564 16931 15046 10988 7849 6382 6601 10041 12183 8508 5827 5497 6958 9739 9852
7924I852J7M78N51J702L643M258k251j86L481P85l551l356o78k643n032r17K700
$$ 9852 9869 10347 10898 12600 16243 20501 18250 18064 21545 22330 18779 15423 14745 12102 7070 6153 8853
7907H853K835p55k152R77m06M328J148k180m047j817K626K288O24k571J617L015
$$ 8853 11688 10933 8781 9758 9352 13680 14828 12648 8601 6784 9410 11698 12322 9751 11368 14383
7891A4383K17j301j705o32j390m414R33j807j907k45M941J399l901k791l318L110
$$ 14383 14600 13299 11594 10962 9572 5158 6091 4284 2377 2132 7073 8472 4571 1780 -1538 1572
7875A572N837O05j019k8N45K878j085n04r13j127J813j388n72J657k147J47l32
$$ 1572 7409 8014 6995 6967 7512 10390 9305 8801 7888 6761 8574 7186 6614 8271 6124 6271 5939
7858E939k66J446m330k087K331J235J784J814K922k249k051j380k718n576k627
$$ 5939 5673 7119 2789 702 3033 4268 6052 7866 10788 8539 6488 5108 2390 -3186 -5813
7843e813R141O104j364Q65k011k208j121o49Q9m084K014N773K17j626J682j6j553
$$ -5813 3328 9432 8068 8933 6922 4714 3593 2944 3033 -1051 963 6736 6953 5327 7009 6993 5440
7826E440J154l771J485L372j595n346l300O233M184k491n107o27K7K416K404K047
$$ 5440 6594 2823 4308 7680 6085 739 -2561 3672 7856 5365 258 -369 -342 2074 4478 6525
7810F525J307j055j728k455L123L270J830o22k691m377o23j053J521J584r62M05
$$ 6525 7832 6777 5049 2594 5717 8987 10817 10195 7504 3127 2504 1451 2972 4556 3594 3999
7794C999l692j567J510L0j53r47O42j697L79K726K783N39P87K0n07o97j469K26
$$ 3999 307 -1260 250 280 127 -820 -178 -1875 -1496 1230 4013 4552 5339 5359 4852 4155 2686 2912
7776B912K31k374L69J219K54M971K389m306m162K234N885k632j956L03K933P05
$$ 2912 3143 769 1138 2357 2611 7582 9971 5665 1503 3737 9622 6990 5034 5337 8270 8975
7760H975j741n108k270K503J92R89O21p504m420L594M561Q16J186k753J338J696
$$ 8975 7234 2126 -144 2359 2551 3540 4161 -3343 -7763 -4169 392 1208 2394 -359 979 2675
7744B675R25j177k231k064M85l246m68L189J337p68J34N66j208K927K055J40J030
$$ 2675 3600 2423 192 -1872 -1387 -4633 -5101 -1912 -575 -1343 -1209 -643 -1851 1076 3131 3271 4301
7727D301r45k539Q62K841N89k606M49l257k919L855l91l756n51J674R80J446k993
$$ 4301 3356 817 1679 4520 5109 2503 2952 -305 -3224 631 240 -3516 -4067 -2393 -1413 33 -2960
7710b960J353K240M84j353l199k217M24O68J832j326j020k632j226M080O113l063
$$ -2960 -1607 633 1117 -236 -3435 -5652 -5228 -4560 -2728 -4054 -5074 -7706 -8932 -4852 1261 -1802
7694a802l521j388J034M52j696L768K832k704K696N21j840J600j483L918l336
$$ -1802 -5323 -6711 -5677 -5225 -6921 -3153 -321 -3025 -329 192 -1648 -48 -1531 2387 -949
7679i49l134J496j683j804k160j909L880N958Q83l814L64n33J214Q04l754j135
$$ -949 -4083 -2587 -4270 -6074 -8234 -10143 -6263 -305 578 -3236 -2872 -3405 -2191 -1387 -5141 -6276
7663f276K355L674M796l41J35j611m349r65p4l172j8k8J161k943R4O13M311K952
$$ -6276 -3921 -247 4549 4208 4343 2732 -1617 -2582 -2656 -5828 -5846 -5874 -4713 -7656 -7562 -6949 -2638 314
7645C14j746j261k239J080Q4o18M79J560K46l011J10K991J121K347K93l825j69
$$ 314 -1432 -2693 -4932 -3852 -3768 -4386 -3907 -2347 -2101 -5112 -5002 -2011 -890 1457 1750 -2075 -2244
7628b244J562k215k766k315L21L204l47Q2j030Q53K943R58J186j196P76p85q79
$$ -2244 -682 -2897 -5663 -7978 -7657 -4453 -4800 -4718 -5748 -4895 -1952 -994 192 -1004 -228 -1013 -1892
7611a892m571k704M911j012J73N057J715M9l393l7O96j06L77k66J603K208k416
$$ -1892 -6463 -9167 -4256 -5268 -5095 -38 1677 1726 -1667 -1704 -1008 -1114 -737 -1003 600 2808 392
7594C92k335K195m048o036j97N334M775J727n9j710L719l302n554m279Q05L743
$$ 392 -1943 252 -3796 -9832 -10029 -4695 80 1807 1748 38 3757 455 -5099 -9378 -8573 -4830
7578d830M425J634k540j981K603J046j871L776J528m308L77M877k479K569R03
$$ -4830 -405 1229 -1311 -3292 -689 357 -1514 2262 3790 -518 -141 4736 2257 4826 5729
7563E729k599o82K102j658k277l558l383o55q8L60J483K996M384N218L553j195
$$ 5729 3130 2448 4550 2892 615 -2943 -6326 -6981 -7069 -6709 -5226 -2230 2154 7372 10925 9730
7547I730o730j271J536k456o651j803K410L67O60M094R97j058k159k265J406P57
$$ 9730 3000 1729 3265 809 -5842 -7645 -5235 -4868 -4208 -114 883 -175 -2334 -4599 -3193 -2436
7531b436k707k239l12M361M276j11k854K80j947k903J11K387K15J398K01m238
$$ -2436 -5143 -7382 -7694 -3333 943 832 -2022 -1742 -3689 -6592 -6481 -4094 -3879 -2481 -2280 -6518
7515f518j736J127o95K002K543k072J900J495L19j44m442j520n87j393O4K437
$$ -6518 -8254 -7127 -7822 -5820 -3277 -5349 -3449 -1954 -1635 -1779 -6221 -7741 -8328 -9721 -9657 -7220
7499g220M214L742r85k155l356L77J819K938J22m124l030M48j367k7l84k279J925
$$ -7220 -3006 736 -249 -2404 -5760 -5383 -3564 -626 -504 -4628 -7658 -7210 -8577 -8604 -8988 -11267 -9342
7482i342J660j408K485N932M904O22o20j40m791k883M80L287J303o06k754l659
$$ -9342 -7682 -9090 -6605 -673 4231 4853 4233 4093 -698 -3581 -3101 186 1489 883 -1871 -5530
7466e530K381O54j221j3Q01o54m58J216k216N18K462M379j650j298k572J69K811
$$ -5530 -3149 -2495 -3716 -3729 -2928 -3582 -4040 -2824 -5040 -4522 -2060 2319 669 -629 -3201 -3032 -221
7449b21N232K927k85o920l233J89j45j617k618O46L739q42L986J698k201m505
$$ -221 5011 7938 7653 733 -2500 -2311 -2456 -4073 -6691 -6045 -2306 -3148 838 2536 335 -4170
7433d170l088J330P07k558m387J145L640N10J316J851O6K319P38l942K534L664
$$ -4170 -7258 -5928 -5221 -7779 -12166 -11021 -7381 -6871 -5555 -3704 -3638 -1319 -581 -4523 -1989 1675
7417A675K248j445j420m60l135j119k89J726j697p7N017J939k272J815K623J70
$$ 1675 3923 2478 1058 598 -2537 -3656 -3945 -2219 -3916 -3993 1024 2963 691 2506 5129 5299
7401E299l859k451J483p92j844r55l159k39J319j418J385l32R83PL043K840o50
$$ 5299 1440 -1011 472 -320 -2164 -3119 -6278 -6517 -5198 -6616 -5231 -5563 -4580 -4573 -1530 1310 660
7384F60K061K989O65j464j614l39m621K90K855N41j738Q23M881o45l361O97L167
$$ 660 2721 5710 6375 4911 3297 2958 -1663 -1373 1482 2023 285 1108 5989 5344 1983 2680 5847
7367E847m6l824j561m026l241p44M508N555K060p93j677j335J149L36J208n737
$$ 5847 5801 1977 416 -3610 -6851 -7595 -3087 2468 4528 3735 2058 723 1872 2208 3416 -2321
7351b321k980M09J896l334K88J621m858q44K711j836K302M666J873j708O15P73
$$ -2321 -5301 -4892 -2996 -6330 -6042 -4421 -9279 -10123 -7412 -9248 -6946 -2280 -407 -2115 -1500 -727
7335g27j927p47l245j393L465J065K321Q69j247l621l354j782j874O892M666l552
$$ -727 -2654 -3401 -6646 -8039 -4574 -3509 -1188 -319 -1566 -5187 -8541 -10323 -12197 -5305 -639 -4191
7319d191k716q36L00l85K232K59k573L761O845k021o059k365R16L950r58k395
$$ -4191 -6907 -7743 -7443 -7828 -5596 -5337 -7910 -4149 2696 675 -5384 -7749 -6833 -2883 -3841 -6236
7303f236l43K094J256J625K605p5k239p80m28J855J160j419k388J124L216k774
$$ -6236 -6579 -4485 -3229 -1604 1001 926 -1313 -2093 -2521 -666 494 -925 -3313 -2189 1027 -1747
7287a747m402L175j75l800J700O151j594k685K18K313j301l698L693n96L413n84
$$ -1747 -6149 -2974 -3149 -6949 -5249 902 -692 -3377 -3159 -846 -2147 -5845 -2152 -2748 665 81
7271H1N10j032N52q29J766K84m915J69K923J0K732M27k042m794k582O583L981
$$ 81 591 -441 111 -718 1048 1332 -3583 -3414 -491 -481 2251 2678 636 -4158 -6740 -157 3824
7254C824j577l128j134L60k540l406K738O413l82j377l705k482M22M904K241O49
$$ 3824 2247 -881 -2015 -1655 -4195 -7601 -4863 1550 1168 -209 -3914 -6396 -5974 -1070 1171 1820
7238A820P29j997n343p00N83k223j443L47J497j087n29P6J348J81p58J366K677
$$ 1820 2549 552 -4791 -5491 -4908 -7131 -8574 -8227 -6730 -7817 -8346 -8270 -6922 -6741 -7499 -6133 -3456
7221c456r83l168N71k327N17L488l40J388R78r04j004L209p79J318M63P66k015
$$ -3456 -4439 -7607 -7036 -9363 -8846 -5358 -5698 -4310 -3332 -4236 -5240 -2031 -2810 -1492 -1029 -263 -2278
7204b278j051m56r43R92N425N42k316k816l818J081Q6L997N339P23k593n781q82
$$ -2278 -3329 -3785 -4728 -3736 1689 2231 -85 -2901 -6719 -5638 -5552 -1555 3784 4507 1914 -3867 -4749
7187d749j91K299M53j924P54J156j791j838j153K494o3l281k818K798K755K733
$$ -4749 -4940 -2641 -2188 -4112 -3358 -2202 -3993 -5831 -6984 -4490 -4553 -7834 -10652 -7854 -5099 -2366
7171b366J093l654K225R92j219j833j367j239K185K329O23Q48J605J806k804k599
$$ -2366 -1273 -4927 -2702 -1710 -2929 -4762 -6129 -7368 -5183 -2854 -2231 -1383 222 2028 -776 -3375
7155c375M385N242j935k348K884J838o543k436j306j049R96M092J530j556m97
$$ -3375 1010 6252 4317 1969 4853 6691 148 -2288 -3594 -4643 -3647 445 1975 419 -78
7140g8l366l095K347N738r05m659m991N62J214k93j809P86l36k046M657L216n52
$$ -78 -3444 -6539 -4192 1546 641 -4018 -9009 -8447 -7233 -7526 -9335 -8549 -8885 -10931 -6274 -3058 -3610
7123c610m73J993j613q70M333K891o523m537M089l41l112j145M88N22K898L948
$$ -3610 -4083 -2090 -3703 -4573 -240 2651 -3872 -8409 -4320 -4661 -7773 -8918 -8430 -7908 -5010 -1062
7107a062k95L305j685k284j903p46j956j953M713j771J190l97J990M419K321q89
$$ -1062 -1357 1948 263 -2021 -3924 -4670 -6626 -8579 -3866 -5637 -4447 -4844 -2854 1565 3886 2997
7091B997k489o43K467L220n61k57j887l979k859J801K246K654l063K989j423l394
$$ 2997 508 -135 2332 5552 4991 4734 2847 -1132 -3991 -2190 56 2710 -353 2636 1213 -2181
7075b181K743j257k502J994K587L734j286m541k007p55Q44R66j87K062m484l201
$$ -2181 562 -695 -3197 -1203 1384 5118 3832 -709 -2716 -3471 -2627 -1661 -1848 214 -4270 -7471
7059g471K037Q73J619M09j879l576j184J850L449k733j070J47J461K553J251N81
$$ -7471 -5434 -4561 -2942 -2533 -4412 -7988 -9172 -7322 -3873 -6606 -7676 -7529 -6068 -3515 -2264 -1683
7043a683L094J09n689P08L381L668R6k622j836k626k339j290K127K469J254M15
$$ -1683 1411 1520 -4169 -3461 -80 3588 3684 1062 -774 -3400 -5739 -7029 -4902 -2433 -1179 -764
7027g64L312o39l993l626L810K6m016Nk248J729K868M45Q18K612N557j577m889
$$ -764 2548 1909 -2084 -5710 -1900 -1874 -5890 -5885 -8133 -6404 -3536 -3091 -2273 339 5896 4319 -570
7010e70l681L33K613K225j851k471r25j888J782n46j77K115n452j021K238j638
$$ -570 -4251 -3918 -1305 920 -931 -3402 -4327 -6215 -4433 -4979 -5156 -3041 -8493 -9514 -7276 -8914
6994h914k576L718J829K872L989K498m444O94l496q93N62J847l232j219m72J222
$$ -8914 -11490 -7772 -5943 -3071 918 3416 -1028 -334 -3830 -4723 -4161 -2314 -5546 -6765 -7237 -6015
6978f015K875M247R23j700k632j263k260J257M21k64P50M450K149N18k790j388
$$ -6015 -3140 1107 2030 330 -2302 -3565 -5825 -4568 -4147 -4411 -3661 789 2938 3456 666 -722
6962g22J168K83q15k98J968j922j038j604k337K767O57K76j410Q00K436K404k027
$$ -722 446 729 -86 -384 1584 -338 -1376 -2980 -5317 -2550 -1893 -1617 -3027 -2227 209 2613 586
6945E86n913l693M230K359j786K99k665j069M627O231J884n909k564k769j22j508
$$ 586 -5327 -9020 -4790 -2431 -4217 -3918 -6583 -7652 -3025 3206 5090 -819 -3383 -6152 -6274 -7782
6929g782r0K363K38k153J98K538q34k651L16J043L928k28o84J568J283K035k498
$$ -7782 -7872 -5509 -5271 -7424 -7226 -4688 -5522 -8173 -7857 -6814 -2886 -3114 -3798 -2230 -947 1088 -1410
6912a410m44J735J715N70k919K855p62n49J764j412R09j804k379M340k025j762
$$ -1410 -1854 -119 1596 2166 -753 2102 1340 791 2555 1143 2052 248 -2131 2209 184 -1578
6896a578L912K672N98l609m165K647M189L698j098R8l582l094k525j001K233q83
$$ -1578 2334 5006 5604 1995 -2170 477 4666 8364 7266 7364 3782 688 -1837 -2838 -605 -1488
6880a488K062N062j265l6l168k047o58j810j043L382k813j681q39K879J728J342
$$ -1488 574 5636 4371 4335 1167 -880 -1538 -3348 -4391 -1009 -3822 -5503 -6342 -3463 -1735 -393
6864c93Q17j164q4p51j080J714r2l619j772N41J951M533j107j334J190j197k443
$$ -393 424 -740 -824 -1575 -2655 -941 -1033 -4652 -6424 -5883 -3932 601 -506 -1840 -650 -1847 -4290
6847d290j997o64O8L214J800j526Q8m12j028j482j000J529O87L70L743L729K68
$$ -4290 -6287 -6951 -6883 -3669 -1869 -3395 -3307 -3719 -4747 -6229 -7229 -5700 -5013 -4643 -900 2829 3097
6830C097j535o29j446o44j148j53L719j896q91k580j202J730J189J261j625k469
$$ 3097 1562 933 -513 -1157 -2305 -2458 1261 -635 -1526 -4106 -5308 -3578 -2389 -1128 -2753 -5222
6814e222m81r75l673k020L734L455J097J606N238K28m833k928j194J001M473L722
$$ -5222 -5703 -6678 -10351 -12371 -8637 -5182 -4085 -2479 2759 2987 -1846 -4774 -5968 -4967 -494 3228
6798C228l765l715L75K545R63l07l201O72J411R32k614j933K526N621J295n129
$$ 3228 -537 -4252 -3877 -1332 -369 -676 -3877 -3205 -1794 -862 -3476 -5409 -2883 2738 4033 -1096
6782a096n291M306P81l231K003m289n296k16N685M325j317K676L506K482J298
$$ -1096 -6387 -2081 -1300 -4531 -2528 -6817 -12113 -12329 -6644 -2319 -3636 -960 2546 5028 6326
6767F326O41Q2m381l832j222J997K887K246k39k248n543K711K12j054k510l114
$$ 6326 6967 7049 2668 -1164 -2386 -389 2498 4744 4505 2257 -3286 -575 -363 -1417 -3927 -7041
6751g041J729n1L995K632K907L745k955R15r53k660l151j119n44j82L49L755K070
$$ -7041 -5312 -5363 -1368 1264 4171 7916 4961 5876 4923 2263 -888 -2007 -2551 -2733 -2384 1371 3441
6734C441k997p27k17J009R21l310k122J213q5L237L489l113J590J4o873n08K777
$$ 3441 444 -283 -500 509 1430 -1880 -4002 -2789 -2874 363 3852 739 2329 2343 -4530 -5038 -2261
6717b261n39R00K118P03l375R94L612K142l912l669j504k360k401L839L471K853
$$ -2261 -2800 -1900 218 921 -2454 -1460 2152 4294 382 -3287 -4791 -7151 -9552 -5713 -2242 611
6701F11J97K79m271m708L304J18K364J773k271M7p56J308K771J152N9j53L399
$$ 611 808 1087 -3184 -7892 -4588 -4470 -2106 -333 -2604 -2557 -3313 -2005 766 1918 1977 1824 5223
6684E223J440p82j458l75Q4m936k0J959J54L450r9m503j716j592M30M268P43n808
$$ 5223 6663 5881 4423 4048 4132 -804 -824 1135 1289 4739 4640 137 -1579 -3171 -2741 1527 2270 -3538
6666c538j867k25j121N602J370m514m272M782L639J548J34j26q15j690p36J80
$$ -3538 -5405 -5630 -6751 -1149 221 -4293 -8565 -3783 -144 1404 1538 1412 597 -1093 -1829 -1649
6650a649J950j948J463K179J093l830k361N733J780o666k606J873L890j712o12
$$ -1649 301 -1647 -184 1995 3088 -742 -3103 2630 4410 -2256 -4862 -2989 901 -811 -1423
6635a423j099R70k804K462K426J863K250m46J122K670M05p234k466O375n17j560
$$ -1423 -2522 -1552 -4356 -1894 532 2395 4645 4199 5321 7991 8396 1162 -1304 5071 4554 2994
6619B994j920N867O269J563j344k219l586Q8O3j472l39k064J912k663j623j497
$$ 2994 1074 6941 13210 14773 13429 11210 7624 7712 7775 6303 5964 3900 5812 3149 1526 29
6603B9k026k150j434j607L086k14j308k132k754R50J407p30O08M834Q41j920l13
$$ 29 -1997 -4147 -5581 -7188 -4102 -4316 -5624 -7756 -10510 -9560 -8153 -8883 -8275 -3441 -2600 -4520 -4833
6586d833L821q25N10M437q53m113N75J660O3k962N436M239o20p52k953l624m132
$$ -4833 -1012 -1837 -1327 3110 2257 -1856 -1281 379 442 -2520 2916 7155 6535 5783 2830 -794 -4926
6569d926O9M010N869j417p258j355K515K251m189j46J557l418n52K526j202k310
$$ -4926 -4857 -847 5022 3605 -3653 -5008 -2493 -242 -4431 -4577 -3020 -6438 -6990 -4464 -5666 -7976
6553g976O6J320L047J465k568J16K377M148J002M85J639l19m609k06M77k204k615
$$ -7976 -7910 -6590 -3543 -2078 -4646 -4530 -2153 1995 2997 3482 5121 4802 193 -13 464 -1740 -4355
6536d355j98N77k974k141M269K354J649J166j541r45m268J988l98k333L213N331
$$ -4355 -4553 -3976 -6950 -9091 -4822 -2468 -819 347 -1194 -2139 -6407 -4419 -4817 -7150 -3937 1394
6520A394j7m02j252l865j328k088m7L133L884Q06M27J858J282n799k335J313k057
$$ 1394 1377 975 -277 -4142 -5470 -7558 -7605 -4472 -588 218 645 2503 3785 -2014 -4349 -3036 -5093
6503e093N65P382L119n094l614l389J510P886K519k777j842K874L56L088j140
$$ -5093 -4528 2854 5973 879 -2735 -6124 -4614 3272 5791 3014 1172 4046 4402 7490 6350
6488F350j598l775j137o34j040O09j162j171O280J458j76K08m726j705J476k06
$$ 6350 4752 977 -160 -794 -1834 -1225 -2387 -3558 2722 4180 4004 4212 -514 -2219 -743 -949
6472i49m4j287j727j610j799m037m79J225L717P13l848R19J632j593j409K55J414
$$ -949 -993 -2280 -4007 -5617 -7416 -11453 -11932 -10707 -6990 -6277 -10125 -9206 -7574 -9167 -10576 -10321 -8907
6455h907J466j515K39k64K567K084K060J4j327K572L18j903l198J967k17j037
$$ -8907 -7441 -8956 -8717 -8981 -6414 -4330 -2270 -2256 -3583 -1011 -693 -2596 -5794 -3827 -4044 -5081
6439e081K775Q89n42J647J080N418K183n715j388J815K374j101n513K020m94j528
$$ -5081 -2306 -1417 -1959 -312 768 6186 8369 2654 1266 3081 5455 4354 -1159 861 367 -1161
6423a161l37j869j194M976J233J60j240p8Q14K395n33m041J956m77j369j206o51
$$ -1161 -1498 -3367 -4561 415 1648 1808 568 490 1304 3699 3166 -875 1081 604 -765 -1971 -2622
6406b622k436n0J486j792l263O98J474K624K461K992l708j150J75L673M67N147
$$ -2622 -5058 -5108 -3622 -5414 -8677 -7979 -6505 -3881 -1420 1572 -2136 -3286 -3111 562 1029 6176
6390F176J22m357k417J21j947k836M77M108j3j939j454l59L409K536L30l827j685
$$ 6176 6298 1941 -476 -355 -2302 -5138 -4661 -553 -566 -2505 -3959 -4318 -909 1627 1957 -1870 -3555
6373c555k74k48L673R52m0j845j283J624J686M397q27m5J119l781l447j779p68
$$ -3555 -3829 -4077 -404 548 508 -1337 -2620 -996 690 5087 4260 4215 5334 1553 -1894 -3673 -4441
6356d441j013r95M446J321P66k403j586R1l31K744o97K16l160J925L792m430r91
$$ -4441 -5454 -6449 -2003 -682 84 -2319 -3905 -3814 -4145 -1401 -2098 -1882 -5042 -3117 675 -3755 -4746
6339d746L263J007j006p61j376o83J223L029J722L490r32n459J596L720j008n9
$$ -4746 -1483 -476 -1482 -2243 -3619 -4302 -3079 -50 1672 5162 4230 -1229 367 4087 3079 3020
6323C020j478j964P2K490J903J697j493j201L15L599j91m133oK144o006L117K834
$$ 3020 1542 -422 -350 2140 4043 5740 4247 3046 3361 6960 6769 2636 2630 4774 -1232 1885 4719
6306D719l654m668j396j764K349k944P12j210O48M232L181j668J771M06P16r80
$$ 4719 1065 -3603 -4999 -6763 -4414 -7358 -6646 -7856 -7208 -2976 205 -1463 308 714 1430 450
6290D50l96N526j545j874r92N17K22K352k202l119Q09j995j319P26R53J606m904
$$ 450 54 5580 4035 2161 1169 1686 1908 4260 2058 -1061 -252 -2247 -3566 -2840 -1887 -281 -5185
6273e185k278J155K473J098J650J862J931L259P9k266m002l956M878J429j519
$$ -5185 -7463 -6308 -3835 -2737 -1087 775 2706 5965 6044 3778 -224 -4180 698 2127 608
6258F08k145k345J651J142Q34n700L01J073Q81K815R27k166K626M75l170k695
$$ 608 -1537 -3882 -2231 -1089 -255 -5955 -5654 -4581 -3700 -885 42 -2124 502 977 -2193 -4888
6242d888n076J812M071l0J496K066j561J889j679m9K086K800L21m490m260j138
$$ -4888 -9964 -8152 -4081 -4111 -2615 -549 -2110 -221 -1900 -1949 137 2937 3258 -1232 -5492 -6630
6226f630P067J555k872J090n12m979K150l29J16K993L725r73m684k245P53k37
$$ -6630 437 1992 -880 210 -302 -5281 -3131 -3460 -3344 -351 3374 2401 -2283 -4528 -3775 -4012
6210d012J449j967m35o54M40j425J63L534K80m883o69L275o78o4K47M382J720
$$ -4012 -2563 -4530 -4965 -5619 -5179 -6604 -6441 -2907 -2627 -7510 -8179 -4904 -5582 -5646 -5399 -1017 703
6193G03o87j527k175l399L88K833J963L110M67K296j860N46L927p55k481j529
$$ 703 16 -1511 -3686 -7085 -6697 -3864 -1901 1209 1676 3972 2112 2658 6585 5830 3349 1820
6177A820K132M413j704n329j569m049r19n63k516K462L193J782K157K337L9p37
$$ 1820 3952 8365 6661 1332 -237 -4286 -5205 -5768 -8284 -5822 -2629 -847 1310 3647 3686 2949
6161B949o008k490j235K059K885L445L433k84K483j178l246K164k818l229J981
$$ 2949 -3059 -5549 -6784 -4725 -1840 1605 5038 4754 7237 6059 2813 4977 2159 -1070 911
6146I11j011N29m05l17J039K60N42O8l448m674J388OK695M53j235k923L193K305
$$ 911 -100 429 24 -293 746 1006 1548 1616 -1832 -6506 -5118 -5112 -2417 -1964 -3199 -6122 -2929 -624
6128f24N3K204j158p90m64M281m33n699n915K743K539L520L283j185k509K728
$$ -624 -571 1633 475 -315 -779 3502 3069 -2630 -8545 -5802 -3263 257 3540 2355 -154 2574
6112B574K779k375k793m551r27l067n008J159J756M045N27j21N038M488k420l747
$$ 2574 5353 2978 185 -4366 -5293 -8360 -13368 -12209 -10453 -6408 -5881 -6002 -964 3524 1104 -2643
6096b643O01P12O02O02o01k962l442n94kK757N09k571L572r37O94r18M97M89L447
$$ -2643 -2042 -1330 -728 -126 -727 -3689 -7131 -7725 -7727 -4970 -4461 -7032 -3460 -4397 -3703 -4621 -4124 -3635 -188
6077a88M341L036j067m822J52k468k624K252R25K705q28j169k123j450j115P127
$$ -188 4153 7189 6122 1300 1452 -1016 -3640 -1388 -463 2242 1414 245 -1878 -3328 -4443 2684
6061B684J951l437m231k443M487J895m200Q27j879p97K54M97K624l68R81k16J276
$$ 2684 4635 1198 -3033 -5476 -989 906 -3294 -2467 -4346 -5143 -4889 -4392 -1768 -2136 -1155 -1371 -95
6044i5L151L305K194k410l969O6k817P11K056k092j155K23k935k034L755L075
$$ -95 3056 6361 8555 6145 2176 2242 -575 136 2192 100 -1055 -832 -3767 -5801 -2046 1029
6028A029L343K925k318q76P98J890p99m967j066r39k313m528k497N012K544L669
$$ 1029 4372 7297 4979 4103 4901 6791 5992 1025 -41 -980 -3293 -7821 -10318 -5306 -2762 907
6012I07P19m306k851J374J001l30J51L350K270L40m24J455l958l165k365j154
$$ 907 1626 -2680 -5531 -4157 -3156 -3486 -3335 15 2285 2625 2201 3656 -302 -3467 -5832 -6986
5996f986L16J132J307L999k3l949r37k169J558N99j148j153O93L888J162J543
$$ -6986 -6670 -5538 -4231 -232 -255 -4204 -5141 -7310 -5752 -5153 -6301 -7454 -6761 -2873 -1711 -168
5980a68k143l620n02J62m045M78O272j321p64J667J113P46l875J909J920n6j326
$$ -168 -2311 -5931 -6433 -6271 -10316 -9838 -3566 -4887 -5651 -3984 -2871 -2125 -6000 -4091 -2171 -2227 -3553
5963c553l250K465J037L716L41m758J283p16K737L32K912N56m233J41o28r77Q24
$$ -3553 -6803 -4338 -3301 415 756 -4002 -2719 -3435 -698 -366 2546 3102 -1131 -990 -1618 -2595 -1771
5946a771L08K027r84o50k251k31N457L55l982K368O5l442K431j351k00J832M66
$$ -1771 -1463 564 -420 -1070 -3321 -3552 1905 2260 -1722 646 711 -2731 -300 -1651 -1851 -19 447
5929D47j871j277j071k893k811L07j239K778J986L287J153N58K099O68M11J279
$$ 447 -1424 -2701 -3772 -6665 -9476 -9169 -10408 -7630 -5644 -2357 -1204 -646 1453 2121 2532 3811
5913C811l360l394j854m31j06J55j202n63L617L352j06j897k569R86j414m86L440
$$ 3811 451 -2943 -4797 -5228 -5334 -5179 -6381 -6944 -3327 25 -81 -1978 -4547 -3561 -4975 -5461 -2021
5896b021j049k297j150j907K442J869k043Q51m28j493P51j35Q61L062M716j091
$$ -2021 -3070 -5367 -6517 -8424 -5982 -4113 -6156 -5305 -5733 -7226 -6475 -6610 -5749 -2687 2029 938
5880I38n343l203J113M004k151k954M63k29o17K880j584M316J394j508m338J489
$$ 938 -4405 -7608 -6495 -2491 -4642 -7596 -7133 -7362 -7979 -5099 -6683 -2367 -973 -2481 -6819 -5330
5864e330m74J727l07l647k60k574J571N822n50J269o89j619J985N01r90Q54j965
$$ -5330 -5804 -4077 -4384 -8031 -8291 -10865 -9294 -3472 -4022 -2753 -3442 -5061 -3076 -2575 -3565 -2711 -4676
5847d676j811j55n4O70J078j257M57K411J388K065l388l031j680L514M88j826
$$ -4676 -6487 -6642 -6696 -6026 -4948 -6205 -5748 -3337 -1949 116 -3272 -6303 -7983 -4469 -3981 -5807
5831e807l016J401J509r91J528K059N620J248n460l175N31p14l293N40L475K388
$$ -5807 -8823 -7422 -5913 -6904 -5376 -3317 2303 3551 -1909 -5084 -4553 -5267 -8560 -8020 -4545 -2157
5815b157K718K209q75j380R51N293k577p595J216K552J788O58J050j228l578n545
$$ -2157 561 2770 1895 515 1466 6759 4182 -3413 -2197 355 2143 2801 3851 2623 -955 -6500
5799f500l134M00J284J256J947L723j363PQ89K976Q51n546M47J237K712K052m615
$$ -6500 -9634 -9234 -7950 -6694 -4747 -1024 -2387 -2380 -1491 1485 2336 -3210 -2763 -1526 1186 3238 -1377
5782a377Q06K625m765k418L755J446j677P4J722m078j73k75j297L572L482k48
$$ -1377 -571 2054 -2711 -5129 -1374 72 -1605 -1531 191 -3887 -4060 -4335 -5632 -2060 1422 1174
5766A174k525l28j117K203L120L647j227m479k814J662j502o286k144J616N171
$$ 1174 -1351 -1679 -2796 -593 2527 6174 4947 468 -2346 -684 -2186 -8472 -10616 -9000 -3829
5751c829J535p70j785j667K765n04K13k277m480J571L477O036K041l18j679m928
$$ -3829 -2294 -3064 -4849 -6516 -3751 -4255 -4042 -6319 -10799 -9228 -5751 285 2326 2008 329 -4599
5735d599j90K703j108J550j65j431j568O34N158P28L69k98O42k283j981j199L366
$$ -4599 -4789 -2086 -3194 -1644 -1809 -3240 -4808 -4174 984 1712 2081 1783 2425 142 -1839 -3038 328
5718C28l84l993K739L42j695k512m96j563K416M362L282l706k640P5k633K361
$$ 328 -56 -4049 -1310 -968 -2663 -5175 -5671 -7234 -4818 -456 2826 -880 -3520 -3445 -6078 -3717
5702c717J133K232J37j273J487p99k288J017J356r94n95O364l818m57k023k687
$$ -3717 -2584 -352 -215 -1488 -1 -800 -3088 -2071 -715 -1709 -2304 4060 242 -215 -2238 -4925
5686d925J699K597j217l876K982J802O13j142k987j097j21P4K305j069j486p70
$$ -4925 -3226 -629 -1846 -5722 -2740 -938 -325 -1467 -4454 -5551 -5672 -5598 -3293 -4362 -5848 -6618
5670f618Q91K6M689K434K153J927l76k356j50m117l555K596N413k15j689k887
$$ -6618 -5727 -5701 -1012 1422 3575 5502 5126 2770 2620 -1497 -5052 -2456 2957 2742 1053 -1834
5654a834k098j262J064J123M520l191j66J415Q99K156J508j267k028p42j358O39
$$ -1834 -3932 -5194 -4130 -3007 1513 -1678 -1844 -429 470 2626 4134 2867 839 97 -1261 -622
5638f22K008L49K329l209n056k72p22M81J755K456j600R28J823M39J683O86k849
$$ -622 1386 1735 4064 855 -4201 -4473 -5195 -4714 -2959 -503 -2103 -1175 648 1087 2770 3456 607
5621F07J101j091J541j641J573K379j126l419k185j733J907N84j887M823Q49m884
$$ 607 1708 617 2158 517 2090 4469 3343 -76 -2261 -3994 -2087 -1503 -3390 1433 2282 -2602
5605b602j077M34k225q58N655K823k232j242l875J015N147J65l307R49L077K829
$$ -2602 -3679 -3245 -5470 -6328 -673 2150 -82 -1324 -5199 -4184 963 1128 -2179 -1230 1847 4676
5589D676l33k355j458k461l48N00J226J36N647K638m295J233k033l826k362k036
$$ 4676 4343 1988 530 -1931 -2279 -1779 -553 -417 5230 7868 3573 4806 2773 -1053 -3415 -5451
5573e451j281M00M809M032M53k441l3l06l152J361K372l568Q90O097J242l818
$$ -5451 -6732 -6332 -1523 2509 2962 521 488 182 -2970 -1609 763 -2805 -1915 4182 5424 1606
5557A606o799J447N347j099j298O98K258o45p27j207j19q62q37m55k2K40R21j87
$$ 1606 -5193 -3746 1601 502 -796 -98 2160 1515 788 -419 -538 -1400 -2237 -2692 -2714 -2474 -1553 -1740
5539a740l78n81M393J961k52J266l177m501k553j659K628O714j034m785m88j80
$$ -1740 -2118 -2699 1694 3655 3403 4669 1492 -3009 -5562 -7221 -4593 2121 1087 -3698 -4186 -4366
5523d366l53K114k19M48K358K140J389L98k543q05K870n82m100q11q8k289J830
$$ -4366 -4719 -2605 -2824 -2376 -18 2122 3511 3909 1366 561 3431 2849 -1251 -2062 -2150 -4439 -2609
5506b609N83P38N343K666k191l420k689K861L292l819j422J598J026k375q05p59
$$ -2609 -2026 -1288 4055 6721 4530 1110 -1579 1282 4574 755 -667 931 1957 -418 -1223 -1982
5490a982J723N375N226r16q078k844j789m019J0M285L159j680k807J482r43l657
$$ -1982 -259 5116 10342 9426 1348 -1496 -3285 -7304 -7294 -3009 150 -1530 -4337 -2855 -3798 -7455
5474g455L265p30k18Q60K844o90M616P31m783J63m20J881L217k502k996p18J684
$$ -7455 -4190 -4920 -5138 -4278 -1434 -2124 2492 3223 -1560 -1397 -1817 64 3281 779 -2217 -2935 -1251
5457a251k491k3L109k363L556j642l480L785N081l41k424k342Q42L317r28J95
$$ -1251 -3742 -3765 -656 -3019 537 -1105 -4585 -800 4281 3940 1516 -826 16 3333 2405 2600
5441B600n387l755J683L233J362N332J120j346l108k231J772M194r10m716m915
$$ 2600 -2787 -6542 -4859 -1626 -264 5068 6188 4842 1734 -497 1275 5469 4559 -157 -5072
5426e072M020K633p93j016J941K379K63N63l235k236O40m998J50N54l178R29K250
$$ -5072 -1052 1581 788 -228 1713 4092 4355 4918 1683 -553 87 -4911 -4761 -4207 -7385 -6456 -4206
5409d206j809J057K230N324K5k621k081p05k404L824L454K6l746k264J316J576
$$ -4206 -6015 -4958 -2728 2596 2621 0 -2081 -2786 -5190 -1366 2088 2114 -1632 -3896 -2580 -1004
5393a004J430m199j164K005j808L251M38M473K680o234j577K57J448J647j513
$$ -1004 426 -3773 -4937 -2932 -4740 -1489 -1051 3422 6102 -132 -1709 -1452 -4 1643 130
5378A30l335k811o06k159k91K071K938L327J221L671J742M56k447n165l034N59
$$ 130 -3205 -6016 -6622 -8781 -9072 -7001 -4063 -736 485 4156 5898 6354 3907 -1258 -4292 -3733
5362c733L269l342m128K20J403K331L741k28j050P33j96n315k346N89J983L994
$$ -3733 -464 -3806 -7934 -7714 -6311 -3980 -239 -467 -1517 -784 -980 -6295 -8641 -8052 -6069 -2075
5346b075M601J799n517K875M459l517M48L342k229k471m33K704J632l373l901
$$ -2075 2526 4325 -1192 1683 6142 2625 3073 6415 4186 1715 1282 3986 5618 2245 -1656
5331a656L694O269j020l118l248j801J045L277L561l424m505j99P39k192m740
$$ -1656 2038 8307 7287 4169 921 -880 165 3442 7003 3579 -926 -1125 -386 -2578 -7318
5316g318j317Q632J800j235j371k985J516K736k834l76J271m3k792j806K779L478
$$ -7318 -8635 -3 1797 562 -809 -3794 -2278 458 -2376 -2752 -1481 -1524 -4316 -6122 -3343 135
5300A35k048k980K535K770Q42l159k810j171M641M127M897m43m435l852J817L33
$$ 135 -1913 -4893 -2358 412 1254 -1905 -4715 -5886 -1245 2882 7779 7336 2901 -951 866 1199
5284A199P90j325K642r40P69k120M49m196m677o31M05M378j974P34O936r70n085
$$ 1199 1989 664 3306 2366 3135 1015 1464 -2732 -7409 -8040 -7635 -3257 -5231 -4497 2439 1469 -3616
5267c616L337K522m760j910j938j417J167K755L431J005m61j057M29K154J58l227
$$ -3616 -279 2243 -2517 -4427 -6365 -7782 -6615 -3860 -429 576 115 -942 -513 1641 1799 -1428
5251a428l258l842R82L937p9K084J977j622l621L34J112J263R94j111K52J51n211
$$ -1428 -4686 -8528 -7546 -3609 -3688 -1604 373 -1249 -4870 -4536 -3424 -2161 -1167 -2278 -2026 -1875 -7086
5234g086p00J079J350R28o33K003k565P7J985P28J995k1j327j563K825j644J025
$$ -7086 -7786 -6707 -5357 -4429 -5062 -3059 -5624 -5547 -3562 -2834 -839 -860 -2187 -3750 -925 -2569 -1544
5217a544O72L367k09m998j911J32J207R3J699J552l15O49J527j319N978p66n628
$$ -1544 -872 2495 2286 -2712 -4623 -4491 -3284 -3191 -1492 60 -255 394 1921 602 6580 5814 186
5200A86j325J247q81l859K190J102r16o645m694O425O06n884l331L744L397k42
$$ 186 -1139 108 -773 -4632 -2442 -1340 -2256 -8901 -13595 -7170 -6564 -12448 -15779 -12035 -8638 -8880
5184h880q45o38n95L538L84j021k069N066K311k787j05J469N041N969J112L49
$$ -8880 -9725 -10363 -10958 -7420 -7036 -8057 -10126 -5060 -2749 -5536 -5641 -4172 869 6838 7950 8299
5168H299M95n54m370j376l647j779r89j606J801O713L85j804l215j390J090K190
$$ 8299 8794 8240 3870 2494 -1153 -2932 -3921 -5527 -3726 2987 3372 1568 -1647 -3037 -1947 243
5152B43k023K20j298k80l089o112j232L476L94L786K731k907q88k058K262L549
$$ 243 -1780 -1560 -2858 -3138 -6227 -12339 -13571 -10095 -9701 -5915 -3184 -6091 -6979 -9037 -6775 -3226
5136c226P32J229K293m680l071J040j508L116L230K265R27o60l008k321J825L311
$$ -3226 -2494 -1265 1028 -3652 -6723 -5683 -7191 -4075 -845 1420 2347 1687 -1321 -3642 -1817 1494
5120A494m175m52K112O88J147O38j568j330L065J174j704k863k13J911J553j061
$$ 1494 -2681 -3133 -1021 -333 814 1452 -116 -1446 1619 2793 1089 -1774 -1987 -76 1477 416
5104D16l114K540l545j829q44N160l056n645L624N083K852Q90j718l851j017k1
$$ 416 -2698 -158 -3703 -5532 -6376 -1216 -4272 -9917 -6293 -1210 1642 2532 814 -3037 -4054 -4075
5088d075l04M712M419M78m492l641L831k86j768p02J505K077J76k488j72j804
$$ -4075 -4379 333 4752 5230 738 -2903 928 642 -1126 -1828 -323 1754 1930 -558 -730 -2534
5072b534q15n311n514J9L337L040M184O621q09j269J693P9K27J016M617K490k446
$$ -2534 -3349 -8660 -14174 -14155 -10818 -7778 -3594 3027 2218 949 2642 2721 2948 3964 8581 11071 8625
5055H625o783j587j550k39P52j086j207m127P2L120L830J879K476j456j088O84
$$ 8625 1842 255 -1295 -1534 -782 -1868 -3075 -7202 -7130 -4010 -180 1699 4175 2719 1631 2315
5039B315K776k033m896M12k944k00k880J968J618mp10J868l97Q44K224J662L13
$$ 2315 5091 3058 -1838 -1426 -4370 -4570 -7450 -5482 -3864 -3868 -4578 -2710 -3107 -2263 -39 1623 1936
5022A936m75m79j846o8j029n2n024M77M08L50K737r73j033J978n91l345K867L256
$$ 1936 1461 982 -864 -932 -1961 -2013 -7037 -6560 -6152 -5802 -3065 -4038 -5071 -3093 -3684 -7029 -4162 -906
5004i06M003R20j679o23o720j800j781l987K039K328L898P71L243J164k017P35
$$ -906 3097 4017 2338 1715 -5005 -6805 -8586 -12573 -10534 -8206 -4308 -3537 -294 870 -1147 -412
4988d12l84K86M65k255j57M258R91j899M131L8k155j995j022l352j123K277j092
$$ -412 -796 -510 -45 -2300 -2457 1801 2792 893 5024 5062 2907 912 -110 -3462 -4585 -2308 -3400
4971c400M56j640l208M009K735J137K016k654k95j636K729J137l425J089n86k40
$$ -3400 -2944 -4584 -7792 -3783 -1048 89 2105 -549 -844 -2480 249 1386 -2039 -950 -1536 -1776
4955a776L11J780K496K549l63m693M724N13n436K43j999j617j075O41M112N542
$$ -1776 -1465 315 2811 5360 4997 304 5028 5541 105 348 -1651 -3268 -4343 -3702 410 5952
4939E952m98r58j630l907k996J519n605K431M955K608k96j912R86q49k411K655
$$ 5952 5454 4496 2866 -1041 -4037 -2518 -8123 -5692 -737 1871 1575 -337 649 -200 -2611 44
4923D4N99k857j395k258R93j270J235J753J355J690L510n17Q93O34M7R11L1K725
$$ 44 643 -2214 -3609 -5867 -4874 -6144 -4909 -3156 -1801 -111 3399 2882 3775 4409 4456 5367 5398 8123
4905H123m62n902j528Q95k160k411j198j536M998j144k011o35j192o27K537J306
$$ 8123 7661 1759 231 1126 -1034 -3445 -4643 -6179 -1181 -2325 -4336 -4971 -6163 -6790 -4253 -2947
4889b947L934L67m081l754J464L877k050n8j594R51J85J127j73k055L012N117
$$ -2947 987 1354 -2727 -6481 -5017 -1140 -3190 -3248 -4842 -3891 -3706 -2579 -2752 -4807 -1795 3322
4873C322l692Mj696K735J403l76k216J007j775r48K445L581j091n25M090q68m831
$$ 3322 -370 -366 -2062 673 2076 1700 -516 491 -1284 -2232 213 3794 2703 2178 6268 5400 569
4856E69n94j208J075k734p69R83L256r12k41K427J728J253k427l83J137P84r15
$$ 569 -25 -1233 -158 -2892 -3661 -2678 578 -334 -575 1852 3580 4833 2406 2023 3160 3944 3029
4839C029k335p0j160M60j478j776j585p88r64O96K35M141L254r45n831m573J141
$$ 3029 694 624 -536 -76 -1554 -3330 -4915 -5703 -6667 -5971 -5736 -1595 1659 714 -5117 -9690 -8549
4822h549R693N224j922n711k303K116L064j46o467k833K826K637J32R45K63O97
$$ -8549 1144 6368 4446 -1265 -3568 -1452 1612 1466 -5001 -7834 -5008 -2371 -2239 -1294 -1031 -334
4806c34M25M64k942l594k124q00N434L902N738J495k596m064j137O66n94j525
$$ -334 91 555 -2387 -5981 -8105 -8905 -3471 431 6169 7664 5068 1004 -133 533 -61 -1586
4790a586k107j830J142J471M487J215l29l012K606p24k692J15j485r56J643K736
$$ -1586 -3693 -5523 -4381 -2910 1577 2792 2463 -549 2057 1333 -1359 -1244 -2729 -3685 -2042 694
4774F94j41l724k086l347J240L548m83J815K145J947l640m079r65J761K915kR37
$$ 694 553 -3171 -5257 -8604 -7364 -3816 -4299 -2484 -339 1608 -2032 -6111 -7076 -5315 -2400 -2402 -1465
4757a465M66j766J077J184j254j273k202l185O09J888Q11L111K068j504O73l93
$$ -1465 -999 -2765 -1688 -504 -1758 -3031 -5233 -8418 -7809 -5921 -5110 -1999 69 -1435 -762 -1155
4741a155Q26L46K324J276J902m839k593J625K057J452n95Q50j375m681k831J210
$$ -1155 -329 17 2341 3617 5519 680 -1913 -288 1769 3221 2626 3476 2101 -2580 -5411 -4201
4725d201K955J717n39L1o71o96O28m43J495j555M52K69J494K646M76J161k442
$$ -4201 -1246 471 -68 -37 -708 -1404 -776 -1219 276 -1279 -827 -558 936 3582 4058 5219 2777
4708B777k831o64J656j791M6k863k60L425p1j882j456j931K125K71j253R34m105
$$ 2777 -54 -718 938 -853 -807 -3670 -3930 -505 -576 -2458 -3914 -5845 -3720 -3449 -4702 -3768 -7873
4691g873q47J45L288J376R80m643R92N110q10M05K078L12K233m32l517o78j775
$$ -7873 -8720 -8575 -5287 -3911 -2931 -7574 -6582 -1472 -2282 -1877 201 513 2746 2314 -1203 -1881 -3656
4674c656n719K040O169Q25L075k589n956l703K216L139l00N768N87q44L80M7J445
$$ -3656 -9375 -7335 -1166 -341 2734 145 -5811 -9514 -7298 -4159 -4459 1309 1896 1052 1432 1479 2924
4657B924o12j896k85l70K630k391n601K618K217j697J302J495m6j107l857j033
$$ 2924 2312 416 131 -239 2391 0 -5601 -2983 -766 -2463 -1161 334 288 -819 -4676 -5709
4641e709M017O89j299K224K414j275j04P17k244K446K083m637r40N15m705J356
$$ -5709 -1692 -1003 -2302 -78 2336 1061 957 1674 -570 1876 3959 -678 -1618 -1103 -5808 -4452
4625d452O75p24J145J354o14j411j22k413L1R96L257K017J971k630r63R88K109
$$ -4452 -3777 -4501 -3356 -2002 -2616 -4027 -4149 -6562 -6531 -5535 -2278 -261 1710 -920 -1883 -895 1214
4608A214j498L39j18k607M21K140J295j404j467k159j299L888K925r0l024l028
$$ 1214 -284 55 -63 -2670 -2249 -109 1186 -218 -1685 -3844 -5143 -1255 1670 1580 -1444 -4472
4592d472l33J934k530K1P51K57K12K656J084k330J774m006k321J769q8L210J491
$$ -4472 -4805 -2871 -5401 -5380 -4629 -4372 -4160 -1504 -420 -2750 -976 -4982 -7303 -5534 -5622 -2412 -921
4575i21K854L558k674j18J685k216p71K736K466J960n752j678K990M08m572m548
$$ -921 1933 5491 2817 2699 4384 2168 1397 4133 6599 8559 2807 1129 4119 4527 -45 -4593
4559d593L701N259L871n484n155K129p10K609K744Q13q87r69j819j919n77J058
$$ -4593 -892 4367 8238 2754 -2401 -272 -982 1627 4371 5184 4297 3328 1509 -410 -987 71
4543G1O81L821P66m811n20K790K593j287m1J663j294l36k064o677l828M338j32
$$ 71 752 4573 5339 528 8 2798 5391 4104 4063 5726 4432 4096 2032 -4645 -8473 -4135 -4267
4526d267p71J524L640o86J034j736K229J491k648n175L136K51J415M811L568L23
$$ -4267 -5038 -3514 126 -560 474 -1262 967 2458 -190 -5365 -2229 -1978 -563 4248 7816 8139
4510H139l266m339o97j114L329L57j193K22l4k256K340K645q58j411n139J347
$$ 8139 4873 534 -163 -1277 2052 2409 1216 1438 1404 -852 1488 4133 3275 1864 -3275 -1928
4494a928N217P67K529J611k549n780m159J305M329N165k051l137r62K280m63l44
$$ -1928 3289 4056 6585 8196 5647 -133 -4292 -2987 1342 6507 4456 1319 357 2637 2174 1830
4478A830j964n436j49O602K810O06j769J006R29k666k291J03K923j697r01M027
$$ 1830 -134 -5570 -5719 883 3693 4299 2530 3536 4465 1799 -492 -389 2534 837 -64 3963
4462C963j684n227m283J452L563J858n99k427N631L598J556o966l997Q08l41K584
$$ 3963 2279 -2948 -7231 -5779 -2216 -358 -957 -3384 2247 5845 7401 435 -3562 -2754 -3095 -511
4446e11L192P97j703n40l321k264J373K501J122k119L72J104K874j962M09K224
$$ -511 2681 3478 1775 1235 -2086 -4350 -2977 -476 646 -1473 -1101 3 2877 915 1324 3548
4430C548l62L15K078k057l773p3n79L56k53l235j093J308O07N81N54J075m77Q95
$$ 3548 3186 3501 5579 3522 -251 -324 -903 -547 -800 -4035 -5128 -3820 -3213 -2632 -2078 -1003 -1480 -585
4412e85N73Q28K41j018K308N31K358L22o151m245J479j73j497n81L92K531j027
$$ -585 -12 816 1057 39 2347 2878 5236 5558 -593 -4838 -3359 -3532 -5029 -5610 -5218 -2687 -3714
4395c714l407K785L847L519J386j252k729K840J441k006l129n393n45N907L450
$$ -3714 -7121 -4336 -489 3030 4416 3164 435 3275 4716 2710 -419 -5812 -6357 -450 3000
4380C000o888l542j033P85j373j98M949K784K293K618k688l448k101o99K015Q57
$$ 3000 -3888 -7430 -8463 -7678 -9051 -9249 -4300 -1516 777 3395 707 -2741 -4842 -5541 -3526 -2669
4364b669p23J538J656p58J628j217J042M50l966l327m56K825K869J863k955j653
$$ -2669 -3392 -1854 -198 -956 672 -545 497 947 -3019 -6346 -6802 -3977 -1108 755 -2200 -3853
4348c853p48n87q44K73Q0M016K241p23k842k097m5M791J075J222j270l363P96
$$ -3853 -4601 -5188 -6032 -5759 -5679 -1663 578 -145 -2987 -5084 -5129 -338 737 1959 689 -2674 -1878
4331a878J106M99j888k62K669J698j393K701k172J839J402m244m045m237p72M681
$$ -1878 -772 -273 -2161 -2423 246 1944 551 3252 1080 2919 4321 77 -3968 -8205 -8977 -4296
4315d296O670K861l423n318NQ97l900j104L449L185k727r14N531L137r28m146
$$ -4296 2374 5235 1812 -3506 -3501 -2604 -6504 -7608 -4159 -974 -3701 -4615 916 4053 3125 -1021
4299a021K484q07M053p31n494L380j126m263N026L060m552L52M11l776Q48L108
$$ -1021 1463 656 4709 3978 -1516 1864 738 -3525 1501 4561 9 361 772 -3004 -2156 952
4283I52l677m858o28J454L579K877p76L183M675k064j536j511m31K669M417J42
$$ 952 -2725 -7583 -8211 -6757 -3178 -301 -1077 2106 6781 4717 3181 1670 1239 3908 8325 8467
4267H467k471k853l279j687M548L393J928n153m650k027J766J959J455k078J118
$$ 8467 5996 3143 -136 -1823 2725 6118 8046 2893 -1757 -3784 -2018 -59 1396 -682 436
4252D36M64n12J731j463J982p98k815M6K711m373k275J379q84j277q12K233N737
$$ 436 900 388 2119 656 2638 1840 -975 -929 1782 -2591 -4866 -3487 -4371 -5648 -6460 -4227 1510
4235A510O82K032R83q92k938o84J16l530p056K072O407Q48R3P77M699J568R43
$$ 1510 2192 4224 5207 4315 1377 693 809 -2721 -9777 -7705 -1298 -450 -357 420 5119 6687 7630
4218G630r62l684J87L70k153J39M64j68k718k29J032q35m09j705N80j638O28L95
$$ 7630 6668 2984 3171 3541 1388 1527 1991 1823 -895 -1124 -92 -927 -1336 -3041 -2461 -4099 -3471 -3076
4200c076q12K34J925J108m340N41K460M108J610k071o0L749l624o333j743l682
$$ -3076 -3888 -3654 -1729 -621 -4961 -4420 -1960 2148 3758 1687 1627 5376 1752 -4581 -6324 -10006
4184a0006m050k662K117P370M794K189K450M46r81J486N34j747k763m05k445k03
$$ -10006 -14056 -16718 -14601 -7231 -2437 -248 2202 2648 1667 3153 3687 1940 -823 -1228 -3673 -3876
4168c876K694J112j94J369L306n70k779o00J715m54o44m107m221m94M528N63J666
$$ -3876 -1182 -70 -264 1105 4411 3841 1062 462 2177 1723 1079 -3028 -7249 -7743 -3215 -2652 -986
4151i86M372M215Q07o085o009l305J72J701n17K50j320k062J217K982P996n63
$$ -986 3386 7601 8408 2323 -3686 -6991 -6819 -5118 -5635 -5385 -6705 -8767 -7550 -4568 3428 2865
4135B865l46k115j463J260K300O25m089J865j920p39J867l33o11j301n18M35K772
$$ 2865 2519 404 -1059 201 2501 3126 -963 902 -1018 -1757 110 -223 -834 -2135 -2653 -2218 554
4118E54L948j768j992j016N608P656j460l564l802l557j920P93K431Q53o016j986
$$ 554 4502 2734 742 -274 5334 12990 11530 7966 4164 607 -1313 -520 1911 2764 -3252 -5238
4102e238L630k088m504K593M567L663N40k295j726n039m75L419J708J059l07k32
$$ -5238 -1608 -3696 -8200 -5607 -1040 2623 3163 868 -858 -5897 -6372 -2953 -1245 -186 -493 -725
4086g25K922j146l193P36O59j425J241j268k621r01N155P53K869q09n0k506j280
$$ -725 2197 1051 -2142 -1406 -747 -2172 -931 -2199 -4820 -5721 -566 187 3056 2247 2197 -309 -1589
4069a589J251N432j149O84l059m361j564M49J321M939j275l378J427J771k392
$$ -1589 -338 5094 3945 4629 1570 -2791 -4355 -3906 -2585 2354 1079 -2299 -872 899 -1493
4054a493j633O5L283q24n044j751L496M387J755M58j290k473k20J41k19j023r74
$$ -1493 -3126 -3061 222 -602 -5646 -7397 -3901 486 2241 2699 1409 -1064 -1284 -1143 -1362 -2385 -3359
4037c359K410M720K604j072m542l493k66k079J034l491n82N10m72K08k087J594
$$ -3359 -949 3771 6375 5303 761 -2732 -2998 -5077 -4043 -7534 -8116 -7606 -8078 -7870 -9957 -8363
4021h363p09M34O864K491j776M677K769k753j552k817K785j508j622M263o01l936
$$ -8363 -9072 -8638 -1774 717 -1059 3618 6387 3634 2082 -735 2050 542 -1080 3183 2582 -1354
4005a354n052K348P97m883m034J115K563J935L942J282N345K385K491j168j771
$$ -1354 -6406 -4058 -3261 -8144 -12178 -11063 -8500 -6565 -2623 -1341 4004 6389 8880 7712 5941
3990E941j811J62J664J408k232k645k734j944j421j426J268K554R5k256L226K131
$$ 5941 4130 4292 5956 7364 5132 2487 -247 -2191 -3612 -5038 -3770 -1216 -1121 -3377 -151 1980
3974A980k713p3j327o30N751M675l544J3L261l049K99j202l941q70n17J278L572
$$ 1980 -733 -806 -2133 -2763 2988 7663 4119 4132 7393 4344 4643 3441 -500 -1370 -1887 -609 2963
3957B963j451J09L781k024l376m693K726M796J397l816m26J080J614R58j367j336
$$ 2963 1512 1621 5402 3378 2 -4691 -1965 2831 4228 412 -14 1066 2680 3638 2271 935
3941I35j921L936L081j841o510M189L965R62k551j106j911R29K732m07J30k000
$$ 935 -986 2950 6031 4190 -2320 1869 5834 6796 4245 3139 1228 2157 4889 4482 4612 2612
3925B612o15j634l16J39k749Q20J053L092q07j082N56j228j649M50j345l4L672
$$ 2612 1997 363 47 186 -2563 -1743 -690 2402 1595 513 1069 -159 -1808 -1358 -2703 -2737 935
3908I35N581O51m731l679J482p81J657k907k520J079J533K001j375O80J719J869
$$ 935 6516 7167 2436 -1243 239 -542 1115 -1792 -4312 -3233 -1700 301 -1074 -394 1325 3194
3892C194l445N44m2J354L477L95P59k024J321L121j789m382M2J439p40k735l044
$$ 3194 -251 293 251 1605 5082 5477 6236 4212 5533 8654 6865 2483 2525 3964 3224 489 -2555
3875b555l825k41K8L033K29k65M18K318o7j860K87Q16j637m093L623K743l150
$$ -2555 -6380 -6621 -6593 -3560 -3331 -3596 -3178 -860 -927 -2787 -2500 -1684 -3321 -7414 -3791 -1048 -4198
3858d198k421L526o5k695j522K090K324M169K826M50m388P55k749k977N007M76
$$ -4198 -6619 -3093 -3158 -5853 -7375 -5285 -2961 1208 4034 4484 96 851 -1898 -4875 132 608
3842F08j607j298J4L239J492k55j195J098j199l467j057J587L180K620m333K30
$$ 608 -999 -2297 -2283 956 2448 2193 998 2096 897 -2570 -3627 -2040 1140 3760 -573 -343
3826c43M77j378J541k634l418J553M801K873K805l958j301j938j090n59K880J148
$$ -343 134 -1244 297 -2337 -5755 -4202 599 3472 6277 2319 1018 -920 -2010 -2569 311 1459
3810A459k971l466M669K390j675Q37J932j899m663n37L986j870K096L251m471
$$ 1459 -1512 -4978 -309 2081 406 1243 3175 1276 -3387 -3924 62 -1808 288 3539 -932
3795i32k072N015J931k55k808l412O51J4J215J47P4M773J124j910k999R21N533
$$ -932 -3004 2011 3942 3687 879 -2533 -1882 -1868 -653 -506 -432 4341 5465 3555 556 1477 7010
3778G010Q88J254l394n651k188l504j998N28K817K260J821j263j123J019K61O08
$$ 7010 7898 9152 5758 107 -2081 -5585 -7583 -7055 -4238 -1978 -157 -1420 -2543 -1524 -1263 -655
3762f55J206K316J347j240R81K752j216k735l281m266J408l027K23j610N702M988
$$ -655 551 2867 4214 2974 3955 6707 5491 2756 -525 -4791 -3383 -6410 -6187 -7797 -2095 2893
3746B893q95M254J885l703n05O95J944j154k873m335L82O85L250m13k06K624M097
$$ 2893 1998 6252 8137 4434 3929 4624 6568 5414 2541 -1794 -1412 -727 2523 2110 1904 4528 8625
3729H625j772L593J098l101J89l428o090r88N929L72J057m08m96K396J511L19
$$ 8625 6853 10446 11544 8443 8632 5204 -886 -1874 4055 4427 5484 5076 4580 6976 8487 8806
3713H806l580m638k940j607j131m86K583L034p2k806j052M035K408R5k053j979
$$ 8806 5226 588 -2352 -3959 -5090 -5576 -2993 41 -31 -2837 -3889 146 2554 2649 596 -1383
3697a383K056K47L269k116j171j477J781O76k298k39J16O144J395m365j430k891
$$ -1383 673 920 4189 2073 902 -575 1206 1882 -416 -655 -539 5605 7000 2635 1205 -1686
3681a686k713m28L335N750L77j034L78l00n107k828K059Q0o81J621M54n07r4l16
$$ -1686 -4399 -4827 -1492 4258 4635 3601 3979 3679 -1428 -4256 -2197 -2117 -2798 -1177 -723 -1230 -1324 -1640
3663a640J194M672J17k23l741K278J149l124o85n54K397j041m888p85L470K122
$$ -1640 -446 4226 4343 4120 379 2657 3806 682 -3 -557 1840 799 -4089 -4874 -1404 718
3647G18k424l055N12N03L112N37k297l99L035M20k14K646m794n085M074l01R29
$$ 718 -1706 -4761 -4249 -3746 -634 -97 -2394 -2793 242 662 448 3094 -1700 -6785 -2711 -3012 -2083
3630b083m380n3J77K832M734L397q17Q04l20n478j426J050J773j512j234K862
$$ -2083 -6463 -6516 -6339 -3507 1227 4624 3807 4611 4291 -1187 -2613 -1563 210 -1302 -2536 326
3614C26m767q20K680K798k580m281J323K04j765J822L299o22k581P59M223K024
$$ 326 -4441 -5261 -2581 217 -2363 -6644 -5321 -5117 -6882 -5060 -1761 -2383 -4964 -4205 18 2042
3598B042k158M15J840n144r20J96J562K742L435N04J69j327l474K012J846J73
$$ 2042 -116 299 2139 -3005 -3925 -3729 -2167 575 4010 4514 4683 3356 -118 1894 3740 3913
3582C913p13m98J354k619k66K068j753k284j083J146j527J058K875p43k018N04
$$ 3913 3200 2702 4056 1437 1171 3239 1486 -798 -1881 -735 -2262 -1204 1671 928 -1090 -586
3566e86p97L068N385K052l661J216j843m820k992Q87L34J109J863o92o33j857
$$ -586 -1383 1685 7070 9122 5461 6677 4834 14 -2978 -2091 -1757 -648 1215 523 -110 -1967
3550a967j731K122M977J700k459j281j874O75K823R16k407k160k130m506l360
$$ -1967 -3698 -1576 3401 5101 2642 1361 -513 162 2985 3901 1494 -666 -2796 -7302 -10662
3535a0662Q7Q11N4J333J924N157K50j783l08L499l64N423o25j489l903J76L705
$$ -10662 -10575 -9764 -9710 -8377 -6453 -1296 -1046 -2829 -3137 362 -2 5421 4796 3307 -596 -420 3285
3518C285N07j45J165j15k792l468j577q67J587l593J696O178j412l468k378m10
$$ 3285 3792 3647 4812 4697 1905 -1563 -3140 -4007 -2420 -6013 -4317 1861 449 -3019 -5397 -5807
3502e807M139K536L783K702j536m135l976J376K785j140q87j464m14J342K520
$$ -5807 -1668 868 4651 7353 5817 1682 -2294 -918 1867 727 -160 -1624 -2038 -696 1824
3487A824K740q75k039N82K074J337L369Q25p934j675J294K51K176j34q67j495
$$ 1824 4564 3689 1650 2232 4306 5643 9012 9837 1903 228 1522 1773 3949 3815 2948 1453
3471A453k266k051M202K305k261nj18r3j571j55J33M87j03K169L81m460j489O16
$$ 1453 -813 -2864 1338 3643 1382 1377 1259 1166 -405 -560 -427 60 -43 2126 2507 -1953 -3442 -2826
3453b826k820k3M75J219j381Q95j998J555O03J743K01K45M201l700k046j250k797
$$ -2826 -5646 -5669 -5194 -3975 -5356 -4461 -6459 -4904 -4301 -2558 -2357 -2112 2089 -1611 -3657 -4907 -7704
3436g704L0M037J301K540L322r49p95K491l347k100J632L41J085k243p64k461
$$ -7704 -7674 -3637 -2336 204 3526 2577 1782 4273 926 -1174 458 799 1884 -359 -1123 -3584
3420c584J128J577j371l70J764J949J383n002j805O967P24O20l688k814N23O50
$$ -3584 -2456 -879 -2250 -2620 -856 1093 2476 -2526 -4331 2636 3360 3980 292 -2522 -1999 -1349
3404a349L076N70k483J528o26r1o36K477J696J218o95m189r89L413k06l727j336
$$ -1349 1727 2297 -186 1342 716 625 -11 2466 4162 5380 4685 496 -493 2920 2714 -1013 -2349
3387b349l771l324K249M765N16L376L956j531l5j340J060k440J724j394J044M144
$$ -2349 -6120 -9444 -7195 -2430 -1914 1462 5418 3887 3852 2512 3572 1132 2856 1462 2506 6650
3371F650r84m497n894p43R80M789o73K196k077k545L687N80k724J175j536o49
$$ 6650 5666 1169 -4725 -5468 -4488 301 -372 1824 -253 -2798 889 1469 -1255 -80 -1616 -2265
3355b265K77P28L390M781n64n284n021O409J735m753q32k18q36k280j622j971
$$ -2265 -1988 -1260 2130 6911 6347 1063 -3958 2451 4186 -567 -1399 -1617 -2453 -4733 -6355 -8326
3339h326K051L050L737k941k759M078R33j645K142j526m892J183L517J518J047
$$ -8326 -6275 -3225 512 -2429 -5188 -1110 -177 -1822 320 -1206 -6098 -4915 -1398 120 1167
3324A167m633N2L229K505L37o498Q45J826J406k285l240j453M668J926l10J028
$$ 1167 -3466 -3414 -185 2320 2657 -3841 -2996 -1170 236 -2049 -5289 -6742 -2074 -148 -458 570
3308E70j03J708M79l93r23p3n106r60K448J035j385k23j33l947P09k76J51L279
$$ 570 467 2175 2654 2261 1338 1265 -3841 -4801 -2353 -1318 -2703 -2926 -3059 -7006 -6297 -6573 -6422 -3143
3290c143k0M065L51m921n58L429k398k957J427K880j53o33J598J80J961L698l382
$$ -3143 -3163 902 1253 -3668 -4226 -797 -3195 -6152 -4725 -1845 -1998 -2631 -1033 -853 1108 4806 1424
3273A424k673J16J978M92J446K800j719n516j367O184J003l537N44j619r73J743
$$ 1424 -1249 -1133 845 1337 2783 5583 3864 -1652 -3019 3165 4168 631 1175 -444 -1417 326
3257C26j087k183K771K730J791k139l050j920J274K343j083k666k12R01M30K121
$$ 326 -761 -2944 -173 2557 4348 2209 -841 -2761 -1487 856 -227 -2893 -3105 -2204 -1774 347
3241C47K044J767j479M27k298p00K514l900l986K528N662J245m99k147J178O37
$$ 347 2391 4158 2679 3106 808 108 2622 -1278 -5264 -2736 2926 4171 3672 1525 2703 3340
3225C340j29k604J099n93P11K097r17m77R73L890J29m169j561k361p90k760K329
$$ 3340 3211 607 1706 1113 1824 3921 3004 2527 3500 7390 7519 3350 1789 -572 -1362 -4122 -1793
$$ [...]
##END NTUPLES=NMR SPECTRUM
##END=
