##TITLE=Analysis number 312671
Compound Code cc 29601
Book Reference 419/172/2
Project Code adrs
Chemist Name anns
##JCAMPDX= 6.0         $$ Bruker NMR JCAMP-DX V2.0
##DATA TYPE= NMR SPECTRUM
##DATA CLASS= NTUPLES
##ORIGIN= Bruker BioSpin GmbH
##OWNER= NMR
$$ XWIN-NMR		Version 3.5
$$ Thu Aug 11 08:34:04 2005 GMT Daylight Time (UT+1h)  MAYBRIDGE\NMR@NMR_250MHZ
##.OBSERVE FREQUENCY= 250.131544655141
##.OBSERVE NUCLEUS= ^1H
##.ACQUISITION MODE= SIMULTANEOUS (DQD)
##.ACQUISITION SCHEME= undefined
##.AVERAGES= 16
##.DIGITISER RES= 18
##SPECTROMETER/DATA SYSTEM= dpx250
##.PULSE SEQUENCE= zg30
##.SOLVENT NAME= DMSO
##.SHIFT REFERENCE= (INTERNAL, DMSO, 0, 16.522)
##AUDIT TRAIL= $$ (NUMBER, WHEN, WHO, WHERE, WHAT)
$$ ##TITLE= Audit trail, XWIN-NMR		Version 3.5
$$ ##JCAMPDX= 5.01
$$ ##ORIGIN= Bruker BioSpin GmbH
$$ ##OWNER= NMR
$$ C:\u/data/dgb/nmr/ADRS/7550/pdata/1/auditp.txt
$$ ##AUDIT TRAIL=  $$ (NUMBER, WHEN, WHO, WHERE, WHAT)
(   1,<2005-08-11 08:33:35.21 +100>,<MAYBRIDGE\NMR>,<NMR_250MHZ>,
      <created by zg, POWCHK disabled, PULCHK disabled
       configuration hash MD5:
       62 19 C7 07 E1 42 D1 B7 37 6C 3D D0 77 39 F9 E6
       data hash MD5: 64K
       0B CF 08 70 16 F1 77 95 C8 33 10 02 F2 5B 36 C5>)
(   2,<2005-08-11 08:33:53.81 +100>,<MAYBRIDGE\NMR>,<NMR_250MHZ>,
      <Start of raw data processing
       ef LB = 0.3 FT_mod = 6 PKNL = 1 SI = 32K 
       data hash MD5: 32K
       0E 4B 72 60 3D D2 38 F0 84 23 45 D5 14 F3 F5 04>)
(   3,<2005-08-11 08:33:55.96 +100>,<MAYBRIDGE\NMR>,<NMR_250MHZ>,
      <apk 
       data hash MD5: 32K
       23 50 0B BA 1C C1 9D 3B 93 B3 68 18 25 2C 48 AE>)
(   4,<2005-08-11 08:33:57.10 +100>,<MAYBRIDGE\NMR>,<NMR_250MHZ>,
      <abs ABSG = 5 
       data hash MD5: 32K
       D3 2F D6 D9 43 D9 70 D7 20 7C C0 AF 86 51 27 09>)
$$ ##END=
$$ 
$$ hash MD5
$$ 5B C6 D7 FA 01 CF 86 9A AE C3 42 A3 DC 65 B0 14
##$RELAX= 
##$RELAX= 
##$RELAX= 
##$RELAX= 
##$RELAX= 
##$RELAX= 
##$RELAX= 
$$ Bruker specific parameters
$$ --------------------------
##$DU= <C:\u>
##$EXPNO= 7550
##$NAME= <ADRS>
##$PROCNO= 1
##$TYPE= <nmr>
##$USER= <dgb>
##$AMP= (0..31)
100 100 100 100 100 100 100 100 100 100 100 100 100 100 100 100 100 100 
100 100 100 100 100 100 100 100 100 100 100 100 100 100 
##$AQSEQ= 0
##$AQ_mod= 3
##$AUNM= <au_zg>
##$AUTOPOS= <1 >
##$BF1= 250.13
##$BF2= 250.13
##$BF3= 250.13
##$BF4= 250.13
##$BF5= 500.13
##$BF6= 500.13
##$BF7= 500.13
##$BF8= 500.13
##$BYTORDA= 1
##$CFDGTYP= 0
##$CFRGTYP= 5
##$CHEMSTR= <none>
##$CNST= (0..31)
1 1 145 1 1 1 1 1 1 1 1 1 1 1 1 1 1 1 1 1 1 1 1 1 1 1 1 1 1 1 1 1 
##$CPDPRG= <>
##$CPDPRG1= <>
##$CPDPRG2= <>
##$CPDPRG3= <>
##$CPDPRG4= <mlev>
##$CPDPRG5= <mlev>
##$CPDPRG6= <mlev>
##$CPDPRG7= <mlev>
##$CPDPRG8= <mlev>
##$CPDPRGB= <>
##$CPDPRGT= <>
##$D= (0..31)
0 1 0 0 0 0 0 0 0 0.06 0 0 0 0 0 0 0.0002 0 0 0 0 0 0 0 0 0 0 0 0 0 0 
0 
##$DATE= 1123745611
##$DBL= (0..7)
120 120 120 120 120 120 120 120 
##$DBP= (0..7)
150 150 150 150 150 150 150 150 
##$DBP07= 0
##$DBPNAM0= <>
##$DBPNAM1= <>
$$ [...]
##$SUBNAM7= <"">
##$SUBNAM8= <"">
##$SUBNAM9= <"">
##$SW= 20.6930455092707
##$SWIBOX= (0..15)
0 0 3 0 0 0 0 0 0 0 0 0 0 0 0 0 
##$SW_h= 5175.983436853
##$TD= 65536
##$TD0= 1
##$TE= 295.16
##$TE2= 300
##$TE3= 300
##$TEG= 300
##$TL= (0..7)
0 120 120 120 120 120 120 120 
##$TP= (0..7)
150 150 150 150 150 150 150 150 
##$TP07= 0
##$TPNAME0= <>
##$TPNAME1= <>
##$TPNAME2= <>
##$TPNAME3= <>
##$TPNAME4= <>
##$TPNAME5= <>
##$TPNAME6= <>
##$TPNAME7= <>
##$TPOAL= (0..7)
0.5 0.5 0.5 0.5 0.5 0.5 0.5 0.5 
##$TPOFFS= (0..7)
0 0 0 0 0 0 0 0 
##$TUNHIN= 0
##$TUNHOUT= 0
##$TUNXOUT= 0
##$USERA1= <user>
##$USERA2= <user>
##$USERA3= <user>
##$USERA4= <user>
##$USERA5= <user>
##$V9= 5
##$VALIST= <valist>
##$VCLIST= <CCCCCCCCCCCCCCC>
##$VD= 0
##$VDLIST= <DDDDDDDDDDDDDDD>
##$VPLIST= <PPPPPPPPPPPPPPP>
##$VTLIST= <TTTTTTTTTTTTTTT>
##$WBST= 1024
##$WBSW= 4
##$XGAIN= (0..3)
0 0 0 0 
##$XL= 0
##$YL= 0
##$YMAX_a= 374516
##$YMIN_a= -405228
##$ZGOPTNS= <>
##$ZL1= 120
##$ZL2= 120
##$ZL3= 120
##$ZL4= 120
##$ABSF1= 16.522
##$ABSF2= -4.171173
##$ABSG= 5
##$ABSL= 3
##$ALPHA= 0
##$AQORDER= 0
##$ASSFAC= 0
##$ASSFACI= 0
##$ASSFACX= 0
##$ASSWID= 0
##$AUNMP= <proc_1d>
##$AZFE= 0.1
##$AZFW= 0.1
##$BCFW= 0
##$BC_mod= 0
##$BYTORDP= 0
##$COROFFS= 0
##$CY= 12.5
##$DATMOD= 1
##$DC= 0
##$DFILT= <>
##$DTYPP= 0
##$F1P= 14.0000005364418
##$F2P= -0.99999901652339
##$FCOR= 0.5
##$FTSIZE= 32768
##$FT_mod= 6
##$GAMMA= 0
##$GB= 0
##$INTBC= 1
##$INTSCL= 1
##$ISEN= 128
##$LB= 0.3
##$LEV0= 0
##$LPBIN= 0
##$MAXI= 10000
##$MC2= 0
##$MEAN= 0
##$ME_mod= 0
##$MI= 0
##$NCOEF= 0
##$NC_proc= -4
##$NLEV= 6
##$NOISF1= 0
##$NOISF2= 0
##$NSP= 0
##$NTH_PI= 0
##$NZP= 0
##$OFFSET= 16.522
##$PC= 1
##$PHC0= -89.34518
##$PHC1= 12.37838
##$PH_mod= 1
##$PKNL= yes
##$PPARMOD= 0
##$PSCAL= 4
##$PSIGN= 0
##$REVERSE= no
##$SF= 250.13
##$SI= 32768
##$SIGF1= 0
##$SIGF2= 0
##$SINO= 400
##$SIOLD= 32768
##$SREGLST= <1H.DMSO>
##$SSB= 0
##$STSI= 32768
##$STSR= 0
##$SW_p= 5175.98343685301
##$SYMM= 0
##$S_DEV= 0
##$TDeff= 65536
##$TDoff= 0
##$TI= <Analysis number 999999
Compound Code 99
Book Reference 9
Project Code 9>
##$TILT= no
##$TM1= 0
##$TM2= 0
##$TOPLEV= 0
##$USERP1= <user>
##$USERP2= <user>
##$USERP3= <user>
##$USERP4= <user>
##$USERP5= <user>
##$WDW= 1
##$XDIM= 32768
##$YMAX_p= 454080904
##$YMIN_p= -593328
$$ End of Bruker specific parameters
$$ ---------------------------------
##NTUPLES= NMR SPECTRUM
##VAR_NAME=  FREQUENCY,     SPECTRUM/REAL,   SPECTRUM/IMAG
##SYMBOL=    X,             R,               I
##VAR_TYPE=  INDEPENDENT,   DEPENDENT,       DEPENDENT
##VAR_FORM=  AFFN,          ASDF,            ASDF
##VAR_DIM=   32768,         32768,           32768
##UNITS=     HZ,            ARBITRARY UNITS, ARBITRARY UNITS
##FACTOR=    0.157963299565203, 1,           1
##FIRST=     4132.6476996994, 0,             0
##LAST=      -1043.33573715361, 0,           0
##MIN=       -1043.33573715361, -593328,     0
##MAX=       4132.6476996994, 454080904,     0
$$ Real data points
##PAGE= N=1
##DATA TABLE= (X++(R..R)), XYDATA
$$ [...]
##PAGE= N=2
##DATA TABLE= (X++(I..I)), XYDATA
$$ plain form
15572 1163330 1139402 1181768 1195226 1197835 1176108 1161072 1151124 1198599 1268081 1236422 1172877 1131334
15560 1131334 1191972 1267157 1298663 1294551 1207370 1257808 1279649 1173240 1086694 1215563 1216566
15549 1216566 1180861 1255227 1179053 1174768 1159335 1217441 1322596 1242372 1160014 1278999 1267445
15538 1267445 1208333 1224582 1221037 1246720 1223359 1181916 1164720 1159984 1195222 1152789 1160762 1156067
15526 1156067 1132698 1155495 1215225 1190020 1220634 1219557 1141589 1116429 1062341 1055753 992558 1069201
15514 1069201 1036271 1033688 1083430 1176752 1252101 1238821 1186514 1110171 1183888 1325889 1328354
15503 1328354 1244572 1161760 1169911 1213666 1272659 1299704 1369684 1304592 1367542 1463871 1465225 1313265
15491 1313265 1329655 1335764 1271921 1154567 1114113 1206960 1211267 1212944 1146937 1133829 1141774 1085619
$$ packed form
15572A163330k3928M2366J3458K609k1727j5036r948M7475O9482l1659o3545m1543
15560A131334O0638P5185L1506m112q7181N0438K1841j06409q6546J28869J003
15549A216566l5705P4366p6174m285j5433N8106J05155q0224q2358J18985j1554
15538A267445n9112J6249l545K5683k3361m1443j7196m736L5238m2433P973m695
15526A156067k3369K2797N9730k5205L0614j077p7968k5160n4088o588o3195P6643
15514A069201l2930k583M9742R3322P5349j3280n2307p6343P3717J42001K465
15503A328354q3782q2812Q151M3755N8993K7045O9980o5092O2950R6329J354j51960
15491A313265J6390O109o3843j17354m0454R2847M307J677o6007j3108P945n6155
$$ plain form
15479 1085619 1040809 1144030 1190421 1112202 1094908 1191468 1308376 1236101 1278489 1175832 1104134
15468 1104134 1173236 1302890 1258210 1193463 1243428 1291132 1318020 1340322 1339972 1241133 1280242
15457 1280242 1384335 1449538 1410011 1288285 1145838 1128554 1121315 1256578 1392313 1423620
15447 1423620 1359298 1197857 1164316 1109503 1190634 1218592 1201922 1288164 1310232 1278363 1182641
15436 1182641 1112900 1199231 1255616 1177846 1096031 1143590 1260542 1216192 1195246 1202194 1286694
15425 1286694 1486913 1529804 1441015 1350322 1424038 1389398 1412836 1409027 1346978 1268940 1233453
15414 1233453 1245881 1277241 1227871 1310580 1409942 1413821 1364091 1292883 1182631 1232088 1238246
15403 1238246 1286008 1229067 1193171 1165181 1202835 1391941 1543839 1530505 1380172 1307763 1300740
$$ packed form
15479A085619m4810J03221M6391p8219j7294R6560J16908p2275M2388j02657p1698
15468A104134O9102J29654m4680o4747M9965M7704K6888K2302l50r8839L9109
15457A280242J04093O5203l9527j21726j42447j7284p239J35263J35735L1307
15447A423620o4322j61441l3541n4813Q1131K7958j6670Q6242K2068l1869r5722
15436A182641o9741Q6331N6385p7770q1815M7559J16952m4350k0946O948Q4500
15425A286694K00219M2891q8789r0693P3716l4640K3438l809o2049p8038l5487
15414A233453J2428L1360m9370Q2709R9362L879m9730p1208j10252M9457O158
15403A238246M7762n6941l5896k7990L7654J89106J51898j3334j50333p2409p023
$$ plain form
15392 1300740 1219789 1235036 1162690 1223456 1345729 1432093 1382722 1339560 1350045 1268089 1256211
15381 1256211 1201496 1176688 1158126 1193233 1183025 1165224 1186045 1255118 1251305 1244564 1392912
15370 1392912 1351416 1485646 1535580 1538954 1507972 1461935 1356192 1240813 1230750 1266911 1284876
15359 1284876 1314503 1441276 1480794 1489466 1404609 1372198 1357826 1277750 1353842 1462958 1505981
15348 1505981 1551087 1566544 1370317 1140853 1114049 1236530 1272371 1217685 1248142 1320446 1314392
15337 1314392 1217779 1136770 1120373 1183755 1212475 1158655 1159336 1136019 1154552 1204099 1333563
15326 1333563 1382672 1363425 1341781 1233330 1152756 1124820 1059849 1131602 1269962 1366844 1567770
15315 1567770 1458924 1344611 1305956 1349162 1324199 1286441 1361977 1410567 1372900 1273839 1253028
$$ packed form
15392A300740q0951J5247p2346O0766J22273Q6364m9371m3162J0485q1956j1878
15381A256211n4715k4808j8562L5107j0208j7801K0821O9073l813o741J48348
15370A392912m1496J34230M9934L374l0982m6037j05743j15379j0063L6161J7965
15359A284876K9627J26773L9518Q672q4857l2411j4372q0076P6092J09116M3023
15348A505981M5106J5457j96227k29464k6804J22481L5841n4686L0457P2304o054
15337A314392r6613q1009j6397O3382K8720n3820O81k3317J8533M9547J29464
15326A333563M9109j9247k1644j08451q0574k7936o4971P1753J38360R6882K00926
15315A567770j08846j14313l8655M3206k4963l7758P5536M8590l7667r9061k0811
$$ plain form
15304 1253028 1309611 1317491 1305327 1313974 1302145 1385444 1402985 1325955 1281958 1236986 1314466 1435041
15292 1435041 1433920 1386108 1408960 1342562 1379508 1552800 1472651 1366240 1372035 1435013 1453656
15281 1453656 1497724 1545847 1510853 1452969 1446012 1368232 1484880 1473886 1301784 1299581 1496764
15270 1496764 1516072 1529322 1590038 1502541 1406289 1425129 1384085 1298856 1319276 1265524 1308120
15259 1308120 1336724 1332677 1303263 1232466 1275417 1400301 1473488 1408899 1332270 1378325 1494704
15248 1494704 1460485 1365856 1432318 1492850 1630380 1551382 1476113 1494925 1385057 1402671 1374511
15237 1374511 1352073 1362638 1303292 1309843 1260343 1312245 1317491 1341762 1280822 1241827 1377192
15226 1377192 1455225 1491535 1470393 1448468 1441900 1439427 1467032 1512584 1491730 1443235 1387143 1256141
$$ packed form
15304A253028N6583P880j2164Q647j1829Q3299J7541p7030m3997m4972P7480J20575
15292A435041j121m7812K2852o6398L6946J73292q0149j06411N795O2978J8643
15281A453656M4068M8123l4994n7884o957p7780J16648j0994j72102k203J97183
15270A496764J9308J3250O0716q7497r6252J8840m1044q5229K0420n3752M2596
15259A308120K8604m047k9414p0797M2951J24884P3187o4589p6629M6055J16379
15248A494704l4219r4629O6462O0532J37530p8998p5269J8812j09868J7614k8160
15237A374511k2438J0565n9346O551m9500N1902N246K4271o0940l8995J35365
15226A377192P8033L6310k1142k1925o568k473K7605M5552k0854m8495n6092j31002
$$ plain form
15214 1256141 1228396 1228075 1247758 1270050 1265652 1321304 1396878 1370296 1332651 1267945 1247551 1332260
15202 1332260 1434693 1462970 1528184 1440938 1380684 1301216 1299961 1437856 1446768 1445502 1347160
15191 1347160 1346384 1275069 1279598 1217759 1277189 1374053 1412550 1444185 1392453 1277959 1353796 1422636
15179 1422636 1397368 1501776 1510762 1483376 1394838 1317165 1328055 1350725 1391846 1381756 1424997
15168 1424997 1513013 1530285 1444455 1406643 1447038 1478682 1483173 1420575 1397523 1441940 1454570
15157 1454570 1377937 1240403 1227245 1237754 1321450 1347630 1417983 1470689 1531651 1421979 1483333
15146 1483333 1488579 1436081 1471022 1419647 1332382 1437292 1507300 1528756 1539518 1432349 1421927
15135 1421927 1480126 1502278 1599245 1659642 1620742 1514217 1453057 1469576 1435012 1376850 1407417
$$ packed form
15214A256141k7745l21J9683K2292m398N5652P5574k6582l7645o4706k0394Q4709
15202A332260J02433K8277O5214q7246o0254p9468j255J37895Q912j266r8342
15191A347160p76p1315M529o1839N9430R6864L8497L1635n1732j14494P5837O8840
15179A422636k5268J04408Q986k7386q8538p7673J0890K2670M1121j0090M3241
15168A424997Q8016J7272q5830l7812M0395L1644M491o2598k3052M4417J2630
15157A454570p6633j37534j3158J0509Q3696K6180P0353N2706O0962j09672O1354
15146A483333N246n2498L4941n1375q7265J04910P0008K1456J0762j07169j0422
15135A421927N8199K2152R6967O0397l8900j06525o1160J6519l4564n8162L0567
$$ plain form
15124 1407417 1380309 1409750 1413230 1427938 1586121 1611305 1473487 1454143 1439985 1411272 1366291
15113 1366291 1284571 1326484 1480658 1634120 1582268 1525488 1479734 1510366 1663961 1667154 1809084
15102 1809084 1765794 1509446 1358693 1350908 1400714 1543628 1600388 1630783 1641067 1623102 1611316
15091 1611316 1632729 1543544 1532823 1631970 1529139 1501728 1536120 1589449 1615677 1608159 1670105
15080 1670105 1780219 1682476 1623385 1543470 1510592 1508609 1480213 1591331 1650964 1632983 1567682
15069 1567682 1595805 1598034 1449667 1304556 1292709 1313851 1315302 1320049 1467263 1587384 1642165
15058 1642165 1542533 1464375 1570560 1550506 1566826 1604399 1578848 1513386 1458340 1547675 1660704
15047 1660704 1658128 1586393 1499921 1569274 1684900 1656393 1686611 1646340 1664640 1684128 1641340
$$ packed form
15124A407417k7108K9441L480J4708J58183K5184j37818j9344j4158k8713m4981
15113A366291q1720M1913J54174J53462n1852n6780m5754L0632J53595L193J41930
15102A809084m3290k56348j50753p785M9806J42914N6760L0395J0284j7965j1786
15091A611316K1413q9185j0721R9147j02831k7411L4392N3329K6228p518O1946
15080A670105J10114r7743n9091p9915l2878j983k8396J11118N9633j7981o5301
15069A567682K8123K229j48367j45111j1847K1142J451M747J47214J20121N4781
15058A642165r9632p8158J06185k0054J6320L7573k5551o5462n5046Q9335J13029
15047A660704k576p1735q6472O9353J15626k8507L0218m0271J8300J9488m2788
$$ plain form
15036 1641340 1656399 1562767 1423515 1442652 1468589 1443493 1470121 1514398 1533824 1420608 1356023
15025 1356023 1433378 1516740 1538208 1488997 1450175 1366103 1327096 1321585 1384010 1352636 1432433
15014 1432433 1559827 1614566 1635319 1638684 1578601 1550215 1713943 1781054 1705222 1702597 1700973
15003 1700973 1658586 1674733 1690395 1670213 1649952 1699485 1632622 1601827 1513109 1518811 1543129
14992 1543129 1581479 1432035 1480297 1664460 1651600 1597848 1605733 1554078 1581106 1685666 1648811
14981 1648811 1553750 1489099 1347990 1358644 1540814 1564287 1548190 1658106 1671101 1659474 1663439
14970 1663439 1618612 1583646 1668720 1561467 1541135 1526266 1555488 1551798 1605391 1585914 1471771
14959 1471771 1536317 1530710 1688071 1747331 1796753 1812559 1789059 1709848 1726213 1768126 1718327
$$ packed form
15036A641340J5059r3632j39252J9137K5937k5096K6628M4277J9426j13216o4585
15025A356023P7355Q3362K1468m9211l8822q4072l9007n511O2425l1374P9797
15014A432433J27394N4739K0753L365o0083k8386J63728O7111p5832k625j624
15003A700973m2387J6147J5662k0182k0261M9533o6863l0795q8718N702K4318
14992A543129L8350j49444M8262J84163j2860n3752P885n1655K7028J04560l6855
14981A648811r5061o4651j41109J0654J82170K3473j6097J09916J2995j1627L965
14970A663439m4827l4966Q5074j07253k0332j4869K9222l690N3593j9477j14143
14959A471771O4546n607J57361N9260M9422J5806k3500p9211J6365M1913m9799
$$ plain form
14948 1718327 1674424 1661698 1601042 1571994 1539997 1529889 1601271 1545004 1527714 1559263 1599509
14937 1599509 1630958 1597555 1520062 1463547 1541935 1403688 1411419 1470639 1447370 1560498 1655096
14926 1655096 1651803 1638652 1655555 1796964 1881398 1884216 1773463 1794367 1756499 1678364 1672496
14915 1672496 1654677 1620312 1650077 1651915 1554456 1488694 1467492 1432736 1452550 1509215 1689181
14904 1689181 1622914 1556671 1542490 1509898 1560409 1660420 1549838 1404155 1431003 1472355 1512207
14893 1512207 1648461 1645602 1657196 1607697 1777243 1819571 1661961 1635649 1627406 1497391 1475358
14882 1475358 1517696 1576830 1648636 1703513 1638946 1529493 1444259 1396202 1564462 1673905 1747742
14871 1747742 1718194 1615336 1619721 1468809 1359494 1446708 1498719 1529629 1478848 1452502 1598752
$$ packed form
14948A718327m3903j2726o0656k9048l1997j0108P1382n6267j7290L1549M0246
14937A599509L1449l3403p7493n6515P8388j38247P731N9220k3269J13128R4598
14926A655096l293j3151J6903J41409Q4434K818j10753K0904l7868p8135n868
14915A672496j7819l4365K9765J838r7459o5762k1202l4756J9814N6665J79966
14904A689181o6267o6243j4181l2592N0511J00011j10582j45683K6848M1352L9852
14893A512207J36254k859J1594m9499J69546M2328j57610k6312q243j30015k2033
14882A475358M2338N9134P1806N4877o4567j09453q5234m8057J68260J09443P3837
14871A747742k9548j02858M385j50912j09315Q7214N2011L0910n0781k6346J46250
$$ plain form
14860 1598752 1542232 1483581 1529573 1557238 1557943 1480722 1486341 1534694 1559719 1515593 1588468 1654618
14848 1654618 1739751 1606045 1548243 1541860 1499180 1534725 1594550 1650478 1624411 1678908 1645159
14837 1645159 1686434 1663358 1558920 1601797 1558241 1600857 1609763 1551172 1576279 1586624 1614466
14826 1614466 1753689 1777022 1735302 1754480 1648894 1675676 1658017 1623767 1629656 1661545 1614051
14815 1614051 1628715 1733142 1750086 1805923 1793860 1774105 1829045 1772136 1782640 1807040 1739990
14804 1739990 1664317 1718017 1727687 1750775 1658986 1667866 1625749 1490828 1551686 1509758 1503804 1612745
14792 1612745 1706515 1683019 1659665 1704216 1792818 1774581 1812530 1899193 1882335 1750233 1763765
14781 1763765 1788742 1754769 1698582 1641441 1727458 1815607 1878697 1831246 1788175 1793436 1850353
$$ packed form
14860A598752n6520n8651M5992K7665P05p7221N619M8353K5025m4126P2875O6150
14848A654618Q5133j33706n7802o383m2680L5545N9825N5928k6067N4497l3749
14837A645159M1275k3076j04438M2877m3556M2616Q906n8591K5107J0345K7842
14826A614466J39223K3333m1720J9178j05586K6782j7659l4250N889L1889m7494
14815A614051J4664J04427J6944N5837j2063j9755N4940n6909J0504K4400o7050
14804A739990p5673N3700R670K3088r1789Q880m2117j34921O0858m1928n954J08941
14792A612745R3770k3496k3354M4551Q8602j8237L7949Q6663j6858j32102J3532
14781A763765K4977l3973n6187n7141Q6017Q8149O3090m7451m3071N261N6917
$$ plain form
14770 1850353 1837023 1828362 1854564 1894083 1863531 1804158 1788560 1649350 1583727 1594561 1610544
14759 1610544 1652257 1726112 1747925 1624633 1611831 1695048 1702229 1609920 1572285 1689181 1664877
14748 1664877 1685640 1741610 1807242 1828502 1760849 1691431 1676244 1703584 1638975 1543489 1610761
14737 1610761 1654196 1664883 1624950 1584609 1578177 1611660 1655795 1734580 1819614 1752948 1634304
14726 1634304 1690120 1864668 2002811 1940872 1810347 1787845 1790309 1756121 1788395 1856085 1907677
14715 1907677 1902822 1803104 1815448 1812513 1671609 1686509 1762143 1839592 1906367 2037541 2011783
14704 2011783 1845606 1775947 1759367 1849750 1762013 1639765 1571071 1768205 1848502 1866450 1856137
14693 1856137 1844180 1825578 1797842 1873171 1933225 1931686 1854198 1843113 1714943 1717479 1825842
$$ packed form
14770A850353j3330q661K6202L9519l0552n9373j5598j39210o5623J0834J5983
14759A610544M1713P3855K1813j23292j2802Q3217P181r2309l7635J16896k4304
14748A664877K0763N5970O5632K1260o7653o9418j5187K7340o4609r5486O7272
14737A610761M3435J0687l9933m0341o432L3483M4135P8785Q5034o6666j18644
14726A634304N5816J74548J38143o1939j30525k2502K464l4188L2274O7690N1592
14715A907677m855r9718J2344k935j40904J4900P5634P7449O6775J31174k5758
14704B011783j66177o9659j6580R0383q7737j22248o8694J97134Q0297J7948j0313
14693A856137j1957j8602k7736P5329O0054j539p7488j1085j28170K536J08363
$$ plain form
14682 1825842 1929156 1996858 1883757 1785969 1881883 1893626 1941404 1953489 1908652 1854290 1846332
14671 1846332 1935179 1963424 1983421 1901990 1832728 1820473 1759033 1734409 1687583 1735094 1763513
14660 1763513 1680424 1663751 1709390 1730647 1744369 1803277 1814331 1701482 1726739 1771128 1797032
14649 1797032 1804618 1814219 1866487 1910929 1895685 1931855 2006419 1966192 1818259 1812821 1829530 1844051
14637 1844051 1911777 1881594 1811756 1709286 1646592 1714176 1774112 1859501 1885671 1859141 1805605
14626 1805605 1857250 1908934 1906620 1965674 1934563 1981393 1951587 1930352 1929957 1868737 1807574 1762305
14614 1762305 1669841 1634005 1690809 1793227 1856001 1925541 2019456 2061875 1953664 1893155 1869587
14603 1869587 1859166 1765188 1713952 1769374 1765004 1769000 1891263 1903797 1899940 1689983 1515470
$$ packed form
14682A825842J03314O7702j13101r7788R5914J1743M7778J2085m4837n4362p958
14671A846332Q8847K8245J9997q1431o9262j2255o1440k4624m6826M7511K8419
14660A763513q3089j6673M5639K1257J3722N8908J1054j12849K5257M4389K5904
14649A797032P586R601N2268M4442j5244L6170P4564m0227j47933n438J6709J4521
14637A844051O7726l0183o9838j02470o2694O7584N9936Q5389K6170k6530n3536
14626A805605N1645N1684k314N9054l1111M6830k9806k1235l95o1220o1163m5269
14614A762305r2464l5836N6804J02418O2774O9540R3915M2419j08211o0509k3568
14603A869587j0421r3978n1236N5422m370L996J22263J2534l857k09957j74513
$$ plain form
14592 1515470 1431581 1560606 1625541 1632599 1680296 1693550 1631562 1622807 1780224 1882532 1935045
14581 1935045 1932067 1901223 1910857 1930671 1939085 1950814 1899888 1939998 1924097 1906546 1839633 1848539
14569 1848539 1823985 1845946 1853042 1918995 1865862 1879152 1985151 2092597 1968556 1930556 2029231
14558 2029231 2010282 1954444 1962092 1932435 1919573 1929697 1926820 1951001 1999800 1917401 1788948
14547 1788948 1812327 1790538 1745034 1840061 1895969 1847433 1792298 1714607 1675274 1714366 1792982
14536 1792982 1905096 1931337 2024732 1926382 1888924 1912866 1887781 2003666 2053913 1921150 1824420
14525 1824420 1748806 1688724 1679211 1677753 1761286 1801160 1773646 1764502 1735760 1749158 1828292 1868492
14513 1868492 1875156 1910411 1930693 1892601 1902602 1835342 1808263 1776041 1914682 1969474 1946848
$$ packed form
14592A515470q3889J29025O4935P058M7697J3254o1988q755J57417J02308N2513
14581A935045k978l0844R634J9814Q414J1729n0926M0110j5901j7551o6913Q906
14569A848539k4554K1961P096O5953n3133J3290J05999J07446j24041l8000R8675
14558B029231j8949n5838P648k9657j2862J0124k877K4181M8799q2399j28453
14547A788948K3379k1789m5504R5027N5908m8536n5135p7691l9333L9092P8616
14536A792982J12114K6241R3395r8350l7458K3942k5085J15885N0247j32763r6730
14525A824420p5614o0082r513j458Q3533L9874k7514r144k8742J3398P9134M0200
14513A868492O664L5255K0282l8092J0001o7260k7079l2222J38641N4792k2626
$$ plain form
14502 1946848 1939617 1976291 2075799 2109478 2101463 2113082 2063289 1920317 1876710 2009942 2098217
14491 2098217 2065751 2029861 1878420 1735789 1753874 1800864 1796058 1884965 1920440 1877573 1997054
14480 1997054 2058892 2016056 1977711 2014569 2021043 1977780 1980536 2105222 2148897 2231738 2260399
14469 2260399 2140768 1962898 1934446 1956301 2040191 2206422 2211725 2098589 1962582 1940231
14459 1940231 2046892 1987150 1889794 1854240 1922090 1928846 1932228 1945407 1918078 1923108 1869561 1895412
14447 1895412 1990230 1964920 1935983 1835972 1867109 1870389 1949845 1977353 1988771 1990676 1881780
14436 1881780 1799310 1779194 1790474 1828201 1971084 2087122 2120932 2143321 2040619 1925080
14426 1925080 1924047 1971161 2019892 2040657 2028202 2045214 2090927 2122443 2019614 1955681 1898228
$$ packed form
14502A946848p231L6674R9508L3679q015J1619m9793j42972m3607J33232Q8275
14491B098217l2466l5890j51441j42631J8085M6990m806Q8907L5475m2867J19481
14480A997054O1838m2836l8345L6858O474m3263K756J24686M3675Q2841K8661
14469B260399j19631j77870k8452K1855Q3890J66231N303j13136j36007k2351
14459A940231J06661n9742r7356l5554O7850O756L382J3179k7329N030n3547K5851
14447A895412R4818k5310k8937j00011L1137L280P9456K7508J1418J905j08896
14436A881780q2470k0116J1280L7727J42883J16038L3810K2389j02702j15539
14426A925080j033M7114M8731K0765j2455J7012M5713L1516j02829o3933n7453
$$ plain form
14415 1898228 2010693 2169882 2128664 2058328 1955210 1841060 1899084 1973095 1956267 1986744
14405 1986744 1954043 1930349 1918874 1938581 1901855 1895692 1923964 1953149 2068421 2102817 2092821
14394 2092821 2084327 2095570 2089915 2008032 2005682 1892765 1883473 1988734 2051416 2003730 2104178
14383 2104178 2109162 2200062 2164708 2151294 2006477 1957885 1917735 1885298 1966814 1979574 2038533
14372 2038533 2137085 2120262 2015772 1894868 1951964 2014771 1975197 2008439 2075456 1997703 1913135
14361 1913135 2022423 2073913 2112120 2148457 2166191 2152310 2103243 2018685 1956784 1951439 1981226
14350 1981226 1905755 2002556 1993808 1949488 1907016 1974320 2014511 1882747 1910894 1957334 2121366
14339 2121366 2220411 2203816 2157224 2158904 2108251 2045140 1989855 1948838 2051594 2126203 2152184
$$ packed form
14415A898228J12465J59189m1218p0336j03118j14150N8024P4011j6828L0477
14405A986744l2701k3694j1475J9707l6726o163K8272K9185J15272L4396r996
14394B092821q494J1243n655q1883k350j12917r292J05261O2682m7686J00448
14383B104178M984R0900l5354j3414j44817m8592m0150l2437Q1516J2760N8959
14372B038533R8552j6823j04490j20904N7096O2807l9574L3242O7017p7753q4568
14361A913135J09288N1490L8207L6337J7734j3881m9067q4558o1901n345K9787
14350A981226p5471R6801q748m4320m2472O7304M0191j31764K8147M6440J64032
14339B121366R9045j6595m6592J680n0653o3111n5285m1017J02756P4609K5981
$$ plain form
14328 2152184 2196064 2205146 2206431 2254892 2308707 2347798 2353574 2223038 2083072 2101635 2255243
14317 2255243 2298675 2255799 2223409 2084099 2032477 2164537 2243370 2253241 2173362 2209336 2174739
14306 2174739 2214361 2262248 2200649 2167202 2080436 2179267 2146904 2183513 2230416 2185071 2131731
14295 2131731 2059980 2068964 2119488 2099841 2189995 2194673 2186501 2058072 2081189 2165414 2154714 2111680
14283 2111680 2154467 2040860 1916361 2005864 2144569 2198900 2176717 2141899 2263341 2226536
14273 2226536 2055058 2049617 2020800 2003001 2132640 2223841 2234727 2264086 2262752 2166806 2121657
14262 2121657 2129633 2126788 2157215 2163689 2132025 2225292 2385396 2385962 2342737 2339349 2250362 2178236
14250 2178236 2221057 2204235 2256855 2209233 2062721 2007912 2079567 2065195 2045394 2108940 2068288
$$ packed form
14328B152184M3880R082J285M8461N3815L9091N776j30536j39966J8563J53608
14317B255243M3432m2876l2390j39310n1622J32060P8833R871p9879L5974l4597
14306B174739L9622M7887o1599l3447q6766R8831l2363L6609M6903m5345n3340
14295B131731p1751Q984N0524j9647R0154M678q172j28429K3117Q4225j0700m3034
14283B111680M2787j13607j24499Q9503J38705N4331k2183l4818J21442l6805
14273B226536j71478n441k8817j7799J29639R1201J0886K9359j334r5946m5149
14262B121657P976k845L0427O474l1664R3267J60104N66m3225l388q8987p2126
14250B178236M2821j6822N2620m7622j46512n4809P1655j4372j9801O3546m0652
$$ plain form
14239 2068288 2092471 2095670 2171907 2296395 2399152 2407027 2239977 2116961 2187667 2177750 2188782
14228 2188782 2235782 2207656 2206956 2327010 2318493 2288574 2246001 2138873 2129969 2134692 2097200 2096349
14216 2096349 2062351 2109801 2103737 2036151 2127656 2173379 2230176 2351687 2388842 2391724 2354573
14205 2354573 2232049 2174875 2193765 2290968 2374001 2405925 2391068 2288665 2248757 2203234 2212221
14194 2212221 2144191 2096922 2113920 2141077 2124025 2167716 2216985 2383688 2347470 2329027 2300183
14183 2300183 2193459 2131114 2158002 2145291 2096360 2173644 2170147 2170360 2111251 2020589 2135184
14172 2135184 2236799 2137965 2068019 1990149 1972075 2007305 2153736 2192870 2252200 2304242 2299346
14161 2299346 2316962 2336106 2420650 2445675 2402866 2287087 2243581 2285474 2315815 2293893 2289039
$$ packed form
14239B068288K4183L199P6237J24488J02757P875j67050j23016P0706r917J1032
14228B188782M7000k8126p00J20054q517k9919m2573j07128q904M723l7492q51
14216B096349l3998M7450o064o7586R1505M5723N6797J21511L7155K882l7151
14205B354573j22524n7174J8890R7203Q3033L1924j4857j02403l9908m5523Q987
14194B212221o8030m7269J6998K7157j7052M3691M9269J66703l6218j8443k8844
14183B300183j06724o2345K6888j2711m8931P7284l497K13n9109r0662J14595
14172B135184J01615r8834o9946p7870j8074L5230J46431L9134N9330N2042m896
14161B299346J7616J9144Q4544K5025m2809j15779m3506M1893L0341k1922m854
$$ plain form
14150 2289039 2313096 2350985 2370516 2355505 2323932 2378926 2303885 2309221 2306100 2248452 2287505 2378836
14138 2378836 2324446 2281674 2365448 2373461 2320943 2354007 2550474 2603339 2454770 2255666 2252292
14127 2252292 2351206 2422940 2354866 2444258 2489889 2427994 2387035 2399918 2314681 2295828 2312435
14116 2312435 2420535 2594522 2583344 2393876 2351337 2449591 2512519 2470509 2273095 2181910
14106 2181910 2179461 2215766 2140543 2160764 2118456 2225854 2308758 2387227 2457411 2495679 2460795
14095 2460795 2324423 2315674 2386905 2342320 2323265 2473570 2489377 2372409 2325850 2399355 2439942
14084 2439942 2460868 2379910 2357303 2324996 2204523 2290677 2354141 2409831 2401925 2381734 2345980
14073 2345980 2250782 2207364 2229157 2266000 2232181 2307990 2349228 2317359 2364047 2411706 2433311
$$ packed form
14150B289039K4057L7889J9531j5011l1573N4994p5041N336l121n7648L9053R1331
14138B378836n4390m2772Q3774Q013n2518L3064J96467N2865j48569j99104l374
14127B252292R8914P1734o8074Q9392M5631o1895m0959J2883q5237j8853J6607
14116B312435J08100J73987j1178j89468m2539R8254O2928m2010j97414r1185
14106B181910k449L6305p5223K0221m2308J07398Q2904P8469P0184L8268l4884
14095B460795j36372q749P1231m4585j9055J50305J5807j16968m6559P3505M0587
14084B439942K0926q0958k2607l2307j20473Q6154O3464N5690p906k0191l5754
14073B345980r5198m3418K1793L6843l3819P5809M1238l1869M6688M7659K1605
$$ plain form
14062 2433311 2482093 2388967 2345541 2349737 2377218 2380167 2361455 2387477 2429370 2497722 2467119 2530547
14050 2530547 2543542 2442810 2418074 2382118 2266389 2258456 2353989 2407519 2379332 2378881 2319318
14039 2319318 2370561 2333762 2289451 2211533 2206092 2204272 2372894 2431751 2357558 2410611 2553187
14028 2553187 2523900 2524319 2570436 2570231 2599075 2597686 2519618 2540049 2463669 2402298 2506575 2555176
14016 2555176 2567621 2417812 2394091 2480769 2476214 2439155 2440206 2456411 2533414 2555947 2522394
14005 2522394 2444636 2454730 2375951 2423873 2537605 2577076 2601509 2585313 2575069 2665733 2603392
13994 2603392 2442270 2399786 2509536 2585145 2551548 2538661 2416399 2459508 2546598 2645920 2698681
13983 2698681 2577998 2525714 2565473 2588439 2546364 2524280 2562786 2549280 2491016 2521418 2646196
$$ packed form
14062B433311M8782r3126m3426M196K7481K949j8712K6022M1893O8352l0603O3428
14050B530547J2995j00732k4736l5956j15729p933R5533N3530k8187m51n9563
14039B319318N1243l6799m4311p7918n441j820J68622N8857p4193N3053J42576
14028B553187k9287M19M6117k05K8844j389p8068K0431p6380o1371J04277M8601
14016B555176J2445j49809k3721Q6678m555l7059J051J6205P7003K2533l3553
14005B522394p7758J0094p8779M7922J13732L9471K4433j6196j0244R0664o2341
13994B603392j61122m2484J09750P5609l3597j2887j22262M3109Q7090R9322N2761
13983B698681j20683n2284L9759K2966m2075k2084L8506j3506n8264L0402J24778
$$ plain form
13972 2646196 2758683 2723347 2593809 2578950 2582389 2559648 2572885 2481861 2599298 2691402 2660844
13961 2660844 2545125 2404332 2505286 2630599 2495945 2460125 2459122 2361292 2305674 2321224
13951 2321224 2448268 2510992 2502156 2515250 2520821 2468896 2517254 2584730 2468896 2346256 2445503
13940 2445503 2560683 2588972 2547558 2509993 2512675 2531930 2509286 2483938 2497847 2476891 2519373
13929 2519373 2565330 2613462 2477870 2451079 2410241 2423189 2610405 2681128 2547559 2379185
13919 2379185 2372550 2436106 2493296 2466999 2515033 2651181 2620980 2469793 2475962 2507600 2655342
13908 2655342 2769748 2677993 2666793 2679494 2641391 2634618 2523896 2544690 2564769 2493727 2391947
13897 2391947 2423047 2424949 2423565 2408719 2377308 2345400 2508143 2578495 2520456 2522385 2474110 2482378
$$ packed form
13972B646196J12487l5336j29538j4859L439k2741J3237r1024J17437R2104l0558
13961B660844j15719j40793J00954J25313j34654l5820j003r7830n5618J5550
13951B321224J27044O2724q836J3094N571n1925M8358O7476j15834j22640R9247
13940B445503J15180K8289m1414l7565K682J9255k2644k5348J3909k0956M2482
13929B519373M5957M8132j35592k6791m0838J2948J87216P0723j33569j68374
13919B379185o635O3556N7190k6297M8034J36148l0201j51187O169L1638J47742
13908B655342J14406r1755j1200J2701l8103o773j10722K0794K0079p1042j01780
13897B391947L1100J902j384j4846l1411l1908J62743P0352n8039J929m8275Q268
$$ plain form
13885 2482378 2485337 2507819 2563777 2696263 2714827 2722520 2737868 2611484 2636157 2621500 2630805
13874 2630805 2664119 2594338 2611545 2592613 2611370 2746629 2625043 2547954 2588359 2619098 2571584
13863 2571584 2540862 2612251 2699932 2665419 2554333 2488772 2381376 2456201 2489381 2474371 2526561
13852 2526561 2615531 2674795 2648082 2631126 2692194 2706224 2754953 2688586 2690023 2692956 2606002 2569422
13840 2569422 2578152 2743903 2773321 2760816 2802884 2793950 2692114 2613521 2636293 2676594 2652537
13829 2652537 2695757 2729937 2720489 2731078 2829577 2865189 2856604 2896996 2981379 2972285 2869578 2777972
13817 2777972 2768721 2646269 2714916 2780900 2722851 2658544 2603655 2695995 2627573 2744521 2812877
13806 2812877 2809902 2848970 2862267 2793419 2646648 2552928 2505694 2646055 2693204 2540716 2553466
$$ packed form
13885B482378K959K2482N5958J32486J8564P693J5348j26384K4673j4657R305
13874B630805L3314o9781J7207j8932J8757J35259j21586p7089M0405L0739m7514
13863B571584l0722P1389Q7681l4513j11086o5561j07396P4825L3180j5010N2190
13852B526561Q8970N9264k6713j6956O1068J4030M8729o6367J437K933q6954l6580
13840B569422Q730J65751K9418j2505M2068q934j01836p8593K2772M0301k4057
13829B652537M3220L4180r448J0589R8499L5612q585M0392Q4383r094j02707r1606
13817B777972r251j22452O8647O5984n8049o4307n4889R2340o8422J16948O8356
13806B812877k975L9068J3297o8848j46771r3720m7234J40361M7149j52488J2750
$$ plain form
13795 2553466 2608490 2582932 2634145 2757977 2868010 2871665 2816628 2851760 2878434 2890550 2925092
13784 2925092 2909902 2752435 2673236 2718293 2746666 2825976 2773468 2699361 2783873 2719663 2759323
13773 2759323 2812736 2897538 2980375 3007395 2973634 2953871 2938705 2789103 2689967 2807691 2997740
13762 2997740 2987901 2968469 2982219 3042532 2948014 2966097 2991009 2891409 2903508 2996520 2909622
13751 2909622 2764290 2800505 2830098 2811495 2728863 2649701 2655426 2702719 2710475 2745583 2694867
13740 2694867 2699909 2681208 2700084 2708307 2723239 2735710 2711128 2705686 2805678 2818411 2724805 2842806
13728 2842806 2865525 2833691 2807888 2802687 2871887 3023017 3135801 3054706 2941419 2940263 2962817
13717 2962817 3001556 2996841 2940038 2832708 2800956 2743664 2776708 2784317 2761043 2771138 2750491
$$ packed form
13795B553466N5024k5558N1213J23832J10033L655n5037L5132K6674J2116L4542
13784B925092j5190j57467p9199M5057K8373P9310n2508p4107Q4512o4210L9660
13773B759323N3413Q4802Q2837K7020l3761j9763j5166j49602r9136J17724J90049
13762B997740r839j9432J3750O0313r4518J8083K4912r9600J2099R3012q6898
13751B909622j45332L6215K9593j8603q2632p9162N725M7293P756L5108n0716
13740B694867N042j8701J8876Q223J4932J2471k4582n442R9992J2733r3606J18001
13728B842806K2719l1834k5803n201O9200J51130J12784q1095j13287j156K2554
13717B962817L8739m715n6803j07330l1752n7292L3044P609k3274J0095k0647
$$ plain form
13706 2750491 2781417 2829901 2873118 2882195 2867126 2862426 2878768 2821707 2814653 2879519 2849694 2815992
13694 2815992 2759493 2733141 2853592 2924703 2810517 2738756 2873047 2820895 2911312 3012966
13684 3012966 2956259 2794679 2839799 2972435 2923731 2872228 2982566 3044444 2989358 2914606 2819576
13673 2819576 2677520 2748841 2935418 2923336 2872365 2815689 2777866 2828187 2893182 2962476 2898321
13662 2898321 2940685 3006678 3121159 3166395 3074506 3016054 2870715 2777940 2782199 2797683 2774556
13651 2774556 2797107 2877447 2878901 2933686 3031717 3126622 3034785 2962936 3009424 2953583 2952773 3000598
13639 3000598 3071542 3070868 3117982 3148267 3052397 3180698 3217399 3186544 3108417 3096459 2997656
13628 2997656 2881767 2819216 2859085 2970581 2935122 2961986 3043259 3011456 3019333 3092235 3100409
$$ packed form
13706B750491L0926M8484M3217R077j5069m700J6342n7061p054O4866k9825l3702
13694B815992n6499k6352J20451P1111j14186p1761J34291n2152R0417J01654
13684C012966n6707j61580M5120J32636m8704n1503J10338O1878n5086p4752r5030
13673B819576j42056P1321J86577j2082n0971n6676l7823N0321O4995O9294o4155
13662B898321M2364O5993J14481M5236r1889n8452j45339r2775M259J5484k3127
13651B774556K2551Q0340J454N4785R8031R4905r1837p1849M6488n5841q10M7825
13639C000598P0944o74M7114L0285r5870J28301L6701l0855p8127j1958r8803
13628B997656j15889o2551L9869J11496l5459K6864Q1273l1803P877P2902Q174
$$ plain form
13617 3100409 3021134 2987272 2994806 3025715 2925566 2881908 2963308 3068227 3171746 3232931 3185345
13606 3185345 3150347 3118242 3075026 3067909 3044683 3113108 3053228 3046371 3031916 3110640 3107753 2951097
13594 2951097 2926487 2974186 3005973 2977519 3028077 3150792 3023983 2964973 2948105 3084736 3188401
13583 3188401 3280259 3176065 3033084 2945208 2933653 3046138 3125159 3090462 3113795 3079186 3083974
13572 3083974 2992947 2945025 3102608 3097035 3126105 3216176 3232682 3185230 3161991 3243977 3243349 3194919
13560 3194919 3212885 3133460 3105753 3184647 3249575 3210461 3205038 3152449 3213228 3269149 3212376
13549 3212376 3180050 3162950 3162042 3203912 3211035 3118437 3022067 3018882 3156064 3163017 3115531 3159463
13537 3159463 3215244 3246580 3236245 3246481 3333951 3233418 3173898 3152611 3094661 3090087 3161403
$$ packed form
13617C100409p9275l3862P534L0909j00149m3658Q1400J04919J03519O1185m7586
13606C185345l4998l2105m3216p117k3226O8425n9880o857j4455P8724k887j56656
13594B951097k4610M7699L1787k8454N0558J22715j26809n9010j6868J36631J03665
13583C188401R1858j04194j42981q7876j1555J12485P9021l4697K3333l4609M788
13572C083974r1027m7922J57583n573K9070R0071J6506m7452k3239Q1986o28m8430
13560C194919J7966p9425k7707P8894O4928l9114n423n2589O0779N5921n6773
13549C212376l2326j7100r08M1870P123r2598r6370l185J37182O953m7486M3932
13537C159463N5781L1336j0335J0236Q7470j00533n9520k1287n7950m574P1316
$$ plain form
13526 3161403 3251720 3143833 3131784 3167950 3269811 3289458 3263216 3171888 3062159 3152166 3231080
13515 3231080 3234540 3249803 3336189 3382227 3274280 3254235 3248140 3271838 3298785 3326100 3290573
13504 3290573 3390431 3433998 3362556 3283591 3215069 3267596 3249961 3273557 3324314 3347910 3380976
13493 3380976 3297798 3216335 3331146 3299406 3109309 3038729 3186858 3268540 3200114 3133536 3160779
13482 3160779 3186294 3135783 3121099 3206285 3278209 3317273 3387219 3468254 3397345 3206901 3206336
13471 3206336 3371437 3312128 3231381 3104497 3114732 3246701 3240832 3152080 3207185 3306052 3389244
13460 3389244 3229924 3163334 3284001 3369338 3365766 3363802 3439949 3446650 3317132 3314359 3273449
13449 3273449 3293000 3346723 3395515 3414730 3339923 3274331 3250104 3312539 3474057 3503120 3451134
$$ packed form
13526C161403R0317j07887j2049L6166J01861J9647k6242r1328j09729R0007P8914
13515C231080L460J5263Q6386M6038j07947k0045o095K3698K6947K7315l5527
13504C290573R9858M3567p1442p8965o8522N2527j7635K3596N0757K3596L3066
13493C380976q3178q1463J14811l1740j90097p0580J48129Q1682o8426o6578K7243
13482C160779K5515n0511j4684Q5186P1924L9064O9946Q1035p0909j90444n65
13471C206336J65101n9309q0747j26884J0235J31969n869q8752N5105R8867Q3192
13460C389244j59320o6590J20667Q5337l572j964P6147O701j29518k773m0910
13449C273449J9551N3723M8792J9215p4807o5592k4227O2435J61518K9063n1986
$$ plain form
13438 3451134 3316647 3248881 3248193 3336239 3377090 3338351 3372996 3330532 3273992 3311629 3343831
13427 3343831 3422709 3475744 3417340 3320874 3293493 3315807 3443282 3561733 3673583 3699287 3687414
13416 3687414 3563580 3477934 3491895 3467875 3528552 3510421 3421399 3368009 3403431 3480944 3491908
13405 3491908 3469414 3413252 3402534 3444180 3520511 3541010 3524661 3447019 3405886 3245263 3426965
13394 3426965 3590609 3663781 3711830 3630920 3631001 3745355 3726915 3614754 3578907 3545642 3478402
13383 3478402 3559405 3589371 3569271 3549302 3504242 3517059 3562688 3499418 3480578 3536140 3577218
13372 3577218 3565646 3489690 3494385 3462520 3504134 3619540 3636353 3438058 3544985 3548776 3394098
13361 3394098 3404250 3446676 3390708 3435299 3429478 3400282 3488561 3515887 3545684 3618892 3671394
$$ packed form
13438C451134j34487o7766o88Q8046M0851l8739L4645m2464n6540L7637L2202
13427C343831P8878N3035n8404r6466k7381K2314J27475J18451J11850K5704j1873
13416C687414j23834q5646J3961k4020O0677j8131q9022n3390L5422P7513J0964
13405C491908k2494n6162j0718M1646P6331K0499j6349p7642m1133j60623J81702
13394C426965J63644P3172M8049q0910Q1J14354j8440j12161l5847l3265o7240
13383C478402Q1003K9966k0100j9969m5060J2817M5629o3270j8840N5562M1078
13372C577218j1572p5956M695l1865M1614J15406J6813j98295J06927L791j54678
13361C394098J0152M2426n5968M4591n821k9196Q8279K7326K9797P3208N2502
$$ plain form
13350 3671394 3534877 3438384 3420795 3401549 3405980 3369690 3321491 3343219 3353115 3369682 3366638 3387383
13338 3387383 3445989 3539563 3584974 3594282 3524627 3459934 3477994 3520524 3639352 3787632 3773679
13327 3773679 3674826 3644104 3651988 3599368 3657355 3669598 3662561 3543300 3434163 3612837 3538405
13316 3538405 3488679 3563163 3652983 3657591 3687598 3638507 3610636 3696245 3754753 3704014 3619242
13305 3619242 3578969 3493318 3461445 3547299 3675545 3813606 3854364 3830473 3855849 3899429 3914397
13294 3914397 3928196 3852333 3852540 3842055 3818582 3786382 3755897 3698206 3575988 3563929 3524097
13283 3524097 3550348 3616566 3693869 3664962 3655609 3674095 3682355 3733628 3703039 3656252 3687465 3683978
13271 3683978 3731858 3820969 3820505 3852349 3794632 3806136 3787367 3646912 3590896 3696258 3717857
$$ packed form
13350C671394j36517r6493j7589j9246M431l6290m8199K1728R896J6567l044K0745
13338C387383N8606R3574M5411R308o9655o4693J8060M2530J18828J48280j3953
13327C773679r8853l0722P884n2620N7987J2243p037j19261j09137J78674p4432
13316C538405m9726P4484Q9820M608L0007m9091k7871Q5609N8508n0739q4772
13305C619242m0273q5651l1873Q5854J28246J38061M0758k3891K5376M3580J4968
13294C914397J3799p5863K07j0485k3473l2200l0485n7691j22218j2059l9832
13283C524097K6251O6218P7303k8907r353J8486Q260N1273l0589m6787L1213l487
13271C683978M7880Q9111m64L1844n7717J1504j8769j40455n6016J05362K1599
$$ plain form
13260 3717857 3563331 3627658 3698233 3636661 3582897 3569032 3564229 3617149 3474452 3539113 3700976
13249 3700976 3747042 3705119 3618443 3501563 3518826 3495982 3612066 3696177 3723311 3707503 3760439
13238 3760439 3866152 3791738 3780369 4002854 3989780 3847365 3849872 3896389 3981300 3978186 3964029
13227 3964029 3916219 3834769 3948966 3883108 3723994 3785907 3894342 3857022 3854849 3848763 3783928
13216 3783928 3759324 3751891 3864032 3956846 3888476 3901241 3914224 3970564 3940771 3853093 3826052
13205 3826052 4027250 3993499 3871900 3867678 3874081 3904625 3931200 3927297 3898331 4049642 4031132
13194 4031132 4061115 4020446 4001452 4009728 4022417 4048358 3967752 3716237 3746558 3979706 4066405
13183 4066405 4059074 3970635 3919920 3935599 3928710 3971872 4055308 4010624 3988369 4041221 3902860
$$ packed form
13260C717857j54526O4327P0575o1572n3764j3865m803N2920j42697O4661J61863
13249C700976M6066m1923q6676j16880J7263k2844J16084Q4111K7134j5808N2936
13238C760439J05713p4414j1369K22485j3074j42415K507M6517Q4911l114j4157
13227C964029m7810q1450J14197o5858j59114O1913J08435l7320k173o086o4835
13216C783928k4604p433J12141R2814o8370J2765J2983N6340k9793q7678k7041
13205C826052K01198l3751j21599m222O403L0544K6575l903k8966J51311j8510
13194D031132K9983m0669j8994Q276J2689K5941q0606k51515L0321K33148Q6699
13183D066405p331q8439n0715J5679o889M3162Q3436m4684k2255N2852j38361
$$ plain form
13172 3902860 3856585 4019476 4152012 4170448 4138326 4116213 4142497 4111754 4070046 3945711 3914889
13161 3914889 3970904 3958295 3946585 3957910 3956662 3945688 3959858 3999346 4015639 3971188 4120668
13150 4120668 4203828 4258989 4290332 4129574 4141304 4172605 4036257 3924849 4114426 4272142
13140 4272142 4229825 4204268 4099852 4030777 4005759 4041187 4103542 4092849 4136788 4060046 4041745
13129 4041745 4156502 4113677 4071305 4193525 4209465 4206684 4196537 4212091 4191707 4068556 4073557
13118 4073557 4064580 4097524 4080889 4147494 4277512 4304223 4294819 4099275 4013669 4005220 3995018
13107 3995018 4038666 4105434 4098064 4227912 4344908 4345712 4332121 4386937 4324694 4274031 4288695
13096 4288695 4270645 4321702 4429241 4513820 4468921 4426830 4420055 4480469 4445903 4364588 4361441
$$ packed form
13172C902860m6275J62891J32536J8436l2122k2113K6284l0743m1708j24335l0822
13161C914889N6015j2609j1710J1325j248j0974J4170L9488J6293m4451J49480
13150D120668Q3160N5161L1343j60758J1730L1301j36348j11408J89577J57716
13140D272142m2317k5557j04416o9075k5018L5428O2355j0693M3939p6742j8301
13129D041745J14757m2825m2372J22220J5940k781j0147J5554k0384j23151N001
13118D073557q977L2944j6635O6605J30018K6711r404j95544q5606q449j0202
13107C995018M3648O6768p370J29848J16996Q04j3591N4816o2243n0663J4664
13096D288695j8050N1057J07539Q4579m4899m2091o775O0414l4566q1315l147
$$ plain form
13085 4361441 4327506 4405972 4395105 4279879 4219121 4228059 4293369 4364707 4388177 4344080 4298684
13074 4298684 4299656 4252329 4301350 4385326 4316446 4373847 4355778 4359157 4318676 4483968 4563177 4403181
13062 4403181 4395309 4450159 4427787 4311354 4239309 4311510 4429665 4444097 4389123 4484856 4458125
13051 4458125 4333379 4249489 4304750 4362398 4318487 4293560 4409574 4528511 4649453 4555336
13041 4555336 4523150 4717294 4830889 4737577 4736912 4698914 4724678 4661093 4602444 4602526 4563123 4548249
13029 4548249 4535073 4514104 4428069 4430187 4403872 4266788 4292301 4354667 4419003 4474428 4427111
13018 4427111 4348649 4467571 4657461 4660145 4805415 4734207 4548317 4522494 4483667 4571244 4564114
13007 4564114 4619159 4586965 4467629 4487567 4523776 4518010 4539153 4589784 4539557 4460715 4535424
$$ packed form
13085D361441l3935P8466j0867j15226o0758Q938O5310P1338K3470m4097m5396
13074D298684R72m7327M9021Q3976o8880N7401j8069L379m0481J65292P9209j59996
13062D403181p872N4850k2372j16433p2045P2201J18155J4432n4974R5733k6731
13051D458125j24746q3890N5261N7648m3911k4927J16014J18937J20942r4117
13041D555336l2186J94144J13595r3312o65l7998K5764o3585n8649Q2l9403j4874
13029D548249j3176k0969q6035K118k6315j37084K5513O2366O4336N5425m7317
13018D427111p8462J18922J89890K684J45270p1208j85890k5823l8827Q7577p130
13007D564114N5045l2194j19336J9938L6209n766K1143N0631n0227p8842P4709
$$ plain form
12996 4535424 4591531 4585929 4496947 4481614 4488961 4442877 4371178 4372488 4439094 4479134 4500650 4564143
12984 4564143 4702157 4709193 4589917 4671068 4716923 4640907 4747932 4810218 4835944 4855480 4908250
12973 4908250 4919479 4791232 4750864 4765501 4739082 4724006 4712645 4744131 4841614 4825108 4697263
12962 4697263 4724955 4857185 4912558 4844227 4851621 4737906 4710736 4767569 4755174 4785299 4798850
12951 4798850 4756419 4684434 4726329 4747033 4728657 4663858 4730167 4777357 4845179 4846974 4750032
12940 4750032 4738947 4778946 4900984 4936089 4857852 4873345 4937186 5000862 4912908 4837579 4805174
12929 4805174 4766685 4848569 4884130 4937228 5055380 5094547 4991611 4915384 4941809 4891190 4871636
12918 4871636 4914249 4951990 5051677 5128579 5032619 4910644 4823862 4788887 4825571 4894058 4962715
$$ packed form
12996D535424N6107n602q8982j5333P347m6084p1699J310O6606M0040K1516O3493
12984D564143J38014P036j19276Q1151M5855p6016J07025O2286K5726J9536N2770
12973D908250J1229j28247m0368J4637k6419j5076j1361L1486R7483j6506j27845
12962D697263K7692J32230N5373o8331P394j13715k7170N6833j2395L0125J3551
12951D798850m2431p1985M1895K0704j8376o4799O6309M7190O7822J795r6942
12940D750032j1085L9999J22038L5105p8237J5493O3841O3676q7954p5329l2405
12929D805174l8489Q1884L5561N3098J18152L9167j02936p6227K6425n0619j9554
12918D871636M2613L7741R9687P6902r5960j21975q6782l4975L6684O8487O8657
$$ plain form
12907 4962715 4944465 4991275 5077356 5030183 4878254 4902809 4922688 4979947 5086590 5044684 5060495
12896 5060495 5131889 5149217 5066189 4961415 4961391 4993314 5059290 4992407 4970967 4929262 4952500 4974620
12884 4974620 5039732 5049576 5051462 5092799 5193153 5284230 5240702 5241437 5220074 5036265 4950987 4997575
12872 4997575 5120850 5174068 5123576 5120945 5132944 5223129 5239930 5211175 5298784 5323014 5322492 5170705
12860 5170705 5188501 5266061 5296507 5184568 5114525 5142275 5113044 5094039 5145374 5178791 5182143
12849 5182143 5191512 5218165 5195758 5139493 5140501 5327376 5307889 5292291 5239594 5211708 5252196
12838 5252196 5234818 5199206 5238025 5281265 5258956 5238347 5198664 5267543 5349841 5479119 5385720
12827 5385720 5288860 5389924 5352510 5344786 5483872 5544411 5459895 5379246 5411193 5478339 5496779
$$ packed form
12907D962715j8250M6810Q6081m7173j51929K4555J9879N7259J06643m1906J5811
12896E060495P1394J7328q3028j04774k4L1923O5976o6883k1440m1705K3238K2120
12884D974620O5112R844J886M1337J00354R1077m3528P35k1363j83809q5278M6588
12872D997575J23275N3218n0492k631J1999R0185J6801k8755Q7609K4230n22j51787
12860E170705J7796P7560L0446j11939p0043K7750k9231j9005N1335L3417L352
12849E182143R369K6653k2407n6265J008J86875j9487j5598n2697k7886M0488
12838E252196j7378l5612L8819M3240k2309k0609l9683O8879Q2298J29278r3399
12827E385720r6860J01064l7414p724J39086O0539q4516q0649L1947O7146J8440
$$ plain form
12816 5496779 5485282 5576545 5617247 5549663 5512324 5426741 5468548 5566669 5572322 5660617 5777464
12805 5777464 5759114 5743261 5813758 5631442 5499847 5501689 5557592 5635774 5611983 5524676 5515083
12794 5515083 5479659 5536994 5543178 5498262 5394196 5517485 5614270 5600226 5633842 5601965 5614927
12783 5614927 5633225 5525129 5529047 5606600 5616244 5670135 5760756 5731437 5717422 5794383 5807859
12772 5807859 5735812 5664769 5715054 5692403 5693769 5685760 5669504 5704280 5736768 5763860 5669621 5605617
12760 5605617 5665286 5858334 5998305 5935059 5863565 5814930 5784745 5778889 5852382 5951467 5927685
12749 5927685 5933370 5932878 5869790 5864440 5869249 5873770 5877386 5821990 5731842 5713150 5690373 5762028 5764063
12736 5764063 5743258 5738929 5759510 5760941 5779683 5922157 6093266 6160849 6126811 6008358 6067831
$$ packed form
12816E496779j1497R1263M0702o7584l7339q5583M1807R8121N653Q8295J16847
12805E777464j8350j5853P0497j82316j31595J842N5903P8182k3791q7307r593
12794E515083l5424N7335O184m4916j04066J23289R6785j4044L3616l1877J2962
12783E614927J8298j08096L918P7553R644N3891R0621k9319j4015P6961J3476
12772E807859p2047p1043N0285k2651J366q009j6256L4776L2488K7092r4239o4004
12760E605617N9669J93048J39971o3246p1494m8635l0185n856P3493R9085k3782
12749E927685N685m92o3088n350M809M521L616n5396r0148j8692k2777P1655K035
12736E764063k0805m329K0581J431J8742J42474J71109O7583l4038j18453N9473
$$ plain form
12725 6067831 6113170 5978540 6029974 6031035 6042471 6111008 6075259 5970342 5967388 5867740 5829194
12714 5829194 5897643 6007120 5988166 5932676 6032671 6125779 6179837 6209623 6212368 6190662 6062053
12703 6062053 6047241 6119433 6127933 6119638 6080903 6123690 6076599 6218519 6388096 6357636 6318170
12692 6318170 6361778 6350142 6200503 6142567 6107416 6061100 6057748 6033604 6077937 6207720 6241119
12681 6241119 6305826 6326259 6369306 6369612 6357648 6370162 6495509 6498448 6443936 6402802 6340578 6337143
12669 6337143 6289673 6318777 6350602 6442827 6534800 6576412 6479958 6450707 6529712 6489537 6496376
12658 6496376 6500647 6541782 6526936 6422872 6426721 6484400 6452771 6299667 6405408 6501338 6449651
12647 6449651 6466805 6456961 6494086 6538668 6600840 6578102 6655897 6690852 6588782 6608898 6722049
$$ packed form
12725F067831M5339j34630N1434J061J1436O8537l5749j04917k954r9648l8546
12714E829194O8449J09477j8954n5490R9995R3108N4058K9786K745k1706j28609
12703F062053j4812P2192Q500q295l8735M2787m7091J41920J69577l0460l9466
12692F318170M3608j1636j49639n7936l5151m6316l352k4144M4333J29783L3399
12681F241119O4707K0433M3047L06j1964J2514J25347K939n4512m1134o2224l435
12669F337143m7470K9104L1825R2225R1973M1612r6454k9251P9005m0175O839
12658F496376M271M1135j4846j04064L849N7679l1629j53104J05741R5930n1687
12647F449651J7154r844L7125M4582O2172k2738P7795L4955j02070K0116J13151
$$ plain form
12636 6722049 6738225 6682414 6561912 6632989 6640660 6583758 6678698 6824597 6924945 6908568 6946202
12625 6946202 6935031 6779372 6791961 6804217 6751445 6820102 6890208 6847588 6825111 6796832 6687430
12614 6687430 6752637 6848352 6827584 6862281 6902108 6952292 6910607 6926818 7070862 7130229 7058748
12603 7058748 7005270 6972265 6922953 6951464 6980608 6930025 6894299 7018793 7084447 7063961 7079946
12592 7079946 7069661 7067110 7097111 7085523 7067212 7039108 7102667 7055674 7066621 7178867 7237933
12581 7237933 7151819 7089401 7135327 7323363 7390036 7393191 7388750 7387880 7369302 7217670 7094395
12570 7094395 7074990 7156103 7177158 7280252 7375496 7423494 7501459 7495969 7378223 7305208 7344225
12559 7344225 7530156 7596428 7556605 7536582 7529413 7421653 7411013 7456716 7426480 7378996 7334127
$$ packed form
12636F722049J6176n5811j20502P1077P671n6902R4940J45899J00348j6377L7634
12625F946202j1171j55659J2589J2256n2772O8657P0106m2620k2477k8279j09402
12614F687430O5207R5715k0768L4697L9827N0184m1685J6211J44044N9367p1481
12603G058748n3478l3005m9312K8511K9144n0583l5726J24494O5654k0486J5985
12592G079946j0285k551L0001j1588j8311k8104O3559m6993J0947J12246N9066
12581G237933q6114o2418M5926J88036O6673L155m441q70j8578j51632j23275
12570G094395j9405Q1113K1055J03094R5244M7998P7965n490j17746p3015L9017
12559G344225J85931O6272l9823k0023p169j07760j0640M5703l0236m7484m4869
$$ plain form
12548 7334127 7332451 7343208 7328188 7450966 7414358 7421222 7588314 7800823 7850206 7781925 7704826
12537 7704826 7612707 7666238 7739056 7860524 7832204 7759592 7789440 7721076 7623710 7597246 7651418
12526 7651418 7720489 7811147 7812750 7696396 7722191 7758952 7648423 7583188 7671411 7810591 7767304
12515 7767304 7779672 7839853 7862435 7819974 7823311 7959749 7911639 7897705 7938105 7821387 7809567
12504 7809567 7844384 8019104 7936722 7791192 7739226 7813311 7758556 7812258 7988263 7964974 7858667
12493 7858667 7936953 8001269 8032827 7942639 7835930 7887328 7946966 8092351 8161976 8289866 8290138
12482 8290138 8181326 8136718 8080287 7995751 8100900 8283260 8208384 8232934 8265796 8262748 8278570
12471 8278570 8333940 8400273 8446857 8503429 8486766 8330873 8216165 8269794 8428230 8490306 8415575
$$ packed form
12548G334127j676J0757j5020J22778l6608O864J67092K12509M9383o8281p7099
12537G704826r2119N3531P2818J21468k8320p2612K9848o8364r7366k6464N4172
12526G651418O9071R0658J603j16354K5795L6761j10529o5235Q8223J39180m3287
12515G767304J2368O0181K2582m2461L337J36438m8110j3934M0400j16718j1820
12504G809567L4817J74720q2382j45530n1966P4085n4755N3702J76005k3289j06307
12493G858667P8286O4316L1558r0188j06709N1398N9638J45385O9625J27890K72
12482H290138j08812m4608n6431q4536J05149J82360p4876K4550L2862l048J5822
12471H278570N5370O6333M6584N6572j6663j55893j14708N3629J58436O2076p4731
$$ plain form
12460 8415575 8352416 8387399 8450967 8448265 8421160 8482290 8421725 8429739 8526839 8582222 8487909 8537091
12448 8537091 8728156 8648652 8665795 8627432 8638678 8698120 8774127 8757002 8748806 8797363 8853009
12437 8853009 8896551 8973829 8999100 8984498 9003294 8957991 8842815 8777654 8816237 9000093 9156143
12426 9156143 9151462 9116749 9157935 9186667 9147163 9207271 9173016 9214062 9243483 9206746 9236219
12415 9236219 9231176 9250072 9271264 9204029 9118501 9230489 9293386 9279412 9317728 9375989 9330541
12404 9330541 9353283 9392269 9469904 9571783 9622454 9694661 9632303 9535096 9568019 9497984 9404009
12393 9404009 9517054 9550536 9531967 9575951 9643503 9605702 9614014 9685233 9762034 9700807 9658159
12382 9658159 9703875 9678091 9762056 9675864 9669102 9673813 9760661 9823992 9925800 9939131 9862355
$$ packed form
12460H415575o3159L4983O3568k702k7105O1130o0565Q014R7100N5383r4313M9182
12448H537091J91065p9504J7143l8363J1246N9442P6007j7125q196M8557N5646
12437H853009M3542P7278K5271j4602J8796m5303j15176o5161L8583J83856J56050
12426I156143m681l4713M1186K8732l9504O0108l4255M1046K9421l6737K9473
12415I236219n043J8896K1192o7235q5528J11988O2897j3974L8316N8261m5448
12404I330541K2742L8986P7635J01879N0671P2207o2358r7207L2923p0035r3975
12393I404009J13045L3482j8569M3984O7552l7801Q312P1219P6801o1227m2648
12382I658159M5716k5784Q3965q6192o762M711Q6848O3331J01808J3331p6776
$$ plain form
12371 9862355 9869338 9944011 10012277 10024032 10061526 10051438 10173959 10171648 10096951 10133469 10236861
12360 10236861 10232613 10170115 10179505 10251905 10273527 10296325 10241242 10299403 10392035 10406797 10458670
12349 10458670 10477290 10429911 10502956 10668402 10666122 10683843 10633350 10583110 10666223 10676449 10490392
12338 10490392 10439653 10498177 10560013 10615533 10723020 10873104 10836654 10736987 10748259 10823418 10846948
12327 10846948 10785051 10678476 10795656 10802061 10790662 10840801 10956326 11026670 11074337 11069734 11107973
12316 11107973 11074228 11060374 11135977 11095452 10949771 10959137 11096296 11153052 11237511 11329507 11342023
12305 11342023 11339524 11385849 11415544 11368908 11374691 11415620 11524827 11592954 11546513 11541953 11495824
12294 11495824 11517736 11586446 11600357 11435674 11388592 11490949 11603123 11698370 11744771 11794003
$$ packed form
12371I862355O983P4673O8266J1755L7494j0088J22521k311p4697L6518J03392
12360A0236861m248o2498R390P2400K1622K2798n5083N8161R2632J4762N1873
12349A0458670J8620m7379P3045J65446k280J7721n0493n0240Q3113J0226j86057
12338A0490392n0739N8524O1836N5520J07487J50084l6450r9667J1272P5159K3530
12327A0846948o1897j06575J17180O405j1399N0139J15525P0344M7667m603L8239
12316A1107973l3745j3854P5603m0525j45681R366J37159N6756Q4459R1996J2516
12305A1342023k499M6325K9695m6636N783M0929J09207O8127m6441m560m6129
12294A1495824K1912O8710J3911j64683m7082J02357J12174R5247M6401M9232
$$ plain form
12284 11794003 11864023 11885442 11869091 11972853 11975918 11966098 12001404 12036502 12079992 12076431 12148714
12273 12148714 12259663 12356557 12312895 12285184 12327703 12370502 12383244 12411733 12463722 12554139 12582824
12262 12582824 12500078 12554627 12609686 12566200 12503583 12636359 12728817 12727846 12856062 12996694 12886329
12251 12886329 12820772 12875309 12956182 12904527 12911994 12936871 12951096 12981780 13077715 13147157 13121335
12240 13121335 13084130 13090215 13148281 13239344 13367522 13367853 13390096 13389469 13429499 13387079 13340901 13416174
12228 13416174 13571642 13631300 13618667 13665961 13644340 13714137 13766392 13877545 13817184 13718160 13643144
12217 13643144 13669242 13766518 13868545 14073066 14068202 14019878 14051934 14161828 14250418 14290953 14312438
12206 14312438 14235052 14335400 14474289 14555530 14674332 14652285 14664917 14713189 14653717 14693260
$$ packed form
12284A1794003P0020K1419j6351J03762L065r820L5306L5098M3490l561P2283
12273A2148714J10949R6894m3662k7711M2519M2799J2742K8489N1989R0417K8685
12262A2582824q2746N4549N5059m3486o2617J32776R2458r71J28216J40632j10365
12251A2886329o5557N4537Q0873n1655P467K4877J4225L0684R5935O9442k5822
12240A3121335l7205O085N8066R1063J28178L31K2243o27M0030m2420m6178P5273
12228A3416174J55468N9658j2633M7294k1621O9797N2255J11153o0361r9024p5016
12217A3643144K6098R7276J02027K04521m864m8324L2056J09894Q8590M0535K1485
12206A4312438p7386J00348J38889Q1241J18802k2047J2632M8272n9472L9543
$$ plain form
12196 14693260 14793615 14876323 14798871 14774367 14751001 14887459 14961574 15070442 15079592 15073734 15125558
12185 15125558 15240796 15287134 15274282 15357266 15389797 15390151 15392361 15552109 15559610 15552345 15614529 15515449
12173 15515449 15510689 15577435 15660711 15776106 15837864 15938799 16025956 16046038 16082072 16259142 16332412
12162 16332412 16211401 16196055 16281952 16298025 16328497 16370096 16453442 16539904 16631120 16629140 16657743
12151 16657743 16689861 16927601 16958161 16933513 17064978 17150529 17330704 17285517 17255086 17310654
12141 17310654 17340366 17340424 17433950 17538425 17644369 17710910 17686123 17615260 17698977 17798913 17855612
12130 17855612 17923365 18008299 18044868 18140780 18103515 18163474 18191425 18271024 18394362 18451515 18474088
12119 18474088 18499291 18594823 18746866 18779800 18827654 18937658 18938806 18905028 19079871 19168665 19183126
$$ packed form
12196A4693260J00355Q2708p7452k4504k3366J36458P4115J08868R150n858N1824
12185A5125558J15238M6338j2852Q2984L2531L54K210J59748P501p265O2184r9080
12173A5515449m760O6746Q3276J15395O1758J00935Q7157K0082L6034J77070P3270
12162A6332412j21011j5346Q5897J6073L0472M1599Q3346Q6462R1216j980K8603
12151A6657743L2118K37740L0560k4648J31465Q5551J80175m5187l0431N5568
12141A7310654K9712N8R3526J04475J05944O6541k4787p0863Q3717R9936N6699
12130A7855612O7753Q4934L6569R5912l7265N9959K7951P9599J23338N7153K2573
12119A8474088K5203R5532J52043L2934M7854J10004J148l3778J74843Q8794J4461
$$ plain form
12108 19183126 19160065 19238655 19300867 19359305 19464533 19589395 19671119 19751099 19800452 19949366
12098 19949366 20001162 20071377 20189841 20234138 20329459 20487912 20515089 20550409 20446252 20468247
12088 20468247 20512388 20585804 20751238 20893990 20965203 20946104 20971988 21088994 21258814 21385654
12078 21385654 21383756 21317277 21459474 21631939 21696621 21805189 21793996 21822092 21989635 22048459
12068 22048459 22008026 22079996 22179189 22191548 22295555 22292744 22349102 22505589 22606450 22767315
12058 22767315 22911652 22963070 22887235 22994154 23017548 23011530 23163328 23300874 23374097 23349127
12048 23349127 23462630 23547659 23578498 23576815 23653450 23723342 23786965 23879298 24044848 23995086 23983976
12037 23983976 24030090 24038666 24081598 24168965 24261019 24290266 24205564 24188778 24311035 24458290 24561930
$$ packed form
12108A9183126k3061P8590O2212N8438J05228J24862Q1724P9980M9353J48914
12098A9949366N1796P0215J18464M4297R5321J58453K7177L5320j04157K1995
12088B0468247M4141P3416J65434J42752P1213j9099K5884J17006J69820J26840
12078B1385654j898o6479J42197J72465O4682J08568j1193K8096J67543N8824
12068B2048459m0433P1970R9193J2359J04007k811N6358J56487J00861J60865
12058B2767315J44337N1418p5835J06919K3394o018J51798J37546P3223k4970
12048B3349127J13503Q5029L0839j683P6635O9892O3623R2333J65550m9762j1110
12037B3983976M6114Q576M2932Q7367R2054K9247q4702j6786J22257J47255J03640
$$ plain form
12026 24561930 24634660 24575560 24660290 24730599 24698189 24749309 24798114 24778240 24845510 24911389 25104547
12015 25104547 25271841 25251037 25202907 25232316 25260219 25202583 25123945 25096398 25134931 25211271 25217617
12004 25217617 25101709 24965392 25108064 25207402 25151891 25174710 25153807 25071989 25075496 25020011 24932637
11993 24932637 24862213 24608504 24516392 24466462 24451664 24349655 24265967 24185165 24066876 23968595
11983 23968595 23905280 23871755 23780883 23636792 23488346 23166510 23013253 22901796 22692946 22510199
11973 22510199 22370749 22121741 21838676 21589569 21400881 21237959 21063047 20761560 20350103
11964 20350103 20037357 19925220 19657585 19322995 19057783 18813843 18532219 18066991 17612167
11955 17612167 17204231 16809673 16538953 16309422 15950168 15534300 15089225 14703495 14324170
$$ packed form
12026B4561930P2730n9100Q4730P0309l2410N1120M8805j9874O7270O5879J93158
12015B5104547J67294k0804m8130K9409K7903n7636p8638k7547L8533P6340O346
12004B5217617j15908j36317J42672R9338n5511K2819k0903q1818L507n5485q7374
11993B4932637p0424k53709r2112m9930j4798j02009q3688q0802j18289r8281
11983B3968595o3315l3525r0872j44091j48446l21836j53257j11457k08850j82747
11973B2510199j39450k49008k83065k49107j88688j62922j74912l01487m11457
11964B0350103l12746j12137k67635l34590k65212k43940k81624m65228m54824
11955A7612167m07936l94558k70720k29531l59254m15868m45075l85730l79325
$$ plain form
11946 14324170 13857713 13348353 12775402 12346427 11883881 11355060 10931128 10340239 9797341
11937 9797341 9237694 8766638 8369349 7873540 7374605 6920803 6358064 5850843 5284071
11928 5284071 4689115 4184529 3638117 3122713 2584791 2052047 1544245 1003425 409938
11919 409938 -234937 -678060 -1193759 -1586488 -2032403 -2688192 -3199032 -3673012 -4188692 -4639345
11909 -4639345 -5197529 -5688093 -6227825 -6778290 -7114090 -7629041 -8070119 -8505436 -8828358
11900 -8828358 -9299309 -9778840 -10209286 -10660403 -11064325 -11374627 -11736735 -12195320 -12523628
11891 -12523628 -12851799 -13192971 -13597293 -13896768 -14150084 -14317970 -14621953 -14850547 -15079363
11882 -15079363 -15375108 -15637513 -15875098 -16146340 -16326990 -16614889 -16917542 -17216368 -17355888
$$ packed form
11946A4324170m66457n09360n72951m28975m62546n28821m23932n90889n42898
11937I797341n59647m71056l97289m95809m98935m53802n62739n07221n66772
11928E284071n94956n04586n46412n15404n37922n32744n07802n40820n93487
11919D09938o44875m43123n15699l92729m45915o55789n10840m73980n15680m50653
11909d639345n58184m90564n39732n50465l35800n14951m41078m35317l22922
11900h828358m70951m79531m30446m51117m03922l10302l62108m58585l28308
11891a2523628l28171l41172m04322k99475k53316j67886l03983k28594k28816
11882a5079363k95745k62405k37585k71242j80650k87899l02653k98826j39520
$$ plain form
11873 -17355888 -17545212 -17883364 -18004604 -18003747 -18111173 -18309901 -18442620 -18552631 -18694118 -18759709
11863 -18759709 -18944021 -19106774 -19165574 -19294198 -19413788 -19450021 -19486511 -19449619 -19613322 -19822131
11853 -19822131 -19948870 -20011084 -20017749 -19965954 -19927051 -19878293 -19973475 -20130273 -20078831 -19991406 -20019467
11842 -20019467 -20133561 -20258492 -20200019 -20219321 -20334997 -20263112 -20173757 -20222126 -20206237 -20076373
11832 -20076373 -20062995 -20073412 -20001595 -19946097 -19911068 -19841815 -19772126 -19825535 -19950919 -20021514 -19872516
11821 -19872516 -19641208 -19526215 -19471408 -19445535 -19361925 -19186152 -19121133 -19066757 -19058700 -19010170 -18889072
11810 -18889072 -18871019 -18828717 -18890175 -18804749 -18735948 -18738258 -18667264 -18698082 -18634857 -18431457 -18390025
11799 -18390025 -18321390 -18342218 -18318231 -18161119 -18031422 -17974541 -17949283 -17954773 -17899199 -17888735 -17730275
$$ packed form
11873a7355888j89324l38152j21240Q57j07426j98728j32719j10011j41487o5591
11863a8759709j84312j62753n8800j28624j19590l6233l6490L6892j63703k08809
11853a9822131j26739o2214o665N1795L8903M8758r5182j56798N1442Q7425k8061
11842b0019467j14094j24931N8473j9302j15676P1885Q9355m8369J5889J29864
11832b0076373J3378j0417P1817N5498L5029O9253O9689n3409j25384p0595J48998
11821a9872516K31308J14993N4807K5873Q3610J75773O5019N4376Q057M8530J21098
11810a8889072J8053M2302o1458Q5426O8801k310P0994l0818O3225K03400M1432
11799a8390025O8635k0828K3987J57112J29697N6881K5258n490N5574J0464J58460
$$ plain form
11788 -17730275 -17512813 -17452425 -17436319 -17429229 -17404561 -17295069 -17250389 -17246469 -17148491 -17096875 -16950344
11777 -16950344 -16756009 -16775512 -16766586 -16725851 -16576939 -16454857 -16407575 -16440673 -16466405 -16402544 -16279001
11766 -16279001 -16106439 -15944276 -15946075 -15860123 -15842330 -15803079 -15790635 -15721853 -15651698 -15603151 -15442996
11755 -15442996 -15278250 -15294242 -15238089 -15132098 -15090559 -15023376 -14864229 -14751479 -14780936 -14754916
11745 -14754916 -14674146 -14620619 -14541626 -14452307 -14347813 -14326944 -14295175 -14146472 -14087030 -14024335 -13933264
11734 -13933264 -13991046 -13976028 -13855678 -13896705 -13886992 -13774398 -13749457 -13709253 -13666609 -13530324 -13337650
11723 -13337650 -13145579 -13089279 -13068200 -13062971 -13075454 -13172028 -13124454 -13004841 -12946319 -12827450 -12817893
11712 -12817893 -12804854 -12762504 -12638720 -12578582 -12556034 -12554975 -12497593 -12324941 -12305364 -12248801 -12123524
$$ packed form
11788a7730275K17462O0388J6106P090K4668J09492M4680L920R7978N1616J46531
11777a6950344J94335j9503Q926M0735J48912J22082M7282l3098k5732O3861J23543
11766a6279001J72562J62163j799Q5952J7793L9251J2444O8782P0155M8547J60155
11755a5442996J64746j5992N6153J05991M1539O7183J59147J12750k9457K6020
11745a4754916Q0770N3527P8993Q9319J04494K0869L1769J48703N9442O2695R1071
11734a3933264n7782J5018J20350m1027R713J12594K4941M0204M2644J36285J92674
11723a3337650J92071N6300K1079N229j2483r6574M7574J19613N8522J18869R557
11712a2817893J3039M2350J23784O0138K2548J059N7382J72652J9577N6563J25277
$$ plain form
11701 -12123524 -12018137 -11982612 -11868500 -11750713 -11715277 -11740493 -11673680 -11687977 -11611336 -11592671
11691 -11592671 -11571652 -11550583 -11561001 -11586919 -11577094 -11522271 -11420324 -11408485 -11439957 -11423974 -11345981
11680 -11345981 -11340072 -11246657 -11098074 -11002948 -10891210 -10887005 -10822955 -10721755 -10687552 -10749355 -10717806
11669 -10717806 -10586844 -10507782 -10472860 -10513003 -10521766 -10435705 -10345919 -10362567 -10366596 -10275932 -10141488
11658 -10141488 -10094551 -10084309 -9943917 -9893839 -9976783 -9997986 -9888704 -9765167 -9779047 -9803944
11648 -9803944 -9846747 -9804916 -9621138 -9449657 -9484705 -9530555 -9492281 -9422763 -9523527 -9476564 -9393405
11637 -9393405 -9403915 -9338566 -9238358 -9159366 -9011428 -8903735 -8916917 -8868526 -8798014 -8748863 -8759550
11626 -8759550 -8632353 -8565976 -8568415 -8686925 -8915102 -8840509 -8653228 -8565790 -8535327 -8517734 -8479021
$$ packed form
11701a2123524J05387L5525J14112J17787L5436k5216O6813j4297P6641J8665
11691a1592671K1019K1069j0418k5918R825N4823J01947J1839l1472J5983P7993
11680a1345981N909R3415J48583R5126J11738M205O4050J01200L4203o1803L1549
11669a0717806J30962P9062L4922m0143q763Q6061Q9786j6648m029R0664J34444
11658a0141488M6937J0242J40392N0078q2944k1203J09282J23537j3880k4897
11648i803944m2803M1831J83778J71481l5048m5850L8274O9518j00764M6963Q3159
11637i393405j0510O5349J00208P8992J47938J07693j3182M8391P0512M9151j0687
11626h759550J27197O6377k439j18510k28177P4593J87281Q7438L0463J7593L8713
$$ plain form
11615 -8479021 -8304487 -8292978 -8343743 -8363166 -8310066 -8217771 -8257227 -8311745 -8156252 -8042388 -8130726
11604 -8130726 -8058185 -7965107 -8041976 -8160522 -8080435 -7906985 -7771904 -7855204 -7859061 -7835023 -7815206
11593 -7815206 -7722994 -7676297 -7668435 -7625748 -7511292 -7436107 -7474978 -7496140 -7495230 -7520709 -7509919 -7424603
11581 -7424603 -7413117 -7398969 -7329079 -7239095 -7119760 -7067698 -7121455 -7178748 -7176071 -7189153 -7128487
11570 -7128487 -7022388 -6947279 -6912496 -6775454 -6685329 -6735117 -6792311 -6786251 -6665019 -6561833 -6567261
11559 -6567261 -6586383 -6481749 -6419951 -6530941 -6629813 -6628890 -6453804 -6306726 -6265889 -6206266 -6170478
11548 -6170478 -6201552 -6292035 -6330403 -6376932 -6395678 -6236437 -6108154 -6041010 -6041221 -6041528 -6052885 -6014423
11536 -6014423 -6052655 -5952334 -5986532 -5995085 -5923409 -5907936 -5833360 -5821536 -5797240 -5866328 -5789708
$$ packed form
11615h479021J74534J1509n0765j9423N3100R2295l9456n4518J55493J13864q8338
11604h130726P2541R3078p6869j18546Q0087J73450J35081q3300l857K4038J9817
11593g815206R2212M6697P862M2687J14456P5185l8871k1162R10k5479J0790Q5316
11581g424603J1486J4148O9890Q9984J19335N2062n3757n7293K677j3082O0666
11570g128487J06099P5109L4783J37042R0125m9788n7194O060J21232J03186n428
11559f567261j9122J04634O1798j10990r8872R23J75086J47078M0837N9623L5788
11548f170478l1074r0483l8368m6529j8746J59241J28283O7144k11l07j1357L8462
11536f014423l8232J00321l4198q553P1676J5473P4576J1824K4296o9088P6620
$$ plain form
11525 -5789708 -5596747 -5497323 -5535850 -5545878 -5521329 -5513509 -5495780 -5439682 -5398794 -5367830 -5464540
11514 -5464540 -5450510 -5370613 -5384684 -5362428 -5349127 -5343881 -5323869 -5302974 -5238243 -5188906 -5175210
11503 -5175210 -5110435 -5098786 -5048765 -4933749 -4812721 -4754808 -4781628 -4860903 -4831329 -4698641 -4698382
11492 -4698382 -4738443 -4640806 -4649161 -4575175 -4569269 -4611749 -4638032 -4677833 -4707214 -4673781 -4551472
11481 -4551472 -4537216 -4495112 -4437031 -4560275 -4578737 -4470658 -4385267 -4314696 -4331211 -4421324 -4469668
11470 -4469668 -4484474 -4371007 -4347068 -4208313 -4213866 -4198470 -4179666 -4194504 -4212358 -4213748 -4238933
11459 -4238933 -4214364 -4098969 -4065545 -4113667 -4099015 -4154906 -4083081 -3966822 -4010545 -3969158 -3801888
11448 -3801888 -3750020 -3764430 -3750358 -3721178 -3735816 -3677813 -3608742 -3566056 -3557026 -3635701 -3721375
$$ packed form
11525e789708J92961R9424l8527j0028K4549P820J7729N6098M0888L0964r6710
11514e464540J4030P9897j4071K2256J3301N246K0012K0895O4731M9337J3696
11503e175210O4775J1649N0021J15016J21028N7913k6820p9275K9574J32688K59
11492d698382m0061R7637q355P3986N906m2480k6283l9801k9381L3433J22309
11481d551472J4256M2104N8081j23244j8462J08079Q5391P0571j6515r0113m8344
11470d469668j4806J13467K3939J38755n553J5396J8804j4838j7854j390k5185
11459d238933K4569J15395L3424m8122J4652n5891P1825J16259m3723M1387J67270
11448c801888N1868j4410J4072K9180j4638N8003O9071M2686R030p8675q5674
$$ plain form
11437 -3721375 -3697462 -3723935 -3748716 -3707478 -3630657 -3457625 -3351905 -3317774 -3368800 -3339470 -3361504
11426 -3361504 -3459759 -3390965 -3271796 -3226254 -3337685 -3368827 -3330606 -3322700 -3177361 -3080553 -3152900
11415 -3152900 -3192671 -3308569 -3279733 -3208782 -3142761 -3047966 -3008062 -2936132 -2890312 -2859503 -2885318
11404 -2885318 -2871137 -2870479 -2876856 -2928093 -2883427 -2843571 -2839016 -2754064 -2724051 -2842969 -2887014 -2859938
11392 -2859938 -2798227 -2821298 -2885362 -2696211 -2596379 -2507463 -2498202 -2476861 -2502151 -2549398 -2568650
11381 -2568650 -2640461 -2681978 -2668956 -2525326 -2444219 -2376640 -2257512 -2099039 -2013588 -2038805 -2126560
11370 -2126560 -2093837 -2112170 -2025548 -2040870 -2043174 -2096692 -2069894 -1924567 -1975776 -1941619 -1923208
11359 -1923208 -1945337 -2005068 -2050021 -1989544 -1842676 -1802065 -1862590 -1892343 -1855022 -1862398 -1877355
$$ packed form
11437c721375K3913k6473k4781M1238P6821J73032J05720L4131n1026K9330k2034
11426c361504r8255O8794J19169M5542j11431l1142L8221P906J45339R6808p2347
11415c152900l9771j15898K8836P0951O6021R4795L9904P1930M5820L0809k5815
11404b885318J4181O58o377n1237M4666L9856M555Q4952L0013j18918m4045K7076
11392b859938O1711k3071o4064J89151R9832Q8916R261K1341k5290m7247j9252
11381b568650p1811m1517J3022J43630Q1107O7579J19128J58473Q5451k5217q7755
11370b126560L2723j8333Q6622j5322k304n3518K6798J45327n1209L4157J8411
11359a923208k2129n9731m4953O0477J46868M0611o0525k9753L7321p376j4957
$$ plain form
11348 -1877355 -1823369 -1699351 -1566861 -1811885 -1922242 -1983747 -1887902 -1731627 -1544945 -1560116
11338 -1560116 -1489928 -1505440 -1353046 -1304932 -1279853 -1279814 -1350617 -1398539 -1255414 -1263223 -1254898 -1139269
11326 -1139269 -1013297 -960511 -1101706 -1211154 -1247170 -1247362 -1219674 -1116365 -1008848 -1022595 -1114967
11315 -1114967 -1061012 -1089474 -1093534 -996405 -876553 -756762 -677594 -649345 -692871 -702833 -775422
11304 -775422 -795555 -778265 -802563 -748452 -728652 -643259 -602568 -513866 -399102 -383509 -308922
11293 -308922 -283077 -359552 -413600 -285089 -228622 -314297 -283554 -311006 -343916 -236339 -177490
11282 -177490 -220150 -125495 9793 63182 72286 170274 240336 289152 267889 355749 441795
11271 441795 621711 774530 877616 660112 182388 -415896 -902179 -1187030 -1306151 -1276169
$$ packed form
11348a877355N3986J24018J32490k45024j10357o1505R5845J56275J86682j5171
11338a560116P0188j5512J52394M8114K5079L9p0803m7922J43125p809Q325J15629
11326a139269J25972N2786j41195j09448l6016j92K7688J03309J07517j3747r2372
11315a114967N3955k8462m060R7129J19852J19791P9168K8249m3526r962p2589
11304g75422k0133J7290k4298N4111J9800Q5393M0691Q8702J14764J5593P4587
11293c08922K5845p6475n4048J28511N6467q5675L0743k7452l2910J07577N8849
11282a77490m2660R4655J35288N3389R104R7988P0062M8816k1263Q7860Q6046
11271D41795J79916J52819J03086k17504m77724n98284m86283k84851j19121K9982
$$ plain form
11261 -1276169 -1206619 -1108847 -1066137 -832955 -691789 -687272 -662985 -565836 -453962 -505024 -522032
11250 -522032 -448846 -405600 -316883 -266993 -189868 -154609 -193498 -140489 -37496 88203 77309
11239 77309 66677 137617 189656 218218 302911 317530 326996 315313 303052 336549 356960 319719
11227 319719 307852 382042 442621 481563 382900 417660 410927 583475 613911 702099 779233
11216 779233 806822 794040 731267 655134 651445 656395 745892 873148 924889 803779 880337
11205 880337 930369 977837 944089 955444 994280 1120658 1111728 1115268 1066691 998725 1010745 1136454
11193 1136454 1226326 1185331 1149792 1170280 1195991 1253346 1301502 1355717 1427086 1439131 1474304
11182 1474304 1562916 1511193 1453770 1538122 1591678 1626636 1714107 1732822 1680581 1671328 1653414
$$ packed form
11261a276169O9550R7772M2710K33182J41166M517K4287R7149J11874n1062j7008
11250e22032P3186M3246Q8717M9890P7125L5259l8889N3009J02993J25699j0894
11239G7309j0632P0940N2039K8562Q4693J4619R466j1683j2261L3497K0411l7241
11227C19719j1867P4190O0579L8942r8663L4760o733J72548L0436Q8188P7134
11216G79233K7589j2782o2773p6133l689M950Q9497J27256N1741j21110P6558
11205H80337N0032M7468l3748J1355L8836J26378q930L540m8577o7966J2020J25709
11193A136454Q9872m0995l5539K0488K5711N7355M8156N4215P1369J2045L5173
11182A474304Q8612n1723n7423Q4352N3556L4958Q7471J8715n2241r253j7914
$$ plain form
11171 1653414 1672157 1801266 1879191 1878949 1856166 1901946 1974929 2004905 2166164 2209003 2145883
11160 2145883 2213477 2295817 2168426 2041439 1963037 2027277 2078293 2211918 2324059 2376478
11150 2376478 2293252 2319559 2452948 2526148 2496845 2481776 2528109 2597516 2509456 2437305 2561774
11139 2561774 2679852 2655161 2579793 2603797 2661177 2774076 2816481 2860792 2887884 2964880 2991095
11128 2991095 2948501 3032489 3019793 2932002 2985797 3187064 3267817 3267933 3210877 3264299 3316950
11117 3316950 3405623 3500232 3480608 3387404 3329978 3430549 3583710 3577929 3479285 3479996 3595935
11106 3595935 3605311 3615082 3656917 3629604 3728902 3809031 3866220 3858320 3963157 4074268 4145511
11095 4145511 4138880 4201188 4278813 4255389 4181447 4276248 4452013 4420281 4424931 4412555 4358634
$$ packed form
11171A653414J8743J29109P7925k42k2783M5780P2983K9976J61259M2839o3120
11160B145883O7594Q2340j27391j26987p8402O4240N1016J33625J12141N2419
11150B376478q3226K6307J33389P3200k9303j5069M6333O9407q8060p2151J24469
11139B561774J18078k4691p5368K4004N7380J12899M2405M4311K7092P6996K6215
11128B991095m2594Q3988j2696q7791N3795K01267Q0753J16n7056N3422N2651
11117C316950Q8673R4609j9624r3204n7426J00571J53161n781r8644P11J15939
11106C595935R376R771M1835k7313R9298Q0129N7189p900J04837J11111P1243
11095D145511o631O2308P7625k3424p3942R4801J75765l1732M650j2376n3921
$$ plain form
11084 4358634 4292802 4269508 4329632 4418908 4596401 4751241 4837036 4899502 4905414 4897688 4921573
11073 4921573 5071734 5086966 4956002 4933331 5073452 5176448 5324070 5412855 5370373 5431101
11063 5431101 5448319 5490392 5634875 5709261 5717283 5846486 5980712 5944463 5927234 6086996 6316353
11052 6316353 6623378 7108132 7384888 7378587 7236174 7175500 7202720 7214790 7122615 6910210
11042 6910210 6823686 6778186 6832837 7020801 7162728 7190997 7315116 7478540 7626054 7592445
11032 7592445 7642564 7570968 7494550 7469319 7548747 7573309 7606174 7772499 7785791 7808356 7957285
11021 7957285 8015360 7999750 7931040 7907744 7821480 7814015 7842304 7926366 8082775 8126484 8199970
11010 8199970 8272669 8343926 8446493 8390007 8378687 8457712 8464056 8447450 8530988 8772359 8928191
$$ packed form
11084D358634o5832k3294O0124Q9276J77493J54840Q5795O2466N912p726K3885
11073D921573J50161J5232j30964k2671J40121J02996J47622Q8785m2482O0728
11063E431101J7218M2073J44483P4386Q022J29203J34226l6249j7229J59762K29357
11052F316353L07025M84754K76756o301j42413o0674K7220J2070r2175k12405
11042F910210q6524m5500N4651J87964J41927K8269J24119J63424J47514l3609
11032G592445N0119p1596p6418k5231P9428K4562L2865J66325J3292K2565J48929
11021G957285N8075j5610o8710k3296q6264p465K8289Q4062J56409M3709P3486
11010H199970P2699P1257J02567n6486j1320P9025O344j6606Q3538K41371J55832
$$ plain form
10999 8928191 9050290 9144800 9237031 9215044 9211875 9333633 9459337 9610771 9882706 9922403
10989 9922403 9851985 9858926 9855182 9772972 9762621 9966670 10226778 10306119 10402471 10534159 10647682
10978 10647682 10814605 10903527 10948782 10954738 11211043 11565724 11648429 11729059 11754419 11884716
10968 11884716 12001938 12177125 12331249 12539526 12785781 12826150 12823948 12925518 13121213 13280734
10958 13280734 13357889 13516797 13775981 14025033 14278965 14483565 14601083 14652697 14877687 15180689
10948 15180689 15347286 15372269 15485497 15722608 15959834 16156404 16506330 16737197 16925408
10939 16925408 17193358 17414451 17675183 17862970 17899310 18198104 18535619 18889189 19221575
10930 19221575 19575041 19876645 20249352 20541884 20762370 21047192 21377121 21752626 22122397
$$ packed form
10999H928191J22099R4510R2231k1987l169J21758J25704J51434K71935L9697
10989I922403p0418O941l744q2210j0351K04049K60108P9341R6352J31688J13523
10978A0647682J66923Q8922M5255N956K56305L54681Q2705Q0630K5360J30297
10968A1884716J17222J75187J54124K08277K46255M0369k202J01570J95695J59521
10958A3280734P7155J58908K59184K49052K53932K04600J17518N1614K24990L03002
10948A5180689J66597K4983J13228K37111K37226J96570L49926K30867J88211
10939A6925408K67950K21093K60732J87787L6340K98794L37515L53570L32386
10930A9221575L53466L01604L72707K92532K20486K84822L29929L75505L69771
$$ plain form
10921 22122397 22512510 22909418 23302099 23617701 24039598 24442926 24781316 25250978 25744196
10912 25744196 26269369 26862595 27360539 27840598 28446059 29143599 29864379 30540023 31191081
10903 31191081 31927930 32775745 33600207 34382418 35237774 35956331 36902418 37907363 39115052
10894 39115052 40389148 41703419 42975233 44204901 45636827 47283919 49186689 51073399
10886 51073399 53059649 55214348 57295895 59328517 61357434 63568255 66195372 69425340
10878 69425340 73219411 77646425 82645871 88150642 94222155 100805509 107898633 115959676
10870 115959676 125627589 137458032 151851236 169276121 189714374 212470047 234127081
10863 234127081 244006872 219347230 130778612 -11978772 -142076342 -208359210 -220711920
$$ packed form
10921B2122397L90113L96908L92681L15602M21897M03328L38390M69662M93218
10912B5744196N25173N93226M97944M80059O05461O97540P20780O75644O51058
10903C1191081P36849Q47815Q24462P82211Q55356P18557R46087J004945J207689
10894C9115052J274096J314271J271814J229668J431926J647092J902770J886710
10886E1073399J986250K154699K081547K032622K028917K210821K627117L229968
10878F9425340L794071M427014M999446N504771O071513O583354P093124Q061043
10870A15959676R667913J1830443J4393204J7424885K0438253K2755673K1657034
10863B34127081R879791k4659642q8568618j42757384j30097570o6282868j2352710
$$ plain form
10856 -220711920 -209526385 -191230476 -172525703 -155419559 -140394836 -127664007 -116996349
10849 -116996349 -107980559 -100334226 -93483459 -87127045 -81599019 -76587941 -72012366 -67842653
10841 -67842653 -64085037 -60738157 -57871509 -55575948 -53747362 -51985171 -50109609 -48272338
10833 -48272338 -46314272 -44459373 -42866424 -41282452 -39739664 -38304096 -36977310 -35761023
10825 -35761023 -34694604 -33710168 -32602868 -31547917 -30719955 -29768170 -28835959 -28086105 -27355329
10816 -27355329 -26603852 -25881199 -25240693 -24644502 -23970437 -23271714 -22636178 -22102116 -21633685
10807 -21633685 -21192927 -20618904 -20082504 -19581768 -19124216 -18870156 -18411065 -18000859 -17622765
10798 -17622765 -17251528 -16859787 -16465644 -16156612 -15806380 -15356568 -14920227 -14663166 -14350128
$$ packed form
10856b20711920J1185535J8295909J8704773J7106144J5024723J2730829J0667658
10849a16996349R015790P646333O850767O356414N528026N011078M575575M169713
10841f7842653L757616L346880K866648K295561J828586J762191J875562J837271
10833d8272338J958066J854899J592949J583972J542788J435568J326786J216287
10825c5761023J066419R84436J107300J054951Q27962R51785R32211P49854P30776
10816b7355329P51477P22653O40506N96191O74065O98723O35536N34062M68431
10807b1633685M40758N74023N36400N00736M57552K54060M59091M10206L78094
10798a7622765L71237L91741L94143L09032L50232M49812M36341K57061L13038
$$ plain form
10789 -14350128 -14096650 -13907656 -13578858 -13203288 -12948558 -12632698 -12322407 -11983789 -11694730
10780 -11694730 -11347371 -10990740 -10721440 -10513145 -10419845 -10347826 -10160284 -9839313 -9468708 -9174454
10770 -9174454 -8895694 -8651526 -8393998 -8224310 -8036198 -7850890 -7682883 -7397567 -7156902
10761 -7156902 -6842185 -6579934 -6438295 -6292777 -6176646 -6020173 -5894928 -5828561 -5775321 -5644725
10751 -5644725 -5373429 -4981300 -4780096 -4636866 -4439096 -4283450 -4237909 -3957834 -3640196 -3549361
10741 -3549361 -3432125 -3354320 -3262206 -3023413 -2848760 -2717710 -2686578 -2611633 -2533217 -2481042
10731 -2481042 -2367907 -2152774 -1878151 -1610037 -1389242 -1342878 -1215703 -1037979 -860706 -623124
10721 -623124 -403977 -87255 105675 163818 219507 252049 399475 556887 784789 1010840
$$ packed form
10789a4350128K53478J88994L28798L75570K54730L15860L10291L38618K89059
10780a1694730L47359L56631K69300K08295R3300P2019J87542L20971L70605K94254
10770i174454K78760K44168K57528J69688J88112J85308J68007K85316K40665
10761g156902L14717K62251J41639J45518J16131J56473J25245O6367N3240J30596
10751e644725K71296L92129K01204J43230J97770J55646M5541K80075L17638R0835
10741c549361J17236P7805R2114K38793J74653J31050L1132P4945P8416N2175
10731b481042J13135K15133K74623K68114K20795M6364J27175J77724J77273K37582
10721f23124K19147L16722J92930N8143N5689L2542J47426J57412K27902K26051
$$ plain form
10711 1010840 1260080 1430112 1673741 1821380 1919760 2049992 2186313 2263448 2278601 2395885
10701 2395885 2655840 2946954 3185290 3345806 3647926 3880759 4067839 4259366 4475212
10692 4475212 4612730 4811577 5099067 5316858 5495468 5725204 5914954 6167841 6387064
10683 6387064 6741395 7153796 7439783 7624165 7861211 8089047 8412237 8838279 9201978
10674 9201978 9598327 10013554 10474881 10951570 11378626 11466736 11539834 11674555 11791399 12015202
10664 12015202 12400600 12746896 13040810 13343968 13708506 14251066 14742467 15025859 15420536
10655 15420536 15880746 16367324 16916038 17364305 17842550 18459879 19033526 19642744 20257198
10646 20257198 20773229 21393860 22074195 22720238 23465070 24274424 25082297 26083370 27014721
$$ packed form
10711A010840K49240J70032K43629J47639R8380J30232J36321P7135J5153J17284
10701B395885K59955K91114K38336J60516L02120K32833J87080J91527K15846
10692D475212J37518J98847K87490K17791J78610K29736J89750K52887K19223
10683F387064L54331M12401K85987J84382K37046K27836L23190M26042L63699
10674I201978L96349M15227M61327M76689M27056Q8110P3098J34721J16844K23803
10664A2015202L85398L46296K93914L03158L64538N42560M91401K83392L94677
10655A5420536M60210M86578N48714M48267M78245O17329N73647O09218O14454
10646B0257198N16031O20631O80335O46043P44832Q09354Q07873J001073R31351
$$ plain form
10637 27014721 27904751 28897103 30035854 31290979 32528717 33707058 35083708 36550178
10629 36550178 37999353 39526951 41357969 43299367 45571237 48018054 50747148 53759689
10621 53759689 57180100 60874729 64893305 69154347 73351205 76729358 78056331 76016482
10613 76016482 70626561 63667967 58002075 55825285 57465668 61873012 68229861 75614940
10605 75614940 82975505 88138829 87879692 78720923 60948270 40340809 24366469 17330555
10597 17330555 18316903 24612332 33403860 43018119 51480573 55697590 51085961 33306274
10589 33306274 3584262 -28792893 -52594530 -63127627 -63073044 -57023624 -48305244 -39096126
10581 -39096126 -31332236 -27361537 -30334639 -42396280 -61939115 -82028066 -95393075
$$ packed form
10637B7014721Q90030R92352J138751J255125J237738J178341J376650J466470
10629C6550178J449175J527598J831018J941398K271870K446817K729094L012541
10621E3759689L420411L694629M018576M261042M196858L378153J326973k039849
10613G6016482n389921o958594n665892k176790J640383M407344O356849P385079
10605G5614940P360565N163324k59137r158769j7772653k0607461j5974340p035914
10597A7330555R86348O295429Q791528R614259Q462454M217017m611629j7779687
10589C3306274k9722012l2377155k3801637j0533097N4583O049420Q718380R209118
10581c9096126P763890L970699k973102j2061641j9542835k0088951j3365009
$$ plain form
10574 -95393075 -99733311 -97186515 -91319275 -84533319 -78025001 -72830390 -69927590 -70330912
10566 -70330912 -74452855 -81046814 -87545260 -91385868 -91625843 -89339475 -85882224 -81974365
10558 -81974365 -78102304 -74395138 -71080295 -68013922 -65270319 -62799731 -60534286 -58643879
10550 -58643879 -56938813 -55177818 -53466920 -51833396 -50376162 -48993166 -47690556 -46485627
10542 -46485627 -45377301 -44337644 -43362999 -42626760 -41895310 -41169754 -40422577 -39730456 -38996901
10533 -38996901 -38224468 -37611423 -37035080 -36295502 -35640991 -35114349 -34651212 -34141317 -33531428
10524 -33531428 -33042469 -32718920 -32316467 -31914128 -31472161 -31070387 -30637283 -30213188 -29779153
10515 -29779153 -29481330 -29195431 -28805015 -28559870 -28239886 -27849659 -27681616 -27391331 -26998011
$$ packed form
10574i5393075m340236K546796N867240O785956O508318N194611K902800m03322
10566g0330912m121943o593959o498446l840608k39975K286368L457251L907859
10558h1974365L872061L707166L314843L066373K743603K470588K265445J890407
10550e8643879J705066J760995J710898J633524J457234J382996J302610J204929
10542d6485627J108326J039657R74645P36239P31450P25556P47177O92121P33555
10533c8996901P72433O13045N76343P39578O54511N26642M63137N09895O09889
10524c3531428M88959L23549M02453M02339M41967M01774M33104M24095M34035
10515b9779153K97823K85899L90416K45145L19984L90227J68043K90285L93320
$$ plain form
10506 -26998011 -26697358 -26537543 -26327135 -26077614 -25857561 -25614739 -25305126 -25090663 -24754298
10497 -24754298 -24528393 -24370369 -24141614 -23932294 -23663141 -23515912 -23388407 -23085327 -22896849
10488 -22896849 -22733804 -22528250 -22348686 -22133090 -21957487 -21799620 -21679160 -21586867 -21437120
10479 -21437120 -21205889 -21019261 -20918477 -20675612 -20469277 -20273496 -20134991 -20015725 -19832164
10470 -19832164 -19713504 -19502417 -19249136 -19145824 -19175281 -19034008 -18823488 -18709576 -18725719 -18749219
10460 -18749219 -18559978 -18287403 -18080302 -17906883 -17722140 -17489922 -17316899 -17114561 -16974972
10451 -16974972 -16982820 -17090959 -17499122 -18041111 -18442126 -18517542 -18571017 -18477389 -18276787 -18087484
10441 -18087484 -17884176 -17703429 -17582729 -17396576 -17158770 -17142870 -17119499 -17085908 -17037661 -16960334
$$ packed form
10506b6998011L00653J59815K10408K49521K20053K42822L09613K14463L36365
10497b4754298K25905J58024K28755K09320K69153J47229J27505L03080J88478
10488b2896849J63045K05554J79564K15596J75603J57867J20460R2293J49747
10479b1437120K31231J86628J00784K42865K06335J95781J38505J19266J83561
10470a9832164J18660K11087K53281J03312k9457J41273K10520J13912j6143k3500
10460a8749219J89241K72575K07101J73419J84743K32218J73023K02338J39589
10451a6974972p848j08139m08163n41989m01015p5416n3475R3628K00602J89303
10441a8087484K03308J80747J20700J86153K37806J5900K3371L3591M8247P7327
$$ plain form
10431 -16960334 -16830780 -16687400 -16505995 -16383314 -16292069 -16260174 -16239243 -16081020 -15768664 -15678408
10421 -15678408 -15657723 -15634615 -15498487 -15389163 -15330486 -15302998 -15297579 -15136936 -15139646 -15198490 -14982379
10410 -14982379 -14795447 -14653318 -14583150 -14509819 -14484775 -14532484 -14623945 -14524252 -14271890 -14032502
10400 -14032502 -13969147 -13872335 -13899586 -13931048 -13963174 -14042839 -14085393 -13990594 -13828787 -13706199 -13666772
10389 -13666772 -13592672 -13610898 -13667594 -13592343 -13564370 -13594419 -13609336 -13481815 -13476150 -13318662 -13287489
10378 -13287489 -13252147 -13195426 -13160479 -13181353 -13158324 -13147827 -13184625 -13117865 -13108217 -13107600 -13064761 -12944029
10366 -12944029 -12833953 -12823882 -12731076 -12727101 -12764662 -12672321 -12513910 -12378944 -12307142 -12277388 -12346625
10355 -12346625 -12386497 -12294531 -12272549 -12221960 -12180777 -12153170 -12188120 -12117198 -11917607 -11806066 -11815928
$$ packed form
10431a6960334J29554J43380J81405J22681R1245L1895K0931J58223L12356R0256
10421a5678408K0685K3108J36128J09324N8677K7488N419J60643k710n8844K16111
10410a4982379J86932J42129P0168P3331K5044m7709r1461R9693K52362K39388
10400a4032502O3355R6812k7251l1462l2126p9665m2554R4799J61807J22588L9427
10389a3666772P4100j8226n6696P5251K7973l0049j4917J27521N665J57488L1173
10378a3287489L5342N6721L4947k0874K3029J0497l6798O6760R648O17M2839J20732
10366a2944029J10076J0071R2806L975l7561R2341J58411J34966P1802K9754o9237
10355a2346625l9872R1966K1982N0589M1183K7607l4950P0922J99591J11541r862
$$ plain form
10344 -11815928 -11959665 -11904303 -11843854 -11908649 -11946651 -11985370 -11860983 -11843580 -11802432 -11726614 -11620742
10333 -11620742 -11575311 -11496362 -11421994 -11371001 -11365633 -11371489 -11290852 -11290124 -11324098 -11293338 -11245445 -11293103
10321 -11293103 -11322946 -11200184 -11102181 -11187932 -11194130 -11110072 -11105847 -11210374 -11219720 -10984011 -10748447
10310 -10748447 -10707188 -10718848 -10735647 -10762157 -10693298 -10692037 -10607434 -10615913 -10504584 -10479726 -10427373
10299 -10427373 -10451324 -10533930 -10535884 -10323152 -10197968 -10254728 -10273906 -10312091 -10213048 -10217852 -10237602
10288 -10237602 -10338956 -10275681 -10086263 -9975933 -9975571 -10000506 -10112096 -10252589 -10148752 -9993022
10278 -9993022 -9928909 -9907564 -9759474 -9652202 -9502383 -9391726 -9379536 -9144119 -9198340 -9312679
10268 -9312679 -9379871 -9592252 -9954627 -10222018 -10212331 -10231023 -10262297 -10353077 -10464617 -10365154 -10221058
$$ packed form
10344a1815928j43737N5362O0449o4795l8002l8719J24387J7403M1148P5818J05872
10333a1620742M5431P8949P4368N0993N368n856Q0637P28l3974L0760M7893m7658
10321a1293103k9843J22762R8003q5751o198Q4058M225j04527r346K35709K35564
10310a0748447M1259j1660j6799k6510O8859J261Q4603q479J11329K4858N2353
10299a0427373k3951q2606j954K12732J25184n6760j9178l8185R9043m804j9750
10288a0237602j01354O3275J89418J10330L62k4935j11590j40493J03837J55730
10278i993022O4113K1345J48090J07272J49819J10657J2190K35417n4221j14339
10268i312679o7192k12381l62375k67391R687j8692l1274r0780j11540R9463J44096
$$ plain form
10257 -10221058 -10270093 -10234945 -10191208 -10134180 -10150001 -9994626 -9937954 -9849702 -9738269 -9690948 -9625633
10246 -9625633 -9547260 -9558225 -9650122 -9608322 -9581054 -9574011 -9613244 -9660138 -9550522 -9402123 -9322767
10235 -9322767 -9323184 -9386568 -9413478 -9300031 -9194867 -9210765 -9236959 -9254547 -9232270 -9167309 -9059282
10224 -9059282 -8974091 -8958454 -9126745 -9127524 -9050213 -9020860 -9109953 -9160221 -9099332 -9102431 -9043123 -8856671
10212 -8856671 -8715358 -8642695 -8756332 -8835062 -8940610 -8913830 -8842900 -8739364 -8752874 -8651584
10202 -8651584 -8532374 -8487198 -8446006 -8480285 -8496930 -8423629 -8295087 -8326668 -8471357 -8601272
10192 -8601272 -8604037 -8471203 -8461150 -8410293 -8319967 -8386417 -8327805 -8146849 -8137265 -8187528 -8144890
10181 -8144890 -8168642 -8105134 -8032905 -7967676 -8011095 -8079138 -8135330 -8152646 -8088152 -8004376 -8001779
$$ packed form
10257a0221058m9035L5148M3737N7028j5821J55375N6672Q8252J11433M7321O5315
10246i625633P8373j0965r1897M1800K7268P043l9233m6894J09616J48399P9356
10235i322767m17o3384k6910J13447J05164j5898k6194j7588K2277O4961J08027
10224i059282Q5191J5637j68291p79P7311K9353q9093n0268O0889l099N9308J86452
10212h856671J41313P2663j13637p8730j05548K6780P0930J03536j3510J01290
10202h651584J19210M5176M1192l4279j6645P3301J28542l1581j44689j29915
10192h601272k765J32834J0053N0857R0326o6450N8612J80956R584n0263M2638
10181h144890k3752O3508P2229O5229m3419o8043n6192j7316O4494Q3776K597
$$ plain form
10170 -8001779 -7958401 -7773063 -7840946 -7900228 -7905445 -8045153 -8094456 -7990571 -8016652 -8161610 -8151031
10159 -8151031 -8104149 -7953036 -7819606 -7767642 -7725702 -7785499 -7968533 -8114993 -8222274 -8226205
10149 -8226205 -8327785 -8370577 -8260249 -8151546 -8084668 -8123406 -8144317 -8230639 -8326591 -8379577 -8399008
10138 -8399008 -8500894 -8577335 -8532906 -8356709 -8272722 -8220555 -8161976 -8039332 -8113523 -8107880 -8122318
10127 -8122318 -8244123 -8362931 -8334313 -8247516 -8159726 -8053123 -7883233 -7915085 -7997972 -8014157
10117 -8014157 -8103649 -8107858 -8056209 -7916732 -7891841 -7873313 -7908989 -7835257 -7769654 -7757340 -7734415
10106 -7734415 -7582696 -7567349 -7599450 -7566703 -7597150 -7666848 -7780068 -7880981 -7865206 -7767333 -7689543
10095 -7689543 -7626784 -7598593 -7562063 -7606419 -7620554 -7607245 -7576462 -7606300 -7569235 -7470188 -7390861
$$ packed form
10170h001779M3378J85338o7883n9282n217j39708m9303J03885k6081j44958J0579
10159h151031M6882J51113J33430N1964M1940n9797j83034j46460j07281l931
10149h226205j01580m2792J10328J08703O6878l8738k0911q6322r5952n2986j9431
10138h399008j01886p6441M4429J76197Q3987N2167N8579J22644p4191N643j4438
10127h122318j21805j18808K8618Q6797Q7790J06603J69890l1852q2887j6185
10117h014157q9492m209N1649J39477K4891J8528l5676P3732O5603J2314K2925
10106g734415J51719J5347l2101L2747l0447o9698j13220j00913J5775R7873P7790
10095g689543O2759K8191L6530m4356j4135J3309L0783k9838L7065R9047P9327
$$ plain form
10084 -7390861 -7457999 -7457353 -7370319 -7357900 -7438453 -7493232 -7494672 -7431899 -7335899 -7416320 -7380226 -7292328
10072 -7292328 -7197884 -7261403 -7344676 -7418788 -7394683 -7314478 -7235868 -7148165 -7215461 -7203403 -7030925
10061 -7030925 -7011841 -7110616 -7110529 -6981711 -6919853 -7001928 -7135943 -7142640 -7212527 -7225011 -7255505 -7260779
10049 -7260779 -7176728 -7097705 -7151010 -7221363 -7212179 -7180328 -7080689 -6948271 -7004085 -7006161 -7019628
10038 -7019628 -6962844 -6999523 -7018018 -6965483 -6919029 -7036502 -6997857 -6987005 -7059203 -7073148 -7016805
10027 -7016805 -7021685 -7047645 -7067546 -7036151 -7035657 -7069336 -7040969 -6795909 -6634022 -6694656 -6777181
10016 -6777181 -6840323 -6692053 -6626399 -6670886 -6740453 -6743606 -6809213 -6814129 -6798037 -6653294 -6569219
10005 -6569219 -6543824 -6508370 -6626134 -6580541 -6480310 -6517680 -6610852 -6576994 -6591824 -6712130 -6681124
$$ packed form
10084g390861o7138O46Q7034J2419q0553n4779j440O2773R6000q0421L6094Q7898
10072g292328R4444o3519q3273p4112K4105Q0205P8610Q7703o7296J2058J72478
10061g030925J9084r8775Q7J28818O1858q2075j34015o697o9887j2484l0494n274
10049g260779Q4051P9023n3305p0353R184L1851R9639J32418n5814k076j3467
10038g019628N6784l6679j8495N2535M6454j17473L8645J0852p2198j3945N6343
10027g016805m880k5960j9901L1395M94l3679K8367K45060J61887o0634q2525
10016f777181o3142J48270O5654m4487o9567l153o5607m916J6092J44743Q4075
10005f569219K5395L5454j17764M5593J00231l7370r3172L3858j4830j20306L1006
$$ plain form
9994 -6681124 -6633270 -6734172 -6716261 -6502042 -6376858 -6510911 -6639879 -6644679 -6509146 -6392991
9984 -6392991 -6461907 -6558793 -6573326 -6443421 -6467237 -6529433 -6605225 -6502374 -6521277 -6610867 -6607149
9973 -6607149 -6551996 -6549162 -6499099 -6546355 -6498304 -6452648 -6409469 -6387761 -6460591 -6507780 -6523483 -6605198
9961 -6605198 -6596718 -6427246 -6364096 -6334443 -6277512 -6248376 -6257019 -6358059 -6360136 -6303619 -6258485 -6248824
9949 -6248824 -6308400 -6262059 -6163375 -6130394 -6160114 -6175622 -6088217 -6053880 -5978668 -6045027 -6222891
9938 -6222891 -6268845 -6188668 -6177284 -6175237 -6241829 -6212384 -6211569 -6153167 -6068052 -6081100 -5981652 -5920799
9926 -5920799 -5958319 -5981331 -6141703 -6178053 -6049592 -6003514 -6038870 -6052816 -5934403 -5854573 -5881578
9915 -5881578 -5999737 -6093789 -6012777 -5937607 -5921654 -5919931 -5887009 -5850014 -5934166 -5987031 -5994168 -6026074
$$ packed form
9994f681124M7854j00902J7911K14219J25184j34053j28968m800J35533J16155
9984f392991o8916r6886j4533J29905k3816o2196p5792J02851j8903q9590L718
9973f607149N5153K834N0063m7256M8051M5656M3179K1708p2830m7189j5703q1715
9961f605198Q480J69472O3150K9653N6931K9136q643j01040k077N6517M5134R661
9949f248824n9576M6341R8684L2981k9720j5508Q7405L4337P5212o6359j77864
9938f222891m5954Q0177J1384K047o6592K9445Q15N8402Q5115j3048R9448O0853
9926e920799l7520k3012j60372l6350J28461M6078l5356j3946J18413P9830k7005
9915e881578j18159r4052Q1012P5170J5953J723L2922L6995q4152n2865p137l1906
$$ plain form
9903 -6026074 -6024610 -6072507 -6059507 -5894429 -5798172 -5768935 -5798522 -5753821 -5797440 -5884412 -5832431
9892 -5832431 -5774674 -5805282 -5884814 -5919843 -5851056 -5782507 -5821764 -5843352 -5844756 -5871396 -5811012 -5732269
9880 -5732269 -5700098 -5582685 -5561350 -5603902 -5597473 -5581314 -5519280 -5535579 -5621427 -5593033 -5644309
9869 -5644309 -5633311 -5678237 -5647023 -5622557 -5752295 -5747758 -5717704 -5624894 -5550187 -5530919 -5558075
9858 -5558075 -5545791 -5629854 -5632586 -5577612 -5588222 -5547690 -5550172 -5514381 -5571818 -5539790 -5558065 -5607257
9846 -5607257 -5589506 -5534090 -5620881 -5748481 -5766237 -5625232 -5627803 -5649249 -5677769 -5659620 -5621070
9835 -5621070 -5489812 -5360923 -5373614 -5416899 -5439611 -5392172 -5428219 -5443580 -5410314 -5371517 -5434355
9824 -5434355 -5442724 -5518849 -5467134 -5394377 -5361987 -5417097 -5569370 -5584320 -5490840 -5364421 -5347091
$$ packed form
9903f026074J464m7897J3000J65078R6257K9237k9587M4701m3619q6972N1981
9892e832431N7757l0608p9532l5029O8787O8549l9257k1588j404k6640O0384P8743
9880e732269L2171J17413K1335m2552O429J6159O2034j6299q5848K8394n1276
9869e644309J0998m4926L1214K4466j29738M537L0054R2810P4707J9268k7156
9858e558075J2284q4063k732N4974j0610M0532k482L5791n7437L2028j8275m9192
9846e607257J7751N5416q6791j27600j7756J41005k571k1446k8520J8149L8550
9835e621070J31258J28889j2691m3285k2712M7439l6047j5361L3266L8797o2838
9824e434355q369p6125N1715P2757L2390n5110j52273j4950R3480J26419J7330
$$ plain form
9813 -5347091 -5336112 -5334199 -5411108 -5328402 -5291338 -5298762 -5394723 -5387854 -5399210 -5343790 -5350845 -5257458
9801 -5257458 -5276599 -5364467 -5327524 -5251905 -5155793 -5187996 -5258817 -5304080 -5331620 -5194816 -5127832
9790 -5127832 -5267583 -5388003 -5472890 -5400933 -5328652 -5265988 -5212248 -5183382 -5207275 -5207836 -5205513 -5193770
9778 -5193770 -5214450 -5201184 -5144336 -5106366 -5197555 -5297725 -5243647 -5310161 -5175526 -5144241 -5114010
9767 -5114010 -5002891 -5097594 -5092123 -5177688 -5159532 -5236758 -5224870 -5125239 -5091320 -5022156 -4957946
9756 -4957946 -4902404 -4879899 -4939721 -5007000 -5049072 -5085525 -5069754 -4938833 -4963878 -5066203 -5202709
9745 -5202709 -5163824 -5064069 -4929991 -4978087 -5102071 -5234804 -5214965 -5093609 -4971837 -4888318
9735 -4888318 -4865049 -4951935 -4871491 -4943187 -5061292 -4972093 -4856833 -4861699 -4851483 -4889376 -4922870
$$ packed form
9813e347091J0979J913p6909Q2706L7064p424r5961O869j1356N5420p055R3387
9801e257458j9141q7868L6943P5619R6112l2203p0821m5263k7540J36804O6984
9790e127832j39751j20420q4887P1957P2281O2664N3740K8866k3893n61K323J1743
9778e193770k0680J3266N6848L7970r1189j00170N4078o6514J34635L1285L0231
9767e114010J11119r4703N471q5565J8156p7226J1888R9631L3919O9164O4210
9756d957946N5542K2505n9822o7279m2072l6453J5771J30921k5045j02325j36506
9745e202709L8885R9755J34078m8096j23984j32733J9839J21356J21772Q3519
9735d888318K3269q6886Q0444p1696j18105Q9199J15260m866J0216l7893l3494
$$ plain form
9724 -4922870 -4885136 -4853861 -4755991 -4803016 -4861526 -4946877 -4770596 -4777915 -4958433 -5073386 -4965783
9713 -4965783 -4883078 -4912876 -4877859 -4718115 -4722805 -4736103 -4760886 -4774742 -4649672 -4703620 -4870906
9702 -4870906 -4917374 -4893239 -4851356 -4735241 -4706682 -4702229 -4707155 -4698261 -4622307 -4660208 -4685464 -4641801
9690 -4641801 -4558888 -4454967 -4335176 -4324731 -4303880 -4284037 -4440112 -4496423 -4482351 -4486315 -4380069
9679 -4380069 -4264087 -4207590 -4186845 -4275039 -4248748 -4239557 -4328975 -4242971 -4145997 -4027462 -4014896
9668 -4014896 -4108036 -4005111 -3921780 -3900281 -3850313 -3742949 -3616250 -3490432 -3400023 -3302174 -3177616
9657 -3177616 -2998696 -2620754 -2170114 -1539639 -1028888 -609433 -534478 -1969057 -5025607
9648 -5025607 -7704997 -8768413 -8597871 -8060661 -7632713 -7197610 -6829285 -6629859 -6677920
$$ packed form
9724d922870L7734L1275R7870m7025n8510q5351J76281p319j80518j14953J07603
9713d965783Q2705k9798L5017J59744m690j3298k4783j3856J25070n3948j67286
9702d870906m6468K4135M1883J16115K8559M453m926Q894P5954l7901k5256M3663
9690d641801Q2913J03921J19791J0445K0851J9843j56075n6311J4072l964J06246
9679d380069J15982N6497K0745q8194K6291R191q9418Q6004R6974J18535J2566
9668d014896r3140J02925Q3331K1499M9968J07364J26699J25818R0409R7849J24558
9657c177616J78920L77942M50640O30475N10751M19455P4955j434579l056550
9648e025607k679390j063416J70542N37210M27948M35103L68325J99426m8061
$$ plain form
9639 -6677920 -6480019 -6212178 -5970187 -5899178 -5845894 -5821276 -5774191 -5798711 -5686692 -5653400 -5668191
9628 -5668191 -5624373 -5638668 -5497643 -5418875 -5374982 -5364556 -5395984 -5432650 -5516791 -5502360 -5440441
9617 -5440441 -5310068 -5349838 -5338741 -5204161 -5126112 -5136961 -5146834 -5031607 -4910763 -4919959 -5049879
9606 -5049879 -5097119 -5105317 -5047269 -5063637 -5036924 -5057320 -5161119 -5194721 -5228006 -5017062 -4933939
9595 -4933939 -5017380 -5014836 -4908928 -4855925 -4938324 -5018120 -5024272 -4918227 -4909449 -4934422 -4857374 -4876681
9583 -4876681 -4950169 -5065762 -4949125 -4790908 -4875835 -4958681 -5026506 -5013103 -5053575 -5062477 -5039168
9572 -5039168 -5018747 -4990768 -4936327 -4843547 -4904256 -4884863 -4764539 -4633993 -4580691 -4586030 -4629426
9561 -4629426 -4626622 -4681754 -4531737 -4450660 -4456884 -4409442 -4429766 -4482680 -4513380 -4549866 -4690528
$$ packed form
9639f677920J97901K67841K41991P1009N3284K4618M7085k4520J12019L3292j4791
9628e668191M3818j4295J41025P8768M3893J0426l1428l6666q4141J4431O1919
9617e440441J30373l9770J1097J34580P8049j0849r873J15227J20844r196j29920
9606e049879m7240q198N8048j6368K6713k0396j03799l3602l3285K10944Q3123
9595d933939q3441K544J05908N3003q2399p9796o152J06045Q778k4973P7048j9307
9583d876681p3488j15593J16637J58217q4927q2846o7825J3403m0472q902K3309
9572e039168K0421K7979N4441R2780o0709J9393J20324J30546N3302n339m3396
9561d629426K804n5132J50017Q1077o224M7442k0324n2914l0700l6486j40662
$$ plain form
9550 -4690528 -4762416 -4718879 -4739639 -4722402 -4704070 -4650722 -4576395 -4611633 -4641357 -4647096 -4702311 -4699877
9538 -4699877 -4659159 -4545506 -4521332 -4574616 -4540563 -4401201 -4448460 -4478305 -4430301 -4447425 -4544808
9527 -4544808 -4472000 -4414911 -4382439 -4454403 -4541837 -4546601 -4544270 -4523287 -4537123 -4548259 -4576603 -4605369
9515 -4605369 -4539489 -4499820 -4395741 -4461571 -4488686 -4465970 -4475714 -4411428 -4428421 -4484639 -4570082
9504 -4570082 -4567816 -4658869 -4760963 -4686525 -4502092 -4412629 -4467057 -4536677 -4540177 -4507579 -4499709 -4444799
9492 -4444799 -4450558 -4490719 -4462369 -4540433 -4628090 -4580139 -4440834 -4312478 -4344770 -4348351 -4309896
9481 -4309896 -4269600 -4310708 -4269931 -4252622 -4341882 -4446059 -4474297 -4465461 -4266604 -4210273 -4159129
9470 -4159129 -4152237 -4119500 -4193610 -4249340 -4220180 -4343148 -4416928 -4371689 -4321917 -4310778 -4245858
$$ packed form
9550d690528p1888M3537k0760J7237J8332N3348P4327l5238k9724n739n5215K434
9538d699877M0718J13653K4174n3284L4053J39362m7259k9845M8004j7124r7383
9527d544808P2808N7089L2472p1964q7434m764K331K0983j3836j1136k8344k8766
9515d605369O5880L9669J04079o5830k7115K2716r744O4286j6993n6218q5443
9504d570082K266r1053j02094P4438J84433Q9463n4428o9620l500L2598P870N4910
9492d444799n759m0161K8350p8064q7657M7951J39305J28356l2292l581L8455
9481d309896M0296m1108M0777J7309q9260j04177k8238Q836J98857N6331N1144
9470d159129O892L2737p4110n5730K9160j22968p3780M5239M9772J1139O4920
$$ plain form
9459 -4245858 -4298785 -4389080 -4405185 -4470869 -4351472 -4274011 -4277662 -4285111 -4241297 -4189901 -4177055 -4086254
9447 -4086254 -4122664 -4293259 -4328197 -4175175 -4071154 -4113943 -4265731 -4327177 -4380990 -4494437
9437 -4494437 -4345383 -4292517 -4300935 -4312252 -4270479 -4330024 -4371742 -4390308 -4368388 -4305003 -4247911
9426 -4247911 -4231185 -4208651 -4132041 -4103412 -4104150 -4132421 -4123925 -4100148 -4148707 -4178309 -4146756 -4117796
9414 -4117796 -4161251 -4296920 -4256516 -4217750 -4259575 -4198270 -4131555 -4130240 -4275854 -4269140 -4226831
9403 -4226831 -4234166 -4200902 -4068746 -3982110 -4056063 -4093041 -4064458 -4165764 -4204982 -4200269 -4172677
9392 -4172677 -4071553 -4028140 -4111472 -4128476 -4140218 -4087224 -3998570 -4035355 -4032667 -3975494 -3992937
9381 -3992937 -4030352 -4001970 -4071106 -4065922 -3967148 -4076066 -4134886 -4184444 -4241138 -4272378 -4190238
$$ packed form
9459d245858n2927r0295j6105o5684J19397P7461l651p449M3814N1396J2846R0801
9447d086254l6410j70595l4938J53022J04021m2789j51788o1446n3813j13447
9437d494437J49054N2866q418j1317M1773n9545m1718j8566K1920O3385N7092
9426d247911J6726K2534P6610K8629p38k8271Q496K3777m8559k9602L1553K8960
9414d117796m3455j35669M0404L8766m1825O1305O6715J315j45614O714M2309
9403d226831p335L3264J32156Q6636p3953l6978K8583j01306l9218M713K7592
9392d172677J01124M3413q3332j7004j1742N2994Q8654l6785K688N7173j7443
9381c992937l7415K8382o9136N184R8774j08918n8820m9558n6694l1240Q2140
$$ plain form
9370 -4190238 -4124687 -4091617 -4070616 -4027010 -4091618 -4108785 -4022493 -3951438 -3977098 -4061802 -4122361
9359 -4122361 -4267969 -4157740 -3987558 -4066919 -4133704 -4165186 -4035160 -3983556 -3883122 -3848856
9349 -3848856 -3788252 -3871390 -4043999 -4139031 -4110856 -4135435 -4092196 -4070465 -4099885 -4113013 -4062285
9338 -4062285 -3949237 -3889469 -3971388 -3893911 -3817785 -3895928 -3934926 -3896726 -3890438 -3881710 -3951894 -4074827
9326 -4074827 -4148409 -4130535 -4099875 -4140826 -4161926 -4114021 -4164006 -4065165 -3978095 -3976210 -3951977 -3910038
9314 -3910038 -3854417 -3898932 -3919762 -3967055 -4034980 -4221818 -4205887 -4118303 -3991848 -3948868 -4032363
9303 -4032363 -4042358 -4105412 -4044010 -3875284 -3691433 -3709511 -3773996 -3799112 -3801588 -3756854 -3677961
9292 -3677961 -3767314 -3886131 -3930932 -4055041 -4120184 -3982146 -3913088 -3832545 -3893159 -3917960 -3866274
$$ packed form
9370d190238O5551L3070K1001M3606o4608j7167Q6292P1055k5660q4704o0559
9359d122361j45608J10229J70182p9361o6785l1482J30026N1604J00434L4266
9349c848856O0604q3138j72609r5032K8175k4579M3239K1731k9420j3128N0728
9338d062285J13048N9768q1919P7477P6126p8143l8998L8200O288Q728p0184j22933
9326d074827p3582J7874L0660m0951k1100M7905m9985R8841Q7070J885K4233M1939
9314c910038N5621m4515k0830m7293o7925j86838J5931Q7584J26455M2980q3495
9303d032363r995o3054O1402J68726J83851j8078o4485k5116k476M4734P8893
9292c677961q9353j18817m4801j24109o5143J38038O9058Q0543o0614k4801N1686
$$ plain form
9281 -3866274 -3876735 -3888818 -4020479 -4038913 -4014785 -4046311 -4029472 -4025079 -4099691 -3981343 -3716349
9270 -3716349 -3688267 -3793655 -3929092 -3964533 -4013921 -4026512 -3965400 -3930202 -3911253 -3870383 -3915950
9259 -3915950 -3776505 -3704780 -3741074 -3707243 -3728992 -3750440 -3831329 -3892768 -3868267 -3773740 -3798012
9248 -3798012 -3793106 -3821691 -3819251 -3703541 -3727178 -3802555 -3825066 -3852315 -3837198 -3820105 -3778110 -3769165
9236 -3769165 -3876801 -3875298 -3876654 -3919906 -3796648 -3695529 -3747739 -3778462 -3768444 -3837958 -3906892
9225 -3906892 -3844879 -3853516 -3764351 -3767762 -3733117 -3697186 -3620062 -3531448 -3622073 -3653821 -3652563 -3641881
9213 -3641881 -3589361 -3632179 -3612304 -3519605 -3588679 -3586016 -3636151 -3583102 -3491912 -3595567 -3641339
9202 -3641339 -3726184 -3838536 -3725822 -3690845 -3635560 -3584872 -3624441 -3626951 -3667613 -3617675 -3607149
$$ packed form
9281c866274j0461j2083j31661j8434K4128l1526J6839M393p4612J18348K64994
9270c716349K8082j05388j35437l5441m9388j2591O1112L5198J8949M0870m5567
9259c915950J39445P1725l6294L3831k1749k1448q0889o1439K4501R4527k4272
9248c798012M906k8585K440J15710k3637p5377k2511k7249J5117J7093M1995Q945
9236c769165j07636J503j356m3252J23258J01119n2210l0723J0018o9514o8934
9225c906892O2013q637Q9165l411L4645L5931P7124Q8614r0625l1748J258J0682
9213c641881N2520m2818J9875R2699o9074K663n0135N3049R1190j03655m5772
9202c641339q4845j12352J12714L4977N5285N0688l9569k510m0662M9938J0526
$$ plain form
9191 -3607149 -3536619 -3567661 -3596043 -3604627 -3720589 -3866366 -3873270 -3811990 -3808552 -3813927 -3830242 -3898619
9179 -3898619 -3825858 -3739008 -3667202 -3676363 -3609917 -3581714 -3585504 -3539662 -3637249 -3602156 -3509918 -3488480
9167 -3488480 -3465690 -3601069 -3526830 -3480637 -3459771 -3530545 -3679421 -3769336 -3722021 -3628821 -3564143
9156 -3564143 -3511921 -3546957 -3562198 -3642775 -3677554 -3605794 -3600259 -3627440 -3446691 -3439432 -3575690
9145 -3575690 -3519503 -3524807 -3596245 -3573053 -3587071 -3585771 -3698618 -3664228 -3636544 -3612862 -3512039
9134 -3512039 -3432161 -3483613 -3586322 -3637619 -3577232 -3524472 -3603268 -3581611 -3504718 -3377717 -3313403
9123 -3313403 -3328157 -3326930 -3416800 -3546839 -3570597 -3464254 -3532429 -3499395 -3505832 -3501770 -3483934 -3609579
9111 -3609579 -3725276 -3788715 -3839232 -3762238 -3668356 -3618226 -3578627 -3512229 -3455254 -3418195 -3450124
$$ packed form
9191c607149P0530l1042k8382q584j15962j45777o904O1280L438n375j6315o8377
9179c898619P2761Q6850P1806r161O6446K8203l790M5842r7587L5093R2238K1438
9167c488480K2790j35379P4239M6193K0866p0774j48876q9915M7315R3200O4678
9156c564143N2222l5036j5241q0577l4779P1760N535k7181J80749P259j36258
9145c575690N6187n304p1438K3192j4018J300j12847L4390K7684K3682J00823
9134c512039P9878n1452j02709n1297O0387N2760p8796K1657P6893J27001O4314
9123c313403j4754J227q9870j30039k3758J06343o8175L3034o437M062J7836j25645
9111c609579j15697o3439n0517P6994R3882N0130L9599O6398N6975L7059l1929
$$ plain form
9100 -3450124 -3620153 -3597016 -3417451 -3465870 -3466449 -3467786 -3483422 -3467392 -3499891 -3607125 -3561945
9089 -3561945 -3564706 -3585557 -3570558 -3549496 -3584407 -3531814 -3373639 -3345380 -3450903 -3417525 -3277976
9078 -3277976 -3337782 -3462860 -3507517 -3523793 -3524101 -3539181 -3419388 -3382407 -3533603 -3603223 -3576675
9067 -3576675 -3558253 -3631558 -3636949 -3559541 -3444141 -3419499 -3377954 -3254847 -3261721 -3399470 -3515264
9056 -3515264 -3578957 -3519480 -3426676 -3401233 -3426453 -3372976 -3230602 -3193216 -3307738 -3381230 -3385470
9045 -3385470 -3358359 -3393280 -3373485 -3477247 -3472088 -3519645 -3575710 -3515243 -3433342 -3347027 -3329871
9034 -3329871 -3370316 -3300244 -3395792 -3436664 -3335924 -3278128 -3230019 -3298261 -3304706 -3432297 -3552551
9023 -3552551 -3584814 -3503659 -3518735 -3554828 -3530512 -3407904 -3260329 -3213837 -3290578 -3329640 -3232857
$$ packed form
9100c450124j70029K3137J79565m8419n79j337j5636J6030l2499j07234M5180
9089c561945k761k0851J4999K1062l4911N2593J58175K8259j05523L3378J39549
9078c277976n9806j25078m4657j6276l08j5080J19793L6981j51196o9620K6548
9067c576675J8422p3305n391P7408J15400K4642M1545J23107o874j37749j15794
9056c515264o3693N9477R2804K5443k5220N3477J42374L7386j14522p3492m240
9045c385470K7111l4921J9795j03762N159m7557n6065O0467Q1901Q6315J7156
9034c329871m0445P0072r5548m0872J00740N7796M8109o8242o445j27591j20254
9023c552551l2263Q1155j5076l6093K4316J22608J47575M6492p6741l9062R6783
$$ plain form
9012 -3232857 -3300137 -3442122 -3484544 -3580078 -3601457 -3506438 -3454309 -3370107 -3332354 -3401567 -3489433
9001 -3489433 -3466051 -3480141 -3501968 -3409115 -3353991 -3402089 -3515568 -3566524 -3477145 -3357359 -3443975
8990 -3443975 -3560179 -3612370 -3541709 -3490292 -3463760 -3388215 -3425335 -3432799 -3393568 -3311468 -3328733
8979 -3328733 -3367482 -3287543 -3258057 -3245002 -3368532 -3378133 -3393511 -3329029 -3190789 -3201375 -3268584
8968 -3268584 -3225002 -3242224 -3291203 -3306542 -3223677 -3252741 -3241045 -3234372 -3313059 -3333293 -3307525 -3267352
8956 -3267352 -3242713 -3216382 -3167834 -3179226 -3235509 -3319474 -3367740 -3365951 -3314412 -3278648 -3244207 -3171505
8944 -3171505 -3158234 -3145791 -3133485 -3103192 -3282268 -3479931 -3513943 -3572446 -3449683 -3286318 -3318438
8933 -3318438 -3385506 -3366997 -3283695 -3229014 -3185227 -3150557 -3190455 -3134729 -3034523 -3038384 -3164237
$$ packed form
9012c232857o7280j41985m2422r5534k1379R5019N2129Q4202L7753o9213q7866
9001c489433K3382j4090k1827R2853N5124m8098j13479n0956Q9379J19786q6616
8990c443975j16204n2191P0661N1417K6532P5545l7120p464L9231Q2100j7265
8979c328733l8749P9939K9486J3055j23530r601j5378O4482J38240j0586o7209
8968c268584M3582j7222m8979j5339Q2865k9064J1696O673p8687k0234K5768M0173
8956c267352K4639K6331M8548j1392n6283q3965m8266J789N1539L5764L4441P2702
8944c171505J3271J2443J2306L0293j79076j97663l4012n8503J22763J63365l2120
8933c318438o7068J8509Q3302N4681M3787L4670l9898N5726J00206l861j25853
$$ plain form
8922 -3164237 -3141902 -3157038 -3268381 -3123715 -3035225 -3047087 -3092302 -3104672 -3049863 -3178712 -3253198
8911 -3253198 -3282011 -3297024 -3270765 -3203753 -3284733 -3239390 -3119041 -3075786 -3109798 -3120276 -3114113
8900 -3114113 -3121431 -3157112 -3183860 -3113488 -3143949 -3153850 -3170451 -3146224 -3284119 -3240840 -3191908 -3219619
8888 -3219619 -3264204 -3176985 -3172990 -3172843 -3182504 -3163968 -3162886 -3247772 -3221671 -3232866 -3138235 -3324015
8876 -3324015 -3418861 -3314541 -3189705 -3179138 -3165869 -3132909 -3008008 -2846027 -2863890 -2986075
8866 -2986075 -3049393 -3129590 -3196219 -3250506 -3316429 -3274168 -3283249 -3250209 -3126738 -3149978 -3183995
8855 -3183995 -3087315 -3090871 -3142410 -3188901 -3122352 -2984061 -2939124 -3053925 -3078116 -3138163 -3105113
8844 -3105113 -3072644 -3001491 -2968724 -2995168 -3118912 -3170206 -3168978 -3160896 -3131631 -3147347 -3225367 -3358629
$$ packed form
8922c164237K2335j5136j11343J44666Q8490j1862m5215j2370N4809j28849p4486
8911c253198k8813j5013K6259O7012q0980M5343J20349M3255l4012j0478O163
8900c114113p318l5681k6748P0372l0461r901j6601K4227j37895M3279M8932k7711
8888c219619m4585Q7219L995J47r661J8536J082q4886K6101j1195R4631j85780
8876c324015r4846J04320J24836J0567J3269L2960J24901J61981j7863j22185
8866b986075o3318q0197o6629n4287o5923M2261r081L3040J23471k3240l4017
8855c183995R6680l556n1539m6491O6549J38291M4937j14801k4191o0047L3050
8844c105113L2469P1153L2767k6444j23744n1294J228Q082K9265j5716p8020j33262
$$ plain form
8832 -3358629 -3311901 -3245806 -3190352 -3163701 -3113837 -3153358 -3203299 -3306494 -3334969 -3205729 -3098147
8821 -3098147 -3041719 -2994242 -2960310 -2948460 -3023857 -3010782 -3020272 -2976443 -3009122 -3078015 -2924377
8810 -2924377 -2947987 -3021133 -3114048 -3185587 -3250017 -3197212 -3193527 -3260764 -3258187 -3143494 -3060807 -2974143
8798 -2974143 -2973728 -2927242 -2956064 -3083852 -3236402 -3267483 -3296302 -3197855 -3153410 -3136252 -3158226
8787 -3158226 -3018178 -2897682 -2960297 -2937532 -2913136 -3026826 -3050654 -3074536 -3102360 -3019992 -3086617
8776 -3086617 -3296416 -3267715 -3230299 -3220567 -3246286 -3279331 -3275112 -3189640 -3098657 -3058642 -3052921 -3102423
8764 -3102423 -3132576 -3122175 -2987906 -2988071 -3039302 -3114725 -3155646 -3084304 -3092859 -3031052 -3037374 -3069819
8752 -3069819 -3096612 -3113298 -3014382 -2894474 -2919215 -3022051 -3054613 -2981844 -2950949 -2797918 -2775102
$$ packed form
8832c358629M6728O6095N5454K6651M9864l9521m9941j03195k8475J29240J07582
8821c098147N6428M7477L3932J1850p5397J3075r490M3829l2679o8893J53638
8810b924377k3610p3146r2915p1539o4430N2805L685o7237K577J14693Q2687Q6664
8798b974143M15M6486k8822j27788j52550l1081k8819R8447M4445J7158k1974
8787c158226J40048J20496o2615K2765K4396j13690k3828k3882k7824Q2368o6625
8776c086617k09799K8701L7416R732k5719l3045M219Q5472R0983M0015N721m9502
8764c102423l0153J0401J34269j65n1231p5423m0921P1342q555O1807o322l2445
8752c069819k6793j6686R8916J19908k4741j02836l2562P2769L0895J53031K2816
$$ plain form
8741 -2775102 -2822644 -2859953 -2891761 -3008325 -3140675 -3099618 -2988700 -3015204 -3074372 -3109066 -2933645
8730 -2933645 -2855795 -2935976 -2959905 -2984446 -3155960 -3260691 -3245904 -3242584 -3101807 -3032128 -3035186
8719 -3035186 -2955853 -3040974 -3052127 -3037809 -2992431 -3000972 -3059908 -2989930 -2945682 -2963119 -3040667 -2995009
8707 -2995009 -2961395 -2981754 -2893640 -2870887 -2897492 -2985436 -2959685 -2951050 -2956365 -2983770 -2888115 -2924065
8695 -2924065 -2905338 -2879330 -2846103 -2873002 -2889801 -2874162 -2835517 -2780368 -2946550 -2908020 -2818878
8684 -2818878 -2799191 -2915679 -2966938 -2923463 -2960354 -2972825 -3047842 -2995316 -3010792 -2946674 -2935547
8673 -2935547 -2873996 -2917253 -2907483 -2934700 -2849510 -2833511 -2685542 -2701795 -2850354 -2992119 -2931110
8662 -2931110 -2873860 -2891027 -2747140 -2731851 -2836631 -2979320 -2935404 -2891252 -2844769 -2853879 -2919073
$$ packed form
8741b775102m7542l7309l1808j16564j32350M1057J10918k6504n9168l4694J75421
8730b933645P7850q0181k3929k4541j71514j04731J4787L320J40777O9679l058
8719c035186P9333q5121j1153J4318M5378q541n8936O9978M4248j7437p7548M5658
8707b995009L3614k0359Q8114K2753k6605q7944K5751Q635n315k7405R5655l5950
8695b924065J8727K6008L3227k6899j6799J5639L8645N5149j66182L8530Q9142
8684b818878J9687j16488n1259M3475l6891j2471p5017N2526j5476O4118J1127
8673b935547O1551m3257R770k7217Q5190J5999J47969j6253j48559j41765O1009
8662b931110N7250j7167J43887J5289j04780j42689M3916M4152M6483r110o5194
$$ plain form
8651 -2919073 -2952397 -2912655 -2814387 -2746957 -2785427 -2867274 -2802497 -2712340 -2696168 -2791281 -2945217
8640 -2945217 -2871585 -2810659 -2827867 -2815364 -2786202 -2798471 -2778878 -2765154 -2854006 -2880090 -2761727
8629 -2761727 -2732001 -2804718 -2854657 -2869129 -2901180 -2858160 -2722025 -2796443 -2872193 -2859568 -2852574
8618 -2852574 -2865879 -2715634 -2557976 -2569214 -2706501 -2766067 -2755591 -2802445 -2792563 -2722670 -2746174
8607 -2746174 -2765244 -2789647 -2773181 -2791427 -2785153 -2841306 -2895501 -2945310 -2994661 -3002398 -3066974 -2983138
8595 -2983138 -2946418 -2824786 -2829460 -2814094 -2756970 -2867915 -2939493 -2910012 -2944896 -2970306 -2919420
8584 -2919420 -2901883 -2886997 -2825082 -2915122 -2996495 -3032892 -2935680 -2849195 -2825494 -2914904 -2938990
8573 -2938990 -2894081 -2722143 -2751161 -2834646 -2855372 -2789688 -2857708 -3005871 -2899111 -2759082 -2731992
$$ packed form
8651b919073l3324L9742R8268O7430l8470q1847O4777R0157J6172r5113j53936
8640b945217P3632O0926j7208J2503K9162j2269J9593J3724q8852k6084J18363
8629b761727K9726p2717m9939j4472l2051M3020J36135p4418p5750J2625O994
8618b852574j3305J50245J57658j1238j37287n9566J0476m6854R882O9893k3504
8607b746174j9070k4403J6466j8246O274n6153n4195m9809m9351p737o4576Q3836
8595b983138L6720J21632m674J5366N7124j10945p1578K9481l4884k5410N0886
8584b919420J7537J4886O1915r0040q1373l6397R7212Q6485K3701q9410k4086
8573b938990M4909J71938k9018q3485k0726O5684o8020j48163J06760J40029K7090
$$ plain form
8562 -2731992 -2742965 -2645645 -2673005 -2627059 -2544780 -2589562 -2657048 -2810277 -2855368 -2833009 -2736620
8551 -2736620 -2777944 -2782416 -2840098 -2833925 -2745893 -2728619 -2805432 -2776662 -2609786 -2594303 -2738033
8540 -2738033 -2851193 -2759048 -2689038 -2810928 -2774869 -2667671 -2685794 -2775782 -2675297 -2744202 -2786167
8529 -2786167 -2732334 -2722301 -2837770 -2760260 -2731238 -2760388 -2766326 -2756212 -2704909 -2753571 -2897148
8518 -2897148 -2990165 -2956025 -2913001 -2875805 -2869919 -2802445 -2701213 -2743587 -2769166 -2800377 -2738486
8507 -2738486 -2746287 -2792200 -2814959 -2875727 -2926015 -2817170 -2643425 -2748424 -2715811 -2556404 -2542331
8496 -2542331 -2546022 -2542411 -2602481 -2664294 -2690826 -2730065 -2641568 -2547149 -2504125 -2474025 -2511512 -2608226
8484 -2608226 -2630202 -2689292 -2780844 -2804944 -2842366 -2826313 -2736556 -2685406 -2670235 -2665831 -2713272 -2712255
$$ packed form
8562b731992j0973R7320k7360M5946Q2279m4782o7486j53229m5091K2359R6389
8551b736620m1324m472n7682O173Q8032J7274p6813K8770J66876J5483j43730
8540b738033j13160R2145P0010j21890L6059J07198j8123q9988J00485o8905m1965
8529b786167N3833J0033j15469P7510K9022k9150n938J0114N1303m8662j43577
8518b897148r3017L4140M3024L7196N886O7474J01232m2374k5579l1211O1891
8507b738486p801m5913k2759o0768n0288J08845J73745j04999L2613J59407J4073
8496b542331l691L611o0070o1813k6532l9239Q8497R4419M3024L0100l7487r6714
8484b608226k1976n9090r1552k4100l7422J6053Q9757N1150J5171M404m7441J017
$$ plain form
8472 -2712255 -2766601 -2749692 -2680018 -2584753 -2580950 -2583099 -2472211 -2432789 -2448013 -2517190 -2563526 -2612948
8460 -2612948 -2697897 -2598584 -2629251 -2696575 -2572885 -2508046 -2568760 -2735783 -2745833 -2753136 -2601093
8449 -2601093 -2438772 -2432489 -2490824 -2483604 -2649359 -2672356 -2547225 -2546045 -2464967 -2540564 -2680385
8438 -2680385 -2682430 -2714412 -2816618 -2951698 -2976266 -2912264 -2968575 -2982132 -2889623 -2833569 -2760405
8427 -2760405 -2669155 -2646698 -2510338 -2509253 -2583219 -2605929 -2673535 -2696344 -2791188 -2865160 -2811657
8416 -2811657 -2792242 -2922313 -2936432 -2909496 -2934214 -2976611 -2982309 -2974898 -2881334 -2778034 -2736423
8405 -2736423 -2701449 -2690535 -2747442 -2890143 -2922540 -2900953 -2828207 -2810806 -2823854 -2759491 -2692974
8394 -2692974 -2699730 -2769316 -2751207 -2713321 -2707794 -2730562 -2719251 -2673211 -2723677 -2777893 -2701582 -2740226
$$ packed form
8472b712255n4346J6909O9674R5265L803k149J10888L9422j5224o9177m6336m9422
8460b612948q4949R9313l0667o7324J23690O4839o0714j67023j0050p303J52043
8449b601093J62321O283n8335P220j65755k2997J25131J180Q1078p5597j39821
8438b680385k045l1982j02206j35080k4568O4002n6311j3557R2509N6054P3164
8427b760405R1250K2457J36360J085p3966k2710o7606k2809r4844p3972N3503
8416b811657J9415j30071j4119K6936k4718m2397n698P411R3564J03300M1611
8405b736423L4974J0914n6907j42701l2397K1587P2746J7401j3048O4363O6517
8394b692974o756o9586J8109L7886N527k2768J1311M6040n0466n4216P6311l8644
$$ plain form
8382 -2740226 -2694968 -2668869 -2655171 -2699372 -2727631 -2695666 -2616599 -2595973 -2623223 -2621394 -2707036 -2668228
8370 -2668228 -2619647 -2709506 -2664681 -2723373 -2680468 -2655744 -2552714 -2636659 -2676509 -2650763 -2717294
8359 -2717294 -2783023 -2633572 -2622927 -2599595 -2572289 -2542405 -2483345 -2537518 -2679503 -2668507 -2615564
8348 -2615564 -2529968 -2608497 -2581998 -2669948 -2819439 -2803877 -2639728 -2712775 -2747155 -2752433 -2629580
8337 -2629580 -2598780 -2593656 -2519396 -2569830 -2580273 -2656831 -2746057 -2735256 -2588016 -2482283 -2528492
8326 -2528492 -2640253 -2681112 -2676134 -2658417 -2682591 -2633133 -2621439 -2682309 -2714456 -2651575 -2649262 -2692529
8314 -2692529 -2712411 -2775750 -2709295 -2594541 -2546019 -2595797 -2679285 -2619602 -2657768 -2748596 -2729227
8303 -2729227 -2763358 -2771633 -2592606 -2511758 -2468989 -2351111 -2458582 -2574595 -2499788 -2467821 -2537021
$$ packed form
8382b740226M5258K6099J3698m4201k8259L1965P9067K0626k7250J829q5642L8808
8370b668228M8581q9859M4825n8692M2905K4724J03030q3945l9850K5746o6531
8359b717294o5729J49451J0645K3332K7306K9884N9060n4173j41985J0996N2943
8348b615564Q5596p8529K6499q7950j49491J5562J64149p3047l4380n278J22853
8337b629580L0800N124P4260n0434j0443p6558q9226J0801J47240J05733m6209
8326b528492j11761m0859M978J7717k4174M9458J1694o0870l2147O2881K313m3267
8314b692529j9882o3339O6455J14754M8522m9778q3488N9683l8166r0828J9369
8303b729227l4131q275J79027Q0848M2769J17878j07471j16013P4807L1967o9200
$$ plain form
8292 -2537021 -2580608 -2606090 -2684502 -2750945 -2700470 -2644283 -2606803 -2574899 -2634433 -2666893 -2682734
8281 -2682734 -2665054 -2573243 -2489503 -2416336 -2452499 -2437063 -2395266 -2456455 -2598047 -2629077 -2579898
8270 -2579898 -2481544 -2519242 -2474922 -2392421 -2387044 -2476644 -2513868 -2518832 -2490919 -2503242 -2594996 -2577281
8258 -2577281 -2520001 -2427308 -2403521 -2581775 -2582344 -2591993 -2572514 -2496654 -2449600 -2480506 -2369872 -2465816
8246 -2465816 -2577511 -2564732 -2569649 -2573791 -2623295 -2634280 -2508903 -2434599 -2438434 -2477916 -2573718 -2570635
8234 -2570635 -2496927 -2489597 -2385288 -2366442 -2381147 -2405573 -2359978 -2367105 -2423935 -2451950 -2464661 -2499137
8222 -2499137 -2449605 -2381136 -2372911 -2468314 -2509759 -2555155 -2423839 -2460122 -2532146 -2607605 -2533969
8211 -2533969 -2511543 -2393019 -2383062 -2353147 -2422974 -2519647 -2502453 -2489800 -2491915 -2514317 -2453030 -2431805
$$ packed form
8292b537021m3587k5482p8412o6443N0475N6187L7480L1904n9534l2460j5841
8281b682734J7680R1811Q3740P3167l6163J5436M1797o1189j41592l1030M9179
8270b579898R8354l7698M4320Q2501N377q9600l7224m964K7913j2323r1754J7715
8258b577281N7280R2693K3787j78254n69r649J9479P5860M7054l0906J10634r5944
8246b465816j11695J2779m917m142m9504j0985J25377P4304l835l9482r5802L083
8234b570635P3708P330J04309J8846j4705k4426M5595p127n6830k8015j2711l4476
8222b499137M9532O8469Q225r5403m1445m5396J31316l6283p2024p5459P3636
8211b533969K2426J18524R957K9915o9827r6673J7194J2653k115k2402O1287K1225
$$ plain form
8199 -2431805 -2452784 -2467323 -2524889 -2616189 -2648383 -2516943 -2405662 -2397863 -2426499 -2476530 -2543330
8188 -2543330 -2618248 -2539530 -2508880 -2653544 -2677339 -2566077 -2471584 -2345986 -2310664 -2389864 -2520400
8177 -2520400 -2522319 -2535080 -2489444 -2396644 -2395141 -2421104 -2440124 -2470619 -2511564 -2622389 -2550213 -2374009
8165 -2374009 -2353329 -2465144 -2510134 -2375210 -2364222 -2417461 -2308213 -2434109 -2575760 -2522734
8155 -2522734 -2408236 -2445752 -2487610 -2378482 -2258980 -2210802 -2251028 -2305235 -2326832 -2421605 -2542373
8144 -2542373 -2494905 -2454333 -2405605 -2444678 -2530351 -2441031 -2464704 -2502903 -2412556 -2333415 -2317689
8133 -2317689 -2370817 -2302739 -2419350 -2532119 -2632817 -2585178 -2337525 -2274929 -2334540 -2404517 -2419855
8122 -2419855 -2385764 -2316121 -2226145 -2173214 -2290653 -2419158 -2456656 -2387445 -2417363 -2380373 -2343712
$$ packed form
8199b431805k0979j4539n7566r1300l2194J31440J11281P799k8636n0031o6800
8188b543330p4918P8718L0650j44664k3795J11262R4493J25598L5322p9200j30536
8177b520400j919j2761M5636R2800J503k5963j9020l0495m0945j10825P2176J76204
8165b374009K0680j11815m4990J34924J0988n3239J09248j25896j41651N3026
8155b522734J14498l7516m1858J09128J19502M8178m0226n4207k1597r4773j20768
8144b542373M7468M0572M8728l9073q5673Q9320k3673l8199R0347P9141J5726
8133b317689n3128O8078j16611j12769j00698M7639K47653O2596n9611o9977j5338
8122b419855L4091O9643Q9976N2931j17439j28505l7498O9211k9918L6990L6661
$$ plain form
8111 -2343712 -2411173 -2504052 -2509991 -2447079 -2504093 -2527992 -2544099 -2475217 -2392055 -2426728 -2460885 -2486137
8099 -2486137 -2496038 -2507660 -2522083 -2499908 -2402203 -2416713 -2405506 -2297667 -2288326 -2278500 -2320132 -2391198
8087 -2391198 -2380887 -2438060 -2523927 -2533907 -2483558 -2429163 -2365959 -2372277 -2406464 -2419429 -2428304 -2353870
8075 -2353870 -2310245 -2370386 -2469282 -2364270 -2353571 -2413238 -2409909 -2310564 -2290096 -2232093 -2155432
8064 -2155432 -2174917 -2226799 -2250576 -2189149 -2249504 -2264960 -2257181 -2239855 -2204358 -2217385 -2156346 -2163141
8052 -2163141 -2182504 -2217124 -2280901 -2410644 -2381316 -2437347 -2309170 -2353302 -2418479 -2372264 -2366511
8041 -2366511 -2335939 -2410959 -2555522 -2467711 -2356559 -2436066 -2368662 -2379980 -2375440 -2320838 -2269704
8030 -2269704 -2296991 -2412826 -2489931 -2433553 -2436799 -2445778 -2407508 -2388918 -2325855 -2320740 -2384995 -2400276
$$ packed form
8111b343712o7461r2879n939O2912n7014k3899j6107O8882Q3162l4673l4157k5252
8099b486137r901j1622j4423K2175R7705j4510J1207J07839R341R826m1632p1066
8087b391198J0311n7173q5867r980N0349N4395O3204o318l4187j2965q875P4434
8075b353870M3625o0141r8896J05012J0699n9667L329R9345K0468N8003P6661
8064b155432j9485n1882k3777O1427o0355j5456P779J7326L5497j3027O1039o795
8052b163141j9363l4620o3777j29743K9328n6031J28177m4132o5177M6215N753
8041b366511L0572p5020j44563Q7811J11152p9507O7404j1318M540N4602N1134
8030b269704k7287j15835p7105N6378l246q979L8270J8590O3063N115o4255j5281
$$ plain form
8018 -2400276 -2351672 -2277405 -2289496 -2337909 -2384758 -2430994 -2529841 -2567936 -2543430 -2496382 -2458841
8007 -2458841 -2384591 -2353217 -2359676 -2393477 -2364930 -2339387 -2265983 -2342778 -2322900 -2231598 -2253713 -2213748
7995 -2213748 -2066204 -2100724 -2258182 -2295472 -2220100 -2267895 -2280041 -2263261 -2251618 -2232784 -2245354
7984 -2245354 -2298769 -2399040 -2374127 -2367646 -2319489 -2285086 -2302569 -2335821 -2373296 -2438711 -2477873
7973 -2477873 -2487844 -2423495 -2340291 -2306442 -2377604 -2488525 -2515483 -2361152 -2272546 -2254772 -2279366
7962 -2279366 -2338101 -2414920 -2339722 -2342872 -2316147 -2267614 -2349681 -2389732 -2342609 -2291116 -2366217 -2444236
7950 -2444236 -2370041 -2313620 -2272583 -2349189 -2286590 -2232146 -2229695 -2257967 -2274535 -2382251 -2407654
7939 -2407654 -2361445 -2225489 -2290319 -2353851 -2396010 -2339170 -2339256 -2267714 -2188400 -2234797 -2242562 -2324270
$$ packed form
8018b400276M8604P4267j2091m8413m6849m6236r8847l8095K4506M7048L7541
8007b458841P4250L1374o459l3801K8547K5543P3404p6795J9878R1302k2115L9965
7995b213748J47544l4520j57458l7290P5372m7795j2146J6780J1643J8834j2570
7984b245354n3415j00271K4913O481M8157L4403j7483l3252l7475o5415l9162
7973b477873r971O4349Q3204L3849p1162j10921k6958J54331Q8606J7774k4594
7962b279366n8735p6819P5198l150K6725M8533q2067m0051M7123N1493p5101p8019
7950b444236P4195N6421M1037p6606O2599N4444K451k8272j6568j07716k5403
7939b407654M6209J35956o4830o3532m2159N6840q6P1542P9314m6397p765q1708
$$ plain form
7927 -2324270 -2412921 -2484092 -2417137 -2356768 -2278243 -2356288 -2434058 -2397833 -2346203 -2351148 -2242222
7916 -2242222 -2129802 -2088107 -2162206 -2260577 -2295731 -2158558 -2042297 -2163314 -2277379 -2292290
7906 -2292290 -2341646 -2388869 -2242350 -2064186 -2099862 -2123077 -2279361 -2308497 -2203009 -2168698 -2228114
7895 -2228114 -2251252 -2247453 -2275009 -2440641 -2486630 -2453462 -2440540 -2381802 -2381235 -2340104 -2290281 -2275649
7883 -2275649 -2274429 -2343314 -2386096 -2400681 -2406347 -2398349 -2449583 -2388150 -2352755 -2233240 -2147597 -2185881
7871 -2185881 -2110559 -2272207 -2289741 -2289855 -2391372 -2395979 -2287208 -2302029 -2328463 -2272209 -2241298
7860 -2241298 -2250563 -2349875 -2296183 -2254255 -2189320 -2089644 -2026549 -2044764 -2129396 -2153372 -2236591 -2277852
7848 -2277852 -2339754 -2401142 -2293561 -2207483 -2136083 -2104383 -2007447 -2030351 -2105931 -2155144 -2234799
$$ packed form
7927b324270q8651p1171O6955O0369P8525p8045p7770L6225N1630m945J08926
7916b242222J12420M1695p4099r8371l5154J37173J16261j21017j14065j4911
7906b292290m9356m7223J46519J78164l5676k3215j56284k9136J05488L4311n9416
7895b228114k3138L799k7556j65632m5989L3168J2922N8738N67M1131M9823J4632
7883b275649J220o8885m2782j4585n666P998n1234O1433L5395J19515Q5643l8284
7871b185881P5322j61648j7534j14j01517m607J08771j4821k6434N6254L0911
7860b241298r265r9312N3692M1928O4935R9676O3095j8215q4632k3976q3219m1261
7848b277852o1902o1388J07581Q6078P1400L1700R6936k2904p5580m9213p9655
$$ plain form
7837 -2234799 -2216143 -2154899 -2139045 -2186936 -2161406 -2246243 -2297306 -2295266 -2326106 -2350396 -2413524 -2496141
7825 -2496141 -2433208 -2367072 -2339294 -2302427 -2265049 -2276249 -2327051 -2271816 -2208759 -2177448 -2221003
7814 -2221003 -2284375 -2274738 -2183551 -2107378 -2197856 -2219461 -2192998 -2169935 -2106376 -2174183 -2297227
7803 -2297227 -2351684 -2282816 -2223741 -2108641 -2009315 -2031491 -2048226 -2232614 -2384098 -2305457 -2155425
7792 -2155425 -2119814 -2249266 -2275768 -2069980 -1943195 -2011262 -2081216 -2160889 -2186980 -2279217 -2243824
7781 -2243824 -2155235 -2307043 -2428898 -2373084 -2318376 -2379728 -2274568 -2029112 -2003819 -2148080
7771 -2148080 -2266715 -2252565 -2284172 -2273805 -2306759 -2242569 -2260799 -2244933 -2233193 -2182764 -2203264
7760 -2203264 -2286188 -2229531 -2211446 -2143389 -2057397 -2059231 -2099932 -2058446 -2032005 -2032812 -2146153 -2161580
$$ packed form
7837b234799J8656O1244J5854m7891K5530q4837n1063K040l0840k4290o3128q2617
7825b496141O2933O6136K7778L6867L7378j1200n0802N5235O3057L1311m3555
7814b221003o3372R637R1187P6173r0478k1605K6463K3063O3559o7807j23044
7803b297227n4457O8868N9075J15100R9326k2176j6735j84388j51484P8641J50032
7792b155425L5611j29452k6502K05788J26785o8067o9954p9673k6091r2237L5393
7781b243824Q8589j51808j21855N5814N4708o1352J05160K45456K5293j44261
7771b148080j18635J4150l1607J0367l2954O4190j8230J5866J1740N0429k0500
7760b203264q2924N6657J8085O8057Q5992j834m0701M1486K6441q07j13341j5427
$$ plain form
7748 -2161580 -2152088 -2099419 -2108839 -2126354 -2170577 -2277043 -2278793 -2204477 -2188097 -2211453 -2253470 -2336226
7736 -2336226 -2370071 -2353781 -2332442 -2211779 -2164322 -2206006 -2209942 -2077406 -2120886 -2112775 -2167995
7725 -2167995 -2167313 -2381344 -2409087 -2321454 -2300991 -2261056 -2179634 -2044859 -1943571 -2008060 -2047641
7714 -2047641 -2117745 -2295127 -2361793 -2279088 -2210080 -2198617 -2214692 -2204353 -2145276 -2088628 -2124439
7703 -2124439 -2164838 -2162695 -2161165 -2145828 -2333769 -2540500 -2448461 -2393565 -2223668 -2186788 -2238848
7692 -2238848 -2250904 -2190012 -2145744 -2159786 -2200327 -2270959 -2273111 -2135855 -2117654 -2232834 -2244956
7681 -2244956 -2292634 -2348089 -2375012 -2334806 -2241127 -2237670 -2206855 -2102339 -2113734 -2031901 -2018388
7670 -2018388 -2026795 -2150840 -2206449 -2216237 -2289193 -2291620 -2282188 -2239842 -2299138 -2275424 -2162161 -2170604
$$ packed form
7748b161580R492N2669r420j7515m4223j06466j750P4316J6380k3356m2017q2756
7736b336226l3845J6290K1339J20663M7457m1684l936J32536m3480Q111n5220
7725b167995O82k14031k7743Q7633K0463L9935Q1422J34775J01288o4489l9581
7714b047641p0104j77382o6666Q2705O9008J1463j6075J0339N9077N6648l5811
7703b124439m0399K143J530J5337j87941k06731R2039N4896J69897L6880n2060
7692b238848j2056O0892M4268j4042m0541p0632k152J37256J8201j15180j2122
7681b244956m7678n5455k6923M0206R3679L457L0815J04516j1395Q1833J3513
7670b018388q407j24045n5609r788p2956k427R432M2346n9296K3714J13263q443
$$ plain form
7658 -2170604 -2264551 -2251460 -2316569 -2213550 -2168787 -2057287 -2092894 -2159337 -2189293 -2157443 -2098840
7647 -2098840 -2206873 -2240145 -2216968 -2158354 -2179759 -2179347 -2142793 -2137413 -2066154 -2032561 -2034437 -2078241
7635 -2078241 -2132193 -2114901 -2137962 -2099309 -2110679 -2139984 -2171898 -2185626 -2245010 -2192498 -2219294
7624 -2219294 -2250034 -2243890 -2219449 -2176385 -2155444 -2169589 -2128931 -2172395 -2119706 -1985961 -1982666 -2073260
7612 -2073260 -2184885 -2122481 -1997621 -2023978 -2076073 -2180056 -2268505 -2258324 -2204522 -2090199 -2037615
7601 -2037615 -1925685 -2003012 -2073057 -2211833 -2233294 -2245259 -2236846 -2184182 -2065258 -1944436 -1911742
7590 -1911742 -1842939 -1974316 -2120856 -2203000 -2174462 -2141497 -2175334 -2128291 -2007674 -1948822 -2052775
7579 -2052775 -2082442 -2152329 -2172969 -2272443 -2307658 -2180130 -2076809 -2064715 -2163609 -2178012 -2148914
$$ packed form
7658b170604r3947J3091o5109J03019M4763J11500l5607o6443k9956L1850N8603
7647b098840j08033l3272K3177N8614k1405M12L6554N380P1259L3593j876m3804
7635b078241n3952J7292k3061L8653j1370k9305l1914j3728n9384N2512k6796
7624b219294l0740O144K4441M3064K0941j4145M0658m3464N2689J33745L295r0594
7612b073260j11625O2404J24860k6357n2095j03983q8449J0181N3802J14323N2584
7601b037615J11930p7327p0045j38776k1461j1965Q413N2664J18924J20822L2694
7590a911742O8803j31377j46540q2144K8538L2965l3837M7043J20617N8852j03953
7579b052775k9667o9887k0640r9474l5215J27528J03321J2094r8894j4403K9098
$$ plain form
7568 -2148914 -2042830 -1990426 -1885168 -1897333 -1897437 -1999702 -2047317 -2095864 -2038711 -2079776 -2155468
7557 -2155468 -2183340 -2150214 -2083282 -1971303 -1997601 -2090410 -2188369 -2212624 -2186805 -2161455 -2145688
7546 -2145688 -2154265 -2100539 -2062907 -2021140 -1978983 -2045292 -2208764 -2280968 -2222368 -2138601 -2030920
7535 -2030920 -1923503 -1885562 -1927323 -1956646 -1993958 -2086561 -2188461 -2137499 -1991391 -1838625 -2005523
7524 -2005523 -2070343 -2039927 -1999303 -1913709 -1880368 -1918336 -2038046 -2067557 -2024846 -2061102 -2088480
7513 -2088480 -2197612 -2105961 -2073773 -2114704 -2137147 -2201928 -2192463 -2261245 -2281195 -2286319 -2277208 -2334488
7501 -2334488 -2279964 -2282862 -2211885 -2065248 -1976828 -2040720 -2175363 -2286862 -2176518 -2086784 -2081701
7490 -2081701 -2048478 -2003076 -2076719 -2105268 -2145018 -2192576 -2193989 -2045601 -1980590 -2043844 -2041842 -2120836
$$ packed form
7568b148914J06084N2404J05258j2165j04j02265m7615m8547N7153m1065p5692
7557b155468k7872L3126O6932J11979k6298r2809r7959k4255K5819K5350J5767
7546b145688q577N3726L7632M1767M2157o6309j63472p2204N8600Q3767J07681
7535b030920J07417L7941m1761k9323l7312r2603j01900N0962J46108J52766j66898
7524b005523o4820L0416M0624Q5594L3341l7968j19710k9511M2711l6256k7378
7513b088480j09132R1651L2188m0931k2443o4781R465o8782j9950n124R111n7280
7501b334488N4524k898P0977J46637Q8420o3892j34643j11499J10344Q9734N083
7490b081701L3223M5402p3643k8549l9750m7558j413J48388O5011o3254K002p8994
$$ plain form
7478 -2120836 -2069584 -2078179 -2175258 -2130016 -2091413 -1995568 -1920102 -2017318 -2132336 -2119842 -2106382
7467 -2106382 -2062998 -2029663 -1984552 -1963130 -1913231 -1984414 -2045410 -2103480 -2157796 -2211912 -2152982
7456 -2152982 -2089140 -2107875 -2057498 -2084310 -2105693 -2013428 -1997194 -1929865 -1960490 -1986256 -1977355 -2024920
7444 -2024920 -2019482 -1947437 -1864212 -1970724 -2029401 -1959498 -1887611 -1925301 -2036837 -2098595 -2248563
7433 -2248563 -2186244 -2040398 -2063856 -2134939 -2105529 -2154416 -2067807 -1911760 -1867078 -1918595 -1971461
7422 -1971461 -2045227 -1967457 -1942529 -2023763 -2139173 -2140137 -2091953 -1978617 -1867559 -1921445 -1957452
7411 -1957452 -2004349 -2126149 -2301246 -2236656 -2221206 -2199754 -2213085 -2196395 -2178197 -2206444 -2102426
7400 -2102426 -2009580 -2020612 -1966156 -1868071 -1878707 -1980776 -2044125 -2109071 -2020123 -2037464 -2120911
$$ packed form
7478b120836N1252q595r7079M5242L8603R5845P5466r7216j15018J2494J3460
7467b106382M3384L3335M5111K1422M9899p1183o0996n8070n4316n4116N8930
7456b152982O3842j8735N0377k6812k1383R2265J6234O7329l0625k5766Q901m7565
7444b024920N438P2045Q3225j06512n8677O9903P1887l7690j11536o1758j49968
7433b248563O2319J45846k3458p1083K9410m8887Q6609J56047M4682n1517n2866
7422a971461p3766P7770K4928q1234j15410r64M8184J13336J11058n3886l6007
7411a957452m6897j21800j75097O4590J5450K1452j3331J6690J8198k8247J04018
7400b102426R2846j1032N4456R8085j0636j02069o3349o4946Q8948j7341q3447
$$ plain form
7389 -2120911 -2067608 -1995268 -2029422 -2012722 -1998432 -2033692 -2148225 -2009475 -2034658 -2105831 -2184866
7378 -2184866 -2105276 -2006575 -2004097 -2120130 -2100929 -2184452 -2149948 -2113035 -2277146 -2180209 -2045471
7367 -2045471 -1945477 -1948109 -2009670 -2132814 -2097727 -1908330 -1856322 -1990697 -1985184 -1892881 -1902010
7356 -1902010 -1995618 -2034069 -2074626 -2040839 -2078373 -1994470 -1915607 -1945559 -1968183 -2005917 -2055034
7345 -2055034 -2039090 -1982721 -1907743 -1891485 -1902768 -1964671 -2018280 -2024514 -1956459 -1909251 -1815744 -1901014
7333 -1901014 -1827668 -1919386 -2054118 -1992861 -1910335 -1893864 -1880659 -1816319 -1736228 -1695430 -1833257
7322 -1833257 -1941626 -1950435 -1817968 -1955701 -1994243 -1928288 -1934402 -2025158 -2038351 -2046544 -1999127
7311 -1999127 -1915106 -2003308 -2083919 -2057080 -2016664 -2039481 -2025819 -2077229 -2041354 -1967005 -1898208
$$ packed form
7389b120911N3303P2340l4154J6700J4290l5260j14533J38750k5183p1173p9035
7378b184866P9590R8701K478j16033J9201q3523L4504L6913j64111R6937J34738
7367b045471R9994k632o1561j23144L5087J89397N2008j34375N513R2303r129
7356a902010r3608l8451m0557L3787l7534Q3903P8863k9952k2624l7734m9117
7345b055034J5944N6369P4978J6258j1283o1903n3609o234O8055M7208R3507q5270
7333a901014P3346r1718j34732O1257Q2526J6471J3205O4340Q0091M0798j37827
7322a833257j08369q809J32467j37733l8542O5955o114r0756j3193q193M7417
7311a999127Q4021q8202q0611K6839M0416k2817J3662n1410L5875P4349O8797
$$ plain form
7300 -1898208 -2019550 -2077837 -2133231 -2161395 -2081544 -1923638 -1761127 -1733710 -1855326 -1833115 -1842362
7289 -1842362 -1937135 -1971709 -2055070 -2019936 -1937967 -1808813 -1878494 -1900385 -1837055 -1825163 -1858733
7278 -1858733 -1869602 -1862176 -1826948 -1832233 -1843133 -1822416 -1805533 -1861919 -1994635 -1873754 -1870491 -1933156
7266 -1933156 -2056505 -2101828 -2079795 -2063419 -1968525 -1856845 -1892417 -1911517 -1962481 -1923390 -1827035
7255 -1827035 -1801852 -1887486 -1917333 -1978060 -1934762 -1928084 -1973054 -2004485 -1935365 -1998030 -2021350 -1995367
7243 -1995367 -1961556 -2036936 -2156455 -2083472 -1927101 -1933698 -1913549 -1901803 -1880807 -1907808 -1930428
7232 -1930428 -1867475 -1738994 -1790695 -1795830 -1826570 -1799369 -1777395 -1881512 -1925520 -1870964 -1801568
7221 -1801568 -1861215 -2013741 -1973278 -2036757 -1975549 -1872064 -1807833 -1837355 -1837953 -1867333 -1915714
$$ packed form
7300a898208j21342n8287n5394k8164P9851J57906J62511K7417j21616K2211r247
7289a842362r4773l4574q3361L5134Q1969J29154o9681k1891O3330J1892l3570
7278a858733j0869P426L5228n285j0900K0717J6883n6386j32716J20881L263o2665
7266a933156j23349m5323K2033J6376R4894J11680l5572j9100n0964L9091R6355
7255a827035K5183q5634k9847o0727M3298O678m4970l1431O9120o2665k3320K5983
7243a995367L3811p5380j19519P2983J56371o597K0149J1746K0996k7001k2620
7232a930428O2953J28481n1701n135l0740K7201K1974j04117m4008N4556O9396
7221a801568n9647j52526M0463o3479O1208J03485O4231k9522n98k9380m8381
$$ plain form
7210 -1915714 -1977796 -1929395 -1972795 -2009328 -1941049 -1962845 -1972170 -1979528 -2061172 -2068536 -1986684 -1923595
7198 -1923595 -1979277 -1968245 -1948710 -1933202 -1902248 -1970590 -1947585 -1949631 -1904085 -1755296 -1783490
7187 -1783490 -1791738 -1874510 -2022131 -2006710 -2045181 -2012314 -1863791 -1864019 -1794675 -1758831 -1683435 -1654579
7175 -1654579 -1716127 -1720044 -1758091 -1694345 -1760693 -1860128 -2026906 -2011891 -2010414 -1931391 -1831832 -1845147
7163 -1845147 -1724907 -1755359 -1816810 -1904205 -1954937 -1930984 -1932689 -1987389 -1920747 -1807161 -1759220
7152 -1759220 -1790157 -1925756 -2053394 -2055615 -1950724 -1894235 -1968632 -2021361 -1940507 -1968752 -1965430
7141 -1965430 -1924497 -1846765 -1789152 -1790711 -1819272 -1850958 -1868579 -1898771 -1859385 -1932024 -2040451
7130 -2040451 -1994315 -1837417 -1769482 -1702408 -1714355 -1809442 -1834170 -1857502 -1991809 -1940927 -1873019
$$ packed form
7210a915714o2082M8401m3400l6533O8279k1796r325p358q1644p364Q1852O3089
7198a923595n5682J1032J9535J5508L0954o8342K3005k046M5546J48789k8194
7187a783490q248q2772j47621J5421l8471L2867J48523k28O9344L5844P5396K8856
7175a654579o1548l917l8047O3746o6348r9435j66778J5015J477P9023R9559j3315
7163a845147J20240l0452o1451q7395n0732K3953j705n4700O6642J13586M7941
7152a759220l0937j35599j27638k221J04891N6489p4397n2729Q0854k8245L322
7141a965430M0933P7732N7613j559k8561l1686j7621l0192L9386p2639j08427
7130b040451M6136J56898O7935O7074j1947r5087k4728k3332j34307N0882O7908
$$ plain form
7119 -1873019 -1878255 -1908822 -1946265 -1941001 -1953833 -2034567 -1941596 -1872668 -1886964 -2002628 -1973074 -1831659
7107 -1831659 -1805824 -1972729 -1991841 -1970881 -1880226 -1873697 -1856816 -1913249 -1919240 -1952492 -1854376 -1948818
7095 -1948818 -1921017 -1844905 -1775277 -1786516 -1957246 -2009084 -1996320 -1851495 -1850362 -1863571 -1866883
7084 -1866883 -1851333 -1829490 -1669679 -1684142 -1837327 -1936588 -1924650 -1813902 -1755137 -1732594 -1839256
7073 -1839256 -1947439 -1880621 -1756995 -1757287 -1834523 -1761253 -1781401 -1796911 -1715261 -1717049 -1876123
7062 -1876123 -2020699 -1961995 -1876211 -1844355 -1852581 -1936265 -1931548 -1886381 -1883059 -1822843 -1867284 -1944202
7050 -1944202 -1932029 -1849112 -1761585 -1769495 -1759207 -1731766 -1775113 -1762951 -1724537 -1730320 -1832331 -1849976
7038 -1849976 -1850681 -1856528 -1796392 -1811650 -1773656 -1885660 -2029877 -1946735 -1805411 -1671118 -1589445
$$ packed form
7119a873019n236l0567l7443N264j2832q0734R2971O8928j4296j15664K9554J41415
7107a831659K5835j66905j9112K0960R0655O529J6881n6433n991l3252R8116r4442
7095a948818K7801P6112O9628j1239j70730n1838J2764J44825J133j3209l312
7084a866883J5550K1843J59811j4463j53185r9261J1938J10748N8765K2543j06662
7073a839256j08183O6818J23626k92p7236P3270k0148j5510Q1650j788j59074
7062a876123j44576N8704Q5784L1856q226q3684M717M5167L322O0216m4441p6918
7050a944202J2173Q2917Q7527p910J0288K7441m3347J2162L8414n783j02011j7645
7038a849976p05n847O0136j5258L7994j12004j44217Q3142J41324J34293Q1673
$$ plain form
7027 -1589445 -1630851 -1661941 -1687740 -1810487 -1717261 -1732474 -1766446 -1875245 -1993174 -1952094 -1953994
7016 -1953994 -1957695 -1840876 -1907771 -1922999 -1852550 -1878862 -1845278 -1875137 -1847905 -1871880 -1895667
7005 -1895667 -1883183 -1813077 -1733899 -1704949 -1756863 -1789676 -1798462 -1844610 -1817356 -1826032 -1839377 -1852652
6993 -1852652 -1845615 -1768118 -1778033 -1800388 -1782103 -1746839 -1807238 -1890123 -1840334 -1783381 -1768175 -1846467
6981 -1846467 -1786684 -1727250 -1759468 -1899325 -1950553 -1830439 -1887165 -1884655 -1817774 -1765766 -1745587
6970 -1745587 -1716743 -1765893 -1721375 -1797337 -1930466 -1820693 -1746117 -1759619 -1901113 -2074301 -2095525
6959 -2095525 -2024936 -2010305 -1958849 -1845399 -1911616 -1835050 -1773535 -1793299 -1913896 -1904317 -1756328
6948 -1756328 -1751876 -1773750 -1811971 -1838187 -1793395 -1818471 -1806080 -1799395 -1778557 -1795229 -1753496 -1709165
$$ packed form
7027a589445m1406l1090k5799j22747R3226j5213l3972j08799j17929M1080j900
7016a953994l701J16819o6895j5228P0449k6312L3584k9859K7232k3975k3787
7005a895667J2484P0106P9178K8950n1914l2813q786m6148K7254q676j3345j3275
6993a852652P037P7497r915k2355J8285L5264o0399q2885M9789N6953J5206p8292
6981a846467N9783N9434l2218j39857n1228J20114n6726K510O6881N2008K0179
6970a745587K8844m9150M4518p5962j33129J09773P4576j3502j41494j73188k1224
6959b095525P0589J4631N1456J13450o6217P6566O1515j9764j20597R579J47989
6948a756328M452k1874l8221k6216M4792k5076J2391O685K0838j6672M1733M4331
$$ plain form
6936 -1709165 -1621917 -1668345 -1725348 -1688583 -1603590 -1615627 -1589626 -1631242 -1808021 -1983912 -1876798
6925 -1876798 -1764022 -1828793 -1964640 -1904211 -1729230 -1736488 -1761971 -1701903 -1730137 -1690696 -1784073
6914 -1784073 -1762524 -1770879 -1784128 -1792636 -1783450 -1733544 -1619249 -1590079 -1680692 -1733005 -1686025 -1706977
6902 -1706977 -1774697 -1846990 -1836409 -1867714 -1905302 -1882806 -1965557 -2036371 -1939011 -1882197 -1850849
6891 -1850849 -1934225 -1939787 -1880119 -1788272 -1740727 -1729239 -1730714 -1665090 -1697969 -1812973 -1819515 -1745895
6879 -1745895 -1803908 -1842834 -1803502 -1689669 -1726986 -1767453 -1660864 -1612077 -1876118 -1989403 -1955623
6868 -1955623 -1912855 -1796460 -1762138 -1813482 -1914429 -1908074 -1843087 -1876122 -1845373 -1856452 -1829522
6857 -1829522 -1792563 -1875724 -1996472 -2009556 -2015024 -1881325 -1831978 -1911763 -1934511 -1971093 -1883219
$$ packed form
6936a709165Q7248m6428n7003L6765Q4993j2037K6001m1616j76779j75891J07114
6925a876798J12776o4771j35847O0429J74981p258k5483O0068k8234L9441r3377
6914a784073K1549q355j3249q508R186M9906J14295K9170r0613n2313M6980k0952
6902a706977o7720p2293J0581l1305l7588K2496q2751p0814R7360N6814L1348
6891a850849q3376n562N9668R1847M7545J1488j475O5624l2879j15004o542P3620
6879a745895n8013l8926L9332J13833l7317m0467J06589M8787k64041j13285L3780
6868a955623M2768J16395L4322n1344j00947O355O4987l3035L0749j1079K6930
6857a829522L6959q3161j20748j3084n468J33699M9347p9785k2748l6582Q7874
$$ plain form
6846 -1883219 -1816607 -1904474 -1907605 -1789518 -1819482 -1877468 -1866258 -1818302 -1811620 -1781339 -1804232 -1743785
6834 -1743785 -1692494 -1692143 -1638233 -1716093 -1821110 -1757564 -1675289 -1613088 -1510093 -1534982 -1643148
6823 -1643148 -1771577 -1782285 -1733905 -1731753 -1740850 -1731264 -1609160 -1577937 -1592951 -1620341 -1667687 -1776732
6811 -1776732 -1713645 -1618009 -1603543 -1707872 -1794881 -1666555 -1597983 -1586133 -1645769 -1720444 -1739166
6800 -1739166 -1809761 -1793507 -1852221 -1822823 -1793025 -1779955 -1717214 -1655579 -1533343 -1498539 -1650637
6789 -1650637 -1722499 -1825459 -1903578 -1869555 -1871538 -1825871 -1664151 -1719819 -1732549 -1764477 -1796171
6778 -1796171 -1818325 -1844653 -1729882 -1787129 -1975732 -2018542 -1910132 -1766921 -1804359 -1936984
6768 -1936984 -1919746 -1894739 -1901604 -1925928 -1891685 -1964282 -1857839 -1703129 -1759782 -1809437 -1862359
$$ packed form
6846a883219O6612q7867l131J18087k9964n7986J1210M7956O682L0281k2893O0447
6834a743785N1291L51N3910p7860j05017O3546Q2275O2201J02995k4889j08166
6823a643148j28429j0708M8380K152r097R586J22104L1223j5014k7390m7346j09045
6811a776732O3087R5636J4466j04329q7009J28326O8572J1850n9636p4675j8722
6800a739166p0595J6254n8714K9398K9798J3070O2741O1635J22236L4804j52098
6789a650637p1862j02960p8119L4023j983M5667J61720n5668j2730l1928l1694
6778a796171k2154k6328J14771n7247j88603m2810J08410J43211l7438j32625
6768a936984J7238K5007o865k4324L4243p2597J06443J54710n6653m9655n2922
$$ plain form
6757 -1862359 -1811703 -1842623 -1901242 -1938580 -2028163 -2025043 -2052230 -1989023 -1907388 -1956197 -1954670 -1828899
6745 -1828899 -1744779 -1742751 -1722596 -1688860 -1691233 -1783205 -1760594 -1727309 -1697687 -1692942 -1714579 -1668900
6733 -1668900 -1676204 -1805180 -1810186 -1802871 -1675665 -1534078 -1691130 -1807088 -1836715 -1750003 -1706300
6722 -1706300 -1702804 -1665122 -1724263 -1740799 -1682492 -1664483 -1615506 -1557305 -1562628 -1582133 -1604541 -1703675
6710 -1703675 -1727338 -1631867 -1688140 -1761094 -1731476 -1714030 -1601959 -1546505 -1654657 -1791880 -1739329
6699 -1739329 -1695472 -1701179 -1777511 -1715484 -1780704 -1765279 -1744431 -1714658 -1696117 -1685223 -1696351 -1804263
6687 -1804263 -1772728 -1674665 -1781656 -1907070 -1788175 -1654914 -1663181 -1745493 -1777916 -1712534 -1589803
6676 -1589803 -1668291 -1716527 -1747930 -1693313 -1615262 -1689071 -1676734 -1584818 -1489371 -1467039 -1586349
$$ packed form
6757a862359N0656l0920n8619l7338q9583L120k7187O3207Q1635m8809J527J25771
6745a828899Q4120K028K0155L3736k373r1972K2611L3285K9622M745k1637M5679
6733a668900p304j28976n006P315J27206J41587j57052j15958k9627Q6712M3703
6722a706300L496L7682n9141j6536N8307J8009M8977N8201n323j9505k2408r9134
6710a703675k3663R5471n6273p2954K9618J7446J12071N5454j08152j37223N2551
6699a739329M3857n707p6332O2027o5220J5425K0848K9773J8541J0894j1128j07912
6687a804263L1535R8063j06991j25414J18895J33261q267q2312l2423O5382J22731
6676a589803p8488m8236l1403N4617P8051p3809J2337R1916R5447K2332j19310
$$ plain form
6665 -1586349 -1656023 -1658843 -1749242 -1856336 -1836522 -1733487 -1661149 -1615778 -1669183 -1746929 -1696880
6654 -1696880 -1793670 -1797688 -1822614 -1823352 -1732614 -1735982 -1739896 -1714114 -1678764 -1740842 -1861890 -1927534
6642 -1927534 -1883298 -1866394 -1873376 -1742588 -1677918 -1719790 -1677918 -1623857 -1645817 -1806158 -1890108
6631 -1890108 -1797902 -1740454 -1685374 -1686450 -1830577 -1913004 -1843929 -1792382 -1656989 -1670312 -1689818
6620 -1689818 -1754509 -1772380 -1863543 -1850468 -1709220 -1738807 -1832003 -1765979 -1687424 -1698133 -1629001
6609 -1629001 -1652272 -1768498 -1823108 -1871392 -1893766 -1844160 -1783907 -1752046 -1710460 -1670262 -1624382
6598 -1624382 -1668172 -1615340 -1669488 -1728497 -1717259 -1672276 -1679126 -1681804 -1664846 -1643077 -1728994 -1821734
6586 -1821734 -1771920 -1791584 -1715717 -1630608 -1695708 -1635771 -1585585 -1587413 -1599333 -1589332 -1652353 -1613671
$$ packed form
6665a586349o9674k820r0399j07094J9814J03035P2338M5371n3405p7746N0049
6654a696880r6790m018k4926p38R0738l368l914K5782L5350o2078j21048o5644
6642a927534M4236J6904o982J30788O4670m1872M1872N4061k1960j60341q3950
6631a890108R2206N7448N5080j076j44127q2427O9075N1547J35393j3323j9506
6620a689818o4691j7871r1163J3075J41248k9587r3196O6024P8555j0709O9132
6609a629001k3271j16226n4610m8284k2374M9606O0253L1861M1586M0198M5880
6598a624382m3790N2832n4148n9009J1238M4983o850k678J6958K1769q5917r2740
6586a821734M9814j9664P5867Q5109o5100N9937N0186j828j1920J0001o3021L8682
$$ plain form
6574 -1613671 -1713951 -1798459 -1758402 -1799836 -1788393 -1698550 -1720688 -1783800 -1763709 -1748266 -1688819
6563 -1688819 -1649479 -1661467 -1666443 -1578723 -1710366 -1702690 -1668445 -1639954 -1594560 -1645317 -1737703 -1755691
6551 -1755691 -1760606 -1787748 -1786404 -1791457 -1758033 -1772139 -1809786 -1830587 -1806644 -1738337 -1727045 -1719309
6539 -1719309 -1717123 -1697330 -1712833 -1782920 -1758203 -1750066 -1720673 -1799437 -1795823 -1722898 -1579168 -1543869
6527 -1543869 -1684622 -1862706 -1957082 -1918498 -1872031 -1923463 -1776879 -1767165 -1766019 -1693731 -1579195
6516 -1579195 -1592462 -1535240 -1514851 -1630328 -1691529 -1690799 -1797018 -1815336 -1675583 -1774881 -1799736
6505 -1799736 -1692510 -1676754 -1692683 -1754392 -1809432 -1822158 -1786380 -1785913 -1764501 -1688229 -1667557 -1649152
6493 -1649152 -1700601 -1722810 -1771394 -1748491 -1736698 -1753320 -1697755 -1631387 -1676246 -1778361 -1894121
$$ packed form
6574a613671j00280q4508M0057m1434J1443Q9843k2138o3112K0091J5443N9447
6563a688819L9340j1988m976Q7720j31643P676L4245K8491M5394n0757r2386j7988
6551a755691m915k7142J344n053L3424j4106l7647k0801K3943O8307J1292P736
6539a719309K186J9793j5503p0087K4717Q137K9393p8764L614P2925J43730L5299
6527a543869j40753j78084r4376L8584M6467n1432J46584R714J146P2288J14536
6516a579195j3267N7222K0389j15477o1201P30j06219j8318J39753r9298k4855
6505a799736J07226J5756j5929o1709n5040j2726L5778M67K1412P6272K0672J8405
6493a649152n1449k2209m8584K2903J1793j6622N5565O6368m4859j02115j15760
$$ plain form
6482 -1894121 -1846771 -1735121 -1670168 -1719284 -1654644 -1572083 -1594739 -1495784 -1629297 -1706140 -1812926
6471 -1812926 -1895126 -1843300 -1764140 -1659900 -1651417 -1747665 -1766205 -1839953 -1807303 -1749092 -1701579
6460 -1701579 -1674022 -1623944 -1560985 -1552307 -1589942 -1632469 -1551163 -1502524 -1556719 -1668607 -1674662 -1657103
6448 -1657103 -1547409 -1494316 -1521472 -1579947 -1541503 -1484764 -1507285 -1441246 -1511063 -1594244 -1653810
6437 -1653810 -1590992 -1530960 -1492993 -1456098 -1506170 -1617669 -1640836 -1668698 -1632693 -1613083 -1737796
6426 -1737796 -1681110 -1568769 -1538348 -1676598 -1843282 -1829722 -1734664 -1681895 -1664879 -1672974 -1722911
6415 -1722911 -1668370 -1648292 -1660268 -1734282 -1677963 -1559197 -1482141 -1415217 -1458095 -1559673 -1664755
6404 -1664755 -1699550 -1699796 -1642008 -1655331 -1591225 -1530630 -1506878 -1582831 -1601042 -1595280 -1603389 -1675714
$$ packed form
6482a894121M7350J11650O4953m9116O4640Q2561k2656R8955j33513p6843j06786
6471a812926q2200N1826P9160J04240Q483r6248j8540p3748L2650N8211M7513
6460a701579K7557N0078O2959Q678l7635m2527Q1306M8639n4195j11888o055J7559
6448a657103J09694N3093k7156n8475L8444N6739k2521O6039o9817q3181n9566
6437a653810O2818O0032L7967L6895n0072j11499k3167k7862L6005J9610j24713
6426a737796N6686J12341L0421j38250j66684J3560R5058N2769J7016q095m9937
6415a722911N4541K0078j1976p4014N6319J18766P7056O6924m2878j01578j05082
6404a664755l4795k46N7788j3323O4106O0595K3752p5953j8211N762q109p2325
$$ plain form
6392 -1675714 -1677828 -1653699 -1579901 -1645345 -1712029 -1700241 -1639531 -1692470 -1703196 -1690857 -1668674 -1593746
6380 -1593746 -1598256 -1694903 -1704169 -1666879 -1682792 -1664588 -1614825 -1599230 -1572682 -1570110 -1524329 -1543880
6368 -1543880 -1658322 -1720745 -1701671 -1785529 -1689766 -1672810 -1735194 -1758649 -1758568 -1757052 -1746281 -1652203
6356 -1652203 -1612975 -1679002 -1676329 -1688944 -1608152 -1589939 -1513273 -1428821 -1413718 -1510744 -1532782 -1579240
6344 -1579240 -1570132 -1547504 -1425669 -1483195 -1623138 -1673334 -1709646 -1724218 -1643584 -1705534 -1667404
6333 -1667404 -1572947 -1577374 -1570976 -1608732 -1582163 -1511805 -1481510 -1518646 -1556593 -1640156 -1713641 -1732564
6321 -1732564 -1739933 -1681769 -1641532 -1663831 -1587687 -1586700 -1560242 -1541256 -1610060 -1646544 -1564445 -1450229
6309 -1450229 -1565053 -1494223 -1438294 -1390231 -1411204 -1522070 -1593381 -1721343 -1640545 -1612625 -1605356
$$ packed form
6392a675714k114K4129P3798o5444o6684J1788O0710n2939j0726J2339K2183P4928
6380a593746m510r6647r266L7290j5913J8204M9763J5595K6548K572M5781j9551
6368a543880j14442o2423J9074q3858R5763J6956o2384k3455Q1J516J0771R4078
6356a652203L9228o6027K673j2615Q0792J8213P6666Q4452J5103r7026k2038m6458
6344a579240R108K2628J21835n7526j39943n0196l6312j4572Q0634o1950L8130
6333a667404R4457m427O398l7756K6569P0358L0295l7136l7947q3563p3485j8923
6321a732564p369N8164M0237k2299P6144R87K6458J8986o8804l6484Q2099J14216
6309a450229j14824P0830N5929M8063k0973j10866p1311j27962Q0798K7920P269
$$ plain form
6298 -1605356 -1684837 -1790981 -1765175 -1670171 -1665515 -1668929 -1686577 -1573338 -1533066 -1555114 -1646948
6287 -1646948 -1654191 -1626548 -1626439 -1654279 -1598402 -1606810 -1640633 -1611606 -1646256 -1671252 -1530135 -1514568
6275 -1514568 -1558788 -1686401 -1817276 -1670403 -1527271 -1650140 -1685291 -1723153 -1752434 -1717184
6265 -1717184 -1598908 -1587678 -1696342 -1724989 -1720896 -1708914 -1659810 -1646730 -1517580 -1473274 -1509005
6254 -1509005 -1580841 -1607273 -1580076 -1571437 -1568125 -1487473 -1377580 -1454157 -1491206 -1575995 -1609982 -1596416
6242 -1596416 -1570758 -1667418 -1672806 -1638029 -1579751 -1591160 -1636367 -1713825 -1703211 -1655176 -1611303 -1478612
6230 -1478612 -1486722 -1513143 -1548758 -1525721 -1517827 -1571040 -1662237 -1623851 -1594264 -1455472 -1411159 -1490313
6218 -1490313 -1425099 -1449760 -1663645 -1736959 -1720093 -1670575 -1630576 -1512262 -1565285 -1653561 -1689455
$$ packed form
6298a605356p9481j06144K5806R5004M656l414j7648J13239M0272k2048r1834
6287a646948p243K7643J09k7840N5877q408l3823K9027l4650k4996J41117J5567
6275a514568m4220j27613j30875J46873J43132j22869l5151l7862k9281L5250
6265a717184J18276J1230j08664k8647M093J1982M9104J3080J29150M4306l5731
6254a509005p1836k6432K7197Q639L312Q0652J09893p6577l7049q4789l3987J3566
6242a596416K5658r6660n388L4777N8278j1409m5207p7458J0614M8035M3873J32691
6230a478612q110k6421l5615K3037P894n3213r1197L8386K9587J38792M4313p9154
6218a490313O5214k4661k13885p3314J6866M9518L9999J18314n3023q8276l5894
$$ plain form
6207 -1689455 -1632464 -1516325 -1466329 -1583555 -1622877 -1583452 -1447788 -1411793 -1389299 -1426525 -1479169
6196 -1479169 -1455801 -1525790 -1619563 -1523458 -1490556 -1554938 -1557751 -1448861 -1353318 -1343379 -1433711 -1590283
6184 -1590283 -1628615 -1632240 -1655447 -1597218 -1443472 -1399224 -1310752 -1309557 -1354552 -1420431 -1468138 -1470463
6172 -1470463 -1472063 -1483175 -1450368 -1392113 -1398608 -1584768 -1659979 -1567671 -1577637 -1605773 -1599809 -1547929
6160 -1547929 -1624362 -1682099 -1570492 -1513629 -1476083 -1419061 -1454230 -1502696 -1521792 -1493361 -1467199
6149 -1467199 -1514262 -1512299 -1427441 -1407933 -1563533 -1569499 -1503224 -1479918 -1416542 -1531511 -1632973
6138 -1632973 -1686374 -1645058 -1580289 -1564364 -1532623 -1517288 -1468941 -1404305 -1420932 -1368298 -1396408
6127 -1396408 -1487848 -1502545 -1487851 -1664488 -1749518 -1694775 -1614837 -1680251 -1652750 -1585108 -1551833
$$ packed form
6207a689455N6991J16139M9996j17226l9322L9425J35664L5995K2494l7226n2644
6196a479169K3368o9989r3773R6105L2902o4382k813J08890R5543R939r0332j56572
6184a590283l8332l625k3207N8229J53746M4248Q8472J195m4995o5879m7707k325
6172a470463j600j1112L2807N8255o495j86160p5211R2308r966k8136N964N1880
6160a547929p6433n7737J11607N6863L7546N7022l5169m8466j9096K8431K6162
6149a467199m7063J963Q4858J9508j55600n966O6275K3306O3376j14969j01462
6138a632973n3401M1316O4769J5925L1741J5335M8347O4636j6627N2634k8110
6127a396408r1440j4697J4694j76637q5030N4743P9938o5414K7501O7642L3275
$$ [...]
##END NTUPLES=NMR SPECTRUM
##END=
