##TITLE=Analysis number 313272
Compound Code cc 31009
Book Reference 397/68/4
Project Code adrs
Chemist Name brucer
##JCAMPDX= 6.0         $$ Bruker NMR JCAMP-DX V2.0
##DATA TYPE= NMR SPECTRUM
##DATA CLASS= NTUPLES
##ORIGIN= Bruker BioSpin GmbH
##OWNER= NMR
$$ XWIN-NMR		Version 3.5
$$ Wed Aug 31 13:56:44 2005 GMT Daylight Time (UT+1h)  MAYBRIDGE\NMR@NMR_250MHZ
##.OBSERVE FREQUENCY= 250.131544655141
##.OBSERVE NUCLEUS= ^1H
##.ACQUISITION MODE= SIMULTANEOUS (DQD)
##.ACQUISITION SCHEME= undefined
##.AVERAGES= 16
##.DIGITISER RES= 18
##SPECTROMETER/DATA SYSTEM= dpx250
##.PULSE SEQUENCE= zg30
##.SOLVENT NAME= CDCl3
##.SHIFT REFERENCE= (INTERNAL, CDCl3, 0, 16.4618)
##AUDIT TRAIL= $$ (NUMBER, WHEN, WHO, WHERE, WHAT)
$$ ##TITLE= Audit trail, XWIN-NMR		Version 3.5
$$ ##JCAMPDX= 5.01
$$ ##ORIGIN= Bruker BioSpin GmbH
$$ ##OWNER= NMR
$$ C:\u/data/dgb/nmr/ADRS/8820/pdata/1/auditp.txt
$$ ##AUDIT TRAIL=  $$ (NUMBER, WHEN, WHO, WHERE, WHAT)
(   1,<2005-08-31 13:56:07.24 +100>,<MAYBRIDGE\NMR>,<NMR_250MHZ>,
      <created by zg, POWCHK disabled, PULCHK disabled
       configuration hash MD5:
       62 19 C7 07 E1 42 D1 B7 37 6C 3D D0 77 39 F9 E6
       data hash MD5: 64K
       A5 B5 7F 03 94 2D D0 9E 8B 3C 54 2C F7 C8 E3 BE>)
(   2,<2005-08-31 13:56:24.67 +100>,<MAYBRIDGE\NMR>,<NMR_250MHZ>,
      <Start of raw data processing
       ef LB = 0.3 FT_mod = 6 PKNL = 1 SI = 32K 
       data hash MD5: 32K
       4E 08 F7 CF 14 E4 B6 4B 32 A7 7F 6C 7D 1D 50 6C>)
(   3,<2005-08-31 13:56:29.27 +100>,<MAYBRIDGE\NMR>,<NMR_250MHZ>,
      <apk 
       data hash MD5: 32K
       6A 69 72 0E 0F 7C 21 4E 82 DE 01 A9 4D C2 A3 94>)
(   4,<2005-08-31 13:56:30.92 +100>,<MAYBRIDGE\NMR>,<NMR_250MHZ>,
      <abs ABSG = 5 
       data hash MD5: 32K
       14 E6 8D 3F CD 24 BC DF 4D 0A 2E 5F E2 36 44 51>)
$$ ##END=
$$ 
$$ hash MD5
$$ 83 26 DD 1E D4 C0 64 83 59 9C E5 B9 25 E3 A9 97
##$RELAX= 
##$RELAX= 
##$RELAX= 
##$RELAX= 
##$RELAX= 
##$RELAX= 
##$RELAX= 
$$ Bruker specific parameters
$$ --------------------------
##$DU= <C:\u>
##$EXPNO= 8820
##$NAME= <ADRS>
##$PROCNO= 1
##$TYPE= <nmr>
##$USER= <dgb>
##$AMP= (0..31)
100 100 100 100 100 100 100 100 100 100 100 100 100 100 100 100 100 100 
100 100 100 100 100 100 100 100 100 100 100 100 100 100 
##$AQSEQ= 0
##$AQ_mod= 3
##$AUNM= <au_zg>
##$AUTOPOS= <18 >
##$BF1= 250.13
##$BF2= 250.13
##$BF3= 250.13
##$BF4= 250.13
##$BF5= 500.13
##$BF6= 500.13
##$BF7= 500.13
##$BF8= 500.13
##$BYTORDA= 1
##$CFDGTYP= 0
##$CFRGTYP= 5
##$CHEMSTR= <none>
##$CNST= (0..31)
1 1 145 1 1 1 1 1 1 1 1 1 1 1 1 1 1 1 1 1 1 1 1 1 1 1 1 1 1 1 1 1 
##$CPDPRG= <>
##$CPDPRG1= <>
##$CPDPRG2= <>
##$CPDPRG3= <>
##$CPDPRG4= <mlev>
##$CPDPRG5= <mlev>
##$CPDPRG6= <mlev>
##$CPDPRG7= <mlev>
##$CPDPRG8= <mlev>
##$CPDPRGB= <>
##$CPDPRGT= <>
##$D= (0..31)
0 1 0 0 0 0 0 0 0 0.06 0 0 0 0 0 0 0.0002 0 0 0 0 0 0 0 0 0 0 0 0 0 0 
0 
##$DATE= 1125492965
##$DBL= (0..7)
120 120 120 120 120 120 120 120 
##$DBP= (0..7)
150 150 150 150 150 150 150 150 
##$DBP07= 0
##$DBPNAM0= <>
##$DBPNAM1= <>
$$ [...]
##$SUBNAM7= <"">
##$SUBNAM8= <"">
##$SUBNAM9= <"">
##$SW= 20.6930455092707
##$SWIBOX= (0..15)
0 0 3 0 0 0 0 0 0 0 0 0 0 0 0 0 
##$SW_h= 5175.983436853
##$TD= 65536
##$TD0= 1
##$TE= 295.16
##$TE2= 300
##$TE3= 300
##$TEG= 300
##$TL= (0..7)
0 120 120 120 120 120 120 120 
##$TP= (0..7)
150 150 150 150 150 150 150 150 
##$TP07= 0
##$TPNAME0= <>
##$TPNAME1= <>
##$TPNAME2= <>
##$TPNAME3= <>
##$TPNAME4= <>
##$TPNAME5= <>
##$TPNAME6= <>
##$TPNAME7= <>
##$TPOAL= (0..7)
0.5 0.5 0.5 0.5 0.5 0.5 0.5 0.5 
##$TPOFFS= (0..7)
0 0 0 0 0 0 0 0 
##$TUNHIN= 0
##$TUNHOUT= 0
##$TUNXOUT= 0
##$USERA1= <user>
##$USERA2= <user>
##$USERA3= <user>
##$USERA4= <user>
##$USERA5= <user>
##$V9= 5
##$VALIST= <valist>
##$VCLIST= <CCCCCCCCCCCCCCC>
##$VD= 0
##$VDLIST= <DDDDDDDDDDDDDDD>
##$VPLIST= <PPPPPPPPPPPPPPP>
##$VTLIST= <TTTTTTTTTTTTTTT>
##$WBST= 1024
##$WBSW= 4
##$XGAIN= (0..3)
0 0 0 0 
##$XL= 0
##$YL= 0
##$YMAX_a= 281887
##$YMIN_a= -518609
##$ZGOPTNS= <>
##$ZL1= 120
##$ZL2= 120
##$ZL3= 120
##$ZL4= 120
##$ABSF1= 16.46185
##$ABSF2= -4.231323
##$ABSG= 5
##$ABSL= 3
##$ALPHA= 0
##$AQORDER= 0
##$ASSFAC= 0
##$ASSFACI= 0
##$ASSFACX= 0
##$ASSWID= 0
##$AUNMP= <proc_1d>
##$AZFE= 0.1
##$AZFW= 0.1
##$BCFW= 0
##$BC_mod= 0
##$BYTORDP= 0
##$COROFFS= 0
##$CY= 12.5
##$DATMOD= 1
##$DC= 0
##$DFILT= <>
##$DTYPP= 0
##$F1P= 14.0000005364418
##$F2P= -0.99999901652339
##$FCOR= 0.5
##$FTSIZE= 32768
##$FT_mod= 6
##$GAMMA= 0
##$GB= 0
##$INTBC= 1
##$INTSCL= 1
##$ISEN= 128
##$LB= 0.3
##$LEV0= 0
##$LPBIN= 0
##$MAXI= 10000
##$MC2= 0
##$MEAN= 0
##$ME_mod= 0
##$MI= 0
##$NCOEF= 0
##$NC_proc= -3
##$NLEV= 6
##$NOISF1= 0
##$NOISF2= 0
##$NSP= 0
##$NTH_PI= 0
##$NZP= 0
##$OFFSET= 16.46185
##$PC= 1
##$PHC0= -78.2562
##$PHC1= 3.789789
##$PH_mod= 1
##$PKNL= yes
##$PPARMOD= 0
##$PSCAL= 4
##$PSIGN= 0
##$REVERSE= no
##$SF= 250.130015043426
##$SI= 32768
##$SIGF1= 0
##$SIGF2= 0
##$SINO= 400
##$SIOLD= 32768
##$SREGLST= <1H.CDCl3>
##$SSB= 0
##$STSI= 32768
##$STSR= 0
##$SW_p= 5175.98343685301
##$SYMM= 0
##$S_DEV= 0
##$TDeff= 65536
##$TDoff= 0
##$TI= <Analysis number 999999
Compound Code 99
Book Reference 9
Project Code 9>
##$TILT= no
##$TM1= 0
##$TM2= 0
##$TOPLEV= 0
##$USERP1= <user>
##$USERP2= <user>
##$USERP3= <user>
##$USERP4= <user>
##$USERP5= <user>
##$WDW= 1
##$XDIM= 32768
##$YMAX_p= 511121732
##$YMIN_p= -52440
$$ End of Bruker specific parameters
$$ ---------------------------------
##NTUPLES= NMR SPECTRUM
##VAR_NAME=  FREQUENCY,     SPECTRUM/REAL,   SPECTRUM/IMAG
##SYMBOL=    X,             R,               I
##VAR_TYPE=  INDEPENDENT,   DEPENDENT,       DEPENDENT
##VAR_FORM=  AFFN,          ASDF,            ASDF
##VAR_DIM=   32768,         32768,           32768
##UNITS=     HZ,            ARBITRARY UNITS, ARBITRARY UNITS
##FACTOR=    0.157963299565203, 1,           1
##FIRST=     4117.60259120188, 0,            0
##LAST=      -1058.38084565113, 0,           0
##MIN=       -1058.38084565113, -52440,      0
##MAX=       4117.60259120188, 511121732,    0
$$ Real data points
##PAGE= N=1
##DATA TABLE= (X++(R..R)), XYDATA
$$ [...]
14503B3720r831N871R7m951q991p94m12p935k569j259J4513O327q243j1981p687
$$ 23720 13889 19760 19857 14906 5915 5121 4709 -3226 -5795 -7054 7459 13786 5543 -6438 -14125
14488a4125r271p184Q083Q730N616Q930P687p731L173j800O403j404L596j322
$$ -14125 -23396 -30580 -22497 -13767 -8151 779 8466 735 3908 2108 8511 7107 10703 9381
14474I381p247o108j0320q990L607R858J1961l866r550l023L875L101k223m58
$$ 9381 2134 -3974 -14294 -23284 -19677 -9819 2142 -1724 -11274 -14297 -10422 -7321 -9544 -10002
14460a0002q013j0416Q164N169j216j783k27M440p583l671n569q331J278nJ4511
$$ -10002 -18015 -28431 -20267 -15098 -16314 -18097 -18324 -13884 -21467 -25138 -30707 -39038 -37760 -37765 -23254
14445b3254J1283J2171Q086O93m029q769K297n677m039Q526J0055P53n033l867
$$ -23254 -11971 200 8286 8979 4950 -3819 -1522 -7199 -11238 -2712 7343 8096 3063 -804
14431h04n023j5861Q300J728O541P435o031j2128M184M79p86J1781l581N80M936
$$ -804 -5827 -21688 -13388 -11660 -5119 2316 -3715 -15843 -11659 -11180 -11966 -185 -3766 -3186 1750
14416A750m818R398J40Q969j232m038n601o955N218J064O46P381r26r406p58K246
$$ 1750 -3068 6330 6470 15439 14207 10169 4568 -2387 2831 3895 4541 11922 10996 1590 832 3078
14400C078K6081M856q388p966M928k418j9359j2219L545j0518n061Q810n968r15
$$ 3078 29159 34015 25627 17661 22589 20171 812 -11407 -7862 -18380 -23441 -14631 -20599 -21514
14386b1514j4744k243K222M548J3004J3885p788j94J449K223m848p319J92N224
$$ -21514 -36258 -38501 -36279 -31731 -18727 -4842 -12630 -12824 -11375 -9152 -14000 -21319 -21127 -15903
14372a5903R348j0130j2588N547K386M089R941J614j5098o15M546n110J6044J9934
$$ -15903 -6555 -16685 -29273 -23726 -21340 -17251 -7310 -5696 -20794 -21409 -16863 -21973 -5929 14005
14358A4005P070j286P681N444L358n005j738N933L051o428j6583P590n880j7011
$$ 14005 21075 19789 27470 32914 36272 31267 29529 35462 38513 32085 15502 23092 17212 201
14344B01n353J1762K706l704m624r878P571J7931k003j7897j9243o24O53p085
$$ 201 -5152 6610 9316 5612 988 -8890 -1319 16612 14609 -3288 -22531 -23155 -22502 -29587
14330b9587N015J1318Q33p71L85k266N937N50O408J6658J205j2058n540J4201
$$ -29587 -24572 -13254 -12421 -13192 -12807 -15073 -9136 -8586 -2178 14480 15685 3627 -1913 12288
14316A2288r61J0056Q206L41m998k225Q128K941m176p067K795J166n324n630j2328
$$ 12288 11327 21383 29589 29930 24932 22707 30835 33776 29600 22533 25328 26494 21170 15540 3212
14301C212p312Q900J7046L140j1961j53m163o693k217K433J207k436m727J073
$$ 3212 -4100 4800 21846 24986 13025 12872 8709 2016 -201 2232 3439 1003 -3724 -2651
14287b651J1041Q322Q798r429J838J5720L837o920j5970J0381J7424J555j6127
$$ -2651 8390 16712 25510 16081 17919 33639 37476 30556 14586 24967 42391 43946 27819
14274B7819k393j328j173k841p298j418N368R354Q798J472j9524j5724q785o317
$$ 27819 25426 24098 22925 20084 12786 11368 16736 26090 34888 36360 16836 1112 -7673 -13990
14260a3990j149J2943J3781K746l850L655K712l454m638K646l783O447J1939J4997
$$ -13990 -15139 -2196 11585 14331 10481 14136 16848 13394 8756 11402 7619 14066 26005 41002
14246D1002j0131n142o944p594P755J9858Q09J772J589P129M1j063o47M011J1200
$$ 41002 30871 25729 18785 11191 18946 38804 39613 41385 42974 50103 50144 49081 48434 52445 63645
14231F3645J6101J0020J5479K1353J6670J941L516r464Q056J0672j6680k2831
$$ 63645 79746 89766 105245 126598 143268 145209 148725 139261 147317 157989 141309 118478
14219A18478k2226j2363l744k749k16K429n657j0013r120L062O498O38J240r984
$$ 118478 96252 83889 80145 77396 77180 79609 73952 63939 54819 57881 64379 65017 66257 56273
14205E6273j6007m690J9002K1249N422j1981m498L449P49j2788L962J685P120
$$ 56273 40266 35576 54578 75827 81249 69268 64770 68219 68968 56180 60142 61827 68947
14192F8947J1740r37q197J2646R226q066n167L162K424P845J3117P745J7252J1920
$$ 68947 80687 79750 71553 84199 93425 85359 80192 83354 85778 93623 106740 114485 131737 143657
14178A43657j9253Q227O051o08o815J2955P6j2518R370K4548J0337J5237Q936
$$ 143657 124404 132631 138682 138074 131259 144214 144290 131772 141142 165690 176027 191264 200200
14165B00200m845R79M14p898P164Q074l40J0166L50j1056n983K0223J7012K1202
$$ 200200 195355 196334 196748 188850 196014 204088 203748 213914 214264 203208 197225 217448 234460 255662
14151B55662J2296P320J2194K0225K4055L7601K7316K7723K8186L5705L6586L4385
$$ 255662 267958 275278 287472 307697 331752 369353 396669 424392 452578 488283 524869 559254
14139E59254K4827L4300N7523O9816M7769O0899M7153K5474N0516P5556P4841
$$ 559254 584081 618381 675904 745720 793489 854388 901541 927015 977531 1053087 1127928
14128A127928P5252R5935Q2147R4954J29205J67798J80777K17085K60775L14563
$$ 1127928 1203180 1299115 1381262 1476216 1605421 1773219 1953996 2171081 2431856 2746419
14118B746419M08330M87325N69257O14280O52713P92279J027922J366922J840157
$$ 2746419 3154749 3642074 4211331 4825611 5478324 6270603 7298525 8665447 10505604
14109A0505604K468709L413656M937480P284489J0433413J3307479J2648134O268909
$$ 10505604 12974313 16387969 21325449 28609938 39043351 52350830 64998964 71267873
14101G1267873q03792k030654J322700M206506K039007n403179j1374478j1946520
$$ 71267873 70464081 68433427 69756127 73962633 76001640 70598461 59223983 47277463
14093D7277463r891067p613888n684882m263966l254750k510846j925360j458396
$$ 47277463 37386396 29772508 24087626 19823660 16568910 14058064 12132704 10674308
14085A0674308j177804j035641r27323q63253p78465o78633n69941m69976m08030
$$ 10674308 9496504 8460863 7533540 6670287 5891822 5213189 4643248 4173272 3765242
14076C765242l68250l07712k53166k37724k10895j73467j56226j41309j19198
$$ 3765242 3396992 3089280 2836114 2598390 2387495 2214028 2057802 1916493 1797295
14067A797295j01277j03449r0450q5995q8632q4853p5899o8646n7288n1157k8374
$$ 1797295 1696018 1592569 1502119 1416124 1327492 1242639 1166740 1098094 1040806 989649 961275
14056I61275l7099m7354l7568m0878l2762l1593k3191l1462k1429m969j6419l2644
$$ 961275 924176 876822 839254 798376 765614 734021 710830 679368 657939 652970 636551 603907
14044F03907k3381k0196j8958k2419j8340j7011j4306j7509j0185j8887k8622
$$ 603907 580526 560330 541372 518953 500613 483602 469296 451787 441602 422715 394093
14033C94093j2154l59j3473j9149r392j4076j5395J523k0070k1874j4808r008
$$ 394093 381939 381580 368107 348958 339566 325490 310095 311618 291548 269674 254866 245858
14021B45858j732j941M378p24j0367j7323n236L48KQ325O178O631o073L305k823
$$ 245858 244126 242185 246563 245839 235472 218149 212913 213261 213263 221588 227766 234397 228324 231629 228806
14006B28806j4413l281l407o491n353O56M270r754k402k584q779r351Q757M705
$$ 228806 214393 211112 207705 201214 195861 196517 200787 191033 188631 186047 177268 167917 176674 181379
13992A81379p66O087Q6j3073k9512l673K0929J0343j6947p738J0199j750R399
$$ 181379 180613 186700 186786 173713 144201 140528 161457 171800 154853 147115 157314 155564 164963
13979A64963J3009o834K719P913P606j323J925J3242n149n647m040m111l499l381
$$ 164963 177972 171138 173857 181770 189376 188053 189978 203220 198071 192424 188384 184273 180774 177393
13965A77393j3718j3624J2566J721q174j5226q977k816j652m543m41n912j2775
$$ 177393 163675 150051 162617 164338 156164 140938 131961 129145 127493 122950 122509 116597 103822
13952A03822o454j375L577O390m711j411K215Q761J8305j11j305P347j2808j0596
$$ 103822 97368 95993 99570 105960 101249 99838 102053 110814 129119 129008 127703 135050 122242 111646
13938A11646P489L90q551M11J1517r283j4100o996m842O394l501l150l891N368
$$ 111646 119135 119525 110974 111385 122902 113619 99519 92523 87681 94075 90574 87424 83533 88901
13924H8901J004j1532j0268k002p238J579J360J2794O170j2042r11N879j1641
$$ 88901 89905 78373 68105 66103 58865 60444 61804 74598 80768 68726 67815 73694 62053
13911F2053J2010J4591Q715N588J576J6415o856j0389j5920J1426J1865J138j4413
$$ 62053 74063 88654 97369 102957 104533 120948 114092 103703 87783 99209 111074 112212 97799
13898I7799r002l649j901L96j92J686L82j1089j8803J3784J3519K416J362M618
$$ 97799 88797 85148 83247 83643 83451 85137 85519 74430 55627 69411 82930 85346 86708 91326
13884I1326p347r895j787R29J2983Q293J0726P736Q209j7750j582J2313L67p209
$$ 91326 83979 74084 72297 73226 86209 94502 105228 112964 121173 103423 101841 114154 114521 107312
13870A07312j0708p719Q92j353j1827J936m064K947J547m1p531k74M929O843o883
$$ 107312 96604 88885 89777 88424 76597 78533 74469 77416 78963 78922 71391 71117 76046 82889 76006
13855G6006k114j865O329N337n365q092L078J957J0131N890m404q296N528k006
$$ 76006 73892 72027 78356 83693 78328 70236 73314 75271 85402 91292 86888 78592 84120 82114
13841H2114k226J586k0868j42J796Q077p328O369J9988R291j8441N244R835M637
$$ 82114 79888 81474 60606 60464 62260 70337 63009 69378 89366 98657 80216 85460 95295 99932
13827I9932j4930o327Q896j390k518P791j292o94j157r824J81K828j403L110K317
$$ 99932 85002 78675 87571 86181 83663 91454 90162 89468 88311 78487 78668 81496 80093 83203 85520
13812H5520n504J7242j557o442L763J0003k779p101j9196k5049m364J1209Q982
$$ 85520 80016 97258 95701 89259 93022 103025 100246 93145 73949 48900 44536 55745 64727
13799F4727m592o051O557J1113j4725j4083j673L068P800n841J76j7425N734J0567
$$ 64727 60135 54084 60641 71754 57029 42946 41273 44341 52141 46300 46476 29051 34785 45352
13785D5352J0974M809j1970k021k529k122m033J805J0361P467J446k424p353m298
$$ 45352 56326 61135 49165 47144 44615 42493 38460 40265 50626 58093 59539 57115 49762 45464
13771D5464N836L398l662k824o784J6421J3975M697r242p254J994K883m844M434
$$ 45464 51300 54698 51036 48212 41428 57849 71824 76521 67279 60025 62019 64902 60058 64492
13757F4492J2997J409R532r73k3475r030J4564K2432N452j4638k7379j5914J5149
$$ 64492 77489 78898 88430 87457 63982 54952 69516 91948 97400 82762 55383 39469 54618
13744E4618K0987N260q572l993o320J3195O691J4832J0219m266j0575r765j0016
$$ 54618 75605 80865 72293 68300 61980 75175 81866 96698 106917 102651 92076 82311 72295
13731G2295q056j0210j859J4942J0713M517n849P628M165j300l320P688K410p818
$$ 72295 64239 54029 52170 67112 77825 82342 76493 84121 88286 86986 83666 91354 93764 85946
13717H5946k158N350J920l287q190j2778O315J3067k352K851j249m71m130P142
$$ 85946 83788 89138 91058 87771 79581 66803 73118 86185 83833 86684 85435 84964 80834 87976
13703H7976j3788n625L543O500J2307j31n389N504p765Q67p794K727l983j5533
$$ 87976 74188 68563 72106 78606 90913 90782 85393 90897 83132 83999 76205 78932 74949 59416
13689E9416m60K587J0608N964J1359O143N495J2749j898o243L523R089n685j2526
$$ 59416 58956 61543 72151 78115 89474 95617 101112 113861 111963 105720 109243 118332 112647 100121
13675A00121m712M668P372j118L233p207j1754j1975M723J7968O942J3250Q262
$$ 100121 95409 100077 107449 106331 109564 102357 90603 78628 83351 101319 108261 121511 129773
13662A29773n292r531J665P006R131L225j130O577j0464J3539J3481N189K6135
$$ 129773 124481 114950 116615 123621 132752 135977 134847 141424 130960 144499 157980 163169 189304
13649A89304L2916L6492M8622N2985N3862N7297J2342j1495j0869n692J6053j0529
$$ 189304 222220 258712 307334 360319 414181 471478 483820 472325 461456 455764 471817 461288
13637D61288n1751n5269m9287l2611l6777j7393j8368j1886p901j5071j1993j6960
$$ 461288 409537 354268 304981 272370 235593 218200 199832 187946 180045 164974 152981 136021
13625A36021r041J1365Q598j143q296l382k263m039o409k413J533J413k542j6232
$$ 136021 126980 138345 146943 145800 137504 134122 131859 127820 121411 118998 120531 121944 119402 103170
13611A03170j26n612o959k384R268n706J1416J0566J549l439J1246R589o849q527
$$ 103170 103044 97432 90473 88089 97357 91651 103067 113633 115182 111743 122989 132578 125729 117202
13597A17202k417l559M232J3660k110M081k306J831n682P482O665J708J321k803
$$ 117202 114785 111226 115458 129118 127008 131089 128783 130614 124932 132414 139079 140787 142108 139305
13583A39305O073n097j147L086P96J0253n260r882Q199O984r034j7013O201K776
$$ 139305 145378 140281 139134 142220 143016 153269 148009 138127 146326 153310 144276 127263 133464 136240
13569A36240k248r193q583q669j0106R2J4391O941K269O637J2132O593K014O21
$$ 136240 133992 124799 116216 107547 97441 97533 111924 118865 121134 127771 139903 146496 148510 149131
13555A49131M017o633j2248j0496j970n168R608o1K166r372J0265J713m718j061
$$ 149131 153148 146515 134267 123771 121801 116633 126241 126180 128346 118974 129239 130952 126234 125173
13541A25173j020K500r23L493K7868J1406j5892j8308K332N397J0407K921J3223
$$ 125173 124153 126653 125730 129223 157091 168497 152605 134297 136629 142026 152433 155354 168577
13528A68577N769J2241j967P172q698k897J6970J2985K315J4274K9499K3594L3874
$$ 168577 174346 186587 184620 191792 183094 180197 197167 210152 212467 226741 256240 279834 313708
13515C13708M0086L9102K3414J3517K81o307k4376k4348k9735k6473q677p138
$$ 313708 353794 392896 416310 429827 430108 423801 399425 375077 345342 318869 310192 303054
13503C03054j8993q500k2568j3506Q212K275K173m14L718j0648q086k441K2994
$$ 303054 284061 275561 252993 239487 247699 249974 252147 251733 255451 244803 236717 234276 257270
13490B57270J2054O991j246L110N444N759k845n480l39R480k44j157P974N142
$$ 257270 269324 276315 275069 278179 283623 289382 286537 281057 280718 290198 289954 288797 296771 301913
13476C01913K4399K1540K2832J8216M1912L9269N0179Q2003J02359J28482J37199
$$ 301913 326312 347852 370684 388900 430812 470081 520260 602263 704622 833104 970303
13465I70303J43048J26589Q8911M4804P459j7139m3284n4343q0970p8666m4974
$$ 970303 1113351 1239940 1328851 1373655 1381114 1363975 1320691 1266348 1185378 1106712 1061738
13454A061738l1127j4516J1873K9675L6938K7937j662q694q541o646r505j8428
$$ 1061738 1030611 1016095 1027968 1057643 1094581 1122518 1120856 1112162 1103621 1096975 1087470 1069042
13442A069042n6563q4635r3521q3779p0461n9006m3975k7346k2893k6690k5304
$$ 1069042 1012479 927844 834323 750544 680083 621077 577102 549756 526863 500173 474869
13431D74869n139L140P506j8045k6554j8916O789J0579m144Q12J1694m413m353
$$ 474869 469730 472870 480376 462331 435777 416861 423650 434229 430085 430897 442591 438178 433825
13418D33825O080K560r530M985N48j4325k959R041N467J1723N721j887O78O65
$$ 433825 439905 442465 432935 437920 438468 424143 421184 430225 435692 447415 453136 451249 451927 452592
13404D52592R757J5291L1178J1282j4360P91J9625J0855Q339P209J2907O640O880
$$ 452592 462349 477640 508818 520100 505740 506531 526156 537011 545350 552559 565466 572106 578986
13391E78986J589K235R092J5252K0563J6896K718K638R332J3964J1564L0269L6190
$$ 578986 580575 582810 591902 607154 627717 644613 647331 649969 659301 673265 684829 715098 751288
13378G51288L2018K3458J3560K7501L1006K9517K7230J1620R653P852k1054r968
$$ 751288 783306 806764 820324 847825 878831 908348 935578 947198 956851 964703 943649 933681
13366I33681J260J5519K1459j370l811J9686K4787K1197K7662J9471J8555J7838
$$ 933681 934941 950460 971919 970549 966738 986424 1011211 1032408 1060070 1079541 1098096 1115934
13354A115934K1448K7453J5981J8716L1472L0804K7934L2789L7037L4445L0357
$$ 1115934 1137382 1164835 1180816 1199532 1231004 1261808 1289742 1322531 1359568 1394013 1424370
13343A424370M2127L6724M5109M5331L8297K9348N1138N8029M4992N2968N4879
$$ 1424370 1466497 1503221 1548330 1593661 1631958 1661306 1712444 1770473 1815465 1868433 1923312
13332A923312O0741N7900O3726O0425O5326Q0192Q9210Q7666Q9181J06234R0584
$$ 1923312 1984053 2041953 2105679 2166104 2231430 2311622 2400832 2488498 2577679 2683913 2774497
13321B774497P8235O6692N3401O0496P1057O7778P9836P7251P3584Q6485Q1229
$$ 2774497 2852732 2919424 2972825 3033321 3104378 3172156 3251992 3329243 3402827 3489312 3570541
13310C570541Q5932P0301J02916J05577J07847J13605J06470J02946J12285R7117
$$ 3570541 3656473 3726774 3829690 3935267 4043114 4156719 4263189 4366135 4478420 4575537
13300D575537R7515R6512J02952J07553R7950J00046R5960R9132R4058O4665Q9228
$$ 4575537 4673052 4769564 4872516 4980069 5078019 5178065 5274025 5373157 5467215 5531880 5621108
13289E621108Q9009P8328P8599P4920Q3223P7222N5290O1537O0341M5058M5717
$$ 5621108 5710117 5788445 5867044 5941964 6025187 6102409 6157699 6219236 6279577 6324635 6370352
13278F370352M4045L3274L1674M1434M0224K9612K6370M795P476P266Q0r55l496
$$ 6370352 6414397 6447671 6479345 6520779 6561003 6590615 6616985 6621780 6629256 6636522 6636602 6635647 6632151
13265F632151j3455m19Q163j3166l1364l7357l6687k9365k2570l2287l5338l5541
$$ 6632151 6618696 6618277 6626440 6613274 6581910 6544553 6507866 6478501 6455931 6423644 6388306 6352765
13253F352765k6160l4029n2168l5153j1284k6469k6367n0017l2869k4643j6901
$$ 6352765 6326605 6292576 6240408 6205255 6193971 6167502 6141135 6091118 6058249 6033606 6016705
13242F016705l0097l2213j3494j5782j7881j7393m781J2454L607O032J4148o01
$$ 6016705 5986608 5954395 5940901 5925119 5907238 5889845 5885064 5897518 5901125 5907157 5921305 5920704
13230E920704K0258K7516M1871L6777L4890L2511M1883L2644K7300M4451O1213
$$ 5920704 5940962 5968478 6010349 6047126 6082016 6114527 6156410 6189054 6216354 6260805 6322018
13219F322018P5375O5608N8124N3419L5564M0856O3471P7537N7856O4119O6025
$$ 6322018 6397393 6463001 6521125 6574544 6610108 6650964 6714435 6791972 6849828 6913947 6979972
13208F979972O2403N2576M5971L3454M6676N7900O2405N7102L7892K1460K8545
$$ 6979972 7042375 7094951 7140922 7174376 7221052 7278952 7341357 7398459 7436351 7457811 7486356
13197G486356K9705L0770J9817J1054J2367N821R063O725p729O564j443o309k2666
$$ 7486356 7516061 7546831 7566648 7577702 7590069 7595890 7604953 7611678 7603949 7610513 7609070 7602761 7580095
13184G580095j2822q524k1946n8111q5192p2390q2310q9000p8459p8856q5502
$$ 7580095 7567273 7558749 7536803 7478692 7393500 7321110 7238800 7149800 7071341 6992485 6906983
13173F906983q0131r4577r2087r2340r6424q6599q3675q2447q9955j00074j22933
$$ 6906983 6826852 6732275 6640188 6547848 6451424 6364825 6281150 6198703 6108748 6008674 5885741
13162E885741j15790j06700r4806r1560j00802j18469j14377r3265q4810r3461
$$ 5885741 5769951 5663251 5568445 5476885 5376083 5257614 5143237 5049972 4965162 4871701
13152D871701j07132j04109r4182r4663q2094q0461r1138r7684o4796o6738p8131
$$ 4871701 4764569 4660460 4566278 4471615 4389521 4309060 4217922 4120238 4055442 3988704 3910573
13141C910573m4201j8975M957J5533l0154q4927j13341j11230r9990r4081p7890
$$ 3910573 3866372 3847397 3852354 3867887 3837733 3752806 3639465 3528235 3428245 3334164 3256274
13130C256274n1713n2286l7185l8664k9714l8296n7019o0364n4484m2779n7498
$$ 3256274 3204561 3152275 3115090 3076426 3046712 3008416 2951397 2891033 2836549 2793770 2736272
13119B736272n4125n8265l8817m7584m8013k8210k9459k7435l4689m8210l1887
$$ 2736272 2682147 2623882 2585065 2537481 2489468 2461258 2431799 2404364 2369675 2321465 2289578
13108B289578j9161o070k3124k5773k1030k6835j3774j4895j3576k2765j1326
$$ 2289578 2270417 2264347 2241223 2215450 2194420 2167585 2153811 2138916 2125340 2102575 2091249
13097B091249M725J4721L9615M7695M8213M8556J8046k0301n3196l3235r769k1337
$$ 2091249 2095974 2110695 2150310 2198005 2246218 2294774 2312820 2292519 2239323 2206088 2196319 2174982
13085B174982n6542p8956p6469n6610n8594n4513m8838m5459l5050k7512j7088
$$ 2174982 2118440 2039484 1963015 1906405 1847811 1793298 1744460 1699001 1663951 1636439 1619351
13074A619351k5360l0412j7312r395j5953j4884k1959l338m358k3591j2059m089
$$ 1619351 1593991 1563579 1546267 1536872 1520919 1506035 1484076 1480738 1476380 1452789 1440730 1436641
13062A436641O246o677k7032j3267j0064j3848j9681k2496j2376M195j551K690
$$ 1436641 1442887 1436210 1409178 1395911 1385847 1371999 1352318 1329822 1317446 1321641 1320090 1322780
13050A322780K7122L5623L1853K3738J6884j6742l9805n1256m7635l6443m6301
$$ 1322780 1349902 1385525 1417378 1441116 1458000 1441258 1401453 1350197 1302562 1266119 1219818
13039A219818l8069k7807k361q770k8838l0509j5688m859j9418k8233j8427k2402
$$ 1219818 1181749 1153942 1151581 1142811 1113973 1083464 1067776 1062917 1043499 1015266 996839 974437
13027I74437j9479l2160k9964j1715q918k2471j5342n592j1914k4568r489j7394
$$ 974437 954958 922798 892834 881119 872201 849730 834388 828796 816882 792314 782825 765431
13015G65431j2046o906K571n452l6712j9350M130N396j48k1571q724n785j4864
$$ 765431 753385 746479 749050 743598 706886 687536 691666 697062 696914 675343 666619 660834 645970
13002F45970j3514r123q075p758j0572r073l733n808j1283j795j565j2086M241
$$ 645970 632456 623333 615258 607500 596928 587855 584122 578314 567031 565236 563671 551585 555826
12989E55826N752M968j1201k4578q521p657j2814n760O597l152j3549k3318p104
$$ 555826 561578 566546 555345 530767 522246 514589 501775 496015 502612 499460 485911 462593 455489
12976D55489q688o636O789j1561l303p851j2814J5304Q223j4589p839M682q269
$$ 455489 446801 440165 446954 435393 432090 424239 411425 426729 434952 420363 412524 417206 408937
12963D08937n477q731l088j939o33J470K22j1170j5340j2974r691q505k303k479
$$ 408937 403460 394729 391641 389702 389069 390539 390761 379591 364251 351277 341586 333081 330778 328299
12949C28299O65J2064J3227J7465K171o438j0732r413L946p168j0773q939N400
$$ 328299 328964 341028 354255 371720 373891 367453 356721 347308 351254 344086 333313 324374 329774
12936C29774J6752l683K016O365P828J8415K0120J5885J401j0207n692j3429j5606
$$ 329774 346526 342843 344859 351224 359052 377467 397587 413472 414873 404666 398974 385545 369939
12923C69939j0605o034j2201l711l620n436r726n788k043j1999j3597n653N663
$$ 369939 359334 353300 341099 337388 333768 328332 318606 312818 310775 298776 285179 279526 285189
12910B85189J1424J3997N938J7768J3212J8898N081M896p424j9670j2640k3443
$$ 285189 296613 310610 316548 334316 347528 366426 371507 376403 368979 349309 336669 313226
12898C13226j8106J416n919r611q679j8103j4718M126Q111q891j662Q869L002
$$ 313226 295120 296536 290617 281006 272327 254224 239506 243632 251743 242852 241190 250059 253061
12885B53061J2542P887k871o993m47N742j120j0902o029Q104R912N492m477O472
$$ 253061 265603 273490 270619 263626 263179 268921 267801 256899 250870 258974 268886 274378 269901 276373
12871B76373J4032M683K079L626K405Q48P135L992M16J793J6597K9459L2809K0595
$$ 276373 290405 295088 297167 300793 303198 304046 311181 315173 315589 317382 333979 363438 396247 416842
12857D16842K3223M434l1976m5750l1811k870o999j6087L49j1943j4179j4669
$$ 416842 440065 444499 412523 366773 334962 332092 325093 309006 309355 297412 283233 268564
12845B68564o211O883J0433J0272R263j858M994O317J3370J8658J9153K5528K9408
$$ 268564 262353 269236 279669 289941 299204 297346 302340 308657 322027 340685 359838 385366 414774
12832D14774R207j9658j9153k5886k7981k3792j1747j8906j4247N512p794n986
$$ 414774 423981 404323 385170 359284 331303 307511 295764 276858 262611 268123 260329 254343
12820B54343l57p202p520L902j1491q139Q120m447n71r268o495k872M335K110
$$ 254343 253986 246784 239264 243166 231675 223536 231656 227209 226638 217370 210875 208003 212338 214448
12806B14448P314P187j3239k1992k199N268l59K286j0120K924Q09P829J008O457
$$ 214448 221762 228949 215710 193718 191519 196787 196428 198714 188594 191518 192327 200156 201164 207621
12792B07621j4687j7430m431O822m115k685J6378Q596o027Q365N880k262j2979
$$ 207621 192934 175504 171073 177895 173780 171095 187473 196069 190042 198407 204287 202025 189046
12779A89046K10O354r243n627m206M575R468J0310k509p053j1347R007q856p04
$$ 189046 189256 195610 186367 180740 176534 181109 190577 200887 198378 191325 179978 188985 180129 179425
12765A79425r332L987K0053K149p811n342n556l760N73J2293R931r874j0956J3701
$$ 179425 170093 174080 194133 196282 188471 183129 177573 173813 174386 186679 196610 186736 175780 189481
12751A89481m040r519P459R144J599N237k805j5484k0144Q468O356k4539k597
$$ 189481 185441 175922 183381 192525 194124 199361 196556 181072 160928 169396 175752 151213 148616
12738A48616J4809J1783R14q180n692Q707P282J2660J0978R08N759j397N282N466
$$ 148616 163425 175208 176122 167942 162250 170957 178239 190899 201877 202785 208544 207147 212429 217895
12724B17895n181j7213K176P258j4972n138n07M432L747Q025J0215L377P15M66
$$ 217895 212714 195501 197677 204935 189963 184825 184318 188750 192497 200522 210737 214114 214829 215295
12710B15295k38j0647q910j0735o170r690L261R942K650q233l062k819m904j1519
$$ 215295 215057 204410 195500 184765 178595 168905 172166 182108 184758 176525 173463 170644 165740 154221
12696A54221j8833L636L322K453K7211J2989J3435R48L062K644j749K499O820
$$ 154221 135388 139024 142346 144799 172010 184999 198434 199382 202444 205088 203339 205838 212658
12683B12658k74J2777q080j6738m598k113L122N674J778k477J2578O055O26n379
$$ 212658 212384 225161 217081 200343 195745 193632 196754 202428 204206 201729 214307 220362 220988 215609
12669B15609r90m478p538N916O010J4314L756n3l038L983P361j2517K109Q001
$$ 215609 214619 210141 202603 208519 214529 228843 232599 232546 229508 233491 240852 228335 230444 238445
12655B38445j2625J7391L2522P956Q167L049l879n107j926L181J0548L519j8996
$$ 238445 225820 243211 275733 283689 291856 294905 291026 285919 283993 287174 297722 301241 282245
12642B82245o262j3244j4692j928K716r489m364M60J7070p464j949K4671Q455
$$ 282245 275983 262739 248047 246119 248835 239346 234982 235442 252512 245048 243099 267770 276225
12629B76225L220K320M589O188P034o287n01N277J3108L1836K1904K6845L2318
$$ 276225 279445 281765 286354 292542 299576 293289 292788 298065 311173 343009 364913 391758 424076
12616D24076L3119M0536M7153P0702J03410J05509J12380P1456L1095K6153J5764
$$ 424076 457195 497731 544884 615586 718996 824505 936885 1008341 1039436 1065589 1081353
12605A081353j0811o2042r3785j08244j02760p6557o4135o1860l6852l6441j6816
$$ 1081353 1070542 1008500 914715 806471 703711 627154 563019 501159 464307 427866 411050
12594D11050j5465K753L8954N7419O5071Q6985Q4201L5799k6301n8276n5816l2813
$$ 411050 395585 398338 437292 494711 559782 646767 730968 766767 740466 682190 626374 593561
12582E93561j1940j4237J9653M5177N1560M1748K2890k2289m9900o8220p6660
$$ 593561 581621 567384 587037 632214 683774 725522 748412 726123 676223 608003 531343
12571E31343p5715m5208l3299k1494j0265L809P270J7176Q832K1070P621j3722
$$ 531343 455628 410420 377121 355627 345362 349171 356441 373617 382449 403519 411140 397418
12559C97418l2662j5375k9763k5897l650p840j3230o489J2459M270J126j118j3266
$$ 397418 364756 349381 319618 293721 290071 282231 269001 262512 274971 279241 280367 279249 265983
12546B65983K19k735j4021O202j349M04O885K054N373m647Q252J2491J4569L2166
$$ 265983 266202 263467 249446 255648 254299 254703 261588 263642 269015 264368 272620 285111 299680 331846
12532C31846L5595K6660j1665r150j7181l0776l1188k4588p001k670L529q235
$$ 331846 367441 394101 382436 373286 356105 325329 294141 269553 262552 259882 263411 255176
12520B55176k410j5845j2685Q392r253q10Q343p163l914j5300j365J9807m44j9477
$$ 255176 252766 236921 224236 232628 223375 222565 230908 223745 219831 204531 203166 222973 222529 203052
12506B03052j5778O469P452J0812O962j436o445j604J7212J0612O438k440J0556
$$ 203052 187274 193743 201195 212007 218969 217533 211088 209484 226696 237308 243746 241306 251862
12493B51862K7644J1246K0592P938o314j3342j8029k3913j2602m291J653K740
$$ 251862 279506 290752 311344 319282 312968 299626 281597 257684 245082 240791 242444 245184
12481B45184N367K7303J6722m825J9994K7924J0298J2353J5033J3065j1342q213
$$ 245184 250551 277854 294576 289751 309745 337669 347967 360320 375353 388418 377076 368863
12469C68863j1117j2061r431Q51M867J9524M4470O2875N0534J7181p968k6521
$$ 368863 357746 345685 336254 337105 341972 361496 405966 468841 519375 536556 528588 502067
12457E02067m5923l0775l1339k4518j3029q666k476J2865q75j6410k0329j3472
$$ 502067 456144 425369 394030 369512 356483 347817 345341 358206 357331 340921 320592 307120
12445C07120p663K595L40J008J3165J7846J8482K8850J6997K2496J0831P777j3081
$$ 307120 299457 302052 302392 303400 316565 334411 352893 381743 398740 421236 432067 439844 426763
12432D26763k4244k7060k1523j4919r429l256K413L5820N0914N0529O0998M5748
$$ 426763 402519 375459 353936 339017 329588 326332 328745 364565 415479 466008 527006 572754
12420E72754J5679j3188m0007l2933l8158k8887k9518k3543l4845k0465k7767
$$ 572754 588433 575245 535238 502305 464147 435260 405742 382199 347354 326889 299122
12409B99122q546r776J196n591n210N504J112N037J5501R325K2370J4276J2828
$$ 299122 290576 280800 281996 276405 271195 276699 277811 282848 298349 307674 330044 344320 357148
12396C57148m181l1492p198Q852l275j3113m934n176j4557R673K8617L338k1242
$$ 357148 352967 321475 314277 323129 319854 306741 301807 296631 282074 291747 320364 323702 302460
12383C02460o178Q064R717p374k2322k7559j8411n961j1701k3865O109L832k723
$$ 302460 296282 304346 314063 306689 284367 256808 238397 232436 220735 196870 202979 206811 204088
12370B04088L098l335j6918n99K280r129r251N069n06o876l455j1236k087k441
$$ 204088 207186 203851 186933 186334 188614 179485 170234 175303 174797 167921 164466 153230 151143 148702
12356A48702l656J5647J146R05Q975J4394J1159J2320N303l210L262K257j8768
$$ 148702 145046 160693 161839 162744 171719 186113 197272 209592 214895 211685 214947 217204 198436
12343A98436j5415q931J9753P594j7601p580j8644o263M877J409L533j1862j0195
$$ 198436 183021 174090 193843 201437 183836 176256 157612 151349 156226 157635 161168 149306 139111
12330A39111m027J305l350J304j4293j1961o789p525L570K5484N655k845N093
$$ 139111 135084 136389 133039 134343 120050 108089 101300 93775 97345 122829 128484 125639 130732
12317A30732J3807p57j7869q416k396o295l523n065p934P95R082P970j8406R10
$$ 130732 144539 143782 125913 117497 115101 108806 105283 100218 92284 93079 102161 110131 91725 92635
12303I2635J6898j0066j98J2413k78J982J738R45o143j7108R997O2q83L756j963
$$ 92635 109533 99467 99269 111682 111404 113386 115124 116069 109926 92818 102815 102877 101994 105750 103787
12288A03787N617N948O508J5679K12K2615M868R473J3911J7380J3015R101M752
$$ 103787 109404 115352 121860 137539 137751 160366 165234 174707 188618 205998 219013 228114 232866
12275B32866k566j7157j5324j4624q971j1824j5240K208K630j4201J891o408o042
$$ 232866 230300 213143 197819 183195 174224 162400 147160 149368 151998 137797 139688 133280 127238
12262A27238P513k808R376p518j7748J009J1489l908n145k172R054J4432M789
$$ 127238 134751 131943 141319 133801 116053 117062 128551 124643 119498 117326 126380 140812 145601
12249A45601k777K0265J7690R230k598m032q15j3653k1104j1570l444L626l271
$$ 145601 142824 163089 180779 190009 187411 183379 182564 168911 147807 136237 132793 136419 133148
12236A33148N751l479m570M277N779R382k400n768K951j394j8112q028M687J5270
$$ 133148 138899 135420 130850 135127 140906 150288 147888 142120 145071 143677 125565 117537 122224 137494
12222A37494N981m037Q073Q858J0844K9532K9372K0276L1067M876J523j5192j7651
$$ 137494 143475 139438 147511 156369 167213 196745 226117 246393 277460 282336 283859 268667 251016
12209B51016j2883l3361j7237q008p889L733k862j0252j6233j0274J0993J3141
$$ 251016 238133 204772 187535 179527 171638 175371 172509 162257 146024 135750 146743 159884
12197A59884N226P116o885N685p737k4244j6845m126q51l717K268K832R671R470
$$ 159884 165110 172226 165341 171026 163289 139045 122200 118074 117223 113506 115774 118606 128277 137747
12183A37747P632K282j3670p979k929M544J0217q070q482m030J629J1969J5115
$$ 137747 145379 147661 133991 126012 123083 127627 137844 129774 121292 117262 118891 130860 145975
12170A45975J0991P76j849J0826K2168O742r33K6541K8979J8372K2421J4310J988
$$ 145975 156966 157742 155893 166719 188887 195629 194696 221237 250216 268588 291009 305319 307307
12157C07307R468j298j1739J3175O792J7295L0719J5147m428r158n438m203R000
$$ 307307 316775 315477 303738 316913 323705 341000 371719 386866 382438 373280 367842 363639 372639
12144C72639O093N750M575l745q533j8792j7184j3041j4832k3642j8618m007j4514
$$ 372639 378732 384482 389057 385312 376779 357987 340803 327762 312930 289288 270670 266663 252149
12131B52149k5680j7441l92N055j1523j3802J958K108j3526p279o624j2047j1650
$$ 252149 226469 209028 208636 213691 202168 188366 190324 192432 178906 171627 165003 152956 141306
12118A41306N069K109J5949K2340J0201P992j631j6903j9411q274J9136N755n997
$$ 141306 146375 148484 164433 186773 196974 204966 203335 186432 167021 158747 177883 183638 177641
12105A77641k153j1518o032L584J3963J467Q361K416j2406o465P955O554J722
$$ 177641 175488 163970 157938 161522 175485 176952 185313 187729 175323 168858 176813 183367 185089
12092A85089J7991N514m208Q920j0653j0530l747n437j8337o637l865m9J0273
$$ 185089 203080 208594 204386 213306 202653 192123 188376 182939 164602 157965 154100 154051 164324
12079A64324R567J093o760Q43O098l606O114o193N96L749R42n402k940J0155J2390
$$ 164324 173891 174984 168224 169067 175165 171559 177673 171480 172076 175825 176767 171365 168425 178580 190970
12064A90970N516N15p896j0287L42L303p86k9250k1269J2690J8237Q550L397k798
$$ 190970 196486 197001 189105 178818 179160 182463 181677 152427 131158 143848 162085 170635 174032 171234
12050A71234q157R67K1046m349r218r32j9245j1523N319P640j0036j4382m596
$$ 171234 163077 164044 185090 180741 171523 170591 151346 139823 145142 152782 142746 128364 123768
12037A23768q614R551J0763J703m497j2509q039J4395J9408J7148J3889M483j2628
$$ 123768 115154 124705 135468 137171 132674 120165 112126 126521 145929 163077 176966 181449 168821
12024A68821m875K452J0812L978P837o696k128r698n209o103j4700j5664J435
$$ 168821 163946 166398 177210 181188 189025 182329 180201 170503 165294 159191 144491 128827 130262
12011A30262K3371J423o348O122O94j8356n510N009J44j0516L621k080r185j301
$$ 130262 153633 155056 148708 154830 155524 137168 131658 136667 136811 126295 129916 127836 118651 117350
11997A17350J655O219J1570J2204P258j0370p74J8110R256q719j1709j2824J2703
$$ 117350 119005 125224 136794 148998 156256 145886 145112 163222 172478 163759 152050 139226 151929
11984A51929L266q066O568j1726Q780Q125M733m323j967J3374l62l616L179r23
$$ 151929 155195 147129 153697 141971 150751 158876 163609 159286 157319 170693 170331 166715 169894 168971
11970A68971j0078J0400O737J3824q850j0649N817q004j8928j3204R195j1620
$$ 168971 158893 169293 176030 189854 181004 170355 176172 168168 149240 136036 145231 133611
11958A33611j3747J6530L888L719k155l048K609J611Q867J344J653O477Q153J4426
$$ 133611 119864 136394 140282 144001 141846 138798 141407 143018 151885 153229 154882 161359 169512 183938
11944A83938m340j839l308k459l689j1816j0156n503j345j5682k544J2182J2212
$$ 183938 179598 177759 174451 171992 168303 156487 146331 140828 139483 123801 121257 133439 145651
11931A45651R664j2623j7133j535K167L681Q163Q81R932o489k21Q464P221r484
$$ 145651 155315 142692 125559 124024 126191 129872 138035 138916 148848 142359 142138 150602 157823 148339
11917A48339K409L426N732n128O28O985J3246n326j5305o548j0364r391L435J0609
$$ 148339 150748 154174 159906 154778 155406 162391 175637 170311 155006 148458 138094 128703 132138 142747
11903A42747K587K427O668J0280j270R670J364j0261j072O774L16L382Q690q11
$$ 142747 145334 147761 154429 164709 163439 173109 174473 164212 163140 169914 170230 173612 182302 181491
11889A81491m003j4275O614q751j414O908J3157K577Q827J525L731J58J3481J2522
$$ 181491 177488 163213 169827 161076 159662 166570 179727 182304 191131 192656 196387 196545 210026 222548
11875B22548j674L39k671j1448p915j0079j1543J5p500k551J0784R815j0415j4949
$$ 222548 220874 221213 218542 207094 199179 189100 177557 177572 170072 167521 178305 188120 177705 162756
11861A62756J1R093k976R144J6881J6870N360Q643P022J0820J0539o605K063n731
$$ 162756 162767 171860 168884 178028 194909 211779 217139 225782 232804 243624 254163 247558 249621 243890
11847B43890q930r974L5O673L104j460l306j6891q541l691j4062j3232j239M911
$$ 243890 234960 224986 225021 231694 234798 233338 230032 213141 204600 200909 186847 173615 172376 177287
11833A77287K501Q144J0869j25j585j913k078p965o3J6368J5354J9300J1715L681
$$ 177287 179788 187932 198801 198676 197091 195178 193100 185135 185072 201440 216794 236094 247809 251490
11819B51490O207k540j0170M258m219l740K664J0937N246l167j4407k094L34n71
$$ 251490 257697 255157 244987 249245 245026 241286 243950 254887 260133 256966 242559 240465 240799 240228
11805B40228K967j2326k6001L888J694o895L34N641J0064O045m974M876l242m904
$$ 240228 243195 230869 204868 208756 210450 203555 203889 209530 219594 225639 220665 225541 222299 217395
11791B17395K321N623Q470J453j5275N46J6969K400n044J2045j871k1419j7078
$$ 217395 219716 225339 233809 235262 219987 220533 237502 239902 234858 246903 245032 223613 206535
11778B06535J192K371l178j3205l756J002p097m445N290J0658j798R363Q869l736
$$ 206535 207727 210098 206920 193715 189959 190961 183864 179419 184709 195367 193569 202932 211801 208065
11764B08065L703n731o850M591Q025J3224N970O305m621q26m784p436R90j977
$$ 208065 211768 206037 199187 203778 211803 225027 230997 237302 232681 231855 227071 219635 220625 218648
11750B18648r930O377j2371n908J8460L914j3509j2909L378J890j991j5172j5318
$$ 218648 208718 215095 202724 196816 215276 219190 205681 192772 196150 198040 196049 180877 165559
11737A65559M206J0041k203K305p87K40M442L607k493q499j7349N234N524J1335
$$ 165559 169765 179806 177603 179908 179121 179361 183803 187410 184917 176418 159069 164303 169827 181162
11723A81162L297p757K511k56O833K353J000K6455P366k2543n03J5992K1079J962
$$ 181162 184459 176702 179213 178957 185790 188143 189143 215598 222964 200421 199918 215910 236989 238951
11709B38951j2831r337J5460K732P304k080o320O268r010Q41J224J771l414q525
$$ 238951 226120 216783 232243 234975 242279 240199 233879 240147 231137 231978 233202 234973 231559 223034
11695B23034N50J1600K1031L0799J4476L244r381K499R940J2528K6535q4n473
$$ 223034 223584 235184 256215 287014 301490 304734 295353 297852 307792 320320 346855 346771 341298
11682C41298j5367k336k93j4076j4265m604L022m014J7044L235M561J2554J8008
$$ 341298 325931 323595 323302 309226 294961 290357 293379 289365 306409 309644 314205 326759 344767
11669C44767J311L984K0191L2856L6545L887L777K4655R605N608P170Q977O502
$$ 344767 346078 350062 370253 403109 439654 443541 447318 471973 481578 487186 494356 503333 509835
11656E09835J5667M1683L4621M1717L4314L5727N9245Q0531J20480J47195J77780
$$ 509835 525502 567185 601806 643523 677837 713564 772809 853340 973820 1121015 1298795
11645A298795K22534K51741K53368K27177J76078Q6940k9525j06638j60460j83189
$$ 1298795 1521329 1773070 2026438 2253615 2429693 2516633 2487108 2380470 2220010 2036821
11635B036821j94705j73038j19153q8935n4435l1358j6831K5689N4612J04364
$$ 2036821 1842116 1669078 1549925 1460990 1406555 1375197 1358366 1384055 1438667 1543031
11625A543031J45045K11709K72623L57688M51874N23712N50636M95494L24277
$$ 1543031 1688076 1899785 2172408 2530096 2981970 3505682 4056318 4551812 4876089
11616D876089J15491j10631l15632m26859m64770m55744m00389l31345k72315
$$ 4876089 4991580 4880949 4565317 4138458 3673688 3217944 2817555 2486210 2213895
11607B213895k09611j55537j23147q9997m5474j1384K3779P7949J07949J64116
$$ 2213895 2004284 1848747 1725600 1635603 1590129 1578745 1602524 1680473 1788422 1952538
11597A952538K17651K71792K99449K59435J85166O7810o3369j83084k34533k48896
$$ 1952538 2170189 2441981 2741430 3000865 3186031 3253841 3190472 3007388 2772855 2523959
11587B523959k35978k10102j72089j46238j13787q1991m4845j5856n077J7842
$$ 2523959 2287981 2077879 1905790 1759552 1645765 1563774 1518929 1503073 1497996 1515838
11577A515838O5700J22397J77343K20208L04641M13691N04496N97192O17752N55236
$$ 1515838 1581538 1703935 1881278 2101486 2406127 2819818 3324314 3921506 4539258 5094494
11567E094494L95058J56463j29098l27406m51216m85921m51875l75935k93081
$$ 5094494 5489552 5646015 5516917 5189511 4738295 4252374 3800499 3424564 3131483
11558C131483k31352j57518p4893r146N5918J28583K09798L14371M36351N80504
$$ 3131483 2900131 2742613 2667720 2658574 2714492 2843075 3052873 3367244 3803595 4384099
11548D384099P84865R88529J156111J221419J077090P28765K03920l50989p72737
$$ 4384099 5168964 6157493 7313604 8535023 9612113 10340878 10544798 10193809 9421072
11539I421072j030021j093836j016933q73178p25169n63245m20401l32134k37641
$$ 9421072 8391051 7297215 6280282 5407104 4681935 4118690 3698289 3366155 3128514
11530C128514j55086r0134j6549M7472J24071K28885L17652M26056N12181N41187
$$ 3128514 2973428 2883294 2866745 2914217 3038288 3267173 3584825 4010881 4523062 5064249
11520E064249M80132L02461P0607j88186l93940n17616n64029n27133m68348m00877
$$ 5064249 5544381 5846842 5917449 5729263 5335323 4817707 4253678 3726545 3258197 2857320
11510B857320l35944k62886k02578j62616j17895p3390n7706j6514P247K7408
$$ 2857320 2521376 2258490 2055912 1893296 1775401 1702011 1644305 1627791 1635038 1662446
11500A662446O9601J42483J94326K74782L35176L48573L16049K00804O1111r8276
$$ 1662446 1732047 1874530 2068856 2343638 2678814 3027387 3343436 3544240 3605351 3507075
11490C507075k29825k99673l00654k55942k30573j72620j31953r1963m5854k826
$$ 3507075 3277250 2977577 2676923 2420981 2190408 2017788 1885835 1793872 1748018 1745192
11480A745192K7459P2891J17856J60068K28814L20673M28590N34325O17397O31135
$$ 1745192 1772651 1845542 1963398 2123466 2352280 2672953 3101543 3635868 4253265 4884400
11470D884400N52552L64273R8462k01049m26311n55274n75762n45503m76175l90328
$$ 4884400 5436952 5801225 5899687 5698638 5272327 4717053 4141291 3595788 3119613 2729285
11460B729285l02598k21753j61324j24863q1571m2676O68K1836Q1843J25011J65455
$$ 2729285 2426687 2204934 2043610 1918747 1837176 1794500 1795168 1817004 1898847 2023858 2189313
11449B189313K17750K53707K40277K02648J31391J4774j05728k11604k74648k92473
$$ 2189313 2407063 2660770 2901047 3103695 3235086 3249860 3144132 2932528 2657880 2365407
11439B365407k78577k45222k06464j78702j35532j15203r5098p2272o4204m5332
$$ 2365407 2086830 1841608 1635144 1456442 1320910 1205707 1110609 1038337 974133 928801
11429I28801m1681l0625m1181j5271k4563k9238p954P899K42j9711j8301o326
$$ 928801 887120 856495 815314 800043 775480 746242 738288 746187 746429 726718 708417 702091
11417G02091K378j249p869j6023L615m532j8422J50J429j1293n285k2571m928
$$ 702091 704469 703220 695351 679328 682943 678411 659989 660139 661568 650275 644990 622419 617491
11404F17491K566j959J3462K315j3636r035K2085P282O32M810J5749j966j2874
$$ 617491 620057 618098 631560 633875 620239 611204 633289 640571 641203 646013 661762 659796 646922
11391F46922p91J0812J1032J4825P243L656R303J182k081P50q112l615N750J2606
$$ 646922 646131 656943 667975 682800 690043 693699 703002 704184 702103 702853 694741 691126 696876 709482
11377G09482K5015J5555M375j1379j7889N943R427n507k370J2154P353N623N183
$$ 709482 734497 750052 754427 743048 725159 731102 740529 735022 732652 744806 752159 757782 762965
11364G62965J0331k854R722q59n822J6620J2744J672L015K1570L2987M2854M0301
$$ 762965 773296 770442 780164 779305 773483 790103 802847 804519 807534 829104 862091 904945 945246
11351I45246K1916Q415J4310N227k456l803j3428j2663k7139R10j255k672Q242
$$ 945246 967162 975577 989887 995114 992658 988855 975427 962764 935625 936535 935280 932608 940850
11338I40850q163j009J5402l884j6527P608L756o266o564l817j959J5211Q487
$$ 940850 932687 931678 947080 943196 926669 934277 938033 931767 925203 921386 919427 934638 943125
11325I43125M890m125K923K9479J6307J5499J5416J8251J1116L2872K6644J3617
$$ 943125 948015 943890 946813 976292 992599 1008098 1023514 1041765 1052881 1085753 1112397 1126014
11313A126014L8272N2597L2630K3327R60k7028l6652k9993k7554k8322q769K325
$$ 1126014 1164286 1216883 1249513 1272840 1273800 1246772 1210120 1180127 1152573 1124251 1115482 1117807
11301A117807N987m864J62J9691J8697R840M155J8923K7740K7353K3843L5611
$$ 1117807 1123794 1118930 1119092 1138783 1157480 1167320 1171475 1190398 1218138 1245491 1269334 1304945
11289A304945M3688L7096M2152L4099O004k0668k4501l1355l6142k7361m1304
$$ 1304945 1348633 1385729 1427881 1461980 1467984 1447316 1422815 1391460 1355318 1327957 1286653
11278A286653k9607o861m904K892J5622J4992J3747l104J5557L0896L6187K6548
$$ 1286653 1257046 1250185 1245281 1248173 1263795 1278787 1292534 1289430 1304987 1335883 1372070 1398618
11266A398618J731J397J0958O708N363J9999J3281N121P477K2816J7857K6518
$$ 1398618 1400349 1401746 1412704 1419412 1424775 1444774 1458055 1463176 1470653 1493469 1511326 1537844
11254A537844K9325K9189L8015M7624L7988M9841O5039O5985P3844N8179J6063
$$ 1537844 1567169 1596358 1634373 1681997 1719985 1769826 1834865 1900850 1974694 2032873 2048936
11243B048936J4303J0579J0136N378K600J3592J6314L5624L5025K6229L8496N9852
$$ 2048936 2063239 2073818 2083954 2089332 2091932 2105524 2121838 2157462 2192487 2218716 2257212 2317064
11231B317064N3807O0147P1803N3727P4827Q4070R6035R2688R3887J04821J20293
$$ 2317064 2370871 2431018 2502821 2556548 2631375 2715445 2811480 2904168 2998055 3102876 3223169
11220C223169J13208J34097J30534J46015J65967J78387J71888J72681J79257
$$ 3223169 3336377 3470474 3601008 3747023 3912990 4091377 4263265 4435946 4615203
11211D615203J67445J77380J61078J50981J40778J51309J46936J34662J09399
$$ 4615203 4782648 4960028 5121106 5272087 5412865 5564174 5711110 5845772 5955171
11202E955171Q1334Q3140Q4513O0094M9870M0598M6544N6333L2888J9816K0229
$$ 5955171 6036505 6119645 6204158 6264252 6314122 6354720 6401264 6457597 6490485 6510301 6530530
11191F530530J1911k072k6459k6474k8806o6225q8740j06341j19370j27428j44853
$$ 6530530 6542441 6540369 6513910 6487436 6458630 6392405 6303665 6197324 6077954 5950526 5805673
11180E805673j56122j44061j58110j48935j40358j37494j30712j23404j35620
$$ 5805673 5649551 5505490 5347380 5198445 5058087 4920593 4789881 4666477 4530857
11171D530857j27487r3109p7202p0348o2609o0834n5923l3004k1395l9324j4880
$$ 4530857 4403370 4310261 4233059 4162711 4100102 4039268 3983345 3950341 3928946 3889622 3874742
11160C874742M029J8416Q955J2499K6248M6544N0186L8429M1070P2247R5523J02907
$$ 3874742 3878771 3897187 3906142 3918641 3944889 3991433 4041619 4080048 4121118 4193365 4288888 4391795
11148D391795J09666J16808J25012J41150J48012J69458K05375K15420K26365
$$ 4391795 4501461 4618269 4743281 4884431 5032443 5201901 5407276 5622696 5849061
11139E849061K43387K52768K63892K77316K89352K98965L10214K91453K93098
$$ 5849061 6092448 6345216 6609108 6886424 7175776 7474741 7784955 8076408 8369506
11130H369506K81447K86934K75924K65231K52221K37194K22696K19805J90337
$$ 8369506 8650953 8937887 9213811 9479042 9731263 9968457 10191153 10410958 10601295
11121A0601295J74300J59475J21630J19827J00977O8928M8567K5520J0570j1101
$$ 10601295 10775595 10935070 11056700 11176527 11277504 11346432 11394999 11420519 11431089 11419988
11111A1419988l6418o4931j04445j05762j12927j57709j72841j97979k15588k19921
$$ 11419988 11383570 11318639 11214194 11108432 10995505 10837796 10664955 10466976 10251388 10031467
11101A0031467k47829k71523k59811k71149k96829k93128k89724k81906k62697
$$ 10031467 9783638 9512115 9252304 8981155 8684326 8391198 8101474 7819568 7556871
11092G556871k65358k69521k75873k49011k30018k20195k03059k02128j98055
$$ 7556871 7291513 7021992 6746119 6497108 6267090 6046895 5843836 5641708 5443653
11083E443653j65251j45103j35641j28167j26920j14256q9098p6320q1361n8110
$$ 5443653 5278402 5133299 4997658 4869491 4742571 4628315 4539217 4462897 4381536 4323426
11073D323426n6727l3385k1897l3912q629j2966N0J2304J9088K3975K1577N0157
$$ 4323426 4266699 4233314 4211417 4177505 4168876 4155910 4155960 4168264 4187352 4211327 4232904 4283061
11061D283061P4421P3117O7894O9559Q6870J17315J23701J08920J24212J47288
$$ 4283061 4357482 4430599 4498493 4568052 4654922 4772237 4895938 5004858 5129070 5276358
11051E276358J48135J64472J54654J33481J42264J51223J43810J41257J21414
$$ 5276358 5424493 5588965 5743619 5877100 6019364 6170587 6314397 6455654 6577068
11042F577068J04974Q9215Q0493N4402L7672L0654K0722K788j2397j5104k1750
$$ 6577068 6682042 6771257 6851750 6906152 6943824 6974478 6995200 6997988 6985591 6970487 6948737
11031F948737l9906k9132m7461n4716o8590p2510o5396r4605j10591j22323j55519
$$ 6948737 6908831 6879699 6832238 6777522 6708932 6636422 6571026 6476421 6365830 6243507 6087988
11020F087988j63745j46571j69524j94775j91155j78091j72136j71653j63587
$$ 6087988 5924243 5777672 5608148 5413373 5222218 5044127 4871991 4700338 4536751
11011D536751j57280j59517j66344j41931j35393j31782j24373j23855j15830
$$ 4536751 4379471 4219954 4053610 3911679 3776286 3644504 3520131 3396276 3280446
11002C280446r8137p8179r2053q4399p1429p0050o7346n3442o9779o2473m2346
$$ 3280446 3182309 3104130 3012077 2927678 2856249 2786199 2718853 2665411 2595632 2533159 2490813
10991B490813m6130l1816j8025l2001k5723k4773l0513m5637k9996j7131j4834
$$ 2490813 2444683 2412867 2394842 2362841 2337118 2312345 2281832 2236195 2206199 2189068 2174234
10980B174234q448k846n187k918n19k6012j8420r857j0097Q72K616j235K112M213
$$ 2174234 2165786 2162940 2157753 2154835 2154316 2128304 2109884 2100027 2089930 2090802 2093418 2092183 2094295 2098508
10966B098508K487p763n655k653j8256j163n440P675L877j6010p777n40K181j422
$$ 2098508 2100995 2093232 2087577 2084924 2066668 2065505 2060065 2067740 2071617 2055607 2047830 2047290 2049471 2048049
10952B048049j3500r976l276Q052m728p153m664j0419q322o525j1490J2442Q016
$$ 2048049 2034549 2024573 2021297 2029349 2024621 2017468 2012804 2002385 1994063 1987538 1976048 1988490 1996506
10939A996506j3397j6669j2577m098l280j591r310L991j0835L013p41p675k1848
$$ 1996506 1983109 1966440 1953863 1949765 1946485 1944894 1935584 1939575 1928740 1931753 1931012 1923337 1901489
10926A901489p017o390K766J2171J5961M152j8253k0162o950n384l183J2552R564
$$ 1901489 1894472 1888082 1890848 1903019 1918980 1923132 1904879 1884717 1877767 1872383 1869200 1881752 1891316
10913A891316k758J354O13K677Q593J7770J4487L0085L9769K8972j469l273l0930
$$ 1891316 1888558 1889912 1890525 1893202 1901795 1919565 1934052 1964137 2003906 2032878 2031409 2028136 1997206
10900A997206l4598j9435r249j1287j2875j2680m412r512j4019l464J932l189
$$ 1997206 1962608 1943173 1933924 1922637 1909762 1897082 1892670 1883158 1869139 1865675 1867607 1864418
10888A864418P149L124m006j423N475P991O085R228J709P779k759p488o677J1297
$$ 1864418 1871567 1874691 1870685 1869262 1874737 1882728 1888813 1898041 1899750 1907529 1904770 1897282 1890605 1901902
10874A901902K2818K5714K1325J076J0438K6360j8647j5425K662j0765j4133j3973
$$ 1901902 1924720 1950434 1971759 1972835 1983273 2009633 1990986 1975561 1978223 1967458 1953325 1939352
10862A939352j980R244p109n76p46q217j0713M78J4551K8895J1962K358j7233
$$ 1939352 1937372 1946616 1939507 1938931 1938185 1929968 1919255 1919733 1934284 1963179 1975141 1977499 1960266
10849A960266k440K7289K4602K9137N0180N7867P1656O6072M9823J2107j9608
$$ 1960266 1957826 1985115 2009717 2038854 2089034 2146901 2218557 2284629 2334452 2346559 2326951
10838B326951m4291o1946n9028o0153m7670k3930j7267j7596o064r378k5322o040
$$ 2326951 2282660 2220714 2161686 2101533 2053863 2029933 2012666 1995070 1989006 1979628 1954306 1948266
10826A948266j3819p435j4570q319k6182q379N158n656o032k2773o467j1670k3542
$$ 1948266 1934447 1927012 1912442 1904123 1877941 1869562 1874720 1869064 1863032 1840259 1833792 1822122 1798580
10813A798580k0486k3435j5599j1925p02L987l828k430K434n96q257Q945M333
$$ 1798580 1778094 1754659 1739060 1727135 1726433 1730420 1726592 1724162 1726596 1726000 1717743 1726688 1731021
10800A731021j0387k0150k0730k6249k5194j7583r821r065k7854k917K093o773
$$ 1731021 1720634 1700484 1679754 1653505 1628311 1610728 1600907 1591842 1563988 1561071 1563164 1556391
10788A556391j7268m318r011n141O86K5895K1504J9386K0147J5122R970n160q258
$$ 1556391 1539123 1534805 1525794 1520653 1521339 1547234 1568738 1588124 1608271 1623393 1633363 1628203 1619945
10775A619945k1676j5471L133j0831j4012j2260l0988j6750q936j5221j9688p621
$$ 1619945 1598269 1582798 1585931 1575100 1561088 1548828 1517840 1501090 1492154 1476933 1457245 1449624
10763A449624j906n247K010K840j3995j7510p70k96q96j1311r454j1453j1470
$$ 1449624 1447718 1442471 1444481 1447321 1433326 1415816 1415046 1414750 1413854 1402543 1393089 1381636 1370166
10750A370166L925j1049L999Q405J1640J241j0842j6582j7118m274K459j7599
$$ 1370166 1374091 1363042 1367041 1375446 1387086 1388327 1377485 1360903 1343785 1339511 1341970 1324371
10738A324371l1346j0425P260j984j6705j6241m847j2295j6628j862o101r364
$$ 1324371 1293025 1282600 1289860 1287876 1271171 1254930 1250083 1237788 1221160 1219298 1213197 1203833
10726A203833p387K171r983p918j3226j3219p820J4705j437j9001j2054J743O261
$$ 1203833 1196446 1198617 1188634 1180716 1167490 1154271 1146451 1161156 1159719 1140718 1128664 1130407 1136668
10713A136668J919q742j4258j5984j0301q961p573o763q948n074j4982p312Lk035
$$ 1136668 1138587 1129845 1115587 1099603 1089302 1080341 1072768 1066005 1057057 1051983 1037001 1029689 1029692 1027657
10699A027657P507J1873o529j1331j9313n908k183R34p773j9270j1907J44j0071
$$ 1027657 1035164 1047037 1040508 1029177 1009864 1003956 1001773 1002707 994934 975664 963757 963901 953830
10686I53830L597M05j8331r417k0552L81N098o243l226P40j0947N911P772J1231
$$ 953830 957427 957832 939501 930084 909532 909913 915011 908768 905542 906282 895335 901246 909018 920249
10672I20249j1785N537L49k900L07j1479j5464m848l877j7421r858Q39q819j0329
$$ 920249 908464 914001 914350 911450 911757 900278 884814 879966 876089 858668 848810 849649 840830 830501
10658H30501j0364J6163K0218r261Q264R956j0946k8798l813J633J7781N047k09
$$ 830501 820137 836300 856518 847257 855521 865477 854531 825733 821920 823553 841334 846381 846172
10645H46172p140j008m207m789K198r407j0882l707K606J1741R075l308P546P509
$$ 846172 839032 838024 833817 829028 831226 821819 810937 807230 809836 821577 830652 827344 834890 842399
10631H42399j7134k4680j7409p037m575J92N115J2154L126j2502p857j5351q154
$$ 842399 825265 800585 783176 776139 771564 771756 776871 789025 792151 779649 771792 756441 748287
10618G48287N860m76l818r80P008O70n580M983R128K664k933N746k138j0272Q197
$$ 748287 754147 753671 749853 748873 755881 756551 750971 755954 765082 767746 764813 770559 768421 758149 766346
10603G66346J5142J0917k053M70O299J525J997j6788j3937J203J659j612M269
$$ 766346 781488 792405 790352 790822 797121 798646 800643 783855 769918 771121 772780 771168 775437
10590G75437k095L666N820p579Q81n481j5875r502l60Q962N73p569j0401k1255
$$ 775437 773342 777008 782828 775249 776130 770649 754774 745272 744912 753874 754447 746878 736477 715222
10576G15222k7553p297J056k1200l976n754j2770O241j767j786Q550K4159K189
$$ 715222 687669 680372 681428 660228 656252 650498 637728 643969 642202 640416 648966 673125 675314
10563F75314n198Q729O186R731P518J2909J0102k704m993n195J2198l23q518p470
$$ 675314 670116 678845 685031 694762 702280 715189 725291 722587 717594 712399 724597 724274 715756 708286
10549G08286j593k798R133J2739k093q926q405Q263o311j927j2627k2422j9559
$$ 708286 706693 703895 713028 725767 723674 714748 706343 714606 708295 706368 693741 671319 651760
10536F51760j7351p784j731j94Q52n948O00k446r466j4727j7472N381J3333l076
$$ 651760 634409 626625 624894 624700 625552 619604 620204 617758 608292 593565 576093 581474 594807 591731
10522E91731p920K909J2052m813q038J967J5239J4550R007j8748j7032m714P36
$$ 591731 583811 586720 598772 593959 585921 587888 603127 617677 626684 607936 590904 586190 586926
10509E86926Q047j572N993M160p406J803P201k878K283R274l346r564p310J3539
$$ 586926 594973 593401 599394 603554 596148 597951 605152 602274 604557 613831 610485 600921 593611 607150
10495F07150J3168o0j2837p077q124q43j4583j3007K088J4660O644p672o35L517
$$ 607150 620318 620258 607421 600344 592220 591377 576794 563787 565875 580535 587179 579507 578872 582389
10481E82389M64n597P85n54j717k810r463j0006m633J1376O334o974L574J1727
$$ 582389 582853 577256 578041 577487 575770 572960 563497 553491 548858 560234 566568 559594 563168 574895
10467E74895K621j947m955n488k3479j507p98j4781j0890j0923j1622J511j972
$$ 574895 577516 575569 570614 565126 541647 540140 539342 524561 513671 502748 491126 492637 490665
10454D90665K709P48j0690j5447j0658P47J0749P066m855J3307N718N45N161k753
$$ 490665 493374 494122 483432 467985 457327 458074 468823 475889 471034 484341 490059 490604 495765 493012
10440D93012l534J2835Q433j7067j0413m872m702M403J2199L008O253j2131j6167
$$ 493012 489478 502313 510746 493679 483266 478394 473692 478095 490294 493302 499555 487424 471257
10427D71257K963J0258R859M406j0115k80N087N909l418R99L513l529j9065k3001
$$ 471257 474220 484478 494337 498743 488628 488348 493435 499344 495926 496925 500438 496909 477844 454843
10413D54843N872N230j5271j0910L318k467q625M515p692K681O041J0291L933
$$ 454843 460715 465945 450674 439764 443082 440615 431990 436505 428813 431494 437535 447826 451759
10400D51759J617j1190r51R638L164j1493P104J358j3007M645o678l275J343R393
$$ 451759 453376 442186 441235 450873 454037 442544 449648 451006 437999 442644 435966 432691 434034 443427
10386D43427R04l075N657K108J0783N922n760j7857o768J1608P860P822j2400
$$ 443427 444331 441256 446913 449021 459804 465726 459966 442109 435341 446949 454809 462631 450231
10373D50231n701N335l508q80R004O871J6825J1192o454O122j633J0466o354N758
$$ 450231 444530 449865 446357 445477 454481 461352 478177 489369 482915 489037 487404 497870 491516 497274
10359D97274n016j505L197J387L57P538P263k73j057q709l581K847M660J2813
$$ 497274 492258 490753 493950 495337 495694 503232 510495 510222 509165 500456 496875 499722 504382 517195
10345E17195m227m554m954q797L92J006q822O036J2230J0380J2216K052J5274
$$ 517195 512968 508414 503460 494663 495055 496061 487239 493275 505505 515885 528101 530153 545427
10332E45427L480j0206k3285r921o982n545K763j6377k1407N407Q881L685k425
$$ 545427 548907 538701 515416 505495 498513 492968 495731 479354 457947 463354 472235 475920 473495
10319D73495M616M567J940P276J2639J4714J8991J5933J4848J5343K755k341l687
$$ 473495 478111 482678 484618 491894 504533 519247 538238 554171 569019 584362 587117 584776 581089
10306E81089k4332k3914J29j9716j5996k474r256o197m700j6136J455J4248J9138
$$ 581089 556757 532843 532972 513256 497260 494786 485530 479333 474633 458497 459952 474200 493338
10293D93338J0834q723Q177J6317L1521J2319J9867J4538J2551J5968J6309j90
$$ 493338 504172 495449 503626 519943 551464 563783 583650 598188 610739 626707 643016 642826
10281F42826n172Q73L679n740J5210K6705L3056N2351N5591N2638O7377R6951
$$ 642826 637654 638527 642206 636466 651676 678381 711437 763788 819379 872017 939394 1036345
10269A036345J43532J74467J86042J97754J88561J35996N4445n2762j20125j62571
$$ 1036345 1179877 1354344 1540386 1738140 1926701 2062697 2117142 2064380 1944255 1781684
10259A781684j70083j71488j56020j40092j01105r6870q6884o9670m8437k9076
$$ 1781684 1611601 1440113 1284093 1144001 1042896 946026 859142 789472 741035 711959
10249G11959k6606j3830j6385r053Q95l374k400J1385K4761K6667L8534M9231
$$ 711959 685353 671523 655138 646085 646980 643606 641206 652591 677352 704019 742553 791784
10237G91784K9426J1289j4366k8268m4326n5189m3970k6147r412l0512j9821j4829
$$ 791784 821210 832499 818133 789865 745539 690350 646380 620233 610821 580309 560488 545659
10225E45659k7260k1195j90K503P582R857R656O989J1673o03J4650K1674J2374
$$ 545659 518399 497204 497014 499517 507099 516956 526612 533601 545274 544671 559321 580995 593369
10212E93369N96j0198j0524q694j9378k6370k4714k6868j6264j2607r396N236
$$ 593369 593965 583767 573243 564549 545171 518801 494087 467219 450955 438348 428952 434188
10200D34188M684j191m579m979M67K0178r86k572J806J5354J3615J5629N216N359
$$ 434188 438872 437681 433102 428123 428590 448768 447782 445210 447016 462370 475985 491614 496830 502189
10186E02189K958j9240j8743j2881k5526j7613l116j0319j8971K559j775p322
$$ 502189 505147 485907 467164 454283 428757 411144 408028 397709 378738 381297 379522 372200
10174C72200q335J2519J5743R657K4877K1184J3566J4829K3577J6728J6457J5439
$$ 372200 363865 376384 392127 401784 426661 447845 461411 476240 499817 516545 533002 548441
10162E48441J2769n383j7926m2727l8530j7718J87j287j9542k8681j4383k56l272
$$ 548441 561210 555827 537901 495174 456644 438926 439113 437826 418284 389603 375220 374964 371692
10149C71692J5223R107j4652j295p697j627L133Q220J1631J2125P658j41N429
$$ 371692 386915 396022 381370 380075 372378 370751 373884 382104 393735 405860 413518 413377 418806
10136D18806O457j2686m53n666j3658j0145j7600k3868o717k349o773P101L149
$$ 418806 425263 412577 412124 406458 392800 382655 365055 341187 334470 332121 325348 332449 335598
10123C35598J7748j565k992j4929l297J4856m377n817J0089K216j5831p453K339
$$ 335598 353346 351781 348789 333860 330563 345419 341042 335225 345314 347530 331699 324246 326585
10110C26585k293p967j7427N658N353O094O542j0616N038R050j0888J098L853
$$ 326585 324292 316325 298898 304556 309909 316003 322545 311929 316967 326017 315129 316227 320080
10097C20080j074L652J287j1654P436J0609j3868p031M150J0511R604l269K627
$$ 320080 319006 322658 323945 312291 319727 330336 316468 309437 313587 324098 333702 330433 333060
10084C33060j7j8197j9232Q113J4612R363J4106m035m370p748k234k210L109M635
$$ 333060 333043 314846 295614 303727 318339 327702 341808 337773 333403 325655 323421 321211 324320 328955
10070C28955k395K616m042M802L605K420J351O59O687N597K168j326n120k029
$$ 328955 326560 329176 325134 329936 333541 335961 337312 337971 344658 350255 352423 351097 345977 343948
10056C43948l123oJ322J529M644j017o871p544j0517J4782O939m197J1755J5394
$$ 343948 340825 340819 342141 343670 348314 347297 340426 332882 322365 337147 344086 339889 351644 367038
10042C67038J9056J3443K901K612O786l525q034r329Q884O858r931l363R101Q692
$$ 367038 386094 399537 402438 405050 411836 408311 400277 390948 399832 406690 396759 393396 402497 411189
10028D11189O498J7282K2484K851J0499M192m617j0116l954m668K83j752j2834
$$ 411189 417687 434969 457453 460304 470803 474995 470378 460262 456308 451640 451923 450171 437337
10015D37337o897l39R43J1874J736K717J202K173O706K3414J2855j900K87R103
$$ 437337 430440 430101 431044 442918 444654 447371 448573 450746 457452 480866 493721 491821 492108 501211
10001E01211o39r273J3930J5345J3809l760K694K1909N409J915M209K877p41O418
$$ 501211 500572 491299 505229 520574 534383 530623 533317 555226 560635 562550 566759 569636 568895 575313
9987E75313K4987O669J5909J8689r30Q123O258M979J1046J7162o531M443O789
$$ 575313 600300 606969 622878 641567 640637 648760 655018 659997 671043 688205 681674 686117 692906
9974F92906J6492K7289K4990J2448K7499L7790K5789J5391K7229N2350N1931N3174
$$ 692906 709398 736687 761677 774125 801624 839414 865203 880594 907823 960173 1012104 1065278
9962A065278O4356P6773Q0343P7050Q4129R5942J37993J66525J92240K25916K52647
$$ 1065278 1129634 1206407 1286750 1363800 1447929 1543871 1681864 1848389 2040629 2266545 2519192
9951B519192K80769K95751L22811L44733M11496N65782Q17193J112802J171725
$$ 2519192 2799961 3095712 3418523 3763256 4174752 4740534 5557727 6670529 7842254
9942G842254O26738j95865n80777n11180l62743k31714j12255J8627J43726K47927
$$ 7842254 8468992 8273127 7692350 7181170 6818427 6586713 6474458 6493085 6636811 6884738
9932F884738L09992L30355L14292K94893K77941K21760J60849J09232J02320J00860
$$ 6884738 7194730 7525085 7839377 8134270 8412211 8633971 8794820 8904052 9006372 9107232
9922I107232J34478J67300J61366R0446P988m3597o4769o3680n5252k4397j8320
$$ 9107232 9241710 9409010 9570376 9660822 9668810 9625213 9560444 9496764 9441512 9417115 9398795
9911I398795k966R228K7272N1112N2794M1066O527k8981m8445n9658r2440j37365
$$ 9398795 9395829 9405057 9432329 9483441 9536235 9577301 9583828 9554847 9506402 9446744 9354304 9216939
9899I216939j77225j93471k06735k24001k51893k97261l39276l60545l29676k96294
$$ 9216939 9039714 8846243 8639508 8415507 8163614 7866353 7527077 7166532 6836856 6540562
9889F540562k58750k24391k12181k19404k39009k28012j85559j35182q6276l0895
$$ 6540562 6281812 6057421 5845240 5625836 5386827 5158815 4973256 4838074 4751798 4720903
9879D720903K0983N0736M3739k310o6910j08035j15152p6543r283Q3722J53012
$$ 4720903 4741886 4792622 4836361 4834051 4767141 4659106 4543954 4467411 4458128 4541850 4694862
9868D694862J68174J44495Q7633K8368J5182M4915O0983J17905J84453K37681
$$ 4694862 4863036 5007531 5095164 5123532 5138714 5183629 5244612 5362517 5546970 5784651
9858E784651K82522L25442L46425L44338L15998L11856L50075M09145M53183M95758
$$ 5784651 6067173 6392615 6739040 7083378 7399376 7711232 8061307 8470452 8923635 9419393
9848I419393M70872M07415L89833L88085M39422M98531N62111N95939M74338J66204
$$ 9419393 9890265 10297680 10687513 11075598 11515020 12013551 12575662 13171601 13645939 13812143
9838A3812143j12316j90686j86217j81856j39979m3596J15468K96763L33361J09328
$$ 13812143 13699827 13509141 13322924 13141068 13001089 12957493 13072961 13369724 13703085 13812413
9828A3812413k05420l33925k72562j84283j57440j69967k18812k41530k30809
$$ 13812413 13606993 13273068 13000506 12816223 12658783 12488816 12270004 12028474 11797665
9819A1797665j84333j42084j17551j48318k07295k81037l25830l96701m70208
$$ 11797665 11613332 11471248 11353697 11205379 10998084 10717047 10391217 9994516 9524308
9810I524308n05698n23272n10083m34061l77464l45775l38037l19917l20336l21098
$$ 9524308 9018610 8495338 7985255 7551194 7173730 6827955 6489918 6170001 5849665 5528567
9800E528567k99977k61935k31535k06301j89116j83636j95597k04580k42566k70686
$$ 5528567 5228590 4966655 4735120 4528819 4339703 4156067 3960470 3755890 3513324 3242638
9790C242638k79096k68686k56803k26173k27100j93811j61784j51833j09104q3338
$$ 3242638 2963542 2694856 2438053 2211880 1984780 1790969 1629185 1477352 1368248 1284910
9780A284910r1398p2923n2214m9680n2094l3993m0782l5733l3375k8641l2061
$$ 1284910 1193512 1120589 1068375 1018695 966601 932608 891826 856093 822718 794077 762016
9769G62016k2864k5672j8474o069j0788j9056j5089p256j4580r040r188q911m84
$$ 762016 739152 713480 695006 688937 678149 659093 644004 636748 622168 613128 603940 595029 594545
9756E94545J1218j5311R49J225K636K3057R865L038j7170j1713n549R060J9590
$$ 594545 605763 590452 591401 592626 595262 618319 628184 631222 614052 602339 596790 605850 625440
9743F25440L7556O5982P1659Q6923J07229J12848N5483j6373q3642j15204j18854
$$ 625440 662996 728978 800637 887560 994789 1107637 1163120 1146747 1063105 947901 829047
9732H29047q7865m2413m1529l2522k1110j9663j6602r913p120j0601J727J2039
$$ 829047 741182 698769 657240 624718 603608 583945 567343 557430 550310 539709 541436 553475
9720E53475K087p090n60r937j4784P352L958j5027q828K384O569n076n769q411
$$ 553475 555562 548472 547912 537975 523191 530543 534501 519474 510646 513030 519599 514523 508754 500343
9706E00343o485j458L391l692l599J3062q339M893J9617l719L299l241l237j115
$$ 500343 493858 492400 495791 492099 488500 501562 493223 498116 517733 514014 517313 514072 510835 509720
9692E09720m12r187m878K361R458J9623J8215j0612q242J569J2990K705N113k68
$$ 509720 509308 500121 495243 497604 507062 526685 544900 534288 526046 527615 540605 543310 548423 548155
9678E48155Q718j677R501J470q333Q001J0365P018J7847Q097j6079k424O079J2267
$$ 548155 556873 555196 564697 566167 557834 565835 576200 583218 601065 609162 593083 590659 596738 609005
9664F09005J1494O421r70N139j2731j301k2158k1279j3382j1754l887j8705j1780
$$ 609005 620499 626920 625950 631089 618358 617057 594899 573620 560238 548484 544597 525892 514112
9651E14112J3846P741O214P601K798O111M249L941J0467M794j049M882k652q747
$$ 514112 527958 535699 541913 549514 552312 558423 562672 566613 577080 581874 580825 585707 583055 574308
9637E74308q70j1998L032n445r776n603M444L831R83n342r864j4005J3684k827
$$ 574308 573438 561440 564472 559027 549251 543648 548092 551923 552906 547564 537700 523695 537379 534552
9623E34552J0395P134o153j4680p338O205Q094M118L560p319o125m678k80o322
$$ 534552 544947 552081 545928 531248 523910 530115 538209 542327 545887 538568 532443 527765 527485 521163
9609E21163q309N319J2774J1769P305K5840M854j9551j0775N948K2719K3318J0015
$$ 521163 512854 518173 530947 542716 550021 575861 580715 561164 550389 556337 579056 602374 612389
9596F12389J0922K6587K0022K1361J7017J2150r098Q366O426P841N614K353R19
$$ 612389 623311 649898 669920 691281 708298 720448 711350 719716 726142 733983 739597 741950 742869
9583G42869l181K006J0347J0974P349J0707J4558K834M628m385O961J2746j54
$$ 742869 739688 741694 752041 763015 770364 781071 795629 798463 803091 798706 805667 818413 818259
9570H18259R975k257j30j70N629Q487J0579M121r224M41j504n315m692r425j3175
$$ 818259 828234 825977 825847 825677 831306 839793 850372 854493 845269 845710 844206 838891 834199 824774 811599
9555H11599Q522J0050j838k861k2391j0138j0226j0030r494j1720p200j0871k0267
$$ 811599 820121 830171 828333 825472 803081 792943 782717 772687 763193 751473 744273 733402 713135
9542G13135k9681r415P158j4526j9055p865j0732J0797J3732J7968R35N565q14
$$ 713135 683454 674039 681197 666671 647616 639751 629019 639816 653548 671516 672451 678016 677202
9529F77202q328j4751j5766r832j6604j5107O540J1346m729k691O873J4680K8147
$$ 677202 668874 654123 638357 628525 611921 596814 603354 614700 609971 607280 614153 628833 656980
9516F56980K4538J1048J5111O219r902K159R997M612J0236R981m223L690J9538
$$ 656980 681518 692566 707677 713896 703994 706153 716150 720762 730998 740979 736756 740446 759984
9503G59984J4094N618p33j016N229K3417K5159K7178L3228M3454L0128J9837J1718
$$ 759984 774078 779696 778963 777947 783176 806593 831752 858930 892158 935612 965740 985577 997295
9490I97295J1657L126L145J5938P93l603r96j2835q418L36n04j0919j989q183
$$ 997295 1008952 1012078 1015223 1031161 1031954 1028351 1027355 1014520 1006102 1006438 1005934 995015 993026 984843
9476I84843n138j1466k656Q321O332m562j5976j0738l042M050n186k0379j0867
$$ 984843 979705 968239 965583 973904 980236 975674 959698 948960 945918 949968 944782 924403 913536
9463I13536N4j0076O380m290o604L141o503j6578j9957l0795k0482j2887n415
$$ 913536 913590 903514 909894 905604 899000 902141 895638 879060 859103 828308 807826 794939 789524
9450G89524J0353N891j2234M837J6757O010K773K2602M8513L5539L4484L7632
$$ 789524 799877 805768 793534 798371 815128 821138 823911 846513 895026 930565 965049 1002681
9438A002681L0330M8998N1971O7294O6731P0536P5728R5037J30883J42513J87727
$$ 1002681 1033011 1082009 1133980 1201274 1268005 1338541 1414269 1509306 1640189 1782702 1970429
9427A970429K38085K90217L60739M31900N00802N45408N37609M50068K72487N8932
$$ 1970429 2208514 2498731 2859470 3291370 3792172 4337580 4875189 5325257 5597744 5656676
9417E656676j32987k58093l35545l67417l73155l45807k95332k64494k18219j72591
$$ 5656676 5523689 5265596 4930051 4562634 4189479 3843672 3548340 3283846 3065627 2893036
9407B893036j29659r8226p1611l3889K8147O3460R5900J52568K25980K72371L27469
$$ 2893036 2763377 2665151 2593540 2559651 2587798 2651258 2747158 2899726 3125706 3398077 3725546
9396C725546L90487M51907M98875M77828L27077J04512j26642l09581l96790m23777
$$ 3725546 4116033 4567940 5066815 5544643 5871720 5976232 5849590 5540009 5143219 4719442
9386D719442m01850l70889l34666l03353k79268k52412k18373j90206j63825j30913
$$ 4719442 4317592 3946703 3612037 3308684 3029416 2777004 2558631 2368425 2204600 2073687
9376B073687j10365r3369o7810m1657l2122l2016k9931N989J4190J8064Q585K3157
$$ 2073687 1963322 1869953 1802143 1760486 1728364 1696348 1666417 1672406 1686596 1704660 1713245 1736402
9364A736402P0457P8017Q1040R5320J37856J39178J59412J78171K02968K50474
$$ 1736402 1806859 1884876 1965916 2061236 2199092 2338270 2497682 2675853 2878821 3129295
9354C129295L07047L73369M47250N54177O66292P82556Q80462R33186R56779Q77520
$$ 3129295 3436342 3809711 4256961 4811138 5477430 6259986 7140448 8073634 9030413 9907933
9344I907933P17410M73153J90365p2393k38684k63801j97829j49071j33283j99176
$$ 9907933 10625343 11098496 11288861 11216468 10977784 10713983 10516154 10367083 10233800 10034624
9334A0034624l33393m79716n56468n63165m88715l93502k63688j51009l0755J11676
$$ 10034624 9701231 9221515 8665047 8101882 7613167 7219665 6955977 6804968 6774213 6885889
9324F885889K66547M20797N74538P44923R12398J014704J008838Q78776O51590
$$ 6885889 7152436 7573233 8147771 8892694 9805092 10819796 11828634 12707410 13359000
9315A3359000L52184J0892k74662m88216n95191o07140o07594o09559o47591p10361
$$ 13359000 13711184 13722076 13447414 12959198 12364007 11756867 11149273 10539714 9892123 9181762
9305I181762p81442q00303p33904o54721n78871n03313l97894l48529k87860k32439
$$ 9181762 8400320 7600017 6866113 6211392 5632521 5129208 4731314 4382785 4094925 3862486
9295C862486j99067j55653j12988q9227o1365n0448l4296j7917n272j779o580
$$ 3862486 3663419 3507766 3394778 3305551 3244186 3193738 3159442 3141525 3136253 3134474 3127894
9284C127894J568J5133L8403M7622Q3763J10758J57384K11696K74008L22523L86100
$$ 3127894 3129462 3144595 3182998 3230620 3314383 3425141 3582525 3794221 4068229 4390752 4776852
9273D776852M79575N60793O01371O42405O22911N35992M05265L37804L41398L76512
$$ 4776852 5256427 5817220 6418591 7060996 7683907 8219899 8625164 8962968 9304366 9680878
9263I680878M03847M02763L26434J75228m4672k93648n07311o58822p07504o71448
$$ 9680878 10084725 10487488 10813922 10989150 10944478 10650830 10143519 9484697 8777193 8105745
9253H105745n94387n01325l88717k69693j59545n6437O9614J93925L11284M30373
$$ 8105745 7511358 7010033 6621316 6351623 6192078 6135641 6205255 6399180 6710464 7140837
9243G140837N33380N80514N05189L31612J80440O1057J7628O7410J25230J64152
$$ 7140837 7674217 8254731 8759920 9091532 9271972 9333029 9350657 9418067 9543297 9707449
9233I707449J17629m0298k63004m59094o05294o96723p36025p18683o57537n81003
$$ 9707449 9825078 9784780 9521776 9062682 8457388 7760665 7024640 6305957 5648420 5067417
9223E067417n01724m22434l51516k75945k26498j84636j43904j23409j08749r4080
$$ 5067417 4565693 4143259 3791743 3515798 3289300 3104664 2960760 2837351 2728602 2634522
9213B634522j14861j07801r3834q7153r7865j07115q7736n4824m2286k2452j7291
$$ 2634522 2519661 2411860 2318026 2230873 2133008 2025893 1938157 1883333 1841047 1818595 1801304
9202A801304k7197R75J8825J6717N3906P5945R6946R6271J12698J50613J67337
$$ 1801304 1774107 1775082 1793907 1810624 1864530 1940475 2037421 2133692 2246390 2397003 2564340
9191B564340K13329K37988K70261K89411L27214L39171L10464K13910M7096j53473
$$ 2564340 2777669 3015657 3285918 3575329 3902543 4241714 4552178 4766088 4813184 4659711
9181D659711k88325l37073l32049l02272k67544k30303j81347j27997q6112n7323
$$ 4659711 4371386 4034313 3702264 3399992 3132448 2902145 2720798 2592801 2506689 2449366
9171B449366k3043k3144k1526J497L3326O9298Q6796Q7728J30630J75205K27822
$$ 2449366 2426323 2403179 2381653 2383150 2416476 2485774 2572570 2660298 2790928 2966133 3193955
9160C193955K40687K50868K34028J84048Q2264o6041k10977l01706l53425l52621
$$ 3193955 3434642 3685510 3919538 4103586 4185850 4119809 3908832 3607126 3253701 2901080
9150B901080l05471k59620k20615j86393j43948j05443q6469o4635m8874l0481
$$ 2901080 2595609 2335989 2115374 1928981 1785033 1679590 1593121 1528486 1479612 1449131
9140A449131l3833l0192m4649l5234k6682l6040k8290k4356m950q914k5352m1245
$$ 1449131 1415298 1385106 1340457 1305223 1278541 1242501 1214211 1189855 1184905 1175991 1150639 1109394
9128A109394l9095l1220k7871k7574l6922m6213l1845j5039k1268j7893j2530
$$ 1109394 1070299 1039079 1011208 983634 946712 900499 868654 853615 832347 814454 801924
9117H01924k987J0969R528Q180Q351j2153k7512j8056j5430k5537Q696M5511O1684
$$ 801924 798937 809906 819434 827614 835965 823812 796300 778244 762814 737277 745973 791484 853168
9104H53168N7762K3624o856O114K1152J5765n377l1500m3458l4293k8806l7287
$$ 853168 910930 934554 927698 933812 954964 970729 965352 933852 890394 856101 827295 790008
9092G90008l2014j5539p320Q9J802J8107K94j78R758J772k3688k2282k4353j7654
$$ 790008 757994 742455 735135 735224 737026 755133 755427 755249 765007 766779 743091 720809 696456 678802
9078F78802M253J803J237l675j8960M216J2713K6759M0474M7258M0981K7246K9452
$$ 678802 683055 684858 686095 682420 663460 667676 680389 707148 747622 794880 835861 863107 892559
9065H92559J2722N626K806j0921k4422j7991o809J0907p436m730j19P837M315
$$ 892559 905281 910907 913713 902792 878370 860379 853570 864477 857041 852311 852192 860029 864344
9052H64344O604K835R98K8452J8310L8976N3523P2656P3177J19889J58564J40931
$$ 864344 870948 873783 874781 903233 921543 960519 1014042 1086698 1159875 1279764 1438328 1579259
9040A579259K7121j03435j55036j18806o9161k9945K008j0217l962J1082R71j236
$$ 1579259 1606380 1502945 1347909 1229103 1159942 1129997 1132005 1121788 1117826 1128908 1129879 1128643
9028A128643k308k1284k6742l6824l6618m1773j8601j8242m598J7259m66o967
$$ 1128643 1126335 1105051 1078309 1041485 1004867 963094 944493 926251 921653 938912 938446 931479
9016I31479k0784j4963o531m308J4489O145J8607R367J318J1113N419J1055o312
$$ 931479 910695 895732 889201 884893 899382 905527 924134 933501 934819 945932 951351 962406 956094
9003I56094o87K6784K8233K3479J4063J1517K1167K4032P466J2320Q075L9020
$$ 956094 955407 982191 1010424 1033903 1047966 1059483 1080650 1104682 1112148 1124468 1132543 1171563
8991A171563L1862J5114K5620K1609L4411L9777L2092L3513L7836M2372L8045
$$ 1171563 1203425 1218539 1244159 1265768 1300179 1339956 1372048 1405561 1443397 1485769 1523814
8980A523814P810R219l492j625R73m859n425P2K1553L9970N1150N1752N5700P5149
$$ 1523814 1531624 1540843 1537351 1535726 1536699 1531840 1526415 1526487 1548040 1588010 1639160 1690912 1746612 1821761
8966A821761R6897Q1421R0754R1348R3505J19786J06698J20647J46503J56939
$$ 1821761 1918658 2000079 2090833 2182181 2275686 2395472 2502170 2622817 2769320 2926259
8956B926259J42193J63453J63946J54254J63411J52243J86527K44585L02596L52368
$$ 2926259 3068452 3231905 3395851 3550105 3713516 3865759 4052286 4296871 4599467 4951835
8946D951835L84650M11802M35968M63094N18163N97931O72629P36101Q40740J012808
$$ 4951835 5336485 5748287 6184255 6647349 7165512 7763443 8436072 9172173 10012913 11025721
8936A1025721J246321J456752J712192J991015K399049K898531L500971M175959
$$ 11025721 12272042 13728794 15440986 17432001 19831050 22729581 26230552 30406511
8928C0406511M753197N164131N625036O758047R056701J2732295J8134291K6143690
$$ 30406511 35159708 40323839 45948875 52706922 61763623 74495918 92630209 118773899
8920A18773899L8253277N6331219Q0374286J01120690R0338067K5930294n1848267
$$ 118773899 157027176 213358395 293732681 394853371 485191438 511121732 459273465
8913D59273465q4015668p8730181o4280639m9759774l7196967k7341105k0063513
$$ 459273465 375257797 296527616 232246977 182487203 145290236 117949131 97885618
8906I7885618j4744619j0714839p588707n218600l537784k481597j655662n34569
$$ 97885618 83140999 72426160 64837453 59618853 56081069 53599472 51943810 51409241
8898E1409241R82190K697713L990739M168610L063732O02675j898354k665054
$$ 51409241 52391431 55089144 59079883 63248493 66312225 66914900 65016546 62351492
8890F2351492k781473l309963m238890n099613n163626m555602l886888l423262
$$ 62351492 59570019 56260056 52021166 46921553 41757927 37202325 33315437 29892175
8882B9892175l158776k897636k490940k118977j850215j642399j482719j298207
$$ 29892175 26733399 23835763 21344823 19225846 17375631 15733232 14250513 12952306
8874A2952306j124165r66257q36965p35306o36156n48410m77851m32570l64121
$$ 12952306 11828141 10861884 10024919 9289613 8653457 8105047 7627196 7194626 6830505
8865F830505l20937k84889k76524k68927k57390k44838k22612k04870j92163j94122
$$ 6830505 6509568 6224679 5948155 5679228 5421838 5177000 4954388 4749518 4557355 4363233
8855D363233j85842j80034j98903j80647j48370j17060q3035m8572j1128P063
$$ 4363233 4177391 3997357 3798454 3617807 3469437 3352377 3269342 3220770 3209642 3216705
8845C216705n3029j65598j88970j72281j54784j40810j18799r2636p6022n4121
$$ 3216705 3163676 2998078 2809108 2636827 2482043 2341233 2222434 2129798 2053776 1999655
8835A999655n2269m6933m5652k6697k0870k4149k8315j8990m3931l7645l4606
$$ 1999655 1947386 1900453 1854801 1828104 1807234 1783085 1754770 1735780 1691849 1654204 1619598
8824A619598l9198k5280k0549k4449l4736l7779k8434k8570l7026m4177l4198
$$ 1619598 1580400 1555120 1534571 1510122 1475386 1437607 1409173 1380603 1343577 1299400 1265202
8813A265202j4920m816r213q756k369k3435l7287k5094r227p141j3298L457j0588
$$ 1265202 1250282 1245466 1236253 1227497 1225128 1201693 1164406 1139312 1130085 1122944 1109646 1113103 1102515
8800A102515j6147l3211l0015l541K3391K6013K9819K1376K7154K0549M6778O0888
$$ 1102515 1086368 1053157 1023142 1019601 1042992 1069005 1098824 1120200 1147354 1167903 1214681 1275569
8788A275569J6067m2548o0183m3910m2552m9211l7450l0439l3084k0817j8037
$$ 1275569 1291636 1249088 1188905 1144995 1102443 1053232 1015782 985343 952259 931442 913405
8777I13405j5010j4853j3816o965p094P077j771k2895k8549k7128l0057M988K3427
$$ 913405 898395 883542 869726 862761 855667 862744 860973 838078 809529 782401 752344 757332 780759
8764G80759J1515J942K0891L7026L3037K6764J0210j2649k1536j5352K680N025
$$ 780759 792274 794216 815107 852133 885170 911934 922144 909495 887959 872607 875287 880312
8752H80312j5425j8050o912o389k1803j6075r261o687p734o540k728j0080k3447
$$ 880312 864887 846837 839925 833536 811733 795658 786397 779710 771976 765436 762708 752628 729181
8739G29181q131j1038j8796m4292l2125j9036j8352J8019K6246K2705J1787J8333
$$ 729181 721050 710012 691216 646924 614799 595763 577411 595430 621676 644381 656168 674501
8727F74501J8078M2382N9108O7564L5800J3299j0411k7362m2398m3492k7638J071
$$ 674501 692579 734961 794069 861633 897433 910732 900321 872959 830561 787069 759431 760502
8715G60502J3486N560J4402K8698L6722M0675J2228l3899n1391n9882m9716l1306
$$ 760502 773988 779548 793950 822648 859370 900045 912273 878374 826983 767101 717385 686079
8703F86079o105j5686p267M568r533j2763k252p503j2149J513P799J4461J0976
$$ 686079 679974 664288 657021 661589 652056 639293 637041 629538 617389 618902 626701 641162 652138
8690F52138R828n410m901L091k836j2318K147P471J2321K759J0922P367o87N340
$$ 652138 661966 656556 651655 654746 651910 639592 641739 649210 661531 664290 675212 682579 681892 687232
8676F87232j1066J2329K9442R233l302J8619P595J1451J6979J3810J2524K825
$$ 687232 676166 688495 717937 727170 723868 742487 750082 761533 778512 792322 804846 807671
8664H07671k554K855k3275k2193j0829m911l838j0113o480r72M087k467N353J518
$$ 807671 805117 807972 784697 762504 751675 746764 742926 732813 726333 725361 729448 726981 732334 733852
8650G33852Q979P866p669K044R013l072q61L910K420n475M907j4577j2567j185
$$ 733852 742831 750697 743028 745072 754085 751013 750152 754062 756482 751007 755914 741337 728770 727585
8636G27585l558m422P67J8398M3948Q1878J08587J09192J3315j01922r5348o8278
$$ 727585 724027 719605 720372 738770 782718 864596 973183 1082375 1095690 993768 898420 830142
8624H30142p3900p6682q2792n5619m3820j3953k811K248J0178L279K0661J1471
$$ 830142 756242 679560 596768 541149 497329 483376 480565 482813 492991 496270 516931 528402
8612E28402J4778J4283K2030K4503K6486K4627M7545L4477K5333K4059Q513J9443
$$ 528402 543180 557463 579493 603996 630482 655109 702654 737131 762464 786523 795036 814479
8600H14479J0894K9014L2147K4298J4901J2516L063k721j23J0051j2290N48M0440
$$ 814479 825373 854387 886534 910832 925733 938249 941312 938591 938468 948519 936229 936777 977217
8587I77217P2637J15478J84732K19659Q2746j41747j97938j29582r0238q0174
$$ 977217 1049854 1165332 1350064 1569723 1652469 1510722 1312784 1183202 1092964 1012790
8577A012790p8875n6789n3260m0121l7978l0210k7569k1512M901j6479k5296j6386
$$ 1012790 933915 877126 823866 783745 745767 715557 687988 666476 671377 654898 629602 613216
8565F13216o414j4111j0777o317j9040l877k0180k5799q023l997j4767j7500j3213
$$ 613216 606802 592691 581914 575597 556557 552680 532500 506701 498678 494681 479914 462414 449201
8552D49201n226k514j1741k927Q114O34j454j6205l862K8799L8593P2697R3590
$$ 449201 443975 441461 429720 426793 434907 435541 434087 417882 414020 442819 481412 554109 647699
8539F47699J06262O6520l2405j08952o7312l8195k7084j6249q209P273J4352J2473
$$ 647699 753961 820481 788076 679124 611812 573617 546533 530284 522075 529348 543700 556173
8527E56173R380J0896K2914L5335L8179N6403Q5267J00409J13248J49626J62240
$$ 556173 565553 576449 599363 634698 672877 729280 814547 914956 1028204 1177830 1340070
8516A340070J70846J78924J53290J22189Q7081K3531k7660p4137j21912j58101
$$ 1340070 1510916 1689840 1843130 1965319 2052400 2075931 2048271 1974134 1852222 1694121
8506A694121j61668j56880j50065j35975j08527p7282o4522l5966l4369k0990
$$ 1694121 1532453 1375573 1225508 1089533 981006 903724 839202 803236 768867 747877
8496G47877j2394j7865j7685j6297q69L14L945p520k815o215k487K735j4677k5138
$$ 747877 735483 717618 699933 683636 682767 683081 687026 679506 676691 670476 667989 670724 656047 630909
8482F30909k1940j7739r444j8709j9885k9648j5516k1621j5786j1683l828J0666
$$ 630909 608969 591230 581786 563077 543192 513544 498028 476407 460621 448938 445110 455776
8470D55776n957P263J7814K4569R252o736k2009k7426j4132k0758k3514l597o127
$$ 455776 449819 457082 474896 499465 508717 501981 479972 452546 438414 417656 394142 390545 384418
8457C84418q735o314m354o61J0660J1248O660J3787q524n718l470J2780J2189
$$ 384418 375683 369369 365015 364354 375014 386262 392922 406709 398185 392467 388997 401777 413966
8444D13966o217j5803m891J5404P202M767m246n228L077O389J3060J1961J933
$$ 413966 407749 391946 387055 402459 409661 414428 410182 404954 408031 414420 427480 439441 441374
8431D41374m176R121J2152K5533K3717J3678J2883L0355L1902J880p080k6865
$$ 441374 437198 446319 458471 484004 507721 521399 534282 564637 596539 598419 591339 564474
8419E64474k4006m700m272k492p318K154J6099J0733R99Q286R9K6866P713j2827
$$ 564474 540468 535768 531496 529004 521686 523840 539939 550672 551671 559957 560056 586922 594635 581808
8405E81808j4673m089P485k524k811q328k084k333r221O091Q509k332j2777j5363
$$ 581808 567135 563046 570531 568007 565196 556868 554784 552451 543230 549321 557830 555498 542721 527358
8391E27358j951o588q9M181N591m693p316j6248N244J4087j1119o877K635J3186
$$ 527358 525407 518819 518730 522911 528502 523809 516493 500245 505489 519576 508457 501580 504215 517401
8377E17401J0823O792J1393Q759O843n976j5985M522p575k2464j1129O25q048
$$ 517401 528224 535016 546409 555168 562011 556035 540050 544572 536997 514533 503404 504029 495981
8364D95981o608r666o811k026J2547k1990j8929m37j2658m858o270l591L172L721
$$ 495981 489373 479707 472896 470870 483417 461427 442498 442061 429403 424545 418275 414684 417856 421577
8350D21577m630o204j5383m582k233n633k423J4774P034R689N714j364R367N389
$$ 421577 416947 410743 395360 390778 388545 382912 380489 395263 402297 411986 417700 416336 425703 431092
8336D31092Q828K0206J6445o418q484J2046J2017J1039L235L599p195j0130p289
$$ 431092 439920 460126 476571 470153 461669 473715 485732 496771 500006 503605 496410 486280 478991
8323D78991j017k719j30K876K277m027o355j1817j0941l780p983p851R258O780
$$ 478991 477974 475255 475125 478001 480278 476251 469896 458079 447138 443358 435375 427524 436782 443562
8309D43562l530j4928j52N118k179p314m670k041m988k0341j4427l638M765n770
$$ 443562 440032 425104 424952 430070 427891 420577 415907 413866 408878 388537 374110 370472 375237 369467
8295C69467Q853J2762M655j1113j8089k776j445J672j5403j1300l597o099p78
$$ 369467 378320 391082 395737 384624 366535 363759 362314 363986 348583 337283 333686 327587 326809
8282C26809j674J4571p062k322j348M850L233j3497j3248r586q945N748p85N940
$$ 326809 325135 339706 332644 330322 328974 333824 337057 323560 310312 300726 291781 297529 296744 302684
8268C02684P66o304j1588k793j0706j1805o743n162N610K2391J2456J3163j1345
$$ 302684 303450 297146 285558 282765 272059 260254 253511 248349 253959 276350 288806 301969 290624
8255B90624j1661q403N949Q895O490n428N450o07N34l936l287q438m712q262o731
$$ 290624 278963 270560 276509 285404 291894 286466 291916 291309 291843 287907 284620 276182 271470 263208 256477
8240B56477J4249K0162O878j2304j0183p093q84J2173J358r462Q924r083j5085
$$ 256477 270726 290888 297766 285462 275279 268186 267302 279475 280833 271371 280295 271212 256127
8227B56127l726M050j3009j1177q061m486R697l090j610M898J579k23j4489k697
$$ 256127 252401 256451 243442 232265 224204 219718 229415 226325 224715 229613 231192 230969 216480 213783
8213B13783J006j019L071N53o452j0397q461P413P868j2592j2516r619J069J449
$$ 213783 214789 213770 216841 217394 210942 200545 192084 199497 207365 194773 182257 172638 173707 175156
8199A75156m233j8114n010p828k285J308O646k439k334O180L528m443M82K878
$$ 175156 170923 152809 147799 139971 137686 138994 145640 143201 140867 147047 150575 146132 146614 149492
8185A49492l601J273n562P548J4219j4310o806O935m246m750J1312j682o446n460
$$ 149492 145891 147164 141602 149150 163369 149059 142253 149188 144942 140192 151504 149822 143376 137916
8171A37916j407K031m883r606J70P808Q761J0652K123k722Q382l357Q586L265
$$ 137916 136509 138540 133657 124051 124221 132029 140790 151442 153565 150843 159225 155868 164454 167719
8157A67719j3349r801n327R246k238r030j355j342j783J4530M904l464J2650J533
$$ 167719 154370 144569 139242 148488 146250 137220 135865 134523 132740 147270 152174 148710 161360 162893
8143A62893o14J7766L8717M0553O4240L7768k5730n0162m4682l2181j6642j2411
$$ 162893 162279 180045 218762 259315 323555 361323 335593 285431 240749 208568 191926 179515
8131A79515k5821k0062k808J712l195j334n11j1062j6406J649M1L215J78p913
$$ 179515 153694 133632 130824 132536 129341 128007 127496 116434 100028 101677 101718 104933 105111 97198
8117I7198J303M456M305J730j3310j5128j071Q794K0270J6571K131n921O676M020
$$ 97198 98501 102957 107262 108992 95682 80554 79483 88277 108547 125118 127249 121328 128004 132024
8103A32024M494R449K6269K5513L8616M2313K6863N952k7632n3197l7525l1725
$$ 132024 136518 145967 172236 197749 236365 278678 305541 311493 283861 230664 193139 161414
8091A61414l1728j9897j693P984m046q213J3777O717p356p570j2225M603J3176
$$ 161414 129686 109789 108096 116080 112034 103821 117598 124315 116959 109389 97164 101767 114943
8078A14943M507j0444j2865M609P409L119k5537J534J4570J2527l233o515j1870
$$ 114943 119450 109006 96141 100750 108159 111278 85741 87275 101845 114372 111139 104624 92754
8065I2754J3668J1001m622j381j1576R29q766o371J1192J5175L391o908j0492
$$ 92754 106422 117423 112801 111420 99844 100773 92007 85636 96828 112003 115394 108486 97994
8052I7994R68n276J0225J4918J2857q231m71R436L806k1540r226K1190J9039o893
$$ 97994 98962 93686 103911 118829 131686 123455 122984 132420 136226 114686 105460 126650 145689 138796
8038A38796n78L176l699O635L1646J4412k741n358J9534K582O525J8565J9020
$$ 138796 138218 141394 137695 144330 175976 190388 187647 182289 201823 204405 210930 229495 248515
8025B48515k866m973P499L177m492m398q245K67M664l885o657j0095l090o582
$$ 248515 245649 240676 248175 251352 246860 242462 234217 234484 239148 235263 228606 218511 215421 208839
8011B08839j1702l305R463L952r88j1116K72j1163M872J1189J9459L342r596j4438
$$ 208839 197137 193832 203295 207247 206259 195143 195415 184252 189124 200313 219772 223114 213518 199080
7997A99080j763O781J9267L9969M2549K6244L5054O6653Q1925P8668P7245K7085
$$ 199080 197317 204098 223365 263334 305883 332127 367181 433834 515759 594427 671672 698757
7985F98757n3528q6339p7910n8712n0145k6349K01O203M4207O8029M6907J6749
$$ 698757 645229 558890 480980 422268 372123 345774 345975 352178 396385 464414 511321 528070
7973E28070l8299o2139p0269n6572l6885l0558l5485m272O322P318j3757j5067
$$ 528070 489771 427632 357363 300791 263906 233348 197863 193591 199913 207231 193474 178407
7961A78407j2822p844k796M935M804l885k106j424k353N887J1592J9665K1433
$$ 178407 165585 157741 154945 159880 164684 160799 158693 157269 154916 160803 172395 192060 213493
7948B13493L2998L2184J8305L0545N0536L8982q054M645j0222l7322l6940j6322
$$ 213493 246491 278675 296980 327525 378061 417043 408989 413634 403412 366090 329150 312828
7936C12828K0644L9559L1270K0576l517l0416n1595m3525k9519l2955l3679k0755
$$ 312828 333472 373031 404301 424877 421360 390944 339349 295824 266305 233350 199671 178916
7924A78916j0506o367j7230j4338m020n157J756k524j8893p130N952P843p853
$$ 178916 168410 162043 144813 130475 126455 121298 123054 120530 101637 94507 100459 108302 100449
7911A00449n707l758j019R558Q545Q560K824J3439K2223K1134j21l902K001j3849
$$ 100449 94742 90984 89965 99523 108068 116628 119452 132891 155114 176248 176127 172225 174226 160377
7897A60377j6241q410j7237p199Q764Q350j9771j9997j2670n577L74o929l907
$$ 160377 144136 135726 118489 111290 120054 128404 108633 88636 75966 70389 70763 63834 59927
7884E9927n392M000q97r039j386O999J1674n752j3910l440R700J0174K08n764
$$ 59927 54535 58535 57638 48599 47213 54212 65886 60134 46224 42784 52484 62658 62866 57102
7870E7102n166N189P727j2499j8856N250J1089m808L621j886k411J926N562j0500
$$ 57102 51936 57125 64852 52353 33497 38747 49836 45028 48649 46763 44352 46278 51840 41340
7856D1340j2961K147L458N735O475J0479M611L40m712J757j0907q216M964m720
$$ 41340 28379 30526 33984 39719 46194 56673 61284 61624 56912 58669 47762 39546 44510 39790
7842C9790n028j0515J3026N882l392k580n487j013J1799O049l509o926J668J28
$$ 39790 34762 24247 37273 43155 39763 37183 31696 30683 42482 48531 45022 38096 39764 39892
7828C9892N161J1960j966j2719r133J13R119p541n067j3857M884J4790j1000r709
$$ 39892 45053 57013 55047 42328 33195 33308 42427 34886 29819 15962 20846 35636 24636 14927
7814A4927j1137j1904J3576K351P485Q287K373l178o379q13J7629J4180L188q155
$$ 14927 3790 -8114 5462 7813 15298 23585 25958 22780 16401 15588 33217 47397 50585 42430
7800D2430j9561k0856m87Q509J5961K008l999L847l280M356r20L772p408r416
$$ 42430 22869 2013 1526 10035 25996 28004 24005 27852 24572 28928 28008 31780 24372 14956
7786A4956j9684J248Q650L303J228M446J146O163j4255r841R409O833K084m060
$$ 14956 -4728 -3480 5170 8473 9701 14147 15293 21456 7201 -2640 6769 13602 15686 11626
7772A1626q363O991J5451n496l557P132K377N061J2727j0393j5620P92l271J2600
$$ 11626 3263 10254 25705 20209 16652 23784 26161 31222 43949 33556 17936 18728 15457 28057
7758B8057K250K387J563Q183o704p101M243M186p586m213r744p696l085J3360
$$ 28057 30307 32694 34257 42440 35736 28635 32878 37064 29478 25265 15521 7825 4740 18100
7744A8100l371q805M769J677P799P494k822k761j595N097j1609J4559J3745j0164
$$ 18100 14729 5924 10693 12370 20169 27663 24841 22080 20485 25582 13973 28532 42277 32113
7730C2113j2249j4712M47Q767N688k239j5488p830j633R730J468j01L347O738
$$ 32113 19864 5152 5599 14366 20054 17815 2327 -5503 -7136 2594 4062 3961 7308 14046
7716A4046O923k387j0181M600O840j306j4808L49J4307Q209o27m683N349Q023
$$ 14046 20969 18582 8401 13001 19841 18535 3727 4076 18383 26592 25965 21282 26631 34654
7702C4654m950l687m84k353o930n222L491j0876O756P592l116P316K226r719j4188
$$ 34654 29704 26017 25533 23180 16250 11028 14519 3643 10399 17991 14875 22191 24417 14698 510
7687E10n889l794M717J4784J2975J483K792J1003p654L198J762j5695P85J5117
$$ 510 -5379 -9173 -4456 10328 23303 24786 27578 38581 30927 34125 35887 20192 20977 36094
7673C6094L607N715p813n786r042p784m563k949L712O675J2447l58p945p668m814
$$ 36094 39701 45416 37603 31817 22775 14991 10428 7479 11191 17866 30313 29955 22010 14342 9528
7658I528l992j0680N811N959q7M612K941P92n592K17Q391k917j042j057P213J1597
$$ 9528 5536 -5144 667 6626 6539 11151 14092 14884 9292 9509 17900 14983 13941 12884 20097 31694
7642C1694O067O090K309j3662j4309L730J9530J058q962N606J163j1372J678K52
$$ 31694 37761 43851 46160 32498 18189 21919 41449 42507 33545 39151 40314 28942 30620 30872
7628C0872o000J140O011k782j1874p777n127J7689j836J230O122N267m613o078
$$ 30872 24872 26012 32023 29241 17367 9590 4463 22152 20316 21546 27668 32935 28322 22244
7614B2244K988L78J760m792j2652M483P036J501m991J0051J147K659j4072p604
$$ 22244 25232 25610 27370 22578 9926 14409 21445 22946 17955 28006 29153 31812 17740 10136
7600A0136k264J1131L98J0660P380M88m550m011q157R92J2965L069n253q420p579
$$ 10136 7872 19003 19401 30061 37441 37929 33379 29368 21211 22203 35168 38237 32984 24564 16985
7585A6985M517p641n087P434k295K425m045j156P532L511n155o655J8228N797
$$ 16985 21502 13861 8774 16208 13913 16338 12293 11137 18669 22180 17025 10370 28598 34395
7571C4395r115r740M698n107K658M729j4574M108R537J217j3416K777K873m170
$$ 34395 25280 15540 20238 15131 17789 22518 7944 12052 21589 22806 9390 12167 15040 10870
7557A0870m255o660n64K03n166P275K327M854J734j0780k82N504R76K559k14P370
$$ 10870 6615 -45 -609 -406 -5572 1703 4030 8884 10618 -162 -444 5060 6036 8595 8381 15751
7541A5751J2516o198n682j203L099j869q662R727Q652p736r291K686r13M823P295
$$ 15751 28267 22069 16387 15184 18283 16414 7752 17479 26131 18395 9104 11790 10877 15700 22995
7526B2995n297J3339J0487K9j3540j68p051J248R679n740p082j3204r026Q772
$$ 22995 17698 31037 41524 41553 28013 27845 20794 22042 31721 25981 18899 5695 -3331 5441
7512E441J4180Q069N807q63l056L429j840R000R02j3043q393j291p908r924O225
$$ 5441 19621 27690 33497 32634 29578 33007 31167 40167 41069 28026 19633 18342 10434 510 6735
7497F735K0703Q134p45j6719o309M060j657J0704O032j9043r064n925J2942J5643
$$ 6735 27438 35572 34827 18108 11799 15859 14202 24906 30938 11895 2831 -3094 9848 25491
7483B5491j2999L95n964p229R980J7109m584J414M863p543j319j399J115P676
$$ 25491 12492 12887 6923 -306 9674 26783 22199 23613 28476 20933 19614 18215 19330 27006
7469B7006j995J1500k145K906L764r843j5875l721J7106q05j3326j820j235L74
$$ 27006 25011 36511 34366 37272 41036 31193 15318 11597 28703 27898 14572 12752 11517 11891
7455A1891q113j254K4903O544l081j1792j215j3020l961N73j0809N069K2209J8930
$$ 11891 3778 2524 27427 33971 30890 19098 17883 4863 902 1475 -9334 -4265 17944 36874
7441C6874J823k0680j6178J2223O881o877j2095o202J2501k446j3128L653Q283
$$ 36874 38697 18017 1839 14062 20943 14066 1971 -4231 8270 5824 -7304 -3651 4632
7428D632N93L68l23P600r60r191n929K090R421Q152r620R411J7841N601K882n627
$$ 4632 5225 5593 5270 12870 11910 2719 -3210 -1120 8301 16453 6833 16244 34085 39686 42568 36941
7412C6941n575P195j989r09k961j3204q997K219l382k829l061r040Q21J9421J5467
$$ 36941 31366 38561 36572 35663 32702 19498 10501 12720 9338 6509 3448 -5592 -4771 14650 30117
7397C0117j601j4664k689M644q102j7094K115K503k663r75N168P162J5520R195
$$ 30117 28516 13852 11163 15807 7705 -9389 -7274 -4771 -7434 -8409 -3241 3921 19441 28636
7383B8636j4626j3173j431J5726J3961l418q860r725L861J1232R981k382o617
$$ 28636 14010 837 -594 15132 29093 25675 16815 7090 10951 22183 32164 29782 23165
7370B3165j7967n482p61o246J2214R055j939q591M989l975J77M974k595r33k1465
$$ 23165 5198 -284 -1045 -7291 4923 13978 12039 3448 8437 4462 4639 9613 7018 6085 -15380
7355a5380K80J4192J163m502R139J8076J2424q824m642j6187m182r496k55J1908
$$ -15380 -15100 -908 255 -4247 4892 22968 35392 26568 21926 5739 1557 -7939 -8194 3714
7341C714M123J0022j0793K840M489n975j1098j223R532J067P272J0829K147J245
$$ 3714 7837 17859 7066 9906 14395 8420 -2678 -3901 5631 6698 13970 24799 26946 28191
7327B8191j5548j3356j0285R023K2498M291q492J344K272K787J0095q123Q65P856
$$ 28191 12643 -713 -10998 -1975 20523 24814 16322 17666 19938 22725 32820 24697 25562 33418
7313C3418j5009q730O466R70j762j267N928N257O809Q188l626j2094L184J267
$$ 33418 18409 9679 16145 17115 15353 14086 20014 25271 32080 40268 36642 24548 27732 28999
7299B8999l975Q060o209j4253p786l214p910N05q067P049P13N363N506M192Q955
$$ 28999 25024 33084 26875 12622 4836 1622 -6288 -5783 -13850 -6801 -6088 -725 4781 8973 17928
7284A7928p754K650j384l527L19o73L647o538j50J2244J5779q724j8679L48R42
$$ 17928 10174 12824 11440 7913 8232 7559 11206 4668 4518 16762 32541 23817 5138 5486 6428
7269F428q95j0440k746L433L2K097r053o112J6427J1795n503Q994p264q712J815
$$ 6428 5533 -4907 -7653 -4220 -4188 -2091 -11144 -17256 -829 10966 5463 14457 7193 -1519 296
7254B96n035J6420K358L303p22N134J74j0823m299l919P718J2585o540j103o312
$$ 296 -4739 11681 14039 17342 16620 21754 21928 11105 6806 2887 10605 23190 16650 15547 9235
7239I235m333Q547o027L851O757O622j5718Q467J1234q465n622K814l987r020
$$ 9235 4902 13449 7422 11273 18030 24652 8934 17401 28635 20170 14548 17362 13375 4355
7225D355K351O734j494N396J7303r821j1270m372n876o363J788N501P595m610
$$ 4355 6706 13440 11946 17342 34645 24824 13554 9182 3306 -3057 -1269 4232 11827 7217
7211G217N137R446j2929j6738J023J1919M331k621o27j8360q4K1990J0561j0545
$$ 7217 12354 21800 8871 -7867 -6844 5075 9406 6785 6158 -12202 -12286 9704 20265 9720
7197I720p113o193L216P747o294j0294P668L854N569R910Q201j2367j0750j0134
$$ 9720 2607 -3586 -370 7377 1083 -9211 -1543 2311 7880 17790 25991 13624 2874 -7260
7183g260J2865O785N254k4243n458M4n418N356J7426J0092k774M657k911j694
$$ -7260 5605 12390 17644 -6599 -12057 -12013 -17431 -12075 5351 15443 12669 17326 14415 12721
7169A2721j270j297n520K427L141o353k026j416N95K507M045J828l117m332O741
$$ 12721 11451 10154 4634 7061 10202 3849 1823 407 1002 3509 7554 9382 6265 1933 8674
7154H674K466L216O908p552r072r737N022N499j060M609J0409m94l804M10K996
$$ 8674 11140 14356 21264 13712 4640 -5097 -75 5424 4364 8973 19382 18888 15084 15494 18490
7139A8490L668n53n009o208m82q64o113O842L373o334l384P01Q229k423P80l337
$$ 18490 22158 21605 16596 10388 9906 9042 2929 9771 13144 6810 3426 4127 12356 9933 10713 7376
7123G376J1450J0066m507l14j7551j509O849M402O084J1016J306r432q424R530
$$ 7376 18826 28892 24385 24071 6520 5011 11860 16262 22346 33362 34668 25236 16812 26342
7109B6342k47k655j8355P26J1946j7177l92m480K233Q067R038n222j114N085o041
$$ 26342 26095 23440 5085 5811 17757 580 188 -4292 -2059 6008 15046 9824 8710 13795 7754
7094G754n729J555k983n44J377n733J1526m543k0586K494J4022K0843M166L810
$$ 7754 2025 3580 597 53 1430 -4303 7223 2680 -17906 -15412 -1390 19453 23619 27429
7080B7429j1146o61j0483j604R248j727k880q860q001J0656J2076j0089j2281
$$ 27429 16283 15622 5139 3535 12783 11056 8176 -684 -8685 1971 14047 3958 -8323
7067h323L647K295k327J4872J0883p464Q978k867M267m139N558l124o869P763
$$ -8323 -4676 -2381 -4708 10164 21047 13583 22561 19694 23961 19822 25380 22256 15387 23150
7053B3150q531j4604m649O113K97N652n726Q159k677j0044m47K32M678P176j3481
$$ 23150 14619 15 -4634 1479 1776 7428 1702 9861 7184 -2860 -3307 -3075 1603 8779 -4702
7038d702j6352l321o80L256R277J1950p357l259K037M616J2061K091j4438L71
$$ -4702 -21054 -24375 -25055 -21799 -12522 -572 -7929 -11188 -9151 -4535 7526 9617 -4821 -4450
7024d450q765p19J2222M455m417p544P07R401J047k461o434o1R541O428j2608
$$ -4450 -13215 -13934 -1712 2743 -1674 -9218 -8511 890 1937 -524 -6958 -7019 2522 8950 -3658
7009c658k063J1197J9233N643O66J745q107Q305l629k2449j00R73O613J244M360
$$ -3658 -5721 5476 24709 30352 31018 32763 24656 32961 29332 6883 6783 7756 14369 15613 19973
6994A9973L06O463L63O375p689j5997L154j0011p737N907Q158O311l538J770K698
$$ 19973 20279 26742 27105 33480 25791 9794 12948 2937 -4800 1107 9265 15576 12038 13808 16506
6979A6506Q49j0654j9441j376R361O016p213M833N850J5404n198o838j0095o251
$$ 16506 17355 6701 -12740 -14116 -4755 1261 -5952 -1119 4731 20135 14937 8099 -1996 -8247
6965h247p484O359Q258M352J7511O06k5717n368P479J761J0481J3993k633r801
$$ -8247 -15731 -9372 -1114 3238 20749 21355 -4362 -9730 -2251 -490 9991 23984 21351 11550
6951A1550k473P179P108m274Q31m496M847n026j287j0848O169Q126n682j9018
$$ 11550 9077 16256 23364 19090 19921 15425 20272 15246 13959 3111 9280 17406 11724 -7294
6937g294j693J4707O413k83J221r30J7063J5838r513j1356J6147j614r240o713
$$ -7294 -8987 5720 12133 11850 13071 12141 29204 45042 35529 24173 40320 38706 29466 22753
6923B2753j3339Q342n244M644j1229O620O993o19k404j918k090p243J375J8684
$$ 22753 9414 17756 12512 17156 5927 12547 19540 18921 16517 14599 12509 5266 6641 25325
6909B5325k67j0974R817L394j9321j64K162L950o91K584j4973k2P015j878n436
$$ 25325 25058 14084 23901 27295 7974 7810 9972 13922 13231 15815 842 820 7835 5957 521
6894E21j634M778N290M369P81N678J124K757N95l131k76j1072o482j0004n172
$$ 521 -1113 3665 8955 13324 14105 19783 20907 23664 24259 21128 20852 9780 3298 -6706 -11878
6879a1878J0584K093N560K027j0609j0243M274K34j019J6197o613l459N615R117
$$ -11878 -1294 799 6359 8386 -2223 -12466 -8192 -7958 -8977 7220 607 -2852 2763 11880
6865A1880j677K826R306j805j2361q738M692Q852R399m165j3147M113J0500p499
$$ 11880 10203 13029 22335 20530 8169 -569 4123 12975 22374 18209 5062 9175 19675 12176
6851A2176j6921o081J3325n57j2574M469M946K812N449O272j53j448n962l172
$$ 12176 -4745 -10826 2499 1942 -10632 -6163 -1217 1595 7044 13316 13163 11715 5753 2581
6837B581N193o634m302L198j917j4009J8067J2760j0857j0212O367J341k149o389
$$ 2581 7774 1140 -3162 36 -1881 -15890 2177 14937 4080 -6132 235 1576 -573 -6962
6823f962M651J637K229J524K354K328j4954j3005P816J2568K1919k562n967N727
$$ -6962 -2311 -674 1555 3079 5433 7761 -7193 -20198 -12382 186 22105 19543 13576 19303
6809A9303m397p471m759K126j892J467Q802N33j4189r466M963P429M776N788p680
$$ 19303 14906 7435 2676 4802 2910 4377 13179 13712 -477 -9943 -4980 2449 7225 13013 5333
6794E333Q044P045k479j7217j2462j1102K307K4679J7537m955K754K554J4294
$$ 5333 13377 20422 17943 726 -11736 -22838 -20531 4148 21685 16730 19484 22038 36332
6781C6332r882k599p838r500O599j2981j3755j2846O459K4904K4154J3492q868
$$ 36332 26450 23851 16013 6513 13112 131 -13624 -26470 -20011 4893 29047 42539 33671
6768C3671j0909m365j1628J843Q058M06n080N275P934RK939n131j575r995j1140
$$ 33671 22762 18397 6769 8612 16670 17076 11996 17271 25205 25214 28153 23022 21447 11452 312
6753C12n529L631j701M646O140L388M21O589j2702k281j598o938j7190M323O979
$$ 312 -5217 -1586 -3287 1359 7499 10887 11308 17897 5195 2914 1316 -5622 -22812 -18489 -11510
6738a1510j984J433R331J1879J3753j588N030l669n493j1144N420R590j655M350
$$ -11510 -13494 -12061 -2730 9149 22902 21314 26344 22675 17182 6038 11458 21048 19393 23743
6724B3743L527O726QJ865r378k633j873n313l848J578J73l64J520P859J7348L244
$$ 23743 27270 33996 34004 35869 26491 23858 21985 16672 12824 14402 14575 14211 15731 23590 40938 44182
6708D4182J314J0135M902K2595K9545M1217N9591O1620P266m8279n0042n1477
$$ 44182 45496 55631 60533 83128 112673 153890 213481 275101 282367 234088 184046 132569
6696A32569l4195j8649k0543m969j5956j4186j0412l381N878J3469J0335n052
$$ 132569 98374 79725 59182 54213 38257 24071 13659 10278 16156 29625 39960 34908
6684C4908j2074J0364N6m078O33m01m186j1760K690n743j774L369L717j4126j6857
$$ 34908 22834 33198 33254 29176 29809 29408 25222 13462 16152 10409 8635 12004 15721 1595 -15262
6669a5262J0564N107J202N768j415o5J1713k040m791o747j0499k022l385n100
$$ -15262 -4698 409 1611 7379 5964 5899 17612 15572 10781 4034 -6465 -8487 -11872 -16972
6655a6972n9n79J742k530O221J0106K1342j0209j884q691j3975P512J5197M324
$$ -16972 -17031 -17610 -15868 -18398 -12177 -2071 19271 9062 7178 -1513 -15488 -7976 7221 11545
6641A1545M827o341j3691R809K424p307P15J5844Q552P604k7187k1872l893q437
$$ 11545 16372 10031 -3660 6149 8573 1266 1981 17825 26377 33981 6794 -15078 -18971 -27408
6627b7408O302J6936Q762R007M867r91J165J0368J2731l965j6588j6331k362p80
$$ -27408 -21106 -4170 4592 13599 18466 17475 18640 29008 41739 37774 21186 4855 2493 1713
6613A713L751P32l30K202j3258Q163K360m397l434P28J2290J727J0730k152o547
$$ 1713 5464 6196 5866 8068 -5190 2973 5333 936 -2498 -1770 10520 12247 22977 20825 14278
6598A4278j637N043O078j0402j3902L760j619j656K3024L606j254r793j0282m178
$$ 14278 12641 17684 23762 13360 -542 3218 1599 -57 22967 26573 25319 15526 5244 1066
6584A066J533N50K435R497L594M111Q137J08O49P138J506k990n639n627o907n719
$$ 1066 2599 3149 5584 15081 18675 22786 30923 31031 31680 38818 40324 37334 31695 26068 19161 13442
6568A3442n965l561j355k991j8144L989P788j118o667j2326N694K0108K0423O094
$$ 13442 7477 3916 2561 -430 -18574 -14585 -6797 -7915 -14582 -26908 -21214 -1106 19317 25411
6554B5411j2167k068j2346M193K781o523q388j3404J3461J5978J1807p04k346
$$ 25411 13244 11176 -1170 3023 5804 -719 -9107 -22511 -9050 6928 18735 18031 15685
6541A5685j8104L512M115l613r957j521R604J2626P669m036k1177m418J4963J2086
$$ 15685 -2419 1093 5208 1595 -8362 -9883 -279 12347 20016 15980 -5197 -9615 5348 17434
6527A7434q97K456J1312j2801k654j2732j0853L751Q577q79J867o257l973J7339
$$ 17434 16537 18993 30305 17504 14850 2118 -8735 -4984 3593 2714 4581 -1676 -5649 11690
6513A1690L071J23p767j6534j6409J3176K424N1N899J3857m386p829j7883j148
$$ 11690 14761 14884 7117 -9417 -25826 -12650 -10226 -10175 -4276 9581 5195 -2634 -20517 -21665
6499b1665p66J2417J5093l40K269m694j1190o328J9100R030K807J577j0373j3471
$$ -21665 -22431 -10014 5079 4739 7008 2314 -8876 -15204 3896 12926 15733 17310 6937 -6534
6485f534K08K604k089o981j5458p957P937J3964m157j0557J1646O351N910N554
$$ -6534 -6326 -3722 -5811 -12792 -28250 -36207 -28270 -14306 -18463 -29020 -17374 -11023 -5113 441
6471D41l988j1553L574R488K921P282M585K001k643N462r884j2654O641j17n801
$$ 441 -3547 -15100 -11526 -2038 883 8165 12750 14751 12108 17570 7686 -4968 1673 1556 -4245
6456d245j036N53J3985n773o010k256Q451M438P011j0556j2683J1301p015J590
$$ -4245 -5281 -4728 9257 3484 -2526 -4782 3669 8107 15118 4562 -8121 3180 -3835 -2245
6442b245P164l081R073j1836L985j5073k62J964k959j700n192K683J2320l10m670
$$ -2245 4919 1838 10911 -925 3060 -12013 -12275 -10311 -13270 -14970 -20162 -17479 -5159 -5469 -10139
6427a0139J0576J866L750J981o98N937o18p070n461j5594j1238O4J4911K816R989
$$ -10139 437 2303 6053 8034 7336 13273 12655 5585 124 -15470 -26708 -26644 -11733 -8917 1072
6412A072M293q21k131o836J2404Q569j1128K160r937k025R274L997l219P712j2972
$$ 1072 5365 4544 2413 -4423 7981 16550 5422 7582 -2355 -4380 4894 8891 5672 13384 412
6397D12o700K7149P014p968o569Q24o913r082q257o247K584R609L356P809J948
$$ 412 -6288 20861 27875 19907 13338 14162 7249 -1833 -10090 -16337 -13753 -4144 -788 7021 8969
6382H969J483O697j7176l884R165N181j475n021L79K453O520J620M540k954l278
$$ 8969 10452 17149 -27 -3911 5254 10435 8960 3939 4318 6771 13291 14911 19451 16497 13219
6367A3219N641j117l316k587o694L554k114m485J498p996n299j817P83o62M771
$$ 13219 18860 17743 14427 11840 5146 8700 6586 2101 3599 -4397 -9696 -11513 -10730 -11392 -6621
6352f621J273J60p733k873p909k497J1751p48k373J945k42L050O232M60L282R501
$$ -6621 -5348 -5188 -12921 -15794 -23703 -26200 -14449 -15197 -17570 -15625 -15867 -12817 -6585 -6125 -2843 6658
6336F658q151q089K612P332n675N387K390j3798l619J0289j934O415j89L68r750
$$ 6658 -1493 -9582 -6970 362 -5313 74 2464 -11334 -14953 -4664 -6598 -183 -372 -4 -9754
6321i754K143J643J1452N086l197L162k066j0703J730j913j888M605P554j384
$$ -9754 -7611 -5968 5484 10570 7373 10535 8469 -2234 -504 -2417 -4305 300 7854 6470
6307F470r869j522O07J818Q73M108O108n588n282k521j2585L539Q44N422j671
$$ 6470 -3399 -4921 -4314 -2496 -1623 2485 8593 3005 -2277 -4798 -17383 -13844 -13000 -7578 -9249
6292i249j115Q462N698j5089j3566P708J2026Q588j229j1653k535O630j1090j6155
$$ -9249 -10364 -1902 3796 -11293 -24859 -17151 -5125 3463 2234 -9419 -11954 -5324 -16414 -32569
6278c2569P814n965J0147J2262M903N662L509O596o968n67R121L224P47M918r761
$$ -32569 -24755 -30720 -20573 -8311 -3408 2254 5763 12359 5391 4824 13945 17169 17916 22834 13073
6263A3073j0147R468J3362j306n539O823m380r597K144L395q404O953l011l824
$$ 13073 2926 12394 25756 24450 18911 25734 21354 11757 13901 17296 8892 15845 12834 9010
6249I010Q534l521r029o330L146j5857o843J0118J4611l795q148J2198j798L921
$$ 9010 17544 14023 4994 -1336 1810 -14047 -20890 -10772 3839 44 -8104 4094 2296 6217
6235F217m241j143J0295n850n515J5797j1885j6770j1043Q51j313K800j499K895
$$ 6217 1976 833 11128 5278 -237 15560 3675 -13095 -24138 -23287 -24600 -21800 -23299 -20404
6221b0404J3082P868O177k989N651K351p855K898m669o831p853M558P66o158N797
$$ -20404 -7322 546 6723 3734 9385 11736 3881 6779 2110 -4721 -12574 -8016 -7250 -13408 -7611
6206g611J641j772J0832J2058k524p117n384m208j0892l878o911J6528J4203N80
$$ -7611 -5970 -7742 3090 15148 12624 5507 123 -4085 -14977 -18855 -25766 -9238 4965 5545
6192E545j8824K824J0849m879p911L586j95o981L292J3199l803l164n137R720
$$ 5545 -13279 -10455 394 -4485 -12396 -8810 -9005 -15986 -12694 505 -3298 -6462 -11599 -1879
6178a879J0614p629l110J4284K831J1097j1561p919l778m053P92K008O917Q902
$$ -1879 8735 1106 -2004 12280 15111 26208 14647 6728 2950 -1103 -311 1697 8614 17516
6164A7516o353q611m748J23R229P137j954J39l933l186q737M273k929j3050n847
$$ 17516 11163 2552 -2196 -2073 7156 14293 12339 12478 8545 5359 -3378 895 -2034 -15084 -20931
6149b0931n79Q116N875P646r534j0727q362J1750J9406Q014N170j2258m973N980
$$ -20931 -21510 -13394 -7519 127 -9407 -20134 -28496 -16746 2660 10674 15844 3586 -1387 4593
6135D593r782N5J4921Q448m875r802k0264k633l546J2581Q097k375j0658n505
$$ 4593 -5189 -5134 9787 18235 13360 3558 -16706 -19339 -22885 -10304 -2207 -4582 -15240 -20745
6121b0745J572p59N360J207M899O276j1320L951J5343p84J906n384o261p173J5352
$$ -20745 -19173 -19932 -14572 -13365 -8466 -2190 -13510 -9559 5784 5000 6906 1522 -4739 -11912 3440
6106C440N905j3581j4105K72q221J0977l154j540N246N088J2923K119q603m961
$$ 3440 9345 -4236 -18341 -18069 -26290 -15313 -18467 -20007 -14761 -9673 3250 5369 -3234 -8195
6092h195K655O272P369o080j6743o987J1802Q182J1389n834k654N967M552Q750
$$ -8195 -5540 732 8101 2021 -14722 -21709 -9907 -1725 9664 3830 1176 7143 11695 20445
6078B0445r9k507j0213n128N283J0430m836j7786N05N415q317J3230j4620k004
$$ 20445 20346 17839 7626 2498 7781 18211 13375 -4411 -3906 1509 -6808 6422 -8198 -10202
6064a0202j309M675N579n383j1275L403J0532L884P29j3235n979m763J4806P599
$$ -10202 -11511 -6836 -1257 -6640 -17915 -14512 -3980 -96 633 -12602 -18581 -23344 -8538 -939
6050i39K191j1497P668J0777L35j6138o36q32k340o509J3526Q985K830J167n870
$$ -939 1252 -10245 -2577 8200 8535 -7603 -8239 -9071 -11411 -17920 -4394 4591 7421 8588 2718
6035B718L433O944K348j7698j9359j510r31Q114k079j0181m59r417r970K7318
$$ 2718 6151 13095 15443 -2255 -21614 -23124 -24055 -15941 -18020 -28201 -28660 -38077 -48047 -20729
6021b0729K2683L436L952P001R463k675k797Q709j4033L916j477n539m357k369
$$ -20729 1954 5390 9342 16343 25806 23131 20334 29043 15010 18926 17449 11910 7553 5184
6007E184n669l843k205l317l296j2304N113M334m752J264J6692J5937N20k0560
$$ 5184 -485 -4328 -6533 -9850 -13146 -25450 -20337 -16003 -20755 -19491 -2799 13138 13658 -6902
5993f902O660j036n65Q016k361n35J223k789O263J393O099n998q873j2566r992
$$ -6902 -242 -1278 -1843 6173 3812 3277 4500 1711 7974 9367 15466 9468 595 -11971 -21963
5978b1963P577J0964L721j0211n287J0288o821O122J1225p987N176p38k805o247
$$ -21963 -14386 -3422 299 -9912 -15199 -4911 -11732 -5610 5615 -2372 2804 2066 -739 -6986
5964f986O107N72j3907o262K849O857M008O449j287n444M631L352m759p073j0485
$$ -6986 -879 -307 -14214 -20476 -17627 -10770 -6762 -313 -1600 -7044 -2413 939 -3820 -10893 -21378
5949b1378J7072r304j80P433L74J344m80L494Q167j1714j6208N034O424l768N309
$$ -21378 -4306 -13610 -13790 -6357 -5983 -4639 -5119 -1625 6542 -5172 -21380 -16346 -9922 -13690 -8381
5934h381l471q77J111j513J5266L22J848J1380O395k2130j4322J984M910N473
$$ -8381 -11852 -12729 -11618 -13131 2135 2457 4305 15685 22080 -50 -14372 -12388 -7478 -2005
5920b005n369O666K908p872j0914L162L075m399j280K934O812n929j113N562J2922
$$ -2005 -7374 -708 2200 -5672 -16586 -13424 -10349 -14748 -16028 -13094 -6282 -12211 -13324 -7762 5160
5905E160N829R882o230o461L572L777L45o995o814l221l731p548J0003J2449j176
$$ 5160 10989 20871 14641 8180 11752 15529 15874 8879 2065 -1156 -4887 -12435 -2432 10017 8841
5890H841n746m757l176P600r49p969N95J213M878J990j019K145j341r609P946
$$ 8841 3095 -1662 -4838 2762 1813 -6156 -5561 -4348 530 2520 1501 3646 2305 -7304 642
5875F42k37r598J3071J0822L672q361N7n305j1797J049j905r347l677J3740j658
$$ 642 405 -9193 3878 14700 18372 10011 10068 4763 -7034 -5985 -7890 -17237 -20914 -7174 -8832
5860h832o048j326L417K978J827J2349J475L30J609j467j5733Q001K3767r61J022
$$ -8832 -14880 -16206 -12789 -9811 -7984 4365 5840 6170 7779 6312 -9421 -1420 22347 21386 22408
5845B2408J642J797j4839n085m30j2117r922J3910R617K565p291J1352j463p492
$$ 22408 24050 25847 11008 5923 5493 -6624 -16546 -2636 6981 9546 2255 13607 12144 4652
5831D652j987p220N84m267J3559j973m725r840J702N570J1129N12k3819P198L343
$$ 4652 2665 -4555 -3971 -8238 5321 3348 -1377 -11217 -9515 -3945 7184 7696 -16123 -8925 -5582
5816e582K960J5677k5j4111M218j061p259p919L037R207N432m443j82k824K988
$$ -5582 -2622 13055 13030 -1081 3137 2076 -5183 -13102 -10065 -858 4574 131 -51 -2875 113
5801A13o87j108p594k71p29J8370r87n546j816o048p996M427n13J0081P443j4846
$$ 113 -574 -1682 -9276 -9547 -10276 8094 7107 1561 -255 -6303 -14299 -9872 -10385 -304 7139 -7707
5785g707j935J0359K635J1742j0421o761K205j0952o107J1961R873p257q130L752
$$ -7707 -9642 717 3352 15094 4673 -2088 117 -10835 -16942 -4981 4892 -2365 -10495 -6743
5771f743P028M652p219o574N390N361m253N638R464J7804p517j2493k638M243
$$ -6743 285 4937 -2282 -8856 -3466 1895 -2358 3280 12744 30548 23031 10538 7900 12143
5757A2143O503k552j1679l822o286r785L03m252j196o014J2225Q456p492N298
$$ 12143 18646 16094 4415 593 -5693 -15478 -15175 -19427 -20623 -26637 -14412 -5956 -13448 -8150
5743h150L036K222l915q600J2765j0731m828J76j852O832R91j1927r73j495J4852
$$ -8150 -5114 -2892 -6807 -15407 -2642 -13373 -18201 -18025 -19877 -13045 -12054 -23981 -24954 -26449 -11597
5728a1597J1404R533m202r319K497J3856m593l917l073P39N590O640K274O366
$$ -11597 -193 9340 5138 -4181 -1684 12172 7579 3662 589 1328 6918 13558 15832 22198
5714B2198o934j4684r671N868N475n059m29N059J273o759j3425k132J4828J6020
$$ 22198 15264 580 -9091 -3223 2252 -2807 -3236 1823 3096 -3663 -17088 -19220 -4392 11628
5700A1628o09j2406p498P085Q995r04R855j5566r673L806L133J5635N688N38j1583
$$ 11628 11019 -1387 -8885 -1800 7195 6291 16146 580 -9093 -5287 -2154 13481 19169 19707 8124
5685H124m87j1402j694O71O135P924J728L099j713q941l967l862l463n12J2755
$$ 8124 7637 -3765 -5459 -4788 1347 9271 10999 14098 12385 3444 -523 -4385 -7848 -8360 4395
5670D395K518m629N035P960o446o360P48M804r769m78M597l107p919k3n227N896
$$ 4395 6913 2284 7319 15279 8833 2473 3221 8025 -1744 -2222 2375 -732 -8651 -8674 -13901 -8005
5654h005L174p725J219P373K0458m53j0038J87k299j1893j444J599l39k808o397
$$ -8005 -4831 -12556 -11337 -3964 16494 16041 6003 6190 3891 -8002 -9446 -7847 -8186 -10994 -17391
5639a7391q522n678J0385n103M163N065L94K296L697N571N42o783o70Q34l4Q023
$$ -17391 -25913 -31591 -21206 -26309 -22146 -17081 -16687 -14391 -10694 -5123 -4581 -11364 -12034 -11200 -11234 -3211
5623c211J0663k857p589M020J9385K871j2708R305M162r312n734k297J186o666
$$ -3211 7452 4595 -2994 1026 20411 23282 10574 19879 24041 14729 8995 6698 7884 1218
5609A218o287r89L207K973P98j852M772q890Q226L327M923J1068j0225m911q588
$$ 1218 -5069 -6058 -2851 122 920 -932 3840 -5050 3176 6503 11426 22494 12269 7358 -1230
5594a230J361O46L513K722j318j0760l302N004M452j4221k32Q639N229J7322l200
$$ -1230 131 777 4290 7012 5694 -5066 -8368 -3364 1088 -13133 -13365 -4726 503 17825 14625
5579A4625j1952l407P939p524P569n468o919N900p504l849j659j9324l366Q042
$$ 14625 2673 -734 7205 -319 7250 1782 -5137 763 -6741 -10590 -12249 -31573 -34939 -26897
5565b6897M616J8139L821m700k820J260p228Q297j2209o524j714P645m618R547
$$ -26897 -22281 -4142 -321 -5021 -7841 -6581 -13809 -5512 -17721 -24245 -25959 -18314 -22932 -13385
5551a3385R28K803o598p420Q914O902P387j2075J081J1625j10r98O561L625n32
$$ -13385 -12457 -9654 -16252 -23672 -14758 -7856 -469 -12544 -11463 162 52 -946 5615 9240 8708
5536H708j3116j829P292R269r376n000J2854N36K442o171K0263j217j6452j5885
$$ 8708 -4408 -6237 1055 10324 948 -4052 8802 9338 11780 5609 25872 24655 8203 -7682
5522g682J3989J0712N755l941N44j5222l239k598j230q221l244J2341R827k168
$$ -7682 6307 17019 22774 18833 19377 4155 916 -1682 -2912 -11133 -14377 -2036 7791 5623
5508E623l479k839O927l837j0382j0338M170R423k327L293n312l939K668R595
$$ 5623 2144 -695 6232 2395 -7987 -18325 -14155 -4732 -7059 -3766 -9078 -13017 -10349 -754
5494g54J2405J4735p272o496r554q596r36P735L029Q154q239N249J0279j0518
$$ -754 11651 26386 19114 12618 3064 -5532 -6468 1267 4296 12450 4211 9460 19739 9221
5480I221j4069J264l986j1602K016J121l462J678o813pP981M402j0424P250K1635
$$ 9221 -4848 -3584 -7570 -19172 -17156 -16035 -19497 -17819 -24632 -24639 -16658 -12256 -22680 -15430 6205
5465F205j537j0003r709m474p118K892J1414M117r216q587P394J8761M22k397
$$ 6205 4668 -5335 -15044 -19518 -26636 -23744 -12330 -8213 -17429 -26016 -18622 139 561 -1836
5451a836J3356R12O614N525o757k5246l898J8415o360j1642K083N763J2914L324
$$ -1836 11520 12432 19046 24571 17814 -7432 -11330 7085 725 -10917 -8834 -3071 9843 13167
5437A3167m599n723o723L38m021Q815j822j3473Q198J6245J862p853J3420m601
$$ 13167 8568 2845 -3878 -3540 -7561 1254 -568 -14041 -5843 10402 12264 4411 17831 13230
5423A3230n146O094k620j1907j5446p519L616n00J9190J1760L184J1392J388j393
$$ 13230 8084 14178 11558 -349 -15795 -23314 -19698 -20198 -1008 10752 13936 25328 26716 25323
5409B5323p330j4378q81l231R306k250l08j3304o677J4331R922r058m628J6583
$$ 25323 17993 3615 2734 -497 8809 6559 6251 -7053 -13730 601 10523 1465 -3163 13420
5395A3420R147p777k949j4858j6867o708K9n526M022N06L02J7777K623q707R382
$$ 13420 22567 14790 11841 -3017 -19884 -26592 -26563 -32089 -28067 -27561 -27259 -9482 -6859 -15566 -6184
5380f184M884m605q068j550N326J5875R436L118m58n001l548L585l242o257N884
$$ -6184 -1300 -5905 -13973 -15523 -10197 5678 15114 18232 17774 12773 9225 12810 9568 3311 9195
5365I195M441O307j0992j0002N216o156j1031j908m086J4832J0416n230M977M200
$$ 9195 13636 19943 8951 -1051 4165 -1991 -13022 -14930 -19016 -4184 6232 1002 5979 10179
5351A0179j3179j1522J0878p04m861q808Q330J0939k09n914o637P612k634J249
$$ 10179 -3000 -14522 -3644 -4348 -9209 -18017 -9687 1252 1043 -4871 -11508 -3896 -6530 -5281
5337e281R901O358j97l310J7793l704j4397O116j602L281j0965j3293P59r679
$$ -5281 4620 10978 10781 7471 25264 21560 7163 13279 11677 14958 3993 -9300 -8541 -18220
5323a8220N937Q762j418k819r086l013J0776K332j309j6635j998J1160K4915M982
$$ -18220 -12283 -3521 -4939 -7758 -16844 -19857 -9081 -6749 -8058 -24693 -26691 -15531 9384 14366
5309A4366M545J0184n25n473q426j3822N963k04r080j2684O705J2450O227J575
$$ 14366 18911 29095 28570 23097 14671 849 6812 6608 -2472 -15156 -8451 3999 10226 11801
5295A1801J71M470L205P449p347k2941k314M823Q22J0182P313l481j6093j4815
$$ 11801 11972 16442 19647 27096 19749 -3192 -5506 -683 139 10321 17634 14153 -1940 -16755
5281a6755j1185J4498J2002q543J4329M698k020j8492j8018o015Q66K2634J0964
$$ -16755 -27940 -13442 -1440 -9983 4346 9044 7024 -11468 -29486 -35501 -34635 -12001 -1037
5268a037P043O093o041j2020j476M453K793J1180J0396j5867j4860k900M496k592
$$ -1037 6006 12099 6058 -5962 -7438 -2985 -192 10988 21384 5517 -9343 -12243 -7747 -10339
5254a0339K512O453K286L223j2862q193l115k801L2L621p075J8935J5671P682
$$ -10339 -7827 -1374 912 4135 -8727 -16920 -20035 -22836 -22804 -19183 -26258 -7323 8348 16030
5240A6030p514n258M861M613j2610j8747Q013M170n899J014L67o056L021J2203
$$ 16030 8516 3258 8119 12732 122 -18625 -10612 -6442 -12341 -11327 -10960 -17016 -13995 -1792
5226a792l095o294j966m206n130M243K166L564Q65R755o208m442K206L401j66
$$ -1792 -4887 -11181 -13147 -17353 -22483 -18240 -16074 -12510 -11645 -1890 -8098 -12540 -10334 -6933 -7099
5211g099L729M170J040L652q282J573r764j1330p27l508J257P734N966n180J972
$$ -7099 -3370 800 1840 5492 -2790 -1217 -10981 -22311 -23038 -26546 -25289 -17555 -11589 -16769 -14797
5196a4797J4792J4726J2725j102L336r506r358o861j1497O929O227m661q636J5300
$$ -14797 -5 14721 27446 26344 29680 20174 10816 3955 -7542 -613 5614 953 -7683 7617
5182G617J2762j0943j7512n400P303J4513Q402q622n419m73O093p635j2740K892
$$ 7617 20379 9436 -8076 -13476 -6173 8340 16742 8120 2701 2228 8321 686 -12054 -9162
5168i162j35q24l343k088m308R056n376k2156J692J1828O489l207l887n090J976
$$ -9162 -9297 -10121 -13464 -15552 -19860 -10804 -16180 -38336 -36644 -24816 -18327 -21534 -25421 -30511 -28535
5153b8535J6363n30p84Q020L858l453M164n127j3538l730M261J3138O591l506
$$ -28535 -12172 -12702 -13486 -5466 -1608 -5061 -897 -6024 -19562 -23292 -19031 -5893 698 -2808
5139b808k247k548o68j027N456L561O274k832k800j8915Q795J1885J294r758p090
$$ -2808 -5055 -7603 -8271 -9298 -3842 -281 5993 3161 361 -18554 -9759 2126 3420 -6338 -13428
5124a3428j072j811R530L937o936K595j200J1864R204n992r620M03J0775k848
$$ -13428 -14500 -16311 -6781 -2844 -9780 -7185 -8385 3479 12683 6691 -2929 -2526 8249 5401
5110E401l01J988k111P598L286N301p492m012q109j1849j0888l461j830O87J0040
$$ 5401 5100 7088 4977 12575 15861 21162 13670 9658 1549 -10300 -21188 -24649 -26479 -25792 -15752
5095a5752J2600L617n494n922L533O419q408j864r157o331Q349N532j0551r656
$$ -15752 -3152 465 -5029 -10951 -7418 -999 -9407 -11271 -20428 -26759 -18410 -12878 -23429 -33085
5081c3085N133J1322Q139p043p367K582J4740J1024K603N488L068j164j0755j6747
$$ -33085 -27952 -16630 -8491 -15534 -22901 -20319 -5579 5445 8048 13536 16604 15440 4685 -12062
5067a2062N209J3551M472p941j7481N200n151j949J994J4207O771j6665R142J2921
$$ -12062 -6853 6698 11170 3229 -14252 -9052 -14203 -16152 -14158 49 6820 -9845 -703 12218
5053A2218k4540j4965J3320K1360n092j2960K363O113L786j0006j1677K906r913
$$ 12218 -12322 -27287 -13967 7393 2301 -10659 -8296 -2183 1603 -8403 -20080 -17174 -27087
5040b7087O907p585o346J4673R289n548n513J0299M798q447j055J776R677J2909
$$ -27087 -20180 -27765 -34111 -19438 -10149 -15697 -21210 -10911 -6113 -14560 -15615 -13839 -4162 8747
5026H747J5748o666m858q189r94r476p500K970m097q34m977j0042R214J6497m905
$$ 8747 24495 17829 12971 4782 3788 -5688 -13188 -10218 -14315 -15149 -20126 -30168 -20954 -4457 -9362
5011i362L450l270m931M912J831L150O326J134l211k840O350L347n644J1090n939
$$ -9362 -5912 -9182 -14113 -9201 -7370 -4220 2106 3240 29 -2811 3539 6886 1242 12332 6393
4996F393j4011r418k394J0824J3074Q18k676M129N576K167p938j0064N054L794
$$ 6393 -7618 -17036 -19430 -8606 4468 5286 2610 6739 12315 14482 6544 -3520 1534 5328
4982E328l082j220O549K723p055n935J638O929o313l592j3097Q220R885Q412M122
$$ 5328 2246 1026 7575 10298 3243 -2692 -1054 5875 -438 -4030 -17127 -8907 978 9390 13512
4967A3512j760j1427r449k830j2223J869O706j906p62j814O409J3513n241j3543
$$ 13512 11752 325 -9124 -11954 -24177 -22308 -15602 -17508 -18270 -20084 -13675 -162 -5403 -18946
4953a8946p651P984L733j990m658m40j047J727J3481O44L930m704m309j4391P247
$$ -18946 -26597 -18613 -14880 -16870 -21528 -21968 -23015 -21288 -7807 -7163 -3233 -7937 -12246 -26637 -19390
4938a9390K1715O0J690k364J750O32j5065J8K731L711J056p640j638J1201J4060
$$ -19390 2325 2385 4075 1711 3461 4093 -10972 -10954 -8223 -4512 -3456 -11096 -12734 -1533 12527
4923A2527m550j0112O97r00N344Q707N492q064o081q267o786L044k807m519J1228
$$ 12527 7977 -2135 -1438 -2338 3006 11713 17205 9141 3060 -5207 -11993 -8949 -11756 -16275 -5047
4908e047L547j3631k251J821R286J3319n101j2102o650J0521J3811M423l879k112
$$ -5047 -1500 -15131 -17382 -15561 -6275 7044 1943 -10159 -16809 -6288 7523 11946 8067 5955
4894E955n96r657M753k71m165R67j2937k777L89P23m846K2833J4093J0264l014
$$ 5955 5359 -4298 455 184 -3981 -3014 -15951 -18728 -18339 -17616 -22462 371 14464 24728 21714
4879B1714j2266j2645o828o436j69k827j123J4051R352q704j3493J3259J4442
$$ 21714 9448 -3197 -10025 -16461 -16630 -19457 -20580 -6529 2823 -5881 -19374 -6115 8327
4866H327J6016j3825j7116o948k064O227q430L145J829O324K049l829J1189j1443
$$ 8327 24343 10518 -6598 -13546 -15610 -9383 -17813 -14668 -12839 -6515 -4466 -8295 2894 -8549
4852h549k610q19j761J0205J5366Q251k0340o991J8279P454o017j684m518Q40
$$ -8549 -11159 -11978 -13739 -3534 11832 20083 -257 -7248 11031 18485 12468 10784 6266 7106
4838G106q45j322j2674N278P675p277j0596l704p078j2968O891k061O079Q406
$$ 7106 6261 4939 -7735 -2457 5218 -2059 -12655 -16359 -23437 -36405 -29514 -31575 -25496 -17090
4824a7090j0808j851J8724J7693m439K408N013j769L657L52l213o177j0135n345
$$ -17090 -27898 -29749 -11025 6668 2229 4637 9650 7881 11538 11890 8677 2500 -7635 -12980
4810a2980L653L542J0095K795j0150o936l139P262j1410L143J3544j0816q725
$$ -12980 -9327 -5785 4310 7105 -3045 -9981 -13120 -5858 -17268 -14125 -581 -11397 -20122
4797b0122K311m920J3648L995n2l29r849p417l939P794L330o391r307L328J3563
$$ -20122 -17811 -22731 -9083 -5088 -5140 -5469 -15318 -22735 -26674 -18880 -15550 -21941 -31248 -27920 -14357
4782a4357J3931O869j926j0831q008j648J748l529o890j551J5580L405o227j392
$$ -14357 -426 6443 4517 -6314 -14322 -15970 -14222 -17751 -24641 -26192 -10612 -7207 -13434 -14826
4768a4826j4495j647J132J3278k114k936P542N667j193N327M184n69J0890q752
$$ -14826 -29321 -30968 -29836 -16558 -18672 -21608 -14066 -8399 -9592 -4265 -81 -650 10240 1488
4754A488k0723O335J0483K644q018K267J4940K392j3473l134m520k34k798P715
$$ 1488 -19235 -12900 -2417 227 -7791 -5524 9416 11808 -1665 -4799 -9319 -9553 -12351 -4636
4740d636p05m180k438j103P125L65J350K7p342k95L200l212k058n14M783r731
$$ -4636 -5341 -9521 -11959 -13062 -5937 -5572 -4222 -4195 -11537 -11832 -8632 -11844 -13902 -14416 -9633 -19364
4724a9364N18l571R48O529Q824K318r594o9J708N25O171J5540O153r227o040o369
$$ -19364 -18846 -22417 -21469 -14940 -6116 -3798 -13392 -13461 -11753 -11228 -5057 10483 16636 7409 1369 -5000
4708e000r51J0888L116k951k636P25J036L86k88q929n710N444r205L383n033O495
$$ -5000 -5951 4937 8053 5102 2466 3191 4227 4613 4325 -4604 -10314 -4870 -14075 -10692 -15725 -9230
4692i230O104J6584J3197K180q898p693n750j1246q013k116L579J2374L316k704
$$ -9230 -3126 13458 26655 28835 19937 12244 6494 -4752 -12765 -14881 -11302 1072 4388 1684
4678A684m364p520m68k168O46J26Q969l730j5841P515P085J959q48L267J40k205
$$ 1684 -2680 -10200 -10668 -12836 -12190 -12064 -3095 -6825 -22666 -15151 -8066 -6107 -6955 -3688 -3548 -5753
4662e753K428J1174K265k203q031m514O440q290j1500Q435O379q39j1071j6460
$$ -5753 -3325 7849 10114 7911 -120 -4634 1806 -6484 -17984 -9549 -3170 -4009 -15080 -31540
4648c1540N726J9364J3067j1076j447q069L045o380L480N738J8692N382n228m206
$$ -31540 -25814 -6450 6617 -4459 -5906 -13975 -10930 -17310 -13830 -8092 10600 15982 10754 6548
4634F548n209m881J493J3803j258m489P451n32L593Q819o795j0498M554j842N441
$$ 6548 1339 -3542 -2049 11754 10496 6007 13458 12926 16519 25338 18543 8045 12599 10757 16198
4619A6198j2073j4342j2312L505j392K19p097J5822K0234P044q019k468j1868
$$ 16198 4125 -10217 -22529 -19024 -20416 -20197 -27294 -11472 8762 15806 7787 5319 -6549
4606f549j4127O255R348q560j0447J0663J4120K145j8163l836O499M233r769j185
$$ -6549 -20676 -14421 -5073 -13633 -24080 -13417 703 2848 -15315 -19151 -12652 -8419 -18188 -19373
4592a9373J5608m289L081m002r562N340J1434K968q40j90o111j524m136M556J3314
$$ -19373 -3765 -8054 -4973 -8975 -18537 -13197 -1763 1205 365 175 -5936 -7460 -11596 -7040 6274
4577F274j216n736M799R630j2692j1489J421M587K035M099J330j290m780m642
$$ 6274 5058 -678 4121 13751 1059 -10430 -9009 -4422 -2387 1712 3042 1752 -3028 -7670
4563g670J588j1629j2058L162Q460L995k343J2878Q810r644m640J1331J1107O8
$$ -7670 -6082 -17711 -29769 -26607 -18147 -14152 -16495 -3617 5193 -4451 -9091 2240 13347 13415
4549A3415j2672K65J1342j0618o907q355L39J5722P474j593k249k888k861j5866
$$ 13415 743 1008 12350 1732 -5175 -13530 -13191 2531 10005 8412 6163 3275 414 -15452
4535a5452O872O25p442M410J0163j7762K438j425j0920J314J9348J5330R38j1337
$$ -15452 -8580 -7955 -15397 -10987 -824 -18586 -16148 -17573 -28493 -27179 -7831 7499 8437 -2900
4521b900J02O590q535q622K356N243m48j6394q18J0114J2386L154j2632O027J823
$$ -2900 -2798 3792 -4743 -13365 -11009 -5766 -6214 -22608 -23426 -13312 -926 2228 -10404 -4377 -2554
4506b554o138J904Q027J740m056N351j318l424j1815j4562j027L744J172O669
$$ -2554 -8692 -6788 1239 2979 -1077 4274 2956 -468 -12283 -26845 -27872 -24128 -22956 -16287
4492a6287P868O120n435N385J978m766J0639K355J655k728m540j0733p487M25
$$ -16287 -8419 -2299 -7734 -2349 -371 -5137 5502 7857 9512 6784 2244 -8489 -15976 -15551
4478a5551k047N087J5323L726q884j3479K019O490N872J3000j1309r113P085l054
$$ -15551 -17598 -12511 2812 6538 -2346 -15825 -13806 -7316 -1444 11556 247 -8866 -1781 -4835
4464d835j07K407n484K772l966N781J2199j0894o320K61L968J4776k761j5086
$$ -4835 -4942 -2535 -8019 -5247 -9213 -3432 8767 -2127 -8447 -8186 -4218 10558 7797 -7289
4450g289n962k300L015J4705m660j4472k360O274J0208L416j4963q654J0193J796
$$ -7289 -13251 -15551 -12536 2169 -2491 -16963 -19323 -13049 -2841 575 -14388 -23042 -12849 -11053
4436a1053l953P472R409K0422j9886k0126j479K589L473M140Q022j1380k431J4932
$$ -11053 -15006 -7534 1875 22297 2411 -17715 -19194 -16605 -13132 -8992 -970 -12350 -14781 151
4422A51j0887m009K897o292j4437j967M689J0042m163J3730J5791k179j0205K780
$$ 151 -10736 -14745 -11848 -18140 -32577 -34544 -29855 -19813 -23976 -10246 5545 3366 -6839 -4059
4408d059n400j0002N538N211Q273K660r823J29p665N541K358J5258M229N1q21
$$ -4059 -9459 -19461 -13923 -8712 -439 2221 -7602 -7473 -15138 -9597 -7239 8019 12248 12299 11478
4393A1478q652j6689l008J2194n554J4777j6091k2653q669R034J2384K6863Q930
$$ 11478 2826 -13863 -16871 -4677 -10231 4546 -11545 -34198 -42867 -33833 -21449 5414 14344
4380A4344j3362r693K063R661M403j7024k294L613o341j7250M585Q157J821L31
$$ 14344 982 -8711 -6648 3013 7416 -9608 -11902 -8289 -14630 -31880 -27295 -19138 -17317 -16986
4366a6986l995m302K068J3530L989J172p966n667o051R052Q264o617q949j367
$$ -16986 -20981 -25283 -23215 -9685 -5696 -4524 -12490 -18157 -24208 -15156 -6892 -13509 -22458 -23825
4352b3825K327J523O908O780K108M571N020l921o43R710L279J0939q795k317N7
$$ -23825 -21498 -19975 -13067 -6287 -4179 392 5412 1491 848 10558 13837 24776 15981 13664 13721
4337A3721o982j3475j20J3739j868j8858Q979l653p775o831J1311J3451J345K304
$$ 13721 6739 -6736 -6856 6883 5015 -13843 -4864 -8517 -16292 -23123 -11812 1639 2984 5288
4323E288L15l354n921O60j256R54R885Q889j0516j6209L852R18j0121K670O457
$$ 5288 5603 2249 -3672 -3012 -4268 -3314 6571 15460 4944 -11265 -7413 -6495 -16616 -13946 -7489
4308g489O824P421O25L662j334J426m143N057p362m963r87M1K57J0987K354K363
$$ -7489 -665 6756 7381 11043 9709 11135 6992 12049 4687 -276 -1263 -1222 -965 10022 12376 14739
4292A4739m345m188M683N444j5387q483j007q58K502r503r311j5441j52J0659
$$ 14739 10394 6206 10889 16333 946 -7537 -8544 -9402 -6900 -16403 -25714 -41155 -41307 -30648
4278c0648J1434R86Q835L427J737q278L200J4945p616L74L465P143m726j8120
$$ -30648 -19214 -18228 -9393 -5966 -4229 -12507 -9307 5638 -1978 -1604 1861 9004 4278 -13842
4264a3842p988r990j1350O651J3763l608P770J1449K946J713r112N464J6097j639
$$ -13842 -21830 -31820 -43170 -36519 -22756 -26364 -18594 -7145 -4199 -2486 -11598 -6134 9963 8324
4250H324j9372m935N653r930p050M923J0951K858N96m531O602q202N696L827m597
$$ 8324 -11048 -15983 -10330 -20260 -27310 -22387 -11436 -8578 -7982 -12513 -5911 -14113 -8417 -4590 -9187
4235i187j562j924O695m651K267J507O522r667j2862l962j6O083j890J3803R688
$$ -9187 -10749 -12673 -5978 -10629 -8362 -6855 -333 -10000 -22862 -26824 -26840 -20757 -22647 -8844 844
4220H44N674J1884L214o312j8201l937n035j380o45N189j060N511N547l248k219
$$ 844 6518 18402 21616 15304 -2897 -6834 -11869 -13249 -13894 -8705 -9765 -4254 1293 -1955 -4174
4205d174n347J551J732O976K684j448J6480J714o547K100j318j4245j541L98l642
$$ -4174 -9521 -7970 -6238 738 3422 1974 18454 20168 13621 15721 14403 158 -1383 -985 -4627
4190d627j068L340l684o665R243Q408n63M154P144L606j3734o801k545O073J3834
$$ -4627 -5695 -2355 -6039 -12704 -3461 4947 4384 8538 15682 19288 5554 -1247 -3792 2281 16115
4175A6115n371k158L786j441k079j0376K611L344m170R56l291j0795j1202r182
$$ 16115 10744 8586 12372 10931 8852 -1524 1087 4431 261 1217 -2074 -12869 -24071 -33253
4161c3253m970J1960R158J7574L142l193O903j0535k239Q403j5177j0312m695
$$ -33253 -38223 -26263 -17105 469 3611 418 7321 -3214 -5453 2950 -12227 -22539 -27234
4148b7234n01J219R070m451m646P783J6708Q267j2703J551R785M562q014j0362
$$ -27234 -27735 -26516 -17446 -21897 -26543 -18760 -2052 6215 -6488 -4937 4848 9410 1396 -8966
4134h966n94J023K695j999K906n28K100J388j2616J1007j315K252P093Q204M424
$$ -8966 -9560 -8537 -5842 -7841 -4935 -5463 -3363 -1975 -14591 -3584 -4899 -2647 4446 12650 17074
4119A7074j7292K613p832j9242o426J0910R242J1324n375r202M330l409J0814
$$ 17074 -218 2395 -5437 -24679 -31105 -20195 -10953 371 -5004 -14206 -9876 -13285 -2471
4106b471k110J641J639O79j411r832L588J1333O388N151m323M304J4369j3616
$$ -2471 -4581 -2940 -1301 -622 -2033 -11865 -8277 3056 9444 14595 10272 14576 28945 15329
4092A5329q017N45q918Q866J0969k1276q019J960J838Q345k573j5206O209J3993
$$ 15329 7312 7857 -1061 7805 18774 -2502 -10521 -8561 -6723 1622 -951 -16157 -9948 4045
4078D045q96L864j28p165K39j380k177k512m431N865M992p554K286J1457P330
$$ 4045 3149 7013 6885 -280 -41 -1421 -3598 -6110 -10541 -4676 316 -7238 -4952 6505 13835
4063A3835j0946o578o696j800L831j830o58m450N464L501m429J0703O782n361
$$ 13835 2889 -3689 -10385 -12185 -8354 -10184 -10842 -15292 -9828 -6327 -10756 -53 6729 1368
4049A368j580j674j0524L075l346j0906N803K0723o800r379r4j698O340J595K596
$$ 1368 -212 -1886 -12410 -9335 -12681 -23587 -17784 2939 -3861 -13240 -13334 -15032 -8692 -7097 -4501
4034d501J0438P834j3178k44Q685O802M541P092j1760k7494k944L921J584N654
$$ -4501 5937 13771 593 349 9034 15836 20377 27469 15709 -11785 -14729 -10808 -9224 -3570
4020c570k04n041J597q688n98J2498J406n286m525K780o415j522Q652J1590l836
$$ -3570 -3774 -8815 -7218 -15906 -16504 -4006 -2600 -7886 -12411 -9631 -16046 -17568 -8916 2674 -1162
4005a162L376o934q527O938Q984o079n178P825P323N776q128R251p29j3030Q74
$$ -1162 2214 -4720 -13247 -6309 2675 -3404 -8582 -757 6566 12342 4214 13465 12736 -294 580
3990E80J871k692R696J71k1383J137K50j81L6k281k1476j0625P83J1383M659k641
$$ 580 2451 -241 9455 9626 -11757 -10620 -10370 -10551 -10515 -12796 -34272 -44897 -44114 -32731 -28072 -30713
3974c0713K315K909L769R438J7920L150O344Q232j0770q580p748k24L287K220
$$ -30713 -28398 -25489 -21720 -12282 5638 8788 15132 23364 12594 4014 -3734 -3958 -671 1549
3960A549O663N449m295j2697K367M104o910p303k283P060K357K100J0684J1447
$$ 1549 8212 13661 9366 -3331 -964 3140 -3770 -11073 -13356 -6296 -3939 -1839 8845 20292
3946B0292m933j423J328k905r210m923m239J946j630J504n141R050j188J0363
$$ 20292 15359 13936 15264 12359 3149 -1774 -6013 -4067 -5697 -4193 -9334 -284 -1472 8891
3932H891m69L910p429j5175n948j900R638L227P433m434j9221O521J6325L518
$$ 8891 8422 12332 4903 -10272 -16220 -18120 -8482 -5255 2178 -2256 -21477 -14956 1369 4887
3918D887p459o43J281j5265o256K521R071M761Q38M370Q67j0728N159J0261N243
$$ 4887 -2572 -3215 -1934 -17199 -23455 -20934 -11863 -7102 -6264 -1894 -1027 -11755 -6596 3665 8908
3903H908M996j8496j7744J4696J3825j3965K332N928l597l073P937l561k252L554
$$ 8908 13904 -4592 -22336 -7640 6185 -7780 -5448 480 -3117 -6190 1747 -1814 -4066 -512
3889e12m80O70n813k608P19K558j549R964N104p612q770O115N491j624j5150O186
$$ -512 -992 -322 -6135 -8743 -8024 -5466 -7015 2949 8053 441 -8329 -2214 3277 1653 -13497 -7311
3873g311R643L05m599L26K4733l549O61m608j1123K398M020L158j6881j7658P831
$$ -7311 2332 2637 -1962 -1636 23097 19548 20209 15601 4478 6876 10896 14054 -2827 -20485 -12654
3858a2654Q293M298p167j2129P036Q576J205L959k922j710N799n346m539L871
$$ -12654 -4361 -63 -7230 -19359 -12323 -3747 -2542 1417 -1505 -3215 2584 -2762 -7301 -3430
3844c430o048M405P967p220j0295l91L50m564r187J0911N489j931K0768J000J919
$$ -3430 -9478 -5073 2894 -4326 -14621 -15012 -14662 -19226 -28413 -17502 -12013 -13944 6824 7824 9743
3829I743o606n260R852N995m389K247p831L018J838p73p823j056n668p726n232
$$ 9743 3137 -2123 7729 13724 9335 11582 3751 6769 8607 7834 11 -1045 -6713 -14439 -19671
3814a9671N278O419R88l61r514q495l793Q759J6467l14j6876N78P676Q793O606
$$ -19671 -14393 -7974 -6986 -7347 -16861 -25356 -29149 -20390 -3923 -4237 -21113 -20535 -12859 -4066 2540
3799B540m281m886O372j184p998q596q825o441N242P669n594N98O10J2905J5008
$$ 2540 -1741 -6627 -255 -1439 -9437 -18033 -26858 -33299 -28057 -20388 -25982 -25384 -24774 -11869 3139
3784C139L366J102J5903J329j7436j7538l761n859j879K201J1016M400l366l47
$$ 3139 6505 7607 23510 24839 7403 -10135 -13896 -19755 -21634 -19433 -8417 -4017 -7383 -7730
3770g730N564k3549Q446p08R560O371j3446p006J1859n16k703m151k399j0571
$$ -7730 -2166 -25715 -17269 -17977 -8417 -2046 -15492 -22498 -10639 -11155 -13858 -18009 -20408 -30979
3756c0979m375J6307Q382m979j1630O1Q25k39L057K77k968M92K789M214k027l136
$$ -30979 -35354 -19047 -10665 -15644 -27274 -27213 -26388 -26627 -23570 -23293 -26261 -25769 -22980 -18766 -20793 -23929
3740b3929N82L122K5384P120M216K704p798l134R137J2936m211r668Q740R940
$$ -23929 -23347 -20225 5159 12279 16495 19199 11401 8267 17404 30340 26129 16461 25201 35141
3726C5141o271j0922n075q808J1023J4554k313M266p347R67L692j2766q04L723
$$ 35141 28870 17948 12873 4065 15088 29642 27329 31595 24248 25215 28907 16141 15337 19060
3712A9060P40n384J513J98l825p883n313J416k034k013Q616N333j550P5j2521
$$ 19060 19800 14416 15929 16127 12302 4419 -894 522 -1512 -3525 5091 10424 8874 8949 -3572
3697c572j8033Q96K6310Q267q77l909j2232j1653j0015J0588P267O572n09j558
$$ -3572 -21605 -20709 5601 13868 12991 9082 -3150 -14803 -24818 -14230 -6963 -391 -900 -2458
3683b458n341M343m46M74N43j7217m251J4283J3087O337j0868j6125N390O67J690
$$ -2458 -7799 -3456 -3902 -3428 -2885 -20102 -24353 -10070 3017 9354 -1514 -17639 -12249 -11582 -9892
3668i892k81J0963j987p010k550O205J3936R410p799k5232n836J6842J0066L351
$$ -9892 -10173 790 -1197 -8207 -10757 -4552 9384 18794 10995 -14237 -20073 -3231 6835 10186
3654A0186j0989r622l675J1627J2242L014n669j1418j7100J447J6593R811q640
$$ 10186 -803 -10425 -14100 -2473 9769 12783 7114 -4304 -21404 -19957 -3364 6447 -2193
3641b193l551j809K924P906O276O564Q324o536j0456q976j8641o472J9996n137
$$ -2193 -5744 -7553 -4629 3277 9553 16117 24441 17905 7449 -1527 -20168 -26640 -6644 -11781
3627a1781J773J912j2316j4278o065J5348L397m62j06P325J5108j4596j2231J0330
$$ -11781 -10008 -8096 -20412 -34690 -40755 -25407 -22010 -22472 -22578 -15253 -145 -14741 -26972 -16642
3613a6642J5502k781J1306n535l624r499j0522R231R862k02r822j1996j712K4935
$$ -16642 -1140 -3921 7385 1850 -1774 -11273 -21795 -12564 -2702 -2904 -12726 -24722 -26434 -1499
3599a499J861o092J051j1445m349K798L090k685O211P639l416j844l611o800J936
$$ -1499 362 -5730 -4679 -16124 -20473 -17675 -14585 -17270 -11059 -3420 -6836 -8680 -12291 -19091 -17155
3584a7155J921n805J5069J0739K227j1629j383k158k128O862J6284R34L98m755
$$ -17155 -15234 -21039 -5970 4769 6996 -4633 -6016 -8174 -10302 -3440 12844 13778 14176 9421
3570I421r770l802p9q5O379p871j591p885J69j9L75K065O940K0823P201O042k0659
$$ 9421 -349 -4151 -4230 -4315 2064 -5807 -7398 -15283 -15114 -15133 -14758 -12693 -5753 15070 22271 28313 7654
3553G654m0153j0172J1454K0902R949j187j1141o328R741m938k9J3697J0009R671
$$ 7654 -32499 -42671 -31217 -10315 -366 -1553 -12694 -19022 -9281 -14219 -14248 -551 9458 19129
3539A9129o727L296o782r719n957m706N644j0263j1199Q255M635J945Q751q002
$$ 19129 12402 15698 8916 -803 -6760 -11466 -5822 -16085 -27284 -19029 -14394 -12449 -3698 -11700
3525a1700k247l451J3424P632j0196j1508J2249M989m229O625j482m44r444o551
$$ -11700 -13947 -17398 -3974 3658 -6538 -18046 -5797 -808 -5037 1588 106 -338 -9782 -16333
3511a6333m429l46L310l253k396J6745M180L941j0267r754k041J729k0269N505
$$ -16333 -20762 -21108 -17798 -21051 -23447 -6702 -2522 1419 -8848 -18602 -20643 -18914 -39183 -33678
3497c3678J9782J943N299M294m734J0696L547j3426M76P716j048L748J1982K23
$$ -33678 -13896 -11953 -6654 -2360 -7094 3602 7149 -6277 -5801 1915 867 4615 16597 16820
3483A6820j717r528j0772m677L555k661J308O491p968k194K0357N180p287j5039
$$ 16820 15103 5575 -5197 -9874 -6319 -8980 -7672 -1181 -9149 -11343 9014 14194 6907 -8132
3469h132q695J996N840Q545O027j0164j8918j107J66J1929J3351J0967K958m61
$$ -8132 -16827 -14831 -8991 -446 5581 -4583 -23501 -24608 -24442 -12513 838 11805 14763 14302
3455A4302p558m892n12m195j9615k603l209j2683K488O760l792M407K4174J6934
$$ 14302 6744 1852 1340 -2855 -22470 -25073 -28282 -40965 -38477 -31717 -35509 -31102 -6928 10006
3441A0006m80P064j385q012N392j0941n253P304j058j0231k17Q81n41N40R02q124
$$ 10006 9526 16590 15205 7193 12585 1644 -3609 3695 2637 -7594 -7811 -6930 -7471 -6931 -6029 -14153
3425a4153L321j73k838P570m979J973K31j1250P453J6097j1889j0102L812J7472
$$ -14153 -10832 -11005 -13843 -6273 -11252 -9279 -9048 -20298 -12845 3252 -8637 -18739 -14927 2545
3411B545R983k059N34q839j3065k133J7138k980j700J525j53J595J401M947n243
$$ 2545 12528 10469 11003 2164 -10901 -13034 4104 1124 -576 949 796 2391 3792 8739 3496
3396C496k2248o832J6816Q947n916l974j374m921k476m129O542J43J0464M729
$$ 3496 -18752 -25584 -8768 179 -5737 -9711 -11085 -16006 -18482 -22611 -16069 -15926 -5462 -733
3382g33P359l229r511l89n806J1705k353j3129O33J8834J2161O727n335j1862
$$ -733 6626 3397 -6114 -6503 -12309 -604 -2957 -16086 -15453 3381 15542 22269 16934 5072
3368E072q126R506J5095r395j4463m65J2014j2094j0399l0r889j677R597m395
$$ 5072 -3054 6452 21547 12152 -2311 -2776 9238 -2856 -13255 -13285 -23174 -24851 -15254 -19649
3354a9649o541j1096Q92J9320O460j0398L311m837R710K483J5636O403j4259k3146
$$ -19649 -26190 -37286 -36394 -17074 -10614 -21012 -17701 -22538 -12828 -10345 5291 11694 -2565 -25711
3340b5711K683R860o896m670L182O303J9854P209r408N633k700l645M078l122
$$ -25711 -23028 -13168 -20064 -24734 -21552 -15249 4605 11814 2406 8039 5339 1694 5772 2650
3326B650L118P416p218j6123q378J866J4520J0380Q509k464j6111P545q439j8223
$$ 2650 5768 13184 5966 -10157 -18535 -16669 -2149 8231 16740 14276 -1835 5710 -2729 -20952
3312b0952j603L473J9473l871l027P827j3612j959J8563o66q53m19M769J0593
$$ -20952 -22555 -19082 391 -3480 -6507 1320 -12292 -14251 4312 3646 2793 2374 7143 17736
3298A7736O718j0030q145q36k283j2376k118M205L923R443L814J54j17j5368j044
$$ 17736 24454 14424 6279 5443 3160 -9216 -11334 -7129 -3206 6237 10051 10205 10088 -5280 -6324
3283f324J1692o250j6512o415J3713J1278m553N854J7946K186p243O333q16o562
$$ -6324 5368 -882 -17394 -23809 -10096 1182 -3371 2483 20429 22615 15372 21705 20889 14327
3269A4327j1351j5010o018j0981n744P762J8188L439j1248M673J276n744n747
$$ 14327 2976 -12034 -18052 -29033 -34777 -27015 -8827 -5388 -16636 -11963 -10687 -16431 -22178
3256b2178M290N016Q345l005n457j939R397J5638l344p891o384J865L239k342
$$ -22178 -17888 -12872 -4527 -7532 -12989 -14928 -5531 10107 6763 -1128 -7512 -5647 -2408 -4750
3242d750K774K445M19J941q300J00p518m018P447K3990J0552j0398k3047K944
$$ -4750 -1976 469 888 2829 -5471 -5371 -12889 -16907 -9460 14530 25082 14684 -8363 -5419
3228e419o172q070N600Q991p39J1927R227l274p941n931P908Q798j759K178J020
$$ -5419 -11591 -19661 -14061 -5070 -5809 6118 15345 12071 4130 -1801 6107 14905 13146 15324 16344
3213A6344k869j0728o149N190m352L195Q448J835q972j8937n569M702R175N864
$$ 16344 13475 2747 -3402 1788 -2564 631 9079 10914 1942 -16995 -22564 -17862 -8687 -2823
3199b823n606N888K288k039R827j4097o952j278n475P968M202l275r590J7506
$$ -2823 -8429 -2541 -253 -2292 7535 -6562 -13514 -14792 -20267 -12299 -8097 -11372 -20962 -3456
3185c456J0872j059j053l839r690n072Q401o811j9403o410R634J4816L82O12J4271
$$ -3456 7416 6357 5304 1465 -8225 -13297 -4896 -11707 -31110 -37520 -27886 -13070 -12688 -12076 2195
3170B195l055k306L379J370J2405j10j4197r483l685m763L10l755N543Q775J0760
$$ 2195 -860 -3166 213 1583 13988 13878 -319 -9802 -13487 -18250 -17940 -21695 -16152 -7377 3383
3155C383J2117n527r613P883R404R38o282n376K847P26j362r85l927n551o61J645
$$ 3383 15500 9973 360 8243 17647 18585 12303 6927 9774 10500 9138 8153 4226 -1325 -1986 -341
3139c41j790M017P441O210j293n298j0556J062j2555l575o085Q343K6021J0511
$$ -341 -2131 1886 9327 15537 14244 8946 -1610 -548 -13103 -16678 -22763 -14420 11601 22112
3125B2112r003k4347J010J0609m522j4771j3811k520N715J1209P804K238J6020
$$ 22112 13109 -11238 -10228 381 -4141 -18912 -32723 -35243 -29528 -18319 -10515 -8277 7743
3112G743l897K06K573Q905n119k577J3423P755o437K433m561j8126L984j8693
$$ 7743 3846 4052 6625 15530 10411 7834 21257 29012 22575 25008 20447 2321 6305 -12388
3098a2388j4060J5836O734k329l070j0314Q270J0373o273K08J3124Q236j0909
$$ -12388 -26448 -10612 -3878 -6207 -9277 -19591 -11321 -948 -7221 -7013 6111 14347 3438
3085C438j3699M524M145o679K156N214l571J38L856L375j130j027k219J0423l143
$$ 3438 -10261 -5737 -1592 -8271 -6115 -901 -4472 -4334 -478 2897 1767 740 -1479 8944 5801
3070E801j7377K184P853J527j0036K108J874r708P067K671k332M11l870n061q938
$$ 5801 -11576 -9392 -1539 -12 -10048 -7940 -6066 -15774 -8707 -6036 -8368 -7957 -11827 -16888 -25826
3055b5826j594J8529L663L772J4839l314k0637j5423o38J2558M46K0162J4528
$$ -25826 -27420 -8891 -5228 -1456 13383 10069 -10568 -25991 -26629 -14071 -13625 6537 21065
3042B1065p091j3559N169m554o913q25l733m104O301P883M19j0945R115k789n233
$$ 21065 13974 415 5584 1030 -5883 -6708 -10441 -14545 -8244 -361 58 -10887 -1772 -4561 -9794
3027i794n720J8332J312L03q104j1410L607O393J722J3177J2552J20j8426j3056
$$ -9794 -15514 2818 4130 4433 -3671 -15081 -11474 -5081 -3359 9818 22370 22490 4064 -8992
3013h992m718O827m195m685m735k098P945M315R080m218Q813L951M598k219k911
$$ -8992 -13710 -6883 -11078 -15763 -20498 -22596 -14651 -10336 -1256 -5474 3339 7290 11888 9669 6758
2998F758o794L462O759K734M280K259l152l2105O25o336R841R342p06j0437m402
$$ 6758 -36 3426 10185 12919 17199 19458 16306 -15799 -15174 -21510 -11669 -2327 -3033 -13470 -17872
2983a7872K631l333l144J4619N321n822m408r218m484P278O538J130P245J1636
$$ -17872 -15241 -18574 -21718 -7099 -1778 -7600 -12008 -21226 -25710 -18432 -11894 -10764 -3519 8117
2969H117m784J606l933k671k283J1391K737N886j2967o119J2394N292m289k131
$$ 8117 3333 4939 1006 -1665 -3948 7443 10180 16066 3099 -3020 9374 14666 10377 8246
2955H246m76M122m642k81j16O216R560j1136q006L931N877j2719j1565L467j550
$$ 8246 7770 11892 7250 6969 6853 13069 22629 11493 3487 7418 13295 576 -10989 -7522 -9072
2940i072j925J244j1167Q111N688R628j4243Q215J5719R043j0465n85l943p516
$$ -9072 -10997 -9753 -20920 -12809 -7121 2507 -11736 -3521 12198 21241 10776 10191 6248 -1268
2926a268k470R097o336o643J863P451O507J5600m131r249j912k82p662l071L751
$$ -1268 -3738 5359 -977 -7620 -5757 1694 8201 23801 19670 10421 8509 8227 565 -2506 1245
2911A245M01P508j219m981j700O083P6n799p8J309p05m359L492M431q060m706
$$ 1245 1646 9154 7935 2954 1254 7337 7413 1614 1536 2845 2140 -2219 1273 5704 -2356 -7062
2895g062j5440j0161J0313O031n790J0233n010L537n216J1509P351L666J0135
$$ -7062 -22502 -32663 -22350 -16319 -22109 -11876 -16886 -13349 -18565 -7056 295 3961 14096
2882A4096N012J4515j5085j2655p720q192k119J2276N30r342N202J3154K577l419
$$ 14096 19108 33623 18538 5883 -1837 -10029 -12148 128 658 -8684 -3482 9672 12249 8830
2868H830N133L915j4397j2397J2726J687r734j5412r123J6396K7516p138k1113
$$ 8830 13963 17878 3481 -8916 3810 5497 -4237 -19649 -28772 -12376 15140 8002 -13111
2855a3111l560O318O821m882k305R673r643p255K43l464m75M459N869K2289J3917
$$ -13111 -16671 -10353 -3532 -8414 -10719 -1046 -10689 -17944 -17701 -21165 -21640 -17181 -11312 10977 24894
2840B4894j4234q586J313M188l382j0025j3414Q373P682M267O165q202m688m70
$$ 24894 10660 2074 3387 7575 4193 -5832 -19246 -10873 -3191 1076 7241 -961 -5649 -6119
2826f119n769j5203Q164J2824p879Q668o909o66M823o75p680N534q51n09J0162
$$ -6119 -11888 -27091 -18927 -6103 -13982 -5314 -12223 -12889 -8066 -8741 -16421 -10887 -11738 -12247 -2085
2811b085K352n911p279p356J0776J6794j1394N931K981n110r646N012p063P686
$$ -2085 267 -5644 -12923 -20279 -9503 7291 -4103 1828 4809 -301 -9947 -4935 -11998 -4312
2797d312J3618J2810k479j2510r392j0646O314O865l208j4714P821K4040Q194
$$ -4312 9306 22116 19637 7127 -2265 -12911 -6597 268 -2940 -17654 -9833 14207 22401
2784B2401l113J724j630j9254j8586O737J7999j8525p833N956q64o144J0717J934
$$ 22401 19288 21012 19382 128 -18458 -11721 6278 -12247 -20080 -14124 -14988 -21132 -10415 -8481
2770h481o01Q475P547j40K580O292o746j3688j0515M190P260M635Q063Q210r18
$$ -8481 -9082 -607 6940 6800 9380 15672 8926 -4762 -15277 -11087 -3827 808 8871 17081 16163
2755A6163l219p322j1112r693J1083J5347q80j6088L294J9400Q59J782N51n215
$$ 16163 12944 5622 -5490 -15183 -4100 11247 10367 -5721 -2427 16973 17832 19614 20165 14950
2741A4950j8266k330o07k896J903o401m708j770J3562J3095K779l949M49J2612
$$ 14950 -3316 -5646 -6253 -9149 -7246 -13647 -18355 -20125 -6563 6532 9311 5362 5811 18423
2727A8423q632j0527j4897O813l301r258J78M717K0799n21J858N99J745J0853
$$ 18423 9791 -736 -15633 -8820 -12121 -21379 -21201 -16484 4315 3794 5652 6251 7996 18849
2713A8849J3190r138j1535O01K123k867j042k950l239N46q847k873J0025n394
$$ 18849 32039 22901 11366 11967 14090 11223 10181 7231 3992 4538 -4309 -7182 2843 -2551
2699b551j0826k625J225k044K507j875m698Q392o486n073r37k251m780k560L183
$$ -2551 -13377 -16002 -14777 -16821 -14314 -16189 -20887 -12495 -18981 -24054 -24991 -27242 -32022 -34582 -31399
2684c1399R541R095q286K30O221R016J142J1853R055r392j1989k752l087p370
$$ -31399 -21858 -12763 -21049 -20819 -14598 -5582 -4440 7413 16468 7076 -4913 -7665 -10752 -18122
2670a8122J500j952M516o600N021J1930m372L322J2185M982l376o804k886m226
$$ -18122 -16622 -18574 -14058 -20658 -15637 -3707 -8079 -4757 7428 12410 9034 2230 -656 -4882
2656d882l05J5544l135k055j0438m494P800J2902N471K018K149r528n62o069j6045
$$ -4882 -5187 10357 7222 5167 -5271 -9765 -1965 10937 16408 18426 20575 11047 10485 4416 -11629
2641a1629n675O240J3033L036O858J0535j0337q435K223l047Q775J2013j0126
$$ -11629 -17304 -11064 1969 5005 11863 22398 12061 3626 5849 2802 11577 23590 13464
2628A3464j9085p127k571l296j183P532l067L59J4173n879n289J531q90M511O390
$$ 13464 -5621 -12748 -15319 -18615 -19798 -12266 -15333 -14974 -801 -6680 -11969 -10438 -11328 -6817 -427
2613d27J4417l782o240O469k517j419J6457J0715q196o923j1843l124k091j2476
$$ -427 13990 10208 3968 10437 7920 6501 22958 33673 25477 18554 6711 3587 1496 -10980
2599a0980r99O47M39j522j236J2805L3p831l137P782m090j055Q092J996K848J660
$$ -10980 -11979 -11332 -10893 -12415 -13651 -846 -813 -8644 -11781 -3999 -8089 -9144 -1052 944 3792 5452
2583E452j2080p244P336L957j050M578P61n186j38J2105L688j958Q233P177l059
$$ 5452 -6628 -13872 -6536 -2579 -3629 949 1710 -3476 -3614 8491 12179 10221 18454 25631 22572
2568B2572j4357j6904r534N760J678M021R660K497k324Q304L789p223j0986j3343
$$ 22572 8215 -8689 -18223 -12463 -10785 -6764 2896 5393 3069 11373 15162 7939 -3047 -16390
2554a6390L504L76o07M982M331n691P140M314O000Q993m726k269R596j686j3845
$$ -16390 -12886 -12510 -13117 -8135 -3804 -9495 -2355 1959 7959 16952 12226 9957 19553 17867 4022
2539D022m010L362j937K394j685J1669O600J029k105j3028o460k928N891m66J060
$$ 4022 12 3374 1437 3831 2146 13815 20415 21444 19339 6311 -149 -3077 2814 2348 3408
2524C408j1678J374m520o34o39J695N507O893j944J3063R030o192K31N604j6263
$$ 3408 -8270 -6896 -11416 -12050 -12689 -10994 -5487 1406 -538 12525 21555 15363 15594 21198 4935
2509D935k4585q670N806J4880Q889Q157K778n152r97N765Q580j1522q712m822
$$ 4935 -19650 -28320 -22514 -7634 1255 9412 12190 7038 6041 11806 20386 8864 152 -4670
$$ [...]
##END NTUPLES=NMR SPECTRUM
##END=
