##TITLE=Analysis number 313249
Compound Code cc 32904
Book Reference 422/85
Project Code adrs
Chemist Name robb
##JCAMPDX= 6.0         $$ Bruker NMR JCAMP-DX V2.0
##DATA TYPE= NMR SPECTRUM
##DATA CLASS= NTUPLES
##ORIGIN= Bruker BioSpin GmbH
##OWNER= NMR
$$ XWIN-NMR		Version 3.5
$$ Tue Aug 30 14:44:56 2005 GMT Daylight Time (UT+1h)  MAYBRIDGE\NMR@NMR_250MHZ
##.OBSERVE FREQUENCY= 250.131544655141
##.OBSERVE NUCLEUS= ^1H
##.ACQUISITION MODE= SIMULTANEOUS (DQD)
##.ACQUISITION SCHEME= undefined
##.AVERAGES= 16
##.DIGITISER RES= 18
##SPECTROMETER/DATA SYSTEM= dpx250
##.PULSE SEQUENCE= zg30
##.SOLVENT NAME= CDCl3
##.SHIFT REFERENCE= (INTERNAL, CDCl3, 0, 16.522)
##AUDIT TRAIL= $$ (NUMBER, WHEN, WHO, WHERE, WHAT)
$$ ##TITLE= Audit trail, XWIN-NMR		Version 3.5
$$ ##JCAMPDX= 5.01
$$ ##ORIGIN= Bruker BioSpin GmbH
$$ ##OWNER= NMR
$$ C:\u/data/dgb/nmr/ADRS/8810/pdata/1/auditp.txt
$$ ##AUDIT TRAIL=  $$ (NUMBER, WHEN, WHO, WHERE, WHAT)
(   1,<2005-08-30 14:44:21.31 +100>,<MAYBRIDGE\NMR>,<NMR_250MHZ>,
      <created by zg, POWCHK disabled, PULCHK disabled
       configuration hash MD5:
       62 19 C7 07 E1 42 D1 B7 37 6C 3D D0 77 39 F9 E6
       data hash MD5: 64K
       6F 30 D0 6A 03 37 2F 87 94 21 D9 3E 0D 5B F3 DE>)
(   2,<2005-08-30 14:44:34.67 +100>,<MAYBRIDGE\NMR>,<NMR_250MHZ>,
      <Start of raw data processing
       ef LB = 0.3 FT_mod = 6 PKNL = 1 SI = 32K 
       data hash MD5: 32K
       9F E5 C7 82 41 6D 19 48 9D 31 C9 BB 55 3F AA A5>)
(   3,<2005-08-30 14:44:40.88 +100>,<MAYBRIDGE\NMR>,<NMR_250MHZ>,
      <apk 
       data hash MD5: 32K
       2F 10 87 51 CE 79 6C 2E 82 59 ED BC BE DA C1 41>)
(   4,<2005-08-30 14:44:42.53 +100>,<MAYBRIDGE\NMR>,<NMR_250MHZ>,
      <abs ABSG = 5 
       data hash MD5: 32K
       F9 83 BF F8 0C 4F 0E F6 9C FD 5F 19 90 B2 E7 1A>)
$$ ##END=
$$ 
$$ hash MD5
$$ 2F 58 EB 5E 29 B6 6B 13 EF 21 88 1D C3 69 56 9E
##$RELAX= 
##$RELAX= 
##$RELAX= 
##$RELAX= 
##$RELAX= 
##$RELAX= 
##$RELAX= 
$$ Bruker specific parameters
$$ --------------------------
##$DU= <C:\u>
##$EXPNO= 8810
##$NAME= <ADRS>
##$PROCNO= 1
##$TYPE= <nmr>
##$USER= <dgb>
##$AMP= (0..31)
100 100 100 100 100 100 100 100 100 100 100 100 100 100 100 100 100 100 
100 100 100 100 100 100 100 100 100 100 100 100 100 100 
##$AQSEQ= 0
##$AQ_mod= 3
##$AUNM= <au_zg>
##$AUTOPOS= <35 >
##$BF1= 250.13
##$BF2= 250.13
##$BF3= 250.13
##$BF4= 250.13
##$BF5= 500.13
##$BF6= 500.13
##$BF7= 500.13
##$BF8= 500.13
##$BYTORDA= 1
##$CFDGTYP= 0
##$CFRGTYP= 5
##$CHEMSTR= <none>
##$CNST= (0..31)
1 1 145 1 1 1 1 1 1 1 1 1 1 1 1 1 1 1 1 1 1 1 1 1 1 1 1 1 1 1 1 1 
##$CPDPRG= <>
##$CPDPRG1= <>
##$CPDPRG2= <>
##$CPDPRG3= <>
##$CPDPRG4= <mlev>
##$CPDPRG5= <mlev>
##$CPDPRG6= <mlev>
##$CPDPRG7= <mlev>
##$CPDPRG8= <mlev>
##$CPDPRGB= <>
##$CPDPRGT= <>
##$D= (0..31)
0 1 0 0 0 0 0 0 0 0.06 0 0 0 0 0 0 0.0002 0 0 0 0 0 0 0 0 0 0 0 0 0 0 
0 
##$DATE= 1125409459
##$DBL= (0..7)
120 120 120 120 120 120 120 120 
##$DBP= (0..7)
150 150 150 150 150 150 150 150 
##$DBP07= 0
##$DBPNAM0= <>
##$DBPNAM1= <>
$$ [...]
##$SUBNAM7= <"">
##$SUBNAM8= <"">
##$SUBNAM9= <"">
##$SW= 20.6930455092707
##$SWIBOX= (0..15)
0 0 3 0 0 0 0 0 0 0 0 0 0 0 0 0 
##$SW_h= 5175.983436853
##$TD= 65536
##$TD0= 1
##$TE= 295.16
##$TE2= 300
##$TE3= 300
##$TEG= 300
##$TL= (0..7)
0 120 120 120 120 120 120 120 
##$TP= (0..7)
150 150 150 150 150 150 150 150 
##$TP07= 0
##$TPNAME0= <>
##$TPNAME1= <>
##$TPNAME2= <>
##$TPNAME3= <>
##$TPNAME4= <>
##$TPNAME5= <>
##$TPNAME6= <>
##$TPNAME7= <>
##$TPOAL= (0..7)
0.5 0.5 0.5 0.5 0.5 0.5 0.5 0.5 
##$TPOFFS= (0..7)
0 0 0 0 0 0 0 0 
##$TUNHIN= 0
##$TUNHOUT= 0
##$TUNXOUT= 0
##$USERA1= <user>
##$USERA2= <user>
##$USERA3= <user>
##$USERA4= <user>
##$USERA5= <user>
##$V9= 5
##$VALIST= <valist>
##$VCLIST= <CCCCCCCCCCCCCCC>
##$VD= 0
##$VDLIST= <DDDDDDDDDDDDDDD>
##$VPLIST= <PPPPPPPPPPPPPPP>
##$VTLIST= <TTTTTTTTTTTTTTT>
##$WBST= 1024
##$WBSW= 4
##$XGAIN= (0..3)
0 0 0 0 
##$XL= 0
##$YL= 0
##$YMAX_a= 449419
##$YMIN_a= -321480
##$ZGOPTNS= <>
##$ZL1= 120
##$ZL2= 120
##$ZL3= 120
##$ZL4= 120
##$ABSF1= 16.522
##$ABSF2= -4.171173
##$ABSG= 5
##$ABSL= 3
##$ALPHA= 0
##$AQORDER= 0
##$ASSFAC= 0
##$ASSFACI= 0
##$ASSFACX= 0
##$ASSWID= 0
##$AUNMP= <proc_1d>
##$AZFE= 0.1
##$AZFW= 0.1
##$BCFW= 0
##$BC_mod= 0
##$BYTORDP= 0
##$COROFFS= 0
##$CY= 12.5
##$DATMOD= 1
##$DC= 0
##$DFILT= <>
##$DTYPP= 0
##$F1P= 14.0000005364418
##$F2P= -0.99999901652339
##$FCOR= 0.5
##$FTSIZE= 32768
##$FT_mod= 6
##$GAMMA= 0
##$GB= 0
##$INTBC= 1
##$INTSCL= 1
##$ISEN= 128
##$LB= 0.3
##$LEV0= 0
##$LPBIN= 0
##$MAXI= 10000
##$MC2= 0
##$MEAN= 0
##$ME_mod= 0
##$MI= 0
##$NCOEF= 0
##$NC_proc= -4
##$NLEV= 6
##$NOISF1= 0
##$NOISF2= 0
##$NSP= 0
##$NTH_PI= 0
##$NZP= 0
##$OFFSET= 16.522
##$PC= 1
##$PHC0= -80.95645
##$PHC1= 4.444162
##$PH_mod= 1
##$PKNL= yes
##$PPARMOD= 0
##$PSCAL= 4
##$PSIGN= 0
##$REVERSE= no
##$SF= 250.13
##$SI= 32768
##$SIGF1= 0
##$SIGF2= 0
##$SINO= 400
##$SIOLD= 32768
##$SREGLST= <1H.CDCl3>
##$SSB= 0
##$STSI= 32768
##$STSR= 0
##$SW_p= 5175.98343685301
##$SYMM= 0
##$S_DEV= 0
##$TDeff= 65536
##$TDoff= 0
##$TI= <Analysis number 999999
Compound Code 99
Book Reference 9
Project Code 9>
##$TILT= no
##$TM1= 0
##$TM2= 0
##$TOPLEV= 0
##$USERP1= <user>
##$USERP2= <user>
##$USERP3= <user>
##$USERP4= <user>
##$USERP5= <user>
##$WDW= 1
##$XDIM= 32768
##$YMAX_p= 407017345
##$YMIN_p= -405050
$$ End of Bruker specific parameters
$$ ---------------------------------
##NTUPLES= NMR SPECTRUM
##VAR_NAME=  FREQUENCY,     SPECTRUM/REAL,   SPECTRUM/IMAG
##SYMBOL=    X,             R,               I
##VAR_TYPE=  INDEPENDENT,   DEPENDENT,       DEPENDENT
##VAR_FORM=  AFFN,          ASDF,            ASDF
##VAR_DIM=   32768,         32768,           32768
##UNITS=     HZ,            ARBITRARY UNITS, ARBITRARY UNITS
##FACTOR=    0.157963299565203, 1,           1
##FIRST=     4132.6476996994, 0,             0
##LAST=      -1043.33573715361, 0,           0
##MIN=       -1043.33573715361, -405050,     0
##MAX=       4132.6476996994, 407017345,     0
$$ Real data points
##PAGE= N=1
##DATA TABLE= (X++(R..R)), XYDATA
32767 1829 -23279 -45550 -33024 -22246 -20029 -20413 -1211 -13171 -20858 -14625 -2990 -12656 -21424
32754 -21424 -18794 -22346 -27390 -27545 -6844 -12606 3494 11626 11082 -6007 -24188 -33041 -35463 -19935
32740 -19935 -32230 -35205 -25186 -7967 -6047 -9413 -2998 9801 -837 -7293 -13312 -25928 -22058
32727 -22058 -3375 24055 38483 21599 15003 2297 -5733 -9075 -4886 -17874 -12128 -15733 -17898
32714 -17898 -13770 -16332 -24801 -9718 13828 12448 4388 -3354 -11264 -9118 3898 -10215 -16203
32701 -16203 -8204 -3462 -6681 -13349 -18667 -10384 -16696 -14452 -12526 -35770 -42039 -11370 10093 19936
32687 19936 23209 13980 -6397 -21087 -20548 -10183 6035 4995 -17112 -12639 -22947 -38573 -28982
32674 -28982 -14282 -20050 -22918 -24843 -15883 3247 -4314 1059 1499 18795 10245 12497 7127 -17604
32660 -17604 -42551 -46533 -28990 -19902 -18232 -26466 -26714 -21334 -21487 -28560 -42141 -37198 -28900 -24659
32646 -24659 -7231 -4146 -20711 -852 1050 17879 17213 17533 2223 -11384 -11565 -28129 -24050
32633 -24050 -20208 -34487 -48124 -59558 -61330 -53527 -44493 -23197 -4230 -11212 -2242 2663 -27384
32620 -27384 -40965 -44706 -28884 -16420 -30541 -60087 -65891 -64367 -30107 3826 13242 9143 14803
32607 14803 -1174 5870 13615 9267 -19559 -28356 -23168 -31521 -22898 -33548 -39821 -37787 -32378 -19373
32593 -19373 -8792 -9424 -20336 4705 11893 432 -11591 -28321 -41975 -19642 8235 -3066
32581 -3066 -22669 -44591 -51448 -44791 -28969 -23733 -24350 -25593 -35452 -29103 -13196 19594 31304
32568 31304 19261 -2176 -1758 1203 22701 33888 35484 43845 11500 -18968 -24661 -15849 -2708
32555 -2708 -18963 -14657 -19934 5023 12198 2463 6606 8527 5088 -3850 -4776 1590 23662 28574
32541 28574 22458 11822 14162 4985 17591 21000 5410 -4998 -19479 -49407 -56242 -41532 -29464
32528 -29464 -17226 6231 -12828 -24930 -29738 -31049 -34386 -44510 -27440 -16522 -11956 -2161 12607
32515 12607 5930 -15632 -40368 -50789 -51859 -32056 -30774 -39956 -27204 -11882 -27622 -42919
32503 -42919 -34938 -14717 -21337 -17751 -26998 -31606 -11785 -339 2026 17349 11797 -24304 -40028
32490 -40028 -12809 6614 11488 2565 3169 5628 11762 7843 -9004 -37282 -31670 -27139 -19129 1728
32476 1728 7167 -1027 3963 -9366 -19145 -40764 -45171 -12228 -2603 -36400 -71769 -49343 -23255
32463 -23255 -18278 -29928 -18541 1014 -21923 -43373 -17252 -10783 -35473 -44781 -49349 -48072 -27145
32450 -27145 -12505 -19204 -14101 -9073 -9964 -5581 11856 16834 12908 7347 -3349 10176 18738 23570
32436 23570 25777 10150 -4208 3497 -12561 -33400 -28529 -20405 -16585 -15237 -15975 -31245 -23389
32423 -23389 -17469 12083 8824 3822 7371 1132 9595 34289 28700 7443 1976 3864 5107 17959
32409 17959 10728 15376 355 -26457 -42556 -59357 -54806 -41514 -9224 14258 12870 -11601
32397 -11601 -19261 -12799 -3691 7598 12667 4799 -10388 27497 17967 19772 22175 -16370 -5695
32384 -5695 -601 7015 -27842 -56150 -49291 -36657 -36597 -37814 -31738 -24758 -1383 4246 -8076 -2150
32370 -2150 -12821 -7683 -12124 -24429 -5844 -13523 -26591 -24891 -20731 -21816 -28097 -10860 7238
32357 7238 -8644 -15297 -10893 -8364 5085 27063 17703 20219 32680 28078 289 -19869 -24625
32344 -24625 -34197 -31919 -22573 13370 24327 22553 10550 -2758 12683 8781 -9297 -10931 -20816
32331 -20816 -22760 -8810 -9210 -1724 -15021 -35921 -34221 -24427 -13827 -32744 -58306 -33779 -23376
32318 -23376 -39796 -34714 -11417 1464 -5426 -8711 -12216 -12960 14516 10216 5734 12117 238
32305 238 -8603 -38138 -39998 -40587 -30390 -19183 -7582 11773 -2634 -21126 2573 11246 24996
32292 24996 17516 3952 5786 1862 -7361 -465 6787 2859 2056 23782 43147 20713 -3706
32279 -3706 -27501 -38954 -30137 -27377 -43015 -32572 -21928 -11443 15062 8048 1702 -13581 -15820
32266 -15820 -20164 -9826 268 -4791 1856 3079 11240 14822 -4722 11789 26899 27291 -21182
32253 -21182 -53177 -47672 -34101 -52868 -57401 -52536 -54298 -38923 -35156 -47085 -38100 -34730 -26519
32240 -26519 5392 17883 13124 -13100 -17672 -31109 -14470 -23199 -44823 -57774 -49754 -21736
32228 -21736 -5982 3682 -3819 -24778 -26144 -27717 -36894 -29503 -24571 -24385 -47422 -24995 -19919 -27755
32214 -27755 -5859 -4768 -23040 -29711 -43340 -53343 -45210 -21530 -910 12075 -13137 7231
32202 7231 16690 22703 8053 -14601 -17128 -26813 -71344 -69908 -22004 -11517 -7476 11149 27180
32189 27180 31227 14706 13479 31085 16606 -17569 -37807 -37306 -46016 -38040 -26488 -17332 -52682
32176 -52682 -82414 -56012 -20612 -8051 -5310 -30790 -38570 -26150 -34253 -39056 -47289 -61411 -42440
32163 -42440 -6904 6408 -3747 -21983 -50470 -36800 -28479 -16797 -21508 -11296 22618 26086
32151 26086 18051 -9125 -27961 -29288 -267 6991 29041 12630 21494 7932 19045 25246 9530
32138 9530 -4221 -3770 47452 56470 31834 21911 -8423 -46548 -47141 -39246 -25402 -12370 -68
32125 -68 -949 -12078 -38889 -47142 -46124 -20524 8335 9365 -26768 -40965 -20276 -863 896
32112 896 -18726 -46470 -53784 -53474 -32781 -11458 -12188 -27710 -31203 -21575 -5841 -11302 -11952 -23370
32098 -23370 -10198 -9184 -20664 -18713 11579 36871 53319 48645 17111 5759 8456 28307
32086 28307 15656 -3101 -9758 32002 46425 41624 3424 -9481 -20427 -35665 -11632 2335
32074 2335 -7957 2944 10745 -8771 -12667 -18409 -3492 12824 18995 37126 33470 22730 14776
32061 14776 2966 -3547 -26272 -36267 -43680 -56297 -49286 -41404 -34138 -126 -10513 -32543 -9137
32048 -9137 7527 -25533 -43033 -33168 -45043 -48712 -27243 -30928 -44600 -63175 -53636 -11366 16039
32035 16039 16884 17044 -14975 -5619 -18229 -19937 -16597 -12067 -882 22897 4610 -11788 -17732
32022 -17732 -14213 -26714 -10514 10417 12420 22664 20835 19873 19174 13814 1678 -16678 -11862
32009 -11862 -13457 13622 52181 26582 -30095 -42356 -40947 -55589 -49874 -27935 -19031 -10369 18917
31996 18917 40193 29722 12832 -12234 -28325 -16122 1136 19381 5792 11011 31982 31959
31984 31959 20801 34772 23092 6067 -22474 -54389 -29299 -13826 -42862 -39180 -20359 5078
31972 5078 24596 16481 1469 -12000 -61104 -67796 -61876 -53054 -58137 -51475 -12361 5550 -9497
31959 -9497 -3980 -4746 -27438 -35125 -20129 -38392 -45532 -30329 -710 9017 -16692 -11817 2229
31946 2229 20646 13065 18757 20121 8235 -14462 -20931 5041 7800 -3611 -27705 -1389 4819
31933 4819 -10131 14211 35476 16977 11030 796 28819 58159 45010 29741 23899 31842
31921 31842 31156 50971 70890 44254 18267 2671 -3597 -14438 -8156 2962 29949 39468 26055
31908 26055 30958 39257 31187 13430 29186 21024 18657 -4378 -16144 -23195 -22110 -8630 -22223
31895 -22223 -6561 20912 10936 -434 12191 37392 59907 48971 4939 -302 14136 1947
31883 1947 -26103 -34289 -25351 -695 14020 -453 -9317 4101 782 -9416 -27416 -13418 1225
31870 1225 9555 23377 26613 27635 32248 7549 -5015 -5512 -1305 -15277 -18444 -5590 -11882 -2470
31856 -2470 2738 -7353 -43101 -51882 -59305 -31528 -26489 -24897 -27487 -9744 6125 7926 19575
31843 19575 13629 -16107 -26410 -26631 -24056 -3381 -287 9592 14383 5247 -8017 -15075 -19109 -1772
31829 -1772 1119 -3197 -18823 -19750 -35282 -47932 -22105 11489 7590 -11319 -14863 -11756 -44666
31816 -44666 -30113 -9313 -22397 -17008 -32837 -32471 9953 25711 7843 5918 10397 18989 43675
31803 43675 49964 41103 12046 -3857 -14714 -20626 -12671 -27132 -25443 -27468 -42874 -32338 -18876
31790 -18876 -28959 -47551 -44412 -32047 -30603 -31911 -23480 -3934 1558 26523 27242 26456 24194 6251
31776 6251 -20973 -13438 -21053 -18690 -13575 -18051 -6593 26516 22963 807 -4091 -17336 -21089
31763 -21089 -27680 -40426 -34749 -25079 -8175 15046 -1923 2067 14090 27244 25874 703 -14595
31750 -14595 -31714 -14877 -21820 -454 2848 -9697 4736 12131 113 -21008 -43429 -53490
31738 -53490 -41926 -33069 -28614 -8860 -13064 -5964 -20857 -3492 -12570 -7116 -13939 -20864 -19829
31725 -19829 7940 12062 -3409 -22116 -36625 -35085 -23633 -28145 -14826 -14768 -12730 -3202 -10289
31712 -10289 -35157 -28057 -18700 -17157 -58535 -60070 -26347 -20364 -43336 -55448 -47583 -44295 -2691
31699 -2691 40106 57081 40136 5494 1351 -13863 -17792 -29585 -23380 -17418 6145 21588 20736
31686 20736 21035 9146 -17744 -52121 -41992 6654 12373 2304 4419 -14986 -42463 -27295
31674 -27295 -23341 12904 40013 64878 60719 53288 51755 33709 3031 -10757 -16200 -19594 3532
31661 3532 -3669 -8616 -14208 -28033 -37632 -44377 -54547 -39557 -52156 -30954 6012 14401 -611
31648 -611 -5769 -29332 -23448 8585 15039 4710 14343 14140 -29694 -31835 -10258 9486 13258 10778
31634 10778 -16163 -18218 -10210 169 1696 12174 11704 -7278 -3566 -5574 -3846 13643 20418
31621 20418 8379 29218 20715 8541 6865 10548 10064 15923 15226 18106 10519 -6511 -39122 -66272
31607 -66272 -48166 -10088 -1324 -25630 -25413 -32316 -28734 -12446 1561 -4687 -3396 2715 10151
31594 10151 -2065 -18431 -17179 -4314 5505 1803 9447 16019 10208 352 6316 -523 8845 26314
31580 26314 -16652 -22178 -18068 -25978 -30335 -54137 -82797 -69107 -18494 -29458 -56046 -47333 -20589
31567 -20589 -22985 2978 4768 -4451 -7716 -4827 1589 19968 22902 21412 34358 58580 62820
31554 62820 53880 26589 11247 -17224 -23348 -16599 -2362 12745 2422 -21570 -40095 -57180
31542 -57180 -46258 -49752 -20363 4510 1499 18965 21851 -1035 -12215 13849 -13433 -32504
31530 -32504 -13323 -26131 -59523 -58642 -46682 -35067 -11842 9079 16431 2465 -5107 -21694
31518 -21694 -7210 34487 28188 5515 -1403 1230 7467 -3059 -2196 -4545 -23405 -33495 -2564
31505 -2564 16314 11709 18795 19186 -17003 -35353 -21050 -18097 -14579 3413 13934 -7180 -25386
31492 -25386 -20958 -166 -18944 -25640 -9291 -42832 -35847 -28030 -39004 -16255 2401 18235
31480 18235 10612 3602 -3991 -18074 -23813 -15351 -45 11198 12406 25033 34038 24879 -11084
31467 -11084 -9040 -18140 -9052 12518 -208 -31360 -29983 -29355 -12669 689 2460 -9807 -17719
31454 -17719 6475 46545 60979 52234 39982 47185 14707 -2501 7932 37209 54704 30987
31442 30987 8431 -4704 -26127 -27340 -12949 4633 10990 2291 12327 -8182 1033 -11591
31430 -11591 -15753 -3704 24255 5478 -23986 -20322 -4269 18922 44021 37881 20527 1246
31418 1246 -8295 6880 205 -11780 -23549 -9220 30946 39425 18294 -1458 7671 24470 32231
31405 32231 29718 29485 10193 -1919 -21722 -37504 -35489 -20564 -12414 -22011 -26081 -12539 -15696
31392 -15696 663 20065 43982 46461 39353 28468 24494 6099 1573 -13943 5040 7610 8628
31379 8628 24671 14117 11609 45709 73496 65487 66329 18060 -12220 23423 58146 52561 43163
31366 43163 41902 4262 -11143 -45567 -45221 -14952 -8303 14976 31014 33932 36031 13290 8059
31353 8059 -8961 -45656 -34866 -10072 20538 25954 12079 -6107 8690 9678 -11599 4435
31341 4435 23666 179 -8526 6702 16545 8468 -2122 -11066 552 946 4122 -16421 -34321
31328 -34321 -61889 -54004 -33993 -21550 -22456 -26464 -16179 -399 -3893 1309 -4800 -14999 -37853
31315 -37853 -38647 -12278 13615 3255 107 3765 -7019 -6759 -10943 -372 31723 50315 50504
31302 50504 19447 2150 6166 23563 37747 53791 28812 19208 21144 14311 14656 14452 25573
31289 25573 30756 38072 36525 4362 6285 214 9460 21642 1021 4352 17272 -10980 -31684
31276 -31684 -42134 -52141 -20773 -19504 -17774 -10701 -17106 -15686 -27923 -11712 -18470 -24152 -7301
31263 -7301 -11347 -34931 -32958 10300 18940 1431 -27035 -3693 36519 22855 -7305 -20523
31251 -20523 -15210 -8249 -10002 -30729 -19379 21093 46385 18019 -33437 -18396 -4682 -35455
31239 -35455 -33991 -22254 17036 17294 24184 952 -39832 -28764 -22950 6651 5601 4798 11343
31226 11343 11533 13749 10105 -16931 -47820 -45896 -7603 34512 44442 43128 52397 53825 41041
31213 41041 1397 -31687 -7410 21490 7912 254 -15027 -33669 -31137 -19175 -21566 -10067
31201 -10067 13664 -1763 -6997 -21952 -45820 -41812 -15683 -22331 -3640 1938 -6173 -15156 19522
31188 19522 38456 49407 20604 -3044 4051 21654 23151 -9204 -16563 -10493 -26858 -26392 -23943
31175 -23943 -12811 -28139 -37772 -39975 -20428 -22758 -23707 -12313 -9628 -23550 -25954 -20609 -20658 -20157
31161 -20157 -11019 12668 25551 30612 11871 16303 20001 14561 12587 18249 33746 28425 -18245
31148 -18245 -32994 -27116 -18949 -443 -8848 -21976 -33215 -26706 6151 17521 3544 23298
31136 23298 66675 69584 50288 43639 29487 20532 18273 -15031 -11682 -56454 -71303 -37146 -23603
31123 -23603 -19943 10733 8039 -13562 -31628 -32809 -29481 -37355 -30925 -14008 14 31171 20721
31110 20721 2259 -18378 -46885 -59013 -65153 -42628 -5069 6302 -3718 -22346 -41481 -24291
31098 -24291 -25176 -8523 2418 -1474 -7124 -14519 -33401 -8373 -3006 -13796 -18808 -41063 -40926
31085 -40926 -12280 -3088 2872 -15718 -40980 -28943 -6491 -13320 -5836 9478 -14826 -16529 -6332
31072 -6332 -3706 13586 9469 16934 25726 25028 30350 18743 10888 23943 5251 9181 4246 -14839
31058 -14839 -6963 -10417 8204 26043 17603 -4121 -8179 7061 14089 685 4979 -93 7887
31045 7887 -3704 7168 13307 25787 44445 32989 41820 26207 21096 43421 45346 12354 5652
31032 5652 5502 2388 3837 5696 16611 22429 -26058 -16939 1984 15308 32258 28173 28901 3679
31018 3679 -22582 -10446 6358 -21107 -21753 -11820 1914 17145 30591 390 12047 27851
31006 27851 20034 9759 32875 37547 49261 22610 631 -5380 -7599 -7861 -25146 -32593 -39284
30993 -39284 -27088 -1532 14543 -6168 -10338 6007 -9309 -23773 -20646 -26371 -35119 -27897 -14456
30980 -14456 12506 1069 -19833 -22530 -35295 -43486 -3896 12773 12007 12413 42892 51416 20486
30967 20486 11367 964 30103 24474 14465 12411 9226 8157 1612 19486 34659 21508 12286
30954 12286 14082 14247 20256 25659 50058 69548 62312 42788 18606 7061 -13629 -10127 666
30941 666 -4628 -8577 -4275 4088 -22736 -23898 -36600 -27652 -20012 -34560 -1519 27340 14165
30928 14165 18827 7347 -13996 -29993 -15402 -24304 -40536 -49618 -28508 -21499 -7859 10927
30916 10927 22988 43207 54724 52446 46443 33678 4897 6678 -5467 -27158 -13560 7457
30904 7457 1293 -24193 -20599 -2899 7033 13765 43637 53419 40560 53751 45733 20670 -11170
30891 -11170 -22533 4025 31853 29879 13344 10787 15122 -1997 -38368 -24903 -36419 -33975
30879 -33975 -37374 -15086 -7270 -12756 -39153 -84081 -87147 -40952 -1747 -1357 4522 -5719 -17348
30866 -17348 -17318 -6069 -5375 8344 8125 8601 2542 -9679 -9537 9161 17489 35810 59036 22764
30852 22764 11947 -9828 -4788 26577 45316 10466 -34521 -41032 -31011 -12479 5070 16644
30840 16644 26341 25087 10120 19454 -16803 -37200 -21261 -16197 -35284 -56433 -66856 -35184
30828 -35184 14382 14300 8939 17194 14026 -11021 -18641 2630 11181 4040 -3716 -16649 -27130 -5843
30814 -5843 -4434 -15116 6322 6323 -7040 -13217 -28389 -23011 -10144 -14522 -14477 2080 6829 11815
30800 11815 -10071 -17045 -10882 -20506 -16549 -2723 6088 5460 5101 2823 -4542 -17597 -33051 -45013
30786 -45013 -32010 9340 14790 8569 10067 -14515 -1699 -6781 -2900 1928 -10068 -14656 -18158
30773 -18158 16815 28407 -12791 -10892 6047 40134 61742 36121 7508 4266 27075 27375
30761 27375 -5637 2890 36258 49545 32976 6721 -4948 -3114 8759 6151 6139 28244 -15657
30748 -15657 -2275 -20793 -35735 -30108 -21126 -21036 -7411 -5927 -48610 -35700 -9167 -11523 -8677
30735 -8677 973 20540 23309 19260 7148 -30519 -41486 -21237 3350 -7711 -17670 -28734 -47790
30722 -47790 -37406 -46455 -55341 -49714 -53597 -39214 -9506 10483 7939 -6209 -23426 -25262 19528
30709 19528 29084 5142 9065 -8653 -11375 -1582 -17872 -47891 -55313 -20815 -14005 -34139 -41484
30696 -41484 -29955 -21186 7059 18327 28580 27219 -1752 -30717 -13805 14253 43232 25067
30684 25067 5762 -2791 20147 29838 12980 -2550 -11847 4408 24224 -5438 -28094 -4286
30672 -4286 164 9149 -5146 -22188 -24559 -10157 -19548 -3741 -698 -6649 -25600 -8417 8495
30659 8495 -4670 -7341 -4935 -10984 -1894 -12984 -3255 21379 28458 32504 43802 62723 45878
30646 45878 21722 -3392 -14253 -4589 -6061 -420 4490 26804 62644 52475 17793 -12580
30634 -12580 -50986 -52734 -31381 -26875 -27827 -22719 -2972 34547 38899 29106 23123 -370 -22705
30621 -22705 -22703 5779 -26728 -29898 -3037 19416 9972 6425 11800 1327 -10382 -18865 -27888 -4126
30607 -4126 -6375 -19067 -20149 4104 31399 36364 21159 9265 8795 7628 557 -1816 19963
30594 19963 848 -22976 -53188 -44358 -16684 -22420 -19649 6944 29556 18847 12800 8654 488
30581 488 11004 43799 41128 24662 6879 22605 13282 -13062 -13021 -27934 -16237 -1116 11565
30568 11565 16537 -6670 -34420 -36937 -22413 -10678 -8518 -4 -3465 -3193 -14579 -31770 -24759
30555 -24759 -12520 -6704 -3191 -19721 -31519 -38729 -42916 -38375 -5968 26442 -2607 -21584 -30032
30542 -30032 -37796 -54145 -68740 -54950 -11565 7906 -2481 7117 -13495 -1009 44214 59693
30530 59693 45807 24395 20077 -4263 -10568 -20666 -23487 -9927 -1037 6752 -19227 -30417 -27930
30517 -27930 -48160 -21197 22203 9301 22442 26889 21225 15634 4838 -8750 -21999 -6631
30505 -6631 -1587 19271 -5490 -570 -731 -25957 -7629 7533 15874 9318 10599 20603 3146
30492 3146 -20195 -24417 -25305 -15195 4390 26258 18360 -11198 -15290 19451 38951 45500 20911
30479 20911 16010 12419 -901 -12114 -16302 -13590 10084 21254 -9716 -25035 -4260 14195
30467 14195 25002 27629 7515 9053 12576 14802 -11332 -22756 -25148 -21283 -6602 -14403 -29208
30454 -29208 -15516 15295 60814 56184 18452 -8523 818 -12216 -12200 -15358 -5265 1162 11379
30441 11379 23048 36109 38921 22415 17704 23370 43868 42535 28155 21785 25845 34361 32944
30428 32944 15917 21158 24071 4305 3748 41466 37797 5427 24234 57639 66689 41522 33905
30415 33905 24121 5871 -3000 4873 6248 13533 8601 -24591 -35034 -8756 -216 31075 48719
30402 48719 40819 18216 4513 -8008 -27034 -41015 -36370 -25023 1345 18071 8361 -13648
30390 -13648 -28376 -25007 -24058 -33666 -17357 -14571 -7360 7372 2561 -7995 -19481 2812 -21022
30377 -21022 -32961 -27398 -18171 -13460 -8614 -118 1531 -9645 11270 5159 -25251 -20335 -946
30364 -946 10387 -7912 -28782 -40375 -4468 -3844 -4450 444 8436 14532 -10417 -14412 2586 8545
30350 8545 25238 5771 5622 -13047 -22138 -11427 -15940 -29292 -18400 -4331 26342 21846 -22755
30337 -22755 -33687 -13913 -20602 -10120 3729 -47 1638 12118 32419 33846 23820 25502 23332
30324 23332 9255 -2036 3058 -3230 -4344 -17766 -35781 -24653 -12256 -4931 -9669 7959 25377
30311 25377 34319 32153 22525 16135 40280 59738 60975 22101 -24211 -17848 -2150 -24556 -44345
30298 -44345 -23311 2694 16450 23017 29114 34365 40896 26692 17482 20934 9691 1233 -5275
30285 -5275 -5780 -14782 -12130 17115 30763 1485 -14970 -20412 -35001 -29577 -8718 30457 27824
30272 27824 9619 6956 7380 -5485 -17679 -11401 7493 2503 -8107 11142 17672 16369 4706
30259 4706 15141 13237 17707 33891 45004 34759 28854 9388 -786 -10560 -4902 7323 6263
30246 6263 -20959 3344 -6508 2424 26271 35849 33092 33777 24597 19773 21557 -3628 16654 26032
30232 26032 18218 16376 25480 53251 51945 36803 49063 47456 15139 -26272 -31986 -8686 9530
30219 9530 1025 -3676 845 16277 -3842 -90 -8558 -21978 -13330 10487 38632 46049 24691
30206 24691 16788 16892 8762 953 -15220 -25428 -14074 -25191 -24324 -27178 -22993 -37939 -35345 -35953
30192 -35953 -42373 -46662 -16372 -7843 -5549 4797 1596 -5006 -3774 8333 16279 15173 3772
30179 3772 26575 35871 34458 32813 25507 38519 63875 48937 25655 17319 16486 21841 40344
30166 40344 25481 4835 22504 16170 1942 532 3978 18202 -3065 -19146 -9431 7462
30154 7462 -22650 -33004 -13025 16042 12928 4438 24768 27193 15160 13845 50 -5675 -12023
30141 -12023 23347 36362 7008 21196 42318 46676 52301 59738 56579 50411 42696 46708 16931
30128 16931 12093 1599 13277 -742 9276 17190 -6315 -1902 -4808 3190 -2287 6390 8404
30115 8404 -5066 -19286 3114 23509 31981 13953 -2758 -7269 3557 8851 9233 2482 5750
30102 5750 11681 -883 -173 -3742 -14155 -2622 7086 16206 37737 33481 20420 21513 16899 -2032
30088 -2032 1262 5124 -11029 -5149 20485 26462 20646 20727 2756 -8531 -11163 11680 24272 12583
30074 12583 4092 -3754 -5897 -26750 -26574 -30337 -19494 2577 8345 -21598 -24502 -12214 2913
30061 2913 17854 1551 -15971 -15525 -9681 -8790 3374 -12130 -34109 -33063 9593 25697 23651
30048 23651 22142 20483 17942 -1738 -1279 208 9803 11339 2657 -21317 -24185 -6700 4010 20761
30034 20761 4723 -9185 -530 -1614 5436 13099 16584 797 -13790 -14968 323 11882 143
30021 143 -8907 -15693 -15299 -17318 -32801 -45594 -1594 -6352 -11224 -77 -892 -18185 -45988 -50913
30007 -50913 -50674 -48533 -14284 -99 27379 37179 7436 16131 40986 42116 24590 -6304 -26005
29994 -26005 -15600 7219 -16318 -29980 -15995 -1874 -4615 9556 16692 782 -2110 -293
29982 -293 19605 26890 44653 25545 9683 200 17046 39248 51491 44027 37536 55232 37359
29969 37359 18974 45130 76737 82988 66821 63461 55643 36367 26597 15590 12474 5466 19830
29956 19830 10410 9819 20779 30368 23450 -5265 -26060 -28040 -12921 -2104 -1265 -1846 10462 9584
29942 9584 -10058 -8122 -25780 -13939 -3713 16559 29956 17070 -346 7594 3409 -4393 7267
29929 7267 31646 41347 10447 -35415 -41740 -39032 -32794 -34913 -23127 -17512 -10075 5096 -1906
29916 -1906 9259 24454 10369 -25926 -22468 10523 23194 17803 8874 28910 6320 -19723
29904 -19723 -20024 -6075 1770 -3063 -21023 -5707 -8452 4523 4129 -27686 -40393 -32253 -43801
29891 -43801 -47987 -40093 -15303 10494 20952 -15028 -31301 -41411 -45411 -30013 -15060 10179
29879 10179 4773 -1143 12219 -205 -26312 -18641 -47 25425 16305 4655 21729 24481 13946
29866 13946 -7929 -31096 -8419 -7841 -10275 -19986 1222 4681 -20566 -39616 -45841 -25833 24631
29853 24631 41010 30074 18296 24736 -180 -24139 -31089 -35527 -16748 16275 46527 55610
29841 55610 48214 23909 16477 5720 5863 -2991 -8948 -11303 -5070 21556 20439 -1268 -25357
29828 -25357 -10613 13946 27475 23954 1742 4788 25892 18165 16641 3841 -11197 -2797 24991
29815 24991 10445 -8382 -7148 -10031 -12164 -8559 -6187 -10132 -7604 -17986 -23185 -23949 -7065 8174
29801 8174 -9045 -1807 -18621 -29994 -36127 -16180 4179 -8015 -3392 28975 40470 44580 48731
29788 48731 24199 -3592 -18239 -10473 -27950 -26302 8199 -8298 -40625 -12868 10903 22733
29776 22733 27235 46783 45839 22889 3611 -41006 -44060 -14715 -8269 -10014 -9169 3928 17873
29763 17873 24932 35338 30661 34122 8904 10412 -4368 -25355 -30334 -30413 -15977 10979 21940
29750 21940 5389 -10084 -11691 21316 41280 36626 56552 80825 87138 93016 66950 44243
29738 44243 33689 11971 3508 3955 4845 8099 -7790 -39095 -35118 -21616 -19028 4297 3031
29725 3031 -14770 -12375 -15002 -17298 -17621 1083 9922 -16122 -30959 -24661 -4128 -22164 -17810
29712 -17810 -7877 8124 36563 28697 2623 -3580 -12866 -31897 -40562 -32440 7736 20449 33104
29699 33104 50819 29928 -12706 -40757 -42781 -35423 -22007 15736 44380 46169 46409 64495 59364
29686 59364 31607 30646 -2973 -24361 -28509 -2086 -7745 -12710 -14583 -10343 4348 18406 16532
29673 16532 15839 3142 -2692 19957 37430 32719 -128 -16684 -21476 -20509 -14944 -17551 -13366 -22375
29659 -22375 -31742 -19146 -5825 -13326 -13676 -13989 -8214 24045 38347 9630 1275 -7345 -13975 -6813
29645 -6813 4607 -5020 2336 1833 -97 18180 17176 18905 32985 -5251 -28373 -3688 -682
29632 -682 -6486 2565 142 -2714 -13239 -15909 7033 8792 -16241 -8715 24251 27114 35670 36026
29618 36026 8768 6769 14478 14196 12039 -2745 784 -6512 -16653 -21757 -31583 -2289 12978
29605 12978 -13548 -31428 -37053 -17305 -16037 -3842 -17201 -15321 -23735 -16719 -8443 -12059 -30560
29592 -30560 -58240 -53203 -7507 29291 26520 -2704 -2984 1451 -14409 -38079 -38609 -63964 -86928
29579 -86928 -86929 -41033 -16206 -20626 -36715 -38561 -31631 -35946 -34659 -22440 -3991 19109 27178 11398
29565 11398 8487 5884 9101 34134 15347 7402 -12703 -1555 1822 3403 22984 23975 14274
29552 14274 20382 32489 49739 41308 -2078 -11127 -20110 -35224 -18755 -3786 3367 19298 27288
29539 27288 14637 18699 24617 37035 50352 37001 38167 9029 3179 4850 -11518 -1767 3317
29526 3317 -4138 4178 -14062 -18252 -19186 -37804 -44702 -23448 -16615 -32351 -41151 -47017 -17127 19890
29512 19890 7554 -1907 -20980 -47941 -40433 -30528 -15496 15580 20805 8178 -7921 -16173 -29245
29499 -29245 -33436 -15273 15744 54215 47510 5960 817 23103 11321 12857 17794 -2235 -4928
29486 -4928 -32950 -28892 -26176 -16727 -12972 -18593 -4772 -3200 -7419 4568 1527 6319 15445 18130
29472 18130 -1734 -7009 514 -2438 -27961 -15818 1881 -16155 -15702 -31677 -27890 -17350 4146
29459 4146 12928 16637 -5482 5118 25226 11268 8886 11542 36976 36327 13233 -2210 11935
29446 11935 13285 -6888 -22276 -4676 -5060 5135 5485 32453 30679 11612 181 -21260 -24295
29433 -24295 -21323 -14829 16774 33171 37693 35990 26520 34638 54522 40816 33531 -9183 2850
29420 2850 19014 4602 -19324 -32594 -38893 -16258 -25071 -33004 -16796 -9028 -10507 -25478 -36077
29407 -36077 -30803 -24910 -21676 -9890 4524 11470 17292 5369 23646 28414 30419 16875 -5845
29394 -5845 5286 28601 22203 1372 -4923 -17537 7361 -1918 -18196 8724 27976 27973 -9258
29381 -9258 -17483 -1063 -3576 -18304 -31933 -41771 -32867 -13611 -35588 -36261 1312 24862 17559
29368 17559 16401 48045 44500 20829 43215 40262 33602 55569 54670 53795 33227 10949 -2469
29355 -2469 4673 11067 -10752 -60842 -74385 -53437 -26173 8166 25586 14491 6238 13059 22016
29342 22016 2855 10604 12450 9014 22092 27594 28596 33681 40213 45209 39184 12626 11491 34320
29328 34320 35447 22127 27079 38189 53551 38428 -2874 8089 17425 2242 -12751 -37427
29316 -37427 -43667 -17198 -11626 6519 48471 33373 11533 -15747 -20552 -25663 -27680 -34300 -47099
29303 -47099 -46865 -33830 -13163 -7552 10149 12973 17652 23041 19567 -8333 -8673 13788 21076 43194
29289 43194 38135 15986 -9150 -4156 -16310 -24502 5081 2864 -5485 16459 43285 53696 44674
29276 44674 16523 18444 20095 25090 28352 27160 22681 7793 -10842 -16224 -31633 -55320 -51952
29263 -51952 -34997 -16222 -34774 -23117 -37511 -18520 8402 16427 5315 -3831 4725 -30
29251 -30 8436 -453 -6775 207 4457 11346 7 -13434 -7688 6124 11928 21418 5853 -16627
29237 -16627 -35674 -21066 -8807 -8795 14770 17408 14096 37791 22547 10601 -55 -10488 -18348
29224 -18348 -26386 -11750 13737 8069 18828 36276 22623 -15600 -43029 -25303 8929 29130
29212 29130 34159 26866 -5226 16907 13978 -9851 -16127 -41901 -49706 -39552 -15128 -5209 -6713
29199 -6713 -17622 -25778 -18470 -14777 -3064 18277 30513 18275 8924 3963 17330 12750 15871
29186 15871 10197 18926 15579 6936 -18488 2517 36196 37629 22563 13534 15216 40998 61090
29173 61090 29587 2744 25788 23320 4187 19729 28391 34397 28589 716 -18622 -26042 -11582
29160 -11582 5171 17729 33018 26762 24921 7351 7356 12310 -3397 278 12123 6151 -22875
29147 -22875 -43275 -26806 -1614 16186 -12516 -20355 12269 15502 -19777 -22443 -12900 14920
29135 14920 14655 3892 -1935 24566 45520 26916 5099 -1017 -5930 -5849 2303 -9076 -11485 9372
29121 9372 6873 10400 -6377 -13294 10524 46117 70081 42126 29021 48295 37177 24603
29109 24603 22181 31484 7850 10052 -5770 -22585 -15973 -7258 -18629 -41922 -34529 -41251 -36773
29096 -36773 -27288 -21297 -31439 -48087 -30144 -85 15683 15297 9038 -5362 -12693 -4636 29767
29083 29767 46610 31981 -5401 3377 25528 11020 -1766 -4238 3367 5905 -10780 -7527 -22762
29070 -22762 -42691 -34039 1070 30379 53225 32331 12797 -17387 -34183 -26078 -2352 10478
29058 10478 16751 27643 16072 13205 -10508 -17116 -9324 -1146 233 1285 7064 46128 36993
29045 36993 17921 16140 -36212 -42235 -39801 -29227 77 8414 8516 -19745 -29303 7699 29923
29032 29923 33205 32115 28166 26880 27535 45172 43169 -2998 -21945 -15658 -27943 -12458 27502
29019 27502 43320 19987 -30069 -54362 -44615 -1833 32699 35669 21008 -16314 -13074 341
29007 341 16095 17944 47286 58453 31640 15193 29748 19592 8660 22203 17770 -9141
28995 -9141 -13781 -9957 -11263 -22074 -13095 -19094 -41667 -43154 -36432 -9006 -4301 -17999 5516
28982 5516 14512 10382 -15106 -19634 -20010 -22776 -12736 -17223 -35032 -30960 -4900 2614 5625 -5490
28968 -5490 -8661 -19919 -3703 21240 35442 35800 22588 16215 16437 13410 23273 32064 42124 31828
28954 31828 28987 9481 -5875 -3780 14073 28203 33409 54484 40349 19135 3358 -19278
28942 -19278 -26592 -36055 9177 9619 -14181 -14041 -4162 -4895 -9812 838 -7499 12518 21670 15693
28928 15693 -15132 -27514 -11084 -5398 9146 6808 24972 43553 34802 11106 4593 11001 7644
28915 7644 4973 17332 -14120 -40065 -14641 10817 21511 14529 -282 -15336 599 17446
28903 17446 15529 -3463 -11310 -23265 -460 -22294 -23666 -23123 -36735 -24962 -4451 12051 13702
28890 13702 44255 32462 33208 11394 -2468 22334 22976 -4840 -23396 1819 4467 15022 18771
28877 18771 3761 -7038 -24664 -17425 -17708 -17935 -4902 -24044 -9306 8234 133 -27228 -43906
28864 -43906 -47814 -52573 -57411 -42744 -37585 -41262 -18243 -13073 -10791 17358 55979 25293 9755
28851 9755 7528 24304 37362 43992 45759 12970 19814 51117 55107 56978 25045 866 -17608
28838 -17608 3695 10479 10345 25119 21395 15744 26900 27806 31374 40559 44439 47265 30878 31356
28824 31356 20531 -3643 12525 24271 9009 -603 -8999 -24943 -12351 20669 14505 16864
28812 16864 33233 7064 -2932 2318 -7317 -8731 27268 33822 26098 30124 20583 13073 4695 -3333
28798 -3333 -23392 -35707 -8787 -8663 -16558 781 -5286 -9498 -279 -3854 4737 5355 2964 3012 -5176
28783 -5176 -5283 -9261 -29311 -13735 -15812 -7082 15071 31694 17070 5728 20469 12353 7280
28770 7280 1163 -19 -8042 -5284 5552 10572 18589 14066 30236 33949 35605 36252 34520 46722
28756 46722 48037 52610 41486 34397 53149 34279 16420 30065 31498 19182 -6316 -28773
28744 -28773 2059 19182 6432 379 11229 938 -16600 -7897 -13671 -10062 -10447 -20651 -33928
28731 -33928 -40609 -3505 23804 7892 -8117 -5239 10547 -6439 -28817 -30942 -8410 -13710
28719 -13710 -8045 -15711 -15178 -27459 -38635 -30432 5664 23584 15460 4928 5422 -9073 -7844
28706 -7844 2498 10342 9679 8129 18290 12383 -11744 -16839 8739 10875 -12011 -20126 -18224 -3425
28692 -3425 -6268 -14484 -9651 7533 18923 37725 21169 -11626 -16485 -8795 9976 14857 29474
28679 29474 5868 -12176 -2029 12492 5512 -6087 -9221 15434 28343 13410 3622 -18417
28667 -18417 -15957 2991 -11264 -28036 -15634 -21972 -31643 -14259 9407 18419 25236 35235 45602
28654 45602 51611 39449 3512 14469 25288 3217 -9357 -1920 31157 44948 34908 29982
28642 29982 44128 10186 -1305 -10663 -486 10411 15809 12661 -7423 -13826 -7807 11872 18802
28629 18802 22226 11845 7413 6375 1444 -2245 16179 16653 17123 20784 22512 33571 31582 31955
28615 31955 38891 47741 48382 40766 16132 14680 24979 44800 33991 25207 51406 69661 36301
28602 36301 11715 -12737 9660 6100 11396 25657 11905 -14055 440 14492 21399 13128
28590 13128 -10712 -8592 -6002 10041 25224 6979 13786 14845 42314 30741 22660 3159 -19141
28577 -19141 -28003 -24486 -29379 -27126 -31664 -26509 -18766 -4490 -9107 -30395 -44974 -37696 -8126
28564 -8126 29879 18096 3724 5608 23022 28201 6092 6480 -9631 -38924 -52008 -9480 3603
28551 3603 -13093 349 3117 11852 32481 21599 20411 24193 47897 66983 58535 49311 23022
28538 23022 17845 5809 -6232 -15571 27172 43604 36001 25603 18354 9011 -5660 -1243 9004
28525 9004 5805 6744 3076 -23183 -21850 -3809 6299 11269 -9411 9980 26486 4049 3711
28512 3711 17309 9978 286 -12144 19188 37930 30330 44770 39577 38262 18082 15307 26522
28499 26522 26829 4570 -26889 -24923 -8013 6577 22701 10505 -2059 18869 47566 57123
28487 57123 49295 19540 -727 -17339 -3968 11841 9922 -15838 -24326 -18917 -28883 -40318 -30122
28474 -30122 -25561 -8609 6921 2259 11329 9849 13308 24404 16659 27275 41421 58593 22969
28461 22969 17333 11044 -3183 -547 19056 14652 25571 15732 3821 15980 33310 14192 -3648
28448 -3648 12075 34252 37818 19884 12951 26788 35695 35171 39155 58735 51821 24614 5621
28435 5621 -2114 -1297 -8311 -807 36422 40463 23865 -9300 8830 38609 59777 35489 -750
28422 -750 -2961 -8551 -19621 -17444 -4282 13065 12833 -4155 -25386 -1500 292 -6898 -11749 -25798
28408 -25798 -5189 -4238 -6197 -5098 -11400 19423 38666 71349 94814 92973 53939 12489 10637
28395 10637 27103 19736 -13593 -45044 -56176 -36343 -9343 -16553 -21995 -16066 -13382 -8495 -3406
28382 -3406 -8378 -20647 -4804 10581 26337 17124 -7830 -18831 -13874 -20486 -34610 -19495 -2184
28369 -2184 13504 11029 3734 -24549 -8042 -11960 -4596 7015 22011 26844 9039 1921 10526
28356 10526 9481 3738 10857 7132 -10380 9117 25117 32071 26523 19113 7970 9778 27524
28343 27524 15600 -6716 -6564 -5141 -28003 -27974 -34185 -27679 13314 25180 28302 4757 -16490
28330 -16490 -17827 17345 37267 28180 20242 22430 12497 6116 -18258 -26641 -28248 -7912 5658
28317 5658 -17071 1467 27596 36063 15504 -4753 1140 1156 16861 21246 6094 11905 26103
28304 26103 11146 -20169 -23637 -32150 -46806 -28586 -3864 10776 19466 20346 32402 45820 42834
28291 42834 21861 8913 32923 59343 46306 12947 -7497 -20583 -32745 -24574 2079 24669
28279 24669 26190 34967 49821 29639 22504 36264 18753 22038 32370 6297 -17972 -32398
28267 -32398 -36366 -38406 -49643 -69832 -50733 -33357 -12452 16921 32769 44265 24835 -247
28255 -247 -3415 34081 24718 -2096 -36977 -20511 3467 30524 34250 28642 22341 33155 24718
28242 24718 9513 -7761 -18747 -13138 -13928 -19916 -11605 26244 38212 36054 42557 66220 49169
28229 49169 29810 49502 34537 52912 63513 46124 35879 23149 3445 6030 -16264 -31979
28217 -31979 -38307 -32476 -11342 -394 13553 -18094 -38755 -44133 -50650 -47626 1980 31781 14275
28204 14275 -3102 -1502 4966 9441 -16081 -8262 -5104 10547 40879 30341 14086 36466 31230
28191 31230 14431 6184 -2494 -299 -8101 -1921 -11133 -13998 -24246 -51665 -19168 6287 12174
28178 12174 31061 31200 19937 19769 41767 44212 47328 61152 57370 55297 58819 63480 34458 34617
28164 34617 75949 67217 33413 32756 20048 -5110 -14728 1132 -350 -20941 -9222 -7258 -4657
28151 -4657 -23934 -39722 -30225 -2287 4169 -36384 -63429 -69982 -81857 -78057 -57604 -51139 -45525
28138 -45525 -40816 -28598 -30676 -8992 -13884 -25141 -19058 -13994 -4277 -9885 -12650 17033 -3557
28125 -3557 -16871 6743 10277 -1932 -8938 1630 10263 1617 22635 42079 26804 13696 -10685
28112 -10685 -12928 -4452 20105 43288 44038 22689 -12647 -22570 -7893 3354 5091 2215 -32121
28099 -32121 -36537 -25379 -43443 -32663 -30721 -30070 -27723 -21024 -14707 -10187 4312 12172 6708 -2417
28085 -2417 1328 5807 11196 3710 -10976 -10106 -887 -492 -3956 -37775 -24689 25810 27309 28350
28071 28350 15455 22290 4233 -19066 -36474 -25145 -12265 -8905 -5136 14515 13408 22385 523
28058 523 -11942 21904 17439 -4679 -22090 -24342 -41552 -42546 -18059 -6469 9303 21019 31255
28045 31255 25535 24862 10409 8989 14117 338 -21662 -26272 -11190 -13592 -8074 2097 -5203
28032 -5203 12778 35409 32237 22105 2199 3170 -12433 -1513 12190 8187 14610 -28869 -44490
28019 -44490 -42693 -31062 -38236 -56436 -45695 -27089 -23119 -18283 -21697 -21888 -15370 665 5110
28006 5110 24 1336 -6343 -18829 1039 13240 36679 26504 7775 1545 28565 50688 53341
27993 53341 41910 20348 -13922 -5790 -2532 -3996 -34094 -56198 -38201 -16753 -12266 -34557
27981 -34557 -38677 3542 22838 18922 9428 3685 1527 -14244 -2975 12917 -3154 -18612 -24437
27968 -24437 -17261 -20431 -40085 -57074 -73904 -37291 -14447 -19844 -14971 -2189 9379 18619 33311
27955 33311 14291 -17460 -13741 -3189 -5379 11035 5598 3182 19092 36997 21210 14699 11775
27942 11775 -9826 -11316 7122 -1488 -5894 3274 24847 11593 -24533 -22095 -9017 19628 17464
27929 17464 19757 19653 24617 47445 38533 22007 -11740 -9669 2079 2177 -7379 2468 3707 6356
27915 6356 1036 9621 -6650 -10802 -9837 -22461 1804 30414 27295 14477 -20415 -36833 -15774
27902 -15774 -3373 -19207 -27095 10996 14410 -3435 -9519 -11803 -42647 -38324 -32452 -19683 -6572
27889 -6572 20982 24813 38492 40630 49410 52119 28584 8463 7652 18504 11786 12685 19106 40110
27875 40110 41110 41206 25932 -715 14232 31252 32614 40635 28302 -979 2928 10795 -446
27862 -446 -4356 8111 12670 32735 5440 -21493 -18660 -109 -4037 -8209 -7946 -9877 -5809 25836
27848 25836 53069 64784 39853 14024 15982 -3185 -9660 15146 40046 54682 47789 30140
27836 30140 37 1613 -20418 11376 -14391 -56107 -56591 -21521 1186 8904 -20008 -33780
27824 -33780 -22481 2886 5643 7136 9993 7007 15002 24706 -8250 -25338 -21700 -9028 -10466
27811 -10466 -1425 10512 -12226 -21593 -13203 -10625 -13415 -11828 -7605 25779 12881 -4433 -32477
27798 -32477 -21939 -23481 -24392 -35107 -42953 -39635 -16832 -9499 -6638 28796 36466 33274 8294
27785 8294 4027 -6581 -912 9218 -2569 -25875 -50307 -51149 -59263 -61956 -74470 -79224 -58398
27772 -58398 -62554 -45701 -23762 24800 53164 49856 25462 -8982 -4990 22336 6757 -16247
27760 -16247 -20709 -44713 -63108 -70755 -71352 -28928 -29137 -41709 -37655 -28433 -39377 -52615 -58840
27747 -58840 -57531 -48004 -34913 -19925 22161 30653 15522 39892 23582 6666 -6667 -11626
27735 -11626 -26127 -26312 -10247 -11035 -8290 25712 45305 12338 -2758 -34496 -42928 -35940 -15618
27722 -15618 -2950 9997 -17846 -40149 -39915 2599 -8111 -30124 -13216 15246 22147 2439
27710 2439 1029 -10721 -41328 -65768 -65313 -89198 -80821 -35627 -7715 -1936 25569 53043 59672
27697 59672 23128 3417 -20200 -52507 -57356 -20944 -8525 -7976 8730 29332 30700 55171
27685 55171 79704 64972 45212 29195 37309 52030 48172 2588 -15907 -15086 -9748 -23916 -44724
27672 -44724 -32375 -10453 13536 28617 8814 -7921 5977 -965 -8321 -24459 -13724 17597
27660 17597 16060 19526 12135 -19460 -36783 -15852 -8696 -25969 -55594 -40024 -27228 -2772
27648 -2772 28003 7134 -3156 32559 44583 46908 47390 21102 45030 63776 39260 41259 14329
27635 14329 -7560 -33117 -11902 13342 3232 -28661 -18260 7298 23444 27721 22570 28258
27623 28258 27391 33558 23195 -4205 12791 26753 17490 -2268 5733 38947 42803 12211 9313
27610 9313 3467 9938 5090 3666 15540 40274 63672 82655 54843 30448 66521 72733 40476
27597 40476 33245 15576 -17522 -19091 -9145 -4369 9662 -4942 -17688 -19681 -21598 -5969 -12768
27584 -12768 -13623 -1128 13777 -1414 -5824 4666 22844 53780 58700 54720 41569 19645 3291
27571 3291 -889 1178 9442 -9366 -4050 -9238 -30497 -36891 -28247 -16022 -11193 -18578 -19488 -29591
27557 -29591 -50741 -67670 -53978 -20537 -3721 -11230 -13522 -9650 10793 10425 27752 25407 4088
27544 4088 24208 36270 25046 -8406 -32798 -15291 5557 -8623 -5129 5951 24618 40324
27532 40324 38642 14113 3493 2665 8441 1769 1252 -5487 -47209 -30865 10095 37951 56705
27519 56705 62973 43894 31642 34250 30347 20432 27140 23247 12568 1428 -6685 -7042 5149
27506 5149 -134 -165 -4988 -12936 16119 29093 1721 -18119 -19598 -23780 -28931 -37836 -39367 -15322
27492 -15322 1657 474 -1257 16729 6077 -15729 -11511 -9002 -31129 -26276 -25143 -30642 -12246
27479 -12246 -11505 -7454 23583 50528 65081 52519 65292 34358 -11205 -27465 -22327 -7468
27467 -7468 5418 11003 -18818 -14075 -456 14907 -2390 -16871 -6808 3126 -37643 -23162
27455 -23162 -6487 -11784 -20311 -10279 -26481 -20069 -11726 -19903 -27815 -23410 -17629 -9418 3876
27442 3876 1258 -2765 9456 12018 -2621 -14897 -21794 -35136 -32170 -16018 5926 9106 -8166
27429 -8166 -33179 -45220 -14416 15710 35038 45500 16386 11202 30442 22909 23459 28487 5578
27416 5578 5399 -17994 -33853 -27682 -1240 42014 58128 26409 7962 5637 12630 -21847 -33856
27403 -33856 -53401 -67597 -68402 -43964 -39054 -56094 -57423 -41463 -40451 -35969 -12518 35767 52785
27390 52785 49280 46729 16892 -2718 13166 17775 25575 13468 4589 -2935 23144 -1236 -17880
27377 -17880 12145 18829 13455 4983 -14484 -32701 -57209 -14161 16001 24484 -6576 -34713
27365 -34713 -44305 -26867 -12065 -14841 -14575 -12144 6634 15718 8532 28161 33707 29840 42467
27352 42467 22472 14859 12590 16435 29183 37630 32376 13854 26717 12689 20183 6284 835
27339 835 -10475 7925 21029 13553 15355 16180 -7060 -11763 -2248 24387 39245 28591 13550
27326 13550 4488 -22511 -64130 -56688 -29699 -20606 -24444 -28210 -48586 -25336 5955 10431 2945
27313 2945 3961 -4807 -36698 -66607 -67842 -53782 10945 18305 3491 3390 -6461 -26058 -20041
27300 -20041 -11548 -1972 -766 -39760 -29777 266 36160 15119 -28979 -9120 5445 14428 -3110
27287 -3110 -25717 -3508 5682 12024 34939 49966 40909 49239 38643 30246 25310 13841 -22696
27274 -22696 -36934 -10677 19838 -6304 -32993 -28594 -8185 17402 33646 11471 6676 8433
27262 8433 -14165 -17701 5180 26822 40210 40083 51235 41974 41390 13552 -6351 -18102 2004
27249 2004 22086 -1835 -11261 -9125 -14328 -34147 -45727 -36894 -11903 -262 7012 29206 22723
27236 22723 14053 -3609 5064 1005 732 27999 25817 21838 14432 -14323 -21863 -12563 4770 30845
27222 30845 26921 26209 3763 -35159 -67995 -48049 -24654 -3353 42367 31437 -1343 3270
27210 3270 825 -19872 -19715 -28181 -26599 -13646 -11114 -12595 -10751 -21391 -38226 -24084 -9028
27197 -9028 4361 9428 14963 -12248 -13881 -18524 -25341 -14446 -21884 -37239 -28463 -34098 -43907 -22642
27183 -22642 -5880 9100 154 -7364 10687 36648 15116 -12373 -19050 -16461 -13970 -21109 -10220
27170 -10220 4072 -7082 712 -2009 5344 28363 55725 48523 33478 9719 17401 14998 -23839
27157 -23839 -57317 -61742 -34544 -8087 22408 33848 26143 8238 3371 2972 32705 20665 -561
27144 -561 13239 25109 28102 14435 -4392 11019 4934 -7778 -8205 23399 36995 -911 -22853
27131 -22853 -16456 -19916 -12139 -8115 -18779 -10744 -8367 -10825 -3422 -18504 -23140 -10493 -8989 24656
27117 24656 59147 37124 25376 52674 61219 45354 47803 48951 43815 20944 18501 14045 -2298
27104 -2298 13319 30990 14260 10790 28112 38834 40393 41980 20940 38546 58589 47819
27092 47819 15444 11533 22852 12512 -10479 -44001 -22964 -15432 -25131 -6620 -2809 -9461 -7038
27079 -7038 -8449 7013 19323 47172 42321 21892 7127 -3952 -5180 -16924 -24614 2600 20226
27066 20226 26903 43463 66138 68564 38416 21342 12561 -2392 -34209 -13808 -17598 -31071
27054 -31071 -49030 -47969 -59659 -54135 -9506 21552 34472 36168 34323 47943 53591 26812 -7475
27041 -7475 -37356 -42611 -33985 -31942 -25099 9061 39309 30291 9583 10390 -24425 -29441 -11522
27028 -11522 11129 27351 -2136 -9864 -13938 -32470 -45511 -32156 -32818 -27584 -16419 -6498 -26612
27015 -26612 -19691 -2841 619 -4375 -8391 -6094 -1055 -14321 -31214 -22349 1657 -31933 -39779
27002 -39779 -20625 -17983 -8596 14741 15545 -2407 -19836 -25166 -17597 -11191 -4740 22407 47604
26989 47604 35600 35577 26838 11193 20722 4201 -19039 -1249 -4375 -4510 6247 -12901 -12625 -7824
26975 -7824 -2385 -6983 23634 14853 6445 -12074 -9376 -19682 -43253 -54396 -65380 -29368 -10138
26962 -10138 -19153 -12616 -10646 -27966 -28336 -14096 -15319 -31506 -28369 -30906 -25564 -2453 4294 4605
26948 4605 2024 13178 12476 -7672 -21297 -9809 -9211 -27827 -24953 -16302 -21739 -50734 -64549
26935 -64549 -40383 3967 27811 7276 -6957 2569 8015 2115 134 -30825 -39437 -16640 -27057
26922 -27057 -26701 -15685 1369 -2038 -32088 -47764 -40156 -23162 -9900 19847 17046 11432 -20390
26909 -20390 -12840 477 2769 -6808 -3626 12792 2934 24442 28068 -9350 -50372 -55082 -30284
26896 -30284 2504 -6781 -1356 -16131 -37989 -13368 16837 26336 26149 -1664 -21977 -1809 -4963
26883 -4963 -8736 -24917 -37432 -46881 -59810 -47331 -37897 -46716 -37298 -7978 -19599 -42346 -63087
26870 -63087 -39533 -18744 -30212 -68204 -37238 -20051 -19325 -29662 -13264 -558 21329 -3331
26858 -3331 -1409 -13299 -32507 -27079 6701 17548 -8196 -7800 -7736 -17657 -22285 13461 15027 -10352
26844 -10352 196 14351 10051 28253 44181 35963 19417 27161 20184 13456 26018 46507 58056
26831 58056 50667 29956 2581 -20596 -9726 -20130 -28683 -38590 -56179 -53126 -46657 -59277 -41993
26818 -41993 -16524 -16242 1449 1541 -24074 -16941 5864 -1889 -2477 -461 -9941 4805 26065 32770
26804 32770 19090 16597 11443 -4941 324 -12656 -6832 -11524 -20368 -6382 -20386 -28779 -31656
26791 -31656 -15854 4965 -10105 -4424 17291 18036 13083 12169 -14550 -16897 -32663 -17565 19509
26778 19509 1300 -27195 -24469 -18818 13299 11869 -24633 -37439 -28003 -31878 -25752 -11477 -22870
26765 -22870 -20671 -8075 19720 33902 30672 9076 19718 18094 15107 19560 5839 -6244 9102
26752 9102 13736 5671 -9274 -26799 -20776 6649 23357 9902 8529 -11874 -7617 13975 6070
26739 6070 20314 8607 16632 33706 30801 8437 29615 20415 31534 23919 9636 -4219 -2098
26726 -2098 1897 -7141 -1649 -16641 -26664 -43266 -37485 -37602 -39345 -25256 -10979 -24367 -16639
26713 -16639 -32154 -30219 4742 -13055 -12737 526 -6624 -6092 -10110 5921 15055 48987 38368
26700 38368 20187 14532 -1823 -5009 14049 27487 12256 9303 394 6755 45691 48301 48349
26687 48349 48462 43527 40103 39220 15881 -9750 -12467 -8081 1766 30892 34999 48129 30143 20083
26673 20083 37612 46607 23395 -70 12457 4820 -1410 15842 22911 2387 -3160 -50643 -49318
26660 -49318 -29134 -7437 -5850 -15912 230 12458 13416 -6493 -23839 -17139 -5049 -11737 -12234
26647 -12234 9626 23413 -15608 -6840 23619 27876 31181 21018 6570 23054 29221 36071 22712
26634 22712 11377 11181 -13878 -9147 -33774 -50622 -58531 -46718 -84166 -50093 -14244 -1570
26622 -1570 22193 16806 14804 24242 50662 37898 11120 -18261 -43953 -49519 -46570 -24887 -17809
26609 -17809 -21841 597 20533 22431 12764 -27787 -44696 -38621 -31436 -27147 12755 12977 14168
26596 14168 13481 3612 84 4282 -1650 -16159 -26242 -52466 -37037 912 13282 8176 2240
26583 2240 8687 16616 4084 -12995 -2765 19783 41033 59474 49050 18300 23510 10773
26571 10773 -11131 -9092 -1213 -18827 -25196 -62693 -78300 -55674 -38274 -23016 7542 -3823
26559 -3823 -42196 -49089 -32122 -15252 -20900 -6257 -2251 -37339 -33416 -35134 -24985 -27877 -26875
26546 -26875 2363 16462 -9366 -27821 -27852 -35459 -28939 1376 6815 9233 10438 25329 27085
26533 27085 16194 -3115 -34721 -47469 -38198 -14642 4465 -1163 -7284 29543 25059 -4286
26521 -4286 -7182 -554 14892 4446 -5863 1639 -6164 -32440 -60972 -60277 -27063 -7429 17157
26508 17157 6154 -14768 -39574 -34232 -25829 -24747 -250 29913 28773 35723 46022 56569 30081
26495 30081 20585 27227 26322 10470 9905 -688 9920 6102 -12560 -30622 -34299 -45674 -49505
26482 -49505 -39363 -35434 -16675 -25466 -42675 -49168 -62683 -45400 4361 38544 54507 48503
26470 48503 23740 18104 49464 37036 -8609 18833 13493 8105 10740 4265 -606 -12782 -33891
26457 -33891 -23113 4225 -8781 -18664 -14139 -3112 -7140 -24348 -36444 -59848 -40970 -8473
26445 -8473 2328 2878 5964 17789 26751 30060 25586 12032 -8335 21428 33315 22410 -2244
26432 -2244 -35382 -40428 -2684 7147 -17849 -27953 -40292 -34723 -13130 -17512 -12920 -2711 -1439
26419 -1439 -2923 -11505 -16624 -28192 -38012 -58484 -59244 -28380 -27040 -21982 -18962 -25301 -13178 17480
26405 17480 31640 26666 35491 31526 49626 18553 -18706 -5827 8591 -11007 -13803 -19272 -26250
26392 -26250 -20546 7398 8138 4293 15299 -22203 -54586 -45876 -21834 1780 23869 24835 29116
26379 29116 13985 19390 32782 34597 20588 25219 33134 37092 19531 -5967 -15199 -34873 -41263
26366 -41263 -27739 -39721 -46954 -50456 -21027 -9957 -37630 -47400 -46307 -3797 12094 -528
26354 -528 1992 -6065 -29167 -29180 -29066 -29711 -22465 -17043 -23503 -47415 -63827 -54435 -21320 -7476 -26196
26339 -26196 -34969 -39855 -39561 -41034 -41188 -40653 -21452 4837 8759 11646 9762 -126 -37026 -40627
26325 -40627 -9245 -2864 -4121 -4512 2965 -5821 -8878 21154 16250 -7055 2550 8507 1558 -14942
26311 -14942 -19190 -27930 -6394 13631 -28174 -28213 -1702 14392 -1616 -714 23084 30362 14479
26298 14479 18567 47057 53755 42217 39353 52144 44352 30119 36596 11186 15205 31039 37283
26285 37283 25847 10487 -499 -4516 -6073 -17409 -5972 -616 7553 11368 42825 45024 34352
26272 34352 29642 36097 31818 20531 39595 58724 26260 2061 6222 -5932 -25770 -31224 -13690
26259 -13690 -7844 -11143 -3028 -26280 -29602 -7023 -7802 -21912 -25008 -10605 -17540 -4022 -11433
26246 -11433 -2335 -16135 -6839 -5732 21077 13573 4474 30266 39347 33018 50263 23490 13253
26233 13253 -22365 -50186 -42661 -19777 22106 31806 40769 30946 30898 43979 17476 -15030 -33653
26220 -33653 -43315 -71526 -51750 -30769 -36291 -40919 -30396 -3517 5778 16729 3294 -11046
26208 -11046 -13930 -2253 9284 11356 16545 36590 53517 68277 34629 23188 7354 2671
26196 2671 -15423 1381 32235 38323 31087 28186 34447 29452 41441 62468 35747 22428 29468
26183 29468 30589 27304 41171 36396 -1540 -14470 -27789 -16387 -10065 16467 42199 65299
26171 65299 72386 40918 37816 54210 51692 48092 51402 41830 41654 36792 27715 32938 28823 55644
26157 55644 52661 22290 13238 1077 712 -12078 -13847 -31952 -44456 418 5748 -15992 -22369
26144 -22369 -30745 -22225 19170 47793 41082 8065 11693 30634 43287 35847 30479 27656 23430
26131 23430 16462 20095 5286 12476 8264 -12174 -21580 21105 34140 15871 -4681 5451 21611
26118 21611 -11587 -27664 -19102 -30819 -23719 2247 -11369 -41566 -35855 -46440 -53034 -21496
26106 -21496 -12779 -5380 -5154 13594 26739 13907 15471 35618 35906 13010 -5945 -537 13462
26093 13462 12286 -19384 -25859 -25479 6170 19188 3392 -10948 -42516 -51777 -43279 -53748 -46034
26080 -46034 -22898 -22153 -29274 -17815 -15229 -27204 -43551 -33816 -35755 -38741 -35025 -25902 -7043
26067 -7043 573 -8419 -13816 -31615 -18863 -7708 -15900 -38179 -27895 -858 -3358 -2864 3286
26054 3286 -15171 -26324 -11422 4456 19372 35545 33100 6569 -9063 -26754 -24479 -20184
26042 -20184 -9348 -22796 -37393 -28054 -13515 -1257 19778 16376 26666 16004 841 1355
26030 1355 -5865 -21280 -28890 -32904 -19586 -2894 14166 4764 1333 9635 11072 17466 5961
26017 5961 3291 17679 5506 -14756 -14501 5635 11087 -7658 -8015 -3586 -8120 8898 15621 7281
26003 7281 -8810 -31199 -36886 -30829 -20467 7108 21010 19073 31810 27687 15505 3955 -10454
25990 -10454 -8874 798 14489 20728 28074 8303 2113 2560 11322 20384 20450 7809 -9189 -4413
25976 -4413 6328 -13870 -7256 -1712 1691 -10272 -15231 -12865 15586 12520 9865 12157 7005 -13377
25962 -13377 -24700 -14104 24699 25983 10996 3894 10653 8480 -11512 -19322 -30349 -34710 -19348
25949 -19348 128 6356 -12114 6628 -11054 -3495 -8930 -17834 -8422 -8804 -22331 -33761 -25323
25936 -25323 -24072 -33089 -52538 -31958 -12091 -31771 -14116 2206 15489 -8587 6728 27012
25924 27012 12749 16824 13470 -6876 -8019 13210 20777 13848 35840 4976 -18512 -28046 -26625
25911 -26625 -13834 -11671 -10413 -7551 -10927 -16413 -34285 -15045 14555 -178 -11164 -12076 -21582
25898 -21582 -27161 -23760 -23408 -21909 -16149 -23249 -41900 -34790 -45649 -57375 -57511 -43952 -34490 -43238
25884 -43238 -22357 -17643 -2825 -9596 -6781 665 23813 33850 45241 49336 40642 37772 29364
25871 29364 -1017 -19287 -23593 -11915 -1845 9962 -3302 -17125 -26053 -6615 1536 1992 10208
25858 10208 16363 15602 1912 -604 3257 -21118 -38516 -14444 6554 9125 -12595 -1373 2269
25845 2269 20583 16496 22472 28791 75413 83603 55396 31928 26273 17082 1316 -22551 3407
25832 3407 12486 41773 36969 32110 24108 11667 -8834 -7793 -7662 -12022 7361 4952 418 3275
25818 3275 21804 55288 66990 33827 318 -1783 4862 -2223 -5014 -25647 -26624 -31257 -41389
25805 -41389 -22268 -5988 -18973 -30836 -25574 -13754 17474 42533 49029 54212 63148 70176 80374
25792 80374 71231 44383 21694 -10126 -38728 -39337 -24388 -26788 -15685 -33316 -42380 -24582 27227
25779 27227 49173 36413 20697 31100 -1303 -21951 -12356 -1790 -17822 -15409 -10620 -35044
25767 -35044 -19136 -4226 5723 -11 -28320 -17998 -8984 18091 51055 58523 52880 27061 45545
25754 45545 47239 32517 27306 37371 16842 4937 19140 25277 -9224 -53633 -39713 -3529
25742 -3529 -3460 -11884 -46067 -44963 -20807 -9485 -5700 -4274 20403 31284 24660 16324 11847 -17320
25728 -17320 -34715 -16925 10301 4878 -6560 14263 8431 13119 30008 34785 5547 -18604
25716 -18604 18340 36987 53151 52837 27406 20548 -4141 2677 14887 11834 -3239 -13621 -47343
25703 -47343 -33709 -40534 -31236 5492 10204 26461 8948 843 3011 -9345 -20816 -15653 -3995
25690 -3995 20524 18893 -701 -190 -3096 -15467 -12034 15793 -3882 3403 13451 3495 7348
25677 7348 5015 6261 -15931 -24371 969 24224 16972 13650 45583 59980 38002 30292 2291
25664 2291 -7731 1910 -1817 -19210 4441 19710 15917 17154 13590 18716 11084 13819 7525 -24666
25650 -24666 -18374 5998 28501 39562 21590 29371 36545 28129 3498 3350 31243 24468 10795
25637 10795 19521 19484 10389 24962 17208 2554 5489 6296 8012 21579 18908 8505 -24429 -36943
25623 -36943 -16593 -3395 390 -7852 -18126 -17420 -14185 -37162 -24947 -21622 -9438 12384 13155
25610 13155 12308 -6464 -2139 28681 28626 3603 -13471 -2747 3383 9774 14625 18465 15114 21457
25596 21457 27499 9963 8783 12789 1381 -7217 -2352 -4834 11265 4017 -4124 -9942 21466
25583 21466 11739 5385 4133 14446 -4150 -2454 8921 -4480 -19606 -4709 -6181 -13987 2079
25570 2079 22929 26741 11692 -17205 -13766 18630 30111 26663 11137 -4184 -7798 -6378 -24220
25557 -24220 -18833 -15 -68 -15701 -18677 -25778 -31022 -9630 -9142 -5015 -12598 -18791 -14144 -14054 -32454
25542 -32454 -12391 11749 -5224 -18465 -6334 22995 54445 58588 38562 -510 1724 -571
25530 -571 -12715 -15082 -2584 -18958 -15723 -17332 -13672 21687 22033 26779 2319 -27596 -26673 -48021
25516 -48021 -57444 -22196 -5635 -34426 418 9460 -3496 -7760 -9664 -10317 -32150 -46626 -34436
25503 -34436 -18479 -30272 -23478 -33572 -25077 -6150 -12568 -7739 -6932 12659 1158 -12620 8581
25490 8581 6178 10479 4682 19066 12245 24 4002 26235 25371 12094 -5815 -23382 -28649
25477 -28649 -52315 -46679 -31213 -52558 -42854 -31677 -23124 -22568 -22105 -11216 -6017 -19609 -20951
25464 -20951 -27032 -21645 -21928 -19210 4066 12353 -10969 -46152 -54628 -42149 -43154 -44465 -27533
25451 -27533 -8109 -15058 -18256 -16397 -47609 -31818 -21091 -3042 3352 1099 -11437 -24393 2748
25438 2748 1069 -8261 -2098 8306 7472 4533 28141 48204 21848 14530 -1919 -5283 -11422 -10312
25424 -10312 2604 28291 21092 38630 31259 -5039 -23764 -1501 24645 8243 -28070 -38354
25412 -38354 -30403 -2067 2929 -24579 -38600 2076 12498 -8857 7515 23620 50423 72434
25400 72434 70995 76315 60421 39262 22187 9481 1699 12748 18682 1002 -10029 -27275
25388 -27275 -37647 -32030 -29381 -47240 -51558 -36421 -45378 -18863 8191 36777 24914 16117 27682
25375 27682 34751 46004 41507 31572 26423 -3689 -29859 -6462 15168 13646 9472 -10091 -16985
25362 -16985 -22910 -7857 -25417 -29637 -37986 -46244 -35306 -42181 -34015 -22777 -9314 -13710 -30624
25349 -30624 -48842 -22036 -9680 -7961 -1826 -18778 -14034 2002 6557 16580 -783 -9479 -773
25336 -773 209 -39084 -59798 -47488 -41000 -11149 4808 -5467 -12549 -14575 -17608 -17265 -716 2582
25322 2582 4010 6624 7884 9477 -3255 -7796 -14817 -16705 8982 -5822 -29601 -13998 -14571 -16883
25308 -16883 8983 16563 8320 11627 16500 -6049 -12515 -13759 -18458 -12955 27324 45685 31876
25295 31876 29309 16615 9496 7531 -1746 -23609 -39129 -35605 -33228 -15911 -13078 -26853 -30934
25282 -30934 -30246 -230 18787 13140 -453 -22172 -18299 -544 8534 -1953 -8682 -7764 6829
25269 6829 -908 -5485 -17828 -30680 -1791 2223 -5421 -4099 -12838 -35024 -22277 4786 22538
25256 22538 24116 12358 10799 10783 -20364 -39024 -16596 -17573 -666 16868 11395 -8316 -13840
25243 -13840 262 -25554 -37178 -23937 -13952 -1289 -11223 -30243 -19620 12089 -7128 -37603
25231 -37603 -22786 16542 36269 24271 -19359 -51545 -47939 -36798 -49134 -27106 3095 100
25219 100 -6745 -10430 -7948 -6662 2073 1114 10975 -2963 -17059 -21414 -4497 1293 -19664 -12894
25205 -12894 2756 -910 -16221 -19881 3903 20634 30165 28993 -995 -31868 -50664 -32690
25193 -32690 -18128 -23584 -36188 -20718 -3500 56 -1180 -26694 -31470 3738 37335 44319 25902
25180 25902 5791 -17937 -48522 -41102 1930 4791 -20893 -40459 -16360 -5983 -17259 11312
25168 11312 17102 -6443 -19458 -10495 10151 -817 -30915 -38796 -23172 -856 -4657 -19050
25156 -19050 -43218 -12501 14929 28831 18561 -18122 -40539 -19607 -12130 -606 -1219 14776
25144 14776 -5830 2160 7750 4656 -14619 -10854 -10224 -1789 -2781 -30784 -22164 1772 589 -14420
25130 -14420 -49619 -50559 -45303 -31463 -20558 -30007 -48719 -53097 -22606 -14399 -10288 -1252 -8077
25117 -8077 -3711 -786 11421 25580 52637 53111 57260 44740 4602 -17579 -19233 -23889 380
25104 380 -3515 -8011 -368 -25389 -30482 -8486 -20017 3556 35437 54803 57045 25297 3212
25091 3212 -220 -4904 -15237 379 29424 43017 29719 9521 -5295 -18061 -6104 -2877
25079 -2877 -16860 1556 -12418 -16063 -20425 -12947 4537 18654 18031 6486 4632 21131 14383
25066 14383 -2709 -3721 -3200 -13899 -16086 -25389 -16852 6664 6978 4089 1815 -4786 -7875 -6662
25052 -6662 -3014 -26512 -33055 -17845 19007 35822 5226 5206 18833 19846 10427 23085 30631
25039 30631 24991 32737 27812 29257 25063 -36016 -55371 -33383 -16303 -34628 -64075 -51619 -17653
25026 -17653 -6132 -42761 -60401 -34836 -23905 -5259 -20143 -35089 -38630 -31157 -29824 -1690
25014 -1690 -5326 -8557 -10612 2143 -16637 7144 44162 13832 222 10246 26493 51183
25002 51183 46932 36490 36137 19055 14388 16892 5894 16225 39489 15924 11571 20645 20626 -389
24988 -389 -20941 -25141 -10823 -2574 19338 14361 -8627 386 -5160 -1177 -14976 -17670 7891
24975 7891 33427 9909 -9251 11009 27841 220 -24584 -26773 -18595 -1463 6014 17843
24963 17843 25433 1254 -31741 -50226 -38953 -31660 -23970 -15597 -13787 -18608 -14663 -19184 -13966
24950 -13966 -16026 -24869 -47037 -31591 5590 7996 -5504 -10775 -18330 -24609 7171 6565 4039
24937 4039 2833 -7027 14107 12507 578 2581 1121 -15873 -18066 -23824 -20856 -7311 3648
24924 3648 28864 28111 16845 8787 -24954 -43483 -48083 -53534 -18190 -6424 -9385 -37480 -39515
24911 -39515 -15222 5377 28594 41104 51851 33974 12297 9250 8173 -10524 -28154 4864
24899 4864 30992 23954 24074 35361 45329 22941 32903 41316 43780 37392 45800 34007 13235 -1737
24885 -1737 -30705 -47744 -37669 -8100 -2303 1291 -6175 -16570 4532 38700 15978 2998
24873 2998 8505 -120 -18370 -21670 -20908 -13980 -27660 -67904 -83622 -47452 -48056 -45436 -12331 -10834
24859 -10834 -12270 -21925 -15070 -11062 -17959 -3506 4187 8155 36072 35288 19294 -4432 -13501 -25217
24845 -25217 -29424 -16586 -11776 -5528 -7387 6166 -12115 -24758 -16545 -24280 -36207 -53212 -60005
24832 -60005 -25822 29710 60934 34467 2070 -31426 -35907 -11971 -2258 3259 -4473 -26701
24820 -26701 -9354 -9334 -30368 -45695 -63090 -58241 -42773 -27429 2331 2556 -14997 -24518 -6738
24807 -6738 14014 -14827 -44594 -30764 -4709 -16466 -19519 -17368 -5249 13954 30644 36989
24795 36989 19614 -25494 -38076 -67799 -72160 -41650 -28861 -26229 -42469 -32056 -18312 -28195
24783 -28195 -41364 -37901 -2344 5651 -1263 12734 29162 35974 31412 9386 -19831 -29189 -18956
24770 -18956 9407 5856 2091 1932 24776 36486 19535 9729 12142 6803 8364 1232 -12146
24757 -12146 15347 19426 3340 -14002 -7303 25416 36140 11741 -11787 193 11847 -5729
24745 -5729 -1941 27072 19442 -15850 -21584 -25067 -15270 -681 -13769 -12755 7530 23615 -1389
24732 -1389 -1519 -7825 -10215 -19411 -31167 -25248 -20318 -12726 -8204 -3905 -26369 -35381 -13792 -7070
24718 -7070 -6548 10822 15369 5178 320 -8072 -12293 -16247 -14442 -38507 -31743 -19426 -33377 -45752
24704 -45752 -51415 -48649 -54855 -33682 1749 28979 29945 35836 39206 60875 49731 29184 16112
24691 16112 -2329 -37644 -41843 -29841 -8291 -11233 -22647 -26673 -41688 -37742 -18553 -6995
24679 -6995 1528 -13106 -9786 1076 1277 15882 -4060 -15996 -2133 -18198 -18155 -12030 -16556 -59770
24665 -59770 -64578 -48054 -27577 -24028 -19311 1376 637 -27039 -4673 16575 11956 -15675 -15020
24652 -15020 -19012 -42909 -39414 -30207 -25454 -38242 -46099 -64464 -55191 -24321 -11362 -12839 -16095
24639 -16095 -4985 15582 48484 29151 34367 27104 31912 14947 -12999 -10910 938 21494
24627 21494 19449 13736 25860 21157 -10518 -28442 -28238 -24536 -1264 -649 -7423 10161 -5377
24614 -5377 5819 5485 6580 -18468 -31034 -4880 -17110 -21764 -19984 -25286 3939 10902 -1223
24601 -1223 -22584 -16804 -23622 -18095 1324 23943 1751 -7066 7976 15249 30661 60841 60695
24588 60695 19956 2334 433 -7864 -20613 -5345 8945 5356 3077 -41538 -65481 -45508
24576 -45508 -36593 -13079 -2964 -1386 -12064 -25041 -16631 -4789 -6845 -29871 -48297 -46681 -807
24563 -807 9625 10457 4490 -10085 -20829 -23294 -5197 -5313 -23197 -23267 -23996 -35169 -12669 14314
24549 14314 51335 76189 47803 56266 65448 69223 42322 41308 12415 -14260 19314 38751
24537 38751 6495 -4455 -9539 786 273 -6915 -31011 -34114 -27586 -31797 -34774 -49160 -53142
24524 -53142 -38896 -17444 12964 -5381 -37341 -70070 -81938 -57130 -13050 -5009 -17450 -3897
24512 -3897 -7428 -12314 -11756 3041 -3150 -20059 -10434 -10313 -3732 -20650 -22631 -33058 -37434 -41090
24498 -41090 -58290 -64955 -46664 -30717 -34121 -11553 -646 7698 22837 33496 18642 -9554
24486 -9554 -23829 -43651 -46653 -8941 7813 2266 -26679 -39686 -44921 -30955 -14612 -17217 -11289
24473 -11289 8551 -13508 -16152 -16216 15477 15831 5589 5352 -24129 -39940 -27487 -7285 16110
24460 16110 29025 23940 37393 34102 38046 40756 39061 25787 9239 -9927 -21117 -25483 -7635
24447 -7635 4069 5084 -5995 5854 16332 10867 -13497 -17916 -16098 -21274 -33618 -12544 12543
24434 12543 -11771 -18822 4094 6771 -7032 -10969 -31355 -11419 561 -14996 -23696 -5668
24422 -5668 -5090 -11753 -27926 -23848 -23295 -28206 -35374 -47833 -58932 -64060 -76730 -75238 -50370 -19912
24408 -19912 12021 -6121 -13602 -1386 -11388 -28709 -16153 2674 -12541 -13964 27342 9553
24396 9553 7928 272 -2954 -13567 -35276 -32174 -25570 -45048 -39717 -34916 -27600 -12011 539
24383 539 14857 14583 10984 16256 26934 34296 31946 21647 -125 6724 7071 -11338 -17007 9150
24369 9150 34307 56223 41238 36209 24302 13919 -9732 -10659 -30694 -30502 -24260 -43470 -46223
24356 -46223 -18570 -25610 -9903 6820 11446 6441 12926 46755 48163 25572 22170 3157 -8693
24343 -8693 -7388 -4606 6133 17686 15416 19550 42734 45490 -5795 -38256 -35809 -20869 24964
24330 24964 20980 -1115 -13248 -38150 -48880 -41550 -29540 -20339 -23829 -23247 30394 37151 35939
24317 35939 37188 -986 -16082 -22816 -30726 -22411 -27924 -28386 -25161 -13404 -25539 -20449 -30115 -36400
24303 -36400 -8128 2592 3146 -2576 -1174 1191 28550 42454 28873 6962 6523 14969 -5874
24290 -5874 -35427 -18930 12743 39960 29677 41136 12387 -885 6543 4997 -22281 -21490 -14882
24277 -14882 -35983 -46745 -53939 -62846 -71729 -63556 -22260 -28371 -43290 -20703 -13665 -21076 -31527
24264 -31527 -49881 -71345 -50126 -27491 -21388 -18681 4051 -30 610 32143 32612 16996 7036
24251 7036 17636 20503 17427 24344 38337 30980 9989 -24820 -36091 -9206 -16674 -17590 -15480
24238 -15480 -24733 -14229 -31594 -48452 -41573 -23497 -11004 -7768 -7840 -22240 -46051 -21211 9959
24225 9959 13108 -15563 2021 20500 18618 18928 3426 1593 7279 36912 37591 13174 -31729
24212 -31729 -37020 -37219 -29020 -6979 -990 -12295 -24761 -71546 -60585 -67243 -70962 -77995 -67692
24199 -67692 -27526 -11374 3857 9608 9452 -19558 -7483 -2408 -18200 -37128 -29875 -11878 -25886
24186 -25886 -39016 -25511 3349 11376 -8002 -18825 -20641 -11012 -5727 -4017 -295 -7144 -4271
24173 -4271 -30885 -28139 -16244 -16791 -23047 -14178 -17000 -27815 -1543 -14079 -5543 -53883 -83158
24160 -83158 -86831 -67251 -61939 -64808 -71855 -54280 -28943 -12440 -13160 -33783 -4998 3827 40715
24147 40715 52343 6819 -27016 -29620 -22104 -13476 -7767 -11684 -25139 -37721 -28527 -7706 1105
24134 1105 17040 11742 -2405 -979 13010 22507 712 -8683 -8231 -5796 -38429 -75347 -72581
24121 -72581 -67998 -56432 -34487 -28716 -34307 -24313 -7325 -11021 -9869 -16231 -4674 14773 12905
24108 12905 -26612 -46637 -34715 -8603 -29475 -41959 -39775 3267 17366 12319 32422 36985
24096 36985 29711 29907 40717 17865 -14269 -41468 -39680 -15153 -9384 -27959 -44728 -48116 -43149
24083 -43149 -40240 -10691 -16127 -27054 -32058 -3526 15382 -16853 -15286 -12850 -18492 -14487 8189
24070 8189 11621 -7689 -23373 -18047 -25978 -48156 -43561 -19819 -1794 6733 -9774 -5332 16703
24057 16703 12123 -13238 -9693 2257 -8587 -38512 -22909 -9265 15046 32853 25644 29206
24045 29206 20000 33985 31421 3509 -14257 -2171 -13545 -33366 -35068 -44218 -23759 -9517
24033 -9517 -8045 5291 1278 -29638 -43497 -35142 -36858 -13569 29847 41489 37286 -6216 -37904
24020 -37904 -19272 8018 10330 -12242 -36512 -44398 -26753 12566 34407 35887 -5286 -5008 -15085
24007 -15085 -22230 -14216 17536 26219 14964 30156 28654 12711 -23142 -16150 -28726 -24385 -154
23994 -154 4812 -13047 -20799 -5140 -10682 1616 12475 6767 37295 41914 18851 -17931 -6289
23981 -6289 6589 8405 -13779 -11109 1690 15359 24723 17915 16566 22663 9682 6686 2862
23968 2862 10148 16358 17091 -11080 -15896 -29138 -661 18837 3231 24523 41773 37053 13316
23955 13316 12574 -699 -32647 -28802 -37307 -40723 -39831 -12957 -1391 3164 -7218 -13458 -6775 -30100
23941 -30100 -48278 -18856 12762 22235 5163 717 -26763 -15451 -16996 -24592 -25510 -29842 -39546
23928 -39546 -33251 -22487 -23135 -34442 -34910 -19921 -28128 -64633 -74364 -64921 -55115 -29386 -24288 -22770
23914 -22770 -18091 -22123 -30378 -27922 -30760 -11051 3813 -11087 -17258 -11361 1452 -20164 -41479
23901 -41479 -32347 -26000 -35087 -22549 -11385 3387 2385 2441 -12208 10443 13008 -22321 -31487
23888 -31487 -32460 -39523 -39876 -48820 -48304 -29791 -25236 -28120 -21188 -13017 348 22975 24437 12556
23874 12556 6438 10142 3269 17491 26559 8914 -36610 -79818 -48525 -18969 11651 -2299
23862 -2299 -3280 15928 41066 55708 24549 24484 39967 57547 44355 18439 -10713 -22027 1598
23849 1598 28556 43486 15561 -28034 -43042 -39800 -6619 9132 26705 17284 7217 30437
23837 30437 32750 14995 815 -593 -6015 -27936 -69940 -63868 -36845 -8598 -14869 -20289 -34043
23824 -34043 -57106 -59066 -55140 -56372 -40846 -19778 -29775 -51225 -31787 -31650 -46676 -47317 -48063 -29996
23810 -29996 -38797 -17586 -11661 5840 2896 13993 28635 19669 23369 20134 6552 3491 10150
23797 10150 1982 -16455 -12662 7086 17390 19933 17424 24928 18571 30696 21885 20705 38217
23784 38217 28205 -4048 -11912 -18824 -4146 8840 -1773 4035 15522 18379 18764 17312 5907
23771 5907 8100 20390 -7100 -24590 -9389 -4312 -6768 16 -2978 1608 -4666 -17532 -9980
23758 -9980 9450 7972 -6442 -8667 -76 28020 41129 37066 11714 -8317 12233 29890 13475
23745 13475 -11386 -35957 -68493 -56460 -20388 -7858 1266 9743 24434 40391 43905 41306
23733 41306 24468 6829 14981 17462 6556 12078 13367 15283 1953 -30460 -63673 -46735 -26055
23720 -26055 -2428 29465 39065 44905 57755 56919 51205 60815 83257 80754 36031 -14833 -14594
23707 -14594 -20355 -48454 -30750 -26658 -29714 -19657 21817 36575 28341 44529 74012 57774
23695 57774 19398 -20471 -12040 -5563 -18224 -36520 -39814 -18590 -20351 3786 1787 -5903 23792
23682 23792 42008 22974 886 15596 -1428 -4985 -7889 -3005 10087 15323 20226 3777 -16902
23669 -16902 -309 3438 -26176 -35482 -54247 -55095 -39671 -36455 -29491 -19820 2194 24394 21006
23656 21006 19910 -1081 3052 -4853 4990 28050 9914 150 12702 8003 -2160 -8203 -18959
23643 -18959 -16222 6274 -1948 -5828 18722 26337 10267 -7287 -10884 -21124 -29270 -36598 -8568
23630 -8568 -26206 -45366 -29464 -9541 10056 20983 -4728 -18371 -25192 -23976 -30076 -42677
23618 -42677 -63023 -45781 -19692 -4534 1098 7513 -18453 -35106 -47655 -38057 -35656 -22049
23606 -22049 -29956 -13913 -3663 13885 27585 37170 52491 41235 16715 9510 -8985 -22834
23594 -22834 -39749 -37951 -37719 -32169 -10911 -21143 -24585 -16717 -18726 -23377 -23075 -32256 -31402 -6768
23580 -6768 5351 -395 6531 -14557 -43207 -29272 -8540 -17226 -30752 -34373 -24834 -14620 -6034
23567 -6034 -15637 -17180 -22720 -44484 -64195 -52818 -37876 -22698 -31358 -20561 -2665 19413 15744
23554 15744 -36932 -53195 -36252 -29618 -1542 63635 47654 969 -11653 -5522 -21022 -27447
23542 -27447 -14654 -29831 -36656 -23118 -5497 -8020 -24963 -21810 -6466 -21105 -31263 -3329
23530 -3329 -5037 -11198 -4667 10799 10370 -17838 -28115 5338 18433 20209 -7802 3150 6236
23517 6236 -5660 -22224 -17491 4915 -3965 -4147 -18770 -23465 -37402 -38678 -52270 -59953 -31666
23504 -31666 -36438 -38183 -31905 -26322 -26868 -31603 -23503 -233 6266 7502 7765 13126 7475 -5939
23490 -5939 -34902 -67010 -60174 -34443 -23344 -14967 -168 15279 23185 -14261 -38193 -44753 -41823
23477 -41823 -44709 -33563 1375 19298 21831 6393 -8643 -4202 6887 10019 2428 9216 7474
23464 7474 -40283 -61834 -67711 -57884 -46266 5725 9786 11651 -5343 -20795 -23633 -35966 -36765
23451 -36765 -46446 -41100 -38325 -36514 -17850 -21563 -2792 16557 20359 19342 -514 -10881 -7720
23438 -7720 -12768 -7649 4087 18696 23944 10824 -6406 3780 -4299 10955 4602 -1740 -5052
23425 -5052 -821 3966 -11567 -2161 -2529 6556 15789 26719 17034 20574 32832 21684 26406 24154
23411 24154 226 -7076 -11158 -7295 18683 24269 11843 27929 61749 65572 41634 39805 33024
23398 33024 2940 -18503 7097 33038 23695 14254 -17522 -51074 -59189 -23117 -16283 -6823 18774
23385 18774 34974 52221 63483 54249 26059 31208 38525 14358 -7104 -29750 -24116 -4400
23373 -4400 -18829 -44608 -33318 -22740 14997 27849 9951 -2888 -9382 644 -35454 -32017
23361 -32017 -26205 -40881 -30815 -18611 -4594 9525 4042 212 -7086 -16409 -7141 8110 12041
23348 12041 15351 29741 21408 -12896 -12685 -11569 -12664 -26021 -26727 -14227 -22323 -21662 16252 15086
23334 15086 -25037 -30445 -15875 -5200 7595 10065 8910 11058 -5519 -9523 -742 -13376 -18994
23321 -18994 -6322 -2936 8766 36830 17920 4921 10205 17287 51490 26395 -7086 -19275
23309 -19275 -28106 -18224 5624 2513 -8224 -33384 -18374 -3719 36390 18309 -4945 -17192
23297 -17192 -14472 -12413 -25210 -4032 25622 10427 6209 7014 22086 31970 48270 45819 46383
23284 46383 62084 48663 43023 22221 -2756 -23111 -40161 -15209 22024 52344 46707 23070
23272 23070 9665 24698 38094 39565 43100 35974 13054 3658 -9748 -21441 -14500 -6174 -3714
23259 -3714 -2109 -23789 -11557 18830 10010 -23442 -5631 10459 5174 18142 12442 5869 -4806
23246 -4806 2307 192 7720 18391 -552 -11532 -13421 -33809 -30895 -31451 -31141 -36759 -31042 -19892
23232 -19892 -1537 -1503 -19126 -15326 -20659 -17442 -16459 -30941 -13576 -6 15486 22673 16943 32354
23218 32354 27027 8090 13365 -13772 -17076 -16041 -20504 -31487 -41240 -51144 -50270 -55902 -50863 -51018
23204 -51018 -25529 -2485 -4852 -17987 -28038 -28316 -42046 -22848 -10139 -26803 -17406 1904
23192 1904 -8626 -8105 -6378 -10285 -24121 -13355 -24737 -27587 221 2436 -17561 -27983 -47779
23179 -47779 -62049 -45791 -25021 -13490 -30498 -39320 -20200 14232 26356 6241 11419 7056
23167 7056 -33882 -27382 -16333 13426 8823 12733 -174 6076 11259 7876 -4934 -3097 18491
23154 18491 12928 -10675 -23446 -12256 -14815 -27151 -15383 3394 9601 43828 55270 43002
23142 43002 11327 7684 -10770 -10694 -25625 -33638 -20386 23229 50319 36443 -14910 -34691 -49134
23129 -49134 -48607 -35062 -12718 7895 22895 16453 27485 36424 21257 26852 32014 11399 4478
23116 4478 27621 18738 23738 40243 37804 48216 69864 85289 90488 82499 89938 110848 125095
23103 125095 117402 109187 131936 188013 239458 284144 364907 480839 659754 949269 1375055
23092 1375055 1807673 2085420 2154066 1952246 1578621 1158865 819928 582941 405364 275108
23082 275108 174868 124695 104031 101663 93963 72691 50619 56742 69322 59778 27046 36328
23070 36328 32384 16014 -1279 -1743 43317 75304 71514 43265 3054 -29855 -20652 -14548 -9673
23057 -9673 -4286 -2631 -13312 -25068 -10131 24574 25635 28661 53082 55600 26829 24130 64723
23044 64723 49033 31961 18147 51718 59188 50582 43917 31600 13913 -14530 -18245 -32170
23032 -32170 -7651 11919 4228 3381 3358 5211 18089 27252 18948 15127 7017 -4450 -8322 -20235
23018 -20235 -30008 -21289 -23346 -12945 -11272 -6578 -2831 -18496 -26892 -4645 -9245 -44218 -63768
23005 -63768 -60098 -50567 -41884 -56079 -72915 -62492 -23546 -17815 -3887 4770 34444 22012 13060
22992 13060 10846 12486 17707 14238 7170 3471 1526 -19430 -17452 -16869 -9289 -463 19122 -14830
22978 -14830 -30401 -29350 -27107 -31643 -56916 -70125 -49838 -35173 -46522 -73037 -81647 -67653
22966 -67653 -19036 8304 17897 2381 -4275 4738 -8857 -1801 -9921 -2147 -17897 -23885 -20600
22953 -20600 -7485 7476 -7876 -52001 -50758 -21561 3629 13177 23715 -8618 -13485 4217
22941 4217 25860 26952 28930 19118 11184 13546 35640 59012 71933 59917 26561 11062 -20528
22928 -20528 -17960 -20732 -14721 7441 12225 26170 40327 27579 35435 12842 -21451 -26964 2625
22915 2625 19952 24172 -9696 -42946 -46050 -20040 2042 2862 6957 24192 6460 -14565 -13951
22902 -13951 -11232 -12159 1283 3646 152 -34765 -43216 -21324 -15704 -1651 4079 8983 14866 17588
22888 17588 24147 27770 9309 9897 2779 5347 -2782 16169 11247 16293 1046 10366 29737 16905
22874 16905 1566 -1594 -10739 -39939 -56474 -54625 -49357 -41953 -33085 -14775 21501 30369 8491
22861 8491 -5243 -13053 -19801 -24407 -20503 -22406 -38891 -53272 -86574 -85069 -75327 -45863 -45989 -33166
22847 -33166 -22657 -3300 26540 57334 60489 34683 53124 19947 -22284 -5057 10423 16656
22835 16656 9393 3292 -8926 -35591 -84952 -104767 -122632 -125243 -115680 -138955 -139669 -111817 -65625
22822 -65625 -39409 -32941 -7080 24575 4831 6236 16954 32853 22138 32818 46638 82266
22810 82266 97208 108052 125477 131911 93366 71760 77450 104600 125005 118634 99829 118450
22798 118450 115342 128060 129070 150939 180708 202832 243061 270105 287855 271962 268538 220130
22786 220130 187523 141098 132621 100561 76423 56852 78349 108000 107325 64413 41932 25952
22774 25952 45900 46494 32471 42403 59241 70205 49967 59392 60958 50606 78324 88534 99486
22761 99486 69921 38168 55339 48057 34043 14471 50136 59172 55561 88586 118491 122581
22749 122581 136165 137014 98551 102029 112009 111597 70485 65811 84113 109766 109022 122807 164771
22736 164771 171116 216677 258175 268771 293710 315279 324523 325219 317427 259100 192090 116049
22724 116049 95428 77169 105756 92161 65543 63694 66124 50496 42563 57925 55711 65741
22712 65741 93571 96480 71100 52018 71595 101684 110025 77382 81325 128015 132779 134829 145998
22699 145998 162087 191629 232217 330590 459049 536627 539589 514271 435882 315968 256518
22688 256518 224305 194111 216430 224260 203619 175045 193577 211007 215472 198236 181281 178406
22676 178406 188663 216831 240756 257212 259138 257281 285477 309990 391156 542556 681372
22665 681372 744356 773033 714640 559840 439446 353912 285740 201334 162277 181038 188441
22654 188441 167082 144376 150471 186515 175642 176378 193453 201628 198755 192317 222896 239665 219375
22641 219375 225942 226968 205105 230158 243262 245770 221654 215020 246823 289664 319294 346630
22629 346630 369357 387238 418386 443591 483809 533298 547899 564418 627432 730406 913723
22618 913723 1194106 1616275 2084888 2431041 2590070 2497083 2116904 1642360 1247988 964945
22608 964945 828469 739761 659653 571486 545822 532800 507670 520009 554188 552485 554462 593030
22596 593030 650581 701213 730755 756614 795150 825129 842552 897544 958162 1018112 1067002
22585 1067002 1128667 1187023 1248339 1271247 1294978 1345151 1432866 1531446 1617961 1714422 1830130
22574 1830130 1990093 2173727 2377988 2606548 2875537 3146058 3421948 3678771 3983789
22565 3983789 4374132 4839385 5381828 6021219 6712190 7428461 8204609 9075723 9967665
22556 9967665 10978193 12114974 13417752 14916269 16664900 18813490 21505784 25031394
22548 25031394 29671284 35653957 43099366 52442223 64731577 82537046 111808420 163352382
22540 163352382 243884203 329522500 386602783 407017345 376177904 302165871 219367245
22533 219367245 150483528 102704407 72169843 52690815 39699375 30563065 23917610
22526 23917610 19042433 15448501 12720802 10657583 9043717 7778910 6792529 6003690
22518 6003690 5348801 4811850 4344373 3907642 3547378 3261567 3022643 2819973 2628520
22509 2628520 2445591 2265050 2069816 1901196 1810392 1719365 1618422 1579967 1551071 1505323
22499 1505323 1439059 1383743 1317418 1242274 1156729 1104223 1067923 1058176 1004125 962043 883416
22488 883416 843993 799612 792039 796854 800385 797191 740692 689670 674054 679342 670234 641501 634145
22475 634145 633152 632289 623426 646167 652913 638861 673470 698598 730352 761455 817408 895134 1056128
22462 1056128 1391235 1862316 2300649 2532886 2536164 2251278 1790311 1356308 1023777 796626
22452 796626 662622 552598 439854 423092 385797 340674 353133 397970 386251 351505 346370
22441 346370 361503 343783 355598 337637 300456 267131 208452 188314 196402 185229 189984 187417
22429 187417 189550 209513 216009 230699 222575 250689 269102 284914 268838 248144 252543 287077
22417 287077 291762 309987 344978 360211 346369 357092 376349 361081 332430 279436 249999 231993
22405 231993 212925 170310 166136 177796 162665 140367 105410 100770 124456 127302 118160 88191
22393 88191 79962 69633 51197 44897 32490 20532 31277 -2164 -87932 -200628 -291135 -366859
22381 -366859 -405050 -360620 -257309 -175131 -87323 -47765 -29021 -4967 13137 28181 30920
22370 30920 24322 47982 42618 22414 10443 7042 1319 10239 22848 19433 31391 42986 57176
22357 57176 60962 47416 44431 25560 6413 7665 5745 -10420 -75475 -141865 -215536 -254728
22345 -254728 -274529 -291232 -275736 -238082 -214872 -201669 -171127 -128552 -83911 -37660 21517
22334 21517 37106 34731 30629 4593 19566 22543 21867 5438 -3848 9379 17992 -1538 -8809
22321 -8809 35975 73400 76396 48745 27251 -6668 -32963 -12867 11146 2038 -15437 -1064
22309 -1064 4785 17655 21420 18987 -3326 -4790 922 21855 50223 29375 17575 23204 21694
22296 21694 25750 18497 9612 -14849 -136 31414 21101 19330 18675 7242 20886 34651 62645
22283 62645 76732 63280 58909 33299 25686 46922 48933 59190 55525 48308 20640 8423 2604
22270 2604 -2127 7206 4580 11406 11321 1449 -5878 -2137 19489 36930 46095 44995 37975 35738 35694
22255 35694 32685 45471 54096 85769 110363 122775 130514 153614 160067 125902 113178 89639
22243 89639 32732 32780 44512 33313 53443 36372 -429 9603 8647 -9440 -16723 -25796 -45855
22230 -45855 -38168 -5071 22441 25911 53856 71877 64477 59551 67411 70651 47824 25594 8559
22217 8559 21621 27019 22219 31958 36121 63261 59236 41388 16669 23056 46062 54835 17749
22204 17749 13441 22220 23907 6563 15309 18674 10253 -3896 -18437 6631 14994 27820 28257
22191 28257 26196 20688 12087 5869 16265 22588 28006 43439 61461 41772 27094 8164 -19776
22178 -19776 -23355 -26182 -17727 -7755 -19981 -46934 -40064 -44641 -33325 -11679 23755 18775 43247
22165 43247 57655 41617 36250 29622 33494 80384 79505 69650 62314 36114 17330 21328 43536
22152 43536 64842 59512 47783 61790 63730 43683 15778 4768 -135 -32507 -35027 -30712 -25472
22139 -25472 -21468 -39882 -28103 910 10912 5114 18339 42974 51146 36975 38858 43990 29991
22126 29991 29408 45745 24637 -11373 -36615 -32958 -7015 31617 34170 34147 25472 27379 50502
22113 50502 37919 28318 26384 32389 28694 14514 27371 26938 38883 20697 -1437 5212 32536
22100 32536 43887 25925 10010 -4230 -19865 -13245 -65 -8484 -23492 -33937 -8934 -13262
22088 -13262 -54945 -76837 -66215 -44423 -23489 -17009 -14064 -4594 -13154 -4408 25606 24213 27305
22075 27305 41704 44704 48788 54205 83604 76634 75252 94680 80071 51482 43583 33745 13607
22062 13607 7051 6660 30386 33817 19290 22737 28189 18046 18223 15393 34570 46946 32735
22049 32735 -6282 -13778 -11173 -31019 -28798 -29564 -44409 -49451 -36036 -20579 -12817 -4220 -128
22036 -128 -17011 -12806 -9671 -35832 -40790 -32152 -19792 -13041 16565 51254 40156 29088 8360
22023 8360 1834 5973 4696 1721 -4509 23375 17953 -6592 -5380 12684 21235 -2041 -27177
22010 -27177 -19713 -15283 -1344 -815 6456 -2137 11731 12853 7719 -14578 -7645 20934 58050
21997 58050 57661 45735 11625 4076 10722 21552 45465 43172 37132 61871 102797 153475 183258
21984 183258 232677 282412 337119 407827 525358 717700 1071866 1483364 1847073 2088333
21974 2088333 2101260 1835802 1437603 1032935 717823 491000 373689 286059 201117 125775
21964 125775 70976 63866 89326 81653 52478 21236 3193 377 -10877 312 -11580 -24916
21952 -24916 -10786 -25796 -43426 -41889 -21671 -1669 1932 4562 30173 20789 22336 24685 -1209
21939 -1209 -16355 -20575 -12587 -14448 -13391 2108 46543 55928 45679 16197 -19630 -1578 -4112
21926 -4112 -13831 10364 -2629 -33177 -52069 -55117 -46475 -37966 -42826 -44493 -52007 -59515 -48970
21913 -48970 -32498 -32712 -46259 -46947 -38785 -29383 -28813 -15560 9748 17783 2275 8536 9508 8694
21899 8694 29624 17136 -3109 -28923 -34190 -59051 -61178 -22994 -7127 -29690 -42018 -18063
21887 -18063 -21465 -7817 10896 44909 59005 53903 22060 5184 -24345 -15219 -36707 -46764
21875 -46764 -47982 -62818 -59063 -31465 -3050 2396 -2442 9945 20323 -1724 -6052 -17887 -8833
21862 -8833 -13972 -15690 -1455 -1962 9952 9107 15088 -4371 -6910 5843 23217 17221 -1064 -2968
21848 -2968 -7655 -1746 8441 2123 988 -11549 -39814 -12669 -10054 -43047 -46056 -51676 -63312
21835 -63312 -49794 -42520 -56309 -79298 -93619 -83351 -71036 -89337 -95686 -71328 -49408 -24847
21823 -24847 -19740 -23054 -10788 -35698 -40351 -12891 -6988 -17836 -31609 -23637 -37471 -39392 -41011
21810 -41011 -59327 -59419 -63258 -72209 -61940 -57961 -34208 -30144 -12725 -14313 -19305 -16245 -17409 25982
21796 25982 58555 35370 6074 -6054 -2088 -10122 -61118 -60071 -36720 13112 45038 46715
21784 46715 33907 37547 8192 -9743 -48581 -60753 -46372 -12697 -16527 5561 21053 32192
21772 32192 30993 36803 22723 -9303 -22913 -29218 -14528 -25871 -34471 -53664 -50618 -41301 -11358
21759 -11358 21968 14091 3803 -12537 -33846 -36464 -17552 4979 13019 -2397 -15714 -6980
21747 -6980 -4959 -29351 -43605 -57847 -54462 -41473 -50118 -28439 -48826 -59160 -54040 -48519 -55728
21734 -55728 -52564 -46358 -34766 -32758 -45473 -10961 -33443 -33065 -54422 -42587 -19260 -32878 -42333
21721 -42333 -48029 -38022 -40053 -45060 -41909 -32842 -27563 -30425 -23334 -19132 4038 22936 3479
21708 3479 -11032 12966 1931 -29209 -46109 -29115 -30674 -50364 -20671 -7772 5734 7203
21696 7203 2653 -2496 -1988 -17261 -40471 -30303 3350 -18895 -38427 -55008 -45278 -7963 3931
21683 3931 21179 24037 9703 -10929 -22971 -15884 -22127 -33697 -41840 -46457 -48585 -37470 -21856
21670 -21856 -13092 -20754 -14762 -67 30829 23221 8008 11388 -2219 11148 14840 12601 9559
21657 9559 8974 18315 17366 3639 -10750 -37939 -24673 -4727 -2798 15656 31141 46051 26008
21644 26008 27137 45082 65775 58946 30905 18327 6492 -757 -12185 -16981 -1273 5035 -7529
21631 -7529 -17044 -4849 8771 15982 5954 1807 -11153 -27366 -30973 -8770 -16945 -6370 2854
21618 2854 3365 -17254 9692 16169 42719 30858 12800 6710 -8656 -33743 -72378 -68971 -44454
21605 -44454 -45459 -71053 -42981 -24094 -7787 -316 4828 23873 19366 -8569 -31050 -35426 -34672
21592 -34672 -41909 -48061 -90876 -87890 -53997 -7681 11703 1666 -13753 1784 -8905 -2673
21580 -2673 -4774 -20745 -23420 -12851 -18658 -42613 -22807 15542 45075 35865 8871 13331 13390
21567 13390 12733 12626 26479 39915 32633 25596 10638 -7977 -12418 -12068 -33656 -27426 -30828 -37187
21553 -37187 -18498 -15951 -37080 -46193 -40046 -37536 -40324 -9330 11737 -15635 -28016 -21253 -5261
21540 -5261 -13487 -29788 -40712 -21693 -12835 -11281 -7707 -16002 -203 15927 -1505 -13169 -1144
21527 -1144 -5392 -23922 -42657 -22855 -26259 -17677 -13011 -8009 28879 38937 16782 15689 20208
21514 20208 27382 13601 4925 -23442 -34346 5080 4000 -13249 7518 25622 39696 54634
21502 54634 61222 57532 67974 23030 135 -338 -5874 -17979 -15366 -20764 -14093 -30399 -33261
21489 -33261 -35406 -28273 -13807 -16621 -19763 -7758 27605 35593 24625 4336 -8791 -22562 -7446
21476 -7446 857 -664 -9065 -22402 -62862 -48396 -8751 -10330 -19354 -1400 4793 -3632 498
21463 498 9034 3466 -22811 -18074 -4648 9986 20247 6898 -12664 10271 -961 -18775 -10983
21450 -10983 -7922 21581 36134 26245 6869 -32250 -33764 -20583 9828 -12891 -22902 -16433
21438 -16433 4420 -7980 -4823 27899 39362 -3179 -21862 -10771 -16398 -8468 16842 12150
21426 12150 -6223 -18126 -6704 -20264 -23479 -19950 -26420 -27811 -7831 -2025 -41071 -41435 -10301
21413 -10301 -7283 -37476 -36022 -32682 -38061 -2123 6460 16967 19475 15940 176 -23343 -19375
21400 -19375 -19039 -31162 -20351 -31137 -39061 -48111 -36106 17243 30241 53880 57029 54997 58941
21387 58941 58144 56854 39220 16247 2590 -10580 -160 -5763 -4856 -19677 -20803 -20529 -29954 -21354
21373 -21354 -5278 -7918 -3272 5360 3633 6717 12702 11111 15806 5328 -14595 -3675 -9373
21360 -9373 -24279 -30769 -22967 -23933 10489 24601 47053 11513 -17473 -22821 -3335 6289 41497
21347 41497 44193 31788 8000 15916 20054 14769 -5875 -29493 -20013 -17455 -31825 -66021 -47077
21334 -47077 -950 -9742 -44168 -77297 -53470 -19598 15238 13850 20425 19703 -11422 -4084 14490
21321 14490 13047 4979 19663 29129 26110 -7946 -8111 -5357 -6351 -15159 -14375 -13604 -1020 -18498
21307 -18498 -27938 -7175 8606 16328 4575 -24860 -29778 -27167 -30410 -35326 -41445 -39634 -51551
21294 -51551 -57517 -37281 -38604 -14640 -13236 -17234 -18903 -21601 -9973 269 -19685 -35872 -31395
21281 -31395 -18718 -24847 -37134 -13345 15280 22020 11479 15054 23585 35487 -1275 -19133
21269 -19133 -12216 6501 12969 13457 3043 -19133 -17831 415 5892 26420 35560 26281 32652
21256 32652 54446 74177 54941 34277 18757 18686 27181 26302 -8342 -22081 -8025 10703 1579
21243 1579 6987 -2046 -19656 -25557 -18905 -16417 6217 18901 -1426 -8343 -16464 1832 -15754
21230 -15754 -17122 -25183 -22760 -28237 -5493 4750 18027 15505 -21525 -46056 -71006 -81285 -60729
21217 -60729 -31416 1885 29282 56595 40325 17660 5151 -13694 -13457 -35114 -64653 -40590
21205 -40590 -33328 -3905 26289 36310 41070 31602 16519 16139 16893 27652 21156 32415 37989
21192 37989 8726 14011 7989 -10394 -14089 -9950 2278 18396 28501 -8503 -35485 -40782 -15040
21179 -15040 -3005 -12822 -37050 -31123 8848 24567 27233 5185 4415 9503 -533 -2102 -23752
21166 -23752 -11432 -8675 -6373 -16749 -29313 -10328 -4884 -10055 -25993 -48643 -28313 -18924 -26851
21153 -26851 -22959 9131 26213 53478 55001 14013 7513 25101 31229 11428 -14477 -7320 20414
21140 20414 1529 -1261 24319 987 3766 13666 -10697 -8834 12685 10037 12037 5900 18241
21127 18241 9440 6922 4930 28396 43530 47099 44026 22023 5503 -6606 13603 2914 10802
21114 10802 -1596 -1139 -1863 1842 7216 22733 7581 7370 17481 7378 11912 13854 21953 10365
21100 10365 9477 -12949 -47709 -61027 -9184 19580 16054 5104 16692 23231 -18709 -32565
21088 -32565 -35186 -16356 -11305 -7866 33418 41682 46586 40516 11637 4751 -4898 -19188 8938
21075 8938 21250 44831 60228 51491 33886 24524 9423 -7819 -2327 31620 23624 -467 -11306
21062 -11306 -20021 -1587 12663 14064 22993 12459 17180 7764 -11958 -21209 -8460 -4553 -28391
21049 -28391 -54165 -33206 -11718 -25322 -25945 -21922 17226 24586 -421 4282 14125 9082 2573
21036 2573 12854 128 2595 5135 -598 31958 24335 4362 21224 27642 31358 39765 53222
21023 53222 67868 59906 56067 53269 18992 14641 30984 11773 8802 15210 1065 -1944 28828
21010 28828 1613 -39813 -24854 2323 -12722 -24274 -9696 17977 2832 -24269 -30889 -4041
20998 -4041 -9498 -18584 -19586 -23424 9653 21679 34292 38916 21566 14890 19441 29845 28978 30982
20984 30982 28513 29863 35927 45835 55285 58683 48050 15046 6139 7145 2576 19376 54855
20971 54855 76970 60435 42708 65613 46373 7271 -14696 -7485 8237 9221 15025 21915 -3638
20958 -3638 -16760 -10648 -4016 -638 -11211 4247 12816 -4503 -9799 -5517 -6745 28597 39450
20945 39450 35908 35340 37767 33345 10582 23850 49361 37704 31852 56084 56295 47955 57523 55542
20931 55542 47149 24741 33780 14136 -12765 -23549 5460 36653 65783 36599 10424 9130
20919 9130 -305 -11697 5237 240 5199 21423 42391 44725 30458 8114 3459 17033 31928
20906 31928 36268 19361 -4261 -24521 -39379 -51628 -59209 -41283 -38424 -63293 -45556 -50588
20894 -50588 -63514 -50700 -39745 -36319 -55515 -31046 -12584 -9297 1213 -11697 -13159 5059
20882 5059 -410 -8639 -21366 -2221 18725 23401 17247 -8096 -11304 -6138 -16141 -37165 -30374
20869 -30374 -20189 -4384 -22084 -24778 -34107 -41270 -11559 137 2466 -1258 -18872 -1704 6931
20856 6931 2811 5889 20791 15674 -10352 -9898 -16456 -22599 -27196 -32576 743 19667 20721 8471
20842 8471 21117 39624 34868 17305 21946 2617 7302 13828 958 -10061 11234 20415 29423
20829 29423 -391 -9429 -22364 3057 2872 -13635 -17033 -17209 -26646 -22692 11337 28006 23819
20816 23819 19146 20432 34786 60611 49908 35703 29324 17798 20280 31353 16771 3120
20804 3120 14816 25758 14302 13811 3660 -397 27160 19133 5626 7830 1280 15407 32239
20791 32239 17489 -9832 -33880 -22025 -3057 1994 -4754 -3919 -7692 -19800 -19586 -14175 21176
20778 21176 38582 46766 36809 19762 -22777 -43867 -33333 -19273 -6417 7981 29738 42919
20766 42919 40694 13882 -1260 -3570 -9320 -18296 -19973 -12085 -17276 -19642 -13387 -8804 -33122 -32842
20752 -32842 -41510 -60672 -60033 -41821 -38239 -27957 -27537 3839 34449 1118 -9334 -39450 -39003
20739 -39003 -18869 -599 2648 -4910 -10948 6172 6755 -22307 -6056 37601 74490 68292 61120
20726 61120 55044 31369 13709 -1444 -7929 -7131 -11836 -28033 -34845 -22818 -16453 -7 6845
20713 6845 -7836 10224 10178 14865 18479 8074 2467 -224 -6505 9063 21469 1817 -21499
20700 -21499 -31195 -45743 -53291 -24506 25093 41482 20059 2045 -146 8587 445 -1047 -15652
20687 -15652 -6588 18303 6791 6923 9930 12043 4513 -8048 3083 13978 12097 11543 4522 30078
20673 30078 42222 44551 35329 51841 57298 52841 35717 18927 18246 13162 45608 35223 30020
20660 30020 33035 34460 32386 24870 35752 25155 4194 1867 -7635 -4798 -22663 -28383 -9476
20647 -9476 4683 17862 -1863 1613 565 11464 37977 53525 47007 46532 57359 56649 34336
20634 34336 -9080 -28598 -30195 -18680 -24924 -39228 -43167 -31113 -17822 -6200 25951 15407
20622 15407 -8058 -17596 -11111 -15643 3152 -482 -12842 -8809 -437 1579 10209 3420 -6487 -8275
20608 -8275 -14849 11941 21684 26326 20201 16151 19362 12066 21450 16601 9406 7839 -13759 -11531
20594 -11531 22844 14715 22127 28523 25234 15931 19262 11755 25277 29995 47279 80142 90396
20581 90396 91394 74183 70283 57096 34752 2653 733 -7006 20301 23132 -539 -19492 -28110
20568 -28110 -29834 -33120 -31340 5772 10639 2093 18396 6768 -22206 -34469 -15373 5807 14531
20555 14531 -1997 19808 672 -35003 -40371 -37743 -46192 -51774 -20522 -15816 -18820 2169 -4119
20542 -4119 -33715 -37775 -5061 18019 7164 10945 18335 16407 31240 746 -3180 7414 -379
20529 -379 12484 -10035 -36576 -21947 5888 19977 37681 45267 54126 25776 1442 1919 27872
20516 27872 31135 16557 -1269 7781 14116 6366 -11040 13949 10815 -146 3226 37600 29048
20503 29048 -10918 -9029 -5819 -24508 -10144 27685 33613 28576 -697 -1564 -12708 -4451 21476
20490 21476 33493 29512 3719 -8233 8512 15582 20330 10113 3784 10663 -5777 -3806 10682
20477 10682 5734 16954 43992 43807 59735 57349 19774 -8187 -8243 18044 5655 -4323 -4286 -4769
20463 -4769 1473 -3975 -11830 -6413 -3369 -3309 -2216 9251 22700 18861 11241 18219 29486 30337 30153
20448 30153 29158 30252 35927 42617 47993 42043 26804 577 4265 25196 30660 48716 73018
20435 73018 91764 87010 50302 33083 40593 28158 44624 32403 -3115 5705 17137 12787
20423 12787 6526 18632 34973 48093 61340 64062 50114 32065 15105 3459 -18120 2576
20411 2576 2971 21604 39259 35758 23574 8406 38855 46426 39953 26720 15273 30158 5932
20398 5932 -15197 -11671 16343 30581 28860 8946 9874 24101 40099 38776 21222 12765 15044
20385 15044 24554 29454 36207 44351 36782 18295 24801 47154 48550 50419 40573 52671 63307
20372 63307 74197 64661 58998 34178 15377 39209 46996 22222 7200 -4579 13242 6045
20360 6045 -16897 -18793 1039 5203 -8936 -25203 -24627 -6213 9144 18218 29267 33175 39709
20347 39709 13095 -16875 -19966 -7258 29278 24276 33854 28585 27942 27757 225 3120 -9511
20334 -9511 -18823 7449 27908 37229 25683 15674 -1372 -20212 -5434 6885 9042 -19193
20322 -19193 -24704 17135 19199 22435 28592 13899 4775 -11894 -23190 -7976 4793 7779 3860
20309 3860 -8722 -8776 17628 23402 23233 20166 -8244 -44094 -33642 -21559 -5555 12671 27372
20296 27372 8942 7540 21773 18820 26704 29482 41337 19295 -13678 -13170 -5150 -28189 -25310
20283 -25310 -1617 11805 30765 62281 54034 35041 53614 40468 40268 53817 66680 57403
20271 57403 65454 58327 34962 40432 30139 3280 6124 28799 49052 53874 63869 65373 41429
20258 41429 18844 22749 23772 12128 2992 17458 20514 10589 13226 39327 62597 66526 51056
20245 51056 27674 22517 29065 26004 25115 31757 52103 66293 56290 62463 64175 47132 29438
20232 29438 29283 38477 35962 39995 33518 19784 25933 28897 24598 14882 28477 54404 36075 41904
20218 41904 48653 47713 27078 2383 7653 11756 18374 26621 29648 16996 -2703 10172 22644
20205 22644 42553 66052 79497 85800 70884 43682 24539 -11931 -40619 -27807 5707 26242
20193 26242 30396 30959 44190 33686 6767 20431 17276 26407 40918 48190 44852 31529 41207
20180 41207 44027 46789 34798 25126 18663 18768 18091 6675 38247 68898 67203 63701 66065 27937
20166 27937 29981 54305 35248 13646 2519 9394 14835 42879 51069 41918 38639 35463 65031
20153 65031 56425 54208 76372 70778 64360 69195 52948 70802 69882 83595 78740 48788 41266
20140 41266 74379 57699 24529 18138 17754 12099 25731 33458 58536 73088 49431 52481 40121
20127 40121 21506 28719 13337 30137 61154 43824 38855 42350 23265 11333 9155 6544 22702
20114 22702 37413 28230 20577 13370 24397 43908 46183 35367 35155 48357 46852 17500 19633
20101 19633 38975 44482 19922 24312 57566 65869 52367 58162 73661 73114 96747 111622 100229
20088 100229 129409 164479 205204 275758 349842 407266 473345 545197 604985 585252 533863
20077 533863 522951 477924 493945 559053 643794 714958 762215 787921 805855 816518 792051
20066 792051 818827 804033 738452 665733 584421 517635 521078 556865 568425 580175 588076 565126
20054 565126 491574 383268 311070 243793 178033 165130 117216 97707 97435 85258 69511 76589
20042 76589 77305 77669 56504 54759 52095 42629 35876 21452 34409 48283 22756 25390 36695
20029 36695 45598 63733 67598 78459 65327 68783 69305 40873 13461 29708 32562 45037 63573
20016 63573 90181 93716 78627 56847 58027 71419 57214 44532 37124 7865 -1534 22122
20004 22122 49104 29084 12134 33721 71774 100422 64056 34686 31230 40555 38113 57480
19992 57480 72804 50766 18091 37264 54695 70160 72879 78057 81354 64890 40685 46870
19980 46870 56746 75378 66367 38303 40095 48794 60994 68810 72358 79922 59752 63487 62672 61711
19966 61711 44392 49685 57165 69889 80981 119646 102996 71011 77184 71613 59715 65947 62812
19953 62812 57117 56987 52568 74551 73293 58149 53228 68192 75371 83389 90263 88545 78336 61138
19939 61138 47670 36854 67303 82009 62189 62178 70764 92148 102252 78204 53359 68212
19927 68212 89241 46632 19062 10326 25572 61157 65521 66262 56928 64289 89052 109829 107830
19914 107830 85119 86033 95798 97358 97713 97987 96043 117052 121869 123929 124102 129432 137303 103016
19900 103016 98853 106755 123371 131907 183789 222303 269817 288325 334291 411664 516103 672838
19888 672838 818144 872279 906152 977723 990133 917053 786601 619144 497730 444342 416483
19877 416483 379805 392734 462347 563028 704262 833473 890080 900248 927182 954555 893114
19866 893114 725044 582433 468266 396517 340440 289282 250688 247831 250760 261931 287259
19855 287259 300351 338950 363951 362832 339906 334562 388600 442741 450944 449693 411058 380528
19843 380528 372577 398851 446380 483605 469665 448646 399347 370421 390206 439837 490359 474803
19831 474803 443409 420846 388301 354422 305807 344303 372023 385126 377339 359888 358261 359944
19819 359944 350567 355311 358785 407314 413799 415967 392513 380214 381907 394587 417898 430033 442957
19806 442957 491473 552482 592385 607329 599584 558539 515609 513241 553068 572377 567438 536021
19794 536021 474334 432132 449438 483552 528199 554428 561792 505127 427428 414109 441540 493588
19782 493588 528765 511408 488160 437602 381406 337244 294179 257800 238541 194913 168794
19771 168794 173818 163673 137379 146359 163290 169826 167396 175754 168077 194635 234629 219840 231814
19758 231814 243490 251408 262294 250096 243722 247260 224180 218077 197305 166847 189456 208992
19746 208992 228281 224775 224293 248547 270972 286700 285439 271216 264024 245533 262917 283845
19734 283845 246777 225392 212778 219652 201433 188948 225644 240148 257605 253302 259237 268823
19722 268823 260476 241148 234003 246120 248803 273496 303370 323147 339054 311687 315551 315951 297962
19709 297962 315655 335807 345669 355630 364975 347365 333150 320736 339274 381615 391652 391595 435668
19696 435668 492342 527929 509704 474698 449577 428223 406904 376810 344027 366035 398095
19685 398095 430390 463502 467362 415307 395824 396436 406046 442979 462126 462529 450944 437157 435694
19672 435694 455136 451102 443541 476025 444031 420304 405346 399966 390989 377170 352694 355914
19660 355914 359780 350470 310340 297133 302827 315238 321568 334378 354207 352410 353211 357863 347270
19647 347270 336730 336442 364023 395864 408266 385594 394912 392098 381557 399969 435134 481178
19635 481178 495293 476408 470778 498278 524195 519301 480040 494123 503968 496644 532064 539110
19623 539110 536469 555666 586310 614916 656569 708477 756868 776640 826052 851369 856475 840293
19611 840293 875707 908296 942148 1006992 1064799 1130439 1190601 1305844 1420601 1517324 1597477
19600 1597477 1684970 1799692 1913831 2027527 2140332 2278798 2488297 2715024 2964068 3258783
19590 3258783 3596970 4003186 4456446 4955126 5468002 6067331 6666449 7229669 7828330
19581 7828330 8513602 9277727 10242938 11476234 13014502 14915039 17255672 20148043 23909159
19572 23909159 29311173 37753587 50807825 67259559 81551265 90512673 96306443 98290736
19564 98290736 93709145 85166818 78660987 79219942 88245647 100951194 110836793 118685277
19556 118685277 127684866 136159814 140982632 139500525 133465870 127516571 119962996 107465106
19548 107465106 93142187 82928735 81486689 89193802 99264636 104083688 104435473 101536474
19540 101536474 91814004 75399367 57338508 41894808 30624906 23086064 18083267
19533 18083267 14631861 12145726 10273224 8811512 7697748 6883865 6219984 5657613
19525 5657613 5220929 4820596 4407831 3985366 3557960 3170456 2833776 2558471 2361654
19516 2361654 2203452 2056811 1929256 1797362 1703418 1630317 1559877 1501038 1443589 1398467
19506 1398467 1357488 1313756 1290028 1250109 1202756 1198731 1197905 1132987 1080553 1073258 1068520 1071249
19494 1071249 1079049 1089759 1084922 1095317 1103566 1134827 1131927 1126102 1102096 1093925 1100754 1110413 1096033
19481 1096033 1105954 1165195 1227200 1272019 1370536 1532538 1694299 1859505 1971273 1991467 1972462
19470 1972462 1959436 1975055 1969456 1952157 1914401 1922015 1900513 1897404 1856707 1824698 1820338 1781781
19458 1781781 1724276 1626920 1535919 1435291 1349793 1264925 1177064 1078925 1003957 999565 972497
19447 972497 927701 927634 981487 1006262 965487 904475 871812 863826 899125 953652 986226 986281 973085
19434 973085 1001830 1026793 985198 978886 1029616 1079173 1137564 1200984 1275369 1346378 1367484 1360552
19422 1360552 1351015 1339232 1369948 1423592 1471005 1462623 1410993 1314401 1186978 1100367 1075327
19411 1075327 1126077 1203953 1262852 1253116 1175944 1133356 1071352 976574 898090 862225 820804
19400 820804 774542 716283 676271 689466 682381 674451 681419 705781 740955 781405 824240 830504
19388 830504 844913 870329 872533 855414 892052 937947 983619 997402 997575 1038214 1075568 1131457
19376 1131457 1204050 1283637 1340976 1403402 1467067 1509876 1582265 1694336 1806899 1951272 2146594
19365 2146594 2355175 2514104 2666772 2816211 2993196 3234433 3543959 3920604 4263721
19356 4263721 4546066 4820156 5140282 5572379 6139819 6867403 7768834 8801261 9987857
19347 9987857 11426962 13299580 15897887 19710293 25717548 35519453 49279481 61431808
19339 61431808 64502975 59285930 51748736 47074851 48404243 56684388 67785229 72327820
19331 72327820 66995064 57150635 48701477 45351210 48585656 57055095 64245579 63836973
19323 63836973 57340680 49893923 45578205 46709934 53672612 61997357 63509245 56563632
19315 56563632 46069286 36531591 29871581 25933043 24009529 23532115 24113114 25471690
19307 25471690 27485616 30057916 33318251 37779446 44193943 53788858 69197791 94341265
19299 94341265 129017856 158290525 169902476 174825215 183061897 185028334 170261416
19292 170261416 148483385 132122016 127493650 128678314 125848373 118960899 114720666 120613073
19284 120613073 143334260 184121875 224237239 238725942 233605867 226240743 215594064
19277 215594064 192695389 166025081 145032286 128657299 110862551 92032052 76072312
19270 76072312 66192358 64194988 69697897 76665728 75589828 65026053 50702377 37652607
19262 37652607 27943088 21342146 16976054 14101948 12217206 10900451 9949877 9210540
19254 9210540 8506759 7828400 7308416 6898674 6404975 5820291 5225661 4667777 4193553
19245 4193553 3834264 3549453 3417407 3340715 3261247 3198738 3112303 2985350 2881532 2768275
19235 2768275 2640919 2509662 2358575 2179088 2014582 1881190 1781982 1681425 1572140 1512511
19225 1512511 1486866 1464466 1456672 1431146 1404709 1374163 1376208 1353007 1336930 1287799 1267045 1263051
19213 1263051 1269914 1298258 1321625 1277844 1222415 1165629 1094888 1070978 1051326 1047336 1055743 1064924
19201 1064924 1095134 1099919 1146390 1263957 1400558 1553965 1670838 1734506 1772624 1836145 1827338
19190 1827338 1758825 1651775 1589774 1513347 1359846 1231749 1133873 1058143 1067196 1118554 1196975
19179 1196975 1201451 1180482 1195532 1225505 1194492 1133802 1030379 946846 892829 880683 894693
19168 894693 877432 862931 892565 935037 942316 942321 966716 1028110 1063477 1053727 1021528 998307 965436
19155 965436 937167 954488 988472 984729 977062 978370 976405 966909 938433 966193 977605 968972 943847
19142 943847 864488 836466 824635 810932 805690 791601 741380 669112 580113 516156 458471 441657
19130 441657 431677 425031 408444 343575 275358 236647 232027 230396 245334 298835 322480 352096
19118 352096 417268 451123 422220 409675 419638 415005 395216 411457 420340 420513 440963 457855
19106 457855 486796 503319 496537 476630 474169 489096 514722 506579 486510 483893 457521 401278
19094 401278 379904 384500 403004 397139 395065 411914 419276 430931 416785 405638 426480 464836
19082 464836 499844 530561 555679 577293 579364 588481 566147 546493 526229 550696 578373 600914
19070 600914 613742 612477 600506 587165 571825 596922 621088 627616 631437 638059 633860 639958 632431
19057 632431 584416 580248 611916 673042 742345 784083 842613 908044 987179 1054234 1117843 1204742
19045 1204742 1255773 1241868 1239262 1265437 1323899 1390990 1438065 1457978 1501225 1566096 1613486
19034 1613486 1620025 1617332 1615774 1582116 1519068 1427745 1307363 1250572 1239544 1297011 1340445 1332111
19022 1332111 1330275 1313953 1252879 1172696 1125366 1067559 1012723 1012038 1007045 1006947 1017642 1036100 1030333
19009 1030333 1058018 1122178 1162403 1161075 1177682 1246712 1313239 1354052 1375434 1377224 1370685 1388595
18997 1388595 1398417 1448037 1531332 1565699 1618103 1711619 1792750 1862030 1958398 2129623 2331957
18986 2331957 2504109 2647748 2835276 3064186 3352937 3639284 3948050 4291429 4665631
18977 4665631 5042018 5382629 5712217 6107351 6648322 7338726 8183667 9187367 10340661
18968 10340661 11836016 13853138 16774131 21395439 29196515 41089426 52999263 57425403
18960 57425403 54044855 48172910 44573904 46429725 55552956 70372071 83709339 90117692
18952 90117692 87244005 75743854 61696877 50210766 44030960 44461032 50768394 56867981
18944 56867981 55064664 46159851 35446231 26503073 20343511 16427917 13944334 12281872
18936 12281872 11180132 10455982 10068938 9933316 9972887 10265354 10730781 11237613 11731371
18927 11731371 12204000 12736824 13455541 14430583 15668095 17147614 18987945 21406836 24669411
18918 24669411 29222308 36213862 47826950 65656437 84442368 92564407 88088688 78928308
18910 78928308 72646522 74017441 85510164 105726021 126180335 138901457 138552215 123936156
18902 123936156 103704330 86531288 77140663 77370756 86348732 96628751 97626509 89276102
18894 89276102 78729138 71541900 70057792 74551612 84899440 100515920 118686071
18887 118686071 134682524 145429189 151466015 153740660 151004021 142556517 131094613
18880 131094613 121322334 117246706 120635037 129835536 139881263 146054296 147575750 145338320
18872 145338320 138287577 124793532 106112572 85952551 67712998 52927897 41751393
18865 41751393 33541572 27518624 23092695 19745198 17150284 15081660 13422679 12064958
18857 12064958 10908233 9927441 9119533 8434564 7880578 7417914 7028946 6673841 6353377
18848 6353377 6050181 5744801 5460496 5209670 5010131 4822431 4631183 4477658 4318730
18839 4318730 4140541 3960620 3788666 3615686 3458684 3299644 3214764 3138467 3054401 2956728
18829 2956728 2897651 2871404 2809010 2746038 2666032 2603310 2528746 2422504 2353963 2332022 2317300
18818 2317300 2293291 2292628 2291921 2238788 2178369 2141771 2102271 2063908 2018968 1947419 1876755 1775783
18806 1775783 1714195 1681429 1672277 1713110 1729031 1720668 1676666 1584745 1460137 1336665 1246248
18795 1246248 1226749 1167708 1136917 1104436 1060046 1049193 1059181 1066585 1108301 1130630 1119454 1104395
18783 1104395 1113820 1165547 1206886 1215868 1239036 1284177 1351091 1447763 1550159 1625914 1664218
18772 1664218 1628100 1568445 1515195 1486180 1553879 1681245 1815718 1954061 2000870 1975794 1957469
18761 1957469 1987622 2057658 2122959 2144520 2189620 2282591 2441866 2652552 2924729 3172035
18751 3172035 3397925 3561664 3678400 3746850 3840669 3929053 4030474 4136733 4280207 4476882
18741 4476882 4759748 5145318 5646097 6243286 6977952 7902572 9084378 10623515 12612980
18732 12612980 15203242 18672659 23639930 31259586 43292635 59751323 76294148 91301277
18724 91301277 104381966 109072421 104300097 94345540 79245565 61214781 44645180
18717 44645180 31783682 22919094 17142822 13402889 10943319 9273669 8091760 7245706
18709 7245706 6665034 6233309 5949489 5775832 5732905 5827256 6060368 6418551 6760908 7089205
18699 7089205 7357894 7614157 7807699 7872651 7883709 7889646 7927208 8068015 8381202 8873726
18689 8873726 9586372 10562940 11846289 13531120 15749095 18518427 22044460 26882853
18681 26882853 33940159 44551319 59523870 77044686 97097935 119732037 137010183
18674 137010183 146512556 150735240 144241949 127818056 108030289 86297545 65058884
18667 65058884 47327871 34127856 25070913 19031028 14972074 12172122 10142173 8623245
18659 8623245 7480614 6656518 6079347 5637068 5317774 5128268 5025299 5013235 5065018 5100847
18649 5100847 5119489 5119748 5117892 5094602 5046087 5002981 4928314 4853668 4820889 4885061 5039630 5322891
18637 5322891 5749465 6332401 7132604 8225807 9679029 11672863 14506105 18838663 25734355
18628 25734355 35389827 45270206 54172324 62143860 65162548 62239428 56162733 47044793
18620 47044793 36203921 26271523 18583118 13322034 9823482 7503374 5940288 4856520
18612 4856520 4101403 3512861 3033877 2643154 2357751 2122993 1942322 1816566 1764029 1741863
18602 1741863 1737905 1750000 1737666 1727879 1684224 1632417 1606850 1541116 1424388 1300848 1179808
18591 1179808 1108351 1058226 984662 953158 910299 879633 882021 871208 849756 853006 881741 909474
18579 909474 940551 925539 887424 855986 862414 889044 860785 760505 688483 639297 616603
18568 616603 614677 613325 595817 592850 593097 603904 613702 647718 699012 720538 714341 662281 595773
18555 595773 574393 590855 589219 556775 535357 502840 487596 513233 559534 651437 769164
18544 769164 896655 945168 879695 776909 713439 726070 796166 910477 906153 777626 625429
18533 625429 509828 449126 410644 369041 286592 236536 202141 204586 173390 148186 127263
18522 127263 83878 56336 52991 32818 26150 64208 72187 39961 28566 23880 50455 110681
18510 110681 135485 142616 142457 155473 174342 206647 200280 187295 177164 148046 140879 169640
18498 169640 178155 164856 155385 148757 149154 151746 142467 168956 203184 176157 144196 146741 126717
18485 126717 99799 80310 41156 37052 19014 13152 13331 34300 34319 28768 27975 21345 19080 24127
18471 24127 29253 41538 36114 24146 24059 26367 61732 67825 44793 16178 34215 88379 117269
18458 117269 103032 79063 75403 92078 106101 120810 147428 123083 122307 118815 145488 168249
18446 168249 179042 179946 181818 182754 190863 233646 307091 414316 505036 536872 552039 538723
18434 538723 521880 519658 543647 610687 698104 741992 721721 677617 574496 518847 487323
18423 487323 462956 480585 520643 522371 468516 401748 322224 274017 213570 210101 186429 154237
18411 154237 170226 173337 167014 151207 145361 159633 155230 142957 115268 136785 154517 159266
18399 159266 191089 191585 157652 159164 172597 175715 198417 261216 345040 443839 527971 567171
18387 567171 522273 492718 474468 474712 522000 599071 640129 630059 623624 571227 466715 428460
18375 428460 430283 448580 425835 392073 353006 311014 263004 224957 211037 218891 192058 191469
18363 191469 199171 194346 200266 207438 188831 183584 178386 160843 164347 146545 148797 152673 139669
18350 139669 128973 145018 127484 143262 176835 165756 219019 289813 349085 394547 407415
18339 407415 415014 416884 396283 346567 301315 269615 236221 198339 187039 175931 163656 155096
18327 155096 131669 133541 133759 142248 138584 120158 108071 101855 122876 148765 120956 110484 114490
18314 114490 118944 134755 143045 136370 155745 170560 180784 196325 209241 210487 221199 240709
18302 240709 245274 226499 232458 289670 325495 379727 432808 500786 628245 773782 880606
18291 880606 978401 1033060 1029351 1013255 955780 905142 836890 810404 806344 814938 861643 879732
18279 879732 883146 864328 822533 741012 632862 531660 434839 354579 273811 208021 189302
18268 189302 165258 167186 175609 161351 172440 192454 199788 195721 184184 169746 148128 133449
18256 133449 160118 158540 132923 133379 130297 103175 75919 61253 56894 51107 77168 78283 75874
18243 75874 69853 66783 76939 87632 96602 103772 123381 141675 152713 148693 142757 118212 132546
18230 132546 119696 58058 35893 44692 46594 74044 89865 90266 78950 94916 119426 111386
18218 111386 93473 88195 115310 140435 150234 167429 198158 202658 223299 260229 328317 393950
18206 393950 454686 524774 563415 567730 504853 420807 361453 282021 209555 167878 133829 111120
18194 111120 100744 95101 80433 54323 60244 53266 47106 45727 32700 60337 69162 66585 64965
18181 64965 39217 38800 63727 100042 110088 108509 94236 63968 91982 108408 115408 133352
18169 133352 155270 148251 158539 175863 172044 176916 186937 225858 285510 399773 518589 644761
18157 644761 767920 887802 967818 956758 912505 888360 807409 682274 576031 483192 406216
18146 406216 372773 370742 338450 322792 347310 379954 402636 407414 460410 504088 503341 520487
18134 520487 580867 627954 665603 731188 835342 905908 944545 1007738 1068614 1154374 1263442
18123 1263442 1381953 1531097 1678396 1822710 2021791 2277430 2665606 3194596 3796661
18114 3796661 4523765 5499692 6914991 9073657 12843044 20013058 32820433 46541075
18106 46541075 48328355 39825365 28385179 18621165 12134726 8147392 5721122 4225650
18098 4225650 3224880 2482056 1979076 1615028 1340803 1132287 982577 853007 768627
18089 768627 705233 648611 562971 511154 468527 430283 435139 427218 395086 349712 346185 332892
18077 332892 346050 319789 299218 277226 256010 264189 216600 187947 192765 169032 147621 160153
18065 160153 176529 150934 106576 119190 102700 87055 65580 84065 88250 79006 80349 73983
18053 73983 52000 53341 52860 42921 57281 62503 49080 59853 76378 57528 68538 56000 38623
18040 38623 19503 4596 27218 60645 65457 53345 64275 59657 55122 55609 71390 57175 61214
18027 61214 69590 77148 113004 103661 80575 64914 48390 29631 29774 36200 47574 24240 6849
18014 6849 2407 -2273 14282 30477 38302 31735 55868 60218 35721 -4234 -23538 6162 3909
18001 3909 -4534 -16846 -43984 -42560 -8992 9526 -14775 -19464 -13387 6389 1507 -2969 -3154
17988 -3154 13956 54475 41698 13742 8898 34004 52350 50685 29280 40752 60155 46350
17976 46350 21281 11921 -3999 21174 -5004 -27926 -34691 -15624 20606 3421 -4905 -17148
17964 -17148 -22469 -25344 -30884 -12707 -7619 15351 14610 -10669 -14992 -45115 -43742 -57695 -59685
17951 -59685 -86028 -94579 -55791 -48356 -41333 -22741 -12708 -7731 -20122 -42256 -36112 -2381 26599
17938 26599 27949 16934 15230 10181 -542 -18471 -19390 -26985 -36452 -57210 -53877 -25998 -22522
17925 -22522 -14508 -12581 -809 23169 9577 -9122 -22896 -23861 -18787 -18566 -16673 -35639 -46023
17912 -46023 -22623 -12671 18180 8036 -11766 22802 20862 8131 -16317 -36456 -18226 14506
17900 14506 17583 -3555 103 -28126 -20673 3012 28386 32882 6832 -14957 13608 48474
17888 48474 39718 23204 22689 13509 24428 45643 33739 35105 14842 -4023 -1907 18386 23906
17875 23906 2775 -5080 -385 2905 -9454 8898 25357 18730 7634 17336 32474 14138 12214
17862 12214 12924 -8924 5808 16289 -401 -9585 -7596 14568 17090 8372 -7622 -5736 -14815
17849 -14815 -4572 -13498 -42688 -37418 -15587 -2401 -5816 -37005 -54523 -46266 -26738 -18709 13924
17836 13924 18593 28093 32198 48944 62279 32704 31485 43625 32961 24516 411 -17763 -25421
17823 -25421 -6983 950 9140 15981 33721 14976 -11485 -20284 -37476 -39215 -15681 10995 19661
17810 19661 22225 5281 -432 -3909 4198 7583 -12983 3666 -4563 5377 -5638 -10331 -14149
17797 -14149 -24664 -9724 25844 20510 7011 1414 -16552 -24420 -31973 -37628 -37475 -33636 -42027
17784 -42027 -18056 5011 -6372 4649 -42159 -18993 6146 1801 5080 23550 6972 -910
17772 -910 -1576 -10282 -9450 -8759 -8103 7500 8858 5138 6238 -425 -19727 -24631 -2894 -5011 -16557
17757 -16557 -29569 -27493 -2342 12441 -4756 -17767 -55228 -60317 -28824 -9263 -18606 -26898
17745 -26898 13198 9021 -9739 -21540 -8162 -16136 -30554 -28084 -5300 11000 11161 -4188 -28651
17732 -28651 -42773 -16385 791 5573 8372 25902 37497 44189 24944 -8794 -18556 -2615
17720 -2615 28183 23245 20812 22940 1756 -17532 -22955 -17045 4406 -39024 -43310 -13442 9250
17707 9250 -6076 -29100 -32005 -27282 -4309 -4756 13569 34250 28315 26311 12229 19452 23957
17694 23957 -3474 -26019 -25553 -8685 -10504 -11753 -24297 -28936 -27473 -5609 2131 -20133 -24681
17681 -24681 -22313 -18085 9431 6683 -11283 -14745 -2356 -2269 24681 12936 5232 16999 29952
17668 29952 48600 28075 -7986 -13771 -3309 -12794 -8555 -38805 -40268 -40357 -38536 -21740 12059
17655 12059 22391 19962 -10182 6266 50715 62622 46101 33138 36553 22887 50621 56101
17643 56101 52610 23852 14322 31770 37367 16766 -3120 -31329 -18342 21656 31699 31685 44639
17630 44639 59850 51459 22714 5138 -14223 -16117 3327 8445 -13704 -29096 -15099 3214
17618 3214 -77 17511 26614 5361 -10854 -18278 -56 29468 43643 28339 11471 26838
17606 26838 35246 17636 -7331 -2331 26940 30600 22714 14987 14379 13777 25673 9508 -6004
17593 -6004 -2955 24532 12352 -6725 10391 21493 35118 27473 21816 5144 -22750 -34202
17581 -34202 -24702 -6063 -2303 -1883 11770 17514 17489 17822 25380 62610 58781 69573 59277 11251
17567 11251 606 -2589 14598 24358 31998 33829 32599 28277 20548 -2137 -4070 24283 41691
17554 41691 34325 42892 22513 -2618 -4426 15917 778 -7580 4799 22473 -16 -2782 19658
17541 19658 9588 -6882 -27235 -23621 -13782 -21663 -28867 -22861 -18138 -32088 -16753 -20571 -20817
17528 -20817 -11985 -25071 1380 -34542 -18213 23558 54267 65932 74451 50380 29144 41571
17516 41571 33260 1268 -14488 -9493 -8780 -14218 -9897 14866 37645 69515 56702 43119 46816
17503 46816 60242 62396 63654 67680 72636 85443 110999 135728 146436 149973 153141 172729 174529
17490 174529 172224 208057 246614 345181 464260 572709 646279 636678 551488 476258 423080
17479 423080 385719 379910 401653 466924 580495 690217 746758 746612 745057 791173 802554 776044
17467 776044 720335 581806 474330 401735 348426 326065 301241 339022 441508 575651 639814
17456 639814 603205 512964 404462 319312 247250 196977 160873 131257 110364 132301 139183
17445 139183 136995 97738 97862 150467 232878 295793 287904 264377 207728 156856 104992 69353
17433 69353 48793 28294 5985 15759 32807 12452 -9462 -16653 -20620 -10096 22094 37808
17421 37808 29513 17986 23058 33798 32123 21232 9623 29852 31166 29598 38200 14745 -8017
17408 -8017 -16681 -14528 14489 52366 65384 30872 36825 46736 55220 44963 34517 24119 8167
17395 8167 17464 4567 2402 -21474 -41847 -21162 -5086 -18909 -8313 -8743 10017 29371 -1922
17382 -1922 -4107 -2241 -1705 -3676 14590 8601 -7436 -16401 -35137 -35022 -28958 -9196 -14586 -4014
17368 -4014 22558 32460 57312 68014 27175 -11697 -30765 -61969 -64047 -32359 -17834 7458
17356 7458 9131 -5745 -15235 956 12300 -7864 6880 18669 43524 51467 46506 34079 5380
17343 5380 -7820 -16618 3813 18597 12261 10725 29764 23633 -1488 -6427 342 -9557 12609
17330 12609 46517 38522 24509 16422 23947 5692 13648 9849 6517 -13317 -9498 3411 -6271
17317 -6271 3736 11501 20263 11052 15797 -1854 -17720 2623 8326 -16453 -15154 3958 30628
17304 30628 30197 1346 955 -5293 -8916 8523 11454 29636 40358 31430 8363 10657 17377 7227
17290 7227 14865 37815 33931 36756 35138 42821 31739 29485 21683 34508 61417 69179 47237
17277 47237 40772 60126 67021 69257 45844 34609 55380 45031 38664 42286 53477 32952 25081
17264 25081 -243 6435 1676 -26599 -33894 -12511 -9739 10512 9127 4287 14716 6228 -15202
17251 -15202 -11415 -4376 462 -7625 -9359 -4488 2283 -4556 -18903 -19559 -23596 2512 20446 5586
17237 5586 -42930 -36810 13874 24685 12506 21264 30589 13961 3669 -13820 4450 17230
17225 17230 10011 -18075 -9806 24697 28606 611 11897 8143 -13677 -3808 -13286 -23868 -6529
17212 -6529 -15635 -18954 -1411 -19841 -37370 -40484 -5796 16902 -24584 -12737 10016 15392 974
17199 974 -14687 -20817 -14082 5472 -3392 4976 40782 66875 62832 58535 52698 74786 100082
17186 100082 94165 62686 57070 52558 62648 70727 66174 59403 78171 103534 140235 129247 114628
17173 114628 120493 117798 116048 148874 143023 130647 137007 152553 151651 169154 171386 159189 152123
17160 152123 165094 188370 196207 166866 161303 152332 115400 75510 58695 74103 105996 122728
17148 122728 119064 123340 118966 111609 106898 86023 87454 107041 97199 121013 125656 124624 139939
17135 139939 121439 127581 153838 145783 140649 138639 126398 141281 177441 174650 150141 134874
17123 134874 129923 144800 155198 154283 176283 218738 235482 230361 217458 220813 193868 165119
17111 165119 163187 150919 145660 160291 208477 233055 239909 216641 185808 170245 169375 178188 165449
17098 165449 173570 177269 137216 126219 130699 137042 156394 154971 154750 152130 154062 182289 183929
17085 183929 163547 183641 211305 209659 219465 235096 245730 228446 210192 199583 198510 176479
17073 176479 171654 173010 212251 255158 281528 277747 284646 274989 271056 271291 253005 258883 256274
17060 256274 230169 209127 210894 210859 229239 241665 298510 365284 435992 479633 448339 400994
17048 400994 343386 327906 283087 254059 267084 299679 335890 336962 346061 354648 379452 403156
17036 403156 416423 433567 392079 360899 350565 346051 327288 293566 304622 309641 321845 359713
17024 359713 377963 371019 339244 345035 356075 319135 305444 323657 333736 321599 280035 301565
17012 301565 316794 307567 314713 320125 303472 299427 306528 300877 298972 317758 323745 348800 381556
16999 381556 400179 395480 399234 398945 408732 414827 412189 368302 368580 431212 472012 505318 530602
16986 530602 545108 572028 580314 587617 604510 622681 614839 621066 627187 637488 679217 719690
16974 719690 756120 818316 851820 855932 867473 928058 982242 1022530 1064638 1106105 1164200 1226368
16962 1226368 1287725 1355730 1480516 1597916 1717926 1848106 2004274 2202790 2422584 2652004
16952 2652004 2896438 3133071 3334316 3475697 3621999 3881799 4224827 4640378 5121190
16943 5121190 5685437 6323301 7025884 7694607 8292236 8919831 9670268 10645995 11842496
16934 11842496 13340499 15172795 17450133 20367317 24238039 29575432 37381881 49581904
16926 49581904 68784988 94307098 115156168 118084859 104909755 86042573 69748094
16919 69748094 59464433 55326291 56872747 64566540 80029339 103911960 128909727
16912 128909727 141483134 140225412 136771638 140064102 144876473 138049422 118600410 94965764
16904 94965764 74450080 60299882 52570645 50537479 54329821 65352165 84420539
16897 84420539 104719394 111623530 100461242 79790416 58767514 42215459 30672202
16890 30672202 23010724 17917643 14376760 11777777 9811429 8345534 7252452 6445189
16882 6445189 5851758 5375373 5015057 4749210 4595207 4415671 4092115 3694530 3288454
16873 3288454 2940976 2675167 2458933 2297374 2197763 2147090 2107886 2078882 1968758 1837603
16863 1837603 1705000 1571204 1476393 1393123 1325493 1243618 1167762 1107648 1041607 971336 939836
16852 939836 913448 857392 812394 775645 759251 763259 744632 731733 740250 725626 724483 747103
16840 747103 768762 769206 742855 711225 672249 642444 613319 580622 576238 571203 565974 610071
16828 610071 646928 681327 688215 672740 651019 640469 604880 560358 503107 434657 408241 422588
16816 422588 416237 412853 416606 422238 435850 453878 452529 411066 396772 380536 337396 333944 327189
16803 327189 302123 294470 276320 308529 316485 276669 256436 247874 242077 231176 205591 217505
16791 217505 233173 225428 228030 255570 275161 250563 242370 246824 208059 205357 213058 211579 201789
16778 201789 191034 199099 176661 143245 121663 115113 133623 145410 100612 57552 13170 22612
16766 22612 36919 28303 48669 70958 63170 43793 46334 35691 -16897 -63506 -43899 -23489
16754 -23489 -66399 -91224 -116109 -121043 -108018 -66371 -16232 11390 25530 33124 38852 8042
16742 8042 -6512 -36626 -85568 -94994 -85472 -68220 -48728 -45311 -67997 -86181 -93583 -98992 -83684
16729 -83684 -44828 -26987 -24404 -27580 -52193 -64789 -73029 -95828 -128671 -124486 -130155 -132187 -139662
16716 -139662 -137179 -104480 -75961 -56047 -58511 -64178 -98674 -82257 -56893 -50007 -36127 -54552
16704 -54552 -86950 -69591 -42214 -41407 -71886 -73619 -62332 -24984 -15263 -16385 -9538 -2180 10000
16691 10000 -11447 -21958 -12779 -5466 -8404 -10298 5526 -4170 -9891 -6878 2494 9875 9704 7584
16677 7584 5174 34921 22517 -8120 -24588 -5706 -25953 -21758 9674 48739 49904 26826
16665 26826 23193 9168 18574 22862 40567 47956 23982 -25621 -51692 -47296 -18945 -7364 9056
16652 9056 15464 617 -4425 31916 25356 -694 7843 45325 31648 31784 32969 254 -10216
16639 -10216 -3010 -10847 6507 36440 43403 42744 54927 60856 60987 54665 36448 11241 35487
16626 35487 47848 62288 77482 81532 100102 107145 84222 45326 29957 25677 30301 35241 35115
16613 35115 20559 13882 28113 51349 67614 55133 46911 36300 55918 51810 57145 52896 22945
16600 22945 233 -8383 14310 16025 8475 11735 25802 30759 23065 4881 -1897 6752 4755
16587 4755 4767 6402 -4021 7376 22630 29725 27165 7640 379 28713 47517 43153 34933 22681
16573 22681 30897 48508 47219 32654 42567 21968 5596 5219 7876 21746 57122 59534 47421
16560 47421 63960 94486 94700 36837 -430 18016 27355 12411 -9647 -18108 -7726 -2813 5242
16547 5242 14366 18961 35650 49638 41253 17147 -10895 -14615 -5284 -9192 42403 57144 40184
16534 40184 9540 -17463 -18665 -4727 19124 20380 24186 32017 16785 24320 -13959 -61684 -62657
16521 -62657 -41549 -12365 9133 10139 -3837 -17236 -12770 9366 7876 -1139 12814 16651 14451
16508 14451 15823 18046 23219 28374 21473 25629 14306 1138 11641 8105 -3565 502 -8523
16495 -8523 -18453 -20870 -41585 -26232 -17650 2370 5664 -17059 -22351 -6970 7200 13351 16138
16482 16138 11491 4008 14857 13148 2549 20182 25364 4279 -182 21348 -10002 -8326 21314
16469 21314 49986 41499 13013 3000 30089 29974 25970 -14174 -25422 25694 35898 20063
16457 20063 10544 13658 32501 31794 38308 43703 37931 24266 31450 39092 37183 20656 24441 29752
16443 29752 38226 23112 21260 4490 -12690 2881 15015 23411 22741 44180 35427 25392 19762
16430 19762 47295 17904 -6777 -25567 -41628 -3754 27551 35636 55428 39754 30400 36630
16418 36630 33207 33036 51313 60102 46683 36423 29324 19743 14615 3799 3811 7405 4373 -2416
16404 -2416 -25271 -21619 16002 5865 -15386 -3494 1746 -10203 -12508 -30659 -16521 -16364 -40480
16391 -40480 -32874 1098 163 -14955 2263 38884 24122 15446 23622 9846 11894 8001 -5841
16378 -5841 -12581 -17929 -24883 -41944 -45268 957 28234 53288 57980 54997 71777 112726 116302
16365 116302 74914 68499 117402 137360 166375 235286 340985 475581 565304 606563 577751
16354 577751 482789 384511 310463 275202 295116 342814 404950 497922 615727 690117 712105
16343 712105 708874 711338 747092 749349 690042 581752 448192 334663 273742 245489 247040 306923
16331 306923 409646 496426 550336 516981 445985 343007 252670 176264 115713 99392 89584
16320 89584 95947 81399 55509 42948 1585 -3840 -30599 -28836 4160 2222 11519 9478 9759
16307 9759 21669 25385 30110 17421 32214 35354 54184 52720 39493 23990 25508 16278 -7883
16294 -7883 4170 2868 -25140 -26122 -393 -16434 -27247 -11652 6861 10595 -7343 -30849 -74977
16281 -74977 -87469 -54428 -22716 -16817 -18460 -6285 17915 17693 -15681 -25149 -11913 9252 -1131
16268 -1131 -33219 -32985 -20506 -3674 585 3317 -4711 7905 29026 43397 27000 2900 -16894
16255 -16894 -34272 -20214 -27871 -41525 -46166 -38694 -31426 -36364 -43803 -40859 -28020 -23463 -17250
16242 -17250 -291 -17999 -24321 -17823 -18731 99 -23322 -44113 -38921 -11877 5436 -4957 15172
16229 15172 25606 -2277 -12880 -163 -16701 -16720 11030 23345 7401 2248 -15555 2351
16217 2351 17152 51620 59347 61838 54220 37975 16351 -1978 22812 40046 7814 -30611
16205 -30611 -55580 -27502 -18435 -17229 -27763 -24818 -10521 1386 -156 13794 30904 25767 11104
16192 11104 -8601 -9615 -34386 -39261 -18743 -13486 -28557 -17940 2817 -16186 -5659 1154
16180 1154 12768 21114 -10542 -31159 -6484 -682 -10034 -9670 -38264 -30212 -17388 -3680 -10610
16167 -10610 -5213 -10225 960 -11086 -30705 -31323 -15595 -2029 -5297 -4207 -29933 -17283 -19811
16154 -19811 -6575 19851 16857 5373 -13511 -31706 -13428 12989 19678 3219 -11461 -38649
16142 -38649 -54322 -47227 -27068 -15972 -16426 -7767 1461 -8391 -26556 -31892 -13565 -15991 -16940 -8175
16128 -8175 -11794 -8432 9463 47177 39652 15338 67 -2969 -7994 -10124 16421 31013 27357
16115 27357 22913 3390 3469 13843 18182 13668 15607 18074 21500 10937 16457 -3405 -12429 -9014
16101 -9014 -18357 -33101 -23989 -14519 -14971 -36924 -47638 -43019 -38659 -13689 -2703 -1943 -6236 -24008
16087 -24008 -27913 7464 14157 -13401 -15851 22471 26877 11090 -2182 2682 18976 -10828 -48022
16074 -48022 -33181 1951 5938 -35952 -34217 -34004 -38293 -36960 -27799 -16997 -4616 -16119 -19486
16061 -19486 -12004 -37395 -59678 -53116 -23534 -23042 -20827 -50 7203 12169 19147 21258 -10603
16048 -10603 -36457 -31871 -19687 -11965 12253 -1113 8950 35482 29245 26036 26514 -2874 -11853
16035 -11853 -318 -13174 -22600 5940 2296 -19884 -36504 -60722 -43862 -17996 13648 47247
16023 47247 66111 45146 26635 34653 6517 -11796 -9180 -11953 2431 21347 31601 33988
16011 33988 1606 -15258 -23102 -21712 -29433 -36189 -15535 10189 -11313 -46466 -29743 -19451
15999 -19451 -21045 -14055 -8457 6464 85 -19829 -21898 8994 18431 11696 17027 -4464 -21992
15986 -21992 -13902 7952 -128 -16878 -23154 -27523 -21786 -32683 -17025 759 15970 13259 28769
15973 28769 30228 8922 -11283 -9695 -10125 -5039 10529 17181 7471 15875 20247 32318 20651
15960 20651 10862 23879 37527 15131 -12594 -4617 -9801 -949 -14698 -13859 -12130 -26924 -29337
15947 -29337 -10063 7038 -6147 -17683 -8886 1489 2507 -2987 -16903 -6438 17534 34443
15935 34443 39975 8267 -37752 -38765 -33107 -25212 2182 -25444 -24372 11550 254 -9310 -18897
15922 -18897 -28512 -28170 -44977 -22029 6744 7637 -11020 -20878 1484 32328 14458 -184 -5068
15909 -5068 -17392 -44671 -15957 -14837 -28684 -19898 -18274 -3066 -14295 -28512 -21360 2943 -1673
15896 -1673 19484 39015 31357 -8358 -9512 11006 25838 3967 -2764 3130 -12708 -25486 -28764
15883 -28764 -29041 -16127 -663 11850 10260 -8583 -15086 -13797 -32168 -40415 -34691 -34936 -25723 -28032
15869 -28032 -35084 -47807 -42413 -44629 -30265 -22899 -53515 -85905 -90070 -71599 -75212 -78694 -65393
15856 -65393 -42838 -31843 -40116 -30742 -13435 -28142 -39686 -51390 -36141 -36561 -34560 -40001 -55067
15843 -55067 -30366 -15763 -2876 9737 -13829 -28372 -12435 -12581 -64100 -64561 -40437 -21278
15831 -21278 -2416 32206 22147 295 -11730 -22819 -7647 -11290 -11685 10574 15137 -12469
15819 -12469 -29433 -22135 -17761 -34520 -35418 -17076 -17356 -19188 -12371 -1474 -2563 -17160 -20777 2074
15805 2074 39282 4955 -12966 -3934 -9869 -6385 238 17214 2585 15612 17126 -36407 -37387
15792 -37387 -18919 -32738 -55487 -32243 -14500 -37047 -32622 -51303 -52571 -34646 -4944 1361
15780 1361 -16441 -10442 -6169 1858 4274 -8131 -8264 -11852 -11687 -6716 -15648 -11724 -15168 -23644 -35685
15765 -35685 -37472 -41374 -31854 -33322 -19038 -14073 -32837 -45262 -70475 -58779 -29804 -22260 -24389
15752 -24389 -15261 3647 15481 25149 24468 3545 21225 10911 -11162 -29109 -23182 -27241 -24317
15739 -24317 9124 -4437 -19116 5056 30166 16259 -2535 1647 2197 9548 7865 14450 16852
15726 16852 -873 -23665 -14816 -12503 -4033 -5354 -32534 -6840 -13837 -19740 -9201 16426 -1966
15713 -1966 -36734 -40030 -37793 -22654 -24087 -11368 20117 26262 10526 4689 -10339 -27076 -34748
15700 -34748 -25990 -38200 -30812 -24935 -25875 -26899 -21355 5 14760 12400 -7490 -7609 -11356 -12522
15686 -12522 -9974 17285 14305 -8546 -30777 -35644 -15376 -22892 -21630 -16127 -8477 174 15180
15673 15180 22255 5949 -2229 -10447 -24405 -39542 -27727 10386 33543 37191 24864 -11412
15661 -11412 -42138 -63094 -54219 -37893 -26666 -27075 -2812 1041 1007 -3744 -9370 -26189 -38868
15648 -38868 -38013 -6651 4211 13043 23760 32439 49772 45497 23079 -6276 2204 7244 -23832
15635 -23832 -24357 -24090 -5204 -16881 -41191 -22452 -18877 -26257 -26691 -18138 3020 11568 -5687 -29225
15621 -29225 -26952 -9893 -12660 -7370 -11098 -8219 -12014 -17951 -20276 -7276 -6181 2195 9810 20720
15607 20720 -8238 -25276 -1610 31179 51095 41493 28001 14557 -7412 -27463 -28046 -17413
15595 -17413 -8113 1564 -8403 -27603 -14139 -17451 -113 5011 6015 -12654 -14399 -26926 -38389
15582 -38389 -43559 -41205 -41933 -28629 -42079 -51814 -26835 -17256 -12457 -22077 -37730 -31718 -19066
15569 -19066 -20797 -16610 -2547 -17079 -17886 9772 20061 2738 -16687 3840 5010 -22548 -30491
15556 -30491 -39368 -45421 -25147 -5731 -15197 -40901 -17901 2417 30726 35170 25875 -600 -40976
15543 -40976 -23960 -15401 -22439 -3844 -9934 -11915 -24278 -20574 -32087 -37207 -15801 -14892 -2551
15530 -2551 17054 13768 -12818 -52907 -68653 -46326 -40046 -48427 -44957 -39769 -21556 8179 38722
15517 38722 34938 12654 18502 8626 -4771 -12990 -18634 -28655 -36362 -39456 -59027 -49738 -48249
15504 -48249 -45087 -14671 -14797 -41625 -33480 -36002 -32607 -33045 -10367 33592 19475 -18005 -14876
15491 -14876 -14515 5901 7405 7350 3762 -12498 -7569 -24256 -53504 -63977 -34307 -5008 6342
15478 6342 -14813 -12228 -12154 3623 24819 32334 6487 -2386 -21707 -26774 -11209 -6483 1537 37495
15464 37495 47400 49756 36453 24957 -9292 -43837 -45608 -11838 9854 8481 2957 12994 22820
15451 22820 8499 -10078 -18904 -18434 -14965 21372 32988 30735 9643 441 -13489 -14790 20713
15438 20713 35804 27681 -9192 -27177 -4195 12934 38288 41954 42976 46871 23417 -12251
15426 -12251 -22581 -10123 693 -8222 -6511 8005 -73 6319 26953 49443 40577 14400 -4669
15413 -4669 -33295 -44058 -54549 -80386 -48117 10782 16739 -6107 3320 -21489 -43831 -24955
15401 -24955 -25775 -14737 -31141 -47781 -61022 -54736 -32677 -4933 7433 10313 -1162 -3230 12092
15388 12092 -8379 -26364 -43515 -45499 -47348 -18082 2362 2772 5423 -25687 -34426 -49412 -36093
15375 -36093 -17445 -21365 -42878 -18425 8306 1958 11039 18890 8276 -19634 -32684 -32954 2496
15362 2496 -2428 9634 13986 17584 22132 2989 -24932 -25723 10884 26369 22265 15576 -2625
15349 -2625 -30243 -30261 -14880 -37447 -24916 -937 -39164 -43832 -28876 -18604 -13403 -7244 17714
15336 17714 38919 23859 -14151 -37712 -15133 -19349 -37187 -41850 -23275 4416 -12114 -30666
15324 -30666 -14293 15935 29083 16262 298 6289 5330 -22224 -34498 -52691 -68866 -61174
15312 -61174 -36021 -4528 -11845 -35230 -63208 -57143 -40735 -10516 -459 -35409 -39247 -37221
15300 -37221 -7707 -1451 2094 -11767 -13441 -11704 1745 21014 18705 18546 21382 7467 -4976
15287 -4976 7248 24791 18666 11311 224 -12342 -14673 -4405 -16590 -13439 -19213 -6312 -3095
15274 -3095 4832 -29553 -19238 3285 15472 41432 34060 -2775 -13453 -15774 -22297 -9432 -5179
15261 -5179 -21279 3362 7084 15806 12266 9661 -2347 12657 11326 407 -6000 5507 -5314
15248 -5314 -21943 -24427 3087 38524 43375 10712 6847 -7802 -41315 -42674 -2439 27118 -5186
15235 -5186 -10836 -1563 4408 2012 -3562 -2046 30598 27957 -4594 -7076 -15837 -24579 -22230 -20699
15221 -20699 -16762 79 -17168 -26204 15833 7735 -4620 -20014 -36249 -52353 -67257 -66602 -34436
15208 -34436 22477 18271 -12965 -9344 -5965 9288 26042 7769 -29425 -51245 -55838 -50128 -22105
15195 -22105 -22909 -38484 -46893 -28324 -23058 -43626 -37404 -46672 -56783 -42397 -32603 -48892 -19579
15182 -19579 -7781 -16763 -14514 -14950 -7960 -26366 -24333 -8904 -11016 -33936 -39041 -40016 -24516 -12836
15168 -12836 19631 35551 20743 5333 6007 6287 10159 3769 -14842 -26544 -6698 -31572 -62480
15155 -62480 -49268 -14532 -3534 15354 -178 2649 7365 10932 18742 13832 17314 6602 5956
15142 5956 20386 -1709 -4334 -7125 16147 23202 11501 3579 -37379 -46446 -31028 -41810 -26986
15129 -26986 -17661 -33165 -49925 -5853 17797 16985 565 -38923 -48903 -32450 -16979 -23367 -21852
15116 -21852 -6679 -24170 -16978 -29772 -14034 -761 -6267 -4712 -14012 -39128 -49516 -39073
15104 -39073 -20448 6261 -4103 33725 24554 19160 29387 -5308 -1064 -9624 -1827 -4038 10671
15091 10671 28079 22493 5332 -47792 -64769 -41121 -33741 -29102 -5294 17403 -3049 -10164
15079 -10164 -30929 -52418 -26515 3469 -2317 -12625 -16426 -11827 -24737 -26527 -13055 -17992 -26214
15066 -26214 -6544 1718 -14701 -35651 -31455 -15189 -24512 -24478 4530 -2739 -38614 -33742 -33760 -37389
15052 -37389 -42323 -43814 -14985 -8131 3069 -32765 -38258 -11504 9370 27404 30777 3041 -9328
15039 -9328 3196 4410 3361 -2273 -14211 -18115 -8560 26985 32662 -1106 -28367 -26041 -17144
15026 -17144 -5869 -10708 -15427 -5850 11439 13986 10930 -11058 -31464 -4041 3472 15981 49167
15013 49167 52777 39563 46210 39983 24354 14379 3640 18357 -5080 1468 -2006 -2087 6596 18324
14999 18324 -349 -13039 -8420 21570 37801 14817 40224 60468 70552 51239 46129 32050
14987 32050 4131 -1436 1156 -9007 -19336 -30290 -23942 -6174 -8354 -2482 -1154 -3289 -18035
14974 -18035 -37554 -24136 -21928 -45680 -51610 -41193 -26308 -25894 -18598 -30898 -38705 -11205 11335
14961 11335 -4713 -6091 5611 10282 26950 4398 -18015 -32714 -27372 -11881 -36081 -59169
14949 -59169 -56501 -53030 -24681 -10657 -7771 -16118 -15943 -9367 -38898 -44633 -41425 -22061 -10551
14936 -10551 -3007 22985 20056 6549 2919 -17523 -51351 -38946 -25047 3646 18787 58625
14924 58625 66022 50735 26242 28797 27610 8067 11002 -16964 -16808 -9432 648 10290 -6086
14911 -6086 -11877 -21326 13174 11840 -11986 -9920 2702 4402 -21877 -30421 -22519 -1217 16126
14898 16126 22425 16050 5845 -3366 -4382 16892 22750 20671 13811 -15158 -38282 -29523 6591
14885 6591 14113 22872 15023 2376 -19401 -5672 -12446 -25248 -36747 -38759 -33084 -20338 -5412
14872 -5412 16774 12489 -15142 -3423 14296 2210 -6828 -18804 -29063 -17968 22412 45489
14860 45489 50252 36177 13517 2743 2822 -13273 -13615 -3310 17812 35899 32609 23704 6510
14847 6510 -18227 -42423 -20869 5483 275 -34741 -37474 -14248 -1354 8198 2728 62 -1369
14834 -1369 -22772 -24066 -21979 -14107 -10846 8044 5946 2240 -32068 -38665 -8052 9228 -7509
14821 -7509 -18337 -5768 -10349 -25933 -11476 10238 48235 65052 44792 5981 1282 7352
14809 7352 -14756 -25530 -5596 43593 40758 24534 13458 -10949 -31964 -46693 -23052 -12800
14797 -12800 -13957 -19143 -27451 -20380 -18888 -13604 -33651 -37638 -8299 13610 35194 -1316 -6641
14784 -6641 15198 19888 25178 25670 11916 9881 31403 15462 -11216 -28796 -60932 -48989 -3144
14771 -3144 1041 -32212 -31230 -9156 7173 -2023 -15725 5191 10451 -10573 -34373 -40769 -42410
14758 -42410 -21568 -6533 3174 25160 22022 -1782 -30043 -32990 -40052 -17640 568 -12755
14746 -12755 -1885 -32526 -54694 -44139 -10899 6745 16358 29993 36395 30012 -2643 -23358
14734 -23358 -23063 -19561 -19028 -32796 -32147 -11978 3074 1222 -21129 -39303 -34262 -33356 -27648 -21762
14720 -21762 -11765 12100 24954 30094 404 -39369 -46770 -11186 -3948 10840 18934 14331 -4165
14707 -4165 -10790 6145 948 -23849 -21039 21138 34528 24494 18669 -9783 -23010 -25858 -11666
14694 -11666 -2346 -21759 -52031 -69705 -61563 -41520 -26249 -2098 -17927 -29228 -22841 -10160
14682 -10160 -10256 -10224 -16599 -5055 1919 7223 -20115 -31046 -11026 26906 11911 18310 40633 50409
14668 50409 30344 -16342 -20975 -3860 9925 62 20338 10785 -32417 -14850 3113 -28232
14656 -28232 -50544 -33566 -57716 -54693 -38585 -42527 -24358 -19184 -23546 -28610 -39831 -42439 -35943
14643 -35943 -17676 9739 22601 4988 1195 -5935 11574 14770 15969 1325 10131 28959 14034
14630 14034 2926 12238 24516 22260 -15770 -25390 -7775 -5652 -20372 -3497 -10231 -26375 -34261
14617 -34261 -43535 -39868 -49898 -36411 -18638 18296 38449 46767 24986 -14532 -6958 708 -4148
14604 -4148 -23799 -50591 -64930 -63186 -47190 -49691 -54012 -60881 -53984 -63082 -41596 -19725 -26248
14591 -26248 6127 -13331 -35756 -49982 -26645 -14591 -17386 -46740 -47138 -47977 -15348 4630 -440
14578 -440 5646 -1785 6918 2749 4839 -6452 -35303 -26909 -10107 -7209 -14789 1818 20065 18021
14564 18021 38069 32492 -124 -22026 -4090 12826 1528 -793 -17230 -30728 -37715 -8861
14552 -8861 -18905 -30184 -11519 -40350 -46881 -23224 -1375 22278 25532 -3236 11758 55176
14540 55176 42980 -5425 -41449 -23552 -24555 -52933 -41856 -7482 12646 11303 -9979 1787
14528 1787 -18626 -6508 -9731 -18428 -12054 -16292 -12690 -7169 -5437 -6312 -13848 -9454 -11968 -1609
14514 -1609 -258 21930 25277 11541 14202 5560 -10427 -21016 -23189 -23854 -17895 -23071 -9154 -7203
14500 -7203 -43464 -44240 -64304 -51512 -28188 -8535 -23334 -38417 -34612 -29581 -26178 -31706 -40818
14487 -40818 -55958 -42127 -22268 -1025 -3642 -31113 -57811 -28421 -23663 -32674 -33379 -35480 -28562
14474 -28562 -12000 -12231 -6887 4431 -5926 -32807 -45505 -30887 -12365 -1613 -10009 -4018 32179
14461 32179 54870 44575 16403 13958 949 14215 19921 7422 -25921 -59908 -63870 -59886
14449 -59886 -75043 -55835 -49764 -53261 -66982 -69846 -35250 -11708 -2031 9137 16148 13009 -16506
14436 -16506 -26874 -21497 -20045 1496 14305 -14129 -29871 -40 -4500 -36136 -46292 -19971
14424 -19971 9942 46615 57510 25530 20689 17118 20624 -587 7505 21799 23767 30850 26981
14411 26981 15367 18675 1802 -11022 1806 18316 -12345 -35030 -28559 -20126 -17410 -30240
14399 -30240 -39067 -36614 -18893 28444 20425 -3132 -18572 -34233 -31295 -11486 668 7394 -13199
14386 -13199 -24613 -14951 -11913 -34569 -33126 -23911 3209 -15329 -31935 -33311 1801 14485 6860
14373 6860 -12615 -13302 -21499 -19055 -14494 -6327 -26395 -42960 -42042 -46820 -52189 -27546 -15427 -10519
14359 -10519 -4595 -2004 -12127 -44843 -42976 -15469 4328 21940 46594 75088 46375 33451
14347 33451 20962 -506 -226 21674 13224 11058 11959 23806 20080 -18502 -33128 -40444 -60281
14334 -60281 -56002 -54125 -32474 -20225 1604 24403 40060 45049 17761 -8057 -11313 -25782
14322 -25782 15312 35237 19651 26059 26383 17201 16664 35612 4605 -1731 19077 29271 22434
14309 22434 6684 -1208 -6451 -6833 -650 3337 12550 1329 -18307 -19185 -23492 -21855 -33796 -22950
14295 -22950 -45505 -72988 -66251 -20971 -4116 -23100 -21513 -38528 -43097 -47859 -32881 -22109
14283 -22109 -8573 14776 9488 5762 14130 23295 45435 40009 27589 -2727 -26649 -30352 -36544
14270 -36544 -43321 -5347 13371 -8662 -14875 -24034 465 31979 37794 39298 561 -9338 -3590
14257 -3590 -2350 -1592 -7923 -36815 -41736 -26708 -24054 -20416 -11928 -28388 -39879 -13997 10437
14244 10437 11564 9937 30020 36274 9424 29849 49352 15075 -4363 -24142 -32524 -27599 -19666
14231 -19666 7259 -1546 -4373 -10267 6140 25389 -2764 -30612 -17839 11560 -4734 -36140
14219 -36140 -20446 -24499 -38446 -24020 -767 14600 11205 1711 15492 664 -25986 -46401
14207 -46401 -46973 -62452 -70235 -44990 -23923 -24004 -13487 -17170 5733 32964 38178 2611 -35174
14194 -35174 -27151 -19053 1288 12901 4691 3404 4724 -6607 -4170 -2522 10841 8852 -703
14181 -703 1321 6527 27441 20064 15702 7703 2189 11518 29039 32969 22554 -3516 -26665 -16415
14167 -16415 -30684 -33233 -28320 -16577 -8659 -3126 -5406 -5952 -10038 8203 29460 56354 65517
14154 65517 70362 57721 35624 30693 40583 66741 99645 106503 114563 137774 175447 224265 264224
14141 264224 328439 398383 488954 601244 689065 756029 794978 797922 782608 759635 709647
14130 709647 637429 542399 430199 347140 256695 204774 148988 128208 90619 52479 22659
14119 22659 31520 50278 53584 64325 79273 66961 38045 18458 7484 20079 19021 -22343
14107 -22343 -29959 -23674 8032 4243 15260 43430 45003 35513 18485 11339 18182 35681 28047
14094 28047 20128 20600 -6598 -8534 4078 -8754 -7184 13831 1123 -12374 -21618 -21318 -71
14081 -71 -9710 -15085 -28096 -8854 -7463 -40388 -40245 -51208 -59011 -74023 -73111 -46778 -25462 -28020
14067 -28020 -83697 -74582 -56876 -29043 -27336 -19254 -27511 -29406 -33151 -23694 -7264 7540 60
14054 60 -16821 -29592 8040 15014 -1204 -412 8844 12729 27430 27003 41574 40470 7751 19414
14040 19414 14002 923 19711 34710 26878 -3822 2256 15748 8828 16740 16316 5843 6158
14027 6158 20196 17772 3893 -3143 -4833 15652 32745 42627 49270 33866 1452 1951 -3465
14014 -3465 -14528 -34294 -39015 -34755 -50405 -53722 -46083 -40001 -35419 -13906 -1244 -15643 5100
14001 5100 4148 -21004 -22060 2514 24880 35723 32157 22579 3580 -11464 -19230 -9062 9836
13988 9836 -9537 -6963 -13323 -25757 -24468 -9505 -10242 -10004 -52938 -85025 -46094 2164 28720
13975 28720 18929 16045 26821 6444 -12450 -29854 -30046 -42175 -31124 11847 12387 18814 24204
13962 24204 17455 15819 12618 1005 -26476 -48274 -43984 -71354 -64137 -65764 -49377 -55429 -43550
13949 -43550 -44378 -45733 -46224 -49640 -22871 -17901 -10528 27586 46829 5734 -24400 -28612 -31018 -17917
13935 -17917 20935 26295 12003 10087 18218 34283 20315 11577 29620 32999 50678 54137 12846
13922 12846 -17092 -16615 -13645 13349 25974 -27438 -39025 -16509 -40469 -61519 -50348 -44006
13910 -44006 -1847 9112 -22556 -31249 -34880 -31418 -26142 11843 28346 6023 3669 1857 -11088
13897 -11088 -9964 10496 12934 13937 20797 24552 21374 -1405 -8230 -21707 -35626 -32552 -16468
13884 -16468 -21648 -30960 -36817 -37313 -961 24224 4018 -2889 -5449 1746 14589 12473 16151 1243
13870 1243 -16021 -34058 -38330 -33748 -5752 9647 20055 -1355 -19048 -21458 -23569 -37769 -20087
13857 -20087 -14387 -14428 -10725 -30059 -23731 -17190 -15080 -33628 -31148 -18688 -6597 -22300 -40106
13844 -40106 -32468 -29419 -23070 -21644 -12935 -18632 -32903 -32319 -1917 13558 4679 -14014 -15934 2220
13830 2220 15896 -6337 -7573 8219 5517 -2860 -12914 -26461 -33585 -36267 -29982 -4550 -1235
13817 -1235 -10070 -14679 -42707 -48776 -25828 -29433 -41991 -39326 -25780 12497 24965 10153 -1287
13804 -1287 -14505 -27071 -13842 1573 -2652 -12129 -26564 -12860 -11976 -32183 -61498 -41323 2599
13791 2599 4719 -41442 -71352 -63416 -26888 -1430 -7267 -10387 -8481 30642 31818 1455 -14621
13778 -14621 5484 14958 -3493 -20126 -45652 -39364 -13344 -15370 -11866 -17587 -2106 13825 -12930
13765 -12930 -57840 -50759 -17112 -9653 -34482 -55650 -66558 -37793 -32582 -26127 -6839 -19379
13753 -19379 -38215 -36100 -71327 -60421 -30568 -40062 -35715 -31942 -31323 -21427 -26829 -64802 -48199
13740 -48199 -14770 -33494 -9409 -1434 -3362 -23439 -31012 -22573 -22718 -11547 -12579 -38160 -64590
13727 -64590 -67667 -63101 -25455 13822 2332 -12153 -35297 -25672 -35366 -23769 -6243 -7105 -13190
13714 -13190 -6843 2925 13397 39075 47744 34423 43662 31139 -6412 -1898 2686 1896 -15424
13701 -15424 932 3669 6604 -2366 -9861 -17835 -7405 3498 10385 22738 23938 -13638 -27847
13688 -27847 -33337 -15397 -7954 -1019 -1267 5605 1895 -15959 -15144 -29577 -33072 -21981 -11141 7019
13674 7019 9041 -11248 -24331 -50987 -44973 -37083 -2752 27866 56093 46311 39338 1858 5421
13661 5421 7002 -16942 -13565 2596 15473 12569 10131 35070 38926 -8123 -3826 -8625 -17583
13648 -17583 -23295 -29555 -17099 -21445 -9959 -3489 -18043 -31327 -22088 -17716 -24462 2311 2554
13635 2554 -15860 -37259 -50410 -36645 -3617 3873 9969 21970 31809 30076 48392 35972 31410
13622 31410 13721 -3608 -33588 -52300 -18472 -15778 -22584 -38289 -39671 -35015 -7953 4999
13610 4999 -8083 -15040 1697 -13803 -22608 -8107 12585 15319 15109 32900 28159 -4920 -42103
13597 -42103 -45559 -63788 -63302 -30753 -45116 -86780 -63223 -32027 -24288 -22122 -15097 -204 -2398
13584 -2398 -6079 -30209 -28729 -38430 -46560 -38255 3182 6934 -8973 -21399 -23662 4790 -633
13571 -633 -4047 26143 15707 5802 18155 12685 21033 19558 1284 -25046 -24501 -15698 -27691 -38357
13557 -38357 -44313 -56036 -30788 -9457 -1705 -4519 13386 4119 -2633 35382 31647 -18451 -39280
13544 -39280 -37470 -42531 -30407 5385 11972 -4430 -40293 -49183 -34811 -2200 9017 -861 -8256
13531 -8256 -42847 -50850 -18607 -14447 -11371 -11866 -1827 7059 -7244 -15307 -38797 -47737 -23050
13518 -23050 -15806 -14924 -20499 260 29080 9255 4270 8105 28262 46776 21672 917 -6915
13505 -6915 -18172 -27398 -6365 8022 1191 4608 7446 -5125 2834 22460 13158 -14074 -4694
13492 -4694 -2753 -16392 -27551 -16368 -17596 -18678 -56205 -31566 -25550 -44441 -49587 -36750 -17502
13479 -17502 -12106 2504 2061 6825 17859 -813 3531 9691 3557 96 -12596 -16651 -8557 4338
13465 4338 12972 22171 8782 -9213 -24539 -8589 -21686 -27008 -17232 -19292 -16537 4762 19587
13452 19587 34244 8895 -17143 -42367 -23156 -7814 4148 10729 -6133 -10439 -21156 -22757
13440 -22757 -10377 -25994 -13159 -16166 -41034 -44016 -51604 -47481 -4220 6059 6452 -3016 -27180
13427 -27180 -10814 2973 16251 39990 29287 7894 23471 9160 -8091 -21640 -26228 -25727
13415 -25727 -29976 -37721 -44818 -5090 18264 -1588 16329 22744 -12196 -7181 21233 25284 3583
13402 3583 -9052 -29712 -29065 -22525 -1877 -379 -13460 -826 -711 -16076 -17637 2245 11871
13389 11871 -770 -3336 21457 5005 -1093 -2014 9183 3021 5313 3753 -8240 -23354 -26719
13376 -26719 -19993 -18457 -27589 -39035 -37178 -2795 17575 6177 -12901 -22455 -36497 -50608 -43934
13363 -43934 -15367 10501 10002 -8460 -22385 -15252 -12446 -2709 1641 -9257 8276 21546 21832
13350 21832 31557 52367 19541 5737 -11678 5345 17109 12016 35343 35012 30398 -7603 -14663
13337 -14663 -17361 16747 46157 46515 20954 -14133 -25460 6141 6787 -6104 -9795 -35860 -16291
13324 -16291 -7859 5673 5487 -16575 -22134 -33207 -32685 -38891 -56549 -41156 -26943 -16963 -11597
13311 -11597 -14328 -15182 -14804 -30799 3117 2169 -16442 5635 13478 27443 24003 -8755 -15972 -32273
13297 -32273 -40086 -17430 -22448 -9148 15578 15273 -9957 -32494 -51820 -60180 -36109 -29165 -38177
13284 -38177 -39977 -40596 -55461 -52797 -50120 -39294 -32628 -29701 -13343 1498 -28885 -67662 -51998
13271 -51998 -16068 -13290 -22588 -6084 -7537 -4952 17534 37731 53937 60652 68601 36734 21287
13258 21287 8015 50956 54013 44806 25067 -20834 -18853 -2239 -5146 -15007 7410 14888 15538
13245 15538 38618 42533 25731 12847 -3299 -23622 -6445 -7938 -47310 -49182 -47587 -38515 -10246
13232 -10246 -5128 10903 47536 68263 46491 37701 35605 31760 3096 5115 9754 14786 22926
13219 22926 25181 5103 18675 11906 -24203 -23736 12572 9924 -19489 -8332 -11539 -39064 -29636
13206 -29636 -21040 -25402 -17366 -5730 -17224 -5543 -15337 -25505 -1314 -3097 234 -21852 -19293
13193 -19293 1756 -1943 17544 13506 7745 -10558 -33387 -26656 -21322 3209 19456 2615 -23423
13180 -23423 -10939 14744 -7054 -22076 -35781 -15601 8891 24419 28261 5182 -24737 -39673
13168 -39673 -32572 -34234 -3412 5579 -14071 18802 39550 27596 -1763 -28313 -37901 -50997
13156 -50997 -46803 -42608 -32425 -941 9785 7143 -2166 -32867 -31506 -9003 -35005 -34586 -9167
13143 -9167 -30686 -45157 -34794 -42138 2189 33821 25149 18088 7000 -4254 5681 -12089 -38513
13130 -38513 -45200 -33806 -7272 -385 4041 686 6777 10694 908 -18247 2964 7275 -7749
13117 -7749 3571 20419 13869 388 1646 -10374 -30283 -45072 -57121 -61066 -46184 -30115
13105 -30115 -33697 -37183 -50903 -47229 -55736 -35237 -8583 -23215 -48166 -27098 -22393 -24656 -18637
13092 -18637 -1272 -10187 -30190 -28135 -15968 -11876 -23896 -39865 -13125 8006 11058 -17739
13080 -17739 -33800 -42081 -46547 -29041 -23380 -6050 23209 42227 18324 -28780 -37556 -36981 -25988
13067 -25988 -42501 -26677 7968 13062 11067 13314 13425 33614 11753 -22985 -16187 16951 16080
13054 16080 14203 14218 14688 12264 -8744 726 10191 6147 -8120 -31785 -17256 -7837 -22280 -15660
13040 -15660 -8919 1696 7130 -5357 -4921 -21010 -23493 -19038 -12874 1432 20290 10756 16809
13027 16809 4738 -33792 -40054 -12865 120 -23172 7236 15507 15660 19150 -10422 -41467 -67303
13014 -67303 -75610 -75830 -42978 -14713 13327 20233 14553 6774 -3815 12921 194 -20580 -6207
13001 -6207 -10798 -4213 6092 -7285 -3458 -467 -4387 -11457 1289 -8394 12842 -1865 -43083
12988 -43083 -24268 -9458 -17868 -43662 -23033 -20581 -34735 -35981 -53567 -51315 -36071 -31909 -25025
12975 -25025 7114 16809 -873 -7488 -21938 -21781 -22598 -45769 -50412 -43644 -12085 -13633 -30095
12962 -30095 10442 -17985 -57799 -35236 -8510 -30387 -48215 -35329 -35999 -21593 -9008 -1647
12950 -1647 20457 11892 13747 5845 20282 11616 -8007 -688 -1227 9160 17975 8668 13447 7924
12936 7924 -5241 2000 47757 37540 315 -15950 11868 11915 2278 -16727 -23966 -18103 5199
12923 5199 25420 29632 166 -4577 16681 20277 2228 -22814 -18206 -22137 -29922 -28946 88
12910 88 30563 51631 56102 39942 -6520 -40392 -35295 -21701 -27320 -25474 -20825 -26399 -22044 -17188
12896 -17188 -28877 -22858 -20556 -23389 -15787 -25956 -12731 -5691 -30964 -25776 533 19958 17791
12883 17791 11278 -5537 -35559 -45092 -33592 -49049 -15649 -13758 -34439 -57125 -46535 -17679
12871 -17679 -21104 -53629 -45336 -20514 -5655 20429 18173 -4028 -10927 -2763 24507 20258 9373
12858 9373 24540 11793 5902 -1797 14784 -5476 13940 11707 25233 15129 2224 -24023
12846 -24023 -7603 16283 4484 1588 23672 8355 7512 -805 8427 29140 13327 29237 -3177
12833 -3177 -9881 -3522 -23738 -22583 -2312 6949 -6462 -1545 -7149 -20218 -39711 -45289 -37623
12820 -37623 -34064 -52702 -40919 -28435 -12215 16946 32659 -3296 -257 8482 22859 10452
12808 10452 -14015 -12679 2045 8244 -12166 -6350 8155 2026 24077 33131 26966 37522 16301
12795 16301 16434 15449 1338 1038 1852 -12573 -15184 -18981 -7036 -14354 -30496 -43933 -32540 -2097
12781 -2097 -9310 -3440 -7401 1332 9958 -13840 -32898 -7444 19888 36133 31711 28104 15331
12768 15331 -9765 -7398 -3673 -121 -11700 -23079 -8542 -10670 -5452 -19534 -27252 11481 45610
12755 45610 57938 36187 17211 10002 -12731 -7295 -13601 -37578 -75666 -45395 -24542 -30270
12743 -30270 -36036 -21839 -742 15041 11381 20069 14103 -11384 3182 7995 -16327 -8659 -8221
12730 -8221 -19332 -34867 -43180 -63288 -80953 -33425 -17979 -22568 -6199 -26018 -12834 -29071
12718 -29071 -51713 -31394 -10163 -6636 15962 37544 42576 24408 41779 37371 21930 7317
12706 7317 -1587 -4626 1560 -18693 -40570 -45032 -21079 -19765 -38218 -34614 -45963 -33693 -28520
12693 -28520 -26001 -9937 4217 14330 34170 73528 79438 46717 22702 4410 -15438 -23632
12681 -23632 -32624 -38198 -15704 -240 -2207 -9782 2256 19990 10237 -5692 -3458 5765 -6009
12668 -6009 -7636 -3351 11790 25609 11769 40581 51231 7327 -41527 -57448 -48219 -14706
12656 -14706 -7333 51 3439 -15637 -6525 13837 32114 32005 14628 11723 -13002 -11389 -14268
12643 -14268 -16248 -19919 -17745 -16844 -21535 -8887 -7220 237 -7067 -26935 -24408 -7324 -14523 -23863
12629 -23863 -8800 -9640 -40068 -71121 -76995 -42866 -26212 -13081 -2290 -7721 -12761 -22584 -28353
12616 -28353 -29407 -30096 -26454 -28947 -18400 -35249 -47917 -65189 -56232 -19315 -25099 2535 -15454
12603 -15454 -13215 6134 -7208 -26053 -21329 -12007 5456 17457 2572 -4926 -9543 3850 -5585
12590 -5585 -1368 -20080 -36997 -27232 -23899 -902 -19721 -14887 -148 -15388 -35931 -15247 -7790
12577 -7790 -20408 -17414 -11093 -16352 -33661 -2476 -3054 -27409 -22988 -7272 1508 -17800 -25940
12564 -25940 -2148 3195 -42764 -38962 -31528 -13868 -27854 -39799 -26768 -21738 -45457 -50378 -35034
12551 -35034 -3212 3931 -22747 -39639 -11907 11264 28171 17536 -9017 -18307 -23925 -42874
12539 -42874 -12625 -2903 -9413 -25264 -43500 -6032 4413 -13666 -16032 9421 32433 33142 7159
12526 7159 10143 30336 25319 1375 -15185 -32611 -40781 -41367 -6543 10537 -10642 -7370 -17523
12513 -17523 -15402 -1358 21710 19860 -12682 -10281 2264 4914 81 8312 395 -29515 -22677
12500 -22677 5012 17384 20148 13458 32581 42622 36769 23031 -6791 -35716 -62763 -88640
12488 -88640 -76686 -54052 -61845 -54048 -25427 -10149 -5627 -7283 -8069 21678 27033 12624 15507
12475 15507 -1123 2952 883 8119 20588 2496 -8109 -21349 -28027 22484 44444 45121 42701
12462 42701 26938 2785 4137 31990 20182 16016 13201 7938 -6096 8544 -7155 -26322
12450 -26322 -18626 -2467 1646 -46 9534 34363 21943 14975 6567 -20398 -42099 -58660 -29931
12437 -29931 -13942 -15767 -7758 -18777 -64641 -65708 -55941 -36986 -20828 -22880 -35481 -17049 -15174
12424 -15174 -37270 -29492 -10830 -17725 -27427 -38688 -31789 -5047 -2612 -7537 13375 16494 -5385
12411 -5385 -1655 -8122 -14808 -22074 1949 36855 29526 593 -9591 -216 27265 23367 31035
12398 31035 31789 14183 9126 12785 512 -8167 4117 -15377 -28417 -16105 -8580 6667 3820
12385 3820 -24831 -18031 11040 -1225 -12098 -4837 -12937 -10533 -6271 -11593 -5611 -29867 -39790
12372 -39790 -43845 -28218 -52088 -46650 -11532 -7658 -1212 -16835 -16283 4262 9006 31147 13075
12359 13075 -13374 9871 9484 2847 4897 26284 15405 18047 19746 2573 3148 9683 31687
12346 31687 39492 35324 46791 61367 69026 69482 42178 16495 19072 37317 25445 25515 38583
12333 38583 28861 9424 -5434 4518 9951 22380 34520 27383 25923 20889 18832 -14704 -28538
12320 -28538 -16514 -13746 -13572 -15122 -10314 -14033 -28052 -18112 -12894 -1531 5906 -3325 -1732 8357
12306 8357 9220 20006 20331 -8139 -24186 -8734 -26812 -17999 12004 13832 3879 8058 21678
12293 21678 42295 42754 31423 20672 15196 29351 50411 32891 429 -21986 -22737 -16239 -20796
12280 -20796 -9838 3210 -962 -20523 -13031 -13155 -5157 5872 32206 20571 10840 907 6794
12267 6794 345 -1436 22425 42125 53015 48041 18230 3314 20092 22952 4544 -12189 -5180
12254 -5180 10318 15254 11331 17297 23239 24163 22531 8671 -13503 -25864 -37850 -48869 -35270
12241 -35270 -26569 -11489 28666 58774 39196 26195 28933 9083 -28831 -30108 -7541 -5968
12229 -5968 -15601 -26981 -37747 -23825 -8776 -6825 -303 13085 18305 2116 12002 25138 24985
12216 24985 26765 18441 -8744 -11479 -11429 4972 4235 -6219 -12677 -11141 14454 39092 44408 52567
12202 52567 44824 32305 15445 -7085 2859 19786 400 -4457 202 -4015 2507 10274 -8481
12189 -8481 -27188 -31001 -25918 -12073 7750 17139 -7805 -33680 -53903 -56910 -40821 -36037 -44706
12176 -44706 -42081 -43152 -34205 -45628 -30644 -15824 -15302 -15099 -29046 -44475 -60672 -53820 -24140
12163 -24140 4951 14225 8550 -5990 -23269 -15892 -35882 -36094 -36432 -13176 4191 -7165 -11014
12150 -11014 -16173 -23947 -24974 -10213 -5592 -25538 5866 42267 40361 -438 -19700 274 4554
12137 4554 7279 19529 32791 22198 25106 29853 36979 44597 24555 -10830 -23325 -27912 -37021
12124 -37021 -36247 -5545 26323 24926 18709 40288 51818 22668 -6091 -446 2089 -8968 -28152
12111 -28152 -24209 -23288 2399 6912 9338 9623 -17420 -33972 -14256 8790 4038 6511 17037
12098 17037 42500 44188 36948 28685 26936 17003 -13004 2749 11413 -6590 -21281 -23414 -19425
12085 -19425 -8346 9423 7151 -15268 -8072 16172 29704 11394 7701 17060 -6039 -32927
12073 -32927 -44052 -60290 -77295 -42829 5264 18476 18044 27546 14126 6205 -11466 -20468 -22406
12060 -22406 -155 11960 47383 56539 34189 18732 -10773 -22387 -6915 -13519 -9787 11604
12048 11604 125 -1506 -7668 -9969 -7772 -37029 -52657 -25181 -18405 -162 -9661 -11579 -1456
12035 -1456 425 -6944 -6909 -22568 3698 17873 16886 8570 -12127 -11588 -16363 -32515 -17459 -15260
12021 -15260 -15509 -1922 -10736 -21567 -38093 -42174 -39331 -37974 -16041 -20628 -38815 -26224 -5469
12008 -5469 -12774 -14746 17958 47573 10604 1896 9887 7602 -4388 14647 27943 35639 11370
11995 11370 3730 -151 -1130 34483 47316 36939 20631 988 12143 33971 35170 9042 -8132
11982 -8132 -22249 -28342 -31296 -14014 -1450 6410 40252 24329 16292 8029 10722 6419 -41033
11969 -41033 -28892 -5504 -17701 -39264 -38229 -4250 -13252 -29863 -20312 9998 1961 16490
11957 16490 31445 24513 -9179 -9285 575 -5298 -12762 8228 2844 3793 12686 -4399 -3310 -12223
11943 -12223 1179 22954 42963 32094 14805 5916 8401 13165 -4511 -33866 -8588 -2313
11931 -2313 -28227 -11628 -5850 -18163 -19592 3744 2918 -14866 -38054 -12821 7787 -252 -10759
$$ [...]
##END NTUPLES=NMR SPECTRUM
##END=
