##TITLE=Analysis number 312562
Compound Code cc 32909
Book Reference 422/37
Project Code adrs
Chemist Name robb
##JCAMPDX= 6.0         $$ Bruker NMR JCAMP-DX V2.0
##DATA TYPE= NMR SPECTRUM
##DATA CLASS= NTUPLES
##ORIGIN= Bruker BioSpin GmbH
##OWNER= NMR
$$ XWIN-NMR		Version 3.5
$$ Tue Aug  9 08:24:44 2005 GMT Daylight Time (UT+1h)  MAYBRIDGE\NMR@NMR_250MHZ
##.OBSERVE FREQUENCY= 250.131544655141
##.OBSERVE NUCLEUS= ^1H
##.ACQUISITION MODE= SIMULTANEOUS (DQD)
##.ACQUISITION SCHEME= undefined
##.AVERAGES= 16
##.DIGITISER RES= 18
##SPECTROMETER/DATA SYSTEM= dpx250
##.PULSE SEQUENCE= zg30
##.SOLVENT NAME= CDCl3
##.SHIFT REFERENCE= (INTERNAL, CDCl3, 0, 16.4421)
##AUDIT TRAIL= $$ (NUMBER, WHEN, WHO, WHERE, WHAT)
$$ ##TITLE= Audit trail, XWIN-NMR		Version 3.5
$$ ##JCAMPDX= 5.01
$$ ##ORIGIN= Bruker BioSpin GmbH
$$ ##OWNER= NMR
$$ C:\u/data/dgb/nmr/ADRS/7310/pdata/1/auditp.txt
$$ ##AUDIT TRAIL=  $$ (NUMBER, WHEN, WHO, WHERE, WHAT)
(   1,<2005-08-09 08:24:23.35 +100>,<MAYBRIDGE\NMR>,<NMR_250MHZ>,
      <created by zg, POWCHK disabled, PULCHK disabled
       configuration hash MD5:
       62 19 C7 07 E1 42 D1 B7 37 6C 3D D0 77 39 F9 E6
       data hash MD5: 64K
       C2 40 2F 21 74 7F 06 CD 8F 51 56 68 B2 87 C4 BF>)
(   2,<2005-08-09 08:24:34.95 +100>,<MAYBRIDGE\NMR>,<NMR_250MHZ>,
      <Start of raw data processing
       ef LB = 0.3 FT_mod = 6 PKNL = 1 SI = 32K 
       data hash MD5: 32K
       84 D5 BA E2 69 F6 FF F3 B3 FD 96 63 4B 2C B8 3D>)
(   3,<2005-08-09 08:24:36.79 +100>,<MAYBRIDGE\NMR>,<NMR_250MHZ>,
      <apk 
       data hash MD5: 32K
       25 97 89 39 E6 C9 EA 4F CC 29 84 86 EB AE EC C1>)
(   4,<2005-08-09 08:24:37.56 +100>,<MAYBRIDGE\NMR>,<NMR_250MHZ>,
      <abs ABSG = 5 
       data hash MD5: 32K
       C2 A8 8E 91 72 C7 AE F4 9B 55 E9 55 FA 29 26 1A>)
$$ ##END=
$$ 
$$ hash MD5
$$ D3 CB F5 FB 2A DE B5 6E 4A C0 FC 56 0B C0 7C C2
##$RELAX= 
##$RELAX= 
##$RELAX= 
##$RELAX= 
##$RELAX= 
##$RELAX= 
##$RELAX= 
$$ Bruker specific parameters
$$ --------------------------
##$DU= <C:\u>
##$EXPNO= 7310
##$NAME= <ADRS>
##$PROCNO= 1
##$TYPE= <nmr>
##$USER= <dgb>
##$AMP= (0..31)
100 100 100 100 100 100 100 100 100 100 100 100 100 100 100 100 100 100 
100 100 100 100 100 100 100 100 100 100 100 100 100 100 
##$AQSEQ= 0
##$AQ_mod= 3
##$AUNM= <au_zg>
##$AUTOPOS= <1 >
##$BF1= 250.13
##$BF2= 250.13
##$BF3= 250.13
##$BF4= 250.13
##$BF5= 500.13
##$BF6= 500.13
##$BF7= 500.13
##$BF8= 500.13
##$BYTORDA= 1
##$CFDGTYP= 0
##$CFRGTYP= 5
##$CHEMSTR= <none>
##$CNST= (0..31)
1 1 145 1 1 1 1 1 1 1 1 1 1 1 1 1 1 1 1 1 1 1 1 1 1 1 1 1 1 1 1 1 
##$CPDPRG= <>
##$CPDPRG1= <>
##$CPDPRG2= <>
##$CPDPRG3= <>
##$CPDPRG4= <mlev>
##$CPDPRG5= <mlev>
##$CPDPRG6= <mlev>
##$CPDPRG7= <mlev>
##$CPDPRG8= <mlev>
##$CPDPRGB= <>
##$CPDPRGT= <>
##$D= (0..31)
0 1 0 0 0 0 0 0 0 0.06 0 0 0 0 0 0 0.0002 0 0 0 0 0 0 0 0 0 0 0 0 0 0 
0 
##$DATE= 1123572262
##$DBL= (0..7)
120 120 120 120 120 120 120 120 
##$DBP= (0..7)
150 150 150 150 150 150 150 150 
##$DBP07= 0
##$DBPNAM0= <>
##$DBPNAM1= <>
$$ [...]
##$SUBNAM8= <"">
##$SUBNAM9= <"">
##$SW= 20.6930455092707
##$SWIBOX= (0..15)
0 0 3 0 0 0 0 0 0 0 0 0 0 0 0 0 
##$SW_h= 5175.983436853
##$TD= 65536
##$TD0= 1
##$TE= 295.16
##$TE2= 300
##$TE3= 300
##$TEG= 300
##$TL= (0..7)
0 120 120 120 120 120 120 120 
##$TP= (0..7)
150 150 150 150 150 150 150 150 
##$TP07= 0
##$TPNAME0= <>
##$TPNAME1= <>
##$TPNAME2= <>
##$TPNAME3= <>
##$TPNAME4= <>
##$TPNAME5= <>
##$TPNAME6= <>
##$TPNAME7= <>
##$TPOAL= (0..7)
0.5 0.5 0.5 0.5 0.5 0.5 0.5 0.5 
##$TPOFFS= (0..7)
0 0 0 0 0 0 0 0 
##$TUNHIN= 0
##$TUNHOUT= 0
##$TUNXOUT= 0
##$USERA1= <user>
##$USERA2= <user>
##$USERA3= <user>
##$USERA4= <user>
##$USERA5= <user>
##$V9= 5
##$VALIST= <valist>
##$VCLIST= <CCCCCCCCCCCCCCC>
##$VD= 0
##$VDLIST= <DDDDDDDDDDDDDDD>
##$VPLIST= <PPPPPPPPPPPPPPP>
##$VTLIST= <TTTTTTTTTTTTTTT>
##$WBST= 1024
##$WBSW= 4
##$XGAIN= (0..3)
0 0 0 0 
##$XL= 0
##$YL= 0
##$YMAX_a= 469340
##$YMIN_a= -464885
##$ZGOPTNS= <>
##$ZL1= 120
##$ZL2= 120
##$ZL3= 120
##$ZL4= 120
##$ABSF1= 16.44205
##$ABSF2= -4.251122
##$ABSG= 5
##$ABSL= 3
##$ALPHA= 0
##$AQORDER= 0
##$ASSFAC= 0
##$ASSFACI= 0
##$ASSFACX= 0
##$ASSWID= 0
##$AUNMP= <proc_1d>
##$AZFE= 0.1
##$AZFW= 0.1
##$BCFW= 0
##$BC_mod= 0
##$BYTORDP= 0
##$COROFFS= 0
##$CY= 12.5
##$DATMOD= 1
##$DC= 0
##$DFILT= <>
##$DTYPP= 0
##$F1P= 14.0000005364418
##$F2P= -0.99999901652339
##$FCOR= 0.5
##$FTSIZE= 32768
##$FT_mod= 6
##$GAMMA= 0
##$GB= 0
##$INTBC= 1
##$INTSCL= 1
##$ISEN= 128
##$LB= 0.3
##$LEV0= 0
##$LPBIN= 0
##$MAXI= 10000
##$MC2= 0
##$MEAN= 0
##$ME_mod= 0
##$MI= 0
##$NCOEF= 0
##$NC_proc= -4
##$NLEV= 6
##$NOISF1= 0
##$NOISF2= 0
##$NSP= 0
##$NTH_PI= 0
##$NZP= 0
##$OFFSET= 16.44205
##$PC= 1
##$PHC0= -75.89553
##$PHC1= -2.110759
##$PH_mod= 1
##$PKNL= yes
##$PPARMOD= 0
##$PSCAL= 4
##$PSIGN= 0
##$REVERSE= no
##$SF= 250.130019996905
##$SI= 32768
##$SIGF1= 0
##$SIGF2= 0
##$SINO= 400
##$SIOLD= 32768
##$SREGLST= <1H.CDCl3>
##$SSB= 0
##$STSI= 32768
##$STSR= 0
##$SW_p= 5175.98343685301
##$SYMM= 0
##$S_DEV= 0
##$TDeff= 65536
##$TDoff= 0
##$TI= <Analysis number 999999
Compound Code 99
Book Reference 9
Project Code 9>
##$TILT= no
##$TM1= 0
##$TM2= 0
##$TOPLEV= 0
##$USERP1= <user>
##$USERP2= <user>
##$USERP3= <user>
##$USERP4= <user>
##$USERP5= <user>
##$WDW= 1
##$XDIM= 32768
##$YMAX_p= 436092333
##$YMIN_p= -438753
$$ End of Bruker specific parameters
$$ ---------------------------------
##NTUPLES= NMR SPECTRUM
##VAR_NAME=  FREQUENCY,     SPECTRUM/REAL,   SPECTRUM/IMAG
##SYMBOL=    X,             R,               I
##VAR_TYPE=  INDEPENDENT,   DEPENDENT,       DEPENDENT
##VAR_FORM=  AFFN,          ASDF,            ASDF
##VAR_DIM=   32768,         32768,           32768
##UNITS=     HZ,            ARBITRARY UNITS, ARBITRARY UNITS
##FACTOR=    0.157963299565203, 1,           1
##FIRST=     4112.650528871, 0,              0
##LAST=      -1063.33290798201, 0,           0
##MIN=       -1063.33290798201, -438753,     0
##MAX=       4112.650528871, 436092333,      0
$$ Real data points
##PAGE= N=1
##DATA TABLE= (X++(R..R)), XYDATA
$$ [...]
$$ plain form
19307 803102 866205 956886 1059841 1149601 1171331 1152682 1135316 1148371 1170206 1183925 1183049 1118707
19295 1118707 987070 851606 733103 645261 569993 529220 482815 429017 411967 414998 430032
19284 430032 421382 399305 402718 433863 436818 420363 411339 412469 387135 390140 398313 379000 368705
19271 368705 370930 373059 362929 359092 382724 406053 409822 391324 415140 423948 407746 398542 431955
19258 431955 486805 545650 573413 618866 659446 692663 680140 673068 644645 637310 641349 622823
19246 622823 616160 632376 667385 701802 746304 873975 1016492 1085640 1163579 1273323 1345142
19235 1345142 1403440 1448514 1504732 1556771 1628590 1703280 1791495 1875048 1926855 1957424 2022974
19224 2022974 2068989 2117622 2185201 2236168 2309482 2425946 2508421 2564725 2593430 2597169 2562753
$$ packed form
19307H03102O3103R0681J02955Q9760K1730j8649j7366J3055K1835J3719q76o4342
19295A118707j31637j35464j18503q7842p5268m0773m6405n3798j7050L031J5034
19284D30032q650k2077L413L1145K955j6455r024J130k5334L005Q173j9313j0295
19271C68705K225K129j0130l837K3632K3329L769j8498K3816Q808j6202r204L3413
19258D31955N4850N8845K7763M5453M0580L3217j2523p072k8423p335M039j8526
19246F22823o663J6216L5009L4417M4502J27671J42517O9148P7939J09744P1819
19235A345142N8298M5074N6218N2039P1819P4690Q8215Q3553N1807L0569O5550
19224B022974M6015M8633O7579N0967P3314J16464Q2475N6304K8705L739l4416
$$ plain form
19213 2562753 2510853 2431946 2353190 2262394 2186329 2094605 2061057 2041358 2040730 2036460 2033962 2056800
19201 2056800 2038583 2023396 1983829 1936034 1872144 1770482 1667800 1584551 1506948 1456753 1407069
19190 1407069 1374420 1351920 1374703 1406744 1400570 1436324 1432067 1449391 1472285 1513004 1581010 1609718
19178 1609718 1620055 1650727 1688483 1713765 1756333 1792282 1806041 1831187 1842203 1810661 1795843
19167 1795843 1786784 1774349 1720563 1703916 1737582 1734437 1696342 1693276 1677334 1646103 1641983 1646913
19155 1646913 1641087 1644519 1637940 1626125 1635748 1651568 1656255 1660508 1659574 1647089 1666133 1656115 1652500
19142 1652500 1680945 1731295 1801321 1854343 1924943 2003445 2096447 2194105 2339601 2486634 2665423
19131 2665423 2874808 3160776 3515618 3910898 4313764 4649639 4900244 5166561 5361028
$$ packed form
19213B562753n1900p8907p8756r0796p6065r1724l3548j9699o28m270k498K2838
19201B056800j8217j5187l9567m7795o3890j01662j02682q3249p7603n0195m9684
19190A407069l2649k2500K2783L2041o174L5754m257J7324K2894M0719O8006K8708
19178A609718J0337L0672L7756K5282M2568L5949J3759K5146J1016l1542j4818
19167A795843r059j2435n3786j6647L3666l145l8095l066j5942l1231m120M930
19155A646913n826L432o579j1815R623J5820M687M253r34j2485J9044j0018l615
19142A652500K8445N0350P0026N3022P0600P8502R3002R7658J45496J47033J78789
19131B665423K09385K85968L54842L95280M02866L35875K50605K66317J94467
$$ plain form
19122 5361028 5420029 5448236 5518282 5651872 5881346 6242607 6774369 7479215 8349665 9395828
19112 9395828 10658845 12204962 14043308 16239451 19091023 23042015 28821255 37693581
19104 37693581 51767792 73682160 102855823 129206388 143505730 148596309 152013181
19097 152013181 153378896 143178084 120976805 93938096 72286832 58611870 51713270
19090 51713270 50689811 55596017 67811557 89263689 117434677 140268869 150485192
19083 150485192 152504804 153844202 151460987 136551355 110321666 81158385 58224981
19076 58224981 42534955 32128028 25201588 20466248 17072988 14597583 12762340 11279540
19068 11279540 9981281 8804063 7865811 7105558 6428331 5877650 5469364 5204138 5057860
$$ packed form
19122E361028N9001K8207P0046J33590K29474L61261N31762P04846Q70450J046163
19112I395828J263017J546117J838346K196143K851572L950992N779240Q872326
19104C7693581J4074211K1914368K9173663K6350565J4299342N090579L416872
19097A52013181J365715j0200812k2201279k7038709k1651264j3674962o898600
19090E1713270j023459M906206J2215540K1452132K8170988K2834192J0216323
19083A50485192K019612J339398k383215j4909632k6229689k9163281k2933404
19076E8224981j5690026j0406927o926440m735340l393260k475405j835243j482800
19068A1279540j298259j177218r38252p60253o77227n50681m08286k65226j46278
$$ plain form
19059 5057860 5013272 4984959 4889665 4740409 4581313 4392886 4124210 3805284 3456063 3153343
19049 3153343 2935175 2784490 2681137 2603550 2582410 2563204 2538908 2552425 2562585 2531291 2475128
19038 2475128 2427274 2383296 2344096 2311156 2284056 2264501 2244404 2218713 2186232 2157018 2134935
19027 2134935 2128861 2117374 2111291 2068982 2028230 1999823 1973342 1952336 1953991 1920384 1864209 1776035
19015 1776035 1698413 1633494 1629637 1619153 1623929 1599575 1593404 1597845 1624617 1654982 1710049 1778103
19003 1778103 1820971 1880172 1952231 2010697 2115092 2238307 2444792 2651953 2923692 3225781
18993 3225781 3552254 3857269 4109819 4297741 4438709 4457873 4375199 4193319 3989268 3795747
18983 3795747 3612832 3448845 3362415 3403451 3556956 3775791 4015041 4256399 4445439 4592233
$$ packed form
19059E057860m4588k8313r5294j49256j59096j88427k68676l18926l49221l02720
19049C153343k18168j50685j03353p7587k1140j9206k4296J3517J0160l1294n6163
19038B475128m7854m3978l9200l2940k7100j9555k0097k5691l2481k9214k2083
19027B134935o074j1487o083m2309m0752k8407k6481k1006J655l3607n6175q8174
19015A776035p7622o4919l857j0484M776k4354o171M441K6772L0365N5067O8054
19003A778103M2868N9201P2059N8466J04395J23215K06485K07161K71739L02089
18993C225781L26473L05015K52550J87922J40968J9164q2674j81880k04051j93521
18983C795747j82915j63987q6430M1036J53505K18835K39250K41358J89040J46794
$$ plain form
18973 4592233 4624425 4535527 4340051 4045908 3686080 3306035 2914194 2577884 2314884 2117960
18963 2117960 1955766 1837530 1745369 1683121 1639491 1596327 1534360 1496855 1470490 1431726 1358434
18952 1358434 1295334 1266937 1228099 1153792 1084513 994213 948501 948270 943383 951302 926635 917079
18940 917079 950421 1015931 1031779 1024031 1034529 1037532 1052955 1085057 1071645 1018678 980150 959591
18928 959591 912474 869683 837029 823020 831916 891021 942225 958507 979580 1000540 996051 1021265
18916 1021265 1043261 1043640 1037078 1034134 1024762 1020350 1018177 1022821 1037038 1034928 1041544 1036708 1043080 1039555
18902 1039555 1024515 1012618 993081 962557 935113 914309 882381 873791 901236 900701 857558 814860
18890 814860 790657 774576 787560 814373 824306 812251 847432 896708 906998 914086 929891 938669
$$ packed form
18973D592233L2192q8898j95476k94143l59828l80045l91841l36310k63000j96924
18963B117960j62194j18236r2161o2248m3630m3164o1967l7505k6365l8764p3292
18952A358434o3100k8397l8838p4307o9279r0300m5712k31m887P919k4667r556
18940I17079L3342O5510J5848p748J0498L003J5423L2102j3412n2967l8528k0559
18928I59591m7117m2791l2654j4009Q896N9105N1204J6282K1073K0960m489K5214
18916A021265K1996L79o562k944r372m412k173M644J4217k110O616m836O372l525
18902A039555j5040j1897j9537l0524k7444k0804l1928q590K7445n35m3143m2698
18890H14860k4203j6081J2984K6813R933j2055L5181M9276J0290P088J5805Q778
$$ plain form
18878 938669 961594 997200 1009675 1018068 1049264 1105035 1131202 1179676 1196529 1194301 1230499 1241656
18866 1241656 1266973 1318418 1365191 1396281 1421359 1457638 1485752 1522241 1536190 1550159 1552626
18855 1552626 1545507 1565846 1593861 1610924 1634318 1666657 1698542 1753790 1788690 1816017 1865641
18844 1865641 1918604 2014401 2097038 2181336 2284270 2394928 2538512 2714413 2854018 2948965
18834 2948965 3055350 3185250 3356915 3557144 3769529 3984956 4212620 4368284 4482933
18825 4482933 4584079 4715421 4857002 5015692 5218278 5454793 5745705 6080672 6377660
18816 6377660 6619955 6773605 6854240 6911754 7014826 7139763 7268933 7484477 7782443 8145383
18806 8145383 8629608 9233445 9923274 10671213 11538295 12569119 13847179 15450150 17432794
$$ packed form
18878I38669K2925L5606J2475Q393L1196N5771K6167M8474J6853k228L6198J1157
18866A241656K5317N1445M6773L1090K5078L6279K8114L6489J3949J3969K467
18855A552626p119K0339K8015J7063K3394L2339L1885N5248L4900K7327M9624
18844A865641N2963R5797Q2637Q4298J02934J10658J43584J75901J39605R4947
18834B948965J06385J29900J71665K00229K12385K15427K27664J55664J14649
18825D482933J01146J31342J41581J58690K02586K36515K90912L34967K96988
18816F377660K42295J53650Q0635N7514J03072J24937J29170K15544K97966L62940
18806H145383M84225O03837O89829P47939Q67082J030824J278060J602971J982644
$$ plain form
18797 17432794 20012813 23503859 28289204 35032510 44671887 58298484 76595195 98223237
18789 98223237 118859203 133996116 142954716 147628941 148469041 143788570 133752150 122251524
18781 122251524 114805275 115069530 123258975 135688816 146331126 151605652 152028019 148893509
18773 148893509 140920913 126379235 106670107 85906398 67905726 53923870 43610473
18766 43610473 36079825 30442397 26129205 22741400 20074676 17926828 16156338 14720018
18758 14720018 13534167 12576150 11808647 11144556 10602500 10160289 9829940 9596871 9426467
18749 9426467 9307097 9261987 9287472 9414820 9612863 9889739 10225535 10654344 11141371 11738227
18739 11738227 12455315 13362933 14605937 16301705 18658202 21950298 26289913 31589795
$$ packed form
18797A7432794K580019L491046M785345O743306R639377J3626597J8296711K1628042
18789I8223237K0635966J5136913Q958600M674225Q40100m680471j0036420j1500626
18781A22251524p446249K64255Q189445J2429841J0642310N274526M22367l134510
18773A48893509p972596j4541678j9709128k0763709j8000672j3981856j0313397
18766D3610473p530648n637428m313192l387805k666724k147848j770490j436320
18758A4720018j185851r58017p67503o64091n42056m42211l30349k33069j70404
18749I426467j19370m5110K5485J27348J98043K76876L35796M28809M87027N96856
18739A1738227P17088R07618J243004J695768K356497L292096M339615N299882
$$ plain form
18731 31589795 37602172 44339696 51774852 59233645 65644331 70695259 74937259 78527315
18723 78527315 81222743 83121541 85137229 88512822 93828857 100496789 107156533 113347220
18715 113347220 119530971 125222153 128557217 128242476 125406371 121692236 117341337 111996926
18707 111996926 106103598 101052132 97862232 96266262 94914024 92579644 89297024 85289021
18699 85289021 80074228 72966881 64270817 55203788 46665110 38756363 31591719 25461241
18691 25461241 20585945 16925813 14216812 12215279 10668534 9456801 8485581 7725210
18683 7725210 7078934 6520902 6017756 5540829 5113537 4729679 4374134 4058734 3792358
18674 3792358 3545271 3379013 3221864 3064985 2918809 2795162 2698521 2632908 2599397 2581000
$$ packed form
18731C1589795O012377O737524P435156P458793O410686N050928M242000L590056
18723G8527315K695428J898798K015688L375593N316035O667932O659744O190687
18715A13347220O183751N691182L335064l14741k836105l714135m350899n344411
18707A11996926n893328n051466l189900j595970j352238k334380l282620m008003
18699H5289021n214793p107347q696064r067029q538678p908747p164644o130478
18691B5461241m875296l660132k709001k001533j546745j211733r71220p60371
18683G725210o46276n58032n03146m76927m27292l83858l55545l15400k66376
18674C792358k47087j66258j57149j56879j46176j23647r6641o5613l3511j8397
$$ plain form
18664 2581000 2536130 2484624 2427463 2384807 2347091 2336965 2300142 2237492 2168201 2140374 2108616
18653 2108616 2068126 2044528 2009491 1971630 1939546 1894575 1865133 1845168 1816105 1768240 1741987
18642 1741987 1711114 1668784 1658439 1641460 1635150 1629601 1601127 1561611 1542168 1520643 1524011 1505203
18630 1505203 1501124 1543941 1601132 1692845 1759087 1838589 1932889 2035360 2171657 2383044 2637964
18619 2637964 2887112 3062200 3192811 3309445 3462019 3668689 3928072 4153683 4294874
18610 4294874 4337099 4308298 4331046 4406194 4484548 4643657 4867487 5153248 5487880 5758221
18600 5758221 5947668 6076345 6226103 6477598 6847568 7307462 7757466 8265077 8919429
18591 8919429 9869513 11330072 13533792 16739244 21095603 26358988 32075365 37767285
$$ packed form
18664B581000m4870n1506n7161m2656l7716j0126l6823o2650o9291k7827l1758
18653B108616m0490k3598l5037l7861l2084m4971k9442j9965k9063m7865k6253
18642A741987l0873m2330j0345j6979o310n549k8474l9516j9443k1525L368j8808
18630A505203m079M2817N7191R1713O6242P9502R4300J02471J36297K11387K54920
18619B637964K49148J75088J30611J16634J52574K06670K59383K25611J41191
18610D294874M2225k8801K2748P5148P8354J59109K23830K85761L34632K70341
18600E758221J89447J28677J49758K51495L69970M59894M50004N07611O54352
18591H919429R50084J460559K203720L205452M356359N263385N716377N691920
$$ plain form
18583 37767285 42597343 45789951 47489786 48428696 49334020 50457533 51843165 53216009
18575 53216009 53713865 53068349 51652751 50145660 48937069 48272411 48082811 47801014 47114588
18566 47114588 46177737 45366993 44904346 44803841 44902133 44477501 42767587 39604785 35376738
18557 35376738 30748487 26213368 22237745 19104792 16797211 15128857 13958011 13142499
18549 13142499 12573701 12207185 12003764 11934889 11971596 12165819 12602888 13256630 14258453
18540 14258453 15694626 17907007 21240922 26068487 32441123 39902373 47824467 55503403
18532 55503403 61603277 65264263 66982689 67827059 68664079 69864074 71562424 73120005
18524 73120005 73541036 72708436 71250085 69847313 68948568 68792745 68973947 68495247 67050978
$$ packed form
18583C7767285M830058L192608J699835R38910R05324J123513J385632J372844
18575E3216009M97856o45516j415598j507091j208591o64658j89600k81797o86426
18566D7114588r36851q10744m62647j00505R8292m24632j709914l162802m228047
18557C5376738m628251m535119l975623l132953k307581j668354j170846q15512
18549A3142499n68798l66516k03421o8875L6707J94223M37069O53742J001823
18540A4258453J436173K212381L333915M827565O372636P461250P922094P678936
18532E5503403O099874L660986J718426Q44370Q37020J199995J698350J557581
18524G3120005M21031q32600j458351j402772q98745j55823J81202m78700j444269
$$ plain form
18515 67050978 65093756 63298097 61977044 61184970 60626640 59164756 55792701 50473812
18507 50473812 43852514 36833296 30053333 24083641 19314321 15723230 13050107 11043832
18499 11043832 9499485 8308210 7358563 6596768 6038889 5634076 5305357 5037924 4827535
18490 4827535 4667095 4597807 4545116 4447873 4332876 4236162 4141216 4000355 3851049 3676302
18480 3676302 3544052 3436882 3343601 3256601 3124267 3002876 2912913 2856826 2830795 2827174 2896300
18469 2896300 3022218 3202712 3422077 3634750 3765145 3764574 3658793 3622983 3691156 3849134
18459 3849134 3983688 3952905 3747019 3449844 3187083 2997747 2803063 2669712 2578203 2516643
18449 2516643 2464381 2416287 2366075 2329856 2294288 2272654 2265557 2329757 2422443 2520108 2564712
$$ packed form
18515F7050978j957222j795659j321053p92074n58330j461884l372055n318889
18507E0473812o621298p019218o779963n969692m769320l591091k673123k006275
18499A1043832j544347j191275r49647p61795n57879m04813l28719k67433k10389
18490D827535j60440o9288n2691r7243j14997r6714r4946j40861j49306j74747
18480C676302j32250j07170r3281q7000j32334j21391q9963n6087k6031l621O9126
18469B896300J25918J80494K19365K12673J30395n71j05781l5810O8173J57978
18459C849134J34554l0783k05886k97175k62761j89336j94684j33351r1509o1560
18449B516643n2262m8094n0212l6219l5568k1634p097O4200R2686R7665M4604
$$ plain form
18438 2564712 2566525 2558110 2554058 2574843 2589661 2628116 2710994 2798910 2856628 2901199 2971241 3038238
18426 3038238 3123610 3196471 3225622 3221967 3201697 3175124 3092302 2926911 2702052 2453041 2266550
18415 2266550 2112907 1983052 1919573 1900475 1878419 1819296 1783503 1784847 1776955 1760596 1718893
18404 1718893 1652037 1576524 1536765 1534534 1510996 1489119 1485926 1478940 1476416 1445591 1413680 1369845
18392 1369845 1321802 1292585 1281888 1271861 1269638 1268449 1307347 1373399 1397546 1416526 1435879 1437031
18380 1437031 1416990 1414563 1397429 1370933 1376094 1375496 1359677 1367849 1389057 1371336 1357698 1337671
18368 1337671 1355857 1399450 1446194 1531876 1653532 1822605 2008819 2186835 2335416 2478665
18358 2478665 2605411 2709004 2782693 2831413 2862850 2907472 2968506 2999115 3024901 3065712 3112534
$$ packed form
18438B564712J813q415m052K0785J4818L8455Q2878Q7916N7718M4571P0042O6997
18426C038238Q5372P2861K9151l655k0270k6573q2822j65391k24859k49011j86491
18415B266550j53643j29855o3479j9098k2056n9123l5793J344p892j6359m1703
18404A718893o6856p5513l9759k231k3538k1877l193o986k524l0825l1911m3835
18392A369845m8043k9217j0697j0027k223j189L8898O6052K4147J8980J9353J152
18380A437031k0041k427j7134k6496N161n98j5819Q172K1208j7721j3638k0027
18368A337671J8186M3593M6744Q5682J21656J69073J86214J78016J48581J43249
18358B478665J26746J03593P3689M8720L1437M4622O1034L0609K5786M0811M6822
$$ plain form
18347 3112534 3138999 3195962 3324939 3451830 3647680 3880660 4148840 4502594 4974331 5582538
18337 5582538 6403230 7527783 9048407 11190951 14356575 19054153 25977671 35795559
18329 35795559 48256835 61577118 72892040 80013717 81775221 77896187 69094539 57202960
18321 57202960 44974328 34678322 27079052 21949347 18640679 16519416 15069972 14010505
18313 14010505 13156791 12374602 11646951 10928390 10295077 9768918 9383150 9079196 8909139
18304 8909139 8843308 8802381 8750547 8734234 8747948 8733586 8700810 8663133 8677524 8767030 8918415
18293 8918415 9156200 9540492 10105286 10931966 12110867 13795906 16164404 19558765 24461280
18284 24461280 31647913 42277598 57505647 77343331 99937287 121647463 139197742
$$ packed form
18347C112534K6465N6963J28977J26891J95850K32980K68180L53754M71737O08207
18337E582538Q20692J124553J520624K142544L165624M697578O923518R817888
18329C5795559J2461276J3320283J1314922P121677J761504l879034q801648j1891579
18321E7202960j2228632j0296006p599270n129705l308668k121263j449444j059467
18313A4010505q53714p82189p27651p18561o33313n26159l85768l03954j70057
18304H909139o5831m0927n1834j6313J3714j4362l2776l7677J4391Q9506J51385
18293H918415K37785L84292N64794Q26680J178901J685039K368498L394361M902515
18284B4461280P186633J0629685J5228049J9837684K2593956K1710176J7550279
$$ plain form
18277 139197742 149607830 150593818 142013743 125907502 105834133 85340439 66756902
18270 66756902 51607478 40302372 32324104 26890983 23154189 20437345 18388047 16785069
18262 16785069 15363652 14010800 12749150 11603731 10643490 9902649 9314563 8890158 8594582
18253 8594582 8389527 8252984 8158322 8081514 8007986 7948778 7899562 7912153 8054939 8370314
18243 8370314 8862961 9500336 10222029 11042494 11955051 12853679 13828668 15077287 16963078
18234 16963078 19982624 24807821 32269813 42840169 55781786 68875077 79253105
18227 79253105 85068417 85355829 79922279 69696878 56838230 44237122 33867374 26332464
18219 26332464 21316335 18158544 16338922 15516288 15483214 16052529 16966319 18054832 19076605
$$ packed form
18277A39197742J0410088R85988q580075j6106241k0073369k0493694j8583537
18270F6756902j5149424j1305106p978268n433121l736794k716844k049298j602978
18262A6785069j421417j352852j261650j145419r60241p40841n88086m24405k95576
18253H594582k05055j36543r4662p6808p3528n9208m9216J2591J42786L15375
18243H370314M92647O37375P21693Q20465R12557Q98628R74989J248619J885791
18234A6963078L019546M825197P461992J0570356J2941617J3093291J0378028
18227G9253105N815312K87412n433550j0225401j2858648j2601108j0369748p534910
18219B6332464n016129l157791j819622q22634l3074N69315R13790J088513J021773
$$ plain form
18210 19076605 19607133 19126920 17709068 15847419 14056586 12568870 11344810 10323162
18202 10323162 9629751 9186412 8910995 8726874 8594245 8474927 8342422 8164449 7933879
18193 7933879 7716720 7508474 7312253 7143439 6998303 6941963 6910453 6876276 6741502 6462482
18183 6462482 6075458 5651600 5265394 4877805 4491601 4128679 3787577 3507416 3280561
18174 3280561 3107060 2941015 2817512 2733486 2668757 2637448 2666095 2790596 2986336 3204718
18164 3204718 3421687 3569014 3602961 3531938 3429542 3346099 3282039 3293754 3338763 3443602
18154 3443602 3579200 3778352 3966862 4136938 4246177 4267991 4243442 4175315 4069269 3972910
18144 3972910 3925538 3939924 3960628 3979209 3923258 3839827 3706177 3566095 3440991 3312328
$$ packed form
18210A9076605N30528m80213j417852j861649j790833j487716j224060j021648
18202A0323162o93411m43339k75417j84121j32629j19318j32505j77973k30570
18193G933879k17159k08246j96221j68814j45136n6340l1510l4177j34774k79020
18183F462482l87024m23858l86206l87589l86204l62922l41102k80161k26855
18174C280561j73501j66045j23503q4026o4729l1309K8647J24501J95740K18382
18164C204718K16969J47327L3947p1023j02396q3443o4060J1715M5009J04839
18154C443602J35598J99152J88510J70076J09239K1814k4549o8127j06046r6359
18144C972910m7372J4386K0704J8581n5951q3431j33650j40082j25104j28663
$$ plain form
18134 3312328 3201742 3110133 3042786 2977728 2946230 2920909 2878798 2816904 2715538 2584941 2483364
18123 2483364 2472939 2528773 2639487 2813372 3026664 3323628 3753880 4351903 5112715 6065017
18113 6065017 7399557 9479359 12970556 19174233 30397650 47179759 58221701 55996320
18105 55996320 43647336 29079256 19751716 14143619 10734086 8677402 7363055 6463053
18097 6463053 5898548 5562275 5362068 5278980 5353728 5571360 5830468 6173460 6546525 6937447
18087 6937447 7330710 7707869 8113074 8548205 8964336 9387399 9877024 10406481 10979513
18078 10979513 11705374 12656022 13914422 15616202 18027458 21441339 26017990 31388471
18070 31388471 36856731 42312640 48408764 55187539 61312555 66057238 69972657 74059015
$$ packed form
18134C312328j10586r1609o7347o5058l1498k5321m2111o1894j01366j30597j01577
18123B483364j0425N5834J10714J73885K13292K96964M30252N98023P60812R52302
18113F065017J334540K079802L491197O203677J1223417J6782109J1041942k225381
18105E5996320j2348984j4568080r327540n608097l409533k056684j314347r00002
18097F463053n64505l36273k00207q3088P4748K17632K59108L42992L73065L90922
18087F937447L93263L77159M05205M35131M16131M23063M89625N29457N73032
18078A0979513P25861R50648J258400J701780K411256L413881M576651N370481
18070C1388471N468260N455909O096124O778775O125016M744683L915419M086358
$$ plain form
18062 74059015 78622426 83338565 87856001 91243321 92897336 93308155 92493649 90314789
18054 90314789 86724045 82074837 77054945 72236947 68290094 64553245 59683112 53535264
18046 53535264 47066441 41276220 35893946 30515784 25382210 21064856 17834823 15498032
18038 15498032 13828282 12661957 11873477 11346554 11026516 10834241 10764349 10814680 10983870
18029 10983870 11317713 11886770 12753368 14106142 16170722 19048137 22549406 26169567
18021 26169567 29786462 33798110 38352087 42484078 45554036 47968026 50472521 53401859
18013 53401859 56505472 59428982 61621825 62777116 63230442 62806494 61335899 58790849
18005 58790849 55510826 52022760 48602239 45666378 42951794 39498669 35200059 30655742
$$ packed form
18062G4059015M563411M716139M517436L387320J654015M10819q14506k178860
18054I0314789l590744m649208n019892m817998l946853l736849m870133o147848
18046E3535264o468823n790221n382274n378162n133574m317354l230033k336791
18038A5498032j669750j166325p88480n26923l20038j92275o9892N0331J69190
18029A0983870L33843N69057Q66598J352774K064580K877415L501269L620161
18021B6169567L616895M011648M553977M131991L069958K413990K504495K929338
18013E3401859L103613K923510K192843J155291M53326m23948j470595k545050
18005E8790849l280023l488066l420521k935861k714584l453125m298610m544317
$$ plain form
17997 30655742 26561389 22747474 18890752 15255098 12156765 9768582 8022014 6784344
17989 6784344 5904052 5215777 4683069 4243926 3884083 3577040 3301732 3037127 2812165
17980 2812165 2591317 2396854 2213566 2071530 1927226 1786635 1681282 1595510 1489162 1410206
17970 1410206 1354776 1277326 1241244 1218742 1192428 1153820 1093154 1053248 1015077 1004828 977483
17959 977483 919293 876982 841303 802003 752606 700772 654433 630977 609550 601909 616314 609153
17947 609153 609516 609461 590942 587411 606199 619268 633468 648628 643330 620128 643343 678980 702795
17934 702795 697980 645986 607181 596966 571489 575303 569661 550377 536258 510086 505940 505691 499204
17921 499204 492045 486137 461453 439580 422039 423920 442016 428047 400159 376457 376307 365185
$$ packed form
17997C0655742m094353l813915l856722l635654l098333k388183j746568j237670
17989F784344q80292o88275n32708m39143l59843l07043k75308k64605k24962
17980B812165k20848j94463j83288j42036j44304j40591j05353q5772j06348p8956
17970A410206n5430p7450l6082k2502k6314l8608o0666l9906l8171j0249k7345
17959I77483n8190m2311l5679l9300m9397n1834m6339k3456k1427p641J4405p161
17947F09153L63n5j8519l531J8788J3069J4200J5160n298k3202K3215L5637K3815
17934G02795m815n1994l8805j0215k5477L814n642j9284j4119k6172m146k49o487
17921D99204p159n908k4684k1873j7541J881J8096j3969k7888k3702j50j1122
$$ plain form
17909 365185 315837 278418 267425 289299 273404 243880 222377 224211 240892 216330 203041 219717
17897 219717 211639 213245 250385 280816 295864 308284 305237 327133 379803 417177 422327 426824
17885 426824 443457 421241 392013 393210 422572 460874 470195 467922 449829 422152 401915 385032
17873 385032 368838 379363 350563 338340 331886 345771 323146 297122 252192 216905 197608 189723
17861 189723 200054 199677 186594 179258 190403 203271 215076 201192 211520 245541 289528 308806
17849 308806 346042 364336 386270 444134 503750 558223 613526 644216 708266 741586 727273
17838 727273 710430 711918 720497 726911 730966 694877 671394 658641 633810 603997 558526 539294
17826 539294 511004 469873 432779 384768 335384 331929 335062 337555 348665 351454 389766 447568
$$ packed form
17909C65185m9348l7419j0993K1874j5895k9524k1503J834J6681k4562j3289J6676
17897B19717q078J606L7140L0431J5048J2420l047K1896N2670L7374N150M497
17885D26824J6633k2216k9228J197K9362L8302R321k273j8093k7677k0237j6883
17873C85032j6194J0525k8800j2223o454J3885k2625k6024m4930l5287j9297p885
17861A89723J0331l77j3083p336J1145J2868J1805j3884J0328L4021M3987J9278
17849C08806L7236J8294K1934N7864N9616N4473N5303L0690O4050L3320j4313
17838G27273j6843J488Q579O414M055l6089k3483j2753k4831k9813m5471j9232
17826E39294k8290m1131l7094m8011m9384l455L133K493J1110K789L8312N7802
$$ plain form
17814 447568 499858 568723 660486 747983 776773 776877 752289 693241 614378 565420 525957 515090
17802 515090 480927 445505 450215 472001 488198 495108 524391 551364 569212 614615 627652 622234
17790 622234 603383 598514 607040 592931 593595 602998 620755 603106 573992 577509 544353 489896 433164
17777 433164 397680 351176 321340 289941 277884 281048 257006 221278 232519 270336 319586 379261
17765 379261 469896 579680 686459 797009 879248 942607 955059 885593 783672 694686 592277
17754 592277 482808 402985 338145 291105 289135 280544 255022 256354 272829 277054 282929 290964
17742 290964 275223 264335 280196 284263 288550 284671 257737 272328 282982 269597 252481 253693
17730 253693 247650 255126 266246 277829 292950 308745 353493 413639 479394 533295 581869 625317
$$ packed form
17814D47568N2290O8865R1763Q7497K8790J04k4588n9048p8863m8958l9463j0867
17802E15090l4163l5422M710K1786J6197O910K9283K6973J7848M5403J3037n418
17790F22234j8851m869Q526j4109O64R403J7757j7649k9114L517l3156n4457n6732
17777D33164l5484m6504k9836l1399j2057L164k4042l5728J1241L7817M9250N9675
17765C79261R0635J09784J06779J10550Q2239O3359J2452o9466j01921q8986j02409
17754E92277j09469p9823o4840m7040j970q591k5522J332J6475M225N875Q035
17742B90964j5741j0888J5861M067M287l879k6934J4591J0654j3385j7116J212
17730B53693o043P476J1120J1583J5121J5795M4748O0146O5755N3901M8574M3448
$$ plain form
17718 625317 661764 701500 741910 818298 867129 896729 937442 1010024 1048508 1046297 1027284 1028101
17706 1028101 996580 978342 977386 959127 968925 931720 883037 847639 815602 806999 812578 798817
17694 798817 769283 773295 723963 656901 604648 564735 541985 498686 464243 449908 405409 396371
17682 396371 383777 391542 386546 383804 368165 364625 351029 353458 401476 461942 546568 637896
17670 637896 740311 894935 1069340 1256496 1411435 1537521 1608543 1634120 1645796 1632190
17660 1632190 1553067 1399366 1201256 1005269 806772 669971 559260 467937 418331 371625
17650 371625 293883 218715 206707 214775 211579 235046 229349 221048 191476 183773 172282 172522 169698
17637 169698 142621 160530 189935 163811 143670 153993 155854 176792 209017 198719 178224 184876
$$ packed form
17718F25317L6447L9736M0410P6388M8831K9600M0713P2582L8484k211j9013Q17
17706A028101l1521j8238r56j8259R798l7205m8683l5398l2037q603N579j3761
17694G98817k9534M012m9332o7062n2253l9913k2750m3299l4443j4335m4499r038
17682C96371j2594P765m996k742j5639l540j3596K429M8018O0466Q4626R1328
17670F37896J02415J54624J74405J87156J54939J26086P1022K5577J1676j3606
17660A632190p9123j53701j98110j95987j98497j36801j10711r1323m9606m6706
17650C71625p7742p5168j2008Q068l196K3467n697q301k9572p703j1491K40k824
17637A69698k7077J7909K9405k6124k0141J0323J861K0938L2225j0298k0495O652
$$ plain form
17625 184876 213928 215370 205664 185696 155466 165826 189436 180663 175406 191426 209579 206369
17613 206369 191887 172400 188481 207542 224757 210338 179756 191267 192775 152022 134397 146577
17601 146577 113549 87672 94369 109943 101843 100407 112631 125441 128341 139799 144876 139565 136862
17588 136862 128318 135606 162221 206497 276157 359514 411279 474948 529151 557366 596539 596020
17576 596020 563797 539187 529219 537276 560239 548914 534757 509929 495971 513950 557594 613398
17564 613398 637685 659679 691778 709706 695617 707088 717764 725089 707650 658972 625788 595109
17552 595109 587403 606088 595018 546660 487769 438702 445432 464155 468425 450942 431320 401864
17540 401864 385836 348300 322438 297262 302550 334437 359991 355008 364116 406262 456568 501250
$$ packed form
17625A84876K9052J442r706j9968l0230J0360K3610q773n257J6020J8153l210
17613B06369j4482j9487J6081J9061J7215j4419l0582J1511J508m0753j7625J2180
17601A46577l3028k5877O697J5574q100j436J2224J2810K900J1458N077n311k703
17588A36862q544P288K6615M4276O9660Q3357N1765O3669N4203K8215L9173n19
17576E96020l2223k4610r968Q057K2963j1325j4157k4828j3958J7979M3644N5804
17564F13398K4287K1994L2099J7928j4089J1471J0676P325j7439m8678l3184l0679
17552E95109p706J8685j1070m8358n8891m9067O730J8723M270j7483j9622k9456
17540D01864j6028l7536k5862k5176N288L1887K5554m983R108M2146N0306M4682
$$ plain form
17528 501250 506391 508497 537021 556547 537763 539970 514264 494180 483035 467730 462625 472897
17516 472897 498009 538069 527978 555888 602938 635439 637806 664709 678177 693881 712203 673430
17504 673430 602771 548882 517988 500917 493877 473492 437464 400325 399144 399868 349637 311177
17492 311177 293173 278252 275135 250572 212660 143140 122789 139328 144134 111303 85975 83644
17480 83644 97062 111118 111407 136053 132266 140883 131677 100917 78707 78341 85015 72710 62798
17467 62798 51857 67109 92686 79405 54123 73030 68085 57400 61875 49584 79161 90916
17455 90916 77534 66656 48077 52872 67279 71764 47679 43243 57721 72025 87515 120784
17443 120784 114647 174580 286072 368514 348737 284287 211336 180840 133512 135664 146046 106362
$$ packed form
17528E01250N141K106K8524J9526j8784K207k5706k0084j1145j5305n105J0272
17516D72897K5112M0060j0091K7910M7050L2501K367K6903J3468J5704J8322l8773
17504F73430p0659n3889l0894j7071p040k0385l6028l7139j181P24n0231l8460
17492C11177j8004j4921l117k4563l7912o9520k0351J6539M806l2831k5328k331
17480H3644J3418J4056K89K4646l787Q617r206l0760k2210l66O674j2305r912
17467F2798j0941J5252K5577j3281k5282J8907m945j0685M475j2291K9577J1755
17455I0916j3382j0878j8579M795J4407M485k4085m436J4478J4304J5490L3269
17443A20784o137N9933J11492Q2442j9777o4450p2951l0496m7328K152J0382l9684
$$ plain form
17431 106362 97402 96502 97883 101137 83963 89121 79140 68072 77431 56434 41100 47774 64121
17418 64121 67371 80700 90203 78985 92403 90443 75532 67476 73856 82933 36921 35715 68090
17405 68090 62923 58095 83569 86894 71147 45276 25916 24050 63268 66582 60965 86203 94326
17392 94326 108784 97242 91794 92150 118239 150912 161957 169180 212900 248108 270442 345818
17380 345818 447715 534171 606854 626066 554804 471823 384005 326636 346943 389916 428039
17369 428039 520141 637980 727231 766954 791248 816974 807709 758961 677663 559741 448795
17358 448795 376245 352122 335800 362815 416115 487470 563630 620088 636019 545223 417947
17347 417947 302348 238243 214807 166632 126780 132033 150576 167908 170526 132152 100123 101469
$$ packed form
17431A06362q960r00J381L254j7174N158r981j1068R359k0997j5334O674J6347
17418F4121L250J3329R503j1218J3418j960j4911q056O380R077m6012j206L2375
17405F8090n167m828K5474L325j5747k5871j9360j866L9218L314n617K5238Q123
17392I4326J4458j1542n448L56K6089L2673J1045P223M3720L5208K2334P5376
17380C45818J01897Q6456P2683J9212p1262q2981q7818n7369K0307M2973L8123
17369D28039R2102J17839Q9251L9723K4294K5726r265m8748q1298j17922j10946
17358D48795p2550k4123j6322K7015N3300P1355P6160N6458J5931r0796j27276
17347D17947j15599o4105k3436m8175l9852N253J8543J7332K618l8374l2029J346
$$ plain form
17335 101469 86253 130687 177006 164926 178006 188128 196002 200955 200071 202831 185659 139033
17323 139033 96394 97993 91228 90883 110518 122481 117004 107780 97716 72941 84730 97973 109021
17310 109021 105785 108180 124415 128143 97917 90413 60608 50593 85591 97282 88686 66441
17298 66441 44328 45726 39341 25562 38485 56914 75824 68503 63837 73858 82830 66090 63058
17285 63058 57844 75430 83674 68598 38779 53174 38436 56799 57034 49070 59053 69363 56231
17272 56231 78638 73939 52264 32085 33837 71739 101272 102164 89692 72777 68306 76658 88681
17259 88681 98351 97681 112334 115002 85456 98567 91925 98974 111633 144657 124875 118932 113258
17246 113258 100182 78574 56824 65364 116024 124711 131742 125514 109422 69000 82313 88153
$$ packed form
17335A01469j5216M4434M6319j2080J3080J0122P874M953q84K760j7172m6626
17323A39033m2639J599o765l45J9635J1963n477r224j0064k4775J1789J3243J1048
17310A09021l236K395J6235L728l0226p504k9805j0015L4998J1691q596k2245
17298F6441k2113J398o385j3779J2923J8429J8910p321m666J0021Q972j6740l032
17285F3058n214J7586Q244j5076k9819J4395j4738J8363K35p964R983J0310j3132
17272E6231K2407m699k1675k0179J752L7902K9533Q92j2472j6915m471Q352J2023
17259H8681R670o70J4653K668k9546J3111o642P049J2659L3024j9782n943n674
17246A13258j3076k1608k1750Q540N0660Q687P031o228j6092m0422J3313N840
$$ plain form
17234 88153 76512 60183 72695 70053 58767 47549 45469 36461 39361 43552 15289 -17149 -15148
17221 -15148 -5814 34997 45944 39959 19300 31209 73694 69714 57744 48700 69458 71551 46053
17208 46053 43260 39449 43594 46886 51670 49416 63353 83467 95254 93521 109976 125016 137330
17195 137330 141769 126156 96568 90823 75487 71075 91262 107983 128083 119932 108609 91236
17183 91236 71662 64286 75048 102124 130580 108714 75855 67239 74022 69758 60493 58157 79580
17170 79580 81010 74155 60675 67346 79665 69494 59707 78743 100449 112749 85490 76865 74877
17157 74877 69134 85183 96105 88545 111739 124482 139358 137205 141955 161933 143479 145567 134372
17144 134372 111288 91313 121988 141116 125675 104225 84441 79893 84587 100620 90547 62305
$$ packed form
17234H8153j1641j6329J2512k642j1286j1218k080r008K900M191k8263l2438K001
17221a5148R334M0811J0947n985k0659J1909M2485l980j1970r044K0758K093k5498
17208D6053k793l811M145L292M784k254J3937K0114J1787j733J6455J5040J2314
17195A37330M439j5613k9588n745j5336m412K0187J6721K0100q151j1323j7373
17183I1236j9574p376J0762K7076K8456k1866l2859q616O783m264r265k336K1423
17170G9580J430o855j3480O671J2319j0171r787J9036K1706J2300k7259q625j988
17157G4877n743J6049J0922p560K3194J2743J4876k153M750J9978j8454K088j1195
17144A34372k3084j9975L0675J9128j5441k1450j9784m548M694J6033j0073k8242
$$ plain form
17132 62305 80209 102357 97533 98885 120812 99029 105252 105209 98860 93817 92414 79568 84675 82680
17118 82680 112081 126173 103054 91474 105250 109470 114655 98090 114935 131350 120714 104234
17106 104234 129194 159761 129560 96136 101977 111717 101759 116307 121250 137992 145093 102686
17094 102686 94692 100415 89157 118139 121013 130506 140135 125813 100346 83474 93863 133762
17082 133762 173708 172475 166322 147862 135680 133596 122666 133455 135087 155169 186679 167346
17070 167346 140972 125703 149313 192788 194593 169995 163404 143363 137630 124789 143504 166882
17058 166882 193655 198206 172379 148880 134779 135549 152021 153928 164267 165772 165960 189693 168519
17045 168519 141823 162049 180954 184965 193949 188847 174622 171758 165335 164525 156681 181560 184252
$$ packed form
17132F2305J7904K2148m824J352K1927k1783O223m3o349n043j403j2846N107j995
17118H2680K9401J4092k3119j1580J3776M220N185j6565J6845J6415j0636j6480
17106A04234K4960L0567l0201l3424N841R740r958J4548M943J6742P101m2407
17094A02686p994N723j1258K8982K874R493R629j4322k5467j6872J0389L9899
17082A33762L9946j233o153j8460j2182k084j0930J0789J632K0082L1510j9333
17070A67346k6374j5269K3610M3475J805k4598o591k0041n733j2841J8715K3378
17058A66882K6773M551k5827k3499j4101P70J6472J907J0339J505J88K3733k1174
17045A68519k6696K0226J8905M011Q984n102j4225k864o423q10p844K4879K692
$$ plain form
17032 184252 184809 167811 133594 118066 121824 137962 121069 116009 132621 124806 121857 149682 186316
17019 186316 205083 204342 191881 165296 154328 156498 155527 164717 150000 136132 146686 152877 156912
17006 156912 164111 140230 160913 175177 182998 193716 180043 157782 160294 160165 180787 194110
16994 194110 197204 181343 184571 190122 173230 185318 217332 221837 242529 266589 281757 267261
16982 267261 239344 219927 204481 194316 222249 244998 267394 323440 385392 372778 323318
16971 323318 280112 239440 193039 189066 237137 261223 307774 364785 392959 421283 434188 467848
16959 467848 455729 460533 456241 430868 392897 370872 357207 397860 397597 406328 455565 525311
16947 525311 554446 534463 516066 483238 458240 390646 356644 370407 408037 441586 464885
$$ packed form
17032A84252N57j6998l4217j5528L758J6138j6893n060J6612p815k949K7825L6634
17019A86316J8767p41j2461k6585j0968K170r71R190j4717j3868J0554O191M035
17006A56912P199k3881K0683J4264P821J0718j3673k2261K512j29K0622J3323
16994A94110L094j5861L228N551j6892J2088L2014M505K0692K4060J5168j4496
16982B67261k7917j9417j5446j0165K7933K2749K2396N6046O1952j2614m9460
16971C23318m3206m0672m6401l973M8071K4086M6551N7011K8174K8324J2905L3660
16959D67848j2119M804m292k5373l7971k2025j3665M0653k63Q731M9237O9746
16947E25311K9135j9983j8397l2828k4998o7594l4002J3763L7630L3549K3299
$$ plain form
16936 464885 465784 487234 506770 507621 520456 526397 546317 553336 529137 476762 434900 437133 431358
16923 431358 445701 463494 477983 520634 512170 517008 525801 534300 505950 486782 471265 453401
16911 453401 458045 453519 468547 482824 483719 494082 519997 560751 585966 587881 604764 686590
16899 686590 796168 929813 1106664 1279938 1415278 1423758 1336346 1215836 1084406 953307
16889 953307 901139 877691 837759 869829 947415 1016489 1130849 1294010 1500697 1799425 2127417
16878 2127417 2384992 2406121 2194420 1900208 1682369 1501129 1393237 1340764 1313940 1297507
16868 1297507 1329027 1391158 1485875 1607825 1756756 1922774 2102689 2268229 2355492 2354446
16858 2354446 2293288 2244426 2295638 2369371 2476014 2628020 2775495 2925354 3050010 3171904
$$ packed form
16936D64885Q99K1450J9536Q51J2835N941J9920P019k4199n2375m1862K233n775
16923D31358J4343J7793J4489M2651q464M838Q793Q499k8350j9168j5517j7864
16911D53401M644m526J5028J4277Q95J0363K5915M0754K5215J915J6883Q1826
16899F86590J09578J33645J76851J73274J35340Q480q7412j20510j31430j31099
16889I53307n2168k3448l9932L2070P7586O9074J14360J63161K06687K98728L27992
16878B127417K57575K1129k11701k94212k17839j81240j07892n2473k6824j6433
16868A297507L1520O2131R4717J21950J48931J66018J79915J65540Q7263j046
16858B354446o1158m8862N1212P3733J06643J52006J47475J49859J24656J21894
$$ plain form
16848 3171904 3337898 3539348 3702345 3835234 3950915 4072392 4265028 4502495 4778418
16839 4778418 5144247 5565063 6026840 6486718 6906907 7270456 7631254 8073698 8639293
16830 8639293 9357585 10344455 11700496 13601413 16198076 19879534 25229687 33452989
16822 33452989 46285327 65463844 89085875 107101871 109798808 97718245 78959557
16815 78959557 63050651 53276439 49344190 50938430 58493074 73339769 95850219 120579390
16807 120579390 137115793 142652274 143175191 144911409 143266135 130955818 109107582 85326010
16799 85326010 66904020 55306024 49661602 49469426 55196007 67855943 86609612 103557517
16791 103557517 107499307 96148429 75658105 55678371 40713138 30385423 23391565
$$ packed form
16848C171904J65994K01450J62997J32889J15681J21477J92636K37467K75923
16839D778418L65829M20816M61777M59878M20189L63549L60798M42444N65595
16830H639293P18292R86870J356041J900917K596663L681458N350153Q223302
16822C3452989J2832338J9178517K3622031J8015996K696937j2080563j8758688
16815G8959557j5908906r774212l932249J594240P554644J4846695K2510450K4729171
16807A20579390J6536403N536481N22917J736218j645274j2310317k1848236k3781572
16799H5326010j8421990j1597996n644422j92176N726581J2659936J8753669J6947905
16791A03557517L941790j1350878k0490324j9979734j4965233j0327715o993858
$$ plain form
16784 23391565 18594034 15234886 12800346 10940843 9609771 8700248 8130115 7744044
16776 7744044 7477575 7317805 7253762 7269066 7273411 7150082 6902465 6583569 6253871 5895269
16766 5895269 5552468 5270340 5118994 5092444 5187065 5341289 5441130 5509643 5552599 5559525 5493485
16755 5493485 5380488 5187982 4921706 4617098 4287129 3963941 3658833 3425614 3278121
16746 3278121 3203834 3188396 3217281 3233720 3205369 3085354 2872131 2613434 2309067 2021791
16736 2021791 1772386 1557135 1416596 1292493 1142175 1066434 1015556 944504 891824 821996
16726 821996 751824 709029 693099 671476 629503 586496 539430 553388 529921 515842 515510 488049
16714 488049 466597 454079 438945 411854 361850 342350 325790 308143 288983 269683 276439 288205
$$ packed form
16784B3391565m797531l359148k434540j859503j331072r09523n70133l86071
16776G744044k66469j59770o4043J5304M345j23329k47617l18896l29698l58602
16766E895269l42801k82128j51346k6550R4621J54224R9841O8513M2956O926o6040
16755E493485j12997j92506k66276l04608l29969l23188l05108k33219j47493
16746C278121p4287j5438K8885J6439k8351j20015k13223k58697l04367k87276
16736B021791k49405k15251j40539j24103j50318p5741n0878p1052n2680o9828
16726H21996p0172m2795j5930k1623m1973m3007m7066J3958k3467j4079l32k7461
16714D88049k1452j2518j5134k7091n0004j9500j6560j7647j9160j9300O756J1766
$$ plain form
16702 288205 276168 250716 231683 214469 220568 224224 215323 210209 232812 227545 233120 204161 174730
16689 174730 150900 139601 140346 136107 139935 147365 154160 181064 211030 216006 230913 255711 285121
16676 285121 242629 218817 175400 122856 102129 77419 88030 106778 81941 49620 11887
16665 11887 -19059 -59253 -77257 -106404 -110664 -91150 -82590 -71531 -73850 -79542 -116668 -165583
16653 -165583 -194047 -225021 -273429 -268647 -257841 -270326 -216489 -158988 -108823 -106643 -121748 -134835
16641 -134835 -95856 -73865 -99277 -129178 -150858 -151293 -141414 -112494 -90648 -62833 -40685 -33433
16629 -33433 -28053 450 715 -6238 -32882 -50560 -48989 -45727 -42479 -56927 -32819 -48479 -58082
16616 -58082 -50502 -49164 -39934 -31361 -48084 -53270 -62281 -82117 -75588 -97138 -100887 -98044 -84757
$$ packed form
16702B88205j2037k5452j9033j7214O099L656q901n114K2603n267N575k8959k9431
16689A74730k3830j1299P45m239L828P430O795K6904K9966M976J4907K4798K9410
16676B85121m2492k3812m3417n2544k0727k4710J0611J8748k4837l2321l7733
16665A1887l0946m0194j8004k9147m260J9514Q560J1059k319n692l7126m8915
16653a65583k8464l0974m8408M782J0806j2485N3837N7501N0165K180j5105j3087
16641a34835L8979K1991k5412k9901k1680m35R879K8920K1846K7815K2148P252
16629c3433N380K8503K65o953k6644j7678J571L262L248j4448K4108j5660r603
16616e8082P580J338R230Q573j6723n186r011j9836O529k1550l749K843J3287
$$ plain form
16603 -84757 -78004 -80836 -83269 -82782 -73070 -61971 -53482 -80367 -82111 -82136 -94119 -109474 -75213 -66696
16589 -66696 -76003 -76298 -68956 -62710 -72598 -82225 -75462 -88407 -76964 -52983 -48069 -60947 -67130 -67920
16575 -67920 -67141 -92287 -107359 -118364 -75159 -57735 -64205 -44089 -31464 -24236 -27942 -26656 -53796
16562 -53796 -66015 -82628 -84128 -82388 -53313 -65085 -88058 -92427 -92355 -77705 -66988 -67755 -98841
16549 -98841 -92746 -93659 -94393 -100167 -129180 -144416 -116910 -106408 -85608 -89259 -65781 -47948 -70817
16536 -70817 -79519 -65236 -79685 -104543 -111968 -90285 -60363 -51860 -62052 -100106 -150410 -124872
16524 -124872 -90926 -69009 -114616 -124602 -119042 -127378 -119978 -92365 -88124 -104644 -106342 -107495 -104293
16511 -104293 -102326 -105624 -108362 -100052 -110519 -120714 -114938 -90508 -93513 -78497 -87345 -78444 -54626
$$ packed form
16603h4757O753k832k433M87R712J1099Q489k6885j744k5j1983j5355L4261Q517
16589f6696r307k95P342O246r888r627O763j2945J1443K3981M914j2878o183p90
16575f7920P79k5146j5072j1005M3205J7424o470K0116J2625P228l706J286k7140
16562e3796j2219j6613j500J740K9075j1772k2973m369P2J4650J0717p67l1086
16549i8841O095r13p34n774k9013j5236K7506J0502K0800l651K3478J7833k2869
16536g0817q702J4283j4449k4858p425K1683K9922Q503j0192l8054n0304K5538
16524a24872L3946K1917m5607r986N560q336P400K7613M241j6520j698j153L202
16511a04293J967l298k738Q310j0467j0195N776K4430l005J5016q848Q901K3818
$$ plain form
16498 -54626 -27561 -39000 -38137 -81108 -107077 -105241 -92690 -76584 -72624 -72065 -63499 -71928 -89702
16485 -89702 -115367 -116346 -97503 -59050 -41364 -33767 -19233 -28062 -38769 -50881 -72358 -63507 -44963
16472 -44963 -45619 -50157 -38247 -45622 -37121 -15962 -33423 -61338 -77092 -78884 -65366 -36528 -28389
16459 -28389 -21191 -31065 -67726 -99006 -92135 -85605 -88410 -97721 -61966 -38948 -27950 -28130 -29225
16446 -29225 -52794 -78642 -98675 -96193 -77705 -78472 -70886 -54023 -66173 -63477 -61639 -71148 -112615
16433 -112615 -100378 -92462 -95987 -101798 -115603 -125225 -114985 -95629 -93224 -74895 -73613 -65152 -38511
16420 -38511 -40951 -62787 -68894 -58501 -40847 -49972 -72541 -97122 -70164 -63919 -83451 -93071 -87727
16407 -87727 -69823 -57438 -45269 -40273 -53082 -64338 -72745 -78381 -48230 -34249 -15360 -24817
$$ packed form
16498e4626K7065j1439Q63m2971k5969J836J2551J6106L960N59Q566q429j7774
16485h9702k5665r79J8843L8453J7686P597J4534q829j0707j2112k1477Q851J8544
16472d4963o56m538J1910p375Q501K1159j7461k7915j5754j792J3518K8838Q139
16459b8389P198r874l6661l1280O871O530k805r311L5755K3018J0998j80j095
16446b9225k3569k5848k0033K482J8488p67P586J6863j2150K696J838r509m1467
16433a12615J2237P916l525n811j3805r622J0240J9356K405J8329J282Q461K6641
16420c8511k440k1836o107J0393J7654r125k2569k4581K6958O245j9532r620N344
16407h7727J7904J2385J2169M996j2809j1256q407n636L0151J3981J8889r457
$$ plain form
16395 -24817 -40188 -52047 -78477 -74543 -46420 -36416 -65740 -81647 -65096 -68865 -62685 -25001
16383 -25001 -43369 -77977 -79808 -79224 -101552 -122927 -104563 -101398 -113094 -88869 -93331 -80139 -45808
16370 -45808 -46148 -61875 -63624 -47385 -38472 -38291 -32744 -42084 -32212 -32643 -66720 -61067 -60449 -63246 -57100
16355 -57100 -36727 -24095 -43905 -36600 -47875 -46420 -20247 -1200 14954 20186 24397 37915
16343 37915 10649 -13396 -37301 -29104 -60908 -82359 -99327 -93782 -70540 -58038 -63506 -30514
16331 -30514 -38304 -42023 -33966 -27281 -37212 -40054 -35787 -52024 -62201 -73385 -77771 -84008 -100077
16318 -100077 -105346 -72500 -41792 -28388 -45204 -42200 -7533 -45142 -77548 -58393 -38240 -64774
16306 -64774 -99993 -98022 -84397 -69518 -70221 -66866 -70203 -64464 -71211 -48520 -29173 -19486 -20746
$$ packed form
16395b4817j5371j1859k6430L934K8123J0004k9324j5907J6551l769O180L7684
16383b5001j8368l4608j831N84k2328k1375J8364L165j1696K4225m462J3192L4331
16370d5808l40j5727j749J6239Q913J81N547r340R872m31l4077N653O18k797O146
16355e7100K0373J2632j9810P305j1275J455K6173J9047J6154N232M211J3518
16343C7915k7266k4045k3905Q197l1804k1451j6968N545K3242J2502n468L2992
16331c0514p790l719Q057O685r931k842M267j6237j0177j1184m386o237j6069
16318a00077n269L2846L0708J3404j6816L004L4667l7609l2406J9155K0153k6534
16306f4774l5219J971J3625J4879p03L355l337N739o747K2691J9347R687j260
$$ plain form
16293 -20746 -33202 -55409 -80506 -78892 -81031 -71236 -79932 -71701 -42423 -24150 -41136 -51625 -44963
16280 -44963 -16676 -17135 -38324 -34849 -37179 -36089 -27799 -47019 -47037 -40264 -26711 -13553 -16527 -32602
16266 -32602 -27156 -8132 9645 20344 29085 37179 36306 53905 94334 139108 198452 261741 364320
16253 364320 445367 459791 416695 347738 296234 248474 217646 229717 234731 313764 447873
16242 447873 566904 650718 679897 685405 707486 686038 628852 531191 446504 368678 332203
16231 332203 284108 258707 281198 313894 377301 457615 483513 432835 337485 245857 195315
16220 195315 130621 95546 34883 -10876 -10915 -5503 -7274 -21589 -24206 -32863 -26612 -42642 -41489
16207 -41489 -26355 -34359 -39542 -44293 -33402 -35381 -71397 -60927 -31382 5882 17840 6500
$$ packed form
16293b0746j2456k2207k5097J614k139R795q696Q231K9278J8273j6986j0489O662
16280d4963K8287m59k1189L475k330J090Q290j9220j8O773J3553J3158k974j6075
16266c2602N446J9024J7777J0699Q741Q094q73J7599M0429M4774N9344O3289J02579
16253C64320Q1047J4424m3096o8957n1504m7760l0828J2071N014P9033J34109
16242D47873J19031Q3814K9179N508K2081k1448n7186r7661q4687p7826l6475
16231C32203m8095k5401K2491L2696O3407Q0314K5898n0678r5350r1628n0542
16220A95315o4694l5075o0663m5759l9N412j771j4315k617q657O251j6030J153
16207d1489J5134q004n183m751J0891j979l6016J0470K9545L7264J1958j1340
$$ plain form
16195 6500 -25372 -40486 -33324 -53520 -55181 -42911 -31781 -56664 -58097 -52716 -52010 -43598 -41031
16182 -41031 -35695 -65534 -80415 -91990 -97115 -81822 -53142 -45703 -77892 -80359 -60456 -39014
16170 -39014 -39106 -35877 -39384 -30587 -28857 -19203 -9886 -30119 -46837 -42447 -28167 -35756 -36491 -8285
16156 -8285 20599 9089 6237 3531 -2615 -23903 -45259 -39432 -52341 -66175 -69702 -22572 18397
16143 18397 23789 22463 26564 1025 -40335 -66789 -77370 -61775 -73291 -89926 -84052 -86243 -76236
16130 -76236 -74177 -59234 -40721 -23118 -31672 -44170 -64770 -58457 -61017 -68997 -100048 -120649 -112848
16117 -112848 -61081 -21803 -10191 -13549 -30767 -57143 -68973 -75145 -84976 -96974 -94929 -69149
16105 -69149 -59432 -58207 -59600 -50190 -57484 -43925 -60206 -62275 -58158 -37401 -27077 -38522 -53031
$$ packed form
16195F500l1872j5114P162k0196j661J2270J1130k4883j433N381P06Q412K567
16182d1031N336k9839j4881j1575n125J5293K8680P439l2189k467J9903K1442
16170c9014r2L229l507Q797J730R654R317k0233j6718M390J4280p589p35K8206
16156h285K8884j1510k852k706o146k1288k1356N827j2909j3834l527M7130M0969
16143A8397N392j326M101k5539m1360k6454j0581J5595j1516j6635N874k191J0007
16130g6236K059J4943J8513J7603q554j2498k0600O313k560p980l1051k0601P801
16117a12848N1767L9278J1612l358j7218k6376j1830o172r831j1998K045K5780
16105f9149R717J225j393R410p294J3559j6281k069M117K0757J0324j1445j4509
$$ plain form
16092 -53031 -75940 -79409 -17585 -18683 -36585 -37738 -56091 -76804 -67175 -67721 -68366 -55891 -35217
16079 -35217 -36029 -50752 -58382 -56023 -43466 -40407 -39334 -56363 -47906 -10604 -2271 -42800 -49949
16066 -49949 -44692 -48587 -36335 -35394 -25498 -35266 -33063 -43003 -57960 -48651 -63514 -85752 -91207 -85540
16052 -85540 -83855 -61970 -52145 -75969 -54293 -44398 -44066 -35726 -23152 -20657 -23019 -26655 -16753 -34125
16038 -34125 -42837 -41972 -41192 -16640 -5082 -24052 -37450 -14841 -14703 -53208 -77150 -68933 -51984
16025 -51984 -60685 -67392 -53700 -31237 -33991 -70596 -93487 -88900 -35268 -5804 -36797 -56513
16013 -56513 -60154 -71593 -91590 -85134 -81027 -62951 -77233 -98725 -105544 -96987 -53596 -38741 -41883
16000 -41883 -50612 -60695 -75567 -57614 -55487 -62676 -47963 -51364 -47653 -68998 -53850 -65775 -86172
$$ packed form
16092e3031k2909l469O1824j098j7902j153j8353k0713R629n46o45J2475K0674
16079c5217q12j4723p630K359J2557L059J073j7029Q457L7302Q333m0529p149
16066d9949N257l895J2252R41R896r768K203r940j4957R309j4863k2238n455N667
16052h5540J685K1885R825k3824K1676R895L32Q340J2574K495k362l636R902j7372
16038c4125q712Q65P80K4552J1558j8970j3398K2609J38l8505k3942Q217J6949
16025e1984q701o707J3692K2463k754l6605k2891M587N3632K9464l0993j9716
16013e6513l641j1439j9997O456M107J8076j4282k1492o819Q557M3391J4855l142
16000d1883q729j0083j4872J7953K127p189J4713l401L711k1345J5148j1925k0397
$$ plain form
15987 -86172 -77438 -66238 -61316 -59026 -39851 -44768 -48155 -37904 -42823 -49047 -53651 -53580 -68671 -105988
15973 -105988 -94065 -54506 -24846 -26489 -39291 -40238 -26249 -27211 -65802 -64996 -21458 -34356 -48671
15960 -48671 -41262 -24987 -42823 -76818 -69702 -77355 -81784 -80439 -64549 -18933 -17629 -24772 1037
15947 1037 -10402 -44957 -48169 -54461 -41660 -35518 -22644 2202 4070 -32462 -36171 -32890 -8091
15934 -8091 24679 28416 9545 3148 -13156 -42166 -33210 -38256 -20382 -32819 -36340 -47045 -43473
15921 -43473 -38224 -37787 -60283 -69447 -57368 -47067 -28955 -46062 -47878 -62168 -81303 -85470 -64234
15908 -64234 -59416 -70352 -69038 -34500 -32547 -37448 -28525 -48201 -56020 -53905 -76665 -114101 -115638
15895 -115638 -92374 -97435 -97462 -70092 -74465 -91107 -88913 -67696 -34950 -20238 -43323 -36704 -15185
$$ packed form
15987h6172Q734J1200M922K290J9175m917l387J0251m919o224m604P1j5091l7317
15973a05988J1923L9559K9660j643j2802r47J3989r62l8591Q06M3538j2898j4315
15960d8671P409J6275j7836l3995P116p653m429J345J5890M5616J304p143K5809
15947A037j1439l4555l212o292J2801O142J2874K4846J868l6532l709L281K4799
15934h091L2770L737j8871o397j6304k9010Q956n046J7874j2437l521j0705L572
15921d3473N249M37k2496r164J2079J0301J8112j7107j816j4290j9135m167K1236
15908f4234M818j0936J314L4538J953m901Q923j9676p819K115k2760l7436j537
15895a15638K3264n061k7K7370m373j6642K194K1217L2746J4712k3085O619K1519
$$ plain form
15882 -15185 3228 -10409 -27983 -54188 -68603 -56647 -9445 -13084 -13911 -8708 -15908 -46263 -40837
15869 -40837 -15658 2717 -26191 -46381 -49510 -42312 -32129 -34215 -45676 -49441 -46198 -54345 -54186
15856 -54186 -32826 -8902 -18290 -54952 -55825 -35469 -42907 -35526 -54402 -81700 -75822 -60605 -42691
15843 -42691 -35812 -21564 -40031 -69016 -35328 -17324 -31610 -39938 -48551 -68791 -91793 -98748
15831 -98748 -80853 -75908 -59245 -34921 -22329 -23008 -38465 -31787 -33524 -232 -33243 -45236 -53544
15818 -53544 -67424 -67340 -87187 -85586 -103134 -104254 -86643 -77218 -93365 -73678 -37130 -46102 -26767
15805 -26767 -26691 -18392 -39834 -56520 -63023 -37274 -21281 -40027 -50036 -32814 -11682 -21187 -33363
15792 -33363 -51153 -60766 -82424 -72022 -72022 -70696 -66265 -35379 -28301 -45746 -30463 -38482 -67096
$$ packed form
15882a5185J8413j3637j7574k6205j4415J1956M7202l639q27N203p200l0355N426
15869d0837K5179J8375k8908k0190l129P198J0183k086j1461l765L243q147J59
15856e4186K1360K3924r388l6662q73K0356p438P381j8876k7298N878J5217J7914
15843d2691O879J4248j8467k8985L3688J8004j4286q328q613k0240k3002o955
15831i8748J7895M945J6663K4324J2592o79j5457O678j737L3292l3011j1993q308
15818e3544j3880Q4j9847J601j7548j120J7611R425j6147J9687L6548q972J9335
15805b6767P6Q299k1442j6686o503K5749J5993j8746j0009J7222K1132r505j2176
15792c3363j7790r613k1658J0402%J326M431L0886P078j7445J5283q019k8614
$$ plain form
15779 -67096 -67189 -67902 -87272 -70639 -50928 -61374 -35672 -32854 -61530 -59912 -48902 -82105 -83784
15766 -83784 -80138 -69037 -46907 -45974 -32660 -29309 -16048 -5358 -9972 -25083 -37822 -15569 -37199
15753 -37199 -57384 -70346 -65775 -56349 -36022 -52950 -60274 -53711 -40627 -62226 -58632 -60636 -67361
15740 -67361 -79691 -80225 -67964 -67089 -57666 -56542 -42090 -21844 -19381 -64879 -54438 -51994 -69534
15727 -69534 -35430 -30761 -38515 -22197 -1068 4334 -16079 -70618 -78016 -56180 -31227 -16241
15715 -16241 -28729 -41078 -51179 -48616 -50973 -67435 -64392 -57186 -64285 -58963 -59434 -48665 -33997
15702 -33997 -44215 -56888 -52795 -41519 -44691 -73886 -43238 -20258 -13040 -18253 -13028 -14475 -7547
15689 -7547 10259 25725 976 -13362 1705 -13804 -12851 -32358 -41597 -33137 -26904 -36887 -35754
$$ packed form
15779f7096r3p13j9370J6633J9711j0446K5702K818k8676J618J1010l3203j679
15766h3784L646J1101K2130R33J3314L351J3261J0690m614j5111j2739K2253k1630
15753c7199k0185j2962M571R426K0327j6928p324O563J3084k1599L594k004o725
15740f7361j2330n34J2261Q75R423J124J4452K0246K463m5498J0441K444j7540
15727f9534L4104M669p754J6318K1129N402k0413n4539p398K1836K4953J4986
15715a6241j2488j2349j0101K563k357j6462L043P206p099N322m71J0769J4668
15702c3997j0218j2673M093J1276l172k9195L0648K2980P218n213N225j447O928
15689g547J7806J5466k4749j4338J5067j5509R53j9507r239Q460O233r983J133
$$ plain form
15676 -35754 -32838 -30618 -50720 -56031 -45817 -27788 -37098 -47501 -39288 -35931 -13883 -7716 -31798
15663 -31798 -37899 -10192 8322 -4679 -13570 -17844 -27296 -36844 -32178 -55946 -57406 -74874 -81668
15650 -81668 -36365 -41851 -54444 -51608 -61970 -71133 -65186 -57417 -61318 -30966 -24405 -39521 -39560 -25724
15636 -25724 -18410 -21133 -16649 15746 22065 11332 -13188 -36698 -18275 7006 6102 -28072 -38955
15623 -38955 -40832 -53641 -50267 -46149 -47406 -54619 -65557 -63362 -88723 -73262 -68537 -58411 -52825
15610 -52825 -38986 -2476 -17544 -37866 -67132 -68524 -44829 1416 32302 28824 275 -14839
15598 -14839 -54458 -65610 -60907 -54212 -33899 -23140 -3221 8616 -7009 -3446 -1085 -15549
15586 -15549 -28703 -17739 -1654 5949 -5648 -38163 -35330 -38423 -54012 -32008 -24098 -10250
$$ packed form
15676c5754K916K220k0102n311J0214J8029r310j0403Q213L357K2048O167k4082
15663c1798o101K7707J8514j3001q891m274r452r548M666k3768j460j7468o794
15650h1668M5303n486j2593K836j0362r163N947P769l901L0352O561j5116l9J3836
15636b5724P314k723M484L2395O319j0733k4520k3510J8423K5281r04l4174j0883
15623c8955j877j2809L374M118j257p213j0938K195k5361J5461M725J0126N586
15610e2825J3839L6510j5068k0322k9266j392K3695M6245L0886l478k8549j5114
15598a4839l9619j1152M703O695K0313J0759J9919J1837j5625L563K361j4464
15586a5549j3154J0964J6085P603j1597l2515K833l093j5589K2004P910J3848
$$ plain form
15574 -10250 -33059 -42009 -54404 -51000 -32106 -21252 -3772 11462 3954 -936 -15915 -19248 -44326
15561 -44326 -50609 -43071 -39277 -40831 -40232 -34512 -54624 -60717 -48213 -57478 -22918 -9492 -46266
15548 -46266 -70196 -71845 -47905 -34255 -10140 4338 18809 39962 20247 -22919 -48878 -63835
15536 -63835 -52427 -21691 -7647 -34808 -62785 -45704 -28971 -26758 -32138 -31172 -23480 -28779 -30063
15523 -30063 -5089 11198 -32616 -42366 -24570 11260 6130 -2999 13641 3085 -28494 -34806
15511 -34806 -27350 -41615 -38889 -11478 -959 -22972 -45267 -42965 -53612 -74432 -54565 -36231
15499 -36231 -794 -15981 -37534 -52381 -52160 -27637 -19124 -15716 5335 1194 -10725 -31292 -33147
15486 -33147 -36757 -37380 -42918 -44082 -51288 -48717 -38869 -11468 -7252 -27878 -35048 -58192 -72211 -66262
$$ packed form
15574a0250k2809q950j2395L404J8894J0854J7480J5234p508m890j4979l333k5078
15561d4326o283P538L794j554N99N720k0112o093J2504r265L4560J3426l6774
15548d6266k3930j649K3940J3650K4115J4478J4471K1153j9715m3166k5959j4957
15536f3835J1408L0736J4044k7161k7977J7081J6733K213n380R66P692n299j284
15523c0063K4974J6287m3814r750J7796L5830n130r129J6640j0556l1579o312
15511c4806P456j4265K726K7411J0519k2013k2295K302j0647k0820J9867J8334
15499c6231L5437j5187k1553j4847K21K4523Q513L408K1051m141j1919k0567j855
15486c3147l610o23n538j164p206K571R848K7401M216k0626p170k3144j4019N949
$$ plain form
15472 -66262 -57866 -51303 -38348 -17922 -20439 -2514 -11844 -23051 -20242 -50332 -47042 -29211 -28772
15459 -28772 -45437 -20421 -12405 -18385 -46927 -67346 -45991 5652 7623 -3629 -6278 -13658 -7764
15446 -7764 -5585 11110 -5323 -21407 -15539 -4396 1840 15911 4427 -8209 -28053 -10779
15434 -10779 7539 -221 -25980 -40810 -29099 -12639 -10370 -37602 -55313 -50739 -49736 -34290
15422 -34290 -48131 -57404 -30281 -12568 -19309 -20727 -16560 -3438 4523 -2580 10693 -1996 4044
15409 4044 5393 -4859 -3784 39774 34244 32579 35694 36627 51813 14893 -13517 -5411 29726
15396 29726 31990 8545 -14869 -18940 -14799 -11434 6676 -15202 -43595 -52230 -37649 -25181 -36223
15383 -36223 -21407 24853 9745 -7109 8875 13617 -9901 -5254 13334 11643 -3627 -9402
$$ packed form
15472f6262Q396O563J2955K0426k517J7925r330j1207K809l0090L290J7831M39
15459b8772j6665K5016Q016n980k8542k0419K1355N1643J971j1252k649p380N894
15446g764K179J6695j6433j6084N868J1143O236J4071j1484j2636j9844J7274
15434a0779J8318p760k5759j4830J1711J6460K269k7232j7711M574J003J5446
15422c4290j3841r273K7123J7713o741j418M167J3122P961p103J3273j2689O040
15409D044J349j0252J075M3558n530j665L115R33J5186l6920k8410Q106L5137
15396B9726K264k3445k3414m071M141L365J8110k1878k8393q635J4581J2468j1042
15383c6223J4816M6260j5108j6854J5984M742k3518M647J8588j691j5270n775
$$ plain form
15371 -9402 -10938 -242 -7060 803 5555 16471 2972 18645 22638 3980 -6875 -22674 -28412
15358 -28412 -5213 -9002 -32043 -20 21653 32099 39280 31147 -444 -20477 -15075 2262
15346 2262 14650 10174 -3958 5561 24660 7107 -4178 16637 22917 7394 -5062 -16445
15334 -16445 -48747 -42076 -11225 -5898 -3330 14638 672 1210 7770 -3579 -29361 -24968 -5270
15321 -5270 -4189 -14019 -26525 -17288 1635 10192 2740 -20662 -15526 1787 -3680 -12510 -17010 -12171
15307 -12171 17247 14545 -9417 -6187 -10071 -14636 -18894 -16368 7047 18845 15379 20307 21823
15294 21823 24148 23490 8065 -19394 -1040 19886 20012 -385 -18038 2969 7399 25340 12292
15281 12292 9271 15023 15450 16836 2326 -6556 3265 3162 11437 -1944 23023 7987 -10650 -1019
$$ packed form
15371i402j536J0696o818P863M752J0916j3499J5673L993j8658j0855j5799n738
15358b8412K3199l789k3041L2023K1673J0446P181q133l1591k0033N402J7337
15346B262J2388m476j4132R519J9099j7553j1285K0815O280j5523j2456j1383
15334a6445l2302O671L0851N327K568J7968j3966N38O560j1349k5782M393J9698
15321e270J081r830j2506R237J8923Q557p452k3402N136J7313n467q830m500M839
15307a2171K9418k702k3962L230l884m565m258K526K3415J1798l466M928J516
15294B1823K325o58j5425k7459J8354K0926J26k0397j7653K1007M430J7941j3048
15281A2292l021N752M27J386j4510q882R821j03Q275j3381K4967j5036j8637R631
$$ plain form
15267 -1019 9457 20468 24315 1370 -8186 3983 14866 -1765 -33260 -46547 -29917 3923
15255 3923 20074 26688 24064 51277 59786 11537 -6949 4740 8915 -3244 -15590 6112 4257
15242 4257 -11905 -21692 -18876 -9436 -3072 -22110 -38603 -9338 9 -19715 -4062 19682 -19808
15229 -19808 -37812 -23508 -8661 -21513 -42281 -27708 -12078 -17475 -4762 10029 23487 23544
15217 23544 -3234 1606 19247 -22542 -30721 -20695 9222 26219 30886 11436 -11437 -8954
15205 -8954 33911 32059 11033 10578 -12196 -15641 -20839 -8582 11758 18872 11466 15021 -8715
15192 -8715 -16491 -16092 -17257 -10663 -22066 -16322 5517 29430 31095 18080 12143 11667 20255 10503
15178 10503 -33 14761 24066 24922 18763 -3244 -8936 -469 24520 75069 64899 37296 -10843
$$ packed form
15267a019J0476J1011L847k2945r556J2169J0883j6631l1495j3287J6630L3840
15255C923J6151O614k624K7213Q509m8249j8486J1689M175j2159j2346K1702j855
15242D257j6162r787K816R440O364j9038j6493K9265R347j9724J5653K3744l9490
15229a9808j8004J4304J4847j2852k0768J4573J5630n397J2713J4791J3458N7
15217B3544k6778M840J7641m1789q179J0026K9917J6997M667j9450k2873K483
15205h954M2865j852k1026m55k2774l445n198J2257K0340P114p406L555k3736
15192h715p776L99j165O594j1403N744K1839K3913J665j3015n937m76Q588r752
15178A0503j0536J4794R305Q56o159k2007n692Q467K4989N0549j0170k7603m8139
$$ plain form
15165 -10843 -12530 353 -15230 -1087 9529 14501 24963 4089 8125 14202 -19526 -32474
15153 -32474 -48117 -44557 7661 61206 43388 17830 11861 23175 41002 12166 -3672 -4534
15141 -4534 -43961 -28672 5043 21355 -10663 -14918 29082 41595 37416 16837 -2377 23319
15129 23319 78232 87611 71298 68102 72078 43640 29745 25269 29750 29246 13441 -6923 4575
15116 4575 9982 23641 35434 53336 57457 45924 34557 28937 52839 40682 26123 28137 28550
15103 28550 -16112 -26396 -8484 19250 24877 27659 25230 32598 37514 29344 14142 16476 23301
15090 23301 26917 37750 52799 61284 47520 56905 53388 34502 19884 29341 35617 52506 50411
15077 50411 51367 64295 43058 40194 33625 29195 15951 24365 22838 19198 18878 45485 56268 56465
$$ packed form
15165a0843j687J2883j5583J4143J0616M972J0462k0874M036O077l3728j2948
15153c2474j5643L560N2218N3545j7818k5558n969J1314J7827k8836j5838q62
15141d534l9427J5289L3715J6312l2018m255M4000J2513m179k0579j9214K5696
15129B3319N4913R379j6313l196L976k8438j3895m476M481n04j5805k0364J1498
15116D575N407J3659J1793J7902M121j1533j1367n620K3902j2157j4559K014M13
15103B8550m4662j0284J7912K7734N627K782k429P368M916q170j5202K334O825
15090B3301L616J0833J5049Q485j3764R385l517j8886j4618R457O276J6889k095
15077E0411R56J2928k1237k864o569m430j3244Q414j527l640l20K6607J0783J97
$$ plain form
15063 56465 53566 50464 49770 44591 29512 34484 35462 28902 48688 45298 84389 85230 60708 35722
15049 35722 40608 53632 53271 68862 65977 86991 89584 82321 59981 67425 69711 37807 40252
15036 40252 60549 65821 35013 40176 68507 62081 45851 56354 62071 35405 26782 50759 46602
15023 46602 10184 4236 35844 51216 34320 -4261 530 23397 44137 77054 67872 54590
15011 54590 44723 51545 71588 62208 55939 41331 49857 39817 22693 18882 21804 20233 9636
14998 9636 4858 26744 32888 27610 18885 26303 33715 31613 25405 28580 67843 111782 110908 112822
14984 112822 127567 119834 120715 146814 148543 190308 276295 307550 286815 249040 185421 121221
14972 121221 79636 82675 94820 90309 70380 34166 43903 36614 55719 83995 91067 67432
$$ packed form
15063E6465k899l102o94n179j5079M972R78o560J9786l390L9091Q41k4522k4986
15049C5722M886J3024l61J5591k885K1014K593p263k2340P444K286l1904K445
15036D0252K0297N272l0808N163K8331o426j6230J0503N717k6666q623K3977m157
15023D6602l6418n948L1608J5372j6896l8581M791K2867K0740L2917r182j3282
15011E4590r867O822K0043r380o269j4608Q526j0040j7124l811K922j571j0597
14998I636m778K1886O144n278q725P418P412k102o208L175L9263M3939q74J914
14984A12822J4745p733Q81K6099J729M1765Q5987L1255k0735l7775o3619o4200
14972A21221m1585L039J2145m511j9929l6214R737p289J9105K8276P072k3635
$$ plain form
14960 67432 58318 57969 71561 48556 32771 39659 48366 35032 48908 65568 67717 75882 81885
14947 81885 63068 53809 67201 89167 102433 89442 57427 45077 24877 14099 43588 49450
14935 49450 29227 25948 -9816 -12057 -4490 12297 40286 51290 51445 47501 48731 57129 43559
14922 43559 45800 49842 53157 50010 49267 59474 45603 52878 74537 71592 90121 81405 71487 73335
14908 73335 76067 71143 61873 54720 49017 51041 71626 55378 69572 75292 79715 63250 36339
14895 36339 27829 43892 83617 89471 68834 81674 105151 90969 116101 95295 72612 84136
14883 84136 65357 48908 46325 27712 33320 25618 42414 60308 74644 79193 57712 68094
14871 68094 80407 65501 70974 81380 82914 62502 65554 81319 99180 92773 95408 96353 104659
$$ packed form
14960F7432r114l49J3592k3005j5785O888Q707j3334J3876J6660K149Q165O003
14947H1885j8817r259J3392K1966J3266j2991l2015j2350k0200j0778K9489N862
14935D9450k0223l279l5764k241P567J6787K7989J1004J55l944J230Q398j3570
14922D3559K241M042L315l147p43J0207j3871P275K1659k945J8529q716r918J848
14908G3335K732m924r270p153n703K024K0585j6248J4194N720M423j6465k6911
14895C6339q510J6063L9725N854k0637J2840K3477j4182K5132k0806k2683J1524
14883H4136j8779j6449k583j8613N608p702J6796J7894J4336M549k1481J0382
14871F8094J2313j4906N473J0406J534k0412L052J5765J7861o407K635R45Q306
$$ plain form
14858 104659 113871 112106 114692 107291 102039 129415 109218 106870 99941 113295 110455 85401 62488
14845 62488 69977 94456 99975 96484 121531 138870 131283 120373 119403 105727 108102 127835 102914
14832 102914 105260 99360 86512 77329 64989 71932 99083 118327 121713 114483 87849 99133 102448
14819 102448 105234 79088 86051 103309 125020 132753 122177 104339 92609 129212 132517 140128
14807 140128 124057 109394 111716 89873 102022 114614 124531 150552 133610 124918 95326 104762
14795 104762 125181 124363 131545 138192 113817 77186 104363 135118 139373 150521 139135 130762 113652
14782 113652 104901 93849 77978 80393 76408 66263 100955 138466 125977 81414 66054 61615
14770 61615 84323 134340 149623 128586 113261 116642 131177 133510 110822 121126 131953 119318
$$ packed form
14858A04659R212j765K586p401n252K7376k0197k348o929J3354k840k5054k2913
14845F2488P489K4479N519l491K5047J7339p587j0910r70j3676K375J9733k4921
14832A02914K346n900j2848r183j2340O943K7151J9244L386p230k6634J1284L315
14819A02448K786k6146O963J7258K1711P733j0576j7838j1730L6603L305P611
14807A40128j6071j4663K322k1843J2149J2592R917K6021j6942q692k9592R436
14795A04762K0419q18P182O647k4375l6631K7177L0755M255J1148j1386q373j7110
14782A13652q751j1052j5871K415l985j0145L4692L7511j2489m4563j5360m439
14770F1615K2708N0017J5283k1037j5325L381J4535K333k2688J0304J0827j2635
$$ plain form
14758 119318 121206 130761 121622 106051 112474 110674 90763 109783 152199 165926 169731 176677 178406
14745 178406 215267 218713 227477 216938 200421 187291 185043 191392 193992 173156 148823 174792
14733 174792 218432 245775 228863 211851 199564 203696 220511 226032 200599 185149 195944 195849
14721 195849 190318 188905 166851 167259 169957 193431 211237 186156 150243 152313 154888 153719 179127
14708 179127 187397 178750 162109 158837 172144 192633 214207 214605 206727 233972 237141 213326 193625
14695 193625 186989 148581 130850 153997 176731 194298 181275 173479 148728 168849 194127 202624
14683 202624 208521 220473 219371 216332 217969 194597 195028 201974 207776 213270 203264 202795 213543 240501
14669 240501 234758 241408 257522 254439 245597 263252 268197 264098 283627 294889 301819 305889 304401
$$ packed form
14758A19318J888R555r139j5571O423j800j9911J9020M2416J3727L805O946J729
14745A78406L6861L446Q764j0539j6517j3130k248O349K600k0836k4333K5969
14733A74792M3640K7343j6912j7012j2287M132J6815N521k5433j5450J0795r5
14721A95849n531j413k2054M08K698K3474J7806k5081l5913K070K575j169K5408
14708A79127Q270q647j6641l272J3307K0489K1574L98p878K7245L169k3815j9701
14695A93625o636l8408j7731K3147K2734J7567j3023p796k4751K0121K5278Q497
14683B02624N897J1952j102l039J637k3372M31O946N802N494j0006m69J0748K6958
14669B40501n743O650J6114l083q842J7655M945m099J9529J1262O930M070j488
$$ plain form
14656 304401 274685 266755 273599 254758 267701 274619 290903 319345 344147 349435 351073 360142 362281
14643 362281 351416 350613 377398 382758 389538 407459 456382 482648 467417 460775 480924 490317 499449
14630 499449 536048 528740 558661 642651 705943 722732 743457 812957 859498 893265 921372 979893
14618 979893 1046298 1083384 1118793 1179886 1244909 1285522 1362452 1447438 1583120 1702781 1805958
14607 1805958 1934654 2096182 2258275 2472191 2736663 3026646 3370766 3813676 4314282
14598 4314282 4871202 5512935 6231611 7013242 7807158 8577792 9297804 9956562 10508310
14589 10508310 10914892 11123039 11089082 10881633 10491872 9982855 9380387 8695206 7959778
14580 7959778 7257910 6626005 6069600 5618853 5262764 4978413 4766937 4580482 4364136
$$ packed form
14656C04401k9716p930O844j8841J2943O918J6284K8442K4802N288J638R069K139
14643C62281j0865q03K6785N360O780J7921M8923K6266j5231o642K0149R393R132
14630D99449L6599p308K9921Q3990O3292J6789K0725O9500M6541L3767K8107N8521
14618I79893O6405L7086L5409O1093O5023M0613P6930Q4986J35682J19661J03177
14607A805958J28696J61528J62093K13916K64472K89983L44120M42910N00606
14598D314282N56920O41733P18676P81631P93916P70634P20012O58758N51748
14589A0508310M06582K08147l3957k07449l89761n09017o02468o85181p35428
14580G959778p01868o31905n56405m50747l56089k84351k11476j86455k16346
$$ plain form
14571 4364136 4067006 3733541 3401160 3097472 2786221 2562149 2354493 2154588 2001564
14562 2001564 1877606 1759688 1657338 1571770 1489328 1442326 1390086 1317843 1249670 1214830 1215058
14551 1215058 1184072 1120075 1061151 1023267 1018362 1029903 1039032 1033009 1022680 1035954 1021515 1020833
14539 1020833 1034355 1026128 1016494 1030502 1070766 1105773 1117846 1166126 1197316 1224721 1237247 1283573
14527 1283573 1322441 1375282 1405812 1415791 1417309 1436290 1436437 1447283 1499214 1537575 1576079 1577993
14515 1577993 1577049 1630786 1683114 1712280 1746127 1718439 1689194 1692642 1680409 1691516 1686171 1648094
14503 1648094 1630706 1627622 1633087 1629166 1586340 1537249 1522477 1531732 1540647 1547642 1561447 1636667
14491 1636667 1732440 1820899 1945150 2106681 2296904 2475785 2649354 2813593 2956495 3042071
$$ packed form
14571D364136k97130l33465l32381l03688l11251k24072k07656j99905j53024
14562B001564j23958j17918j02350q5568q2442m7002n2240p2243o8173l4840K28
14551A215058l0986o3997n8924l7884m905J1541R129o023j0329J3274j4439o82
14539A020833J3522q227r634J4008M0264L5007J2073M8280L1190K7405J2526M6326
14527A283573L8868N2841L0530R979J518J8981J47J0846N1931L8361L8504J914
14515A577993r44N3737N2328K9166L3847k7688k9245L448j2233J1107n345l8077
14503A648094j7388l084N465l921m2826m9091j4772R255Q915O995J3805P5220
14491A636667R5773Q8459J24251J61531J90223J78881J73569J64239J42902Q5576
$$ plain form
14481 3042071 3050985 2971607 2797042 2574892 2348654 2107229 1867438 1682255 1486998 1318640
14471 1318640 1181076 1065219 952277 885843 833018 808459 773508 713881 677776 639623 598121
14460 598121 588044 579612 569386 584211 584315 559715 558894 554243 552178 538766 515877 506492 491008
14447 491008 501160 525865 499921 490327 492517 494358 479977 467364 460569 458001 468223 483261
14435 483261 487221 504373 538517 507339 495073 490584 473012 448606 432745 433808 453381 444403
14423 444403 438007 433633 424994 438511 452832 423796 417255 421226 427709 432511 457719 437296 410120
14410 410120 388361 400534 443360 451517 455221 426433 428870 396360 407356 386007 362876 372824
14398 372824 372375 374514 378974 383158 399513 397495 373501 365382 381878 391313 396766 401366 426471
$$ packed form
14481C042071Q914p9378j74565k22150k26238k41425k39791j85183j95257j68358
14471A318640j37564j15857j12942o6434n2825k4559l4951n9627l6105l8153m1502
14460E98121j0077q432j0226J4825J04k4600q21m651k065j3412k2889r385j5484
14447D91008J0152K4705k5944r594K190J841j4381j2613o795k568J0222J5038
14435D83261L960J7152L4144l1178j2266m489j7572k4406j5861J063J9573q978
14423D44403o396m374q639J3517J4321k9036o541L971O483M802K5208k0423k7176
14410D10120k1759J2173M2826Q157L704k8788K437l2510J0996k1349k3131R948
14398C72824m49K139M460M184J6355k018k3994q119J6496R435N453M600K5105
$$ plain form
14385 426471 428073 412965 414721 410034 408148 407983 406140 398813 411981 393584 415389 431026 406994
14372 406994 416628 420232 415991 414077 433401 427584 415612 426286 437030 445068 444892 454700 439316
14359 439316 410555 411507 393315 380005 384447 370107 354206 365891 337689 309264 317654 322514
14347 322514 360025 358193 342560 357765 363404 370310 396015 396293 385869 392203 417775 428454 430911
14334 430911 441492 440047 464462 461802 442074 466031 472484 454521 442359 446809 433605 443359
14322 443359 434042 433156 429499 421628 401375 379414 379203 403273 435577 455269 451605 443444 478495
14309 478495 509722 489231 485242 475481 439718 431170 436300 435962 466923 483385 485844 502490 512906
14296 512906 512938 557127 606434 619839 626118 641482 645349 662891 688436 691094 706325 720797 706494
$$ packed form
14385D26471J602j5108J756m687j886j65j843p327J3168j8397K1805J5637k4032
14372D06994R634L604m241j914J9324n817j1972J0674J0744Q038j76R808j5384
14359D39316k8761R52j8192j3310M442j4340j5901J1685k8202k8425Q390M860
14347C22514L7511j832j5633J5205N639O906K5705K78j0424O334K5572J0679K457
14334D30911J0581j445K4415k660j9728K3957O453j7963j2162M450j3204R754
14322D43359r317q86l657p871k0253k1961k11K4070L2304J9692l664q161L5051
14309D78495L1227k0491l989r761l5763q548N130l38L0961J6462K459J6646J0416
14296E12906L2M4189M9307J3405O279J5364L867J7542K5545K658J5231J4472j4303
$$ plain form
14283 706494 668234 631148 576677 540110 546034 547142 539496 530938 493910 463779 473545 496374
14271 496374 495706 493398 490596 485446 500926 526174 543131 539516 530476 530648 510501 510015 495007 501831
14257 501831 517453 517436 501969 496306 493450 486665 498542 502038 497043 486460 516645 523368 538208
14244 538208 536450 508794 542336 554413 550070 561546 553502 569248 600686 615880 634765 651786
14232 651786 658004 652106 640462 625943 613167 605443 595163 581699 579611 584046 566238 553814
14220 553814 545331 542776 519513 537427 572363 584435 590973 617877 634745 644121 654487 657575
14208 657575 674415 683380 688637 690996 701484 719282 720213 716587 741908 788593 827243 860296 899444
14195 899444 996421 1119886 1202742 1291287 1368815 1447212 1492490 1524274 1508254 1476197 1419649
$$ packed form
14283G06494l8260l7086n4471l6567N924J108p646q558l7028l0131R766K2829
14271D96374o68k308k802n150J5480K5248J6957l615r040J72k0147m86j5008O824
14257E01831J5622j7j5467n663k856o785J1877L496m995j0583L0185O723J4840
14244E38208j758k7656L3542J2077m343J1476q044J5746L1438J5194J8885J7021
14232F51786O218n898j1644j4519j2776p724j0280j3464k088M435j7808j2424
14220E53814q483k555k3263J7914L4936J2072O538K6904J6868R376J0366L088
14208F57575J6840Q965N257K359J0488J7798R31l626K5321M6685L8650L3053L9148
14195H99444R6977J23465Q2856Q8545P7528P8397M5278L1784j6020l2057n6548
$$ plain form
14184 1419649 1335534 1279059 1198512 1171951 1146951 1096869 1066265 1067350 1075707 1069513 1110575 1113401
14172 1113401 1096732 1115387 1156951 1204711 1256662 1325526 1388978 1459667 1505551 1539012 1579995
14161 1579995 1623514 1673791 1661982 1621376 1589649 1567557 1537313 1502785 1426849 1370982 1344582
14150 1344582 1346265 1312635 1298701 1315179 1337597 1358292 1363864 1403022 1420971 1441286 1433511 1423316
14138 1423316 1449556 1494458 1504303 1501938 1512639 1521650 1539459 1589653 1607529 1633851 1666148 1714790
14126 1714790 1760501 1775201 1813163 1836602 1871383 1949774 1988402 2034987 2074001 2122959 2190136
14115 2190136 2238390 2321486 2412639 2470564 2505838 2556986 2625573 2687276 2752119 2837127 2921847
14104 2921847 2987509 3080643 3166882 3240892 3322733 3460277 3596609 3724121 3885298 4079191
$$ packed form
14184A419649q4115n6475q0547k6561k5000n0082l0604J085Q357o194M1062K826
14172A113401j6669J8655M1564M7760N1951O8864O3452P0689M5884L3461M0983
14161A579995M3519N0277j1809m0606l1727k2092l0244l4528p5936n5867k6400
14150A344582J683l3630j3934J6478K2418K0695N572L9158J7949K0315p775j0195
14138A423316K6240M4902R845k365J0701R011J7809N0194J7876K6322L2297M8642
14126A714790M5711J4700L7962K3439L4781P8391L8628M6585L9014M8958O7177
14115B190136M8254Q3096R1153N7925L5274N1148O8587O1703O4843Q5008Q4720
14104B921847O5662R3134Q6239P4010Q1841J37544J36332J27512J61177J93893
$$ plain form
14094 4079191 4293933 4523646 4801731 5154433 5567175 6084677 6724768 7511955 8374804
14085 8374804 9274436 10241536 11194582 12041466 12654444 13007240 13124594 13024385 12704509
14076 12704509 12202613 11588032 10955024 10426445 10062043 9870849 9805480 9943251 10289995
14067 10289995 10765370 11354353 12020354 12745074 13533123 14345658 15183603 16003684 16819217
14058 16819217 17698400 18645325 19789591 21226745 22989475 25186662 27909689 31186657
14050 31186657 35153130 39930871 45690119 52801643 61784653 73491183 89140797 110238125
14042 110238125 138017399 172544267 212477997 256108997 301677528 346513703 386025555
14035 386025555 415552314 432426616 436092333 426457075 403403111 368616535 326065199
$$ packed form
14094D079191K14742K29713K78085L52702M12742N17502O40091P87187Q62849
14085H374804Q99632R67100R53046Q46884O12978L52796J17354j00209l19876
14076A2704509n01896o14581o33008n28579l64402j91194o5369J37771L46744
14067A0289995M75375N88983O66001P24720P88049Q12535Q37945Q20081Q15533
14058A6819217Q79183R46925J144266J437154J762730K197187K723027L276968
14050C1186657L966473M777741N759248P111524Q983010J1706530J5649614K1097328
14042A10238125K7779274L4526868L9933730M3631000M5568531M4836175L9511852
14035C86025555K9526759J6874302L665717r635258k3053964l4786576m2551336
$$ plain form
14028 326065199 280513878 235420705 192793094 154582099 122458528 97204394 78189890
14021 78189890 64103742 53571205 45481350 39075363 33850812 29448489 25728426 22528098
14013 22528098 19811475 17487557 15503175 13845005 12490412 11360066 10440091 9723547
14005 9723547 9208740 8831445 8520552 8264376 8033666 7790999 7531945 7253567 7007239
13996 7007239 6774658 6581780 6503781 6613995 7014321 7747657 8866939 10292518 11717490
13987 11717490 12713165 12955217 12342515 11109754 9510924 7845392 6334910 5101732
13979 5101732 4173021 3499794 3009960 2687523 2461091 2266324 2088865 1948059 1811789
13970 1811789 1704061 1604688 1534119 1481104 1422860 1375073 1329179 1316718 1319754 1329607 1391096
$$ packed form
14028C26065199m5551321m5093173m2627611l8210995l2123571k5254134j9014504
14021G8189890j4086148j0532537q089855o405987n224551m402323l720063l200328
14013B2528098k716623k323918j984382j658170j354593j130346r19975p16544
14005I723547n14807l77295l10893k56176k30710k42667k59054k78378k46328
13996G007239k32581j92878p7999J10214M00326P33336J119282J425579J424972
13987A1717490R95675K42052o12702j232761j598830j665532j510482j233178
13979E101732r28711o73227m89834l22437k26432j94767j77459j40806j36270
13970A811789j07728r9373p0569n3015n8244m7787m5894j2461L036R853O1489
$$ plain form
13959 1391096 1514755 1683760 1889413 2125309 2410689 2715275 3000815 3235992 3406303
13950 3406303 3487668 3485232 3419709 3240932 2976777 2669138 2343119 2044087 1764139 1504135
13940 1504135 1309536 1124547 1003630 931052 856571 778458 688414 620154 583075 585404 596851
13929 596851 576671 527870 493842 463661 473210 448747 418531 425257 455226 472451 467412 502866
13917 502866 543488 593625 634567 689415 736037 788029 836459 853532 886213 883623 864257 867640
13905 867640 832683 771025 700406 640793 585800 493975 420688 399878 381196 346133 297726
13894 297726 254173 238381 219604 206085 188935 157215 116623 105879 51510 -31566 -118027
13883 -118027 -188873 -267499 -338488 -389459 -432252 -438753 -437233 -412197 -337854 -260420 -169150 -69872
$$ packed form
13959A391096J23659J69005K05653K35896K85380L04586K85540K35177J70311
13950C406303Q1365k436o5523j78777k64155l07639l26019k99032k79948k60004
13940A504135j94599j84989j20917p2578p4481p8113r0044o8260l7079K329J1447
13929E96851k0180m8801l4028l0181R549k4463l0216O726K9969J7225n039L5454
13917E02866M0622N0137M0942N4848M6622N1992M8430J7073L2681k590j9366L383
13905H67640l4957o1658p0619n9613n4993r1825p3287k0810j8682l5063m8407
13894B97726m3553j5792j8777j3519j7150l1720m0592j0744n4369q3076q6461
13883a18027p0846p8626p0989n0971m2793o501J520K5036P4343P7434R1270R9278
$$ plain form
13871 -69872 9883 63090 122425 194019 258502 288037 285961 284242 263178 259174 244436 232691
13859 232691 222295 188928 182935 175653 204502 195715 188839 193302 181017 203184 240242 242156 248907
13846 248907 293439 283372 260861 256501 273364 261403 257791 250398 188208 158316 159433 159584 141415
13833 141415 168340 198393 208374 201544 193603 168971 192940 225000 272883 258828 283246 331060
13821 331060 356373 390826 452004 481224 487414 483721 496377 518642 503298 461309 469151 490651
13809 490651 460001 434849 424826 383853 332853 267060 228484 254536 263157 263773 244007 240583
13797 240583 266817 313187 343674 362281 399719 465101 558462 632858 743291 931801 1166661
13786 1166661 1438774 1750035 2023450 2174647 2222837 2175710 2037364 1821403 1563629 1292503
$$ packed form
13871f9872P9755N3207N9335P1594O4483K9535k076j719k1064m004j4738j1745
13859B32691j0396l3367n993p282K8849q787o876M463j2285K2167L7058J914O751
13846B48907M4532j0067k2511m360J6863j1961l612p393o2190k9892J117J51j8169
13833A41415K6925L0053R981o830p941k4632K3969L2060M7883j4055K4418M7814
13821C31060K5313L4453O1178K9220O190l693J2656K2265j5344m1989P842K1500
13809D90651l0650k5152j0023m0973n1000o5793l8576K6052Q621O16j9766l424
13797B40583K6234M6370L0487J8607L7438O5382R3361P4396J10433J88510K34860
13786A166661K72113L11261K73415J51197M8190m7127j38346k15961k57774k71126
$$ plain form
13776 1292503 1067272 870837 722777 597140 497697 428645 381519 298534 223278 159018
13766 159018 132420 98996 96176 100909 91582 68948 40962 23522 21729 27640 10427 871 -19271
13753 -19271 -32728 -36783 -40914 -18393 -7016 3220 8761 -12948 -21600 -11533 2268 28414
13741 28414 42433 46451 44834 56616 39108 -7077 -32541 -53354 -62303 -64540 -22088 -2257
13729 -2257 10577 23194 30672 57860 63648 67751 69019 60359 54831 26907 8177 18891 32985
13716 32985 15315 -5216 4125 9999 14383 10471 1118 1772 -11475 -37823 -63118 -70719 -63627
13703 -63627 -40856 -19141 -36632 -49527 -46809 -44729 -54733 -61505 -45412 -67840 -95537 -88442
13691 -88442 -55238 -47435 -69466 -80266 -66672 -69469 -67403 -74715 -53134 -38446 -21526 2486
$$ packed form
13776A292503k25231j96435j48060j25637r9443o9052m7126q2985p5256o4260
13766A59018k6598l3424k820M733r327k2634k7986j7440j793N911j7213r556k0142
13753a9271j3457m055m131K2521J1377J0236N541k1709q652J0067J3801K6146
13741B8414J4019M018j617J1782j7508m6185k5464k0813q949k237M2452J9831
13729b257J2834J2617P478K7188N788M103J268q660n528k7924j8730J0714J4094
13716C2985j7670k0531R341N874M384l912r353O54j3247k6348k5295p601P092
13703f3627K2771K1715j7491j2895K718K080j0004o772J6093k2428k7697P095
13691h8442L3204P803k2031j0800J3594k797K066p312K1581J4688J6920K4012
$$ plain form
13679 2486 4860 18518 5453 -5286 -27560 -21430 2330 18602 8363 13907 46303 32599
13667 32599 31143 22308 39208 74217 71381 68382 68727 78688 80311 90074 105338 115698 68220
13654 68220 32198 4756 -12691 -42620 -38494 -10510 2743 -10375 -27461 -25571 -24932 -14053
13642 -14053 -5794 12190 12062 4933 32681 69969 100322 115857 126616 117410 95564 67808 58246
13629 58246 34095 22232 10914 -6783 -5741 -1493 14471 8574 -8526 -28181 -33866 -30998 -4940
13616 -4940 5664 2566 -4409 -11653 -9232 -21786 -15403 7297 9697 3274 -17444 -12529 7115
13603 7115 -2290 25481 36106 30718 54065 70227 69376 60110 71858 84557 99028 150582 220270
13590 220270 289105 399561 536712 662339 850804 1085206 1310301 1536739 1739923 1925708
$$ packed form
13679B486K374J3658j3065j0739k2274O130K3760J6272j0239N544L2396j3704
13667C2599j456q835J6900L5009k836k999L45R961J623R763J5264J0360m7478
13654F8220l6022k7442j7447k9929M126K7984J3253j3118j7086J890O39J0879
13642a4053Q259J7984j28p129K7748L7288L0353J5535J0759r206k1846k7756r562
13629E8246k4151j1863j1318j7697J042M248J5964n897j7100j9655n685K868K6058
13616d940J0604l098o975p244K421j2554O383K2700K400o423k0718M915J9644
13603G115r405K7771J0625n388K3347J6162q51r266J1748J2699J4471N1554O9688
13590B20270O8835J10456J37151J25627J88465K34402K25095K26438K03184J85785
$$ plain form
13580 1925708 2061420 2152610 2167267 2120968 2010820 1825327 1563654 1314211 1095546 881476
13570 881476 691008 513191 414338 344350 273853 222557 168811 124487 117051 90215 64813
13559 64813 59357 76089 58964 64075 53796 15470 6333 9344 5239 -21631 -12436 -22103 -24812
13546 -24812 -46263 -47220 -49941 -65353 -45268 -32216 -26439 -32058 -19716 3952 -4950 -4181 14169
13533 14169 38073 45118 77508 74643 52816 41467 27963 31893 50009 36837 41613 27787
13521 27787 6733 -38552 -71142 -56585 -17154 -10834 -14208 -9498 -8606 -7451 -19183 -15620 -27243
13508 -27243 -32845 -11128 3184 -3044 -20665 10138 30725 43248 40490 45788 58866 42314
13496 42314 154 -12786 -24583 -47155 -43382 -32086 -41964 -66073 -77287 -73674 -69719 -58406
$$ packed form
13580A925708J35712R1190J4657m6299j10148j85493k61673k49443k18665k14070
13570H81476j90468j77817r8853o9988p0497n1296n3746m4324p436k6836k5402
13559F4813n456J6732j7125N111j0279l8326r137L011m105k6870R195r667k709
13546b4812k1451r57k721j5412K0085J3052N777n619J2342K3668q902P69J8350
13533A4169K3904P045L2390k865k1827j1349j3504L930J8116j3172M776j3826
13521B7787k1054m5285l2590J4557L9431O320l374M710Q92J155j1732L563j1623
13508b7243n602K1717J4312o228j7621L0803K0587J2523k758N298J3078j6552
13496D2314m2160j2940j1797k2572L773J1296r878k4109j1214L613L955J1313
$$ plain form
13484 -58406 -31816 -33042 -53184 -75537 -86848 -72810 -79640 -90458 -83361 -98265 -96193 -91894 -72821
13471 -72821 -50536 -70078 -82321 -100808 -100167 -86550 -101142 -98257 -91816 -89304 -99703 -117754 -96893
13458 -96893 -77535 -62825 -52543 -51238 -32883 -68683 -80042 -80768 -99203 -88742 -94441 -123097
13446 -123097 -103875 -87170 -72339 -86431 -115676 -126824 -126959 -104576 -111990 -125750 -102463 -105599
13434 -105599 -111750 -95802 -97453 -99260 -98645 -73608 -62604 -90567 -101324 -86266 -46664 -40793 -38089
13421 -38089 -29740 -17108 -6986 -13791 -4048 -34309 -62179 -32079 -21731 -34591 -42598 -31434
13409 -31434 -50918 -74787 -91065 -93130 -100441 -108425 -97748 -89929 -72414 -61582 -61441 -64031 -74670
13396 -74670 -59015 -52389 -67218 -85590 -73418 -64155 -48731 -82012 -94418 -99992 -97727 -89558 -89823
$$ packed form
13484e8406K6590j226k0142k2353j1311J4038o830j0818P097j4904K072M299J9073
13471g2821K2285j9542j2243j8487O41J3617j4592K885O441K512j0399j8051K0861
13458i6893J9358J4710J0282J305J8355l5800j1359p26j8435J0461n699k8656
13446a23097J9222J6705J4831j4092k9245j1148j35K2383p414j3760K3287l136
13434a05599o151J5948j651j807O15K5037J1004k7963j0757J5058L9602N871K704
13421c8089Q349J2632J0122o805R743l0261k7870L0100J0348j2860q007J1164
13409c1434j9484k3869j6278k065p311p984J0677P819J7515J0832J41k590j0639
13396g4670J5655O626j4829j8372J2172R263J5424l3281j2406n574K265Q169k65
$$ plain form
13383 -89823 -63592 -52457 -55222 -36465 -9911 -10659 -42913 -62161 -73317 -80634 -77020 -90183 -101990
13370 -101990 -85546 -100357 -105096 -94969 -97863 -109894 -89760 -64965 -49481 -50311 -59441 -30070
13358 -30070 -41281 -46255 -33269 -55944 -66840 -58428 -60194 -44023 -59617 -67548 -88498 -109597
13346 -109597 -103706 -98430 -94486 -92019 -105397 -101281 -95274 -95655 -86901 -68960 -71571 -94838 -92021 -87743
13332 -87743 -72292 -68016 -65648 -60853 -72006 -60087 -54386 -59222 -72067 -93541 -99915 -104394 -94672
13319 -94672 -71049 -51140 -67641 -80268 -63766 -54505 -75605 -64665 -37562 -69860 -84301 -79089
13307 -79089 -86040 -69297 -66386 -77922 -87898 -97259 -94942 -104942 -110166 -85768 -101218 -88459 -65306
13294 -65306 -70967 -86963 -100038 -91042 -80578 -72048 -77098 -60199 -41622 -51411 -60444 -82725 -98898
$$ packed form
13383h9823K6231J1135k765J8757K6554p48l2254j9248j1156p317L614j3163j1807
13370a01990J6444j4811m739J0127k894j2031K0134K4795J5484q30r130K9371
13358c0070j1211m974J2986k2675j0896Q412j766J6171j5594p931k0950k1099
13346a09597N891N276L944K467j3378M116O007l81Q754J7941k611k3267K817M278
13332h7743J5451M276K368M795j1153J1919N701m836j2845k1474o374m479R722
13319i4672K3623J9909j6501j2627J6502R261k1100J0940K7103l2298j4441N212
13307g9089o951J6743K911j1536r976r361K317j0000n224K4398j5450J2759K3153
13294f5306n661j5996j3075Q996J0464Q530n050J6899J8577r789r033k2281j6173
$$ plain form
13281 -98898 -83329 -67996 -52264 -53805 -62754 -89774 -103117 -101141 -84633 -65941 -55252 -53624
13269 -53624 -46592 -39093 -39548 -31982 -34196 -23753 -28158 -43638 -61070 -60403 -58590 -50795 -70075 -62266
13255 -62266 -47212 -29452 -47935 -87471 -104280 -146808 -140139 -105991 -97376 -74970 -81499 -62712
13243 -62712 -66615 -79736 -72686 -55374 -73357 -95665 -90847 -83638 -75324 -50282 -24774 -39652 -42928
13230 -42928 -29718 -12351 -10403 11525 18073 -4796 -51735 -50569 -42829 -51530 -85388 -80314 -77424
13217 -77424 -44877 -36619 -36266 -43045 -41194 -14511 -21433 -36662 -51583 -62850 -57449 -64247 -52057
13204 -52057 -27885 -25609 -45656 -71470 -71666 -80774 -54472 -36112 -11517 8760 1722 -38193 -53031
13191 -53031 -72534 -82249 -54706 -40719 -51252 -40331 -14745 2411 7138 10741 7027 -4308
$$ packed form
13281i8898J5569J5333J5732j541q949k7020j3343J976J6508J8692J0689J628
13269e3624P032P499m55P566k214J0443m405j5480j7432O67J813P795j9280P809
13255f2266J5054J7760j8483l9536j6809m2528O669L4148Q615K2406o529J8787
13243f2712l903j3121P050J7312j7983k2308M818P209Q314K5042K5508j4878l276
13230d2928J3210J7367J948K1928O548k2869m6939J166P740q701l3858N074K890
13217g7424L2547Q258L53o779J851K6683o922j5229j4921j1267N401o798J2190
13204e2057K4172K276k0047k5814j96r108K6302J8360K4595K0277p038l9915j4838
13191e3031j9503r715K7543J3987j0533J0921K5586J7156M727L603l714j1335
$$ plain form
13179 -4308 -12228 -5550 -22149 -35340 -39649 -59728 -85264 -91988 -109407 -114962 -104945 -80475 -47230
13166 -47230 -21840 -33810 -61814 -35917 -20200 -9624 -15649 -27980 -33748 -30143 -24280 -14593 -21321
13153 -21321 -48660 -43898 -16261 -18899 -50247 -68238 -47459 -42424 -35302 -33129 -17968 -5391 -3703
13140 -3703 14113 19859 48519 86962 108863 87602 46126 14988 -17321 -33692 -63902 -62159
13128 -62159 -46755 -26496 -21944 -10626 -32656 -59002 -50623 -59356 -31532 10648 -7670 -28312
13116 -28312 -35427 -35805 -28051 -34995 -21306 -24516 -41397 -39229 -61478 -62027 -37078 -27386 -36868 -28907
13102 -28907 -18940 -2752 20737 36183 3317 -22053 -19022 36842 89336 112757 105814 134250
13090 134250 164436 140110 100773 62008 53146 48514 47058 10714 -41053 -31193 -7801 -21945
$$ packed form
13179d308p920O678j6599j3191m309k0079k5536o724j7419n555J0017K4470L3245
13166d7230K5390j1970k8004K5897J5717J0576o025j2331n768L605N863R687o728
13153b1321k7339M762K7637k638l1348j7991K0779N035P122K173J5161J2577J688
13140c703J7816N746K8660L8443K1901k1261m1476l1138l2309j6371l0210J743
13128f2159J5404K0259M552J1318k2030k6346Q379q733K7824M2180j8318k0642
13116b8312p115l78P754o944J3689l210j6881K168k2249n49K4949R692r482P961
13102b8907R967J6188K3489J5446l2866k5370L031N5864N2494K3421o943K8436
13090A34250L0186k4326l9337l8765q862m632j456l6344n1767R860K3392j4144
$$ plain form
13078 -21945 -9998 11751 22611 19635 9227 -21246 -29799 -46410 -41033 -32499 -30453 -14469 8064
13065 8064 -12000 -25004 -41474 -28041 -25386 -18323 -15677 -11440 -50049 -43504 -40389 -40459 -52959 -51286
13051 -51286 -55238 -42486 -6789 26293 39942 60518 40104 18450 16980 -4879 -20336 -25988
13039 -25988 -28757 -8975 -23156 -11788 -38657 -61523 -79108 -85642 -75849 -62204 -53812 -51312 -70563
13026 -70563 -72740 -58978 -67230 -69578 -70828 -68089 -51859 -60002 -50298 -37677 -33635 -39374 -13638
13013 -13638 -24653 -41821 -47881 -52066 -45555 -51322 -54943 -64171 -59237 -49894 -28502 -26250 -16275 -20190
12999 -20190 -19854 -15040 -14265 -29721 -5285 -205 -4423 -21874 -27028 -8035 -5420 22573 13484 -22590
12985 -22590 -47374 -14386 30762 24226 -19694 -7010 5789 -2901 9472 9982 -10456 -29596
$$ packed form
13078b1945J1947K1749J0860k976j0408l0473q553j6611N377Q534K046J5984K2533
13065H064k0064j3004j6470J3433K655P063K646M237l8609O545L115p0j2500J673
13051e1286l952J2752L5697L3082J3649K0576k0414k1654j470k1859j5457n652
13039b5988k769J9782j4181J1368k6869k2866j7585o534R793J3645Q392K500j9251
13026g0563k177J3762q252k348j250K739J6230q143R704J2621M042n739K5736
13013a3638j1015j7168o060m185O511n767l621r228M934R343K1392K252R975l915
12999b0190L36M814P75j5456K4436N080m218j7451n154J8993K615K7993r089l6074
12985b2590k4784L2988M5148o536m3920J2684J2799q690J2373N10k0438j9140
$$ plain form
12973 -29596 -14120 -770 -36482 -42290 -21843 13901 23828 16121 8737 -7424 -13907 -33361 -49718
12960 -49718 -36863 -37732 -24477 11016 45143 20538 -17728 -21015 -21852 -23147 -354 -12955 -27656
12947 -27656 -37100 -29210 -1138 -5298 -3529 -10885 -13027 -20293 -6092 1599 2356 6519 -7369 -10154
12933 -10154 -17550 -29516 -26234 -25150 -21552 23445 24072 3995 -19197 3646 38265 46756 57498
12920 57498 45298 7208 500 13184 19458 20770 -2876 -5656 -1498 14534 25967 13676 -11395
12907 -11395 -36073 -61968 -67485 -48867 -25365 -12723 -16878 -27667 -22981 -23704 -22681 -26824 -17084
12894 -17084 6029 26310 30507 31608 35262 26064 6613 5582 -15629 -6881 27211 29469 39527
12881 39527 46899 10557 -33857 -14437 13538 17081 10296 3512 14891 -6128 -17116 -23858 -13206
$$ packed form
12973b9596J5476J3350l5712n808K0447L5744R927p707p384j6161o483j9454j6357
12960d9718J2855q69J3255L5493L4127k4605l8266l287q37j295K2793j2601j4701
12947b7656r444P890K8072m160J769p356k142p266J4201P691P57M163j3888k785
12933a0154p396j1966L282J084L598M4997O27k0077k3192K2843L4619Q491J0742
12920E7498j2200l8090o708J2684O274J312k3646k780M158J6032J1433j2291k5071
12907a1395k4678k5895n517J8618K3502J2642m155j0789M686p23J023m143R740
12894a7084K3113K0281M197J101L654r198j9451j031k1211Q748L4092K258J0058
12881C9527P372l6342m4414J9420K7975L543o785o784J1379k1019j0988o742J0652
$$ plain form
12868 -13206 -17100 6092 17298 28181 14260 20519 34616 27017 2827 -964 49025 27162
12856 27162 16573 21027 45425 92132 98931 74221 45334 39797 31009 -3172 16188 -14242
12844 -14242 -40280 -7969 16728 -9004 -16833 8293 -4943 -23551 -24650 -26873 -8353 9987
12832 9987 3278 30 26249 41861 18701 13640 11257 15828 -7674 -2388 6663 15209 18477 10112
12818 10112 19702 46978 72908 56818 47595 77113 79527 82213 66027 39198 38531 31222 20732
12805 20732 30300 23768 20489 -8112 3867 9101 4571 11513 37077 44868 28772 38662 58864
12792 58864 50497 27454 14257 26779 48757 48724 54591 63515 35010 27438 19784 10089 -3195
12779 -3195 3020 10387 19127 32612 33653 17961 2732 3630 26504 47147 71187 70928 62931 54104
$$ packed form
12868a3206l894K3192J1206J0883j3921O259J4097p599k4190l791M9989k1863
12856B7162j0589M454K4398M6707O799k4710k8887n537q788l4181J9360l0430
12844a4242k6038L2311K4697k5732p829K5126j3236j8608j099k223J8520J8340
12832I987o709l248K6219J5612k3160n061k383M571k3502N286R051Q546L268q365
12818A0112R590K7276K5930j6090r223K9518K414K686j6186k6829o67p309j0490
12805B0732R568o532l279k8601J1979N234m530O942K5564P791j6096R890K0202
12792E8864q367k3043j3197J2522K1978l3N867Q924k8505p572p654r695j3284
12779c195O215P367Q740J3485J041j5692j5229Q98K2874K0643K4040k59p997q827
$$ plain form
12765 54104 20431 -543 -2549 18082 1250 -11578 -1467 28095 58742 51477 10364 -16671
12753 -16671 -13999 18657 56420 78440 67252 56444 46763 33755 43230 32328 42062 46606 51128
12740 51128 58145 62148 36735 17560 27653 26864 58491 88537 101364 119620 138339 156028
12728 156028 160910 165268 149591 97130 60920 38857 34534 46482 39635 44086 56777 64190 75165
12715 75165 115582 100868 62800 52088 91817 105586 103841 91047 115260 116902 145116 185229
12703 185229 170661 146146 140835 129207 121052 114312 122744 135186 145321 162958 171148 180389 183923
12690 183923 173500 137348 83945 42568 71979 105171 106178 129807 159482 206582 261819 333472
12678 333472 343556 288415 212507 163460 132218 126901 110409 79146 68085 62179 89421 117129
$$ packed form
12765E4104l3673k0974k006K0631j6832j2828J0111K9562L0647p265m1113k7035
12753a6671K672L2656L7763K2020j1188j0808r681j3008R475j0902R734M544M522
12740E1128P017M003k5413j9175J0093p89L1627L0046J2827J8256J8719J7689
12728A56028M882M358j5677n2461l6210k2063m323J1948o847M451J2691P413J0975
12715G5165M0417j4714l8068j0712L9729J3769j745j2794K4213J642K8214M0113
12703A85229j4568k4515n311j1628q155o740Q432J2442J0135J7637Q190R241L534
12690A83923j0423l6152n3403m1377K9411L3192J007K3629K9675M7100N5237P1653
12678C33472J0084n5141p5908m9047l1242n317j6492l1263j1061n906K7242K7708
$$ plain form
12666 117129 105329 93893 69257 67867 75884 66170 85565 78533 74407 83125 73587 37156 31988
12653 31988 28746 52306 54687 43650 34735 37352 76766 104298 66893 42320 25803 31105 23051
12640 23051 28500 45596 66946 52106 48720 58208 65060 55052 66125 96530 125399 151579
12628 151579 144833 94417 46190 74089 85610 63940 98682 126331 112322 93243 67392 67821
12616 67821 36989 19497 49508 93939 136470 139747 130576 93612 91661 92232 114060 114278 122363
12603 122363 120056 119679 97111 80287 79142 95265 124180 120528 121222 128669 132337 94305 80041
12590 80041 86776 95291 108348 105184 84158 84924 101251 114142 103219 89509 112064 101943 117084
12577 117084 129282 115386 108573 126584 108253 105092 127676 147728 143955 119068 123634 130161
$$ packed form
12666A17129j1800j1436k4636j390Q017r714J9395p032m126Q718r538l6431n168
12653C1988l242K3560K381j1037q915K617L9414K7532l7405k4573j6517N302q054
12640B3051N449J7096K1350j4840l386R488O852j0008J1073L0405K8869K6180
12628A51579o746n0416m8227K7899J1521k1670L4742K7649j4009j9079k5851M29
12616F7821l0832j7492L0011M4431M2531L277r171l6964j951N71K1828K18Q085
12603A22363k307l77k2568j6824j145J6123K8915l652O94P447L668l8032j4264
12590H0041O735Q515J3057l164k1026P66J6327J2891j0923j3710K2555j0121J5141
12577A17084J2198j3896o813J8011j8331l161K2584K0052l773k4887M566O527
$$ plain form
12565 130161 147243 202797 257887 280883 273371 265012 235637 236273 270614 346335 414089 506347
12553 506347 582672 590229 567443 502929 445993 452170 444685 410301 366910 321791 307301 287468
12541 287468 276808 293689 331380 368056 410618 426730 414002 378030 390817 406118 418825
12530 418825 439762 435696 472788 519047 534077 529671 517945 481993 462369 462409 498327 543562
12518 543562 561727 581680 644556 726978 836687 958095 1122859 1297214 1377826 1303186 1147539
12507 1147539 1007572 885890 782503 719161 676642 644142 619542 574747 528822 492948 496988
12496 496988 538877 545075 536757 514705 482499 457707 447768 433437 406633 409882 428530 442093
12484 442093 456571 434762 387947 356462 325061 348870 374500 398539 433005 457374 470154
$$ packed form
12565A30161J7082N5554N5090K2996p512q359k9375O36L4341P5721O7754R2258
12553E06347P6325P557k2786o4514n6936O177p485l4384m3391m5119j4490j9833
12541B87468j0660J6881L7691L6676M2562J6112j2728l5972J2787J5301J2707
12530D18825K0937m066L7092M6259J5030m406j1726l5952j9624M0L5918M5235
12518E43562J8165J9953O2876Q2422J09709J21408J64764J74355Q0612p4640j55647
12507A147539j39967j21682j03387o3342m2519l2500k4600m4795m5925l5874M040
12496D96988M1889O198q318k2052l2206k4792r939j4331k6804L249J8648J3563
12484D42093J4478k1809m6815l1485l1401K3809K5630K4039L4466K4369J2780
$$ plain form
12473 470154 484542 510213 506180 534885 607079 630683 601376 508967 402169 300595 255985
12462 255985 237640 248732 258696 228662 214523 208093 237551 234245 221170 205302 202235 185069
12450 185069 182967 190264 169372 177692 202553 196248 205240 221075 218534 206627 198806 189111 189246
12437 189246 172099 153561 137504 123488 136281 151947 145561 151392 178028 171352 179851 181484
12425 181484 148914 162146 152433 172398 194370 186207 160480 163158 184108 160940 154819 185346
12413 185346 213865 204396 184034 177518 159008 170377 187363 195919 195633 198300 195792 206832 193417
12400 193417 167196 188934 197540 204844 219643 235685 218908 204573 214101 210811 183507 190424
12388 190424 193799 203309 226476 219389 195264 178194 179367 188499 193354 185214 175693 196440 237876
$$ packed form
12473D70154J4388K5671m033K8705P2194K3604k9307r2409j06798j01574m4610
12462B55985j8345J1092R964l0034j4139o430K9458l306j3075j5868l067j7166
12450A85069k102P297k0892Q320K4861o305Q992J5835k541j1907p821r695J35
12437A89246j7147j8538j6057j4016J2793J5666o386N831K6636o676Q499J633
12425A81484l2570J3232r713J9965K1972q163k5727K678K0950k3168o121L0527
12413A85346K8519r469k0362o516j8510J1369J6986Q556k86K667k508J1040j3415
12400A93417k6221K1738Q606P304J4799J6042j6777j4335R528l290k7304O917
12388A90424L375R510K3167p087k4125j7070J173R132M855q140r521K0747M1436
$$ plain form
12375 237876 278010 259176 290465 363579 384250 443681 467845 469017 464134 429568 377009 344351
12363 344351 305826 267925 246429 236872 232161 240864 231486 228392 230251 222834 228689 251441 262207
12350 262207 274817 292904 290037 283922 309011 312141 296264 306499 336568 330250 326517 322753 332502
12337 332502 352361 361913 356614 371516 405455 477712 566949 659185 767225 867242 914334
12326 914334 911995 849242 727581 602653 497209 410437 385752 383028 381496 383048 356865 312399
12314 312399 300836 280264 264465 282612 281110 293051 280159 268842 283277 302315 296614 289221
12302 289221 305733 305978 302801 332492 331998 312118 310276 320999 326014 323866 356128 359677 391818
12289 391818 415087 465038 527625 578403 586617 578738 535488 485177 438850 386521 353091 354764
$$ packed form
12375B37876M0134j8834L1289P3114K0671N9431K4164J172m883l4566n2559l2658
12363C44351l8525l7901k1496r557m711Q703r378l094J859p417N855K2752J0766
12350B62207J2610J8087k867o115K5089L130j5877J0235L0069o318l733l764R749
12337C32502J9859R552n299J4902L3939P2257Q9237R2236J08040J00017M7092
12326I14334k339o2753j21661j24928j05444q6772k4685k724j532J552k6183m4466
12314C12399j1563k0572j5799J8147j502J1941j2892j1317J4435J9038n701p393
12302B89221J6512K45l177K9691m94j9880j842J0723N015k148L2262L549L2141
12289C91818K3269M9951O2587N0778Q214p879m3250n0311m6327n2329l3430J673
$$ plain form
12277 354764 344414 317864 316205 317336 307692 308868 325246 302059 292505 289935 277550 264428 281281
12264 281281 278938 294613 291565 280272 265039 291965 291011 295855 302360 271983 248908 236752 252365
12251 252365 266011 259233 265627 287411 300825 280061 273715 261037 244902 242333 249473 265897
12239 265897 285957 277805 289330 306091 297697 304877 330608 331622 325069 338566 343589 325356 342361
12226 342361 347321 346136 357094 352367 323017 321364 336728 326509 329235 331653 315686 294783 277346
12213 277346 284316 296340 295434 344397 360008 349810 334204 336245 336601 344820 376448 369616 356091
12200 356091 338983 329348 337200 335791 315978 319060 291705 291639 305232 311120 307218 318670 346937
12187 346937 380844 358446 338950 322059 337336 349042 345626 346228 367767 375672 358510 381855
$$ packed form
12277C54764j0350k6550j659J131r644J176J6378k3187r554k570j2385j3122J6853
12264B81281k343J5675l048j1293j5233K6926r54M844O505l0377k3075j2156J5613
12251B52365J3646o778O394K1784J3414k0764o346j2678j6135k569P140J6424
12239B65897K0060q152J1525J6761q394P180K5731J014o553J3497N023j8233J7005
12226C42361M960j185J0958m727k9350j653J5364j0219K726K418j5967k0903j7437
12213B77346O970J2024r06M8963J5611j0198j5606K041L56Q219L1628o832j3525
12200C56091j7108r635P852j409j9813L082k7355o6J3593N888l902J1452K8267
12187C46937L3907k2398j9496j6891J5277J1706l416O02K1539P905j7162K3345
$$ plain form
12175 381855 399433 383096 386373 408232 404709 389027 382446 375216 356007 361333 376095 384709 390170
12162 390170 397018 394876 393971 400763 384520 379638 371839 374661 387572 415170 408974 403807 398801 404739
12148 404739 439793 448532 456000 455759 451124 462122 463918 471092 456599 438871 431915 416618 408058
12135 408058 401784 429492 440759 438123 447048 475790 489644 514901 526170 537892 543959 531820
12123 531820 498909 473892 460724 458083 468157 480148 487894 488024 510481 525786 503387 480676
12111 480676 466556 491543 512184 481252 473955 472758 476824 482305 485063 494964 477465 459584 458730
12098 458730 452567 478600 514526 489425 501514 495673 485461 487984 518334 538748 552212 519703
12086 519703 498756 498403 522929 514292 487493 507073 516774 527818 554876 546571 524465 527390 542977
$$ packed form
12175C81855J7578j6337L277K1859l523j5682o581p230j9209N326J4762Q614N461
12162C90170O848k142r05O792j6243m882p799K822J2911K7598o196n167n006N938
12148D04739L5054Q739P468k41m635J0998J796P174j4493j7728o956j5297q560
12135D08058o274K7708J1267k636Q925K8742J3854K5257J1269J1722O067j2139
12123E31820l2911k5017j3168k641J0074J1991P746J30K2457J5305k2399k2711
12111D80676j4120K4987K0641l0932p297j197M066N481K758R901j7499j7881q54
12098D58730o163K6033L5926k5101J2089n841j0212K523L0350K0414J3464l2509
12086E19703k0947l53K4526q637k6799J9580R701J1044K7058q305k2106K925J5587
$$ plain form
12073 542977 520435 513427 505943 495910 522907 531065 541297 536902 532921 550027 565082 571792 592982
12060 592982 606984 608466 629524 611854 594618 600984 589379 588094 598877 582316 585022 593569
12048 593569 601057 604804 624189 634146 639873 640321 627983 620391 637064 669672 674174 638316 643970
12035 643970 669494 640032 615455 620482 641720 654469 662166 669289 655665 625666 619250 637812
12023 637812 659821 680813 691888 677461 660015 628655 651802 683337 676654 655352 655713 650300
12011 650300 647504 643022 650360 663909 676540 694201 688854 707256 705098 702273 703530 699404 721704
11998 721704 741826 739495 703471 689375 721519 738043 751653 757924 762109 767679 769765 792636
11986 792636 805433 796862 786362 818156 805868 799673 810019 817960 785594 769629 768726 764497 790345
$$ packed form
12073E42977k2542p008p484j0033K6997Q158J0232m395l981J7106J5055O710K1190
12060E92982J4002J482K1058j7670j7236O366j1605j285J0783j6561K706Q547
12048E93569P488L747J9385R957N727M48j2338p592J6673L2608M502l5858N654
12035F43970K5524k9462k4577N027K1238J2749P697P123j3624k9999o416J8562
12023F37812K2009K0992J1075j4427j7446l1360K3147L1535o683k1302L61n413
12011F50300k796m482P338J3549J2631J7661n347J8402k158k825J257m126K2300
11998G21704K0122k331l6024j4096L2144J6524J3610O271M185N570K086K2871
11986G92636J2797q571j0500L1794j2288o195J0346P941l2366j5965r03m229K5848
$$ plain form
11973 790345 797017 788099 807816 821955 839113 834486 822328 830469 856097 871060 877120 863726
11961 863726 855299 850974 898924 928257 902891 917189 926370 920494 917020 910841 920994 921063 931946
11948 931946 945487 951669 946474 957941 960172 966701 979751 991578 1013902 999414 993446 997745 1002479
11935 1002479 1018068 997349 979269 987899 992656 1013707 1008786 1019422 1017874 1041787 1035397 1023545
11923 1023545 1021015 1030750 1058929 1084193 1094654 1096503 1117003 1147764 1140416 1097574 1083052 1084209
11911 1084209 1102580 1111659 1115493 1099773 1116231 1125178 1136357 1133148 1153947 1162433 1178881 1199943
11899 1199943 1205699 1201229 1209720 1230006 1227497 1210341 1199598 1204618 1219350 1240793 1248170 1264025
11887 1264025 1273878 1272864 1290361 1302176 1333013 1334947 1326912 1340587 1344918 1350384 1337108 1364199
$$ packed form
11973G90345O672q918J9717J4139J7158m627j2158Q141K5628J4963O060j3394
11961H63726q427m325M7950K9333k5366J4298R181n876l474o179J0153O9J0883
11948I31946J3541O182n195J1467K231O529J3050J1827K2324j4488n968M299M734
11935A002479J5589k0719j8080Q630M757K1051m921J0636j548K3913o390j1852
11923A023545k530R735K8179K5264J0461J849K0500L0761p348m2842j4522J157
11911A084209J8371R079L834j5720J6458Q947J1179l209K0799Q486J6448K1062
11899A199943N756m470Q491K0286k509j7156j0743N020J4732K1443P377J5855
11887A264025R853j014J7497J1815L0837J934q035J3675M331N466j3276K7091
$$ plain form
11875 1364199 1372991 1380841 1398076 1404951 1384059 1379485 1394953 1426263 1435764 1444590 1446251 1426310 1444451
11862 1444451 1447298 1452214 1470846 1506240 1512141 1476280 1475505 1506536 1523797 1543783 1571302 1591219
11850 1591219 1579004 1583469 1592943 1605152 1636115 1664783 1680851 1671943 1681358 1703410 1703158 1700780 1718802
11837 1718802 1741694 1751457 1744548 1757238 1789613 1808348 1827397 1818390 1836245 1842110 1831360 1829659
11825 1829659 1836404 1846877 1859898 1893317 1943788 1990467 2009189 2018330 2010539 2007097 2038007 2114745
11813 2114745 2142806 2115676 2073479 2096558 2130717 2132622 2106701 2097997 2122208 2121762 2130536 2180908
11801 2180908 2218675 2216896 2224932 2242652 2274968 2294965 2294962 2310488 2323300 2327573 2345076 2360391 2396535
11788 2396535 2418165 2423846 2444676 2470747 2488874 2484131 2461184 2472434 2486699 2529182 2568745 2591484
$$ packed form
11875A364199Q792P850J7235O875k0892m574J5468L1310R501Q826J661j9941J8141
11862A444451K847M916J8632L5394N901l5861p75L1031J7261J9986K7519J9917
11850A591219j2215M465R474J2209L0963K8668J6068q908R415K2052k52k378J8022
11837A718802K2892R763o909J2690L2375J8735J9049r007J7855N865j0750j701
11825A829659O745J0473J3021L3419N0471M6679J8722R141p791l442L0910P6738
11813B114745K8061k7130m2197K3079L4159J905k5921q704K4211m46Q774N0372
11801B180908L7767j779Q036J7720L2316J9997lJ5526J2812M273J7503J5315L6144
11788B396535K1630N681K0830K6071J8127m743k2947J1250J4265M2483L9563K2739
$$ plain form
11776 2591484 2616188 2654260 2679776 2698108 2723909 2743484 2770797 2818682 2843713 2833863 2839944 2862931
11764 2862931 2875983 2899417 2919166 2931338 2963653 2986986 3029429 3064234 3095251 3116113 3152586
11753 3152586 3163108 3183781 3198629 3210791 3222474 3246918 3282518 3310111 3345875 3367435 3418293
11742 3418293 3461111 3487011 3511905 3534182 3562440 3573343 3633602 3670702 3691571 3714258 3723264
11731 3723264 3759702 3795258 3813454 3835936 3891161 3948729 3955318 3990859 4024759 4069347 4087937
11720 4087937 4113299 4155161 4209332 4238407 4281174 4341822 4375145 4401429 4429447 4443516 4505868
11709 4505868 4580687 4625559 4655260 4694007 4740948 4790797 4851404 4873812 4875180 4904895 4969053
11698 4969053 5016151 5042968 5081648 5151629 5232912 5295175 5329907 5382103 5419725 5458125 5495921
$$ packed form
11776B591484K4704L8072K5516J8332K5801J9575K7313M7885K5031r850O081K2987
11764B862931J3052K3434J9749J2172L2315K3333M2443L4805L1017K0862L6473
11753C152586J0522K0673J4848J2162J1683K4444L5600K7593L5764K1560N0858
11742C418293M2818K5900K4894K2277K8258J0903O0259L7100K0869K2687R006
11731C723264L6438L5556J8196K2482N5225N7568O589L5541L3900M4588J8590
11720D087937K5362M1862N4171K9075M2767O0648L3323K6284K8018J4069O2352
11709D505868P4819M4872K9701L8747M6941M9849O0607K2408J368K9715O4158
11698D969053M7098K6817L8680O9981Q1283O2263L4732N2196L7622L8400L7796
$$ plain form
11687 5495921 5540490 5607688 5688685 5765128 5803227 5856285 5945929 6025058 6057471 6099763 6139970
11676 6139970 6198334 6261496 6326718 6377682 6420562 6504103 6591182 6641613 6685031 6755354 6828611
11665 6828611 6903177 6968672 7028224 7082252 7160276 7243702 7304288 7369513 7445936 7542272 7621452
11654 7621452 7687481 7742696 7841171 7935336 7981155 8036084 8104556 8214392 8311007 8420069 8514988
11643 8514988 8559814 8597080 8688995 8781637 8866613 8936818 9015090 9078447 9154966 9252460 9367844
11632 9367844 9474311 9526619 9618601 9745377 9846295 9935284 10016460 10108778 10198529 10284080 10381436
11621 10381436 10495022 10615935 10710510 10793404 10860041 10959281 11030933 11110538 11217906 11320259
11611 11320259 11421909 11543237 11631216 11710905 11792217 11905686 11997006 12060432 12124285 12228850
$$ packed form
11687E495921M4569O7198Q0997P6443L8099N3058Q9644P9129L2413M2292M0207
11676F139970N8364O3162O5222N0964M2880Q3541Q7079N0431M3418P0323P3257
11665F828611P4566O5495N9552N4028P8024Q3426O0586O5225P6423R6336P9180
11654G621452O6029N5215R8475R4165M5819N4929O8472J09836R6615J09062R4919
11643H514988M4826L7266R1915R2642Q4976P0205P8272O3357P6519R7494J15384
11632I367844J06467N2308R1982J26776J00918Q8989Q1176R2318Q9751Q5551R7356
11621A0381436J13586J20913R4575Q2894O6637R9240P1652P9605J07368J02353
11611A1320259J01650J21328Q7979P9689Q1312J13469R1320O3426O3853J04565
$$ plain form
11601 12228850 12327364 12412220 12503034 12586569 12704759 12799335 12879535 12953188 13009068 13061257 13153238
11590 13153238 13202931 13248111 13321376 13413649 13486760 13555598 13627841 13722758 13791731 13844253 13926575
11579 13926575 13996140 14043830 14058494 14103819 14135051 14165101 14241761 14319043 14375506 14396311 14435369
11568 14435369 14462601 14491302 14513861 14531789 14558962 14565143 14594800 14630877 14626800 14622462 14635014 14659934
11556 14659934 14661505 14653885 14634404 14643693 14648201 14628622 14589038 14575212 14538091 14515157 14473305 14413669
11544 14413669 14387570 14383194 14327484 14272642 14229999 14189147 14132146 14061190 14014902 13977538 13891816
11533 13891816 13812660 13800933 13738248 13670590 13585014 13522696 13453916 13378683 13322964 13260831 13176706
11522 13176706 13096706 13004023 12949070 12855244 12772212 12698578 12608676 12517251 12412393 12294023 12190487
$$ packed form
11601A2228850R8514Q4856R0814Q3535J18190R4576Q0200P3653N5880N2189R1981
11590A3153238M9693M5180P3265R2273P3111O8838P2243R4917O8973N2522Q2322
11579A3926575O9565M7690J4664M5325L1232L0050P6660P7282N6463K0805L9058
11568A4435369K7232K8701K2559J7928K7173O181K9657L6077m077m338J2552K4920
11556A4659934J571p620j9481R289M508j9579l9584j3826l7121k2934m1852n9636
11544A4413669k6099m376n5710n4842m2643m0852n7001p0956m6288l7364q5722
11533A3891816p9156j1727o2685o7658q5576o2318o8780p5233n5719o2133q4125
11522A3176706q0000r2683n4953r3826q3032p3634q9902r1425j04858j18370j03536
$$ plain form
11511 12190487 12149970 12083657 11996825 11893572 11790042 11688098 11572739 11480420 11387032 11293470
11501 11293470 11222285 11136421 11023225 10902807 10815947 10722738 10626672 10543258 10432007 10318857
11491 10318857 10237172 10156507 10055229 9959739 9863045 9778753 9683135 9586536 9502573 9430878 9334745
11480 9334745 9238069 9140832 9071098 8961618 8881817 8824985 8753077 8648858 8568864 8483597 8400479
11469 8400479 8316905 8212776 8115592 8029803 7954786 7882955 7794101 7703866 7630905 7570546 7485271
11458 7485271 7429719 7377149 7303863 7216226 7141676 7052700 6958046 6916889 6860113 6793335 6711624
11447 6711624 6636678 6585743 6508326 6430637 6370705 6327001 6272102 6191830 6138815 6098910 6031216
11436 6031216 5963936 5912977 5851590 5800427 5720131 5658201 5602142 5581409 5527512 5451751 5390233
$$ packed form
11511A2190487m0517o6313q6832j03253j03530j01944j15359r2319r3388r3562
11501A1293470p1185q5864j13196j20418q6860r3209r6066q3414j11251j13150
11491A0318857q1685q0665j01278r5490r6694q4292r5618r6599q3963p1695r6133
11480I334745r6676r7237o9734j09480p9801n6832p1908j04219p9994q5267q3118
11469H400479q3574j04129r7184q5789p5017p1831q8854r0235p2961o0359q5275
11458G485271n5552n2570p3286q7637p4550q8976r4654m1157n6776o6778q1711
11447F711624p4946n0935p7417p7689n9932m3704n4899q0272n3015l9905o7694
11436F031216o7280n0959o1387n1163q0296o1930n6059k0733n3897p5761o1518
$$ plain form
11425 5390233 5344959 5309380 5261316 5219056 5155621 5129076 5085859 5029512 4965534 4921787 4876254
11414 4876254 4854725 4812592 4755776 4681920 4631754 4591996 4541905 4512640 4479909 4426338 4373724
11403 4373724 4332084 4312359 4273107 4234450 4197048 4150936 4098716 4063768 4026025 4021257 4009388
11392 4009388 3956208 3912024 3867579 3828568 3799581 3752391 3723125 3667187 3634785 3610956 3586867
11381 3586867 3532893 3512037 3483264 3475840 3452199 3416346 3372815 3349638 3301330 3269958 3273243 3251179
11369 3251179 3215121 3180189 3162475 3139784 3109100 3092708 3079668 3037308 3005853 2984574 2945397
11358 2945397 2921261 2913590 2876173 2857389 2850540 2824528 2776305 2742505 2718209 2678626 2646518 2628939
11346 2628939 2614184 2580419 2560404 2537353 2523174 2509248 2496248 2488957 2483307 2464630 2451893 2431395
$$ packed form
11425E390233m5274l5579m8064m2260o3435k6545m3217n6347o3978m3747m5533
11414D876254k1529m2133n6816p3856n0166l9758n0091k9265l2731n3571n2614
11403D373724m1640j9725l9252l8657l7402m6112n2220l4948l7743m768j1869
11392D009388n3180m4184m4445l9011k8987m7190k9266n5938l2402k3829k4089
11381C586867n3974k0856k8773p424k3641l5853m3531k3177m8308l1372L285k2064
11369C251179l6058l4932j7714k2691l0684j6392j3040m2360l1455k1279l9177
11358B945397k4136p671l7417j8784o849k6012m8223l3800k4296l9583l2108j7579
11346B628939j4755l3765k0015k3051j4179j3926j3000p291n650j8677j2737k0498
$$ plain form
11334 2431395 2432383 2401313 2372298 2372386 2345994 2307693 2298679 2296221 2278712 2249443 2249394 2241825 2210695
11321 2210695 2169395 2171981 2175724 2150390 2157161 2114649 2079314 2068502 2045594 2029583 2034959 2000633
11309 2000633 1967689 1963973 1947520 1885148 1882706 1883325 1892031 1883784 1871388 1867585 1847549 1845534 1822811
11296 1822811 1798167 1771303 1752226 1749807 1737378 1727129 1701536 1724969 1735928 1717741 1679836
11285 1679836 1686056 1663898 1632365 1602046 1586020 1589878 1609708 1615789 1600050 1581095 1572228 1539297
11273 1539297 1508603 1526532 1548761 1555645 1557681 1559997 1555119 1540001 1511496 1465836 1464594 1482353
11261 1482353 1448941 1428549 1389026 1371318 1374601 1370786 1370894 1345822 1346619 1347229 1344065 1349650 1340406
11248 1340406 1335111 1339817 1333068 1318607 1300228 1284524 1268809 1245568 1219755 1232166 1236619 1252481
$$ packed form
11334B431395R88l1070k9015Q8k6392l8301r014k458j7509k9269m9p569l1130
11321B210695m1300K586L743k5334O771m2512l5335j0812k2908j6011N376l4326
11309B000633l2944l716j6453o2372k442O19Q706q247j2396l803k0036k015k2723
11296A822811k4644k6864j9077k419j2429j0249k5593K3433J0959j8187l7905
11285A679836O220k2158l1533l0319j6026L858J9830O081j5739j8955q867l2931
11273A539297l0694J7929K2229O884K036K316m878j5118k8505m5660j242J7759
11261A482353l3412k0392l9523j7708L283l815J08k5072P97O10l164N585r244
11248A340406n295M706o749j4461j8379j5704j5715k3241k5813J2411M453J5862
$$ plain form
11236 1252481 1269751 1287557 1281515 1264733 1272611 1261947 1288494 1336536 1396097 1513072 1626167
11225 1626167 1684628 1696465 1687301 1628083 1511634 1391983 1310530 1264025 1208989 1180141 1140722
11214 1140722 1101653 1092731 1066945 1055106 1079071 1101711 1077341 1059257 1050238 1029216 1016041 1024909
11202 1024909 1020709 1048290 1051994 1033535 1000030 977646 933450 920140 943566 957266 956890 936432
11190 936432 950412 960044 972675 982322 938651 904687 898026 869928 875674 879933 893692 891797 882696
11177 882696 860796 856570 856766 865152 885783 913533 881301 856579 866429 840598 827392 788669
11165 788669 768313 783596 829204 810453 769662 785658 803920 808732 789640 817582 830456 795314
11153 795314 765803 772754 784403 778316 775111 767058 738737 726027 725159 722765 736067 729060 721543
$$ packed form
11236A252481J7270J7806o042j6782P878j0664K6547M8042N9561J16975J13095
11225A626167N8461J1837r164n9218j16449j19651q1453m6505n5036k8848l9419
11214A140722l9069q922k5786j1839K3965K2640k4370j8084r019k1022j3175Q868
11202A024909m200K7581L704j8459l3505k2384m4196j3310K3426J3700l76k0458
11190I36432J3980R632J2631R647m3671l3964o661k8098N746M259J3759j895r101
11177H82696k1900m226J96Q386K0631K7750l2232k4722R850k5831j3206l8723
11165G88669k0356J5283M5608j8751m0791J5996J8262M812j9092K7942J2874l5142
11153G95314k9511O951J1649o087l205q053k8321j2710q68k394J3302p007p517
$$ plain form
11140 721543 750758 757800 732227 707680 715569 728512 711310 687844 687648 697886 683887 670918
11128 670918 667398 654492 653171 674575 685366 717561 742274 744316 755510 767574 839797 948752
11116 948752 1036261 1074899 1104416 1110169 1090833 1030501 956930 861690 778125 728666 695712 667223
11104 667223 652274 648548 643725 619575 582176 578748 576658 583055 564201 559271 553036 580880 570167
11091 570167 550890 529301 529811 546416 560962 560709 556171 552709 539577 518200 518349 543466 543242
11078 543242 545429 570908 561432 556036 554985 565275 549280 544643 553093 531745 548093 547885 545359
11065 545359 522467 525389 543747 530373 522146 500517 492927 493008 492608 494869 486813 473397 472669 485095
11051 485095 475631 481872 496494 507988 522888 529945 529177 508910 529573 537561 509086 545899 591121
$$ packed form
11140G21543K9215P042k5573k4547P889J2943j7202k3466j96J0238j3999j2969
11128F70918l520j2906j321K1404J0791L2195K4713K042J1194J2064P2223J08955
11116I48752Q7509L8638K9517N753j9336o0332p3571r5240q3565m9459l2954k8489
11104F67223j4949l726m823k4150l7399l428k090O397j8854m930o235K7844j0713
11091E70167j9277k1589N10J6605J4546k53m538l462j3132k1377J49K5117k24
11078E43242K187K5479r476n396j051J0290j5995m637Q450k1348J6348k08k526
11065E45359k2892K922J8358j3374q227k1629p590Q1m00K261q056j3416p28J2426
11051D85095r464O241J4622J1494J4900P057p68k0267K0663P988k8475L6813M5222
$$ plain form
11038 591121 608845 615395 597944 561908 515849 503835 495930 490767 476449 480453 467956 441230
11026 441230 445645 457666 451744 449348 446968 459518 440658 430072 396175 426437 441052 421986
11014 421986 445614 433529 413263 410537 411901 410386 408823 408111 414897 424822 419253 432281 413515
11001 413515 387196 381032 366460 345980 349131 315028 297444 275656 265273 261050 288101 307152
10989 307152 343582 347896 320791 314475 307554 308814 312786 323213 324989 332242 347914 321771 326570
10976 326570 340699 340496 347147 332975 334014 348267 342080 322945 326540 322104 331097 335673 344123
10963 344123 320314 311024 313063 316052 296109 266712 260415 253443 271147 286346 290466 292265 300864
10950 300864 270748 279179 305009 275369 245389 266745 308418 316691 319410 299188 294547 306585
$$ packed form
11038E91121J7724O550j7451l6036m6059j2014p905n163j4318M004j2497k6726
11026D41230M415J2021n922k396k380J2550j8860j0586l3897L0262J4615j9066
11014D21986K3628j2085k0266k726J364j515j563p12O786R925n569J3028j8766
11001D13515k6319o164j4572k0480L151l4103j7584k1788j0383m223K7051J9051
10989C07152L6430M314k7105o316o921J260L972J0427J776P253J5672k6143M799
10976C26570J4129k03O651j4172J039J4253o187j9135L595m436Q993M576Q450
10963C44123k3809r290K039K989j9943k9397o297o972J7704J5199M120J799Q599
10950C00864l0116Q431K5830k9640k9980K1356M1673Q273K719k0222m641J2038
$$ plain form
10938 306585 310148 310611 284952 247506 242744 249217 268691 263125 273957 287731 284442 293859 288943
10925 288943 260705 243368 247201 269415 273901 267297 280752 304383 307803 281794 279693 272087 273332
10912 273332 276247 310909 337246 314898 283669 256241 262166 288441 282367 264908 267039 247203
10900 247203 224083 213529 239515 263235 282669 265349 237071 224671 220799 202357 202667 218439
10888 218439 247634 269220 244158 240696 234569 222655 193108 214706 209364 184690 189823 216064
10876 216064 217591 211928 183431 185272 192258 197561 194707 193399 219912 257940 259577 258426 232294
10863 232294 214153 229753 236982 200704 175995 191237 201850 176139 163893 166186 178215 182248
10851 182248 193989 186923 188461 200747 213831 222858 232486 215389 219102 219951 218235 227485 218935
$$ packed form
10938C06585L563M63k5659l7446m762O473J9474n566J0832J3774l289R417m916
10925B88943k8238j7337L833K2214M486o604J3455K3631L420k6009k101p606J245
10912B73332K915L4662K6337k2348l1229k7428N925K6275o074j7459K131j9836
10900B47203k3120j0554K5986K3720J9434j7320k8278j2400l872j8442L10J5772
10888B18439K9195K1586k5062l462o127j1914k9547K1598n342k4674N133K6241
10876B16064J527n663k8497J841O986N303k854j308K6513L8028J637j151k6132
10863B32294j8141J5600P229l6278k4709J5242J0613k5711j2246K293J2029M033
10851A82248J1741p066J538J2286J3084R027R628j7097L713Q49j716R250q550
$$ plain form
10838 218935 206551 185454 167652 183988 195348 205265 186609 186104 191580 220862 226486 235089 229961
10825 229961 209652 190509 186655 166087 169505 172456 194342 179648 165418 162898 175594 180635
10813 180635 197177 179998 159681 156671 155586 160713 167154 156581 167296 190784 176200 182405
10801 182405 177693 175818 166934 168528 162164 171848 175294 176942 192946 176391 201048 223564 213322
10788 213322 170454 156825 168085 171267 177510 171717 169594 169403 187710 177427 148871 120934 120881
10775 120881 139141 154170 160432 163027 147095 144970 150823 164278 174650 147961 126821 118465
10763 118465 143820 112132 99417 135133 167679 169704 153334 130655 140264 146321 142570 136929
10751 136929 142099 146176 158239 155363 141024 131566 163505 154572 161483 167233 160413 152160 158949
$$ packed form
10838B18935j2384k1097j7802J6336J1360R917j8656n05N476K9282N624Q603n128
10825B29961k0309j9143l854k0568L418K951K1886j4694j4230k520J2696N041
10813A80635J6542j7179k0317l010j085N127O441j0573J0715K3488j4584O205
10801A82405m712j875q884J594o364R684L446J648J6004j6555K4657K2516j0242
10788B13322m2868j3629J1260L182O243n793k123j91J8307j0283k8556k7937n3
10775A20881J8260J5029O262K595j5932k125N853J3455J0372k6689k1140q356
10763A18465K5355l1688j2715L5716L2546K025j6370k2679R609O057l751n641
10751A36929N170M077J2063k876j4339r458L1939q933O911N750o820q253O789
$$ plain form
10738 158949 189315 212636 189196 157042 145852 129740 126666 114502 127611 162233 152732 134974
10726 134974 141043 157460 145335 141469 143529 167802 191115 175842 174265 186379 153481 142086
10714 142086 162884 162733 157429 147140 138325 127127 115990 130768 144321 150698 154676 161355 156177
10701 156177 146820 148268 156606 146401 153468 145491 141629 134911 136742 112977 89084 85703 98430
10688 98430 115869 130381 132209 100663 137572 166032 150221 144819 155628 173890 186372 164182
10676 164182 152091 142093 144634 170983 149565 110069 130540 134213 126921 132775 126675 134899 145154
10663 145154 167752 168848 177464 159370 130152 124659 144340 147133 129297 128826 171794 213502 214475
10650 214475 173690 175415 161889 140153 140189 138614 138579 127308 102900 114745 129607 141374 144241
$$ packed form
10738A58949L0366K3321k3440l2154j1190j6112l074j2164J3109L4622r501j7758
10726A34974O069J6417j2125l866K060K4273K3313j5273j577J2114l2898j1395
10714A42086K0798j51n304j0289q815j1198j1137J4778J3553O377L978O679n178
10701A56177r357J448Q338j0205P067p977l862o718J831k3765k3893l381J2727
10688I8430J7439J4512J828l1546L6909K8460j5811n402J0809J8262J2482k2190
10676A64182j2091r998K541K6349k1418l9496K0471L673p292N854o100Q224J0255
10663A45154K2598J096Q616j8094k9218n493J9681K793j7836m71M2968M1708R73
10650B14475m0785J725j3526k1736L6j575l5j1271k4408J1845J4862J1767K867
$$ plain form
10637 144241 156526 154906 168668 175327 158322 136539 132214 153275 159969 151981 136180 138167 143490
10624 143490 153743 169791 187781 173847 183344 191891 170561 158626 152361 148318 175461 179118
10612 179118 168066 162745 111596 89778 83054 77195 88973 94480 98816 123185 137963 117818
10600 117818 93964 103728 97752 100801 86949 113613 136218 158956 154179 135637 131818 130344 119277
10587 119277 116136 123385 135971 160588 176163 154027 141164 141005 144627 133893 137135 133529 116462
10574 116462 92464 77818 84289 94212 78131 91799 95263 77515 76748 56302 50814 80025 101374
10561 101374 94142 82485 76089 51621 48910 83242 84395 81142 64961 78898 81887 78532 58520
10548 58520 81495 93904 66794 42530 54669 60482 61626 67519 86053 95011 85271 101379 97554
$$ packed form
10637A44241J2285j620J3762O659j7005k1783m325K1061O694p988j5801J987N323
10624A43490J0253J6048J7990j3934R497Q547k1330j1935o265m043K7143L657
10612A79118j1052n321n1149k1818o724n859J1778N507M336K4369J4778k0145
10600A17818k3854R764n976L049j3852K6664K2605K2738m777j8542l819j474j1067
10587A19277l141P249J2586K4617J5575k2136j2863j59L622j0734L242l606j7067
10574A16462k3998j4646O471R923j6081J3668L464j7748p67k0446n488K9211K1349
10561A01374p232j1657o396k4468k711L4332J153l253j6181J3937K989l355k0012
10548E8520K2975J2409k7110k4264J2139N813J144N893J8534Q958r740J6108l825
$$ plain form
10535 97554 82901 85467 114333 132617 104028 91005 97331 82844 66017 52768 68673 69060
10523 69060 55754 57930 68617 64662 82680 98181 98761 80845 59736 86207 93441 82175 80821
10510 80821 88911 99436 124103 119823 86352 69609 59245 46662 67590 114544 131868 102825
10498 102825 93969 64053 36750 40614 55074 56107 82248 74018 69440 74275 86386 74744 65263
10485 65263 89037 73598 30410 49866 77979 89477 77541 95493 94376 65295 28510 34546
10473 34546 60285 61317 32563 68483 103869 100408 76838 74527 63021 69186 80764 88028 106887
10460 106887 110208 94116 78936 51670 42792 44494 28501 26859 42303 58962 50091 33505
10448 33505 48610 51915 45305 59541 63298 66846 42934 55397 55090 47648 51353 62767 89983
$$ packed form
10535I7554j4653K566K8866J8284k8589j3023O326j4487j6827j3249J5905L87
10523F9060j3306K176J0687l955J8018J5501N80j7916k1109K6471P234j1266j354
10510H0821Q090J0525K4667m280l3471j6743j0364j2583K0928M6954J7324k9043
10498A02825q856k9916k7303L864J4460J033K6141q230m578M835J2111j1642r481
10485F5263K3774j5439m3188J9456K8113J1498j1936J7952j117k9081l6785O036
10473C4546K5739J032k8754L5920L5386l461k3570k311j1506O165J1578P264J8859
10460A06887L321j6092j5180k7266q878J702j5993j642J5444J6659q871j6586
10448C3505J5105L305o610J4236L757L548k3912J2463l07p442L705J1414K7216
$$ plain form
10435 89983 86012 78832 67307 57978 51227 77088 65871 38532 52912 60968 55832 63112 50974
10422 50974 69917 76856 90921 110086 96899 87546 70772 50361 45660 69371 74232 66003 66727
10409 66727 62141 58113 29566 15228 10814 8973 -10510 -16647 -11148 10212 1178 15088 44284
10396 44284 24226 23384 53253 33707 32828 40134 45296 51643 71754 93233 84530 81994 63774
10383 63774 48451 43182 54804 52359 58574 39033 17468 7099 -1115 13599 38132 65213
10371 65213 69171 64190 53365 42940 31193 24652 27415 18729 5101 20810 37034 40583 29735
10358 29735 31318 26765 -5897 8714 37587 34426 33616 57524 80731 82012 58759 28885 38622
10345 38622 68225 37703 50546 63468 58283 74948 66233 55304 33914 49460 68632 27564
$$ packed form
10435H9983l971p180j1525r329o751K5861j1217k7339J4380Q056n136P280j2138
10422E0974J8943O939J4065J9165j3187r353j6774k0411m701K3711M861q229P24
10409F6727m586m028k8547j4338m414j841j9483o137N499K1360r034J3910K9196
10396D4284k0058q42K9869j9546q79P306N162O347K0111K1479q703k536j8220
10383F3774j5323n269J1622k445O215j9541k1565j0369q214J4714K4533K7081
10371F5213L958m981j0825j0425j1747o541K763q686j3628J5709J6224L549j0848
10358B9735J583m553l2662J4611K8873l161q10K3908K3207J281k3253k9874R737
10345C8622K9603l0522J2843J2922n185J6665q715j0929k1390J5546J9172m1068
$$ plain form
10333 27564 18815 38667 31737 18436 35837 41780 33090 41922 47572 58261 64682 71382 37205
10320 37205 5922 4538 22499 52072 86768 44436 26139 49267 56661 49895 49033 53635 29072
10307 29072 14691 15988 23537 23004 28331 31593 57693 68460 83204 107511 107383 99360 95627 109428
10293 109428 114379 102495 107328 91432 90994 106562 103831 129391 136571 138261 110027 101026 118655
10280 118655 143910 125297 127590 141154 130426 128815 122798 122978 123044 96715 83760 97368 84961
10267 84961 89569 90286 84015 53362 62788 67848 72945 83075 65490 40971 29417 41653 55223
10254 55223 62557 85100 115510 106266 80379 77531 82704 79445 67727 75676 77204 75443 105037
10241 105037 122995 115610 116069 131676 140694 149394 158600 170858 151682 121483 130784 108653 116121
$$ packed form
10333B7564q749J9852o930j3301J7401N943q690Q832N650J0689O421O700l4177
10320C7205l1283j384J7961K9573L4696m2332j8297K3128P394o766q62M602k4563
10307B9072j4381J297P549n33N327L262K6100J0767J4744K4307j28q023l733J3801
10293A09428M951j1884M833j5896m38J5568k731K5560P180J690k8234r001J7629
10280A18655K5255j8613K293J3564j0728j611o017J80O6k6329j2955J3608j2407
10267H4961M608P17o271l0653R426N060N097J0130j7585k4519j1554J2236J3570
10254E5223P334K2543L0410r244k5887k848N173l259j1718P949J528j761K9594
10241A05037J7958p385M59J5607R018Q700R206J2258j9176l0199R301k2131P468
$$ plain form
10228 116121 130452 130095 116848 122806 147130 151605 179213 194122 203096 220980 238257 263444
10216 263444 282853 332659 451803 619393 820277 1118364 1476314 1773954 2048069 2291038
10206 2291038 2560887 2727072 2651648 2395248 2130968 1877778 1562578 1203772 852775 613168
10196 613168 459968 356400 277648 243001 228748 213120 182084 142089 141201 151710 120368
10185 120368 138127 105722 59772 63365 53244 35626 47768 34384 22377 38389 39255 40236
10173 40236 52357 93003 91993 80630 82761 98849 69982 39174 72949 106481 128058 137343
10161 137343 128141 135557 152640 140791 170607 194514 185526 178645 160197 117345 92471 63808
10149 63808 38150 41761 36373 34184 19420 9800 22080 34838 23331 6477 33974 75687
$$ packed form
10228A16121J4331l57j3247N958K4324M475K7608J4909Q974J7884J7277K5187
10216B63444J9409M9806J19144J67590K00884K98087L57950K97640K74115K42969
10206B291038K69849J66185p5424k56400k64280k53190l15200l58806l50997k39607
10196F13168j53200j03568p8752l4647j4253j5628l1036l9995q88J0509l1342
10185A20368J7759l2405m5950L593j0121j7618J2142j3384j2007J6012Q66R81
10173D0236J2121M0646j010j1363K131J6088k8867l0808L3775L3532K1577R285
10161A37343r202P416J7083j1849K9816K3907q988o881j8448m2852k4874k8663
10149F3808k5658L611n388k189j4764r620J2280J2758j1507j6854K7497M1713
$$ plain form
10137 75687 91330 66123 59206 54729 40799 42267 56598 75395 101973 96490 58745 39097
10125 39097 43961 46239 50793 48464 36747 37070 51938 45342 45891 39400 69594 60681 29460 9044
10111 9044 23054 31190 49290 62297 58119 53039 57433 58284 42181 2682 -33493 -36475 -28630
10098 -28630 16765 32714 34823 28650 56553 55176 27778 45277 85261 81248 61193 57922 46508
10085 46508 51190 25573 6313 23647 53456 55435 43064 31547 25825 39768 36161 41545 44500
10072 44500 23205 22838 33378 48842 61623 54235 64502 58267 50911 37048 69476 85739 80411
10059 80411 98169 107163 85531 58487 47793 24603 46054 25103 17790 52891 62565 50624
10047 50624 60675 35699 45768 36075 52613 66741 52283 32274 26026 31582 9130 2210
$$ packed form
10137G5687J5643k5207o917m477j3930J468J4331J8797K6578n483l7745j9648
10125C9097M864K278M554k329j1717L23J4868o596N49o491L0194q913l1221k0416
10111I044J4010Q136J8100J3007m178n080M394Q51j6103l9499l6175k982P845
10098b8630M5395J5949K109o173K7903j377k7398J7499L9984m013k0055l271j1414
10085D6508M682k5617j9260J7334K9809J979j2371j1517n722J3943l607N384K955
10072D4500k1295l67J0540J5464J2781p388J0267o235p356j3863L2428J6263n328
10059H0411J7758Q994k1632k7044j0694k3190K1451k0951p313L5101R674j1941
10047E0624J0051k4976J0069r693J6538J4128j4458k0009o248N556k2452o920
$$ plain form
10035 2210 -2116 -11270 -9933 18212 51711 77675 72466 39278 25149 35210 72692 90572 98774
10022 98774 95081 65838 60183 65286 96376 111798 117107 94010 61116 43321 46417 84754 95993
10009 95993 93136 84301 70931 50021 66940 62444 49931 65578 62792 42520 29329 22938 47817
9996 47817 58870 55907 40437 14583 8293 21112 37525 54639 51949 52901 49091 59897 63366
9983 63366 55119 38367 49346 45615 12451 48244 66503 69340 63198 50758 82148 90927 89225
9970 89225 76755 60812 40509 54694 53836 23093 5649 47277 93011 76596 79952 86837 75239
9957 75239 86048 102724 100576 89475 83738 56389 45184 33324 19205 17143 20478 31208 52346
9944 52346 53440 28399 12659 56406 75942 71874 34291 -14020 13382 44025 51865 73914
$$ packed form
10035B210m326r154J337K8145L3499K5964n209l3188j4129J0061L7482J7880Q202
10022I8774l693k9243n655N103L1090J5422N309k3097l2894j7795L096L8337J1239
10009I5993k857q835j3370k0910J6919m496j2513J5647k786k0272j3191o391K4879
9996D7817J1053k963j5470k5854o290J2819J6413J7114k690R52l810J0806L469
9983F3366q247j6752J0979l731l3164L5793J8259K837o142j2440L1390Q779j702
9970H9225j2470j5943k0303J4185q58l0743j7444M1628M5734j6415L356O885j1598
9957G5239J0809J6676k148j1101n737k7349j1205j1860j4119k062L335J0730K1138
9944E2346J094k5041j5740M3747J9536m068l7583m8311K7402L0643P840K2049
$$ plain form
9932 73914 73531 29592 13785 -8392 -35686 -15511 28160 58718 69566 82919 79352 71167 72917
9919 72917 78921 68099 61274 86918 115401 119772 96292 70026 53391 65239 79043 73621 65395
9906 65395 70050 43125 85012 125735 133366 129846 117800 116373 126444 133923 133939 135326 104541 89586
9892 89586 107120 100681 107745 118701 131652 123123 107349 100209 95443 94264 75478 82649 86396
9879 86396 90110 113503 119953 118110 108093 93504 93329 101359 76565 64541 78827 86519 123399
9866 123399 129508 108722 86442 90140 109695 105939 119055 142149 145989 151811 115262 89635 85926
9853 85926 103138 120814 126699 122992 109317 94615 82648 79217 89999 108890 122286 119805 129903
9840 129903 155567 152490 143184 141014 167447 229768 270512 274322 284328 330717 458129 624770
$$ packed form
9932G3914l83m3939j5807k2177k7294K0175M3671L0558J0848J3353l567q185J750
9919G2917O004j0822o825K5644K8483M371k3480k6266j6635J1848J3804n422q226
9906F5395M655k6925M1887M0723P631l520j2046j427J0071P479J6J387l0785j4955
9892H9586J7534o439P064J0956J2951q529j5774p140m766j179j8786P171L747
9879H6396L714K3393O450j843j0017j4589j75Q030k4794j2024J4286P692L6880
9866A23399O109k0786k2280L698J9555l756J3116K3094L840N822l6549k5627l709
9853H5926J7212J7676N885l707j3675j4702j1967l431J0782J8891J3396k481J0098
9840A29903K5664l077r306k170K6433O2321M0744L810J0006M6389J27412J66641
$$ plain form
9828 624770 754400 828468 743950 580348 438468 333943 237525 201226 185055 149836 139548
9817 139548 132806 139667 104550 78629 81698 75035 99099 130062 97783 93166 94531 92171 79139
9804 79139 91726 81255 81744 81626 105326 101237 118375 131542 141267 112973 86517 118622 137647
9791 137647 123872 111589 133346 167390 164240 145598 115730 103693 103289 107430 103762 91299 87478
9778 87478 93792 78844 113247 123934 127393 124477 129748 140918 119847 118810 105767 115914 115475
9765 115475 123187 122267 115940 118939 123206 116361 148141 156671 176351 155641 92304 78398 106464
9752 106464 112624 104686 110425 90984 91397 100446 120167 113728 89910 79036 89712 69977 73657
9739 73657 113478 141337 170547 185655 151077 131337 104644 88052 109083 98958 99692 131884
$$ packed form
9828F24770J29630P4068q4518j63602j41880j04525r6418l6299j6171l5219j0288
9817A39548o742O861l5117k5921L069o663K4064L0963l2279m617J365k360j3032
9804G9139J2587j0471M89j18K3700m089J7138J3167R725k8294k6456L2105J9025
9791A37647j3775j2283K1757L4044l150j8642k9868j2037m04M141l668j2463l821
9778H7478O314j4948L4403J0687L459k916N271J1170k1071j037j3043J0147m39
9765A15475P712r20o327K999M267o845L1780Q530J9680k0710o3337j3906K8066
9752A06464O160p938N739j9441M13R049J9721o439k3818j0874J0676j9735L680
9739G3657L9821K7859K9210J5108l4578j9740k6693j6592K1031j0125P34L2192
$$ plain form
9727 131884 150430 153870 136153 134861 149359 117074 114412 116961 106346 120310 140638 124429
9715 124429 112656 109312 119312 128135 135357 140083 172956 158850 133950 147613 137768 115924 107767
9702 107767 135022 126371 141914 140202 135629 131774 158725 177569 160057 154901 171710 168390 177243
9689 177243 163615 138550 168098 171768 148016 150364 191714 186167 158235 156741 171423 160122
9677 160122 133124 152340 155968 167490 182140 171235 147052 149576 147619 143485 146307 142514 135266
9664 135266 137783 132227 142803 168220 171593 162848 171881 161479 153615 135664 162704 179479 166634
9651 166634 151491 165179 200776 220828 232477 190469 181328 180778 182956 207185 235984 223928
9639 223928 207805 200557 199316 172795 169192 182182 192329 194412 202348 208362 174772 165410 148949
$$ packed form
9727A31884J8546L440j7717j292J4498l2285k662K549j0615J3964K0328j6209
9715A24429j1773l344J0000Q823P222M726L2873j4106k4900J3663r845k1844q157
9702A07767K7255q651J5543j712m573l855K6951J8844j7512n156J6809l320Q853
9689A77243j3628k5065K9548L670k3752K348M1350n547k7932j494J4682j1301
9677A60122k6998J9216L628J1522J4650j0905k4183K524j957m134K822l793p248
9664A35266K517n556J0576K5417L373q745R033j0402p864j7951K7040J6775j2845
9651A66634j5143J3688L5597K0052J1649m2008r141n50K178K4229K8799j2056
9639B23928j6123p248j241k6521l603J2990J0147K083P936O014l3590r362j6461
$$ plain form
9626 148949 150786 129065 111104 140543 157837 168758 160977 182008 209318 222619 206693 180627
9614 180627 183390 183994 198185 222748 234452 205929 176415 167877 179640 183567 199423 200755 221582
9601 221582 219376 226712 241999 225241 232167 223451 221475 237883 222021 204398 200008 198462 179225
9588 179225 206237 217799 195159 195968 233725 244440 228008 237640 250652 227594 226128 235410 210170
9575 210170 208544 209781 211953 244341 285312 331763 383640 378345 345366 352493 357595 346089 348864
9562 348864 375590 404245 443856 522187 639661 714755 711184 641704 593358 585989 537702 466589
9550 466589 420380 379503 362933 366905 376880 388386 443133 470062 493091 520164 581378 612638
9538 612638 672527 697208 666316 634956 618486 619497 616195 607718 601027 573560 556834 559690 556139
$$ packed form
9626A48949J837k1721j7961K9439J7294J0921p781K1031K7310J3301j5926k6066
9614A80627K763O04J4191K4563J1704k8523k9514q538J1763L927J5856J332K0827
9601B21582k206P336J5287j6758O926q716j976J6408j5862j7623m390j546j9237
9588A79225K7012J1562k2640Q09L7757J0715j6432R632J3012k3058j466R282k5240
9575B10170j626J237K172L2388M0971M6451N1877n295l2979P127N102j1506K775
9562C48864K6726K8655L9611P8331J17474P5094l571o9480m8346p369m8287p1113
9550D66589m6209m0877j6570L972R975J1506N4747K6929K3029K7073O1214L1260
9538F12638N9889K4681l0892l1360j6470J011l302q477o691k7467j6726K856l551
$$ plain form
9525 556139 558929 557917 516332 502180 556368 662634 740023 898479 1109024 1385217 1587107
9514 1587107 1616174 1435566 1158375 910382 771914 677289 589911 534588 537736 523425 527903
9503 527903 549863 573179 592914 568260 559068 590919 617491 626994 627428 657031 707753 709089 699241
9490 699241 655459 572284 526196 500012 441463 399492 363890 350302 320979 297468 337354 392508
9478 392508 437004 506353 548703 598371 634272 653587 674385 605624 500967 419584 378060
9467 378060 339158 310397 312366 317173 302198 284700 310507 304947 278550 249946 260730 267203
9455 267203 264898 255728 247789 250105 253486 236343 247854 268398 263759 253943 249088 252114 275080
9442 275080 298714 288191 257149 257665 240366 229813 226573 229829 256617 235524 224661 266734
$$ packed form
9525E56139K790j012m1585j4152N4188J06266P7389J58456K10545K76193K01890
9514A587107K9067j80608k77191k47993j38468r4625q7378n5323L148j4311M478
9503E27903K1960K3316J9735k4654r192L1851K6572R503M34K9603N0722J336r848
9490F99241m3782q3175m6088k6184n8549m1971l5602j3588k9323k3511L9886N5154
9478C92508M4496O9349M2350M9668L5901J9315K0798o8761j04657q1383m1524
9467C78060l8902k8761J969M807j4975j7498K5807n560k6397k8604J0784O473
9455B67203k305r170p939K316L381j7143J1511K0544m639r816m855L026K2966
9442B75080K3634j0523l1042N16j7299j0553l240L256K6788k1093j0863M2073
$$ plain form
9430 266734 283400 295749 306069 323261 325746 282482 275689 297681 262631 235547 217715 244152
9418 244152 256783 255671 250735 233945 230995 222808 210970 218658 228191 256621 251232 231053 248209
9405 248209 265403 276235 264794 267895 237805 244574 241879 248398 232406 241144 236999 243392 252817
9392 252817 265334 254885 258541 251628 272478 286462 294493 270033 259413 247396 253733 272294
9380 272294 292807 282129 243917 247721 268970 256893 264999 289680 294855 304607 283546 283824 304830
9367 304830 301271 302716 306068 312773 308057 305830 306432 294659 290022 286660 283135 290715 301400 276025
9353 276025 268205 276649 255185 259397 264482 275228 295930 287567 261554 262746 249300 265529 252581
9340 252581 249705 274462 258163 231901 230532 236128 244964 246111 252544 279047 280032 268729 259415
$$ packed form
9430B66734J6666J2349J0320J7192K485m3264o793K1992l5050k7084j7832K6437
9418B44152J2631j112m936j6790k950q187j1838P688R533K8430n389k0179J7156
9405B48209J7194J0832j1441L101l0090O769k695O519j5992Q738m145O393R425
9392B52817J2517j0449L656o913K0850J3984Q031k4460j0620j2017O337J8561
9380B72294K0513j0678l8212L804K1249j2077Q106K4681N175R752k1061K78K1006
9367C04830l559J445L352O705m716k227O02j1773m637l362l525P580J0685k5375
9353B76025p820Q444k1464M212N085J0746K0702q363k6013J192j3446J6229j2948
9340B52581k876K4757j6299k6262j369N596Q836J147O433K6503R85j1303r314
$$ plain form
9327 259415 249924 262909 271491 282083 247995 244715 251645 267321 276210 273452 278768 255317 276166
9314 276166 287932 279091 279517 271892 251359 259311 257302 237300 241730 228913 206833 223636 233786
9301 233786 259437 284541 277694 289217 273356 282540 280074 267389 248232 259488 294799 285294
9289 285294 290482 304770 313006 299866 287237 299215 347269 347273 297142 240849 241754 259359 252989
9276 252989 290108 326070 327256 326996 322628 292521 304778 314353 333128 316147 321431 345487 347863
9263 347863 316598 267824 246431 263587 280953 266197 272713 248842 233544 235524 226855 248406
9251 248406 287378 299786 290987 271756 270117 220960 214061 219879 242242 247551 233717 221772 226802
9238 226802 237942 264462 266912 235743 237930 232275 235423 263710 285903 286590 268223 266300 269859
$$ packed form
9327B59415r491J2985Q582J0592l4088l280O930J5676Q889k758N316k3451K0849
9314B76166J1766q841M26p625k0533P952k009k0002M430j2817k2080J6803J0150
9301B33786K5651K5104o847J1523j5861R184k466j2685j9157J1256L5311r505
9289B85294N188J4288Q236j3140j2629J1978M8054Mn0131n6293R05J7605o370
9276B52989L7119L5962J186k60m368l0107J2257R575J8775j6981N284K4056K376
9263C47863l1265m8774k1393J7156J7366j4756O516k3871j5298J980q669K1551
9251B48406L8972J2408q799j9231j639m9157o899N818K2363N309j3834j1945N030
9238B26802J1140K6520K450l1169K187n655L148K8287K2193O87j8367j923L559
$$ plain form
9225 269859 276075 287696 298435 278084 253097 237303 229215 252700 283650 269788 247230 258563
9213 258563 241593 203919 196033 230471 254333 272254 281933 286824 284950 308650 300499 281171 274135
9200 274135 291497 295643 293449 297159 291862 286433 303918 327993 317947 311216 307879 317283 297261
9187 297261 294122 322066 327925 313009 311675 315087 313513 316044 325827 304160 315880 300318 303988
9174 303988 304295 267855 269094 274831 291828 296211 299186 281138 271432 255458 266495 296637 297707
9161 297707 303368 296568 280723 278537 304952 300221 306986 294138 307938 295590 289861 278453 307038
9148 307038 323121 324287 326222 312641 306770 312087 326065 340574 325381 265353 272921 304265 330446
9135 330446 352642 373238 375401 351336 329485 324211 329800 328503 334189 343592 310149 287104 285257
$$ packed form
9225B69859O216J1621J0739k0351k4987j5794q088K3485L0950j3862k2558J1333
9213B58563j6970l7674p886L4438K3862J7921R679M891j874K3700q151j9328p036
9200B74135J7362M146k194L710n297n429J7485K4075j0046o731l337R404k0022
9187B97261l139K7944N859j4916j334L412j574K531R783k1667J1720j5562L670
9174C03988L07l6440J239N737J6997M383K975j8048r706j5974J1037L0142J070
9161B97707N661o800j5845k186K6415m731O765j2848J3800j2348n729j1408K8585
9148C07038J6083J166J935j3581n871N317J3978J4509j5193o0028P568L1344K6181
9135C30446K2196K0596K163k4065k1851n274N589j297N686R403l3443k3045j847
$$ plain form
9122 285257 284339 298681 295074 326430 344143 345125 330414 324712 299271 285597 284627 308728 319019
9109 319019 290362 294623 282528 261234 235564 219864 201876 250170 282666 272239 283348 269131
9097 269131 266056 290500 300849 327899 352825 329664 313305 305648 309577 299662 268051 252343
9085 252343 256818 275725 268943 270473 273015 297537 333689 347057 388311 392527 369013 397893 425368
9072 425368 393416 357633 320624 277054 290429 329104 327387 318108 292397 260812 249368 262486
9060 262486 272450 233435 231111 264347 277228 290983 301762 302912 277792 262288 262485 235350 217305
9047 217305 236201 265751 278750 268667 263286 242873 239276 237224 245678 265297 309823 337503
9035 337503 359570 372207 377057 401866 404969 403317 398762 399227 404446 435738 437815 416945 371772
$$ packed form
9122B85257r18J4342l607L1356J7713R82j4711n702k5441j3674r70K4101J0291
9109C19019k8657M261j2095k1294k5670j5700j7988M8294L2496j0427J1109j4217
9097B69131l075K4444J0349K7050K4926k3161j6359p657L929r915l1611j5708
9085B52343M475J8907o782J530K542K4522L6152J3368M1254M216k3514K8880K7475
9072D25368l1952l5783l7009m3570J3375L8675j717r279k5711l1585j1444J3118
9060B62486R964l9015k324L3236J2881J3755J0779J150k5120j5504J97k7135j8045
9047B17305J8896K9550J2999j0083n381k0413l597k052Q454J9619M4526K7680
9035C37503K2067J2637M850K4809L103j652m555M65N219L1292K077k0870m5173
$$ plain form
9022 371772 335481 331015 328531 316585 326714 329286 314175 277755 285862 303504 332089 330189 343733
9009 343733 357211 350304 323087 313730 318940 321309 292880 258461 240572 246520 259155 251108 260426
8996 260426 280933 288786 296760 270654 258831 231751 270635 303359 321175 320972 338936 346593 374653
8983 374653 393043 417386 431064 428272 413675 402037 395973 405038 385046 347538 302042 286178
8971 286178 304182 293014 324411 345923 330071 330509 306962 248643 224203 194004 184852 211678
8959 211678 225835 216705 197339 192334 194599 189739 164616 168789 189761 193155 197920 235725 249598
8946 249598 290381 320178 327715 317565 351169 359352 376873 439180 492213 527960 541703 502883
8934 502883 450131 408213 342091 284213 280800 315010 340689 299802 261300 261314 263647 226201 218169
$$ packed form
9022C71772l6291m466k484j1946J0129K572j5111l6420Q107J7642K8585j900J3544
9009C43733J3478o907k7217r357N210K369k8429l4419j7889N948J2635q047R318
8996B60426K0507P853P974k6106j1823k7080L8884L2724J7816k03J7964P657K8060
8983C74653J8390K4343J3678k792j4597j1638o064R065j9992l7508m5496j5864
8971B86178J8004j1168L1397K1512j5852M38k3547n8319k4440l0199r152K6826
8959B11678J4157r130j9366n005K265m860k5123M173K0972L394M765L7805J3873
8946B49598M0783K9797P537j0150L3604Q183J7521O2307N3033L5747J3743l8820
8934E02883n2752m1918o6122n7878l413L4210K5679m0887l8502J4K333l7446q032
$$ plain form
8921 218169 210382 218236 250787 250335 256203 252916 280227 298575 306806 333028 316299 342273 365754
8908 365754 391706 400205 390690 380320 394112 429937 442795 459230 472389 488434 503422 510513
8896 510513 552856 604832 644069 685930 772706 852337 929670 1043409 1182792 1323530 1471568
8885 1471568 1659576 1843808 2074021 2320301 2620481 3046174 3628466 4398066 5513814
8876 5513814 7200439 9893308 14042708 19330249 23219131 23203424 19614207 14475519 10167505
8867 10167505 7222708 5253122 3941037 3074807 2458336 2033909 1733391 1525673 1371487
8858 1371487 1238136 1115354 1008897 884899 779090 683882 606284 548119 463469 374065
8848 374065 357796 318449 295014 281745 279413 281681 293521 302347 316354 289789 270557 246733
$$ packed form
8921B18169p787P854L2551m52N868l287K7311J8348Q231K6222j6729K5974K3481
8908C65754K5952Q499r515j0370J3792L5825J2858J6435J3159J6045J4988P091
8896E10513M2343N1976L9237M1861Q6776P9631P7333J13739J39383J40738J48038
8885A471568J88008J84232K30213K46280L00180M25693N82292P69600J115748
8876E513814J686625K692869M149400N287541L888882j5707l589217n138688m308014
8867A0167505k944797j969586j312085q66230o16471m24427l00518k07718j54186
8858A371487j33351j22782j06457j23998j05809r5208p7598n8165q4650q9404
8848C74065j6269l9347k3435j3269k332K268J1840Q826J4007k6565j9232k3824
$$ plain form
8836 246733 250312 275673 283933 289183 277538 300797 321347 343767 354517 386536 412627 422170
8824 422170 426227 429182 442859 416390 408995 390691 377382 364824 312648 255289 237397 247523
8812 247523 215089 203083 225873 208533 183480 161906 169825 175887 163846 161868 181037 176106
8800 176106 183985 198493 168093 148844 160540 179332 218395 225203 241208 272571 285186 250669
8788 250669 216266 209591 213446 218865 199426 208879 237550 271429 305185 314326 320362 330954 327634
8775 327634 318987 330349 349366 305570 260402 224104 221256 215962 234410 230795 211816 187189
8763 187189 159989 120128 116580 145725 162779 145055 152242 144898 136838 124058 140173 140962 142776
8750 142776 148148 131062 150692 163425 197678 190184 176826 161621 148429 147605 178523 193915
$$ packed form
8836B46733L579K5361Q260N250j1645K3259K0550K2420J0750L2019K6091R543
8824D22170M057K955J3677k6469p395j8304j3309j2558n2176n7359j7892J0126
8812B47523l2434j2006K2790j7340k5053k1574P919O062j2041j978J9169m931
8800A76106P879J4508l0400j9249J1696J8792L9063O808J6005L1363J2615l4517
8788B50669l4403o675L855N419j9439R453K8671L3879L3756R141O036J0592l320
8775C27634q647J1362J9017m3796m5168l6298k848n294J8448l615j8979k4627
8763A87189k7200l9861l548K9145J7054j7724P187p344q060j2780J6115P89J814
8750A42776N372j7086J9630J2733L4253p494j3358j5205j3192q24L0918J5392
$$ plain form
8738 193915 180571 181731 172971 158081 155296 162530 194651 182926 171018 188000 241621 289851
8726 289851 260000 250535 289622 280193 243614 217187 193969 151732 147374 121169 87528 82260
8714 82260 94998 106997 77749 81205 55698 61087 91103 126857 120336 111841 123822 122804 121117
8701 121117 154916 165385 173871 169286 169204 169788 187390 169437 161743 157612 151562 150291 145649 138298
8687 138298 156833 185874 211060 224992 228533 248341 268531 277862 268363 255762 260165 238752
8675 238752 214569 208024 216182 217168 221420 199473 171499 185875 206672 222388 229303 226589 216085
8662 216085 207886 212442 197213 213002 230212 236193 242085 239342 238991 244278 251329 235610 217365
8649 217365 197226 172047 180334 204477 213192 226177 237320 230716 224819 231839 263047 289282 310410
$$ packed form
8738A93915j3344J160q760j4890k785P234L2121j1725j1908J6982N3621M8230
8726B89851k9851r465L9087r429l6579k6427k3218m2237m358k6205l3641n268
8714H2260J2738J1999k9248L456k5507N389L0016L5754o521q495J1981j018j687
8701A21117L3799J0469Q486m585q2N84J7602j7953p694m131o050j271m642p351
8687A38298J8535K9041K5186J3932L541J9808K0190R331r499j2601M403k1413
8675B38752k4183o545Q158R86M252k1947k7974J4376K0797J5716O915k714j0504
8662B16085q199M556j5229J5789J7210N981N892k743l51N287P051j5719j8245
8649B17365k0139k5179Q287K4143Q715J2985J1143o604n897P020L1208K6235K1128
$$ plain form
8636 310410 336649 357805 358788 385450 381163 414492 474892 485882 447540 395723 383001 384605
8624 384605 369897 348466 361324 376494 387877 405574 410657 446450 454090 439685 436842 439344
8612 439344 472827 512874 512414 501115 541788 578553 634174 679324 706837 739511 800461 842748
8600 842748 884779 909265 935096 990795 1025461 1034374 1018869 981433 898742 849326 824712 802765
8588 802765 809511 846037 908414 962203 949631 868675 745590 623377 560165 497158 468149
8577 468149 417959 367801 351992 343631 381597 404822 402449 407761 413831 367069 328651 307730
8565 307730 307011 308292 300903 298034 298559 285164 257399 221179 237094 241547 232938 254985 260795 261779
8551 261779 258706 243429 207372 163067 148154 141098 150235 196834 231101 231291 235590 262184 303315
$$ packed form
8636C10410K6239K1156R83K6662m287L3329O0400J0990l8342n1817j2722J604
8624C84605j4708k1431J2858J5170J1383J7697N083L5793P640j4405k843K502
8612D39344L3483M0047m60j1299M0673L6765N5621M5150K7513L2674O0950M2287
8600H42748M2031K4486K5831N5699L4666Q913j5505l7436q2691m9416k4614k1947
8588H02765O746L6526O2377N3789j2572q0956j23085j22213o3212o3007k9009
8577D68149n0190n0158j5809q361L7966K3225k373N312O070m6762l8418k0921
8565C07730p19J281p389k869N25j3395k7765l6220J5915M453q609K2047N810R84
8551B61779l073j5277l6057m4305j4913p056R137M6599L4267J90M299K6594M1131
$$ plain form
8538 303315 284437 257415 215234 192772 154148 144418 128780 112413 103026 100577 107666 98166 92280
8525 92280 107786 119857 116311 131510 141574 131336 114930 155773 159803 177494 193792 201440
8513 201440 194228 205211 183849 198600 246364 289593 342253 370228 384276 383147 362447 295380
8501 295380 239740 183602 116002 61741 69733 106294 111568 130339 139845 125549 94891 70449
8489 70449 74387 66842 79968 96122 108217 115108 138805 135100 119185 112914 135853 156068 147441
8476 147441 142470 123967 146983 168636 164941 170419 182994 206686 230986 249448 232973 172842
8464 172842 132838 132512 118507 115453 96875 111318 86602 66811 63902 56304 41638 13590 20146
8451 20146 41625 29971 16682 14403 31078 45546 35548 31785 36273 21846 3211 29917 36839
$$ packed form
8538C03315j8878k7022m2181k2462l8624r730j5638j6367r387k449P089r500n886
8525I2280J5506J2071l546J5199J0064j0238j6406M0843M030J7691J6298P648
8513B01440p212J0983k1362J4751M7764M3229N2660K7975J4048j129k0700o7067
8501B95380n5640n6138o7600n4261P992L6561N274J8771R506j4296l0658k4442
8489G0449L938p545J3126J6154J2095O891K3697l705j5915o271K2939K0215q627
8476A47441m971j8503K3016K1653l695N478J2575K3692K4300J8462j6475o0131
8464A72842m0004l26j4005l054j8578J4443k4716j9791k909p598j4666k8048O556
8451B0146K1479j1654j3289k279J6675J4468r998l763M488j4427j8635K6706O922
$$ plain form
8438 36839 42095 54081 61344 40915 41765 66308 62033 59128 95081 104845 97442 95587 95700 82455
8424 82455 92404 96810 115866 133283 118327 86001 88095 62232 50563 45415 25547 34750 57486
8411 57486 58075 46270 48680 67061 88014 109897 98092 71286 38438 28521 11938 1461 9107
8398 9107 17367 17500 14484 14089 40642 52111 52579 60797 81174 82440 60395 51996 47283 55502 52910
8383 52910 40665 6516 -20102 -21167 -1452 8881 29349 37379 47441 10574 12651 29108
8371 29108 10808 9482 10218 38723 53375 69876 65959 33461 18197 26168 37535 54994 58958
8358 58958 44356 64120 66541 69592 69693 56390 39143 11166 -35442 -45551 -43439 -19353 -11668
$$ packed form
8438C6839N256J1986P263k0429Q50K4543m275k905L5953R764p403j855J13j3245
8424H2455R949M406J9056J7417j4956l2326K094k5863j1669n148j9868R203K2736
8411E7486N89j1805K410J8381K0953K1883j1805k6806l2848r917j6583j0477P646
8398I107Q260J33l016l95K6553J1469M68Q218K0377J266k2045q399m713Q219k592
8383E2910j2245l4149k6618j065J9715J0333K0468Q030J0062l6867K077J6457
8371B9108j8300j326P36K8505J4652J6501l917l2498j5264P971J1367J7459L964
8358E8958j4602J9764K421L051J01j3303j7247k7977m6608j0109K112K4086P685
$$ [...]
##END NTUPLES=NMR SPECTRUM
##END=
