##TITLE=Analysis number 312173
Compound Code cc 33504
Book Reference 378/148/7
Project Code adrs
Chemist Name benw
##JCAMPDX= 6.0         $$ Bruker NMR JCAMP-DX V2.0
##DATA TYPE= NMR SPECTRUM
##DATA CLASS= NTUPLES
##ORIGIN= Bruker BioSpin GmbH
##OWNER= NMR
$$ XWIN-NMR		Version 3.5
$$ Tue Jul 26 15:44:20 2005 GMT Daylight Time (UT+1h)  MAYBRIDGE\NMR@NMR_250MHZ
##.OBSERVE FREQUENCY= 250.131544655141
##.OBSERVE NUCLEUS= ^1H
##.ACQUISITION MODE= SIMULTANEOUS (DQD)
##.ACQUISITION SCHEME= undefined
##.AVERAGES= 16
##.DIGITISER RES= 18
##SPECTROMETER/DATA SYSTEM= dpx250
##.PULSE SEQUENCE= zg30
##.SOLVENT NAME= CDCl3
##.SHIFT REFERENCE= (INTERNAL, CDCl3, 0, 16.4498)
##AUDIT TRAIL= $$ (NUMBER, WHEN, WHO, WHERE, WHAT)
$$ ##TITLE= Audit trail, XWIN-NMR		Version 3.5
$$ ##JCAMPDX= 5.01
$$ ##ORIGIN= Bruker BioSpin GmbH
$$ ##OWNER= NMR
$$ C:\u/data/dgb/nmr/ADRS/6650/pdata/1/auditp.txt
$$ ##AUDIT TRAIL=  $$ (NUMBER, WHEN, WHO, WHERE, WHAT)
(   1,<2005-07-26 15:43:37.97 +100>,<MAYBRIDGE\NMR>,<NMR_250MHZ>,
      <created by zg, POWCHK disabled, PULCHK disabled
       configuration hash MD5:
       62 19 C7 07 E1 42 D1 B7 37 6C 3D D0 77 39 F9 E6
       data hash MD5: 64K
       C1 07 14 D6 9D 32 67 53 57 89 A7 17 4A 38 20 07>)
(   2,<2005-07-26 15:43:55.64 +100>,<MAYBRIDGE\NMR>,<NMR_250MHZ>,
      <Start of raw data processing
       ef LB = 0.3 FT_mod = 6 PKNL = 1 SI = 32K 
       data hash MD5: 32K
       65 DC 5B B8 26 F6 E4 F7 90 CA 71 B0 E2 FC DF EE>)
(   3,<2005-07-26 15:44:00.82 +100>,<MAYBRIDGE\NMR>,<NMR_250MHZ>,
      <apk 
       data hash MD5: 32K
       48 FA 85 0D FF AC 30 6A 45 FD A6 0D 99 C9 AB 6D>)
(   4,<2005-07-26 15:44:02.41 +100>,<MAYBRIDGE\NMR>,<NMR_250MHZ>,
      <abs ABSG = 5 
       data hash MD5: 32K
       50 03 69 7E 28 E9 3D 8C 33 E0 D8 9A 15 DA EB 5A>)
$$ ##END=
$$ 
$$ hash MD5
$$ 76 E7 19 65 8B F1 CA F8 DF D6 C4 9B 43 1C 2C D4
##$RELAX= 
##$RELAX= 
##$RELAX= 
##$RELAX= 
##$RELAX= 
##$RELAX= 
##$RELAX= 
$$ Bruker specific parameters
$$ --------------------------
##$DU= <C:\u>
##$EXPNO= 6650
##$NAME= <ADRS>
##$PROCNO= 1
##$TYPE= <nmr>
##$USER= <dgb>
##$AMP= (0..31)
100 100 100 100 100 100 100 100 100 100 100 100 100 100 100 100 100 100 
100 100 100 100 100 100 100 100 100 100 100 100 100 100 
##$AQSEQ= 0
##$AQ_mod= 3
##$AUNM= <au_zg>
##$AUTOPOS= <53 >
##$BF1= 250.13
##$BF2= 250.13
##$BF3= 250.13
##$BF4= 250.13
##$BF5= 500.13
##$BF6= 500.13
##$BF7= 500.13
##$BF8= 500.13
##$BYTORDA= 1
##$CFDGTYP= 0
##$CFRGTYP= 5
##$CHEMSTR= <none>
##$CNST= (0..31)
1 1 145 1 1 1 1 1 1 1 1 1 1 1 1 1 1 1 1 1 1 1 1 1 1 1 1 1 1 1 1 1 
##$CPDPRG= <>
##$CPDPRG1= <>
##$CPDPRG2= <>
##$CPDPRG3= <>
##$CPDPRG4= <mlev>
##$CPDPRG5= <mlev>
##$CPDPRG6= <mlev>
##$CPDPRG7= <mlev>
##$CPDPRG8= <mlev>
##$CPDPRGB= <>
##$CPDPRGT= <>
##$D= (0..31)
0 1 0 0 0 0 0 0 0 0.06 0 0 0 0 0 0 0.0002 0 0 0 0 0 0 0 0 0 0 0 0 0 0 
0 
##$DATE= 1122389015
##$DBL= (0..7)
120 120 120 120 120 120 120 120 
##$DBP= (0..7)
150 150 150 150 150 150 150 150 
##$DBP07= 0
##$DBPNAM0= <>
##$DBPNAM1= <>
$$ [...]
##$SUBNAM7= <"">
##$SUBNAM8= <"">
##$SUBNAM9= <"">
##$SW= 20.6930455092707
##$SWIBOX= (0..15)
0 0 3 0 0 0 0 0 0 0 0 0 0 0 0 0 
##$SW_h= 5175.983436853
##$TD= 65536
##$TD0= 1
##$TE= 296.16
##$TE2= 300
##$TE3= 300
##$TEG= 300
##$TL= (0..7)
0 120 120 120 120 120 120 120 
##$TP= (0..7)
150 150 150 150 150 150 150 150 
##$TP07= 0
##$TPNAME0= <>
##$TPNAME1= <>
##$TPNAME2= <>
##$TPNAME3= <>
##$TPNAME4= <>
##$TPNAME5= <>
##$TPNAME6= <>
##$TPNAME7= <>
##$TPOAL= (0..7)
0.5 0.5 0.5 0.5 0.5 0.5 0.5 0.5 
##$TPOFFS= (0..7)
0 0 0 0 0 0 0 0 
##$TUNHIN= 0
##$TUNHOUT= 0
##$TUNXOUT= 0
##$USERA1= <user>
##$USERA2= <user>
##$USERA3= <user>
##$USERA4= <user>
##$USERA5= <user>
##$V9= 5
##$VALIST= <valist>
##$VCLIST= <CCCCCCCCCCCCCCC>
##$VD= 0
##$VDLIST= <DDDDDDDDDDDDDDD>
##$VPLIST= <PPPPPPPPPPPPPPP>
##$VTLIST= <TTTTTTTTTTTTTTT>
##$WBST= 1024
##$WBSW= 4
##$XGAIN= (0..3)
0 0 0 0 
##$XL= 0
##$YL= 0
##$YMAX_a= 224476
##$YMIN_a= -160269
##$ZGOPTNS= <>
##$ZL1= 120
##$ZL2= 120
##$ZL3= 120
##$ZL4= 120
##$ABSF1= 16.44984
##$ABSF2= -4.243332
##$ABSG= 5
##$ABSL= 3
##$ALPHA= 0
##$AQORDER= 0
##$ASSFAC= 0
##$ASSFACI= 0
##$ASSFACX= 0
##$ASSWID= 0
##$AUNMP= <proc_1d>
##$AZFE= 0.1
##$AZFW= 0.1
##$BCFW= 0
##$BC_mod= 0
##$BYTORDP= 0
##$COROFFS= 0
##$CY= 12.5
##$DATMOD= 1
##$DC= 0
##$DFILT= <>
##$DTYPP= 0
##$F1P= 14.0000005364418
##$F2P= -0.99999901652339
##$FCOR= 0.5
##$FTSIZE= 32768
##$FT_mod= 6
##$GAMMA= 0
##$GB= 0
##$INTBC= 1
##$INTSCL= 1
##$ISEN= 128
##$LB= 0.3
##$LEV0= 0
##$LPBIN= 0
##$MAXI= 10000
##$MC2= 0
##$MEAN= 0
##$ME_mod= 0
##$MI= 0
##$NCOEF= 0
##$NC_proc= -4
##$NLEV= 6
##$NOISF1= 0
##$NOISF2= 0
##$NSP= 0
##$NTH_PI= 0
##$NZP= 0
##$OFFSET= 16.44984
##$PC= 1
##$PHC0= -76.87996
##$PHC1= 12.96174
##$PH_mod= 1
##$PKNL= yes
##$PPARMOD= 0
##$PSCAL= 4
##$PSIGN= 0
##$REVERSE= no
##$SF= 250.130018047414
##$SI= 32768
##$SIGF1= 0
##$SIGF2= 0
##$SINO= 400
##$SIOLD= 32768
##$SREGLST= <1H.CDCl3>
##$SSB= 0
##$STSI= 32768
##$STSR= 0
##$SW_p= 5175.98343685301
##$SYMM= 0
##$S_DEV= 0
##$TDeff= 65536
##$TDoff= 0
##$TI= <Analysis number 999999
Compound Code 99
Book Reference 9
Project Code 9>
##$TILT= no
##$TM1= 0
##$TM2= 0
##$TOPLEV= 0
##$USERP1= <user>
##$USERP2= <user>
##$USERP3= <user>
##$USERP4= <user>
##$USERP5= <user>
##$WDW= 1
##$XDIM= 32768
##$YMAX_p= 313795107
##$YMIN_p= -625213
$$ End of Bruker specific parameters
$$ ---------------------------------
##NTUPLES= NMR SPECTRUM
##VAR_NAME=  FREQUENCY,     SPECTRUM/REAL,   SPECTRUM/IMAG
##SYMBOL=    X,             R,               I
##VAR_TYPE=  INDEPENDENT,   DEPENDENT,       DEPENDENT
##VAR_FORM=  AFFN,          ASDF,            ASDF
##VAR_DIM=   32768,         32768,           32768
##UNITS=     HZ,            ARBITRARY UNITS, ARBITRARY UNITS
##FACTOR=    0.157963299565203, 1,           1
##FIRST=     4114.59891256159, 0,            0
##LAST=      -1061.38452429142, 0,           0
##MIN=       -1061.38452429142, -625213,     0
##MAX=       4114.59891256159, 313795107,    0
$$ Real data points
##PAGE= N=1
##DATA TABLE= (X++(R..R)), XYDATA
$$ [...]
32038 255828 180488 149108 -8802 -126330 -110540 -2961 46287 28876 65427 12396 153011
32027 153011 82656 -244618 -211591 -134023 -224143 -172636 -120949 -152039 33028 105570 253810
32016 253810 -28190 -160612 -51009 104147 28716 -43733 51009 94165 66479 31906 302005
32005 302005 253209 -28093 -253080 -453922 -366163 -192437 -105309 -5173 -12897 90986
31995 90986 98151 32939 -63465 -15043 154405 178177 113068 131793 158769 -59799 -112516
31984 -112516 -129967 -44135 -16410 -103400 -193011 -246579 -179502 -168645 -297007 -261593 -229385
31973 -229385 -10893 -14664 141448 9356 -218225 -159885 -283934 -196634 -64486 87236
31963 87236 160215 269080 250463 77869 139761 78057 230203 242614 72064 -8786 46655
31952 46655 49176 -31451 -1349 14773 -62700 -139785 -48566 -35022 -5532 120292 273173
31941 273173 151168 90307 116927 256260 141041 22270 -86433 -37408 18238 3196
31931 3196 86211 10351 97815 -46215 -2731 -227089 -258385 -165493 -84889 28194 -17453
31920 -17453 -107242 -130834 -57247 131468 33894 27777 -43976 32308 48820 -9691 -37295 -34152
31908 -34152 -83003 -133985 -62025 -62496 -151476 -103537 49890 69638 -28875 -123827 -88755 -34441
31896 -34441 100373 77065 69523 63177 41551 -153915 -111330 -42163 -41971 -174925 1254 88190
31884 88190 36642 34547 157731 154829 183613 375949 279403 -30932 -107450 -64385 -113128
31873 -113128 -30959 -52970 -64942 11500 103197 33599 19453 63563 67643 31041 -13174 59443
31861 59443 175105 389824 324002 238304 409485 460795 207081 -31157 40772 151760
31851 151760 88935 -95768 -136734 -205531 -244306 -317349 -324417 -186675 -221224 -106760 131816
31840 131816 114425 122004 41291 56312 142577 -131477 -271532 -279737 -317541 -187592 -14497
31829 -14497 -150451 -185199 -28082 -44237 -94774 -64895 -149367 -183311 -107252 -44051 -212294
31818 -212294 -127922 -9353 -474 113175 142949 148901 -106539 -171536 -85864 -44688 -65223
31807 -65223 -32924 -40713 36096 217354 129058 128087 131736 66325 98687 130933 103657 108157
31795 108157 93053 -66022 -193394 -10107 155609 136622 38690 21091 -92647 -170159
31785 -170159 -130700 -56339 7116 -11827 -108388 -108339 96500 233758 164997 16932 -58207
31774 -58207 -119210 -77307 83093 168119 81388 14903 30457 -27091 -68935 -47870 18767
31763 18767 -119799 -27684 -240 18375 141974 112429 -48388 75083 110699 38543 -30503
31752 -30503 -169306 -230813 -94788 181593 280648 199611 183005 31440 -98999 -12223 172518
31741 172518 200262 35667 62952 236242 91658 51790 -95739 -242482 -217084 31823
31731 31823 145119 24801 -133012 -126236 -163757 -71512 -19472 -95100 -86542 -105110 -12321
31720 -12321 63820 29142 -211424 -315318 -220102 -314073 -357252 -174858 -129012 -200583 -168587
31709 -168587 17656 35547 -23593 -42109 -62610 162648 334284 217079 158824 43660
31699 43660 -48540 -157948 -200924 -109565 -30408 -128513 -138847 -83413 1104 -90150 -140986
31688 -140986 -11407 -22827 -37874 95435 132823 55377 -158464 -151065 -12540 143471 81350
31677 81350 32138 74488 41468 -158945 -294930 -297354 -124819 39799 46521 -9058 -85385
31666 -85385 58306 83844 165982 167474 137638 103428 92567 96864 76311 128401 90963 173490
31654 173490 27508 -93231 -69186 34644 95010 199060 276996 152236 45961 179579
31644 179579 206284 238829 141830 172555 199523 150866 11286 81751 34511 -103493 -145264
31633 -145264 -157257 -216915 -143507 -218549 -154320 -89892 -144593 -138682 -141583 -129558 -196071 -271523
31621 -271523 -173394 -43815 20569 340 -25908 -69554 -126019 -249680 -116972 76260 1186
31610 1186 -81879 -117132 -153839 -190040 -117650 -81025 -74907 69911 25019 -35221 -53604 25101
31598 25101 41842 157572 247600 147030 151109 302329 209746 123107 25911 -70125 -82656
31587 -82656 -121381 -276347 -273391 -91929 96356 9629 -11029 -3533 -63868 -91710 -92939 -127264
31575 -127264 -86665 64545 29635 -85442 -106746 10786 72098 130567 232374 201563 -97303
31564 -97303 -298957 -369405 -333298 -107346 54029 -46684 -148035 -30587 9874 -270078
31554 -270078 -374638 -85331 -124356 -136298 -54761 -123759 -233405 -114867 9974 235944
31544 235944 260242 170883 108555 217933 228433 103801 77291 49188 1454 41057 -65318
31533 -65318 9963 -117977 -170735 -144713 -193178 -215081 -74346 -52032 118769 208051 228574
31522 228574 150334 -27733 -179414 -79581 82904 59149 139725 130412 128201 34304 131463
31511 131463 73384 -72071 -206029 -31133 252061 271799 267759 156371 -1536 90607
31501 90607 267934 147221 2999 -16745 -7446 148342 193125 50351 6643 -25965 -188021
31490 -188021 -65413 -199300 -174536 29000 107982 61049 -77019 -283328 -159370 -132334
31480 -132334 -67099 9648 14799 215528 42937 41705 24580 -8964 -55089 -58990 69522
31469 69522 146213 136048 53726 55946 -40034 -93751 -40370 -150253 -216721 -237654 -239821 -151579
31457 -151579 -123988 -172131 55295 224007 -9027 10271 91887 -41056 -36042 16717 144557
31446 144557 2309 37110 146022 133244 -119829 -367155 -363170 -204114 -37594 -20077
31436 -20077 53886 73978 140667 151294 59425 -87768 -160103 -162970 -129144 -157078 -180665 -467
31424 -467 58674 104637 55707 9999 36921 61330 -6514 26001 -8209 -25171 30779 107747
31412 107747 103916 52722 33154 -8715 -87259 -61106 36382 192308 265309 364811 326075
31401 326075 425624 367344 147717 -8774 18085 -82582 -163231 -199000 -184697 -126862 -117584
31390 -117584 -38823 148295 171781 87238 3198 -79735 56052 4687 14812 20442 -83725
31379 -83725 -158172 -214752 -197691 -125974 18384 67619 95277 67576 29340 -111198 -286078
31368 -286078 -195413 -149486 20240 -74453 -139141 -187496 -173742 -214642 -80907 33898 101047
31357 101047 29798 50336 237749 377085 322873 284954 211716 132291 196697 294870 356281
31346 356281 235853 17927 -1790 76196 -3903 -207459 -112486 34493 160381 65667
31336 65667 11555 157938 170580 61872 -56135 -117640 -76196 -11870 49693 -173781 -244859
31325 -244859 -148305 -123826 38075 321932 353890 444163 311176 133929 209326 302358 272832
31314 272832 279521 177249 122358 90761 41527 9272 -14411 -8947 24370 168210 316256
31303 316256 222647 110267 39514 -45362 -111501 -129798 55436 214027 262193 121930 69551
31292 69551 120727 66922 -28798 -190874 -201348 -293110 -255331 -178453 -73922 -264042 -476377
31281 -476377 -480333 -122848 28418 80194 127201 136936 191299 185494 125515 -40814 38133
31270 38133 68029 24093 -12585 -19343 -20676 -60948 -3614 146482 246086 146124 -17564 -117708
31258 -117708 -16444 -38504 -99084 -219696 -153393 36013 19585 -128298 -117612 -119526 -60264
31247 -60264 -221952 -278787 -162151 -28296 -10767 -39253 -37802 -42975 -88161 -125145 -99729
31236 -99729 -5716 -17920 107668 73657 -1979 31357 -53651 -108898 -50957 66454 64618
31225 64618 -114098 -238285 -226198 -147557 -108853 -9527 56127 21985 37356 111907 34203
31214 34203 198312 187970 -5815 -124283 -37520 -42305 -105180 -38689 98433 187947 252996
31203 252996 206974 92642 67865 35073 -105752 -28555 -75444 -10752 -60720 -195501 -182251
31192 -182251 -53583 -37467 -92653 -103218 -23236 129281 232952 218801 223279 159330 126204
31181 126204 75749 193003 -23800 -104846 -41093 -61700 -102803 -158716 -124713 -323864 -210292
31170 -210292 -4492 189397 288841 293122 131731 -17413 -93337 -47696 120949 120641 29564
31159 29564 -53278 -324134 -314753 -244410 -167177 -94063 8058 236934 336979 278453 202409
31148 202409 164995 54205 503 -142430 -171465 -127197 -2238 20765 -138803 -161751 -110677
31137 -110677 -11172 -88177 -211246 -238811 -247127 -165198 -100115 -118687 -157408 -117403 -86294
31126 -86294 71084 57251 -66266 -59058 19229 28195 -154110 -249259 -50424 74614 140597
31115 140597 65497 12534 119231 110577 30143 -4675 115219 25211 -32769 -74025 -161749
31104 -161749 -42502 128126 187102 142988 163563 81103 65451 164191 151238 153660 49884
31093 49884 -21945 -49484 -32054 40530 139168 27460 -48868 -58892 732 85498 122242
31082 122242 73293 658 -9978 136598 87258 -29579 -82122 31977 112893 143449 130474
31071 130474 41072 125971 53966 -129136 -203740 -39556 63033 9164 69856 119854 169179
31060 169179 149330 -31755 -53674 -3696 32425 84568 101335 -27978 104226 196582 55193
31049 55193 35263 79749 76645 -88927 -46143 80968 32273 -100849 -288966 -374847 -260495
31038 -260495 -311223 -289880 -293968 -253125 -159339 -98478 -102299 -81948 -60367 -41985 18993 20493
31026 20493 -43898 -174899 -122355 -24000 -179104 -20524 26115 52676 154834 -3143 -179011
31015 -179011 13107 38963 -27390 -47109 36297 175273 222260 86579 36546 30703 -55177
31004 -55177 -145318 -234056 -252393 -134072 -94304 -100454 -176405 -144900 -154359 -138456 -35782 -58362
30992 -58362 -123194 -221424 -116016 6291 -42207 -106133 -132637 -40571 20873 -90190 -155723
30981 -155723 -256946 -189921 -109938 -94045 -33228 51834 2960 -185700 -164566 -111743 -201737
30970 -201737 -210774 -185280 -141741 -97544 -20893 -121373 -248981 -262154 -157401 -45302 -81147
30959 -81147 -128541 -109170 -107051 -79567 -75003 -111883 -46932 -55938 -4287 101861 54759 -8373
30947 -8373 -232773 -223401 -176488 -293790 -336332 -340908 -240408 -250013 -86967 69351 -70530
30936 -70530 -107496 -166142 -164834 -266034 -80327 63926 76026 71614 143303 6397 -103050
30925 -103050 -119043 -117074 -194287 -213237 -194848 26182 174457 94865 -112336 -143485 -33824
30914 -33824 26839 -72674 -170374 -99123 -83000 -63489 -340 -20866 -48923 -70184 53258
30903 53258 158226 124730 88261 -69170 -298102 -191043 132542 191515 103766 111051 -51780
30892 -51780 24300 782 -122874 -208339 -103711 -28508 -167676 -271334 -184928 -226440 -208015
30881 -208015 -34490 -24267 -135476 -118495 -215943 -72914 -9895 -111026 -321945 -70313
30871 -70313 196873 206155 52623 -117547 -94711 -113034 -78406 1876 -76036 -51917 -106873
30860 -106873 -158601 -53172 109602 129604 167225 281078 320769 237860 168285 319323 313557
30849 313557 293783 128714 -65826 44497 207234 122148 -82278 94783 79076 -27028
30839 -27028 -110082 -87962 -54038 -47181 -27089 26234 1029 -389 34573 11983 -53215 -86252
30827 -86252 -29004 -80955 -214650 -348143 -227067 -18127 271573 456770 254725 250274
30817 250274 222042 -10175 18843 101806 33297 125441 80054 -652 -27884 -64787 38908
30806 38908 221288 146713 197226 56716 -25929 31343 152998 107220 -60604 -23602 27282
30795 27282 151798 89103 29067 29077 113040 69720 -11369 77430 86496 -18889 -53270 -47618
30783 -47618 -66328 -111867 -109966 -59269 146889 252088 317069 153002 96567 -36699 -145031
30772 -145031 -144691 -141785 -68223 22180 3118 -68279 -105130 -143653 -25846 164597 261048 194207
30760 194207 -18945 -149382 -250082 -212252 -179470 -178845 -190435 -156422 -180210 -305101 -363764
30749 -363764 -263692 -168314 -262627 -309443 -197602 35543 72422 -22595 -32991 7953 -32558
30738 -32558 4562 46179 45360 33096 123735 154224 165483 255813 235951 105445 130998 71727
30726 71727 -22947 -59427 -47181 -64502 -155801 -159847 -134198 -191999 -131373 -170070 -92088 -91414
30714 -91414 -111706 -175226 -83752 -155871 -110659 -7397 43441 25590 -77468 -205747 -154005
30703 -154005 -117966 -99208 -126989 -203277 -191730 -117812 -85911 -8229 165475 63610 12547
30692 12547 -82046 -48577 -20535 -15936 21636 63308 -99212 -121023 30003 102296 -6790
30681 -6790 -31471 -105318 40192 20164 -47616 -175879 -187008 -140014 61252 52603 57113 -70424
30669 -70424 -141728 -55269 -49266 -103759 -173685 -335832 -245758 -111813 -66218 -220034 -249231
30658 -249231 -302515 -351410 -291794 -258389 -83150 27417 70347 -69460 24054 133323 253563
30647 253563 280261 88893 -118021 -146845 -188956 -46293 82574 -140439 -98966 42437
30637 42437 126526 170283 135863 95430 135328 122690 4504 15336 -75724 -50966 -59526 -61487
30625 -61487 -139761 -174584 -391501 -439087 -389746 -327667 -126921 -17746 -66021 24635 80379
30614 80379 122513 50188 -51836 -105532 67706 114949 158196 93301 120969 26268 -21059
30603 -21059 57790 -39598 -159651 88263 238146 149120 5416 13392 153816 -11999 -168657
30592 -168657 -283410 -281800 -241111 -107833 114303 123214 36879 109 -22378 -86156 -140064
30581 -140064 -35226 -22636 -112573 -156467 -100558 2098 79356 133270 72893 47125 -77193
30570 -77193 -60732 69515 96648 -2337 808 -31519 -54545 787 -95361 11310 -45730
30559 -45730 -201813 -117085 -41965 2410 82608 68841 119845 174032 33949 27641 23973 11205
30547 11205 -25423 -47560 -174112 -237235 -344955 -295462 -151893 -108019 -117510 -66740 -1789
30536 -1789 69107 -25474 -181756 -119261 24523 97964 259548 364842 332283 393926 261503
30525 261503 109035 -102479 15085 7920 23476 65683 201940 275652 202024 135138 201433
30514 201433 154473 51078 -22691 -69321 28271 85746 -37884 -60956 36049 -36387 -102985
30503 -102985 -75073 18418 109955 280786 377234 401522 69253 -192615 -296146 -234350 -4935
30492 -4935 140518 175798 173393 131480 -69924 -34427 -64752 -36858 89611 123716 128928 113903
30480 113903 110667 185668 345140 343026 198607 151020 78747 40637 -8422 109390 185937
30469 185937 327620 353286 133109 83815 71830 -27944 -6710 68404 -108620 -291792 -144970
30458 -144970 -99888 -82584 -127941 15218 118743 106170 124595 144577 100510 72429 -26734
30447 -26734 -132053 -135868 -193523 -147428 -19864 88049 -21084 17399 5693 -24912 4623
30436 4623 -34983 -80810 -93988 -145558 18290 44023 35785 113331 209758 300709 262147 65097
30424 65097 -21358 -129828 -133383 -83046 -3882 148415 207790 259914 62224 10579 227537
30413 227537 315078 292891 248097 324006 323427 139617 17704 -14703 -39828 85606 7053
30402 7053 12097 216571 252393 33595 23511 -7926 53115 162081 248908 267235 172796
30391 172796 82929 -51354 -113794 7804 17460 -76005 -187909 -166140 -114513 -176193 -186547
30380 -186547 45824 119390 -36606 5114 169178 79091 14747 -103285 -26726 -33773 223840
30369 223840 388836 343898 234586 -9011 -141782 12809 174362 271508 99647 28787
30359 28787 -14211 32489 71730 11739 70490 -63558 -35462 168356 193481 207600 378909
30348 378909 499011 451813 466511 212818 -45122 144616 141279 -59243 -273827 -301325
30338 -301325 -112465 25825 30265 14544 1336 76103 207307 290888 247382 262737 251064
30327 251064 211429 102343 -109491 -382141 -316291 -170772 -100307 70825 -30046 -136802
30317 -136802 -108879 -52376 109835 52136 -72979 -70783 -17864 91253 100291 66113 -4556
30306 -4556 43985 -25650 -39194 77389 260832 349918 238440 -20997 -57957 -64089 -168262
30295 -168262 -272670 -263768 -24336 163654 121731 -18907 36187 157202 222539 54759
30285 54759 123874 163764 29535 -100838 -52279 -97357 -159921 -196408 -28484 65752 -6755
30274 -6755 -31965 41657 54084 132561 95236 174837 218210 208766 248066 167587 126755 1801
30262 1801 9630 5346 -31475 36087 -47394 58063 183369 338021 301086 172249 206737
30251 206737 253359 245490 144155 59486 -91890 -164225 -174844 -230212 -239512 -58448 172936
30240 172936 -21714 -155036 -209483 -165117 -232445 -404170 -490732 -333842 -206333 -178519
30230 -178519 -137839 -87043 -82617 -193909 -248027 -100822 46267 85135 -79642 -245025 -29430
30219 -29430 20100 -66560 -136087 -73976 -38978 35488 157257 94129 -127385 -125262 63352
30208 63352 136338 11314 -71657 -89663 -111115 47034 194197 180028 181255 147516 113602
30197 113602 43653 -54884 -110824 -259592 -193782 -137828 -282637 -248895 -96985 -52077 -115793
30186 -115793 -60752 -6444 -39299 -193738 -225276 -275665 -204290 32200 85738 -60854 -171456
30175 -171456 -186301 -181032 -156887 -70234 -81355 -143782 95066 231316 30869 -44318 98482
30164 98482 -94950 -137507 -43105 -139374 -94422 -91722 -36519 -3814 -99275 -147410 -75209 34988
30152 34988 -1606 -597 8888 -56442 -56631 -104250 -83817 -22568 57964 54270 67012 202696
30140 202696 268431 450957 397023 208344 125377 37202 -96805 -197300 -150344 31828
30130 31828 52340 -24006 -152124 -153765 -17054 124671 291387 273231 105010 -193092 -197228
30119 -197228 -134664 -192297 -106141 98983 132036 88903 35687 -115390 -153589 -81364 -224545
30108 -224545 -162497 -11268 119626 50820 -85761 -98247 33384 -134743 -47265 67318
30098 67318 -137939 -193745 -27466 -45229 23875 -1060 10087 110743 88271 77334 62588
30087 62588 94846 183014 140436 156425 158604 193653 218932 111618 80736 262171 241972
30076 241972 183370 5606 -83681 -91581 -114869 -34675 19986 140306 122218 92555 103967
30065 103967 110708 107252 -91094 -193104 -248319 -286316 -21812 72947 94093 -141799 -121468
30054 -121468 -44123 145300 191039 102258 17724 -61684 -105908 35899 40679 30741 118370
30043 118370 146243 129385 89159 14538 -72408 -98483 4558 47111 186620 291705 388802
30032 388802 250013 124337 5060 -152811 -144137 -27217 58954 -16991 23081 173827
30022 173827 149922 141902 110745 137368 187144 192690 288567 249526 181843 332447 286827 116490
30010 116490 68025 179793 260599 268057 73658 26339 -95380 -341359 -341469 -176365 -79854
29999 -79854 -141670 -97206 -113629 -182762 -161265 -160447 -54306 203488 161319 -110388 -128471
29988 -128471 6848 -55928 -25634 130462 236040 144872 28481 26830 -5061 -56284 -210326
29977 -210326 -123067 14006 -16524 94366 161036 140500 21010 21595 -68140 -148617 -176408
29966 -176408 -130519 -74862 -170982 -209271 -37049 187799 69696 -117480 -150556 -124000 -116653
29955 -116653 -82530 60642 70728 224413 165538 135586 279655 219924 321567 205589
29945 205589 106758 179607 153380 -107196 -111738 -156861 -18182 90342 139819 200315 87870
29934 87870 66966 130384 56198 -139995 -55901 53727 65498 29995 -2085 5986 5482 145654
29922 145654 320773 193372 117480 115658 502658 627983 453742 194574 -42080 -99384
29912 -99384 -121908 -166739 -138661 -43297 -65671 -26971 -39127 -66150 -44917 -125781 -34387 133018
29900 133018 167578 77034 106540 265638 187555 67969 268154 175116 59903 -65353
29890 -65353 -45430 -26191 84043 -17708 -214438 -322047 -338634 -257635 -127925 105447
29880 105447 107931 -4739 -28907 -78008 -130367 -238125 -130387 -141341 -186562 -239597 12384
29869 12384 113342 121039 340458 291411 -45036 -165359 43622 248246 238716 102311 92516
29858 92516 198652 101206 170945 68482 -149824 -66631 -77851 -85383 35523 299526 333528
29847 333528 423356 460858 344152 184128 60200 20364 85979 191614 207429 200099 113115
29836 113115 95274 180463 172397 388144 370578 333470 386199 421373 363656 332149 292187
29825 292187 38982 -76120 -77088 -80086 49436 204744 213112 137697 132109 277458 260854
29814 260854 80305 16988 103675 221647 217105 90375 25295 -81268 -169936 -108672 5229
29803 5229 84906 106477 49942 74186 132778 218583 210049 31320 37856 -35050 -91558 39301
29791 39301 111444 202780 174430 202271 116618 -60517 -141617 -181808 -124139 -31074 -106502
29780 -106502 -98843 -101769 50228 11186 -54236 8685 80411 36821 151372 125840 26463
29769 26463 -51148 -107537 -51154 -57577 -28656 -85987 -51657 149145 155140 44027 -2654 -34374
29757 -34374 174442 298297 116035 55771 99552 89552 35311 -9196 -8742 -7730 -50101 -127930
29745 -127930 -8632 214124 346861 365537 199693 285342 116016 -73643 -155284 -206779
29735 -206779 -90680 -108130 40954 38541 -6044 -20719 -184264 -194012 -131693 -84244 127444
29724 127444 270255 112397 36086 129521 194376 175821 71675 168671 282565 257048 195790
29713 195790 46173 -160246 -312004 -99055 17157 -137218 -145255 36386 196428 264246
29703 264246 113737 158258 64848 -11463 15758 87862 79585 54802 -18816 -73821 -128440
29692 -128440 -247192 -311985 -259203 -138064 -29238 90980 230560 201134 216604 35907
29682 35907 -142148 -303315 -329061 -122832 -42234 47447 167742 302102 146731 184495
29672 184495 397219 425389 431829 380504 384558 379441 241768 22654 -115642 23790 -45898
29661 -45898 -58979 -980 84933 16037 14027 154599 181927 122411 112740 45033 86375 161747
29649 161747 195147 282504 229715 93566 65167 99982 194432 361900 315601 149557 137804
29638 137804 225574 251291 259643 25382 -185052 -82709 52692 74547 71642 70475 123742
29627 123742 68042 140328 124655 181752 138522 118413 89871 125964 151599 134622 -78544
29616 -78544 -241126 -270653 -274752 -171042 -137287 -175682 -33884 4884 781 -23980 -2354
29605 -2354 11191 71114 37895 -124520 -168345 26049 102374 32222 -39969 -38498 62229
29594 62229 40011 34770 56796 130977 79636 -47045 20038 2078 46433 13118 42451 4058
29582 4058 -77902 -101202 -136701 -235306 -131122 -10855 -20976 -95356 -162379 -199953 -62797
29571 -62797 55666 4608 -37598 -20356 -60618 -131516 -130740 -25706 64745 40262 -1816 -86619
29559 -86619 45662 38428 -15915 156607 262491 163909 159086 194259 115233 23587 -161754
29548 -161754 -125221 153954 231607 219549 241085 196833 131094 148701 73819 -29896 88032
29537 88032 69760 114539 179792 118133 116169 -104016 12557 199157 54997 -132738 249
29526 249 73156 -92937 -166677 -39853 92023 136099 101732 13240 36349 -75557 -174586
29515 -174586 -231513 -264890 -115339 -59591 -62591 -31399 -61191 103566 42613 -25705 -71494
29504 -71494 -15627 59667 207098 79272 -46183 -89370 156 41480 -144185 -113044 9960
29493 9960 75079 131561 29460 -76145 -321247 -318864 -247745 -212618 -157555 -168813 -120816
29482 -120816 107130 209977 169229 147915 294168 216718 260704 264469 124151 111944 240936
29471 240936 179504 62356 -9260 54173 150189 155838 130067 -51663 -192194 -160076 -17159
29460 -17159 9462 -33069 -42035 -110440 -30181 5353 102323 256585 194781 187878 166400 907
29448 907 -141333 -206840 -80307 51854 119892 64745 -6977 92787 24945 -77174 -194315
29437 -194315 -119715 -19188 64263 148570 121437 208528 156805 165681 116794 131059 36203
29426 36203 -38976 109762 39375 77671 63697 186418 204419 81412 160319 240416 187021
29415 187021 63052 -147020 -153698 -141736 -87967 -60002 -58175 42155 129068 126464 41742
29404 41742 -68045 45679 188751 125516 -26633 -100449 -122911 -143549 -180895 -136618 -19953
29393 -19953 52466 133516 122704 150694 -47811 44966 -14484 13278 78745 19013 96775
29382 96775 46163 -28270 88699 55808 -96023 -25491 67641 144268 45765 95154 275241
29371 275241 153677 -37772 -46776 19275 -70623 -92883 -121963 -180481 -233813 -254463 -306406
29360 -306406 -387279 -173452 -47561 88966 157502 207507 161309 105830 275636 366403 306246
29349 306246 188263 87604 145652 181774 160768 179110 87098 226135 349267 316954 271566
29338 271566 431244 404020 390574 408277 384410 277087 276873 222204 172432 248052 211306
29327 211306 97586 86370 -35944 -159649 -199127 -193376 -190430 -235747 -154635 -141012 -160388
29316 -160388 -33901 -53557 -273617 -333543 -227379 -111377 23567 78004 39666 -16334
29306 -16334 -101155 -41778 11579 -65021 -16193 91745 178374 184798 -27605 -28558 -48943 22555
29294 22555 12880 -81390 -198193 -219690 -162306 -141239 -142074 56031 206932 210314 123652 -62367
29282 -62367 -135016 -301946 -276796 -317702 -368420 -306945 -202842 -110309 -76271 -210515 -229182
29271 -229182 39637 289910 146075 130854 143660 139283 28279 -49809 -18748 -36967 103474
29260 103474 30357 -201589 -217275 -88015 94729 128669 211439 254386 81583 84936 81246
29249 81246 122123 190515 158431 107480 118016 6547 17862 108306 97522 213854 259329
29238 259329 207576 130181 76436 9981 -131042 -152421 87557 105707 29036 83427 46571
29227 46571 -20616 -116669 -116287 105851 189960 158887 81830 11064 -145563 -305238 -338393
29216 -338393 -145179 9189 -6189 -80844 11273 -167172 -123348 -84836 -4285 89355 60376
29205 60376 -5172 39461 7138 41355 220692 273560 36910 -16719 141685 177364 273586
29194 273586 204751 129064 97976 73910 125744 103350 -71243 -213072 -198888 -136539 65012
29183 65012 13049 -39097 18354 74514 -8672 -20075 -71626 -141256 -107903 -140582 -286511
29172 -286511 -376316 -379817 -380989 -426589 -300212 -269132 -155133 -77809 -35620 -12519 117208
29161 117208 -5712 -49953 -165488 -53458 61939 123957 128757 286843 280192 208867 41580
29150 41580 -38890 -20148 -17686 -185268 -188127 -189187 -143426 -49873 -93688 -208266 -193454 -129648
29138 -129648 81659 358821 402103 200728 183203 174648 397494 313030 260308 118273 28665
29127 28665 -124413 -100889 -6162 30665 -6716 39840 22551 -3460 4082 -98465 -121006
29116 -121006 -19069 -4944 65604 -121856 -13932 -29827 36441 87304 23690 -53508 -102108
29105 -102108 3903 -84912 -178389 -130572 -152985 74361 -26103 -96597 -63579 -79465 -146979
29094 -146979 -119816 -90031 -85259 -46060 -21943 112595 161052 -20198 -152579 -144500 18487
29083 18487 114265 213236 140655 15206 -45908 -55365 66455 60479 98016 57050 -14930 12392
29071 12392 62130 70630 -36939 53618 40015 -107128 -67337 -31683 44257 119323 203514
29060 203514 222779 154047 212519 62692 -160996 -297446 -356420 -287065 -198959 -147076 -163249
29049 -163249 -110500 -150779 -226528 -359711 -354341 -111749 -51576 -116338 -70959 67156 177166
29038 177166 144224 79381 81073 186284 32566 24652 -81182 -147498 -161270 -212426 -138454
29027 -138454 -27834 -59257 27105 87858 126641 129956 10498 -134546 -124422 -118824 -155311
29016 -155311 -213295 -274613 -231828 -89868 -219145 -244908 -63563 -4718 -71190 -44119 -167296
29005 -167296 -107591 101265 133860 175027 187668 -81388 -61340 -25079 -105884 -62119 105816
28994 105816 96841 125309 84947 29704 -251564 -327290 -230404 -13585 -89942 -234784 -204324
28983 -204324 -202406 -266568 -148155 73640 272336 374385 253026 164492 193275 -36023
28973 -36023 -125162 54876 181300 91126 -59323 -171911 -250097 -183632 -92147 -190650 -170926
28962 -170926 -80710 44622 -37875 -98822 17427 64702 54064 6417 -57834 -27201 -49026
28951 -49026 -61650 40510 -10466 -2214 4289 42497 212544 119358 207181 159147 -71568
28940 -71568 -243782 -105881 -104396 -183921 -41325 -28799 -63638 85932 162843 119651 -32354
28929 -32354 71907 165992 164344 69819 -10859 86825 99856 16724 -91885 -128902 -205405
28918 -205405 -198246 -102728 15120 -7960 -37966 -101125 -121597 -141360 936 -42308 66516
28907 66516 55948 3875 131513 220356 262562 171809 52009 45009 56821 -142277 -128315
28896 -128315 -89093 -89082 -152210 -13220 56030 -2938 64169 62538 17461 18783 -43285 28272
28884 28272 188791 243544 143256 -17344 -19831 21412 119901 32013 -281144 -438106 -324859
28873 -324859 -122370 -106033 -96834 -117138 -113956 -73464 -118122 -87412 -126625 -37834 27803 -175760
28861 -175760 -139732 64447 87376 133765 122721 156733 264329 212809 114525 -68132 -48591
28850 -48591 56973 159964 128173 119636 -3477 46731 57081 -35944 -66488 -1320 -30529
28839 -30529 -42043 -135709 -129163 -117076 -138076 56060 -17871 25118 91025 44026 28860 -37741
28827 -37741 -123987 -133467 -56624 33765 60415 -63740 -128011 -45354 42328 118475 307104
28816 307104 342771 496461 400802 171067 319604 411996 332422 216179 21639 -141926
28806 -141926 -231393 -127685 147477 267915 212030 241356 276680 309726 133901 -53861
28796 -53861 126024 170257 102547 113407 75138 46294 -70813 -73784 38241 91023 136580
28785 136580 19700 -129010 -111863 -140387 -44555 273827 240664 -75895 -104755 33853
28775 33853 60883 160916 161277 112750 128486 192808 148600 82836 196884 351512 388342
28764 388342 311362 166194 -59686 -156860 -233089 -155678 -93082 -45748 12373 -87974 -212841
28753 -212841 -185789 -176121 29471 178903 112561 135744 184160 86437 66139 32408 45928
28742 45928 83922 189882 135899 21725 39597 134911 160432 20144 93460 117493 111608
28731 111608 116997 97213 184545 277778 188042 -43401 -133658 -153191 -140159 -17636 116081
28720 116081 186060 90684 58833 -25695 -89417 -99004 -116557 -3999 51372 93503 89803 -11148
28708 -11148 -129594 -202412 -150086 -25423 53094 -99354 -337095 -233408 34580 113028
28698 113028 100461 42920 -47678 -53835 -141694 -12043 33748 209541 346417 362959 58161
28687 58161 -5578 2572 10660 118645 61063 -19977 -55776 -62441 -77316 82965 199285 180598
28675 180598 180354 139622 262086 336103 267546 130702 80099 4965 -212094 -207840 6697
28664 6697 126858 99853 -74971 -191033 -231741 -67700 -12058 135800 45086 18923 -19977
28653 -19977 -110418 -29136 61444 114237 -7544 -82492 97421 79670 -100162 -171562 -261261
28642 -261261 -322141 -302819 -100854 -7888 -170632 -325750 -379927 -303566 -197586 -167662 -99400
28631 -99400 -121929 -190677 -235924 -207357 -58447 63652 -37921 -34913 12559 -39906 -124429
28620 -124429 -115588 -23636 -40392 -5906 -9878 78051 162752 39403 27907 111715 120380 303599
28608 303599 332682 89432 -112368 -205536 -56919 24677 -121815 -145219 -40117 -45202 -96735
28597 -96735 -75060 30583 61784 884 57305 -23688 -88477 -152170 -117860 -44573 36924
28586 36924 47307 111191 128929 158852 -51186 -82671 -240014 -318819 -128783 105344 186546
28575 186546 150595 -32665 -97225 -64662 -50620 -127239 -51897 -32631 -41383 83672 50331
28564 50331 -149902 -77388 180018 254893 261102 163808 43339 -39008 -3488 30783 44723
28553 44723 -119452 -81630 -22759 9380 -63908 -63910 -150532 30904 19983 -232313 -188935 10239
28541 10239 97061 164702 -101141 -252082 -321269 -249378 -141547 -103965 -82399 154921 208410
28530 208410 5552 47625 28272 -191542 -412628 -316661 -279291 -276552 -165317 -13705 -70949
28519 -70949 -132906 -46854 92651 72013 -97632 -223618 -291145 -221035 -9916 39590 103750
28508 103750 163119 289713 180772 75342 -103008 -128180 47319 145561 217353 398232
28498 398232 349183 130163 78752 -42618 -189405 -171575 -89904 76630 15403 -83085 -80861
28487 -80861 -27595 -82056 -193556 -307766 -232605 -68702 94599 109590 -11796 -212312
28477 -212312 -343746 -442991 -440531 -164975 -83109 -112940 -144280 -135605 -205370 -199262 -138087 -184796
28465 -184796 -140716 -143658 -137700 -59546 82476 87430 140857 -147169 -343618 -240546 90612
28454 90612 98826 53430 59184 92214 234909 196618 -77330 -292475 -334820 -33752 159719
28443 159719 120298 45508 -130456 -144053 -12321 134850 103978 101619 -51657 -118070 -88026
28432 -88026 -131175 -156903 -67459 -21178 5523 -107532 -107830 -24690 105523 303104 282417
28421 282417 232764 112933 79192 -35608 -67008 -57767 -105724 -187933 -51570 115336 183384
28410 183384 42179 163255 117660 50060 -83629 -177623 -111838 -165638 -166295 -226222 -143676
28399 -143676 -81578 17831 -13162 -70243 5759 117946 132864 13749 -48080 56772 222594
28388 222594 329512 238780 114065 -6574 4355 84835 92673 226150 264213 -87723 -71102
28377 -71102 98596 245243 221241 -29235 -56659 -53686 24960 173096 21932 -27125 -64518
28366 -64518 74582 117501 294784 264905 96295 69190 254145 135482 -89891 -146914
28356 -146914 67652 287775 230286 58510 -16430 -262290 -293785 -160214 -57428 -211489
28346 -211489 -230820 -113915 -68988 -190085 -135130 -124006 -92684 56443 49722 13322 181125
28335 181125 219145 219358 230642 185851 100362 -30808 -70712 -43246 -216691 -167267 -40278
28324 -40278 -52319 -85475 -119943 3157 84342 86823 -37707 -24694 38493 179075 370862
28313 370862 369433 125304 67974 165913 163718 104188 170704 77304 19222 -38549 170618
28302 170618 217123 215552 278789 239857 64191 -46461 -444 -33305 -71212 -34942 19384
28291 19384 84952 327655 331608 148089 96495 146551 60028 -33486 129 -67114 33559
28280 33559 199932 109744 171479 264705 196850 251364 172156 -62587 -141899 -214392 -51390
28269 -51390 -63953 -164326 -266479 -230271 -246713 -244505 -257510 -197735 -131289 -137770 -201374 -118268
28257 -118268 20747 -59541 -135464 -123037 -157104 -216099 -38499 118277 149793 103911 272615
28246 272615 334089 261789 174137 -32622 -247044 -106179 62930 -80225 -254562 -214233
28236 -214233 -121989 23533 266503 277264 126956 -40138 -153402 -152662 -22678 118298
28226 118298 206298 136109 124346 293512 444592 370873 90863 70802 152622 28278 -70811
28215 -70811 -184625 -100876 26074 46921 -24858 128349 138506 39157 -80169 -202132 -329458
28204 -329458 -320416 -96369 114154 281910 167853 134539 174369 121145 137372 101329 209794
28193 209794 289292 341899 348529 397006 412182 423777 302440 106714 3003 29893 21550
28182 21550 51529 156255 -39844 46582 -28546 -132353 -166686 2795 28274 20905 76340
28171 76340 -89009 -195391 -126683 -190285 -83581 -124039 8671 19154 9650 -51113 -147294
28160 -147294 -269268 -214870 -184516 -99486 -111226 -89926 25767 -45514 104531 170403 178945
28149 178945 50991 -168426 -176217 -58748 195315 112726 -11125 -132971 -174938 71711
28139 71711 -112655 -202590 -221487 -189522 -32564 70869 303012 367289 377451 338610 312320
28128 312320 179418 79382 -88895 -140191 -21255 -64012 -197564 -203086 -75283 175641
28118 175641 352404 350184 256593 150396 202790 182183 157254 109962 4328 37052 291304
28107 291304 230193 73757 -50286 20276 96439 37209 53089 143886 94099 27703 3681
28096 3681 73395 179041 189293 95147 -25498 636 93393 246897 331327 289412 154458
28085 154458 150522 131748 187897 61914 54581 87364 -101189 -287577 -250623 -105315 36742
28074 36742 -33405 32342 13640 -110891 -103406 18819 115683 -51047 -251753 -238854 -47931
28063 -47931 108993 -30297 -242899 -254618 -177819 -48288 -57323 -69352 53800 151155 234756
28052 234756 209939 268590 419736 207390 115177 -139914 -184918 -25190 70104 90451 -31414
28041 -31414 4534 19915 -44456 -74505 -27472 -24878 150661 225075 112368 -46819 -150931
28030 -150931 -53004 -11157 2474 -97726 -76444 13678 -101664 -127385 13975 9630 -135918
28019 -135918 -159520 -113135 -250351 -246713 -86273 101471 44128 -13784 80105 177432 307768
28008 307768 292927 118378 -77161 -93332 -71397 -183283 -97309 -39527 -65699 -159393 -195799
27997 -195799 -189702 -13224 -49275 -70857 -170066 -257990 -312570 -321726 -167948 -88557 -64758
27986 -64758 -62821 -53200 132134 132752 88639 145221 244841 240487 97999 117637 104939 -39005
27974 -39005 -91604 28929 -61655 4899 163189 82567 83803 75828 63275 97988 98976 -20918
27962 -20918 -245481 -280859 -127418 22822 -156829 -179807 -138672 -173067 -229702 -82544 -109796
27951 -109796 -114303 -118912 -113225 -145502 -18968 66534 -11547 -235216 -211133 -99138 167773
27940 167773 207155 153476 42838 24392 -73032 -133046 -33638 -78229 70084 171880 171087
27929 171087 88738 49064 129204 133321 117049 171522 121406 -12975 51518 91733 -45045
27918 -45045 -28538 -130174 -432 101592 -116806 -140759 -121267 -166992 -103774 -40485 -160253
27907 -160253 -3492 215176 412993 469134 421758 191351 14719 -71383 -154501 -67963
27897 -67963 -126109 -70298 126798 101429 176657 281449 334487 222111 -9531 17741 17850
27886 17850 75719 387 -235340 -311168 -109285 -3197 60265 -9252 -27940 -56204 37061
27875 37061 164993 127325 127870 78757 86493 27256 95221 61042 95570 196393 240748 269594
27863 269594 182497 223537 150642 93346 157517 133182 -99182 -171565 -297489 -380371 -304720
27852 -304720 -136050 -160899 -184025 -66901 36725 134132 203096 287961 234620 264398 230734
27841 230734 56834 -7928 117038 78560 -628 -205424 -297391 -149953 -556 212176
27831 212176 288565 161608 31154 78282 -27150 -154890 -108564 -60782 -52349 -330 54721
27820 54721 95138 -23479 62600 152774 222600 167660 -74276 -200173 -143088 185038 282870
27809 282870 160444 -73038 -295522 -310065 -260300 -195714 -93227 -102274 -260758 -223645 -204923
27798 -204923 -178416 -76079 -43048 -171597 -216815 -171006 -188085 -131645 -170091 -228361 -133011
27787 -133011 -141619 -53458 -209288 -333875 -80743 80867 53946 180213 142102 25090
27777 25090 -2873 110304 281586 260837 148914 126882 204738 168663 299396 415288 233589
27766 233589 137038 30719 -45064 -136503 44075 132947 158984 142462 233700 281222 214175
27755 214175 64605 -240204 -295067 -168121 -155964 30190 -39203 -125716 -154304 4447
27745 4447 19238 -95434 -200410 -101539 -201737 -279755 -197591 -156725 -136012 72647 -42191
27734 -42191 -461690 -495996 -298490 -200189 -43619 -15815 -30290 -86120 -86101 -140657 -104167 62788
27722 62788 141372 86858 82038 17163 -76645 -118870 -129040 -104587 -181803 -265010 -212616 -128773
27710 -128773 -37681 24881 8987 -9120 -172303 -185841 -185256 -214762 -52527 82209 94686
27699 94686 143018 315125 295552 142787 36434 -4227 38216 -48302 -170350 -7294 -64215
27688 -64215 -21610 72938 60116 -73922 -41033 -73894 -46968 -104668 -67800 6124 140173
27677 140173 121204 141605 257263 211660 182112 116240 51483 -26730 108949 166574 212323
27666 212323 152917 92454 196869 112773 -24000 85914 51692 11887 -96679 -69470 -134110
27655 -134110 -141114 -66978 -60446 1108 -91442 -247887 -365004 -207068 741 36577 -143671
27644 -143671 -256219 -255077 -79806 -149639 -71074 63141 271362 430176 410028 269894
27634 269894 -44974 -103912 -35432 -44508 126908 82141 -34715 -29042 -16962 10442 -18391
27623 -18391 -6316 69040 -40372 -39656 63416 -13252 -60085 -70220 -86577 -110769 6577
27612 6577 96586 191231 -35317 -208693 -147353 -253673 -329113 -221957 -33810 100348 185920
27601 185920 160128 28280 -52143 -96614 -75233 -151082 -240048 -72797 -120555 -116787 -54834
27590 -54834 -40251 97975 171439 70520 14777 50113 29736 -44862 88623 133315 73201
27579 73201 166317 128089 20132 128805 289178 320853 215207 155582 128721 -108167 -274423
27568 -274423 -193934 -103738 -58602 9876 150295 192678 55666 -143536 -90576 12688 -33617
27557 -33617 -52929 -28785 188836 193388 129715 81053 79603 109405 28724 -172994 -288970
27546 -288970 -264478 -124941 -92739 -41980 -13785 -8670 18857 147559 292786 350210 261636
27535 261636 171611 46286 -128133 -117002 -117093 -264568 -196103 -134204 -156942 -311449 -227910
27524 -227910 -72696 -75078 -62424 646 130190 75823 114183 101758 -70234 46306 200817
27513 200817 210421 209039 17703 -70237 -33881 -146756 -123127 -28494 35162 10139 64604
27502 64604 21516 -37241 -217771 -383536 -154347 -76811 12267 118150 -21851 -96743 -316224
27491 -316224 -358158 -322788 -307189 -263855 -279620 -156398 98640 74611 65610 -160545 -169774
27480 -169774 19482 176803 235622 286347 299889 256448 81670 137587 70481 -109686 40988
27469 40988 84736 16495 18597 77105 168011 41925 -202190 -233854 -197875 -204273 -203212 -165227
27457 -165227 -263290 -88856 -165430 -137012 2739 26648 96304 -53895 131089 223484 150049
27446 150049 57372 -187825 -207842 -158663 -175987 -69069 47630 125336 42097 -169077 -180584
27435 -180584 -119057 -42117 11894 17383 56591 -18202 -30306 46780 -100778 -326883 -223056
27424 -223056 -2285 220413 162104 2766 -60629 145530 134663 40770 12366 -98356
27414 -98356 -78968 5810 169445 232611 291359 284224 402361 436611 389717 143511 -59472
27403 -59472 -70499 -97105 -131992 -99008 69591 -107645 -117294 -10231 -1764 -93618 -143347
27392 -143347 -166421 -256318 -326091 -385597 -229354 22103 227886 70281 -264871 -371935
27382 -371935 -289465 -154704 17698 126007 51752 -139410 -245961 -218115 -112672 -38291
27372 -38291 116750 103944 77371 -35658 -26792 -139356 -220335 -160931 -147443 -109331 43966
27361 43966 93683 -41237 -59431 -5613 -27306 -32575 67512 -92662 -145915 -21381 175817
27350 175817 283312 176090 98472 116839 119732 167980 81374 -35967 101213 185081 236600
27339 236600 61062 24503 182230 186004 128978 79822 6478 -227665 -254709 -103088 69401
27328 69401 99191 -38852 -96228 -138739 -143662 -228045 -247987 -283159 -216445 -115498 -64762
27317 -64762 -36637 -56004 -22440 -9823 -147915 -322058 -151550 -100911 122316 174413 199741
27306 199741 9309 -105709 -76120 52195 194023 154398 103829 59595 49195 153775
27296 153775 273433 130984 37729 76602 32123 27961 237002 205050 85359 143139 54132
27285 54132 61338 242755 205089 283554 207523 201985 112446 84602 258531 301701 180034
27274 180034 10843 70703 20785 -24772 -9743 88685 28248 -19356 19417 -66478 -59512
27263 -59512 -58585 79059 175528 75143 -47299 -5076 107415 82196 19377 102077 -30390
27252 -30390 -123711 42155 215686 292171 211138 9893 20975 -154013 -140622 -31668 -65108
27241 -65108 -86193 -188224 -141527 4673 77208 91063 153173 146476 -25961 -293580 -203087
27230 -203087 -83643 -21669 -6103 -113843 -114009 -124329 -73659 -42917 296490 400377 387564
27219 387564 278866 201559 179056 191047 217612 189692 141995 233494 65528 -64424 -72001
27208 -72001 -71220 -238468 -317279 -163888 -120287 131317 214400 212660 195378 127545 150314 82926
27196 82926 95518 145490 45458 -32954 -47332 -132707 -100422 15165 67009 160038 185684
27185 185684 86547 271743 330647 265266 61123 -60242 -158059 -93791 -199708 -297959 -245222
27174 -245222 -16467 27067 -75731 -138752 -138089 -45942 -2007 -108592 -117582 6594 46299
27163 46299 89827 171106 124996 10668 42720 81959 187080 101034 98317 83452 68932
27152 68932 68427 172693 322256 569029 535163 346817 275980 120431 -50150 145489 145900
27141 145900 287886 232438 32034 28866 225410 180614 116550 93450 222550 268446 193170
27130 193170 47616 211696 207708 -122420 36965 184298 -12830 -47578 -35274 -50500
27120 -50500 -105339 -20541 11316 159074 92487 -238137 -158513 63575 104055 68687 12570
27109 12570 -33493 -7784 -56220 -127736 -144993 -142202 -180673 46589 30296 12632 -66110 -14354
27097 -14354 200925 228168 108388 59850 256792 364458 147603 25608 -45269 -88718
27087 -88718 -169437 -208075 -173284 -222518 -35883 -21041 -9990 119240 162689 149429 6395
27076 6395 -81935 -40459 -9605 106566 -30106 -18994 -67846 -94380 -64787 -22725 145279
27065 145279 102875 -3378 24911 119369 130774 239506 182740 185237 74651 67515 56809
27054 56809 -130934 -108368 -69456 -47320 -88888 -151351 -162702 -130431 -89009 58165 79625
27043 79625 74203 91336 136020 53025 -107002 -211857 -150018 -45167 -38283 -92358 -53992
27032 -53992 -59267 -100721 -43281 -105214 -20300 -39799 -3273 53855 69971 104720 78814 151951
27020 151951 138892 40458 77181 145838 22878 -143348 -207383 -122641 -101351 -4034 -32514
27009 -32514 -81457 -72394 38551 199827 119789 87606 177263 143104 -66213 -16734 232565
26998 232565 228041 228627 242296 267864 334949 166628 -122995 -244872 -136312 -154266 -46204
26987 -46204 -9889 -38379 -53567 -34786 -201692 -242237 -85681 104303 172287 98764 177849
26976 177849 106805 -97860 -191578 -121218 -140813 20983 89865 79961 71671 27943 -58384
26965 -58384 -185093 -141585 67062 129248 30507 -266489 -388339 -236103 114 -6878 52137
26954 52137 267868 290210 243533 153154 27561 24066 75751 17840 146229 201235 270148
26943 270148 164394 -71345 -22106 166705 326048 287966 179996 43720 68066 71402
26933 71402 40758 26949 245518 217078 83062 17449 72620 -119440 -234127 -47714 61971
26922 61971 69347 126792 178816 239436 230573 209430 127487 15390 -61734 -47584 -103214 -135928
26910 -135928 -107196 -196363 -291858 -194573 -241003 -12341 87951 115619 83560 32617 -46062
26899 -46062 -81480 -34694 17286 -68999 -73212 26161 72546 150185 275656 280583 92205 -23885
26887 -23885 91221 191969 56731 -216301 -137531 -141854 -411872 -529975 -504516 -535774 -416455
26876 -416455 -269440 -31613 221264 362579 218273 -39107 -82624 -120816 -150080 -162732
26866 -162732 -62671 -150448 -17314 259721 201968 -7909 -247445 -275983 -229123 -161730
26856 -161730 -68288 -19650 -94385 36218 148288 30750 -106745 -239874 -254755 -220945
26846 -220945 37032 235808 204127 245337 227694 123118 -151287 -241051 -311347 -357811 -289447
26835 -289447 -124322 -39211 57198 121891 146908 114903 -17859 -50113 -65882 -98901 -100539
26824 -100539 -72518 -96147 -41532 10203 51086 113079 69879 75708 34260 130419 193203 67730
26812 67730 20702 141675 89657 -97237 -136955 31916 73775 -55869 -51085 -111801 -10958
26801 -10958 196521 148863 131336 25585 -1409 -74861 -92431 -109847 -133464 -149018 11483
26790 11483 107366 30670 -79696 -24639 114407 300708 289458 253603 274630 157435 120064
26779 120064 -60230 -7171 86667 171248 114116 -122812 -129377 -90385 -212697 -176594 -95430
26768 -95430 -129167 -195409 -185351 -172359 26010 131928 63255 51323 85507 51879 -22009
26757 -22009 16113 45676 -9414 -130717 -151248 -99171 -189248 -202502 -121539 -144363 -130063
26746 -130063 62208 130416 232256 194352 120136 123068 98034 78989 3777 93332 206277
26735 206277 182921 63059 28477 67911 -22149 -111442 -155662 -95733 -27099 -44694 -40457
26724 -40457 -97590 -91554 24347 215270 116141 59215 60329 81206 56211 42038 158010
26713 158010 234467 36143 -104897 88657 242087 237211 106152 -107499 -105477 -84640 -160570
26702 -160570 -223866 -146744 -173433 -76046 -87349 -113989 -65153 35815 -80720 80073 103056
26691 103056 97928 125021 13389 -86936 -12352 34561 -75920 -151136 -185010 -178833 -215299
26680 -215299 -200314 -521 207067 210277 191564 265099 311248 86861 12142 -25512 -86972
26669 -86972 -126250 -143645 -174208 -226481 -248422 -132629 -26055 -106760 -34164 124429 97414
26658 97414 102392 48153 50579 87934 -11179 159567 311499 72325 -50752 2315 -29794
26647 -29794 -152150 -160173 -130482 -2977 -159711 -69474 60124 2844 85937 -6815 -184210
26636 -184210 -189058 -20161 -38244 -161139 -142370 -125477 -81416 -10630 97407 37976 -42308
26625 -42308 -16838 -79693 -102574 82130 187615 166882 85829 -51972 13652 111212 88915
26614 88915 46039 72258 -98338 -170183 -73056 -40264 -132789 -47733 -41552 -47822 122118 199613
26602 199613 263163 290844 252341 285451 280903 294692 339834 268929 268672 187263 -102079 -289654
26590 -289654 -212070 -247578 -180548 -103725 -150595 -113752 17639 38241 -7282 -53065 -46138
26579 -46138 182068 196087 215048 334111 400492 103821 -32557 -183351 -142846 67166
26569 67166 123012 318904 329577 156381 182839 162695 66808 146327 173918 -17604 -41873
26558 -41873 -11243 -90405 -134942 -80681 -130111 -62781 -89476 -7130 -4665 25434 -12463 -62626
26546 -62626 -46133 11049 47913 125070 60615 102841 123216 45673 88033 84775 100540 73485
26534 73485 128961 156394 102291 40466 47171 75585 238159 165253 43720 -80070 -53064
26523 -53064 -12892 -91501 10093 130284 172265 151064 134209 28203 -80119 36850 157184
26512 157184 276162 161588 118993 93402 119971 201614 214347 63631 203789 234816 262209
26501 262209 229209 2474 -114704 -83790 134783 148384 49086 16186 -3099 19278 15461
26490 15461 -36488 -139202 -92366 40460 48107 130010 191293 163414 224071 155310 -4795
26479 -4795 -32026 25276 -72417 -123372 -220859 -226570 -162029 -124097 -130533 -104692 -98423 -242155
26467 -242155 -194714 18496 -106363 -142630 -207597 -117307 -133208 -28407 159702 136253 -105641
26456 -105641 -197160 -63771 98636 65273 71223 31232 63786 14977 -87267 -229395 -157274
26445 -157274 -187028 -196921 -80783 -24860 -165695 -242175 -121724 70253 278984 432746
26435 432746 295512 220675 177226 14603 -185541 -84451 98529 62028 28145 129506
26425 129506 6471 -60212 81723 87403 -470 -60685 -152294 -80017 -125916 -51415 2704
26414 2704 -72554 -54705 -113497 -187158 -104485 -86734 -202750 -187841 -278722 -161869 53805
26403 53805 61656 -107283 -17283 -132469 -214878 -138312 13498 17047 99578 286300 375839
26392 375839 310583 236059 149755 224232 308197 321302 230716 202844 94034 -39724 -23709
26381 -23709 7260 -136802 -212968 -201339 -291486 -293410 -118950 79940 57486 24095 -57892
26370 -57892 -114766 -250111 -423494 -473143 -537462 -435453 -246544 -21779 11158 7484 62028
26359 62028 218296 81663 17168 -66502 -100052 51455 77124 -15302 -125834 -71165 -94130
26348 -94130 -198803 -195217 -104133 153346 102564 -20949 3570 -49819 76101 58544 -107359
26337 -107359 -91439 -9857 -31281 -147522 -225591 -75609 117955 228935 241865 298431 234639
26326 234639 91797 -117415 -254858 -327700 -243081 80760 131243 195613 191975 177027 68600
26315 68600 178396 151995 80671 -10825 -85068 2171 44057 155267 37062 -161584 -122557
26304 -122557 43881 36239 -126817 -227443 -264872 -264919 -209065 -264592 -234861 -135634 -135449 -87525
26292 -87525 3087 7978 49128 128761 -49869 -208108 -233376 -47952 29363 19698 74426
26281 74426 158590 117689 -30294 -139466 -14851 31556 464 73366 192984 127787 22650
26270 22650 30812 68015 -38509 -157205 -226827 -87089 -146879 -152440 -56311 -79063 -77335 -140495
26258 -140495 -185330 -25572 -71943 -202584 -375648 -365202 -344337 -372369 -457139 -386554 -308293
26247 -308293 -81852 -21585 105218 149097 99919 -25805 -12726 -60836 -93244 -66489 -22536
26236 -22536 49065 125121 170549 89672 -110230 -177844 -221600 -237965 -213865 -189920 -299567
26225 -299567 -467702 -414065 -186100 -81845 -38981 -39310 -103483 -61358 96008 132934 20241
26214 20241 -178008 -118735 -99947 -151675 -126477 -34022 121729 -19892 -62410 8541 -152469
26203 -152469 -185231 -94880 -101368 -168457 -303841 -310475 -212177 -118307 -206825 -111091 -33024 -28903
26191 -28903 36884 25788 17049 93049 162020 -43637 -77355 80384 27877 -74690 39850
26180 39850 35112 -86176 -77790 -86079 -72097 -61780 -31202 -128777 -161458 -172591 -55586 84123
26168 84123 172074 119998 185916 151044 180039 129360 -13281 -143291 -123255 -104567 -167540
26157 -167540 -236546 -246923 -200251 -153427 -183008 -113065 -14432 23244 -63706 -129628 -64729
26146 -64729 -32585 -117888 -75195 41530 42862 -48423 -72886 -89684 -11608 117624 99893
26135 99893 78210 -15432 33274 85036 161765 211582 255686 90157 -29691 -191600 -80622
26124 -80622 -74683 -49174 -38393 10766 114519 168027 84344 -38325 1665 21530 -47264
26113 -47264 -192005 -228760 -181726 -48913 -68932 -122396 -72950 -40713 133281 236904 291781
26102 291781 113397 -28980 5328 -29344 75332 -45860 -135427 -68691 38475 -13718
26092 -13718 -110743 -97032 -158817 -153985 -67907 54936 76432 -40153 -141307 -132253 14095
26081 14095 37244 -23890 -70387 -221982 -179191 -57626 125535 43161 45021 -161176 -264655
26070 -264655 -123836 29255 37168 -4431 -42047 -166882 -148536 -110430 2322 212646 141143
26059 141143 51336 20677 -53393 87249 60644 11384 -32965 84559 235249 130293 11799
26048 11799 -66596 -59844 -124713 -78617 -44765 66435 186328 378325 350389 115822 -23296
26037 -23296 -66929 92817 298413 116399 -7023 -43973 -30695 54892 205289 163325 33608
26026 33608 91793 256144 203571 97581 123280 270390 291543 256223 132537 212150 404937
26015 404937 399082 255953 7402 -11647 135604 410839 387989 148887 57143 118942 161100
26004 161100 78601 -207986 -399689 -251402 -74143 -89307 -85231 80998 318331 300191
25994 300191 195299 77200 -82308 -187637 -108530 -35747 -89860 -35718 -53581 -77617 -186327
25983 -186327 -69382 -151512 -124170 72554 32835 -187809 19950 113870 39119 75215 109624
25972 109624 92650 -95796 -65970 -188778 -313743 -274579 -233700 -173774 -140666 -10971 64745
25961 64745 121225 234020 354797 338060 212843 210448 181795 153039 28066 21451 92797
25950 92797 86578 113337 116015 26351 -120649 -120821 -78817 -44012 22136 113407 157307 142934
25938 142934 181970 34812 -789 -14078 -37438 -29819 -115607 -188411 -38708 21861 -32305
25927 -32305 -133363 -128279 129520 -19992 -211537 -253278 -235019 -16133 116549 69708 63318
25916 63318 76599 74326 -147062 -163238 2033 92731 148349 326 43812 -62867 -161361
25905 -161361 -192141 -247794 -422349 -328520 -201961 -225729 -29712 88821 43561 -82940
25895 -82940 -44910 2279 96429 62942 -45294 -47208 108696 66535 -40593 -117753 -201998
25884 -201998 -207677 -65740 -3110 43554 107002 34175 29703 34140 -231406 -254231 -14990
25873 -14990 -85645 -27853 51321 29944 107731 -63701 -73903 55290 49279 -50506 -119565
25862 -119565 -236875 -128933 -70328 20395 164491 103466 104157 75517 -140471 -117430 -45616
25851 -45616 37017 -37704 -91892 16857 124329 227724 33795 -77504 -134732 -158360 -201805
25840 -201805 -214221 -288513 -244570 -119081 -70633 -125672 -142342 -156191 -55870 72892 7773
25829 7773 -57092 -10681 -75462 -191965 -179298 -243079 -303438 -204414 -34596 2015 -71492
25818 -71492 -10980 -92065 -46001 -250423 -244413 -278793 -371603 -233581 -89002 156964 142295
25807 142295 39492 -132023 -178762 -93839 -31457 -39429 -71841 -215101 -151197 -169815 -296162
25796 -296162 -94523 -5211 -18785 199155 175023 113373 14714 -70288 -55449 -82815 -110075
25785 -110075 28901 118185 -85397 -253015 -125939 -109907 -102693 -101568 -154281 -127812 -171154
25774 -171154 -47457 82831 122446 127827 88052 -42403 -86803 -68864 15548 52869 -71315
25763 -71315 6646 52263 737 152174 -17820 -327442 -325271 -265811 -270268 -172382 -171915 -111538
25751 -111538 53786 234221 332451 120175 27897 -96192 90236 155045 204051 106646
25741 106646 55046 27890 23109 -19309 -107131 -139782 -100210 -79182 -155597 -304749 -200051
25730 -200051 -206646 -137107 -128461 -218584 -185257 -91794 -195503 -312402 -155558 -83383 -135402
25719 -135402 -130993 -170358 -138789 -1053 77631 -60377 -138758 -164147 -158385 93771 227357
25708 227357 149827 88340 -28643 -148212 -59370 84547 167166 181045 73168 -25470 -69998
25697 -69998 -47512 154782 140338 70337 89470 152515 106620 113090 101153 -68200 -93341
25686 -93341 -24543 -110699 741 54827 149736 280848 314715 354490 272311 114856 137309
25675 137309 -4608 -211164 -214154 -213251 -242561 -272005 -168214 -171434 -236224 -243920 -72077 111307
25663 111307 6166 -125231 69505 173469 31526 -149998 -133403 -24437 -116345 -54216
25653 -54216 14027 -66136 68319 113090 69158 69510 236755 145219 80590 63789 48050 174433
25641 174433 137914 88766 4347 -36624 -79168 -101786 -185794 -183806 -159729 -224325 -249203 -188114
25629 -188114 -200192 -98916 -130988 -195100 -114221 -105211 -233273 -158530 -6929 102740 139236
25618 139236 58871 239702 300682 73711 -134796 -113320 124200 51461 -153190 -208642
25608 -208642 -54720 53017 171612 102995 60209 11419 38003 131926 265945 385081
25598 385081 426516 375885 221741 111913 33734 -28749 -75187 43912 174379 346655
25588 346655 176112 -8464 20459 77730 307 32449 16360 41078 -17405 -6069 115268
25577 115268 194981 215139 112681 103522 95364 130360 192471 103187 135399 238861 287846
25566 287846 249046 164545 168620 -16817 -16426 160324 95365 -59803 -121291 21391 159085
25555 159085 106965 120261 92774 77248 -142386 -126626 -147773 -114863 -3929 -34301 46760
25544 46760 36977 62766 73076 -3976 -28607 -26565 -17391 -89523 -209561 -162320 -79142 -133432
25532 -133432 -267035 -164508 -139424 -344701 -401065 -387122 -223142 -186393 -108904 -205956 -200331
25521 -200331 -70680 192183 120127 22002 -81365 -235057 -395196 -266006 -13510 169177
25511 169177 218457 327154 244683 173983 71277 -14459 4052 25203 -92783 40475 156397
25500 156397 183201 125422 167926 13946 -113842 -64392 2329 32056 -26960 76959 81065
25489 81065 54947 10274 49067 -18327 -98115 -131443 -113416 47388 218555 197716 59367
25478 59367 -35466 -15318 82254 11220 -43277 34191 -41042 -189286 -360127 -221725 -34919
25467 -34919 130410 149349 94399 -82888 -65108 49616 37737 85723 184091 94695 1608
25456 1608 -141090 -128302 -161934 -169475 -104822 -16428 71153 114510 88296 137346 160340 -69592
25444 -69592 -162486 -37143 -55830 -111379 -38509 37924 79778 -9526 -8326 43921 115812 20785
25432 20785 -5876 64056 812 19144 4849 -88956 -145537 -104411 -58967 903 -157312
25421 -157312 -198057 -38217 6769 62839 -11005 8536 -89507 -214440 -112833 -155563 -108416
25410 -108416 -29777 12569 16791 153989 144022 -87748 -143350 -81524 -13902 40248 55292
25399 55292 136741 101722 -109018 -228779 -227504 -251891 -151530 122188 188370 322743 274548
25388 274548 159047 12198 -172975 -147599 10380 97619 -56311 -159815 -25995 48593
25378 48593 30090 -29366 50811 92042 -57154 -191107 -260183 -60303 53912 156346 127794
25367 127794 35647 -61952 -143040 -181547 -59397 -185981 -197799 -98910 13054 -31614 -164952
25356 -164952 -63549 76278 154932 224606 257701 189864 21022 -49006 60132 41297 -52170
25345 -52170 -20719 29302 -86825 78909 144052 283016 274723 102465 116234 157610 103395
25334 103395 -81649 -304842 -209455 -168840 18840 112094 656 1250 30142 -5383 8808
25323 8808 -72549 -133663 -89461 -295704 -282492 -234080 -177575 -55095 -141435 -115868 -141477
25312 -141477 -156029 -119328 -61719 -84951 -14764 11410 129548 235547 209723 168246 48047
25301 48047 13254 -23022 -110574 -91125 -174508 -249743 -162208 75120 146795 42168 55880
25290 55880 86877 -7196 -81678 -295840 -357220 -214128 -61513 -215256 -194735 -31328 -44379
25279 -44379 28159 -41140 -24752 137837 146369 128759 118043 12489 -240470 -115545 180321
25268 180321 56614 -17928 34543 169188 270456 17014 -169008 -44031 -88817 -163103
25258 -163103 -138259 -120237 -57977 55146 16493 56167 120386 117017 241557 27171 -30010
25247 -30010 -81558 -83885 -104607 -76697 -189021 -109455 2708 -7769 -171559 -64352 56961
25236 56961 54309 57977 -6483 162824 1244 -160100 -217483 -292432 -141574 27019 -2321
25225 -2321 -202278 -127433 -74930 -396 -106955 -66391 63466 137083 291322 229490 4068
25214 4068 -25538 -88067 -293918 -217755 -187038 -79154 -39796 5112 -128937 -139085 -1546
25203 -1546 104654 92911 151662 102697 32062 90111 103046 -26949 34752 -37269 -131271
25192 -131271 -89187 104550 46433 -284322 -356246 -147210 -98529 -26490 137214 131829 174277
25181 174277 268472 201590 45668 47484 14558 -8121 -118030 -66213 -180301 -200721 -15218
25170 -15218 -26324 -148405 -197395 -174891 -125266 4653 28637 143573 170551 -79520 -79043
25159 -79043 -23386 -46770 46848 208303 122735 -14711 26508 115396 68285 81710 125490
25148 125490 118077 186850 153383 -14370 48548 85202 -39799 -168881 -64401 -26640 -255050
25137 -255050 -564125 -461652 -121390 5312 196254 117715 28523 -12218 -31735 -131257
25127 -131257 -160279 -106806 -990 -27231 -92149 -3255 67984 108112 66956 -29886 -50998
25116 -50998 -15818 69674 -64183 -70509 18996 -105739 -183880 -229171 -193753 -51080 -29205
25105 -29205 33138 82372 -69655 -117796 -136473 -196729 -171154 -3896 707 -104678 -19178
25094 -19178 9132 -206551 -83285 -86588 -40878 85158 111141 183290 219177 168444 137434
25083 137434 66227 -201902 -350205 -361925 -372634 -290543 -280897 -183473 -133268 -164662 -122314
25072 -122314 -50695 -69134 -8413 -13397 -136688 -104718 40203 35259 29325 -6062 12339 -14859
25060 -14859 -40499 -83000 -111674 -196570 -256830 -338612 -192010 -108601 -142532 -20740 -72154
25049 -72154 43269 277209 176271 89874 176793 140794 37337 98732 58417 -104857 -236247
25038 -236247 -224660 -170771 -218082 -211151 -158715 -129479 -112303 -138916 -103211 41332 208394
25027 208394 166804 42106 6161 102991 -42094 -181520 7265 20044 44499 13728 70150
25016 70150 153787 115524 42045 -28496 18764 -30301 -86204 -89828 38009 181089 173232 -633
25004 -633 71396 108998 -62385 -212525 -107064 -31134 31826 81474 209724 182380 161239
24993 161239 -79475 -270418 -178650 -115576 12362 105030 195307 149241 80634 121036 -22810
24982 -22810 -145619 -138551 -113159 -187805 -268311 -180419 -14914 33182 -49663 44091 120375
24971 120375 87974 -65781 -137250 -131654 -191917 3753 12794 147869 115603 -256 50499
24960 50499 96199 150240 154700 223336 408839 193700 80721 2362 5146 -49650 -158884
24949 -158884 -281605 -333884 -270073 -260378 -170818 -245182 -378639 -303687 -193048 -153382 38972
24938 38972 27288 5572 5351 -118459 -178581 -78661 92694 24026 -3190 13582 -110716
24927 -110716 -190495 -100360 173511 250241 122522 31672 -5519 101461 104555 18163 134449
24916 134449 111396 10408 55497 72618 19793 -37208 -10324 142538 105977 34001 -42666
24905 -42666 -21006 48833 -55425 -147541 -231817 -185522 -111385 -150990 -137733 -174030 -109473
24894 -109473 -119246 -117488 -142042 17118 79138 75584 57567 134343 146504 84916 71538 111092
24882 111092 -79697 -205574 -122801 -146155 -124850 -224129 -197444 -118419 49738 105999 61647
24871 61647 -24239 -144644 -257647 -204002 -86163 39525 66565 92256 -18509 -51035 -79235
24860 -79235 -175045 -319171 -430426 -280311 -158717 -75896 140605 245755 155363 237149
24850 237149 66216 35690 7516 -95964 -132535 15851 58541 -15635 57349 115931 161727
24839 161727 47349 -15386 -88645 -74603 76780 109425 51699 -16807 31026 101849 191157
24828 191157 40988 59126 92006 106825 -53025 -100790 -156742 -136242 -132020 -115834 -73199
24817 -73199 -82583 -208149 -84817 -62872 -89529 53793 9667 -141981 -261431 -210052 -86863
24806 -86863 -55970 -206953 -215230 -20063 -108410 -325314 -289803 -159957 -37616 156891 260204
24795 260204 239951 172257 129470 130433 57444 -3208 -67127 -9318 -22027 125024 151505 196707
24783 196707 164131 -55300 -177413 -4145 15537 -21668 72592 205347 205676 99630 -33855
24772 -33855 -39406 -140626 -161154 -256872 -227273 -173170 -43501 185648 109341 1400 26713
24761 26713 113765 77928 -23092 113231 94940 -5131 -13235 85264 121549 2392 2734
24750 2734 211250 316614 314620 285309 470810 357680 37834 48655 49836 -10383 101854
24739 101854 39045 -13109 -30781 -70759 -78964 -238832 -161555 -90124 41626 94162 117712
24728 117712 144824 33622 -67474 -57080 41343 137328 164222 137709 104668 113400 90458
24717 90458 -27252 -55816 -12867 -28443 86739 229805 169130 200564 169398 210152 175283
24706 175283 148476 265272 230996 112869 83729 -15558 30686 145775 321046 344161 309833
24695 309833 356028 289076 283556 151426 99918 137053 79144 109443 89031 -107684 -262685
24684 -262685 -242294 -162220 -108096 9626 -73745 -123455 51203 52740 -25184 76931 -2982
24673 -2982 14873 23824 -65490 -64441 -70828 -70183 87828 322787 251590 29598 59785 70833
24661 70833 31180 -105029 -174608 -186502 -69230 -52334 8433 -36280 -38423 -75445 -88432
24650 -88432 -1847 54337 97559 38084 -37460 -143341 -143116 -29876 22864 5144 -69678 -143297
24638 -143297 -199015 -207966 -291971 -136182 -111274 -111107 -27897 3522 172088 254188 257240 180068
24626 180068 -38668 -296376 -232100 236967 393253 205154 162702 57247 51130 220696
24616 220696 158407 -25867 -119141 -49980 -150815 -213123 -223446 -101494 -123122 -160639 -124426
24605 -124426 -156646 -194114 -99806 -39543 89014 297078 233835 168823 163513 5190 -106110
24594 -106110 -82871 -191847 -178361 -104439 60083 64111 -10136 -89949 15052 174948 180378
24583 180378 157040 150556 112274 248212 158044 -68289 11673 -85266 -268044 -164098 -231306
24572 -231306 -190279 59872 196258 68737 61269 101690 -53958 -295666 -273488 -111014
24562 -111014 -74336 -33903 50377 22683 22222 164584 48959 -8832 -61133 -128491 -4231
24551 -4231 184453 113120 110160 172246 226066 211054 199399 66913 132804 270867 280794 154281
24539 154281 96907 3911 123315 29820 -138884 -135089 -107105 53121 113649 139373 173336
24528 173336 78789 179089 360353 366505 124266 -5651 96784 134991 222797 161415 83027
24517 83027 -4682 111988 21803 6999 -25167 17860 60691 -37787 -172146 -173061 -62739
24506 -62739 -106293 -148591 -99811 -161701 -161507 -155552 -237323 -201170 -42886 -68301 -245473 -197589
24494 -197589 -99646 -90729 98906 213670 202217 215098 235877 156926 140915 56188 199625
24483 199625 66936 -28423 -86620 -119026 4992 -16680 29695 52053 -88382 -84081 -136318
24472 -136318 -171948 -158385 -71032 162495 225311 65434 -126957 -81723 71820 -35145
24462 -35145 62862 291874 305859 72332 9614 33262 -6448 -91974 -160115 -30683 104251
24451 104251 -119708 4517 153891 196473 295143 320099 94898 61414 25151 -43811 8506
24440 8506 75474 38106 -106853 -138585 -68968 -149601 -135360 84316 15096 -58730 -79977
24429 -79977 -77609 -140997 -229992 -183114 -39687 14187 -36607 -93083 -34124 -115310 -169894 -222474
24417 -222474 -85635 27263 -45947 75863 40911 120366 30274 -127992 -188711 -255096 -306674
24406 -306674 -307622 -401397 -280608 -98619 -45753 -52667 -16056 18095 -44811 -68756 60755
24395 60755 158462 135369 107940 172248 157214 81181 102009 155914 258221 266606 181700 96732
24383 96732 36053 -264938 -314975 -290785 -116701 19610 32424 58253 108508 115875 43688
24372 43688 -173270 -137661 -44447 -26113 -117500 -249737 -276261 -146023 -127370 -199709 -109323
24361 -109323 47401 111370 50246 -62121 -173271 -291888 -270060 -152456 -283218 -575034
24351 -575034 -365950 -229520 9565 86764 118907 96030 163401 47389 -9589 -12641 106429
24340 106429 227117 125684 -64258 -98049 -116296 14749 137369 101228 -7878 -55571
24330 -55571 -27818 76962 42726 -115127 75293 136070 58501 -72454 39327 202611
24320 202611 242936 112688 -38933 -117901 -80796 -118781 -217016 -204582 -111609 -192431 -173574
24309 -173574 -177627 -145123 -28742 -39946 37940 60026 56207 -14379 -27495 -250108 -307760
24298 -307760 -141897 139593 200383 62677 -82161 -190387 -33147 -105956 63404 126305
24288 126305 27971 -55189 -52135 -106892 -210178 4782 141521 184866 214550 325692 201190
24277 201190 27189 -179478 -285907 -343809 -189446 -49522 45596 24102 73824 56046
24267 56046 3432 8289 -49440 -113367 -151892 -117690 -216946 -366413 -363172 -310932 -327984 -388907
24255 -388907 -460459 -297532 -155133 44211 158617 4954 -86548 51988 236784 117161
24245 117161 -122815 -47808 114984 100836 11866 -17935 -17277 41070 126294 -72464 -73632
24234 -73632 2649 14423 -54351 -42315 10168 58692 105840 144548 125860 155594 140409 209338
24222 209338 245947 47891 -108143 -251714 -161334 16952 99103 76889 57436 67063 59252
24211 59252 -181528 -411478 -381293 -376468 -155869 151433 275559 155975 245777 399876
24201 399876 268287 -8478 -154648 -133428 -22562 84521 230991 17788 -93166 -48141
24191 -48141 70844 104957 123969 42843 -92198 -96983 -153899 -327545 -464714 -407339 -257263
24180 -257263 -131132 -310334 -249308 -225620 97197 339952 373557 198387 30939 -7294
24170 -7294 -95990 -32666 -34662 -111477 -205082 -371326 -342179 -210367 -128156 -87699 95260
24159 95260 126030 117437 114289 91446 -16332 116376 263456 247047 126451 147987 90732
24148 90732 8306 22187 8280 143328 137851 115769 167187 138082 94323 104920 307065
24137 307065 456415 256527 182100 95117 -44432 -40772 -92132 -116857 -93022 25215 -18160
24126 -18160 -72435 -70949 -16498 -45958 -12332 54126 193041 1798 -180423 -66025 -23970
24115 -23970 -67848 -8423 77753 64695 -21067 -56329 -31030 59809 62996 -45760 -34514 43944
24103 43944 48084 131106 107860 -136969 -183468 -140848 -66166 10649 -6129 -152608 -117820
24092 -117820 92302 96830 11385 -2860 13385 44296 174897 183948 36451 -85140 -156728
24081 -156728 -165404 -119007 -220922 -230169 -267093 -162584 -38637 6715 24707 -157813 -240698
24070 -240698 -33738 40631 121705 290674 225176 186535 317671 469061 407899 175216
24060 175216 2888 -170591 -165386 106413 120182 -48942 -119072 -79816 -31728 -117383 -73237
24049 -73237 -64181 -83800 -138149 -10714 199445 332736 318471 202598 58563 -34732 -102339
24038 -102339 -185119 -121477 100553 84215 93319 321527 263731 233669 98442 -48670 -114137
24027 -114137 -165949 -209615 -61322 74755 -38477 1163 -45567 -72431 25278 234597 249794
24016 249794 212240 181990 -24197 -109353 -87994 93370 204329 -43707 -94007 -10248 90718
24005 90718 193901 145876 -22113 -101228 6447 113106 20903 -167994 -288229 -311965
23995 -311965 -355289 -233094 -53491 17479 -2377 -108876 -67815 84767 271495 55816
23985 55816 -125775 32619 93445 -17311 -182553 -143231 -63773 -216297 -33698 241388
23975 241388 259810 170291 123786 95770 44606 20359 32505 32134 -40027 -213742 -98243
23964 -98243 -135485 -146399 -83124 -84233 -7083 70784 13271 -67962 40731 166184 53806
23953 53806 164326 213241 248273 110872 -28820 -28781 -52512 15118 -82507 126023 292371
23942 292371 169918 -17837 -17393 121625 137072 126562 16202 173699 88477 94133 38299
23931 38299 171965 231663 29697 19815 109950 35656 -26969 232324 203644 205816 237512
23920 237512 143838 15645 106863 161355 121043 27926 -69834 -49150 37884 45057 -120557
23909 -120557 -182105 -168648 -218722 -234329 -126525 -230712 -286431 -11595 172492 24779
23899 24779 -85713 -25003 85697 321757 340933 310875 81191 -232008 -256441 116702
23889 116702 290282 206670 229429 111972 7151 50017 84687 69902 75118 7411 -14406
23878 -14406 27013 -59132 -129478 -104413 -53682 -17301 -29574 30987 82564 73904 -42746 -229857
23866 -229857 -110134 -71771 -143216 -282081 -318103 -160566 -108175 -184095 -124553 -140493 -113621
23855 -113621 -130191 -279182 -207213 -40932 106684 81230 52896 112259 133165 2837 -64967
23844 -64967 137635 167132 -117226 -131770 8651 86878 150898 157848 118673 22228 -2845
23833 -2845 -26709 28279 91482 -35991 -47968 65917 210035 146494 104148 -10976 -85438
23822 -85438 -66424 27515 114352 79088 114830 71815 -38891 -90263 -35334 74392 289569
23811 289569 282988 309635 320850 279224 316924 322190 219884 100982 35589 137441 308363
23800 308363 271293 14349 -127244 -58436 48741 109517 142597 59995 -166691 -214300 -60509
23789 -60509 19621 -5837 -54514 -73051 -176336 -334771 -261581 -133110 -187491 -280232 -220956
23778 -220956 -168373 -120216 -12503 -123620 -59349 121087 210193 -8843 -168334 -232850
23768 -232850 -260913 -170756 -97109 50062 -41428 -108568 -80256 -133958 -115874 -189257 -371723
23757 -371723 -356903 -153541 -132040 -115033 -142433 -1841 48247 -131667 -211563 -169338 -270570
23746 -270570 -360802 -274300 -359023 -443741 -374074 -277267 -293389 -168467 -194207 -220712 -222745
23735 -222745 -161411 3052 -22660 -308199 -362676 -212771 -47088 -34763 23108 -42463 -29000
23724 -29000 -53922 -117641 75709 152569 116499 -25798 -89512 -309679 -270299 -204928 -33369
23713 -33369 63752 -56879 -149582 50381 251154 211216 79840 27621 95149 -26620 -186128
23702 -186128 -78237 30758 93308 -78960 -170598 -208728 -274590 -327803 -406214 -335657 -122123
23691 -122123 -99005 27903 4514 221045 384327 384541 313248 186121 58842 103375 -44681
23680 -44681 -163031 -258208 -268396 -165801 45046 113672 178997 295525 205282 58917 120790
23669 120790 257311 257289 214179 71345 39039 7429 -9264 50119 -17781 -86918 -41620 31662
23657 31662 162559 341076 287573 185911 148977 71231 104027 187810 134353 107495 -37444
23646 -37444 -177351 -137497 7985 6327 121308 253148 191896 81990 -35103 -70661 -106728
23635 -106728 -73130 -118333 -219791 -212074 -121094 -57404 -63867 16444 64762 -27297 -117173 -235451
23623 -235451 -210006 -233205 -194990 -143080 -99336 -18613 100632 46168 29367 -4297 -10344
23612 -10344 30107 17821 30286 -146008 -172106 -151094 -215422 -232076 -193329 -383625 -453959
23601 -453959 -348187 -196078 -134424 -170439 -123167 -164432 -244297 -207327 -72524 69289 231197
23590 231197 156670 25637 -19962 -24649 -14808 8674 41196 210930 148892 92432 141614
23579 141614 358070 486991 575531 457271 284147 208298 171790 304969 339250 200326
23569 200326 80425 181993 268200 145075 -69834 -88550 -166511 -141187 -166076 -166756 -95165
23558 -95165 -57844 -205450 -263575 -207470 -105144 101586 110781 5695 88374 186225 396853
23547 396853 412252 331800 82802 -104069 -183681 -114274 -42800 48519 112441 154566 216436
23536 216436 185874 180317 22400 24019 42952 -36833 2198 45156 -36045 1394 79698 97240
23524 97240 189432 -13650 -3916 -96319 -29092 13130 84368 175308 128820 28127 -111171
23513 -111171 -107963 -175288 -245397 -257160 -247356 -152557 -68847 16118 151447 48144 -1044
23502 -1044 -5442 -111889 -39519 -139788 -178645 -115729 -9901 68750 -18722 7748 133534
23491 133534 245613 131031 65709 38506 -1910 -69801 -95446 -149438 -34552 23816 -171039
23480 -171039 -199052 -113494 -39652 -29854 88561 126779 45807 -17476 -63212 -13670 28921
23469 28921 5162 5414 112794 101375 102301 117887 144487 92620 -175462 -363422 -215216 -221582
23457 -221582 -170399 -63533 -153842 -311281 -175309 -208974 -222149 -249553 -236648 -232508 -214367
23446 -214367 -126193 54396 79945 146285 208286 229095 157475 183663 118645 261476 230014
23435 230014 163819 122987 27528 73667 224168 234663 107984 -29861 -134629 -332349
23425 -332349 -135939 -63190 -127448 13219 100969 153459 68778 69516 109637 67613 -198721
23414 -198721 -165554 36231 153140 123122 21321 46103 145387 270065 370308 390323
23404 390323 357227 220307 143148 121656 103036 62732 -25262 -44303 -90615 -232425 -259862
23393 -259862 -176607 -242505 -229200 -203888 -274100 -248011 -97626 -145010 -195732 -253740 -225552
23382 -225552 -241205 -170483 -147388 -340476 -366068 -157673 21580 -2037 11654 132958 109542
23371 109542 46136 -61779 -154619 -88138 -150655 -154774 -84004 -174194 -174286 -228692 -240066 -68520
23359 -68520 32283 31101 62787 96517 53962 878 31530 30885 44584 136315 10995 -88699
23347 -88699 -249811 -326670 -276454 -308919 -192392 -163586 -176031 -117712 -121242 46436 170769
23336 170769 145001 88192 62513 45181 -40666 -75712 -79927 -136940 -119124 -6026 -125653
23325 -125653 -33412 147654 275926 242610 145886 124156 273395 42508 -206458 -103976
23315 -103976 103689 32836 -193084 -73268 132399 351413 441692 273721 277679 265150
23305 265150 168939 103677 -27544 47507 89166 57147 183169 304619 205767 163605 142651
23294 142651 112322 86812 -19806 -160845 -116047 -58108 -81547 66169 200374 189138 98537
23283 98537 109492 66012 11379 -64199 -162286 -265626 -148382 54400 94342 -7990 -85225
23272 -85225 -145196 -53615 30864 32839 -70614 -117000 -89911 -76403 -160221 -74373 15379 11725
23260 11725 -42623 18620 -16368 35739 92800 178337 81903 59460 168341 103903 163746
23249 163746 92302 23612 24146 -101637 -255924 -80652 21230 168776 117565 -83581 -137174
23238 -137174 141764 258184 24670 -63365 -23229 -57310 72085 330594 364044 127471
23228 127471 -8108 27223 -47507 -91705 -37688 -151793 -149275 104361 126018 142009 220958
23217 220958 117322 -21870 -4765 134124 29667 -45563 169105 343420 216419 195423
23207 195423 193843 145546 218978 232122 101425 -42116 -113097 31698 22681 59619 18948
23196 18948 -111768 -140556 -117451 7980 -30117 -199924 -297803 -72822 115596 58438 -2168
23185 -2168 -47369 129656 133404 87773 302910 645778 890030 1185647 1319342 1297118 998778
23174 998778 923252 737740 552708 583477 454691 382945 405869 148685 -22359 -80135
23164 -80135 -117789 -11019 43957 114606 105935 111837 92252 -12183 -51123 162194 211219
23153 211219 53028 120318 136290 177919 215308 135579 208674 206992 116969 66382 -9191
23142 -9191 -3583 70835 -1227 92132 166545 100859 27713 9938 71718 26205 -190537 -191923
23130 -191923 -133937 -186873 67369 58146 -32367 59456 131330 74501 113703 81572 44287
23119 44287 110368 24231 -212074 -126553 44741 127501 111368 54948 -20350 -35776 -71404
23108 -71404 -133271 -285830 -367869 -92641 10461 -57191 -78942 -237086 -341934 -269304 14053
23097 14053 -19579 -67808 -165875 -238447 -243466 -225698 -185056 -97924 -163170 -111062 -192009 -182773
23085 -182773 -56678 -19508 33035 57590 -90520 25468 63267 96992 -48743 -23288 97673
23074 97673 59016 7156 14488 -88080 -169537 -41746 -3653 -59926 -167443 -148048 -164279
23063 -164279 -235173 -271633 -276707 -163809 -109889 -112446 -214863 -211192 -154410 -30834 -133517
23052 -133517 -209353 -103787 -81809 -98909 -45393 41302 -149326 -322511 -264469 -31915 199911
23041 199911 200392 160251 170656 191438 81110 -57779 -153811 26381 82656 121744 8684
23030 8684 7585 -41587 143887 239273 294540 215075 -16578 -70082 -31218 -5175 3856 -27635
23018 -27635 48756 -82086 -84670 -98700 -9653 29565 75816 50118 -19286 -2585 20402 -28280
23006 -28280 125115 121613 -93421 -65514 -37309 7055 -38591 -99463 11683 78715 -92417
22995 -92417 -312941 -289144 -92183 2164 74594 112874 138470 159189 229607 110222 -21196
22984 -21196 -118661 -88326 -33789 13635 -90703 27812 76797 -39304 -84322 -103353 -93397
22973 -93397 -147548 -53471 -22162 68415 44220 51174 -6520 -87879 -145685 -136402 -9442 -19050
22961 -19050 -118858 -148955 50942 904 -69586 -62668 -43248 -27900 303957 338458 142570
22950 142570 2264 -126896 -227227 -208075 6058 24217 -41252 101677 -39058 -111089
22940 -111089 -19729 93856 143246 73152 283120 309697 204707 205303 293940 387470 394174
22929 394174 164304 131589 284119 219697 6433 -125740 -177098 -151903 3521 129126
22919 129126 98587 139806 -71944 -84246 -104750 -301789 -183347 32354 170473 152078
22909 152078 90492 100399 35699 116123 17884 -21878 -166710 -53620 50321 55681 215284
22898 215284 253050 328295 228305 318192 351737 341639 160921 27588 -87593 -49963 -128632
22887 -128632 -32141 66867 -89000 -78846 52623 143191 266480 281191 356679 207081 97333
22876 97333 216345 117233 76793 -25938 -6837 121955 121181 -59763 59715 -85086 -133026
22865 -133026 -52346 -494 112890 209070 202237 284827 272337 262320 235506 90089 84675
22854 84675 200563 77482 19605 174387 304128 331172 335816 293043 174254 160799 85431
22843 85431 65623 60292 43310 -848 71171 126042 211375 71132 -73585 37723 -46676
22832 -46676 112288 158737 -135211 -214516 -129041 -110238 -23771 28587 101911 26495 -30542
22821 -30542 106701 255799 316281 385539 330115 96930 143538 246227 299368 345536 279746
22810 279746 264388 191809 19593 17399 -7343 -178614 -160167 -93834 -13733 -96184 -21580
22799 -21580 -8817 108111 170026 186634 149036 107168 48476 69294 105461 120323 171532
22788 171532 296984 177709 55309 -13400 53859 -16603 -150559 -107518 -104412 -154468 26407
22777 26407 196635 268659 85956 36193 236930 47605 99131 119853 180164 264071 243253
22766 243253 255776 257902 287915 247557 253566 341508 337249 351778 406239 561025 599695 646613
22754 646613 715180 762927 890659 874872 726975 612613 614487 517537 242025 9665 -18296
22743 -18296 99446 77135 22780 228677 231794 130720 18648 112073 227508 265180 150739
22732 150739 16725 -3714 95048 339991 487046 574512 411435 215032 236266 216682
22722 216682 338714 391580 324923 302616 371628 330220 202466 249524 375206 528488 585581
22711 585581 516180 573201 671134 928889 1231469 1643598 1772185 1505319 1297870 1227085
22701 1227085 976792 792527 807965 669596 612432 473853 189982 375989 610253 473251
22691 473251 381344 503004 531604 539551 530708 474240 490960 474623 515684 618957 496899
22680 496899 476554 506198 723604 787395 559039 478932 378750 211169 110027 100280 151079
22669 151079 331293 471139 648962 809608 1043175 1247912 1281615 1316175 1230253 1111757
22659 1111757 921757 991915 1227621 1464471 1615401 1730506 1740835 1886305 2106363 2135865
22649 2135865 2134880 2311583 2507508 2848365 3234771 3685949 4404047 5076071 5778297 6416654
22639 6416654 7157754 7811733 8463495 9410954 10418578 12099127 14635692 18075050 23050883
22630 23050883 30412332 41788367 60549349 93810158 147369608 205936948 236880356
22623 236880356 227611695 193520918 151279891 109922617 75862309 51467885 35477835
22616 35477835 25409978 18961733 14513982 11239453 8812583 7336361 6285175 5596792
22608 5596792 5070142 4464763 3826696 3284562 2776092 2271085 1723348 1445822 1501583 1603221
22598 1603221 1489774 1446002 1432874 1243161 1023905 953017 886522 790123 688076 535582
22588 535582 439361 490594 573554 556847 473108 368398 325444 471101 495046 399766 151228
22577 151228 225714 375563 382541 292173 162064 14305 2102 16953 168673 364062 149220
22566 149220 47829 183012 243756 260067 258316 289967 233759 218371 93531 -163874 -196460
22555 -196460 -80523 14366 -170088 -257634 -207694 -62424 60237 71009 -4274 -19522 118989
22544 118989 403332 694190 1087314 1169128 1095166 858744 571106 494736 286506 137492
22534 137492 192436 133097 45148 -31995 23096 33541 26003 -11565 -21082 10399 -67964 -27019
22522 -27019 33873 -139284 -282897 -283580 -74302 141590 15700 -224209 -268283 -358056 -271153
22511 -271153 -208347 -215969 -173291 -49863 -93292 -161250 -197396 -29647 74823 7258 49663
22500 49663 161797 106742 -100967 -51659 9976 22492 -24565 -111396 -112232 -194226 -152458 -80472
22488 -80472 -76133 -208531 -213287 -223909 -33592 13034 -30072 -65073 -130172 -165543 -17392
22477 -17392 3959 130928 37585 -140273 18716 77574 32994 65056 27079 236503 268033
22466 268033 216531 178368 124455 118605 226261 358853 351655 201597 124734 54801 51787
22455 51787 110208 20974 -255788 -373010 -344408 -275769 -249584 -5973 33371 -69873 -54824
22444 -54824 -131072 -326070 -474892 -403797 -159745 -97132 -91869 -34207 -31379 -65434 -67320 -83903
22432 -83903 -42763 -483 -13454 -58709 -65106 -206486 -234522 -33326 89443 -23724 -213450
22421 -213450 -231753 -218037 -54780 156210 189785 156849 -119295 -247711 -317541 -100081
22411 -100081 -31178 -135182 -219018 -98421 -161697 -262921 -12251 72258 3136 -113340
22401 -113340 24170 84269 -45946 -145674 -95972 -107693 -142142 13690 117154 193890 138020
22390 138020 50746 107537 212914 173793 91803 -89994 -44353 -39605 81238 2372 -176759
22379 -176759 -112666 -93561 -80366 -70222 -196962 -231769 -207989 11843 113437 98752 36806
22368 36806 39943 11978 -33149 -79019 -32254 -6851 4018 31888 45085 125681 128311 157442
22356 157442 -53589 46760 38092 92966 129727 231619 217579 -4446 -82854 -136612 19416
22345 19416 -36864 -166692 -79505 -197386 -226463 -149956 -271103 -390102 -408653 -572135 -607313
22334 -607313 -409121 -370964 -221720 -198415 -184796 -135149 -107620 42435 58033 131507 32598
22323 32598 -33531 -42763 -32441 -69127 -155289 -29646 -82038 -108783 -99094 11165 55507 55680
22311 55680 66995 120469 13432 -50347 84630 -97750 -198052 -250755 -313957 -248692 -194213
22300 -194213 -98681 -101037 -117060 -166194 -85730 -35282 -73789 -36371 28932 -71097 95679
22289 95679 -90952 -177656 -160376 -87206 -110095 -184205 -24642 -79781 -217689 -63780 86017
22278 86017 59554 96682 36930 -57772 23830 71668 23570 -48867 -83164 -150591 -174392 -201769
22266 -201769 -315414 -172437 2838 -58160 -190387 -125269 -154430 -204678 -114649 29940
22256 29940 69216 -65567 -226778 -219498 -228558 -190096 -207248 -191283 -250660 -281887 -268836 -341951
22244 -341951 -422645 -358841 -98980 14189 27236 164482 233610 170932 -15019 -115182
22234 -115182 -176470 -22306 -46037 -66464 -16410 -118353 -165797 -200427 -232374 -22067 66749
22223 66749 -43604 -274383 -319623 -212418 -143525 -47195 60872 28205 63145 93856 -88227
22212 -88227 -162665 57154 120116 39263 -107390 36570 101316 89999 2412 -46155 108422
22201 108422 244525 218515 41938 29503 200392 217138 226599 336896 195276 49444
22191 49444 35696 1956 -26713 60625 122750 104688 -205623 -261566 -160557 -73130 -9871
22180 -9871 -139924 -187730 -94451 -53601 -71583 -67247 -47 -68718 107464 161495 77008 270485
22168 270485 223223 78103 51933 -89053 66664 279859 214278 139468 47520 40211 49633
22157 49633 66200 88187 -19547 -66828 -42148 -35578 -14783 -76827 -22977 -92746 -166553 -109496
22145 -109496 44075 -38993 -82062 -55275 -28285 80379 253097 248856 202437 149681 69474
22134 69474 -133961 -230072 -263177 -239166 -290816 -287827 -137394 -133205 -123640 27196 89688 98060
22122 98060 118515 -12419 -88964 -136522 -53559 -70704 -49896 -9726 -12449 -20848 -70884 -187998
22110 -187998 -221111 -157046 -155631 -97552 -94793 -30999 20624 84796 66777 123317 92080 -91190
22098 -91190 -221050 -99217 97334 -28367 -68517 10914 152247 939 -128108 -162850
22088 -162850 -41636 -52164 -142635 -291679 -280975 -261489 -107429 90578 132716 20694
22078 20694 40966 -3946 -61880 -7349 26810 26419 13756 21122 -78359 -84949 75723 173556
22066 173556 177341 285985 463759 764358 1023319 955750 660678 533955 374964 212763
22056 212763 34129 -18229 50692 177519 226695 153617 79347 -104285 -333553 -340396 -200233
22045 -200233 -110317 -63174 -217185 -191020 -69278 -25473 71465 137939 246675 133824 -38639
22034 -38639 -144835 -74601 23268 -16281 -19728 120427 -43611 -54875 36336 74506 -162388
22023 -162388 -203793 -143201 -151742 -150170 20043 14689 -166919 -132984 -120031 -237412 -281710
22012 -281710 -156390 -204481 -221676 -164203 -118674 -74184 -143963 -171969 -39435 -58785 71676
22001 71676 165643 57274 -25380 6602 59367 12402 -17747 -83667 -273461 -293328 -57072
21990 -57072 -29638 -12758 12293 -9120 81314 154764 147169 139977 175664 -32738 -110968 -74363
21978 -74363 -85118 -303830 -331058 -380988 -306875 -343885 -362310 -279568 -121067 -57294 -98966
21967 -98966 -104968 -51703 69439 85948 108631 114055 65299 109632 105884 -28321 -213516 -225040
21955 -225040 -117709 -701 7800 12387 -87457 -247851 -224442 -985 79580 70726 24587
21944 24587 113321 79837 -9853 31550 154322 187228 -13086 -120686 -120244 69104 101590
21933 101590 97389 -34611 -249773 -296722 -293611 -1892 150125 171669 244137 98302 106071
21922 106071 12050 -104390 -20148 72894 9488 -1327 83675 58863 131415 129376 19960
21911 19960 88260 172158 140919 91475 -42534 -152800 -10185 121846 61559 -11832 -158095
21900 -158095 -41450 17032 -60070 -170438 -236197 -207611 -81994 -56815 -61429 36349 145873
21889 145873 224083 28471 -102510 -111603 -86904 -57109 -127181 -133890 541 57938 6930
21878 6930 -77031 64156 112213 68146 113716 96865 13912 -24054 -80309 -190949 -177727
21867 -177727 -1325 113850 31529 -27470 25737 29361 7193 -9885 -70982 -36568 1496
21856 1496 87935 145674 82615 20263 21716 -184764 -173463 -103028 -110040 122177 138981 154953
21844 154953 199078 99191 20267 112880 299654 473623 409310 321905 225903 68650 119552
21833 119552 108643 85330 -23658 28601 139116 157293 94624 -41714 -33503 98387 102960
21822 102960 24746 -9255 -66974 -119834 -139487 -181545 -139814 -145324 -210933 -297630 -248210 -193797
21810 -193797 -54806 72749 64895 -226306 -202059 -189433 -237951 -239213 47988 161180 613
21799 613 -55131 -76974 -99492 -71511 -37632 -131858 -45841 -128348 -185538 -253023 -220283 -298139
21787 -298139 -288646 -206331 3875 61141 -78287 -128172 -41183 25569 42414 86364 119302
21776 119302 107128 132389 114312 55442 -62145 -245719 -311138 -219281 -168320 -254639 -257441
21765 -257441 -296259 -172368 -58156 -38762 74887 -131777 -213258 -177097 -44919 135588
21755 135588 70289 249769 237680 257464 263629 190960 188656 153179 -21228 -40653 -98463
21744 -98463 -176256 -216235 -112667 31582 130414 209490 324434 330097 219527 29756 41028
21733 41028 97086 131046 6242 50705 -11290 -148711 46793 143329 205842 353519 371595
21722 371595 130868 -163668 -150711 -3670 116632 1579 23229 -39869 -106663 -43401
21712 -43401 -85868 -101216 -66688 54189 200593 265522 282144 133370 -95487 -171953 -69263
21701 -69263 59588 182775 102701 32121 53625 112022 212806 126182 52657 -3038 47299
21690 47299 124719 74965 76192 115201 103323 126383 79626 41805 79657 121024 46236 10868
21678 10868 -65541 -154423 -146068 -151962 -109835 -20315 -85431 -95486 84738 156950 142070 51662
21666 51662 -12586 -8465 -76083 -245953 -122026 -109461 -174089 -340720 -473544 -404189 -219080
21655 -219080 -192421 -68919 90469 137106 188507 208074 52686 -94029 -132255 -123140 5888
21644 5888 -122761 -195680 -385878 -323550 -203507 -230577 -130415 46818 94222 31421 -64533
21633 -64533 -100923 -68185 101890 125301 20419 -116432 5261 152604 235874 92785
21623 92785 -29743 -45583 -118106 -225556 -128047 -65955 -100998 -91812 -119501 -34289 42884
21612 42884 25152 -71181 85097 77052 -20128 -38738 -160560 -129307 -165205 -68818 -43179
21601 -43179 -210070 -326925 -316438 -226483 -120552 -135716 -173665 -212469 -159796 -38958 -69248
21590 -69248 -73572 -32062 27662 72125 71543 172625 138769 18874 -247124 -300145 -107885
21579 -107885 -110261 -144869 -346945 -478747 -339420 -329548 -322133 -382209 -223628 -120508 -225858
21568 -225858 -151998 -102434 -194067 -112507 -250191 -336790 -412035 -433711 -250692 -42249 226092
21557 226092 250282 96411 -131401 -225252 -198944 -211787 -188935 -232083 -188568 -173201 -127587
21546 -127587 -272346 -160155 -78619 -155676 -68726 -263812 -119516 -155208 -164357 -104927 -45626
21535 -45626 -120059 -147391 -62285 -70606 -216463 -119757 115949 134048 3401 -125334 -233845
21524 -233845 -298795 -133631 -86691 -94749 -65815 -112259 -102174 78971 139558 -21977 -143306
21513 -143306 -41764 122092 129865 34708 1586 -37852 -166444 -177930 -164436 -123630 -103050
21502 -103050 -20408 65379 88064 122544 -12672 -66805 -146169 -126587 -11768 14394 618
21491 618 -87958 -239553 -314109 -243240 -224805 -230272 -225810 -235408 -97968 -11622 123886 183749
21479 183749 163682 103610 51982 187296 221632 393223 455762 490925 137766 84272 257955
21468 257955 216577 225521 150076 40605 64124 15544 -95887 -201501 -167767 -63353 -128193
21457 -128193 -165290 -73153 104536 116818 41612 -46506 10303 12574 -10119 38002 -35278
21446 -35278 -85656 -127708 -162170 -51930 -27131 73745 71903 132567 19470 -38394 -53301
21435 -53301 21706 -60927 -99821 -52596 -6581 -53585 -97188 119471 210531 103950 55549
21424 55549 259920 235088 204312 194662 63877 -175500 -46795 -108785 -201196 -157187 -147612
21413 -147612 -197720 -259635 -435855 -394038 -305378 -260250 -305353 -340528 -224796 -73448 -239475
21402 -239475 -359280 -328347 -198670 -93333 -86597 -17895 34386 4315 -152675 -28105 -10084
21391 -10084 -11184 -11677 58911 -105922 -191772 -279786 -268710 -121013 168176 121666 -3958
21380 -3958 -68005 -72382 -169967 -124810 -142464 -47172 5175 184411 209642 -30624 -170982
21369 -170982 -216258 -224004 -46969 25856 5690 -151637 58248 236103 136377 119485 166455
21358 166455 98301 177261 185825 88671 19943 -119105 -187544 -1041 153426 108508 -30953
21347 -30953 -149439 -90154 43459 182187 93046 99310 173547 248145 223763 205382 187404
21336 187404 152490 300077 131175 -2882 80737 64689 -17482 -148447 -254222 -134269
21326 -134269 50935 175292 206783 51262 -42255 -152127 -302050 -313384 -179464 -141828
21316 -141828 -138655 -67818 52960 120228 119125 91559 -3742 -102941 -118470 -30201 -177656
21305 -177656 -218340 55023 179275 141591 5264 -79450 -64198 -27982 -95433 -89569 -103988
21294 -103988 25959 -62793 -138528 -41491 99423 88856 -34882 -77770 -71923 107588 125334
21283 125334 182347 41067 -64947 -91188 -85839 47251 261049 276638 172688 -45816
21273 -45816 56414 87466 -16834 69209 102915 55500 75273 57476 133459 57007 -223600
21262 -223600 -257583 -240759 -198825 -201175 -186628 -282133 -57608 -8943 48261 129745 -12205
21251 -12205 -263258 -345060 -85519 215042 187562 -62168 -195297 -191036 -83282 -146123 -207209
21240 -207209 -255442 -300944 -238148 -103833 -177052 -225118 -19578 78215 60180 81019 84583
21229 84583 24871 60480 31857 -101001 -196364 -84190 -119800 -152410 -200799 -286501 -320283
21218 -320283 -149929 -109787 -82170 174851 307389 385084 422280 403102 259633 249551 -5459
21207 -5459 7915 191001 119990 -72342 -80524 44850 183228 391932 535332 409578 364736
21196 364736 369939 302929 191583 229710 228747 -17748 12124 46828 146250 156602 153515 185788
21184 185788 188040 -17471 -178124 -139844 -122574 -232296 -396438 -390087 -246033 -93146 -166887
21173 -166887 -143799 34683 20737 -45686 26025 117001 291486 209741 145138 89614 -29625
21162 -29625 152851 224723 100447 100139 32224 -71023 -73970 -89327 -147664 20482 17964 60378
21150 60378 159341 129975 131725 -62430 -170693 -117983 -159864 -78356 -45341 -5144 65086
21139 65086 95815 92260 28995 -11766 159981 58605 -60810 -186049 -122142 -54871 -226424
21128 -226424 -229853 -64869 -52351 -64130 -128055 -62506 -137848 -45430 93000 200411 -19986
21117 -19986 -74528 -39749 -25906 66634 102045 219246 134712 74261 25919 -90837 -253874
21106 -253874 -189071 -234103 -163854 -74953 -10373 162001 189602 170024 -6647 -13492 65373
21095 65373 65171 103323 -93491 -202667 -90113 -24273 -24862 -14442 104144 147991 57258 156266
21083 156266 155133 98552 -91971 -47781 114398 -53640 -156894 -328517 -284755 -187630 -109429
21072 -109429 -18495 -34930 -123472 -208385 -306503 -378373 -223609 -96830 143500 191725 -9969
21061 -9969 -146575 -148185 -73819 -179047 -88997 35391 64007 131247 310636 242920 139728
21050 139728 19021 -44035 -59542 -87995 -143192 -179224 -191491 -96885 -88990 -72774 94399
21039 94399 99734 163659 37342 82464 218679 132994 38261 -10082 -157827 -195885 4899
21028 4899 93437 63219 26757 52721 -95118 -175094 -207065 79944 261999 232590 182871
21017 182871 107136 42789 -27942 78580 188362 159638 -143841 -478538 -439245 -172239
21007 -172239 -170636 -244938 -206545 -120117 -110676 -41689 -41714 -59424 -113867 -85851 49513 -32827
20995 -32827 -92289 -156620 -97641 117553 84306 15617 114784 243067 338197 229072 212051
20984 212051 76671 4693 101225 69087 -91190 -39677 -13366 -73771 155342 149183 13045
20973 13045 67956 135181 86618 11274 -82627 -165393 -133587 22106 106831 97469 246397
20962 246397 231418 7515 50685 141906 89023 -151058 -128637 -45697 -117626 -126596 19615
20951 19615 134289 366967 400500 393981 203309 -220092 -322616 -185884 -73669 -75491 136991
20940 136991 335923 295200 293933 143169 26776 -90809 -165926 -159988 -50799 142817 50653
20929 50653 32041 -64100 -203818 -266254 -97403 73345 231799 166074 -8279 -3865 -36093
20918 -36093 185165 449047 322633 131923 147434 242433 56568 -27891 -40948 50177 -31030
20907 -31030 102845 25383 7467 79381 76353 115050 -43573 -154313 -68792 -160065 -253210
20896 -253210 -190230 -115941 96226 129643 147535 89847 1706 47829 223552 123053 86865
20885 86865 323809 307821 351403 164377 42787 -35252 54529 197217 396434 314875 11531
20874 11531 -18401 46668 -120388 16601 -10583 -91803 -57174 84641 70651 146465 185636
20863 185636 59398 -18445 150381 165568 120101 128587 119794 96420 152330 185557 124289
20852 124289 -164896 -103944 -90192 52395 35244 126526 152342 -16680 -178969 -59667
20842 -59667 31338 32455 -16747 -113032 -146593 -147325 -226381 -211949 -310272 -137836 -49153 -41306
20830 -41306 -32190 -8705 -117101 -125193 -195261 -205427 -193900 -286991 -172001 -220551 -337354
20819 -337354 -326887 -83351 152279 197208 179541 208825 181089 102097 122479 89480 24102
20808 24102 214156 345201 257931 253030 144480 173106 221858 120488 213518 277069 319972
20797 319972 326240 362473 484882 437150 342249 287563 388145 289436 241372 244891 149807
20786 149807 172086 132544 68405 188800 277902 187146 199395 307792 100764 -40821 -5544
20775 -5544 -64997 -159734 -276578 -125351 -148331 -179450 -275718 -352075 -211213 -133406 -111273
20764 -111273 448 177211 143568 123216 83515 33037 131965 121886 -36777 -81393 17764
20753 17764 7439 113432 255929 271288 335234 288458 316578 238782 278336 353232 292169
20742 292169 203375 203054 244201 203260 248247 303731 358919 376159 345811 267758 239459 362026
20730 362026 401197 440270 304049 229541 188289 82615 73088 151624 177854 168170 241783
20719 241783 342687 460581 332067 214910 324415 305950 313014 432315 593286 743852
20709 743852 575794 585130 584361 545565 589292 629416 758652 735441 745399 837735 983297 1124667
20697 1124667 1320898 1544901 1745379 1814769 1788284 1889781 1993595 2126990 2262829 2579333
20687 2579333 2932076 3197539 3322869 3551567 3857662 4506588 5203993 5802584 6664355
20678 6664355 7642124 8909032 10545958 12741448 16013095 20984095 29164960 42593545
20670 42593545 59892301 74633407 83915080 91339128 95864463 91946900 80772869 68007271
20662 68007271 56626391 48519170 45718066 50090952 61778288 75547243 84881966 90643606
20654 90643606 94845284 93172698 82755839 67707510 52610890 39182347 28197864
20647 28197864 20401977 15113775 11562911 9033479 7379247 6401255 5468712 4709938
20639 4709938 4177242 3723408 3298453 2886849 2555261 2357757 2399354 2349623 2197045 2008699
20629 2008699 1625148 1573564 1633747 1405991 1167396 1001671 897968 757907 824469 961902
20619 961902 936618 928689 755331 584027 527241 545814 439052 339888 296951 139039 289779
20608 289779 395372 420070 346379 272149 284708 208128 121306 108484 109529 100115 229998
20597 229998 250506 307739 278671 232607 236736 166797 37198 152022 232927 274620 172728
20586 172728 28800 -176216 -122202 111887 159038 250226 124051 86260 312110 313503 282762
20575 282762 205463 162758 75498 -131921 -45194 -126954 -168704 22102 -3538 -67076 -171989
20564 -171989 -120081 -136697 -32499 6825 72889 -15323 -4544 122975 299734 184904 67
20553 67 89360 -37947 -187901 -84442 31065 46592 -56333 -85929 -36547 22939 12454
20542 12454 143141 193673 229012 259075 240686 132846 62977 -25542 -53081 6252 88227
20531 88227 57864 -25648 -56557 -143027 -210854 -71887 -15572 65935 208002 271389 237984
20520 237984 61678 -22401 -45050 -124348 -155333 -175396 -271352 -382565 -296823 -192577 -136825
20509 -136825 -314992 -381273 -441546 -390257 -148299 -55620 -116359 20350 214402 191279 41114
20498 41114 -63254 -2356 100611 61686 -29827 -166677 -205658 -80099 9304 205054 296278
20487 296278 267675 294840 364263 152497 129593 77190 46995 4974 -50727 79312 297386
20476 297386 306153 196909 -78753 -87666 9703 -113588 -248273 -49857 60789 105256 128150
20465 128150 -27358 -155673 -85884 -126561 -200450 -154596 -110609 -100160 -10947 52946 84820
20454 84820 116594 166322 138465 73865 46193 -186799 -295226 -227550 -235503 -60216 27896
20443 27896 108321 29518 -19586 46562 28156 -99215 -204967 -331248 -411907 -220253 -95046
20432 -95046 41820 116574 32858 159201 283926 195085 50151 -97451 -206949 -141474
20422 -141474 -75240 150969 132714 11753 170466 107807 -160946 -357293 -205321 -162304
20412 -162304 -156139 20904 193353 146792 164569 228346 201004 134757 312023 468078 613833
20401 613833 881356 846257 1075198 1028632 836673 826034 766962 637168 526086 360129
20391 360129 360388 205127 153887 143592 155677 67965 -42677 98275 106482 127010 164168
20380 164168 101652 39556 7772 -22833 96595 81308 171703 313365 378806 215082 115806
20369 115806 140294 114049 111805 198538 155963 19868 37445 38519 43937 62050 47265 92504
20357 92504 176780 -455 32606 63582 26233 -60820 -160259 -77896 -77113 -58777 92838 49126
20345 49126 -71056 -172652 -20831 175228 117889 70750 28190 -60754 -221791 -276130 -246351
20334 -246351 -286386 -78097 129003 134089 138720 72907 60312 -7315 -14117 -50716 -75505 -87413
20322 -87413 -240829 -227773 -158057 6995 -28290 -81490 -86040 -130030 -175942 -110286 -139599
20311 -139599 -296986 -240988 -283638 -300047 -234953 -266302 -437284 -328661 -187970 -190016 -156396
20300 -156396 -105069 -198335 -108734 -4740 -13637 -15380 97899 52197 50604 -48161 -43164 41260
20288 41260 80071 -49738 -174653 -224629 -143233 -193503 -111149 -28849 -45029 -1102 129074
20277 129074 126072 -4493 -156690 -194528 -108732 -94220 -977 77663 34068 -158259 -340175
20266 -340175 -422474 -283681 -302668 -245706 -161749 -84880 -43309 70831 180713 173276 167280
20255 167280 200255 217238 272068 281684 113218 -135709 -162137 -22484 -137273 -299456 -127471
20244 -127471 58410 82351 112270 28398 72348 144481 65528 9336 -74600 -156808 16135
20233 16135 184412 109818 53680 40329 171044 201671 169557 -30503 -197134 -261821 -169825
20222 -169825 -118550 -106289 -73008 -96566 -158879 -159943 -85327 35514 58962 -83950 16252
20211 16252 111929 155449 135747 32101 -86785 -55861 77590 106152 63706 15640 -160466
20200 -160466 -219285 -147477 -127729 -92682 -134894 -72214 45240 51607 -469 -88410 -100325
20189 -100325 3342 -79495 -75514 -56625 -41682 -109580 -218439 -246057 -243315 -205753 -276556
20178 -276556 -204281 -188982 -173366 -92366 -92454 -170114 -302167 -411538 -243994 -170019 -365251
20167 -365251 -388100 -222461 -46166 136854 137232 -37977 16792 156177 84255 -1153 -97826
20156 -97826 -230886 -230239 -204456 -172088 -46346 -9951 -15080 117916 57294 102657 -15245
20145 -15245 -98949 -142 -40440 1658 -194630 -250805 -21173 37028 -170274 -236003 -99911
20134 -99911 44187 105809 158519 290512 251918 208683 136624 238066 253000 51561 57372
20123 57372 161734 299138 530912 488268 456971 568248 610116 444991 354655 340919 288454
20112 288454 187253 459208 521167 497410 521580 478590 536191 494464 555349 311894 182784
20101 182784 80232 8026 113928 11865 -61189 49183 10223 -62915 14800 11612 -183428
20090 -183428 -168854 -255871 -241859 -53644 92229 240482 254410 141500 63604 19898 -107719
20079 -107719 -78313 33839 3583 -125119 -146707 -50636 24337 -91658 -21720 18854 155250
20068 155250 144482 281871 105998 72006 58051 -5095 195848 323526 119046 13047
20058 13047 156523 251310 318593 296767 311371 243541 60471 28995 -73510 -149455 -13380
20047 -13380 137441 31111 -39740 -145533 -169645 -236501 -158698 -40292 26044 72397 221531
20036 221531 205711 7328 -140804 -225571 -5854 92085 77107 -73232 -117359 -34470 40579
20025 40579 223887 205616 195174 153736 29726 4137 -2836 131764 289294 229352 72936
20014 72936 -261752 -401937 -292007 -215229 -144263 -94373 -129658 -3290 -36069 -156570 -145520
20003 -145520 -13796 -97342 -191106 -150121 -66423 25081 36753 138861 156346 94039 108135
19992 108135 -12130 -102816 -123759 -104781 -50077 163967 176591 124716 160722 -6239 -112160
19981 -112160 -80408 -30196 -118925 -96900 41056 47582 66398 236244 317974 173465 5115
19970 5115 -69585 112902 285920 83720 113244 217550 267455 270725 72729 104380 107737
19959 107737 185323 174981 172440 252869 328128 325181 392104 320406 281867 470709 538960 459927
19947 459927 503702 340922 196512 349498 355568 353976 360493 331798 189970 22690 41442
19936 41442 94338 123281 243330 294999 269135 206347 219809 101467 48502 104180 199228
19925 199228 85585 -28458 -104041 -170940 -125026 -26005 29341 87573 144281 98396 -6200
19914 -6200 -26411 46318 166263 303582 286756 249766 57768 63778 172844 355117 558457
19903 558457 469047 231195 -23574 21987 236838 316556 117361 187422 413663 410861 463976
19892 463976 547484 488742 312127 228361 434287 533245 570651 699464 757393 640462 615871
19881 615871 658518 433631 219142 149598 250419 331135 479966 607165 529265 424554
19871 424554 259437 -45586 -197559 -112167 112920 403358 540461 613018 711580 859467
19861 859467 844499 846991 810445 933740 803069 774736 884610 1014650 1162504 1207524 1301459
19850 1301459 1597860 1951104 2213434 2527959 2879335 3162235 3330979 3568623 4014990
19841 4014990 4256931 4684501 4977736 5204223 5556910 6167180 6723269 7512994 8709451
19832 8709451 10064797 11743568 13745890 16460437 20287332 25968752 34617354 48859911
19824 48859911 73706984 111726499 149748088 175022427 193083385 198792399 180026600
19817 180026600 147592533 114109070 83503894 59311911 41819608 30140278 22421409
19810 22421409 17325460 13974063 11652078 9916822 8539114 7301347 6080138 5103733
19802 5103733 4445493 4112723 3950396 3707600 3610427 3387314 3214029 3089109 3022866 2786865
19792 2786865 2556580 2200677 1864112 1631074 1327441 1005713 905577 696377 656901 842136
19782 842136 958148 928722 790788 583936 531761 656641 577029 310350 260982 322336
19772 322336 407194 412555 213349 52573 187094 244225 452873 555970 594275 621046 534603
19761 534603 500577 540487 530994 203583 -30155 29746 38399 -37456 58240 -12216 -99450
19750 -99450 32205 98825 144804 49096 61350 183813 193422 233461 218364 219276 263670 193233
19738 193233 246027 447143 431782 302454 157336 116045 163150 97891 98995 23233 125162
19727 125162 291908 432387 498892 365989 230048 87225 56578 148350 286492 328794
19717 328794 171246 25423 -26848 -23304 -42898 -34587 123690 229373 78894 43506 189533
19706 189533 153943 197154 217278 300738 396914 269629 211463 406481 394490 188493 39092
19695 39092 32663 -4898 -42676 -54991 -75824 -22953 -227790 -353418 -276768 -243862 -133052
19684 -133052 -68952 -75141 -134464 -42546 -1092 130962 66162 23184 84776 7761 -186589
19673 -186589 -424434 -290224 -204651 -141658 -70688 -155675 -91302 -56802 79086 122300 259798
19662 259798 226421 151661 6520 -61518 -99987 -81029 -4439 82999 118762 178816 10355
19651 10355 -161545 -209186 -92224 -30411 -1123 14560 40046 115299 191197 110775 4254
19640 4254 -59013 78108 104040 145445 125935 61191 60965 152045 255717 149564 -76451
19629 -76451 -322429 -330196 -415321 -262443 -177542 -269075 -418243 -303759 -147765 -56191 -129894
19618 -129894 -196297 -39946 2669 -5324 -87102 -90512 -56508 -163172 -109098 38119 204951
19607 204951 188854 -39724 -70774 -136585 -71223 -37956 -12895 110911 -54932 -145566 -241660
19596 -241660 -166806 -79084 -69918 -150335 -89040 -38535 25080 71651 -2012 -244190 -168207
19585 -168207 -28780 -119874 -47539 75875 -71479 -170545 -151611 -194122 -94369 -143981 -128287
19574 -128287 50806 136774 52319 -28954 -68417 -102545 -148691 -90397 41977 -82526 -61810
19563 -61810 -62027 -73890 -64664 -110075 -22794 34028 18047 84790 212951 221170 187930 126384
19551 126384 92940 230302 127736 243941 30794 91780 239222 212417 29268 28163
19541 28163 112608 -5497 138414 134582 25940 253511 242966 161159 20113 -113763 -107844
19530 -107844 -86324 -40110 -2090 -85064 18145 49890 152315 99290 -25662 25777 89548
19519 89548 144269 165298 55506 1353 -32546 -47585 -130571 -57624 -79332 -29090 -183204
19508 -183204 -343257 -406196 -306648 -238446 37006 223063 45785 -21368 157502 113206
19498 113206 -28462 -60715 115372 209571 217637 127023 24964 94916 101949 45906 52429
19487 52429 -32888 -32227 -69010 -39965 92211 240336 340081 260932 178752 135153 11531
19476 11531 139448 195118 182620 106992 43625 163594 91166 -52245 56914 102597 -59454
19465 -59454 -128755 -65554 46568 -25484 -217880 -32851 -6474 -109836 47531 22501 -132020
19454 -132020 -206298 -356152 -375925 -191906 64146 115288 117481 48805 28407 -110094 -127632
19443 -127632 -101598 -17474 -79796 -262947 -360554 -257537 -141948 -23337 120180 220920
19433 220920 283294 241424 203657 264126 189175 304540 514171 635948 516989 616787 671649
19422 671649 464245 430574 367761 316351 118993 38325 61942 27338 44907 -14339 -148878
19411 -148878 -53531 -27093 1664 -11632 126313 -74398 -5080 125464 239274 254702 109506
19400 109506 188869 369194 359152 256958 212542 132890 171093 92874 148943 221408 243005
19389 243005 214875 149799 240433 233177 160082 83483 39582 48203 29628 102338 146444 39741
19377 39741 123933 68215 -31071 -16030 376095 681903 646030 399123 358277 252150 378369
19366 378369 437141 385121 440767 255317 -17865 -86612 -113319 -78067 -16199 -46374 -7055
19355 -7055 81278 53511 -808 -48560 -81816 17083 91133 192545 -43049 -43556 48953 29646
19343 29646 2903 55631 157654 3272 62339 -77242 -201885 -128811 -177025 -157603 -44608
19332 -44608 -41869 -38349 8065 100476 283282 255671 139229 20170 62572 183878 212845
19321 212845 110427 130059 102745 -6295 -481 -18781 -19024 -219537 -329816 -170340 -75412
19310 -75412 -34641 -47846 -81666 -29087 113971 98873 158196 232755 183146 101501 65030
19299 65030 45881 76133 162169 178941 165388 54679 14361 79910 152028 272684 199725
19288 199725 -21128 -105194 -21887 91452 132345 70925 -109784 -79445 -143785 -155115 -144174
19277 -144174 -142881 -82784 -45722 25667 -3145 77580 90063 19638 -88198 -21626 53183
19266 53183 66123 163882 251050 103175 -220285 -323237 -295849 -278622 -142534 -36917 41585
19255 41585 23447 39116 -109190 -96935 -87549 -108289 -70663 -102398 -127816 -152792 -46241
19244 -46241 -168 20453 219333 309111 469739 482217 537047 933148 1152642 1120151 1197831
19233 1197831 1055592 858552 674126 582189 465906 325756 283598 75202 400080 510777
19223 510777 437412 376816 265756 285434 122557 61184 36384 -56512 -51019 -62934 91165
19212 91165 112740 31136 1923 65447 41850 102001 122418 68647 -19567 -20505 -141296 -203235
19200 -203235 -219556 -20135 178312 234232 154192 97297 136706 239441 234459 198155 181397
19189 181397 199769 158771 -151178 -211942 125880 232548 106206 160572 227279 203290 165763
19178 165763 193136 195928 157238 207810 333875 451226 444359 327709 233057 159027 188912
19167 188912 1153 33681 164450 339800 371692 370679 336636 292549 279444 393185 427843
19156 427843 392465 442870 332307 269671 297355 289816 150058 6947 -5304 -24557 128572
19145 128572 174641 87190 -16305 -121181 -8684 193496 270622 106161 105774 156824 -30236
19134 -30236 -155743 -42935 89776 99919 87269 46515 155656 204800 260815 219433 128901
19123 128901 179654 184672 -53588 -117757 104996 422429 521614 253667 191477 319093 548394
19112 548394 542130 531611 700234 550899 315437 205912 247930 266255 351768 519829 604286
19101 604286 453762 458008 381834 342624 301762 169386 153480 59244 -303065 -462083 -111632
19090 -111632 192069 253573 248703 294269 360484 258000 103202 212964 373380 391092 420355
19079 420355 346050 229464 141590 100946 35348 125748 226304 212527 129664 889 39031
19068 39031 42006 -100065 -165717 29215 98972 57507 -4585 36616 55687 178814 225360
19057 225360 147977 120235 206398 398210 440638 545617 468081 359541 410300 537258 403550
19046 403550 282586 196035 163345 185618 246092 74893 -62692 55067 37776 -131502
19036 -131502 137408 300768 304853 339397 335255 275390 332298 241253 142589 124174 127782 131009
19024 131009 64756 177465 367369 477434 550868 418239 216146 159070 160310 115763 261923
19013 261923 471044 482315 424321 462031 481557 294161 215117 140570 -72653 -110296 29258
19002 29258 306696 499369 404180 260455 240079 426840 559439 495284 398192 232559
18992 232559 305553 401858 437935 506317 600586 544580 531006 518510 576074 344914 368348
18981 368348 489919 401144 390872 423287 490088 560824 491791 468974 454740 413186 410836
18970 410836 571441 557476 411704 231461 277327 294921 272163 345933 279854 334508 546746
18959 546746 555425 577034 696209 658557 499984 480399 371521 349524 376431 404413 461404
18948 461404 566718 625605 711869 790156 646827 533528 555953 838219 1143131 1172803
18938 1172803 1248198 1238543 1199282 1254916 1344242 1493913 1506286 1398794 1201613 1245393 1426700
18927 1426700 1607203 1802697 1774464 1781144 2066145 2419498 2490491 2548757 2757935 2954275
18917 2954275 3383815 3967974 4695886 5396030 6416824 8041666 10599848 14355528 20394711
18908 20394711 30843150 45618126 58638345 66121702 71863957 76093421 73184896 63182739
18900 63182739 50822456 39002471 28911106 20988013 15314283 11419954 8763559 6930734
18892 6930734 5683555 4798786 4236424 3689825 3292686 3280283 3192584 3204895 3173703 3060824
18882 3060824 3016205 2918089 2641660 2264984 2106079 2172199 2255481 2240080 2375485 2820288
18872 2820288 3106440 3454725 3636949 3667527 3919176 4094245 4162702 4402194 4372977 4794343
18862 4794343 5581088 6548913 7702962 8994896 10969914 13932705 18261567 24993285
18854 24993285 36503775 55495646 77560347 93304538 102134064 110035070 112215205
18847 112215205 102550313 85233693 67008735 50080626 36101588 25820765 18750680
18840 18750680 13981500 10892028 8715971 6904426 5582517 4653434 3924316 3569208
18832 3569208 3307534 2976843 2734127 2529277 2489161 2304152 2011965 1775159 1599897 1514998
18822 1514998 1552394 1688308 1795414 1868587 1691114 1554377 1506377 1474950 1330687 1180460
18812 1180460 1182690 1079225 787205 490082 460914 591992 559110 544622 579278 640957 504010
18801 504010 394606 456657 497951 563460 452129 608392 706530 644085 613974 744301 840475
18790 840475 815815 743574 634794 737351 664514 412941 368729 294394 296211 425520 356391
18779 356391 570201 682642 698140 676168 561571 546194 443382 484739 536589 728114
18769 728114 1007344 1213942 1806847 2291072 2188061 1835924 1348146 1041343 899018 879540
18759 879540 777783 595394 456271 435944 526156 625722 749328 718912 571207 459193
18749 459193 558273 691233 632760 650950 671336 555703 471200 641166 605850 401748 437218
18738 437218 517744 611704 701384 588032 485555 432849 416450 387426 518519 573594 639018
18727 639018 686011 744781 668361 598238 497018 479887 568070 556222 542603 632215 593321
18716 593321 589758 354716 265131 436533 570842 507765 463929 478921 476424 663963 634255
18705 634255 579910 617240 552586 489244 296279 405243 627030 698124 752187 590747 575406
18694 575406 581340 568574 679568 801821 817836 759544 731334 642361 561845 618441 631396
18683 631396 559179 552502 715005 758791 682996 763317 857179 784274 810248 768326 715758
18672 715758 971197 1084660 1147999 1254884 1315777 1240554 1194508 1392511 1459363 1182693
18662 1182693 1166766 1099881 1061443 1238618 1301076 1383760 1779603 2083526 2408270 2763077
18652 2763077 2887774 3040049 3201082 3365915 3573628 3867484 4260764 4969213 5856751
18643 5856751 7210633 9078391 11681230 15814245 22704638 33837211 46650594 54438971
18635 54438971 60414365 64532581 60039991 51247770 42218599 34133680 28573488 26307260
18627 26307260 27719433 33741331 44487686 53341085 57937276 62291367 61065199 52372170
18619 52372170 42392512 32595943 24036402 17542143 13080997 9974257 7809596 6433669
18611 6433669 5452551 4778667 4400810 3957793 3657424 3494115 3222274 2894613 2836207 2867926
18601 2867926 2787279 2661011 2440383 2463751 2686059 2831946 3013986 3275969 3599638 3948051
18591 3948051 4376275 4785015 5375209 6235612 7591767 9719022 13131135 18776054 27224501
18582 27224501 34449148 38345815 42324419 42983257 37968903 31934349 26241660 21622548
18574 21622548 18698779 18155913 20214230 26017647 33758762 38057182 40891849 43096265
18566 43096265 39712538 32979327 26135194 19607898 14327855 10639938 8110809 6326965
18558 6326965 5032362 4046811 3296581 2738800 2459030 2330038 2154084 2147506 2099025 1827220
18548 1827220 1597914 1331236 1286338 1334768 1180817 1030693 788934 765069 919377 901993
18538 901993 915078 953800 862927 902542 766397 571627 613292 609088 580643 635075 599976
18527 599976 521033 613091 604312 557280 575098 500840 421628 456588 364309 301697 362951 438757
18515 438757 436201 437220 469633 528527 622333 704300 774677 674795 464327 409086 328802 307576
18503 307576 383215 378333 392854 475749 507588 421352 242860 112548 31727 106200 158965
18492 158965 270278 360886 312553 400701 450909 215100 162573 211439 399251 383413 446741
18481 446741 432337 383365 477518 531472 705095 558337 352914 292383 450356 495240 534999
18470 534999 580591 665517 535505 279393 373880 547835 646880 500867 493752 482198 495655
18459 495655 450796 439872 290722 415906 514119 399008 344191 466925 593991 492176
18449 492176 328359 299164 136963 215624 493988 578598 557858 597724 467382 518847 545309
18438 545309 548273 580686 615840 543327 528363 491366 557119 556626 491791 442714 517957 515270
18426 515270 453164 400612 442569 437661 322165 251290 329498 565261 669337 570547 592417
18415 592417 672787 726050 827531 742552 638595 470206 513943 540396 367188 374961 385866
18404 385866 590800 572681 552514 585002 599299 637015 331264 271629 206821 116169 198326
18393 198326 339308 494241 589667 563465 532417 537740 487773 520647 600657 523624 472325
18382 472325 537505 565371 598395 486580 404689 516537 529890 543298 729200 936316 1104695
18371 1104695 1304265 1452667 1312928 1248197 1100274 844350 716047 743803 657923 719056
18361 719056 786302 862382 789725 664176 608502 694721 674523 591008 599957 728258 758092
18350 758092 455010 385940 462867 542452 597856 431431 327256 293809 354915 547124 649525
18339 649525 585793 605391 575885 401723 328260 239376 351625 622534 581702 590445 576654
18328 576654 456266 157466 209724 423505 578241 557637 474526 397585 542489 508859
18318 508859 630592 743710 833559 850187 734722 715750 576735 671089 538909 394969
18308 394969 417560 295627 327972 373447 480640 523100 499336 425552 274070 172225 271106
18297 271106 421601 319549 404411 540350 493657 359329 390407 460073 402278 311887 208320
18286 208320 177287 238997 335674 412918 360640 433306 521246 572791 565562 550660 425773
18275 425773 411957 394591 163039 60382 96043 14290 142652 194067 324865 103406
18265 103406 116185 22972 42321 186375 273031 366358 453658 471077 380084 308725 249302
18254 249302 445664 524236 490062 413892 331810 398222 388410 347067 322032 334042 400237
18243 400237 439838 306528 259266 375252 581931 646686 671975 654406 789761 870063 860899
18232 860899 763711 507321 455422 455457 351779 56772 231015 382824 453340 434534 335131
18221 335131 457884 543659 504228 465210 494847 495118 594449 445228 336320 369411 277107
18210 277107 281561 316459 350273 241500 188451 366872 434375 371689 169034 90087 197201
18199 197201 228254 250152 335159 355014 410794 599042 586399 472782 473737 468407 439639 436574
18187 436574 344407 244954 234216 349308 199344 47243 78503 175190 174785 127590 190960
18176 190960 287284 531104 663765 682808 791495 686738 607608 557288 803243 901496
18166 901496 931447 780208 691875 683888 797926 813021 769154 794826 698301 679156 691811
18155 691811 627229 620747 648347 566455 509949 721084 800156 835635 963380 1106824 1071837
18144 1071837 1085843 1188063 1332961 1373170 1446012 1420755 1443953 1542913 1598592 1749263 1825932
18133 1825932 2179291 2506661 2639700 2884997 3233619 3520071 4045070 4513417 5150636
18124 5150636 5693262 6300431 7172240 8042046 9188101 10670089 12656710 15216321 18597839
18115 18597839 23657176 31082832 41750291 57855296 85726763 138872176 231558202
18108 231558202 313795107 307844887 267346259 214852586 156923764 108643752 73671313
18101 73671313 50883021 36984134 27947357 21735517 17220986 13742559 11066956 9017394
18093 9017394 7505675 6544050 5681194 4929191 4266995 3758575 3420715 3187266 2986544
18084 2986544 2764840 2647628 2436652 2203169 2105373 1930947 1834185 1712564 1686342 1730636
18074 1730636 1607413 1420503 1328576 1214238 1130400 1148048 1177792 1008475 986847 936389
18064 936389 847300 966979 940457 917257 742489 668377 831888 959965 1081377 1085650 1103401
18053 1103401 1100236 959634 833405 927155 1018779 926140 952003 991517 807596 687444 649443
18042 649443 626718 715514 676963 443339 382307 494096 763334 814281 740868 688528 655889
18031 655889 565796 414533 493505 628502 691659 641810 715205 719007 529068 434001 385200
18020 385200 322511 186432 189269 227325 123651 190321 258693 262608 205430 192256 338364
18009 338364 340382 271283 266596 523691 542927 359623 184093 290535 312979 244001 256375
17998 256375 312558 336247 302868 383836 419047 513253 453565 374669 221445 -3883 30424
17987 30424 171837 168033 127798 173583 9857 -99329 32306 107611 -78643 -72030 43993
17976 43993 50533 -117813 -68786 -67193 -79649 -170521 -97177 -106845 -121877 -60675 175084 275500
17964 275500 192283 43649 -90146 -155390 -140088 -67726 40328 25130 -114618 32373
17954 32373 255760 255547 222079 372885 515792 462881 422821 428640 513504 558450 546813 488286
17942 488286 250689 390608 431057 309606 118537 11804 50499 25485 -64568 19910
17932 19910 131034 272971 421531 260075 198419 173098 552 -58299 -71806 -133820 -107069
17921 -107069 -16908 23896 210214 300866 396834 387721 367607 406316 396112 197010 -92625
17910 -92625 -203346 -176900 -125232 -175358 33154 99451 50846 103360 64539 -16099 -41550
17899 -41550 -61255 -148046 -83815 97194 159037 128201 74135 42663 60810 14580 112782
17888 112782 327298 383310 267361 143539 300260 199944 115481 148747 91782 146112
17878 146112 324105 318249 362642 369944 401158 304656 194354 182852 227892 196703 65333
17867 65333 5332 64144 154373 226444 369696 362511 183571 116711 90793 166689 263381
17856 263381 461831 505736 380125 201490 156046 151856 93692 -12489 15095 30185 -10510
17845 -10510 18326 85493 98406 123616 229773 289931 390468 404824 371307 342515 143210
17834 143210 68744 -177066 -190715 -126706 173659 262822 213183 296101 271711 229966 73996
17823 73996 -44824 -131410 -35593 -68410 13299 695 45632 227228 290052 143711 63175
17812 63175 162984 92809 -83474 -127177 -98392 7311 13951 155698 295937 258003 294114
17801 294114 197702 161882 56144 113732 156588 234298 340002 121142 -77652 -253727
17791 -253727 -228824 -131907 -5253 100391 90228 -99758 -56043 23341 170236 107944 167615
17780 167615 209788 135449 -26261 163474 161737 235195 392804 492462 443693 319630 240949
17769 240949 356168 478627 367259 297083 241516 138630 225012 270327 247574 249164 87964
17758 87964 57783 95099 71406 42009 58154 111108 93302 125056 243143 255840 331925
17747 331925 361243 435714 242697 -6641 -101247 -97633 159948 303023 203685 119915 77024
17736 77024 -1137 32414 -32108 -267030 -357811 -166271 22077 54738 119280 95120 83499
17725 83499 137861 158246 212801 172280 39773 -66250 -39766 35311 145313 181082 198925
17714 198925 290629 175416 18752 24588 72124 137099 172708 188227 239783 381012 326485
17703 326485 179835 24401 -191936 -309255 -319072 -170005 -58309 -124307 -183593 -134464
17693 -134464 -133131 51615 125152 180632 138746 130497 63484 -50517 41866 140185 55458
17682 55458 151368 291435 223914 203757 205985 -30514 -146593 -77192 -93917 -50929 35420
17671 35420 108132 192796 51067 16288 -103987 -10735 75411 149198 -12801 -12000 47839
17660 47839 222012 307808 245306 124204 -35391 -164542 -199860 -140123 -115825 -38281 -36124
17649 -36124 -46468 59238 80375 60384 253793 115507 -142827 -92153 -93491 -143093 -118211
17638 -118211 -117438 -83266 -236778 -153427 -80659 -238925 -236940 -71609 -133798 -256341 -257202 -227469
17626 -227469 -208868 -151296 -85656 -38969 50540 254369 246461 193935 198080 136632 38771 -82857
17614 -82857 61046 154812 109712 67094 -34185 74416 188245 119363 14798 46360 6430
17603 6430 -72643 -122006 28259 -156984 -325290 -303844 -47064 36983 194677 195843 3754
17592 3754 15593 149351 149894 69058 88613 -61837 18056 169287 271768 214459 212092 47949
17580 47949 169727 116839 147212 176906 237676 282877 278262 141592 -75087 27433 33821
17569 33821 -49457 -65415 -76908 -278651 -150102 25665 87712 39156 -85625 -227655 -265802
17558 -265802 -251741 -175966 -258965 -199329 1737 133497 -8080 -95476 -156572 -92139 -23332
17547 -23332 -13484 40245 172844 192947 228970 357161 359795 339299 235988 -21566 -137135
17536 -137135 -47508 49838 194077 98860 -167011 -185680 -113706 -151728 -178338 -139925 150073
17525 150073 297721 175026 111162 -20817 -37180 -205727 -379443 -493569 -275648 -27079
17515 -27079 -8152 -125413 -32080 -58456 50215 77235 -137860 -55898 -150896 -172769 -76985
17504 -76985 -48866 15467 7346 20601 91238 -45464 -109649 -146827 -190950 -62918 9354
17493 9354 -169819 -296354 -126393 9801 34195 -37142 -97419 41029 -4731 -40763 -124970
17482 -124970 55801 173140 31550 -193945 -250001 -277769 -253461 -238789 -154869 -42374
17472 -42374 -103018 -262011 -216221 -251057 -247114 -217233 -150638 -112924 -192223 -126226 -36730 95408
17460 95408 78866 -11412 -41007 -50617 -37542 -47144 42212 114333 120198 86515 -131584 -59378
17448 -59378 25637 -61020 -37514 182249 341989 962511 1300707 1543287 1438643 1108188
17438 1108188 794488 602862 450898 271606 131703 32746 -44805 -111355 -111248 -21083 -12591
17427 -12591 69313 116547 -13521 86940 280622 398332 503948 548100 730795 614412
17417 614412 363888 127746 -29521 -127382 -122938 -111469 -91531 -47752 69833 111856 -115
17406 -115 58757 91585 43477 187869 83008 20935 161791 243685 173773 207016 177545
17395 177545 51761 -117622 -142532 -96195 -85963 -113062 -64396 79667 123070 120046 72675
17384 72675 -193728 -192742 -140127 -102626 -48747 174410 97870 -104922 -65736 -11126 84597
17373 84597 -13348 -263732 -188492 43099 77735 -102368 -296900 -267115 1263 19916 -54143
17362 -54143 30254 30000 9985 23868 75500 30016 -56716 89416 -75448 -106621 -25039 2407
17350 2407 57304 85795 191704 60936 51318 150276 174116 99710 25971 124699 174931 181852
17338 181852 230320 97336 34998 65527 58663 126088 130709 162817 -25496 -202327 -132906
17327 -132906 -39625 36634 120954 230487 301272 289791 361265 334663 295922 301261 88506
17316 88506 -111125 13044 -31825 -172084 -115872 54126 174751 254405 243104 360888
17306 360888 384377 389376 145042 58090 -85692 -89222 6523 187904 174830 88160 -20606
17295 -20606 68653 258043 254777 220283 204564 112216 79928 166177 129953 30470 42773 57493
17283 57493 108566 207060 108484 -7878 -117831 -129540 -62063 -24340 136550 89249 48852
17272 48852 -16529 -51958 15864 -23943 126277 91097 149240 259059 81461 -28457 25081
17261 25081 -76504 -135694 -115231 60046 147301 107786 147800 4038 53381 79168 -11639
17250 -11639 -122672 -77091 -121151 -113424 22924 227337 171472 -75625 -289582 -118593 -96126
17239 -96126 -93608 52547 43176 51968 38490 23800 -91269 51009 64738 -46081 -238270
17228 -238270 -386696 -187731 -103489 -22602 156720 300424 418416 502993 379279 248026
17218 248026 167901 150871 35335 -89994 13879 -103265 -200775 -281519 -295858 -103047
17208 -103047 23091 58478 179113 152914 30174 -216286 -212290 -86962 -100458 -177244 -131641
17197 -131641 -75752 -19440 -106811 -183283 -154721 -61142 32024 29991 -12318 68961 104213 -36733
17185 -36733 51639 57305 58653 63364 15665 -35685 -3415 19861 201489 157877 107448 135169
17173 135169 98442 27441 212074 219027 213966 321365 209452 115078 100726 14333 85180
17162 85180 31102 -529 -63170 -230457 -349680 -301139 -138936 -156424 -171703 -202568 -35761
17151 -35761 26607 30256 148918 197084 256997 200798 134761 3699 92744 98112 -15698
17140 -15698 -47913 -14575 -125945 -140787 -94153 27623 33503 17731 67716 67083 233548 167510
17128 167510 99237 -81737 -78197 -87035 -95948 -218021 -69292 86027 -96668 -291797 -290581
17117 -290581 -160313 -156661 -50329 75193 64550 -28816 -71176 39298 -36662 -79138 23886
17106 23886 -8349 -53273 -29089 84616 197461 121847 40699 -1707 -5012 135553 254665
17095 254665 228361 60371 175418 159223 -18535 68789 85235 48058 162292 329415
17085 329415 338328 177617 -70175 22921 105114 36279 -56657 -88645 -88688 -2644 94771 12054
17073 12054 -30568 31640 -177554 -189297 39543 8205 -105636 -217402 76018 239488
17063 239488 153505 125629 133821 132759 40451 -9956 -64565 -152783 -190548 -124349 -110392 -57307
17051 -57307 54529 131315 22735 33253 117162 315003 285155 99160 168491 119018 8341
17040 8341 -53496 -78911 -61253 -56836 -120194 -116927 -129206 -159817 -134598 -154783 -124741 -56368
17028 -56368 -32550 56269 165059 82193 -33744 17056 39326 68084 -12828 -96367 -180598
17017 -180598 -78700 -115981 -106465 -149434 -181380 -143268 -76660 -30537 -38000 81275 142839
17006 142839 64510 49262 83411 61613 40010 -86525 -110942 -151796 -148612 -28708 -10057
16995 -10057 109244 161457 -101928 -285666 -256197 -342393 -286941 -175384 -276432 -331736 -409944
16984 -409944 -332822 -213720 -106314 -203217 -258443 -290065 -181943 -220317 -267622 -284880 -135908
16973 -135908 10952 88646 191973 244621 36067 -140220 -91554 -73123 -113310 -97478 -99034
16962 -99034 -147992 -116479 -54965 33706 -37896 -168849 -121644 -68910 -49487 47923 147105
16951 147105 250801 285925 170739 40137 -145353 -117582 -259829 -360594 -331119 -247729
16941 -247729 -342085 -396108 -214356 -33630 -7924 65157 -24279 -13578 12341 10950 24534
16930 24534 68612 -17361 -157466 -85833 -41352 46744 37895 -11195 62110 87647 -33736
16919 -33736 -42333 -24052 -69061 82849 230332 260454 114755 28124 21349 19377 72896 12537
16907 12537 -51919 42142 110805 159269 -34501 -115373 -53494 3528 78860 26903 -16945
16896 -16945 -19632 107388 343993 376300 148919 101669 -29811 -62137 -285714 -324042 -188656
16885 -188656 -128254 -242171 -324627 -295838 -199772 -143611 -114647 -21316 -138933 -216010 -148305
16874 -148305 -19752 14432 68681 116483 133325 229803 237848 78119 -129656 -226567 -220209
16863 -220209 -203460 -138892 17129 146036 59696 82319 73485 209019 289948 468555 433585
16852 433585 305994 186845 162125 169628 152675 117123 129419 15506 -63882 39436 28820
16841 28820 102724 34270 60157 45414 -96159 -81553 -97584 -89044 -65115 -237075 -256221
16830 -256221 -252222 -87080 -81095 -162677 -255385 -341335 -379196 -290521 -150477 -66077 -7187
16819 -7187 -21713 33879 -14646 -61614 -199919 -347548 -296058 -258045 -318430 -246352 -51506
16808 -51506 123998 284319 190601 162019 204493 147594 -17409 -213267 -306826 -216438 -50387
16797 -50387 -120680 -153287 -223326 -363437 -422546 -331078 -80243 -126460 -217911 -350195 -367909
16786 -367909 -300839 -77236 74085 94642 88956 75490 166585 220361 197086 149255 90975
16775 90975 120603 -47647 -288701 -371566 -362098 9001 30149 36144 -30069 -97143 -14855
16764 -14855 -23166 27805 -47081 -7877 -104330 -173268 -191827 -275452 -318178 -270975 -266015 -163447
16752 -163447 -189408 -182292 -33563 -19769 -187389 -307981 -418415 -233940 -108176 -64601
16742 -64601 17148 89725 246954 243900 55363 -72029 -161411 -133707 -63909 -140218 -110973
16731 -110973 -25299 -30020 33450 50946 59354 -59420 -134051 -79304 -61350 -30253 -20496 805
16719 805 -17224 -16681 -162799 -379575 -297467 -97882 11162 45335 -10313 -79835 -301 26695
16707 26695 -27715 -28425 -33358 -2288 49686 -77775 -87638 70979 113987 106374 38850 129987
16695 129987 187243 161986 254733 248705 327996 329566 304169 131648 82345 54971 93329 68876
16683 68876 -121269 -156505 -193778 -137250 5465 118918 115924 54942 -47162 -147398 -244412
16672 -244412 -110752 19372 102456 -49386 -131811 -125649 -159482 30959 279597 346331 121473
16661 121473 -97465 -104317 88668 193459 158493 7149 -105795 -77946 -87430 -235069 -193570
16650 -193570 -138803 -123169 15193 78564 -36579 67751 347091 478168 263121 186106
16640 186106 309144 263465 259343 284148 191548 -76872 -183623 -168001 -160869 -59809 -110999
16629 -110999 -127809 -34392 138946 1207 -123513 -195197 -241210 -270244 -257473 -188412 -335517
16618 -335517 -275267 -185136 -214401 -325151 -145738 -45976 -20291 47318 84051 12862 96316
16607 96316 217709 89139 -26124 23922 172110 168387 91891 -79276 -178551 90546 143100
16596 143100 22311 3939 -58683 60122 -36112 -102266 -62835 -115158 -135118 -113883 81744
16585 81744 90891 66210 34838 -77902 -106245 -32438 53077 -3846 -74347 -15085 55576 8581
16573 8581 77314 207335 219647 192923 61019 -234035 -374679 -441950 -476766 -451898 -287637
16562 -287637 17567 125940 27825 -29912 -32075 -132372 -93781 -81574 -164009 -190074 -193161
16551 -193161 -242553 -306635 -169502 -11849 69934 6660 -136711 -227164 -144294 -131555 -122060
16540 -122060 -159249 -11063 2548 -22624 66622 141742 95479 23633 1415 -187452 -380733
16529 -380733 -369269 -128770 65720 186317 203028 227550 51162 -16628 206824 119913
16519 119913 -17561 -49632 21698 117853 -18589 -59019 -130623 -185411 -127061 -72297 -2292
16508 -2292 -146431 -62891 190506 224093 102129 52606 -35738 -45136 -57666 38949 -31379
16497 -31379 -6396 44916 -86166 -257160 -103573 70362 -16777 -5818 61921 -80065 -30862
16486 -30862 -50101 -45846 -106146 -71413 -108327 -226131 -179577 24910 133082 -39097 -59872
16475 -59872 -75248 -22721 -52242 -206175 -178628 -100623 -31901 -58088 -157025 -105360 5644
16464 5644 -49769 -145507 -94291 -110324 -156857 -75506 -66474 -3467 9380 134782 90365 -118156
16452 -118156 -183368 -182337 -198653 -127925 -97055 -91405 -189867 -120864 -250155 -291781 -264061 -284005
16440 -284005 -210487 -176499 -129441 -76309 -168680 -184912 11730 210458 131141 -26991 -97129
16429 -97129 -95176 -85937 -80735 -47189 -128837 -7186 75726 97788 58382 59343 -46096 22602
16417 22602 23255 85300 166195 138462 -3951 -116899 -281869 -468999 -433360 -313214 -140900
16406 -140900 165333 140768 21519 828 60699 17661 -144338 -243244 -310506 -292583 -109217
16395 -109217 -4844 48994 16705 63088 177694 45820 -40377 158905 339702 213528
16385 213528 -93184 -198780 -279912 -230425 -6932 18585 -100477 3069 109245 204253
16375 204253 153776 112438 82478 249263 484277 444622 328404 177929 141161 26394
16365 26394 -45837 50042 138664 205422 158124 231361 254048 36674 129298 174460 94416
16354 94416 10816 -60024 59256 11414 -48012 -192493 -224816 20325 -36003 -92195 -156082
16343 -156082 -22914 106531 187673 150082 -102513 -15804 156335 92015 -38355 67597
16333 67597 202454 194381 94465 168399 171660 297301 240866 133121 109335 238629 167672
16322 167672 112563 90492 91680 54058 -6046 26053 -59283 40778 94599 -3504 -155014
16311 -155014 -123994 -37094 -128775 -272931 -203550 -95509 -20667 176846 187007 41241 -47981
16300 -47981 -158721 -232896 -198354 -28106 -86574 -96863 -561 170491 270641 163980 185815
16289 185815 124682 96410 -148480 -40562 164520 185714 -46049 -127822 -1174 30965
16279 30965 -181591 -206043 48178 151221 189758 172153 166321 126012 76572 -11333 70071
16268 70071 -74757 -121050 29089 184826 199243 100419 -11327 -42966 80505 6277 -135366
16257 -135366 -20105 12291 -97289 -138244 -110793 -77940 -44493 133344 238724 155302 -111705
16246 -111705 -266896 -189291 -137995 -58918 -72108 -102132 -31261 35799 -98961 -131348 -63500
16235 -63500 -99444 -107640 -254067 -400164 -252112 3415 114590 155934 324068 301674 282435
16224 282435 372894 505634 456558 271540 232549 138498 -22027 28587 155525 182614 133256
16213 133256 -155134 -166256 -58476 15750 90272 80951 -176755 -357482 -224937 -194414 -155743
16202 -155743 -4328 65313 62227 80536 28830 26158 -77312 -166918 -146117 -42953 -42645 -127896
16190 -127896 -152865 -35245 105828 264001 248592 136878 -6708 -151169 -236957 -178195
16180 -178195 -69482 134571 343863 245425 9218 -131835 -175238 -24203 16921 -119403
16170 -119403 -216379 -245413 -253233 -128183 27377 -104168 -320612 -294033 -55643 -70358 -61364
16159 -61364 -82800 -174301 -143385 -19528 -8055 842 122315 125678 116887 73975 -47355 -15737
16147 -15737 48725 -16613 -206277 -318873 -199103 -280760 -376443 -272647 -50920 -184859
16137 -184859 -257867 -77293 74624 73361 -115566 -136864 -35505 74698 88414 59602 -33580
16126 -33580 9682 -129887 -218126 -166497 -81459 -92112 -179917 -310331 -291971 -133142 -272170
16115 -272170 -184342 -143614 -73258 -53225 -41820 15280 -4304 -69783 -139669 -174009 -107602
16104 -107602 -125864 -135693 -104967 -105111 -54745 20832 72098 152010 199436 278246 91929 6379
16092 6379 44161 -100082 -3976 163616 104282 74808 180609 134399 62948 2618 -25322
16081 -25322 -67247 -145122 -200136 -184482 -74166 92934 -17030 -20763 25560 -149839 -5273
16070 -5273 21447 85950 133093 403299 446320 385601 318813 156265 14188 59692 95641
16059 95641 42748 69950 28414 -39850 71327 -24694 10619 54708 56766 -167402 -271260
16048 -271260 -161643 23008 -36478 -86797 17884 -165686 -405938 -203701 37042 124192
16038 124192 52005 -73101 -51943 -31076 -99178 -42122 -49229 -87795 -136508 18329 198652
16027 198652 104567 30757 76866 72084 29806 36431 140091 82066 -152152 -180854 -132837
16016 -132837 -224604 -256350 -179758 -209284 -136326 -51933 153406 93165 -104451 -26927 181961
16005 181961 148422 -10784 -119887 -113801 -73613 -47578 113439 144732 52493 71160 113343
15994 113343 160724 94653 -34798 -13147 -216031 -177781 -57953 -70522 61051 271500
15984 271500 271373 172772 181064 117529 -10386 -114420 -63074 59197 -156545 -163340 -61199
15973 -61199 -130071 -186816 -147130 -94851 -299423 -410851 -403753 -360965 -273420 -203123 -175038
15962 -175038 -328012 -317413 -436255 -413032 -153663 91397 264746 255849 137187 95484
15952 95484 41443 54059 110259 58050 95481 278093 456628 263465 23651 -105590 -183223
15941 -183223 -272953 -158106 -65564 33769 195105 260817 114512 -10384 110602 -88641
15931 -88641 -182552 -225356 -27424 76008 100682 281893 277725 135945 -54064 -219741 -31417
15920 -31417 59363 29635 -49060 -106586 -289060 -257443 -86249 15573 57638 149452 141405
15909 141405 193930 218991 112768 81792 139543 210070 196072 188344 60923 194857 186399
15898 186399 18179 -29489 155884 215938 274150 298069 149312 -76061 -162149 -148104 -85783
15887 -85783 208100 269288 125701 104073 58212 -47155 -98355 -200005 -338353 -312450 -353659
15876 -353659 -395357 -342755 -206866 -64759 -96454 -112882 -317642 -335112 -223021 -218946 -65389
15865 -65389 72263 194512 -32143 -143335 6851 21397 81183 69404 -56793 -103668
15855 -103668 -142848 -25538 68779 122966 -14229 -105189 -119491 3359 -17670 -28025 -97465
15844 -97465 -77787 59175 -59627 -122568 -144406 -3017 24703 19446 -22497 -53776 14670
15833 14670 115819 162322 148013 227031 227339 83261 -46084 -164077 -181481 -42066 -123145
15822 -123145 -28939 28745 92757 -7916 -185059 33464 90676 5437 46138 64773 65230
15811 65230 193188 276785 198917 91724 -21816 -254577 -181928 -109337 -91858 7461 -24504
15800 -24504 135274 160703 281611 136084 36413 -1143 -150202 -232285 -343571 -167680
15790 -167680 -255561 -247952 -105913 -316146 -374045 -340516 -314299 -263873 -111806 -117626 -145446
15779 -145446 -165817 -83941 -25900 64673 151008 63354 -101464 -191662 -253036 -82939 24618
15768 24618 -9031 -12235 -5420 -147074 -169679 4660 156030 12444 -26261 -138476 -361302
15757 -361302 -241356 -63736 -74065 -17796 -88855 -46865 91797 137557 79228 23973 40646
15746 40646 62897 -123202 -273037 -138665 -149786 -114784 10944 -42044 -101796 -20919 -151633
15735 -151633 -266476 -232775 -115378 17778 -99655 -140039 -17857 24584 131196 99424
15725 99424 25103 -203340 -278258 -260633 -265590 -292363 -318766 -221197 -197480 -189382 -4802 73542
15713 73542 57178 5650 -50345 -73083 -59194 -76159 -156110 -137539 -7190 -60288 -64513 -45072
15701 -45072 -59892 -319683 -263439 -146756 -156562 -243630 -459507 -334367 -353893 -212562 91809
15690 91809 82310 76560 60897 13264 118025 133635 330319 321634 78018 84813 38600 17586
15678 17586 -73320 -82462 -203917 -172725 4388 105981 33838 -89694 -170440 -187020 -114333
15667 -114333 50135 83764 133484 13016 31650 -93427 -32068 -82960 -92863 -271881 -369664
15656 -369664 -309229 -115019 -71600 -169854 -180277 -204775 -167235 -145761 160409 323704 216835
15645 216835 66671 63829 27569 -43772 63847 164453 84279 -47522 -51856 34593 -40718
15634 -40718 -91753 -113047 -69252 -180744 -269847 -167438 -13013 75675 150815 113702 91225
15623 91225 76786 3232 -88474 33969 13526 -3346 -191159 -254767 -46651 48695 139183
15612 139183 56102 -129983 -134427 -202248 -222784 -150703 -44905 78030 196887 104650 43742
15601 43742 -57220 -332835 -537006 -490431 -287428 -77461 6629 -16186 -52094 -37380 93190
15590 93190 146091 108239 -114342 -67464 143053 112330 187256 255947 283207 247860 174748
15579 174748 5365 -21328 -86447 -154683 -157135 8897 55608 9465 95690 206627 243349
15568 243349 132957 100803 201470 65707 80806 114017 176690 135237 -25422 -47284 51998
15557 51998 -119108 -89095 27370 153710 132421 -53461 -71181 21025 78240 197661 204216
15546 204216 171086 78569 -20168 -167675 -255026 -139972 -175708 -292841 -388183 -424119 -384870
15535 -384870 -266639 31676 150219 184860 116453 58310 45483 19351 61944 -40672 51877
15524 51877 146347 121422 228751 215839 13095 -43056 102000 143551 17589 -249402 -199369
15513 -199369 -60994 -27320 -60190 -123603 -188107 -159023 -153225 -76974 17920 116255 62614
15502 62614 89219 -44947 6252 46616 159132 116254 22593 54634 -54127 -169112 65295
15491 65295 117264 96966 86442 60695 -132346 -137520 -152637 -59149 -9459 -79906 -87200 -140547
15479 -140547 -216018 -220837 -123273 -48662 -81143 14018 214290 261729 71904 -102286 -167124
15468 -167124 -211424 -171813 -93623 -25088 -18047 -229998 -307590 -373066 -422268 -282301 -17332
15457 -17332 116847 187993 213801 52988 -49022 -1140 231659 330572 243619 60230 8317
15446 8317 23695 119848 22676 25665 -20990 46980 -26856 -250316 -142751 -19284 -196192
15435 -196192 -270738 -99666 -25116 194365 280394 131641 52998 60119 -68889 -96463 -63777
15424 -63777 -37641 -38743 -57039 -138477 -49308 202765 299382 158446 144910 262118 164082
15413 164082 133139 241536 254172 64738 61741 -31492 71473 231556 232639 124786 4327
15402 4327 -70695 -87476 32844 48142 73974 25575 126372 109802 67478 219252 273117
15391 273117 293679 261840 124278 -5337 -54673 -6377 -74862 -167657 -186744 -88527 -106147
15380 -106147 -111126 -258418 -203667 -247949 -284822 -364355 -391203 -440991 -448130 -214551 21694
15369 21694 -86253 -69226 -87700 -149700 -191297 -146155 -51388 -1655 -88177 79640 59896
15358 59896 11726 -106031 -83338 -68086 56255 47409 60278 212494 188196 198390 74303
15347 74303 138241 75224 114255 77696 55011 -119640 -213795 -412452 -345328 -118509 -70750
15336 -70750 -94417 104412 114603 -11535 -19535 104636 124374 32 -5306 -133682 -126452
15325 -126452 41053 140831 44443 17002 55205 84462 52115 -67037 -1085 -20929 -56637
15314 -56637 -60879 -208448 -194302 -163766 -126721 -48864 27628 -40768 33508 181201 226801
15303 226801 135608 17412 -18690 -71583 -104533 -131058 -14379 -20576 1583 -59732 -128399
15292 -128399 -149690 -220673 -212952 -166212 -283937 -194410 -125937 -52299 -86880 -19663 -133096
15281 -133096 -163129 -216454 -198049 -229930 -357072 -378765 -290934 -174399 -122071 -124993 14875
15270 14875 -173752 -269391 -365582 -346522 -328249 -345290 -297648 -320790 -363867 -383477 -293811
15259 -293811 -286761 -91158 -122872 -66556 130741 14119 7785 -4427 59506 -79912 -229906
15248 -229906 -126168 -25692 88467 160377 -109130 -439544 -292560 -127397 -171561 -53871
15238 -53871 180638 247921 269457 310955 259745 124340 235436 170564 129761 1772 -208604
15227 -208604 -220972 -90710 -129061 -346084 -405208 -210957 -19304 46692 -113349 -213341
15217 -213341 -199140 -207088 -256941 -396365 -312244 -205377 -129735 -92190 -48068 -82779 -86507
15206 -86507 -147813 -94175 -64148 -17858 29742 -100932 -92302 21120 49354 -20030 80578
15195 80578 160869 182816 245010 286737 184595 52218 56285 113173 71594 -117169 -234210
15184 -234210 -278576 -282437 -213680 -334954 -252599 -151176 -71427 379 122452 78085 190926
15173 190926 242351 61798 132263 167424 188076 310280 248560 37964 -45660 -38681 40185
15162 40185 -8984 -74283 35063 126683 11264 35260 128724 -35949 -142674 -229724 -97617
15151 -97617 18114 39003 -14183 -190227 -244087 -149467 -214627 -5954 21721 44333 -15197
15140 -15197 -38709 -21833 -33180 114906 241856 164161 86066 13608 -55461 76765 138225
15129 138225 150411 -44907 -70553 147072 128713 249471 310842 219450 122374 237224 257360
15118 257360 121459 -16828 -55843 -44292 -6883 -56560 -51259 20253 128047 220727 -9847
15107 -9847 -223470 -395493 -625213 -585824 -468288 -494903 -509147 -376605 -292201 -136007 -116584
15096 -116584 -147995 -202216 -117023 -175051 -283940 -306456 -202397 -176300 -135913 22536 87534
15085 87534 108457 46408 -133676 -176103 -158093 -127737 -89620 -187719 -162414 -247824 -208390
15074 -208390 -32009 74095 -25307 31704 99338 85570 106734 -77000 -294839 -237519 2565
15063 2565 -125568 -105572 -50932 31972 172157 175703 13284 117189 202915 47316 -14517
15052 -14517 103726 102021 69891 -39947 -63039 61257 15095 102934 97203 93006 41528 124049
15040 124049 157253 75383 -115795 -97712 82823 266838 340856 414197 277241 33630
15030 33630 -38748 -59989 -11671 -17726 -91699 -134036 -183425 -235491 -220520 -141993 -33277 -59970
15018 -59970 -107518 -138150 -119712 23396 -99618 -61780 70699 128613 42944 -6798 -54515
15007 -54515 -193421 -78104 104298 56160 -7842 -137116 -39906 -69575 -111856 -54646 -226205
14996 -226205 -269130 -194604 -47550 100459 139258 222180 334562 310102 277286 119779 98971
14985 98971 40947 -23722 -108673 -145447 -122442 16784 161325 90589 10189 82775 82306 254942
14973 254942 234489 140050 305783 380657 234884 56438 -267546 -326988 -155845 -63977
14963 -63977 34409 -133012 -440877 -559648 -366794 -172268 -77552 -285734 -355985 -181524
14953 -181524 -103762 4485 108980 37019 -34575 -99672 -132739 -117151 -132936 -153465 -220960
14942 -220960 -202010 -283377 -222031 -187857 -116915 -142453 12457 -98002 -322269 -317184 -239371
14931 -239371 -162163 -86102 -138075 -252267 -252860 -259987 -109118 -17641 96375 183018 -85381
14920 -85381 -269448 -227371 -179379 -283985 -317680 -335903 -302557 -215039 -314077 -154137 4799
14909 4799 49134 -90833 -12581 45135 34086 114419 119079 2306 11156 -175835 -378888
14898 -378888 -322140 -180061 -191475 -214078 -85509 -1293 22027 -12511 -69140 68843 -19185
14887 -19185 -118164 -134393 -165207 -138295 -7579 77323 -23466 -18166 -65574 -244608 -151856
14876 -151856 146529 106976 -112877 -169157 -94356 -74605 59079 104678 38727 -123193 -45846
14865 -45846 -16145 -16285 17591 105379 -141321 -227786 -107668 -2912 37138 27393 44512 87813
14853 87813 29686 -13437 70038 208231 220620 135467 139022 61256 -75713 -58754 -139189
14842 -139189 -123649 -42651 -43963 -35483 65688 84526 150102 4570 40681 -87983 -123626
14831 -123626 -131849 -138797 -176533 -223890 -155027 62905 11956 -108961 -206777 -79894 -80350 -112692
14819 -112692 22414 20427 -18660 41147 -34063 -201852 -201189 -115863 -74824 -100815 -144235 -116557
14807 -116557 -14892 92037 173001 228640 146921 89265 21561 163650 168076 31602 -37659
14796 -37659 -76145 -80195 -50933 6417 223805 213662 106946 49467 -18243 -103279 -84901
14785 -84901 -120726 -91974 -88166 -114378 16226 218478 263925 68365 77188 99705 217140
14774 217140 286749 72994 -75106 -241014 -283140 -296791 -229584 -134134 -150015 -54406 38531
14763 38531 182612 148868 34516 -11914 -90507 -195906 -65148 51163 16802 -65080 -47628
14752 -47628 -4177 22078 -17761 96289 130373 22033 -73202 -86880 -92086 -22633 157489
14741 157489 308844 406767 372494 176785 45086 -71725 -217798 -117708 -95121 31005
14731 31005 151547 133573 66665 -98787 -216363 -159477 -171905 -113995 15840 110683 67451
14720 67451 6870 72162 25098 37135 -84721 -39312 -60062 -80475 -25137 -14827 -83904
14709 -83904 22191 196654 147444 135473 209697 94687 -101696 -235573 -283806 -201150 -78616
14698 -78616 -12905 -28213 -7201 27765 143599 176731 190694 97482 14818 111709 137273
14687 137273 82824 -50454 -90946 239449 356446 294615 220153 257998 179577 112213 -74374
14676 -74374 -57403 102350 319895 310583 90609 -5203 -135579 -182726 -7867 163043 18471
14665 18471 55470 187838 107153 91241 -22086 -137800 -182336 -250156 -107301 -80321 -178036
14654 -178036 -153698 -217022 -144899 77586 133425 23585 42350 91615 105742 52412 103451
14643 103451 84882 26811 23227 168813 177762 126526 18250 -36935 44574 18600 -61396
14632 -61396 -132565 -100589 -39905 -107463 -181127 -43703 -56285 -93655 -128314 -110136 -88713
14621 -88713 -122291 -42696 93610 130657 42453 116516 92675 -95724 88998 193342 176072
14610 176072 240614 124603 21946 54461 280141 117585 -250294 -392135 -256000 -104266
14600 -104266 51937 44851 67891 196602 59500 18788 -66760 -162669 -196943 -168724 -228383
14589 -228383 -140038 105764 227152 185551 -30830 -153988 -60029 110200 20049 -150348
14579 -150348 47567 66222 29587 -21542 -10607 36041 160768 196721 55309 74268 -77781
14568 -77781 -94005 -59773 45144 60784 94257 -1535 65632 163842 136451 298169 285957
14557 285957 190883 -34660 -95094 -90092 -132866 -238576 -111535 -43538 -65183 -108473 -163759
14546 -163759 -156559 -52776 -23308 33123 -21163 -134834 -6678 -130100 -209421 -158348 -117633
14535 -117633 -60799 51341 146791 118428 -84385 -77668 9011 181365 294112 199043 204779
14524 204779 193520 58804 -144391 -117351 -142375 -102061 -108405 -135310 -90327 44488 -23649
14513 -23649 -141598 -96777 94948 203104 55379 13434 -8565 59932 84258 13184 -32308
14502 -32308 96837 262106 283196 202479 165420 51713 -3359 24291 29670 -135819 -112177
14491 -112177 13884 3275 52889 -19774 -211413 -817 51777 -52817 -22928 -268 178097
14480 178097 267970 188256 138414 106706 229202 310932 244529 114569 -52522 -53378 -105860
14469 -105860 -87230 -118309 -177214 -226557 -293396 -200033 43170 -28294 -177605 -250369 -246383
14458 -246383 -65391 -13363 176537 -2836 -46074 -39413 -127216 -194241 -21340 28146 -83874
14447 -83874 -81616 14737 -2960 -28052 -138870 -101194 -113880 16265 -39848 28063 50302
14436 50302 -54051 -131670 -130639 114181 53970 -37737 32933 91519 148522 130142 -55530
14425 -55530 -109205 -198711 -112736 -91204 3296 -79929 -106490 -14275 127915 368888 295241
14414 295241 153514 39167 59481 -32688 -50713 -9449 -113402 -189242 -185321 -115225 -77140
14403 -77140 -151931 -100836 159594 264616 430230 348433 387763 312792 115510 -135542 -295415
14392 -295415 -177357 -58341 -124686 -85818 -67033 -6392 5721 -93598 63157 108896 164329
14381 164329 27458 -60752 1541 27235 103656 328127 157181 14202 16554 -90494 55987
14370 55987 113096 66338 -51881 -102252 -34158 110916 -39441 -103040 -181512 -152936 -276029
14359 -276029 -429144 -373224 -121544 59921 153080 131751 129085 144414 29552 -112452 -45636
14348 -45636 -59250 -114343 -76035 -58355 -29640 -16002 71470 194318 43630 -44515 -221148
14337 -221148 -138817 -127283 -280010 -353926 -212613 -165685 -98812 -28592 159556 312157 54042
14326 54042 -79620 -239892 -151089 33319 -15545 -84084 -155589 -127713 -310051 -302544 -222867
14315 -222867 -108825 -179478 -232272 -138671 -266196 -279041 -185802 -177715 -337616 -278547 -194304
14304 -194304 -53263 141117 256804 169986 112190 125792 82535 13694 -27407 -78091 -130605
14293 -130605 -83447 -88327 -228786 -154275 -13818 -738 58066 99024 44116 20373 88708
14282 88708 193429 53682 37470 -99591 10257 87522 91320 285790 228231 -3273 -225064
14271 -225064 -70416 55150 108563 -18102 -79743 -10527 24584 102338 -29564 -151844
14261 -151844 -234983 -284390 -173762 41287 65536 37941 -52361 -50651 -12055 100126 202285
14250 202285 107397 -110526 -49701 42441 84133 89080 213839 195958 158868 87436 90542
14239 90542 99051 -57538 -55914 -62832 -3954 -46787 -115298 -212330 -203918 -124555 -98437 -148424
14227 -148424 -274634 -222015 -172644 -151858 -87170 -172529 -299246 -331214 -253146 -181418 -250128
14216 -250128 -211890 -188196 -93938 -160481 -217422 -95215 29092 4209 227868 148686 -78653
14205 -78653 -266045 -284158 -189041 -172717 -264140 -145185 46315 152902 -10239 -282816
14195 -282816 -461665 -593294 -462083 -162311 -213143 -131878 -193511 -195509 -228790 -175338 -200011
14184 -200011 -162261 -112512 38428 167617 70752 107670 86878 -53657 -17658 118736 65602
14173 65602 -34370 -227048 -214709 -142102 102342 46512 -101258 16830 58774 -116357 -112645
14162 -112645 -211951 -340085 -14342 19407 -18155 -5334 -14454 -20149 -114859 -139494 -83196
14151 -83196 -18444 -72431 -149714 -161117 -53713 -9309 -103021 -12228 59925 104697 137634
14140 137634 211790 310034 210317 86342 -118192 -57237 -85884 -221672 -144310 -60062 47436
14129 47436 -115037 -182778 -274271 -269554 -210684 -42091 86489 -16870 34684 -39393 -50334
14118 -50334 71509 110450 82586 146185 22853 -107407 -175341 -218457 -310322 -249374 -188269
14107 -188269 -122660 -97529 -177609 -303472 -171066 -191946 -162365 -96435 -43588 -88552 -140677
14096 -140677 -93082 -303694 -332088 -123118 -16898 -97122 -80626 -222234 -288428 -186358
14086 -186358 56781 46171 139810 187186 125479 -68459 -201209 -186437 -297750 -278670 -82560
14075 -82560 12338 187752 163984 118942 168044 82859 -15712 -233342 -288883 -141475 146286
14064 146286 361160 433511 353858 69785 -25528 -74619 -71866 53050 121749 309318 443267
14053 443267 370694 126372 56915 11912 -87757 -307602 -342434 -297054 -97973 -23003 -28805
14042 -28805 -32160 28878 -50045 -28435 -58785 -17333 51804 130752 180793 86605 104367 118918
14030 118918 106013 58488 20828 42787 92101 255805 298587 363448 475410 404259 217015
14019 217015 53147 66700 159157 93101 16242 -29388 35977 -13458 114265 83199 21023
14008 21023 -82458 -30301 -24404 -119255 -248508 -255623 -24873 206292 132413 42422 31611
13997 31611 206626 169839 101957 -115387 31740 -21417 78792 213708 305501 214838 61945
13986 61945 89560 143940 -58088 -170520 -143281 -70215 -16470 90701 165930 258050 273007
13975 273007 236884 82135 -46130 -113251 -123429 -175874 -11866 184123 109784 83399 183769
13964 183769 222032 261721 217869 65025 96020 175616 51922 -132016 -65176 133412 94486
13953 94486 101500 111505 171342 172722 27385 -58493 -1009 -40244 -19586 195121 228927 134055
13941 134055 -90351 -129608 -244242 -494262 -580456 -444154 -424653 -449260 -381584 -405678 -351998
13930 -351998 -477895 -280484 -264788 -267792 -400931 -329305 -174353 40745 -34954 -87481 -50193
13919 -50193 -164224 -288319 -170037 3398 1145 1008 124990 134284 10171 -3634 -155409
13908 -155409 -86250 64464 109585 175136 17672 22305 -75238 -87087 39920 2735 -5724
13897 -5724 -144396 -116705 -23074 -46414 -153630 -108218 -137910 -62471 -38720 -12216 -49396
13886 -49396 -125295 -84330 -79105 -2113 72543 153078 -6051 -162015 -236945 -237751 -38195 66756
13874 66756 119623 55799 -115174 -70527 13478 13640 -71309 -165518 -160096 -140898 -119709 -8503
13862 -8503 -4743 57295 112576 148783 153480 12385 -16111 -32213 -183846 -267931 -244904 -101170
13850 -101170 -136938 -22804 -156515 -215886 -152049 -86693 -143606 -18300 -125888 139450
13840 139450 177221 56419 25480 -124034 -186256 -93559 -54195 -80616 -304807 -437534 -261015
13829 -261015 -131734 -201044 -158367 -153718 -111151 -37594 -10321 -71924 10550 48733 173465
13818 173465 289056 74194 103644 246147 109334 -53464 -151542 -111269 6063 -41730
13808 -41730 76685 201013 37740 85660 -64889 -161417 -70203 127194 36384 26571 192207
13797 192207 159992 132566 175095 119150 -134616 -367615 -250046 -118956 -71962 -4435 35154
13786 35154 -28681 -69143 -42141 103908 106937 -1833 -65349 29863 -21957 -214230 -248611
13775 -248611 -189628 -183862 -33402 -33567 31974 28456 59199 33896 -38817 -98038 -32492 99887
13763 99887 111281 22611 -8119 -53317 80990 165484 144566 42539 5857 -60581 -286365
13752 -286365 -57017 21755 -11507 124697 81306 -123360 -161028 -66743 108876 226313
13742 226313 138446 7403 53945 16886 -75704 -38892 75355 225558 157122 184609 230965
13731 230965 317193 224713 143714 179966 198458 259356 240186 190011 1002 -214572 -336460
13720 -336460 -281290 -203560 -176965 -103813 -223430 -311450 -268928 -135736 -56120 42303 -45661
13709 -45661 -110741 -197944 -351358 -469230 -544382 -415340 -247420 -200697 29554 123034 -17663
13698 -17663 -20593 -69213 -23520 -17690 -204999 -246359 -311668 -302831 -255594 -177810 -108925 -21302
13686 -21302 94560 -5149 -98376 -61479 -167155 -89111 38145 77994 138871 132200 -67934
13675 -67934 -173584 -105088 -36984 -65740 -54808 101242 43188 -162405 -123629 99626 181606
13664 181606 251190 397168 460804 157713 -2467 -21449 2672 148855 265564 200472
13654 200472 16893 -139667 -195429 -131417 -94833 -164119 -94898 13100 -9498 -35444 -230034
13643 -230034 -247236 -164652 -268852 -265832 -338857 -271182 -70166 21709 -136941 -240326 -118678
13632 -118678 -116554 -143866 -69062 -94717 -123347 -175286 -124038 -174542 -143701 -191955 -117892 -41630
13620 -41630 -108425 -102533 54400 88526 32752 39009 168423 87257 -104945 -215709 -248064
13609 -248064 -160448 -45392 66014 167216 -19198 32946 101835 -88929 -72772 43379
13599 43379 -39541 57877 208615 -34984 -94034 -70767 -65543 66909 -33941 -87151 -268907
13588 -268907 -353339 -148126 110958 205182 232275 127257 77801 76186 89082 162646 52625
13577 52625 -38173 -143232 -315968 -239324 -3903 127223 110653 195589 241568 406382 237637
13566 237637 -22336 -206307 -218725 -255043 -251904 -267137 -243521 -256150 -78645 7196 69067
13555 69067 164662 154755 -27123 88157 114675 114206 44650 27730 26105 127384 152095 257784
13543 257784 238454 80103 -98439 -67417 -26617 -82888 -102651 -68211 57833 44899 -10424
13532 -10424 -21227 65401 257531 177000 73848 117824 -39325 -123622 -84788 59030 153781
13521 153781 166064 213044 224365 57800 -132289 -153416 -172891 -130753 108677 314197 151585
13510 151585 -27033 -23479 -66779 -242010 -104103 145048 177316 56010 14374 42167 8152
13499 8152 -82813 -188108 -239615 -179879 -50119 -55491 -186026 -197309 -146568 -153993 -117954 -113726
13487 -113726 -168318 -163015 -296448 -372850 -234635 6054 57636 27368 237536 248099 -29396
13476 -29396 -98441 93270 255828 268376 343834 114747 -169193 -157620 -97055 49783 44930
13465 44930 88072 67052 81617 -18210 -218462 -86178 11400 27393 44523 4781 -71439
13454 -71439 -60457 33465 -82989 -27181 -30167 -14942 66733 -27703 72489 168046 212376
13443 212376 231639 234912 145619 -43514 -109976 60886 132358 16828 -429 25128 -44096
13432 -44096 -59426 -90261 87299 147370 180978 216093 327240 232035 348281 213910 13481
13421 13481 62385 209343 355516 393394 402439 303308 4322 -161913 -91376 -10832 -6419
13410 -6419 -253620 -297112 -222275 -79239 71475 141927 134354 48047 -61719 -194104 -170375
13399 -170375 -44361 6528 -9687 63451 21315 -40939 -66263 -30271 3586 244952 215018
13388 215018 -5801 -109937 -39886 27077 -115935 -108319 -230281 -97320 -53998 -8883 207237
13377 207237 216596 265866 366239 293585 45257 -196350 -260380 -359910 -244665 -241889 -70987
13366 -70987 -142445 -272707 -113369 -141275 73920 276133 341568 237329 201496 196672 95102
13355 95102 -43837 -149742 -171319 -20667 85245 -23922 -101554 -47293 -45968 107527 37343
13344 37343 124673 172245 135249 254736 229245 233178 106312 -67792 -229120 -186444 -146782
13333 -146782 -167064 -154928 -54287 111053 71973 26096 196299 196860 173802 237236 85169
13322 85169 3225 -36518 67232 58693 -81704 17393 -136730 -101648 126761 116414 43439
$$ [...]
##END NTUPLES=NMR SPECTRUM
##END=
