##TITLE=Analysis number 312224
Compound Code cc 33509
Book Reference 378/147/9
Project Code adrs
Chemist Name benw
##JCAMPDX= 6.0         $$ Bruker NMR JCAMP-DX V2.0
##DATA TYPE= NMR SPECTRUM
##DATA CLASS= NTUPLES
##ORIGIN= Bruker BioSpin GmbH
##OWNER= NMR
$$ XWIN-NMR		Version 3.5
$$ Fri Jul 29 08:43:53 2005 GMT Daylight Time (UT+1h)  MAYBRIDGE\NMR@NMR_250MHZ
##.OBSERVE FREQUENCY= 250.131544655141
##.OBSERVE NUCLEUS= ^1H
##.ACQUISITION MODE= SIMULTANEOUS (DQD)
##.ACQUISITION SCHEME= undefined
##.AVERAGES= 16
##.DIGITISER RES= 18
##SPECTROMETER/DATA SYSTEM= dpx250
##.PULSE SEQUENCE= zg30
##.SOLVENT NAME= CDCl3
##.SHIFT REFERENCE= (INTERNAL, CDCl3, 0, 16.4483)
##AUDIT TRAIL= $$ (NUMBER, WHEN, WHO, WHERE, WHAT)
$$ ##TITLE= Audit trail, XWIN-NMR		Version 3.5
$$ ##JCAMPDX= 5.01
$$ ##ORIGIN= Bruker BioSpin GmbH
$$ ##OWNER= NMR
$$ C:\u/data/dgb/nmr/ADRS/6820/pdata/1/auditp.txt
$$ ##AUDIT TRAIL=  $$ (NUMBER, WHEN, WHO, WHERE, WHAT)
(   1,<2005-07-29 08:43:14.95 +100>,<MAYBRIDGE\NMR>,<NMR_250MHZ>,
      <created by zg, POWCHK disabled, PULCHK disabled
       configuration hash MD5:
       62 19 C7 07 E1 42 D1 B7 37 6C 3D D0 77 39 F9 E6
       data hash MD5: 64K
       04 A6 EA 78 E6 7F 67 C3 24 35 5D 88 3D BB DF C4>)
(   2,<2005-07-29 08:43:33.20 +100>,<MAYBRIDGE\NMR>,<NMR_250MHZ>,
      <Start of raw data processing
       ef LB = 0.3 FT_mod = 6 PKNL = 1 SI = 32K 
       data hash MD5: 32K
       EA 59 C7 11 68 11 03 0E FC 2A 12 58 03 81 0B 89>)
(   3,<2005-07-29 08:43:37.40 +100>,<MAYBRIDGE\NMR>,<NMR_250MHZ>,
      <apk 
       data hash MD5: 32K
       4D 96 42 84 60 F5 DA 3C 1D 33 32 B4 62 9F 3A 53>)
(   4,<2005-07-29 08:43:38.76 +100>,<MAYBRIDGE\NMR>,<NMR_250MHZ>,
      <abs ABSG = 5 
       data hash MD5: 32K
       5A 8E EE 66 7E 38 8E 09 9F FC 85 DB AA D6 D2 67>)
$$ ##END=
$$ 
$$ hash MD5
$$ 7F 5B 47 20 E5 03 3E 1C 7A EE 0C 57 FB 06 8F FB
##$RELAX= 
##$RELAX= 
##$RELAX= 
##$RELAX= 
##$RELAX= 
##$RELAX= 
##$RELAX= 
$$ Bruker specific parameters
$$ --------------------------
##$DU= <C:\u>
##$EXPNO= 6820
##$NAME= <ADRS>
##$PROCNO= 1
##$TYPE= <nmr>
##$USER= <dgb>
##$AMP= (0..31)
100 100 100 100 100 100 100 100 100 100 100 100 100 100 100 100 100 100 
100 100 100 100 100 100 100 100 100 100 100 100 100 100 
##$AQSEQ= 0
##$AQ_mod= 3
##$AUNM= <au_zg>
##$AUTOPOS= <1 >
##$BF1= 250.13
##$BF2= 250.13
##$BF3= 250.13
##$BF4= 250.13
##$BF5= 500.13
##$BF6= 500.13
##$BF7= 500.13
##$BF8= 500.13
##$BYTORDA= 1
##$CFDGTYP= 0
##$CFRGTYP= 5
##$CHEMSTR= <none>
##$CNST= (0..31)
1 1 145 1 1 1 1 1 1 1 1 1 1 1 1 1 1 1 1 1 1 1 1 1 1 1 1 1 1 1 1 1 
##$CPDPRG= <>
##$CPDPRG1= <>
##$CPDPRG2= <>
##$CPDPRG3= <>
##$CPDPRG4= <mlev>
##$CPDPRG5= <mlev>
##$CPDPRG6= <mlev>
##$CPDPRG7= <mlev>
##$CPDPRG8= <mlev>
##$CPDPRGB= <>
##$CPDPRGT= <>
##$D= (0..31)
0 1 0 0 0 0 0 0 0 0.06 0 0 0 0 0 0 0.0002 0 0 0 0 0 0 0 0 0 0 0 0 0 0 
0 
##$DATE= 1122622993
##$DBL= (0..7)
120 120 120 120 120 120 120 120 
##$DBP= (0..7)
150 150 150 150 150 150 150 150 
##$DBP07= 0
##$DBPNAM0= <>
##$DBPNAM1= <>
$$ [...]
##$SUBNAM7= <"">
##$SUBNAM8= <"">
##$SUBNAM9= <"">
##$SW= 20.6930455092707
##$SWIBOX= (0..15)
0 0 3 0 0 0 0 0 0 0 0 0 0 0 0 0 
##$SW_h= 5175.983436853
##$TD= 65536
##$TD0= 1
##$TE= 295.16
##$TE2= 300
##$TE3= 300
##$TEG= 300
##$TL= (0..7)
0 120 120 120 120 120 120 120 
##$TP= (0..7)
150 150 150 150 150 150 150 150 
##$TP07= 0
##$TPNAME0= <>
##$TPNAME1= <>
##$TPNAME2= <>
##$TPNAME3= <>
##$TPNAME4= <>
##$TPNAME5= <>
##$TPNAME6= <>
##$TPNAME7= <>
##$TPOAL= (0..7)
0.5 0.5 0.5 0.5 0.5 0.5 0.5 0.5 
##$TPOFFS= (0..7)
0 0 0 0 0 0 0 0 
##$TUNHIN= 0
##$TUNHOUT= 0
##$TUNXOUT= 0
##$USERA1= <user>
##$USERA2= <user>
##$USERA3= <user>
##$USERA4= <user>
##$USERA5= <user>
##$V9= 5
##$VALIST= <valist>
##$VCLIST= <CCCCCCCCCCCCCCC>
##$VD= 0
##$VDLIST= <DDDDDDDDDDDDDDD>
##$VPLIST= <PPPPPPPPPPPPPPP>
##$VTLIST= <TTTTTTTTTTTTTTT>
##$WBST= 1024
##$WBSW= 4
##$XGAIN= (0..3)
0 0 0 0 
##$XL= 0
##$YL= 0
##$YMAX_a= 213591
##$YMIN_a= -214273
##$ZGOPTNS= <>
##$ZL1= 120
##$ZL2= 120
##$ZL3= 120
##$ZL4= 120
##$ABSF1= 16.44827
##$ABSF2= -4.244902
##$ABSG= 5
##$ABSL= 3
##$ALPHA= 0
##$AQORDER= 0
##$ASSFAC= 0
##$ASSFACI= 0
##$ASSFACX= 0
##$ASSWID= 0
##$AUNMP= <proc_1d>
##$AZFE= 0.1
##$AZFW= 0.1
##$BCFW= 0
##$BC_mod= 0
##$BYTORDP= 0
##$COROFFS= 0
##$CY= 12.5
##$DATMOD= 1
##$DC= 0
##$DFILT= <>
##$DTYPP= 0
##$F1P= 14.0000005364418
##$F2P= -0.99999901652339
##$FCOR= 0.5
##$FTSIZE= 32768
##$FT_mod= 6
##$GAMMA= 0
##$GB= 0
##$INTBC= 1
##$INTSCL= 1
##$ISEN= 128
##$LB= 0.3
##$LEV0= 0
##$LPBIN= 0
##$MAXI= 10000
##$MC2= 0
##$MEAN= 0
##$ME_mod= 0
##$MI= 0
##$NCOEF= 0
##$NC_proc= -5
##$NLEV= 6
##$NOISF1= 0
##$NOISF2= 0
##$NSP= 0
##$NTH_PI= 0
##$NZP= 0
##$OFFSET= 16.44827
##$PC= 1
##$PHC0= -77.61891
##$PHC1= 12.81019
##$PH_mod= 1
##$PKNL= yes
##$PPARMOD= 0
##$PSCAL= 4
##$PSIGN= 0
##$REVERSE= no
##$SF= 250.130018441385
##$SI= 32768
##$SIGF1= 0
##$SIGF2= 0
##$SINO= 400
##$SIOLD= 32768
##$SREGLST= <1H.CDCl3>
##$SSB= 0
##$STSI= 32768
##$STSR= 0
##$SW_p= 5175.98343685301
##$SYMM= 0
##$S_DEV= 0
##$TDeff= 65536
##$TDoff= 0
##$TI= <Analysis number 999999
Compound Code 99
Book Reference 9
Project Code 9>
##$TILT= no
##$TM1= 0
##$TM2= 0
##$TOPLEV= 0
##$USERP1= <user>
##$USERP2= <user>
##$USERP3= <user>
##$USERP4= <user>
##$USERP5= <user>
##$WDW= 1
##$XDIM= 32768
##$YMAX_p= 475071770
##$YMIN_p= -936259
$$ End of Bruker specific parameters
$$ ---------------------------------
##NTUPLES= NMR SPECTRUM
##VAR_NAME=  FREQUENCY,     SPECTRUM/REAL,   SPECTRUM/IMAG
##SYMBOL=    X,             R,               I
##VAR_TYPE=  INDEPENDENT,   DEPENDENT,       DEPENDENT
##VAR_FORM=  AFFN,          ASDF,            ASDF
##VAR_DIM=   32768,         32768,           32768
##UNITS=     HZ,            ARBITRARY UNITS, ARBITRARY UNITS
##FACTOR=    0.157963299565203, 1,           1
##FIRST=     4114.20627796497, 0,            0
##LAST=      -1061.77715888804, 0,           0
##MIN=       -1061.77715888804, -936259,     0
##MAX=       4114.20627796497, 475071770,    0
$$ Real data points
##PAGE= N=1
##DATA TABLE= (X++(R..R)), XYDATA
$$ [...]
$$ plain form
19335 18833076 21465585 25262259 30722818 39165922 52338331 73616197 106374965 144356303
19327 144356303 171043098 181530620 187960144 189811110 173684117 143210665 116066381
19320 116066381 101245292 97817802 106476891 129686161 161931854 185437411 192189358
19313 192189358 193158602 189930234 169843450 134232060 99785355 74849840 57193489
19306 57193489 44770859 36008961 29669574 24603862 20869113 18169971 16111305 14471672
19298 14471672 13196803 11857563 10498780 9538696 8676982 7872458 7404601 6850667 6455786
19289 6455786 6086592 5842598 5617363 5126345 4655750 4187779 3855615 3447875 3308526
19280 3308526 3320445 2963193 2693551 2617400 2212809 2241422 2387387 2308526 1983902 1822870
$$ packed form
19335A8833076K632509L796674N460559Q443104J3172409K1277866L2758768L7981338
19327A44356303K6686795J0487522O429524J850966j6126993l0473452k7144284
19320A16066381j4821089l427490Q659089K3209270L2245693K3505557O751947
19313A92189358R69244l228368k0086784l5611390l4446705k4935515j7656351
19306E7193489j2422630q761898o339387n065712l734749k699142k058666j639633
19298A4471672j274869j339240j358783r60084q61714q04524m67857n53934l94881
19289F455786l69194k43994k25235m91018m70595m67971l32164m07740j39349
19280C308526J1919l57252k69642p6151m04591K8613J45965p8861l24624j61032
$$ plain form
19270 1822870 1617740 1604542 1515971 1497625 1355332 1106958 1001382 819326 850710 1039361
19260 1039361 1372047 1554759 1183461 1053782 940052 867883 886240 599842 515039 702873
19250 702873 703469 578885 655810 861424 687611 342807 376918 228009 160373 123134 240701
19239 240701 398026 469997 548774 679952 909601 1054455 1395689 1679677 1774338 1511148
19229 1511148 1315383 1147269 913413 679285 640275 768312 962155 1011917 990261 1157513
19219 1157513 1163150 1299827 1164298 908925 979089 857129 584409 671396 691075 381230
19209 381230 202685 257247 252756 438271 95780 79060 306091 491462 452182 282972
19199 282972 134536 158636 308107 646590 801686 742691 610361 502093 553490 658412
$$ packed form
19270A822870k05130j3198q8571j8346j42293k48374j05576j82056L1384J88651
19260A039361L32686J82712l71298j29679j13730p2169J8357k86398q4803J87834
19250G02873N96j24584P6925K05614j73813l44804L4111j48909o7636l7239J17567
19239B40701J57325P1971P8777J31178K29649J44854L41234K83988R4661k63190
19229A511148j95765j68114k33856k34128l9010J28037J93843M9762k1656J67252
19219A157513N637J36677j35529k55373P0164j21960k72720Q6987J9679l09845
19209C81230j78545N4562m491J85515l42491j6720K27031J85371l9280j69210
19199B82972j48436K4100J49471L38483J55096n8995j32330j08268N1397J04922
$$ plain form
19189 658412 550055 391047 482731 499277 496562 183156 163236 111660 361949 665832 773502
19178 773502 574495 409350 506735 453426 335657 507564 667128 796488 700575 293113
19168 293113 338104 340419 321197 467190 401968 461840 498058 437720 645158 741225 419711
19157 419711 356206 312195 278320 324654 325263 389168 367363 452179 363548 -7688 139911
19146 139911 389865 433760 549912 483951 500570 503662 460401 528611 465564 440487 204821
19135 204821 37087 -14383 -18098 167692 113388 53934 113712 193324 297881 314096 318905
19124 318905 477734 497467 426885 457862 617255 554575 524214 449101 388158 462105 442380
19113 442380 95477 63109 287459 285060 280338 485250 515167 376453 319964 472811 432603
$$ packed form
19189F58412j08357j59008R1684J6546k715l13406j9920n1576K50289L03883J07670
19178G73502j99007j65145R7385n3309j17769J71907J59564J29360r5913m07462
19168B93113M4991K315j9222J45993o5222N9872L6218o0338K07438R6067l21514
19157D19711o3505m4011l3875M6334O09O3905k1805Q4816q8631l71236J47599
19146A39911K49954M3895J16152o5961J6619L092m3261O8210o3047k5077k35666
19135B04821j67734n1470l715J85790n4304n9454N9778P9612J04557J6215M809
19124C18905J58829J9733p0582L0977J59393o2680l0361p5113o0943P3947j9725
19113D42380l46903l2368K24350k399m722K04912K9917j38714n6489J52847m0208
$$ plain form
19102 432603 525028 546749 479901 422383 362003 442446 469813 290502 344324 431120 719247
19091 719247 690828 642993 418351 325815 391072 462695 417393 386021 486221 440012 280765
19080 280765 351050 498978 726712 716332 729712 812379 877408 777459 727213 700425 828873
19069 828873 894793 1008331 1041980 996601 1006383 965941 1012711 1007354 1182280 1210250 1401223
19058 1401223 1403277 1308404 1156989 1050006 861969 742777 891078 1091835 1300164 1196877
19048 1196877 1272541 1204110 856779 546084 435125 475571 461311 311097 263789 84577
19038 84577 -109033 -35422 260052 450901 457531 217549 114421 359621 641777 506887
19028 506887 545372 699823 818146 806881 679259 462852 345323 491803 746936 600466
$$ packed form
19102D32603R2425K1721o6848n7518o0380Q0443K7367j79311N3822Q6796K88127
19091G19247k8419m7835k24642r2536O5257P1623m5302l1372J00200m6209j59247
19080B80765P0285J47928K27734j0380J3380Q2667O5029r9949n0246k6788J28448
19069H28873O5920J13538L3649m5379R782m0442M6770n357J74926K7970J90973
19058A401223K054r4873j51415j06983j88037j19192J48301K00757K08329j03287
19048A196877P5664o8431l47331l10695j10959M0446j4260j50214m7308j79212
19038H4577j93610P3611K95474J90849O630k39982j03128K45200K82156j34890
19028E06887L8485J54451J18323j1265j27622k16407j17529J46480K55133j46470
$$ plain form
19018 600466 734225 662407 469460 450630 601973 741452 958032 1130907 1067886 888562
19008 888562 732451 1074799 1224381 1207296 1023344 1175899 1521792 1680170 1314234 1096036
18998 1096036 1218161 1139371 1075226 1289776 1434371 1425995 1619178 1614179 1670250 1687223 1691950
18987 1691950 1799807 1760287 1401069 1163972 1188686 1423075 1339082 1315112 1090316 1090434 994847
18976 994847 933652 898979 1021492 950004 982648 1219612 1371104 1318986 1206437 1081123
18966 1081123 1130421 1351437 1473365 1414187 1444851 1617172 1889151 2071729 2231552 2168281
18956 2168281 2151921 1948122 1834494 2026951 2311901 2316073 2536038 2775263 2840600 2742221
18946 2742221 2497320 2429141 2609618 2702840 2384051 2193671 2071740 1917715 1781373 1764209
$$ packed form
19018F00466J33759p1818j92947j8830J51343J39479K16580J72875o3021j79324
19008H88562j56111L42348J49582j7085j83952J52555L45893J58378l65936k18198
18998A096036J22125p8790o4145K14550J44595q376J93183m999N6071J6973M727
18987A691950J07857l9520l59218k37097K4714K34389q3993k3970k24796J18r5587
18976I94847o1195l4673J22513p1488L2644K36964J51492n2118j12549j25314
18966A081123M9298K21016J21928n9178L0664J72321K71979J82578J59823o3271
18956B168281j6360k03799j13628J92457K84950M172K19965K39225O5337r8379
18946B742221k44901o8179J80477R3222l18789j90380j21931j54025j36342j7164
$$ plain form
18936 1764209 1786117 1905952 2088363 2120629 2059342 2078204 1907446 1711350 1470797 1335920
18926 1335920 1426971 1557616 1472565 1365402 1423909 1713371 1762701 1649335 1534524 1536578
18916 1536578 1540955 1493125 1425128 1391937 1500175 1678710 1605083 1547722 1680494 1773647 1736422
18905 1736422 1816150 2017667 2316231 2681079 3088773 3285630 3285371 3227189 3179601 3351576
18895 3351576 3370690 3454761 3775615 4086961 4273004 4482331 4588019 4905078 5159694 5150820
18885 5150820 5401875 5648613 5676492 5683755 6052801 6504509 6924266 7764689 8676503 10032223
18875 10032223 11663404 13544742 16564889 20781027 27225144 37190012 53370205 80211081
18867 80211081 118109729 149002675 154487165 155559724 162903583 150705904 116391943
$$ packed form
18936A764209K1908J19835J82411L2266o1287J8862j70758j96096k40553j34877
18926A335920R1051J30645q5051j07163N8507K89462M9330j13366j14811K054
18916A536578M377m7830o7997l3191J08238J78535p3627n7361J32772R3153l7225
18905A736422P9728K01517K98564L64848M07694J96857k59n8182m7588J71975
18895C351576J9114Q4071L20854L11346J86043K09327J05688L17059K54616q874
18885E150820K51055K46738K7879P263L69046M51708M19757Q40423R11814J355720
18875A0032223J631181J881338L020147M216138O444117R964868J6180193K6840876
18867H0211081L7898648L0892946N484490J072559P343859j2197679l4313961
$$ plain form
18860 116391943 84857223 63314178 48232110 37300815 29410104 23608666 19367956
18853 19367956 16175837 13855224 12372425 11590329 11011017 10668635 10397326 10288718 9900280
18844 9900280 9424340 8944397 8463476 8140657 7765746 7500421 7515677 7878939 7834828 7640460
18834 7640460 7663384 8069420 8356069 8304542 8245207 8495688 8948388 9102639 9275178 9877488
18824 9877488 10838891 11985940 13324301 15273180 17983243 21533285 26530492 34314595
18816 34314595 46029912 64956613 96513782 143354323 188658336 202651332 202342037
18809 202342037 210716054 200732187 158831853 115373024 84943017 64067914 48720616
18802 48720616 37814750 30038777 24199231 20085976 17216015 15352369 13951559 12655029
$$ packed form
18860A16391943l1534720k1543045j5082068j0931295p890711n801438m240710
18853A9367956l192119k320613j482799p82096n79312l42382k71309j08608l88438
18844I900280m75940m79943m80921l22819l74911k65325J5256L63262m4111j94368
18834G640460K2924M06036K86649n1527n9335K50481M52700J54251J72539O02310
18824I877488R61403J147049J338361J948879K710063L550042M997207P784103
18816C4314595J1715317J8926701L1557169M6840541M5304013J3992996l09295
18809B02342037Q374017r983867m1900334m3458829l0430007k0875103j5347298
18802D8720616j0905866p775973n839546m113255k869961j863646j400810j296530
$$ plain form
18794 12655029 11711192 11300006 10789509 10124119 9357522 8850512 8517069 8147263 7539249
18785 7539249 6941860 6613174 6194843 5869224 5611095 5388862 5193291 5016931 4606153
18776 4606153 4268854 4172464 4041862 3759112 3453947 3223554 3238702 3049456 3174289 3769465
18766 3769465 4472722 4406747 3878751 3477883 2952609 2492437 2120728 1874651 1820394 1894478
18756 1894478 1650475 1655244 1752945 1643422 1631785 1711530 1624926 1381378 1393375 1332771 1137292
18745 1137292 1247006 1355614 1414167 1515525 1525102 1209014 1165615 1118315 1251877 1461177
18735 1461177 1487773 1503147 1421192 1508445 1721479 1875250 1674715 1670636 1815733 1742439 1750671
18724 1750671 1742115 1612893 1340772 1364819 1406786 1555175 1371898 1189841 1216498 1347702
$$ packed form
18794A2655029r43837m11186n10497o65390p66597n07010l33443l69806o08014
18785G539249n97389l28686m18331l25619k58129k22233j95571j76360m10778
18776D606153l37299r6390j30602k82750l05165k30393J5148j89246J24833N95176
18766C769465P03257o5975n27996m00868n25274m60172l71709k46077n4257P4084
18756A894478k44003M769R7701j09523j1637P9745q6604k43548J1997o0604j95479
18745A137292J09714J08608N8553J01358R577l16088m3399m7300J33562K09300
18735A461177K6596J5374q1955Q7253K13034J53771k00535m079J45097p3294Q232
18724A750671q556j29222k72121K4047M1967J48389j83277j82057K6657J31204
$$ plain form
18714 1347702 1334800 1280871 1020640 937788 1156291 1334147 1239439 974285 1059290 964404
18704 964404 1082345 1137941 1113719 1104765 1156143 1121643 1285581 1334465 1062106 1051953 816057
18693 816057 770697 979187 796731 848950 904690 926632 854739 763442 899440 966404 858296
18682 858296 779554 1126982 1406615 1339310 1332784 1320010 1177145 1375964 1351052 1100755 798636
18671 798636 768339 1079189 1259738 1250557 1070536 872619 770946 732697 725588 683827 532469
18660 532469 446602 536546 793536 769383 819787 707998 657581 676289 543797 570933 616969
18649 616969 899153 1060163 871513 837141 975471 1069848 909791 822483 860322 1115390
18639 1115390 883177 788326 837718 1076263 1274597 1098395 861959 933323 1067568 907634
$$ packed form
18714A347702j2902n3929k60231q2852K18503J77856r4708k65154Q5005r4886
18704I64404J17941N5596k4222q954N1378l4500J63938M8884k72359j0153k35896
18693H16057m5360K08490j82456N2219N5740K1942p1893r1297J35998O6964j08108
18682H58296p8742L47428K79633o7305o526j2774j42865J98819k4912k50297l02119
18671G98636l0297L10850J80549r181j80021j97917j01673l8249p109m1761j51358
18660E32469q5867Q9944K56990k4153N0404j11789n0417J8708j32492K7136M6036
18649F16969K82184J61010j88650l4372J38330R4377j60057q7308L7839K55068
18639A115390k32213r4851M9392K38545J98334j76202k36436P1364J34245j59934
$$ plain form
18629 907634 937455 1266366 1318800 1144902 1101590 1141037 1177620 1172118 967121 790343 848355
18618 848355 896426 838633 782960 758445 718045 923285 868390 867331 899260 699293 535262
18607 535262 529501 488820 485803 447275 423612 265395 592985 733113 815236 901110 905768
18596 905768 936316 952548 997560 1063631 1369237 1594503 1613962 1546969 1735432 1762053 1630478
18585 1630478 1679228 1722988 1477909 1645909 1809180 1958816 1961886 2109582 2256383 2259495
18575 2259495 2159396 2166619 2047605 1710663 1556627 1510180 1607115 1635695 1432732 1305214
18565 1305214 1326357 1286347 1333534 1367984 1335055 1248491 1263731 1466819 1661215 1480241 1245275
18554 1245275 1156344 1180608 1197492 1336076 1520336 1436802 1239262 1258837 1365458 1268909
$$ packed form
18629I07634K9821L28911N2434j73898m3312L9447L6583n502k04997j76778N8012
18618H48355M8071n7793n5673k4515m0400K05240n4895j059L1929j99967j64031
18607E35262n761m0681l017l8528k3663j58217L27590J40128Q2123Q5874M658
18596I05768L0548J6232M5012O6071L05606K25266J9459o6993J88463K6621j31575
18585A630478M8750M3760k45079J68000J63271J49636L070J47696J46801L112
18575B259495j00099P223j19014l36942j54036m6447R6935K8580k02963j27518
18565A305214K1143m0010M7187L4450l2929q6564J5240K03088J94396j80974k34966
18554A245275q8931K4264J6884J38584J84260q3534j97540J9575J06621r6549
$$ plain form
18544 1268909 1162763 1102733 1111047 1341008 1549909 1443021 1306607 1286877 1012896 1126232
18534 1126232 1318175 1268462 1133358 1465792 1397793 1112934 1233181 1411972 1361238 1472687
18524 1472687 1449493 1433528 1481336 1559343 1652071 1802016 1939053 2039021 1900194 1802429 1730163
18513 1730163 1698444 1769928 2129951 2144355 1881455 2084892 2270559 2372684 2629478 2715127
18503 2715127 2661694 2747655 2869753 3268973 3673602 3579881 3604933 3895148 4127937 4463380
18493 4463380 4360997 3985841 3738240 3832867 4274866 4582776 4886996 5133026 5352576 5703390
18483 5703390 6100567 6580420 6969473 7441603 7952417 8608234 9401270 10717762 12339457
18474 12339457 14584583 17778416 22077957 28507428 38647076 54156045 76263346 98031989
$$ packed form
18544A268909j06146o0030Q314K29961K08901j06888j36414j9730k73981J13336
18534A126232J91943m9713j35104L32434o7999k84859J20247J78791n0734J11449
18524A472687k3194j5965M7808P8007R2728J49945J37037R9968j38827r7765p2266
18513A730163l1719P1484L60023J4404k62900K03437J85667J02125K56794Q5649
18503B715127n3433Q5961J22098L99220M04629r3721K5052K90215K32789L35443
18493D463380j02383l75156k47601R4627M41999L07910L04220K46030K19550L50814
18483E703390L97177M79853L89053M72130N10814O55817P93036J316492J621695
18474A2339457K245126L193833M299541O429471J0139648J5508969K2107301K1768643
$$ plain form
18466 98031989 107879530 111626568 116354601 109752582 90257490 72026865 60848157 55961025
18458 55961025 57888153 67015917 84070829 102459629 109975868 110975115 113509265 106262564
18450 106262564 85157814 63695696 48067450 37241124 29846081 24748725 20804044
18443 20804044 17968994 15681548 14093939 13032306 12063347 11336730 11069709 10881593 10613393
18434 10613393 10619064 10572503 10433204 10246752 10142225 9934233 9928235 10291387 10320606 10537016
18424 10537016 10873645 11326387 12079626 13323560 14870999 16777430 19385000 23717572
18416 23717572 30706578 41172572 56826097 74594636 84889625 89120662 94576443
18409 94576443 93630870 80012319 64792889 54939425 50214639 49943800 54878432 65824268
$$ packed form
18466I8031989R847541L747038M728033o602019j9495092j8230625j1178708m887132
18458E5961025J927128R127764J7054912J8388800P516239R99247K534150p246701
18450A06262564k1104750k1462118j5628246j0826326p395043n097356l944681
18443B0804044k835050k287446j587609j061633r68959p26617k67021j88116k68200
18434A0613393N671m6561j39299j86452j04527k07992n998L63152K9219K16410
18424A0537016L36629M52742P53239J243934J547439J906431K607570M332572
18416B3717572O989006J0465994J5653525J7768539J0294989M231037N455781
18409I4576443r45573j3618551j5219430r853464m724786k70839M934632J0945836
$$ plain form
18401 65824268 79803995 88165763 91142379 96097808 95101528 80718526 63314172 50653154
18393 50653154 42523360 37369404 34415486 33240809 33732964 36501716 41532860 49834642
18385 49834642 63179886 82687621 104916748 123572514 137701951 152895781 171900291
18378 171900291 194969387 218835612 233145748 235639922 234928505 230675438 217335820
18371 217335820 198736529 179956355 161437475 144757895 127850908 107277970 84832727
18364 84832727 66171438 52562831 42542413 35190082 29786753 25678022 22434855 20013053
18356 20013053 18468733 17157884 15704392 14367702 13441634 12473400 11681821 11111133 10578001
18347 10578001 10083718 9491172 8909671 8148493 7504049 6985742 6726069 6560434 6432271
$$ packed form
18401F5824268J3979727Q361768K976616M955429r96280j4383002j7404354j2661018
18393E0653154q129794n153956k953918j174677M92155K768752N031144Q301782
18385D9834642J3345244J9507735K2229127J8655766J4129437J5193830J9004510
18378A71900291K3069096K3866225J4310136K494174p11417m253067j3339618
18371B17335820j8599291j8780174j8518880j6679580j6906987k0572938k2445243
18364H4832727j8661289j3608607j0020418p352331n403329m108731l243167k421802
18356B0013053j544320j310849j453492j336690r26068r68234p91579n70688n33132
18347A0578001m94283n92546n81501p61178o44444n18307k59673j65635j28163
$$ plain form
18338 6432271 6276897 5781588 5278730 4968320 4880835 4813730 4678733 4717100 4822201 4620963
18328 4620963 4268577 4086485 3842634 3409406 3135013 2977377 2958179 2846966 2976977 2887946
18318 2887946 2729558 2673727 2622498 2454225 2418075 2287500 2251253 2227565 2328828 2181262
18308 2181262 1957067 1881481 1726015 1959919 2192397 2239926 1981730 1917914 1957696 1885135
18298 1885135 1935164 2000146 1922846 1950713 1832120 1937186 2250235 2319535 2209005 1794404
18288 1794404 1571771 1490901 1683651 1574147 1534094 1467279 1617545 1824800 2112986 2117713
18278 2117713 2085299 2133550 2103701 2179290 2077024 2049752 1632202 1468103 1063602 1069603 1343425
18267 1343425 1588893 1385620 1339773 1441032 1623222 1583582 1236300 1114137 1068278 1019074
$$ packed form
18338F432271j55374m95309n02858l10410q7485o7105j34997L8367J05101k01238
18328D620963l52386j82092k43851m33228k74393j57636j9198j11213J30011q9031
18318B887946j58388n5831n1229j68273l6150j30575l6247k3688J01263j47566
18308B181262k24195p5586j55466K33904K32478M7529k58196o3816L9782p2561
18298A885135N0029O4982p7300K7867j18593J05066L13049O9300j10530m14601
18288A794404k22633q0870J92750j09504m0053o6815J50266K07255K88186M727
18278B117713l2414M8251k9849P5589j02266k7272m17550j64099m04501O001K73822
18267A343425K45468k03273m5847J01259J82190l9640l47282j22163m5859m9204
$$ plain form
18257 1019074 1066303 1141895 1165517 1042279 1054786 1240766 1375175 1357934 1314761 1090553
18247 1090553 1156629 1323380 1327188 1417557 1421243 1366179 1664405 1740421 1562136 1651812 1454591
18236 1454591 1643634 2130907 2483670 2191436 2033623 1908338 1848497 1571980 1122565 1318242
18226 1318242 1539873 1627687 1588600 1676321 1435414 1221601 1553671 1636104 1308367 965864
18216 965864 937612 1037343 929963 934986 926062 1037412 1134421 1217847 1262012 963537 833128
18205 833128 785588 934874 1113263 1297381 1279572 1088402 1146387 1220739 1235878 1280185 1261202
18194 1261202 1420397 1596029 1604859 1328892 1293385 1596160 1573558 1350848 1519490 1467944
18184 1467944 1415129 1481504 1620056 1890906 1800469 1611387 1458396 1226264 1190002 1390901
$$ packed form
18257A019074M7229P5592K3622j23238J2507J85980J34409j7241m3173k24208
18247A090553O6076J66751L808R0369L686n5064K98226P6016j78285Q9676j97221
18236A454591J89043M87273L52763k92234j57813j25285n9841k76517m49415J95677
18226A318242K21631Q7814l9087Q7721k40907k13813L32070Q2433l27737l42503
18216I65864k8252R9731j07380N023q924J11350R7009Q3426M4165k98475j30409
18205H33128m7540J49286J78389J84118j7809j91170N7985P4352J5139M4307j8983
18194A261202J59195J75632Q830k75967l5507L02775k2602k22710J68642n1546
18184A467944n2815O6375J38552K70850r0437j89082j52991k32132l6262K00899
$$ plain form
18174 1390901 1553393 1322205 1173545 1250955 1447428 1353696 1522476 1624243 1279098 1231110
18164 1231110 1260924 1172365 1290839 1289877 1383704 1393435 1398181 1526560 1628368 1835129 2096843
18153 2096843 1972636 1922800 2201416 2215466 2134753 2163471 2424517 2768715 3041209 3177157
18143 3177157 3157204 3382091 3553865 3548560 3668385 3577231 3756442 4058123 4152747 4209955
18133 4209955 4409198 4826553 5281311 5549294 5886718 6221906 6592609 7120136 7849242
18124 7849242 8841815 9906111 11306667 12927353 14762762 16910256 19393470 22825373
18116 22825373 27671321 34806309 45348810 60682478 84429113 123619190 192274564
18109 192274564 308033905 446754602 475071770 364463425 251510766 179122212
$$ packed form
18174A390901J62492k31188j48660P7410J96473r3732J68780J01767l45145m7988
18164A231110K9814q8559J18474r62R3827R731M746J28379J01808K06761K61714
18153B096843j24207m9836K78616J4050q0713K8718K61046L44198K72494J35948
18143C177157j9953K24887J71774n305J19825r1154J79211L01681R4624N7208
18133D209955J99243M17355M54758K67983L37424L35188L70703N27527P29106
18124G849242R92573J064296J400556J620686J835409K147494K483214L431903
18116B2825373M845948P134988J0542501J5333668K3746635L9190077O8655374
18109A92274564J15759341J38720697K8317168j10608345j12952659p2388554
$$ plain form
18103 179122212 130045870 95743717 72192895 55766900 43714421 34623697 27764101
18096 27764101 22650709 19181647 16509789 14572373 12756538 11483843 10566992 9641193
18088 9641193 8896453 8134297 7238256 6549449 6420518 6308670 5786938 5268344 5001467
18079 5001467 4486971 4234696 4033169 3625528 3203114 3231672 3278058 2948910 2579328 2327886
18069 2327886 2144520 2158749 2384745 2485506 2207409 2250856 2190733 2123656 1938339 1767036
18059 1767036 1819574 2013255 2230462 2379850 2596464 2663515 2579320 2251083 2058492 1947326
18049 1947326 1818732 1722516 1441912 1265621 1345505 1347268 1344576 1380910 1286203 1592264 1843524
18038 1843524 1939552 1919088 2010133 2286574 2362868 2128314 1966110 1820814 1829019 1938612
$$ packed form
18103A79122212m9076342l4302153k3550822j6425995j2052479r090724o859596
18096B7764101n113392l469062k671858j937416j815835j272695r16851r25799
18088I641193p44740p62156q96041o88807j28931j11848n21732n18594k66877
18079E001467n14496k52275k01527m07641m22414K8558M6386l29148l69582k51442
18069B327886j83366J4229K25996J00761k78097M3447o0123o7077j85317j71303
18059A767036N2538J93681K17207J49388K16614O7051q4195l28237j92591j11166
18049A947326j28594r6216k80604j76291P9884J763k692L6334r4707L06061K51260
18038A843524R6028k0464R1045K76441P6294k34554j62204j45296Q205J09593
$$ plain form
18028 1938612 1831772 1499813 1265477 921734 658726 560445 776666 831940 527253 475066
18018 475066 481512 669430 763812 850735 882290 1059061 1285526 1328691 1070908 885565 946815
18007 946815 924943 828368 935914 896128 996602 1352573 1348026 1164601 1089039 1239693 1151066
17996 1151066 893731 806479 511759 391860 525834 399142 138508 122912 57811 -29089
17986 -29089 70263 141764 280515 300602 443629 587149 842315 884549 746445 1081156
17976 1081156 1346358 1303240 1076785 1248672 1403291 1238579 1039070 959275 1012821 929387
17966 929387 687430 534723 524094 469847 610490 671161 807519 1020656 957128 844000
17956 844000 849438 1005402 1082415 1099125 1059521 1137107 1077261 1023546 983208 927126 1123459
$$ packed form
18028A938612j06840l31959k34336l43743k63008r8281K16221N5274l04687n2187
18018D75066O446J87918R4382Q6923L1555J76771K26465M3165k57783j85343O1250
18007I46815k1872r6575J07546l9786J00474L55971m547j83425p5562J50654q8627
17996A151066k57335q7252k94720j19899J33974j26692k60634j5596o5101q6900
17986b9089R9352P1501J38751K0087J43027J43520K55166M2234j38104L34711
17976A081156K65202m3118k26455J71887J54619j64712j99509p9795N3546q3434
17966I29387k41957j52707j0629n4247J40643O0671J36358K13137o3528j13128
17956H44000N438J55964P7013J6710l9604P7586n9846n3715m0338n6082J96333
$$ plain form
17945 1123459 1271976 1191702 1188879 1068277 1122517 1154481 1243185 1362110 1449223 1318166 1465156
17934 1465156 1565186 1442178 1264835 1326428 1436344 1284028 1048097 1043683 1113094 843332
17924 843332 780163 894341 1006427 1019680 999071 922663 776092 614797 498284 338239
17914 338239 302701 395915 434885 384420 476755 660193 601880 573040 603851 590913 482767
17903 482767 191778 298157 221248 231048 302123 263537 331096 571347 399333 263568 192396
17892 192396 254910 333032 390901 355301 362721 452767 422448 316993 301823 411972 486667
17881 486667 450403 527603 663152 595186 571701 518372 429044 545290 734117 752062 981119
17870 981119 1136169 1112502 928917 874883 806450 890056 921481 1085380 992269 783094 766737
$$ packed form
17945A123459J48517q0274k823j20602N4240L1964Q8704J18925Q7113j31057J46990
17934A465156J00030j23008j77343O1593J09916j52316k35931m414O9411k69762
17924H43332o3169J14178J12086J3253k0609p6408j46571j61295j16513j60045
17914C38239l5538R3214L8970n0465R2335J83438n8313k8840L0811j2938j08146
17903D82767k90989J06379p6909R800P1075l8586O7559K40251j72014j35765p1172
17892A92396O2514P8122N7869l5600P420R0046l0319j05455j5170J10149P4695
17881D86667l6264P7200J35549o7966k3485n3329q9328J16246J88827J7945K29057
17870I81119J55050k3667j83585n4034o8433Q3606L1425J63899r3111k09175j6357
$$ plain form
17859 766737 623657 497514 347457 335405 274389 303654 321683 361767 344588 467113 498062
17848 498062 568894 466693 525312 467506 309935 223882 288556 354799 419312 323488 377330
17837 377330 394520 402979 319367 182874 40554 202542 354144 493720 388837 214428
17827 214428 256607 439720 206672 255822 146460 142446 439112 674072 567719 484678
17817 484678 593916 588769 600621 483439 446171 662296 785918 765872 574130 641183 569831
17806 569831 552145 727519 900717 985220 818083 863072 1093485 1216716 1455988 1508776
17796 1508776 1421577 1237859 1204005 1510554 1803997 1945726 1933132 1911601 1767868 1770741
17786 1770741 1610049 1405743 1280416 1291563 1114968 1083087 1243302 966009 842879 802318
$$ packed form
17859G66737j43080j26143j50057j2052o1016K9265J8029M0084j7179J22525L0949
17848D98062P0832j02201N8619n7806j57571q6053O4674O6243O4513r5824N3842
17837C77330J7190Q459q3612j36493j42320J61988J51602J39576j04883j74409
17827B14428M2179J83113k33048M9150j09362m014K96666K34960j06353q3041
17817D84678J09238n147J1852j17182l7268K16125J23622k0046j91742O7053p1352
17806E69831j7686J75374J73198Q4503j67137M4989K30413J23231K39272N2788
17796A508776q7199j83718l3854L06549K93443J41729j2594k1531j43733K873
17786A770741j60692k04306j25327J1147j76595l1881J60215k77293j23130m0561
$$ plain form
17776 802318 904722 959840 864069 652715 300044 337326 502614 416965 283521 165306
17766 165306 404138 610341 416154 186746 128293 207433 138179 3174 -27619 159174
17756 159174 171792 330739 385376 473116 332918 -15624 81938 162673 276980 484946
17746 484946 355195 295393 285574 227177 127458 325215 158488 183893 189048 191243 348748
17735 348748 228018 178534 471711 378491 66562 -70277 31787 -148129 -229335 -40364
17725 -40364 218559 166729 215631 450006 365106 363257 90248 -100815 64282 5377 -211788
17714 -211788 -261196 -70370 219859 274595 335293 83514 -87643 -268512 -277455 -226997 -92003
17703 -92003 65811 200765 75419 160181 91151 138427 168796 351629 299898 266792 479276
$$ packed form
17776H02318J02404N5118r5771k11354l52671L7282J65288q5649j33444j18215
17766A65306K38832K06203j94187k29408n8453P9140o9254j35005l0793J86793
17756A59174J2618J58947N4637Q7740j40198l48542R7562Q0735J14307K07966
17746D84946j29751n9802r819n8397r9719J97757j66727K5405N155K195J57505
17735C48748j20730m9484K93177r3220l11929j36839J02064j79916q1206J88971
17725d0364K58923n1830M8902K34375q4900j849k73009j91063J65097n8905k17165
17714b11788m9408J90826K90229N4736O0698k51779j71157j80869q943N0458J34994
17703i2003J57814J34954j25346Q4762o9030M7276L0369J82833n1731l3106K12484
$$ plain form
17692 479276 292823 59398 100557 93912 152194 72657 -97664 -183273 -192336 11906 340909
17681 340909 380215 181342 -16589 -14605 33898 175165 340557 421664 323677 467453 525277
17670 525277 492653 601398 691903 645871 544224 751993 1082561 1237741 1081124 743102
17660 743102 627788 440083 380876 357612 278351 203068 275402 311039 308669 4896 79055
17649 79055 325387 293733 313544 585511 538738 536513 435748 305013 282510 516532 323872
17638 323872 151638 136563 344925 266337 332230 387713 346308 242710 71920 39430 205918
17627 205918 287649 230271 259985 449383 459489 128798 129780 -46454 -56076 38976 -36754
17616 -36754 190729 32967 -119488 -62550 32630 -108507 -233150 106066 368995 543780
$$ packed form
17692D79276j86453k33425M1159o645N8282p9537j70321q5609r063K04242L29003
17681C40909L9306j98873j97931J984M8503J41267J65392Q1107r7987J43776N7824
17670E25277l2624J08745R0505m6032j01647K07769L30568J55180j56617l38022
17660G43102j15314j87705n9207k3264p9261p5283P2334L5637k370l03773P4159
17649G9055K46332l1654J9811K71967m6773k225j00765j30735k2503K34022j92660
17638C23872j72234j5075K08362p8588O5893N5483m1405j03598j70790l2490J66488
17627B05918Q1731n7378K9714J89398J0106l30691R82j76234r622R5052p5730
17616c6754K27483j57762j52455N6938R5180j41137j24643L39216K62929J74785
$$ plain form
17606 543780 458982 39890 -24361 150256 255546 296017 171781 201328 173646 181392 47246
17595 47246 -268537 -373267 -365254 -347403 -30380 17275 111759 8165 -171184 -132369 -75927
17584 -75927 204527 380942 568791 393211 247861 334780 332127 192168 189447 383978 238770
17573 238770 299578 354205 167122 93863 -79899 -116274 122699 173303 217845 31023 103193
17562 103193 174937 94374 163968 -19277 37736 64622 87669 17691 -63466 -68730 -38495
17551 -38495 -81429 -89847 -9556 211360 403602 528127 165873 -288 141322 299903
17541 299903 336088 309080 265327 275585 553811 702880 430297 269996 314930 247811 93406
17530 93406 118670 152855 138255 50352 -16435 -169190 -223528 -348724 -222284 67904 -70312
$$ packed form
17606E43780q4798m19092o4251J74617J05290M0471j24236K9547k7682P746j34146
17595D7246l15783j04730Q013J7851L17023M7655R4484j03594j79349L8815N6442
17584g5927K80454J76415J87849j75580j45350Q6919k653j39959k721J94531j45208
17573B38770O0808N4627j87083p3259j73762l6375K38973N0604M4542j86822P2170
17562A03193P1744q0563O9594j83245N7013K6886K3047o9978q1157n264L0235
17551c8495m2934q418Q0291K20916J92242J24525l62254j66161J41610J58581
17541B99903L6185k7008m3753J0258K78226J49069k72583j60301M4934o7119j54405
17530I3406K5264L4185j4600q7903o6787j52755n4338j25196J26440K90188j38216
$$ plain form
17519 -70312 -342343 -296890 -137341 -135198 65340 306421 371797 415802 286880 362289 419082
17508 419082 397425 232358 -23644 73471 131030 111149 211689 34446 -174045 63699
17498 63699 247192 434154 666812 523124 376887 394504 390848 143832 -66582 -225017
17488 -225017 -196939 -243275 -241137 -142389 -52101 50320 67849 -176413 -312164 -18980 143091
17477 143091 54894 -150433 -96107 -741 135059 107320 -47814 -128873 -36403 210665 282548
17466 282548 301362 150298 192163 288226 214852 115869 -106092 28883 157163 177879 119751
17455 119751 -14892 155293 146336 31437 63768 140689 167169 -72365 -129540 68275 205039
17444 205039 647217 1283813 1797290 2106331 1774787 1316383 945633 542443 486191 437379
$$ packed form
17519g0312k72031M5453J59549K143K00538K41081O5376M4005j28922P5409N6793
17508D19082k1657j65067k56002R7115N7559j9881J00540j77243k08491K37744
17498F3699J83493J86962K32658j43688j46237J7617l656k47016k10414j58435
17488b25017K8078m6336K138R8748R0288J02421J7529k44262j35751K93184J62071
17477A43091q8197k05327N4326R5366J35800k7739j55134q1059R2470K47068P1883
17466B82548J8814j51064M1865R6063p3374r8983k21961J34975J28280K0716n8128
17455A19751j34643J70185q957j14899L2331P6921K6480k39534n7175J97815J36764
17444B05039M42178O36596N13477L09041l31544m58404l70750m03190n6252m8812
$$ plain form
17434 437379 373961 266486 236140 -271914 -383597 -200029 -97994 -136617 -84104 152895
17424 152895 442073 638309 454855 376159 499105 511480 335096 163658 138020 148719
17414 148719 -51659 -148206 -171836 -102333 -88276 -87609 75587 283232 384565 365078 310109
17403 310109 136807 19193 -167127 -357243 -229185 -33174 -110614 -106913 23408 229177
17393 229177 -50461 -246299 -63563 84233 179374 146932 62222 75795 -66475 -124729
17383 -124729 -95173 11621 45884 134448 204595 378948 187303 -33466 -228753 -236965 -197628
17372 -197628 -179392 -180180 -225021 -161927 106049 88786 -90226 -153762 -185444 -89258 235600
17361 235600 411990 262798 183200 73917 132657 283227 255776 72737 131043 274587
$$ packed form
17434D37379o3418j07475l0346n08054j11683J83568J02035l8623N2513K36999
17424A52895K89178J96236j83454p8696J22946J2375j76384j71438k5638J0699
17414A48719k00378r6547k3630O9503J4057O67J63196K07645J01333j9487n4969
17403C10109j73302j17614j86320j90116J28058J96011p7440L701J30321K05769
17393B29177k79638j95838J82736J47796R5141l2442q4710J3573j42270n8254
17383a24729K9556J06794L4263Q8564P0147J74353j91645k20769j95287q212L9337
17372a97628J8236p88m4841O3094K67976j7263j79012o3536l1682R6186L24858
17361B35600J76390j49192p9598j09283N8740J50570k7451j83039N8306J43544
$$ plain form
17351 274587 211386 84996 50486 124775 135856 22442 16967 -34874 -127328 -79270 -83944
17340 -83944 -194933 -92429 -49418 -55524 -123958 -57845 -114741 -159954 -244685 -66802 96656
17329 96656 -5689 -117648 -5269 25892 -158677 -36241 23371 -6289 -154143 24891
17319 24891 83528 -45286 -152213 -261431 -453676 -365586 -84685 -53145 -206868 -168328
17309 -168328 -30135 250000 366002 208385 324554 394805 442363 485000 324153 58108
17299 58108 112201 300512 209583 163055 166090 -90567 -88644 -204934 -124813 159659 213104
17288 213104 138712 61578 58473 -241857 -212833 -149235 -119041 -86466 -16677 -257659 -503121
17277 -503121 -451712 -465989 -314187 -171898 -373975 -376001 4436 -28659 -261385 -427844
$$ packed form
17351B74587o3201j26390l4510P4289J1081j13414n475n1841r2454M8058m674
17340h3944j10989J02504M3011o106o8434O6113n6896m5213q4731J77883J63458
17329I6656j02345j11959J12379L1161j84569J22436N9612k9660j47854J79034
17319B4891N8637j28814j06927j09218j92245Q8090K80901L1540j53723L8540
17309a68328J38193K80135J16002j57617J16169P0251M7558M2637j60847k66045
17299E8108N4093J88311r0929m6528L035k56657J923j16290Q0121K84472N3445
17288B13104p4392p7134l105l00330K9024O3598L0194L2575O9789k40982k45462
17277e03121N1409j4277J51802J42289k02077k026L80437l3095k32726j66459
$$ plain form
17267 -427844 -539500 -409790 -53032 103872 276183 83601 -153308 -243820 -257026 -96017
17257 -96017 243653 253348 -37851 104906 130623 45905 54064 251026 16027 -80382 -30110
17246 -30110 -178780 -332877 -35560 -25340 -117035 -11202 -197483 -272328 -56646 368710
17236 368710 407061 366129 102873 -2804 -3086 -294494 -627615 -499570 -259646 -360624
17226 -360624 -417009 -224290 -169572 -213748 1384 -72782 -3302 9964 -129427 -277741 -164287
17215 -164287 -170921 -425278 -446273 -275161 -142095 55976 -26488 -173565 -191640 -300772
17205 -300772 -171665 -85115 -86132 20899 190577 163838 -63806 -108633 -20229 78959 81149
17194 81149 100182 -25168 -60592 -96858 9222 16614 -142920 -473092 -502420 -334917 -405887
$$ packed form
17267d27844j11656J29710L56758J56904J72311j92582k36909r0512j3206J61009
17257i6017L39670R695k91199J42757K5717q4718Q159J96962k34999r6409N0272
17246c0110j48670j54097K97317J0220r1695J05833j86281p4845K15682M25356
17236C68710L8351m0932k63256j05677k82k91408l33121J28045K39924j00978
17226c60624n6385J92719N4718m4176K15132p4166O9480J3266j39391j48314J13454
17215a64287o634k54357k0995J71112J33066J98071q2464j47077j8075j09132
17205c00772J29107Q6550j017J07031J69678k6739k27644m4827Q8404R9188K190
17194H1149J9033j25350l5424l6266J06080P392j59534l30172k9328J67503p0970
$$ plain form
17183 -405887 -329135 -325731 -320286 -159261 -123090 -19974 26491 -164748 -156153 -77796 -67038
17172 -67038 6535 153663 353728 395835 212358 324263 543778 239672 147963 342265
17162 342265 157369 21603 -214760 -217629 -186033 -202133 -123766 -237750 -287583 -44001 106492
17151 106492 121741 -185278 -397555 -331032 -265383 -138581 -153456 -100295 -110022 -215881 -311861
17140 -311861 -156728 -137475 -70632 -48655 -90245 -110395 -170856 -153011 -215286 -98780 -177614
17129 -177614 -125605 -313836 -207590 45960 252525 234882 52757 -138841 -57208 -66627
17119 -66627 -92456 -54126 -126388 -73227 40530 -45471 62771 134653 -34794 -123083 -267622
17108 -267622 -214694 -183897 -168003 -173457 105553 561974 580536 445265 406284 267383 -219015
$$ packed form
17183d05887P6752L404N445J61025L6171J03116M6465j91239Q595P8357J0758
17172f7038P3573J47128K00065M2107j83477J11905K19515l04106r1709J94302
17162C42265j84896j35766k36363k869L1596j6100P8367j13984m9833K43582J50493
17151A06492J5249l07019k12277O6523O5649J26802j4875N3161r727j05859r5980
17140c11861J55133J9253O6843K1977m1590k0150o0461J7845o2275J16506p8834
17129a77614N2009j88231J06246K53550K06565j7643j82125j91598Q1633r419
17119f6627k5829L8330p2262N3161J13757q6001J08242P1882j69447q8289j44539
17108b67622N2928L0797J5894n454K79010M56421J8562j35271l8981j38901m86398
$$ plain form
17097 -219015 -220476 -19633 -36594 -51733 -164092 -301915 -247780 -220600 -258058 -225603 -342828
17086 -342828 -424851 -282270 -311010 -328128 -144840 -48145 -148350 -90579 -79235 -90481 144315
17075 144315 254009 235358 -18648 -134577 -104443 -66526 -194387 -137465 -76915 -125614 -217698
17064 -217698 -226731 49424 231123 30831 -192914 -238070 -149692 -101426 -57855 -78034 66158
17053 66158 294012 259614 -52716 -204627 -217832 -242086 -177234 -201347 -95666 -86985 -271246
17042 -271246 -382946 -328105 -190649 -174454 -94958 215773 33816 -84327 43100 106394
17032 106394 59622 -61002 -137832 -21681 -93699 -68660 -69321 49482 -53968 -185949 -229268
17021 -229268 -250041 -51430 65727 185862 -25334 -218815 -427040 -431869 -432695 -620936 -577188
$$ packed form
17097b19015j461K00843j6961j5139j12359j37823N4135K7180l7458L2455j17225
17086c42828q2023J42581k8740j7118J83288R6695j00205N7771J1344j1246K34796
17075A44315J09694j8651k54006j15929L0134L7917j27861N6922O0550m8699r2084
17064b17698r033K76155J81699k00292k23745m5156Q8378M8266M3571k0179J44192
17053F6158K27854l4398l12330j51911j3205k4254O4852k4113J05681Q681j84261
17042b71246j11700N4841J37456J6195P9496L10731j81957j18143J27427O3294
17032A06394m6772j20624p6830J16151p2018K5039o61J18803j03450j31981m3319
17021b29268k0773J98611J17157J20135k11196j93481k08225m829q26j88241M3748
$$ plain form
17010 -577188 -611531 -613004 -527295 -242310 -55704 -68252 -123889 -135246 -42141 77593 77636 207247
16998 207247 362387 581637 662154 619297 304780 192035 -86772 -237617 76738 23878
16988 23878 18971 137812 215683 130932 183881 248636 171859 28818 -23432 218355 256527
16977 256527 195994 261638 24108 11271 121287 114718 -30542 10988 61584 -67154 -11067
16966 -11067 122492 73631 14098 107334 87089 28298 22111 -71015 -64523 -89518 -271248 -468821
16954 -468821 -498544 -345714 -842 128827 122363 -27756 -26312 41440 -10577 -71263 91206
16943 91206 218370 133414 -68948 38331 -3131 -249820 -283174 -198179 -179591 -264243 -388211
16932 -388211 -344014 -357798 -668910 -657656 -398062 -311464 -120438 -150532 -293582 -101595
$$ packed form
17010e77188l4343j473Q5709K84985J86606j2548n5637j1357R3105J19734M3J29611
16998B07247J55140K19250Q0517m2857l14517j12745k78807j50845L14355n2860
16988B3878m907J18841P7871q4751N2949O4755p6777j43041n2250K41787L8172
16977B56527o0533O5644k37530j2837J10016o569j45260M1530N0596j28738N6087
16966a1067J33559m8861n9533R3236k0245n8791o187r3126O492k4995j81730j97573
16954d68821k9723J52830L44872J29669o464j50119J444O7752n2017o0686J62469
16943I1206J27164q4956k02362J07279m1462k46689l3354Q4995J8588q4652j23968
16932c88211M4197j3784l11112J1254K59594Q6598J91026l0094j43050J91987
$$ plain form
16922 -101595 47712 43423 -184790 -318129 -156058 -105423 71829 -53980 -143898 -47218
16912 -47218 -145370 -294811 -205531 -160208 -220284 -156811 69535 196743 140356 -49655 41501
16901 41501 219774 214882 88095 -223240 -172224 12436 -394203 -579513 -569952 -508091 -281677
16890 -281677 -95424 113152 123001 289223 139603 13100 -230876 -379536 -336336 -312878
16880 -312878 -215178 -225155 -140824 -72318 -164009 14977 67341 198713 225606 325917 155212
16869 155212 -344710 -458739 -411437 -406046 -63035 119654 168217 -9710 106000 133678
16859 133678 -43078 14259 -306366 -309585 -378727 -387023 -277237 -70211 23309 -148614 -204605
16848 -204605 -304526 -227157 -228082 -67176 57187 -201297 -189699 -266163 -156407 -71003 -183852
$$ packed form
16922a01595J49307m289k28213j33339J62071N0635J77252j25809q9918R6680
16912d7218r8152j49441Q9280M5323o0076O3473K26346J27208n6387j90011R1156
16901D1501J78273m892j26787l11335N1016J84660m06639j85310R561O1861K26414
16890b81677J86253K08576R849J66222j49620j26503k43976j48660M3200K3458
16880c12878R7700r977Q4331O8506r1691J78986N2364J31372K6893J00311j70705
16869A55212m99922j14029M7302N391L43011J82689M8563j77927J15710K7678
16859A33678j76756N7337l20625l219o9142q296J09786K07026R3520j71923n5991
16848b04605r9921P7369r25J60906J24363k58484J1598p6464J09756Q5404j12849
$$ plain form
16837 -183852 -211336 -330073 -444345 -477325 -487451 -358597 -223284 -116231 -6117 -99893
16827 -99893 -127159 -55258 -138804 -192773 -204010 -421222 -350979 -153485 -350058 -198546 -69773
16816 -69773 65015 77073 24512 19420 62631 64575 11197 -127789 -219203 -279188 -262675 -220713
16804 -220713 -297641 -466076 -400808 -248564 -197749 -10261 63704 193715 207319 225267 242602
16793 242602 184316 43686 -14107 -45554 -125878 -274139 -313309 -170401 -253951 -74207 2612
16782 2612 -101062 -197131 -150660 -330837 -352180 -415130 -625236 -741337 -564081 -324722 -137271
16771 -137271 26262 -56743 -43546 132854 210998 198231 245229 221549 138487 -39072 113531
16760 113531 -5090 -361518 -422222 -446895 -333332 -453110 -406301 -176510 -222117 -279434
$$ packed form
16837a83852k7484j18737j14272l2980j0126J28854J35313J07053J10114r3776
16827i9893k7266P1901q3546n3969j1237k17212P0243J97494j96573J51512J28773
16816f9773J34788J2058n2561n092M3211J944n3378j38986r1414n9985J6513M1962
16804b20713p6928j68435O5268J52244N0815J87488P3965J30011J3604J7948J7335
16793B42602n8286j40630n7793l1447q0324j48261l9170J42908q3550J79744P6819
16782B612j03674r6069M6471j80177k1343o2950k10106j16101J77256K39359J87451
16771a37271J63533q3005J3197J76400P8144j2767M6998k3680q3062j77559J52603
16760A13531j18621l56428o0704k4673J13563j19778M6809K29791m5607n7317
$$ plain form
16750 -279434 -141515 153231 337194 305143 29559 -190608 -278970 -299417 -142034 -35325
16740 -35325 30239 44267 19448 5599 -137498 -186204 -75016 -100926 -139425 -252412 -170541
16729 -170541 -61653 -177060 -79659 18498 65918 271056 163192 312554 569150 360193
16719 360193 231186 106599 65788 194180 195408 121671 -100223 -376212 -181343 -158480
16709 -158480 -28265 -82203 -111326 -344406 -444437 -589368 -473227 -229905 -227023 -38263
16699 -38263 -61588 -254417 -320809 -288464 -393917 -445739 -442434 -375036 -219949 -85272 -427926
16688 -427926 -546371 -235865 -230784 -157940 -70868 -44230 -108851 -82350 53484 -15502 115995
16677 115995 70845 -4838 32042 220470 277367 185080 -15847 -304247 -252609 -282716 -575345
$$ packed form
16750b79434J37919K94746J83963l2051k75584k20167q8362k0447J57383J06709
16740c5325O5564J4028k4819j3849j43097m8706J11188k5910l8499j12987Q1871
16729a70541J08888j15407R7401R8157M7420K05138j07864J49362K56596k08957
16719C60193j29007j24587m0811J28392J228p3737k21894k75989J94869K2863
16709a58480J30215n3938k9123k33080j00031j44931J16141K43322K882J88760
16699c8263k3325j92829o6392L2345j05453n1822L305O7398J55087J34677l42654
16688d27926j18445L10506N081P2844Q7072K6638o4621K6501J35834o8986J31497
16677A15995m5150p5683L6880J88428N6897r2287k00927k88400N1638l0107k92629
$$ plain form
16666 -575345 -465869 -173209 -119451 -223346 -307310 -221398 86263 135492 150202 222933 275557
16655 275557 155644 119360 40399 -194699 -231582 -272846 -179643 -199155 -243404 -78946 154496
16644 154496 141778 235 -150230 -277229 -291607 -145212 -22007 -39646 -72784 -222996
16634 -222996 -197939 -105616 -120605 -236448 -284303 -171946 -139507 -24532 170752 -103401
16624 -103401 -248330 -32550 -98012 -124178 -20803 97839 234381 248323 -1540 -92981
16614 -92981 -136516 -210708 -64319 -135774 -308287 -436084 -350384 -207163 -158166 -321486 -305548
16603 -305548 -167591 -251235 -357847 -149032 -56073 22754 63471 25060 -148110 -256402
16593 -256402 -308396 -43694 179311 137402 -94006 -24662 146987 244557 87045 95827 84965
$$ packed form
16666e75345J09476K92660N3758j03895q3964Q5912L07661M9229J4710P2731N2624
16655B75557j19913l6284p8961k35098l6883m1264R3203j9512m4249J64458K33442
16644A54496j2718j41543j50465j26999j4378J46395J23205j7639l3138j50212
16634b22996K5057R2323j4989j15843m7855J12357L2439J14975J95284k74153
16624a03401j44929K15780o5462k6166J03375J18642J36542J3942k49863r1441
16614i2981m3535p4192J46389p1455j72513j27797Q5700J43221M8997j63320J5938
16603c05548J37957q3644j06612K08815R2959P8827M0717l8411j73170j08292
16593b56402n1994K64702K23005m1909k31408O9344J71649R7570j57512Q782j0862
$$ plain form
16582 84965 82714 -52130 44677 49192 142047 35994 15163 139717 88317 -328350 -289928
16571 -289928 -182750 -291758 -587972 -421075 -14724 185617 181243 -48046 -17790 87253
16561 87253 145652 81964 -101960 -211835 -339937 -50058 -54018 -106607 -86782 -180807 -240254
16550 -240254 -20899 -37068 -41516 -34511 -166993 -83189 26979 -28312 -144240 37038 -73721
16539 -73721 -210855 -108533 -9457 -54858 -56661 -72074 -41692 89372 -61145 -266519 -89025
16528 -89025 -36009 48354 119583 135039 56827 5745 -276911 -313534 -194451 13370 -198053
16517 -198053 -232421 -184998 -89680 -117986 -229371 -468153 -296946 -225480 -125850 -293893 -349274
16506 -349274 -263454 -111326 -84638 74990 101740 120050 -139387 -101248 145625 -22565
$$ packed form
16582H4965k251j34844R6807M515R2855j06053k0831J24554n1400m16667L8422
16571b89928J07178j09008k96214J66897M06351K00341m374k29289L0256J05043
16561H7253N8399o3688j83924j09875j28102K89879l960n2589J9825r4025n9447
16550b40254K19355j6169m448P005j32482Q3804J10168n5291j15928J81278j10759
16539g3721j37134J02322R9076m5401j803j5413L0382J31064j50517k05374J77494
16528h9025N3016Q4363P1229J5456p8212n1082k82656l6623J19083K07821k11423
16517a98053l4368M7423R5318k8306j11385k38782J71207P1466R9630j68043n5381
16506c49274Q5820J52128K6688J59628K6750J8310k59437L8139K46873j68190
$$ plain form
16496 -22565 -176647 -18504 28634 67521 -154557 -175974 710 -127217 -160477 -210555 -236524
16485 -236524 -360348 -394510 -340557 -195766 -250479 -218462 -315708 -300109 -335571 -247094 -402665
16474 -402665 -410527 -280073 -260440 -184950 -382436 -385716 -323062 -347998 -171353 -116002 -29502
16463 -29502 -166416 -363472 -354825 -360151 -466341 -159012 -53573 4179 -68983 -105875 6474
16452 6474 -150188 -272693 -67278 -76239 -194946 -306534 -416199 -494459 -447389 -210814 16836
16441 16836 188047 192425 215160 193100 -58388 -373379 -601842 -439698 62983 -60627
16431 -60627 -287915 -245273 -116000 17442 19735 -240511 -453124 -275698 -34590 -70068
16421 -70068 -151354 -159890 -79880 69409 -79273 -46736 126193 10160 7280 101561 131306
$$ packed form
16496b2565j54082J58143M7138L8887k22078k1417J76684j27927l3260n0078k5969
16485b36524j23824l4162N3953J44791n4713L2017r7246J5599l5462Q8477j55571
16474d02665p862J30454J9633P5490j97486l280O2654k4936J76645N5351Q6500
16463b9502j36914j97056Q647n326j06190L07329J05439N7752p3162l6892J12349
16452F474j56662j22505K05415q961j18707j11588j09665p8260M7070K36575K27650
16441A6836J71211M378K2735k2060k51488l14991k28463J62144N02681j23610
16431f0627k27288M2642J29273J33442K293k60246k12613J77426K41108l5478
16421g0068q1286q536Q0010J49289j48682L2537J72929j16033k880R4281K9745
$$ plain form
16410 131306 193415 114054 41439 188853 354864 376097 158881 -5409 -193961 -221141
16400 -221141 -246242 -245085 -307968 -383654 -253532 -135373 -34925 27577 -60910 -92557 -8262
16389 -8262 -58011 -166757 -261186 -141398 -31185 131082 59046 80789 77987 251031 185802
16378 185802 71013 171692 -40164 -330679 -287022 -316132 -196561 -183152 -214309 -212899 -325410
16367 -325410 -277104 -426893 -272552 -450389 -668718 -553154 -480699 -195931 -61786 -278531
16357 -278531 -358309 -428370 -469462 -299702 -64399 -127629 15071 -204718 -426077 -426874 -330872
16346 -330872 -44092 -49165 36958 55774 -57700 -74691 -87979 -307517 -411893 -430743 -165078
16335 -165078 -45306 -117956 -170385 -44397 148799 19833 -132694 -187945 -158940 213650
$$ packed form
16410A31306O2109p9361p2615J47414J66011K1233k17216j64290j88552k7180
16400b21141k5101J157o2883p5686J30122J18159J00448O2502q8487l1647Q4295
16389h262m9749j08746r4429J19788J10213J62267p2036K1743k802J73044o5229
16378A85802j14789J00679k11856k90515M3657k9110J19571J3409l1157J410j12511
16367c25410M8306j49789J54341j77837k18329J15564P2455K84768J34145k16745
16357b78531p9778p0061m1092J69760K35303o3230J42700k19789k21359p97R6002
16346c30872K86780n073Q6123J8816j13474j6991j3288k19538j04376j8850K65665
16335a65078J19772p2650n2429J25988J93196j28966j52527n5251K9005L72590
$$ plain form
16325 213650 257291 128832 162491 112513 87350 112149 -11199 -166786 -103586 -113283 -26276
16314 -26276 -78984 -172080 -367601 -279756 -179604 95148 129260 32981 -181654 -301206 -537103
16303 -537103 -672703 -801221 -761632 -468664 -282376 -170258 -55975 -94286 -152624 -216184
16293 -216184 -225081 -46460 195871 201291 129284 6772 -837 -98555 -67986 25756 -189543
16282 -189543 -217422 -192542 -180449 153183 383351 367640 -142187 -435922 -431340 -486169 -310696
16271 -310696 -361698 -319255 -337621 -292709 -114860 -67862 -132682 -46734 145458 -129300 -341609
16260 -341609 -377557 -344393 -282405 -90732 147889 63623 -35798 -139799 -93495 -38331 55378
16249 55378 -246436 -463457 -314406 -46253 103548 76446 -17308 -226240 -627824 -694881
$$ packed form
16325B13650M3641j28459L3659m9978k5163K4799j23348j55587O3200r697Q7007
16314b6276n2708r3096j95521Q7845J00152K74752L4112r6279k14635j19552k35897
16303e37103j35600j28518L9589K92968J86288J12118J14283l8311n8338o3560
16293b16184q897J78621K42331N420p2007j22512p609r7718L0569R3742k15299
16282a89543k7879K4880J2093L33632K30168j5711n09827k93735M582n4829J75473
16271c10696n1002M2443j8366M4912J77849M6998o4820Q5948J92192k74758k12309
16260c41609l5948L3164O1988J91673K38621q4266r9421j04001M6304N5164R3709
16249E5378l01814k17021J49051K68153J49801k7102r3754k08932m01584o7057
$$ plain form
16239 -694881 -532981 -186685 -42049 -19960 -258946 -315239 -369342 -190992 -103167 134841
16229 134841 285903 387210 606796 519203 219574 139452 -46640 -268815 -212495 -399048
16219 -399048 -420697 -332629 -393917 -385508 -250785 -213696 -208428 -143583 40949 91153 -58186
16208 -58186 -348449 -196800 -109813 -443683 -379705 -130137 99971 114916 -20957 43974
16198 43974 280235 114040 -183634 -216996 52560 263651 207920 261990 71380 -53139
16188 -53139 -271444 -177254 -19579 215512 303029 184825 -19455 -16658 -137350 -258040
16178 -258040 -329790 -173944 -149291 -376815 -106952 -30147 -117798 -269946 -141906 4630
16168 4630 12526 -42408 74229 392479 356971 272795 15257 -205159 -320959 -425091 -307572
$$ packed form
16239f94881J61900L46296J44636K2089k38986n6293n4103J78350Q7825K38008
16229A34841J51062J01307K19586q7593k99629q0122j86092k22175N6320j86553
16219c99048k1649Q8068o1288Q409J34723L7089N268O4845J84532N0204j49339
16208e8186k90263J51649Q6987l33870O3978K49568K30108J4945j35873O4931
16198D3974K36261j66195k97674l3362K69556K11091n5731N4070j90610j24519
16188e3139k18305R4190J57675K35091Q7517j18204k04280K797j20692j20690
16178b58040p1750J55846K4653k27524K69863P6805q7651j52148J28040J46536
16168D630P896n4934J16637L18250l5508q4176k57538k20416j15800j04132J17519
$$ plain form
16157 -307572 -229406 -166901 -93464 -106774 -418314 -508585 -285327 -77228 186720 306465
16147 306465 146373 117290 -98948 -12855 250994 341635 345717 336368 415154 229520 228980
16136 228980 70449 -42162 20156 11467 -105620 -138759 -365095 -389017 -466626 -555659 -403831
16125 -403831 -157550 -134853 -138604 -165495 -72671 -40469 -145680 -318313 -260492 -169984 -427421
16114 -427421 -685135 -515889 -298413 -365774 -195117 -172926 -82813 21434 32913 1541
16104 1541 89991 251668 343630 274236 -120192 -243921 -271328 -84516 -252919 -148940 124636
16093 124636 -50029 -346835 -125073 -61116 18716 -17350 -4777 -169505 -267900 -288945 -155934
16082 -155934 -125629 22419 -80846 -253311 -112183 -204092 -258684 -570129 -733601 -516886
$$ packed form
16157c07572P8166O2505P3437j3310l11540r0271K23258K08099K63948J19745
16147C06465j60092k9083k16238Q6093K63849R0641M082r349P8786j85634n40
16136B28980j58531j12611O2318q689j17087l3139k26336k3922p7609q9033J51828
16125d03831K46281K2697l751k6891R2824L2202j05211j72633N7821R0508k57437
16114d27421k57714J69246K17476o7361J70657K2191R0113J04247J1479l1372
16104A541Q8450J61677R1962o9394l94428j23729k7407J86812j68403J03979K73576
16093A24636j74665k96806K21762O3957P9832l6066J2573j64728r8395k1045J33011
16082a55934L0305J48048j03265j72465J41128r1909n4592l11445j63472K16715
$$ plain form
16072 -516886 -236621 -265586 -491021 -426901 -281336 -262346 -259221 -279231 -90529 60335 -8267
16061 -8267 -196146 -223577 -187802 -338454 -397262 -46543 -28790 155174 274099 255467 209144
16050 209144 61721 154795 7587 8381 -24438 -241774 -218563 -171460 133630 138377 120836
16039 120836 -31642 -275860 -309882 -123329 -77521 -135143 -24216 -30408 -6500 -74676 49199
16028 49199 136200 212619 104949 -89436 -58704 -200047 -347869 -494734 -328414 -74778
16018 -74778 -38315 103802 18429 -2384 -117793 -73343 -174410 -264256 -251129 -437736 -173985
16007 -173985 125888 142124 90630 202218 187463 246370 410373 506555 327472 -77722
15997 -77722 -345165 -441877 -431782 -385957 -591774 -568436 -820905 -775583 -274417 147657 106579
$$ packed form
16072e16886K80265k8965k25435O4120J45565J8990L125k0010J88702J50864o8602
16061h267j87879k7431L5775j50652n8808L50719J7753J83964J18925j8632m6323
16050B09144j47423R3074j47208P94l2819k17336K3211M7103L05090M747j7541
16039A20836j52478k44218l4022J86553M5808n7622J10927o192K3908o8176J23875
16028D9199Q7001P6419j07670j94385L0732j41343j47822j46865J66320K53636
16018g4778L6463J42117q5373k0813j15409M4450j01067q9846J3127j86607K63751
16007a73985K99873J6236n1494J11588j4755N8907J64003R6182j79083m05194
15997g7722k67443r6712J0095M5825k05817K3338k52469M5322N01166M22074m1078
$$ plain form
15986 106579 48451 -1927 -148157 -386045 -408474 -137905 -11330 -167990 -259984 -196556
15976 -196556 -19200 8472 48141 116791 34237 -113824 -73474 -221698 -395750 -648527
15966 -648527 -797694 -380785 -270062 -538857 -568697 -540121 -446009 -267162 -152131 -83844
15956 -83844 23140 145608 193274 174459 197173 179696 123929 -20174 9426 88258 19085
15945 19085 139055 238085 430726 632882 668254 432513 235861 105485 -31818 -105706
15935 -105706 -212679 -114463 -158187 -257090 38390 124945 59456 87509 116015 -25513 -10711
15924 -10711 -285654 -296004 136711 251348 396806 283668 22893 -204844 -288580 -268725
15914 -268725 -14455 157994 -63853 -122241 -49090 31505 32364 25326 132540 126654 99376
$$ packed form
15986A06579n8128n0378j46230k37888k2429K70569J26575j56660r1994O3428
15976a96556J77356K7672L9669O8650q2554j48061M0350j48224j74052k52777
15966f48527j49167M16909J10723k68795k9840K8576R4112J78847J15031O8287
15956h3844J06984J22468M7666j8815K2714j7477n5767j44103K9600P8832o9173
15945A9085J19970R9030J92641K02156L5372k35741j96652j30376j37303p3888
15935a05706j06973R8216m3724r8903K95480Q6555o5489K8053K8506j41528J4802
15924a0711k74943j0350M32715J14637J45458j13138k60775k27737q3736J9855
15914b68725K54270J72449k21847n8388P3151Q0595Q59p038J07214n886k7278
$$ plain form
15903 99376 -139873 -214758 -256129 -226672 17533 249203 369601 191537 -126356 -178007
15893 -178007 -160668 -32240 69492 -126656 -205468 32525 -17933 135322 131426 271212
15883 271212 219963 116586 44050 71196 70948 61416 235229 130452 -17035 -32434 -151951
15872 -151951 -172918 -273498 -381467 -372879 -152539 252627 422707 224091 -16460 51428
15862 51428 207558 234955 250623 247430 339986 202803 -98187 -75025 269011 663725 679513
15851 679513 349017 22695 -150824 -142253 24278 20004 49980 -186764 -345770 -172886
15841 -172886 -66762 -149063 -262881 4262 -150128 -142365 9450 33133 117532 95639 150074
15830 150074 139213 -17471 -118539 -92195 -15709 -123421 -155694 -16224 -3083 -147826
$$ packed form
15903I9376k39249p4885m1371K9457K44205K31670J20398j78064l17893n1651
15893a78007J7339J28428J01732j96148p8812K37993n0458J53255l896J39786
15883B71212n1249j03377p2536K7146k48r532J73813j04777j47487j5399j19517
15872a51951k0967j00580j07969Q588K20340M05166J70080j98616k40551O7888
15862E1428J56130K7397J5668l193R2556j37183l00990K3162L44036L94714J5788
15851F79513l30496l26322j73519Q571J66531m274K9976k36744j59006J72884
15841a72886J06124q2301j13818K67143j54390P763J51815K3683Q4399k1893N4435
15830A50074j0861j56684j01068K6344P6486j07712l2273J39470J3141j44743
$$ plain form
15820 -147826 -223809 -395526 -307065 -206196 46634 -68799 -114173 -109266 -315622 -156208
15810 -156208 18047 70868 -124602 -181208 -280023 -179482 -306349 -396367 -334206 -241722 -199658
15799 -199658 -193906 -66465 49993 -225538 -307846 -284817 -178957 -75275 60395 23481
15789 23481 197254 130362 4407 19697 156560 237219 331435 443872 212867 -248727
15779 -248727 -277660 -305112 -338517 -153959 -177442 12759 32398 -8995 54551 229991 158288
15768 158288 -105878 -293763 -311173 -230103 -206097 -75950 -223016 -193945 -18255 236722
15758 236722 126356 -32274 -50507 -50675 -175919 -272313 -206934 -355960 -358809 -206598 -292217
15747 -292217 -202720 -133278 -212352 -263489 -134944 -251908 -122666 -286869 -607412 -280599
$$ packed form
15820a47826p5983j71717Q8461J00869K52830j15433m5374M907k06356J59414
15810a56208J74255N2821j95470n6606r8815J00541j26867r0018O2161R2484M2064
15799a99658N752J27441J16458k75531q2308K3029J05860J03682J35670l6914
15789B3481J73773o6892j25955J5290J36863Q0659R4216J12437k31005m61594
15779b48727k8933k7452l3405J84558k3483J90201J9639m1393O3546J75440p1703
15768A58288k64166j87885j7410Q1070K4006J30147j47066K9071J75690K54977
15758B36722j10366j58630j8233j68j25244r6394O5379j49026k849J52211q5619
15747b92217Q9497O9442p9074n1137J28545j16964J29242j64203l20543L26813
$$ plain form
15737 -280599 11660 137819 202101 211095 124650 -151499 -308671 -217691 -93884 -167659 11812
15726 11812 -32409 -113303 45508 270734 501919 468617 442292 359194 171385 297747 317476
15715 317476 178935 24608 -187151 -142241 -20324 -32833 31029 264689 369864 220861
15705 220861 56231 -203659 -147921 -61464 -35029 192342 243633 225325 -50192 -182946
15695 -182946 -299740 -152801 -141504 -300107 -232752 -58418 212679 274112 540879 780993
15685 780993 749807 518823 315850 98933 -39443 -71032 -141944 -44867 -59371 -111033 -50872
15674 -50872 259088 253760 134663 180830 55527 -90117 -127479 -257143 -312208 -417438 -299802
15663 -299802 -174159 34303 385348 61158 -33408 -30615 -124066 -64041 32206 104794 -61296
$$ packed form
15737b80599K92259J26159O4282Q994q6445k76149j57172R0980J23807p3775J79471
15726A1812m4221q0894J58811K25226K31185l3302k6325q3098j87809J26362J9729
15715C17476j38541j54327k11759M4910J21917j2509O3862K33660J05175j49003
15705B20861j64630k59890N5738Q6457K6435K27371N1291j8308k75517j32754
15695a82946j16794J46939J1297j58603O7355J74334K71097O1433K66767K40114
15685G80993l1186k30984k02973k16917j38376l1589p0912R7077j4504n1662O0161
15674e0872L09960n328j19097M6167j25303j45644l7362j29664n5065j05230J17636
15663b99802J25643K08462L51045l24190r4566K793r3451O0025R6247P2588j66090
$$ plain form
15652 -61296 -263905 -262343 -168447 2280 -70248 -280466 -372619 -181926 -31144 -141638 -283642
15641 -283642 -566560 -682681 -560640 -468579 -273532 -233773 -377306 -381026 -90393 79214
15631 79214 28593 -113880 -160495 -31065 -114453 -238776 -355089 -266347 -406434 -417704 -235822
15620 -235822 -66751 293874 264238 98901 111605 104844 277345 303337 260445 167892 139528
15609 139528 -58552 -186528 -155852 -138999 -194281 -209179 -271401 -141771 89276 207219
15599 207219 207527 136884 115278 219881 188761 23753 251227 377299 327982 100243 -159902
15588 -159902 -261826 -279089 -451998 -345017 -88441 -196681 -388753 -244665 47530 32183
15578 32183 31060 127561 -16930 -186295 -168346 -274128 29454 5928 -75764 147964 54786
$$ packed form
15652f1296k02609J562R3896J70727p2528k10218r2153J90693J50782j10494j42004
15641b83642k82918j16121J22041R2061J95047L9759j43533l720K90633J69607
15631G9214n0621j42473m6615J29430q3388j24323j16313Q8742j40087j1270J81882
15620b35822J69071L60625k9636j65337J2704o761J72501K5992m2892r2553k8364
15609A39528j98080j27976L0676J6853n5282j4898o2222J29630K31047J17943
15599B07219L08p0643k1606J04603l1120j65008K27474J26072m9317k27739k60145
15588a59902j01924j7263j72909J06981K56576j08240j92072J44088K92195j5347
15578C2183j123R6501j44491j69365J7949j05782L03582k3526q1692K23728r3178
$$ plain form
15567 54786 -221887 -159486 70758 -47249 -66040 252105 419328 311391 -147576 -219185
15557 -219185 -113819 -19580 -221818 -296571 -24775 13365 20482 -158567 -13654 -378311
15547 -378311 -622478 -567175 -534947 -464642 -263685 -25585 -141924 193997 40249 -191095
15537 -191095 -10604 -133502 3843 81142 162994 229404 70701 -176120 -72985 -26313
15527 -26313 -186837 -174406 -460959 -320863 -233556 -66878 49268 -136486 -382827 -450677
15517 -450677 -595234 -597045 -587792 -559631 -572319 -632880 -632484 -629579 -750165 -583208 -149213 -381462
15505 -381462 -412279 -301920 -443717 -280970 -76589 54245 242420 -46218 -248975 -232015
15495 -232015 -263706 -236203 -184442 -279294 -261274 -244984 -335247 -227452 -138319 -270305 -303288
$$ packed form
15567E4786k76673O2401K30244j18007j8791L18145J67223j07937m58967p1609
15557b19185J05366R4239k02238p4753K71796L8140P117j79049J44913l64657
15547c78311k44167N5303L2228P0305K00957K38100j16339L35921j53748k31344
15537a91095J80491j22898J37345P7299Q1852O6410j58703k46821J03135M6672
15527b6313j60524J2431k86553J40096Q7307J66678J16146j85754k46341o7850
15517d50677j44557j811R253K8161j2688o0561L96K905j20586J66957M33995k32249
15505c81462l0817J10359j41797J62747K04381J30834J88175k88638k02757J6960
15495b32015l1691K7503N1761r4852J8020J6290r0263J07795Q9133j31986l2983
$$ plain form
15484 -303288 -70751 -91620 50052 157065 -37870 -324095 -191110 74120 126445 -21837
15474 -21837 -124278 -78871 23086 265797 370783 296922 174997 264247 133587 83913
15464 83913 48313 12329 -116972 -235165 -51437 -13880 -166616 -177490 -173949 -101600 7320
15453 7320 218853 184850 16901 -65016 -145721 35806 19471 -280231 -395587 -314956 -260918
15442 -260918 -361914 -477310 -312454 -123703 37362 118326 -178039 -236762 -218775 -341970
15432 -341970 -402076 -355809 -232271 -9802 17869 73951 4035 -330209 -431917 -331795
15422 -331795 -207161 -214700 -224870 -269150 -263599 -256660 -272214 79245 174123 20788 -155237
15411 -155237 -38885 -135833 -393459 -386307 -339322 -360806 -329120 -196699 3926 73290 -106826
$$ packed form
15484c03288K32537k0869J41672J07013j94935k86225J32985K65230N2325j48282
15474b1837j02441M5407J01957K42711J04986p3861j21925Q9250j30660m9674
15464H3913l5600l5984j29301j18193J83728L7557j52736j0874L541P2349J08920
15453G320K11533l4003j67949q1917q0705J81527j6335k99702j15356Q0631N4038
15442b60918j00996j15396J64856J88751J61065Q0964k96365n8723J7987j23195
15432c41970o0106M6267J23538K22469K7671N6082o9916l34244j01708J00122
15422c31795J24634p539j0170m4280N551O939j5554L51459R4878j53335j76025
15411a55237J16352r6948k57626P152M6985k1484L1686J32421K00625O9364j80116
$$ plain form
15400 -106826 -133181 -164964 -279528 -162673 -50390 28709 -39947 86898 155913 -60550
15390 -60550 -53304 -92138 -272342 -201298 61604 86879 -24925 -49476 -79253 49977 -13913
15379 -13913 -59336 -162556 -146007 -72387 -90404 -7593 47933 62011 188463 24873 200722
15368 200722 113472 -17931 -108536 -92972 -86233 -135891 -322238 -485919 -407932 -217605 -136681
15357 -136681 -77408 -138250 -281921 -294038 -600801 -392131 -322130 -205275 117340 189744
15347 189744 58876 34187 -32923 -157767 -149395 -24975 37904 76815 136554 197913 257884
15336 257884 55655 64276 123471 225831 22488 -44346 -135046 -235997 -43729 -164704
15326 -164704 -54801 81960 93921 -12640 -155510 -8008 -90355 -159494 55926 396439
$$ packed form
15400a06826k6355l1783j14564J16855J12283P9099o8656J26845O9015k16463
15390f0550P246l8834j80204P1044K62902K5275j11804k4551k9777J29230o3890
15379a3913m5423j03220J6549P3620j8017Q2811N5526J4078J26452j63590J75849
15368B00722q7250j31403r0605J5564O739m9658j86347j63681P7987J90327Q0924
15357a36681N9273o0842j43671j2117l06763K08670P0001J16855L22615P2404
15347A89744j30868k4689o7110j24844Q372J24420O2879L8911N9739O1359N9971
15336B57884k02229Q621N9195J02360k03343o6834r0700j00951J92268j20975
15326a64704J09903J36761J1961j06561j42870J47502q2347o9139K15420L40513
$$ plain form
15316 396439 356065 325902 161104 135476 205153 240907 71123 54189 182124 280035 327190
15305 327190 88982 -108725 59103 94259 267129 284780 229301 46734 -7501 129592
15295 129592 130759 -132848 -282850 -250334 -294478 -315100 -196034 -43403 -177761 -164088 -84577
15284 -84577 19544 251021 264787 453266 510228 342904 252489 42565 -171586 -97273
15274 -97273 -87011 -191237 -399134 -301316 -84866 108631 -21221 11769 72995 89549 67486
15263 67486 35772 127545 -98161 -265945 -153589 -60292 -35859 10417 123182 281951 308612
15252 308612 -2863 171786 275271 202125 377504 442398 160068 36949 157688 280195
15242 280195 352389 287660 -78719 25466 95273 155725 -12591 1735 -19941 -105025 1783
$$ packed form
15316C96439m0374l0163j64798k5628O9677L5754j69784j6934J27935R7911M7155
15305C27190k38208j97707J67828L5156J72870J7651n5479j82567n4235J37093
15295A29592J167k63607j50002L2516m4144k0622J19066J52631j34358J3673P9511
15284h4577J04121K31477J3766J88479N6962j67324r0415k09924k14151P4313
15274i7273J0262j04226k07897R7818K16450J93497j29852L2990O1226J6554k2063
15263F7486l1714R1773k25706j67784J12356R3297K4433M6276J12765J58769K6661
15252C08612l11475J74649J03485p3146J75379O4894k82330j23119J20739J22507
15242B80195P2194o4729l66379J04185O9807O0452j68316J4326k1676q5084J06808
$$ plain form
15231 1783 -65721 11517 48313 -95210 -292945 -349418 -197883 -291899 -429207 -441276 -358558
15220 -358558 -228776 -91707 -104687 4966 5319 -120093 34838 64429 193818 176342 20769
15209 20769 -58553 -27677 76292 -45303 -78525 -25758 17783 125728 43323 -176104 -253736
15198 -253736 26883 282032 -3938 -94343 2627 9241 74362 -12797 -20427 14772 162499
15187 162499 106331 -22059 -185409 -351361 -217906 -38069 -40547 -389013 -516298 -315428
15177 -315428 -341811 -309195 -110081 294 -83295 -89652 -45334 -84196 48498 103209 -110987
15166 -110987 -98670 -172714 -215537 -241054 -260319 -256204 -53743 -186659 -319640 -367139 -498933
15155 -498933 -561158 -254068 -109090 -99689 47617 73530 -52915 -134004 -297287 -386176 -446871
$$ packed form
15231A783o7504P7238L6796j43523j97735n6473J51535r4016j37308j2069Q2718
15220c58558J29782J37069j2980J09653L53j25412J54931K9591J29389j7476j55573
15209B0769p9322L0876J03969j21595l3222N2767M3541J07945q2405k19427p7632
15198b53736K80619K55149k85970r0405R6970O614O5121q7159p630L5199J47727
15187A62499n6168j28390j63350j65952J33455J79837k478l48466j27285K00870
15177c15428k6383L2616J99114J10375q3589o357M4318l8862J32694N4711k14196
15166a10987J2317p4044m2823k5517j9265M115K02461j32916j32981m7499j31794
15155d98933o2225L07090J44978R401J47306K5913j26445q1089j63283q8889o0695
$$ plain form
15144 -446871 -278284 -17734 7547 -96306 149114 186297 297196 323538 221458 254888
15134 254888 242948 108434 -172839 -153898 -41963 -45757 115656 433080 560353 356359
15124 356359 234984 354499 354983 147424 121783 144643 143823 159423 239470 -138054 -26578
15113 -26578 6591 -15876 -14580 -158752 -352114 -355736 -524206 -532855 -245178 -20039 124814
15102 124814 -9020 -276389 -511092 -474497 -230047 -153720 -156234 -145512 4602 26834 242182
15091 242182 179569 -16018 -147061 6781 -22497 26445 148160 249480 221823 -8922
15081 -8922 -73688 172258 231077 211736 104610 160904 19786 -104184 -33368 135280 231767
15070 231767 106888 311462 337191 177808 99189 44508 111174 -52170 -56613 -88035 32128
$$ packed form
15144d46871J68587K60550K5281j03853K45420L7183J10899K6342j02080L3430
15134B54888j1940j34514k81273J8941J11935l794J61413L17424J27273k03994
15124C56359j21375J19515M84k07559k5641K2860q20J5600Q0047l77524J11476
15113b6578L3169k2467J296j44172j93362l622j68470q649K87677K25139J44853
15102A24814j33834k67369k34703L6595K44450P6327k514J0722J50114K2232K15348
15091B42182o2613j95587j31043J53842k9278M8942J21715J01320k7657k30745
15081h922o4766K45946N8819j9341j07126N6294j41118j23970P0816J68648R6487
15070B31767j24879K04574K5729j59383p8619n4681O6666j63344m443l1422J20163
$$ plain form
15059 32128 31431 -149035 -102285 -50021 -70367 -86710 34536 160070 275232 359391 245770
15048 245770 183971 222777 176817 79848 342448 432925 182554 1761 -95761 -203295 -162985
15037 -162985 -57097 109554 321316 262507 444268 462176 159240 252943 387196 437312
15027 437312 511578 694871 511794 432979 306953 175532 164346 328075 588565 730080
15017 730080 1157225 1124287 1285867 1787099 2175154 2643906 3055341 3829899 5133462 7072482
15007 7072482 10585522 17257816 27891294 36124132 32373915 22961258 15859851 11178233
14999 11178233 8200275 6136077 4663064 3612860 2808064 2169063 1711812 1619455 1488221
14990 1488221 1053597 779131 669759 706698 442223 493291 562274 400627 217298 50138
$$ packed form
15059C2128o97j80466M6750N2264k0346j6343J21246J25534J15162Q4159j13621
15048B45770o1799L8806m5960r6969K62600R0477k50371j80793r7522j07534M0310
15037a62985J05888J66651K11762n8809J81761J7908l02936R3703J34253N0116
15027D37312P4266J83293j83077p8815j26026j31421j1186J63729K60490J41515
15017G30080M27145l2938J61580N01232L88055M68752M11435P74558J303563J939020
15007G072482L513040O672294J0633478Q232838l750217r412657p101407m681618
14999A1178233k977958k064198j473013j050204q04796o39001m57251r2357j31234
14990A488221m34624k74466j09372L6939k64475N1068O8983j61647j83329j67160
$$ plain form
14980 50138 55943 193699 271934 242130 207022 124200 -50623 44944 235113 34629 93728
14969 93728 396490 459641 355548 382978 217680 235810 370624 297317 167059 141987 149207
14958 149207 35829 -33394 51058 19151 86126 263540 442577 470901 471653 336694 351178
14947 351178 450211 453698 289592 218823 107646 217055 424067 300598 25144 -129310
14937 -129310 -43908 -19205 168232 99990 -155850 -176694 -90328 129573 253884 237194 245874
14926 245874 86684 -38146 -229664 -254200 -163991 -174340 -163349 -192298 -145312 -29132 -65699
14915 -65699 -99860 30585 -9467 -97263 -76597 -130709 -195050 -228126 -233763 -234950 -185529 -277097
14903 -277097 -469747 -349366 -139669 -151264 -313752 -204881 -283839 -238733 -186234 -8622
$$ packed form
14980E0138N805J37756P8235k9804l5108q2822j74823R5567J90169k00484N9099
14969I3728L02762O3151j04093K7430j65298J8130J34814p3307j30258k5072P220
14958A49207j13378o9223Q4452l1907O6975J77414J79037K8324P52j34959J4484
14947C51178R9033L487j64106p0769j11177J09409K07012j23469k75454j54454
14937a29310Q5402K4703J87437o8242k55840k0844Q6366K19901J24311j6690Q680
14926B45874j59190j24830j91518k4536R0209j0349J0991k8949M6986J16180l6567
14915f5699l4161J30445m0052q7796K0666n4112o4341l3076n637j187M9421r1568
14903b77097j92650J20381K09697j1595j62488J08871p8958M5106N2499J77612
$$ plain form
14893 -8622 183666 195505 -85652 -400042 -530873 -284984 -121387 -229000 -457092 -486288
14883 -486288 -300126 16760 283018 186163 118753 -146037 -201525 -191625 -202009 -124053 -281852
14872 -281852 -272858 -204965 -135280 161646 199392 64116 208253 532843 434595 463188 669008
14861 669008 968784 863068 710441 831563 956788 983384 780029 943533 994578 837245
14851 837245 769781 910559 806745 646883 655303 659119 480005 342825 354506 305641 168094
14840 168094 293534 292347 218729 179719 215121 183653 266482 398269 463106 301397 198774
14829 198774 291760 478383 834235 980723 1074147 1014308 1110025 1287059 1441967 1383773
14819 1383773 1391083 1277702 1198655 1185412 1202019 1067147 672061 231144 36142 -2202
$$ packed form
14893h622J92288J1839k81157l14390j30831K45889J63597j07613k28092k9196
14883d86288J86162L16886K66258r6855o7410k64790n5488R900j0384P7956j57799
14872b81852Q994O7893O9685K96926L7746j35276J44137L24590r8248K8593K05820
14861F69008K99776j05716j52627J21122J25225K6596k03355J63504N1045j57333
14851H37245o7464J40778j03814j59862Q420L816j79114j37180J1681m8865j37547
14840A68094J25440j187p3618l9010L5402l1468Q2829J31787O4837j61709j02623
14829A98774R2986J86623L55852J46488R3424n9839R5717J77034J54908n8194
14819A383773P310j13381p9047j3243J6607j34872l95086m40917j95002l8344
$$ plain form
14809 -2202 -45460 222534 426404 452057 530686 605260 704127 475043 522301 384701 -37508
14798 -37508 -211621 41896 64846 155969 388465 272482 709 -222185 -312395 -239494
14788 -239494 -141963 64409 113226 -8420 -128063 72244 109514 41897 -2078 107125
14778 107125 -40135 -111600 -173819 -366866 -445523 -299980 7752 -30018 -72437 -178 -75368
14767 -75368 -84356 157749 87829 -212901 -362973 -224077 -33931 14578 -18006 -66786 -317735
14756 -317735 -345526 -428158 -167595 139232 235853 -17144 -202067 -183684 -230648 -343364
14746 -343364 -118501 110446 227037 320765 224123 124326 4691 174987 435170 349650
14736 349650 307052 260153 123233 129987 172787 252618 432041 237557 38517 -94338 -245981
$$ packed form
14809b202m3258K67994K03870K5653P8629P4574R8867k29084M7258j37600m22209
14798c7508j74113K53517K2950R1123K32496j15983k71773k22894r0210P2901
14788b39494R7531K06372M8817j21646j19643K00307L7270o7617m3975J09203
14778A07125j47260p1465o2219j93047p8657J45543L07732l7770m2419P2259p5190
14767g5368q988K42105o9920l00730j50072J38896J90146M8509l2584m8780k50949
14756c17735k7791q2632K60563L06827R6621k52997j84923J8383m6964j12716
14746c43364K24863K28947J16591R3728r6642r9797j19635J70296K60183q5520
14736C49650m2598m6899j36920O754M2800P9831J79423j94484j99040j32855j51643
$$ plain form
14725 -245981 -107342 3259 -93981 -144454 -338130 -298831 -75968 -153125 -58398 64385
14715 64385 204680 206929 19012 -122584 33542 343348 374393 313298 368425 300452 99499
14704 99499 180481 175750 278537 348316 255594 166654 255886 212082 145502 253776 760910
14693 760910 820498 542841 231680 104078 199581 244628 75674 109506 22621 -116959
14683 -116959 -345064 -123981 -206149 -248806 -92713 -42403 -175682 -79678 -7709 26409 104122
14672 104122 331145 206389 11433 -173615 -269653 -89586 -53541 -92662 16372 33240
14662 33240 -139974 -334926 -443679 -198473 15088 -87469 -37193 101478 164289 393588
14652 393588 246593 107809 124403 6450 -210205 -248608 -192848 -139120 30791 165026
$$ packed form
14725b45981J38639J10601r7240n0473j93676L9299K22863p7157R4727J22783
14715F4385J40295K249j87917j41596J56126L09806L1045o1095N5127o7973k00953
14704I9499Q0982m731J02787O9779r2722q8940Q9232m3804o6580J08274N07134
14693G60910N9588k77657l11161j27602R5503M5047j68954L3832q6885j39580
14683a16959k28105K21083q2168m2657J56093N0310j33279R6004P1969L4118P7713
14672A04122K27023j24756j94956j85048r6038J80067L6045l9121J09034J6868
14662C3240j73214j94952j08753K45206K13561j02557N0276J38671O2811K29299
14652C93588j46995j38784J6594j17953k16655l8403N5760N3728J69911J34235
$$ plain form
14642 165026 -104572 -333526 -468208 -407917 -248656 -114068 27913 -78741 -30032 11651
14632 11651 -43059 -12939 -22823 193910 456887 411900 323248 151809 242834 244438 196931
14621 196931 -52023 -168265 -29 358011 434689 413017 493776 391050 219538 328954
14611 328954 218089 202085 333734 302650 119813 -66581 154995 279856 460527 345460
14601 345460 79294 39533 104129 229481 422909 487471 449364 257181 114326 322316
14591 322316 254808 -251283 -309635 -24246 132245 229377 288034 317035 183944 186358 164174
14580 164174 171671 22570 -37204 44111 297050 464739 460058 225381 159707 294270 305656
14569 305656 153257 303992 440106 250580 184818 218657 314573 487225 473315 550772
$$ packed form
14642A65026k69598k28954j34682O0291J59261J34588J41981j06654M8709M1683
14632A1651n4710L0120r884K16733K62977m4987q8652j71439R1025J604m7507
14621A96931k48954j16242J68236L58040P6678k1672Q0759j02726j71512J09416
14611C28954j10865j6004J31649l1084j82837j86394K21576J24861J80671j15067
14601C45460k66166l9761O4596J25352J93428O4562l8107j92183j42855K07990
14591C22316o7508n06091n8352K85389J56491R7132N8657K9001j33091K414k2184
14580A64174P497j49101n9774Q1315K52939J67689m681k34677o5674J34563J1386
14569C05656j52399J50735J36114j89526o5762L3839R5916J72652j3910P7457
$$ plain form
14559 550772 398092 354948 589489 751692 476403 245514 185262 294400 219482 333049
14549 333049 407350 572946 765154 728662 443151 506672 370102 268477 164517 234286
14539 234286 284711 315970 372950 407577 286127 62506 41810 208388 414400 519505
14529 519505 291848 123714 -54933 -17154 256340 538281 402583 343900 552127 502043
14519 502043 516928 608354 433271 388980 534620 581997 402362 261832 513763 541447
14509 541447 747513 729529 827118 940833 889998 782099 852266 1041720 1011517 875983
14499 875983 777906 842617 1149263 1176304 1042400 839851 947808 996396 921836 878176 922425
14488 922425 788348 1049209 1079725 797739 916124 1055776 1032316 1130000 985576 662604
$$ packed form
14559E50772j52680m3144K34541J62203k75289k30889o0252J09138p4918J13567
14549C33049P4301J65596J92208l6492k85511O3521j36570j01625j03960O9769
14539B34286N0425L1259N6980L4627j21450k23621k0696J66578K06012J05105
14529E19505k27657j68134j78647L7779K73494K81941j35698n8683K08227n0084
14519E02043J4885R1426j75083m4291J45640M7377j79635j40530K51931K7684
14509E41447K06066j7984R7589J13715n0835j07899P0167J89454l0203j35534
14499H75983r8077O4711L06646K7041j33904k02549J07957M8588p4560m3660M4249
14488I22425j34077K60861L0516k81986J18385J39652k3460R7684j44424l22972
$$ plain form
14478 662604 496462 541706 920528 1019311 713091 492418 496624 747520 1016213 1370747
14468 1370747 1190572 927578 1108428 1319863 1240456 1172568 1156713 1196827 1198216 1366492
14458 1366492 1244546 1268768 1754764 1977220 2085253 2198191 2236207 2096218 2380021 2721016
14448 2721016 2733967 3039686 3141136 3165858 3226353 3572338 3909317 4226999 4494061 4565379
14438 4565379 4784602 5172708 5381690 5610471 6009940 6378984 6914067 7422162 7985550
14429 7985550 9175799 10395626 11460448 12905320 14541981 16473204 18528663 20884322
14421 20884322 23896266 27534487 32027844 37701352 45167642 55189870 68554144 86245314
14413 86245314 109467348 138088662 168037264 192369000 205858160 210151982 212259175
$$ packed form
14478F62604j66142M5244L78822R8783l06220k20673M206K50896K68693L54534
14468A370747j80175k62994J80850K11435p9407o7888j5855M0114J389J68276
14458A366492j21946K4222M85996K22456J08033J12938L8016j39989K83803L40995
14448B721016J2951L05719J01450K4722O0495L45985L36979L17682K67062P1318
14438D565379K19223L88106K08982K28781L99469L69044N35083N08095N63388
14429G985550J190249J219827J064822J444872J636661J931223K055459K355659
14421B0884322L011944L638221M493357N673508P466290J0022228J3364274J7691170
14413H6245314K3222034K8621314K9948602K4331736J3489160M293822K107193
$$ plain form
14406 212259175 217217359 224120636 226461162 217698681 197958030 173164771 148796320
14399 148796320 127816231 110286031 96139577 85149647 76786425 70238252 65187055
14392 65187055 61698065 59170458 57251751 55979060 55498015 55940385 57157939 59026429
14384 59026429 61915197 65690720 70569728 77551887 87341405 100270894 117111806 138945253
14376 138945253 165106464 192246131 213748172 223607741 223376563 220584841 220563345 222598805
14368 222598805 220362086 207374936 183705473 155162874 127956623 104685245 85850118
14361 85850118 70970118 59301378 50061320 42777581 36930065 32126001 28537734 25629185
14353 25629185 23207273 20901599 18774092 16827105 15218634 13750795 12720845 11669264
$$ packed form
14406B12259175M958184O903277K340526q762481j9740651k4793259k4368451
14399A48796320k0980089j7530200j4146454j0989930q363222o548173n051197
14392F5187055l488990k527607j918707j272691m81045M42370J217554J868490
14384E9026429K888768L775523M879008O982159R789518J2929489J6840912K1833447
14376A38945253K6161211K7139667K1502041R859569k31178k791722k1496K035460
14368B22598805k236719j2987150k3669463k8542599k7206251k3271378j8835127
14361H5850118j4880000j1668740r240058p283739n847516m804064l588267k908549
14353B5629185k421912k305674k127507j946987j608471j467839j029950j051581
$$ plain form
14345 11669264 10669663 9693063 9001142 8563768 8023964 7680819 7025168 6495694 6056072
14336 6056072 5604748 5252524 4849044 4697193 4504240 4259583 4104566 4062338 3804299 3605646
14326 3605646 3575228 3500940 3281982 3134544 2799821 2673168 2763999 2718413 2555258 2426859
14316 2426859 2407532 2267948 2086966 2037931 1929438 1938037 1923588 1625558 1450731 1438384
14306 1438384 1364460 1493174 1515850 1328382 1417864 1511623 1424377 1307155 1118677 931611
14296 931611 844918 943979 1022110 1079146 1042833 1036678 1137210 1138488 1114871 776100 580082
14285 580082 795125 813035 964857 1001874 902959 943447 1040002 833158 846877 833063 847351
14274 847351 842428 691818 517321 481408 611861 864704 914012 1039625 895979 788368
$$ packed form
14345A1669264r99601r76600o91921m37374n39804l43145o55651n29474m39622
14336F056072m51324l52224m03480j51851j92953k44657j55017m2228k58039j98653
14326C605646l0418p4288k18958j47438l34723j26653R0831m5586j63155j28399
14316B426859j9327j39584j80982m9035j08493Q599j4449k98030j74827j2347
14306A438384p3924J28714K2676j87468Q9482R3759q7246j17222j88478j87066
14296I31611q6693R9061P8131N7036l6313o155J00532J278k3617l38771j96018
14285E80082K15043J7910J51822L7017r8915M0488R6555k06844J3719j3814J4288
14274H47351m923j50610j74497l5913J30453K52843M9308J25613j43646j07611
$$ plain form
14264 788368 781755 633638 366703 362288 575635 722398 840138 886382 763847 600262
14254 600262 429056 70873 -46921 134174 425464 485298 660749 863136 734384 359306
14244 359306 297816 653263 674208 506248 400894 352844 305057 660459 708117 748978 951299
14233 951299 738367 729846 827381 639993 378538 226704 478978 531760 482295 510832 569090
14222 569090 479058 496874 580508 754686 801415 705641 487851 549864 550263 555719 325995
14211 325995 184803 155093 124916 295140 444116 332911 295473 282373 542710 672774
14201 672774 599229 548856 433627 381918 282075 484471 677109 995145 1079113 898294
14191 898294 619309 294615 -29047 273980 669630 691988 475799 218546 426554 678430
$$ packed form
14264G88368o613j48117k66935m415K13347J46763J17740M6244j22535j63585
14254F00262j71206l58183j17794J81095K91290N9834J75451K02387j28752l75078
14244C59306o1490L55447K0945j67960j05354m8050m7787L55402M7658M0861K02321
14233I51299k12932q521R7535j87388k61455j51834K52274N2782m9465K8537N8258
14222E69090r0032J7816Q3634J74178M6729r5774k17790O2013L99N456k29724
14211C25995j41192k9710l0177J70224J48976j11205l7438j3100K60337J30064
14201F72774p3545n0373j15229n1709r9843K02396J92638L18036Q3968j80819
14191H98294k78985l24694l23662L03027L95650K2358k16189k57253K08008K51876
$$ plain form
14181 678430 470530 275352 261011 162320 284312 352809 228119 337814 224599 431496
14171 431496 417940 374102 208601 -47497 75895 -69970 -149811 -226242 -152782 -171242 -89983
14160 -89983 -71461 -180286 91969 124114 -143005 -178139 82030 351221 441989 494619 625617
14149 625617 731520 662000 239263 190555 343145 291949 298246 120230 94868 225819 359060
14138 359060 545820 584335 561644 724717 847951 714552 588705 479689 469615 505995
14128 505995 534309 439625 214087 140099 343590 641617 233130 -42831 77502 227482
14118 227482 26986 -51121 -17392 106399 91120 26152 6565 204493 176505 113856 200136
14107 200136 274025 199725 226452 187075 125261 76178 182891 246831 255877 295513 171684
$$ packed form
14181F78430k07900j95178j4341r8691J21992O8497j24690J09695j13215K06897
14171D31496j3556m3838j65501k56098J23392j45865p9841p6431P3460j8460Q1259
14160h9983J8522j08825K72255L2145k67119l5134K60169K69191R0768N2630J30998
14149F25617J05903o9520m22737m8708J52590n1196O297j78016k5362J30951J33241
14138C59060J86760L8515k2691J63073J23234j33399j25847j09016j0074L6380
14128E05995K8314r4684k25538p3988K03491K98027m08487k75961J20333J49980
14118B27482k00496p8107L3729J23791j5279o4968j9587J97928k7988o2649Q6280
14107B00136P3889p4300K6727l9377o1814m9083J06713O3940R046L9636j23829
$$ plain form
14096 171684 333620 282889 99954 -27002 -11294 31171 91374 41778 -215687 -328390
14086 -328390 -450757 -308928 -317386 -311982 -197550 221644 282904 233283 149649 27992 143660
14075 143660 299824 241598 289756 335932 410917 278489 375940 497049 254100 250636 140163
14064 140163 93676 60334 -163699 -286847 -189124 -273789 -117851 82548 249570 302150
14054 302150 258609 37482 -25174 -33141 -184420 -145339 -134900 -57487 -21354 -59886 -146459
14043 -146459 -404447 -266770 -61893 -94704 -137220 -247707 -165800 45522 29684 293912
14033 293912 236145 206362 76830 93206 167531 103346 -50341 -171240 -22351 15050 -42749
14022 -42749 34007 189626 131414 5318 -166021 -136215 -265324 -288167 -208854 -24140 39952
$$ packed form
14096A71684J61936n0731j82935j26956J5708M2465O0203m9596k57465j12703
14086c28390j22367J41829q458N404J14432M19194O1260m9621q3634j21657J15668
14075A43660J56164n8226M8158M6176P4985j32428R7451J21109k42949l464j10473
14064A40163m6487l3342k24033j23148R7723q4665J55938K00399J67022N2580
14054C02150m3541k21127o2656p967j51279L9081J0439P7413L6133l8532q6573
14043a46459k57988J37677K04877l2811m2516j10487Q1907K11322j5838K64228
14033B93912n7767k9783j29532J6376P4325o4185j53687j20899J48889L7401n7799
14022d2749P6756J55619n8212j26096j71339K9806j29109k2843P9313J84714O4092
$$ plain form
14011 39952 -11621 -143291 -210369 -148274 409 130934 125012 -126124 -62056 -139655 -176519
14000 -176519 14960 129547 90774 154815 247218 329314 295058 256299 -22227 -18756 -7366
13989 -7366 14230 -138570 9183 71723 -40762 -10603 -118397 -129676 52162 165500 98325
13978 98325 -172532 -101966 -94075 169690 440513 359008 137703 21821 -39155 184345 443220
13967 443220 415058 358995 106273 -4410 83189 9828 -76751 174756 282498 228845 188198
13956 188198 240831 343916 668178 989993 1057321 955458 1238588 1222276 1168750 1142484
13946 1142484 1086501 866937 853640 745528 476600 609989 623629 544138 479153 507659
13936 507659 367440 328236 130915 -9218 346121 344125 326661 374517 253001 152357
$$ packed form
14011C9952n1573j31670o7078O2095J48683J30525n922k51136O4068p7599l6864
14000a76519J91479J14587l8773O4041R2403Q2096l4256l8759k78526L471J1390
13989g366K1596j52800J47753O2540j12485L0159j07794j1279J81838J13338o7175
13978I8325k70857P0566P891K63765K70823q1505k21305j15882o0976K23500K58875
13967D43220k8162n6063k52722j10683Q7599p3361q6579K51507J07742n3653m0647
13956A88198N2633J03085L24262L21815O7328j01863K83130j6312n3526k6266
13946A142484n5983k19564j3297j08112k68928J33389J3640p9491o4985K8506
13936E07659j40219l9204j97321j40133L55339j996j7464M7856j21516j00644
$$ plain form
13926 152357 231764 513026 599347 416185 435011 635645 885044 1121417 1090327 1243338
13916 1243338 1375542 1400125 1449355 1266590 1166378 1236320 1453800 1246213 863203 703037
13906 703037 909383 887608 584429 609541 499465 244863 111114 50422 240427 315335
13896 315335 180764 40883 -46320 -183339 -44556 322713 299579 -107223 -145687 -161827
13886 -161827 -101279 -72263 125471 293200 449838 352384 12152 -64866 79978 194475
13876 194475 276238 121500 252258 218254 157081 138691 -9544 -45763 -102736 -106016 5156
13865 5156 64223 35059 2990 -25578 -168980 -283383 -142066 -52888 -118529 -327537 -370873
13854 -370873 -365485 -401304 -433136 -531555 -431835 -513982 -446511 -271160 -173134 78852 229843
$$ packed form
13926A52357P9407K81262Q6321j83162J8826K00634K49399K36373l1090J53011
13916A243338J32204K4583M9230j82765j00212O9942K17480k07587l83010j60166
13906G03037K06346k1775l03179K5112j10076k54602j33749o0692J90005P4908
13896C15335j34571j39881q7203j37019J38783L67269k3134m06802l8464j6140
13886a61827O0548K9016J97734J67729J56638r7454l40232p7018J44844J14497
13876A94475Q1763j54738J30758l4004o1173j8390j48235l6219n6973l280J11172
13865E156N9067k9164l2069k8568j43402j14403J41317Q9178o5641k09008m3336
13854c70873N388l5819l1832r8419R9720q2147O7471J75351R8026K51986J50991
$$ plain form
13843 229843 252596 174570 129022 363513 452081 312984 213308 77855 -31785 -178491
13833 -178491 -401705 -364184 -297948 -235980 -37497 -209997 -168307 -388986 -295942 -36424
13823 -36424 187489 153330 -36574 -37326 -152427 -226109 -314310 -269639 -168086 14536 50591
13812 50591 62810 241251 287790 105358 -131117 -193898 -232517 -3010 116733 114013 139709
13801 139709 80948 196151 149620 -27072 -115450 137099 339003 247575 147988 191984 189576
13790 189576 198804 -11954 -8647 126018 207462 150691 154677 77938 118542 386328 448119
13779 448119 376355 95914 103277 243924 145229 410773 375359 193213 130272 130477 -101717
13768 -101717 -62895 -229276 -195331 33964 191229 121314 156640 -137091 -262488 -369108
$$ packed form
13843B29843K2753p8026m5548K34491Q8568j39097r9676j35453j09640j46706
13833a78491k23214L7521O6236O1968J98483j72500M1690k20679R3044K59518
13823c6424K23913l4159j89904p52j15101p3682q8201M4671J01553J82622L6055
13812E0591J2219J78441M6539j82432k36475o2781l8619K29507J19743k720K5696
13801A39709n8761J15203m6531j76692q8378K52549K01904r1428r9587M3996k408
13790A89576R228k10758L307J34665Q1444n6771L986p6739M0604K67786O1791
13779D48119p1764k80441P363J40647r8695K65544l5414j82146o2941K05k32194
13768a01717L8822j66381L3945K29295J57265o9915L5326k93731j25397j06620
$$ plain form
13758 -369108 -247417 -131300 -50002 170149 217926 -34828 -361943 -325062 -234867 -57820
13748 -57820 -50818 -83045 -62386 77506 150016 37392 -87162 56191 247891 191726 209198
13737 209198 324593 186657 255539 54805 -5489 -34831 12312 191722 236514 54600
13727 54600 -43286 -32075 134653 -33497 -75395 -16994 167250 200645 149096 134523 -195565
13716 -195565 -156869 126775 150568 -149327 -91169 64667 -70603 -252517 -279800 -320902
13706 -320902 -131879 -74849 110778 274845 274391 148646 -118222 -297552 -166743 -58278
13696 -58278 870 312669 253592 11034 -196809 -266257 -325908 -378202 -307190 -286711 -166108
13685 -166108 93570 216465 -63239 -203000 -90698 40035 112822 209139 -131795 -299562
$$ packed form
13758c69108J21691J16117Q1298K20151M7777k52754l27115L6881R0195J77047
13748e7820P002l2227K0659J39892P2510j12624j24554J43353J91700n6165J7472
13737B09198J15395j37936O8882k00734o0294k9342M7143J79410M4792j81914
13727E4600r7886J1211J66728j68150m1898N8401J84244L3395n1549j4573l30088
13716a95565L8696K83644K3793k99895N8158J55836j35270j81914k7283m1102
13706c20902J89023N7030J85627J64067m54j25745k66868j79330J30809J08465
13696e8278N9148L11799n9077k42558k07843o9448n9651n2294P1012K0479J20603
13685a66108K59678J22895k79704j39761J12302J30733P2787R6317l40934j67767
$$ plain form
13675 -299562 -199220 -94113 90752 174134 243607 115136 -140865 -271389 -150180 64384
13665 64384 -99608 -342409 -299132 -140754 -199021 -172672 -44020 51801 218534 429096
13655 429096 321037 63076 -202973 -292374 -320271 -139481 59924 -88737 -42806 -69788
13645 -69788 -133346 -101815 -203416 -336337 -271968 -361373 -193217 24089 -30989 -130263 -98708
13634 -98708 -89692 -86923 -142612 -171488 -36014 -54185 -13613 -31353 -26666 -114169 -22001 -121765
13622 -121765 -122405 1937 220064 192842 -157275 -253185 -75175 135930 184992 409387 449817
13611 449817 315814 102882 -240874 -371976 -427902 -198200 166624 79740 134010 150129
13601 150129 114522 90020 19762 5373 191076 209478 31213 174491 204200 141463 93245
$$ packed form
13675b99562J00342J05107J84865Q3382O9473j28471k56001j30524J21209K14564
13665F4384j63992k42801M3277J58378n8267K6349J28652R5821J66733K10562
13655D29096j08059k57961k66049q9401k7897J80790J99405j48661M5931k6982
13645f9788o3558L1531j01601j32921O4369q9405J68156K17306n5078r9274L1555
13634i8708R016K769n5689k8876J35474j8171M0572j7740M687q7503R2168r9764
13622a21765o40J24342K18127k7222l50117r5910J78010K11105M9062K24395M0430
13611D49817j34003k12932l43756j31102n5926K29702L64824q6884N4270J6119
13601A50129l5607k4502p0258j4389J85703J8402j78265J43278K9709o2737m8218
$$ plain form
13590 93245 9467 -68196 -135397 115774 472083 371498 68392 103140 294398 141851
13580 141851 -76756 -37432 -20298 -71906 -100957 -187979 -121317 -43150 62029 -50637 54899
13569 54899 86687 -318952 -289089 -482859 -300873 -97974 76344 -63904 36265 -10477
13559 -10477 -104393 17833 62886 4764 -221404 -255009 -333330 -429953 -582018 -576298 -303845
13548 -303845 -207239 -264905 -209794 -155143 -104638 -206606 -260962 -69841 -143398 -113354 91606
13537 91606 -46357 23552 196904 101934 132509 -40597 -165259 -35664 258450 419074
13527 419074 293305 205091 42349 -179215 -131265 -155715 -173427 -100010 98056 309537
13517 309537 522756 322428 -77946 -119005 -14711 -46836 -132353 21665 104533 43406
$$ packed form
13590I3245q3778p7663o7201K51171L56309j00585l03106L4748J91258j52547
13580A41851k18607L9324J7134n1608k9051q7022O6662P8167J05179j12666J05536
13569E4899L1788m05639K9863j93770J81986K02899J74318j40248J00169m6742
13559a0477r3916J22226M5053n8122k26168l3605p8321r6623j52065N720K72453
13548c03845R6606n7666N5111N4651N0505j01968n4356J91121p3557L0044K04960
13537I1606j37963O9909J73352r4970L0575j73106j24662J29595K94114J60624
13527D19074j25769q8214j62742k21564M7950k4450j7712P3417J98066K11481
13517C09537K13219k00328m00374m1059J04294l2125q5517J54018Q2868o1127
$$ plain form
13507 43406 138253 245678 184609 -277020 -276342 -69496 145402 117594 34691 -153032 -185687
13496 -185687 -155901 -67807 -125031 -225889 -236070 -392530 -514392 -273292 -89306 -135141
13486 -135141 -55785 -268557 -233210 156246 201548 220564 263654 149737 136827 100903 -43888
13475 -43888 52640 53623 48510 -57162 -164988 -334842 -409717 -272850 -1664 -30847 -303279
13464 -303279 -393133 -393960 -302373 -217114 103357 182078 -81950 -154268 52478 64555 212012
13453 212012 190837 207991 196230 268762 76577 109998 282042 153191 -60215 -212914
13443 -212914 79077 188146 -117309 -42740 -197416 -336503 -430722 -351807 -304597 -188591
13433 -188591 -120069 -103268 132337 198528 37417 -163835 -42891 -9475 -99286 -246585
$$ packed form
13507D3406R4847J07425o1069m61629O78K06846K14898k7808q2903j87723l2655
13496a85687K9786Q8094n7224j00858j0181j56460j21862K41100J83986m5835
13486a35141P9356k12772L5347L89456M5302J9016M3090j13917j2910l5924j44791
13475d3888R6528R83n113j05672j07826j69854p4875J36867K71186k9183k72432
13464c03279q9854q27R1587Q5259L20471P8721k64028p2318K06746J2077J47457
13453B12012k1175J7154j1761P2532j92185L3421J72044j28851k13406j52699
13443b12914K91991J09069l05455P4569j54676j39087r4219P8915M7210J16006
13433a88591O8522J6801K35605O6191j61111k01252J20944L3416q9811j47299
$$ plain form
13423 -246585 -271248 -64163 -59462 -295853 -492887 -663247 -333870 -163509 -217914 -155937
13413 -155937 83369 61669 -141870 -445628 -604498 -541189 -270943 -152463 76876 195644
13403 195644 238755 412053 517359 570841 488124 535976 466122 354736 125704 243905
13393 243905 306199 153850 100974 44657 196423 107535 22042 131703 141794 38297 -80988
13382 -80988 -84044 -151830 24364 35661 -31772 -95472 -63066 30969 41912 22142 86015 160169
13370 160169 -85517 -90633 -88512 -243798 -33391 47447 -150695 61946 255416 242222 174662
13359 174662 36576 23213 95834 201681 -88660 -29965 -64145 -98042 -98579 -103628 90705
13348 90705 165969 85032 -144118 -112720 77251 129310 218913 179668 203750 172247 -20779
$$ packed form
13423b46585k4663K07085M701k36391j97034j70360L29377J70361n4405O1977
13413a55937K39306k1700k03539l03758j58870O3309K70246J18480K29339J18768
13403A95644M3111J73298J05306N3482q2717M7852o9854j11386k29032J18201
13393B43905O2294j52349n2876n6317J51766q8888q5493J09661J0091j03497j19285
13382h0988l056o7786J76194J1297o7433o3700L2406R4035J0943j9770O3873P4154
13370A60169k45686n116K121j55286K10407Q0838j98142K12641J93470j3194o7560
13359A74662j38086j3363P2621J05847k90341N8695l4180l3897n37n049J94333
13348I0705P5264q0937k29150L1398J89971N2059Q9603l9245K4082l1503j93026
$$ plain form
13337 -20779 -238860 46161 326087 213378 61724 145508 251928 375926 269302 313
13327 313 21515 16577 -171132 -278443 -193174 -206903 -111224 94405 148711 225800 55089
13316 55089 -140140 -222804 -145308 -144026 -94595 -172208 -266146 -203527 -77645 313 -127337
13305 -127337 -36200 10174 -195574 -212340 -125079 -339503 -244562 4946 250001 444869
13295 444869 216947 133731 31500 -177991 -274478 -261125 -375441 -159316 219503 415321
13285 415321 76683 130674 86373 -57575 -392 222961 187548 -162397 -158129 -147531 -172070
13274 -172070 -168690 -88386 -139208 -98245 82849 166957 228582 -165541 -175779 -117217 -263615
13263 -263615 -528151 -197593 216928 377917 305851 320369 7011 -160473 -17329 85810
$$ packed form
13337b0779k18081K85021K79926j12709j51654Q3784J06420J23998j06624k68989
13327C13K1202m938j87709j07311Q5269j3729R5679K05629N4306P7089j70711
13316E5089j95229q2664P7496J282M9431p7613r3938O2619J25882P7958j27650
13305a27337R1137M6374k05748j6766Q7261k14424R4941K49508K45055J94868
13295D44869k27922q3216j02231k09491r6487J3353j14316K16125L78819J95818
13285D15321l38638N3991m4301j43948N7183K23353l5413l49945M268J0598k4539
13274a72070L380Q0304n0822M0963J81094Q4108O1625l94123j0238N8562j46398
13263b63615k64536L30558M14521J60989p2066J4518l13358j67484J43144J03139
$$ plain form
13253 85810 -131357 -254858 -46520 -31392 7016 220801 280065 12448 -125790 -68781
13243 -68781 81482 -185218 10103 -22773 37413 147296 64774 -79310 -29436 -33681 -194857
13232 -194857 -535263 -521236 -336690 -41655 88247 85609 195445 126484 58861 -184226
13222 -184226 -16662 174493 -62501 -239205 -216091 -398126 -394819 -341026 -135069 70267
13212 70267 35391 -177401 126855 386088 321566 93012 88813 290731 196347 271895 607491
13201 607491 488710 343014 57631 -249686 -113878 -65710 71665 293754 102260 -33460
13191 -33460 -24688 45538 96078 -112005 -44189 105315 -130396 -318980 -218058 -105820 89132
13180 89132 212495 358458 284526 362509 432031 358055 204215 360306 418123 415937 527968
$$ packed form
13253H5810k17167j23501K08338J5128L8408K13785N9264k67617j38238N7009
13243f8781J50263k66700J95321l2876O0186J09883q2522j44084M9874m245j61176
13232a94857l40406J4027J84546K95035J29902k638J09836o8961o7623k43087
13222a84226J67564J91155k36994j76704K3114j82035L307N3793K05957K05336
13212G0267l4876k12792L04256K59233o4522k28554m199K01918r4384P5548L35596
13201F07491j18781j45696k85383l07317J35808M8168J37375K22089j91494j35720
13191c3460Q772P0226N0540k08083O7816J49504k35711j88584J00922J12238J94952
13180H9132J23363J45963p3932P7983O9522p3976j53840J56091N7817k186J12031
$$ plain form
13169 527968 557740 381431 157775 -50393 -43274 60224 55154 29580 101908 8396 21491
13158 21491 106930 60773 156117 213049 345675 280499 124849 -119632 -381519 -471072 -398440
13147 -398440 -139064 -81194 -385845 -427902 -121521 -64760 -47453 -163927 -201487 102689
13137 102689 424360 363518 282544 68341 -136135 -170058 -160712 -227991 -124474 18952 105416
13126 105416 34461 51348 118515 137156 229605 173716 100001 81095 84432 303611 622533
13115 622533 915910 875546 727001 863896 957985 762881 623930 454340 282684 400320
13105 400320 352259 143320 13619 48001 59432 118248 -49966 -297878 -369041 -171883
13095 -171883 -127222 88092 219473 -14656 200249 381929 196653 -77782 -247750 -214946
$$ packed form
13169E27968K9772j76309k23656k08168P119J03498n070k5574P2328r3512J3095
13158B1491Q5439m6157R5344N6932J32626o5176j55650k44481k61887q9553P2632
13147c98440K59376N7870l04651m2057L06381N6761J7307j16474l7560L04176
13137A02689L21671o0842q0974k14203k04476l3923R346o7279J03517J43426Q6464
13126A05416p0955J6887O7167J8641R2449n5889p3715j8906L337K19179L18922
13115F22533K93377m0364j48545J36895R4089j95104j38951j69590j71656J17636
13105D00320m8061k08939j29701L4382J1431N8816j68214k47912p1163J97158
13095a71883M4661K15314J31381k34129K14905J81680j85276k74435j69968L2804
$$ plain form
13085 -214946 -252941 -281670 -327037 -190879 -10397 -53444 198147 353279 26407 -194298
13075 -194298 -300466 54513 355853 473328 321156 253716 229121 27184 234887 402816
13065 402816 461665 393127 99923 -8266 -55003 16860 106893 163806 99341 176225 63095
13054 63095 -182749 -372541 -363171 -192928 4744 27893 -34659 -76543 -61181 -79014 -136018
13043 -136018 -1801 -61298 13478 240075 334428 166215 -1915 -237858 -345205 -304834
13033 -304834 -224730 -135794 46241 205452 100313 15944 -141062 -185475 -198684 -149968 12179
13022 12179 128547 73604 -290904 -315448 -142330 -246418 -508901 -632884 -408929 -235337
13012 -235337 -258415 -172191 53417 43996 85369 202002 -53814 -226067 -211352 -314292 -150527
$$ packed form
13085b14946l7995k8729m5367J36158J80482m3047K51591J55132l26872k20705
13075a94298j06168L54979L01340J17475j52172o7440k4595k01937K07703J67929
13065D02816N8849o8538k93204j08189m6737P1863R0033N6913o4465P6884j13130
13054F3095k45844j89792R370J70243J97672K3149o2552m1884J5362j7833n7004
13043a36018J34217n9497P4776K26597R4353j68213j68130k35943j07347M0371
13033c04834Q0104Q8936J82035J59211j05139q4369j57006m4413j3209M8716J62147
13022A2179J16368n4943l64508k4544J73118j04088k62483j23983K23955J73592
13012b35337k3078Q6224K25608r421M1373J16633k55816j72253J4715j02940J63765
$$ plain form
13001 -150527 -43728 -48590 21855 365412 398797 336021 334804 275019 185558 8458 -45263
12990 -45263 -196556 -257297 28931 23346 -74467 -112914 154736 110741 -125522 -89798 57062
12979 57062 21867 -18463 -33973 -146260 -275050 -110467 72845 -7150 -40332 -96738 -103608
12968 -103608 -152302 -334165 -555919 -482151 -457042 -371185 61312 350854 331334 227654
12958 227654 206270 242502 309480 198589 -137628 -224370 -474461 -283781 -38060 42536
12948 42536 -95227 15613 -28304 -139792 -148146 -79642 96291 27770 -124042 -264938 -80857
12937 -80857 -73342 -295388 -229148 -232031 -191442 -77887 -68154 97430 212468 153314 61045
12926 61045 204784 252343 216935 967 -91773 -156376 -231054 -270661 -205139 37604 -56680
$$ packed form
13001a50527J06799m862P0445L43557L3385o2776j217n9785q9461j77100n3721
12990d5263j51293o0741K86228n585r7813l8447K67650m3995k36263L5724J46860
12979E7062l5195m0330j5510j12287j28790J64583J83312p9995l3182n6406o870
12968a03608m8694j81863k21754P3768K5109Q5857M32497K89542j9520j03680
12958B27654k1384L6232O6978j10891l36217q6742k50091J90680K45721Q0596
12948D2536j37763J10840m3917j11488q354O8504J75933o8521j51812j40896J84081
12937h0857P515k22046O6240k883M0589J13555R733J65584J15038n9154r2269
12926F1045J43739M7559l5408k15968r2740o4603p4678l9607O5522K42743r4284
$$ plain form
12915 -56680 -294306 -337753 -65840 -8373 106102 225185 162620 124351 157130 -35520 -190695
12904 -190695 -142642 -202041 -135747 33630 -53212 -45895 -113159 -84971 -63021 5661 113724
12893 113724 178434 -65207 -111454 -83935 -28501 -183060 -254205 -78041 198991 327081
12883 327081 410917 395766 129595 -148246 -135255 37598 92001 -14493 -248331 -326559
12873 -326559 -221011 -125925 56459 5470 -203162 -131423 -158726 -169495 2362 175031
12863 175031 164177 233447 283436 292348 383273 363049 290670 237024 215127 19064 -203054
12852 -203054 -291257 -421396 -239964 -81977 -58627 -98764 -258205 -323120 -212387 18041
12842 18041 58696 15095 30643 25153 109848 101284 -81725 -107073 60541 60560 -195198 71634
$$ packed form
12915e6680k37626m3447K71913N7467J14475J19083o2565l8269L2779j92650j55175
12904a90695M8053n9399O6294J69377q6842P317o7264K8188K1950O8682J08063
12893A13724O4710k43641m6247K7519N5434j54559p1145J76164K77032J28090
12883C27081Q3836j5151k66171k77841J2991J72853N4403j06494k33838p8228
12873c26559J05548R5086J82384n0989k08632P1739k7303j0769J71857J72669
12863A75031j0854O9270M9989Q912R0925k0224p2379n3646k1897j96063k22118
12852b03054q8203j30139J81432J57987K3350m0137j59441o4915J10733K30428
12842A8041M0655m3601J5548n490Q4695q564j83009k5348J67614J9k55758K66832
$$ plain form
12830 71634 385708 291818 284797 184923 200129 74647 16163 120516 331761 252695 -31448
12819 -31448 49319 20666 228184 141167 -114647 -361280 -301776 -271766 -474009 -429560 -113627
12808 -113627 -179267 -226995 -219811 -199058 -74612 -15507 51146 27075 -48884 -55800 -243240
12797 -243240 -406034 -329233 -133756 -123441 -74597 -20096 189830 245787 -7856 -177774
12787 -177774 -207720 -197709 -139124 -23008 18515 -175161 -212176 -156317 -265541 -260652 -98700
12776 -98700 20959 117320 17305 -115831 -9937 -147240 -466803 -508849 -282806 -86550
12766 -86550 -131371 -119691 -181871 -279753 -145107 -135434 -354885 -433881 -510926 -400565 -317350
12755 -317350 -352500 -115342 -170316 -403309 -495131 -301586 -119868 92513 -434 -120962
$$ packed form
12830G1634L14074r3890p021r9874J5206j25482n8484J04353K11245p9066k84143
12819c1448Q0767k8653K07518q7017k55814k46633N9504L0010k02243M4449L15933
12808a13627o5640m7728P184K0753J24446N9105O6653k4071p5959o916j87440
12797b43240j62794P6801J95477J0315M8844N4501K09926N5957k53643j69918
12787a77774k9946J0011N8585J16116M1523j93676l7015N5859j09224M889J61952
12776i8700J19659R6361j00015j33136J05894j37303l19563m2046K26043J96256
12766h6550m4821J1680o2180r7882J34646R673k19451p8996p7045J10361Q3215
12755c17350l5150K37158n4974k32993r1822J93545J81718K12381r2947j20528
$$ plain form
12745 -120962 -219351 -156973 -221465 -101222 -43924 -53995 9071 -64973 -187534 -332523 -347891
12734 -347891 -357682 -298290 -19994 187360 437755 325496 190693 94829 221396 282482
12724 282482 197810 417115 445072 416999 211236 16190 -38554 -5099 275656 314826 330116
12713 330116 207166 161950 194106 117783 88958 -302618 -465375 -406965 -231603 -142431 -135085
12702 -135085 -264119 -324212 -321246 -272756 -93026 168153 104736 -111901 -326651 -295244 -145299
12691 -145299 -58053 -7711 -95703 -78106 779 115806 110586 75491 103438 28289 -92191
12680 -92191 23133 147268 154636 -55181 -147167 -123822 -201786 -343030 -263106 -93900 -135748
12669 -135748 -193056 -356980 -91242 -73739 -211558 -156487 -91454 129533 61108 -109855
$$ packed form
12745a20962r8389O2378o4492J20243N7298j0071O3066p4044j22561j44989j5368
12734c47891r791N9392K78296K07354K50395j12259j34803r5864J26567O1086
12724B82482q4672K19305K7957k8073k05763j95046n4744L3455K80755L9170J5290
12713C30116j22950m5216L2156p6323k8825l91576j62757N8410J75362Q9172P346
12702a35085j29034o0093K966M8490J79730K61179o3417k16637k14750L1407J49945
12691a45299Q7246N0342q7992J7597P8885J15027n220l5095K7947p5149j20480
12680i2191J15324J24135P368k09817r1986K3345p7964j41244P9924J69206m1848
12669a35748n7308j63924K65738J7503j37819N5071O5033K20987o8425j70963
$$ plain form
12659 -109855 -266094 -375079 -413251 -232756 -110711 197934 264157 121360 -7637 -176226
12649 -176226 -297041 -459646 -360758 -199959 -47567 114285 507739 597850 404196 167631
12639 167631 263350 417526 406530 247747 90875 -86139 -230964 -241155 -240012 -369991
12629 -369991 -240029 -136027 -210531 -280861 -160692 -118855 -279246 -451972 -193051 -70915
12619 -70915 -182149 -255159 -164413 242185 419443 361260 131112 106581 188482 84380 42953
12608 42953 -21920 -134969 -59091 -162292 -59957 33959 -300 -35211 -96109 -81980 -200407
12597 -200407 -312618 -218426 -111535 -9503 128030 120507 92512 54354 107744 -20074 -13355
12586 -13355 -212830 -450431 -407192 -278420 -189594 -33513 11136 -26412 9827 246965 290583
$$ packed form
12659a09855j56239j08985l8172J80495J22045L08645O6223j42797j28997j68589
12649a76226j20815j62605R8888J60799J52392J61852L93454R0111j93654k36565
12639A67631R5719J54176j0996j58783j56872j77014j44825j0191J143j29979
12629c69991J29962J04002p4504p0330J20169M1837j60391j72726K58921J22136
12619g0915j11234p3010R0746M06598J77258n8183k30148k4531Q1901j04102m1427
12608D2953o4873j13049P5878j03201J02335R3916l4259l4911o0898J4129j18427
12597b00407j12211R4192J06891J02032J37533p523k7995l8158N3390j27818O719
12586a3355j99475k37601M3239J28772Q8826J56081M4649l7548L6239K37138M3618
$$ plain form
12575 290583 64735 -58717 -106496 -16303 164759 175513 120576 249133 289610 132530
12565 132530 277740 268671 268448 275757 100770 13720 -31290 -44584 -193380 -86541 95081
12554 95081 -136905 -40952 21870 -68558 132097 372715 289855 125509 -85350 -53068 -24899
12543 -24899 106140 -136426 -87139 185396 537083 498058 335681 378398 172596 77517
12533 77517 16350 5018 62362 132587 -38708 -8088 5322 -132609 -64306 -167131 -88989
12522 -88989 -33352 -70403 -151110 -54484 -1237 70933 43728 24355 145778 81142 2661
12511 2661 -10110 10203 162735 301244 190638 111032 289231 303982 -3248 -58423 -84421
12500 -84421 47127 33099 110096 303503 244168 179921 252893 425842 315291 342667 326912
$$ packed form
12575B90583k25848j23452m7779R0193J81062J0754n4937J28557M0477j57080
12565A32530J45210r069k23P309j74987q7050m5010j3294j48796J06839J81622
12554I5081k31986R5953O2822r0428K00655K40618q2860j64346k10859L2282K8169
12543b4899J31039k42566M9287K72535L51687l9025j62377M2717k05802r5079
12533G7517o1167j1332N7344P0225j71295L0620J3410j37931O8303j02825P8142
12522h8989N5637l7051q0707R6626N3247P2170k7205j9373J21423o4636p8481
12511B661j2771K0313J52532J38509j10606p9606J78199J4751l07230n5175k5998
12500h4421J31548j4028P6997J93407n9335o4247P2972J72949j10551K7376j5755
$$ plain form
12489 326912 434612 542889 540914 526138 544959 620742 597480 378139 129406 335879 285856
12478 285856 179908 288317 425535 466684 639552 494480 317720 327691 499071 543746
12468 543746 447415 427168 445789 270107 200239 399039 403432 169826 -3061 -75767 52111
12457 52111 171756 377114 557340 662178 412705 252347 175042 304968 428594 263614
12447 263614 365033 553754 554932 575267 528970 521413 572002 516554 405649 411091 518402
12436 518402 751349 774179 819785 638109 811344 852763 786410 419775 204489 153849
12426 153849 175665 214121 431826 605139 520612 437861 459347 417837 515364 547658 479336
12415 479336 622937 690996 647763 664350 614041 563967 471267 318193 501996 221465 74193
$$ packed form
12489C26912J07700J08277j975j4776J8821P5783k3262k19341k48733K06473n0023
12478B85856j05948J08409J37218M1149J72868j45072j76760R971J71380M4675
12468E43746r6331k0247J8621j75682o9868J98800M393k33606j72887p2706J27878
12457E2111J19645K05358J80226J04838k49473j60358p7305J29926J23626j64980
12447B63614J01419J88721J178K0335m6297p557N0589n5448j10905N442J07311
12436E18402K32947K2830M5606j81676J73235M1419o6353l66635k15286n0640
12426A53849K1816L8456K17705J73313q4527q2751K1486m1510R7527L2294o8322
12415D79336J43601O8059m3233J6587n0309n0074r2700j53074J83803k80531j47272
$$ plain form
12404 74193 198758 370766 382839 390313 332328 260677 183770 294193 445044 504077 592593
12393 592593 630714 450208 215959 506152 732176 599643 532386 587254 508495 539061
12383 539061 560639 740368 768658 496965 574720 852001 846747 750914 698076 693505 693413 702444
12371 702444 424083 282171 280058 445096 508228 445361 554935 501096 438810 320712 301340
12360 301340 293724 375481 546667 712875 572733 582974 561150 274540 288798 443728 416771
12349 416771 221752 33655 -29995 -29490 -98986 31979 -140976 -112817 124704 279765 436595
12338 436595 583571 752349 631512 272046 370710 623846 466721 527174 596527 689026
12328 689026 777377 497128 526830 584959 441018 417396 221487 205167 123163 256184 314490
$$ packed form
12404G4193J24565J72008J2073P474n7985p1651p6907J10423J50851N9033Q8516
12393E92593L8121j80506k34249K90193K26024j32533o7257N4868p8759L0566
12383E39061K1578J79729K8290k71693P7755K77281n254r5833n2838m571r2R031
12371G02444k78361j41912k113J65038O3132o2867J09574n3839o2286j18098j9372
12360C01340p616Q1757J71186J66208j40142J0241k1824k86610J4258J54930k6957
12349D16771j95019j88097o3650N05o9496J30965j72955K8159K37521J55061J56830
12338D36595J46976J68778j20837l59466R8664K53136j57125O0453O9353R2499
12328F89026Q8351k80249K9702N8129j43941k3622j95909j6320q2004J33021N8306
$$ plain form
12317 314490 20413 -27818 180755 345388 292168 421731 269996 -22315 26584 -65039
12307 -65039 -189277 -293006 -67525 -183915 36600 274096 235597 318683 222408 178981
12297 178981 91612 34458 172745 241012 133005 121968 95413 365241 416223 424419 318146
12286 318146 260093 204531 95467 4827 123739 114764 5951 164753 154414 52578 -24310
12275 -24310 49707 -71878 -214218 -314954 -106964 9434 -13343 -63582 233257 201940
12265 201940 258467 453615 368807 -48120 -49837 148936 229449 206622 -27307 -105879 -151099
12254 -151099 -230617 -198557 -227160 46159 175940 407251 213236 57652 211386 194567
12244 194567 105654 -209511 -615575 -533564 -258883 -96435 -43669 -163936 -64010 2099
$$ packed form
12317C14490k94077m8231K08573J64633n3220J29563j51735k92311M8899r1623
12307f5039j24238j03729K25481j16390K20515K37496l8499Q3086r6275m3427
12297A78981q7369n7154J38287O8267j08007j1037k6555K69828N0982Q196j06273
12286C18146n8053n5562j09064r0640J18912q975j08813J58802j0339j01836p6888
12275b4310P4017j21585j42340j00736K07990J16398k2777n0239K96839l1317
12265B01940N6527J95148q4808m16927j717J98773Q0513k2827k33929p8572m5220
12254a51099p9518L2060k8603K73319J29781K31311j94015j55584J53734j6819
12244A94567q8913l15165m06064Q2011K74681J62448N2766j20267R9926O6109
$$ plain form
12234 2099 -87995 -22131 -111119 -229241 -166237 -133194 -192460 -199510 -380239 -251585 -5175
12223 -5175 -7291 214940 276297 75516 -172145 109199 126689 -6142 -32010 17201 220951
12212 220951 458888 498344 333535 375439 259862 4082 19418 70970 79326 -890 94882
12201 94882 280954 384304 278088 192351 57656 -65077 96774 18611 -176949 -158227
12191 -158227 -186672 -148554 -127038 -240723 -210248 -167564 -170310 -62104 -73436 -180637 -189443
12180 -189443 -198341 -405897 -427815 -89746 -25606 -182728 -268987 -276188 -45402 239921 154377
12169 154377 112955 158774 186270 -9616 -54488 82410 -32844 -115403 -76612 -95309 -110855
12158 -110855 -221013 -67219 15082 17394 -120508 135849 290615 335618 283455 361672 274234
$$ packed form
12234B099r0094O5864q8988j18122O3004L3043n9266p050j80729J28654K46410
12223e175k116K22231O1357k00781k47661K81344J7490j32831k5868M9211K03750
12212B20951K37937L9456j64809M1904j15577k55780J5336N1552Q356q0216R5772
12201I4882J86072J03350j06216q5737j34695j22733J61851p8163j95560J8722
12191a58227k8445L8118K1516j13685L0475M2684k746J08206j1332j07201q806
12180a89443q898k07556k1918L38069O4140j57122q6259p201K30786K85323q5544
12169A54377m1422M5819K7496j95886m4872J36898j15254q2559L8791j8697j5546
12158a10855j10158J53794Q2301K312j37902K56357J54766M5003n2163P8217q7438
$$ plain form
12147 274234 237938 191520 176585 238259 184478 138559 -72328 -317372 -228735 -67629 -172533
12136 -172533 98127 302206 597564 594775 470043 310674 239939 181483 439470 390097
12126 390097 45814 21688 206684 381611 250562 143835 -38643 -113976 -149176 -90060
12116 -90060 -101110 -104208 7067 -170816 -207657 2455 -31377 62491 50468 107845 3892
12105 3892 -73897 -110741 -110727 -169467 -245859 -304493 -333771 -224291 -177570 -53992 85060 191705
12093 191705 -73637 -187504 -106498 45651 139360 77794 9400 6106 10118 116778 137195
12082 137195 -47712 -23066 -107733 -215092 -97502 -15641 -176097 -140847 -109220 -123827 -41335
12071 -41335 -141773 -365029 -511167 -468356 -439090 -308539 -228242 -106582 324668 546664
$$ packed form
12147B74234l6296m6418j4935O1674n3781m5919k10887k45044Q8637J61106j04904
12136a72533K70660K04079K95358k789j24732j59369p0735n8456K57987m9373
12126C90097l44283k4126J84996J74927j31049j06727j82478p5333l5200N9116
12116i0060j1050l098J11275j77883l6841K10112l3832R3868j2023N7377j03953
12105C892p7789l6844J4n8740p6392n8634k9278J09480M6721J23578J39052J06645
12093A91705k65342j13867Q1006J52149R3709o1566o8394l294M012J06660K0417
12082A37195j84907K4646q4667j07359J17590Q1861j60456L5250L1627j4607Q2492
12071d1335j00438k23256j46138M2811K9266J30551Q0297J21660M31250K21996
$$ plain form
12061 546664 405595 257343 115650 67979 98749 115123 231400 155225 -16717 79079
12051 79079 134709 123397 -86122 -99032 -175310 14661 -55985 -105781 77968 67448 -111749
12040 -111749 -218902 22706 52619 96763 -119386 -265691 -298508 -355956 -249149 -241589 -77750
12029 -77750 -195083 -219552 123791 517113 512210 350631 228786 66967 202964 92146
12019 92146 1632 110288 62057 -84721 -54778 88220 109633 6542 -241694 -288000 -347907
12008 -347907 -299716 -106341 -240918 -131256 -117124 2807 166213 196825 327358 453114
11998 453114 594744 508621 411262 568877 588795 292450 140222 -6189 -102854 -18535
11988 -18535 -17376 56669 52561 -86543 -206696 -431091 -467717 -585636 -403726 -287015 -155337
$$ packed form
12061E46664j41069j48252j41693m7671L0770J6374J16277p6175j71942R5796
12051G9079N5630j1312k09519j2910p6278J89971p0646m9796J83749j0520j79197
12040a11749j07153K41608K9913M4144k16149j46305l2817n7448J06807P560J63839
12029g7750j17333k4469L43343L93322m903j61579j21845j61819J35997j10818
12019I2146r0514J08656m8231j46778K9943J42998K1413j03091k48236m6306n9907
12008c47907M8191J93375j34577J09662J4132J19931J63406L0612J30533J25756
11998D53114J41630q6123r7359J57615J9918k96345j52228j46411r6665Q4319
11988a8535J159P4045m108j39104j20153k24395l6626j17919J81910J16711J31678
$$ plain form
11977 -155337 -231340 -68676 -154976 -296274 -343994 -152691 -231648 -279834 -153227 -247398 -610762
11966 -610762 -452398 -85492 174308 321989 125627 10552 -96907 -162918 -62132 86433
11956 86433 225035 359149 468606 454964 655213 636360 464925 335340 108632 63960
11946 63960 98004 86939 80094 144865 67298 51515 -161035 -130018 -208687 -162849 -158100 -137266
11934 -137266 -143928 -98152 -142151 -12172 142077 230311 130330 -180658 -221139 -52416 -169222
11923 -169222 -440752 -242370 -183840 92844 224090 255836 -66631 -385309 -278166 -106026
11913 -106026 -24954 145688 127849 339892 430491 448674 550194 455731 302197 -2083
11903 -2083 -120638 -139419 -271580 -130809 81832 86776 95609 126102 -150696 -397335 -408161
$$ packed form
11977a55337p6003J62664q6300j41298m7720J91303p8957m8186J26607r4171l63364
11966f10762J58364L66906K59800J47681j96362j15075j07459o6011J00786J48565
11956H6433J38602J34114J09457j3642K00249j8853j71435j29585k26708m4672
11946F3960L4044j1065o845O4771p7567j5783k12550L1017p8669M5838M749K0834
11934a37266o662M5776m3999J29979J54249Q8234r9981l10988m0481J68723j16806
11923a69222k71530J98382N8530K76684J31246L1746l22467l18678J07143J72140
11913a06026Q1072J70642j7839K12043R0599J8183J01520r4463j53534l04280
11903b083j18555j8781j32161J40771K12641M944Q833L0493k76798k46639j0826
$$ plain form
11892 -408161 -224267 -174957 -217232 -247074 -209136 -159625 -184885 -334819 -304142 -195602 -43796
11881 -43796 71158 -69442 -168058 -208919 -287393 -78137 -34287 87844 81504 124360 187807
11870 187807 279159 121252 85292 54470 -59541 84394 31689 -13452 -121871 -127042 -265073
11859 -265073 -246493 -293305 -271600 -213301 -235522 -294747 -56112 -30011 -193326 -25474 15828
11848 15828 -162494 -132022 56204 45600 -128375 -270249 -215973 -222042 -271201 -201792 -416344
11837 -416344 -482662 -315134 -210769 -10890 -109713 -94335 -141861 -32343 -27178 266437 232418
11826 232418 319600 489393 399932 167236 -64351 -241730 -110137 123229 106108 -153620
11816 -153620 -468768 -583739 -429430 -202300 -19705 -100964 11599 121554 86743 42581
$$ packed form
11892d08161J83894M9310m2275k9842L7938M9511k5260j49934L0677J08540J51806
11881d3796J14954j40600r8616m0861p8474K09256M3850J22131o340M2856O3447
11870A87807R1352j57907l5960l0822j14011J43935n2705m5141j08419n171j38031
11859b65073J8580m6812K1705N8299k2221n9225K38635K6101j63315J67852M1302
11848A5828j78322L0472J88226j0604j73975j41874N4276o069m9159O9409k14552
11837d16344o6318J67528J04365J99879r8823J5378m7526J09518N165K93615l4019
11826B32418Q7182J69793q9461k32696k31587j77379J31593K33366j7121k59728
11816a53620l15148j14971J54309K27130J82595q1259J12563J09955l4811m4162
$$ plain form
11806 42581 -52396 -126344 -139400 -24115 49106 -170743 -292164 -192153 30557 87187 109379
11795 109379 -25992 -238380 -116956 -89203 -11038 78594 67751 167770 354193 459544
11785 459544 390902 261010 135892 305060 234060 -37140 -218830 -261908 -80041 -2599
11775 -2599 52198 34854 -37824 -74839 -25201 172662 135623 -237898 -315948 -385622 -566640
11764 -566640 -301219 79027 -12435 -193941 -349355 -544572 -480156 -6191 255289 182214
11754 182214 -134024 -56191 -2224 -238501 -272357 -224248 -181278 -288735 -266013 -240683 -150090
11743 -150090 4785 -77471 -210385 -289607 -276926 -170066 -196297 -217828 -64991 -74783 31882
11732 31882 -44405 -68359 -22332 -11844 -196054 -252227 -372474 -305359 -142001 -216119 -180756
$$ packed form
11806D2581r4977p3948j3056J15285P3221k19849j21421J00011K22710N6630K2192
11795A09379j35371k12388J21424K7753P8165Q9632j0843J00019J86423J05351
11785D59544o8642j29892j25118J69168p1000k71200j81690m3078J81867P7442
11775b599N4797j7344p2678l7015M9638J97863l7039l73521p8050o9674j81018
11764e66640K65421L80246r1462j81506j55414j95217O4416M73965K61480p3075
11754A82214l16238P7833N3967k36277l3856M8109M2970j07457K2722K5330R0593
11743a50090J54875q2256j32914p9222J2681J06860k6231k1531J52837r792J06665
11732C1882p6287k3954M6027J0488j84210n6173j20247O7115J63358p4118L5363
$$ plain form
11721 -180756 -35429 -36386 -109381 -98492 -29953 -141829 -286668 -278358 -324586 -382541 11658
11710 11658 150688 -113596 -298308 -146647 -132945 -198220 -75208 58035 36063 -58130
11700 -58130 153167 148873 328255 290127 194731 153723 320207 -3597 -102581 -207450 -356969
11689 -356969 -282831 -60675 198649 250656 4631 -85266 3814 -101250 -181646 -67517
11679 -67517 -2189 69032 13909 -42526 101171 206996 72245 -134219 -88659 -1537 -203219
11668 -203219 -504479 -526332 -476243 -260651 -225118 -212817 -351503 -6542 270401 244130
11658 244130 7867 122131 130501 195209 36995 180908 422389 261172 29981 -417223
11648 -417223 -464517 -139280 151109 -79631 -243225 -261705 -43263 25289 -115400 -375241
$$ packed form
11721a80756J45327r57p2995J0889O8539j11876j44839Q310m6228n7955L94199
11710A1658J39030k64284j84712J51661J3702o5275J23012J33243k1972r4193
11700e8130K11297m294J79382l8128r5396m1008J66484l23804r8984j04869j49519
11689c56969P4138K22156K59324N2007k46025q9897Q9080j05064q0396J14129
11679f7517O5328P1221n5123n6435J43697J05825j34751k06464M5560Q7122k01682
11668b03219l01260k1853N0089K15592L5533J2301j38686L44961K76943k6271
11658B44130k36263J14264Q370O4708j58214J43913K41481j61217k31191m47204
11648d17223m7294L25237K90389k30740j63594j8480K18442O8552j40689k59841
$$ plain form
11638 -375241 -238336 -175153 -25052 112525 185934 54879 25262 329612 442987 448968
11628 448968 384374 399870 330543 191298 47918 53811 -7657 -34271 73249 174570 272629
11617 272629 -29895 -24739 -132346 89066 145079 1963 -45241 250680 255280 245466 116460
11606 116460 86746 55447 -17258 10469 -198282 -199051 -143497 -186705 18110 118221 24580
11595 24580 -96663 -126932 81197 334227 345017 378284 434396 100691 2414 -50048 16046
11584 16046 30011 138680 198700 183510 78284 28990 -277504 -382755 -286972 -333893 -268428
11573 -268428 -259351 -171057 -176506 -309148 -530733 -403229 -353499 -183093 -65642 -51144 -72886
11562 -72886 -177508 -144106 -100803 -129863 -220844 -34171 155602 347200 363001 229077 376674
$$ packed form
11638c75241J36905O3183J50101J37577P3409j31055k9617L04350J13375N981
11628D48968o4594J5496o9327j39245j43380N893o1468k6614J07520J01321R8059
11617B72629l02524N156j07607K21412N6013j43116m7204K95921M600r814j29006
11606A16460k9714l1299p2705K7727k08751p69N5554m3208K04815J00111r3641
11595B4580j21243l0269K08129K53030J0790L3267N6112l33705r8277n2462O6094
11584A6046J3965J08669O0020j5190j05226m9294l06494j05251R5783m6921O5465
11573b68428R077Q8294n449j32642k21585J27504M9730J70406J17451J4498k1742
11562g2886j04622L3402M3303k9060r0981J86673J89773J91598J5801j33924J47597
$$ plain form
11551 376674 450658 304048 265596 168535 -112038 -199451 -350173 -465938 -152571 272779
11541 272779 256956 195471 174009 -89850 -134388 -231839 -231167 -116611 -183457 -160723 -295184
11530 -295184 -244309 -44732 15140 303383 414149 493772 329694 72018 -160493 -361708
11520 -361708 -493909 -300942 -208158 -296359 -119920 57557 127740 295491 530665 489869
11510 489869 433309 421538 391345 92927 -152956 -134088 -219205 -102602 -104378 -199236 -284441
11499 -284441 -142306 -198541 -140718 -143152 126143 254654 -148139 -284165 -189356 -225684 -330459
11488 -330459 -251154 -202847 -313258 -347653 -50961 -34479 47654 254009 186530 69914 -93991
11477 -93991 -77075 -185885 -220859 -75297 5255 101411 34094 -40288 36311 50032 52923
$$ packed form
11551C76674P3984j46610l8452r7061k80573q7413j50722j15765L13367M25350
11541B72779j5823o1485k1462k63859m4538r7451O72J14556o6846K2734j34461
11530b95184N0875J99577N9872K88243J10766P9623j64078k57676k32511k01215
11520c61708j32201J92967R2784q8201J76439J77477P0183J67751K35174m0796
11510D89869n6560j1771l0193k98418k45883J8868q5117J16603j776r4858q5205
11499b84441J42135n6235N7823k434K69295J28511m02793j36026R4809l6328j04775
11488c30459P9305M8307j10411l4395K96692J6482Q2133K06355o7479j16616j63905
11477i3991J6916j08810l4974J45562Q0552R6156o7317p4382P6599J3721K891
$$ plain form
11466 52923 28347 23513 10447 112572 187084 317398 340435 86230 -270994 -206582 -240269
11455 -240269 -290174 -80380 -71035 -250205 -276994 -39742 -88856 65334 81768 7831 94297
11444 94297 218672 116039 199046 446331 631772 657361 692176 294639 179128 220093
11434 220093 297989 119853 31406 27817 -10233 60197 133486 105180 -144733 -160989 -66108
11423 -66108 -73333 4528 -143294 -266584 -69580 180034 335299 333362 156878 -170173 -184955
11412 -184955 -46539 -215190 -321920 -417286 -274489 29813 169406 190979 47525 -88935
11402 -88935 4696 88727 202384 126379 117092 -23412 -176780 -147118 176996 184450 -56317
11391 -56317 -347491 -359229 -224580 -342457 -230753 -97259 -63992 111947 -114863 -155302
$$ packed form
11466E2923k4576m834j3066J02125P4512J30314K3037k54205l57224O4412l3687
11455b40269m9905K09794R345j79170k6789K37252m9114J54190J6434p3937Q6466
11444I4297J24375j02633Q3007K47285J85441K5589L4815l97537j15511M0965
11434B20093P7896j78136q8447l589l8050P0430P3289k8306k49913j6256R4881
11423f6108p225P7861j47822j23290J97004K49614J55265j937j76484l27051j4782
11412a84955J38416j68651j06730r5366J42797L04302J39593K1573j43454j36460
11402h8935R3631Q4031J13657p6005r287j40504j53368K9662L24114P454k40767
11391e6317k91174j1738J34649j17877J11704J33494L3267J75939k26810m0439
$$ plain form
11381 -155302 -226260 -163964 95520 151418 151953 39682 68678 -20974 -178903 -86387 -49693
11370 -49693 -201121 -77917 32851 69351 77815 -78930 -304584 -139530 -39259 -13011
11360 -13011 11809 -182836 -167796 -21842 160514 140920 65414 -230315 -403093 -307383 -174519
11349 -174519 114128 245727 188507 286718 372472 162710 71483 351594 327332 146011
11339 146011 42599 -108423 -138502 -84055 18300 -35963 -170426 -246925 215758 586020
11329 586020 583519 447160 360805 348434 101271 106133 295942 -32004 -55035 -71889 -140811
11318 -140811 -38427 -36308 -19598 51518 21860 -12717 -21030 -35532 -80632 -64715 106356
11307 106356 10325 5474 -14954 -318035 -477538 -327399 -243930 -151488 -185158 -353041 -314484
$$ packed form
11381a55302p0958O2296K59484N5898N35j12271K8996q9652j57929R2516L6694
11370d9693j51428J23204J10768L6500Q464j56745k25654J65054J00271K6248
11360a3011K4820j94645J5040J45954J82356j9594p5506k95729j72778R5710J32864
11349a74519K88647J31599n7220R8211Q5754k09762r1227K80111k4262j81321
11339A46011j03412j51022l0079N4447J02355n4263j34463p6499M62683L70262
11329E86020k501j36359q6355j2371k47163M862J89809l27946k3031j6854o8922
11318a40811J02384K119J6710P1116k9658l4577q313j4502m5100J5917J71071
11307A06356r6031m851k0428l03081j59503J50139Q3469R2442l3670j67883L8557
$$ plain form
11296 -314484 -262262 -216360 -211710 -68380 -100535 -215056 -478875 -527042 -167576 -86638 -128468
11285 -128468 -203816 -194661 46301 213181 86021 36448 -90363 -91709 -21960 -12130 -219841
11274 -219841 -230574 -51053 56484 164629 140948 102127 108125 472651 510584 450659 309552
11263 309552 182317 164845 276054 410727 394935 575426 514759 292760 218969 238747
11253 238747 208622 110351 -61576 -17692 -99904 -172628 -197249 -11411 -155699 -403067 -458646
11242 -458646 -172911 43543 -85572 -209110 -242411 -237071 -130159 176594 304501 232055
11232 232055 37700 -135916 -172793 -163771 89085 339450 295270 208957 158062 24423 -16733
11221 -16733 173864 306740 312569 89099 82853 67407 32613 -63170 -17533 107083 283292
$$ packed form
11296c14484N2222M5902M650J43330l2155j14521k63819m8167L59466Q0938m1830
11285a28468p5348R155K40962J66880j27160m9573j26811j346O9749R830k07711
11274b19841j0733J79521J07537J08145k3681l8821N998L64526L7933n9925j41107
11263C09552j27235j7472J11209J34673j5792J80491o0667k21999p3791J9778
11253B38747l0125r8271j71927M3884q2212p2724k4621J85838j44288k47368n5579
11242d58646K85735K16454j29115j23538l3301N340J06912L06753J27907p2446
11232B32055j94355j73616l6877R022K52856K50365m4180q6313n0895j33639m1156
11221a6733J90597J32876N829k23470o246j5446l4794r5783M5637J24616J76209
$$ plain form
11210 283292 247034 115788 121074 112083 -9026 -79073 -239311 -242801 -268021 -144144 -88189
11199 -88189 -89891 28463 179339 47917 -143499 -84184 133718 138365 285961 388683 219722
11188 219722 13132 -112954 -110820 112788 295839 435441 85420 -580 123247 221800
11178 221800 111442 179433 353875 499474 532024 575850 431023 98336 121320 249229
11168 249229 -24661 -131588 -753 -17897 9599 68315 46468 30715 -141892 -187964 -194635
11157 -194635 -306052 -413690 -344182 -244927 -168784 -49956 -153455 -269657 -180836 -109582
11147 -109582 -105534 -274623 -531933 -557206 -621333 -690850 -456383 -304407 -221739 -99254 125443
11136 125443 158693 4112 -123114 -205332 -358014 -403277 -260915 -310751 -292682 -282214 -566544
$$ packed form
11210B83292l6258j31246N286q991j21109p0047j60238l490k5220J23877N5955
11199h8189j702J18354J50876j31422j91416N9315K17902M647J47596J02722j68961
11188B19722k06590j26086K134K23608J83051J39602l50021q6000J23827R8553
11178B21800j10358O7991J74442J45599L2550M3826j44827l32687K2984J27909
11168B49229k73890j06927J30835j7144K7496N8716k1847j5753j72607m6072o671
11157a94635j11417j07638O9508R9255P6143J18828j03499j16202Q8821P1254
11147a09582M048j69089k57310k5273o4127o9517K34467J51976Q2668J22485K24697
11136A25443L3250j54581j27226q2218j52682m5263J42362m9836J8069J0468k84330
$$ plain form
11125 -566544 -632519 -495660 -337901 32992 314086 142478 -103514 -364209 -209925 121278
11115 121278 59285 -140251 -252353 -217277 -167640 -9045 356442 441968 392212 759880
11105 759880 841963 829904 878364 968517 1027816 1068391 822353 548881 670531 605942 532576
11094 532576 406100 358647 278194 432258 318019 -69761 -324428 27337 326738 270192
11084 270192 223236 221354 56282 88986 187858 -8865 -120857 -164265 -52235 153262 1393
11073 1393 -27749 78049 -86813 -200919 27059 182369 152266 61362 172386 -45178
11063 -45178 815 2402 -240996 -131912 -242073 -56852 67663 18947 -145118 -286785
11053 -286785 -349589 -110793 -22261 -248720 -509627 -521570 -364191 -501483 -437940 -83745
$$ packed form
11125e66544o5975J36859J57759L70893K81094j71608k45992k60695J54284L31203
11115A21278o1993j99536j12102L5076M9637J58595L65487Q5526m9756L67668
11105G59880Q2083j2059M8460R0153N9299M0575k46038k73472J21650o4589p3366
11094E32576j26476m7453q0453J54064j14239l87780k54667L51765K99401n6546
11084B70192m6956j882j65072L2704R8872j96723j11992m3408J12030K05497j51869
11073A393k9142J05798j64862j14106K27978J55310l0103r0904J11024k17564
11063d5178M5993J587k43398J09084j10161J85221J24515m8716j64065j41667
11053b86785o2804K38796Q8532k26459k60907j1943J57379j37292O3543L54195
$$ plain form
11043 -83745 62217 -140014 -289102 -365730 -389574 -326137 -125592 -144532 -306919 -97997
11033 -97997 44104 89592 81458 95425 110628 33335 69286 242686 221099 -14819 -347510
11022 -347510 -336146 -134666 97493 320979 417466 257012 254792 71755 -192911 -490809
11012 -490809 -464171 -415318 -507495 -507711 -401224 -367455 -88719 157664 -4310 -98638 -140184
11001 -140184 -205700 -284312 -236401 -132131 -120484 -186866 -503595 -308886 -51810 841 -118733
10990 -118733 -223719 8393 179446 -35221 -197616 -267467 -254452 134887 95614 97234
10980 97234 317176 296528 226540 348528 322077 272739 322679 525085 486297 323161 280172
10969 280172 241279 185295 67970 109029 136529 190846 166341 136771 146260 325568 553615
$$ packed form
11043h3745J45962k02231j49088p6628k3844O3437K00545j8940j62387K08922
11033i7997J42101M5488q134J3967J5203p7293L5951J73400k1587k35918l32691
11022c47510J1364K01480K32159K23486R6487j60454k220j83037k64666k97898
11012d90809K6638M8853r2177k16J06487L3769K78736K46383j61974r4328m1546
11001a40184o5516p8612M7911J04270J1647o6382l16729J94709K57076N2651j19574
10990a18733j04986K32112J71053k14667j62395o9851J3015L89339l9273J620
10980I7234K19942k0648o9988J21988k6451m9338M9940K02406l8788j63136m2989
10969B80172l8893n5984j17325M1059K7500N4317k4505k9570R489J79308K28047
$$ plain form
10958 553615 367875 253901 188875 -173185 -155394 66389 288953 276380 126194 259942
10948 259942 239286 20613 -193815 -32597 18746 101077 44951 67107 37363 204719 421060
10937 421060 516766 552862 313892 215588 328256 695418 949084 732953 733838 927703 1030233
10926 1030233 927587 861230 1080346 964488 864032 781555 811847 549588 143174 84563
10916 84563 74702 127917 369611 232684 76789 72214 155866 217945 308012 342186 127046
10905 127046 71284 202191 60279 -26277 -175406 -200687 -54763 -14231 189746 88105
10895 88105 4383 -213200 84994 115808 -68392 -187237 -132293 -25103 193598 191957 154547
10884 154547 134183 406669 377583 280788 286216 185182 147677 137657 224527 275793 -97853
$$ packed form
10958E53615j85740j13974o5026l62060J7791K21783K22564j2573j50186J33748
10948B59942k0656k18673k14428J61218N1343Q2331n6126K2156k9744J67356K16341
10937D21060R5706L6096k38970r8304J12668L67162K53666k16131Q85J93865J02530
10926A030233j02646o6357K19116j15858j00456q2477L0292k62259m06414n8611
10916H4563r861N3215K41694j36927j55895m575Q3652O2079R0067L4174k15140
10905A27046n5762J30907j41912q6556j49129k5281J45924M0532K03977j01641
10895H8105q3722k17583K98194L0814j84200j18845N4944J07190K18701j641l7410
10884A54547k0364K72486k9086r6795N428j01034l7505j0020Q6870N1266l73646
$$ plain form
10873 -97853 -135462 -54945 -32842 -169724 -225879 -281128 -143345 148260 175675 183668 -11663
10862 -11663 -135852 -315634 -105336 194601 112180 -111144 -9797 129723 44899 -225280
10852 -225280 -213660 57260 -112785 -310066 -319666 57947 213679 -3747 -211138 -88948
10842 -88948 21630 -377581 -631665 -570740 -470570 -239792 87417 204488 112283 20790
10832 20790 -87419 -249463 -232463 -188087 -101960 3972 136538 153257 -72999 68784
10822 68784 226577 222802 98522 -2248 8378 -42962 -95580 -93349 33818 171627 20464
10811 20464 -84421 -66342 136423 79234 49012 -48921 -81123 -98356 -51486 -121636 -436907
10800 -436907 -576316 -524352 -201927 -106605 -101203 -268193 -153816 82942 110538 91895 180343
$$ packed form
10873i7853l7609Q0517K2103j36882n6155n5249J37783K91605K7415P993j95331
10862a1663j24189j79782K10298K99937q2421k23324J01347J39520q4824k70179
10852b25280J1620K70920j70045j97281r600L77613J55732k17426k07391J22190
10842h8948J10578l99211k54084O0925J00170K30778L27209J17071r2205r1493
10832B0790j08209j62044J7000M4376Q6127J05932J32566J6719k26256J41783
10822F8784J57793l775j24280j00770J0626n1340n2618K231J27167J37809j51163
10811B0464j04885J8079K02765n7189l0222r7933l2202j7233M6870p0150l15271
10800d36907j39409N1964L22425R5322N402j66990J14377K36758K7596j8643Q8448
$$ plain form
10789 180343 245834 -20970 -114829 147391 300329 246188 274427 178379 191383 25575 58413
10778 58413 168131 147921 -2267 -226426 -231859 -125953 -291883 -303061 -99314 57062
10768 57062 96647 19834 -195718 -119734 -88518 -208409 -92995 -55224 -121564 -101081 -117835
10757 -117835 -284980 -164773 64571 14805 149753 51590 -105357 -47400 -125429 -244940
10747 -244940 1198 64267 183007 152689 147201 -133171 40441 193878 338876 556118
10737 556118 761195 580272 409020 36144 46118 206065 200872 159232 46539 197105
10727 197105 295519 381321 216359 229089 240431 118088 -144967 -234075 -195006 -25365 304393
10716 304393 475450 426199 313108 144452 112721 317565 384855 376086 313247 193388 -154535
$$ packed form
10789A80343O5491k66804r3859K62220J52938n4141K8239r6048J3004j65808L2838
10778E8413J09718k0210j50188k24159n433J05906j65930j1178K03747J56376
10768E7062L9585p6813k15552P5984L1216j19891J15414L7771o6340K0483j6754
10757a17835j67145J20207K29344m9766J34948r8163j56947N7957p8029j19511
10747b44940K46138O3069J18740l0318n488k80372J73612J53437J44998K17242
10737E56118K05077j80923j71252l72876R974J59947n193m1640j12693J50566
10727A97105R8414Q5802j64962J2730J1342j22343k63055q9108L9069J69641L29758
10716C04393J71057m9251j13091j68656l1731K04844O7290q769o2839j19859l47923
$$ plain form
10705 -154535 -225107 133428 274578 -28253 -22577 12402 -179623 -173568 -5572 -109967 144147
10694 144147 224891 -137829 -322289 -233868 -32411 212161 279843 146475 97556 -155075
10684 -155075 -265317 -155349 43580 121113 251717 405459 266693 188501 -62647 -186887
10674 -186887 -109725 -140286 -117039 -223017 -111492 -329901 -392595 -58049 44687 126341
10664 126341 184811 236860 331543 93534 -154974 -340758 -409039 -289141 -258452 -469316
10654 -469316 -333048 -264354 35130 18289 -78212 -147132 -43931 186159 111105 -43165
10644 -43165 140588 266238 213104 84933 -173422 -458915 -360989 -120496 -26636 -35954 -97608
10633 -97608 117207 97120 11835 48263 327756 505780 426784 188221 89479 67494 89013
$$ packed form
10705a54535p0572L58535J41150l02831N676L4979j92025O055J67996j04395K54114
10694A44147Q0744l62720j84460Q8421K01457K44572O7682j33368m8919k52631
10684a55075j10242J09968J98929P7533J30604J53742j38766p8192k51148j24240
10674a86887P7162l0561K3247j05978J11525k18409o2694L34546J02736Q1654
10664A26341N8470N2049R4683k38009k48508j85784o8281J19898L0689k10864
10654d69316J36268O8694K99484j6841r6501o8920J03201K30090p5054j54270
10644d3165J83753J25650n3134j28171k58355k85493R7926K40493R3860r318o1654
10633i7608K14815k0087q5285L6428K79493J78024p8996k38563r8742k1985K1519
$$ plain form
10622 89013 -210122 -356607 -246317 -225511 -385472 -286636 -12521 39746 8036 21760 -27398
10611 -27398 -80436 4121 -71988 -244753 -298097 -295154 -206493 -173084 -191708 35401 144199
10600 144199 290831 257582 55311 -72469 139671 340544 380177 275563 146599 30098
10590 30098 -136388 -136692 -5823 5806 -204219 -360566 -445254 -259927 -229400 -88052 -77166
10579 -77166 -348905 -377422 -298365 -324432 -253327 78212 462 35215 87353 228564 336474
10568 336474 178982 123635 -30439 -180103 -306601 -243107 -292189 -238252 -74122 22128
10558 22128 143938 11845 136414 385033 416711 466683 232258 35174 194769 102148
10548 102148 -37084 -32123 -112176 4139 116741 -25075 -265155 -461819 -225529 -219742
$$ packed form
10622H9013k99135j46485J10290K0806j59961R8836K74115N2267l1710J3724m9158
10611b7398n3038Q4557p6109j72765n3344K943Q8661L3409j8624K27109J08798
10600A44199J46632l3249k02271j27780K12140K00873L9633j04614j28964j16501
10590C0098j66486l04J30869J1629k10025j56347q4688J85327L0527J41348J0886
10579g7166k71739k8517P9057k6067P1105L31539p7750L4753N2138J41211J07910
10568C36474j57492n5347j54074j49664j26498O3494m9082N3937J64130R6250
10558B2128J21810j32093J24569K48619L1678M9972k34425j97084J59595r2621
10548A02148j39232M961q0053J16315J12602j41816k40080j96664K36290N787
$$ plain form
10538 -219742 -224541 -313403 -366124 -390443 -372005 -326361 -429378 -237450 -179952 -70891 -16535
10527 -16535 54076 69329 -276015 -463374 -433074 -274691 -123695 -149745 -163995 -43863 -84708
10516 -84708 -207329 -294943 -91301 281176 296319 440133 176246 -45487 -113590 -63008
10506 -63008 -27646 -157947 -115829 21254 -2573 -18255 31251 282791 298799 132520 -37822
10495 -37822 -200552 -149218 132619 -45456 -177554 -100434 -200033 -323423 -88858 148766
10485 148766 27564 -98136 -320779 -285987 -206179 -117700 -149320 -240405 -167187 -169327 -331942
10474 -331942 -34477 93608 350891 201725 189542 -17186 26261 53900 93502 -39227
10464 -39227 -237681 -292898 -194674 -185271 -83896 11141 112799 28543 165158 299770 133547
$$ packed form
10538b19742m799q8862n2721k4319J8438M5644j03017J91928N7498J09061N4356
10527a6535P0611J5253l45344j87359L0300J58383J50996k6050j4250J20132m0845
10516h4708j22621q7614K03642L72477J5143J43814k63887k21733o8103N0582
10506f3008L5362j30301M2118J37083k3827j5682M9506K51540J6008j66279j70342
10495c7822j62730N1334K81837j78075j32098P7120r9599j23390K34565K37624
10485A48766j21202j25700k22643L4792P9808Q8479l1620r1085P3218k140j62615
10474c31942K97465J28085K57283j49166j2183k06728M3447K7639L9602j32729
10464c9227j98454n5217R8224R403J01375R5037J01658q4256J36615J34612j66223
$$ plain form
10453 133547 46465 347613 282642 44556 -19867 -145850 -169275 77735 -15971 -84476 83035
10442 83035 -11667 -53401 -121705 -9621 -60632 -174182 -202580 -7496 105143 167722 255153
10431 255153 237924 133924 84572 204120 130559 137723 165854 122601 55810 -116722 -24887
10420 -24887 138338 311520 408801 304839 319427 334859 383409 507677 463523 434229 603503
10409 603503 499275 425844 366137 476708 458485 333987 189987 384209 284267 112717
10399 112717 11690 61533 184405 99477 21003 21485 -194807 -300332 23093 -139651 -324927
10388 -324927 -126975 133628 265273 82590 4106 -179830 -110016 -205374 -268141 -21332
10378 -21332 314963 391398 253384 365477 488917 349549 395178 443930 308483 205256
$$ packed form
10453A33547q7082L01148o4971k38086o4423j25983k3425K47010r3706o8505J67511
10442H3035r4702m1734o8304J12084n1011j13550k8398J95084J12639O2579Q7431
10431B55153j7229j04000m9352J19548p3561P164K8131m3253o6791j72532R1835
10420b4887J63225J73182R7281j03962J4588J5432M8550J24268m4154k9294J69274
10409F03503j04228p3431n9707J10571j8223j24498j44000J94222r9942j71550
10399A12717j01027M9843J22872q4928p8474M82k16292j05525L23425j62744j85276
10388c24927J97952K60603J31645j82683p8484j83936O9814r5358o2767K46809
10378b1332L36295P6435j38014J12093J23440j39368M5629M8752j35447j03227
$$ plain form
10368 205256 130582 194763 303619 399953 419642 25851 -232209 114797 329938 495425
10358 495425 582040 521973 419936 411961 409956 237501 95310 -12858 12156 101452 221851
10347 221851 83337 -14921 182766 187112 366238 326226 313919 305564 -9956 -74678 -86359
10336 -86359 17707 -107957 -14411 -134652 -168180 -50649 -212583 -68984 45678 90234
10326 90234 67344 122953 308352 290906 127911 131606 89413 -63156 -79794 10006 -92640
10315 -92640 -31949 230211 163237 -195028 -167782 74423 76423 -23430 120662 -66904 -34116
10304 -34116 61759 204109 226875 261498 196043 310109 529831 375642 170977 97697 10332
10293 10332 180061 228902 176374 145220 -30342 -239296 -220336 -50742 84675 34693 -78909
$$ packed form
10368B05256p4674O4181J08856R6334J9689l93791k58060L47006K15141J65487
10358D95425Q6615o0067j02037p975k005j72455j42191j08168K5014Q9296J20399
10347B21851j38514r8258J97687M346J79126m0012j2307q355l15520o4722j1681
10336h6359J04066j25664R3546j20241l3528J17531j61934J43599J14662M4556
10326I0234k2890N5609J85399j7446j62995L695m2193j52569j6638Q9800j02646
10315i2640O0691K62160o6974l58265K7246K42205K000r9853J44092j87566L2788
10304c4116R5875J42350K2766L4623o5455J14066K19722j54189k04665p3280q7365
10293A0332J69729M8841n2528l1154j75562k08954J8960J69594J35417m9982j13602
$$ plain form
10282 -78909 -95451 -85313 -47067 -61841 -10696 -220876 -244554 -204182 -57175 -105061 -110416
10271 -110416 -39380 110833 -4312 -84329 -173986 -1889 46533 67999 174371 220999 146628
10260 146628 47643 -98794 60185 254461 22012 -173026 -83690 -28608 173308 236154
10250 236154 -3130 -105937 -167154 -20707 257782 271490 234628 412981 345739 253575
10240 253575 370887 366837 370063 576229 783180 847871 530334 293845 188656 12344
10230 12344 -149918 -58693 219423 400395 373525 463219 471076 457427 461061 644886 787349
10219 787349 580854 409017 404412 223554 163644 77771 80425 278286 740241 968391 869103
10208 869103 667740 652740 614848 360858 342436 250838 214248 218261 60295 -30595 20281
$$ packed form
10282g8909j6542J0138L8246j4774N1145k10180k3678M0372J47007m7886n355
10271a10416P1036J50213j15145q0017q9657J72097M8422K1466J06372M6628p4371
10260A46628r8985j46437J58979J94276k32449j95038Q9336N5082K01916O2846
10250B36154k39284j02807o1217J46447K78489J3708l6862J78353o7242r2164
10240B53575J17312m050L226K06166K06951O4691l17537k36489j05189j76312
10230A2344j62262R1225K78116J80972k6870Q9694P857j3649L634J83825J42463
10219G87349k06495j71837m605j80858n9910q5873K654J97861M61955K28150r9288
10208H69103k01363j5000l7892k53990j8422r1598l6590M013j57966r0890N0876
$$ plain form
10197 20281 211364 268198 326228 686402 818205 724444 565062 279242 91844 171767
10187 171767 231914 206764 143826 128601 110621 -33076 -173155 88724 172346 172600 8827
10176 8827 31663 -34405 -4237 43040 -14438 -64074 -99877 -48923 92192 193105 164658
10165 164658 191389 -101530 -269259 -273314 -125264 12649 95624 129292 68357 118282 24211
10154 24211 -141990 -112425 123942 99966 -48497 -73582 72211 74002 -86693 -90947 -104843
10143 -104843 -226000 -228015 -267680 -263642 -156289 -217963 10269 155869 229097 253457 299323
10132 299323 113652 -106443 -152292 -179169 66275 -139171 -245680 -54385 147421 60904
10122 60904 -111753 206358 440261 200863 -18790 -8564 20788 53779 375379 398950
$$ packed form
10197B0281J91083N6834N8030L60174J31803r3761j59382k85820j87398P9923
10187A71767O0147k5150o2938j5225j7980j43697j40079K61879Q3622K54j63773
10176H827K2836o6068L0168M7277n7478m9636l5803N0954J41115J00913k8447
10165A64658K6731k92919j67729m055J48050J37913Q2975L3668o0935M9925r4071
10154B4211j66201K9565K36367k3976j48463k5085J45793J791j60695m254j3896
10143a04843j21157k015l9665M038J07353o1674K28232J45600P3228K4360M5866
10132B99323j85671k20095m5849k6877K45444k05446j06509J91295K01806q6517
10122F0904j72657L18111K33903k39398k19653J0226K9352L2991L21600K3571
$$ plain form
10112 398950 190207 149541 77376 207294 310972 259359 380744 199848 -136644 -89618
10102 -89618 24777 139108 161099 -77786 -171320 -65593 -79871 -142619 -213792 -233615 -90705
10091 -90705 -76359 -190246 -407703 -418873 -91225 142596 222867 229676 376202 352310 -39985
10080 -39985 -249243 -274648 -204737 6007 270000 299394 207878 146684 190177 186369 124796
10069 124796 166803 167973 113187 -67782 109982 238094 395838 186206 38288 -8304
10059 -8304 -368523 -183779 -34020 19787 2926 170528 444850 512236 630281 653286 481216
10048 481216 -45489 -356911 -66045 -53778 -126152 -104380 136967 370917 555554 492260
10038 492260 279955 186603 271291 311911 376487 348289 90135 -180348 -137354 -70367 64171
$$ packed form
10112C98950k08743m0666p2165J29918J03678n1613J21385j80896l36492M7026
10102h9618J14395J14331K1991k38885r3534J05727j4278o2748p1173j9823J42910
10091i0705J4346j13887k17457j1170L27648K33821Q0271O809J46526k3892l92295
10080c9985k09258k5405O9911K10744K63993K9394r1516o1194M3493l808o1573
10069A24796M2007J170n4786j80969J77764J28112J57744k09632j47918m6592
10059h304l60219J84744J49759N3807j6861J67602K74322O7386J18045K3005j72070
10048D81216n26705l11422K90866J2267p2374K1772K41347K33950J84637o3294
10038D92260k12305r3352Q4688M0620O4576k8198k58154k70483M2994O6987J34538
$$ plain form
10027 64171 275476 352187 340341 350391 25118 -49707 104932 129119 84448 366919 402546
10016 402546 299639 273226 413832 291982 289715 353968 167703 -13456 -426870 -359346
10006 -359346 -76679 -32987 143188 44114 -18293 140690 259357 104268 119032 -175950
9996 -175950 -31115 138591 172842 327089 109998 -64752 -41360 -14415 78777 179353
9986 179353 136633 -139589 -393790 -451677 -151845 179691 -3239 -363755 -294723 -111827
9976 -111827 40552 257785 186060 278896 481277 533435 511988 439933 379867 358984 135886
9965 135886 -35230 -32535 133021 5224 97600 332459 135590 7453 143804 155017
9955 155017 -55057 -6667 324436 550258 508292 330742 460861 634700 434027 168975
$$ packed form
10027F4171K11305P6711j1846J0050l25273p4825J54639K4187m4671K82471L5627
10016D02546j02907k6413J40606j21850k267O4253j86265j81159m13414O7524
10006c59346K82667M3692J76175r9074o2407J58983J18667j55089J4764k94982
9996a75950J44835J69706L4251J54247k17091j74750K3392K6945R3192J00576
9986A79353m2720k76222k54201n7887K99832L31536j82930l60516O9032J82896
9976a11827J52379K17233p1725R2836K02381N2158k1447p2055o0066k0883k23098
9965A35886j71116K695J65556j27797R2376K34859j96869j28137J36351J1213
9955A55017k10074M8390L31103K25822m1966j77550J30119J73839k00673k65052
$$ plain form
9945 168975 239204 284516 437499 352380 102540 222613 381335 427444 108074 -101703
9935 -101703 -118645 -82221 -97472 33534 109141 -53525 -144765 -324730 -404558 -195418 61197
9924 61197 54458 89854 -85095 -87059 14032 -47664 -89473 -115514 -224220 -295473 -199492 -46362
9912 -46362 -29810 -144824 -77847 162234 296673 323160 361803 86572 -2509 221026 214425
9901 214425 221652 100012 251437 535540 591390 488005 348109 229012 -108085 -70860
9891 -70860 57838 -18176 -168261 33289 82080 125651 77391 106096 151205 -7234 -74183
9880 -74183 180258 418748 329162 149994 73174 25012 -65361 -262300 -21758 75084 -193032
9869 -193032 120788 381949 316025 209952 219162 252014 312959 391151 413863 644789 634351
$$ packed form
9945A68975P0229M5312J52983q5119k49840J20073J58722M6109l19370k09777
9935a01703j6942L6424j5251J31006P5607j62666r1240j79965p9828K09140K56615
9924F1197o739L5396j74949j964J01091o1696m1809k6041j08706p1253R5981J53130
9912d6362J6552j15014O6977K40081J34439K6487L8643k75231q9081K23535o601
9901B14425P227j21640J51425K84103N5850j03385j39896j19097l37097L7225
9891g0860J28698p6014j50085K01550M8791M3571m8260K8705M5109j58439o6949
9880g4183K54441K38490q9586j79168p6820m8162r0373j96939K40542R6842k68116
9869a93032L13820K61161o5924j06073R210L2852O0945P8192K2712K30926j0438
$$ plain form
9858 634351 335943 237521 215250 70368 59886 179816 195463 339506 352129 494017 502914
9847 502914 476362 505721 582591 421189 335346 357973 202736 316184 297382 154933 214885
9836 214885 388354 260169 220103 105821 128271 259291 225134 3118 -96337 1563 118591
9825 118591 362016 435715 380903 327179 157158 135380 179258 215278 129866 325007 230233
9814 230233 160893 361499 50368 -283884 -247993 -183258 -116386 50762 281169 225833 142469
9803 142469 155992 147664 418354 713534 638864 415510 300529 366581 440041 406109 435512
9792 435512 349644 138451 186134 217508 248014 248485 102703 21130 -98337 -148233 -268358
9781 -268358 -405022 -197332 76088 66950 -60001 -27840 49664 -14815 -63820 -134677 97021
$$ packed form
9858F34351k98408r8422k2271j44882j0482J19930J5647J44043J2623J41888Q897
9847E02914k6552K9359P6870j61402q5843K2627j55237J13448j8802j42449N9952
9836B14885J73469j28185m0066j14282K2450J31020l4157k22016r9455R7900J17028
9825A18591K43425P3699n4812n3724j70021k1778M3878L6020q5412J95141r4774
9814B30233o9340K00606l11131l34252L5891O4735O6872J67148K30407n5336q3364
9803A42469J3523q328K70690K95180p4670k23354j14981O6052P3460l3932K9403
9792D35512q5868k11193M7683L1374L0506M71j45782q1573j19467m9896j20125
9781b68358j36664K07690K73420r138j26951L2161P7504o4479m9005p0857K31698
$$ plain form
9770 97021 378511 576777 560062 387220 153955 113668 3864 -81069 -64643 -80858 -32699
9759 -32699 10520 -16645 164983 159903 324099 343211 306226 391057 85931 221794 418478
9748 418478 536804 447397 393172 419896 223283 -16866 -130384 -183069 17993 203281
9738 203281 116591 153904 223040 138059 145551 167662 105363 25932 -123265 -97449 -283199
9727 -283199 -453522 -203676 -49084 127284 105409 38792 -39571 7564 90210 94103 147130
9716 147130 118895 180945 294958 358234 50851 28652 7679 13054 55848 85729 59539
9705 59539 285706 581764 701840 632241 416754 372944 558663 429164 274917 40404
9695 40404 -13041 122766 115607 169336 99792 119117 -86201 -132648 -5493 123504 21531
$$ packed form
9770I7021K81490J98266j6715j72842k33265m0287j09804q4933J6426j6215M8159
9759c2699M3219k7165J81628n080J64196J9112l6985Q4831l05126J35863J96684
9748D18478J18326q9407n4225K6724j96613k40149j13518n2685K01062J85288
9738B03281q6690L7313O9136q4981P492K2111o2299p9431j49197K5816j85750
9727b83199j70323K49846J54592J76368k1875o6617p8363M7135Q2646L893N3027
9716A47130k8235O2050J14013O3276l07383k2199k0973N375M2794K9881k6190
9705E9539K26167K96058J20076o9599k15487m3810J85719j29499j54247k34513
9695D0404n3445J35807p159N3729o9544J9325k05318m6447J27155J28997j01973
$$ plain form
9684 21531 -240853 -225411 -228761 -109162 -115691 -204217 -175685 -130364 -158978 -56668 -32813 -118376
9672 -118376 -246333 -275771 -218490 -78913 122069 170578 89887 -71833 33095 44179 123647
9661 123647 301924 331529 35750 -190591 -6580 196943 200437 323857 75381 -268055
9651 -268055 -350257 -419575 -397592 -498681 -627119 -560302 -178980 -21177 -309145 -246637 -157057
9640 -157057 -269007 -167768 -31381 189820 158256 27704 130303 556304 468734 285106
9630 285106 103015 171838 317038 404756 313827 199531 155266 -48920 -158381 48235
9620 48235 200043 -61939 -103556 -132687 -208270 -223219 -173327 -250102 -396560 -372615 -400653
9609 -400653 -398643 -265899 -174581 34268 -51457 1312 176089 192750 314145 400788 402501
$$ packed form
9684B1531k62384J5442l350J19599o529q8526K8532M5321k8614J02310K3855q5563
9672a18376j27957k9438N7281J39577K00982M8509q0691j61720J04928J1084P9468
9661A23647J78277K9605k95779k26341J84011K03523L494J23420k48476l43436
9651b68055q2202o9318K1983j01089j28438O6817L81322J57803k87968O2508Q9580
9640a57057j11950J01239J36387K21201l1564j30552J02599M26001q7570j83628
9630B85106j82091O8823J45200Q7718r0929j14296m4265k04186j09461K06616
9620D8235J51808k61982m1617k9131p5583j4949M9892p6775j46458K3945k8038
9609d00653K010J32744R1318K08849q5725N2769J74777J6661J21395Q6643J713
$$ plain form
9598 402501 434135 390497 357215 -5592 53247 304890 410063 307178 121137 114756 107138
9587 107138 75079 31462 -190583 -196773 -211070 -170995 -52461 78336 237187 123315 104595
9576 104595 230454 388070 193678 -135773 -204635 82365 38427 7978 200605 101932
9566 101932 68728 278530 386006 264774 337451 227350 77053 65442 198397 328215
9556 328215 523517 579371 537831 316458 264987 295662 383348 421661 574557 654591 613790
9545 613790 452413 166032 -41410 38283 64745 13519 -344856 -463471 -276168 44735
9535 44735 230974 286514 334352 237110 65194 -14054 106937 21315 -36833 314697 382598
9524 382598 225805 382525 359491 247548 322570 -3280 527 306019 281141 304086 244700
$$ packed form
9598D02501L1634m3638l3282l62807N8839K51643J05173j02885j86041o381p618
9587A07138l2059m3617k22045o190j4297M0075J18534J30797J58851j13872j8720
9576A04595J25859J57616j94392l29451o8862K87000m3938l0449J92627r8673
9566A01932l3204K09802J07476j21232P2677j10101j50297j1611J32955J29818
9556C28215J95302N5854m1540k21373n1471L0675Q7686L8313J52896Q0034m0801
9545F13790j61377k86381k07442P9693K6462n1226l58375j18615J87303L20903
9535D4735J86239N5540M7838r7242j71916p9248J20991q5622n8148L51530O7901
9524C82598j56793J56720k3034j11943P5022l25850L807L05492k4878K2945n9386
$$ plain form
9513 244700 249530 383846 431886 359713 118369 61459 32928 -17716 -177350 -129417 215685
9502 215685 150215 233216 200946 218728 322442 358968 188608 45721 -90889 -223747 26522
9491 26522 139022 195861 171761 259848 435470 536335 552460 355977 99232 21353 75503
9480 75503 312372 426287 583345 674326 485306 503936 317589 62634 -50456 -23542
9470 -23542 -166104 -88170 153731 226377 434718 518378 516294 533505 421363 432382 472903
9459 472903 517813 485278 349017 589872 643792 555028 502332 478098 848256 925248 725581
9448 725581 809137 725835 753406 833731 1000712 686788 369114 419402 460475 436963 468546
9437 468546 339352 161582 336226 139012 247839 474543 574560 488194 653266 829768
$$ packed form
9513B44700M830J34316M8040p2173k41344n6910k8531n0644j59634M7933L45102
9502B15685o5470Q3001l2270J7782J03714L6526j70360j42887j36610j32858K50269
9491B6522J12500N6839k4100Q8087J75622J00865J6125j96483k56745p7879N4150
9480G5503K36869J13915J57058R0981j89020J8630j86347k54955j13090K6914
9470b3542j42562P7934K41901P2646K08341Q3660k084J7211j12142J1019M0521
9459D72903M4910l2535j36261K40855N3920q8764n2696k4234L70158P6992j99667
9448G25581Q3556q3302K7571Q0325J66981l13924l17674N0288M1073k3512L1583
9437D68546j29194j77770J74644j97214J08827K26704J00017q6366J65072J76502
$$ plain form
9427 829768 896392 633583 383370 198758 283767 145956 16663 95036 252999 257479 225230
9416 225230 75592 267733 407273 383285 643679 622835 605213 440124 571198 465570
9406 465570 577109 899345 1033278 860474 688285 668626 787576 720234 676565 769774
9396 769774 897496 1006543 1030300 903376 706385 711085 684352 805037 1049693 1035545 981000
9385 981000 995045 1012558 1000243 1061294 1060647 881924 717863 676211 976438 1059335 983648
9374 983648 1114500 1154192 1064541 1251557 1550577 1623475 1560457 1538662 1921054 2258081 2156850
9363 2156850 2146556 2303761 2561868 3007148 3304944 3561235 3766431 4139608 4327663 4756574
9353 4756574 5471508 6360992 7288342 8288075 9373716 10833442 12917485 15108365 17898858
$$ packed form
9427H29768O6624k62809k50213j84612Q5009j37811j29293P8373J57963M480l2249
9416B25230j49638J92141J39540k3988K60394k0844j7622j65089J31074j05628
9406D65570J11539L22236J33933j72804j72189j9659J18950o7342m3669R3209
9396G69774J27722J09047K3757j26924j96991M700k6733J20685K44656j4148n4545
9385I81000J4045J7513j2315O1051o47j78723j64061m1652L00227Q2897p5687
9374I83648J30852L9692q9651J87016K99020P2898o3018k1795L82392L37027j01231
9363B156850j0294J57205K58107M45280K97796K56291K05196L73177J88055M28911
9353D756574P14934Q89484R27350R99733J085641J459726K084043K190880K790493
$$ plain form
9344 17898858 21650859 26429964 31976901 38602489 46217776 54016763 60559602 64523259
9336 64523259 64559362 61400705 56446113 50565627 44311082 38642147 34259063 30423622
9328 30423622 26997317 24544468 22493099 20911809 19748680 18903060 18323545 17811049 17536445
9319 17536445 17499920 17652382 18108413 19013911 20329428 22062794 23790293 26055394 29063860
9310 29063860 33273550 38696170 45452069 54195798 65426590 79412199 96428474 115317747
9302 115317747 132529433 142559761 142131747 132009145 116636673 100379308 85126148
9295 85126148 71866152 60978774 51995264 44610939 38993015 34637943 30955183 27855445
9287 27855445 25469042 23689644 22150073 21079984 20074434 19432754 19055030 18942290 19117011
$$ packed form
9344A7898858L752001M779105N546937O625588P615287P798987O542839L963657
9336F4523259L6103l158657m954592n880486o254545n668935m383084l835441
9328C0423622l426305k452849k051369j581290j163129q45620n79515n12496k74604
9319A7536445l6525J52462M56031R05498J315517J733366J727499K265101L008466
9310B9063860M209690N422620O755899Q743729J1230792J3985609J7016275J8889273
9302A15317747J7211686J0030328m28014j0122602j5372472j6257365j5253160
9295H5126148j3259996j0887378q983510p384325n617924m355072l682760l099738
9287B7855445k386403j779398j539571j070089j005550o41680l77724j12740J74721
$$ plain form
9278 19117011 19666962 20168641 20824167 21698329 23180954 25206114 27819043 31054383 35447327
9269 35447327 40866118 47109907 53658386 59571757 63501603 64150904 61397727 55843296
9261 55843296 49009784 41961335 35808746 30552569 26032333 22126709 19310063 16971112
9253 16971112 15004308 13242296 11786600 10549840 9564677 8568391 7857246 7352749 6910285
$$ packed form
9278A9117011N49951N01679O55526Q74162J482625K025160K612929L235340M392944
9269C5447327N418791O243789O548479N913371L929846O49301k753177n554431
9261E5843296o833512p048449o152589n256177m520236l905624k816646k338951
9253A6971112j966804j762012j455696j236760r85163r96286p11145n04497m42464
$$ [...]
##END NTUPLES=NMR SPECTRUM
##END=
